
##TITLE=AC1191_Casanare-sacama_5898592_LQBaTDzb3T
##JCAMPDX= 6.0         $$ Bruker NMR JCAMP-DX V2.0
##DATA TYPE= NMR SPECTRUM
##DATA CLASS= NTUPLES
##ORIGIN= BRUKER
##OWNER= Administrator
$$ 1.72 TOPSPIN		Version 2.1
$$ 2012-04-03 19:32:50.531 -0500  Administrator@TOPSPIN
$$ Compression mode = diff/dup
##.OBSERVE FREQUENCY= 400.13188235
##.OBSERVE NUCLEUS= ^1H
##.ACQUISITION MODE= SIMULTANEOUS (DQD)
##.ACQUISITION SCHEME= undefined
##.AVERAGES= 64
##.DIGITISER RES= 22
##SPECTROMETER/DATA SYSTEM= spect
##.PULSE SEQUENCE= noesygpps1d.comp
##.SOLVENT NAME= COFFEE_meoh
##.SHIFT REFERENCE= INTERNAL, COFFEE_meoh, 1, 14.96859
##AUDIT TRAIL= $$ (NUMBER, WHEN, WHO, WHERE, PROCESS, VERSION, WHAT)
$$ ##TITLE= Audit trail, TOPSPIN		Version 2.1
$$ ##JCAMPDX= 5.01
$$ ##ORIGIN= Bruker BioSpin GmbH
$$ ##OWNER= Administrator
$$ $$ C:\Bruker\TOPSPIN/data/COFFEE/nmr/AC1191_Casanare-sacama_5898592_LQBaTDzb3T/12/pdata/1/auditp.txt
$$ ##AUDIT TRAIL=  $$ (NUMBER, WHEN, WHO, WHERE, PROCESS, VERSION, WHAT)
(   1,<2012-04-03 19:32:45.625 -0500>,<Administrator>,<TOPSPIN>,<go>,<TOPSPIN 2.1>,
      <created by zg
	started at 2012-04-03 19:21:14.031 -0500,
	POWCHK enabled, PULCHK disabled,
       configuration hash MD5:
       1A 1E CE 29 27 FD 77 03 67 4E F0 E3 C4 B2 CB 90
       data hash MD5: 64K
       A2 12 1B 77 79 58 E1 B8 E8 DB 6E 80 38 57 B6 13>)
(   2,<2012-04-03 19:32:48.453 -0500>,<Administrator>,<TOPSPIN>,<proc1d>,<TOPSPIN 2.1>,
      <Start of raw data processing
       efp LB = 0.3 FT_mod = 6 PKNL = 1 PHC0 = 0 PHC1 = 0 SI = 128K 
       data hash MD5: 128K
       51 89 F3 EF 09 51 0C 2E FF 79 EB 06 2C C0 D2 D0>)
(   3,<2012-04-03 19:32:49.734 -0500>,<Administrator>,<TOPSPIN>,<proc1d>,<TOPSPIN 2.1>,
      <pk PHC0 = 36.79321 PHC1 = 0 
       data hash MD5: 128K
       76 B2 0E 7E A2 2A 4C 88 51 67 9B 77 EA B0 1D 37>)
(   4,<2012-04-03 19:32:50.000 -0500>,<Administrator>,<TOPSPIN>,<proc1d>,<TOPSPIN 2.1>,
      <abs ABSG = 1 
       data hash MD5: 128K
       CC 6A E5 AA 39 DE E3 F8 A2 C8 20 84 1A CC E8 10>)
(   5,<2012-04-03 19:32:50.093 -0500>,<Administrator>,<TOPSPIN>,<proc1d>,<TOPSPIN 2.1>,
      <abs ABSG = 2 
       data hash MD5: 128K
       E6 A3 6B DE C2 63 CB 90 5F D0 7E 31 51 22 51 A1>)
(   6,<2012-04-03 19:32:50.140 -0500>,<Administrator>,<TOPSPIN>,<proc1d>,<TOPSPIN 2.1>,
      <abs ABSG = 3 
       data hash MD5: 128K
       C3 4E A6 43 36 E8 72 0C 71 87 E0 4F 56 2B 12 CF>)
(   7,<2012-04-03 19:32:50.218 -0500>,<Administrator>,<TOPSPIN>,<proc1d>,<TOPSPIN 2.1>,
      <abs ABSG = 4 
       data hash MD5: 128K
       E8 8E B1 05 E5 16 2D 5E C3 26 73 27 FD D7 DB 77>)
(   8,<2012-04-03 19:32:50.453 -0500>,<Administrator>,<TOPSPIN>,<proc1d>,<TOPSPIN 2.1>,
      <abs ABSG = 5 
       data hash MD5: 128K
       80 EC B1 2D 34 68 4B A3 9F 86 3F E2 E2 7A A9 C0>)
$$ ##END=
$$ 
$$ $$ hash MD5
$$ $$ 66 EE E4 B0 38 D8 EF 79 62 59 35 6D D4 FB 21 67
##$RELAX= 
##$RELAX= 
##$RELAX= 
##$RELAX= 
##$RELAX= 
##$RELAX= 
##$RELAX= 
##$RELAX= 
$$ [...]
##$TP07= 0
##$TPNAME0= <>
##$TPNAME1= <>
##$TPNAME2= <>
##$TPNAME3= <>
##$TPNAME4= <>
##$TPNAME5= <>
##$TPNAME6= <>
##$TPNAME7= <>
##$TPOAL= (0..7)
0.5 0.5 0.5 0.5 0.5 0.5 0.5 0.5
##$TPOFFS= (0..7)
0 0 0 0 0 0 0 0
##$TUNHIN= 0
##$TUNHOUT= 0
##$TUNXOUT= 0
##$USERA1= <user>
##$USERA2= <user>
##$USERA3= <user>
##$USERA4= <user>
##$USERA5= <user>
##$V9= 5
##$VALIST= <valist>
##$VCLIST= <CCCCCCCCCCCCCCC>
##$VD= 0
##$VDLIST= <DDDDDDDDDDDDDDD>
##$VPLIST= <PPPPPPPPPPPPPPP>
##$VTLIST= <TTTTTTTTTTTTTTT>
##$WBST= 2048
##$WBSW= 25
##$XGAIN= (0..3)
0 0 0 0
##$XL= 0
##$YL= 0
##$YMAX_a= 13059772
##$YMIN_a= -6011023
##$ZGOPTNS= <>
##$ZL1= 120
##$ZL2= 120
##$ZL3= 120
##$ZL4= 120
##$ABSF1= 14.96859
##$ABSF2= -5.583941
##$ABSG= 5
##$ABSL= 3
##$ALPHA= 0
##$AQORDER= 0
##$ASSFAC= 0
##$ASSFACI= 0
##$ASSFACX= 0
##$ASSWID= 0
##$AUNMP= <proc_prof1d_extract.lims>
##$AXLEFT= 0
##$AXNAME= <>
##$AXNUC= <1H>
##$AXRIGHT= 0
##$AXTYPE= 0
##$AXUNIT= <>
##$AZFE= 0.1
##$AZFW= 0.1
##$BCFW= 0
##$BC_mod= 0
##$BYTORDP= 0
##$COROFFS= 0
##$CY= 15
##$DATMOD= 1
##$DC= 0
##$DFILT= <>
##$DTYPP= 0
##$F1P= 0
##$F2P= 0
##$FCOR= 0.5
##$FTSIZE= 131072
##$FT_mod= 6
##$GAMMA= 0
##$GB= 0
##$INTBC= 1
##$INTSCL= 1
##$ISEN= 128
##$LB= 0.3
##$LEV0= 0
##$LPBIN= 0
##$MAXI= 10000
##$MC2= 0
##$MEAN= 0
##$ME_mod= 0
##$MI= 0
##$NCOEF= 0
##$NC_proc= -3
##$NLEV= 6
##$NOISF1= 0
##$NOISF2= 0
##$NSP= 0
##$NTH_PI= 0
##$NZP= 0
##$OFFSET= 14.96859
##$PC= 1
##$PHC0= 36.79321
##$PHC1= 0
##$PH_mod= 1
##$PKNL= yes
##$PPARMOD= 0
##$PPDIAG= 0
##$PPIPTYP= 0
##$PPMPNUM= 2147483647
##$PPRESOL= 1
##$PSCAL= 4
##$PSIGN= 0
##$PYNMP= <proc.py>
##$REVERSE= no
##$SF= 400.130004811137
##$SI= 131072
##$SIGF1= 0
##$SIGF2= 0
##$SINO= 400
##$SIOLD= 131072
##$SPECTYP= <>
##$SREGLST= <1H.CDCl3>
##$SSB= 0
##$STSI= 131072
##$STSR= 0
##$SW_p= 8223.68421052632
##$SYMM= 0
##$S_DEV= 0
##$TDeff= 65536
##$TDoff= 0
##$TI= <>
##$TILT= no
##$TM1= 0
##$TM2= 0
##$TOPLEV= 0
##$USERP1= <user>
##$USERP2= <user>
##$USERP3= <user>
##$USERP4= <user>
##$USERP5= <user>
##$WDW= 1
##$XDIM= 131072
##$YMAX_p= 498043637
##$YMIN_p= -408334750
##$CURPLOT= <Network HP LaserJet P1505>
##$CURPRIN= <$Network HP LaserJet P1505>
##$DFORMAT= <normdp>
##$LAYOUT= <+/1D_H.xwp>
##$LFORMAT= <normlp>
##$PFORMAT= <normpl>
##$SURQMSG= 1
$$ End of Bruker specific parameters
$$ ---------------------------------
##NTUPLES= NMR SPECTRUM
##VAR_NAME=  FREQUENCY,     SPECTRUM/REAL,   SPECTRUM/IMAG
##SYMBOL=    X,             R,               I
##VAR_TYPE=  INDEPENDENT,   DEPENDENT,       DEPENDENT
##VAR_FORM=  AFFN,          ASDF,            ASDF
##VAR_DIM=   131072,        131072,          131072
##UNITS=     HZ,            ARBITRARY UNITS, ARBITRARY UNITS
##FACTOR=    0.0627417313425165, 1,          1
##FIRST=     8223.62146879498, -2624,        -93208
##LAST=      0,             1990,            -95290
##MIN=       0,             -408334750,      0
##MAX=       8223.62146879498, 498043637,    0
$$ Real data points
##PAGE= N=1
##DATA TABLE= (X++(R..R)), XYDATA
$$ [...]
60675A595280p178q356q763q529p801p540q685j0828j2756j3998j4886j5514j5658
60662A454788j5519j5548j5531j4666j2641j0119q084p019o661o261n346m210
60650A333183l484l173k760k233k163k629l023l306m329o227p454o464l704j073
60636A281161J03j72j131j687q58J184K922L189K632K534K760K098L10j511k730
60621A290804l983n911q175j0239j2202j4316j6265j7467j7669j6878j5173j3053
60609A139473j1544j1355j1933j1818j0092p331m948l772l426l088k472j722p36
60596A055236O97K095K497J785J025J010J271J186J271K264L454L356J929Q15
60582A079891J035J685J396J29j207k034k128j124R06K765L252K887L490N738
$$ y = [1595280, 1588102, 1579746, 1570983, 1562454, 1554653, 1547113, 1538428, 1527600, 1514844, 1500846, 1485960, 1470446, 1454788, 1439269, 1423721, 1408190, 1393524, 1380883, 1370764, 1362680, 1355661, 1349000, 1342739, 1337393, 1333183, 1329699, 1326526, 1323766, 1321533, 1319370, 1316741, 1313718, 1310412, 1306083, 1299856, 1292402, 1285938, 1282234, 1281161, 1281264, 1281092, 1279961, 1278274, 1277416, 1278600, 1281522, 1284711, 1287343, 1289877, 1292637, 1294735, 1295045, 1293534, 1290804, 1286821, 1280910, 1272735, 1262496, 1250294, 1235978, 1219713, 1202246, 1184577, 1167699, 1152526, 1139473, 1127929, 1116574, 1104641, 1092823, 1082731, 1075400, 1070452, 1066680, 1063254, 1060166, 1057694, 1055972, 1055236, 1055933, 1058028, 1060525, 1062310, 1063335, 1064345, 1065616, 1066802, 1068073, 1070337, 1073791, 1077147, 1079076, 1079891, 1080926, 1082611, 1084007, 1084136, 1082929, 1080895, 1078767, 1077643, 1078549, 1081314, 1084566, 1087453, 1090943, 1096681]
60568A096681Q207R297R293R776J1546J4017J6322J8024J8738J8216J7236J7565
60556A264918K0146K3781K6345K7173K7348K7760K7877K6790K4604K2056J9325
60545A538123J6129J2634R305N820J240m320r167j1906j3166j4529j6192j6935
60533A497036j6329j5591j5763j6164j5492j3584j1188q625n779l009r68L60J400
60520A376304J837Q30j515l897n264n608n234m305l328k947k744j379J407L921
60506A348078M467L419K573L110M821O683P531P016O436P764J1102J4264J5716
60493A442980J6746J9284K2942K5826K7467K8874L0223L0831L1340L3661L8173
60482A748347M2930M6493M9951N5133O2012O8865P4007P6326P4893O9109N9083
$$ y = [1096681, 1104888, 1114185, 1123478, 1133254, 1144800, 1158817, 1175139, 1193163, 1211901, 1230117, 1247353, 1264918, 1285064, 1308845, 1335190, 1362363, 1389711, 1417471, 1445348, 1472138, 1496742, 1518798, 1538123, 1554252, 1566886, 1576191, 1582011, 1583251, 1578931, 1569764, 1557858, 1544692, 1530163, 1513971, 1497036, 1480707, 1465116, 1449353, 1433189, 1417697, 1404113, 1392925, 1384300, 1378521, 1375512, 1374544, 1374904, 1376304, 1378141, 1378971, 1377456, 1373559, 1368295, 1362687, 1357453, 1353148, 1349820, 1346873, 1344129, 1342750, 1344157, 1348078, 1352545, 1355964, 1358537, 1361647, 1366468, 1373151, 1380682, 1387698, 1394134, 1401898, 1413000, 1427264, 1442980, 1459726, 1479010, 1501952, 1527778, 1555245, 1584119, 1614342, 1645173, 1676513, 1710174, 1748347, 1791277, 1837770, 1887721, 1942854, 2004866, 2073731, 2147738, 2224064, 2298957, 2368066, 2427149]
60471B427149M5355K8678J0484p013k1827l3204m1328m6404m8258m6675m1901
60460B225056l4926k7110j9327j1707m434J878P175J2544J8729K4618K8569L0819
60448B251884L3245L6908M1480M6885N3735O1885P0433P9570R0696J03974J17792
60437B988487J31544J47039J65738J86230K06123K24960K43447K61072K76787
60428D831427K91398L07030L24449L42823L61702L80427L94573L95202L73423
60419H002454L25355K52298J57878M7039p2487j89711k93007l73819m28727m58907
60409F968366m68155m61064m42117m15510l85013l53612l23213k94593k67641
60400C557448k41871k17092j93791j72961j55310j40533j27313j14374j01650
$$ y = [2427149, 2472504, 2501182, 2511666, 2504653, 2482826, 2449622, 2408294, 2361890, 2313632, 2266957, 2225056, 2190130, 2163020, 2143693, 2131986, 2127552, 2129430, 2136605, 2149149, 2167878, 2192496, 2221065, 2251884, 2285129, 2322037, 2363517, 2410402, 2464137, 2526022, 2596455, 2676025, 2766721, 2870695, 2988487, 3120031, 3267070, 3432808, 3619038, 3825161, 4050121, 4293568, 4554640, 4831427, 5122825, 5429855, 5754304, 6097127, 6458829, 6839256, 7233829, 7629031, 8002454, 8327809, 8580107, 8737985, 8785024, 8712537, 8522826, 8229819, 7856000, 7427273, 6968366, 6500211, 6039147, 5597030, 5181520, 4796507, 4442895, 4119682, 3825089, 3557448, 3315577, 3098485, 2904694, 2731733, 2576423, 2435890, 2308577, 2194203, 2092553]
60391B092553r0296q1287p4273o8094o2129n6677n2153m8492m5391m2626l9925
60380A431210l6892l3331k9525k6139k3841k2764k2242k1380k0107j9138j8596
60369A157255j7408j4835j1885j0108r401q421o909o145o652p068o055m183k897
60356A045288k395j686l67Q07J202J333K122L573M686M746M206L902L833L506
60342A074756L347M465O613P754O707N030M853N858O113N234M629M837M774L972
60328A148942L606M624O353P662Q140P625N915L654K176J760J240j32j592k312
60314A197661k589k872k838k274j820j925k006j486p58l79j20N07J523K769M169
60299A187562N366O008O525P591Q735Q992Q949J0264J2787J4208J3383J1947J1534
$$ y = [2092553, 2002257, 1920970, 1846697, 1778603, 1716474, 1659797, 1607644, 1559152, 1513761, 1471135, 1431210, 1394318, 1360987, 1331462, 1305323, 1281482, 1258718, 1236476, 1215096, 1194989, 1175851, 1157255, 1139847, 1125012, 1113127, 1103019, 1093618, 1085197, 1078288, 1072143, 1065491, 1058423, 1052368, 1048185, 1045288, 1042893, 1041207, 1040840, 1041647, 1042849, 1044182, 1046304, 1049877, 1054563, 1059309, 1063515, 1067417, 1071250, 1074756, 1078103, 1082568, 1089181, 1096935, 1103642, 1108672, 1113525, 1119383, 1125496, 1130730, 1135359, 1140196, 1144970, 1148942, 1152548, 1157172, 1163525, 1171187, 1179327, 1186952, 1192867, 1196521, 1198697, 1200457, 1201697, 1201565, 1199973, 1197661, 1195072, 1192200, 1189362, 1187088, 1185268, 1183343, 1181337, 1179851, 1179093, 1178714, 1178594, 1179101, 1180624, 1183393, 1187562, 1192928, 1198936, 1205461, 1213052, 1221787, 1230779, 1239728, 1249992, 1262779, 1276987, 1290370, 1302317, 1313851]
60286A313851J1591J1260J1309J2346J2899J1451Q998P572P315O975O268N699
60274A427534N021L880L288M440O652Q293R236J0471J1834J2134J1213R973Q467
60261A532436N763J788k244n375p574q984r672j0073j0538j0622r779q449p513
60248A449164p157p115p394p709p108n341l730l374l453k723j621j179r95k31
60234A390034L00o70k219k118r0J917K612K554K638L213M570O594Q162Q477Q585
60219A434559R849J1670J2659J3188J4484J5996J6344J6342J8050K1011K2582
60208A606734K2162K1972K3248K4804K6013K8142L1688L5271L8261M1797M6113
60197A946205M9668N2150N5398N9916O3558O5499O8361P4136Q0800Q5931R1169
$$ y = [1313851, 1325442, 1336702, 1348011, 1360357, 1373256, 1384707, 1393705, 1401277, 1408592, 1415567, 1421835, 1427534, 1432555, 1436435, 1439723, 1444163, 1450815, 1459108, 1468344, 1478815, 1490649, 1502783, 1513996, 1523969, 1532436, 1538199, 1539987, 1537743, 1532368, 1524794, 1515810, 1506138, 1496065, 1485527, 1474905, 1465126, 1456677, 1449164, 1442007, 1434892, 1427498, 1419789, 1412681, 1407340, 1403610, 1400236, 1396783, 1394060, 1392439, 1391260, 1390265, 1390034, 1390334, 1389664, 1387445, 1385327, 1385237, 1387154, 1389766, 1392320, 1394958, 1398171, 1402741, 1409335, 1417497, 1425974, 1434559, 1444408, 1456078, 1468737, 1481925, 1496409, 1512405, 1528749, 1545091, 1563141, 1584152, 1606734, 1628896, 1650868, 1674116, 1698920, 1724933, 1753075, 1784763, 1820034, 1858295, 1900092, 1946205, 1995873, 2048023, 2103421, 2163337, 2226895, 2292394, 2360755, 2434891, 2515691, 2601622, 2692791]
60186B692791R9653J10761J20884J28575J35772J44300J54007J64241J74630J84161
60176D109775J91483J96394J99606K01000J99555J94755J86747J75424J60715
60167E815454J43520J25067J05714Q5482O5209M5741K6701P708r778k3645l3698
60156F353475m1043m5316m4950m0421l4614k9055k1812j0522M275K0410L7218
60145F147645N5371P4326R2154J08163J23876J40666J57572J72351J83756J91653
60135G447533J95459J93933J86671J74555J58282J37679J13217Q6988O0833L4256
60125H789406N804k3873n2002p6686r8058j16151j29541j37116j39629j38279
60115G883875j32872j22752j08641r2092p3647n2962l0485p654J4596L6398N7805
$$ y = [2692791, 2792444, 2903205, 3024089, 3152664, 3288436, 3432736, 3586743, 3750984, 3925614, 4109775, 4301258, 4497652, 4697258, 4898258, 5097813, 5292568, 5479315, 5654739, 5815454, 5958974, 6084041, 6189755, 6275237, 6340446, 6386187, 6412888, 6420596, 6410818, 6387173, 6353475, 6312432, 6267116, 6222166, 6181745, 6147131, 6118076, 6096264, 6085742, 6090017, 6110427, 6147645, 6203016, 6277342, 6369496, 6477659, 6601535, 6742201, 6899773, 7072124, 7255880, 7447533, 7642992, 7836925, 8023596, 8198151, 8356433, 8494112, 8607329, 8694317, 8755150, 8789406, 8795210, 8771337, 8719335, 8642649, 8544591, 8428440, 8298899, 8161783, 8022154, 7883875, 7751003, 7628251, 7519610, 7427518, 7353871, 7300909, 7270424, 7262770, 7277366, 7313764, 7371569]
60104G371569P7892R5331J09239J19273J25310J27285J25049J18343J07209R2498
60094H468998P5797N8766M2547K7685J4432L220n135r689r782n129M234J7871
60082H683815L5073N5482P9271J06210J34921J63990J93653K25495K60327K97199
60072A0235436L34746L72603M11078M50063M88676N25551N59093N87781O10474
60063A4575501O26348O34674O34914O26644O08874N80053N39598M88982M30295
60054A9745883L64076K89813K08295J22105L3769n5079j42631k26474l04562l75261
60044A9659934m36209m84513n18605n38560n44415n35796n13920m82302m44375
60035A5161239m01526l54164l03470k51127j98422j46617r7295n1526r520K8240
$$ y = [7371569, 7449461, 7544792, 7654031, 7773304, 7898614, 8025899, 8150948, 8269291, 8376500, 8468998, 8544795, 8603561, 8646108, 8673793, 8688225, 8691445, 8686310, 8676621, 8666839, 8661710, 8665944, 8683815, 8718888, 8774370, 8853641, 8959851, 9094772, 9258762, 9452415, 9677910, 9938237, 10235436, 10570182, 10942785, 11353863, 11803926, 12292602, 12818153, 13377246, 13965027, 14575501, 15201849, 15836523, 16471437, 17098081, 17706955, 18287008, 18826606, 19315588, 19745883, 20109959, 20399772, 20608067, 20730172, 20763941, 20708862, 20566231, 20339757, 20035195, 19659934, 19223725, 18739212, 18220607, 17682047, 17137632, 16601836, 16087916, 15605614, 15161239, 14759713, 14405549, 14102079, 13850952, 13652530, 13505913, 13408618, 13357092, 13347572, 13375812]
60025A3375812O0461Q6017J04314J14241J14402J05306Q9813P0272M6567J8218
60015A4185423j2978m3954p3114j00662j27021j52309j76668j99810k20751k38822
60005A2839334k54311k67247k76628k81684k82759k79828k71611k57542k39403
59996A0428321k19243j96895j71373j43645j15810q8078n8846k7680L744L3725
59986I444220O1888Q8403J13327J36792J58431J76641J89573J96624J97710J91714
59976A0955323J77522J56394J31180J02941P0363L3073o298m4374p9892j13250
59966A1382982j44287j71809j94669k12292k24305k30172k29297k21421k07409
59957I547321j89566j70505j51368j31404j09273q4229n6345k6452L891L3178
$$ y = [13375812, 13436273, 13522290, 13626604, 13740845, 13855247, 13960553, 14050366, 14120638, 14167205, 14185423, 14172445, 14128491, 14055377, 13954715, 13827694, 13675385, 13498717, 13298907, 13078156, 12839334, 12585023, 12317776, 12041148, 11759464, 11476705, 11196877, 10925266, 10667724, 10428321, 10209078, 10012183, 9840810, 9697165, 9581355, 9493277, 9434431, 9406751, 9410495, 9444220, 9506108, 9594511, 9707838, 9844630, 10003061, 10179702, 10369275, 10565899, 10763609, 10955323, 11132845, 11289239, 11420419, 11523360, 11593723, 11626796, 11620498, 11576124, 11496232, 11382982, 11238695, 11066886, 10872217, 10659925, 10435620, 10205448, 9976151, 9754730, 9547321, 9357755, 9187250, 9035882, 8904478, 8795205, 8710976, 8654631, 8628179, 8632070, 8665248]
59947H665248O1103Q8549J16325J44350J72077J99028K24505K47232K65629K78322
59937A0462368K84245K82489K72308K53451K26706J94105J58198J20726Q1986
59928A2336582M1534p30m3990q6495j25939j60361j88826k10855k25300k30746
59918A1104874k27272k16932k01927j83002j60044j33574j04975p5645m6323j6884
59908I738296J3304M4210P4341J01888J26460J48604J67813J82611J92764J99561
59898A0989852K03355K02750J97126J87999J76905J63798J48950J34418J21803
59889A2526956J10280R8832Q9056Q3577Q3044Q6927R6110J12067J34208J60586
59879A3581643J90963K26752K68052L12981L60039M08958M58878N07381N51684
$$ y = [8665248, 8726351, 8814900, 8931225, 9075575, 9247652, 9446680, 9671185, 9918417, 10184046, 10462368, 10746613, 11029102, 11301410, 11554861, 11781567, 11975672, 12133870, 12254596, 12336582, 12378116, 12377386, 12333396, 12246901, 12120962, 11960601, 11771775, 11560920, 11335620, 11104874, 10877602, 10660670, 10458743, 10275741, 10115697, 9982123, 9877148, 9801503, 9755180, 9738296, 9751600, 9795810, 9870151, 9972039, 10098499, 10247103, 10414916, 10597527, 10790291, 10989852, 11193207, 11395957, 11593083, 11781082, 11957987, 12121785, 12270735, 12405153, 12526956, 12637236, 12736068, 12825124, 12908701, 12991745, 13078672, 13174782, 13286849, 13421057, 13581643, 13772606, 13999358, 14267410, 14580391, 14940430, 15349388, 15808266, 16315647, 16867331]
59870A6867331N89388O18012O34996O38016O24293N90260N33636M55338L57999
59861B1909269K43731J15641j9215j51255k73003l80491m70734n40840n90025
59852A9843078o19838o31747o26718o07622n79343n45301n05800m60632m11158
59843A4854919l58814l03871k47170j91204j37785q6142l4898J5247O2272J05136
59833A3677690J43715J77162K03722K21704K29605K25848K09397J80302J39019
59824A5408164Q5912K2261m8781j23122j97288k68394l33127l87752m29612m58553
59814A3269708m76763m86873m89719m84245m69927m48805m24326l98562l71500
59805I218988l42741l12789k82878k54409k28307k04042j79878j55251j32331
$$ y = [16867331, 17456719, 18074731, 18709727, 19347743, 19972036, 20562296, 21095932, 21551270, 21909269, 22153000, 22268641, 22249426, 22098171, 21825168, 21444677, 20973943, 20433103, 19843078, 19223240, 18591493, 17964775, 17357153, 16777810, 16232509, 15726709, 15266077, 14854919, 14496105, 14192234, 13945064, 13753860, 13616075, 13529933, 13495035, 13510282, 13572554, 13677690, 13821405, 13998567, 14202289, 14423993, 14653598, 14879446, 15088843, 15269145, 15408164, 15494076, 15516337, 15467556, 15344434, 15147146, 14878752, 14545625, 14157873, 13728261, 13269708, 12792945, 12306072, 11816353, 11332108, 10862181, 10413376, 9989050, 9590488, 9218988, 8876247, 8563458, 8280580, 8026171, 7797864, 7593822, 7413944, 7258693, 7126362]
59796G126362j13869j00145q9657q1947p7576p5599p3719p1067o8611o6442o3055
59785F244675n7907n2366m7271m1744l5607l1014l0274l3497l9383m6830n4821
59774E773961o2166o8426p3748p7176p6839p2673o7126o1935n5996m7711l7819
59763E072346k8349k0161j2953o459k52O549J4153K1885L0108M0584N3536O5975
59751E236962P4779Q0177Q4430Q8529R2207R5871R9903J02750J02100R7767R1422
59740F246897Q3787P4295O3598N4172M7704M3484M0061L7461L7005L9762M5715
59729F813941N4121O4517P7358R3472J12672J33627J55557J79341K06201K36111
59719H126918K68403L03258L41376L82560M25506M68693N10383N47982N77990
$$ y = [7126362, 7012493, 6912348, 6822691, 6740744, 6663168, 6587569, 6513850, 6442783, 6374172, 6307730, 6244675, 6186768, 6134402, 6087131, 6045387, 6009780, 5978766, 5948492, 5914995, 5875612, 5828782, 5773961, 5711795, 5643369, 5569621, 5492445, 5415606, 5342933, 5275807, 5213872, 5157876, 5110165, 5072346, 5043997, 5023836, 5010883, 5004424, 5004172, 5010721, 5024874, 5046759, 5076867, 5117451, 5170987, 5236962, 5311741, 5391918, 5476348, 5564877, 5657084, 5752955, 5852858, 5955608, 6057708, 6155475, 6246897, 6330684, 6404979, 6468577, 6522749, 6570453, 6613937, 6653998, 6691459, 6728464, 6768226, 6813941, 6868062, 6932579, 7009937, 7103409, 7216081, 7349708, 7505265, 7684606, 7890807, 8126918, 8395321, 8698579, 9039955, 9422515, 9848021, 10316714, 10827097, 11375079, 11953069]
59710A1953069N95845N94761N65628N00511L98004K65743J18221k7849j57904
59701A4806029k62376l37397l83499m03772m02817l85986l58247l23357k84069
59692A1664509k42639k00814j59752j20157q2046m4573o991L0141O5717R9961
59682A1003356J34238J68842K02672K35632K69435L05207L42018L79001M17156
59673A3457557M57563M99530N42383N87576O36938O89954P45000Q02218Q62682
59664A9281401R25252R86896J045994J102821J156313J202503J236931J257098
59656B8195209J262075J251494J226026J188023J141207J090467J041881J001441
59648C7397823R72983R57745R55585R65147R82562J001505J015573J020003J010810
$$ y = [11953069, 12548914, 13143675, 13709303, 14209814, 14607818, 14873561, 14991782, 14963933, 14806029, 14543653, 14206256, 13822757, 13418985, 13016168, 12630182, 12271935, 11948578, 11664509, 11421870, 11221056, 11061304, 10941147, 10859101, 10814528, 10807537, 10837678, 10903395, 11003356, 11137594, 11306436, 11509108, 11744740, 12014175, 12319382, 12661400, 13040401, 13457557, 13915120, 14414650, 14957033, 15544609, 16181547, 16871501, 17616501, 18418719, 19281401, 20206653, 21193549, 22239543, 23342364, 24498677, 25701180, 26938111, 28195209, 29457284, 30708778, 31934804, 33122827, 34264034, 35354501, 36396382, 37397823, 38370806, 39328551, 40284136, 41249283, 42231845, 43233350, 44248923, 45268926, 46279736]
59639D6279736R83317R32682Q56070P54310O31925M95597L52228K08210P0366
59630E1564441n3707j57366k36890k90817l17947l17492k91089k42914j76901
59621D9479318r4740K845J13932K35472L64949N00855O41593P84449R25597J060362
59611E4014632J183051J286801J364002J406944J407660J357215J246335J068547
59603F4335187Q23784N19549J69644k07121n87982r49181j270454j537661j742375
59594E9553390j881477j958165j981272j961194j906521j825087j726563j622073
59586D4691038j522282j437636j379232j355823j368336j408115j460731j510993
59578C3247890j545984j557226j542401j504490j448352j378396j299083j215490
$$ y = [46279736, 47263053, 48195735, 49051805, 49806115, 50438040, 50933637, 51285865, 51494075, 51564441, 51510734, 51353368, 51116478, 50825661, 50507714, 50190222, 49899133, 49656219, 49479318, 49384578, 49387423, 49501355, 49736827, 50101776, 50602631, 51244224, 52028673, 52954270, 54014632, 55197683, 56484484, 57848486, 59255430, 60663090, 62020305, 63266640, 64335187, 65158971, 65678520, 65848164, 65641043, 65053061, 64103880, 62833426, 61295765, 59553390, 57671913, 55713748, 53732476, 51771282, 49864761, 48039674, 46313111, 44691038, 43168756, 41731120, 40351888, 38996065, 37627729, 36219614, 34758883, 33247890, 31701906, 30144680, 28602279, 27097789, 25649437, 24271041, 22971958, 21756468]
59570B1756468j131802j049840r69933q92766q19580p51138o87391o28055n72916
59561A4253047n21720m74281m30712l91120l55019l21387k89550k59952k33824
59552A0975482k11986j94174j79715j68582j61293j58007j58243j61366j66499
59543I415617j72065j76492j79695j82762j85747j86929j84920j80376j74602
59534G792029j67471j58030j46449j34033j21610j09104r6452q3750p0683n6877
59524F647570m2730k9117j6322m195O924J6342K4149L1462L9429M8346N7466O5207
59512F844531P0212P2845P5249P9157Q4289Q9650R5565J03180J12518J22623J33379
59501G883198J45803J60335J76119J92311K09162K27535K47949K70241K93571
$$ y = [21756468, 20624666, 19574826, 18604893, 17712127, 16892547, 16141409, 15454018, 14825963, 14253047, 13731327, 13257046, 12826334, 12435214, 12080195, 11758808, 11469258, 11209306, 10975482, 10763496, 10569322, 10389607, 10221025, 10059732, 9901725, 9743482, 9582116, 9415617, 9243552, 9067060, 8887365, 8704603, 8518856, 8331927, 8147007, 7966631, 7792029, 7624558, 7466528, 7320079, 7186046, 7064436, 6955332, 6858880, 6775130, 6704447, 6647570, 6604840, 6575723, 6559401, 6555206, 6562130, 6578472, 6602621, 6634083, 6673512, 6721858, 6779324, 6844531, 6914743, 6987588, 7062837, 7141994, 7226283, 7315933, 7411498, 7514678, 7627196, 7749819, 7883198, 8029001, 8189336, 8365455, 8557766, 8766928, 8994463, 9242412, 9512653, 9806224]
59492I806224L16848L39733L63058L87588M12609M36346M57430M75090M88364
59483A3483290M96173M98196M94690M85533M70278M49183M23468L94339L62199
59474A7557349L26577K86667K42638J97154J54879J19352R0657O6876M7251L2844
59464A9122244K4867K3914L0556M5164O6865R3637J23360J53699J81046K00851
59454B0066203K09274K03836J82685J44579Q9946K1215n8199j44754k34898l25087
59444B0154800m11845m91381n59613o13330o51213o73327o80242o73296o54836
59435A4745717o27221n92126n51645n09022m66800m24994l82498l39707k98242
59426A0553462k58748k20799j84638j50968j19119q7234n4569k2048R645M0991
$$ y = [9806224, 10123072, 10462805, 10825863, 11213451, 11626060, 12062406, 12519836, 12994926, 13483290, 13979463, 14477659, 14972349, 15457882, 15928160, 16377343, 16800811, 17195150, 17557349, 17883926, 18170593, 18413231, 18610385, 18765264, 18884616, 18975273, 19042149, 19089400, 19122244, 19147111, 19171025, 19201581, 19246745, 19313610, 19407247, 19530607, 19684306, 19865352, 20066203, 20275477, 20479313, 20661998, 20806577, 20896523, 20917738, 20859539, 20714785, 20479887, 20154800, 19742955, 19251574, 18691961, 18078631, 17427418, 16754091, 16073849, 15400553, 14745717, 14118496, 13526370, 12974725, 12465703, 11998903, 11573909, 11191411, 10851704, 10553462, 10294714, 10073915, 9889277, 9738309, 9619190, 9531956, 9477387, 9455339, 9464984, 9505975]
59416I505975P2468J03893J35168J66403J97110K26554K54897K82562L08543L30786
59406A1584359L48391L61599L69356L68602L56717L33373K99449K55422K01455
59397A4478723J38049O6310j1392r0805j67192k37656l01008l55461l98427m29159
59387A2691982m49813m62835m68578m66459m57197m42728m24706m04094l81688
59378H733884l58185l34099l10104k86945k64700k42737k20807j99524j79425
59369F337358j60236j41604j24109j08911r6343q5009p2565n7916m2637k9428
59359E418600j9008r605J44R482J7679K6010L5684M5449N3489O0390O7369P2567
59347E778250P2498O7309O1548N9276O1080O6305P5174Q7707J03061J21010J41596
$$ y = [9505975, 9578443, 9682336, 9817504, 9983907, 10181017, 10407571, 10662468, 10945030, 11253573, 11584359, 11932750, 12294349, 12663705, 13032307, 13389024, 13722397, 14021846, 14277268, 14478723, 14616772, 14683082, 14671690, 14580885, 14413693, 14176037, 13875029, 13519568, 13121141, 12691982, 12242169, 11779334, 11310756, 10844297, 10387100, 9944372, 9519666, 9115572, 8733884, 8375699, 8041600, 7731496, 7444551, 7179851, 6937114, 6716307, 6516783, 6337358, 6177122, 6035518, 5911409, 5802498, 5706155, 5621146, 5548581, 5490665, 5448028, 5418600, 5399592, 5389987, 5390131, 5399613, 5417292, 5443302, 5478986, 5524435, 5577924, 5638314, 5705683, 5778250, 5850748, 5918057, 5979605, 6038881, 6099961, 6166266, 6241440, 6329147, 6432208, 6553218, 6694814]
59336F694814J62248J77956J86246J90210J95205K04368K18553K38273K63422
59327H531295K92482L24078L58421L96000M36129M78247N23327N72278O24056
59318A2536313O76926P30549P85085Q38833Q88314R30187R61788R80362R83385
59309B0311742R69731R39835Q95178Q38314P72883P02679O30856N59961M91760
59300B7112939M26499L63315L01756K41797J81951J18926N0105k4633j04105j87352
59290B8481198k72980l58245m40019n15807n83307o40448o87110p25581p58195
59281B3499506p85376q06796q22901q34048q39296q37516q28804q13656p91880
59272A6139233p63565p30174o93509o54450o13828n73334n34055m95080m55024
$$ y = [6694814, 6857062, 7035018, 7221264, 7411474, 7606679, 7811047, 8029600, 8267873, 8531295, 8823777, 9147855, 9506276, 9902276, 10338405, 10816652, 11339979, 11912257, 12536313, 13213239, 13943788, 14728873, 15567706, 16456020, 17386207, 18347995, 19328357, 20311742, 21281473, 22221308, 23116486, 23954800, 24727683, 25430362, 26061218, 26621179, 27112939, 27539438, 27902753, 28204509, 28446306, 28628257, 28747183, 28797288, 28772655, 28668550, 28481198, 28208218, 27849973, 27409954, 26894147, 26310840, 25670392, 24983282, 24257701, 23499506, 22714130, 21907334, 21084433, 20250385, 19411089, 18573573, 17744769, 16931113, 16139233, 15375668, 14645494, 13951985, 13297535, 12683707, 12110373, 11576318, 11081238, 10626214]
59263A0626214m14366l75045l38561l05539k76135k49443k23341j96558j70326
59254H076900j46732j26027j06889q8608p1623n6307m2426k9376j5972p89J6066
59243G408217L2359M6224N8585P1637Q5644R8878J10312J20664J30700J39925
59233H303145J47260J52089J54540J55386J55445J54703J52416J48650J44780
59224I668414J41732J38730J34907J31312J29974J31515J35065J40002J46330
59215A0897981J53402J59462J62566J61237J54448J41764J23475J00192P2619
59206A2127146M1881R293k4505n9240r3366j24051j49431j69562j84459j92793
59196A1180913j93868j89258j80917j69033j53354j35290j16539r6716p4619n1170
$$ y = [10626214, 10211848, 9836803, 9498242, 9192703, 8916568, 8667125, 8443784, 8247226, 8076900, 7930168, 7804141, 7697252, 7608644, 7537021, 7480714, 7438288, 7408912, 7392940, 7392151, 7408217, 7440576, 7486800, 7545385, 7617022, 7702666, 7801544, 7911856, 8032520, 8163220, 8303145, 8450405, 8602494, 8757034, 8912420, 9067865, 9222568, 9374984, 9523634, 9668414, 9810146, 9948876, 10083783, 10215095, 10345069, 10476584, 10611649, 10751651, 10897981, 11051383, 11210845, 11373411, 11534648, 11689096, 11830860, 11954335, 12054527, 12127146, 12169027, 12178320, 12153815, 12094575, 12001209, 11877158, 11727727, 11558165, 11373706, 11180913, 10987045, 10797787, 10616870, 10447837, 10294483, 10159193, 10042654, 9945938, 9871319, 9820149]
59186I820149k8831q579J0389K8233M4119N8259P1984Q5345R6640J04948J11443
59175A0394099J17584J23554J29285J35643J43775J54232J67529J84696K06571
59166A1756968K33079K63726K98245L36189L76155M15752M52288M83548N07929
59157A5123879N23520N26872N13323M79319M24256L49820K58276J52209L5329
59148A8386803q7546k11368l31058m41292n37091o14909o72977p10972p29919
59139A4049671p32131p20668o98766o69673o36181n99885n61321n21133m80565
59130H429348m40764m02480l66610l33949l04183k76361k50726k28566k09743
59121E615966j92072j74109j56930j41998j28886j16518j05162r5383q6265p6554
$$ y = [9820149, 9791318, 9782739, 9793128, 9821361, 9865480, 9923739, 9995723, 10081068, 10177708, 10282656, 10394099, 10511683, 10635237, 10764522, 10900165, 11043940, 11198172, 11365701, 11550397, 11756968, 11990047, 12253773, 12552018, 12888207, 13264362, 13680114, 14132402, 14615950, 15123879, 15647399, 16174271, 16687594, 17166913, 17591169, 17940989, 18199265, 18351474, 18386803, 18299257, 18087889, 17756831, 17315539, 16778448, 16163539, 15490562, 14779590, 14049671, 13317540, 12596872, 11898106, 11228433, 10592252, 9992367, 9431046, 8909913, 8429348, 7988584, 7586104, 7219494, 6885545, 6581362, 6305001, 6054275, 5825709, 5615966, 5423894, 5249785, 5092855, 4950857, 4821971, 4705453, 4600291, 4504908, 4418643, 4342089]
59111D342089o6714n8078n0637m3352l5971k9021k2503j6120j0138m657J414Q978
59099D015290J7047K3968K9798L5836M2339M8384N3696N8978O4578P0275P6329
59088D536518Q3461R1685J00154J07957J14358J18911J22236J25940J30734J35463
59078E667417J39022J42069J45413J47808J47100J42817J36033J27453J17412
59069F912544J07073R7706Q9151Q0431P1454O2662N3976M5894M0762M0831M5431
59058G647915N2063N9832O9827Q2499R6835J12181J28940J47323J66958J87662
59048H752035K09164K30266K49734K67618K83996K96932L03440L02180K93297
59039A1188662K75851K47513K07178J56434R8495L7061k4009q1551j33819j79412
$$ y = [4342089, 4275375, 4217297, 4166660, 4123308, 4087337, 4058316, 4035813, 4019693, 4009555, 4004898, 4006312, 4015290, 4032337, 4056305, 4086103, 4121939, 4164278, 4212662, 4266358, 4325336, 4389914, 4460189, 4536518, 4619979, 4711664, 4811818, 4919775, 5034133, 5153044, 5275280, 5401220, 5531954, 5667417, 5806439, 5948508, 6093921, 6241729, 6388829, 6531646, 6667679, 6795132, 6912544, 7019617, 7117323, 7206474, 7286905, 7358359, 7421021, 7474997, 7520891, 7561653, 7602484, 7647915, 7699978, 7759810, 7829637, 7912136, 8008971, 8121152, 8250092, 8397415, 8564373, 8752035, 8961199, 9191465, 9441199, 9708817, 9992813, 10289745, 10593185, 10895365, 11188662, 11464513, 11712026, 11919204, 12075638, 12174133, 12211194, 12187185, 12105634, 11971815, 11792403]
59029A1792403k16137k42338k58787k67714k70667k68795k64199k58850k52748
59020I492168k45295k37919k33144k31483k31368k31802k32807k33778k33776
59011G380796k33419k34077k35239k34813k31907k27224k20985k12993k04566
59002E345573j97706j92069j85184j76063j66311j57293j48533j39440j30480
58993C852494j22053j13998j06572j00165r4017q7034p9831p3982o9526o5343
58983B939973o1660n9597n8452n6231n2906n0269m8442m5517m1148l7325l4809
58972B393617l1883k7700k3985k2022k0566j8187j5359j2776r792o009k602p19
58960B202017q7j08o45r66J42K400M006M201L920L502K166N23Q23L584O338P211
$$ y = [11792403, 11576266, 11333928, 11075141, 10807427, 10536760, 10267965, 10003766, 9744916, 9492168, 9246873, 9008954, 8775810, 8544327, 8312959, 8081157, 7848350, 7614572, 7380796, 7147377, 6913300, 6678061, 6443248, 6211341, 5984117, 5763132, 5550139, 5345573, 5147867, 4955798, 4770614, 4594551, 4428240, 4270947, 4122414, 3982974, 3852494, 3730441, 3616443, 3509871, 3409706, 3315689, 3228655, 3148824, 3074842, 3005316, 2939973, 2878313, 2818716, 2760264, 2704033, 2651127, 2600858, 2552416, 2506899, 2465751, 2428426, 2393617, 2361734, 2334034, 2310049, 2288027, 2267461, 2249274, 2233915, 2221139, 2211347, 2205338, 2202736, 2202017, 2201930, 2201822, 2201177, 2200211, 2200353, 2202753, 2206759, 2210960, 2214880, 2218382, 2220548, 2221071, 2221894, 2225478, 2231816, 2239027]
58944B239027P389Q531J0010J0529J0637J1669J3465J4808J5288J5567J6546J8745
58932B392211K1614K3361K2892K1824K2722K5505K7791K8743K9845L1713L3036
58921B681257L3330L3759L4449L4032L2837L3399L6388L9121L9654L9485M0550
58910C078261M2415M4197M6491M9433N1567N2507N4036N6742N8599N8989O0839
58899C654076O6014P1728P4762P6453P9869Q4493Q7906R0950R6782J05487J13770
58888D602290J19951J25837J33206J41493J49653J57920J66920J76625J86857
58879E960752J97806K09841K23416K38771K55247K71674K88047L05738L25376
58870H276668L46120L67888L92449M20690M50632M80049N09835N42927N80820
$$ y = [2239027, 2246416, 2254947, 2264957, 2275486, 2286123, 2297792, 2311257, 2326065, 2341353, 2356920, 2373466, 2392211, 2413825, 2437186, 2460078, 2481902, 2504624, 2530129, 2557920, 2586663, 2616508, 2648221, 2681257, 2714587, 2748346, 2782795, 2816827, 2849664, 2883063, 2919451, 2958572, 2998226, 3037711, 3078261, 3120676, 3164873, 3211364, 3260797, 3312364, 3364871, 3418907, 3475649, 3534248, 3593237, 3654076, 3720090, 3791818, 3866580, 3943033, 4022902, 4107395, 4195301, 4286251, 4383033, 4488520, 4602290, 4722241, 4848078, 4981284, 5122777, 5272430, 5430350, 5597270, 5773895, 5960752, 6158558, 6368399, 6591815, 6830586, 7085833, 7357507, 7645554, 7951292, 8276668, 8622788, 8990676, 9383125, 9803815, 10254447, 10734496, 11244331, 11787258, 12368078]
58861A2368078O22756O67365P13580P60935Q10160Q62552R17626R72711J025703
58852A9721466J076332J123432J163009J190647J203848J200032J174295J121494
58844B8974555J039232R26872P83737O11235M15625K06014r635k24327m29318
58835C2293990o14841p74076r04808j007521j083414j133811j160077j164277
58827B4451165j150394j123602j087362j042707r91278r36935q82762q28682p73994
58818A5633449p20401o70348o24106n80789n40614n03893m69417m36265m05612
58809A0682004l78385l52869l27210l02504k80523k60193k39532k19488k02205
58800H119095j86733j70268j52934j37454j24343j11187r6920q3264p1335n9954
$$ y = [12368078, 12990834, 13658199, 14371779, 15132714, 15942874, 16805426, 17723052, 18695763, 19721466, 20797798, 21921230, 23084239, 24274886, 25478734, 26678766, 27853061, 28974555, 30013787, 30940659, 31724396, 32335631, 32751256, 32957270, 32947635, 32723308, 32293990, 31679149, 30905073, 30000265, 28992744, 27909330, 26775519, 25615442, 24451165, 23300771, 22177169, 21089807, 20047100, 19055822, 18118887, 17236125, 16407443, 15633449, 14913048, 14242700, 13618594, 13037805, 12497191, 11993298, 11523881, 11087616, 10682004, 10303619, 9950750, 9623540, 9321036, 9040513, 8780320, 8540788, 8321300, 8119095, 7932362, 7762094, 7609160, 7471706, 7347363, 7236176, 7139256, 7055992, 6984657, 6924703]
58790F924703m8026l5885k3616j0578K730J4677K5201L6412M9754O4378P8943
58779G078693R3364J08143J23287J38543J53721J68786J84387K01859K21499K41531
58769H713813K60212K78329K98028L20000L43492L68301L94736M22294M50549
58760A1849754M80907N15350N53828N94863O38228O84861P34440P85474Q37617
58751A7675322Q91542R46302R98931J046810J088351J120961J140293J142069
58743B6050581J123091J079971J008545R05572P70608O06369M18241K13370n10
58734C2175838k15389m22194o11289p75348r11293j018771j097971j150136j178658
58725B4794789j187629j179786j157144j122608j079526j030648r78693r26441
$$ y = [6924703, 6876677, 6840792, 6817176, 6806598, 6809328, 6824005, 6849206, 6885618, 6935372, 6999750, 7078693, 7172057, 7280200, 7403487, 7542030, 7695751, 7864537, 8048924, 8250783, 8472282, 8713813, 8974025, 9252354, 9550382, 9870382, 10213874, 10582175, 10976911, 11399205, 11849754, 12330661, 12846011, 13399839, 13994702, 14632930, 15317791, 16052231, 16837705, 17675322, 18566864, 19513166, 20512097, 21558907, 22647258, 23768219, 24908512, 26050581, 27173672, 28253643, 29262188, 30167760, 30938368, 31544737, 31962978, 32176348, 32175838, 31960449, 31538255, 30926966, 30151618, 29240325, 28221554, 27123583, 25973447, 24794789, 23607160, 22427374, 21270230, 20147622, 19068096, 18037448, 17058755, 16132314]
58717A6132314q74818q22446p68858p16552o68198o23684n82013n43990n10317
58708A0021438m79000m47836m18046l92159l69337l46285l22033k98584k77368
58699F670790k58286k41770k28361k16297k02662j87292j72792j60621j49765
58690D852944j39358j29860j21268j12686j04119r6685r0805q5845q1405p7293
58680C813620p2753o7605o3384o1216n9415n5624n0472m6619m4848m3750m2650
58669C205284m1997m1431m0134l8885l9122m0430m1337m1981m3427m5148m5903
58658B745489m6349m7935n0036n1095n1545n2450n2336m9103m4270m1434m0879
58647B218057l9692l6934l4684l3881l3053l1543l0276k9010k6504k3712k3185
$$ y = [16132314, 15257496, 14435050, 13666192, 12949640, 12281442, 11657758, 11075745, 10531755, 10021438, 9542438, 9094602, 8676556, 8284397, 7915060, 7568775, 7246742, 6948158, 6670790, 6412504, 6170734, 5942373, 5726076, 5523414, 5336122, 5163330, 5002709, 4852944, 4713586, 4583726, 4462458, 4349772, 4245653, 4148968, 4058163, 3972318, 3890913, 3813620, 3740867, 3673262, 3609878, 3548662, 3489247, 3433623, 3383151, 3336532, 3291684, 3247934, 3205284, 3163287, 3121856, 3081722, 3042837, 3003715, 2963285, 2921948, 2879967, 2836540, 2791392, 2745489, 2699140, 2651205, 2601169, 2550074, 2498529, 2446079, 2393743, 2344640, 2300370, 2258936, 2218057, 2178365, 2141431, 2106747, 2072866, 2039813, 2008270, 1977994, 1948984, 1922480, 1898768, 1875583]
58636A875583k4799k5620k4485k3135k2579k1933k1201k1317k1140j8415j4293
58625A636666j2542j3489j3174r707n973m300k916k7K616L067K827M226O634P865
58611A601773P282N402K310j560m759o473p406p987p448n566l495k110j196o62
58597A568105o53l38J267L292M125M209N138O665P751R882J5305K2180K5993K6199
58583A699120K6936L0385L4095L6159L8333M2079M5810M8340N1264N5759O0477
58572B168757O4703P0002P6700Q2343Q5938R0331R7867J06953J15363J23846J33935
58561C216738J45066J56470J69452J85282K03065K21551K40765K60338K78768
58552E077495K95868L12925L29004L40326L44775L43397L35557L16589K82981
$$ y = [1875583, 1850784, 1825164, 1800679, 1777544, 1754965, 1733032, 1711831, 1690514, 1669374, 1650959, 1636666, 1624124, 1610635, 1597461, 1587754, 1581781, 1577481, 1574565, 1574538, 1577154, 1580221, 1583048, 1587274, 1593908, 1601773, 1609055, 1614457, 1616767, 1615207, 1610448, 1603975, 1596569, 1588582, 1581134, 1575568, 1572073, 1569963, 1568767, 1568105, 1567452, 1567114, 1568381, 1571673, 1575798, 1580007, 1585145, 1591810, 1599561, 1609443, 1624748, 1646928, 1672921, 1699120, 1726056, 1756441, 1790536, 1826695, 1865028, 1907107, 1952917, 2001257, 2052521, 2108280, 2168757, 2233460, 2303462, 2380162, 2462505, 2548443, 2638774, 2736641, 2843594, 2958957, 3082803, 3216738, 3361804, 3518274, 3687726, 3873008, 4076073, 4297624, 4538389, 4798727, 5077495, 5373363, 5686288, 6015292, 6355618, 6700393, 7043790, 7379347, 7695936, 7978917]
58543G978917K36484J80480J15982M4415k8919r7902j59900k14069k58026k89571
58533G507891l09732l21028l24257l19611l09101k95284k79129k61275k43484
58524D844990k26776k10071j92693j76115j61294j46617j30826j15632j03183
58515C381783r2974q3524p5072o8448o3243n9005n6284n4789n2775m9847m7853
58504B677969m7386m6278m3352m0553l9376l8437l6989l7367m0955m4947m6417
58493B215912m6742m8457n0384m9729m7010m4945m3811m1525l7520l3491l0844
58482A741454k9613k9225k8582k6458k3326k1395k1567k2029k1085j9334j7806
58471A481034j6305j4918j4640j5064j4166j1799j0541j1531j2665j2413j1998
$$ y = [7978917, 8215401, 8395881, 8511863, 8556278, 8527359, 8429457, 8269557, 8055488, 7797462, 7507891, 7198159, 6877131, 6552874, 6233263, 5924162, 5628878, 5349749, 5088474, 4844990, 4618214, 4408143, 4215450, 4039335, 3878041, 3731424, 3600598, 3484966, 3381783, 3288809, 3205285, 3130213, 3061765, 2998522, 2939517, 2883233, 2828444, 2775669, 2725822, 2677969, 2630583, 2584305, 2540953, 2500400, 2461024, 2422587, 2385598, 2348231, 2307276, 2262329, 2215912, 2169170, 2120713, 2070329, 2020600, 1973590, 1928645, 1884834, 1843309, 1805789, 1772298, 1741454, 1711841, 1682616, 1654034, 1627576, 1604250, 1582855, 1561288, 1539259, 1518174, 1498840, 1481034, 1464729, 1449811, 1435171, 1420107, 1405941, 1394142, 1383601, 1372070, 1359405, 1346992, 1334994]
58460A334994j1966j0327o576l898m659o971q258q909r679r076o440m352m768
58447A239115n807n429n136o803q882r102q120p403o346m538l853n202o243n410
58433A150841m879o397p686o536m992n612o911o491n466n695n742l899k247l307
58419A074981n307n132l452k649k259q36N7j685m349m833l588l104l381k812j784
58404A029867j705k118k025k053k476j677O28J787P96Q58L898O524N610L840N091
58389A046845P889Q474P098O249N726M334L454M113L615jl520l608k764m788p794
58374A075322p702n575n278o523o322m954m567m229k201o71k277m424l078K33
58360A017754J308O10J362K777J862j78J31J918J857Q24K277N547P162P222Q300
$$ y = [1334994, 1323028, 1312701, 1306125, 1302227, 1297568, 1290597, 1282339, 1273430, 1263751, 1254675, 1248235, 1243883, 1239115, 1233308, 1227879, 1222743, 1215940, 1207058, 1197956, 1189836, 1182433, 1176087, 1171549, 1167696, 1162494, 1156251, 1150841, 1145962, 1139565, 1131879, 1125343, 1120351, 1114739, 1107828, 1101337, 1095871, 1090176, 1084434, 1080535, 1078288, 1074981, 1069674, 1064542, 1061090, 1058441, 1056182, 1055346, 1055403, 1053718, 1049369, 1044536, 1040948, 1037844, 1034463, 1031651, 1029867, 1028162, 1026044, 1024019, 1021966, 1019490, 1017813, 1018441, 1020228, 1021024, 1021882, 1025780, 1032304, 1037914, 1041754, 1046845, 1054734, 1063208, 1070306, 1076555, 1082281, 1086615, 1090069, 1094182, 1097797, 1097796, 1094276, 1090668, 1087904, 1083116, 1075322, 1067620, 1062045, 1056767, 1050244, 1043922, 1038968, 1034401, 1030172, 1027971, 1027300, 1025023, 1020599, 1017521, 1017754, 1019062, 1019672, 1021034, 1023811, 1025673, 1025495, 1025626, 1027544, 1029401, 1030225, 1032502, 1038049, 1045211, 1052433, 1060733]
58345A060733R680Q871P206P769R645J0168J0534J2857J4375J1691Q145R239J2973
58332A193886J2908R131P698J0045J1502J0108Q852Q767P330M344K718K936K813
58319A293038K537L962N638M707K766L474N583M967K204J273K170J912J377L620
58305A339228O784O491M099M678P818Q610O815O853R134R683Q008P379P654N818
58291A439052L209M124P682Q957P629P477Q219O352L296L827O958P251M749M595
58277A523377P235Q225P407Q938J2385J3309J2444J4696J9102J9755J6715J5976
58265A679564J8396J8964J7364J8638K2592K3279K0242J9715K3260K5573K4956
58254A912543K5567K7817K7028K3372K2792K6144K7591K5472K4789K7305K9125
$$ y = [1060733, 1070413, 1079284, 1086490, 1094259, 1103904, 1114072, 1124606, 1137463, 1151838, 1163529, 1171674, 1180913, 1193886, 1206794, 1215925, 1223623, 1233668, 1245170, 1255278, 1264130, 1272897, 1280227, 1284571, 1287289, 1290225, 1293038, 1295575, 1299537, 1305175, 1309882, 1312648, 1316122, 1321705, 1326672, 1328876, 1330149, 1332319, 1334231, 1335608, 1339228, 1346012, 1352503, 1356602, 1361280, 1369098, 1377708, 1384523, 1391376, 1400510, 1410193, 1418201, 1425580, 1433234, 1439052, 1442261, 1446385, 1454067, 1463024, 1470653, 1478130, 1486349, 1492701, 1495997, 1499824, 1506782, 1514033, 1518782, 1523377, 1530612, 1538837, 1546244, 1555182, 1567567, 1580876, 1593320, 1608016, 1627118, 1646873, 1663588, 1679564, 1697960, 1716924, 1734288, 1752926, 1775518, 1798797, 1819039, 1838754, 1862014, 1887587, 1912543, 1938110, 1965927, 1992955, 2016327, 2039119, 2065263, 2092854, 2118326, 2143115, 2170420, 2199545]
58243B199545K9462L1756L5058L4561L1581L2368L6432L7044L3883L3724L7896
58232B573310M0803M1446M4286M8221M7523M4317M6818N4283N7567N5572N6773
58221C110919O3010O6862O7046P1042P9632Q4258Q3004Q3986Q9596R2830R2578
58210C984763R6702J06041J11296J10023J10950J17174J21117J20444J22745J30040
58200E131295J35015J36952J44533J58580J69280J74724J84334J99723K10905
58191F645341K16003K25247K40605K51749K57569K70658K94558L17835L36931
58182I056496L62677L97326M27832M49395M72834N01408N24153N39892N63108
58173A3295121N97869O31258O60366O98926P48910P94358Q32766Q82611R49371
$$ y = [2199545, 2229007, 2260763, 2295821, 2330382, 2361963, 2394331, 2430763, 2467807, 2501690, 2535414, 2573310, 2614113, 2655559, 2699845, 2748066, 2795589, 2839906, 2886724, 2941007, 2998574, 3054146, 3110919, 3173929, 3240791, 3307837, 3378879, 3458511, 3542769, 3625773, 3709759, 3799355, 3892185, 3984763, 4081465, 4187506, 4298802, 4408825, 4519775, 4636949, 4758066, 4878510, 5001255, 5131295, 5266310, 5403262, 5547795, 5706375, 5875655, 6050379, 6234713, 6434436, 6645341, 6861344, 7086591, 7327196, 7578945, 7836514, 8107172, 8401730, 8719565, 9056496, 9419173, 9816499, 10244331, 10693726, 11166560, 11667968, 12192121, 12732013, 13295121, 13892990, 14524248, 15184614, 15883540, 16632450, 17426808, 18259574, 19142185, 20091556]
58164B0091556J015245J073726J141931J226669J312247J394738J492614J609222
58156C0357948J722018J824291J939042K076197K217764K362089K538046K756145
58148D7793540K991943L237408L518997L845299M192784M567078N019406N578512
58140H0744967O230914O990462P909184Q992642J0198647J1558252J3191839J5152014
58132A60968921J7359989J9749231K2346694K5186903K8354401L2113690L6471624
58125C42551453M0122828M0164903L3791334K0809694M324249j1295762k3079027
58118D47389672l0342493l3782035l4397066l3134857l0843296k8123434k5276300
58111B31490191k2469548j9857750j7522575j5440906j3577566j1928302j0453793
$$ y = [20091556, 21106801, 22180527, 23322458, 24549127, 25861374, 27256112, 28748726, 30357948, 32079966, 33904257, 35843299, 37919496, 40137260, 42499349, 45037395, 47793540, 50785483, 54022891, 57541888, 61387187, 65579971, 70147049, 75166455, 80744967, 86975881, 93966343, 101875527, 110868169, 121066816, 132625068, 145816907, 160968921, 178328910, 198078141, 220424835, 245611738, 273966139, 306079829, 342551453, 382674281, 422839184, 456630518, 477440212, 481764461, 470468699, 447389672, 417047179, 383265144, 348868078, 315733221, 284889925, 256766491, 231490191, 209020643, 189162893, 171640318, 156199412, 142621846, 130693544, 120239751]
58104A20239751r069677p730230o448732n233545m085711l047452k154557j359796
58096H1110051o38264j77278k99826j113381k327394l486622m309199m753234
58088F4004853m875286m748824m473639m146765l807193l453816l102087k780046
58080C2617197k490095k220397j979312j781105j613934j456869j313634j198536
58072A8563315j104583j015063r31846q64773q07110p46988o89461o43813o02828
58063A1156850n56662n13089m82589m57335m25440l92139l67256l45818l20611
58054G295911k99853k92665k90163k80090k67422k61907k57912k45662k30668
58045D869569k23136k18723k07697j93154j83029j73820j58812j43009j34030
$$ y = [120239751, 111170074, 103439844, 96991112, 91757567, 87671856, 84624404, 82469847, 81110051, 80471787, 80294509, 79994683, 78881302, 76553908, 73067286, 68758087, 64004853, 59129567, 54380743, 49907104, 45760339, 41953146, 38499330, 35397243, 32617197, 30127102, 27906705, 25927393, 24146288, 22532354, 21075485, 19761851, 18563315, 17458732, 16443669, 15511823, 14647050, 13839940, 13092952, 12403491, 11759678, 11156850, 10600188, 10087099, 9604510, 9147175, 8721735, 8329596, 7962340, 7616522, 7295911, 6996058, 6703393, 6413230, 6133140, 5865718, 5603811, 5345899, 5100237, 4869569, 4646433, 4427710, 4220013, 4026859, 3843830, 3670010, 3511198, 3368189, 3234159]
58036C234159j27273j15299j02657r6639r2828q4317p5724p3543p2189o4326n5490
58025B273874n3773n4283m8889m2360m3431m8146m7370m3347m3700m6036m3338
58014A759201l8202l7319l8044l4304k9621l0439l2694k8886k2619k2054k4444
58003A420575k1376j4481j1858j2991j1055o733o486r823j0872r979j1909j5220
57991A277792j4762j2152j2740j4911j3175r063q397j0405r964p860q515j0268
57979A145580q175l992l335n253m368j117k40j392o37J030l00l151l244j903l196
57964A106307n467m545k496m091p415p206m906n958r546j0464r068r867j2212
57951A013066j1788r693j0695j3808j3903j1400j1239j3205j2405q681o786p645
$$ y = [3234159, 3106886, 2991587, 2888930, 2792291, 2699463, 2615146, 2539422, 2465879, 2393690, 2329364, 2273874, 2220101, 2165818, 2116929, 2074569, 2031138, 1982992, 1935622, 1892275, 1848575, 1802539, 1759201, 1720999, 1683680, 1645636, 1611332, 1581711, 1551272, 1518578, 1489692, 1467073, 1445019, 1420575, 1399199, 1384718, 1372860, 1359869, 1348814, 1342081, 1335595, 1325772, 1314900, 1304921, 1293012, 1277792, 1263030, 1250878, 1238138, 1223227, 1210052, 1200989, 1192592, 1182187, 1172223, 1164363, 1155848, 1145580, 1137405, 1133413, 1130078, 1124825, 1120457, 1119340, 1119100, 1117708, 1117071, 1118101, 1117801, 1114650, 1111406, 1109503, 1106307, 1100840, 1096295, 1093799, 1089708, 1082293, 1075087, 1070181, 1064223, 1054677, 1044213, 1035145, 1025278, 1013066, 1001278, 991585, 980890, 967082, 953179, 941779, 930540, 917335, 904930, 896249, 889463, 881818]
57939H81818p819p145q620j1070j0087o007l220k109O37M249M532J950J292L215
57925H41616L760K300K439M736N711M574M178M892L939J200m12l37m51l79J397
57910H79163K665L5m597o536o157p561j0432j0466p508n912o812o988n653n515
57896G97726o664o124m076m164o870q537p655o437n664l664q61P7r42j335n70
57881G34240j35N05K811M976M273K539L444N570M581J242K87J812R93l401p240
57866G56497q334q914r995r664p958p429p978o777l937k501k496q76K256L488
57852F85382K574K832M592M646L021L597O852Q502O907N507O161O218M174K408
57838G53373K187J472l10p42M11j43l372n876n781n596p096q273p650o966p367
$$ y = [881818, 873999, 866854, 858234, 847164, 837077, 831070, 827850, 825741, 826378, 830627, 835159, 837109, 838401, 841616, 845376, 847676, 850115, 854851, 860562, 865136, 869314, 874206, 878145, 879345, 878933, 878596, 878145, 877766, 879163, 881828, 881863, 877266, 870730, 864573, 857012, 846580, 836114, 828606, 822694, 815882, 808894, 803241, 797726, 791062, 784938, 780862, 776698, 769828, 761291, 753636, 747199, 741535, 737871, 737010, 737087, 736145, 734810, 734240, 734105, 734610, 737421, 742397, 746670, 749209, 752653, 758223, 762804, 764046, 764333, 766145, 767138, 763737, 756497, 748163, 739249, 729254, 719590, 711632, 704203, 696225, 689448, 685511, 683010, 680514, 679638, 681894, 685382, 687956, 690788, 695380, 700026, 703047, 706644, 713496, 721998, 728905, 734412, 740573, 746791, 750965, 753373, 755560, 757032, 756722, 755980, 756391, 756248, 752876, 747000, 741219, 735623, 728527, 720254, 712604, 705638, 698271]
57823F98271p236n838m929n035m294k557k234l585l614j360J46r97k746l089k711
57808F48192k070k4L001M496M054M207N821O720O091N896O677O240M023K411K357
57793G08092J837J03q51m07o40k233l327l638n274q275r878r379r166r785r071
57778F38108p322p838j0643j1306q251n616o194p004n135k836l102m668n068m824
57764E48301n148n081m091m093n911p155o368n740o953p971o949n730o254o845
57750D64012n312k756j296p13j66m61j836k291p09R77J163J319K958M722N025
57735D64636M747M913M433K617J263J788K762K481J496P22j75p89O19L801N795
57720E01109N384M894N639N368K708L06N55J634Q44j103k195k570k940k401p42
$$ y = [698271, 691035, 685197, 680268, 675233, 670939, 668382, 666148, 662563, 658949, 657589, 657735, 656738, 653992, 650903, 648192, 646122, 646098, 649099, 653595, 657649, 661856, 667677, 674397, 680488, 686384, 693061, 699301, 703324, 705735, 708092, 709929, 710032, 709181, 708774, 708134, 705901, 702574, 698936, 693662, 685387, 675509, 666130, 656964, 647179, 638108, 630786, 622948, 612305, 600999, 592748, 587132, 580938, 573934, 568799, 565963, 562861, 558193, 553125, 548301, 543153, 538072, 533981, 529888, 523977, 516822, 510454, 504714, 497761, 489790, 482841, 477111, 470857, 464012, 458700, 455944, 454648, 453935, 453769, 453308, 451472, 449181, 448472, 449449, 450612, 451931, 454889, 459611, 464636, 469383, 474296, 478729, 481346, 482609, 484397, 487159, 489640, 491136, 491858, 491683, 490894, 491513, 495314, 501109, 506493, 511387, 517026, 522394, 525102, 525408, 525963, 527597, 528441, 527338, 525143, 522573, 519633, 517232, 516490]
57705E16490j46j826l573l401k627k650j830J243M357M931M049L928M039L196
57691E26180K906M848P065O574M209L352N061P537R302J0092R743Q670Q373R353
57677F23265R979R175Q451R289J0566J0731J0487J1097J1933J1877J1365J1145
57665G49360J0910J0786J1874J3779J4386J3782J5128J9538K3486K4013K3036
57654I30078K3462K4467K4289K4631K7916L2425L4446L3858L3840L6220M0331
57643A265963M5209M9902N2884N3949N5389N8977O3456O7332P1794P8070Q4299
57632A947224Q8467R2433R9555J09848J20873J31966J44289J57898J71878J86449
57622C250880K02272K18710K35000K51600K68131K81897K90708K94917K94143
$$ y = [516490, 516344, 514518, 510945, 507544, 504917, 502267, 500437, 501680, 506037, 510968, 515017, 518945, 522984, 526180, 529086, 533934, 540999, 547573, 551782, 555134, 560195, 567732, 577034, 587126, 596869, 605539, 613912, 623265, 633244, 642419, 650870, 660159, 670725, 681456, 691943, 703040, 714973, 726850, 738215, 749360, 760270, 771056, 782930, 796709, 811095, 824877, 840005, 859543, 883029, 907042, 930078, 953540, 978007, 1002296, 1026927, 1054843, 1087268, 1121714, 1155572, 1189412, 1225632, 1265963, 1311172, 1361074, 1413958, 1467907, 1523296, 1582273, 1645729, 1713061, 1784855, 1862925, 1947224, 2035691, 2128124, 2227679, 2337527, 2458400, 2590366, 2734655, 2892553, 3064431, 3250880, 3453152, 3671862, 3906862, 4158462, 4426593, 4708490, 4999198, 5294115, 5588258]
57613E588258K84820K64162K34048J97659J55010J05789N3982M719m2110r0432
57603F755905j40918j89227k30338k60893k78317k82039k75535k63785k49009
57594D585844k31601k13805j98411j84597j69017j50875j32482j15241r8659q3110
57584C008046p0030n9163m8751l8568k9960k2919j5785p820M36R055J8593K8473
57572B771607L7707M6658N5937O4716P2565Q1601R3855J07658J19901J30765J42955
57561C725925J57031J70965J83735J95870K06671K14167K17657K17230K10888
57552E500139J95230J69045J33727R0659M1070j1767o3174j10007j50952j84607
57542E609363k09899k27574k38710k42641k39169k31554k23874k16235k06008
$$ y = [5588258, 5873078, 6137240, 6371288, 6568947, 6723957, 6829746, 6883728, 6888447, 6846337, 6755905, 6614987, 6425760, 6195422, 5934529, 5656212, 5374173, 5098638, 4834853, 4585844, 4354243, 4140438, 3942027, 3757430, 3588413, 3437538, 3305056, 3189815, 3091156, 3008046, 2938016, 2878853, 2830102, 2791534, 2761574, 2738655, 2722870, 2715050, 2715486, 2724541, 2743134, 2771607, 2809314, 2855972, 2911909, 2976625, 3049190, 3130791, 3224646, 3332304, 3452205, 3582970, 3725925, 3882956, 4053921, 4237656, 4433526, 4640197, 4854364, 5072021, 5289251, 5500139, 5695369, 5864414, 5998141, 6088800, 6129870, 6118103, 6054929, 5944922, 5793970, 5609363, 5399464, 5171890, 4933180, 4690539, 4451370, 4219816, 3995942, 3779707, 3573699]
57533C573699j93130j80401j68979j57478j45588j34921j25850j16854j07459
57524B243039r8785r0837q2258p3135o5263n9168n3535m7848m3070l9520l6493
57513A553127l3958l2325l0639k7530k3581k0369j7683j4394j1331j0241j0359
57502A320717r171o276l460j394O39K238K528K946N898J0752J4608J6802J9070
57489A375897K1544K2687K3209K5881L0747L4641L6300L8132M1763M5603M8255
57478A744659N1034N5483O1192O7453P4466Q1795Q8163R3715J00211J08285J16961
57467B643417J26072J36261J46311J53642J58227J62761J68072J71210J68889
57458D034862J59942J43766J19649Q8730N3843J6589k2635o1212r4506j20475
$$ y = [3573699, 3380569, 3200168, 3031189, 2873711, 2728123, 2593202, 2467352, 2350498, 2243039, 2144254, 2053417, 1971159, 1898024, 1832761, 1773593, 1720058, 1672210, 1629140, 1589620, 1553127, 1519169, 1486844, 1456205, 1428675, 1405094, 1384725, 1367042, 1352648, 1341317, 1331076, 1320717, 1311546, 1305270, 1301810, 1300416, 1301055, 1303293, 1305821, 1308767, 1314665, 1325417, 1340025, 1356827, 1375897, 1397441, 1420128, 1443337, 1469218, 1499965, 1534606, 1570906, 1609038, 1650801, 1696404, 1744659, 1795693, 1851176, 1912368, 1979821, 2054287, 2136082, 2224245, 2317960, 2418171, 2526456, 2643417, 2769489, 2905750, 3052061, 3205703, 3363930, 3526691, 3694763, 3865973, 4034862, 4194804, 4338570, 4458219, 4546949, 4600792, 4617381, 4594746, 4533534, 4439028, 4318553]
57448D318553j40874j56851j66869j70374j69979j68038j64014j56932j47717
57439B876905j37307j25348j12471j01310r3132q5815p7011o7238n8290n0647
57429A968336m3984l8112l2052k4347j5772r456o725m828l31P077J5445K3278
57417A838529L0013L5599M1080M8103N6854O5890P4457Q3218R2342J01142J09961
57406B577188J19989J30573J39394J45826J51367J56099J57820J55572J50511
57397C884339J41905J25791R9782O6403K9567r395m9844q8643j21799j47781j67078
57386C763247j80023j87004j89444j88663j84771j77863j69062j59373j49034
57377B178010j38823j30031j22367j13884j04073r4875q7598q1032p3760o6255
$$ y = [4318553, 4177679, 4020828, 3853959, 3683585, 3513606, 3345568, 3181554, 3024622, 2876905, 2739598, 2614250, 2501779, 2400469, 2307337, 2221522, 2144511, 2077273, 2018983, 1968336, 1924352, 1886240, 1854188, 1829841, 1814069, 1804613, 1797888, 1793060, 1792729, 1799806, 1815251, 1838529, 1868542, 1904141, 1945221, 1993324, 2050178, 2116068, 2190525, 2273743, 2366085, 2467227, 2577188, 2697177, 2827750, 2967144, 3112970, 3264337, 3420436, 3578256, 3733828, 3884339, 4026244, 4152035, 4251817, 4318220, 4347787, 4338392, 4288548, 4199905, 4078106, 3930325, 3763247, 3583224, 3396220, 3206776, 3018113, 2833342, 2655479, 2486417, 2327044, 2178010, 2039187, 1909156, 1786789, 1672905, 1568832, 1473957, 1386359, 1305327, 1231567, 1165312]
57367A165312n9459n3426m8465m5376m3402m0267l5509l1495k9806k8956k7076
57356G22075k4605k2861k2009k1803k2308k2712k1539j9021j7002j5764j3705
57345D98746j0970j0174j1961j3291j1988r962r601r951r011p230o155n649m944
57332C77859m487m606m191k712j596j796j984j088l61j015j990k097k178l035
57318C44723l463k524j636k145k902k479j741j907k130j401j012k564n105o558
57304C07156o526n758m368k574j516j513j100N77K156K398K040J787Q61q29j543
57289B91248o73j63j000j074J092L296L125J854J910K762K482J447J415K521L963
57274C14205O100R180J1631J2085J1584J1592J1667J1233J1470J2994J3911J2740
$$ y = [1165312, 1105853, 1052427, 1003962, 958586, 915184, 874917, 839408, 807913, 778107, 749151, 722075, 697470, 674609, 652600, 630797, 608489, 585777, 564238, 545217, 528215, 512451, 498746, 487776, 477602, 465641, 452350, 440362, 430400, 420799, 410848, 401837, 394607, 388452, 382803, 377859, 373372, 368766, 364575, 361863, 360267, 358471, 356487, 355399, 355038, 354023, 352033, 349936, 347758, 344723, 341260, 338736, 337100, 334955, 332053, 329574, 327833, 325926, 323796, 322395, 321383, 318819, 313714, 307156, 300630, 294872, 290504, 287930, 286414, 284901, 283801, 284378, 286534, 288932, 290972, 292759, 293620, 292791, 291248, 290575, 290412, 289412, 288338, 289430, 292726, 295851, 297705, 299615, 302377, 304859, 306306, 307721, 310242, 314205, 320305, 329485, 341116, 353201, 364785, 376377, 388044, 399277, 410747, 423741, 437652, 450392]
57262D50392J1115J1035J1641J1406J1230J2486J4141J4673J4871J5947J7028
57251E95965J7147J7373J8337J8262J6310J5044J6351J7923J7370J6764J8926
57240G85772K2059K2702K1625K1952K3381K3277K2020K2359K4474K6272K7684
57229A043577L0153L2746L3241L2498L3392L5875L7173L6556L5992L6499L7439
57218A425141L8893M1100M2321M0946L8863L8993M0328L9288L4993K9226K2291
57207A832383J3422M473j525n191r696j4987j7638j6511j4190j2458j0486p948
57195A739648o078n129m187l717m849o225n063j347K533N917J0036J4591J8137
57182A754267K1640K7447L4741M0095M2643M4797M7755N0222N1556N2190N1136
$$ y = [450392, 461507, 472542, 484183, 495589, 506819, 519305, 533446, 548119, 562990, 578937, 595965, 613112, 630485, 648822, 667084, 683394, 698438, 714789, 732712, 750082, 766846, 785772, 807831, 830533, 852158, 874110, 897491, 920768, 942788, 965147, 989621, 1015893, 1043577, 1073730, 1106476, 1139717, 1172215, 1205607, 1241482, 1278655, 1315211, 1351203, 1387702, 1425141, 1464034, 1505134, 1547455, 1588401, 1627264, 1666257, 1706585, 1745873, 1780866, 1810092, 1832383, 1845805, 1850278, 1848753, 1843562, 1833866, 1818879, 1801241, 1784730, 1770540, 1758082, 1747596, 1739648, 1733570, 1728441, 1724254, 1720537, 1715688, 1709463, 1704400, 1703053, 1705586, 1711503, 1721539, 1736130, 1754267, 1775907, 1803354, 1838095, 1878190, 1920833, 1965630, 2013385, 2063607, 2115163, 2167353, 2218489]
57171B218489M7212M2671M1117M1799M0539L6682L4307L5825L9054M1735M4443
57160B663873M7687N0441N2988N7353O3305O7659O8963O9516P1322P3287P3740
57149C360134P2740P0720O7644O4399O2395O1286N9637N7821N7367N7807N7494
57138D049444N7007N7967N9005N7248N3585N1786N2196N1118M7029M2715M0179
57127D619279L8002L5055L2640L1615L1061L0778L1562L2429L1329K8926K7689
57116D970365K7090K4109J8818J4733J3243J2389J1628J2776J5418J6543J5665
57105E152777J5387J5954J4546J1036R007R502R087N752J585k049o759j2620j6508
57092E206697j7048j6588j6709j6567j7256k2494l3019m5149n6717o9570q4687
$$ y = [2218489, 2265701, 2308372, 2349489, 2391288, 2431827, 2468509, 2502816, 2538641, 2577695, 2619430, 2663873, 2711560, 2762001, 2814989, 2872342, 2935647, 3003306, 3072269, 3141785, 3213107, 3286394, 3360134, 3432874, 3503594, 3571238, 3635637, 3698032, 3759318, 3818955, 3876776, 3934143, 3991950, 4049444, 4106451, 4164418, 4223423, 4280671, 4334256, 4386042, 4438238, 4489356, 4536385, 4579100, 4619279, 4657281, 4692336, 4724976, 4756591, 4787652, 4818430, 4849992, 4882421, 4913750, 4942676, 4970365, 4997455, 5021564, 5040382, 5055115, 5068358, 5080747, 5092375, 5105151, 5120569, 5137112, 5152777, 5168164, 5184118, 5198664, 5209700, 5218707, 5228209, 5237296, 5243048, 5244633, 5242584, 5235825, 5223205, 5206697, 5189649, 5173061, 5156352, 5139785, 5122529, 5100035, 5067016, 5021867, 4965150, 4895580, 4810893]
57081D810893r9852j13932j28429j43254j55967j66596j78155j91352k04239k17750
57071C211367k35566k57534k79649l01455l26804l56342l86392m16296B01985
57061b83349n20490n56178n99239o51818p09588p71628q42605r23334j009398
57052f867627j101713j208219j332594j472103j629049j812452k025513k264518
57044a9713788k533778k848095l216392l637452m116027m667183n300272o016705
57036e2049692o828504p757755q809746r968004j1221431j2567804j3982897j5423648
57028a38609481j6873591j8328702j9702591k0816797k1580346k2156354k2830856
57021b80898718k3646289k4184318k3727152k1626784j7592678j1801024m857787
$$ y = [4810893, 4711041, 4597109, 4468680, 4325426, 4169459, 4002863, 3824708, 3633356, 3429117, 3211367, 2975801, 2718267, 2438618, 2137163, 1810359, 1454017, 1067625, 651329, 201985, -283349, -803839, -1360017, -1959256, -2611074, -3320662, -4092290, -4934895, -5858229, -6867627, -7969340, -9177559, -10510153, -11982256, -13611305, -15423757, -17449270, -19713788, -22247566, -25095661, -28312053, -31949505, -36065532, -40732715, -46032987, -52049692, -58878196, -66635951, -75445697, -85413701, -96635132, -109202936, -123185833, -138609481, -155483072, -173811774, -193514365, -214331162, -235911508, -258067862, -280898718, -304545007, -328729325, -352456477, -374083261, -391675939, -403476963, -408334750]
57014d08334750K387932R145128J4917209J9511461K2891720K5077630K6154737
57007b88248933K6288660K5675707K4491574K2896441K1058072J9139920J7268729
57000a31429830J5519908J3922475J2469732J1137515R907127Q773886P737336
56993e1961851O793937N941926N183193M515578L930211L419127K978182K600165
56985a6599532K272980J987911J742723J533773J352143J190868J049474R27822
56977d541838Q21440P26584O44302N75658N17508M66553c66680B0634L55398L23186
56967F99218K90255K57586K24438J90545J58669J31807J09635R0060P2480N7587
56957B282280M5630L6569L0367K5972K1819J8300J7678K0484K4212K6712K8559
$$ y = [-408334750, -405946818, -396801690, -381884481, -362373020, -339481300, -314403670, -288248933, -261960273, -236284566, -211792992, -188896551, -167838479, -148698559, -131429830, -115909922, -101987447, -89517715, -78380200, -68473073, -59699187, -51961851, -45167914, -39225988, -34042795, -29527217, -25597006, -22177879, -19199697, -16599532, -14326552, -12338641, -10595918, -9062145, -7710002, -6519134, -5469660, -4541838, -3720398, -2993814, -2349512, -1773854, -1256346, -789793, -366680, 20634, 376032, 699218, 989473, 1247059, 1471497, 1662042, 1820711, 1952518, 2062153, 2152213, 2224693, 2282280, 2327910, 2364479, 2394846, 2420818, 2442637, 2460937, 2478615, 2499099, 2523311, 2550023, 2578582]
56946B578582L0576L1468L0256K9464L2814L8976L8773J9797k4674q9421j59302
56935B557309k18390k58172k78196k81647k72462k55235k34281k11864j88711
56926C58351j66123D6426h1402j10973r5110q1760p2076o5967o2859o1481n9313
56915f90941n4537m8426m3471l9212l2702k3362j4354q059k994L149R840J5099
56903i29970J8882K2784K7424L2085L6427M0737M4603M6669M5875M2054L5511
56892e36919K6882J7437Q761J900k799n244n520m308k668j099R00L966P754J1158
56878d79799J3604J5628J7890K0176K1970K3546K5762K8810L1880L3869L3731
56867b12933L0345K3183J3269K694o934j4845k0296k2825k3289k3172k2528k0148
$$ y = [2578582, 2609158, 2640626, 2670882, 2700346, 2733160, 2772136, 2810909, 2830706, 2806032, 2716611, 2557309, 2338919, 2080747, 1802551, 1520904, 1248442, 993207, 758926, 547062, 358351, 192228, 46426, -81402, -192375, -287485, -369245, -441321, -507288, -570147, -631628, -690941, -745478, -793904, -837375, -876587, -909289, -932651, -947005, -955064, -958058, -954909, -945069, -929970, -911088, -888304, -860880, -828795, -792368, -751631, -707028, -660359, -614484, -572430, -536919, -510037, -492600, -483839, -481939, -484738, -489982, -495502, -499810, -502478, -503577, -502677, -498711, -490957, -479799, -466195, -450567, -432677, -412501, -390531, -366985, -341223, -312413, -280533, -246664, -212933, -182588, -159405, -146136, -143442, -150376, -165221, -185517, -208342, -231631, -254803, -277331, -297479]
56855b97479j6180j2840j1566j1092r629p609o684o901o645m963k496j97J681
56842c92600L154L974L926L313L018L894N879P809Q622Q602Q817R559J0213J0452
56828c01368J0529J0560J0683J1701J4027J6108J5613J2452Q992O990O091N688
56816a71934O217P734R073R460R555J0096J1040J2663J5734J9796K3082a2417
56803A4814L0433L3635L6464M0544M6598N2106N3784N0639M3071L1081J5713N91
56791D49473j0694j7739k1924k3232k0904j6088j1114o532j271M686J0096J4825
56779C49582K0320K7481L5638M3726N1156N7610O3057O7488O9453O5399N2239
56768I03149L0697N327j8438l6665m7693n2340n3068n1743m8464m3107l6876l1037
$$ y = [-297479, -313659, -326499, -338065, -349157, -358786, -366395, -373079, -379980, -386625, -391588, -394084, -394281, -392600, -389446, -385472, -381546, -378233, -375215, -371321, -365442, -357633, -349011, -340409, -331592, -322033, -311820, -301368, -290839, -280279, -269596, -257895, -243868, -227760, -212147, -199695, -190703, -183713, -177622, -171934, -165717, -157983, -148910, -139450, -129895, -119799, -108759, -96096, -80362, -60566, -37484, -12417, 14814, 45247, 78882, 115346, 155890, 202488, 254594, 308378, 359017, 402088, 433169, 448882, 449473, 438779, 421040, 399116, 375884, 354980, 338892, 327778, 321246, 319975, 324661, 334757, 349582, 369902, 397383, 433021, 476747, 527903, 585513, 648570, 716058, 785511, 850910, 903149, 933846, 939173, 920735, 884070, 836377, 784037, 730969, 679226, 630762, 587655, 550779, 519742]
56756E19742k5204j8383j0858l697K873R150J4903K0114K5967L3287M0442M4082
56744F52418M1627L2354J7272o81j7399l0129l8715m3703m4797m2453l8909l5594
56732D51291l1232k4795j8557j5309j3908j0873n613p59K358N283R245J3408J6688
56719C77227J8725J8511J4597P405q05q657j6202k2531k5539k5012k3471k2816
56707B91432k2194k0427j8359j7160j6091j3947j1522j0620j1133j0967q939o289
56695A23784m817m518l908k410j354k025l427l242j007J182J647J232J450K101
56681A04688K217K055K216J867L1j976j836J85J258j13k321l289k942k269j561
56666I8210o91k1l0o20j377j993k179j712p90J32Q85J402J316M80l60l18L35N24
$$ y = [519742, 494538, 476155, 465297, 461600, 464473, 473623, 488526, 508640, 534607, 567894, 608336, 652418, 694045, 726399, 743671, 742990, 725591, 695462, 656747, 613044, 568247, 525794, 486885, 451291, 420059, 395264, 376707, 361398, 347490, 336617, 331004, 330245, 332603, 337886, 347131, 360539, 377227, 395952, 414463, 429060, 436465, 435660, 427003, 410801, 388270, 362731, 337719, 314248, 291432, 269238, 248811, 230452, 213292, 197201, 183254, 171732, 161112, 149979, 139012, 130073, 123784, 118967, 114449, 110541, 108131, 106777, 104752, 101325, 98083, 97076, 98258, 99905, 101137, 102587, 104688, 106905, 108960, 111176, 113043, 113074, 111098, 109262, 109447, 110705, 110592, 108271, 104982, 102040, 99771, 98210, 97519, 97498, 97468, 96848, 95471, 93478, 91299, 89587, 88797, 88929, 89814, 91216, 92532, 93012, 92652, 92334, 92669, 93193]
56648I3193m7m93P6J628L396M373L987K849K412L208L974L345J763P19N31J43
56632A25057j128k666l501l516l626m909p230q785p915n447l930m259m663l621
56618E9861j912p99r4O08O29k86q46k72K35j51p0J410K477J505L30J401L347K973
56600G0346O47j86J554L381L582L087K581J220q76j882j131k36m16r57j190j639
56584G7885k337k228j239q84j863k866k725k032j698j524j034l72K42P49P63K34
56568E9071M19K366M564M401K149R31K194L889M084L770M488N476N120L701K727
56553A09350K500K063J011k2l94o4O54J463K282L149L720L330K087J207J323J336
56537A34995K62q66o47J55M2j19J797N081O358M282J311k8j19l94q34p88o13j037
$$ y = [93193, 93146, 92653, 92729, 94357, 97753, 102126, 106113, 108962, 111374, 114582, 118556, 121901, 123664, 124383, 124914, 125057, 123929, 121263, 117762, 114246, 110620, 105711, 98481, 89696, 81781, 76334, 72404, 68145, 63482, 59861, 57949, 57150, 57056, 57664, 58293, 58007, 57161, 56889, 57124, 56973, 56903, 58313, 60790, 62295, 62625, 64026, 67373, 70346, 70993, 70807, 72361, 75742, 79324, 82411, 84992, 86212, 85336, 83454, 82323, 82087, 81671, 80714, 79524, 77885, 75548, 73320, 72081, 71197, 69334, 66468, 63743, 61711, 60013, 58489, 57455, 57083, 57325, 58074, 58837, 59071, 59490, 61856, 66420, 70821, 72970, 73901, 76095, 79984, 84068, 87838, 92326, 97802, 102922, 106623, 109350, 111850, 113913, 114924, 114902, 114508, 114444, 115098, 116561, 118843, 121992, 125712, 129042, 131129, 132336, 133659, 134995, 135257, 134391, 133744, 133899, 133941, 133822, 135619, 140700, 147058, 151340, 152651, 152623, 152504, 152110, 151276, 150488, 149875, 148838]
56519A48838j976k861l162k303j44K274L805M801O137P071O299M832N105O975
56505A85691P487N377L098L230N381P832R901J1168J0556P977N387M669N614O931
56491B80299P874Q040P198O132O100O665N832L070M28l40J84P27J050R39m52k951
56475C30795m783m947m589m946n730o562p946r529r445p098m813m825o212o522
56461B42848n157l380k142j605j869k705l307l441l883m816n131m262l220k698
56447A95232j880n86o71l259o048n841k882m45l68j197q47P21K026K148J648J718
56431A79469K738L755L678K738K007J682J045K51O93L022N955P730P820O725N087
56416B34395L603K868K850L158L929N504P258Q054P915P954Q542R002R170R762
$$ y = [148838, 146862, 144001, 140839, 138536, 138392, 140666, 144471, 149272, 155409, 162480, 168779, 173611, 178716, 185691, 193178, 198555, 201653, 204883, 210264, 218096, 227997, 239165, 249721, 257698, 263085, 267754, 273368, 280299, 288173, 296213, 303411, 309543, 315643, 322308, 328140, 331210, 331638, 331298, 331482, 332209, 333259, 334198, 333746, 330795, 326012, 321065, 316476, 311530, 305800, 299238, 291292, 281763, 272318, 265220, 260407, 255582, 249370, 242848, 237691, 234311, 232169, 230564, 228695, 225990, 222683, 219242, 215359, 210543, 205412, 201150, 197930, 195232, 193352, 192766, 192095, 188836, 182788, 176947, 174065, 173620, 173252, 172055, 171208, 171929, 173955, 176103, 177751, 179469, 182207, 185962, 189640, 192378, 194385, 196067, 197112, 197363, 198056, 201078, 207033, 214763, 222583, 229308, 234395, 237998, 240866, 243716, 246874, 250803, 256307, 263565, 271619, 279534, 287488, 296030, 305032, 314202, 323964]
56402C23964J0867J1509J1155J0380R909J0094J1166J2672J3018J1264Q883P917
56390D52798P936P025N189L994L130O28l245n596n238m306m539m886m165l356
56376D45369l675m491m751m574m413m343n004p197r928j1022j0211r393r290q517
56362C48560o488m515l334k295j698k829m988n739m952n103o615o852n082m221
56348B83849n626o261l782n25M85J07L76M93r01k165j077J182J858Q24p8k50j33
56331B68376N99K020K617J508M14J180L011M263N052N780N183K511j46l03J577
56316C03642L313L912L346J479o56o44K064M663M878L999L988M194L523L211M481
56301C49393N730N082L622L199L124K037R69J433K402K171J414J525J843J365
$$ y = [323964, 334831, 346340, 357495, 367875, 377784, 387878, 399044, 411716, 424734, 435998, 444881, 452798, 460734, 467759, 472948, 476942, 480072, 480700, 477455, 471859, 466621, 462315, 457776, 452890, 448725, 445369, 441694, 437203, 432452, 427878, 423465, 419122, 414118, 406921, 396993, 385971, 375760, 366367, 357077, 348560, 342072, 337557, 334223, 331928, 330230, 327401, 322413, 316674, 311722, 306619, 300004, 293152, 288070, 283849, 278223, 271962, 268180, 267655, 268140, 268247, 268623, 269116, 268215, 266050, 264973, 266155, 268013, 268837, 268759, 268509, 268376, 268975, 270995, 273612, 275120, 275534, 276714, 279725, 283988, 289040, 294820, 300003, 302514, 302368, 302065, 303642, 306955, 310867, 314213, 315692, 315036, 314392, 316456, 321119, 325997, 329996, 333984, 338178, 341701, 344912, 349393, 355123, 360205, 363827, 367026, 370150, 372187, 373156, 374589, 376991, 379162, 380576, 382101, 383944, 385309]
56287C85309J236K587L990L986L909N101N633L323o3j234j26J191K474M483N950
56272D27749N158L243K582L216L951N219P628R474R226Q595R633J0753R538P523
56258E23488P970J0477J2000J1919J1922J2130J1625J1663J4027J6954J6918J3957
56246F75050J1303J0298R556Q545Q121P905O805N775O594Q413Q817P793P337P841
56232G90153Q142Q476J0027J2181J3309J3679J4722J6428J8105K0406K3700K6214
56220I75542K6866K8004L1892L6570L8977M0124M2982M7266N0761N4074N9326
56209A432384O5533P0011P3211P7639Q3263Q8484R4294J02752J12635J21489J30645
56198B452340J43058J57478J70196J81631J95490K11842K26657K38100K47828
$$ y = [385309, 386545, 389132, 393122, 397108, 401017, 406118, 411751, 415074, 415011, 413777, 413651, 414842, 417316, 421799, 427749, 432907, 436150, 438732, 441948, 445899, 451118, 458746, 468220, 477446, 486041, 495674, 506427, 515965, 523488, 531458, 541935, 553935, 565854, 577776, 589906, 601531, 613194, 627221, 644175, 661093, 675050, 686353, 696651, 706207, 714752, 722873, 730778, 737583, 743358, 749952, 758365, 767182, 774975, 782312, 790153, 798295, 806771, 816798, 828979, 842288, 855967, 870689, 887117, 905222, 925628, 949328, 975542, 1002408, 1030412, 1062304, 1098874, 1137851, 1177975, 1220957, 1268223, 1318984, 1373058, 1432384, 1497917, 1567928, 1641139, 1718778, 1802041, 1890525, 1984819, 2087571, 2200206, 2321695, 2452340, 2595398, 2752876, 2923072, 3104703, 3300193, 3512035, 3738692, 3976792, 4224620]
56189D224620K55991K60271K60377K58440K54282K44810K28535K06647J79524
56180F373497J46472J09039P0640L2999l528l7007o5402q9882j12465j31672j44998
56169F147693j53972j61830j67895j69735j69086j69580j70248j67753j63763
56160D653831j63112j65580j66633j65730j66243j67383j64304j56993j51111
56151C186742j48547j44723j37191j29528j24340j19227j12316j05532r9731r2557
56141A973050q3603p6195p1677o7292o1653n6936n3763m9632m4281m0812l9528
56130A327678l6471l0330k5044k3211k2495k0925k0015k0056j8061j3233r241
56119A088596q226p592n385l708l972l713j082J955L579N005P158Q725R541J1565
$$ y = [4224620, 4480611, 4740882, 5001259, 5259699, 5513981, 5758791, 5987326, 6193973, 6373497, 6519969, 6629008, 6699648, 6732647, 6729119, 6692112, 6626710, 6536828, 6424363, 6292691, 6147693, 5993721, 5831891, 5663996, 5494261, 5325175, 5155595, 4985347, 4817594, 4653831, 4490719, 4325139, 4158506, 3992776, 3826533, 3659150, 3494846, 3337853, 3186742, 3038195, 2893472, 2756281, 2626753, 2502413, 2383186, 2270870, 2165338, 2065607, 1973050, 1889447, 1813252, 1741575, 1674283, 1612630, 1555694, 1501931, 1452299, 1408018, 1367206, 1327678, 1291207, 1260877, 1235833, 1212622, 1190127, 1169202, 1149187, 1129131, 1111070, 1097837, 1088596, 1080370, 1072778, 1067393, 1063685, 1059713, 1056000, 1054918, 1056873, 1060452, 1065457, 1072615, 1081340, 1090881, 1102446]
56105A102446J4681J6006J5106J5166J7432J9248J9219J9288K0065J9205J6249
56094A294111J4111J4016J3799J2635J2535J3880J4652J5242J8548K4246K8546
56083A476321L0743L4162L9792M5080M9920N7157O6027P2226P5913Q2484R3639
56072B123464J04903J13831J23057J32849J38300J36834J31615J24923J15322
56063C245098J03796R5250R0867Q5819P7092O6513N3972L5809J2831p963k2782
56052C836302l4645m5217n1687n4837o1324p3894q7350r7938j08236j19053j25298
56041B976823j24358j20307j15615j07114r4342q2923p5160o6160n3956m4282
56031B092606m0249l6555k9512k3604k2293k1381j7539j4686j5510j5356j0839
$$ y = [1102446, 1117127, 1133133, 1148239, 1163405, 1180837, 1200085, 1219304, 1238592, 1258657, 1277862, 1294111, 1308222, 1322238, 1336037, 1348672, 1361207, 1375087, 1389739, 1404981, 1423529, 1447775, 1476321, 1507064, 1541226, 1581018, 1626098, 1676018, 1733175, 1799202, 1871428, 1947341, 2029825, 2123464, 2228367, 2342198, 2465255, 2598104, 2736404, 2873238, 3004853, 3129776, 3245098, 3348894, 3444144, 3535011, 3620830, 3697922, 3764435, 3818407, 3854216, 3867047, 3859084, 3836302, 3801657, 3756440, 3704753, 3649916, 3588592, 3514698, 3427348, 3329410, 3221174, 3102121, 2976823, 2852465, 2732158, 2616543, 2509429, 2415087, 2332164, 2257004, 2190844, 2136888, 2092606, 2052357, 2015802, 1986290, 1962686, 1940393, 1919012, 1901473, 1886787, 1871277, 1855921, 1845082]
56020A845082o216n014l727K26K953K392L385Q399J2180J1662J1938J6184J9387
56007A918831J8451J8675K3314K6797K5448K4754K8473L0839K7619K4662K7148
55996B195011L0409K9746K9283L2645L5005L3004L2339L6947M1066M0527M0935
55985B576917M6121N0066M9406N1567O0551O7364O5473O3111O8498P5457P6123
55974C250654P5566Q0641Q6283Q6533Q7571R5963J05097J07300J08257J15407
55964D199272J23225J24311J23987J29447J35680J36697J39285J50700J64218
55955E426822J71775J79024J92777K06034K11248K15790K28132K41746K49154
55946G322502K58294K77811L00133L16853L36249L66981L99414M22411M43286
$$ y = [1845082, 1838866, 1833852, 1830125, 1830351, 1833304, 1835696, 1839081, 1847480, 1859660, 1871322, 1883260, 1899444, 1918831, 1937282, 1955957, 1979271, 2006068, 2031516, 2056270, 2084743, 2115582, 2143201, 2167863, 2195011, 2225420, 2255166, 2284449, 2317094, 2352099, 2385103, 2417442, 2454389, 2495455, 2535982, 2576917, 2623038, 2673104, 2722510, 2774077, 2834628, 2901992, 2967465, 3030576, 3099074, 3174531, 3250654, 3326220, 3406861, 3493144, 3579677, 3667248, 3763211, 3868308, 3975608, 4083865, 4199272, 4322497, 4446808, 4570795, 4700242, 4835922, 4972619, 5111904, 5262604, 5426822, 5598597, 5777621, 5970398, 6176432, 6387680, 6603470, 6831602, 7073348, 7322502, 7580796, 7858607, 8158740, 8475593, 8811842, 9178823, 9578237, 10000648, 10443934]
55937A0443934M71272M97724N13862N31350N62829N99050O28266O60331P07003
55928A5615621P57036P96993Q38148Q95517R59547J016954J079289J160673J248390
55919B4368168J327563J412823J521325J637305J739846J842324J966244K101634
55911C7917232K234989K389563K592239K827094L069377L336550L654855M008022
55903F2029921M376826M796942N317401N938570O655610P516420Q559424R747826
55895A14938940J1060595J2594663J4470611J6700658J9273176K2278393K5777117
55888B37094153K9638689L3707235L7891647M1517077M2522757L8085638K6867355
55881D87324551J0719086o203684k0122520k9453677l4513538l6287829l5749470
$$ y = [10443934, 10915206, 11412930, 11926792, 12458142, 13020971, 13620021, 14248287, 14908618, 15615621, 16372657, 17169650, 18007798, 18903315, 19862862, 20879816, 21959105, 23119778, 24368168, 25695731, 27108554, 28629879, 30267184, 32007030, 33849354, 35815598, 37917232, 40152221, 42541784, 45134023, 47961117, 51030494, 54367044, 58021899, 62029921, 66406747, 71203689, 76521090, 82459660, 89115270, 96631690, 105191114, 114938940, 125999535, 138594198, 153064809, 169765467, 189038643, 211317036, 237094153, 266732842, 300440077, 338331724, 379848801, 422371558, 460457196, 487324551, 498043637, 491839953, 471717433, 442263756, 407750218, 371462389, 335712919]
55874C35712919l3790559l1143606k8233715k5257944k2387951j9787172j7504662
55867A57607310j5500009j3754840j2266862j0974538r790726q695053p717534
55860G8907748o854323o070688n364432m756801m235667l767749l352484l009428
55852D1496176k726667k472495k244583k059934j908881j764395j625819j510982
55844B5182420j415422j319328j224663j147163j080731j006213r27036q61614
55836A6200250q08678p53140o98249o59353o32807o02024n67824n42990n23316
55827A0411869m93461m56084m26969m06129l80738l52020l32594l20986l04148
55818F938740k82046k65884k55442k41351k26079k19726k18469k09635j94905
$$ y = [335712919, 301922360, 270778754, 242545039, 217287095, 194899144, 175111972, 157607310, 142107301, 128352461, 116085599, 105111061, 95320335, 86625282, 78907748, 72053425, 65982737, 60618305, 55861504, 51625837, 47858088, 44505604, 41496176, 38769509, 36297014, 34052431, 31992497, 30083616, 28319221, 26693402, 25182420, 23766998, 22447670, 21223007, 20075844, 18995113, 17988900, 17061864, 16200250, 15391572, 14638432, 13940183, 13280830, 12648023, 12045999, 11478175, 10935185, 10411869, 9918408, 9462324, 9035355, 8629226, 8248488, 7896468, 7563874, 7242888, 6938740, 6656694, 6390810, 6135368, 5894017, 5667938, 5448212, 5229743, 5020108, 4825203]
55809D825203j86570j84060j76136j63495j57293j57190j52169j41609j34853
55800C371828j31001j19737j02046r0375q7767q5199p9929p8511q0946p9248p2812
55789B364257o9166o8695o4175n5734n1074n0506m6619l9010l4765l4309l1064
55778A819140k5259k3804k6374k5409k0261j7796j8918j7945j5258j7173k2995
55767A587948k5356k3636k4261k7689k8078k5777k6987l0779k9787k4510k3586
55756A297502k8481l0915k7358k3707k3344k2399j9294j7976j9137j8437j5453
55745A051001j4601j5745j3665q087m549m330l124m83o71l415l649j391k047o068
55731I69176q039o988p735j1078j2336j0789j1019j3705j4484j2869j2997j4685
$$ y = [4825203, 4638633, 4454573, 4278437, 4114942, 3957649, 3800459, 3648290, 3506681, 3371828, 3240827, 3121090, 3019044, 2928669, 2840902, 2755703, 2675774, 2597263, 2516317, 2437069, 2364257, 2295091, 2226396, 2162221, 2106487, 2055413, 2004907, 1958288, 1919278, 1884513, 1850204, 1819140, 1793881, 1770077, 1743703, 1718294, 1698033, 1680237, 1661319, 1643374, 1628116, 1610943, 1587948, 1562592, 1538956, 1514695, 1487006, 1458928, 1433151, 1406164, 1375385, 1345598, 1321088, 1297502, 1269021, 1238106, 1210748, 1187041, 1163697, 1141298, 1122004, 1104028, 1084891, 1066454, 1051001, 1036400, 1020655, 1006990, 998903, 994354, 990024, 986900, 986417, 985746, 982331, 978682, 977291, 975244, 969176, 961137, 954149, 946414, 935336, 923000, 912211, 901192, 887487, 873003, 860134, 847137, 832452]
55719H32452j3240r030p623r543r610p408q481j3657j7211j7252j8140k0671j9844
55706F60742j4776j1217j1531j1336q724p744r851j0718q641p718r643j0475q527
55693E29841p607r465j0574r173q001p657m894p6J413k024n298n256m864o279
55679D50086p147o503p151r356r122n457k608k619k572j339j877m355m523j595
55665C83862n25l435n996n379m566n624n846m129m179p486r619p488m257l228
55651C12105k712p10R84J049J698L943M963L368J961K314J846p24k390j439p60
55636C25496k369l656k281j53N16O81J461K052K846N852R949J0757P375M213M025
55621C66764M442L469K916L813L859K094J049J673J144j901m885o150p238q429
$$ y = [832452, 819212, 810182, 802559, 793016, 783406, 775998, 767517, 753860, 736649, 719397, 701257, 680586, 660742, 645966, 634749, 623218, 611882, 603158, 595414, 585563, 574845, 566204, 558486, 548843, 538368, 529841, 522234, 512769, 502195, 493022, 485021, 477364, 472470, 472394, 473807, 471783, 466485, 461229, 456365, 450086, 442939, 436436, 429285, 419929, 410807, 405350, 402742, 400123, 397551, 396212, 394335, 389980, 385457, 383862, 383337, 379902, 373906, 368527, 363961, 358337, 352491, 348362, 344183, 336697, 327078, 319590, 315333, 312105, 309393, 308683, 309667, 310716, 312414, 316357, 321320, 324688, 326649, 328963, 330809, 330085, 327695, 326256, 325496, 323127, 319471, 317190, 317037, 317553, 318234, 319695, 321747, 324593, 330445, 340394, 351151, 358526, 362739, 366764, 371206, 374675, 377591, 381404, 385263, 387357, 388406, 390079, 391223, 389322, 384437, 378287, 371049, 362620]
55607C62620p380m151k083j851m10K416K629n18k420r47K77q39j234N32Q54j744
55591C45751k941l06J942M91j238K01J775k92l719m708m400n387o259n035m014
55576C11861n903q694r222q390q448q609p619p120q235q501o291m669o559r666
55562B03935j0312q857p400n648l086j743k743l546k376j727l645n409m098j641
55548A41704j050j260j24Q99k93j945j372K88M12o62j219j463j805r55J045J276
55532A33476j327l427k791k059l292l579n98K137Q91j626r15J680J999M55K33
55517A21257P62p83l290l075j64K082K508K619K746K361K750M919O332M229O82
55502A45935j44J725K923K526K344K633J923L90o22j680m092o630p012n608m435
$$ y = [362620, 355240, 351089, 349006, 347155, 346745, 349161, 351790, 351272, 348852, 347905, 348182, 347343, 346109, 346641, 347495, 345751, 342810, 342504, 344446, 344937, 343699, 343900, 345675, 345383, 341664, 336956, 332556, 327169, 320910, 315875, 311861, 305958, 297264, 288042, 279652, 271204, 262595, 254976, 247856, 239621, 231120, 224829, 220160, 213601, 203935, 193623, 184766, 177366, 171718, 168632, 166889, 164146, 160600, 158224, 156497, 152852, 147443, 143345, 141704, 140654, 139394, 139270, 140169, 139876, 137931, 136559, 136847, 137259, 136597, 135378, 133915, 132110, 131155, 132200, 133476, 132149, 128722, 125931, 123872, 120580, 117001, 116403, 118540, 119431, 117805, 116890, 118570, 120569, 121024, 121257, 122019, 121236, 117946, 114871, 114707, 116789, 119297, 121916, 124662, 127023, 129773, 134692, 141024, 145253, 145935, 145791, 147516, 150439, 152965, 155309, 157942, 159865, 160255, 159633, 157953, 153861, 147231, 140219, 134611, 130176]
55487A30176l713k719k408l689m660l152n23M93J19J87L74m95j140K29K231K437
55471A13747J600J903K548J287j007j458J9J019R46J262K170K452K057J776J178
55456A31499l06j470j267j106k452l880l582k733l055l186j210J161Q46j782m105
55441A03372n537o705o323l236n7k97k969m230l400l046l950m260l223k017j100
55426E3022o7M72p5l67P67J614R8k528l669l369k955j746R89K832J221j996l173
55409D1070k414k198k348j084M60j67j750j064J402K333J411J202J757N05k524
55394C6591m256l605k513j865n91J106J713J536J987K150J99k320k094M37J666
55379C0141O06m07m71r35j524m89J242P45j704k605p60J474K573L108K713L85
$$ y = [130176, 126463, 123744, 121336, 117647, 112987, 109835, 109312, 109805, 109924, 110111, 110485, 109990, 108850, 109079, 111310, 113747, 115347, 117250, 119798, 121085, 120078, 118620, 118639, 119658, 120604, 121866, 124036, 126488, 128545, 130321, 131499, 131193, 129723, 128456, 127350, 124898, 121018, 117436, 114703, 111648, 108462, 107252, 108413, 109259, 107477, 103372, 97835, 91130, 84807, 81571, 81514, 81217, 78248, 74018, 70618, 67572, 63622, 59362, 56139, 54122, 53022, 52955, 53427, 53352, 52985, 53752, 55366, 55464, 52936, 49267, 45898, 42943, 41197, 42186, 45018, 46239, 44243, 41070, 38656, 36458, 34110, 33026, 33486, 33319, 31569, 30505, 31907, 34240, 35651, 36853, 38610, 39115, 36591, 32335, 28730, 26217, 24352, 23761, 24867, 26580, 28116, 30103, 32253, 32452, 30132, 28038, 28475, 30141, 30747, 30340, 29869, 28934, 27410, 26921, 28163, 28908, 27204, 24599, 23839, 25313, 27886, 30994, 33707, 34092]
55363C4092k125j929l9M8j431r76J462K060M2j057j03j96k171k403N27K780J852
55346C0433Q23K655N074M816K839J604O50j443l641m285l990l877l311j688j37
55331B6522O28J602K875K586M16r14K29J713J279l5m29m81j229j637n40J039J807
55314C5431K269K843K240j43k421k917k521k504k190r05J20k6k9J083J625o2k520
55297B9373l265k258j090k13O03O20q18k591l224k942k649k039m93J266K066J935
55281A4281J531Q89j1n79o37r47j708j829n92J206K629L497L321J283j669k811
55265A7854j089J220J769J151J113J487R39o14k148l192l759l482k268j068p48
55250G165q04j68J256K681L410L128J855J39j287k153k418j740j58J196J414J177
$$ y = [34092, 31967, 30038, 29999, 30047, 28616, 27640, 29102, 31162, 31204, 30147, 30044, 29848, 27677, 25274, 25801, 28581, 30433, 31256, 33911, 38985, 43801, 46640, 48244, 48894, 47451, 43810, 39525, 35535, 31658, 28347, 26659, 26522, 27150, 28752, 31627, 34213, 34629, 33715, 33944, 35657, 36936, 36901, 36472, 35991, 34762, 33125, 32585, 33624, 35431, 37700, 40543, 42783, 42640, 40219, 37302, 34781, 32277, 30087, 29182, 29302, 29276, 29247, 30330, 31955, 31893, 29373, 26108, 23850, 22760, 22547, 23150, 23770, 22952, 20361, 17137, 14195, 11546, 9507, 9014, 10280, 12346, 14281, 15812, 16701, 16690, 16111, 15474, 14527, 12819, 10990, 10398, 11604, 14233, 17730, 21051, 22334, 20665, 17854, 16765, 17985, 19754, 20905, 22018, 23505, 24444, 23830, 21682, 18490, 14731, 11249, 8981, 7913, 7165, 6361, 6193, 7449, 10130, 13540, 16668, 18523, 18662, 17375, 15222, 12804, 11064, 10906, 12102, 13516, 14693]
55234A4693J353J121m33j842j071Q57J203L8J8J541J962L05q99J50J932K686K862
55217B6476K855J418j627l883l681k461k037j798o38O39Q54N20M74L41j96n34
55201A6722p62j940l400k549R60L700L160J219O18P90j9r48j93J431J904J559
55185B2252K067K940K272K47r76n96J65M45M13j18j570l062k964j251K97M06l71
55168B0596p04O9J471K241J459k70j368j205n28K54J694L611M369K948M64j391
55152C3710k201k329j939j418j542k168k019n66J029J540R43l65j997k716j119
55137A6843K009L803K789N28r16j209p67J56N80o93k624k435K51K321J657J0k68
55120B2035L29M23N31J489K262J821J278J788K180J089l84n86j90n76j044k83
$$ y = [14693, 16046, 17167, 16734, 14892, 13821, 14678, 15881, 15919, 15937, 17478, 19440, 19745, 18846, 18996, 20928, 23614, 26476, 29331, 30749, 29122, 25239, 21558, 19097, 17060, 15262, 14624, 15263, 16117, 16637, 17111, 17452, 17256, 16722, 15960, 14020, 10620, 8071, 9031, 12731, 15891, 17110, 17728, 18518, 18499, 17551, 17358, 18789, 20693, 22252, 24319, 27259, 29531, 29778, 28802, 28206, 28371, 28816, 29229, 29111, 27541, 24479, 21515, 20264, 20561, 20967, 20596, 19892, 19961, 21432, 23673, 25132, 24862, 23494, 22289, 21761, 22015, 23709, 27320, 31689, 34637, 35101, 33710, 31509, 29180, 27241, 25823, 24281, 22113, 20094, 19528, 20557, 22097, 23040, 22675, 20678, 17962, 16843, 18852, 22655, 25444, 25972, 25056, 23847, 23080, 23236, 23816, 23123, 20499, 18064, 18315, 20636, 22293, 22303, 22035, 22364, 22787, 23318, 24807, 27069, 28890, 30168, 31956, 34136, 35225, 34841, 34255, 34065, 33489, 32445, 32162]
55104C2162Q18M95r07j822k075k263j779k42M54j588m671n147k235J322L175L418
55088A9115L015K328J511O23o16j950k101n06J324J739J254J278J570R42l04p76
55072B8446k32M18Q83J474J776J098p6o01k79K58P48J231J437J316J346J470Q67
55055D1580l82q60j84J06p01r07N72J769N72j677k191q47L07N59Q31J351J606
55038D1504J940K787L055J624j68M7K279M297M671L731K202Q26N86J347J211q15
55022G1124k621j769P18J897J180K78j08n10k74J727M089L790N79k352k716j597
55006G3435r81j145j377j454j354q38j5N52N90K52k99p29n75k30q78k478l076
54989E9400j543M59Q73J58j46j48o50r72k88K20p34j711p22R53M81j709k512j187
$$ y = [32162, 32980, 33475, 32568, 30746, 28671, 26408, 24629, 24387, 24841, 23253, 18582, 13435, 11200, 12522, 15697, 19115, 22130, 24458, 25969, 26592, 25976, 24026, 21925, 21419, 22743, 24482, 25736, 27014, 28584, 29526, 29222, 28446, 28214, 28632, 29515, 30989, 32765, 33863, 33787, 33186, 32907, 33165, 33913, 35144, 36581, 37897, 39243, 40713, 41580, 41198, 40338, 40154, 40260, 39559, 38652, 39224, 40993, 41565, 39888, 37697, 36850, 37157, 37716, 38547, 39898, 41504, 43444, 46231, 49286, 50910, 50742, 50789, 53068, 57365, 62036, 65767, 67969, 68795, 69381, 70728, 71939, 71124, 68503, 66734, 67452, 69349, 70529, 70807, 70699, 70189, 69915, 71642, 75731, 79521, 80100, 77748, 75032, 73435, 72454, 71309, 69932, 68478, 67124, 66286, 66271, 66823, 67413, 67665, 67366, 66637, 66062, 65832, 64954, 62476, 59400, 57857, 58316, 59189, 59347, 59201, 59053, 58403, 57431, 57143, 57363, 56629, 54918, 54196, 55149, 55630, 53921, 51409, 50222]
54971E0222j85p33j165k29J009J470J507J356O37M5J040L124L876K398N51P0N59
54954F5552J084J483J455M28r37j011K90J107L71q47j314j188r95o83k62P3P42
54937F5348K217L507K878L73k060l069k980k440j703j261j423j277J45J867K012
54922F2134O90k58j57N6J07O91J522J488Q47R03J470J148K54O96K617L880L383
54905H1471K237J171m13k090j993J72K248K813K835L240L350K860K881L824M580
54890A09186M815N770P660Q805Q493Q206Q761Q890Q129Q271J0104J1446J0501
54877B19037Q585P169M843K25m330n539m403n030q757j2675j4114j3675j3018
54864A58318j2061r750o409l961l952n835p349o610l870r08R37J573J381Q62R51
$$ y = [50222, 50037, 49304, 48139, 47910, 48919, 50389, 51896, 53252, 53889, 53934, 54974, 58098, 61974, 64372, 64923, 64993, 65552, 66636, 68119, 69574, 70002, 69065, 68054, 68344, 69451, 69822, 68975, 67661, 66473, 65478, 64795, 64533, 64606, 65348, 67565, 71072, 73950, 74323, 72263, 69194, 66214, 63774, 62071, 60810, 59387, 58110, 58255, 60122, 62134, 62824, 62566, 62409, 62465, 62572, 63263, 64785, 66273, 67120, 68023, 69493, 70641, 70895, 71591, 74208, 78088, 81471, 83708, 84879, 84466, 82376, 80383, 80555, 82803, 85616, 88451, 91691, 95041, 97901, 100782, 104606, 109186, 114001, 119771, 127431, 136236, 144729, 152935, 161696, 170586, 178715, 186986, 197090, 208536, 219037, 227622, 234791, 239634, 239859, 235529, 229990, 225587, 220557, 211800, 199125, 185011, 171336, 158318, 146257, 136507, 130098, 126137, 122185, 116350, 109001, 102391, 98521, 97613, 98550, 100123, 101504, 102366, 103317]
54849A03317K233L792M293M253N501Q062R549Q502O510N936P121Q862J0122J0164
54835A98217Q462N778L978L591K769j31m206p496r452j0544j0680r715q685q771
54821A53115r516r528q482p203o138n094m225l993m194l983l014j883j365j697
54807H2800k597l603m328m457l654j817L90J864K296K520K915K521Q51m13N96
54792G5884K846L383J218j767l712m413l908j900O66J736Q69n7K62P61J26j222
54776G0772k425l633m777m553k318K71J106L05l35J33J079J552J226M56QK70O60
54759E9797N09N21K018M585O011N088K993J372N10L0n3J97M20Q04J795K743K408
54742I1748J370J798M113N903N385L946L851N100O280P082Q171R567J0707J1486
$$ y = [103317, 105550, 109342, 113635, 117888, 123389, 131451, 141000, 149502, 156012, 161948, 169069, 177931, 188053, 198217, 206679, 212457, 216435, 220026, 222795, 222664, 218458, 210962, 201510, 190966, 180286, 170571, 161886, 153115, 143599, 134071, 125589, 118386, 112248, 107154, 102929, 98936, 94742, 90759, 87745, 85862, 84497, 82800, 80203, 76600, 72272, 67815, 64161, 62344, 62734, 64598, 66894, 69414, 72329, 74850, 75701, 75288, 75884, 78730, 82113, 83331, 81564, 77852, 73439, 69531, 67631, 68297, 70033, 70902, 70845, 71107, 71868, 71994, 70772, 68347, 64714, 59937, 55384, 53066, 53337, 54443, 54748, 54413, 54546, 55625, 57177, 58403, 58859, 58867, 59137, 59797, 60306, 60827, 62845, 67430, 73441, 78529, 81522, 82894, 83404, 83434, 83381, 83578, 83998, 84802, 86597, 89340, 91748, 93118, 94916, 99029, 104932, 110317, 114263, 118114, 123214, 129494, 136576, 144747, 154314, 165021, 176507]
54728A76507J2078J2343J2275J2220J2047J1007R001O740M270Q53l100n748o348
54715B54145o360p064p840p937q024q479p915n258j967l60o86j400j440q55L7
54700A88597P42N82k55m15R69L090M587M972M430L512L504N620R119J1866J3280
54685B54200J4772J6532J6497J3891J1378J1484J2853J2381R555O387M065J968
54673C85963o70m000p956j1977j4846j5954j6023j5757j4986j3815j3092j2693
54661B44194j1197q565p149q314r972r440p135n365m885m803m634m352l414j694
54647A53275m15n00j134j336j489j735q14J568L044J744o99j671j413j602j851
54632A44972p40R79J538J471K545M082L748J599K8j93o19j777k183j254m09n77
$$ y = [176507, 188585, 200928, 213203, 225423, 237470, 248477, 257478, 264218, 268488, 269341, 266241, 260493, 254145, 247785, 240721, 232881, 224944, 216920, 208441, 200526, 195268, 193301, 192941, 192255, 190855, 189415, 188560, 188597, 189339, 189921, 189666, 189251, 190220, 193310, 197897, 202869, 207299, 210811, 214315, 219935, 229054, 240920, 254200, 268972, 285504, 302001, 315892, 327270, 338754, 351607, 363988, 373543, 379930, 383995, 385963, 385293, 381293, 373337, 361360, 346514, 330560, 314537, 298780, 283794, 269979, 256887, 244194, 232997, 224432, 217283, 208969, 198997, 189557, 182422, 177057, 172172, 167369, 162735, 158383, 154969, 153275, 152860, 152360, 151226, 149890, 148401, 146666, 145852, 147420, 150464, 152208, 151509, 149838, 148425, 146823, 144972, 144232, 145211, 146749, 148220, 150765, 154847, 158595, 160194, 160222, 160029, 159410, 157633, 155450, 154196, 153787, 153210]
54616A53210q04%J726L709N099M803K848J435K548M891N476L966K900L761N363
54601B00931O315O691O810O495N995N815N486M252K723K011J584K73j045l89J871
54586B55818L289L090K775K840K111Q69J374M063O278O306N976P441R850J1330
54572C23410J2233J4063J6542J7981J7748J6575J4960J2790J0052O686K245l277
54560D62008q686j2627j4972j6400j7081j6595j5018j3342j2633j2913j2912j1234
54548B97595q012n054l795l687l354k638k417k761k763k166j981l156n383p342
54534B43086p752o527n218n603p320q099p064o073o420o275l791j038j604n064
54520A65238p308o408m750m667n221m601l158k340k400k649k683k249j093K31
$$ y = [153210, 152406, 152406, 154132, 157841, 162940, 167743, 170591, 172026, 174574, 179465, 184941, 188907, 191807, 195568, 200931, 207246, 213937, 220747, 227242, 233237, 239052, 244538, 248790, 251513, 253524, 255108, 255381, 254336, 253947, 255818, 259107, 262197, 264972, 267812, 269923, 270792, 272166, 276229, 282507, 288813, 294789, 302230, 312080, 323410, 335643, 349706, 366248, 384229, 401977, 418552, 433512, 446302, 456354, 463040, 465285, 462008, 453322, 440695, 425723, 409323, 392242, 375647, 360629, 347287, 334654, 321741, 308829, 297595, 289583, 284529, 280734, 277047, 273693, 271055, 268638, 265877, 263114, 260948, 258967, 255811, 250428, 243086, 235334, 228807, 223589, 217986, 210666, 202567, 195503, 189430, 183010, 176735, 172944, 171906, 170302, 165238, 157930, 151522, 146772, 142105, 136884, 132283, 129125, 126785, 124385, 121736, 119053, 116804, 115711, 115942]
54506A15942M94m86j411j315o24q4J49p8j001k017k065j357j232j870j776k20
54490A01049J374J515P38N35J098J297L90j048j653m85J970M018M362L275J795
54475A20230M42m58j87J363K855L167L110L964N100N089M463N051P078R151J0675
54460A81093J1878J1866R499O089M298M164L181N95j718l151n600r382j1379r344
54446A92089n405l121l247m408n840p162p145n132k736k193l737n838p101o898
54432A22126n333l589l094l493k920q83Q52J182J215J796J806N22n66j96M14j45
54416A09694q95n67l58j749l110j707J668L331J947J29L15J576J692M28n42q5
54400A11767J158J739J122L22O12J784K261J236l63j417k061k758k984k111q14
$$ y = [115942, 116436, 115950, 114539, 113224, 112600, 112516, 112665, 112587, 111586, 109569, 107504, 106147, 104915, 103045, 101269, 101049, 102423, 103938, 104676, 105211, 106309, 107606, 107996, 106948, 105295, 104810, 106780, 110798, 115160, 118435, 120230, 120672, 120214, 120027, 121390, 124245, 127412, 130522, 134486, 139586, 144675, 149138, 154189, 161267, 170418, 181093, 192971, 204837, 214336, 220425, 224723, 228887, 232068, 232663, 230945, 227794, 222194, 212812, 201433, 192089, 186684, 183563, 180316, 175908, 170068, 162906, 155761, 150629, 147893, 145700, 141963, 136125, 129024, 122126, 116793, 113204, 110110, 106617, 103697, 102814, 103666, 104848, 106063, 107859, 109665, 110187, 109621, 109425, 109839, 109694, 108799, 108232, 107874, 106125, 103015, 101308, 102976, 106307, 108254, 108383, 108698, 110274, 111966, 112394, 111852, 111767, 112925, 114664, 115786, 116108, 116720, 118504, 120765, 122001, 121638, 120221, 118160, 115402, 112418, 110307, 109493]
54385A09493m21j181k049j995q95N20J175N61o41j445k001l111m299l885j478
54370H8348J159K347K273J886J471J121R95M70j233k808j443K934O220M977R79
54355A09696j266j96J988L030K671J523K66r4J003K590L192K725K194K078K278
54340A33678L039M482N670N594M655L996L899M067M801O376P935Q354P727O746
54326B11019N474M053L585M494M877K583j657n122o591o811o103m014j377k48
54312B04162j201k716l651m493n571o058n514m843m728m590l925l337l301l068
54298A47166j904m11L77M92O35Q44N12n07j522j629l91J824L849M438L360J588
54282A58721L13K0O14J884L492M941N967O739P331P222N831L497J459N47K39n06
$$ y = [109493, 109072, 107891, 105842, 103847, 102952, 103472, 104647, 105208, 104567, 103122, 101121, 98010, 93711, 89826, 88348, 89507, 91854, 94127, 96013, 97484, 98605, 99600, 100070, 98837, 96029, 94586, 97520, 103740, 108717, 109696, 108430, 108234, 110222, 113252, 115923, 117446, 117712, 117618, 118621, 121211, 124403, 127128, 129322, 131400, 133678, 136717, 141199, 146869, 152463, 157118, 161114, 165013, 169080, 173881, 180257, 188192, 196546, 204273, 211019, 216493, 220546, 224131, 228625, 233502, 236085, 234428, 229306, 222715, 215904, 209801, 205787, 204410, 204162, 202961, 200245, 196594, 192101, 186530, 180472, 174958, 170115, 165387, 160797, 156872, 153535, 150234, 147166, 145262, 144851, 145228, 145720, 146355, 147199, 147711, 147204, 145682, 144053, 143662, 145486, 149335, 153773, 157133, 158721, 159034, 159054, 159668, 161552, 165044, 169985, 175952, 182691, 190022, 197244, 203075, 206572, 208031, 208578, 208817, 208311]
54266B08311j714k439k359k401l260m237m423m246m617n129m667l495l106l963
54252A58255m944n179m906m278l135k254l013m987n902m755l250l014l335k960
54238A02343k272k008j480pJ209N96j369l067m038m659m585l493k372k102j614
54223G1082M05K824L429K359J684J947J708N01l23j68j78r79j499q81K16R87J552
54206H4666J829R38j191k925k751j160K48O55L39j51k63N10K054L358L306J603
54190I1065j065l432m227l006p23J038J472R12L7o23n91K35J056P81n72j678j364
54173G9315J44J548J747O97o36j142n07P14J869K615K689K112J802K856M718N244
54157A05785L412P91o79j185j900k481j652K85J439R14l11j105j369j306q47k23
$$ y = [208311, 206597, 204158, 201799, 199398, 196138, 191901, 187478, 183232, 178615, 173486, 168819, 165324, 162218, 158255, 153311, 148132, 143226, 138948, 135813, 133559, 130546, 125559, 119657, 114902, 111652, 108638, 105303, 102343, 100071, 98063, 96583, 96576, 97785, 98381, 97012, 93945, 89907, 85248, 80663, 77170, 74798, 72696, 71082, 71487, 74311, 77740, 80099, 81783, 83730, 85438, 85939, 85616, 85448, 85270, 84291, 82792, 81911, 82127, 83114, 84666, 86495, 87433, 86242, 83317, 80566, 79406, 79654, 80309, 80648, 80497, 80234, 80744, 82798, 86156, 89462, 91065, 90000, 86568, 82341, 79335, 78612, 79650, 81122, 82034, 82071, 81448, 80857, 81092, 82148, 82929, 82357, 80679, 79315, 79459, 81007, 82754, 83451, 82815, 81673, 81166, 81880, 83749, 86364, 89053, 91165, 92967, 95823, 100541, 105785, 109197, 109988, 109309, 108124, 106224, 103743, 102091, 102376, 103815, 104729, 104418, 103313, 101944, 100638, 99791, 99568]
54141I9568N5ok3j63r01j741j431K04J683J576K8j690k534k279j435q35r07j249
54123H7920j234r18q65j264j650j490p67j21m19j743k802k177k95R82R02N05L47
54106G4911m77j945j858J049M461N312L967L012K855J674n96j567k07J403J299
54091I3293K46j01J58o6p88j210j327k010l542m838m365j882P49J159o20j752
54075G3104r9K823L863K445Q14M66N42l1q79j349j726k363k876k855k417j648
54059F7814m05J020K021K572L034L029J818k8p60L71K112K795J975L16j187j743
54043H4754j481j579k678l540k509n5J687J785J243R70O91J39l79q70j469j265
54027G5444Q31L723M704L087J257J231K008J558j62j667k183k003j446o69p8R
$$ y = [99568, 99623, 99617, 99594, 99431, 98530, 96789, 95358, 95562, 97245, 98821, 98849, 97159, 94625, 92346, 90911, 90076, 89169, 87920, 86686, 85768, 84903, 83639, 81989, 80499, 79732, 79611, 79192, 77449, 74647, 72470, 72175, 73157, 74059, 74564, 74911, 74434, 72489, 70631, 71680, 76141, 81453, 85420, 88432, 91287, 92961, 92365, 90798, 90591, 91994, 93293, 93539, 93438, 93596, 93530, 92742, 91532, 90205, 88195, 84653, 79815, 75450, 73568, 74317, 75476, 74856, 73104, 73005, 75828, 79691, 82136, 82950, 83416, 83958, 83927, 83048, 81699, 79973, 77610, 74734, 71879, 69462, 67814, 67409, 68429, 70450, 73022, 76056, 79085, 80903, 80875, 80115, 80486, 82598, 85393, 87368, 87684, 86497, 84754, 83273, 81694, 79016, 75476, 72967, 72912, 74599, 76384, 77627, 78597, 79288, 79427, 79048, 78178, 76709, 75444, 76275, 79998, 84702, 87789, 89046, 90277, 92285, 93843, 93681, 92014, 89831, 87828, 86382, 85713, 85635, 85644]
54011H5644k20l89k72L68J402J884J015m42r60m31j06j94O30K763M502M340K973
53994A02507J957J567J089M18K50J169K969M569M604K929J240J099J733J467Q82
53979A30449K205N434P666P150N573N094N409N301N082N610O373O439O197O582
53965B10564P460Q113Q344Q054O898N507N522P074P779N881L042J973K565K525
53951B91301J102j77j83M35O31P9j128k528l048k110q78j113k680l575k639j125
53935B72364r99k578m336m750l837k887k900l613m336n134o306p037n980l440
53921B14231j652k168m095n506n606m804l734k916k550k085q44O03J006O06J133
53906A81619K858L650K124%m05O07J267J411K108L013K405l8k428k807r58J981
$$ y = [85644, 85424, 85035, 84763, 85131, 86533, 88417, 89432, 88990, 88030, 87599, 87493, 87299, 87929, 90692, 95194, 99534, 102507, 104464, 106031, 107120, 107538, 107788, 108957, 111926, 116495, 121099, 124028, 125268, 126367, 128100, 129567, 130449, 132654, 138088, 145754, 152904, 158477, 163571, 168980, 174281, 179363, 184973, 191346, 197785, 203982, 210564, 218024, 226137, 234481, 242535, 249433, 254940, 260462, 267536, 275315, 281196, 284238, 286211, 288776, 291301, 292403, 292226, 292043, 292478, 293109, 293188, 292060, 289532, 286484, 284374, 283496, 282383, 279703, 276128, 273489, 272364, 271365, 268787, 264451, 259701, 255864, 252977, 250077, 246464, 242128, 236994, 230688, 223651, 217671, 214231, 212579, 210411, 206316, 200810, 195204, 190400, 186666, 183750, 181200, 179115, 178271, 178874, 179880, 180486, 181619, 184477, 188127, 190251, 190251, 189846, 190453, 191720, 193131, 195239, 198252, 200657, 200619, 198191, 195384, 194426, 196407]
53890A96407M540N602N028L751K762K317K441L364M720N270M389L117K798L418
53876B49924M197M910N625N995N932O197P167P929P627O819O269N530M128K972
53862C31221K898K904J739M60J129L513N214N033M095L562L193K606K208K363
53848C72138K877L757N251O873P410O299M243K354J394J583K253J912j93k834
53834D15317m111l681k701j918j263j047k008l964n708o537o939p750r329j1390
53820C46971j2792j2020r056o229n832p246p966p092n939n398m783l752l285l924
53806B51657m603m282l525l447l988m284m111m058m572n339n558m713l361k938
53792A92878m226o197p075o374n054m015l421l294l583l581k497q26M6k69p56
$$ y = [196407, 200947, 206549, 211577, 215328, 218090, 220407, 222848, 226212, 230932, 236202, 240591, 243708, 246506, 249924, 254121, 259031, 264656, 270651, 276583, 282780, 289947, 297876, 305503, 312322, 318591, 324121, 328249, 331221, 334119, 337023, 338762, 339222, 340351, 343864, 349078, 354111, 358206, 361768, 364961, 367567, 369775, 372138, 375015, 378772, 384023, 390896, 398306, 404605, 408848, 411202, 412596, 414179, 416432, 418344, 418151, 415317, 411206, 407525, 404824, 402906, 401643, 400596, 398588, 394624, 388916, 382379, 375440, 367690, 358361, 346971, 334179, 322159, 313103, 306874, 301042, 293796, 285830, 278738, 272799, 267401, 262618, 258866, 255581, 251657, 247054, 242772, 239247, 235800, 231812, 227528, 223417, 219359, 214787, 209448, 203890, 199177, 195816, 192878, 188652, 182455, 175380, 169006, 163952, 159937, 156516, 153222, 149639, 146058, 143561, 142735, 142781, 142512, 141756]
53777A41756p42q08j453j993j596n95n6m24j134j302n07Q73J998K401K286J845
53761A40549R41kL46K433M410L980J489m98n72J93M75M46O87R95J230J875K902
53744A61879L272K618K280L435N139N593M744M172M755N753O278O451O795P212
53730B30376P081N967M014J896N35N56J799L343M113L641K329R63o3r44j782k155
53714B61669j807j358j621k326k390j706j629l157n314o201n311l940l325l275
53700B18309k894j975j107p61q77j212j560j613j209p81j012j765k114j666j211
53685A96552j499k109k217j875j553j120k73O43J368K590M637N949M806K144O07
53670B08650J028K049L132N021O852O033K389n88m93O30r6k007k847k765l063
$$ y = [141756, 141014, 140206, 138753, 136760, 135164, 134569, 134513, 134089, 132955, 131653, 131146, 132019, 134017, 136418, 138704, 140549, 141490, 141488, 141834, 144267, 148677, 152657, 154146, 153648, 153076, 153269, 153744, 154190, 154877, 155872, 157102, 158977, 161879, 165151, 167769, 170049, 173484, 178623, 184216, 188960, 193132, 197887, 203640, 209918, 216369, 223164, 230376, 237457, 243424, 247438, 249334, 249869, 250425, 252224, 255567, 259680, 263321, 265650, 266613, 266550, 265606, 263824, 261669, 259862, 258504, 256883, 254557, 252167, 250461, 248832, 245675, 240361, 234160, 228849, 224909, 221584, 218309, 215415, 213440, 212333, 211572, 210695, 209483, 207923, 206310, 205101, 204320, 203308, 201543, 199429, 197763, 196552, 195053, 192944, 190727, 188852, 187299, 186179, 185906, 186549, 187917, 190507, 195144, 201093, 205899, 208043, 208650, 209678, 211727, 214859, 219880, 226732, 232765, 235154, 234566, 234073, 234703, 234607, 232600, 229753, 226988, 223925]
53655B23925k736r1L218L578P66j688j723r74j138j318l44R23J211R42J170J850
53639B27571K347K557K582K334K119K522L162K864J613J079K333M289N329N395
53625B68096N463N700N273L727J780P12J223K711L782L678L003K584K258J542
53611C11532Q21P71J004O03k90q21j028j638k390k210j221r31j966l035k778j496
53595B94927m51l04p22r87q40j070k754n310o297m406j597n28q82n28M46p5k024
53578B66598k393L07L584M403K826P57q60j831j352R79L690M669L526J712P48
53563B87363J012J702J519J45q22M74L445N522N593N168N526N853N188M343M340
53548C36371M633M454M464N342O044N362M288M752O577P613O773N229M459M484
$$ y = [223925, 221189, 221098, 224316, 227894, 228660, 226972, 225249, 224275, 223137, 221819, 221475, 222398, 223609, 224551, 225721, 227571, 229918, 232475, 235057, 237391, 239510, 242032, 245194, 248058, 249671, 250750, 253083, 257372, 262701, 268096, 273559, 279259, 284532, 288259, 290039, 290751, 291974, 294685, 298467, 302145, 305148, 307732, 309990, 311532, 312353, 313124, 314128, 314731, 314441, 313620, 312592, 310954, 308564, 306354, 305133, 304202, 302236, 299201, 296423, 294927, 294476, 294172, 293450, 292463, 291623, 290553, 287799, 282489, 276192, 271786, 270189, 269661, 268779, 268251, 268697, 268622, 266598, 264205, 264512, 268096, 272499, 275325, 276082, 275222, 273391, 272039, 273018, 276708, 281377, 284903, 286615, 287363, 288375, 290077, 291596, 291741, 290919, 291393, 294838, 300360, 305953, 311121, 316647, 322500, 327688, 332031, 336371, 341004, 345458, 349922, 355264, 361308, 366670, 370958, 375710, 382287, 389900, 396673, 401902, 406361, 410845]
53534D10845M481M255M468N638P023O891M439J266n6R73K358K527K243K825L902
53519D64078M125L299K509K558L156L420K685J159J3K18J160J320L57n86o96k36
53503D88539P01K411M141M320K924J836J896J711N30J25J904M124M320L097L038
53488E25617M732O339O730O727P195P861Q231Q272P908P070O149N584N200M843
53474F18458N179O687Q443R146Q938Q980R599J0155J0411J0734J1193J1658J2546
53461G42127J4244J5954J6414J5733J5330J6082J7555J9081K0540K1901K2840
53450I37801K3016K2397K1398K1075K2388K4798K6343K6053K5435K6465K8859
53439A206028L0777L1623L2474L3808L4574L3929L2725L2535L3827L5568L6394
$$ y = [410845, 415326, 419581, 424049, 429687, 436710, 443601, 448040, 449306, 449250, 450223, 452581, 455108, 457351, 460176, 464078, 468203, 471502, 474011, 476569, 479725, 483145, 485830, 486989, 487002, 487220, 488380, 489700, 490057, 489471, 488775, 488539, 489240, 491651, 495792, 500112, 503036, 504872, 506768, 508479, 509009, 509134, 511038, 515162, 519482, 522579, 525617, 530349, 536688, 543418, 550145, 557340, 565201, 573432, 581704, 589612, 596682, 602831, 608415, 613615, 618458, 623637, 630324, 638767, 647913, 656851, 665831, 675430, 685585, 695996, 706730, 717923, 729581, 742127, 756371, 772325, 788739, 804472, 819802, 835884, 853439, 872520, 893060, 914961, 937801, 960817, 983214, 1004612, 1025687, 1048075, 1072873, 1099216, 1125269, 1150704, 1177169, 1206028, 1236805, 1268428, 1300902, 1334710, 1369284, 1403213, 1435938, 1468473, 1502300, 1537868, 1574262]
53428A574262L5970L5196L4982L4894L3744L1572L0001L0196L1365L2049L1877
53417A936108L1295L0598L0010K9866K9754K8570K6267K4333K3481K2306J9699
53406B232287J7190J6849J8022J8271J6785J4628J2108Q340L427j107m343o787
53394B345670q982j0955j3091j5854j8599k0211k0955k1946k2885k2314k0485
53383B149393j9865k1956k5367k7872k8931k9348k9665k9863k9712k8754k6679
53372A851381k4197k2598k2142k1827k0985j9928j8744j6758j3796j0772q412
53361A651222o424m473k895j863q79K65J039J397K346M460O723P867Q186R088
53347A676059J1226J3960J6396J8293K0049K2203K4879K7582K9806L1791L4133
$$ y = [1574262, 1610232, 1645428, 1680410, 1715304, 1749048, 1780620, 1810621, 1840817, 1872182, 1904231, 1936108, 1967403, 1998001, 2028011, 2057877, 2087631, 2116201, 2142468, 2166801, 2190282, 2212588, 2232287, 2249477, 2266326, 2284348, 2302619, 2319404, 2334032, 2346140, 2354480, 2357907, 2356800, 2352457, 2345670, 2336688, 2325733, 2312642, 2296788, 2278189, 2257978, 2237023, 2215077, 2192192, 2169878, 2149393, 2129528, 2107572, 2082205, 2054333, 2025402, 1996054, 1966389, 1936526, 1906814, 1878060, 1851381, 1827184, 1804586, 1782444, 1760617, 1739632, 1719704, 1700960, 1684202, 1670406, 1659634, 1651222, 1644798, 1640325, 1637430, 1635567, 1634688, 1634953, 1635992, 1637389, 1639735, 1644195, 1650918, 1658785, 1666971, 1676059, 1687285, 1701245, 1717641, 1735934, 1755983, 1778186, 1803065, 1830647, 1860453, 1892244, 1926377]
53336A926377L6671L8571L9658M0814M2683M4786M6405M7718M9534N2279N5543
53325B421039N8299N9531N9202N8750N9849O2465O4870O5724O5348O4570O3387
53314C103034O1398N8864N6460N4346N2126M9408M5982M1729L6818L1782K7023
53303C618970K2450J7837J3258Q929M791M63m640j1009j8486k5983l2291l7258
53291C557031m1631m5722m8956n1034n2658n4563n6474n7610n7863n7690n7246
53280B975584n6330n5069n3935n3002n1803n0200m8874m8408m8270m7249m4921
53269B417523m2138l9893l8217l6528l4691l3057l1609k9718k6957k3764k1111
53258B059840j9706j9447j9385j8480j6767j5399j4996j4597j3129j1290j0511
$$ y = [1926377, 1963048, 2001619, 2041277, 2082091, 2124774, 2169560, 2215965, 2263683, 2313217, 2365496, 2421039, 2479338, 2538869, 2598071, 2656821, 2716670, 2779135, 2844005, 2909729, 2975077, 3039647, 3103034, 3164432, 3223296, 3279756, 3334102, 3386228, 3435636, 3481618, 3523347, 3560165, 3591947, 3618970, 3641420, 3659257, 3672515, 3681444, 3686235, 3686698, 3682058, 3671049, 3652563, 3626580, 3594289, 3557031, 3515400, 3469678, 3420722, 3369688, 3317030, 3262467, 3205993, 3148383, 3090520, 3032830, 2975584, 2919254, 2864185, 2810250, 2757248, 2705445, 2655245, 2606371, 2557963, 2509693, 2462444, 2417523, 2375385, 2335492, 2297275, 2260747, 2226056, 2192999, 2161390, 2131672, 2104715, 2080951, 2059840, 2040134, 2020687, 2001302, 1982822, 1966055, 1950656, 1935660, 1921063, 1907934, 1896644, 1886133]
53247A886133j0475r495p485o466p409q550p924n944m121k748j336j4J116K924
53233A818206N789Q212Q713Q393R730J3255J7202K0106K2072K3697K5277K7022
53221B007674K8791K9862L0103L0701L2353L3595L2603K9986K7807K6486K4823
53210B334784K2618K0767J8938J5734J1496Q403P098N550K154k080n451p775r708
53197B422528j1552j3805j7237k1261k3740k3777k3410k5192k8930l2065l2621
53186B168938l0891k8789k8179k9320l0569l0223k8645k7569k7373k6736k5245
53175A855399k4342k4868k5422k4415k2415k1040k0699k0635k0302j9449j7592
53164A614220j4605j1400r123q175q438r651j0875j0694q811o646n581n435n358
$$ y = [1886133, 1875658, 1866163, 1858678, 1852212, 1844803, 1836253, 1828329, 1822385, 1818264, 1815516, 1814180, 1814166, 1815282, 1818206, 1823995, 1832207, 1840920, 1849313, 1859043, 1872298, 1889500, 1909606, 1931678, 1955375, 1980652, 2007674, 2036465, 2066327, 2096430, 2127131, 2159484, 2193079, 2225682, 2255668, 2283475, 2309961, 2334784, 2357402, 2378169, 2397107, 2412841, 2424337, 2432740, 2439838, 2445388, 2447542, 2445462, 2440011, 2432236, 2422528, 2410976, 2397171, 2379934, 2358673, 2334933, 2311156, 2287746, 2262554, 2233624, 2201559, 2168938, 2138047, 2109258, 2081079, 2051759, 2021190, 1990967, 1962322, 1934753, 1907380, 1880644, 1855399, 1831057, 1806189, 1780767, 1756352, 1733937, 1712897, 1692198, 1671563, 1651261, 1631812, 1614220, 1599615, 1588215, 1579092, 1570917, 1562479, 1552828, 1541953, 1531259, 1522448, 1515802, 1510221, 1504786, 1499428]
53151A499428n216n279n570o396q473j1531j3870j4468j4508j5451j6549j5912
53139A366205j3589j1884j2581j5063j7308j7851j6715j5208j4818j5933j7617
53128A197638j8808j9262j9162j8587j7865j7692j8335j9323k0341k1573k2618
53117I84072k2255k0233j8313j8306j9766k0726k0155j8602j6927j5612j4956
53106G78221j4909j4834j4229j3431j3017j2934j3023j3626j4722j5166j4035
53095F24295j2293j1667j2131j1956j0387q811q848j0299j1609j1610j0254q196
53083D96234o263n158n127n802o484o744o776p056p590p726p041o039n437n023
53069D07968m096k927k610l348m008l839l404l186k609j335m96j249k807l272
$$ y = [1499428, 1494212, 1488933, 1483363, 1476967, 1468494, 1456963, 1443093, 1428625, 1414117, 1398666, 1382117, 1366205, 1352616, 1340732, 1328151, 1313088, 1295780, 1277929, 1261214, 1246006, 1231188, 1215255, 1197638, 1178830, 1159568, 1140406, 1121819, 1103954, 1086262, 1067927, 1048604, 1028263, 1006690, 984072, 961817, 941584, 923271, 904965, 885199, 864473, 844318, 825716, 808789, 793177, 778221, 763312, 748478, 734249, 720818, 707801, 694867, 681844, 668218, 653496, 638330, 624295, 612002, 600335, 588204, 576248, 565861, 557050, 548202, 537903, 526294, 514684, 504430, 496234, 489971, 484813, 479686, 473884, 467400, 460656, 453880, 446824, 439234, 431508, 424467, 418428, 412991, 407968, 403872, 400945, 398335, 394987, 390979, 387140, 383736, 380550, 377941, 376606, 376110, 374861, 372054, 368782]
53055C68782k127p04k70p28j261j436j424j576j913j855p63J030K218J995J077
53040C61045P15J154J635J647J514J896L054M524N379N084M141L443L038K241
53026D00510R16l65j584l477n924p442p059n746n118n583o557p599q356q133o624
53011C21859m598l133k597k898l899m942n059m396m403n648o637n905m161k986
52997B60597k429j515l31R3m72j340k201l088l485k902j882j111l0K007L804L426
52981B49141J179n42m95L1m82j782k653k508j556m59j95j236k660l072k489k155
52965B28067k370k013n81P41Q32K10k6J49M1m94j065j554k116k564k421j525k96
52948B13015N81O68J39m10o80j000j627k096j789p96L74J525K555K953K489J975
$$ y = [368782, 366655, 365951, 365681, 364953, 363692, 362256, 360832, 359256, 357343, 355488, 354725, 355755, 357973, 359968, 361045, 361760, 362914, 364549, 366196, 367710, 369606, 372660, 377184, 382563, 387647, 391788, 395231, 398269, 400510, 401426, 401061, 399477, 396000, 390076, 382634, 375575, 369829, 364711, 359128, 352571, 344972, 336616, 328483, 321859, 317261, 314128, 311531, 308633, 304734, 299792, 294733, 290337, 285934, 280286, 273649, 267744, 263583, 260597, 258168, 256653, 256322, 256415, 255943, 254603, 252402, 249314, 245829, 242927, 241045, 239934, 239904, 241911, 245715, 249141, 250320, 249778, 249283, 249314, 248832, 247050, 244397, 241889, 240333, 239874, 239679, 238443, 235783, 232711, 230222, 228067, 225697, 223684, 223103, 223844, 224676, 224886, 224860, 225009, 225050, 224556, 223491, 221937, 219821, 217257, 214836, 213311, 213015, 213596, 214264, 214403, 213993, 213313, 212313, 210686, 208590, 206801, 206005, 206379, 207904, 210459, 213412, 215901, 217876]
52932B17876K239K604J740q1j055l12R55J292O97ql43j46P14J876K431J933R50
52915B33362L09L61J086K078K368J294j93k96J154K325K064J552K225L477L866
52900B57032L557L709M175L759K698K872N061P552Q373P704P151P500Q219Q629
52886C37991Q489P720O411N039M004K990J596M32O82K291L455K459n10l855o204
52871C72990p047o394m768l234k549k369j970j538j879l042m250n112n843o051
52857C16944m741k040K36O76N2nO20O20o53k279l052k810k215j756j376r13o36
52840B96672r83j693j603M7K357L595L182K032R80Qp84q60l22q7l06R2J492K490
52822C06309J904P50Q11J972K557J832P02O3k41p24j491k194k173q73J256K696
$$ y = [217876, 220115, 222719, 224459, 224378, 223323, 223011, 223966, 225258, 225955, 225947, 225604, 225458, 226172, 228048, 230479, 232412, 233362, 233671, 234032, 235118, 237196, 239564, 240858, 240665, 240369, 241523, 243848, 245912, 247464, 249689, 253166, 257032, 260589, 264298, 268473, 272232, 274930, 277802, 282863, 290415, 298788, 306492, 313643, 321143, 329362, 337991, 346480, 354200, 360611, 365650, 369654, 372644, 374240, 374672, 375354, 377645, 381100, 383559, 383049, 379194, 372990, 365943, 359549, 354781, 351547, 348998, 346629, 344659, 343121, 341242, 338200, 333950, 328838, 322995, 316944, 312203, 310163, 310399, 311075, 311127, 311122, 311742, 312362, 311709, 309430, 306378, 303568, 301353, 299597, 298221, 297308, 296672, 295689, 293996, 292393, 292440, 294797, 298392, 301574, 303606, 304586, 304594, 303810, 302950, 302628, 302541, 302235, 302327, 303819, 306309, 308213, 308963, 309774, 311746, 314303, 316135, 316837, 316900, 316659, 315935, 314444, 312250, 310077, 309204, 310460, 313156]
52806C13156K452J323Q08J256J880K007J406K8j451j512M61K784L240J950R38
52791C30726J047J020l0r76m21J041J535M58n69M50L500O368O975N537L894L047
52775C63602K504K063K653M639O510O519M719K430O44q3P52K708M024L568K353
52760D09605J830J633O81m99n95l9n48k393m116n003n793o821p310o873o222o028
52744C61509o335p142q222q612p579o035n407n406m609l014k049k192k510k677
52730B89720l331m264m402l887m036m737m162j832K28L47o80j390j662j862j697
52715B52353j190j268k269l127l031k537k157j413j97M71R4m42o61j401k779l115
52699B27331j554j2n94k481l446l335l727m821n055l777k337k078k624k674j695
$$ y = [313156, 315608, 316931, 317739, 318995, 320875, 322882, 324288, 324316, 322865, 321353, 321814, 324598, 327838, 329788, 330726, 331773, 332793, 332763, 331787, 331366, 332407, 333942, 334400, 333831, 334281, 337781, 344149, 351124, 356661, 360555, 363602, 366106, 368169, 370822, 375461, 381971, 388490, 393209, 395639, 396283, 396200, 396952, 399660, 403684, 407252, 409605, 411435, 413068, 413749, 413250, 412655, 412616, 412068, 409675, 405559, 400556, 394763, 387942, 380632, 373759, 367537, 361509, 355174, 348032, 339810, 331198, 323619, 317584, 312177, 306771, 302162, 299148, 297099, 294907, 292397, 289720, 286389, 282125, 277723, 273836, 269800, 265063, 260901, 259069, 259297, 259644, 258964, 257574, 255912, 254050, 252353, 251163, 249895, 247626, 244499, 241468, 238931, 236774, 235361, 235164, 235635, 235729, 235287, 234626, 233225, 230446, 227331, 225777, 225765, 225171, 222690, 219244, 215909, 212182, 207361, 202306, 198529, 196192, 194114, 191490, 188816, 187121]
52684A87121n07n18k229m317m822l520k209k151k479j973j113j073j619j599q95
52669A56097l56j43L68J087R63m97k460l652l372j733L56J388K37k693n538o348
52653A33704m541j307J349K290K024J554Q73n58k120k248n82J359K176K095J945
52638A38013J751J238O77M43M40O33J291K162K330J569Q14P23P96O29Q33J923
52622A56265L300M333N291O374O847O199N128M424L886L321L334L980L914K230
52608B18826L1j351k434m245n999o093m774l724l452k974k020j666k535l845m523
52593A69222m188l118k127k209l257l549j820O22J265l56k319k995k546j708p27
52578A40190N4N7n37o39K50J234J261M70j58k4N64R42R32J084J836K448J472j415
$$ y = [187121, 186614, 186096, 183867, 179550, 174728, 171208, 168999, 166848, 164369, 162396, 161283, 160210, 158591, 156992, 156097, 155741, 155598, 155966, 157053, 158016, 157519, 155059, 151407, 148035, 146302, 146658, 148046, 148283, 145590, 140052, 133704, 129163, 127856, 129205, 131495, 133519, 135073, 135946, 135388, 133268, 131020, 130438, 131797, 133973, 136068, 138013, 139764, 141002, 141679, 142122, 142562, 143195, 144486, 146648, 148978, 150547, 151361, 152084, 152880, 153509, 154342, 156265, 159565, 163898, 169189, 175563, 182410, 188609, 193737, 198161, 202047, 205368, 208702, 212682, 216596, 218826, 218857, 217506, 215072, 210827, 204828, 198735, 193961, 190237, 186785, 183811, 181791, 180125, 177590, 173745, 169222, 165034, 161916, 159789, 157580, 154323, 150774, 148954, 149576, 150841, 150485, 148166, 145171, 142625, 140917, 140190, 140244, 140301, 139764, 139125, 139375, 140609, 141870, 142340, 142182, 142158, 142722, 143664, 144596, 145680, 147516, 149964, 151436, 150021]
52560A50021m690o604o732n502l234n45J365J976K137K424J872j86k087j748j2
52545A28455K16j822l556k662P0K267K873K474J757R06J16j30N31J790K628K177
52529A38090Q82K71R97J791J183l52j086m07P24J382J450R52l8o55J78K101L314
52512A50777K708J196N53J503L171L904K649R0j681j200P49K167K108J231M71
52497A70396K00M66J087J476J195O03K95K09L0K1N03R97R74R61J663K444K153
52480A85673J146Q95J655K134J603Q12M95N11P76J693K989L456K479R57K15P20
52464B08209K089L419L627K422J038R11J644J612N58J4P71J645J443O44K29J36
52448B30411r5l06l24o03j316j645r25J82N68J04n19p83m85L73J189J010q7p60
$$ y = [150021, 145331, 138727, 131995, 126493, 123259, 122714, 124079, 126055, 128192, 130616, 132488, 132302, 130215, 128467, 128455, 128671, 126849, 123293, 120631, 120701, 122968, 125841, 128315, 130072, 130978, 131094, 130964, 131495, 133285, 135913, 138090, 138972, 139243, 140240, 142031, 143214, 142862, 141776, 141369, 142093, 143475, 144925, 145877, 145839, 145184, 145362, 147463, 150777, 153485, 154681, 155234, 156737, 159908, 163812, 166461, 166551, 164870, 163670, 164419, 166586, 168694, 169925, 170396, 170596, 171062, 172149, 173625, 174820, 175423, 175718, 175927, 175957, 175978, 176481, 177478, 178452, 179413, 181076, 183520, 185673, 186819, 187714, 189369, 191503, 193106, 193918, 194413, 194924, 195700, 197393, 200382, 203838, 206317, 207274, 207489, 208209, 210298, 213717, 217344, 219766, 220804, 221715, 223359, 224971, 225529, 225543, 226314, 227959, 229402, 230046, 230275, 230411, 230316, 230010, 229686, 229083, 227767, 226122, 225197, 225379, 225947, 226051, 225532, 224749, 224264, 224637, 225826, 226836, 226749, 225989]
52430B25989k72L50K1n20N1J317J622O37k84l74m57j179j626p06J003J854J205
52413B28631J8m80j5Q55J396J199N32L01J139K466L032K567K035J925J366k52
52397B46715j722j506j05P71J025K212M477N581L950R64r13r66L5J512L020L657
52381B68707L056K221J945J296p70l166l754k220k32Q55R65M62j22P6J210K070
52365B72599J837J712K970M299L396O88j102r22l20j84N83K434L703L104J701
52350B96498J146J514J907J883J255j69j801k370j407L72K354M188M713K886K14
52335C13183j85K154M125L603K392K767L625K689O96L12J737K356Q05j178j440
52320C37641j30R21L69j559l325l335j567J93K80r83k009j934j094QJ129J956
$$ y = [225989, 225717, 226067, 226088, 225568, 225619, 226936, 228558, 229195, 228911, 228537, 228080, 226901, 225275, 224569, 225572, 227426, 228631, 228649, 228169, 228154, 229009, 230405, 231604, 232136, 232437, 233576, 236042, 239074, 241641, 243676, 245601, 246967, 246715, 244993, 243487, 243382, 244153, 245178, 247390, 251867, 257448, 261398, 262362, 261449, 260483, 260518, 262030, 265050, 268707, 271763, 273984, 275929, 277225, 276455, 273289, 269535, 267315, 267083, 267938, 268903, 269365, 269243, 269319, 270529, 272599, 274436, 276148, 279118, 283417, 286813, 287501, 286399, 285477, 285157, 284973, 285556, 287990, 291693, 294797, 296498, 297644, 299158, 301065, 302948, 304203, 304034, 302233, 299863, 298456, 298828, 301182, 305370, 310083, 312969, 313183, 312998, 315152, 319277, 322880, 325272, 328039, 331664, 334353, 335049, 335361, 337098, 339454, 340259, 339081, 337641, 337511, 338432, 338801, 337242, 333917, 330582, 329015, 329208, 329488, 328505, 326496, 324562, 323468, 323476, 324605, 326561]
52304C26561K250K272K438K699K800K800K807K708K610K947L626L786L172K905
52290C66381L863M958M346K008j2N3K082M746O861P807P398N793L600J949K181
52275D24014M739Q165R963Q946O384M438M035M619N327N732N857N971O197O146
52261E10533N511N069O203Q990J1583J2131J0713Q935Q254R117J1017J2848J3740
52248F34644J3913J4233J4950J5672J6484J7778J8956J8954J8476J9812K3546
52237H27418K7195K8306K7336K6259K5906K6307K7942L0678L2608L2151L0530
52226A142636L0099L0974L1381L0740L0004K9197K7159K4072K1925K1665K1675
52215A441527K0063J7080J4244J2252J0659R034P532O604O518O927O923N875M126
$$ y = [326561, 328811, 331083, 333521, 336220, 339020, 341820, 344627, 347335, 349945, 352892, 356518, 360304, 363476, 366381, 370244, 375202, 379548, 381556, 381544, 381597, 383679, 388425, 395286, 403093, 410491, 416284, 419884, 421833, 424014, 428753, 436918, 446881, 455827, 462211, 466649, 470684, 475303, 480630, 486362, 492219, 498190, 504387, 510533, 516044, 521113, 527316, 536306, 547889, 560020, 570733, 579668, 587922, 597039, 608056, 620904, 634644, 648557, 662790, 677740, 693412, 709896, 727674, 746630, 765584, 784060, 803872, 827418, 854613, 882919, 910255, 936514, 962420, 988727, 1016669, 1047347, 1079955, 1112106, 1142636, 1172735, 1203709, 1235090, 1265830, 1295834, 1325031, 1352190, 1376262, 1398187, 1419852, 1441527, 1461590, 1478670, 1492914, 1505166, 1515825, 1524859, 1532391, 1538995, 1545513, 1552440, 1559363, 1565238, 1569364]
52202A569364K326N17j451k954l194k519k031j915j266K93J951L022L816M791
52188A570750N728O322O857P751R023J0648J3000J6292J9765K1939K1904K0391
52176A730370J9318K0005K1675K2185K0468J7682J5600J4465J3237J1376R502
52165A915883Q288P522O316L894K45l631o456q085r787j2571j5700j7593j7842
52152A850483j7573j7977j9256k0880k2264k3180k3847k4554k4985k4457k2962
52141A608548k1296j9772j7780j5266j3578j3836j5342j6566j6891j6292j4415
52130A427514j1464r197r057r832q984o217l866l678m986o235o668o077m479k709
52116A334065k040k595l230l378l828n075o177n954m544l119k731l770n748p349
$$ y = [1569364, 1571690, 1572207, 1570756, 1567802, 1564608, 1562089, 1560058, 1558143, 1556877, 1557170, 1559121, 1562143, 1565959, 1570750, 1576478, 1582800, 1589657, 1597408, 1606431, 1617079, 1630079, 1646371, 1666136, 1688075, 1709979, 1730370, 1749688, 1769693, 1791368, 1813553, 1834021, 1851703, 1867303, 1881768, 1895005, 1906381, 1915883, 1924171, 1931693, 1938009, 1941903, 1942148, 1938517, 1932061, 1923976, 1914189, 1901618, 1885918, 1868325, 1850483, 1832910, 1814933, 1795677, 1774797, 1752533, 1729353, 1705506, 1680952, 1655967, 1631510, 1608548, 1587252, 1567480, 1549700, 1534434, 1520856, 1507020, 1491678, 1475112, 1458221, 1441929, 1427514, 1416050, 1406853, 1397796, 1387964, 1378980, 1372763, 1368897, 1365219, 1360233, 1353998, 1347330, 1341253, 1336774, 1334065, 1332025, 1329430, 1326200, 1322822, 1318994, 1313919, 1307742, 1301788, 1297244, 1294125, 1291394, 1287624, 1281876, 1274527]
52102A274527p453o435n549n081m246l040k669l635m867n433n769o186n651l445
52088A205068q79J91j04k31J66o1j293k249j964j279j512k448k598j239O75J667
52072A191910J301K92n71j112j349r90J14J263J366L55m09L54K294L805L949L387
52056A205959L365M218N340O298P267Q282Q784Q498Q280R352J1779J4393J6199
52043A318014J7201J7888J8745K0360K3144K6526K9183L0390L0614L0661L1059
52032A593785L2243L4168L5512L4754L2533L1296L1773L1640K9011K5489K3740
52021A935944K3487K2291J9437J6334J3594J0322O621M109L266K320k74l891p100
52008B046460r498j1370j2813j4018j5274j6107j5572j3968j2968j3502j4665
$$ y = [1274527, 1267074, 1260639, 1255090, 1250009, 1245763, 1242723, 1240054, 1236419, 1231552, 1226119, 1220350, 1214164, 1208513, 1205068, 1204189, 1204380, 1204276, 1204045, 1204211, 1204150, 1202857, 1200608, 1198644, 1197365, 1195853, 1193405, 1190807, 1189568, 1190243, 1191910, 1193211, 1193503, 1192932, 1191820, 1190471, 1189481, 1189595, 1190858, 1192224, 1192579, 1192170, 1192524, 1194818, 1198623, 1202572, 1205959, 1209324, 1213542, 1218882, 1225180, 1232447, 1240729, 1249513, 1258011, 1266291, 1275643, 1287422, 1301815, 1318014, 1335215, 1353103, 1371848, 1392208, 1415352, 1441878, 1471061, 1501451, 1532065, 1562726, 1593785, 1626028, 1660196, 1695708, 1730462, 1762995, 1794291, 1826064, 1857704, 1886715, 1912204, 1935944, 1959431, 1981722, 2001159, 2017493, 2031087, 2041409, 2048030, 2052139, 2055405, 2057725, 2057451, 2053560, 2046460, 2036962, 2025592, 2012779, 1998761, 1983487, 1967380, 1951808, 1937840, 1924872, 1911370, 1896705]
51997A896705j5300j5246j4406j2170q713n575l757k473p83P85J528K216L855
51984A826666N748O533O600P705J0323J2950J4153J3937J2941J1430R589Q001
51972A946576P326P717Q654R113Q121N674K787K69k163n042q010j0321j2092j3951
51958A944658j5731j6627j6746j7337j9108k1190k2366k2570k2734k3670k5699
51947A720880k8792l2262l4652l4846l3396l2063l1837l1988l1391l0188k9530
51936A369935l0021l1232l2578l3849l4704l4526l3229l1676l0769l0519l0452
51925A016380l0339k9983k8918k7126k5532k4900k4519k3113k0890j9457j9547
51914G42056k0053j9712j8689j7801j7026j5781j4167j3063j2960j3308j3130
$$ y = [1896705, 1881405, 1866159, 1851753, 1839583, 1830870, 1825295, 1821538, 1819065, 1818282, 1819067, 1820595, 1822811, 1826666, 1832414, 1838947, 1845547, 1853252, 1863575, 1876525, 1890678, 1904615, 1917556, 1928986, 1938575, 1946576, 1953902, 1961619, 1970273, 1979386, 1987507, 1993181, 1995968, 1996237, 1994074, 1989032, 1981022, 1970701, 1958609, 1944658, 1928927, 1912300, 1895554, 1878217, 1859109, 1837919, 1815553, 1792983, 1770249, 1746579, 1720880, 1692088, 1659826, 1625174, 1590328, 1556932, 1524869, 1493032, 1461044, 1429653, 1399465, 1369935, 1339914, 1308682, 1276104, 1242255, 1207551, 1173025, 1139796, 1108120, 1077351, 1046832, 1016380, 986041, 956058, 927140, 900014, 874482, 849582, 825063, 801950, 781060, 761603, 742056, 722003, 702291, 683602, 665801, 648775, 632994, 618827, 605764, 592804, 579496, 566366]
51903E66366j2035j0499r297q596p788o384m822l929l846m041m428n510p171q132
51889D69888p462o034n670o876q184p963o323m822m642n598o888q089q975q922
51875C73440p380m877k695j342k10Q87Q78r41l274l953k566q79n54j316j723j099
51859C42396k71m44j644k484j881o93q06k492l826l283j760j075j455j813j781
51844C16688j925k424k840k997k837j847P3J515Q73j335l013l163k515j581o9
51829B92603J486J455n83k829l448k587j389k41R93J954K138J685J039K22q72
51814B91626j911k346k012j265p56r64j501j275K0J048N41p14r16Q9Q80R57J208
51797B82709J831J987J839K731M511M935K927N02p0P81J379J548K123K901L074
$$ y = [566366, 554331, 543832, 534535, 525939, 518151, 511767, 506945, 503016, 499170, 495129, 490701, 485191, 478020, 469888, 462426, 456392, 450722, 443846, 435662, 427699, 421376, 416554, 411912, 406314, 399426, 391337, 382362, 373440, 366060, 361183, 358488, 357146, 356936, 357823, 358701, 357760, 354486, 350533, 347967, 347088, 346534, 345218, 343495, 342396, 342125, 341681, 340037, 337553, 335672, 334979, 334173, 331681, 327855, 324572, 322812, 321737, 320282, 318469, 316688, 314763, 312339, 309499, 306502, 303665, 301818, 301891, 303406, 304279, 302944, 299931, 296768, 294253, 292672, 292603, 294089, 295544, 294961, 292132, 288684, 286097, 284708, 284467, 285460, 287414, 289552, 291237, 292276, 292498, 291626, 289715, 287369, 285357, 284092, 283336, 282372, 280871, 279596, 279616, 280664, 281205, 280491, 279575, 279664, 280544, 281501, 282709, 284540, 286527, 288366, 291097, 295608, 300543, 303470, 303972, 303902, 304683, 306062, 307610, 309733, 312634, 315708]
51782C15708K806K633K114O93o75n67Q04J950K141J620L61j613l088k621p34M32
51766C21964j72j462k167k386k699k966k658j726n77L33N57j44j318j778o30J774
51750C03945L976M602L530J905R68R73J441K048K620K520J032j391l089k838j030
51735C21212R79K036J699M35n22k67O24Q96L50j68l82o31l81J397L981N004L639
51718C39901J736Q50K38q72j200M05K449K704J387K36l85j099j253K86K442K770
51702C50595J023l86J84J728K575K406J808J305J380K149K704K010O27L00J661
51687C72069L592M993N782O018N557M915N088O046O602O245N787N834N965N942
51673D50435O373P416Q146Q180Q724J0907J3800J5402J5058J3837J2686J1386
$$ y = [315708, 318514, 321147, 323261, 323954, 323279, 322712, 323516, 325466, 327607, 329227, 329588, 327975, 324887, 322266, 321532, 321964, 321792, 320330, 318163, 315777, 313078, 310112, 307454, 305728, 305151, 305484, 306041, 305897, 304579, 302801, 302171, 303945, 307921, 312523, 316053, 317958, 318926, 319899, 321340, 323388, 326008, 328528, 329560, 328169, 325080, 322242, 321212, 322191, 324227, 325926, 326361, 325839, 325572, 326196, 327092, 327442, 327274, 326892, 326261, 325880, 327277, 331258, 336262, 339901, 341637, 342487, 342725, 341853, 340653, 341058, 343507, 346211, 347598, 347834, 347449, 346350, 345097, 345383, 347825, 350595, 351618, 351232, 351416, 353144, 355719, 358125, 359933, 361238, 362618, 364767, 367471, 369481, 370108, 370408, 372069, 375661, 380654, 386436, 392454, 398011, 402926, 408014, 414060, 420662, 426907, 432694, 438528, 444493, 450435, 456808, 464224, 472370, 480550, 489274, 500181, 513981, 529383, 544441, 558278, 570964, 582350]
51661E82350R461P324N899N312M530K585M5j373q47M98J136J092J450K288K309
51646F24059O29k117m681o355o845n934l878j647j94K84J06m16r01p49L17J549
51630E93227J705N02p42m32J429L166L569L443M402O564Q436Q876Q107O679M635
51615F53566K073n38l058n628p537p458n530l902m184n456n920n370m625l622
51601E92811j772L46J414J218P61O97R62J643K835L779L263J052k018n075p506
51586E94410q680q496p896p791p903p648p524q350r571r741q367o182m037k759
51572D89465l414o032q567q839p167n622n074m862m810n380n980n462m403m603
51558D09250n875n741l139l39O2j679l434l968l507k724k230k358k692k503j931
$$ y = [582350, 591811, 599135, 605034, 610346, 614876, 617461, 617506, 616133, 615286, 615784, 616920, 618012, 619462, 621750, 624059, 624688, 622571, 617890, 611535, 604690, 598756, 594878, 593231, 593037, 593321, 593427, 593011, 592110, 591361, 591678, 593227, 594932, 595434, 594692, 594260, 595689, 598855, 602424, 605867, 610269, 616833, 625269, 634145, 642252, 648931, 653566, 655639, 655101, 652043, 646415, 638878, 631420, 625890, 621988, 617804, 612348, 606428, 601058, 596433, 592811, 591039, 591385, 592799, 594017, 594778, 595475, 596437, 598080, 600915, 604694, 607957, 609009, 606991, 601916, 594410, 585730, 577234, 569338, 561547, 553644, 545996, 538472, 530122, 520551, 510810, 502443, 496261, 492224, 489465, 486051, 480019, 471452, 462613, 455446, 449824, 444750, 439888, 435078, 429698, 423718, 418256, 413853, 409250, 403375, 397634, 394495, 394156, 394218, 392539, 389105, 385137, 381630, 378906, 376676, 374318, 371626, 369123, 367192]
51543C67192j798k122j949r95j32P3k3k47q73j448r69L27J014P59P12J057L51
51526C60929j597k369j18L570N815O060N678N251M321L213K860L099K852K067
51512D01631J934L054M634N681O024N901N371M420L090J330q65l109m734n257
51498D29105m757l945l772m500n228m884l608k431j724j047n02q59j922k140n80
51483C87206J796L530M263M261L539K486K333L738N564O207N576M743M151L330
51469D42723K048P67j23o78j039j080m88Q96K531L117J867j27p75N35K329L177
51453D55680L078K339O53j622k789j808PQ35R19J621K622K104k05k109j703K29
51437D59851J398P54q21k136l180m618o310p011n898l835k449k208k252j842j005
$$ y = [367192, 365394, 363272, 361323, 360328, 360196, 360269, 360246, 359999, 359126, 357678, 356709, 357036, 358050, 358809, 359521, 360578, 360929, 359332, 356963, 356845, 360415, 366230, 372290, 377968, 383219, 387540, 390753, 393613, 396712, 399564, 401631, 403565, 406619, 411253, 416934, 422958, 428859, 434230, 438650, 441740, 443070, 442205, 439096, 434362, 429105, 424348, 420403, 416631, 412131, 406903, 402019, 398411, 395980, 394256, 393209, 392707, 391848, 389926, 387786, 387206, 389002, 392532, 396795, 401056, 404595, 407081, 409414, 413152, 418716, 424923, 430499, 435242, 439393, 442723, 444771, 445538, 445415, 444737, 443698, 442618, 442130, 443026, 445557, 448674, 450541, 450414, 449639, 450174, 452503, 455680, 458758, 461097, 461750, 460128, 457339, 455531, 455538, 456373, 457292, 458913, 461535, 463639, 463434, 461325, 459622, 459851, 461249, 462003, 461182, 459046, 455866, 451248, 444938, 437927, 432029, 428194, 425745, 423537, 421285, 419443, 418438]
51422D18438J40J484K191J311m89j238k27J113J541J587J920J800P09J5J175L277
51406D34747M248L894L823M750N797O410P148Q216Q739Q123P081O726P267P951
51392E24920P876O862N847O141P698Q645P399M788L100L255M041M036L047J541
51378E99196j42j485j723o97O21J050L77o15j048p10m9L59L73L81P76J521K193
51361F00378K329J796J017O26O31J59j340l037l703l564l995n389o689p202p434
51346E64583p579o834n062l753m122n477o582p396q138p819n622k884j805k421
51332D89089k763j886j020j459k739l487l016j631m3J062J455J519J728K060K242
51317D81111K303K365K206J462Q1j832m195o569q160q689q738q820q781q510q463
$$ y = [418438, 418578, 420062, 422253, 423564, 423075, 421837, 421610, 422723, 424264, 425851, 427771, 429571, 430280, 430295, 431470, 434747, 438995, 442889, 446712, 451462, 457259, 463669, 470817, 479033, 487772, 495895, 502976, 509702, 516969, 524920, 532796, 539658, 545505, 551646, 559344, 567989, 575388, 580176, 583276, 586531, 590572, 594608, 597655, 599196, 599054, 597569, 595846, 595149, 595770, 596820, 597197, 596582, 595534, 594824, 594775, 595134, 595507, 595888, 596664, 598185, 600378, 602707, 604503, 605520, 606146, 606777, 606936, 605596, 602559, 598856, 595292, 591297, 585908, 579219, 572017, 564583, 557004, 550170, 545108, 541355, 537233, 531756, 525174, 517778, 509640, 501821, 496199, 493315, 491510, 489089, 486326, 484440, 483420, 481961, 479222, 475735, 472719, 471088, 471045, 472107, 473562, 475081, 476809, 478869, 481111, 483414, 485779, 487985, 489447, 489528, 487696, 483501, 476932, 468772, 460083, 451345, 442525, 433744, 425234, 416771]
51302D16771q813r043q950r117r729r996r568r282r485r018p093m927m045m122
51288C03583m077l996m115l320r72R08o8k805l979k889k112l175m426m052k711
51273B61794k066k616l895n212n391l480m82J266J120P76J276J336j45j893k100
51258B40288j064k61J03R61K519L976M784M903M198K608P51l98l48P17K199L251
51242B69187L425L325L938M985N099L929K896L084L708L557K767J934N98j858
51228C10574m499n665n146m138l263k158r59o46j524k652l394m316n752o541n393
51213B54528l029j636k111l052k908k090k007k697k742j551m13p37k243l638m313
51198B19361m460m170l513l090l385l655k600k90J688K183J770J616J861J724
$$ y = [416771, 407958, 398915, 389965, 380848, 371119, 361123, 351555, 342273, 332788, 323770, 316677, 311750, 307705, 303583, 299506, 295510, 291395, 288075, 287103, 288011, 287943, 285138, 281159, 278270, 276158, 272983, 268557, 264505, 261794, 259728, 257112, 253217, 248005, 242614, 239134, 238652, 239918, 241038, 241814, 243090, 244426, 244281, 242388, 240288, 239224, 238963, 239066, 240027, 242546, 246522, 251306, 256209, 260407, 263015, 263766, 263368, 263020, 263737, 265936, 269187, 272612, 275937, 279875, 284860, 289959, 293888, 296784, 299868, 303576, 307133, 309900, 311834, 312432, 310574, 306075, 300410, 295264, 291126, 287863, 285705, 284746, 284100, 282576, 279924, 276530, 272214, 266462, 259921, 254528, 251499, 249863, 247752, 244700, 241792, 239702, 237695, 234998, 232256, 230705, 230292, 229555, 227312, 223674, 219361, 214901, 210731, 207218, 204128, 200743, 197088, 194488, 194198, 195886, 198069, 199839, 201455, 203316, 205040]
51184B05040P88m60j222j188n83M15J982L969N195M333J705p04j559j610k054
51169B14047k563j980l11J291K078K052J334L16q8L76N42l58r33L93K404K493
51153B21093P58n2J037J772O61m42N58K494K835J545O83J058J448J001M55O41
51137B37545J111P52p76k430k519l89K488L801L019J785J370J010l72k037k495
51122B41863j881j635k169k392j668q98j093j921k341k129k040k555l089k734
51108B13318j575p16q19j268j214q14o24k91Q32K021J648l15j776j115Q50K274
51092B10416K476J878P89n25j354j321j256k167l670m352l629k348j535j320j191
51077A90891q14l07R4M84J224K291K902K286O93q22j571j631j275o52P9R58K266
$$ y = [205040, 205828, 205368, 204146, 202958, 202375, 202790, 204772, 208741, 213936, 218269, 219974, 219270, 217711, 216101, 214047, 211484, 209504, 209193, 210484, 212562, 214614, 215948, 216264, 216176, 216552, 217094, 216736, 215803, 216196, 218600, 221093, 221851, 221799, 222836, 224608, 225269, 224827, 225385, 227879, 230714, 232259, 232942, 234000, 235448, 236449, 236904, 237545, 238656, 239408, 238632, 236202, 233683, 233294, 235782, 239583, 242602, 244387, 245757, 246767, 246395, 244358, 241863, 239982, 238347, 236178, 233786, 232118, 231220, 230127, 228206, 225865, 223736, 221696, 219141, 216052, 213318, 211743, 211027, 210208, 208940, 207726, 206912, 206288, 205997, 206829, 208850, 210498, 210183, 208407, 207292, 208142, 210416, 212892, 214770, 215559, 215034, 213680, 212359, 211103, 208936, 205266, 200914, 197285, 194937, 193402, 192082, 190891, 190077, 189770, 189864, 190348, 191572, 193863, 196765, 199051, 199744, 198922, 197351, 195720, 194445, 193793, 193872, 194830, 197096]
51060A97096L536L203O45j950j680J107L081K491J211J424K585L116L007K882
51046B21754K147J30k007k533j515k43Q31J909K545K410K456L369L615J388k010
51031B34246l254j433R98K013K321L188M144M183L556L060K623J825R40M21l3
51016B58798r89k178k611j591O15K832L664K742J350J058J757J938R84K1L9L80
51000B68809q8j226j938j812j486j609k080k238j471J29J576J834J096O28J003
50985B61127J189N2j791k471j120J260L112L841L897M031M812O287P627P463N265
50970C04581K294N79Q22J863K463K816L651M503M087K352R13R13J490J161q1j022
50954C33385j073p08k23P94K471M082M941N278N678O117O099N577N172N341N799
$$ y = [197096, 200632, 203835, 204480, 202530, 200850, 201957, 205038, 207529, 208740, 210164, 212749, 215865, 218872, 221754, 223901, 224031, 222024, 219491, 217976, 217733, 218564, 220473, 223018, 225428, 227884, 231253, 234868, 236256, 234246, 230992, 229559, 230557, 232570, 234891, 238079, 242223, 246406, 249962, 253022, 255645, 257470, 258410, 258831, 258798, 257809, 255631, 253020, 251429, 252044, 254876, 258540, 261282, 262632, 263690, 265447, 267385, 268369, 268390, 268429, 268809, 268721, 267495, 265557, 263745, 262259, 260650, 258570, 256332, 254861, 254990, 256566, 258400, 259496, 260124, 261127, 262316, 262368, 260577, 258106, 256986, 258246, 261358, 265199, 269096, 273127, 277939, 284226, 291853, 299316, 304581, 306875, 307454, 308276, 310139, 312602, 315418, 319069, 323572, 327659, 330011, 330924, 331837, 333327, 334488, 334407, 333385, 332312, 331604, 331381, 332175, 334646, 338728, 343669, 348947, 354625, 360742, 366841, 372418, 377590, 382931, 388730]
50939C88730N928N602N343N714O789Q262R772J1078J2132J3198J4576J6045J6931
50926E20100J7091J7342J8277J9201J9169J8744J9631K2412K5767K8233K9721
50915G55688L1021L2869L5965M0755M6413N1038N3734N5704N8383O1497O4191
50904A287258O7238P2443Q0003Q7869R3974R7935J00428J02031J03152J04035
50894B196366J04111J01816R5908Q6901P6635O6503N6378M5467L3817K2440J1952
50883B898294J830q394j7734k4502k8421l0997l3648l6410l8679m0174m0756m0240
50871B560169l9175l8863l9952m1679m3185m4739m7043n0138n3769n7961o2283
50860B041382o5486o6937o7680o8892p0041o9758o7890o5324o2386n8840n5111
$$ y = [388730, 394658, 400260, 405603, 411317, 418106, 426368, 436140, 447218, 459350, 472548, 487124, 503169, 520100, 537191, 554533, 572810, 592011, 611180, 629924, 649555, 671967, 697734, 725967, 755688, 786709, 819578, 855543, 896298, 942711, 993749, 1047483, 1103187, 1161570, 1223067, 1287258, 1354496, 1426939, 1506942, 1594811, 1688785, 1786720, 1887148, 1989179, 2092331, 2196366, 2300477, 2402293, 2498201, 2585102, 2661737, 2728240, 2784618, 2830085, 2863902, 2886342, 2898294, 2900124, 2891730, 2873996, 2849494, 2821073, 2790076, 2756428, 2720018, 2681339, 2641165, 2600409, 2560169, 2520994, 2482131, 2442179, 2400500, 2357315, 2312576, 2265533, 2215395, 2161626, 2103665, 2041382, 1975896, 1908959, 1841279, 1772387, 1702346, 1632588, 1564698, 1499374, 1436988, 1378148, 1323037]
50849A323037n1888m8824m5055m0886l7543l5246l3106l0807k8865k6972k3803
50838I20042j9023j4066j0328p708n496l542j835j26J376J827J140P28J978M541
50824H69508O852P966Q278Q825J0335J2614J4550J5124J4643J4517J5724J8076
50812A017012K1014K4155K6828K8117K8129K8360L0059L2787L5447L8038M1439
50801A351385M5778N0178N4136N8274O3428O9655P6466Q3599R1187R9419J08463
50790B151968J18567J29834J41736J53313J64236J75336J87413J99580K09650
50781C631633K16528K21389K25864K29505K29935K25067K14313J97918J76270
50772E568422J50131J20697Q9151N6730K5240l246k7656m8476o6656q2235r4120
$$ y = [1323037, 1271149, 1222325, 1177270, 1136384, 1098841, 1063595, 1030489, 999682, 970817, 943845, 920042, 901019, 886953, 876625, 868917, 863421, 859879, 858044, 857918, 859294, 861121, 862261, 862989, 864967, 869508, 876360, 884326, 892604, 901429, 911764, 924378, 938928, 954052, 968695, 983212, 998936, 1017012, 1038026, 1062181, 1089009, 1117126, 1145255, 1173615, 1203674, 1236461, 1271908, 1309946, 1351385, 1397163, 1447341, 1501477, 1559751, 1623179, 1692834, 1769300, 1852899, 1944086, 2043505, 2151968, 2270535, 2400369, 2542105, 2695418, 2859654, 3034990, 3222403, 3421983, 3631633, 3848161, 4069550, 4295414, 4524919, 4754854, 4979921, 5194234, 5392152, 5568422, 5718553, 5839250, 5928401, 5985131, 6010371, 6007125, 5979469, 5930993, 5864337, 5782102, 5687982]
50761E687982j01020j02649j00234r5693r0147q3682p6771p1255o8926o9933p3558
50750D754114q0041q9911j01810j12908j22098j31068j41273j51283j58365j61665
50740C503692j62504j62096j60436j57158j52245j45713j37411j27452j16466
50731B182211j05472r5668q7961q2070p6406o9608o2066n5279m9813m4748l9221
50720A413899l3570k8612k4558k1289j9133j8384j8195j6897j3877j0442q276
50709A200666p454o720n456m482m591n192m976l567j823n44N07K109M388O458
50695A169323P396P455P961R681J1812J3266J4583J7437K2028K6416K9060L0972
50683A367390L4105L8506M2474M5205M7791N1525N6418O1740O7015P2105P7051
$$ y = [5687982, 5586962, 5484313, 5384079, 5288386, 5198239, 5114557, 5037786, 4966531, 4897605, 4827672, 4754114, 4674073, 4584162, 4482352, 4369444, 4247346, 4116278, 3975005, 3823722, 3665357, 3503692, 3341188, 3179092, 3018656, 2861498, 2709253, 2563540, 2426129, 2298677, 2182211, 2076739, 1981071, 1893110, 1811040, 1734634, 1665026, 1602960, 1547681, 1497868, 1453120, 1413899, 1380329, 1351717, 1327159, 1305870, 1286737, 1268353, 1250158, 1233261, 1219384, 1208942, 1200666, 1193212, 1186492, 1181036, 1176554, 1171963, 1166771, 1161795, 1158228, 1156405, 1155861, 1156368, 1158477, 1162865, 1169323, 1176719, 1184174, 1192135, 1201816, 1213628, 1226894, 1241477, 1258914, 1280942, 1307358, 1336418, 1367390, 1401495, 1440001, 1482475, 1527680, 1575471, 1626996, 1683414, 1745154, 1812169, 1884274, 1961325]
50672A961325Q2331Q8752R6684J05641J14696J22993J29861J35012J38688J41090
50662C117073J41617J39202J33613J25803J16560J05268R0513P1856N0526K8225
50652D120256N624j7395l9960n9432p3214q1198q5402q7311q6635q2978p7394
50641C434961p1408o5473n9397n3612m8989m5973m4938m6739n1688n8394o4938
50630B823412p1023p7711q5178r1890r6234r7966r7721r5946r2642q7868q2266
50619A846967p7005p2628o7926o1073n2427m4941m0664l8089l4438k9381k4614
50608A303781k0620j6244j1238o896l841j235J490L873N800P945J0367J2367J4241
50595A299790J7371K1872K5774K7486K7856K8941L1841L6359M1591M6211M9241
$$ y = [1961325, 2043656, 2132408, 2229092, 2334733, 2449429, 2572422, 2702283, 2837295, 2975983, 3117073, 3258690, 3397892, 3531505, 3657308, 3773868, 3879136, 3969649, 4041505, 4092031, 4120256, 4125880, 4108485, 4068525, 4009093, 3935879, 3854681, 3769279, 3681968, 3595333, 3512355, 3434961, 3363553, 3298080, 3238683, 3185071, 3136082, 3090109, 3045171, 2998432, 2946744, 2888350, 2823412, 2752389, 2674678, 2589500, 2497610, 2401376, 2303410, 2205689, 2109743, 2017101, 1929233, 1846967, 1769962, 1697334, 1629408, 1568335, 1515908, 1470967, 1430303, 1392214, 1357776, 1328395, 1303781, 1283161, 1266917, 1255679, 1248783, 1244942, 1243707, 1245197, 1249070, 1254870, 1262815, 1273182, 1285549, 1299790, 1317161, 1339033, 1364807, 1392293, 1420149, 1449090, 1480931, 1517290, 1558881, 1605092, 1654333]
50584A654333N1265N3949N7997O2592O6974P1146P4751P6991P8216P9948Q2615
50573B410777Q4907Q6013Q6598Q6634Q4391P9187P3154O8381O3729N6670M7172
50562C227613L7538K8985K0737J2359M964m72m464q069j1436j3713j3930j1903
50550C268209q590n483l298j606O6J380J890J893J873J674P17j503n635j2400
50536C239187k1688l2255m2894n3273o3140p1661p8273q3434q7728r0893r2429
50525B521519r2423r1039q7957q3180p7750p2798o8492o4477o0640n6616n1510
50514A714637m5149l8980l4611l1852k9048k4990j9800j4322r411n463k130J138
50502A460019M188O536Q754J2210J6892K0854K2602K2886K3357K4780K7366L1255
$$ y = [1654333, 1705598, 1759547, 1817544, 1880136, 1947110, 2018256, 2093007, 2169998, 2248214, 2328162, 2410777, 2495684, 2581697, 2668295, 2754929, 2839320, 2918507, 2991661, 3060042, 3123771, 3180441, 3227613, 3265151, 3294136, 3314873, 3327232, 3332196, 3331724, 3327260, 3319191, 3307755, 3294042, 3280112, 3268209, 3259619, 3254136, 3250838, 3249232, 3249298, 3250678, 3252568, 3254461, 3256334, 3258008, 3258725, 3257222, 3251587, 3239187, 3217499, 3185244, 3142350, 3089077, 3025937, 2954276, 2876003, 2792569, 2704841, 2613948, 2521519, 2429096, 2338057, 2250100, 2166920, 2089170, 2016372, 1947880, 1883403, 1822763, 1766147, 1714637, 1669488, 1630508, 1595897, 1564045, 1534997, 1510007, 1490207, 1475885, 1466474, 1461011, 1458881, 1460019, 1464207, 1470743, 1479497, 1491707, 1508599, 1529453, 1552055, 1574941, 1598298, 1623078, 1650444, 1681699]
50490A681699L5489L8059L8464L8854M1052M3758M4602M3693M2956M2901M2427
50479B133954M1438M1274M2604M4869M7793N1652N6015N9995O3906O9057P5702
50468B728259Q2761Q9695R7237J05910J15213J24504J33562J42056J49507J55832
50458C924536J60911J63802J63522J60437J55583J48770J38790J25447J09888
50449E251686R2761P3553N2058K9123N581j8265m1746o3587q3047j00135j14282
50438E083700j23829j27533j25994j21060j14225j05577r3892p7996n8724l9232
50428D095638k2510q887L170J4248K3105K8101K8124K2427J1019m619k2505m1755
50416D125556o2110q2256j00229j15229j27456j36224j40229j39960j37857j35463
$$ y = [1681699, 1717188, 1755247, 1793711, 1832565, 1873617, 1917375, 1961977, 2005670, 2048626, 2091527, 2133954, 2175392, 2216666, 2259270, 2304139, 2351932, 2403584, 2459599, 2519594, 2583500, 2652557, 2728259, 2811020, 2900715, 2997952, 3103862, 3219075, 3343579, 3477141, 3619197, 3768704, 3924536, 4085447, 4249249, 4412771, 4573208, 4728791, 4877561, 5016351, 5141798, 5251686, 5344447, 5418000, 5470058, 5499181, 5504762, 5486497, 5444751, 5381164, 5298117, 5197982, 5083700, 4959871, 4832338, 4706344, 4585284, 4471059, 4365482, 4271590, 4193594, 4134870, 4095638, 4073128, 4064241, 4067411, 4081659, 4104764, 4132865, 4160989, 4183416, 4194435, 4189816, 4167311, 4125556, 4063446, 3981190, 3880961, 3765732, 3638276, 3502052, 3361823, 3221863, 3084006, 2948543]
50406B948543j32017j26493j19386j11683j03568r5142q7100p9804p2632o5079
50396A955639n7546n0410m3458l6741l0866k5799k0511j4611r039m467j20M744
50384A666815R398J2874J5673J8978K2793K6048K8239K9944L1907L4312L6767
50373A933748L8556L9223L9231L9573M0452M0935M0202L8300L5408L1452K7018
50362B344098K3468K1211J8844J5184J1406R728J0382J1377J1299J1020J2196
50351B500213J5040J8498K2055K6372L1941L7875M2773M6514N0239N4375N7706
50340B903601N8954N8447N7135N4737N0141M3203L4738K5044J3910K035r277k0078
50328C272590l1833m4932n7656o8270p6800q3891q9241r2116r2393r0078q4793
$$ y = [2948543, 2816526, 2690033, 2570647, 2458964, 2355396, 2260254, 2173154, 2093350, 2020718, 1955639, 1898093, 1847683, 1804225, 1767484, 1736618, 1710819, 1690308, 1675697, 1666658, 1662191, 1662071, 1666815, 1676213, 1689087, 1704760, 1723738, 1746531, 1772579, 1800818, 1830762, 1862669, 1896981, 1933748, 1972304, 2011527, 2050758, 2090331, 2130783, 2171718, 2211920, 2250220, 2285628, 2317080, 2344098, 2367566, 2388777, 2407621, 2422805, 2434211, 2443939, 2454321, 2465698, 2476997, 2488017, 2500213, 2515253, 2533751, 2555806, 2582178, 2614119, 2651994, 2694767, 2741281, 2791520, 2845895, 2903601, 2962555, 3021002, 3078137, 3132874, 3183015, 3226218, 3260956, 3286000, 3299910, 3301945, 3292668, 3272590, 3240757, 3195825, 3138169, 3069899, 2993099, 2909208, 2819967, 2727851, 2635458, 2545380, 2460587]
50317B460587p6792o7668n8948n0484m1171l0731k0037j0187k080L640P046Q976
50305B122151R884R055N521o32q410j6810k5053l2462l8896m4773n0106n4005
50293A875464n5814n6192n6313n6242n4954n1726m6959m1765l7295l4224l2470
50282A351510l1284k9836k7600k4347k0359j6607j4044j2526j1039r117p157n276
50270A142318k872K50L306N657P647R845J2305J5006J8022K0701K1832K1479K1408
50257A296904K2726K4089K3658K1909K1021K1902K3236K3434K2264K0539J9141
50246A540823J8390J7695J5902J2634R068O722N650M577K560k53l260n930p843
50233A616735q939r879j1519j3983j6610j8705j9871j9856j8622j6704j5067j4492
$$ y = [2460587, 2383795, 2316127, 2257179, 2206695, 2165524, 2134793, 2114756, 2104569, 2102489, 2106129, 2113175, 2122151, 2132035, 2141090, 2146611, 2145979, 2137569, 2120759, 2095706, 2063244, 2024348, 1979575, 1929469, 1875464, 1819650, 1763458, 1707145, 1650903, 1595949, 1544223, 1497264, 1455499, 1418204, 1383980, 1351510, 1320226, 1290390, 1262790, 1238443, 1218084, 1201477, 1187433, 1174907, 1163868, 1154751, 1147594, 1142318, 1139446, 1139696, 1143002, 1148659, 1156306, 1166151, 1178456, 1193462, 1211484, 1232185, 1254017, 1275496, 1296904, 1319630, 1343719, 1367377, 1389286, 1410307, 1432209, 1455445, 1478879, 1501143, 1521682, 1540823, 1559213, 1576908, 1592810, 1605444, 1614512, 1621234, 1626884, 1631461, 1634021, 1633768, 1630508, 1624578, 1616735, 1607796, 1597917, 1586398, 1572415, 1555805, 1537100, 1517229, 1497373, 1478751, 1462047, 1446980, 1432488]
50221A432488j5097j6186j6633j5908j4888j4959j6169j7049j6605j5552j5015
50210A258427j4913j4550j4006j3848j3935j3554j2521j1229r843q368p247o965
50198A117448o961n826k852J065M121M982L654J383l72j056r46j31J658L916N046
50183A125129L856Q60k451m956o060n486l863k746l020l827m116m503o232q762
50169A073823r973q885o901n902o131o478o078n042m014l433l272l248l087k477
50155I98902j057R72K470K498J806K034L216L558K215O91M72P96L14m99n12m81
50139A017395k150n244p547p937p368o749n861m802m671n997p813q928r029q172
50125I25127o398m364l217l254l687m038m589n243n230m579m542n774p258p867
$$ y = [1432488, 1417391, 1401205, 1384572, 1368664, 1353776, 1338817, 1322648, 1305599, 1288994, 1273442, 1258427, 1243514, 1228964, 1214958, 1201110, 1187175, 1173621, 1161100, 1149871, 1140028, 1131660, 1124413, 1117448, 1110487, 1104661, 1101809, 1102874, 1106995, 1111977, 1115631, 1117014, 1116642, 1115586, 1114640, 1114509, 1116167, 1120083, 1125129, 1128985, 1129845, 1127394, 1122438, 1116378, 1110892, 1107029, 1104283, 1101263, 1097436, 1093320, 1088817, 1082585, 1073823, 1063850, 1054965, 1048064, 1042162, 1036031, 1029553, 1023475, 1018433, 1014419, 1010986, 1007714, 1004466, 1001379, 998902, 997845, 998817, 1001287, 1003785, 1005591, 1007625, 1010841, 1014399, 1016614, 1017305, 1017777, 1018573, 1018887, 1018388, 1017876, 1017395, 1015245, 1010001, 1002454, 994517, 987149, 980400, 974539, 969737, 965066, 959069, 951256, 942328, 933299, 925127, 918729, 914365, 911148, 907894, 904207, 900169, 895580, 890337, 885107, 880528, 875986, 870212, 862954, 855087]
50111H55087p897q109q162p120m955k610j040q43k140m140n423n526n697p251
50097G84174r755j1660j2231j1965j1583j1561j2234j3259j3330j1572r020p540
50085F48464p285o513m245j867j344k769m360m373k390O35K904K812M13k395l730
50070F13957l466k578j352M80K240K509J265L41J087K787M215N476P047Q149P849
50055F50006P128P836R741J0582R286P397O762P525R020J0979J2782J3106J1681
50042G73831J0311J0743J2380J3345J3023J2134J1091R764Q470P662O878N397
50030H95029L880L958O011Q505R786R654Q940Q375Q171Q206Q434R207J0796J2413
50016A011365J2635J1339J0295J0841J2084J2778J3839J6934K1133K3388K2575
$$ y = [855087, 847190, 839081, 830919, 823799, 818844, 816234, 815194, 814351, 812211, 808071, 802648, 797122, 791425, 784174, 774419, 762759, 750528, 738563, 726980, 715419, 703185, 689926, 676596, 665024, 656004, 648464, 641179, 634666, 630421, 628554, 627210, 624441, 620081, 615708, 613318, 613953, 616857, 619669, 620082, 617687, 613957, 610491, 607913, 606561, 607041, 609281, 611790, 613055, 613396, 614483, 617270, 621485, 626961, 634008, 642157, 650006, 657134, 664970, 674711, 685293, 694579, 701976, 708738, 716263, 725283, 736262, 749044, 762150, 773831, 784142, 794885, 807265, 820610, 833633, 845767, 856858, 866622, 875092, 882754, 889632, 895029, 898909, 902867, 908878, 917383, 927169, 936823, 945763, 954138, 962309, 970515, 978949, 988156, 998952, 1011365, 1024000, 1035339, 1045634, 1056475, 1068559, 1081337, 1095176, 1112110, 1133243, 1156631, 1179206]
50005A179206K0877K0573K1419K2140K2632K3355K3722K2750K0740J9141J8913
49994A415468J9713K0377J9624J6782J2425Q120N113L481K610J915P80j414m604
49981A520390p780r928j1009j1722j2608j3654j4574j5152j5500j5971j6656j7203
49969A358633j7372j7469j7573j6857j4619j1672r559q472p306n859n377o192
49957A220306o464m525j500q0j104k703k829j381L30J264J232L51j283l479n822
49942A192313p875r383j0202j0283r977j0140j1317j2797j3201j2354j1759j2617
49930A060408j4094j4521j3771j3242j3609j3883j2981j1232r815r287r070q159
49918I16744o253m265l449l703l359j256J595L307L532L356L353L154K694K406
$$ y = [1179206, 1200083, 1220656, 1242075, 1264215, 1286847, 1310202, 1333924, 1356674, 1377414, 1396555, 1415468, 1435181, 1455558, 1475182, 1491964, 1504389, 1512509, 1517622, 1521103, 1523713, 1525628, 1526408, 1524994, 1520390, 1512610, 1502682, 1491673, 1479951, 1467343, 1453689, 1439115, 1423963, 1408463, 1392492, 1375836, 1358633, 1341261, 1323792, 1306219, 1289362, 1274743, 1263071, 1253512, 1245040, 1237734, 1231875, 1226498, 1220306, 1213842, 1209317, 1207817, 1207737, 1206633, 1203930, 1201101, 1199720, 1200050, 1201314, 1202546, 1202897, 1201614, 1198135, 1192313, 1184438, 1175055, 1164853, 1154570, 1144593, 1134453, 1123136, 1110339, 1097138, 1084784, 1073025, 1060408, 1046314, 1031793, 1018022, 1004780, 991171, 977288, 964307, 953075, 943260, 933973, 924903, 916744, 910491, 906226, 902777, 899074, 895715, 894459, 896054, 899361, 902893, 906249, 909602, 912756, 915450, 917856]
49904I17856K147J327K35k06K5J24J11O93J303J98k861n988q020j0089j3244j6339
49888H67272j7880j8402j9207j9927j9329j7803j7030j7358j7299j5764j3390
49877F73883j1398j0241r689r350q872q050o944n632m013k157n54M02P76P39L13
49862E99213k12l00j3j98j250k408k746k288j522o23K50O34M94N48J018R06n39
49845E90964k306k734j765j001j648l268m381l878k048n42p71k076k444j366n77
49830E60159j240k001j246K31O94M93J293L015L783K908J753J440J641K029L063
49815E78015M744O031O263N947N695N452N164N147N458N855O581Q080R867J0938
49801F69237J1374J2138J3268J3849J4023J5050J6780J7201J5482J3557J3258
$$ y = [917856, 920003, 921330, 921565, 921359, 921384, 921508, 921619, 922312, 923615, 923813, 920952, 914964, 906944, 896855, 883611, 867272, 849392, 830990, 811783, 791856, 772527, 754724, 737694, 720336, 703037, 687273, 673883, 662485, 652244, 642555, 633205, 624333, 616283, 609339, 603707, 599694, 597537, 596983, 597385, 598161, 598900, 599213, 599001, 598701, 598688, 598490, 597240, 594832, 592086, 589798, 588276, 587653, 587903, 588537, 589031, 589579, 590597, 591503, 590964, 588658, 585924, 584159, 583158, 581510, 578242, 573861, 569983, 567935, 567393, 566622, 564546, 562102, 560736, 560159, 558919, 556918, 555672, 555903, 556597, 557090, 558383, 561398, 565181, 568089, 569842, 571282, 572923, 574952, 578015, 582759, 588790, 595053, 601000, 606695, 612147, 617311, 622458, 627916, 633771, 640352, 648432, 658299, 669237, 680611, 692749, 706017, 719866, 733889, 748939, 765719, 782920, 798402, 811959, 825217]
$$ [...]
##END NTUPLES=NMR SPECTRUM
##END=
