
##TITLE=AC1192_Venezuela-rubio_5898970_KtoYcdMkwf
##JCAMPDX= 6.0         $$ Bruker NMR JCAMP-DX V2.0
##DATA TYPE= NMR SPECTRUM
##DATA CLASS= NTUPLES
##ORIGIN= BRUKER
##OWNER= Administrator
$$ 1.72 TOPSPIN		Version 2.1
$$ 2012-04-10 10:21:51.812 -0500  Administrator@TOPSPIN
$$ Compression mode = diff/dup
##.OBSERVE FREQUENCY= 400.13188235
##.OBSERVE NUCLEUS= ^1H
##.ACQUISITION MODE= SIMULTANEOUS (DQD)
##.ACQUISITION SCHEME= undefined
##.AVERAGES= 64
##.DIGITISER RES= 22
##SPECTROMETER/DATA SYSTEM= spect
##.PULSE SEQUENCE= noesygpps1d.comp
##.SOLVENT NAME= COFFEE_meoh
##.SHIFT REFERENCE= INTERNAL, COFFEE_meoh, 1, 14.96854
##AUDIT TRAIL= $$ (NUMBER, WHEN, WHO, WHERE, PROCESS, VERSION, WHAT)
$$ ##TITLE= Audit trail, TOPSPIN		Version 2.1
$$ ##JCAMPDX= 5.01
$$ ##ORIGIN= Bruker BioSpin GmbH
$$ ##OWNER= Administrator
$$ $$ C:\Bruker\TOPSPIN/data/COFFEE/nmr/AC1192_Venezuela-rubio_5898970_KtoYcdMkwf/12/pdata/1/auditp.txt
$$ ##AUDIT TRAIL=  $$ (NUMBER, WHEN, WHO, WHERE, PROCESS, VERSION, WHAT)
(   1,<2012-04-04 20:34:39.796 -0500>,<Administrator>,<TOPSPIN>,<go>,<TOPSPIN 2.1>,
      <created by zg
	started at 2012-04-04 20:23:08.093 -0500,
	POWCHK enabled, PULCHK disabled,
       configuration hash MD5:
       1A 1E CE 29 27 FD 77 03 67 4E F0 E3 C4 B2 CB 90
       data hash MD5: 64K
       AE 36 93 4B 26 5B 11 61 10 4E A5 79 36 82 55 CA>)
(   2,<2012-04-04 20:34:42.500 -0500>,<Administrator>,<TOPSPIN>,<proc1d>,<TOPSPIN 2.1>,
      <Start of raw data processing
       efp LB = 0.3 FT_mod = 6 PKNL = 1 PHC0 = 0 PHC1 = 0 SI = 128K 
       data hash MD5: 128K
       5C 27 5A 71 E4 DD 43 09 CC 4D 14 85 04 7B AC B3>)
(   3,<2012-04-04 20:34:43.703 -0500>,<Administrator>,<TOPSPIN>,<proc1d>,<TOPSPIN 2.1>,
      <pk PHC0 = 32.75024 PHC1 = 0 
       data hash MD5: 128K
       32 64 F8 F1 FD F4 C2 70 75 D6 A4 E3 59 D6 1D 08>)
(   4,<2012-04-04 20:34:43.937 -0500>,<Administrator>,<TOPSPIN>,<proc1d>,<TOPSPIN 2.1>,
      <abs ABSG = 1 
       data hash MD5: 128K
       94 06 BF 87 84 41 6B B0 6F 6A 6F F1 DD 03 20 9A>)
(   5,<2012-04-04 20:34:44.046 -0500>,<Administrator>,<TOPSPIN>,<proc1d>,<TOPSPIN 2.1>,
      <abs ABSG = 2 
       data hash MD5: 128K
       29 8C 05 8A 07 AD 5E 6D DA 1E 9F B0 98 84 1C 3F>)
(   6,<2012-04-04 20:34:44.234 -0500>,<Administrator>,<TOPSPIN>,<proc1d>,<TOPSPIN 2.1>,
      <abs ABSG = 3 
       data hash MD5: 128K
       08 57 5F 19 63 68 45 13 34 87 5D 29 46 9D E3 69>)
(   7,<2012-04-04 20:34:44.296 -0500>,<Administrator>,<TOPSPIN>,<proc1d>,<TOPSPIN 2.1>,
      <abs ABSG = 4 
       data hash MD5: 128K
       9C EA FE 3A 04 F9 DC E5 25 69 B2 A0 27 17 72 8B>)
(   8,<2012-04-04 20:34:44.359 -0500>,<Administrator>,<TOPSPIN>,<proc1d>,<TOPSPIN 2.1>,
      <abs ABSG = 5 
       data hash MD5: 128K
       2C 3E 06 63 ED 27 15 D0 98 07 83 20 32 B4 82 07>)
(   9,<2012-04-04 20:34:44.593 -0500>,<Administrator>,<TOPSPIN>,<audit>,<TOPSPIN 2.1>,
      <user comment:
       ICON-NMR User ID: COFFEE
       data hash MD5: 128K
$$ [...]
##$TP07= 0
##$TPNAME0= <>
##$TPNAME1= <>
##$TPNAME2= <>
##$TPNAME3= <>
##$TPNAME4= <>
##$TPNAME5= <>
##$TPNAME6= <>
##$TPNAME7= <>
##$TPOAL= (0..7)
0.5 0.5 0.5 0.5 0.5 0.5 0.5 0.5
##$TPOFFS= (0..7)
0 0 0 0 0 0 0 0
##$TUNHIN= 0
##$TUNHOUT= 0
##$TUNXOUT= 0
##$USERA1= <user>
##$USERA2= <user>
##$USERA3= <user>
##$USERA4= <user>
##$USERA5= <user>
##$V9= 5
##$VALIST= <valist>
##$VCLIST= <CCCCCCCCCCCCCCC>
##$VD= 0
##$VDLIST= <DDDDDDDDDDDDDDD>
##$VPLIST= <PPPPPPPPPPPPPPP>
##$VTLIST= <TTTTTTTTTTTTTTT>
##$WBST= 2048
##$WBSW= 25
##$XGAIN= (0..3)
0 0 0 0
##$XL= 0
##$YL= 0
##$YMAX_a= 13343291
##$YMIN_a= -5642287
##$ZGOPTNS= <>
##$ZL1= 120
##$ZL2= 120
##$ZL3= 120
##$ZL4= 120
##$ABSF1= 14.96854
##$ABSF2= -5.58399
##$ABSG= 5
##$ABSL= 3
##$ALPHA= 0
##$AQORDER= 0
##$ASSFAC= 0
##$ASSFACI= 0
##$ASSFACX= 0
##$ASSWID= 0
##$AUNMP= <proc_prof1d_extract.lims>
##$AXLEFT= 0
##$AXNAME= <>
##$AXNUC= <1H>
##$AXRIGHT= 0
##$AXTYPE= 0
##$AXUNIT= <>
##$AZFE= 0.1
##$AZFW= 0.1
##$BCFW= 0
##$BC_mod= 0
##$BYTORDP= 0
##$COROFFS= 0
##$CY= 15
##$DATMOD= 1
##$DC= 0
##$DFILT= <>
##$DTYPP= 0
##$F1P= 0
##$F2P= 0
##$FCOR= 0.5
##$FTSIZE= 131072
##$FT_mod= 6
##$GAMMA= 0
##$GB= 0
##$INTBC= 1
##$INTSCL= 1
##$ISEN= 128
##$LB= 0.3
##$LEV0= 0
##$LPBIN= 0
##$MAXI= 10000
##$MC2= 0
##$MEAN= 0
##$ME_mod= 0
##$MI= 0
##$NCOEF= 0
##$NC_proc= -3
##$NLEV= 6
##$NOISF1= 0
##$NOISF2= 0
##$NSP= 0
##$NTH_PI= 0
##$NZP= 0
##$OFFSET= 14.96854
##$PC= 1
##$PHC0= 32.75024
##$PHC1= 0
##$PH_mod= 1
##$PKNL= yes
##$PPARMOD= 0
##$PPDIAG= 0
##$PPIPTYP= 0
##$PPMPNUM= 2147483647
##$PPRESOL= 1
##$PSCAL= 4
##$PSIGN= 0
##$PYNMP= <proc.py>
##$REVERSE= no
##$SF= 400.130004832214
##$SI= 131072
##$SIGF1= 0
##$SIGF2= 0
##$SINO= 400
##$SIOLD= 131072
##$SPECTYP= <>
##$SREGLST= <1H.CDCl3>
##$SSB= 0
##$STSI= 131072
##$STSR= 0
##$SW_p= 8223.68421052632
##$SYMM= 0
##$S_DEV= 0
##$TDeff= 65536
##$TDoff= 0
##$TI= <>
##$TILT= no
##$TM1= 0
##$TM2= 0
##$TOPLEV= 0
##$USERP1= <user>
##$USERP2= <user>
##$USERP3= <user>
##$USERP4= <user>
##$USERP5= <user>
##$WDW= 1
##$XDIM= 131072
##$YMAX_p= 482854641
##$YMIN_p= -334631691
##$CURPLOT= <Network HP LaserJet P1505>
##$CURPRIN= <$Network HP LaserJet P1505>
##$DFORMAT= <normdp>
##$LAYOUT= <+/1D_H.xwp>
##$LFORMAT= <normlp>
##$PFORMAT= <normpl>
##$SURQMSG= 1
$$ End of Bruker specific parameters
$$ ---------------------------------
##NTUPLES= NMR SPECTRUM
##VAR_NAME=  FREQUENCY,     SPECTRUM/REAL,   SPECTRUM/IMAG
##SYMBOL=    X,             R,               I
##VAR_TYPE=  INDEPENDENT,   DEPENDENT,       DEPENDENT
##VAR_FORM=  AFFN,          ASDF,            ASDF
##VAR_DIM=   131072,        131072,          131072
##UNITS=     HZ,            ARBITRARY UNITS, ARBITRARY UNITS
##FACTOR=    0.0627417313425165, 1,          1
##FIRST=     8223.62146879498, -1400,        -99275
##LAST=      0,             2789,            -97976
##MIN=       0,             -334631691,      0
##MAX=       8223.62146879498, 482854641,    0
$$ Real data points
##PAGE= N=1
##DATA TABLE= (X++(R..R)), XYDATA
$$ [...]
64008 587767 580049 573094 566954 561454 556037 550639 546444 544826 545567 547076 548348 549808 552132 555305
63994 555305 559188 564122 570537 578649 588743 600890 614081 626696 638467 651037 665862 682455
63982 682455 699702 718017 738723 761645 784832 806786 827807 848825 869971 890740 910706
63971 910706 929514 946921 963357 979839 996674 1012734 1026735 1038916 1050776 1063314 1076187
63960 1076187 1088569 1100169 1111208 1121878 1132163 1142010 1151409 1160300 1168463 1175551 1181356 1186096 1190283
63947 1190283 1194262 1198289 1203311 1211191 1223398 1239481 1257498 1276152 1296024 1318590 1344680 1374348
63935 1374348 1407623 1444682 1485413 1529440 1576509 1626450 1678969 1734171 1793261 1858017 1929394
63924 1929394 2007203 2091223 2181815 2279062 2382250 2491061 2606681 2730631 2862765 3001599
63914 3001599 3146838 3300626 3465882 3644131 3835440 4039795 4257879 4491079 4741625
63905 4741625 5012643 5307398 5628505 5978473 6361144 6782162 7247932 7764369 8336679
63896 8336679 8969858 9669077 10439478 11285293 12208613 13208690 14282393 15424913 16629440
63887 16629440 17886057 19181397 20499400 21821835 23127891 24393892 25594133 26702203
63879 26702203 27692022 28539146 29223039 29729108 30048633 30176654 30110082 29847858 29392868
63870 29392868 28754003 27946924 26992989 25916765 24743419 23497233 22201433 20878460
63862 20878460 19549816 18235434 16952940 15717115 14539619 13428951 12390595 11427305
63854 11427305 10539554 9726014 8983904 8309244 7697323 7143427 6643291 6192781 5787199
63845 5787199 5421130 5089286 4787580 4513270 4263965 4036654 3827985 3635473 3457950
63836 3457950 3294496 3143249 3001804 2868586 2743136 2624938 2512683 2404998 2301290
63827 2301290 2201450 2105380 2013495 1927040 1846730 1771217 1698011 1626181 1557159 1492504 1431907
63816 1431907 1374118 1318985 1267476 1220048 1176032 1134619 1095529 1058628 1023724 990993 960784
63805 960784 932566 904834 876744 849468 825222 805111 788433 773793 760222 747304 735022
63794 735022 723832 714312 706375 699190 692213 685958 681314 678297 675921 673254 670177 667031 663877 660344
63780 660344 655988 650451 643298 634075 622826 610340 597383 583632 568078 550915 534398 520798
63768 520798 509687 498309 484860 470316 456587 444042 431837 419679 407855 395982 383375
63757 383375 370697 359742 351135 343488 335542 327967 322059 317516 312704 306837 300783 295702 291671 287800
63743 287800 283172 277630 272101 268141 266740 267473 269004 270274 270829 270346 268572 265886 263334 261685 260625
63728 260625 259131 256632 253716 251591 250806 250653 250111 249235 248957 249391 249231 247387 244501 241945 239871 237394
63712 237394 234453 232165 231069 230187 228350 225561 222521 219718 217729 217599 219719 222598 223856 222591 220048
63697 220048 217872 216433 215103 213416 211412 209258 207167 205598 204978 205151 205504 205863 206868 209147 212301
63682 212301 215193 217164 218506 219597 220127 219629 218480 217845 218578 220495 222723 224474 225498 226082 226731 227737
63666 227737 229155 231163 234060 237572 240590 242173 242619 242905 243223 242923 241958 241418 242157 243614 244659 245152
63650 245152 245957 247650 249876 251954 253618 255110 256957 259724 263596 267950 271505 273141 272732 271111 269070
63635 269070 266351 261870 255242 247889 242154 239326 238894 239563 240367 240793 240675 240426 240762 241803 242970 244111
63619 244111 245963 248867 251799 253646 254838 256561 258720 260089 260566 261794 264951 269037 272174 273741
63605 273741 274370 274595 274638 275097 276558 278459 279442 279160 278744 278953 278747 276675 273273 270956 271384 273736 275954
63588 275954 277074 277799 279213 281649 284898 288927 294048 300425 307587 314468 320085 324331 328100 332565
63574 332565 338443 345991 355328 366386 378696 391663 405111 419395 435065 452615 472261 493463
63562 493463 514957 535880 556861 579387 604135 630677 658782 689004 721489 755111 788507
63551 788507 821448 854466 887424 919046 947529 971148 988618 999588 1004761 1005282 1002281 997118
63539 997118 991212 984905 977120 967062 955816 945247 935626 925331 912662 896868 877668 855279
63527 855279 831217 807776 786037 765300 744815 725044 706614 689186 672408 657179 644887
63516 644887 635755 628819 623128 618072 612919 607266 602016 598909 598788 601009 604830 610624 619244 630611
63502 630611 643528 656879 670700 686032 703888 724445 747220 771895 798740 828173 860103
63491 860103 893822 928289 962354 994902 1025055 1052059 1074833 1091922 1102272 1106016 1104358 1098997
63479 1098997 1091912 1085220 1080355 1077132 1073932 1068924 1061039 1049997 1035877 1018683 998004 973137 943845
63466 943845 910975 876062 840457 805186 771324 739745 710348 682255 654988 628934 604425
63455 604425 581054 558402 536970 517768 501201 486780 473719 461440 449788 439271 430922 425349
63443 425349 421884 419047 415796 411988 407848 403612 399757 396872 395024 393683 392659 392706 394810 399022 404364
63428 404364 409815 415033 420123 424954 428940 431501 432656 433061 433502 434544 436682 440348 445184 449518 451304
63413 451304 449988 447133 444977 444600 445451 446130 445416 443159 440637 439641 440813 443299 446400 450820 457543
63398 457543 466055 474779 482917 490693 497849 503279 506576 508819 511292 514347 518076 523025 529302 535847
63384 535847 541752 547855 555961 566806 579805 594466 610766 628166 645627 663134 682343 705174
63372 705174 732334 763374 797365 833157 869870 907891 948801 993634 1041535 1090651 1139864
63361 1139864 1189021 1237944 1286035 1332465 1375833 1413802 1444142 1466373 1481531 1490140 1491465 1485496
63349 1485496 1474785 1463049 1451997 1440329 1425968 1408450 1388721 1367279 1343274 1315367 1282986
63338 1282986 1246808 1208503 1170043 1132722 1096484 1060505 1024676 990221 958487 929406 901768
63327 901768 875057 850457 829827 813957 802068 792693 784794 778200 773402 771126 772047 776710 785309
63314 785309 797278 811401 826988 844962 867091 893842 923571 954263 985569 1018495 1053564
63303 1053564 1090165 1127627 1166083 1205983 1247190 1288576 1327986 1362610 1390233 1410580 1425025
63292 1425025 1434631 1438903 1436783 1428448 1415632 1400547 1384891 1369528 1354424 1338863 1322051 1303464
63280 1303464 1282507 1258386 1230952 1201303 1170736 1139200 1105618 1069851 1033508 998523 965583
63269 965583 934371 904632 876375 849401 823340 798183 774480 753059 734553 718777 704458
63258 704458 690181 676047 663783 654617 647627 641064 634839 630475 628603 627734 625995 623126 620064 617221
63244 617221 614091 610342 606512 603413 601254 599481 597395 594867 592447 590699 589476 588088 586193 584168
63230 584168 582546 581481 581006 581413 583015 585740 589233 593204 597422 601513 605062 607769 609413 609975 610075
63215 610075 611005 613816 618367 623532 628282 632331 635865 639052 641974 644918 648661 654362 662822 673610
63201 673610 685106 695707 704884 713011 720577 727996 735907 744946 755111 765753 776409 787404 799470
63188 799470 812932 827371 842056 856656 871519 887175 903670 920742 938713 958712 981585
63177 981585 1006938 1033771 1061931 1092405 1126167 1163107 1202064 1241541 1280414 1318436 1356171
63166 1356171 1394152 1432110 1469427 1506302 1543874 1582871 1622514 1661131 1697732 1732683 1766931
63155 1766931 1800831 1833764 1864696 1892885 1917928 1939232 1955687 1966044 1969552 1966213 1956530 1940990
63143 1940990 1919650 1892300 1859463 1823182 1786212 1750110 1714673 1679619 1646220 1616555 1591652
63132 1591652 1571152 1554646 1542567 1535807 1535114 1540789 1552329 1568342 1587433 1609218 1634061 1662119
63120 1662119 1693323 1727903 1765890 1806167 1847123 1888250 1929943 1971632 2011588 2049188 2085872
63109 2085872 2122794 2158563 2190573 2217751 2240553 2258751 2270915 2276241 2275461 2269226 2256402 2234751
63097 2234751 2203010 2161948 2113754 2060872 2005306 1948449 1891198 1834197 1778171 1724109 1672880
63086 1672880 1624513 1578116 1533010 1489819 1449976 1414259 1382415 1354173 1329663 1308464 1289101
63075 1289101 1270157 1251411 1233406 1216473 1200873 1187313 1176420 1167838 1160491 1153637 1147140 1141046
63063 1141046 1135627 1131611 1129518 1128775 1128188 1127421 1127356 1128831 1131542 1134397 1136563 1138034 1139551 1142070 1145993
63048 1145993 1150829 1155814 1160858 1166639 1173855 1182631 1192418 1202084 1210322 1216605 1221762 1227169 1233390 1240095
63034 1240095 1247099 1254732 1263002 1271108 1278254 1284523 1290646 1297202 1304397 1312302 1320885 1329880 1338983 1348283
63020 1348283 1358311 1369609 1382285 1396112 1411059 1427508 1445661 1464935 1484464 1504339 1525761
63009 1525761 1549673 1575798 1603435 1632574 1663581 1696324 1730536 1766702 1805565 1846886 1889833
62998 1889833 1934645 1982746 2034804 2089769 2146467 2205324 2267665 2333928 2403378 2475174 2548864
62987 2548864 2624031 2700374 2778212 2858171 2939919 3021600 3100971 3177220 3251608 3326279 3402299
62976 3402299 3478824 3554165 3627443 3698880 3768538 3835318 3897544 3954187 4005090 4050015 4087723
62965 4087723 4116045 4132693 4136086 4125494 4100607 4061411 4008908 3945788 3875790 3802150 3726899
62954 3726899 3651475 3577244 3505194 3435956 3370888 3312753 3264579 3227903 3202548 3187822 3183171
62943 3183171 3187887 3201131 3222641 3252759 3291250 3336530 3386470 3439827 3496668 3557737 3623632
62932 3623632 3694005 3766870 3838941 3907563 3972513 4035304 4096564 4154686 4207203 4252584 4289967
62921 4289967 4317781 4333675 4335659 4322522 4293335 4247649 4186322 4111023 4022425 3919907 3803892
62910 3803892 3677803 3546692 3414199 3281538 3149100 3018009 2890110 2767289 2651049
62901 2651049 2542086 2440053 2344130 2253992 2169937 2092142 2020269 1953834 1892440 1835645 1783163
62890 1783163 1735253 1692238 1653422 1617159 1582473 1550141 1521496 1496300 1472441 1447991 1423224
62879 1423224 1400155 1380031 1361752 1343180 1323694 1304546 1286654 1269123 1250584 1231031 1211322
62868 1211322 1191652 1171974 1153528 1138245 1126320 1115727 1104574 1092750 1080858 1068977 1057314
62857 1057314 1046868 1038182 1030199 1021542 1012408 1004105 997150 990985 985302 980416 976167 971464 965403 958302
62843 958302 951358 945511 940714 936102 931030 926149 923112 922794 924130 925159 924842 923314 920967 918265 916157
62828 916157 915456 915582 914843 912225 908218 903724 899024 894179 889612 885622 881821 877727 873644 870458 868656
62813 868656 867832 867026 865383 862672 859372 855999 852404 848099 843257 838648 834256 828718 820924 811654 802760
62798 802760 794918 787131 778611 770254 763735 759649 757067 754657 751719 748258 744600 741115 738047 735381
62784 735381 732873 730258 727392 724320 721387 719279 718617 719258 720174 720362 719909 719839 720774 722075 722623 722211 721755
62767 721755 722212 723796 726332 729755 733865 738011 741653 745018 748609 752178 754923 756757 758676 761588
62753 761588 765539 770515 777131 785671 795088 804092 812916 822830 834041 845431 856655 869087 883977
62740 883977 900858 918817 938378 960762 985730 1011482 1036729 1061963 1088655 1118105 1151064
62729 1151064 1187619 1227231 1269505 1315052 1365080 1420152 1479828 1543440 1610572 1681038 1755356
62718 1755356 1835282 1922856 2018496 2120640 2227481 2338416 2453603 2572781 2694788 2817633
62708 2817633 2938786 3055850 3166904 3269652 3360547 3435875 3493685 3533475 3553986 3553029 3530253
62697 3530253 3488621 3432002 3362147 3278988 3182972 3076048 2961204 2842122 2722483 2604292
62687 2604292 2487347 2371484 2258762 2152125 2052350 1957809 1867253 1781589 1702724 1631577
62677 1631577 1567341 1507965 1451482 1397775 1348987 1307379 1272845 1243170 1216370 1191782 1169326
62666 1169326 1149132 1132039 1119189 1110721 1105671 1103276 1103426 1105744 1109338 1113886 1120228 1129527 1142478
62653 1142478 1159261 1179423 1201849 1225881 1252571 1283784 1319934 1359817 1402829 1450010 1502460
62642 1502460 1560130 1622840 1691215 1765764 1846260 1933035 2027759 2131608 2243446 2361006 2483293
62631 2483293 2610508 2741971 2875342 3007848 3137272 3261689 3378992 3486714 3581854 3661007
62621 3661007 3721096 3759802 3775204 3765946 3732550 3677906 3605433 3517102 3414064 3298593 3174137
62610 3174137 3043659 2909178 2772896 2637474 2504831 2375667 2250668 2131352 2019230
62601 2019230 1914726 1817414 1726811 1642398 1563238 1488309 1417419 1351502 1291734 1238332 1190369
62590 1190369 1146832 1107449 1072014 1039370 1008071 978071 950519 925474 901142 876332 852429
62579 852429 831554 813738 797538 782711 770215 759669 748952 736814 724188 712315 701319
62568 701319 691455 684061 679808 677153 673989 670128 666837 664511 662267 659631 657328 656292 656857 658998
62554 658998 662563 667081 672051 677554 684122 691929 700624 710022 720490 732556 746469 762202 779580
62541 779580 798395 818642 840586 864524 890748 919880 952794 989825 1030477 1074396 1122186
62530 1122186 1174568 1230989 1289730 1349279 1409054 1468972 1528859 1587984 1644502 1695667 1739378
62519 1739378 1775228 1803224 1821919 1829127 1824430 1809579 1786256 1754881 1716148 1672113 1624645 1573973
62507 1573973 1520126 1464950 1411151 1359726 1309819 1261095 1214814 1172122 1132418 1094169 1056837
62496 1056837 1021358 988936 959808 933246 908628 886338 867292 851500 837577 824094 810949
62485 810949 798754 787257 775415 763095 751734 742857 736519 731677 727556 724198 721969 721126 721873
62472 721873 724446 729001 735445 743479 752935 764051 777157 791934 807456 823502 841451 863063
62460 863063 888439 916054 944905 975732 1009791 1047369 1088227 1132820 1182100 1236330 1294849
62449 1294849 1356923 1422177 1490260 1560631 1632708 1705607 1777535 1845828 1907879 1961938 2007027
62438 2007027 2042356 2066963 2079827 2080379 2068943 2046484 2013725 1970783 1918113 1857684 1792673 1725789
62426 1725789 1658235 1590354 1522902 1457351 1395206 1337411 1284357 1236020 1191917 1151257 1113523
62415 1113523 1079004 1048394 1021674 997550 974355 951627 930608 913072 899661 889266 879829
62404 879829 869843 859377 849887 842970 839236 838230 839131 841238 844018 847227 851072 855928 861857 868657
62390 868657 876210 884329 892398 899925 907500 916331 926402 935793 942437 946084 947926 948667 947652 943651
62376 943651 935944 924791 911400 897316 883290 868811 853132 836579 820278 804720 789349 773805
62364 773805 759042 746743 737724 731174 725460 719570 713683 708489 704354 701447 700276 701398 704578 708883
62350 708883 713819 719781 727293 736520 747662 760857 775210 788947 801283 813267 826011 838985
62338 838985 851204 863153 876065 889701 902380 913062 922013 929473 935126 939077 942008 943970 944214
62325 944214 942621 940325 938556 937871 938746 941765 946699 952406 958204 964537 972016 980944 992242 1007556
62311 1007556 1027612 1051528 1078589 1109680 1146025 1187539 1233604 1284589 1341195 1402872 1468308
62300 1468308 1537180 1610083 1686860 1766330 1847603 1930198 2012479 2091183 2163196 2226952 2281455
62289 2281455 2324846 2355102 2372018 2377501 2373471 2359992 2335949 2301321 2257963 2207940 2151897 2089861
62277 2089861 2023173 1954542 1886221 1819316 1754965 1694701 1638790 1585449 1532956 1481805 1433596
62266 1433596 1388475 1345262 1303807 1265486 1230990 1199051 1168152 1138634 1112424 1091211 1075338
62255 1075338 1063816 1054731 1046215 1037832 1030918 1026940 1025561 1024801 1022970 1019961 1016573 1013220 1009675 1005716
62241 1005716 1001380 996521 990618 983335 975090 966758 958941 951677 944736 937990 931640 926359 922918 921260
62227 921260 920218 918741 917295 917497 920463 926173 934249 944336 955614 967070 978777 991984 1007376
62214 1007376 1024207 1041911 1061658 1085102 1112076 1140690 1169664 1199606 1231937 1267392 1305892
62203 1305892 1347367 1392346 1441700 1495730 1553636 1614372 1677973 1745170 1815312 1885612 1953041
62192 1953041 2016057 2073658 2123807 2164239 2194402 2215269 2227500 2230907 2225394 2210969 2186938 2152519
62180 2152519 2108565 2057528 2001585 1941930 1879966 1817783 1756946 1697991 1641490 1588363 1538604
62169 1538604 1491145 1445970 1405128 1370421 1340953 1314355 1289828 1268532 1251164 1236722 1223996
62158 1223996 1213072 1204574 1198207 1192957 1188576 1185963 1185657 1186434 1186170 1184246 1182406 1182694 1184939 1187077 1187847
62143 1187847 1188269 1190194 1194145 1199194 1204438 1209958 1216363 1223899 1232227 1240989 1250420 1261241 1273771 1287330
62129 1287330 1300748 1313461 1326069 1340094 1357204 1378009 1401174 1424374 1446787 1470025 1495826
62118 1495826 1523593 1551562 1579724 1609766 1642239 1675903 1710420 1747765 1789853 1836338 1885953
62107 1885953 1938630 1994699 2053047 2111743 2169855 2227023 2281694 2331446 2374930 2411944 2441739
62096 2441739 2463039 2476198 2483805 2488295 2489888 2487408 2480035 2467470 2449369 2425913 2398799 2370733
62084 2370733 2343755 2318362 2294116 2270727 2248631 2228832 2212111 2198223 2186082 2174954 2165172
62073 2165172 2157377 2151367 2146302 2141918 2138881 2137798 2138554 2141030 2145857 2153618 2163488 2173638 2183262 2193509
62059 2193509 2205998 2221078 2238172 2257196 2278680 2302658 2328420 2355452 2383828 2413604 2444626
62048 2444626 2477190 2512097 2549676 2589404 2630880 2674538 2720983 2770250 2822130 2876581 2933242
62037 2933242 2991134 3049454 3108118 3166881 3224582 3280157 3334048 3387798 3442566 3498910 3557610
62026 3557610 3619402 3683648 3748206 3811013 3871348 3929587 3986460 4042788 4099238 4156006 4213067
62015 4213067 4270867 4330354 4392324 4457287 4526001 4599352 4677305 4758491 4841351 4925535 5011973
62004 5011973 5101740 5194757 5289154 5381725 5469428 5550782 5625793 5694738 5757488 5813895 5864060
61993 5864060 5908048 5945965 5978675 6007783 6034408 6058362 6078999 6096490 6111730 6125334 6137375
61982 6137375 6148043 6158030 6168259 6179529 6192319 6206426 6220817 6234320 6246797 6259344 6273117
61971 6273117 6288086 6303028 6316517 6327655 6336079 6341942 6346208 6350514 6356041 6362357 6367828 6371321 6373158
61958 6373158 6374305 6375215 6375813 6376022 6375665 6374166 6371050 6366472 6360646 6353170 6343904 6334279 6326486 6321094 6316626
61943 6316626 6311854 6307331 6303990 6301373 6298368 6294950 6291989 6289744 6287626 6285182 6282175 6277886 6271491 6263213
61929 6263213 6253979 6243696 6230881 6214470 6195180 6174511 6153054 6130299 6105628 6078922 6050511
61918 6050511 6021023 5991127 5961049 5930366 5898367 5864505 5828659 5791398 5753875 5716839 5679647
61907 5679647 5640929 5600333 5558838 5517143 5474720 5430953 5386364 5342054 5298803 5257408 5218980
61896 5218980 5183678 5149760 5115120 5079472 5044022 5009532 4976083 4944407 4915691 4889773 4865081
61885 4865081 4840880 4818309 4798574 4781420 4766233 4753566 4744360 4738315 4734092 4730866 4728971 4729412 4733386
61872 4733386 4741912 4755256 4772958 4794908 4821995 4855197 4894465 4939015 4988295 5042306 5101666
61861 5101666 5167974 5243359 5328855 5423887 5528255 5643873 5773390 5917765 6076631 6250756
61851 6250756 6442692 6655149 6890373 7151435 7442619 7767784 8129259 8528858 8968960
61842 8968960 9451881 9978791 10549607 11162928 11815035 12498900 13203993 13915935 14615314
61833 14615314 15277039 15871493 16367055 16733364 16945583 16989073 16862224 16575939 16150583
61824 16150583 15612050 14987970 14304931 13587356 12857039 12131775 11423925 10741240 10089493
61815 10089493 9473679 8896822 8359208 7859841 7397941 6972488 6581313 6221653 5891070
61806 5891070 5587269 5307862 5051206 4816738 4603494 4408887 4229955 4065273 3914644
61797 3914644 3777417 3652237 3537994 3433767 3338047 3249301 3167345 3092975 3026126 2965405
61787 2965405 2909559 2858320 2811590 2768993 2730718 2697668 2669926 2645787 2623189 2601698 2582356
61776 2582356 2565906 2552011 2540115 2530265 2522774 2517641 2514727 2514220 2516370 2520710 2526022 2531396 2537183
61763 2537183 2544662 2554955 2568521 2585358 2605057 2626804 2649969 2674846 2702256 2732526 2765658
61752 2765658 2802570 2845013 2893745 2947741 3005943 3068924 3137948 3213205 3294107 3380846 3474407
61741 3474407 3575252 3683110 3798056 3920773 4051686 4190699 4337944 4494029 4659518
61732 4659518 4834992 5021785 5221988 5437483 5669473 5918918 6186773 6473950 6781973
61723 6781973 7113925 7474046 7866181 8293270 8758468 9265935 9820325 10426357 11089374
61714 11089374 11815423 12609828 13475705 14414109 15425025 16507335 17657606 18868870 20129801
61705 20129801 21423328 22724155 23996376 25193525 26262309 27148583 27802871 28185015
61697 28185015 28269751 28052848 27553285 26808075 25862955 24765486 23562389 22297681 21009522
61688 21009522 19727982 18475608 17269027 16119519 15033414 14013816 13062631 12180976
61680 12180976 11368146 10620988 9934622 9303866 8724330 8192528 7705223 7259036 6850877
61671 6850877 6478300 6138804 5829043 5545321 5284702 5044982 4823884 4619322 4430392
61662 4430392 4256978 4098099 3951633 3815897 3690479 3575074 3468486 3369401 3277295 3191851
61652 3191851 3112080 3036724 2965094 2897070 2832782 2772620 2716872 2664886 2615265 2567331 2521611
61641 2521611 2478356 2436531 2395135 2354729 2316573 2280750 2246193 2212199 2178824 2145982 2113186
61630 2113186 2080313 2047841 2016219 1985564 1955984 1927714 1900952 1875995 1853299 1832970 1814376
61619 1814376 1796760 1780009 1764292 1749308 1734617 1720572 1708176 1698003 1689767 1682799 1676317 1669387
61607 1669387 1661375 1652444 1642991 1632679 1620764 1607363 1593526 1579872 1565943 1551301 1536646 1523407
61595 1523407 1512558 1504120 1497414 1491472 1485526 1479437 1473549 1468075 1462929 1458207 1454275 1451119 1448057 1444635
61581 1444635 1441577 1440294 1441380 1443921 1446373 1447852 1448428 1448402 1447732 1446391 1445057 1444915 1446451 1448648 1449807
61566 1449807 1449292 1448257 1448521 1450848 1454419 1457821 1460348 1462285 1464153 1465946 1467127 1467142 1465728 1462942 1459210
61551 1459210 1455287 1451727 1448211 1443666 1437302 1429449 1421275 1413799 1407230 1401082 1394768 1388155 1381563 1375248
61537 1375248 1369110 1363099 1357687 1353511 1350673 1348784 1347581 1347002 1346886 1347365 1349509 1354523 1361907 1369357 1375238
61522 1375238 1380513 1387553 1397596 1410266 1425107 1442353 1462147 1484038 1507699 1533452 1561480 1590943
61510 1590943 1620625 1650597 1682742 1719185 1760195 1803988 1848634 1893535 1938619 1982817 2024517
61499 2024517 2063421 2100682 2136845 2170853 2201872 2231073 2260417 2290103 2318344 2343580 2365989
61488 2365989 2386712 2406270 2423943 2438288 2448166 2453451 2454766 2452620 2447292 2439695 2431466 2423501 2415008
61475 2415008 2404902 2393815 2383885 2376784 2372730 2371234 2371933 2374719 2379798 2387602 2398092 2410413 2424144
61462 2424144 2440773 2462976 2492342 2528608 2571100 2619976 2675839 2739077 2809998 2888878 2975518
61451 2975518 3069610 3172159 3285924 3413692 3556286 3712705 3882024 4064788 4262575 4476380
61441 4476380 4705434 4947581 5200790 5463865 5735173 6010710 6283763 6546146 6789289
61432 6789289 7004676 7184589 7323196 7416895 7464098 7465642 7425283 7348560 7240622 7105894
61422 7105894 6949830 6779456 6601122 6418591 6234464 6052906 5879555 5718594 5570898
61413 5570898 5435378 5311568 5200436 5103151 5019844 4950016 4893838 4852295 4825697 4812673 4811432
61402 4811432 4821667 4844117 4878187 4921107 4969892 5023264 5081209 5143558 5209742 5279124 5350526
61391 5350526 5421911 5491536 5559273 5626062 5692294 5757439 5820956 5882701 5942590 6000776 6058079
61380 6058079 6115215 6171433 6224834 6274341 6320485 6363843 6403582 6438250 6467383 6491518 6510981
61369 6510981 6525545 6535144 6540082 6540316 6535158 6524043 6507381 6486498 6462957 6437837 6411198 6382201
61357 6382201 6350335 6316923 6284993 6257201 6234146 6214920 6198677 6184934 6172901 6161802 6151863
61346 6151863 6143832 6137081 6129273 6118619 6105648 6091873 6077448 6061324 6043472 6025776 6010643 5999622
61334 5999622 5993581 5993471 6000625 6016854 6044473 6085674 6141617 6212483 6298579 6401156 6522158 6663585
61322 6663585 6826850 7011963 7217238 7440473 7680608 7937537 8209993 8494121 8784294
61313 8784294 9074427 9357975 9627262 9873672 10088611 10264384 10394924 10476508 10507887 10489757
61303 10489757 10424414 10315876 10169369 9989956 9781719 9548376 9294014 9022899 8739257
61294 8739257 8447827 8153879 7861794 7573966 7291963 7018458 6757044 6510183 6278306
61285 6278306 6061114 5858926 5672428 5501811 5346863 5207705 5084970 4979112 4889600 4814816
61275 4814816 4753027 4703680 4667439 4644512 4633241 4631118 4637231 4652744 4678582 4713397 4754546 4800350
61263 4800350 4850363 4903728 4958686 5014109 5070328 5127474 5183699 5236194 5283736 5327069 5366704
61252 5366704 5401562 5430410 5453698 5473009 5489185 5501773 5509951 5513020 5510111 5500403 5483883 5461280
61240 5461280 5433088 5399211 5359669 5315042 5266042 5213235 5157362 5099303 5039479 4977812 4914660
61229 4914660 4851242 4788779 4727677 4668014 4610432 4556010 4505515 4459134 4416707 4377740 4341310
61218 4341310 4306441 4272747 4240615 4210812 4183860 4159442 4136235 4112520 4087284 4060730 4033843
61207 4033843 4007682 3983063 3960562 3940693 3924198 3912051 3904914 3902897 3906254 3915999 3933036 3957015
61195 3957015 3987039 4023601 4068743 4124174 4190265 4267056 4354782 4452724 4558861 4671629 4790778
61184 4790778 4915220 5040992 5162749 5276347 5378168 5462475 5521732 5550238 5546157 5509884
61174 5509884 5442215 5345156 5223223 5082484 4928461 4765498 4597531 4428432 4261529 4099303
61164 4099303 3943550 3795524 3656048 3525825 3405636 3295996 3196639 3106588 3024853 2950914
61154 2950914 2884417 2824515 2769854 2719513 2673739 2633258 2597946 2566818 2539477 2516778 2499599
61143 2499599 2487705 2480500 2478220 2481259 2488490 2497363 2505872 2513791 2521924 2530813 2540197 2548933 2555245 2557750
61129 2557750 2556557 2552887 2547432 2539669 2528980 2515770 2500980 2484906 2466989 2446575 2423569 2398520
61117 2398520 2372293 2345589 2318674 2291718 2265187 2239525 2214421 2188798 2161669 2132657 2101724
61106 2101724 2068904 2034501 1999170 1963545 1928033 1892948 1858378 1823843 1788641 1752788 1717239
61095 1717239 1682966 1650303 1619362 1590407 1563223 1536541 1508818 1479636 1449819 1420303 1391327
61084 1391327 1362869 1335373 1309664 1286231 1264868 1245135 1227046 1211094 1197513 1185767 1175031
61073 1175031 1165160 1156944 1151358 1148709 1148500 1149936 1152514 1156222 1161229 1167409 1174358 1181907 1190339 1199881
61059 1199881 1210262 1221032 1232013 1243067 1253805 1264167 1275060 1287595 1301620 1315573 1327968
61048 1327968 1338473 1347505 1355475 1362648 1369080 1374244 1377211 1377645 1376256 1373924 1370805 1366746 1362154 1357769
61034 1357769 1353735 1349459 1344456 1338882 1333145 1327348 1321238 1314550 1307282 1299775 1292551 1285920 1279722 1273505
61020 1273505 1266971 1260148 1253199 1246243 1239457 1233143 1227419 1221849 1215748 1209120 1203034 1198585 1195412 1191737
61006 1191737 1186115 1178897 1171770 1166160 1162204 1158982 1155408 1151164 1147034 1144163 1142912 1142749 1143340 1145171
60992 1145171 1148797 1154130 1160934 1169323 1179016 1188813 1197908 1207438 1219577 1234959 1251940 1268649 1285089
60979 1285089 1302951 1323825 1347770 1373331 1398978 1424748 1452203 1482431 1514783 1548224 1583279
60968 1583279 1621519 1663609 1709121 1757970 1810486 1865913 1922374 1978911 2036592 2097193 2161728
60957 2161728 2230528 2303657 2380670 2460809 2543940 2630718 2721851 2818095 2920875 3031717 3150919
60946 3150919 3277976 3413269 3557795 3711244 3872406 4042107 4223813 4420526 4633101
60937 4633101 4862717 5112938 5387612 5688311 6015633 6371998 6762308 7193959 7677947
60928 7677947 8227933 8855873 9569856 10377833 11291171 12322867 13486372 14800612 16292810
60919 16292810 17991010 19917827 22097673 24555209 27267567 30087270 32723476 34846267
60911 34846267 36256642 36981183 37217902 37206423 37146135 37188415 37423981 37816796 38153389 38108232
60901 38108232 37412750 35995748 33987040 31610787 29078170 26545166 24116041 21851672
60893 21851672 19775750 17889243 16187300 14664602 13311329 12112722 11054299 10123866
60885 10123866 9308124 8590866 7956015 7390816 6885889 6434167 6030236 5669021 5344412
60876 5344412 5050113 4781850 4537565 4315408 4112770 3927367 3757772 3602140 3457098
60867 3457098 3318479 3183061 3049821 2919976 2795697 2678257 2567464 2462794 2364223 2271546
60857 2271546 2183942 2101107 2023806 1952175 1884446 1818808 1755813 1697329 1643666 1593523 1546435
60846 1546435 1503291 1464316 1428480 1395289 1365400 1338746 1313671 1288800 1264476 1241477 1219530
60835 1219530 1198137 1177844 1159562 1143300 1128584 1115571 1104791 1096160 1089091 1083311 1078803 1075136
60823 1075136 1071540 1067624 1063631 1060085 1057426 1055675 1054256 1052426 1050070 1047571 1044803 1041053 1036405 1032429
60809 1032429 1030662 1030820 1031179 1030428 1028522 1026104 1023910 1022567 1022182 1021993 1021018 1019186 1017484 1016980 1018075 1020632
60793 1020632 1024397 1029098 1034484 1040495 1047292 1055029 1063643 1072910 1082693 1093104 1104355 1116400 1128828
60780 1128828 1141194 1153090 1163663 1171613 1176474 1179774 1184020 1190397 1198166 1206337 1214766 1223256 1230801
60767 1230801 1236624 1241126 1244897 1247648 1249305 1251454 1256128 1263252 1270688 1276896 1282273 1287581 1292428 1296142
60753 1296142 1299200 1302695 1306714 1309991 1311081 1309476 1305789 1301243 1296799 1292371 1286965 1279896 1271797 1264180
60739 1264180 1258043 1253133 1248480 1243324 1237408 1230662 1223050 1214893 1207130 1200845 1196486 1193692 1191898 1190694
60725 1190694 1189583 1188053 1186382 1185928 1187965 1192423 1198296 1204980 1212497 1220690 1229210 1238442 1249484 1262825
60711 1262825 1277748 1293451 1309973 1327451 1345135 1361963 1377721 1392837 1407277 1420531 1432646
60700 1432646 1444397 1456139 1467176 1476762 1485282 1493770 1502402 1510008 1515238 1517811 1518453 1518057 1517386 1517311
60686 1517311 1518465 1520348 1521404 1520602 1518576 1516559 1514481 1511043 1505698 1499559 1493847 1488232 1481487 1473363
60672 1473363 1464958 1457308 1450309 1443134 1435159 1426295 1416868 1407519 1398994 1391695 1385415 1379636 1374072 1368955
60658 1368955 1364938 1362819 1363148 1365795 1369737 1373419 1375692 1376643 1377484 1379403 1382440 1385542 1387625 1388355 1387872
60643 1387872 1386156 1382994 1378412 1372705 1366002 1358214 1349716 1341816 1335957 1332213 1329132 1325410 1321355 1318011
60629 1318011 1315070 1310758 1304186 1296898 1291231 1287613 1284294 1279310 1271766 1261568 1249289 1236522 1225123
60616 1225123 1215416 1205924 1195390 1184314 1173963 1164807 1156809 1150469 1146210 1143002 1138884 1133179 1127359
60603 1127359 1123354 1121610 1121116 1120874 1120947 1122181 1125038 1128615 1131056 1131323 1130534 1131120 1134568 1140318 1146772 1152849
60587 1152849 1158341 1163311 1167604 1170957 1173421 1175608 1178334 1181766 1185003 1186903 1187347 1187381 1188052 1189503 1191369
60572 1191369 1193718 1197212 1202315 1208579 1214906 1220718 1226761 1234392 1243936 1254280 1264508 1275363 1288183
60559 1288183 1302612 1316490 1328407 1339588 1352649 1368962 1387702 1407017 1425476 1442622 1458819
60548 1458819 1474691 1490381 1505288 1518619 1530016 1539379 1546216 1549435 1547866 1540956 1529231 1514274
60536 1514274 1498007 1481698 1465719 1450297 1436020 1423232 1411360 1399483 1387479 1376075 1365852
60525 1365852 1356846 1349181 1343401 1339872 1338267 1337905 1338148 1338192 1337089 1334618 1331880 1330339 1330229 1330436 1330029 1329419
60509 1329419 1329726 1331343 1333500 1335198 1336299 1337641 1340265 1344610 1350421 1357245 1364836 1373200 1382543 1393261
60495 1393261 1405646 1419353 1433394 1447034 1460532 1474653 1489634 1505178 1521372 1538981 1558572
60484 1558572 1579898 1602413 1626052 1651309 1678979 1710122 1745756 1786054 1829948 1875676 1921185
60473 1921185 1963763 2000111 2027779 2046398 2056862 2059553 2054119 2040843 2021324 1997767 1972310 1947153
60461 1947153 1924597 1906500 1893877 1886863 1884692 1886098 1890658 1899645 1914624 1935178 1958982 1984203
60449 1984203 2010757 2039148 2069502 2102384 2139280 2181312 2228484 2281201 2341539 2411757 2492246
60438 2492246 2582219 2681963 2793193 2917650 3056771 3212414 3386293 3578402 3787332 4012591
60428 4012591 4255628 4518260 4801309 5105559 5432999 5785646 6162387 6556438 6954735
60419 6954735 7338766 7686228 7973236 8177209 8280462 8273699 8157679 7942160 7643475 7282300
60409 7282300 6881257 6461444 6039287 5626121 5229940 4856511 4509051 4188408 3894562
60400 3894562 3627561 3386721 3169760 2973585 2795808 2635128 2490438 2359914 2241141
60391 2241141 2132308 2033450 1946045 1870660 1805191 1746123 1691363 1640849 1594527 1551116 1509497
60380 1509497 1470192 1434506 1402832 1374558 1349110 1326244 1305645 1286942 1269901 1254095 1238791
60369 1238791 1223767 1209856 1197897 1187377 1176808 1165360 1153464 1141967 1131497 1122669 1116017 1111266
60357 1111266 1107194 1102730 1098002 1094081 1091962 1092034 1094173 1097789 1101771 1104995 1107284 1109685 1113394 1118489
60343 1118489 1124060 1129571 1135492 1142385 1149830 1156717 1162360 1166950 1171185 1175923 1181945 1189445 1197781 1206108
60329 1206108 1214164 1222064 1229616 1236361 1242105 1246827 1250278 1252293 1253186 1253156 1251550 1247784 1242865 1238791 1236259
60314 1236259 1234076 1231152 1227914 1225258 1223274 1221770 1221103 1221385 1221597 1220650 1219186 1219324 1222494 1228007 1233783
60299 1233783 1238190 1241309 1244665 1249669 1256313 1263581 1270916 1278686 1287339 1297063 1308446 1322389 1338842
60286 1338842 1356447 1373864 1390602 1406123 1419367 1430099 1439691 1449352 1458359 1465285 1470362 1475176
60274 1475176 1480374 1485169 1489157 1493235 1498288 1504100 1510102 1516543 1524358 1534173 1545524 1556736 1565513
60261 1565513 1570297 1571271 1569764 1566581 1561201 1552668 1541108 1528265 1516471 1506793 1498148 1488632 1477731
60248 1477731 1466730 1457030 1449017 1442768 1438577 1435999 1433502 1430118 1426612 1423971 1421754 1419317 1417824 1419134
60234 1419134 1423107 1427742 1431904 1435949 1439522 1440854 1439226 1436679 1436176 1438990 1444569 1451909 1460105 1468382
60220 1468382 1476584 1485221 1494517 1504008 1513574 1523994 1535701 1547733 1558910 1569456 1580463 1592193
60208 1592193 1604104 1616428 1630500 1647173 1665768 1685072 1704834 1725789 1748621 1773442 1800172
60197 1800172 1828971 1860194 1894281 1931841 1973575 2019784 2070123 2124238 2182704 2246859 2317478
60186 2317478 2394002 2475401 2561562 2653542 2752752 2860226 2976289 3100367 3231317 3368411
60176 3368411 3511721 3660926 3814009 3967992 4120899 4272048 4420174 4562210 4694588
60167 4694588 4815192 4923411 5018694 5099832 5165631 5215603 5249843 5268800 5273644 5266607 5250410
60156 5250410 5227252 5198717 5166815 5134542 5104885 5079582 5059516 5046160 5041839 5048527 5067167 5098318
60144 5098318 5142535 5199740 5269136 5350477 5444756 5552817 5673627 5804430 5942081 6083658
60134 6083658 6226333 6367381 6503959 6632312 6747893 6847118 6928723 6992730 7038605 7065071
60124 7065071 7071108 7056364 7021299 6967897 6899679 6820054 6731347 6636376 6539941 6447099 6360568
60113 6360568 6281392 6211577 6154140 6110787 6081598 6067103 6068752 6087057 6121138 6170469 6235168
60102 6235168 6313862 6402994 6498949 6599140 6700234 6797243 6885835 6964250 7031887 7087495 7130214
60091 7130214 7161168 7182369 7194883 7199631 7199273 7197720 7198157 7202888 7214686 7236828 7271889 7321746 7388747
60078 7388747 7475662 7584345 7715560 7870388 8050885 8258852 8494602 8757499 9047448 9365403
60068 9365403 9712244 10087276 10488006 10911417 11354929 11815516 12288135 12765858 13241531
60059 13241531 13708510 14159720 14587193 14983058 15340277 15652103 15911875 16114053 16254808
60050 16254808 16331234 16341050 16283928 16162231 15979675 15740165 15449016 15114626 14747679 14358927
60040 14358927 13958537 13556932 13164602 12790437 12440551 12118612 11826927 11567635 11343508
60031 11343508 11157415 11010489 10901089 10826107 10782937 10769586 10783119 10818750 10870553 10932843
60021 10932843 11000930 11070591 11136572 11191933 11229996 11247291 11243791 11220060 11175449 11109525 11023561
60010 11023561 10919091 10796052 10653961 10494241 10319803 10132831 9934718 9727986 9516589
60001 9516589 9304092 9093054 8886499 8688489 8502444 8329895 8171656 8029460 7905745
59992 7905745 7802301 7719753 7658131 7617538 7598414 7601434 7626943 7674332 7741996 7827868 7929796
59981 7929796 8045536 8172628 8308142 8448142 8587462 8720453 8842156 8948720 9036946 9103858
59971 9103858 9146866 9164224 9155245 9119972 9058619 8971592 8860480 8728884 8581695 8423450 8257924
59960 8257924 8089163 7922011 7761177 7610302 7471961 7347848 7238760 7145320 7069107 7012408
59950 7012408 6976617 6961750 6967783 6995461 7045437 7117640 7211835 7327634 7463565 7617565 7788908
59939 7788908 7977826 8182093 8395477 8610759 8822725 9026889 9217290 9388028 9536016
59930 9536016 9659959 9757264 9824160 9858359 9859459 9827076 9760934 9663113 9538560 9393305 9233588
59919 9233588 9066092 8896750 8729140 8565884 8411655 8272763 8153617 8055596 7979479 7926563
59909 7926563 7896817 7888328 7899818 7931944 7985203 8058350 8149856 8258930 8383645 8519766 8663103
59898 8663103 8811779 8964517 9117843 9266786 9407851 9539904 9662734 9776213 9880532
59889 9880532 9975954 10062476 10140752 10213197 10283432 10355106 10432132 10519363 10621540 10741552 10880896
59878 10880896 11042149 11230015 11449498 11703572 11992864 12316947 12675177 13066186 13486861
59869 13486861 13931893 14393991 14863948 15330327 15779612 16197258 16568675 16879388 17115548
59860 17115548 17265906 17323798 17287192 17157790 16941491 16649474 16296826 15898864 15468725 15017994
59850 15017994 14558081 14100202 13654561 13229710 12831875 12464801 12131193 11834443 11577916
59841 11577916 11362638 11187300 11051080 10954927 10899182 10881417 10897953 10946462 11025560 11132276
59831 11132276 11261128 11405438 11558479 11713341 11862382 11996878 12107143 12183579 12218260 12205414
59821 12205414 12140813 12022073 11850248 11630151 11368185 11070469 10743487 10395197 10033948
59812 10033948 9666686 9299240 8937747 8588346 8255405 7941005 7646115 7371447 7117269
59803 7117269 6883458 6670185 6478107 6307582 6157817 6026701 5911338 5809070 5718275 5638029
59793 5638029 5566930 5502693 5443028 5386384 5331588 5277566 5224019 5171949 5122905 5077830 5036673
59782 5036673 4998665 4962833 4928774 4896794 4866426 4834894 4798535 4756171 4709774 4661256 4610301
59771 4610301 4556485 4501910 4449979 4402428 4359143 4320076 4285650 4255810 4230372 4209998 4195380
59760 4195380 4185851 4180429 4179901 4186141 4199629 4219545 4246219 4281183 4324197 4372346 4423250 4477622
59748 4477622 4537508 4603462 4674650 4750356 4829483 4909290 4986503 5059705 5129259 5194919 5254949
59737 5254949 5308068 5355064 5397753 5437157 5473683 5508660 5544617 5583954 5628228 5679125 5739307
59726 5739307 5811451 5896844 5995848 6109684 6240848 6391712 6563786 6758802 6979443 7228097
59716 7228097 7505458 7811128 8144994 8506955 8895565 9307600 9737925 10177706 10611895
59707 10611895 11019231 11375395 11656970 11845021 11929075 11910458 11801613 11620971 11387789 11120550
59697 11120550 10837158 10553504 10281019 10026525 9794773 9590381 9417013 9275569 9164241
59688 9164241 9080726 9024545 8997436 9001653 9037701 9103581 9196253 9313940 9456907 9626163 9821927
59677 9821927 10043807 10292169 10568710 10875578 11214396 11586226 11991973 12432473 12908748
59668 12908748 13422627 13976769 14573481 15213813 15898381 16628555 17405750 18229369 19096117
59659 19096117 20001209 20939122 21902781 22882905 23868793 24849427 25814000 26752985 27660299
59650 27660299 28534662 29378670 30197054 30995973 31782664 32564145 33345587 34129597 34915685
59641 34915685 35699063 36470180 37216437 37924470 38580354 39168651 39673541 40082464 40388959
59632 40388959 40592520 40697020 40709998 40642816 40510388 40330152 40120856 39901464 39690264 39504469
59622 39504469 39360210 39272316 39253530 39313716 39459932 39697484 40031071 40464999 41002208 41642808
59612 41642808 42382971 43214378 44124132 45094916 46104858 47126286 48124161 49056632 49878736
59603 49878736 50546597 51019386 51260727 51243078 50953952 50398454 49596106 48576263 47376086
59594 47376086 46039083 44610949 43133986 41644056 40170534 38736658 37359076 36047560
59586 36047560 34805206 33628346 32506342 31422252 30354820 29281877 28185421 27056901
59578 27056901 25899215 24723789 23545719 22380798 21244366 20149843 19107082 18122261
59570 18122261 17198878 16338056 15538481 14797550 14112962 13482726 12904094 12373729 11888820
59561 11888820 11446872 11044366 10676936 10341280 10035838 9759084 9508141 9279646 9071154
59552 9071154 8880990 8707364 8548187 8400966 8262044 8126572 7990552 7853009 7715257
59543 7715257 7577779 7438649 7295599 7148986 7001767 6856640 6714170 6574087 6437465
59534 6437465 6306556 6182912 6066850 5958927 5860834 5774295 5699767 5636618 5583822 5540059
59524 5540059 5504032 5475610 5456174 5447028 5447783 5456857 5472954 5495301 5523038 5555464 5592688 5635008
59512 5635008 5681810 5732004 5785481 5843114 5905209 5970955 6039863 6113054 6192716 6280630 6377582
59501 6377582 6483923 6600399 6728351 6869056 7022892 7189588 7369609 7564895 7777769
59492 7777769 8009389 8259611 8527899 8813717 9116334 9434974 9769012 10117272 10477061
59483 10477061 10844299 11214587 11583801 11947894 12302776 12644489 12969382 13274123 13555525
59474 13555525 13809832 14032283 14218583 14367778 14483219 14570027 14632062 14671903 14692838 14699546
59464 14699546 14697036 14690041 14683472 14682696 14693261 14720498 14768704 14839858 14933388 15047566 15180100 15326220
59452 15326220 15476906 15620373 15745117 15840710 15896776 15903481 15853531 15742834 15569541 15333999
59442 15333999 15039652 14692544 14299714 13869336 13412316 12941715 12469335 12003326 11549210
59433 11549210 11111988 10696742 10308186 9950180 9624872 9331816 9068806 8834167 8627809
59424 8627809 8450007 8300185 8177419 8081392 8012192 7969544 7952634 7960530 7992687 8049255 8130561
59413 8130561 8235906 8363403 8511766 8681603 8873765 9086754 9317064 9561684 9818422
59404 9818422 10083305 10349122 10607208 10849678 11069520 11259749 11413415 11524005 11585667 11593878
59394 11593878 11546456 11443690 11287766 11082925 10835910 10554910 10247568 9920454 9579939
59385 9579939 9232261 8882773 8536276 8197779 7871413 7558792 7260210 6977429 6713301
59376 6713301 6468481 6240868 6029112 5834544 5658545 5499966 5356522 5227083 5111104
59367 5111104 5007265 4914438 4832990 4763662 4705911 4658504 4620775 4592073 4571056 4556916 4550490
59356 4550490 4552815 4563362 4580988 4605831 4638867 4680246 4729180 4784439 4843287 4900710 4951871
59345 4951871 4995795 5035778 5076607 5122364 5176113 5239892 5314931 5402900 5506239 5625425 5756028
59334 5756028 5890491 6023739 6156390 6292823 6437799 6595391 6769372 6963127 7179465
59325 7179465 7421021 7690155 7987948 8313963 8667829 9050935 9466166 9916317 10403194
59316 10403194 10927903 11491112 12092492 12729881 13399067 14094190 14808078 15532104 16256148
59307 16256148 16969200 17660362 18319650 18938750 19511913 20036287 20511092 20936573 21313811
59298 21313811 21644664 21930659 22171829 22367076 22515053 22613535 22658416 22645047 22570763 22434810
59288 22434810 22235897 21971958 21643304 21254456 20811872 20321150 19787348 19216378 18614393
59279 18614393 17986706 17338897 16678388 16013683 15352363 14700694 14064227 13447481 12853578
59270 12853578 12285464 11746965 11241353 10769346 10329818 9922221 9547072 9204350 8892754
59261 8892754 8610583 8356298 8128147 7924207 7742942 7583128 7443465 7322953 7221356
59252 7221356 7138467 7073137 7023683 6988829 6967477 6958122 6959653 6972472 6997738 7035592 7085039 7145271
59240 7145271 7215958 7296339 7385197 7481905 7586448 7698003 7814234 7932535 8051767 8172616
59230 8172616 8296147 8421627 8545701 8664436 8776548 8883858 8988219 9089439 9187394 9284826
59220 9284826 9385893 9492278 9602617 9715832 9832985 9954936 10079489 10201915 10317794
59211 10317794 10424740 10521777 10607650 10679808 10734957 10770522 10785146 10777633 10746322 10690455 10611691
59200 10611691 10513315 10398371 10269683 10131479 9989489 9848858 9712566 9582127 9459219
59191 9459219 9346497 9247250 9164259 9098427 9048468 9012305 8988669 8977206 8977669 8989559 9011886
59180 9011886 9042501 9078410 9117781 9161079 9209078 9260493 9313290 9367966 9427644 9494743 9569475
59169 9569475 9652368 9746575 9856369 9984295 10131027 10297549 10486363 10700611 10942483 11212198
59159 11212198 11507828 11825951 12162465 12512451 12868950 13222117 13559839 13869148 14137194
59150 14137194 14351622 14501071 14576216 14570929 14482750 14312457 14063515 13742178 13357696 12921500
59140 12921500 12445765 11942708 11424482 10902267 10385004 9879757 9393296 8931828 8498508
59131 8498508 8092585 7712116 7356680 7026737 6721844 6441055 6184097 5950458 5737872
59122 5737872 5543344 5365423 5204099 5058909 4928534 4811857 4707750 4613949 4527798 4448355
59112 4448355 4376484 4312844 4256999 4208450 4167100 4132592 4104515 4083522 4070919 4066820 4069811 4078626
59100 4078626 4092997 4112668 4136904 4165546 4199579 4240157 4287706 4342148 4403192 4470227 4542652
59089 4542652 4620273 4702620 4788241 4875977 4966830 5063207 5166102 5274295 5386335 5501795
59079 5501795 5620147 5739874 5859324 5977356 6092630 6203561 6309575 6411179 6507947 6597493
59069 6597493 6677462 6747814 6810419 6867064 6918575 6965369 7008043 7047741 7086305 7125732 7167349
59058 7167349 7212117 7261777 7318716 7384439 7459064 7542798 7636863 7742293 7858715 7985382 8123045
59047 8123045 8273854 8439315 8618690 8809365 9008557 9214534 9426064 9640535 9853041
59038 9853041 10057653 10248893 10421071 10566790 10677799 10747942 10774688 10757920 10698637 10599367
59028 10599367 10464876 10301548 10116157 9915009 9703184 9483925 9259085 9030342 8799690
59019 8799690 8568963 8339628 8112857 7888864 7666214 7442925 7218688 6995210 6774210
59010 6774210 6555926 6339907 6126458 5916844 5712588 5514806 5323783 5139157 4960969
59001 4960969 4790282 4628100 4474003 4326800 4186277 4053178 3927476 3807812 3692760
58992 3692760 3581744 3474792 3372499 3276153 3186553 3102544 3021947 2944134 2870433 2801683 2736663
58981 2736663 2673536 2611802 2552376 2496592 2445485 2399258 2357145 2318369 2283099 2251615 2222871
58970 2222871 2195244 2168741 2145162 2125933 2110853 2098843 2088575 2078479 2067718 2057338 2049035
58959 2049035 2042832 2037504 2033046 2030576 2029745 2028583 2026471 2025039 2025358 2026448 2027442 2028944 2031193 2033173 2035025
58944 2035025 2039031 2046314 2054506 2060830 2065861 2072050 2079907 2088154 2096744 2107127 2119657 2132839 2145385
58931 2145385 2157539 2170277 2184411 2200495 2218613 2238231 2258897 2280705 2303516 2326438 2349048
58920 2349048 2372586 2398904 2428520 2460401 2493182 2525994 2558728 2592180 2627319 2663960 2700982
58909 2700982 2738208 2776919 2817934 2860693 2905203 2953237 3005994 3061788 3117836 3173455 3229713
58898 3229713 3286573 3342389 3396196 3448972 3502606 3558732 3618524 3682597 3751099 3824538 3904046
58887 3904046 3990097 4081658 4177718 4279071 4387434 4503328 4626140 4755963 4894101 5041781
58877 5041781 5199325 5366516 5542989 5728599 5924328 6132505 6355332 6593535 6847271
58868 6847271 7117857 7407532 7717842 8049336 8402672 8779069 9179901 9606825 10062315
58859 10062315 10549265 11070019 11626330 12220046 12853144 13527039 14242066 14997211 15789943
58850 15789943 16616594 17472961 18353695 19250638 20152402 21045706 21915786 22744717 23510666
58841 23510666 24190436 24762929 25210393 25518366 25676642 25680601 25531189 25234395 24801564 24249235
58831 24249235 23597107 22865594 22074780 21243805 20389634 19526725 18668276 17826579 17011069
58822 17011069 16226988 15477086 14763814 14089084 13453245 12855827 12296446 11773698 11284197
58813 11284197 10824407 10392900 9989557 9613238 9261609 8932539 8624301 8335059 8063711
58804 8063711 7810788 7577252 7362846 7166574 6987762 6825241 6676532 6539577 6414552
58795 6414552 6302280 6201761 6111328 6031484 5964163 5909342 5864658 5828608 5802117 5786544 5782005
58784 5782005 5788171 5805053 5832242 5868656 5913745 5968117 6032659 6107989 6194954 6294581 6407050
58773 6407050 6531393 6666592 6812669 6970898 7143461 7332526 7538818 7761288 7998868
58764 7998868 8252296 8523694 8815016 9127758 9463606 9824375 10211712 10627611 11074601
58755 11074601 11554593 12068392 12617235 13203877 13830896 14498660 15205896 15950954 16730932
58746 16730932 17540413 18372393 19219130 20069903 20908708 21716182 22473258 23161250 23759689
58737 23759689 24247371 24606212 24822800 24887511 24795723 24550987 24164920 23653143 23032497 22321641
58727 22321641 21541121 20710975 19848968 18971054 18091460 17221403 16369123 15541809 14746272
58718 14746272 13987272 13266698 12584924 11941795 11336046 10765511 10228884 9726226 9257110
58709 9257110 8819306 8409792 8026058 7665985 7327621 7009846 6712509 6435305 6176950
58700 6176950 5935778 5710658 5501241 5307591 5129262 4964315 4809956 4664996 4530899
58691 4530899 4409289 4299211 4198156 4104840 4019116 3939799 3864878 3793872 3727965 3667529 3611204
58680 3611204 3557648 3506573 3457893 3411412 3367486 3326431 3287236 3248539 3210864 3175959 3143617
58669 3143617 3111162 3076683 3040996 3005704 2971019 2936306 2901231 2865360 2827752 2787839 2745880
58658 2745880 2702007 2655708 2606648 2555210 2502016 2447727 2393197 2338859 2284245 2229463 2176853
58647 2176853 2129461 2087763 2049441 2012395 1976324 1941289 1906841 1873235 1841710 1812671 1784970
58636 1784970 1757712 1731428 1706731 1683112 1659893 1637338 1615970 1595516 1575122 1554129 1532504
58625 1532504 1511239 1492292 1477302 1466298 1458270 1452504 1448436 1444984 1441544 1439191 1439345 1441669 1444977
58612 1444977 1449723 1457524 1468289 1479758 1489855 1497558 1501645 1500940 1496318 1490485 1485281 1480640 1476159
58599 1476159 1471625 1465898 1457617 1447644 1438870 1433033 1429478 1427446 1427547 1430354 1435452 1442522 1451730 1462691
58585 1462691 1474774 1488749 1506143 1526596 1547938 1569381 1592574 1619017 1648535 1680979 1717244
58574 1717244 1757795 1802035 1849852 1901858 1957558 2015386 2075330 2139462 2209246 2284401 2365051
58563 2365051 2452609 2547712 2649713 2759301 2879321 3011704 3155713 3310504 3477321 3657783
58553 3657783 3851870 4058963 4279084 4511839 4755641 5008747 5268870 5530584 5785165
58544 5785165 6024351 6242430 6433539 6589362 6701610 6765485 6779534 6744077 6661632 6537622
58534 6537622 6379099 6193577 5989420 5775102 5556510 5336326 5116979 4902383 4695688
58525 4695688 4497507 4308070 4129536 3964654 3814409 3678253 3555217 3443769 3342114
58516 3342114 3249785 3167597 3095218 3030382 2971048 2916290 2864418 2812751 2760598 2710228 2663423
58505 2663423 2619038 2575179 2531530 2488200 2444545 2400849 2359094 2320407 2283605 2247656 2213396
58494 2213396 2181213 2149159 2115168 2079233 2041822 2002305 1960841 1919782 1881242 1844912 1809878
58483 1809878 1776772 1746464 1718478 1692224 1667890 1644822 1621314 1597493 1575967 1557944 1541325
58472 1541325 1524396 1508542 1495044 1482075 1467663 1453061 1440233 1428258 1415411 1402831 1392862
58461 1392862 1385144 1377298 1368254 1358225 1346769 1333642 1320551 1309538 1300449 1291873 1283229 1274061 1263113
58448 1263113 1250449 1238856 1230775 1225296 1220295 1215647 1211853 1207456 1200809 1193127 1186978 1182673 1178493
58435 1178493 1173454 1167823 1162073 1157111 1153953 1151512 1146698 1138625 1130448 1124971 1120977 1116350 1111940 1109157
58421 1109157 1106279 1100864 1093922 1088200 1083934 1079651 1075506 1072526 1070113 1067521 1066117 1066817 1067041 1063807
58407 1063807 1058392 1054419 1052856 1052437 1053304 1056198 1059323 1060131 1059406 1059835 1061417 1062017 1061547 1061722 1062359 1061853
58391 1061853 1060949 1062387 1066921 1072835 1078937 1084933 1089555 1091632 1092568 1094604 1097275 1098481 1098126 1097487 1096026
58376 1096026 1092313 1087259 1082935 1078866 1072934 1065328 1058313 1052747 1047999 1044385 1042453 1040814 1038053 1035763
58362 1035763 1036302 1038671 1040105 1040387 1040934 1041102 1039582 1038195 1039880 1043826 1046959 1049318 1053399 1059075 1064068
58347 1064068 1068937 1076548 1086569 1095415 1102000 1108945 1117614 1126332 1134204 1142541 1151777 1160790 1169813 1180450
58333 1180450 1192386 1203535 1213628 1224190 1235096 1244788 1253723 1263852 1274861 1284770 1294068 1305209
58321 1305209 1318045 1329784 1339592 1349429 1360305 1371394 1382617 1394275 1404396 1410443 1413475 1416936
58309 1416936 1421852 1427023 1432865 1440614 1448614 1454213 1458723 1465644 1474770 1483179 1491339 1502458 1515905
58296 1515905 1527158 1534684 1541376 1548687 1554874 1559797 1565991 1573869 1580778 1585663 1590025 1593808 1595351 1595859
58282 1595859 1598871 1604742 1610641 1616292 1624307 1634471 1643321 1650183 1658180 1668426 1678592 1688117 1699516
58269 1699516 1713664 1728821 1744923 1763716 1784346 1804176 1823971 1846558 1870437 1891031 1908391
58258 1908391 1927119 1948411 1969112 1989081 2012110 2038434 2063627 2086245 2109393 2133482 2155007
58247 2155007 2174301 2196808 2224335 2252248 2277642 2303267 2331140 2359626 2389269 2424177 2464850
58236 2464850 2506513 2547097 2589834 2635639 2680467 2722985 2767335 2815261 2862959 2908920 2957347
58225 2957347 3010318 3063832 3115391 3168642 3226867 3288445 3351974 3419259 3490247 3561690 3633552
58214 3633552 3709944 3791380 3873424 3955133 4041018 4132387 4225092 4318333 4417104 4523346 4633543
58203 4633543 4747679 4871272 5005648 5145835 5291153 5448003 5618890 5798910 5986625
58194 5986625 6187911 6405352 6634500 6874404 7130792 7405038 7691572 7990079 8307885
58185 8307885 8645993 8995890 9355217 9733160 10134920 10554975 10992088 11456603 11955733
58176 11955733 12485764 13046160 13646807 14293267 14979420 15702863 16472829 17294738 18162547
58167 18162547 19075148 20044307 21077118 22166869 23310370 24517023 25791537 27126676
58159 27126676 28523973 30002886 31579402 33256502 35046507 36979275 39074610 41329801
58151 41329801 43747865 46352739 49162511 52177142 55411635 58913613 62731212 66897870
58143 66897870 71472801 76565055 82296342 88777637 96146221 104581405 114252925 125299664
58135 125299664 137890071 152246807 168571403 187001297 207669969 230727693 256300395
58128 256300395 284619237 316224869 351520647 389333602 425644694 454275915 469663469
58121 469663469 469587775 455692728 431856277 402209262 370112829 337970015 307271073
58114 307271073 278725444 252557254 228808243 207447960 188362027 171386076 156369534
58107 156369534 143176103 131657100 121674779 113135316 105962339 100052791 95283942 91535453
58099 91535453 88655221 86394511 84397139 82269445 79689612 76501872 72744374 68584548
58091 68584548 64211178 59775788 55404334 51210617 47272838 43619009 40254112 37186447
58083 37186447 34416790 31923808 29679213 27664506 25860406 24235655 22761379 21424150
58075 21424150 20212416 19103138 18074744 17121095 16239771 15417730 14641061 13908635 13223927
58066 13223927 12582405 11977923 11412342 10887827 10397806 9935348 9502266 9100779 8724763
58057 8724763 8368209 8033345 7720854 7420698 7122743 6829084 6546671 6275290 6012117
58048 6012117 5760644 5525197 5302560 5087930 4883326 4691787 4509188 4330128 4156552
58039 4156552 3992755 3837087 3685837 3539951 3401029 3266281 3134191 3009353 2894965
58030 2894965 2786528 2679686 2578016 2485894 2399982 2315485 2234899 2162523 2095728 2029821 1966683
58019 1966683 1910485 1859056 1807341 1755575 1706831 1660328 1614349 1571977 1536682 1505533 1473470
58008 1473470 1441047 1411675 1384830 1358351 1333829 1313196 1293464 1271230 1249034 1230964 1215433
57997 1215433 1198551 1181117 1165858 1151255 1134699 1118478 1105987 1095106 1081932 1068018 1057133
57986 1057133 1047807 1036120 1023398 1014025 1007666 1000437 992016 984866 978164 969251 959865 954328 952362
57973 952362 949708 945009 940349 935980 930309 924263 920071 916393 910024 901632 894623 889168 882570 874725
57959 874725 867915 861902 854410 845935 838912 832622 823929 812835 802426 793628 784757 775911 769061 763765
57945 763765 757368 749472 741971 734827 726133 716439 708774 704156 700902 698370 697518 697670 696551 693862 691460
57930 691460 690016 688739 688160 689738 692661 694295 693888 693064 692990 693796 696094 700051 703567 704390 703397 703041
57914 703041 703560 703723 703921 704902 704581 700005 691964 684115 678006 672340 666465 661026 655703 649728 644276
57899 644276 641153 639664 637770 635455 633745 631576 627281 622208 619082 617612 615429 612466 610459 609043
57885 609043 606646 604631 606036 610329 613720 614677 615004 615573 615456 615440 617865 622192 624858 624339 622500 620336
57869 620336 616540 611269 607171 605166 602666 597554 590896 584576 579250 575649 574764 575512 575053 572582 570189
57854 570189 569206 568689 568445 570520 576289 584540 593470 602179 609513 614205 617161 620958 626150 630717 633916
57839 633916 637674 642964 647736 650087 650911 651737 652200 651402 649785 647882 644761 639268 631708 623120 613995
57824 613995 604528 595212 586630 579476 574562 571530 568131 562614 556400 552192 549932 547274 543774 541574
57810 541574 541639 542493 543428 545968 551005 557034 562462 567427 572353 576947 581724 588208 596326 603474 607380
57795 607380 608302 607676 606373 604977 603832 602014 598106 592530 587179 582235 575666 566572 556693 547683 539269
57780 539269 531197 524586 519902 515625 510449 505016 500081 494670 487645 479742 472679 467212 462973 459070
57766 459070 454152 447127 438370 429082 419392 408842 398752 391608 387422 383157 376816 369716 363467 357083
57752 357083 348965 339872 331915 325960 321781 319556 319402 320230 320713 320960 322080 324507 327631 330726 333655
57737 333655 336912 340971 345103 347333 346735 345273 345693 348008 350045 351180 353004 356053 358599 359568 360231
57722 360231 361822 363591 364383 364272 363515 361805 359722 359044 360306 361712 361652 360637 359601 358068 355321 351800
57706 351800 348103 344090 340143 337688 337278 337763 338433 340255 343738 347364 349685 351408 354052 358043 363432
57691 363432 370677 379072 386143 390477 393789 398491 404624 410990 417822 426086 435170 443408 450272 456316
57677 456316 461642 466144 470643 476116 482254 488143 493835 499971 506497 513000 519639 526592 533419 540210
57663 540210 548472 559524 572859 587350 603015 620097 637489 653974 670331 688333 708156 728588
57651 728588 749487 772136 797095 823421 850333 878371 908450 940674 974474 1009462 1046092
57640 1046092 1085637 1129123 1176030 1224756 1274849 1327868 1385399 1447203 1512263 1580743 1653851
57629 1653851 1732606 1817934 1911345 2014289 2127281 2250609 2385306 2532447 2692211 2864853
57619 2864853 3051990 3255496 3475279 3709052 3953948 4207321 4466282 4727350 4986337
57610 4986337 5237864 5475711 5694656 5891432 6062228 6198850 6288028 6315188 6270021 6150819
57600 6150819 5965802 5730606 5463274 5180231 4895057 4618165 4355663 4109053 3877543
57591 3877543 3661115 3461276 3279761 3117347 2973417 2845962 2732561 2632012 2544552 2470024
57581 2470024 2406694 2352531 2306855 2269972 2241891 2222134 2210012 2204436 2204357 2210169 2223741 2246209
57569 2246209 2276686 2314039 2358743 2411803 2472961 2541491 2617970 2703722 2799023 2903279 3016543
57558 3016543 3139380 3271424 3411219 3557164 3707325 3858421 4006118 4146161 4274191
57549 4274191 4384583 4470718 4526870 4549593 4537783 4492404 4416245 4313261 4187837 4044554
57539 4044554 3888028 3722537 3552078 3380733 3212123 3048332 2890266 2739171 2596548
57530 2596548 2462326 2334892 2213724 2100422 1996214 1900123 1810843 1728643 1653772 1584667
57520 1584667 1519833 1460198 1407258 1359746 1314551 1270476 1228829 1190650 1155656 1123932 1096397
57509 1096397 1073038 1052425 1033451 1016131 1000417 985755 972249 960902 952156 945207 939178 934065
57497 934065 930378 928820 930436 935874 944121 952880 960721 968358 977623 989725 1004574 1021276 1039206
57484 1039206 1058852 1081373 1107049 1134854 1164141 1196033 1232210 1272864 1316837 1363401 1413070
57473 1413070 1467077 1526812 1593124 1665323 1741629 1821710 1907964 2003098 2107122 2217977 2334305
57462 2334305 2455921 2582085 2710952 2840469 2968254 3090718 3203638 3303389 3386492 3448715
57452 3448715 3486386 3498337 3485152 3447199 3385348 3303107 3205677 3096877 2978993 2855552 2731591
57441 2731591 2610481 2492653 2378284 2269268 2167540 2073333 1986296 1906922 1835698 1772046
57431 1772046 1715240 1665411 1622648 1585971 1554032 1526110 1501864 1481020 1463970 1451782 1444941
57420 1444941 1442892 1445294 1452783 1465944 1484421 1507680 1535728 1568448 1605117 1645353 1689821 1739394
57408 1739394 1794296 1854641 1921061 1994155 2073964 2160491 2253965 2353866 2458237 2564596 2671100
57397 2671100 2776165 2877176 2970002 3049684 3111530 3151925 3168309 3158677 3121996 3059780 2976386
57386 2976386 2876500 2762913 2638087 2506901 2375248 2245698 2116937 1988323 1862689 1743412
57376 1743412 1630814 1523407 1421274 1326181 1239125 1159663 1087192 1021184 960278 902726 848023
57365 848023 797154 751029 709345 670858 634145 598286 563498 531014 501787 475444 450930
57354 450930 427794 406266 386505 368468 352253 337843 324659 311942 299374 286788 273557
57343 273557 259047 243666 228893 216125 205735 197077 189025 180742 172306 164581 158201 152829 147664
57330 147664 142423 137436 132994 128925 124796 120323 115584 110872 106223 101329 96349 92569 91432 92749
57316 92749 94646 95581 95634 95510 95179 94272 93057 91985 90675 88432 85750 84429 85907 89917 94976 99783
57300 99783 103924 107350 109538 109564 107314 104252 102232 101476 100478 98118 95078 92653 90969 89165 86840
57285 86840 84402 82208 80101 77763 74921 71277 66890 62613 59616 58350 58332 58869 59568 60244 60907 61922
57269 61922 63777 66488 69514 72393 75224 78481 82593 87787 94112 101459 109584 118159 126813 135404
57255 135404 144418 154840 167238 181130 195708 211098 228248 247337 267001 285759 303904 323180
57243 323180 344596 367362 390264 413283 437125 461710 486175 510368 535394 562439 591801
57232 591801 623328 656891 691822 726717 760721 794625 829862 866779 904735 943554 983703
57221 983703 1024921 1065685 1104396 1140500 1174128 1205192 1233069 1256753 1275169 1287843 1295443 1299317
57209 1299317 1300557 1299921 1298248 1295856 1291446 1282802 1269060 1251439 1231294 1208615 1183350 1157243 1132969
57196 1132969 1111796 1093268 1077052 1063864 1054376 1048324 1045228 1045346 1049398 1057855 1070844 1088117 1108457
57183 1108457 1129531 1149184 1166989 1184072 1201440 1219068 1236578 1254011 1271367 1287846 1302455
57172 1302455 1315488 1328752 1343866 1360611 1377437 1393626 1410591 1430838 1455841 1485275 1518255
57161 1518255 1554683 1595005 1639006 1685684 1734461 1785809 1840264 1897337 1955963 2015610 2076176
57150 2076176 2137015 2196846 2254807 2310949 2365502 2418105 2468014 2514941 2559797 2604925 2653338
57139 2653338 2706989 2765514 2826964 2889717 2953281 3017487 3081757 3145389 3207895 3268733 3327095
57128 3327095 3382266 3434004 3482550 3528466 3572146 3612998 3649380 3680063 3705704 3728291 3749353
57117 3749353 3769513 3789606 3811082 3834967 3861013 3888141 3915295 3942157 3969602 3999137 4031140
57106 4031140 4064025 4095984 4127019 4158136 4189144 4218788 4246764 4274173 4302292 4332513 4367096
57095 4367096 4407950 4454591 4504972 4558043 4613351 4668423 4719303 4764184 4804072 4839322 4868130
57084 4868130 4889228 4903429 4911342 4911953 4904549 4889449 4865362 4828313 4774711 4703276 4612554 4498884
57072 4498884 4358570 4189874 3991078 3758591 3488804 3180173 2831999 2442970 2012063
57063 2012063 1538556 1019515 449136 -178138 -865807 -1617089 -2435899 -3325346 -4288799
57054 -4288799 -5333814 -6471938 -7713767 -9067940 -10545921 -12163238 -13934863 -15874671
57046 -15874671 -18001592 -20341119 -22919006 -25760048 -28896535 -32372468 -36237771 -40547378
57038 -40547378 -45372681 -50809672 -56973441 -63991117 -71998733 -81126229 -91468263 -103067903
57030 -103067903 -115927065 -130022515 -145312600 -161739821 -179205141 -197478900 -216119724
57023 -216119724 -234567536 -252421939 -269616780 -286199227 -301851388 -315649229 -326336963
57016 -326336963 -332850848 -334631691 -331594071 -323972642 -312239511 -297067956 -279259254
57009 -279259254 -259646219 -239022945 -218097158 -197448191 -177510720 -158597158 -140926038
57002 -140926038 -124627987 -109747711 -96265959 -84128261 -73259869 -63573980 -54983896
56995 -54983896 -47407736 -40758214 -34936031 -29841281 -25387319 -21499324 -18106774 -15144852
56987 -15144852 -12558614 -10299276 -8319818 -6579351 -5047879 -3701753 -2517818 -1475811
56979 -1475811 -561312 239763 946872 1580290 2153744 2675514 3153410 3593924 3999279
56970 3999279 4370263 4710335 5023278 5309249 5567273 5799797 6011130 6203238 6376750
56961 6376750 6534425 6680091 6815598 6941980 7061936 7177647 7287252 7386674 7474088 7549873
56951 7549873 7613310 7662491 7697392 7720899 7737060 7750016 7764287 7784538 7814002 7851068 7884520
56940 7884520 7892904 7854016 7758773 7614714 7435520 7230291 7003713 6760897 6507061 6244739
56930 6244739 5975302 5702051 5428904 5157481 4888088 4621929 4359799 4100386 3842802
56921 3842802 3589450 3343866 3107211 2879502 2662777 2460145 2272714 2099951 1941976
56912 1941976 1799036 1669744 1552140 1445566 1349632 1262762 1183892 1114048 1053969 1001731
56902 1001731 955155 914910 882599 857382 837396 822968 815021 811150 806365 797217 782643 761888
56890 761888 734872 704055 672695 641338 608818 576417 547933 525386 507289 491535 477630
56879 477630 465815 456289 449907 447800 449845 454932 462714 473740 488140 505528 525394 545540 560723
56866 560723 565229 557222 539322 515546 489292 463199 438273 413127 386237 359005 334767 314977
56854 314977 298364 283541 270245 258021 245977 234253 223936 215326 207915 202018 198528 196986
56842 196986 195819 194748 195193 198066 202810 208865 216479 225735 236239 248014 261484 276566 293119
56829 293119 312153 334977 361090 388304 414888 440220 463566 483745 499919 511289 516457 514860
56817 514860 508591 500833 492497 482331 470362 459113 450995 446342 444563 445514 449079 454903 463378 475866
56803 475866 493418 516065 543615 576230 613880 655458 697860 735393 761404 772319 769856 758347
56791 758347 740939 719573 696857 675253 655287 637209 623683 617820 618887 623183 629489 640701
56779 640701 659506 685407 716939 754141 797715 847952 905293 969056 1033904 1089758 1127299
56768 1127299 1142806 1137434 1114309 1077821 1033406 985539 936574 888512 844420 806696 775283
56757 775283 749128 728433 714229 706749 705577 710648 722066 739709 763775 794739 831746 871784
56745 871784 911006 945799 971958 984585 980635 961278 930947 894585 856107 818144 781966 747979
56733 747979 716835 689408 665572 644302 625572 610951 601582 596801 595472 597488 603084 611915 623708
56720 623708 638574 655469 671304 682682 687768 685815 676216 659428 637960 615046 592535 570689
56708 570689 549211 527738 506298 486127 468977 454662 440414 423986 406521 391044 378953
56697 378953 369446 361588 355191 349876 344926 340307 336627 333877 331084 327435 323090 318885 315788 314453
56683 314453 314513 314339 312341 308768 305711 305029 306478 308077 308162 306931 305895 305897 306064 304941 302262 299125 296770
56666 296770 295784 296123 297100 297623 297321 297230 298396 300100 300687 299983 299464 299887 300229 299383 297579 295639 294072
56649 294072 293422 294201 295712 296102 294468 292152 291149 291966 293664 295275 296468 297295 297835 297856 296818 294722
56633 294722 292748 292162 292682 292834 291731 289578 286816 284116 282825 283722 285501 286142 285540 284846 283650 280491
56617 280491 276156 273432 272889 272006 269613 267964 268613 269339 267770 265481 265525 267720 269534 270302 271451 273326
56601 273326 274827 275876 277503 279480 280244 279425 278426 278246 278462 278562 278635 278457 277496 276129 275611 276493 278134
56584 278134 279913 281877 284019 285861 287062 287746 288066 287981 287500 286835 286408 286757 287917 288775 287960 285683 283646
56567 283646 282650 281523 279097 275956 273256 271085 269042 267131 264915 261118 255646 250826 248954 249521 250386
56552 250386 250758 251359 252591 254370 257012 260352 262611 262149 260020 258958 260052 262048 263659 264724 265161
56537 265161 264676 263815 263996 266146 270065 274879 279251 281740 282192 282274 283425 284855 284936 283918 283634 284936
56521 284936 286992 288873 290332 291302 292032 293419 295890 298378 299694 300272 301143 301998 302074 302156 303632 306070
56505 306070 307939 309435 312368 317315 323064 328913 335349 342261 348613 354304 360399 367169 373694 379650
56491 379650 385549 390905 394268 395708 397221 399914 402595 404018 404765 405800 406735 406681 405689 404256 402375
56476 402375 399967 397478 395325 393347 391182 388451 384450 378666 371857 365590 360426 355538 350342 345430
56462 345430 341576 338780 336531 334214 331218 327558 324322 322533 321723 320728 319547 319062 319136 318507 316563 313730
56446 313730 310229 306065 302189 299899 298860 297471 295486 294481 295263 296562 296989 296791 296846 297109 296900 295956
56430 295956 294768 294436 295937 298719 300631 300629 300874 304229 310235 315876 320077 324699 330752 336491 340280
56415 340280 342946 345927 349013 351308 352942 354682 357101 360918 366705 373653 380116 385935 392414 399386
56401 399386 404595 407232 410043 416165 425251 434363 441646 447737 454315 462379 471343 479087 483608 485059
56387 485059 485256 485133 484065 481903 479822 478613 477851 477392 477919 479213 479735 478858 477741 476987 475277 471601
56371 471601 467139 463625 461160 458824 456089 452599 448000 443053 439506 437854 436617 434630 432333 429913
56357 429913 426122 420265 413652 407778 402683 398325 395603 394480 392939 389629 386069 384491 384791 385194 384566
56342 384566 382607 379237 375414 373142 373027 373104 371600 369289 367644 366455 365260 365450 368517 373357 377560
56327 377560 380484 383113 385839 388443 391414 395282 399300 402496 405266 408369 411362 413660 416002 418989
56313 418989 421361 421827 421663 423306 427083 431347 435184 439001 443097 447590 453173 460066 466809 471929 476164
56298 476164 481193 486882 491758 495572 499301 503121 506448 509627 513527 517689 520838 523128 526030 529964
56284 529964 533660 535943 536864 537159 537697 539173 541344 543232 545026 548742 555623 563993 571383 577790 584958
56269 584958 593328 601731 609569 617329 625285 633423 642253 652136 662316 672050 682056 693402 705831
56256 705831 718655 732168 746419 759803 770969 781126 792262 804119 815309 826360 838893
56245 838893 852335 864361 874496 884617 895768 906893 916993 926374 935379 943805 951945 960612
56233 960612 969985 979748 990201 1001821 1014190 1026856 1040756 1057144 1075615 1094828 1114593 1135649
56221 1135649 1158261 1182739 1210391 1241920 1275848 1310743 1348057 1390415 1437982 1489012 1543160
56210 1543160 1601587 1664500 1731473 1803754 1883376 1970232 2062792 2161533 2268807 2385447 2510320
56199 2510320 2643421 2786772 2942002 3109390 3289184 3481383 3684134 3894656 4111646
56190 4111646 4334591 4561173 4787905 5012605 5233160 5444216 5638444 5811177 5960865
56181 5960865 6085257 6180853 6246549 6284330 6295591 6279997 6238798 6176067 6095573 5999150 5889044
56170 5889044 5769112 5642559 5510870 5375593 5238594 5099816 4957473 4811334 4663493
56161 4663493 4515276 4365995 4215359 4064519 3914016 3763263 3612756 3464379 3319034
56152 3319034 3176490 3037889 2905585 2780084 2660035 2545641 2438885 2339801 2245866 2156027
56142 2156027 2072180 1995693 1925531 1860710 1801339 1746203 1692772 1640962 1593586 1551717 1512903
56131 1512903 1475552 1441598 1412861 1387943 1364971 1344506 1327454 1312658 1298934 1287222 1278549
56120 1278549 1271878 1265942 1261302 1258698 1257200 1255792 1255242 1256821 1260597 1266153 1273522 1282662 1293542 1307134
56106 1307134 1324324 1343692 1362822 1382018 1403811 1428394 1452698 1474602 1494862 1514209 1532078
56095 1532078 1549186 1567718 1587616 1606138 1622441 1639081 1657595 1676306 1694148 1713082 1735019
56084 1735019 1760043 1789442 1826564 1872387 1924037 1980143 2044058 2119146 2204281 2296767 2396388
56073 2396388 2503671 2617036 2734411 2854696 2974988 3089380 3193533 3288118 3375509 3455936
56063 3455936 3529263 3597261 3660792 3716949 3761535 3792283 3807880 3807052 3791148 3764846 3731617 3690736
56051 3690736 3640469 3581065 3512552 3433190 3342771 3244554 3141653 3034805 2925907 2820099
56041 2820099 2721494 2630146 2545714 2470485 2405982 2350230 2301412 2260884 2229775 2206049 2187554
56030 2187554 2174242 2164633 2154373 2141548 2129513 2121181 2114399 2106104 2096766 2087359 2076452 2064147
56018 2064147 2054389 2049231 2045134 2039059 2033779 2032743 2034222 2035450 2038234 2045327 2055219 2065698 2078704
56005 2078704 2096420 2116315 2135335 2155433 2179720 2206798 2234156 2263485 2297132 2332881 2367815
55994 2367815 2403892 2444118 2486508 2527343 2567117 2608029 2649266 2690229 2734543 2785041 2838429
55983 2838429 2890668 2943867 3001924 3063271 3124195 3185650 3250540 3317837 3385496 3455497 3529954
55972 3529954 3606136 3681337 3758587 3841578 3928616 4017795 4112895 4217342 4327673 4440318 4559409
55961 4559409 4690262 4830702 4976936 5132162 5300723 5479592 5664942 5861351 6074735
55952 6074735 6301847 6536952 6783283 7047117 7326128 7614821 7916130 8235860 8570945
55943 8570945 8915502 9273772 9654625 10058013 10479658 10924453 11401991 11913215 12454727
55934 12454727 13031615 13652176 14314421 15011955 15748753 16534014 17367522 18245063 19172866
55925 19172866 20160851 21206923 22304127 23457396 24676120 25957027 27293735 28697621
55917 28697621 30190219 31781750 33477755 35299105 37271839 39403143 41690842 44149769
55909 44149769 46804221 49663426 52733778 56049385 59663261 63619853 67971795 72817135
55901 72817135 78285943 84500150 91583550 99694943 109001223 119628070 131691103 145369317
55893 145369317 160901026 178537189 198572617 221389794 247369387 276777727 309801538
55886 309801538 346415880 385566209 424041332 456452855 477143926 482854641 473987336
55879 473987336 453674107 425869598 394044561 360834653 328081734 296904666 267864500
55872 267864500 241217554 217067967 195379342 175994256 158714882 143350306 129703232
55865 129703232 117572966 106788325 97206862 88684167 81079760 74291847 68251567 62881808
55857 62881808 58090520 53801463 49960033 46508383 43383397 40540855 37956023 35598848
55849 35598848 33431508 31430380 29587185 27887331 26308596 24841832 23491407 22252624
55841 22252624 21107425 20043602 19059428 18147298 17290885 16481469 15720992 15006634 14327735
55832 14327735 13680158 13068731 12492823 11943288 11416135 10916169 10444845 9996848 9570644
55823 9570644 9170529 8796236 8441686 8105466 7791578 7498428 7217784 6946029 6686385
55814 6686385 6439245 6200517 5970256 5752774 5547306 5348282 5155370 4973487 4802665
55805 4802665 4637966 4479654 4332855 4196342 4062194 3928040 3799480 3678695 3560419
55796 3560419 3441010 3322029 3203016 3080384 2956079 2838367 2731134 2630205 2532274 2439436
55786 2439436 2352998 2271028 2194244 2126373 2066398 2008092 1949559 1895963 1850854 1812177 1778691
55775 1778691 1752542 1733070 1715438 1697920 1683663 1673086 1661714 1647763 1634482 1622429 1606645
55764 1606645 1584514 1559538 1534300 1506383 1474409 1441554 1409641 1375900 1339075 1302980 1270531
55753 1270531 1239696 1208662 1179653 1154249 1130137 1105892 1084079 1066266 1049774 1032774 1018083
55742 1018083 1008397 1001736 994960 988234 983118 979669 977948 978980 981998 983933 983325 981271 977429 969483
55728 969483 957962 946887 937765 927600 914690 901450 889274 875772 860068 846030 836751 829810
55716 829810 821298 810867 799623 786452 769820 750547 730148 708946 687718 668248 650545 632773
55704 632773 615558 602560 594778 588140 578925 567818 556338 543294 527621 511215 496050 481512
55692 481512 467087 454391 443988 433451 421432 410671 404199 401215 399191 397382 395830 393566 390117
55679 390117 386320 381812 374724 365774 359213 357150 356186 352451 347040 343533 342788 343098 343255 342601 340062
55664 340062 335625 331030 327085 322289 315728 308938 303320 298418 294365 292878 293843 294117 292031 290014 290375
55649 290375 291679 291958 292300 294173 296176 296771 297704 301273 306274 309911 311846 313384 314606 315337 317149
55634 317149 321252 325847 328388 329135 329953 331265 332821 335863 341629 348948 355966 363216 372570 384207
55620 384207 396714 408992 420055 428240 432720 434735 435668 435243 433078 430157 426985 422119 414555 405931
55606 405931 398558 392892 388565 385930 384841 384020 383438 385030 389143 392754 393574 393536 395723 400195 405365
55591 405365 410943 416483 419394 417943 414435 412087 410376 406843 401850 397800 394689 390166 383504 376076
55577 376076 368157 358417 346672 334537 323200 312621 302760 293652 284467 274192 262818 250706
55565 250706 237827 225127 215144 209311 205883 202395 198711 195715 192776 188979 185350 183169 181257 177667
55551 177667 172958 169179 166566 163889 161141 159250 157939 156457 155614 156402 157400 156316 153547 151487 150724
55536 150724 149609 147310 144713 142380 139970 137653 136007 134627 132672 130475 128847 127407 125477 123786
55522 123786 123226 122661 120272 116388 112774 109826 106830 104255 103132 102572 100544 97007 93833 91778 89925
55507 89925 88107 87548 88884 91515 94846 98389 100889 101474 101432 102709 104802 105305 103505 101270 100217 100083
55491 100083 100168 100445 100754 100413 99133 97316 95485 94223 94113 94721 94453 92725 91225 91568 92939 93877 95113
55474 95113 98290 102851 106723 109495 112538 116517 121152 126912 134460 142704 149750 155546 161320 166800
55460 166800 170406 172019 173121 174309 174942 175061 175303 175009 172853 169373 166568 164960 163200 160453 156817
55445 156817 151598 143773 134330 125601 118108 110586 103288 98431 96728 96067 94595 92795 91463 89709
55431 89709 86210 80963 74835 68562 62816 58156 54580 52044 51158 52121 53477 53532 52533 51661 50598 48333
55415 48333 45715 44496 44192 42721 40152 38790 39163 38926 36536 33285 30770 28934 27626 27559 28418 28310
55399 28310 26513 24852 24979 26049 26466 26319 26696 27711 28395 27812 25689 22772 20704 20468 20998 20625 19484
55382 19484 18772 18132 16274 14077 14255 17414 21041 23210 24782 27004 29457 31594 34061 37103 39606
55367 39606 40995 42211 43645 44036 42753 41274 40977 41136 40572 39731 39589 39846 39719 39488 40019 41612 44145
55350 44145 47334 50187 51470 51330 51154 51403 51204 50555 50818 52093 52175 49538 45639 42883 41809 41615 41974
55333 41974 42817 43473 43425 43041 42639 41807 40380 38864 37189 34520 31026 28240 26876 26062 25538 26503 29001
55316 29001 30566 29281 26471 24588 23927 23274 22357 21560 20256 17515 13808 10314 7190 4158 2168
55301 2168 2722 5809 9797 13161 15274 15963 15410 14296 13296 12672 12677 13582 15005 16168 17109 18450 19701
55284 19701 19437 17687 16275 15977 15410 13915 13329 15116 17687 18832 19278 21325 24898 27406 27156 24939
55268 24939 22454 20885 20747 21501 21481 19516 16458 14032 12709 11849 11193 10864 10495 9787 9432 10115 11101
55251 11101 11196 10590 10354 10642 10897 11341 12566 13895 13853 12304 10655 9839 9494 9311 9786 11114 12386 12574
55233 12574 11723 10894 11305 13615 17537 21999 25917 28801 30480 30653 29107 26165 22731 20149 19890 22502
55217 22502 26643 30018 31717 32812 34263 35342 34822 32833 30696 29581 29910 31250 32109 30808 27434
55202 27434 24312 23699 25591 28362 30774 32589 33975 35138 36168 36759 36590 36112 36045 35991 34942 33417
55186 33417 33427 35536 37687 38059 37466 37493 37769 36854 34766 32793 31430 30098 28604 27458 26963 26933 27043
55169 27043 26814 25869 24774 24738 25855 26698 26497 26418 27727 29883 31575 32456 32660 31879 30275 29151 29315
55152 29315 29883 29944 30088 30873 31202 30066 28681 28938 30615 31966 32186 31616 30511 29514 30262 33307 36300
55135 36300 36527 34672 33860 35367 37458 38094 36698 33599 29937 27917 29013 31877 33900 34570 35263 36054
55119 36054 35256 32484 29896 29766 32358 36479 40454 42463 41748 39804 38817 38776 37812 35375 33050 31933
55103 31933 31170 29673 27506 25045 22570 21246 22646 26307 29294 29272 26910 24506 23370 23395 24084 24965
55087 24965 25660 26270 27371 29226 31405 33172 33796 32721 30241 27716 26281 25718 25478 26121 28258 30610
55071 30610 31000 29247 27389 26915 27383 27941 28602 29662 31235 33640 36988 40290 42381 43698 45612 48069
55055 48069 49716 50419 51568 53424 54320 53409 52376 53252 55863 58379 59264 58018 55325 53145 53374 55656
55039 55656 57619 57771 56841 55942 55195 54889 56075 58782 61216 62112 62561 64180 66705 68786 69985 70561
55023 70561 70340 69448 69243 70791 73063 74365 75020 76613 78700 78501 74656 69714 67664 69801 74053 77727
55007 77727 79696 80037 78963 76909 74853 73482 72278 70488 68913 69455 72484 75893 77454 77052 75797
54992 75797 74158 72192 70501 69475 68374 66681 65510 65960 66848 66104 63964 62565 62603 62616 61739 60911 61011
54975 61011 61834 63296 65566 67593 67707 66422 66374 68445 70053 68682 65372 63227 63866 66612 69885 72122
54959 72122 72461 71708 71716 73025 74377 75217 76891 80147 83257 84305 84047 84672 86721 88885 90174 90743 91141
54942 91141 92074 94354 97889 101295 103531 105234 107447 109877 111460 111774 110741 107944 103597 99380 96891
54927 96891 95928 95475 95527 96541 97987 99048 100037 101471 102384 101461 99499 98885 100648 103614 106400 108593
54911 108593 109925 109991 109331 109427 111052 113496 115687 117251 118400 119739 122170 126013 130139 133082 135043
54896 135043 137758 142247 147838 153685 160014 167345 175527 184252 193731 204122 214895 225614 237081
54883 237081 251048 268762 289978 313199 336513 358337 377715 394047 406566 414147 415724 411004
54871 411004 400903 387171 371408 354428 336711 319173 302845 287747 272824 257413 242356
54860 242356 229313 219294 211997 206084 199999 193205 186985 183352 182773 183660 184571 186024 189344 194506
54846 194506 200276 206129 212926 221689 232544 245059 258962 274256 290935 308696 326850 344540
54834 344540 360987 375237 385831 391487 392287 389444 383524 373715 359425 341849 323167 304745 286861
54821 286861 269759 254052 240187 228026 216903 205925 194702 184086 175596 169678 165137 160698
54809 160698 156314 152378 148567 144385 140238 136900 134349 131961 129476 127054 124860 123349 123264 124345 124659
54794 124659 122340 117765 113027 109616 107555 106362 105652 104967 104118 103581 103589 103188 101367 98771 96960 96032
54778 96032 94495 91595 88299 85618 83451 81737 81254 82218 83136 82390 80474 79555 80983 84114 87478 90178
54762 90178 91995 92894 93079 93336 94779 98018 102641 107573 111794 114621 115708 115342 114716 115291 117675 121413
54746 121413 125827 130327 133947 135778 136620 139186 145460 154327 162906 169989 177025 185804 196361 207487
54732 207487 218316 228925 240051 252808 268257 286689 307283 328577 349260 368665 386797
54721 386797 403738 418704 429776 435105 434439 429118 420607 409445 395625 379475 361990 344602
54709 344602 328834 315807 305712 297730 290694 283904 277373 271353 265804 260500 255634 251979 250209
54696 250209 250287 251765 254446 258313 263201 269167 276956 287235 299393 312025 324815 339180 356665
54683 356665 377210 399173 420520 440040 458063 475890 493517 507967 515055 513120 503988 490307
54671 490307 473516 454725 435568 416941 398175 378649 359057 340125 321488 303183 286830
54660 286830 273608 262142 250214 237748 226284 216355 207418 199774 194269 190259 186051 181481 178015
54647 178015 176023 174034 171282 168977 168107 167595 165881 163139 160753 159402 158662 157924 156851 155334 153662
54632 153662 152471 152195 152876 154519 156981 159403 160627 160549 160348 160991 162183 163168 163761 163983 163352 161423 158824
54615 158824 157064 157155 158694 160310 160908 160548 160280 161260 164133 169056 175662 182670 188272 191728 194404 198442
54599 198442 204325 210294 214209 215569 215691 216308 218120 220542 222832 225149 227928 230431 231160 230241 230176 233171
54583 233171 238577 244004 248234 251818 255481 259488 264335 270642 278283 286605 295379 304559 313511 321770
54569 321770 330268 340416 351973 363044 372119 378848 382983 384112 382609 379422 374645 367660 358898
54556 358898 349962 341520 332484 321928 310572 299705 289752 280613 272465 265465 259332 253754 248559
54543 248559 243329 237730 232454 228743 226535 224119 220078 214607 208508 202110 195865 191011 188662 188665 189820
54528 189820 190688 190062 187590 184245 181325 178685 174987 169910 164834 160789 157060 152594 147688 143364 140072
54513 140072 137824 136690 136295 135617 134118 132261 130297 127559 123793 120149 117802 116598 116095 116934 119764
54498 119764 123532 126273 127179 126714 125252 122956 120676 119586 119964 121342 123564 126522 129098 129800 128667
54483 128667 127374 127227 127978 128837 129610 130439 131324 132462 134370 137057 139486 140476 140095 139867 141476 145209
54467 145209 149604 152862 154855 157502 162704 170140 177596 183388 187836 192293 197366 202422 206389 208570
54453 208570 208831 207460 204963 201823 198365 194874 191753 189260 187029 184200 180396 176324 172885 169733
54439 169733 165459 159474 152975 147575 143621 140480 137858 135909 134406 132851 131316 130322 129935 129728 129506
54424 129506 129226 128456 126841 125020 124055 124008 124170 124572 125939 128096 129868 130979 132651 135686 139206 142007
54408 142007 144006 145675 147151 148779 151373 154879 157637 157992 156064 153127 150115 147616 146403 146722 147575
54393 147575 147849 147696 147843 148077 147640 146747 146498 147299 148357 148729 148119 146673 144752 142872 141319 140006 139064
54376 139064 139016 139646 139348 136709 132466 128746 126493 124803 122818 121025 120219 120268 120641 121524 123517 126423
54360 126423 129027 130237 130050 129277 128651 128527 129240 131073 133633 135907 137488 139324 142472 146502 150075
54345 150075 152805 155401 158043 160133 161930 164867 169387 173830 176652 178792 182509 188517 195376 201238
54331 201238 205146 207146 208214 209714 211872 213147 212156 209807 208315 208347 208468 207393 205380 202976 199737
54316 199737 195057 189575 184877 181959 180428 179134 177263 174860 172462 170429 168690 167088 165672 164580
54302 164580 163946 163943 164473 164670 163331 160147 156113 152432 149506 147251 145723 144983 144898 145557 147338 150040 152580
54285 152580 154189 155424 157397 160497 164409 168801 173198 176737 178913 180319 181910 183768 185218 185849
54271 185849 185801 185407 185169 185676 186791 187209 185537 181679 176728 171896 168005 165402 163653 161752 159254 156726
54255 156726 154564 152186 149122 145969 143184 139863 135145 130181 127071 126086 125558 124413 123184 122311 121049
54240 121049 118722 115868 113487 111964 111182 110900 110567 109455 107442 105167 103254 101989 101792 103150 105660
54225 105660 107925 108867 108642 107900 106709 104700 101904 98936 96488 94863 93903 93199 92477 91827 91526 91807
54209 91807 92920 95169 98569 102718 107210 111859 116183 119117 119901 119079 118028 117620 117808 118352 119352 120891
54193 120891 122496 123201 122203 119653 116639 114032 111484 108229 104673 102194 101303 101276 101908 104131 108087 112040
54177 112040 114341 115270 115743 115465 113968 112347 112018 112526 112532 112478 114126 117548 120674 122127 122711 123711 125339
54160 125339 127390 129940 132698 134746 135495 135139 133964 132135 130163 128485 126544 123532 120169 118463 119358
54145 119358 121764 124066 125488 125822 125190 124352 124014 123592 121980 119711 118749 119631 120545 119995 118793 118285 117995
54128 117995 116500 113794 111431 110658 111341 112415 112742 111840 110253 108852 107670 106119 104485 104147 105859
54113 105859 108718 111316 113029 113718 113182 111583 109619 107595 105197 102643 101077 101099 101795 101969 101440 100410
54097 100410 98541 95722 93028 91790 92136 93145 93921 93845 92541 90525 89252 89656 91099 92593 94303
54082 94303 96838 99649 101382 101517 100594 99067 97076 95177 94105 93668 92876 91472 90501 90945 92398 93520
54066 93520 93452 92441 91324 90708 90648 90833 90913 90577 89604 88170 86922 86334 86119 85820 85935 87580 90795 93892
54048 93892 95063 94155 92433 90979 89834 88445 86556 84728 84074 85196 87391 89378 90811 92389 94400
54033 94400 96049 96655 96606 96434 95575 93045 89172 85885 85196 87716 92449 97523 101107 102236 101336 100068
54017 100068 100315 102690 105791 107423 106918 105759 105474 105644 104868 103091 101669 101351 101530 101561 101642 102166 103281
54000 103281 105284 108354 111740 114314 116080 117954 120026 121497 122510 124272 126711 127865 126715 125088
53986 125088 125486 128193 131793 135358 138672 141298 143052 144893 147994 152251 156772 161289 166003 170594
53972 170594 174656 178698 183594 189327 195254 201285 207743 214385 220567 226166 231426 236137 239868 242774
53958 242774 245398 247960 250589 253793 257723 261404 263688 264771 265779 267046 267683 266779 264277 260808 257323
53943 257323 254657 252834 251032 248709 246233 243840 240832 236708 232406 229256 227211 225223 222897 220593
53929 220593 218374 216094 214148 212836 211429 209356 207972 209264 212640 214807 213493 209905 206796 205335
53915 205335 204785 204245 203587 203029 202634 202249 201659 200917 200576 201345 203446 206465 209528 211307 210442 206913 202834
53898 202834 200936 202091 204915 207572 209237 209983 210369 211279 213202 215427 216758 217219 218125 220220 222740
53883 222740 224886 227385 231751 238350 245884 252643 257853 261900 265591 269364 273269 277635 283304 290729
53869 290729 299039 306599 312456 316945 321067 325745 331473 337916 343773 347558 348712 347734 345546 343192
53855 343192 341807 341957 342933 343484 343476 344304 347433 352941 359610 365992 371256 375318 378354 380224 380709 380406
53839 380406 380649 381883 382670 381211 377515 373143 369117 365237 361302 357643 354144 350031 345244 341009 338217
53824 338217 335975 332558 327409 321419 315581 310157 305092 300464 296230 291881 286738 280554 273690 266671
53810 266671 259788 253274 247589 243034 239023 234370 228761 223537 220389 219229 217802 213711 206908 200084
53796 200084 196257 195613 195136 192009 187008 183416 182788 183286 182558 180492 178172 175786 173198 171370 171210 171578
53780 171578 170381 167518 164905 163590 162603 161061 159698 159536 160315 161179 162082 163685 166239 169085 170972
53765 170972 170812 168642 165927 164341 164175 164521 164880 165719 167392 169345 170795 171532 171791 171858 172094 172878 174353
53748 174353 176439 179059 182078 185257 188563 192056 195077 196326 195585 194717 195891 199358 204012 209418 215729
53733 215729 222154 227445 231949 237371 244107 250454 254970 258099 260945 263849 266882 270428 274430 278124
53719 278124 281140 283897 286360 287586 287105 285568 283420 280197 275962 272073 269378 266792 262989 258601
53705 258601 255388 253840 252978 252082 251302 250704 249886 248580 246850 244765 242611 241227 241290 242249 242662 241731 240094
53688 240094 239078 239533 241273 243244 244257 243850 242376 240205 237153 233030 228503 225050 223984 225494 228495
53673 228495 231451 233627 235425 237232 238311 237537 235061 232325 230297 228522 226176 223359 220930 219671
53659 219671 219849 221061 222332 222901 223075 223779 225336 227378 229771 232546 234923 235702 234976 234329 234820 235910
53643 235910 236827 237869 239680 242302 245616 249601 253468 255739 256242 256885 259221 262220 263909 264460 265911
53628 265911 269143 272780 275375 277178 279117 281036 281861 281253 280338 280633 282583 285498 288817 292734 297169
53613 297169 300881 302607 302724 302621 302649 302076 301029 300723 301286 301140 299466 297685 297216 297206 296074 294216 293421
53596 293421 294217 295474 296311 296777 296764 295707 293503 290730 287936 285705 285219 287522 291958 296352 299097 300486
53580 300486 301872 304169 307371 311010 314741 318452 321656 322943 320912 316133 311412 309316 309976 311998
53566 311998 314724 318476 323143 327875 332136 335922 338946 340696 341478 342513 344624 347413 349875 351434
53552 351434 352370 353709 356660 361740 368436 375884 383516 390806 396978 401614 405106 407939 410066 411686
53538 411686 414024 418364 424611 431620 438617 445401 451511 456245 459569 462200 464861 468065 472288 477485
53524 477485 482568 486186 488019 488840 489580 490781 492376 493261 491866 488251 484986 484630 486742 488780 489652
53509 489652 490772 493604 497786 502044 505545 507830 508572 508002 506779 505227 503586 502979 504675 508073 510917
53494 510917 512292 514006 517917 523040 526688 527860 528165 529692 533124 537888 542952 547181 549785 551071
53480 551071 552434 555165 559307 563840 567841 571214 574413 577995 582729 589622 599050 609849 620051 628738
53466 628738 636522 644057 651187 658158 666592 677968 691620 705428 718334 731173 745185 760750
53454 760750 777559 795142 813121 831637 851438 872810 894794 916456 938734 963665 991647
53443 991647 1020679 1048638 1075249 1101508 1128328 1156358 1186133 1217510 1249494 1281268 1312986
53432 1312986 1345147 1377648 1409942 1441792 1473480 1505417 1537708 1569911 1601291 1631657 1661781
53421 1661781 1692564 1723985 1755396 1786408 1816736 1845640 1872838 1899711 1928161 1958029 1987028
53410 1987028 2013548 2038111 2061604 2083815 2104754 2125908 2148411 2170746 2189854 2204395 2215626
53399 2215626 2225206 2233360 2239382 2242830 2243609 2241458 2235921 2226830 2214689 2200592 2185684 2170654 2155772
53386 2155772 2141228 2126956 2112101 2095398 2076455 2056244 2035922 2015682 1995245 1974982 1955681
53375 1955681 1937198 1918125 1897155 1874584 1852251 1832116 1815048 1800843 1789009 1779121 1770588 1762751
53363 1762751 1755675 1750374 1747635 1746905 1746935 1747302 1748578 1751176 1754856 1759450 1765219 1772343 1780747 1790547 1801941
53348 1801941 1814582 1828023 1843054 1861652 1884988 1912199 1941618 1972443 2004602 2037701 2071126
53337 2071126 2104894 2139863 2177227 2218131 2263190 2311749 2361990 2412464 2463462 2516477 2572576
53326 2572576 2631603 2692545 2754139 2815551 2877172 2940617 3007369 3077359 3149077 3220711 3290725
53315 3290725 3357807 3421180 3481157 3538820 3594887 3649032 3700305 3747882 3791322 3830417 3864947
53304 3864947 3894626 3919328 3939354 3955135 3966473 3972427 3972417 3967265 3958479 3946189 3928309 3902446
53292 3902446 3868711 3830200 3790340 3750011 3707611 3661588 3612137 3560550 3507955 3455230 3403252
53281 3403252 3352400 3302339 3253131 3205921 3161465 3118377 3074120 3027765 2980652 2934286 2888820
53270 2888820 2843835 2799348 2755458 2712006 2669271 2628253 2589741 2553730 2520045 2488592 2458622
53259 2458622 2428917 2399464 2371876 2347114 2323745 2299763 2275449 2252848 2232536 2212338 2189644
53248 2189644 2163978 2136967 2110690 2086667 2065785 2048218 2033149 2018983 2004360 1989251 1975092
53237 1975092 1963622 1955577 1950587 1947959 1947034 1947079 1947888 1950708 1957534 1968778 1982407 1996132 2009877 2025253
53223 2025253 2043170 2063069 2084188 2106461 2129950 2154371 2179501 2205240 2230893 2255035 2276730
53212 2276730 2296541 2315705 2334391 2351302 2365028 2375358 2382996 2388422 2391543 2392336 2391144 2388135 2382955
53199 2382955 2375279 2365202 2352691 2337234 2318692 2298058 2276512 2254040 2230026 2204895 2179900
53188 2179900 2155144 2129202 2101157 2071864 2042620 2013706 1984987 1956804 1929157 1900909 1871251
53177 1871251 1841547 1814264 1789985 1766512 1741196 1713367 1684246 1655283 1627168 1600116 1574455
53166 1574455 1550492 1527828 1505238 1481786 1458018 1435473 1414890 1395586 1376790 1358778 1342166
53155 1342166 1326817 1312232 1298434 1285526 1272607 1258063 1241052 1222140 1202320 1181837 1160137
53144 1160137 1136851 1112729 1089373 1067657 1046534 1024161 1000344 977052 956147 937463 919714
53133 919714 902312 885372 868731 852240 836616 822743 810163 797352 783575 769427 755533
53122 755533 741765 728036 714761 701835 687968 671972 654494 637710 623208 610658 598770
53111 598770 587183 576950 569156 563508 558537 552898 546040 537985 529162 520498 512838 506073 499492 493187
53097 493187 488263 485187 482665 478829 473080 466282 459724 454402 450601 447362 442890 436421 429423 424168
53083 424168 421236 419113 416065 411858 407792 405494 405420 406148 405577 403315 401290 401379 403049 404182 403574 401607
53067 401607 399015 396335 394346 393646 393625 392917 391072 388800 386491 383684 380321 377461 376091 375929 375990 375770
53051 375770 375349 374716 373522 371423 368482 365371 363048 361859 361045 359599 357477 355353 353310 350706 347598
53036 347598 345446 345704 348008 350326 350876 349745 348660 349276 351653 354438 356356 357054 356491 354374 351025
53021 351025 348109 347284 348154 348540 346978 344052 341039 338171 334839 330926 327166 324237 321920 319270 315634
53006 315634 311497 308163 306417 305685 304666 302530 299270 295316 291320 287963 285421 283146 280613 277880
52992 277880 274988 271452 267187 263425 261542 261180 260608 258866 256468 254057 251645 249396 247840 246793 245147
52977 245147 242375 239384 237248 235902 234826 234292 235056 237110 239358 240435 239533 236886 233783 231683 230908
52962 230908 230500 229603 228491 227936 228105 228534 228706 228167 226530 224015 221661 220407 220081 219781 219083 218358 217980
52945 217980 217777 217355 216617 215811 215257 215101 215211 215249 214987 214643 214853 216178 218502 220922 222390 222558 221943 221282
52927 221282 220959 220964 221018 220597 219371 217954 217743 219471 222220 224294 224785 223898 222336 221146 221675 224576 228738
52910 228738 232046 233392 233491 233775 235179 237954 241842 246128 249989 253103 255672 257951 260043 261925 263216
52895 263216 263284 262149 261050 261414 263528 266744 270512 274458 278075 281447 285752 291733 298130 303242 307622
52880 307622 313244 319971 325172 327544 329207 332716 337635 341615 343565 344248 344598 344983 345558 346095 345967 345355
52864 345355 345720 347857 350128 350145 347864 345543 344710 344678 344278 343708 343906 344898 345609 345222 344264 344127 345275 346165
52846 346165 344672 340780 337009 335505 335632 335411 334510 334408 335858 337801 338986 339364 339419 339274 339148 339831 341851
52829 341851 344604 347003 348646 349774 350450 350502 350142 349894 349763 349113 347687 346278 345890 346510 347232 347450 347342
52812 347342 347239 347370 348500 351827 357291 362627 365233 364937 363890 363815 364464 364963 365387 366247 367322 367906 367815
52795 367815 367443 367190 367407 368492 370387 372271 373429 374336 376192 379382 382792 384833 384874 383620 382264 381491
52779 381491 381402 382231 384513 388139 391790 394117 395283 396417 397734 398348 398006 397703 398008 398018 396783 394795
52763 394795 393128 391888 390545 389263 388887 389837 391775 394016 395725 396241 395952 396196 397429 398094 396472 393136
52747 393136 390236 388499 386411 382573 377549 372833 369056 366082 364104 363547 363936 363659 361236 356601 350939
52732 350939 345388 340268 335599 331766 328949 326160 321870 315914 309928 305373 301827 297972 293671 290119
52718 290119 288119 286999 285250 281745 276390 270015 263780 258565 254958 253525 254362 256288 257349 256594 254633
52703 254633 252085 248488 243490 238105 233670 230173 226689 222991 219621 216795 214280 212043 210076 208005
52689 208005 205951 205184 206500 208278 207683 203836 198358 192847 187441 182146 177779 174740 172151 169158 166122
52674 166122 163731 161828 160026 158667 158180 158081 157524 156517 155771 155581 155639 155735 155959 156179 155896 154714 152682
52657 152682 150214 147914 146350 145714 145752 146120 146629 147033 146871 145771 143792 141316 138820 136863 135974 136131
52641 136131 136489 135965 134204 131842 129776 128398 127730 128192 130660 135301 140634 144542 146444 147824 150260
52626 150260 153550 156309 157845 158736 159879 161727 164217 166749 168420 168975 169437 171121 174149 177569 180739
52611 180739 183781 186758 189265 191019 192146 192785 192975 192906 192613 191515 189177 186491 185078 185181 185057 182967
52595 182967 179091 175108 172528 171848 172652 173935 174634 174285 172986 170762 167553 163937 161056 159411 158286
52580 158286 156770 154832 153094 152052 151951 152771 153852 154023 152754 150937 150085 150929 153014 155285 156836
52565 156836 157489 157985 159179 160746 161272 160018 157976 156526 155606 154169 152120 150660 150519 150870 150684 150453
52549 150453 151541 153888 155360 153965 150133 146096 143469 142413 142906 145207 148441 150268 149378 147484 147310
52534 147310 149176 151179 152416 154040 156843 159733 161388 161892 161846 161284 160653 161576 165136 170091 174164 176648
52518 176648 178488 180275 181600 182284 182812 183259 182955 181806 181163 182670 186457 190963 194585 197311 200491
52503 200491 204941 209518 212074 211819 210170 209139 209577 211236 213757 216955 220674 224900 229582 233875 236279
52488 236279 236289 235397 235545 236852 237636 236482 233660 230720 229330 230218 232638 235039 236689 238124 239641 240345
52472 240345 239729 239342 241396 246102 251847 257680 263838 269807 273864 275313 275605 276222 276685 275781 273758 272046
52456 272046 271377 271352 271561 272084 273021 274267 275692 277032 277883 278214 278506 278774 278019 275490 272146 269908 269587
52439 269587 270448 271644 272960 273955 273514 271008 267353 264309 263005 263350 264450 265234 265155 264814 265591 268190
52423 268190 271729 274625 276132 276643 276822 277088 277844 279405 281416 282801 282663 281028 278618 276235 274625
52408 274625 274492 276026 278427 280338 281045 281072 281476 282692 284199 285287 285864 286372 287005 287366 287070 286508 286601
52391 286601 287756 289371 290612 291440 292541 294333 296359 297838 298608 299330 300770 302982 305213 306668 307345
52376 307345 308126 309926 312709 315402 316814 316678 315701 314620 313398 311539 309055 306787 305616 305680 306540 307787
52360 307787 309128 310163 310661 311081 312303 314681 317646 320244 321689 321467 319595 317088 315535 315631 316410 316434
52344 316434 315612 315369 317011 320267 323491 325067 324593 322943 321378 320719 321294 323281 326613 330628 334289
52329 334289 336869 338239 338654 338649 338948 339829 340720 341211 342221 344972 348719 351051 351033 350662 352216 355418 358472
52312 358472 360695 362448 363336 362492 360484 359101 359105 359692 360335 361567 363561 365499 367125 369628 374014 379427
52296 379427 383891 386251 386951 387430 389128 392475 396552 400317 404184 409493 416268 422744 427662 431889 436964
52281 436964 443047 449287 455440 461906 468559 474638 479783 484417 489158 494480 500845 508488 516946 525220
52267 525220 532582 539070 545226 551514 557952 564273 570561 577693 586952 599195 614416 631748 649608
52254 649608 666408 681890 697409 714194 731817 749430 767927 789186 813221 837999 862542
52243 862542 888288 916363 945238 972614 998565 1025234 1054054 1084671 1116105 1147658 1178889
52232 1178889 1209813 1240976 1272606 1304066 1334968 1366222 1398885 1432254 1464182 1493247 1519798
52221 1519798 1545057 1569962 1594648 1618246 1639353 1657374 1673152 1687596 1700094 1709225 1714771 1718079
52209 1718079 1720542 1722598 1724165 1725260 1726097 1727120 1728808 1730963 1732481 1732571 1731984 1732388 1734716 1738708 1743742
52194 1743742 1749420 1755616 1762643 1771123 1781119 1791856 1802886 1815004 1829185 1845248 1862455 1880743
52182 1880743 1900309 1920638 1941265 1962983 1986812 2012087 2037009 2060879 2084340 2107551 2129689
52171 2129689 2150284 2169532 2187150 2202415 2215451 2226927 2236388 2242569 2245802 2248245 2251023 2252707
52159 2252707 2251544 2247760 2242682 2236857 2230080 2222219 2212979 2201794 2188909 2175696 2163142 2150980 2139052
52146 2139052 2128248 2118933 2109595 2098491 2085913 2073561 2062432 2052628 2044471 2038197 2032958 2027762 2023218
52133 2023218 2020907 2020965 2021697 2021737 2021270 2020786 2019863 2017935 2015508 2013914 2014046 2015550 2017040 2017163 2015830 2014141
52117 2014141 2012623 2010058 2005052 1998493 1993117 1990301 1988412 1984825 1978691 1971085 1963289 1955857 1948864 1942098
52103 1942098 1935105 1927761 1920788 1914995 1909961 1904091 1896261 1886955 1877392 1867911 1857834 1846906 1836262
52090 1836262 1827542 1821248 1816397 1811793 1807150 1802733 1798255 1792742 1785704 1778075 1771571 1766974 1763334 1759102
52076 1759102 1753877 1748597 1744031 1739686 1734648 1728982 1723610 1718957 1714459 1709448 1703829 1697748 1691420 1685618
52062 1685618 1681523 1679360 1677739 1675202 1672165 1670511 1671380 1674290 1678542 1684465 1692609 1702377 1712420 1722372
52048 1722372 1733537 1747631 1765250 1785716 1808044 1831685 1856594 1883052 1911357 1941381 1972411
52037 1972411 2003811 2035875 2069561 2105323 2142672 2181018 2220268 2260127 2299480 2337246 2373513
52026 2373513 2408928 2443125 2474698 2502855 2528258 2551809 2573256 2591436 2605488 2615461 2622110 2626479
52014 2626479 2629391 2630933 2630442 2627158 2620842 2611940 2601479 2590740 2580549 2570815 2561042 2551104 2540913
52001 2540913 2529718 2516863 2503480 2492159 2484262 2478537 2473236 2468687 2466634 2467703 2470985 2475821 2482441
51988 2482441 2490545 2498635 2505583 2512072 2519685 2529030 2539341 2549455 2558477 2565755 2571118 2575323 2579627
51975 2579627 2584460 2588817 2591309 2591677 2590774 2589154 2586215 2581031 2573559 2564351 2553307 2539516 2522576 2503454
51961 2503454 2483579 2463489 2442852 2421470 2399524 2376821 2352480 2325720 2296789 2266894 2237263
51950 2237263 2208333 2179649 2150440 2120301 2089331 2057694 2025228 1991617 1956773 1920879 1884154
51939 1884154 1846767 1808868 1770453 1731300 1691353 1651115 1611338 1572206 1533209 1493984 1454980
51928 1454980 1416902 1379561 1341648 1301874 1260273 1218351 1177894 1139519 1102222 1064485 1025979
51917 1025979 988097 952501 919306 887266 855931 826787 801555 779844 759506 739265 719938
51906 719938 702682 687053 671603 655858 640838 627697 616499 606298 596030 585357 574892
51895 574892 565482 557140 549033 540747 532914 526155 520014 513640 507033 500806 495134 489788 484826 480216
51881 480216 475151 468948 462474 457276 453262 448688 442746 436722 431999 428315 424934 422168 420419 418553
51867 418553 414678 408323 400915 394367 390004 388295 388474 388531 386665 382942 379001 376207 374675 373817 373003
51852 373003 371704 369730 367392 364820 361241 355664 348306 340631 333923 328514 324459 321990 320880 320109
51838 320109 318787 316953 314922 312193 307781 301629 295215 290569 288796 289500 291260 292480 292080 289839 286397
51823 286397 282862 280168 278569 277673 276959 276267 275779 275540 275070 273731 271708 270390 271059 273137 274541 274359
51807 274359 274350 276697 280833 283965 284764 284933 286517 289197 291372 292821 294701 297337 299509 300183 299915 300236
51791 300236 302216 305709 309412 311630 311554 310049 308877 309153 310834 313372 316213 318756 320587 321960 323450
51776 323450 325002 325830 325475 324533 324056 324544 325734 327064 328241 329526 331481 334103 336204 336156 333621 330285
51760 330285 328616 329782 332702 335007 335019 333192 331626 331955 333609 334427 333049 330400 328592 328543 328956 327705
51744 327705 324116 319779 317102 317175 319096 321128 322051 321400 319088 315413 311357 308418 307858 309940 313596
51729 313596 316885 318282 317854 316889 316277 315830 315377 315606 316912 318054 317224 314478 311954 311406 312431 313588
51713 313588 314408 315475 317000 318250 318523 318062 317730 318035 318735 319392 320106 321509 324005 327170 330133 332580
51697 332580 335124 338511 342493 345829 347596 348405 349945 353211 357510 361377 364023 365595 366652 368219
51683 368219 371889 378687 387683 396819 405312 414118 423724 432888 440480 447278 454652 462344 469060 474670
51669 474670 480236 486001 490845 493846 495123 495027 493701 491608 489354 486833 483734 481035 480520 482236 483853
51654 483853 483343 481098 478500 475648 471844 467429 463578 460647 457990 455196 452339 449251 445855 443126
51640 443126 442367 443224 443690 442561 440726 439362 437924 435019 430616 426191 422918 420864 419989 420872 423973
51625 423973 428924 435015 441809 448781 455020 460155 465370 472549 482053 491943 499698 504279 506197 506019
51611 506019 503565 498731 492650 487569 485354 486161 488684 491675 494845 498168 500901 502101 501958 501808 502580
51596 502580 503914 505044 505802 506247 506000 504709 502721 500527 497748 493508 487742 481369 475111 468827 462236
51581 462236 455610 449361 443415 437484 431808 427150 423965 421839 419941 417962 416289 415107 413713 411271
51567 411271 408112 405491 403936 402564 400485 398108 396350 395154 393770 392190 391298 391504 392067 392019 391226 390299
51551 390299 389922 390401 391500 392495 392613 391576 389697 387638 386118 385451 385049 383843 381693 379927 379946 381714
51535 381714 384300 387325 390819 394019 395731 396076 396716 398890 401991 404505 405675 405956 406529 408666 412855
51520 412855 418253 423594 428765 434612 440981 446142 448795 449608 449856 449471 447688 445036 443172 442754 442715 441973
51504 441973 440807 440076 439909 439859 439872 440370 441409 442283 442078 440429 437796 435197 433590 433183 433379 433700 434745
51487 434745 437661 442360 446835 449021 449127 449359 451385 454927 458913 462832 466358 468720 469616 470223 472111
51472 472111 475344 478599 481033 482931 484466 484990 484003 482081 480447 480188 482043 486105 491189 495145 496598
51457 496598 496198 495700 495987 496407 495987 494824 493989 494073 494144 492489 488443 483068 477936 473814 470912 469584 469794
51440 469794 470220 468943 465186 459726 453686 447737 442493 438758 436928 436587 436828 436687 435458 433291 431429
51425 431429 431136 432351 433924 435035 435682 436023 436114 436221 436409 435991 434519 433275 434404 438249 442718 445719
51409 445719 447134 448104 449645 452535 457227 463081 468718 473884 479826 487011 493798 498577 502134 506367
51395 506367 511445 515909 519214 522472 526466 530228 532144 531695 529775 527822 526856 526952 527398 527500 527164 526651
51379 526651 526059 525360 524624 523939 523325 522943 523045 523579 524266 525171 526626 528445 529968 531058 532087 532578 530988
51362 530988 526698 521245 516557 512726 508683 504442 501208 499351 497552 494321 489568 484449 480167 477141
51348 477141 474939 472792 470323 467717 465355 463663 463197 464017 464710 463134 458913 454408 452271 452586 453343
51333 453343 453212 452698 452731 453231 453349 452536 451190 450510 451537 453995 456307 457022 455868 453382 450253 447383
51317 447383 445589 444431 442034 436917 429485 421157 412943 405705 400662 398143 396423 393259 388295 382660
51303 382660 376681 369536 361094 352633 345506 340220 336769 334567 331995 327431 321240 315685 312337 310418
51289 310418 308071 304538 300680 298002 297492 298932 301027 302481 302945 302744 302135 301347 300880 300863 300490 298962
51273 298962 296660 294476 292396 289878 287372 286172 286757 288374 290283 292296 294110 295279 296007 296959 298204
51258 298204 299336 300625 302950 306528 310798 315440 320373 324819 327818 329732 331796 334056 335211 334723
51244 334723 333540 332454 331386 330642 331022 332090 332186 331042 330515 331552 332254 330561 327277 324570 322568 319423
51228 319423 314077 307168 299596 291922 285136 280496 278324 277772 277757 277440 276211 274147 272258 271415 271284 270924
51212 270924 270024 268758 266934 264192 260656 256574 251922 247251 244333 244657 247510 250621 252426 252745 251836
51197 251836 250198 249041 249313 250130 249515 247004 244246 242734 242259 242060 242165 242733 243131 242747 242181 242666 244552
51180 244552 247053 249278 250926 252079 252840 253294 253609 254058 254889 256006 256908 257299 257730 259187 261983 265454
51164 265454 268793 271721 274186 275974 276997 277656 278524 279744 280910 281450 281103 280189 279346 278834 278316 277709
51148 277709 277896 279772 282601 284261 283543 281471 279951 279867 280983 282787 284501 284970 283840 282541 282788 284127
51132 284127 284305 282322 279640 277792 276283 274124 272239 272518 274831 276861 277132 276604 276670 277036 276667 275744
51116 275744 275245 275053 273848 271015 267544 264670 262374 259764 256489 253204 250684 248910 247287 245613 244404
51101 244404 243995 243693 242504 240661 239610 240159 241333 241521 240124 237563 234394 231192 228722 227248 225964
51086 225964 223958 221483 219493 218269 217447 217082 217537 218528 219412 220307 221669 222717 221777 218684 215558 214468
51070 214468 215306 216628 217681 218778 220415 222827 225958 229294 232171 234647 237451 240739 243694 245853
51056 245853 247877 250243 252058 252309 251695 252045 254078 256696 258417 258671 257685 255894 253645 251099 248364
51041 248364 245957 244830 245539 247645 250322 253259 256507 259855 262960 265825 268568 270936 272697 274364
51027 274364 276868 280401 284043 286577 287415 286818 285527 284226 283282 283054 284179 286929 290330 292843 294302
51012 294302 296234 299650 303441 305849 306750 307351 308262 309271 310547 312537 314559 315109 314045 313195 314121 316293
50996 316293 318297 319875 321604 323075 322748 319884 315747 312432 310922 310727 311118 312119 314212 317564 321886
50981 321886 326767 331605 335382 337208 337337 337182 337976 339747 341807 343759 345549 346979 347832 348407 349371 351020
50965 351020 353007 354873 356566 358355 360371 362335 363761 364482 364813 365096 365402 366057 368103 372358 378074
50950 378074 383415 387503 391143 395318 399960 404675 409616 414831 419658 423833 428594 435576 444864 454979
50936 454979 464566 473455 482504 493124 506499 522441 539401 556330 573973 593499 614528 635639
50924 635639 656338 677325 699254 722540 747897 775498 803854 831301 858827 889692 925950
50913 925950 966916 1011511 1060265 1113993 1172089 1233646 1299273 1370326 1446844 1527559 1611663
50902 1611663 1699504 1791673 1888332 1989454 2094846 2203629 2314064 2424015 2531536 2635187
50892 2635187 2734023 2827249 2913912 2993293 3065439 3130553 3187733 3235309 3273088 3303566 3330028
50881 3330028 3353753 3373809 3389314 3401068 3410929 3420229 3428981 3436196 3440698 3441642 3438285 3429407 3413492
50868 3413492 3389704 3358215 3319127 3271446 3213683 3145338 3067359 2981314 2888668 2790750 2688779
50857 2688779 2583682 2476287 2367864 2260203 2154893 2052710 1953951 1859297 1770198 1688303
50847 1688303 1614486 1548294 1488234 1432711 1380964 1333367 1290715 1253082 1219420 1188673 1161121
50836 1161121 1137971 1119342 1103400 1088189 1073841 1062098 1053910 1048528 1044841 1042419 1040870 1039461
50824 1039461 1038238 1038773 1042845 1050757 1061693 1075232 1091458 1109742 1128606 1147179 1166048 1186248
50812 1186248 1208003 1230884 1254891 1280765 1309360 1341070 1375871 1413713 1454815 1499678 1548693
50801 1548693 1601675 1658043 1717798 1782199 1853031 1931207 2016528 2108921 2209371 2319324 2439721
50790 2439721 2571128 2714248 2869413 3035771 3212033 3398075 3594763 3801869 4017243
50781 4017243 4238690 4465630 4697912 4933590 5168811 5399295 5620799 5828643 6018412
50772 6018412 6187474 6334970 6460328 6562930 6643484 6704625 6749687 6781699 6803820 6819528
50762 6819528 6831517 6841112 6849545 6859100 6871999 6888444 6906362 6922502 6932850 6932367 6915691 6878750
50750 6878750 6819251 6735605 6626079 6489485 6326284 6138615 5929394 5701779 5459467 5207093
50740 5207093 4949821 4692286 4437873 4189063 3948237 3717873 3499989 3295766 3105812
50731 3105812 2930464 2769590 2622419 2487953 2365559 2254890 2155266 2065339 1983532 1908884
50721 1908884 1841398 1781465 1728804 1682042 1639521 1600317 1564217 1530921 1499943 1471401 1446148
50710 1446148 1424557 1405626 1388043 1371981 1358901 1349291 1341302 1332428 1322270 1312934 1306682 1303987
50698 1303987 1304156 1306951 1312559 1320371 1328939 1337451 1346560 1357565 1371463 1388936 1410308 1434986 1461787
50685 1461787 1490586 1522951 1560337 1602244 1647099 1694450 1745179 1799945 1858749 1921969 1990521
50674 1990521 2064696 2143993 2228503 2319494 2418081 2524181 2637295 2757459 2884617 3017411
50664 3017411 3153263 3289395 3423529 3554105 3680249 3801228 3915567 4020882 4114593 4194241
50654 4194241 4257248 4301611 4327682 4338588 4338036 4328105 4309883 4285673 4259330 4234394 4212884 4195945
50642 4195945 4184499 4178420 4175724 4173604 4170337 4165453 4157732 4143573 4117962 4077052 4019408 3944986
50630 3944986 3853852 3746447 3624597 3491443 3350421 3204713 3057415 2911476 2769253 2632369
50620 2632369 2501941 2378617 2262700 2154755 2055820 1966399 1885489 1811485 1744013 1683985
50610 1683985 1631764 1586173 1545704 1510014 1479840 1455893 1437969 1424650 1413872 1404519 1397580 1394985
50598 1394985 1397126 1402341 1409072 1417589 1429229 1444822 1464393 1487586 1513750 1542302 1573636 1609124
50586 1609124 1649696 1695040 1744648 1798815 1857990 1921970 1990611 2064615 2144500 2229077 2315965
50575 2315965 2403522 2491623 2580609 2670137 2759014 2845709 2929031 3008460 3083403 3152054 3211660
50564 3211660 3260424 3298515 3326772 3345256 3353877 3353749 3346936 3335274 3320206 3303170 3285098 3266019
50552 3266019 3246331 3228142 3214021 3204446 3197708 3192536 3189620 3190123 3193684 3198566 3203206 3206907 3209161
50539 3209161 3208682 3203212 3190407 3168958 3138559 3098634 3047806 2985448 2913409 2835229 2753537 2668932
50527 2668932 2581361 2491795 2402295 2315150 2232180 2154309 2081351 2012547 1947577 1886870 1830929
50516 1830929 1779653 1732343 1688116 1646512 1608203 1575045 1548751 1529280 1514863 1503691 1495314
50505 1495314 1490401 1489698 1493299 1500505 1510094 1521025 1533149 1547120 1563587 1582579 1603708 1626769
50493 1626769 1652013 1679803 1709956 1741575 1773902 1807337 1843123 1881809 1922550 1964195 2006419
50482 2006419 2049281 2092332 2135042 2177800 2221646 2267152 2314337 2363672 2416471 2474130 2537314
50471 2537314 2605856 2679233 2757511 2842299 2936332 3041414 3157090 3281903 3415461 3558323
50461 3558323 3710268 3869790 4035118 4204508 4375470 4544949 4710629 4871055 5024076
50452 5024076 5166108 5293323 5402704 5491682 5557935 5600425 5619883 5617428 5593232 5547341 5481365
50441 5481365 5398501 5302037 5194526 5078355 4956574 4833099 4712478 4599448 4498351 4412563
50431 4412563 4344028 4293011 4258421 4238834 4233239 4240403 4257685 4281224 4307336 4332807 4353436 4363232
50419 4363232 4356047 4327830 4277038 4203727 4109343 3997096 3871310 3735885 3593752 3447720
50409 3447720 3301015 3156493 3015742 2879417 2748319 2623773 2507108 2399142 2300281 2210774
50399 2210774 2130471 2058420 1993149 1933854 1881311 1837265 1802602 1776116 1755207 1737753 1723297
50388 1723297 1712549 1706207 1704482 1707438 1715111 1727026 1742102 1759538 1779596 1803000 1829643 1858415
50376 1858415 1888325 1919264 1951645 1985829 2021948 2059572 2097373 2133897 2168980 2203578 2237763
50365 2237763 2269838 2298261 2323568 2347334 2369780 2389639 2406114 2419839 2431998 2443572 2455422
50354 2455422 2467951 2480644 2493047 2506588 2524367 2548694 2579649 2616382 2658766 2706990 2760371
50343 2760371 2817643 2878048 2941276 3006434 3071909 3136281 3198666 3257752 3310940 3355016 3387867
50332 3387867 3409358 3420260 3420379 3408036 3381327 3339540 3283286 3214096 3134537 3048241 2958883 2869058
50320 2869058 2780628 2695825 2617079 2545751 2482003 2426287 2380123 2344831 2320101 2304499 2297024
50309 2297024 2297368 2304573 2316148 2328965 2340727 2349984 2354817 2352354 2340271 2318336 2287677 2248904
50297 2248904 2202075 2148452 2090767 2031153 1970047 1907963 1846942 1788965 1733880 1680459 1628794
50286 1628794 1580139 1534948 1492828 1454247 1420578 1392323 1368717 1349089 1333084 1319522 1306784
50275 1306784 1294740 1284785 1277527 1271980 1267538 1265141 1265733 1269031 1274719 1283463 1295706 1310621 1327264
50262 1327264 1345749 1366298 1388183 1410567 1433399 1456488 1478878 1500464 1523213 1549146 1577582
50251 1577582 1605770 1631897 1656232 1679594 1702037 1722994 1741727 1757567 1770478 1781224 1790398
50240 1790398 1797689 1802817 1806589 1809943 1812317 1812089 1808465 1801945 1793201 1782607 1770811 1758546 1745616
50227 1745616 1731033 1714513 1697194 1680639 1665658 1652086 1639035 1625345 1610530 1595515 1581825
50216 1581825 1569986 1559326 1549297 1540127 1531805 1523274 1513349 1502110 1490872 1480882 1472525 1465744 1460767
50203 1460767 1458003 1457366 1458220 1460259 1464014 1469913 1477126 1484177 1490720 1497730 1505546 1512754 1517803 1521131
50189 1521131 1524777 1530072 1536264 1541116 1542426 1539452 1533499 1526856 1520725 1514641 1508182 1502130 1496904 1490780
50175 1490780 1481398 1468942 1456344 1446025 1437638 1429434 1420687 1412036 1404253 1397664 1392488 1388890 1386596
50162 1386596 1384972 1383789 1383728 1385711 1389647 1394201 1398232 1402213 1407475 1414113 1420533 1425373 1428961 1432396
50148 1432396 1436046 1439658 1443095 1446028 1447484 1446669 1443725 1438782 1430961 1419557 1405709 1391500 1377563
50135 1377563 1362902 1346919 1330147 1312969 1295188 1277263 1260520 1245521 1231416 1217475 1204068
50124 1204068 1191374 1178409 1164492 1150749 1138855 1128773 1119121 1109558 1101525 1096262 1092978 1089464
50112 1089464 1084038 1076542 1067902 1059309 1051848 1046351 1042941 1040640 1037873 1033820 1029084 1024551 1019711 1012678
50098 1012678 1002066 988413 973600 959195 945570 932293 919008 905913 893471 881766 870426
50087 870426 859389 849411 841346 835041 829363 823279 816503 809278 802195 796190 791967 789124 786487 783688
50073 783688 781930 782691 785884 789771 792628 794156 795250 796741 798676 800878 803863 808679 815713 824126
50059 824126 832779 841366 850257 859615 869276 879299 889969 901307 913099 925377 938373 952044
50047 952044 966102 980370 994580 1007990 1020002 1031216 1043160 1056760 1071647 1086976 1102180
50036 1102180 1116778 1130314 1142993 1155740 1169079 1182382 1194762 1206267 1217596 1228956 1239915
50025 1239915 1250432 1261334 1273446 1286484 1299191 1310553 1320598 1329902 1338721 1347141 1355970 1366626
50013 1366626 1379778 1394696 1410499 1427483 1446491 1467427 1489378 1512125 1536625 1563812 1593389
50002 1593389 1623814 1653118 1680104 1705505 1731632 1759851 1788597 1814919 1837994 1859878 1882639
49991 1882639 1906037 1928355 1948131 1964329 1976083 1983447 1987710 1990022 1990242 1987845 1983153 1976635 1967659
49978 1967659 1955222 1939671 1922562 1904941 1886824 1868365 1850319 1832998 1815643 1797413 1778525
49967 1778525 1760146 1743624 1730044 1719895 1712599 1706609 1700504 1694032 1687920 1682868 1679031 1676438 1675444
49954 1675444 1676440 1679192 1682733 1685977 1688247 1689087 1687849 1683874 1677178 1668691 1659721 1651211 1643353 1635499
49940 1635499 1626462 1615253 1601709 1586158 1568562 1548523 1526390 1503870 1483059 1464926 1448892
49929 1448892 1433637 1418134 1402194 1386482 1371961 1359000 1346983 1334977 1322816 1311453 1302233
49918 1302233 1295797 1291505 1287844 1283490 1278146 1272450 1267207 1262763 1258749 1253934 1246492 1235186 1220633
49905 1220633 1204878 1189276 1173139 1154938 1134513 1113394 1093015 1073322 1053427 1033082 1012934
49894 1012934 993577 974946 956680 938563 920387 901862 883098 864921 848246 833195 819216
49883 819216 805884 793109 780667 768342 756628 746604 738768 732575 727300 722687 718569 714744 711646
49870 711646 710142 710041 709831 708821 708448 710167 712886 714081 712953 710787 708562 706140 703866 702972 703695
49855 703695 704690 705087 705743 707559 709894 711664 712778 713343 712508 709635 705920 703361 702301 701311 699549 698104
49839 698104 698711 701793 706076 709761 711943 713144 714398 715852 716648 716325 715674 715770 716811 718553 721394 726053
49823 726053 732326 739022 745318 751657 759094 768060 777970 787972 797951 808560 820086 831654 842283
49810 842283 852602 864530 878921 894500 909677 924515 940031 956256 972044 986449 999319
49799 999319 1010793 1021274 1031960 1044361 1058768 1073516 1086074 1094792 1099669 1101699 1101474 1098373 1091337
49786 1091337 1080464 1067397 1053897 1040414 1026311 1010925 994049 975967 957587 940103 923928
49775 923928 908308 892397 876234 860242 844536 829413 815731 803752 792291 780344 769112
49764 769112 760837 755619 750903 744596 737404 731436 727498 724570 721245 716923 712100 708186 706644 707589
49750 707589 709400 710259 709909 709423 709522 709819 709763 709654 710227 711452 712234 711511 709547 707957 708320 710752 713764
49733 713764 715504 715272 714015 713387 714109 715207 714943 712549 708862 705353 702841 701197 699970 698958 698289
49718 698289 698063 697966 697436 696557 696571 698886 703437 708535 712451 714744 716018 717087 718623 720863 723266 725039
49702 725039 726429 728867 733335 739231 745408 751648 758325 765328 772336 779771 788453 798413 809019 820228
49688 820228 832834 847305 863006 878738 893600 907357 920471 933716 947277 960361 972327
49677 972327 984045 997362 1013022 1029666 1045035 1057720 1067658 1075453 1081563 1085926 1088208 1088374 1086831
49664 1086831 1083878 1079383 1073230 1065748 1057258 1047725 1037424 1027551 1019362 1012793 1006618 999818 992147 983663
49650 983663 974643 966127 959575 955603 953451 951822 949844 947201 944065 941174 939550 939701 941208 943055
49636 943055 944203 944043 942775 941397 940991 941926 943824 946030 947988 949568 951390 954324 958208 961625 963609
49621 963609 964972 967131 970204 973368 976623 980761 985586 989600 991871 993117 994529 996457 998745 1001467
49607 1001467 1004692 1008075 1011210 1013957 1016235 1018020 1019798 1022384 1025959 1029771 1033074 1035878 1038703 1042174
49593 1042174 1046942 1053162 1059681 1064584 1067065 1068332 1070312 1073941 1078922 1084340 1088951 1091477 1091461 1089830
49579 1089830 1088461 1089316 1093718 1101509 1110506 1117662 1121477 1123042 1124516 1127185 1131289 1136775 1143307 1149964
49565 1149964 1155813 1160675 1164893 1168671 1172275 1176526 1182379 1189996 1198810 1208444 1219038 1230666 1242988
49552 1242988 1255694 1268908 1282832 1297182 1311309 1325009 1338981 1354191 1370766 1387844 1404762
49541 1404762 1422013 1440662 1461118 1483012 1506061 1530336 1555701 1581669 1607987 1634879 1662637
49530 1662637 1691388 1721192 1751760 1782179 1811771 1841351 1872790 1907055 1943512 1981489 2021464
49519 2021464 2063924 2107816 2151195 2193258 2235026 2278042 2322947 2369294 2416365 2464045 2512907
49508 2512907 2563309 2614460 2664809 2713463 2760855 2807895 2854927 2901559 2946913 2989850 3029706
49497 3029706 3067240 3104219 3141541 3178228 3212722 3244546 3274046 3301046 3324766 3345078 3363059
49486 3363059 3380062 3396552 3411972 3425443 3436496 3445268 3452218 3457818 3462562 3466982 3471279 3475147 3478454
49473 3478454 3481962 3486653 3492313 3497551 3501507 3504937 3509347 3515667 3524022 3534108 3545319 3556974 3568920
49460 3568920 3581542 3594959 3608678 3622244 3635594 3648535 3660718 3672630 3685626 3700001 3713589
49449 3713589 3723297 3727948 3728906 3728109 3726177 3722333 3715372 3704434 3689255 3670019 3647079 3620903 3592173
49436 3592173 3561377 3528164 3491557 3451202 3408140 3364084 3320176 3276476 3232197 3186361 3138721
49425 3138721 3090102 3041412 2992482 2942798 2893157 2845246 2799276 2753466 2706595 2659665 2614041
49414 2614041 2569389 2524954 2481825 2441919 2405162 2369409 2333302 2297701 2264083 2232830 2203494
49403 2203494 2175671 2149024 2123079 2097480 2072205 2047419 2023525 2001185 1980777 1961946 1944194
49392 1944194 1927668 1912795 1899485 1887502 1877289 1869388 1863101 1856804 1849782 1842881 1837052 1832110 1827245
49379 1827245 1822101 1816915 1812163 1808479 1806467 1806192 1807150 1808998 1812028 1816648 1822693 1829586 1837153 1846061
49365 1846061 1857382 1871734 1889001 1908958 1931880 1958121 1987441 2019554 2055003 2093875 2132881
49354 2132881 2165190 2184962 2191953 2190846 2186645 2181836 2177247 2173560 2171390 2171187 2173757 2180056 2189973 2202013
49340 2202013 2214749 2228207 2243526 2261659 2282562 2305197 2328106 2350248 2371414 2391822 2411709
49329 2411709 2431710 2453098 2476768 2502050 2527230 2551093 2573481 2594842 2616198 2639250 2665324
49318 2665324 2694029 2723771 2753491 2783050 2812181 2840440 2868435 2897736 2929014 2961251 2993434
49307 2993434 3026220 3061219 3099147 3139209 3180023 3220924 3262647 3306735 3353770 3402488 3451349
49296 3451349 3500700 3552274 3606717 3662912 3719891 3777929 3837361 3897773 3959119 4022322 4087802
49285 4087802 4154448 4221087 4288109 4356624 4426685 4497413 4568470 4640457 4714138 4789825 4867197
49274 4867197 4945220 5022736 5099561 5176314 5252812 5327624 5399846 5470287 5539932 5608161 5673524
49263 5673524 5735471 5794098 5848926 5899339 5945809 5989295 6029808 6066814 6100740 6132646 6162657
49252 6162657 6190179 6215481 6239411 6261474 6279979 6294588 6307015 6318457 6327938 6334464 6339433 6345254
49240 6345254 6352194 6358207 6361721 6363250 6364154 6365024 6365805 6366752 6368588 6372010 6377285 6384045 6391195 6397379 6402023
49225 6402023 6405933 6410510 6416299 6422519 6428032 6432444 6435965 6438457 6439270 6438134 6435652 6432448 6428080 6421265
49211 6421265 6410950 6396740 6378548 6356509 6331264 6303536 6273066 6238505 6198884 6154878 6108155
49200 6108155 6059720 6009397 5956763 5901933 5845358 5787453 5728795 5670248 5612389 5554901 5497007
49189 5497007 5438475 5379894 5321995 5265201 5209926 5156787 5106008 5056869 5008333 4960293 4913779
49178 4913779 4869769 4828069 4787599 4747609 4708327 4670425 4634105 4598876 4564290 4530651 4498752
49167 4498752 4468857 4440360 4412695 4386302 4362207 4340645 4320563 4300627 4280500 4261045 4243565
49156 4243565 4228936 4217090 4206943 4196860 4185527 4172709 4159295 4146648 4135807 4127201 4120989 4117353
49144 4117353 4116157 4116505 4117209 4117907 4119203 4121491 4124181 4126533 4128638 4130922 4133251 4135523 4138838 4144964 4154534
49129 4154534 4166623 4180101 4194375 4208779 4222517 4235822 4250143 4266443 4284132 4302409 4321778
49118 4321778 4343186 4366255 4389554 4412529 4436190 4461885 4490043 4520125 4551030 4581595 4611449
49107 4611449 4641683 4674206 4710166 4749145 4789720 4830367 4870048 4908734 4947667 4988679 5032913
49096 5032913 5080380 5130662 5183507 5238565 5295158 5352815 5411757 5472446 5534824 5598472 5663293
49085 5663293 5729499 5796874 5864659 5932394 6000201 6067676 6132901 6193557 6249149 6301414 6352326
49074 6352326 6402399 6451268 6498927 6545484 6590259 6632272 6671445 6708494 6743697 6776772 6807929
49063 6807929 6838053 6867689 6896794 6925589 6954459 6982627 7008169 7030211 7050295 7070704 7092080
49052 7092080 7113489 7134159 7154167 7173789 7193070 7211884 7229716 7245725 7259707 7272743 7286286
49041 7286286 7301012 7317091 7334985 7354928 7376033 7396954 7417272 7437274 7456534 7473895 7488985
49030 7488985 7502764 7516392 7530421 7545215 7561064 7577433 7593035 7607237 7620811 7634791 7649179
49019 7649179 7663271 7676790 7690130 7703803 7718110 7733110 7748533 7763911 7779077 7794287 7809577
49008 7809577 7824203 7837061 7847652 7856521 7864638 7872243 7878128 7880397 7878214 7872565 7864845 7855015 7841825
48995 7841825 7824535 7803444 7778750 7750127 7717888 7683580 7648690 7613404 7577228 7540087 7502028
48984 7502028 7462438 7420600 7376796 7332108 7287303 7242675 7198736 7156192 7115180 7075268 7036276
48973 7036276 6998513 6962229 6927628 6895412 6866483 6840736 6816922 6794088 6772582 6753276 6736455
48962 6736455 6721925 6709530 6698915 6689373 6680698 6673652 6668673 6664584 6659894 6655149 6652489 6652494 6652954 6651623
48948 6651623 6648922 6646607 6644610 6640910 6634352 6626000 6617255 6607903 6596660 6582823 6566535 6547983 6527181
48935 6527181 6504494 6480767 6456695 6432090 6405749 6376317 6343590 6308775 6273030 6236064 6197041
48924 6197041 6156678 6117095 6079108 6040857 5999894 5955691 5909183 5860877 5810827 5759965 5709860
48913 5709860 5660970 5612214 5562521 5512090 5462069 5413749 5368024 5324730 5282561 5240563 5199786
48902 5199786 5162444 5129319 5099118 5070618 5044115 5020188 4998404 4978442 4961580 4949681 4943054
48891 4943054 4940528 4941398 4945987 4954236 4965063 4977783 4993306 5013178 5037681 5065456 5094751 5124647
48879 5124647 5155309 5187643 5222692 5260812 5301157 5342290 5383524 5425322 5468151 5511450 5554483
48868 5554483 5598023 5644023 5693184 5743673 5793050 5840882 5888620 5937378 5987132 6038032 6091124
48857 6091124 6147028 6204886 6263538 6323405 6386373 6453841 6525264 6598624 6672160 6745856 6821396
48846 6821396 6900466 6983024 7067450 7152354 7237621 7323599 7410109 7496808 7583782 7670974 7757437
48835 7757437 7842063 7924836 8006410 8086517 8163615 8236334 8304503 8368536 8428435 8483761 8533890
48824 8533890 8577783 8614029 8641857 8661958 8675819 8684299 8687284 8684482 8675911 8661586 8641419 8615851
48812 8615851 8586007 8552654 8515282 8472839 8425425 8374619 8322019 8267956 8211890 8153428 8092378
48801 8092378 8028246 7960682 7890579 7820042 7750781 7682725 7614425 7544614 7473214 7401198 7329863
48790 7329863 7260235 7192902 7128208 7066399 7007367 6950295 6893899 6837311 6780816 6725832 6674191
48779 6674191 6627118 6584522 6545207 6508108 6473233 6441178 6411982 6385071 6360291 6338240 6319389
48768 6319389 6303580 6290661 6280888 6274197 6269801 6267237 6267374 6271527 6279683 6290342 6302036 6314462 6328245
48755 6328245 6344237 6363042 6384523 6407634 6431268 6455502 6481527 6510136 6540644 6571549 6601938
48744 6601938 6632022 6662542 6693983 6726291 6759076 6791929 6824511 6856551 6888084 6919578 6951269
48733 6951269 6982296 7011261 7038126 7064750 7092664 7120941 7147425 7171652 7195091 7218573 7241221
48722 7241221 7262496 7283639 7305879 7328319 7348906 7366888 7383065 7398134 7412102 7425028 7436992
48711 7436992 7447241 7454557 7458751 7460729 7460777 7457765 7450531 7439200 7424542 7406567 7384423 7357299 7325064
48698 7325064 7288338 7248333 7206196 7162172 7115778 7067047 7017034 6966605 6915322 6862235 6807414
48687 6807414 6752000 6696978 6642753 6589914 6539623 6493102 6451198 6414489 6383014 6355670 6330637
48676 6330637 6307034 6285830 6268583 6255670 6246482 6241271 6241928 6250420 6266882 6289711 6317288 6349049
48664 6349049 6384849 6423947 6465046 6507120 6549917 6593777 6639192 6686321 6734651 6783270 6831715
48653 6831715 6880211 6928768 6976534 7022853 7068634 7115645 7164262 7212795 7259220 7302631 7342887
48642 7342887 7380152 7415533 7450921 7486965 7521985 7554074 7583543 7612004 7639804 7666248 7692073
48631 7692073 7719585 7749837 7781361 7812554 7843842 7876484 7910468 7944945 7979990 8016615 8055369
48620 8055369 8095953 8137884 8180546 8222820 8263725 8303577 8343629 8384264 8424029 8460696 8492971
48609 8492971 8521097 8546090 8568556 8588095 8603842 8615391 8622853 8626014 8624074 8616439 8603142 8584007
48597 8584007 8557995 8524182 8483056 8436056 8383996 8326618 8263612 8195381 8122757 8046566 7967558
48586 7967558 7886265 7802832 7717339 7630278 7542386 7454172 7366040 7278680 7192607 7107321 7021751
48575 7021751 6935959 6851834 6771524 6695312 6621408 6547804 6474061 6401223 6330258 6260913 6192207
48564 6192207 6123780 6056390 5991201 5928918 5869598 5812729 5757375 5702833 5649358 5597668 5547541
48553 5547541 5497720 5447695 5398701 5352211 5308102 5265220 5223150 5182285 5142568 5103400 5064825
48542 5064825 5027753 4992919 4960361 4929773 4900451 4871122 4841022 4811213 4783613 4758467 4733894
48531 4733894 4708293 4682113 4656806 4633152 4611264 4591232 4572821 4555199 4537769 4520816 4504818
48520 4504818 4489724 4475521 4462839 4452176 4443063 4434895 4428146 4423818 4421779 4420633 4419435 4418850 4420293
48507 4420293 4424288 4429985 4436196 4442617 4449859 4458244 4467018 4475245 4483216 4492160 4502442 4512801 4521705
48494 4521705 4528791 4534686 4540236 4546525 4554919 4566105 4579252 4592821 4606216 4620194 4635786 4653107
48482 4653107 4671159 4688643 4705181 4721794 4739815 4759360 4779484 4799780 4820735 4842200 4862772
48471 4862772 4881613 4899856 4919093 4939249 4959258 4979237 5000509 5023698 5048174 5073375 5099301
48460 5099301 5125570 5151364 5176769 5202977 5230619 5258923 5287283 5316755 5349076 5384514 5421341
48449 5421341 5457266 5491114 5523502 5556316 5591271 5628579 5667115 5705890 5744922 5784654 5825150
48438 5825150 5866147 5907296 5947913 5987016 6024131 6059783 6094841 6129754 6164621 6199385 6233333
48427 6233333 6265033 6293581 6319700 6344776 6369054 6391534 6411461 6428892 6443773 6455654 6464872
48416 6464872 6473030 6481278 6488536 6492375 6491530 6486727 6479012 6468174 6453288 6434186 6411697 6386651 6359279
48403 6359279 6329664 6298268 6265659 6231847 6196143 6157700 6116127 6071650 6024898 5976704 5928023
48392 5928023 5879666 5831798 5783666 5734179 5682921 5630511 5577900 5525500 5473117 5420668 5368793
48381 5368793 5318723 5271366 5226317 5181889 5136638 5091002 5047041 5006406 4969069 4934232 4901674
48370 4901674 4871526 4843415 4816828 4792024 4769519 4748816 4728811 4709575 4692476 4678119 4665293
48359 4665293 4652745 4641019 4631621 4624967 4620228 4616716 4614279 4612389 4610040 4606964 4604227 4603065 4603595 4605081
48345 4605081 4607272 4610917 4616801 4624578 4632968 4641118 4649352 4658315 4667779 4676909 4685517 4694282 4703769 4714015
48331 4714015 4725175 4737579 4750835 4763969 4777123 4792099 4810112 4829691 4848066 4864265 4879480
48320 4879480 4894485 4908243 4919649 4929529 4939902 4951538 4963017 4972312 4978942 4984340 4990116 4996376
48308 4996376 5002239 5007864 5014896 5024334 5034879 5044530 5053289 5062954 5074408 5086581 5098418 5110590 5124393
48295 5124393 5139817 5155612 5170881 5186006 5202172 5220314 5240182 5260125 5278322 5294629 5310782
48284 5310782 5328327 5346842 5364771 5381587 5398340 5416241 5435447 5455203 5474456 5492127 5507410
48273 5507410 5520250 5531410 5541939 5552759 5564668 5578128 5592701 5607073 5620171 5632229 5644294
48262 5644294 5656733 5668683 5679229 5688727 5698475 5709196 5720215 5730258 5738806 5746532 5754503 5763077
48250 5763077 5771539 5778866 5784837 5790204 5795608 5800725 5804979 5808863 5813773 5820351 5827649 5834324 5840186 5846104
48236 5846104 5852769 5859992 5866999 5873091 5878262 5883339 5889063 5894655 5897955 5897639 5894915 5892229 5890591 5889045
48222 5889045 5886567 5883267 5879393 5874130 5866192 5855143 5841498 5825709 5807714 5787614 5766334 5745151
48210 5745151 5724499 5703510 5680953 5656463 5630516 5603297 5574314 5543400 5511405 5479259 5446710
48199 5446710 5412674 5376741 5339727 5302718 5266031 5229103 5191084 5151590 5111202 5071034 5031458
48188 5031458 4991429 4949468 4905149 4859355 4813497 4768951 4726640 4686293 4646339 4605337 4563399
48177 4563399 4521502 4479899 4438311 4397411 4358569 4321840 4285540 4248437 4211197 4174940 4139427
48166 4139427 4103802 4068450 4034877 4003766 3974018 3943757 3911776 3877946 3842774 3806877 3770743
48155 3770743 3734710 3698745 3662120 3623806 3583878 3544280 3507216 3472638 3438143 3401601 3363058
48144 3363058 3323718 3284060 3243647 3202058 3159254 3115575 3072103 3030436 2991258 2953543 2915965
48133 2915965 2878738 2843140 2809485 2776619 2743416 2709928 2676950 2645379 2616242 2590533 2568341
48122 2568341 2548456 2529167 2509412 2489173 2469146 2450215 2433013 2417763 2404531 2393329 2383651
48111 2383651 2374271 2364314 2354610 2347254 2343452 2342300 2342034 2341880 2342207 2343398 2345385 2348062 2351381 2355050 2358858
48096 2358858 2363354 2369473 2377268 2385756 2394342 2403641 2414251 2425448 2436002 2445832 2455860 2466583 2477838
48083 2477838 2489692 2502154 2513945 2523271 2530464 2538364 2549012 2561178 2572413 2582357 2592417 2602989
48071 2602989 2613089 2622538 2632526 2643624 2654864 2665467 2676109 2687752 2700277 2713056 2725948 2738948
48059 2738948 2751633 2763863 2776431 2790196 2804909 2819646 2834057 2848604 2863856 2880113 2897422
48048 2897422 2915297 2932596 2948344 2962850 2977611 2993924 3011692 3029675 3046915 3063745 3081143
48037 3081143 3099162 3116686 3133139 3149733 3168190 3188746 3210483 3233248 3257861 3284414 3311841
48026 3311841 3339486 3367819 3397179 3427138 3457686 3489683 3523265 3557040 3589852 3622226 3655015
48015 3655015 3687794 3719989 3752557 3786747 3821676 3854877 3885359 3914711 3944981 3976558 4008308
48004 4008308 4038762 4066846 4092296 4115775 4138170 4159689 4179964 4198773 4216033 4231346 4244417
47993 4244417 4255978 4267514 4279854 4292527 4304624 4315893 4327020 4339221 4353416 4369401 4385916
47982 4385916 4401932 4417735 4434495 4453021 4472947 4492135 4506059 4508596 4494966 4464398 4419853
47971 4419853 4365707 4306168 4244738 4183414 4122188 4060386 3998581 3938374 3880469 3823988 3767738
47960 3767738 3711208 3654265 3596884 3539424 3482403 3425900 3369830 3314688 3261037 3208235 3154769
47949 3154769 3100070 3045144 2991285 2939174 2889388 2842615 2798697 2756357 2714642 2674121 2636161
47938 2636161 2601403 2569241 2538453 2508185 2478595 2450451 2423793 2397467 2370761 2344918 2321723
47927 2321723 2300940 2280752 2260712 2242393 2226674 2212275 2197870 2183999 2171707 2160664 2149989
47916 2149989 2139753 2130229 2120711 2110636 2101045 2093311 2087011 2080637 2073850 2067296 2060615 2052625 2043577
47903 2043577 2035237 2028213 2020922 2011972 2002030 1992346 1982758 1972403 1961493 1950960 1940711 1929578 1917001
47890 1917001 1903775 1890935 1878672 1866666 1854921 1843786 1833273 1822675 1810991 1797752 1783459
47879 1783459 1769193 1755880 1743998 1733769 1725166 1717690 1710636 1703872 1697982 1693379 1689621 1686003 1682430
47866 1682430 1679236 1676456 1674097 1672954 1674239 1678100 1683263 1688657 1694642 1701925 1709774 1716365 1720861 1724277
47852 1724277 1728083 1732699 1737669 1742639 1747570 1752318 1756463 1759500 1760999 1760783 1759114 1756439 1752875 1748256
47838 1748256 1742722 1736681 1730028 1722113 1712873 1703273 1693932 1684128 1673082 1661705 1651775 1643535 1635419
47825 1635419 1626396 1617481 1610365 1605454 1601935 1599135 1597122 1596314 1597041 1599256 1602300 1605231 1607768 1610631
47811 1610631 1614537 1619202 1623878 1628645 1634534 1642299 1651613 1661652 1672043 1682797 1693501 1703211 1711406
47798 1711406 1718763 1726531 1735107 1743505 1750294 1754722 1756894 1757366 1756875 1755945 1754281 1750818 1744845 1736790 1727422
47783 1727422 1716627 1703662 1688506 1672238 1656112 1640744 1626063 1611332 1595420 1578050 1560943
47772 1560943 1546743 1536283 1527548 1517863 1506611 1495320 1485631 1477866 1471489 1466204 1462261 1459754 1457995
47759 1457995 1456047 1453959 1452882 1453406 1454336 1454019 1452675 1452278 1453944 1456502 1458111 1458497 1458940 1460567 1463163
47744 1463163 1465346 1465665 1463976 1461896 1461392 1462657 1463907 1463416 1461122 1458082 1455303 1453493 1453128 1454102 1455859
47729 1455859 1458278 1461734 1466036 1470248 1474144 1478726 1484520 1490441 1495518 1500840 1508356 1518292 1529257 1540494
47715 1540494 1552444 1565066 1577256 1588452 1599646 1612236 1626780 1643290 1661657 1681034 1699581
47704 1699581 1715807 1729931 1743295 1756628 1769402 1780807 1790747 1799769 1808256 1815827 1821481 1824326
47692 1824326 1824266 1822087 1818892 1815297 1810996 1805232 1797983 1790607 1784743 1780465 1776034 1769789 1761767 1753169
47678 1753169 1744951 1737515 1731172 1725917 1720985 1715566 1710027 1705776 1703871 1704271 1706294 1709160 1712179 1715203
47664 1715203 1719026 1724730 1732454 1741384 1750969 1761519 1773467 1786708 1800931 1816184 1832884 1851591
47652 1851591 1872726 1895953 1919808 1942620 1963956 1984521 2004612 2023473 2040408 2055625 2069477
47641 2069477 2081610 2091525 2099373 2105494 2109591 2110997 2109351 2104423 2095813 2083690 2069551 2055290 2041461
47628 2041461 2027125 2011405 1994526 1977359 1960661 1944836 1929728 1914623 1899264 1885074 1874338
47617 1874338 1867567 1862535 1856827 1850792 1846984 1847043 1850221 1854975 1860792 1868037 1876969 1887708 1900656 1916220
47603 1916220 1934176 1953789 1974330 1995170 2015586 2034994 2053328 2070865 2087810 2104216 2119992
47592 2119992 2134573 2146921 2156334 2163099 2167888 2170808 2171618 2170529 2167941 2163492 2156220 2145766 2132735
47579 2132735 2117903 2101914 2085787 2070493 2055620 2039489 2021241 2002030 1983523 1965994 1948591
47568 1948591 1930641 1911873 1892162 1872315 1854589 1841035 1831290 1822990 1814239 1804628 1793930 1781299
47556 1781299 1766402 1750344 1734569 1719395 1704275 1689049 1674140 1659597 1644586 1628156 1610296
47545 1610296 1592065 1574666 1558387 1542426 1525738 1507997 1489740 1471713 1454222 1436985 1419456
47534 1419456 1401366 1383048 1365149 1347965 1331269 1314819 1298815 1283721 1269869 1257339 1245901
47523 1245901 1235035 1224386 1214309 1205404 1197436 1189403 1180967 1172887 1165449 1157393 1147484 1136519 1126596
47510 1126596 1118587 1111533 1104456 1097611 1091686 1086754 1082400 1078265 1074190 1070359 1067392 1065653 1064420 1062495
47496 1062495 1059721 1057038 1054770 1051857 1047417 1042417 1039058 1038731 1040934 1043867 1045653 1045321 1043114 1039894
47482 1039894 1036223 1032196 1028036 1024081 1019929 1014340 1006666 998098 990812 985815 982054 977682 971859 965090
47468 965090 958046 950595 942371 933956 926596 920531 914461 907308 899780 893243 887632 881787 875544 869920
47454 869920 865098 859855 853675 848038 844548 842743 840915 838437 836119 834648 833786 833018 831996 830398 828111
47439 828111 825695 824036 823383 823203 823080 823329 824643 827397 831373 835932 840483 844890 849311 853530 856850
47424 856850 858897 860242 861804 863974 866784 870548 875581 881253 886033 888830 890053 891182 893417 896751
47410 896751 900137 902661 904755 908185 914383 922712 930620 935698 937527 937606 937874 939489 942727 947436 953226
47395 953226 959405 965255 970661 976187 982224 988335 993922 999370 1005768 1013258 1020315 1025260 1028252 1031256
47381 1031256 1036105 1042829 1049978 1056279 1061762 1067169 1072460 1076515 1078692 1080209 1083149 1088264 1094685 1101846
47367 1101846 1110511 1121358 1133615 1146038 1158663 1172524 1187976 1204298 1220786 1237344 1254005
47356 1254005 1270747 1287996 1306480 1326203 1346124 1365283 1383825 1402601 1422124 1442357 1463230
47345 1463230 1484780 1506719 1528151 1547970 1565477 1580655 1593898 1605519 1615314 1622408 1625646 1624534
47333 1624534 1619925 1613389 1605570 1595534 1582294 1566696 1550933 1536232 1521925 1507127 1492361 1478783
47321 1478783 1466436 1454196 1441238 1427882 1415166 1404267 1396140 1391029 1388243 1386941 1387058 1388917 1392069
47308 1392069 1395364 1398421 1402250 1407972 1415452 1423768 1432718 1443141 1455738 1470080 1485025 1499610 1513254
47295 1513254 1525505 1536321 1546542 1557147 1567515 1575143 1577977 1576623 1573245 1568521 1560979 1549554
47283 1549554 1535358 1520131 1504073 1486324 1466806 1446264 1424787 1401572 1376314 1350017 1324299
47272 1324299 1300442 1278980 1259511 1240857 1222041 1203076 1184424 1166071 1147947 1130957 1116499
47261 1116499 1104816 1094646 1084592 1074142 1063474 1053260 1044736 1038850 1035018 1031747 1028803 1027607
47249 1027607 1028936 1031342 1032730 1032600 1031820 1031031 1030503 1031027 1033506 1037561 1041469 1043688 1043915 1042791 1041250
47234 1041250 1040090 1039463 1038669 1036998 1034643 1032192 1029499 1026062 1022505 1020439 1020405 1020959 1020577 1019641 1019505 1020223
47218 1020223 1020566 1020282 1020944 1023967 1028742 1033723 1038790 1045301 1053821 1062978 1071116 1078294 1085843 1094477 1103818
47203 1103818 1113611 1124336 1136299 1148925 1161507 1174110 1187221 1200939 1215024 1229413 1244127
47192 1244127 1258934 1273571 1288005 1301871 1314057 1323799 1332062 1340722 1350113 1358327 1363488 1365855 1366923
47179 1366923 1367180 1365914 1363004 1359743 1357411 1355740 1353268 1348960 1343133 1336931 1331151 1325676 1319973 1314127
47165 1314127 1309125 1305867 1304040 1302314 1299733 1296739 1294791 1295155 1298049 1302769 1308712 1316363 1326969 1340850
47151 1340850 1356269 1370669 1383168 1395340 1409469 1426543 1446122 1467449 1490150 1514067 1538776
47140 1538776 1563091 1585106 1603391 1618475 1632560 1647281 1662211 1675970 1687997 1698405 1706619
47129 1706619 1711359 1711994 1709153 1703873 1696743 1687869 1677170 1664745 1651394 1638437 1626416 1614417 1601614
47116 1601614 1589115 1579061 1572034 1566666 1562011 1558838 1558098 1559530 1562748 1568673 1578671 1592828 1609908
47103 1609908 1628546 1647775 1666989 1686417 1707386 1731335 1758588 1788456 1820076 1852566 1884900
47092 1884900 1916376 1946962 1976680 2005071 2031722 2056622 2079329 2098444 2112887 2123179 2130497
47081 2130497 2134962 2135958 2133683 2129095 2122560 2113850 2103408 2092279 2080628 2067577 2052731 2036768 2020220
47068 2020220 2002883 1984957 1967719 1952417 1939219 1927691 1917512 1908268 1899286 1890221 1881330 1872984
47056 1872984 1865611 1860249 1858060 1858876 1861181 1864049 1868026 1873492 1879312 1884128 1888093 1892325 1897427 1903567
47042 1903567 1911104 1919622 1926909 1930518 1930369 1928498 1926138 1922309 1915592 1906126 1895227 1883769 1871437
47029 1871437 1857141 1839883 1819560 1797165 1773993 1750705 1727405 1704251 1681398 1658666 1636088
47018 1636088 1614521 1594772 1576272 1557671 1538719 1520479 1503522 1487300 1471729 1458111 1447698
47007 1447698 1440360 1435391 1432600 1431672 1431478 1431221 1431597 1433678 1437273 1441601 1446915 1453855 1461620 1468502 1474345
46992 1474345 1480809 1488867 1497571 1505801 1513710 1521666 1529122 1535640 1542009 1549252 1557229 1565135 1572520 1578880
46978 1578880 1583261 1585699 1588301 1593373 1600687 1608101 1614572 1620997 1628147 1635592 1643092 1651486 1661405 1672372
46964 1672372 1684012 1697004 1711871 1727647 1742798 1756916 1770753 1785017 1799858 1814996 1829635
46953 1829635 1842783 1854479 1866267 1879700 1894729 1910219 1925547 1940928 1956618 1972759 1989663
46942 1989663 2007243 2024336 2039537 2052636 2064435 2075311 2084911 2093211 2100771 2107737 2113419 2117112
46930 2117112 2118648 2118120 2115896 2113033 2110769 2109235 2107394 2104516 2101028 2097755 2095193 2093812 2094010 2095253
46916 2095253 2096334 2097297 2100116 2106272 2114312 2121226 2126092 2131070 2138610 2148909 2160617 2172937 2186071
46903 2186071 2200147 2214892 2230425 2247432 2266050 2285069 2302924 2319371 2335706 2353289 2372283
46892 2372283 2391827 2410876 2428574 2444348 2458280 2471272 2484452 2498392 2512997 2527740 2541573
46881 2541573 2552963 2560752 2565166 2567622 2569543 2571471 2573067 2573606 2572717 2571009 2569729 2569393 2569195 2568311 2567317
46866 2567317 2567448 2568803 2570191 2570689 2570549 2570712 2572310 2576403 2583105 2591017 2598696 2606589 2616281 2627793 2639301
46851 2639301 2649846 2660573 2672443 2684372 2694949 2704796 2715850 2729138 2744394 2760930 2777403
46840 2777403 2791615 2802212 2810317 2818040 2825696 2831817 2835564 2837371 2837133 2833487 2825487 2813836 2799953
46827 2799953 2784798 2769088 2753731 2739443 2726662 2716226 2709324 2706268 2706069 2707819 2711930 2719379 2730253
46814 2730253 2743763 2759463 2777741 2799093 2823255 2849166 2875661 2902185 2928848 2955702 2982103
46803 2982103 3007045 3030074 3051528 3071913 3091324 3109443 3125843 3140425 3153917 3167654 3182335
46792 3182335 3197071 3210264 3221473 3231859 3242867 3255175 3268996 3284609 3302192 3321639 3342790
46781 3342790 3365368 3388510 3411045 3432616 3453976 3475648 3496801 3516068 3533262 3549662 3566540
46770 3566540 3583792 3600120 3614295 3625943 3635037 3641080 3643609 3643725 3644131 3646686 3650395 3652975 3653989
46757 3653989 3654922 3656214 3656247 3654199 3652294 3653646 3658807 3665938 3673778 3682901 3694337 3708543 3725821 3746352
46743 3746352 3769405 3793754 3819340 3847449 3878585 3911063 3942557 3972479 4001992 4031999 4061889
46732 4061889 4090129 4115392 4137066 4155192 4170257 4182854 4193296 4201365 4206405 4207813 4205760 4201457
46720 4201457 4196308 4190620 4183403 4173693 4161928 4149776 4138665 4128536 4117976 4105663 4091866 4078428
46708 4078428 4066937 4057036 4047085 4036429 4026208 4017634 4010399 4003443 3996604 3990553 3985583 3981472 3978363
46695 3978363 3976622 3975885 3975361 3975314 3977075 3981173 3986644 3992911 4001195 4012812 4026952 4041700 4057010 4075082
46681 4075082 4097510 4123314 4150405 4177943 4206492 4236604 4268182 4300878 4334253 4367527 4399789
46670 4399789 4430676 4460624 4490335 4519983 4548725 4574931 4597232 4615629 4631392 4645725 4658808
46659 4658808 4670301 4680349 4689536 4698091 4705685 4712136 4718066 4724743 4733292 4743852 4755372 4766440 4776540
46646 4776540 4786268 4796322 4806742 4817483 4829042 4841778 4854851 4866672 4876294 4883592 4888057 4888378
46634 4888378 4883620 4874104 4860524 4842578 4819118 4789563 4754876 4717146 4678195 4638156 4595196 4547060
46622 4547060 4493428 4436545 4379196 4322312 4265020 4206623 4147594 4088594 4029532 3970301 3911868
46611 3911868 3855708 3802172 3750191 3698827 3648538 3600549 3555499 3513261 3473751 3437041 3402551
46600 3402551 3368839 3334727 3300407 3267180 3236411 3209010 3185480 3165784 3149073 3134082 3120199
46589 3120199 3108189 3099778 3096306 3097418 3101054 3105220 3110116 3118133 3131308 3149038 3168824 3188855 3208961
46576 3208961 3229087 3247837 3263110 3273767 3280394 3284777 3288749 3292873 3295815 3295575 3291795 3286452 3281842
46563 3281842 3278447 3275422 3272631 3271150 3271994 3275479 3281942 3291960 3305261 3320369 3336290 3354188 3376569
46550 3376569 3404841 3438065 3473799 3509431 3542931 3573408 3601385 3627934 3652950 3674623 3691028
46539 3691028 3701912 3708479 3711612 3710873 3705109 3693536 3676223 3654020 3628246 3600061 3569943 3537946
46527 3537946 3504446 3470186 3435482 3399896 3363134 3326049 3290305 3257187 3227020 3199597 3174627
46516 3174627 3151575 3129371 3106704 3082815 3058048 3033482 3009848 2986804 2963492 2939756 2916369
46505 2916369 2893923 2871930 2849502 2826714 2804781 2784846 2767006 2750570 2734916 2719965 2706148
46494 2706148 2694281 2685295 2679687 2676977 2675856 2675189 2674907 2675703 2677890 2680997 2684757 2689917 2697400 2707014
46480 2707014 2717913 2730217 2745032 2762523 2781165 2799646 2818608 2839502 2862383 2886039 2909950
46469 2909950 2934909 2961665 2989985 3019220 3049085 3079750 3111750 3145777 3181937 3219391 3257467
46458 3257467 3296820 3338506 3382208 3426768 3472472 3521103 3573204 3627003 3681012 3736127 3793654
$$ [...]
##END NTUPLES=NMR SPECTRUM
##END=
