
##TITLE=AC1196_HVEAH12055_5946653_9ioTwGzrMZ
##JCAMPDX= 6.0         $$ Bruker NMR JCAMP-DX V2.0
##DATA TYPE= NMR SPECTRUM
##DATA CLASS= NTUPLES
##ORIGIN= BRUKER
##OWNER= Administrator
$$ 1.72 TOPSPIN		Version 2.1
$$ 2012-04-11 01:04:34.281 -0500  Administrator@TOPSPIN
$$ Compression mode = diff/dup
##.OBSERVE FREQUENCY= 400.13188235
##.OBSERVE NUCLEUS= ^1H
##.ACQUISITION MODE= SIMULTANEOUS (DQD)
##.ACQUISITION SCHEME= undefined
##.AVERAGES= 8
##.DIGITISER RES= 22
##SPECTROMETER/DATA SYSTEM= spect
##.PULSE SEQUENCE= zg30
##.SOLVENT NAME= COFFEE_meoh
##.SHIFT REFERENCE= INTERNAL, COFFEE_meoh, 1, 14.98061
##AUDIT TRAIL= $$ (NUMBER, WHEN, WHO, WHERE, PROCESS, VERSION, WHAT)
$$ ##TITLE= Audit trail, TOPSPIN		Version 2.1
$$ ##JCAMPDX= 5.01
$$ ##ORIGIN= Bruker BioSpin GmbH
$$ ##OWNER= Administrator
$$ $$ C:\Bruker\TOPSPIN/data/COFFEE/nmr/AC1196_HVEAH12055_5946653_9ioTwGzrMZ/10/pdata/1/auditp.txt
$$ ##AUDIT TRAIL=  $$ (NUMBER, WHEN, WHO, WHERE, PROCESS, VERSION, WHAT)
(   1,<2012-04-11 01:04:27.546 -0500>,<Administrator>,<TOPSPIN>,<go>,<TOPSPIN 2.1>,
      <created by zg
	started at 2012-04-11 01:03:20.843 -0500,
	POWCHK enabled, PULCHK disabled,
       configuration hash MD5:
       1A 1E CE 29 27 FD 77 03 67 4E F0 E3 C4 B2 CB 90
       data hash MD5: 64K
       D0 47 E4 C9 30 28 7E 2A 71 75 FD 85 23 E3 FD 7C>)
(   2,<2012-04-11 01:04:30.140 -0500>,<Administrator>,<TOPSPIN>,<proc1d>,<TOPSPIN 2.1>,
      <Start of raw data processing
       efp LB = 0 FT_mod = 6 PKNL = 1 PHC0 = 0 PHC1 = 0 SI = 32K 
       data hash MD5: 32K
       F5 CB D2 DF 86 46 54 93 F3 F0 97 70 20 56 40 E5>)
(   3,<2012-04-11 01:04:30.546 -0500>,<Administrator>,<TOPSPIN>,<proc1d>,<TOPSPIN 2.1>,
      <pk PHC0 = 210.4321 PHC1 = 0 
       data hash MD5: 32K
       B1 E4 1F 80 D6 57 E2 21 FE 72 E8 80 47 7F AB 4C>)
(   4,<2012-04-11 01:04:30.671 -0500>,<Administrator>,<TOPSPIN>,<proc1d>,<TOPSPIN 2.1>,
      <abs ABSG = 1 
       data hash MD5: 32K
       8C F0 F5 A8 14 B0 74 32 A8 21 5B 6E 28 06 44 D7>)
(   5,<2012-04-11 01:04:30.703 -0500>,<Administrator>,<TOPSPIN>,<proc1d>,<TOPSPIN 2.1>,
      <abs ABSG = 2 
       data hash MD5: 32K
       41 50 C8 F7 68 B5 B7 31 13 FE 68 A9 A1 76 25 46>)
(   6,<2012-04-11 01:04:30.734 -0500>,<Administrator>,<TOPSPIN>,<proc1d>,<TOPSPIN 2.1>,
      <abs ABSG = 3 
       data hash MD5: 32K
       71 BA D1 E8 E3 71 A4 30 64 75 66 D3 49 E9 89 35>)
(   7,<2012-04-11 01:04:30.765 -0500>,<Administrator>,<TOPSPIN>,<proc1d>,<TOPSPIN 2.1>,
      <abs ABSG = 4 
       data hash MD5: 32K
       E6 98 A4 46 C4 83 1F A0 12 2F CA 7B 2B E5 A5 09>)
(   8,<2012-04-11 01:04:30.781 -0500>,<Administrator>,<TOPSPIN>,<proc1d>,<TOPSPIN 2.1>,
      <abs ABSG = 5 
       data hash MD5: 32K
       55 8D 90 3D AC 4F 99 D3 D7 0C 98 8D 56 BB 43 2D>)
$$ ##END=
$$ 
$$ $$ hash MD5
$$ $$ 17 D0 0D F9 76 01 3D 83 D1 66 BD D9 0F BC 4F D6
##$RELAX= 
##$RELAX= 
##$RELAX= 
##$RELAX= 
##$RELAX= 
##$RELAX= 
##$RELAX= 
$$ Bruker specific parameters
$$ --------------------------
$$ [...]
##$TP= (0..7)
150 150 150 150 150 150 150 150
##$TP07= 0
##$TPNAME0= <>
##$TPNAME1= <>
##$TPNAME2= <>
##$TPNAME3= <>
##$TPNAME4= <>
##$TPNAME5= <>
##$TPNAME6= <>
##$TPNAME7= <>
##$TPOAL= (0..7)
0.5 0.5 0.5 0.5 0.5 0.5 0.5 0.5
##$TPOFFS= (0..7)
0 0 0 0 0 0 0 0
##$TUNHIN= 0
##$TUNHOUT= 0
##$TUNXOUT= 0
##$USERA1= <user>
##$USERA2= <user>
##$USERA3= <user>
##$USERA4= <user>
##$USERA5= <user>
##$V9= 5
##$VALIST= <valist>
##$VCLIST= <CCCCCCCCCCCCCCC>
##$VD= 0
##$VDLIST= <DDDDDDDDDDDDDDD>
##$VPLIST= <PPPPPPPPPPPPPPP>
##$VTLIST= <TTTTTTTTTTTTTTT>
##$WBST= 1024
##$WBSW= 4
##$XGAIN= (0..3)
0 0 0 0
##$XL= 0
##$YL= 0
##$YMAX_a= 513445
##$YMIN_a= -637390
##$ZGOPTNS= <>
##$ZL1= 120
##$ZL2= 120
##$ZL3= 120
##$ZL4= 120
##$ABSF1= 14.98061
##$ABSF2= -5.57192
##$ABSG= 5
##$ABSL= 3
##$ALPHA= 0
##$AQORDER= 0
##$ASSFAC= 0
##$ASSFACI= 0
##$ASSFACX= 0
##$ASSWID= 0
##$AUNMP= <proc_prof1d_extract_pilot.lims>
##$AXLEFT= 0
##$AXNAME= <>
##$AXNUC= <1H>
##$AXRIGHT= 0
##$AXTYPE= 0
##$AXUNIT= <>
##$AZFE= 0.1
##$AZFW= 0.1
##$BCFW= 0
##$BC_mod= 0
##$BYTORDP= 0
##$COROFFS= 0
##$CY= 15
##$DATMOD= 1
##$DC= 0
##$DFILT= <>
##$DTYPP= 0
##$F1P= 0
##$F2P= 0
##$FCOR= 0.5
##$FTSIZE= 32768
##$FT_mod= 6
##$GAMMA= 0
##$GB= 0
##$INTBC= 1
##$INTSCL= 1
##$ISEN= 128
##$LB= 0
##$LEV0= 0
##$LPBIN= 0
##$MAXI= 10000
##$MC2= 0
##$MEAN= 0
##$ME_mod= 0
##$MI= 0
##$NCOEF= 0
##$NC_proc= -8
##$NLEV= 6
##$NOISF1= 0
##$NOISF2= 0
##$NSP= 0
##$NTH_PI= 0
##$NZP= 0
##$OFFSET= 14.98061
##$PC= 1
##$PHC0= 210.4321
##$PHC1= 0
##$PH_mod= 1
##$PKNL= yes
##$PPARMOD= 0
##$PPDIAG= 0
##$PPIPTYP= 0
##$PPMPNUM= 2147483647
##$PPRESOL= 1
##$PSCAL= 4
##$PSIGN= 0
##$PYNMP= <proc.py>
##$REVERSE= no
##$SF= 400.13
##$SI= 32768
##$SIGF1= 0
##$SIGF2= 0
##$SINO= 400
##$SIOLD= 32768
##$SPECTYP= <>
##$SREGLST= <1H.CDCl3>
##$SSB= 0
##$STSI= 32768
##$STSR= 0
##$SW_p= 8223.68421052632
##$SYMM= 0
##$S_DEV= 0
##$TDeff= 65536
##$TDoff= 0
##$TI= <>
##$TILT= no
##$TM1= 0
##$TM2= 0
##$TOPLEV= 0
##$USERP1= <user>
##$USERP2= <user>
##$USERP3= <user>
##$USERP4= <user>
##$USERP5= <user>
##$WDW= 1
##$XDIM= 32768
##$YMAX_p= 458916342
##$YMIN_p= -749755
##$CURPLOT= <Network HP LaserJet P1505>
##$CURPRIN= <$Network HP LaserJet P1505>
##$DFORMAT= <normdp>
##$LAYOUT= <+/1D_H.xwp>
##$LFORMAT= <normlp>
##$PFORMAT= <normpl>
##$SURQMSG= 1
$$ End of Bruker specific parameters
$$ ---------------------------------
##NTUPLES= NMR SPECTRUM
##VAR_NAME=  FREQUENCY,     SPECTRUM/REAL,   SPECTRUM/IMAG
##SYMBOL=    X,             R,               I
##VAR_TYPE=  INDEPENDENT,   DEPENDENT,       DEPENDENT
##VAR_FORM=  AFFN,          ASDF,            ASDF
##VAR_DIM=   32768,         32768,           32768
##UNITS=     HZ,            ARBITRARY UNITS, ARBITRARY UNITS
##FACTOR=    0.250966925370066, 1,           1
##FIRST=     8223.43324360095, -171215,      37915
##LAST=      0,             134388,          -75505
##MIN=       0,             -749755,         0
##MAX=       8223.43324360095, 458916342,    0
$$ Real data points
##PAGE= N=1
##DATA TABLE= (X++(R..R)), XYDATA
$$ [...]
19468d49182F0207a60643O1132m038j56992L5289J09775C692a06992B33955b41417
19456b9715B72186j15440J1575c01203i8161D3445b35k21693c8257A706K38319
19445B40025b07195C4969c43971D090J2982a88518h212j11542l619L6663j4771
19434a01481A1559J64303d29939c7896I8873c29170a18764A55824a07106a1837
19423d94798f8595B7646j3281b4501C4801a26754C2731J55635F705K8252b48095
19411a38712j33710c7241D3747b22774o789r3682P5909O4007B31617f1185j62638
19400b23823O7321a3513k83789E3996a8671C1585J65232c81737a19616L8675K3229
19389e7712n8618K1456E37J04059l4147b81086A3559a29810n9733p7363J17410
$$ y = [-449182, 60207, -160643, -99511, -103549, -260541, -225252, -115477, 3692, -106992, 233955, -241417, -29715, 272186, 156746, 168321, -301203, -98161, 43445, -235, -221928, -38257, 1706, 240025, -207195, 34969, -343971, 4090, 17072, -188518, -8212, -119754, -123373, -86710, -101481, 11559, 175862, -429939, -37896, 98873, -329170, -118764, 155824, -107106, -11837, -494798, -68595, 27646, 14365, -24501, 34801, -126754, 32731, 188366, 6705, 34957, -248095, -138712, -272422, -37241, 43747, -222774, -229563, -323245, -247336, -183329, 231617, -61185, -223823, -156502, -13513, -297302, 53996, -18671, 31585, 196817, -381737, -119616, -80941, -57712, -116330, -94874, 537, 104596, 70449, -281086, 13559, -129810, -189543, -266906, -149496]
19378a49496A03398D352b71856h9276o6086J4988k01759D624h6692k34632i5992
19366g4149F0195k910a17036j07411B0552e1515D3594a32515G451a14488E6325
19354f4048k89495a15331d4954o3827j67700E1623a3320k74767E7489d761m48578
19343d53339K01181d219k27133F0654J85844d12963B97685a16279F9765b9987
19332e5282k38923e670D8180g5334j182D785a5286j05952c7649j80726j64395
19321c82770h735m10904a51612A32602d0028o5153B57987a81056j4361D7339a6510
19309c57930A94289b39380B47148b2997C7041a64786E3543J39933O9161a92609
19298e8180D5855d03300a97507o6384J10556D5636d86632J87808a4001B00440
$$ y = [-149496, 103398, 4352, -271856, -89276, -155362, -140374, -342133, 4624, -86692, -321324, -95992, -74149, 60195, 57285, -117036, -224447, 20552, -51515, 43594, -132515, 7451, -114488, 56325, -64048, -353543, -115331, -44954, -108781, -276481, 51623, -13320, -288087, 57489, -4761, -453339, -252158, -4219, -231352, 60654, 246498, -412963, 297685, -116279, 69765, -29987, -55282, -294205, -5670, 48180, -75334, -76516, 4785, -15286, -121238, -37649, -218375, -382770, -8735, -419639, -151612, 132602, -40028, -105181, 257987, -181056, -195417, 47339, -16510, -357930, 194289, -239380, 247148, -22997, 37041, -164786, 53543, 193476, 262637, -192609, -58180, 45855, -403300, -197507, -263891, -153335, 45636, -486632, -298824, -14001, 200440]
19287A19436d8798A58071J0697c55275e0130j47753m3615A67493i3177l07247
19277d00424A86015o5628c05501Q5054A23029B9085b72769a31775k68020i1532
19266a20289A47579l7683b96308A97748a59998l5801k69040A55052e993D36829
19255b34346C5679b53441k3944a7993e508n5369B5079r245M1444a78771p8207
19244b56978H3307b55324O7754b7379D0435a1906M450C9576e2175o2219a7634
19232h9986A10066J17170a39188o10567b76253A69261b13803C39406b46232Q1186
19222a65046G8825a20807j22405a12537K244C7865c61337k23564B79259c7253
19211H8745d4999k9483C0550h6722j64916G5654N1720a0217j84106G3397g7501
$$ y = [119436, -48798, 158071, 168768, -355275, -50130, -197883, -241498, 167493, -93177, -400424, 186015, 120387, -305501, -220447, 123029, 29085, -272769, -131775, -399795, -91532, -120289, 147579, 109896, -296308, 197748, -159998, -195799, -464839, 155052, -5993, 436829, -234346, 35679, -253441, -277385, -17993, -5508, -60877, 25079, 15834, 57278, -178771, -256978, 83307, -255324, -187570, -27379, 40435, -11906, -7456, 39576, -52175, -114394, -17634, -89986, 110066, 227236, -139188, -749755, -276253, 169261, -213803, 339406, -246232, -165046, 78825, -120807, -243212, -112537, -110293, 37865, -361337, -584901, 279259, -37253, 88745, -44999, -74482, 30550, -86722, -251638, 75654, 127374, -10217, -194323, 73397, -77501]
19199A26627b07222b2177j13720A01995d11503d2181j20676C0253b11551G7158
19188B46356m9182D3827d5843k99248P5692J28587A3948b17665g590I984a22804
19176A0613c3085A3042R699J8353f4234j77759d0055p9690k83696h1119G877O9054
19164G6931J4738m1216J72321e978B21899a28103D1863b00088A52185G4890k0511
19153E4379c43117b8949j54903A1370b07768Q1460j86359p8686K6378f8677a7478
19141b22017A5494a8882m3269b7651n4460j46997b0804B00875F2110g7274k19090
19130b96364b3138A49966K14791a87625a7824n3817F0277q776a23683M0636j59123
19119b42170a19799B56586j02446p4968k1237d1322A05196b6228A74747b38801
$$ y = [126627, -207222, -22177, -135897, 101995, -411503, -42181, -162857, 30253, -211551, 77158, 246356, 197174, 43827, -45843, -345091, -269399, -140812, 13948, -217665, -7590, 9984, -122804, 10613, -33085, 13042, 22741, 41094, -64234, -241993, -40055, -119745, -403441, -81119, 7877, 76931, 91669, 50453, 222774, -5978, 221899, -128103, 41863, -200088, 152185, 74890, 54379, -343117, -28949, -183852, 11370, -207768, -126308, -312667, -391353, -364975, -68677, -17478, -222017, 15494, -18882, -62151, -27651, -82111, -229108, -20804, 200875, 62110, -77274, -296364, -23138, 149966, 364757, -187625, -17824, -71641, 60277, 51501, -123683, -83047, -242170, -119799, 256586, 154140, 79172, 57935, -41322, 105196, -26228, 174747, -238801]
19108H8916J70280A10846d2164J2697j59528g6679a4896B2499e3582k2955j37579
19097b14116b0322l5500K072j61919f1094j12029m1221i4582B4213R578c04683
19085e48298b19115i9383G5005a2306j95133e8794j23160B23888A07205d5063
19074a68676b9768l9166A78343E2945g8008k98215a87700Q9700A25740c5383j54965
19063a90348r3702A14736a81589k02411E8847a02578L606j43470N8368j2547G7616
19051a82899B79685h25B9671M6933a81854B70758c16834I2537b18434G4349a95500
19039d1152k60848A60692E2534b753k0133N528j37915q1094j13122B81889I8249
19027c40069J35555N4389a433D9957b76508A16738a20105k5814a927j04639A35583
$$ y = [88916, 259196, 110846, -42164, -29467, -188995, -76679, -14896, 22499, -53582, -76537, -214116, -20322, -55822, -53750, -215669, -61094, -173123, -214344, -94582, 24213, 33791, -304683, -548298, -219115, -99383, 75005, -12306, -207439, -58794, -181954, 223888, 107205, -45063, -168676, -29768, -68934, 178343, 52945, -78008, -376223, -187700, -98000, 125740, -35383, -190348, -284050, 114736, -181589, -384000, 58847, -102578, -98972, -242442, -184074, -196621, 77616, -182899, 279685, -825, 29671, 76604, -181854, 270758, -316834, 92537, -218434, 74349, -195500, -41152, -302000, 160692, 52534, -2753, -22886, -17358, -155273, -236367, -349489, 281889, 98249, -340069, -204514, -150125, -1433, 49957, -276508, 116738, -120105, -145919, -1927, -106566, 135583]
19015I7189a0290A18033c2655A10303J50448b02645e407E4117J08507a85033F7965
19003g3409j03643B39075a26669l5027j58526Q8856o5335A0701J27138J7191J27785
18992B82815b7550C1703K61827d23097a10651J0573A60970k6531F6622L4337D5675
18980b78110B08904a59861K4192E4937d93318G7372b7368j14769p1498C3603a39035
18968C5576R8736a89945b4362C4147a08085N2535n908C022Q5507J45909K43130
18957D77568M6410J9022B26333a66986A66454K24395d1796F8489a28860L7896
18947i0964l83661B42539k5302a23660M182A6293a92931n6260e5342l3674B54256
18935a02082B95588a82758A4518Q332i7954o9674J4539l8662A32152m1039d8767
$$ y = [97189, -10290, 118033, -32655, 110303, 260751, -202645, -5407, 54117, 162624, -185033, 67965, -73409, -177052, 239075, -126669, -161696, -320222, -231366, -296701, 10701, 137839, 155030, 282815, -27550, 31703, 293530, -423097, -110651, -100078, 160970, 134439, 66622, 100959, 45675, -278110, 208904, -159861, -135669, 54937, -493318, 77372, -27368, -142137, -213635, 33603, -139035, 35576, 134312, -189945, -24362, 34147, -108085, -55550, -61458, 3022, 88529, 234438, 477568, 523978, 543000, 226333, -166986, 166454, 390849, -41796, 68489, -128860, -90964, -474625, 242539, 217237, -123660, -119478, 16293, -192931, -249191, -55342, -89016, 254256, -102082, 295588, -182758, 14518, 22850, -97954, -167628, -153089, -191751, 132152, 91113, -48767]
18923e7726C2258d07146G7857d80308A1626e0725f556k2024j09515l51194A18140
18911E2566a477p2017j72023A41332A8177J48900b31944I4934C537e1851C44699
18899H0383L26617c3355G6482K07952K99815q631j31372A53855d7391A02176M7779
18888A49955b62736A39083d33959E8837b04813A04450h2335l39908q336d3887
18877b72186I0513a95885A54555a8059m24722A73730a86724A5003c59014d9607
18866A1521b54567M9354M5787g9325C20519A32089a85139q1310g4456K7109q5058
18855a32405d3832B6690b54366e7965j91056L9793Q1626N5606D7944J15992e0510
18843c0465j829k03631J4662A30470N9056A4988b99140e4607k39434C68056a93253
$$ y = [-57726, 32258, -407146, 77857, -480308, 11626, -50725, -6556, -28580, -138095, -489289, 118140, 52566, -1477, -73494, -245517, 141332, 18177, 167077, -231944, 94934, 3537, -51851, 344699, 80383, 407000, -33355, 76482, 284434, 584249, 575618, 444246, 153855, -47391, 102176, 149955, -262736, 139083, -433959, 58837, -204813, 104450, -82335, -422243, -430579, -43887, -272186, 90513, -195885, 154555, -18059, -442781, 173730, -186724, 15003, -359014, -49607, 11521, -254567, -205213, -159426, -79325, 320519, 132089, -185139, -266449, -74456, -47347, -132405, -43832, 26690, -254366, -57965, -249021, -209228, -127602, -71996, 47944, 163936, -50510, -30465, -32294, -235925, -221263, 130470, 189526, 14988, -299140, -54607, -294041, 368056, -193253]
18831C70390A8101R4487M7329A0052f652E8458H129b42840h0289A28766a42018
18819a91916H9694a40138E0458f7427b2782j09331m8522q7232a9188q8605j3149
18808a20942j38088N4414b9297A67058b00943A777K42728a00104G1382k6952d1940
18796C29845a77654B08171b4700D3076c14992f9374r9835C2786J03413b93362
18785b15105c734A24852a919k6100k26815A20973P5595G467e854j01343j24727
18774b31924h1831A67212K16813b13609j44623C9499a88899A09480l8533f079
18763b75357A39581A5618e1006G0875C699c8644q0097j64429O8743m8877C6158
18751d0319D2002J17525b39162a4508j91957l38798C8785a18197j8913j24646
$$ y = [370390, 18101, 112588, 159917, 10052, -6652, 58458, 8129, -242840, -80289, 128766, -142018, -191916, 89694, -140138, 50458, -67427, -22782, -132113, -180635, -267867, -19188, -107793, -120942, -259030, -204616, -29297, 167058, -200943, 1777, 244505, -100104, 71382, 44430, -41940, 329845, -177654, 208171, -24700, 43076, -314992, -69374, -169209, 32786, 136199, -293362, -215105, -3734, 124852, -1919, -28019, -254834, 120973, 196568, 7467, -5854, -107197, -231924, -81831, 167212, 384025, -213609, -358232, 39499, -188899, 109480, 70947, -6079, -275357, 139581, 15618, -51006, 70875, 3699, -38644, -118741, -283170, -214427, -263304, 36158, -40319, 42002, 159527, -239162, -14508, -206465, -545263, 38785, -118197, -137110, -261756]
18741b61756b6028l2999A97406r8228J0893B6051h0892K3869k78047D3485b41735
18729b18303o153e2194E2919e3543b0528j72943i1122D6383b8197C0293a43476
18717A63389d4275k53147h4648k7263l12372g8986q9578j82277Q0401e4672J7078
18706c7594l1831j24804k85421C5813c2975p0789E7649a60787b2835j09098a0408
18694a35242e8091l9228B35236c18534g4260j76205L0685A1116a23041F6452a96676
18682d6859l63816J28309B00820h609j98318A96576E9445j5442M6566a87479B63008
18670a6291k0057B52308c13578j4192J20047Q4840j185l6748j14727d471k68333
18659b72804H3418L085c6531C07511r7117a04038A24167h0671B2655P3398e6908
$$ y = [-261756, -26028, -59027, 197406, 99178, 110071, 26051, -80892, -57023, -335070, 43485, -241735, -218303, -224456, -52194, 52919, -53543, -20528, -193471, -91122, 46383, -28197, 30293, -143476, 163389, -44275, -297422, -84648, -111911, -424283, -78986, -168564, -350841, -270440, -54672, -37594, -69425, -194229, -479650, 35813, -32975, -103764, 57649, -160787, -22835, -131933, -10408, -135242, -58091, -97319, 235236, -318534, -74260, -250465, -219780, 11116, -123041, 66452, -196676, -46859, -410675, -282366, 200820, -8609, -206927, 196576, 59445, 44003, 90569, -187479, 263008, -16291, -36348, 252308, -313578, -327770, -207723, -122883, -124068, -160816, -275543, -4471, -272804, 83418, 86503, -36531, 307511, 210394, -104038, 124167, -80671, 22655, 96053, -56908]
18647b14396f1573N409B28354K8710d7648n3125f150G1532b73250B8290c49072
18635e9904B00863c6150l07776D0026i4779b5136j69691r5977A15244d5740l097
18624d8837D0955f9258E063c54779e1483B7719r750a90455j26830A82480C6089
18612i8679D5643O9343c02843A41451a31021p1537A02871j1566e1168B6175J7105
18601D3280K1708J64219J85231A50265j5914f0850J3427B62652l556f7346B51362
18589F0095b42293C7612K05012a01693q7577Q0719k13526J22697P9130A50922
18578e2331K809A06912k2647a97403f0969l0192A91410d83185a34432h226j47311
18567a55537F6837h1301N078m80k0985k73434A61166c76075R1519k3347A95355
$$ y = [-214396, -61573, -56164, 228354, 257064, -47648, -100773, -6150, 71532, -273250, 28290, -349072, -59904, 200863, -36150, -343926, 40026, -94779, -25136, -194827, -290804, 115244, -45740, -48837, 40955, -69258, 5063, -354779, -51483, 27719, 17969, -190455, -317285, 182480, 36089, -98679, 45643, 114986, -302843, 141451, -131021, -202558, 102871, 91305, -51168, 26175, 43280, 64988, 229207, 414438, 150265, 134351, -60850, -47423, 262652, 259096, -67346, 251362, 60095, -242293, 37612, 242624, -101693, -189270, -108551, -322077, -199380, -120250, 150922, -52331, -49522, 106912, 84265, -197403, -60969, -91161, 191410, -483185, -134432, -8226, -155537, 66837, -81301, -76223, -76703, -97688, -371122, 161166, -376075, -284556, -307903, 195355]
18555d9215A93975e25552N2059d4256G8612a94241k9048A6186b88129J05936A20301
18543b23094b5116k6494r9021A27994e56387a1960k23576c563k38754B3045i2524
18531A51539B8423a08903b1293C4140d9219E375J12877b02083j04546B1075b40974
18519C35618a80966A31022D2820a25685e8234G0201J9537c88293J87558C3025
18508F4632K95410A23915e7970o8428K0207R400C42025j59471b25290E8529B4364
18496c92458a7082A87551J03294a80975j23573K5250K4223b0501q6867a5129m7590
18485f2719D92010c2906n5785B6373M5679a90711A80903F9927J7468b19236g2919
18473d6001A18754m33a34546N6552D8782c56088a65033P5418j8898K6511r1476
$$ y = [-49215, 193975, -525552, -473493, -44256, 78612, -194241, -223289, 16186, -288129, -182193, 120301, -223094, -25116, -51610, -150631, 127994, -556387, -11960, -235536, -3563, -242317, 23045, -92524, 151539, 28423, -108903, -21293, 34140, -49219, 5375, 118252, -202083, -306629, 21075, -240974, 335618, -180966, 131022, 42820, -125685, -58234, 70201, 89738, -388293, -200735, 33025, 64632, 360042, 123915, -57970, -126398, -106191, -96791, 342025, 182554, -225290, 58529, 24364, -392458, -17082, 187551, 290845, -180975, -304548, -279298, -255075, -20501, -107368, -15129, -62719, 492010, -32906, -88691, 26373, 72052, -190711, 180903, 69927, 87395, -219236, -72919, -46001, 118754, 118321, -134546, -77994, 48782, -356088, -165033, -89615, -108513, -82002, -173478]
18462a73478b4545j78676A24392N3619d22062C11970b56851A4136a74926g0849
18451i4389A17700b77469j54947a72694c8248j87325E5376J10975f3193k01971
18441b65164j47527K04617D361c39003a45425N1394I4539i9441j44410P2532b3111
18429A93009b45445F7711c75484a1974j41686o0465j81236F3063e3297C29733
18418B73752b21078h7638H8199D4004a60164L8024D8796n686R9106m2153b5940
18406f4106j9229A43347j0134a15692b1710B87354J5909o5533a4182j08425A27520
18394b25397b6900q6547m2794A53930l108A6213J18957E0031K39534c6237j17422
18383a53659j17583a2367j08129G2027N8022d6180a5140C2732b88799A5902a97079
$$ y = [-173478, -24545, -203221, 124392, 178011, -422062, 311970, -256851, 14136, -174926, -70849, -94389, 117700, -277469, -432416, -172694, -38248, -225573, 55376, 166351, -63193, -265164, -412691, -208074, 4361, -339003, -145425, -94031, 94539, -99441, -243851, -171319, -23111, 193009, -245445, 67711, -375484, -11974, -153660, -214125, -395361, 63063, -53297, 329733, 273752, -221078, -87638, 88199, 44004, -160164, -122140, 48796, 43110, 142216, 100063, -25940, -64106, -83335, 143347, 133213, -115692, -21710, 287354, 303263, 237730, -14182, -122607, 127520, -225397, -26900, -113447, -156241, 153930, 150822, 16213, 135170, 50031, 289565, -36237, -153659, -271242, -12367, -120496, 72027, 130049, -46180, -15140, 32732, -288799, 15902, -197079]
18371b94537A68718A9994b58861f5903c0481k9319j78245B15454e1940J6352A39735
18359c02635A61042d0644A01932a46798l9855Q2636p7831o9506A66781q1135B7714
18347B75004a12408A88254D4936b1397B00616I7003i6884k80906a40641E824K10781
18336B16605p1664a42423p0821f8721r4660L3232P143H1144i9053g544m39501
18325d47045a71396j66848C92957A1565K69202a12434A63881F0875g042j33825
18315a40867E2681e39856F7770h5890j78202B58J59673a2298n3375G4935J33929
18304B08864b44272I4103i6892A59893a32752f328B2718J36411b0578D263c00124
18292b83678e2429O673k6563n6842A5162N3424K7817b80032d6827B20882a4787
$$ y = [-294537, 168718, 19994, -258861, -65903, -30481, -59800, -238045, 215454, -51940, -35588, 139735, -302635, 161042, -40644, 101932, -146798, -186653, -104017, -181848, -251354, 166781, 85646, 27714, 275004, -112408, 188254, 44936, -21397, 200616, 97003, -96884, -377790, -140641, 5824, 216605, 144941, -142423, -213244, -68721, -163381, -130149, -123006, 81144, -99053, -7544, -447045, -171396, -338244, 392957, 11565, 280767, -112434, 163881, 60875, -7042, -140867, 52681, -539856, 67770, -85890, -264092, 258, 159931, -12298, -65673, 74935, 208864, -244272, 94103, -96892, 159893, -132752, -6328, 22718, 159129, -20578, 4263, -300124, -283678, -52429, -45756, -72319, -129161, 15162, 68586, 96403, -280032, -46827, 220882, -14787]
18280g0851l5509K6776F1951a96692j27540a12119k0304A70552a9916A25748n0781
18269G4967C7287d95090F4792b02471m4194A5800J3993c1199l80090B9104J43896
18258A73000a2836A05495C957b72432i233k20935B18271p7080E9505B7412b46786
18246A8926a03112j13895e3846j73311R4053B31461b96797i5673g678A99030I1083
18234b00334E0685K44222j06336D808J50012E408d8906E286J19360f0899p1978
18223a32877A8730P9331b2746H7428b2523l8943j44678B13332b32824A17117c12218
18211B37350a49794K4775j58002f3455B54887a87302K5939M8913A37814J33966
18201B71780l7265c4419A44863Q0243b94513f9749r3620j170K796B82055b87384
$$ y = [-70851, -106360, -79584, 61951, -196692, -324232, -112119, -132423, 170552, -19916, 125748, 74967, 37287, -495090, 64792, -202471, -246665, 15800, 29793, -31199, -411289, 29104, 173000, -12836, 105495, 3957, -272432, -9233, -230168, 218271, 141191, 59505, 27412, -246786, 18926, -103112, -217007, -53846, -227157, -133104, 231461, -296797, -95673, -7678, 199030, 91083, -200334, 50685, 294907, 188571, 4808, 154820, 5408, -48906, 5286, 124646, -60899, -132877, 18730, 98061, -22746, 87428, -22523, -61466, -206144, 213332, -232824, 117117, -312218, 237350, -149794, -125019, -283021, -63455, 254887, -187302, -161363, -112450, 137814, 271780, 234515, -34419, 144863, 225106, -294513, -69749, -163369, -164539, -161743, 282055, -287384]
18189b5914j09105K3591l057A98072i6642I7066a45983M0807I624P2739J7323
18178I9686c86451C1593K10058c12067i7723A0155d7173r6485j1758B11021d7943
18166A27796b55348M3696M3651F7007c4078o1004M1159n3955A18458c21022J55069
18155a65953B5724R4188b61942E9045a36085b0214G4377C5730J8437g1618G7835
18143A7143K7186a65184A05343d491j65971o0337I8363c02000A96973a97244C81619
18131i8406j02082B58296B582k0a38942m0655I0846L3303m8086J09631a89142
18119i2987A53138D1920c9210C70854A55665B6793g6768l73802J82912B68299
18108A2316a31982k50220a76289c0411C33414O3828c8223j18930O0943A62573
$$ y = [-25914, -135019, -111428, -114485, 198072, -96642, 97066, -145983, -105176, 9624, 82363, 99686, -386451, 31593, 241651, -312067, -97723, 10155, -47173, -143658, -155416, 211021, -47943, 127796, -255348, -211652, -168001, 67007, -34078, -95082, -53923, -107878, 118458, -321022, -165953, 25724, 119912, -261942, 59045, -136085, -20214, 74377, 35730, 54167, -71618, 77835, 17143, 44329, -165184, 105343, -4491, -170462, -230799, 98363, -302000, 196973, -197244, 381619, -98406, -200488, 258296, 2582, 2562, -138942, -179597, 90846, 124149, 76063, 185694, -189142, -92987, 153138, 41920, -39210, 370854, 155665, 26793, -76768, -450570, -267658, 268299, 12316, -131982, -382202, -176289, -30411, 333414, 397242, -38223, -157153, -96210, 162573]
18097c22328h7994p9470L9105H2184b29316P2920m6770A78479C3596a25173c4070
18085D7826a51801j37769m3393a13545e2529j67082b9619q3614k37643A24501
18074h4724A03861e7091B82968D3925K95445A00713J84518H2946b85129i206j76445
18063a85651M9868n8441A3291N8192L10445A72570a9732k00072M2980Q3867a9288
18051f8975l2764K5979j14934R776A8514K77929A29710E8076J01240h7728A17010
18039a89083f8486b0286C9495g2352j27790D9356g2489n1785E9820K9104C097
18027a84873A97222a45647j4210C04456A46954J68352C1338i7097B66559i4085
18016e7868j48268A3247N1361d7673k23710a12474D4567L79869J06870D0566A9302
$$ y = [-322328, -87994, -167464, -128359, 82184, -229316, -156396, -203166, 178479, 33596, -125173, -34070, 47826, -151801, -289570, -332963, -113545, -52529, -219611, -29619, -113233, -350876, 124501, -84724, 103861, -57091, 282968, 43925, 339370, 100713, 285231, 82946, -285129, -9206, -185651, -135783, -194224, 13291, 71483, 381928, 172570, -19732, -219804, -176824, -92957, -19288, -68975, -101739, -75760, -190694, -180918, 18514, 296443, 129710, 58076, 159316, -87728, 117010, -189083, -68486, -20286, 39495, -72352, -200142, 49356, -72489, -124274, 59820, 88924, 3097, -184873, 197222, -145647, -159857, 304456, 146954, 315306, 31338, -97097, 266559, -94085, -57868, -206136, 13247, 64608, -47673, -271383, -112474, 44567, 424436, 531306, 40566, 19302]
18004b89576F8955b60803A70397a05147c4565h053j11535j59246D62814C1954
17993a98467C72440P6762a10328C8709e8996k77266I621d90675a18648A1820c26956
17981a20299j81212A13568K68032b30150B32651J18048N0574a24633A21852O0794
17971A82646a14624c4383j02008A20205b73263A28654b31132d3644C8655g1978
17960a07422o9475e6993I8858b75308E4073a60939A50801b33902D3257H583e4664
17948a5845B14025L149I022c36014a23575B0973N6904a76099O5869p4441A08992
17936g1707A49178E4022j5863n281a16395j77015J30962H6257a26025j67373B75407
17924c1511j60611B41432j08984e0552b3619G2975a38287G3737R5507a90367P220
$$ y = [-289576, 68955, -260803, 170397, -105147, -34565, -8053, -119588, -278834, 462814, 31954, -198467, 372440, 449202, -110328, 38709, -58996, -336262, 9621, -490675, -118648, 11820, -326956, -120299, -301511, 113568, 381600, -230150, 232651, 350699, 401273, -124633, 121852, 182646, -114624, -34383, -136391, 120205, -273263, 128654, -231132, -43644, 38655, -71978, -107422, -176897, -56993, 98858, -275308, 54073, -160939, 150801, -233902, 43257, 8583, -54664, -15845, 214025, 217174, 9022, -336014, -123575, 20973, 77877, -176099, -110230, -184671, 108992, -71707, 149178, 54022, 38159, 32878, -116395, -293410, -162448, 86257, -126025, -293398, 275407, -31511, -192122, 241432, 132448, -50552, -23619, 72975, -138287, 73737, 169244, -190367, -183147]
17913a83147F1573P5186L4922e281A55125c16558B5873L30801b26237d2915a4328
17901D4460M1344d6747A10885h4444A69696L8801a54052P0805B38500A15773b03252
17889E4106a75318a2958B11087p5607c0822B4856a22407j35052B36516g4359j45058
17878b19417C10219j08622a24881A09441B8841K47467I1304b30333A6260J37789
17868A54049b7689k27167A11191n3594b10777P3029k54456A23925g372B45993
17857i8935M6600D739b0276j32301B3256L553c3815j89953A80821F535b92235
17845B84055k9824E462e6664l1876j34109B90909A36649a45920B61014A5925K05341
17834B21266a66576B73380c6538A53674J09568b36784a17162B33278b4487q0956
$$ y = [-183147, 61573, 136759, 171681, -5281, 155125, -316558, 25873, 356674, -226237, -42915, -14328, 44460, 85804, -46747, 110885, -84444, 169696, 208497, -154052, -83247, 238500, 115773, -203252, 54106, -175318, -12958, 211087, 135480, -30822, 24856, -122407, -257459, 236516, -74359, -219417, 310219, 201597, -124881, 109441, 28841, 276308, 91304, -230333, 16260, 154049, -27689, -254856, 111191, 57597, -210777, -137748, -392204, 123925, -7372, 245993, -98935, -52335, 4739, -20276, -152577, 23256, 26809, -33815, -223768, 180821, 6535, -292235, 284055, 254231, 5462, -56664, -88540, -222649, 290909, 136649, -145920, 261014, 15925, 221266, -166576, 273380, -36538, 153674, 263242, -236784, -117162, 233278, -24487, -105443]
17824a05443A35616K1292b7029j22632A18629a37521A27312L82270C1127D562
17813A0742K97765m3043C2648N7876a40124G2684a39897p7233A73633c4554n5022
17802h9576C4726A6356J0459L61592G8542c07029g1561J4251J085A75966B6011
17790a76282B88994b37986G3715J02698a24097A77335b61676C07655a26188C19548
17779h2000A25000g7714H5379B5797P2969R200J10566b13178Q2305B12942K5977
17768B38919a82926O9581g549j0865I7625b75175A19369e5647A09770J42472h0481
17756a2099k53857A53684M1018A7547L90848e4589A93494b97312A10786K04399
17746C15185K5092f2230A26266J19806H7738b28844J10266B05285J22937C2963
$$ y = [-105443, 135616, 156908, -27029, -149661, 118629, -137521, 127312, 509582, 31127, 4562, 10742, 308507, 265464, 32648, 90524, -140124, 72684, -139897, -217130, 173633, -34554, -89576, 34726, 16356, 26815, 388407, 78542, -307029, -71561, -57310, -56225, 175966, 26011, -176282, 288994, -237986, 73715, 176413, -124097, 177335, -261676, 307655, -126188, 319548, -82000, 125000, -77714, 85379, 25797, 98766, 107966, 218532, -213178, -130873, 212942, 238919, -182926, -113345, -7549, -18414, 97625, -275175, 119369, -55647, 109770, 252242, -80481, -12099, -265956, 153684, 194702, 17547, 408395, -54589, 193494, -297312, 110786, 315185, 340277, -62230, 126266, 246072, 87738, -228844, -118578, 205285, 328222, 32963]
17735D274K06456a00948j17595C7958Q4880B5630M6728j7023J41677c8388A61529
17723A89731r4742K27622r4635B9360a33650A25982d0667B19284R9120d4846b1976
17711F4575J7253K1632h5779B35335J4250J46056A00328a54588f9656C26909d4461
17699a09854e219A25250b44055B89767D9733a35676J1308M8048A41542a68243
17688A42164b9632A54763K0736D2457L4346L58a19660A53264L6816N2838j14385
17677A28533N365J10008f4468k80411a54116B20258e0053A3180b89882e0328k4610
17666g4938A50702A5737L7626N4830K13208a76796A16708a15892A28064J82253
17656C10317B3840K05488M4476g6302B50718d7167k46171b6059A67241J26686
$$ y = [4274, 210730, -100948, -218543, 37958, 122838, 25630, 72358, 55335, 197012, -38388, 161529, 189731, 94989, 322611, 227976, 29360, -133650, 125982, -40667, 219284, 318404, -44846, -21976, 64575, 81828, 103460, -85779, 235335, 249585, 395641, 100328, -154588, -69656, 326909, -44461, -109854, -5219, 125250, -244055, 289767, 49733, -135676, -124368, -76320, 141542, -168243, 142164, -29632, 154763, 175499, 42457, 76803, 77161, -119660, 153264, 190080, 242918, 128533, 133898, 243906, -64468, -344879, -154116, 220258, -50053, 13180, -289882, -50328, -74938, 150702, 15737, 53363, 108193, 321401, -176796, 116708, -115892, 128064, 310317, 23840, 229328, 273804, -76302, 250718, -47167, -293338, -26059, 167241, 293927]
17646B93927a54480N7682l7088A05329j3011a32654A22230C6862J72731M32J27666
17635C37691E8074b84117A57441a66816B91206a91081C01005r7757I9606b0617
17624D37495f0573F7293J44509k6199I1568B517c32071f5965B00962n6933O5024
17613B09053D3892K52500b75124a6957B86901j4999d401A92799J16929q2001I4190
17601a17909C40107b42182R058h9365A16410K42054j55987o4078b06914A87166
17590B83921A25499L44035a76639c5412F3504J8918a0510p4608K0j66047B29809
17578c7270B75339Q2250A35984Q6063i3018B79470j09290b42788B32091E3477
17567B10085J53949A10590K80656A19303f734A71929G4242L3270k809B6505J59123
$$ y = [293927, -154480, -96798, -133886, 105329, 92318, -132654, 122230, 36862, 209593, 210025, 337691, 58074, -284117, 157441, -166816, 291206, -191081, 301005, 203248, 99606, -20617, 437495, -60573, 67293, 211802, 185603, 91568, 2517, -332071, -65965, 200962, 144029, 209053, 43892, 296392, -275124, -16957, 286901, 271902, -4401, 192799, 309728, 227727, 94190, -117909, 340107, -242182, -233124, -89365, 116410, 358464, 202477, 138399, -206914, 187166, 283921, 125499, 469534, -176639, -35412, 63504, 82422, -10510, -85118, -85098, -251145, 229809, -37270, 275339, 357589, 135984, 222047, -93018, 279470, 170180, -242788, 232091, 53477, 210085, 364034, 110590, 391246, 119303, -6734, 171929, 74242, 107512, 104703, 26505, 185628]
17556A85628K3451G655L46479I152K96623M9250j55061N3322C461K85047E988
17544a2125C09232J93366b20003F4772J24896J19552l6155J47605j15620a06699
17533G0373c2823B81507D0223L16667J36467n9459A17551h0957B782N57123a70535
17521A78630K37322n0151j63174J31577F8816Q3141K77845O8168o5047K34958
17511F67881J28955k0631L80333j24788l42709o8633k47414K08536j68878J5284
17501D27936A99990J09441N85251B91219L40154K67110J61085m01037j40651Q7281
17491F05161j11311n0878j25750J95643B40564K72522h348A57766N32363e6147
17480C31262k1507A02919L33230j57676Q0893E458J53273R4382M0111J05251p8770
$$ y = [185628, 209079, 7655, 354134, 9152, 305775, 355025, 199964, 253286, 3461, 288508, 5988, -12125, 309232, 502598, -220003, 64772, 189668, 309220, 273065, 420670, 305050, -106699, 70373, -32823, 281507, 40223, 356890, 493357, 433898, 117551, -80957, 2782, 559905, -170535, 178630, 415952, 365801, 202627, 334204, 68816, 151957, 429802, 497970, 432923, 667881, 796836, 776205, 1156538, 1031750, 689041, 620408, 372994, 581530, 412652, 427936, 199990, 309431, 894682, 291219, 631373, 898483, 1059568, 658531, 517880, 605161, 493850, 442972, 317222, 512865, 240564, 513086, -8348, 157766, 690129, -56147, 331262, 309755, 102919, 436149, 278473, 359366, 5458, 158731, 253113, 293224, 398475, 319705]
17469C19705m1680J26441l9088N2932j32491N9125A41769a2900B81780R3235l8023
17458C36992J23172q8985E1964q635K85575K05765j37670r2991j27380J76073
17448C52701j40056H094M82167K19862o4476p6517K2846A74901K09903A08894
17437B05673M5030J93515A70312J96850J50542A5548J76281K42394j25820j49463
17427A58940O8829J23358j26247K23137L3334J7051B00616J45637C1306L19825
17417C51131j41455G3029J82705M6421b8223m724F5350M68555A22094l1412J55049
17406B45731M17294B68471L72172C17858H7952K07998A32047M62919c7639A79519
17395c9831E01975p3418A16745J92355I9632M44618k18389G8655a41895e8061
$$ y = [319705, 278025, 404466, 365378, 418310, 285819, 344944, 141769, -12900, 281780, 375015, 336992, 460164, 371179, 51964, 43329, 328904, 534669, 396999, 304008, 176628, 352701, 212645, 8094, 490261, 710123, 645647, 569130, 591976, 174901, 384804, 108894, 205673, 250703, 444218, 170312, 367162, 517704, 15548, 191829, 434223, 308403, 158940, 227769, 351127, 224880, 448017, 481351, 498402, 200616, 346253, 31306, 351131, 209676, 73029, 255734, 302155, -28223, -32947, 65350, 533905, 122094, 90682, 245731, 663025, 268471, 640643, 317858, 87952, 295950, 132047, 594966, -37639, 179519, -39831, 501975, 428557, 116745, 309100, 99632, 544250, 325861, 78655, -141895, -58061]
17384E37711E3375M91238q7839B09501p3962J77086B8316J39006Q5762o720r9062
17373A47302L93998B33679D5435L27179o0748c8459I5133b7119j335H9673k9820
17362E9853a03762B90778J63707k21404L16186j85929j77406b19893B04725K19769
17352D24494E1226J92359j10910K77071A5876M5995J99665m1139q5602K8505L49
17341A63649J55100i4369A41245L02845A11977K35898n2751A073c3510o5413B87774
17329E84020A03393J4318K31930R0027H7555L72259A95686Q0883m1021E3309d2
17317C48636H2831K55074k1806K99564k78084j03455K6582J17432A29294J70007
17307B99301r4476r780D9304L16085J2081M8077R8048c4704A38288J22864Q5330
$$ y = [537711, 53375, 544613, 456774, 209501, 135539, 312625, 28316, 167322, 253084, 246364, 147302, 541300, 233679, 45435, 372614, 311866, -38459, 95133, -27119, -28454, 89673, 59853, -103762, 290778, 454485, 233081, 549267, 363338, 185932, -219893, 204725, 424494, 51226, 243585, 132675, 409746, 15876, 61871, 261536, 220397, 134795, 163300, 163649, 318749, -94369, 141245, 444090, 111977, 347875, 295124, 1073, -33510, -98923, 287774, 584020, 103393, 117711, 349641, 439668, 87555, 459814, 195686, 276569, 235548, 53309, -42, 348636, 82831, 337905, 316099, 615663, 337579, 234124, 260706, 378138, 129294, 299301, 204825, 195045, 49304, 365389, 377470, 425547, 523595, -34704, 138288, 261152, 346482]
17296C46482N8967j95165q9368N58692j65612j80742j21005Q2844L05963B23242
17285H927N68763I2906K04155J73057k22447M0880j06907J68661J67892A43637
17274B70885F9156M05703I4433J81417J90356A87972q0320K48156A34924J26405
17264B61329B5928K67579J58018a65020D18503A81475K4854p8931K9056L82648
17254E39102A86562M1725n9750F8570E264K83141j1273O8825L69974l34703K01760
17243E82988I0631K24294J96122K69801A58916J31942L1408I1524K33412J43358
17233D68294B03469J93310A9938K25606L39898j89914C2874i1514C27839m2941
17223B84898G3573J59107N4421m3591K6291J7523J07007K6817A00257K12993M8961
$$ y = [346482, 405449, 210284, 120916, 679608, 513996, 333254, 212249, 295093, 601056, 223242, 8927, 577690, 92906, 297061, 470118, 247671, 288551, 181644, 350305, 518197, 143637, 270885, 69156, 474859, 94433, 275850, 466206, 187972, 107652, 355808, 134924, 261329, 25928, 293507, 451525, -165020, 418503, 181475, 206329, 127398, 156454, 539102, 186562, 228287, 168537, 68570, 5264, 288405, 277132, 345957, 715931, 381228, 582988, 90631, 314925, 511047, 780848, 158916, 290858, 322266, 91524, 324936, 468294, 203469, 396779, 19938, 245544, 585442, 395528, 32874, -91514, 327839, 284898, 73573, 232680, 287101, 243510, 269801, 287324, 394331, 421148, 100257, 313250, 362211]
17212C62211J1606J35345j3715j69664j43337G9057K70972A07838J97204K28254
17202E33296k2864H9226J08249J15499A46304K31040J38827j38157J24800N653
17192E08467l8662r5091K0117q1181K88169o8363A65720M77347B22904J36421
17182C59325j57328K92680B06390O019K71860k18252L11385O489B00488I1781
17171C43230J53986j54543Q1052A79503L66810p7678n772k4770q4785p1430K03039
17160D84917L3288o55j62020J35735M7668N0214Q3318A60398K20569p6829L97632
17149G01770q7982B03060L1144M20938J70677l88261o2600J46920M870A59992
17138D63837k00873G4251K16095M6034O3995P4461J44127n3052J4382j08777J08177
$$ y = [362211, 373817, 509162, 495447, 325783, 182446, 79057, 350029, 107838, 305042, 533296, 510432, 89226, 197475, 312974, 146304, 377344, 516171, 378014, 502814, 508467, 469805, 374714, 394831, 313650, 601819, 533456, 165720, 643067, 222904, 359325, 201997, 494677, 206390, 212409, 484269, 266017, 577402, 583891, 200488, 91781, 343230, 497216, 342673, 423725, 179503, 546313, 468635, 462863, 438093, 353308, 281878, 484917, 518205, 517550, 355530, 491265, 538933, 589147, 672465, 160398, 380967, 304138, 701770, 613788, 203060, 234204, 655142, 825819, 437558, 374958, 521878, 526748, 159992, 463837, 262964, 74251, 290346, 336380, 400375, 474836, 618963, 565911, 580293, 471516, 579693]
17127E79693j72018m94O0463k27595L10242j34006j37591K42731L8316m8517j49109
17116C62115b2559G45165l61646J96565R726r6378J73999j26128J86105O8569
17106G95977k08320k04199J06450K9730l6870R1902L08520l75007j84125J42028
17096D66086L65124l83630M7858J38674j98457N15239D11501L40067j32096K73870
17086H93342l26344J38146N7550k95468N434K83261k41220K6410Q8192K08232
17076H37535C27693L91996k74668L9124N18933l42708J87095L8425k17342j13778
17066E54770n9518K3252L49110N9369m18612J9301O76463n6195D90376N14901
17056A005277D94298L07243l48040M81668j3802r1674j66087K46525Q5230K2476
$$ y = [579693, 407675, 407181, 467644, 240049, 550291, 416285, 278694, 521425, 559741, 511224, 362115, -22559, 745165, 383519, 580084, 589810, 493432, 667431, 541303, 727408, 795977, 587657, 383458, 489908, 519638, 482768, 574670, 883190, 508183, 324058, 466086, 831210, 447580, 495438, 634112, 435655, 950894, 411501, 751568, 619472, 893342, 566998, 705144, 762694, 467226, 472660, 755921, 514701, 541111, 629303, 837535, 327693, 719689, 445021, 484145, 1003078, 660370, 847465, 885890, 668548, 554770, 495252, 518504, 867614, 926983, 508371, 527672, 1204135, 1147940, 490376, 1005277, 494298, 801541, 453501, 935169, 921367, 829693, 663606, 910131, 995361, 1017837]
17046A017837C49462N13760K45172l79533K23955k81791j26739M00109k91036
17037F53359J66204p7425l6681K27281j45816k63164M7842Q2000M55251k34389
17027H74462K04374J64517j70037J5127l86810j82043M50098j14391J83810k94065
17017G45042K29558O5505R5357k22079M14471k25873Q7800k43290J47008k1118
17007A072381k55999J68376K2113J6256q2973J43340j46700n4242L29485j68821
16997A043216j43638M12628k10525m2612k87294K98552m2651j4201K0288K29457
16987A263220j17291j4436j95341K47293J13211k96831J38168J91536m20311O3583
16977I72801K63036K14468n01113L25533l26298J00466K27357J88168k30240R9861
$$ y = [1017837, 349462, 863222, 1108394, 728861, 952816, 671025, 544286, 944395, 653359, 819563, 742138, 705457, 932738, 786922, 523758, 571600, 653600, 1108851, 874462, 1078836, 1243353, 1073316, 1088443, 701633, 519590, 969688, 855297, 1039107, 745042, 974600, 1040105, 1135462, 913383, 1327854, 1101981, 1189781, 946491, 1093499, 1072381, 816382, 984758, 1006871, 1023127, 940154, 1083494, 936794, 882552, 1212037, 1043216, 899578, 1312206, 1101681, 1059069, 771775, 1070327, 1027676, 1013475, 1033763, 1263220, 1145929, 1131493, 936152, 1183445, 1296656, 999825, 1137993, 1329529, 909218, 972801, 1235837, 1450305, 949192, 1274725, 948427, 1048893, 1276250, 1464418, 1234178, 1334039]
16967A334039r0700n8755K82689j74494j61240K37061k5151j89348K57180j8346
16957A392935L6998K05127J91352n57849K79484j1622l59677L61432j7190J7676
16947A538666J19488l7329K06814l7352M1432j50981J32778o40762L80339L8425
16937A591518P604j60934K06721K13594N075k11614K00437l10821K19558N2487
16927A813625J97173k84507k2957J23074J36062L44992l12462K72377m30953k38182
16917A598242M9101J32716K67316K641K79882n59364K70267J60851n54265O19240
16907B266627l29334j16527N7525K56959J59400J4726l9502K19720k58074K67970
16897B499490K81870l12420O6874k09535O6779J21351r2628K53064r362J89084
$$ y = [1334039, 1243339, 1184584, 1467273, 1292779, 1131539, 1368600, 1343449, 1154101, 1411281, 1392935, 1429933, 1635060, 1826412, 1268563, 1548047, 1536425, 1176748, 1538180, 1520990, 1538666, 1658154, 1620825, 1827639, 1790287, 1831719, 1680738, 1813516, 1172754, 1553093, 1591518, 1599122, 1438188, 1644909, 1858503, 1863578, 1651964, 1852401, 1541580, 1761138, 1813625, 2010798, 1726291, 1703334, 1826408, 1962470, 2307462, 1995000, 2267377, 1836424, 1598242, 1647343, 1780059, 2047375, 2050016, 2329898, 1770534, 2040801, 2201652, 1647387, 2266627, 1937293, 1820766, 1878291, 2135250, 2294650, 2309376, 2269874, 2489594, 2231520, 2499490, 2781360, 2468940, 2535814, 2326279, 2393058, 2514409, 2421781, 2674845, 2665483, 2854567]
16887B854567k28610L19828J17106m59237K38478k18157J50487r644K25633j71913
16877B818538J89514j62539N36109o09127K49794K22592J06609k98979L91591
16868C444102K78073k85348l39918J92038P7263J37146j0207J44377N0514J45276
16858C833316K1300J86442l20921J13918K79202N7324K76530m05103J17942L9786
16848D199736L12444J47219k61345K00150j66287K55437j78370K45554j98228
16839D556310L17046J38459K29188k11025j1023L35309j95580K44224J81758J32313
16829E716979K85230k16707J05536q3625J67615O78624k42888J15323J19573J3083
16819F658743m29665M49306J97724K75495K63963q3481J13993j77214L82450O0905
$$ y = [2854567, 2625957, 2945785, 3062891, 2603654, 2842132, 2623975, 2774462, 2764818, 2990451, 2818538, 3008052, 2845513, 3381622, 2772495, 3022289, 3244881, 3351490, 3052511, 3444102, 3722175, 3436827, 3096909, 3288947, 3366210, 3503356, 3493149, 3637526, 3688040, 3833316, 3854616, 4041058, 3720137, 3834055, 4113257, 4170581, 4447111, 4042008, 4159950, 4199736, 4512180, 4659399, 4398054, 4598204, 4431917, 4687354, 4508984, 4754538, 4556310, 4873356, 5011815, 5241003, 5029978, 5018955, 5354264, 5158684, 5402908, 5584666, 5716979, 6002209, 5785502, 5891038, 5807413, 5975028, 6653652, 6410764, 6526087, 6645660, 6658743, 6229078, 6678384, 6876108, 7151603, 7415566, 7332085, 7446078, 7268864, 7651314, 7712219]
16809G712219O4746K96846p0920K11960M55566K05893m4540J26382L56800L26055
16799I641007q718J82852L97033m0496K25527O27432k5075K12008K9355L15946
16789A1556871J09020O01154K03365r2360L64712M10978Q17037o1931L94997O48786
16779A4952629p9151M61141L99392N19191M11887K34227N35648O98717M95887
16770A8629568L78935O63181K59209P13464L06725R18868L55104P65119P36995
16761B3727168Q13091N47524Q65404R45066R86186P44220N64140J226512J142628
16752C1561939J100580O58522J454472O99483J826659J280424J040064J809169
16744D1431312J404238J545668J656921J829446J791150J443754K465191J755282
$$ y = [7712219, 7776965, 8073811, 8002891, 8214851, 8670417, 8876310, 8831770, 8958152, 9314952, 9641007, 9632289, 9815141, 10212174, 10171678, 10397205, 11024637, 10999562, 11211570, 11240925, 11556871, 11665891, 12267045, 12470410, 12378050, 12742762, 13153740, 13970777, 13908846, 14303843, 14952629, 14873478, 15334619, 15734011, 16253202, 16665089, 16899316, 17434964, 18133681, 18629568, 19008503, 19671684, 19930893, 20644357, 20951082, 21869950, 22225054, 22990173, 23727168, 24540259, 25087783, 25953187, 26898253, 27884439, 28628659, 29192799, 30419311, 31561939, 32662519, 33321041, 34775513, 35474996, 37301655, 38582079, 39622143, 41431312, 42835550, 44381218, 46038139, 47867585, 49658735, 51102489, 53567680, 55322962]
16736E5322962K519362J879935K667442K247713K379834K708934K441031K659898
16728G4827111L299216K605216K799722L102539K950355L608253K827762K827796
16720I8847970L320187K974396K829363L117604K736510J912581K824277K019351
16712A20582239J692747J481532J252958Q80085N79984J32700M39982r98335q40828
16703A25203064j126657j496032j716459k059994k189224k630401k342406l159343
16695A08482548k466595l745192k644433l452133l028766l362892l101362k723707
16687H3957468l078709k874119l088886l056954k354047k858851k553892k315291
16679F1776719k821210j796991k255256k201559j993335k144247j705111j416473
$$ y = [55322962, 57842324, 59722259, 62389701, 64637414, 67017248, 69726182, 72167213, 74827111, 78126327, 80731543, 83531265, 86633804, 89584159, 93192412, 96020174, 98847970, 102168157, 105142553, 107971916, 111089520, 113826030, 115738611, 118562888, 120582239, 122274986, 123756518, 125009476, 125889561, 126469545, 126602245, 127042227, 126043892, 125203064, 124076407, 122580375, 120863916, 118803922, 116614698, 113984297, 111641891, 108482548, 106015953, 102270761, 99626328, 96174195, 93145429, 89782537, 86681175, 83957468, 80878759, 78004640, 74915754, 71858800, 69504753, 66645902, 64092010, 61776719, 58955509, 57158518, 54903262, 52701703, 50708368, 48564121, 46859010, 45442537]
16671D5442537j763533j745822j512107j242218j805805j067491j352158j333059
16663C3620344r32636j160380j198089j066016r25452o36659j287844p11896j008063
16654B4693309k60077j074244o69612q82039k20244o39670p41780n11780n03721
16645A9190142p94451l82618o46101k08992o90754n63478m62452J46754n03959
16636A5084091l93323m68784m16126l82614n18723j3094l72333k81206l05586
16627A1932302R7061p87804J00751l81332j71915k49157q20898N5530Q9840j44059
16617I720319j22639n06405K21559o79510L76160o65156k91016j24297J66408
16608H095423m13912k27429Q8824k60229K1978k35996l33791O1011J73878l41060
$$ y = [45442537, 43679004, 41933182, 40421075, 39178857, 37373052, 36305561, 34953403, 33620344, 32687708, 31527328, 30329239, 29263223, 28337771, 27701112, 26413268, 25701372, 24693309, 24433232, 23358988, 22689376, 21807337, 21587093, 20947423, 20205643, 19693863, 19190142, 18395691, 18013073, 17366972, 17157980, 16467226, 15903748, 15441296, 15588050, 15084091, 14690768, 14221984, 13805858, 13423244, 12904521, 12891427, 12519094, 12237888, 11932302, 12029363, 11241559, 11342310, 10960978, 10789063, 10539906, 9719008, 9774538, 9864378, 9720319, 9597680, 9091275, 9312834, 8633324, 9009484, 8344328, 8053312, 7929015, 8095423, 7681511, 7454082, 7542906, 7282677, 7304655, 7068659, 6734868, 6795879, 6969757, 6628697]
16598F628697N2553l59112k13079m1186n4773j08603P0072l55338p6225j76818
16588E366188M66401m20691j17814k19243N3284k16633k90334l2838R0658L2316
16578D711294j3080j50454J35000l13479J96119m17026J06607N9535n28790J87914
16568C973640L57426j42018m03896J29696q4935p6141j43623J89265k54428k4119
16558C520867j11173n0654j31932n8413L36371j05648k79028M01529l00170m01795
16548B819954K87976K73302m19710L23606l89039j475R4463J7305j21054l67800
16538B517528J17680M60939n16591L47745l56959J24031l75026J28377R2196J15902
16528B655822j76020r0161L29919k50047j19665R3803m19537N06729m28565r7766
$$ y = [6628697, 6681250, 6322138, 6109059, 6067873, 6013100, 5904497, 5974569, 5619231, 5543006, 5366188, 5832589, 5411898, 5294084, 5074841, 5128125, 4911492, 4621158, 4588320, 4678978, 4711294, 4698214, 4547760, 4682760, 4369281, 4565400, 4148374, 4254981, 4314516, 3785726, 3973640, 4331066, 4189048, 3785152, 3914848, 3829913, 3753772, 3610149, 3799414, 3544986, 3520867, 3409694, 3359040, 3227108, 3168695, 3505066, 3399418, 3120390, 3521919, 3221749, 2819954, 3107930, 3381232, 2961522, 3285128, 2896089, 2894614, 2989077, 3006382, 2885328, 2517528, 2635208, 3096147, 2579556, 2927301, 2570342, 2694373, 2319347, 2447724, 2539920, 2655822, 2479802, 2389641, 2719560, 2469513, 2349848, 2443651, 2024114, 2530843, 2102278, 2004512]
16518B004512K17352K8459j74046N284j68687L61528l25481K18102j66940J18636
16508B118719l09630J83207o6606J16882n5995l20099J68771K55318k79802M3609
16498A854374m43956O11048l26883r3063J42971j32602L5645k849k15021L31811
16488A761475j1635o992m09650J16881J6902J87239j48928J84208j96750J52147
16478A644897M0088l2945j51235K07514k80181J21448k70746L8722J82319o2142
16468A437739k16704j90800O21041j87215m1140m70345L36529j35755K83036p1314
16458A365072n3828L7448k88718K56488q911J7415k94607L18796k93766L71414
16448A426803j09985n1689j94160L21939k05181j02488J79913K7751k06329K56808
$$ y = [2004512, 2221864, 2250323, 2076277, 2081561, 1912874, 2274402, 1948921, 2167023, 2000083, 2118719, 1809089, 1992296, 1925690, 2042572, 1986577, 1666478, 1835249, 2090567, 1810765, 1854374, 1410418, 2021466, 1694583, 1601520, 1744491, 1611889, 1647534, 1644685, 1429664, 1761475, 1749840, 1742848, 1333198, 1450079, 1466981, 1654220, 1505292, 1689500, 1492750, 1644897, 1684985, 1652040, 1500805, 1708319, 1428138, 1549586, 1278840, 1317562, 1499881, 1437739, 1221035, 1030235, 1651276, 1464061, 1422921, 952576, 1289105, 1153350, 1436386, 1365072, 1311244, 1348692, 1059974, 1316462, 1307551, 1324966, 1030359, 1349155, 1055389, 1426803, 1316818, 1265129, 1070969, 1392908, 1187727, 1085239, 1265152, 1292903, 1086574, 1343382]
16438A343382j30804j39406j22726J04166N3814r7953M5469J05465k45753K7841
16428I43495m6456r5608L44575L1795l06252N5180M8857K10318m82085K57652
16418I61471j79996L4218j24049L45717J26942j88204j04691K3164k27319K32388
16408H99641L50935j91565j17466j99361K67317j22391j70181K18328N0099O4894
16398A050250l27506j60143J72960j1995K42419L6556l43399R4221j621K4714
16388G76456L04623n18097K16856n0377J38731K7209r9685j39762r6838J12047
16378F71163J46912Q4765p6326j62561J47108l71737M63422k04815p2533J29029
16368G54427j45153k73422M76887j66106Q4043L02816B77197O39973j37084j25960
$$ y = [1343382, 1212578, 1073172, 950446, 1054612, 1108426, 1010473, 1055942, 1161407, 915654, 943495, 897039, 801431, 1146006, 1177801, 871549, 926729, 975586, 1185904, 703819, 961471, 781475, 815693, 691644, 1037361, 1164303, 976099, 871408, 894572, 667253, 899641, 1250576, 1059011, 941545, 742184, 1009501, 887110, 716929, 935257, 985356, 1050250, 722744, 562601, 735561, 723566, 965985, 1002541, 659142, 753363, 751742, 776456, 1081079, 562982, 779838, 729461, 868192, 895401, 795716, 655954, 559116, 671163, 818075, 902840, 826514, 663953, 811061, 439324, 902746, 697931, 625398, 754427, 609274, 335852, 812739, 646633, 730676, 1033492, 277197, 917170, 780086, 654126]
16358F54126B68994N94371j02194J02905k90918m5701p3686J37739L64345l66583
16348E89272j2965L35576m19207J92813j06875j56518M9301F969M79756K09968
16338F96693j20936B71431M63984K3362J79327k34705Q5066k69275k41921J66556
16328D43825N33153D85068J76177k7792k85611A68758L01154L3951K9576B06128
16317D81942j12298J35590q8841L38297k34930n5070K46230j1967k84594P02289
16307A116648E47958p6426m1870J91876B52616J87351J87329B48225J81532p9463
16297C50294R3333r1024k5458N6491J83113k00311J08752r3688l7896A15865N40883
16286F56748B60963j07275M25885k19944J56604A31569N15840k64497K59316p6416
$$ y = [654126, 268994, 863365, 761171, 864076, 573158, 527457, 453771, 591510, 955855, 589272, 576307, 911883, 492676, 685489, 578614, 422096, 471397, 6969, 486725, 696693, 575757, 271431, 735415, 758777, 938104, 703399, 788465, 519190, 277269, 443825, 976978, 485068, 661245, 633453, 347842, 168758, 469912, 503863, 533439, 206128, 481942, 369644, 505234, 416393, 754690, 519760, 464690, 710920, 698953, 414359, 1116648, 547958, 471532, 429662, 621538, 252616, 439967, 627296, 248225, 429757, 350294, 443627, 352603, 327145, 383636, 566749, 366438, 475190, 381502, 343606, 115865, 656748, 260963, 153688, 579573, 359629, 516233, 131569, 647409, 382912, 642228, 565812]
16276E65812L56149C91895q0805L04277j35354j99672R5888j01262h6381A44116
16265C55571A75974j096o4888J22221K23329j35858A42853e837C48839A69662
16254A75552J54063m9086K6963J29530n5448j40674O6482K17561B17241j7682
16244A99559J83248A85765K31028B2101L85909p7677L1412Q3997J50534B46245
16233B53772J54791L7030j96783N0492o4183O3376J35635P3673k10114m3357P5648
16222C29980K48981G3846J89414N1633K04047J69378B86418M7986L07866B02073
16211G8052K57395A34326O5867J99074I9353r940L75900E3611L36561K7605J53042
16200E70819B67588A2764K50028p3158I503J82138P1930j22953L77357E5149J38210
$$ y = [565812, 921961, 391895, 311090, 615367, 480013, 280341, 376229, 274967, -86381, 144116, 355571, 175974, 174878, 109990, 232211, 455540, 319682, 142853, -5837, 348839, 169662, 175552, 329615, 280529, 307492, 437022, 381574, 240900, 307382, 524943, 217241, 199559, 382807, 185765, 416793, 22101, 408010, 330333, 361745, 445742, 596276, 246245, 253772, 408563, 445593, 248810, 299302, 235119, 298495, 434130, 507803, 297689, 254332, 329980, 578961, 73846, 263260, 314893, 518940, 688318, 286418, 334404, 642270, 202073, 78052, 335447, 134326, 200193, 399267, 99353, 89413, 465313, 53611, 390172, 417777, 570819, 267588, 12764, 262792, 189634, 9503, 191641, 263571, 140618, 517975, 55149, 193359]
16189A93359M17729a774B6735L8469L82593j82827a00487C07793K7029d4414E1817
16177G0075K69984J9367J12753p7902j84998c6984D09929B5509K61906J50919
16167D38334B5227K1671b03930A04360J20432n5188l9239L02034A91096b25238
16156g6324C5917j0743K44662J23699I3909e7935F4703K30560G6824L35672j63056
16145B49440J9385C1523K63394j12969j1279J73688j70386P9307k3904P431o3470
16134A73335K42282k4135j02468I1437D5034J24179Q2168A0687i7990C3257a9419
16122C75400A45132K23205d215A72119b30880F5006K18150c1426C132J37138A9012
16110I8387N6691E8741a788l03201a11248b5929B60298o1008C2096e1869H5507
$$ y = [193359, 611088, -1774, 26735, 65204, 447797, 264970, -100487, 307793, 334822, -44414, 51817, 70075, 340059, 359426, 472179, 394277, 209279, -36984, 409929, 25509, 287415, 438334, 25227, 46898, -203930, 104360, 224792, 169604, 130365, 432399, 191096, -225238, -76324, 35917, 25174, 269836, 393535, 93909, -57935, 64703, 295263, 76824, 412496, 249440, 268825, 31523, 294917, 181948, 170669, 344357, 173971, 253278, 229374, 236805, 173335, 415617, 391482, 289014, 91437, 45034, 169213, 251381, 10687, -97990, 33257, -19419, 375400, 145132, 368337, -4215, 172119, -230880, 65006, 283156, -31426, 3132, 140270, 19012, 98387, 155078, 58741, -1788, -304989, -111248, -25929, 260298, 199290, 32096, -51869, 85507]
16098D10055D3867J05080B5778F682J68698H4595K72113a9331A23839N5563A2041
16086a52863B99884G8107c83368G8217a8423C11933A29314h02A30760n9171J36076
16075B07665b6138C54786d35476B26098O6138a77434k2497E7943L0840d6470G1535
16063C2016K08182B8993a14719I0907M2752k1286N2843o1293c7001o2878L7055
16052f2824A59384J83875A16985L8060l9951i6796A11387m8967K6561h585A85029
16040a4984A53763C4591N3667J5493a15063N0847B04400a77481A23M1318M1797
16029H3238K15287C4679L1376P0527J84759q5003f9287o1479B30870n8792a23846
16017C09259A20289b7394A67713P7935R173b73161P7919j6437A62373a25062B53891
$$ y = [410055, 43867, 148947, 25778, 6682, 175380, 84595, 356708, -19331, 123839, 179402, 12041, -152863, 299884, 78107, -383368, 78217, -18423, 311933, 129314, -802, 130760, 71589, 207665, -26138, 354786, -435476, 226098, 292236, -177434, -199931, 57943, 88783, -46470, 71535, 32016, 240198, 28993, -114719, 90907, 133659, 112373, 165216, 103923, -37001, -99879, -62824, 159384, 343259, 116985, 155045, 115094, -96796, 111387, 62420, 88981, -8585, 185029, -14984, 153763, 34591, 88258, 103751, -115063, -64216, 204400, -177481, 123, 41441, 83238, 298525, 34679, 66055, 136582, 321341, 236338, -69287, -130766, 230870, 172078, -123846, 309259, 120289, -27394, 167713, 245648, 254821, -273161, -195242, -211679, 162373, -125062, 253891]
16005E8681J57096e9173A97557a34410B3237O4843J01050l4772c18940c5048j1647
15994d6695A75954a01780A16236l7256a844A14877a82456C12459D874L36572a03658
15982e08666B63552J02079p6652R7235j32444r8886a40803D66466j81855l3861
15972B50750K26974J95785L05747k10799O2334J11308l69287A95922L3345K1558
15962B50825O381B8344l700h7380B11746C4740b7864A60895b16382H0216N1985
15951A32201a93960A53090d760A15668d828j60548C17348b3716j00037j57694
15941b81447A07342c72071A0457R587d14884a7135k9888B3701b5509A7721g1020
15929a5857E9061d3411q0566B4156g9718b9116Q451j05673A05602a05305B19370
$$ y = [58681, 215777, -59173, 197557, -134410, 23237, 88080, 189130, 154358, -318940, -35048, -46695, 175954, -101780, 116236, 78980, -1844, 114877, -182456, 312459, 4874, 341446, -103658, -508666, 263552, 365631, 288979, 386214, 253770, 154884, -140803, 466466, 284611, 250750, 477724, 673509, 979256, 768457, 830791, 942099, 572812, 195922, 229267, 250825, 257206, 28344, 24644, -87380, 211746, 34740, -27864, 160895, -216382, 80216, 132201, -193960, 153090, -4760, 115668, -4828, -165376, 317348, -23716, -123753, -281447, 107342, -372071, 10457, 20044, -414884, -17135, -47023, 23701, -25509, 17721, -71020, -15857, 59061, -43411, -123977, 24156, -79718, -29116, -20665, -126338, 105602, -105305, 219370]
15917b58542d1878q1748r6263A74340m7530Q2005i2014a7859A00318b00690P8880
15906a21810B41471c1167A94959b1942o2669k38102B74917f3060B30156e5675
15895A23954a11327j18012J12338A22947d77071K21046K4903A49200a37223K5031
15885a12192B1417O410N2960b00136A34966D1964q931a76029K8721B00569o6727
15874A33842J27588j3752M6267a6095j10869i592p9559B13389i4519B55538c57726
15862b06672d0133E6809b95973k18105J81198a09985b0245k54027H0979O0056
15852A41035a31706D9664a20520j55522A43241b11421A3831J80071b83186A62765
15841H6065a17645A59510i0743j5871j32662k86399a46499k75908a37015H8610
$$ y = [-258542, -41878, -123626, -219889, 174340, 126810, 208815, -92014, -17859, 100318, -200690, -121810, 241471, -31167, 194959, -21942, -84611, -322713, 274917, -63060, 230156, -55675, 123954, -111327, -229339, -117001, 122947, -477071, -256025, -231122, 149200, -137223, -112192, 21417, 27827, 80787, -200136, 134966, 41964, 33033, -176029, -147308, 200569, 133842, 261430, 247678, 293945, -16095, -126964, -9592, -89151, 213389, -94519, 255538, -357726, -206672, -40133, 56809, -295973, -514078, -332880, -109985, -20245, -274272, 80979, 141035, -131706, 49664, -120520, -276042, 143241, -211421, 13831, 193902, -283186, 162765, 86065, -117645, 159510, -90743, -106614, -239276, -525675, -146499, -422407, -137015, 88610]
15830a24969j75199E1985h6949D732a33323B77654q4668n9433a23760C073J59253
15819A62326F9470a40595A3425a91902E10436d5632F9424Q5975f1057j91278f5659
15807A91340m6671a4965k9487A1994J7313K26211b5485D6218N362a58644b6202
15795a67796O2965k6791k62933c0702J890j43539O0882h652A19919J83b59574
15783h9484B28921c17010J23196B87081b26138f4187C28825j57784b45242g033
15772a44313F1914b13001i4050A3697K31667r5785a57385K5798L9673H8010i5734
15760a08501B48388c91656A53795o7665a46835F4079i6122a9522B95118a15503
15749b60566J13985r6078A32046L60661j38513H451J54462D3361i0655C4121K69862
$$ y = [-124969, -300168, 51985, -86949, 4732, -133323, 277654, 192986, 133553, -123760, 3073, 162326, 69470, -140595, 13425, -191902, 510436, -45632, 69424, 155399, -61057, -252335, -65659, 191340, 144669, -14965, -44452, 11994, 29307, 255518, -25485, 46218, 51580, -158644, -26202, -167796, -104831, -131622, -394555, -30702, -28812, -172351, -111469, -8652, 119919, 120102, -259574, -89484, 228921, -317010, -193814, 287081, -226138, -64187, 328825, 171041, -245242, -7033, -144313, 61914, -213001, -94050, 13697, 245364, 149579, -157385, -131587, -91914, 88010, -95734, -108501, 248388, -391656, 153795, 86130, -146835, 64079, -96122, -19522, 295118, -115503, -260566, -146581, -242659, 132046, 492707, 354194, 8451, 162913, 43361, -90655, 34121, 303983]
15738C03983G0542K56163j10821o5561h7547C4970K82199A48039k1407K7632b44032
15726h9774A40550a23050j83835A85586b07808N9659e6752C1912c62777G9115
15715I4922l0637g4249P824P178k44630C3518b36360J01291A26363b92500A01617
15703a6253A11578b37086A5827a09720B19027A01281j611L4327a73026A06681
15692A30705N1863a86020P2992A6776L1680k2410h4368k7701b0445k9412E8177
15680B6997A2962L8124a51884C73112e5093E6530j1625b16894E1083c70143J76643
15669a93500A63345c88727g5752r8228G9934d4004D38M954d4996A13315e7614
15657a09323A34837E3335J18617N5005a98307d5787D1980J21520p8294J37020
$$ y = [303983, 70542, 326705, 215884, 150323, -87547, 34970, 317169, 148039, 126632, 154264, -244032, -89774, 140550, -123050, -306885, 185586, -207808, -148149, -56752, 31912, -362777, 79115, 94922, 64285, -74249, -66425, -59247, -303877, 33518, -236360, -135069, 126363, -292500, 101617, -16253, 111578, -237086, 15827, -109720, 219027, 101281, 99670, 133997, -173026, 106681, 130705, 182568, -186020, -113028, 16776, 48456, 26046, -84368, -112069, -20445, -49857, 58177, 26997, 12962, 51086, -151884, 373112, -55093, 56530, 44905, -216894, 51083, -370143, -193500, 163345, -388727, -75752, -173980, 79934, -44004, 438, 5392, -44996, 113315, -57614, -109323, 134837, 53335, 171952, 226957, -198307, -45787, 41980, 163500, 85206, 222226]
15647B22226c59415R0205a20504M2067A4610b43501B9209d05874A35302d3224
15636a143H5575M6338C4569L49323g6100G3387d1503B85859g1682j3730I2436
15624a08231m0366H8383h9482j56937m9581J41126p6223A96863l5931M234p5092
15613I0074O5631a56466e6896p436j03387g3947o1322A9775J87266e1005m53902
15602e04907d102k53984C2034J65903b03281P7030q6052g507A07885a67405A7710
15590c39172B6310a21107j278D05742j94973a00858p9321D0074b17545B68142
15579a46434f8935p7398N7017A177P0771K5861a4264k616A83430b3541E5663h509
15566a55691j25277f0894k06753a32731F1644f96C9013c8764l8599A14536R7749
$$ y = [222226, -359415, -269210, -120504, -78437, 14610, -243501, 29209, -405874, 135302, -43224, -1143, 85575, 131913, 34569, 383892, -76100, 73387, -41503, 285859, -71682, -85412, 92436, -108231, -148597, 88383, -89482, -246419, -296000, -154874, -231097, 196863, 160932, 165166, 90074, 155705, -156466, -56896, -64332, -167719, -73947, -135269, 19775, 207041, -51005, -504907, -4102, -258086, 32034, 197937, -203281, -126251, -212303, -7507, 107885, -167405, 17710, -339172, 26310, -121107, -122385, 405742, 210769, -100858, -180179, 40074, -217545, 268142, -146434, -68935, -146333, -89316, 1177, 71948, 97809, -14264, -16880, 183430, -23541, 55663, -8509, -155691, -280968, -60894, -267647, -132731, 61644, -696, 39013, -38764, -77363, 114536, 212285]
15555B12285b2245j84870F049J40606C3859b32741A96113a01878j49756e4825
15544a22327K2342A24549a6691j75379d5793A84358a78935C26344G2855K9943
15534A02798a69191M7445k72412A79127A2179J05610n4435N0616J04063L25509
15524E43542a70982A73217B8004R0752b00363K4940d0078D5092R2748N8752M1822
15513B38414i9947B29937a0908k11814A84907d8156C17858o8657p0908k0630L7816
15502A95479g7395B69291e0105I407a24044D2754Q3534K40810I7590J17865C2568
15490A85029C9625J5638J48236m6569l1316K07903G0119P57M88800F6146L7098
15479A03244j9087B0267K28777n1971d41B32988A11836a90337I879a48292A3756
$$ y = [212285, -22245, -207115, 6049, 146655, 33859, -232741, 196113, -101878, -251634, -54825, -122327, -99985, 124549, -16691, -192070, -45793, 184358, -178935, 326344, 72855, 102798, -169191, -121746, -394158, 179127, 12179, 117789, 63354, 113970, 218033, 543542, -170982, 173217, 28004, 118756, -200363, -175423, -40078, 45092, 137840, 196592, 238414, -99947, 229937, -10908, -222722, 184907, -48156, 317858, 249201, 178293, 157663, 195479, -77395, 269291, -50105, 9407, -124044, 42754, 126288, 367098, 97590, 215455, 32568, 185029, 39625, 55263, 203499, 156930, 125614, 333517, 70119, 70876, 559676, 66146, 103244, 84157, 20267, 249044, 197073, -441, 232988, 111836, -190337, 9879, -148292, 13756]
15467a1095J424A43372J01705j21932j1963J22804J71658P155A66298K34607k9322
15456C71583P7511J15620A52219f3227C3656M9993L15080j79351j1481m4345a27735
15444A19743E3352K27791o7390a00082D69696A68929c09282G3159l5737a75573
15433C889M72049G2030d6991G6818K47155K13525j1676N9154J65647J33365l35897
15422E48091m0132j01272o5318H7330r604d9444A79126A2860K1256K1469K48827
15411C04412F8612c7355q1931D21508H680a01704r5122A83042C7237Q021e8388
15399a50746A44210L1153b78874M8018B09443a47101G5770C1001f2537R147j75977
15388b29367Q1090j07608f3484j96233R1355B43011b55921H7546R9585K21245
$$ y = [-11095, -9671, 143372, 245077, 123145, 111182, 233986, 405644, 412799, 166298, 400905, 371583, 449094, 564714, 152219, -63227, 33656, 83649, 398729, 219378, 207897, 163552, -127735, 119743, 53352, 281143, 213753, -100082, 469696, 168929, -309282, 73159, 37422, -175573, 3889, 475938, 72030, -46991, 76818, 323973, 537498, 525822, 584976, 750623, 883988, 548091, 507959, 406687, 341369, 87330, 77726, -49444, 179126, 12860, 34116, 55585, 304412, 68612, -37355, -119286, 421508, 8680, -101704, -196826, 183042, 37237, 45258, -58388, -150746, 144210, 175363, -278874, -230856, 209443, -147101, 75770, 31001, -62537, -53390, -229367, -148277, -255885, -63484, -259717, -168362, 243011, -255921, 87546, 187131, 408376]
15378D08376C9329i6954q1528B05754o0390a13296J713B22229A9551J59749n7882
15367A21418a76342A88472a02365k34B74461b8956k4984A28638k2102L34953E0879
15355F04476G6376j3429a05191j60967C65589A19687E6790J74445J51692A3805
15344A38573J69406A36751Q9818I6802J64862r0335B4217a95602B4248a92948
15333A78695G0522g3809C30614A58960a0221A57565K76596j09465e082H5546K3280
15322A08826L4743k8482N8655f4090D696a27986B27854E6406L66719A70403A2821
15310C61074A13233C0837e0l28543G2502a64444R164A19976l8322E889P2194g3456
15297A40668m2495a34896A15081a3201A46519J92278A02929O7398A1522e429D9732
$$ y = [408376, 39329, -96954, -178482, 205754, 145364, -113296, -111583, 222229, 19551, 179300, 121418, -176342, 188472, -102365, -102599, 274461, -28956, -53940, 128638, 106536, 441489, 50879, 604476, 76376, 62947, -105191, -266158, 365589, 119687, 56790, 231235, 382927, 13805, 138573, 307979, 136751, 226569, 96802, 261664, 171329, 24217, -195602, 24248, -192948, 178695, 70522, -73809, 330614, 158960, -10221, 157565, 434161, 324696, -5082, 85546, 108826, 143569, 115087, 173742, -64090, 4696, -127986, 227854, 56406, 423125, 170403, 12821, 361074, 113233, 30837, -50, -328593, 72502, -164444, -155280, 119976, 81654, 5889, 78083, -73456, 140668, 98173, -134896, 115081, -13201, 146519, 338797, 102929, 170327, 11522, -5429, 49732]
15285B35838A6855Q8908J67260A32526a05969H5866e0300A38451C8698K49353
15275B88051j31236e5034G2641j8585h6554l3914q428l086C22568G8028l5146
15264D2882a1676A80906a00300C25485J1137a5390D6297Q516J50786q2388b6379
15252A77345a44394e0095l1802B45834e9949B40989b2075A02334J6127a30826
15241A18295b05097k281A80875b40348b0451E0617K15843A2745L68615O30j31229
15230B50761m1841J27491K88658Q66495j53806l03967N25114E68492j32163k00899
15220B35430M365q4229D6928N39962A90306p0467P2849f9942A35008i8539D3022
15208d7323D15025C3292D787L47499A51941N2988d4544j20603A6794h9915A20456
$$ y = [235838, 16855, 105763, 273023, 132526, -105969, 85866, -50300, 138451, 38698, 288051, 156815, -55034, 72641, 54056, -86554, -120468, -128896, -131982, 322568, 78028, 42882, -11676, 180906, -100300, 325485, 336622, -15390, 46297, 54813, 205599, 123211, -26379, 177345, -144394, -50095, -81897, 245834, -59949, 240989, -22075, 102334, 118461, -130826, 118295, -205097, -207378, 180875, -240348, -20451, 50617, 266460, 12745, 381360, 381990, 250761, 208920, 336411, 625069, 1491564, 1337758, 1033791, 1558905, 568492, 436329, 235430, 239795, 155566, 46928, 586890, 190306, 119839, 192688, -69942, 135008, -98539, 43022, -47323, 415025, 33292, 4787, 352286, 151941, 204929, -44544, -165147, 16794, -89915, 120456]
15196a56950B60485B7972J49969B5626K41685c44884a33278A9650M3343h4236
15185a0586G5825M6435d1815P137k9871d819j6778B42144D0467J63761b44876
15173a69568A19757c3473A53788c7755B81115r4453f630B9422P910J79042j00079
15162A16295d07912a7558k6734C5079O9697J7064J73773K3178d4874B40b10982
15150B28440E2872L8468Q8300q8564O8159F1735a9847D9919h3915A87844N626
15139A93470L1049f6836B11525E9154j0370a2017E714a28902A9734L69624D4516
15127a27333O2477C7899c75841E2990K34444b02485b3848I0862D3548b10028C92468
15115h494H040J4783e7961G2429B3416K39453l5714q289c5607A02513K96054E5062
$$ y = [-156950, 260485, 27972, 177941, 25626, 267311, -344884, -133278, 19650, 62993, -84236, -10586, 75825, 122260, -41815, -34678, -64549, -4819, -21597, 242144, 40467, 204228, -244876, -169568, 119757, -33473, 153788, -37755, 281115, 186662, -6630, 29422, 37332, 216374, 116295, -407912, -17558, -44292, 35079, 104776, 121840, 295613, 318791, -44874, 240, -210982, 228440, 52872, 91340, 179640, 91076, 159235, 61735, -19847, 49919, -83915, 187844, 193470, 224519, -66836, 211525, 59154, 48784, -12017, 5714, -128902, 19734, 389358, 44516, -127333, -64856, 37899, -375841, 52990, 287434, -202485, -23848, 90862, 43548, -210028, 392468, -8494, 8040, 22823, -57961, 72429, 23416, 262869, 227155, 218866, -35607, 102513, 398567, 55062]
15102E24116H0079J30074r8626m315L069J15009J6119j19044e79A19298L26188
15091D45486a223C80773d8566k46847G0160h7867o1590B8928J25293i1344B37757
15079d6910j17968B05334N8849a5602B17839n7833c390G0224L13089Q4027d7756
15067C55403j0071o0463I1421m845R4726b27739A17481J25936P6019D3369J78872
15056B22241j02915K29422h7762l0683D27759E0358R2392L7868C7693J56039J1101
15045B04833q1043J21567p1533L53446B32460J29065d6880D74631j97353K96042
15035E73320B33120o0406J99957a1643C52413n3613a2437B72170m226B9162M35333
15024D64495B12033L2278I8848K10133K27967R717k63884M9048R1061K66016k66720
$$ y = [524116, 80079, 210153, 111527, 107212, 110281, 225290, 241409, 122365, -579, 119298, 445486, -1223, 380773, -48566, -295413, 70160, -87867, -149457, 28928, 154221, -91344, 237757, -46910, -164878, 205334, 264183, -15602, 217839, 160006, -3390, 70224, 383313, 467340, -47756, 355403, 345332, 284869, 91421, 86576, 181302, -227739, 117481, 243417, 319436, 43369, 222241, 119326, 348748, -87762, -118445, 427759, 50358, 142750, 180618, 37693, 193732, 204833, 123790, 245357, 173824, 527270, 232460, 361525, -46880, 474631, 277278, 573320, 233120, 172714, 372671, -11643, 352413, 298800, -12437, 272170, 267944, 29162, 464495, 212033, 244311, 98848, 308981, 536948, 546665, 282781, 331829, 422890, 688906, 422186]
15013D22186L40540l6235k33698A59479P81524k32216j38890k41675M30860C79417
15002F99903C12267L14349j20663n1080G9575M69351A68688p7847N28107H4555
14991D89415K8191k18415M1249Q3726j88031K65463J05185n8961A33154K37030
14981C70184j48051O54553l77235j8640J62463k97949j00812L07697A05190M92210
14971E97400j01128j52847m9324Q6499J50719K83044J17248l07215J032k41784
14961C83644K55019j24094K6193K77371n8018r5096l24003K89739k49313j22207
14951B59235M32068B60705N6599A55447O6782n3898O0193p4539J55979j23787
14941A86177B9873J60536F2326J89074J21951L1598R800j52516M4741J34108R8238
$$ y = [422186, 762726, 726491, 492793, 159479, 941003, 708787, 569897, 328222, 759082, 379417, 699903, 312267, 626616, 505953, 454873, 79575, 548926, 168688, 90841, 618948, 84555, 489415, 517606, 299191, 340440, 424166, 236135, 501598, 606783, 547822, 133154, 370184, 222133, 876686, 499451, 480811, 643274, 345325, 244513, 552210, 105190, 597400, 496272, 343425, 294101, 380600, 531319, 814363, 931611, 624396, 625428, 383644, 638663, 514569, 540762, 818133, 760115, 665019, 341016, 630755, 381442, 259235, 691303, 260705, 317304, 155447, 222229, 168331, 228524, 153985, 309964, 186177, 29873, 190409, 62326, 251400, 373351, 404949, 414749, 262233, 306974, 441082, 539320]
14930E39320k108j20578L26292k9544k22087O5624Q9443k78340K30951j65060
14920D33913N0521j20612J69702K01425L22612k28921r4053J97077J97600J10061
14910A239325J01729J83735J40791J0973k14161k14069M09257j33819J62962J14274
14900A800997Q5387l39936q4967k30986j8942l90889k25008K09759k52542r3072
14890D59801m5326J49896B37212K18747A47753O93820H2265K44548K46582k74360
14880B99035k7520M7955j49880J78941K27902k13099J74147k35283K73021K43238
14870H18457k51414R4810J91637k86390p071J15665J47776L9237k32272K68499
14860H98934n776k87298B61404L88248k46491K05184K22059l88930k4962K01422
$$ y = [539320, 537212, 416634, 742926, 713382, 491295, 556919, 646362, 368022, 598973, 433913, 484434, 363822, 533524, 734949, 1057561, 828640, 734587, 931664, 1129264, 1239325, 1341054, 1524789, 1665580, 1676553, 1462392, 1248323, 1657580, 1523761, 1686723, 1800997, 1886384, 1546448, 1461481, 1230495, 1211553, 820664, 595656, 805415, 552873, 459801, 414475, 564371, 237212, 455959, 147753, 841573, 82265, 326813, 573395, 299035, 271515, 319470, 169590, 348531, 576433, 363334, 537481, 302198, 575219, 818457, 567043, 661853, 853490, 567100, 560029, 675694, 823470, 862707, 630435, 898934, 893158, 605860, 261404, 649652, 403161, 608345, 830404, 441474, 416512, 617934]
14850F17934o7553J81181j22994P3451C13535K67866p7220K24515C12514M16740
14840G29254F9874K98810K84502l8566k35382J28773A85801N43829j92349K88668
14830H25949J6405j58408K24590J43126k27170K50205N8517l4325l03211M4195
14820H39873J43668j83989j97353n0423M9430B91968K0875K24082L96138C56786
14809F09031j90298j2411L78249l8848L5122K6881L15551n09891N03870m41682
14799F75574J60899C57579K96904r777r0820K16308J1545j14465J60373J57030
14789I84677j44464k50590J34006L52362k86131j63908J67035p3624n4250m259
14779F60854H0392L99551J56707q7722l4002k6202K47958j97057L66707k39689
$$ y = [617934, 550381, 731562, 608568, 682019, 313535, 581401, 504181, 728696, 312514, 729254, 69874, 368684, 653186, 614620, 379238, 508011, 185801, 729630, 537281, 825949, 842354, 683946, 908536, 1051662, 824492, 1074697, 1133214, 1098889, 795678, 839873, 983541, 799552, 602199, 551776, 601206, 291968, 312843, 536925, 933063, 356786, 609031, 418733, 406322, 784571, 745723, 780845, 807726, 1123277, 613386, 1117256, 675574, 836473, 357579, 654483, 644706, 553886, 770194, 781739, 667274, 827647, 984677, 840213, 589623, 723629, 1075991, 789860, 625952, 792987, 719363, 665113, 660854, 80392, 479943, 636650, 548928, 514926, 488724, 736682, 539625, 906332, 666643]
14769F66643K22746j66991P7735j81498M0466j6620J55516J06446j17512J49489
14759I36420p8252N1912m53028M01406j24352J99729k99502j97559O4115j27950
14749C72939l547K05370J39675k77713J03646k60139J97403q3584J46397L36466
14739H76913m13209j58581O62797k77342p0902Q1039J43272j02044J916C24517
14728E73464J79118J74252n6213n6499k7520J49990n8346j68949C30357P15416
14718A045773k33763L22363j20630L22062k6664K18679L64159l22571j44231m6179
14708A378998l4514j86119l0566Q9400l17793L8904J28842j97246l1946n1959
14698G86001m5463j42089L56729L7250R1882k19403j21104J03678J1097J56156
$$ y = [666643, 889389, 722398, 800133, 618635, 659101, 642481, 797997, 904443, 786931, 936420, 858168, 910080, 457052, 858458, 734106, 933835, 634333, 436774, 500889, 372939, 369392, 574762, 714437, 436724, 540370, 280231, 477634, 394050, 540447, 876913, 463704, 305123, 967920, 690578, 619676, 700715, 843987, 741943, 743859, 324517, 573464, 752582, 926834, 870621, 814122, 786602, 936592, 878246, 709297, 330357, 1045773, 812010, 1134373, 1013743, 1335805, 1309141, 1527820, 1891979, 1569408, 1425177, 1378998, 1344484, 1158365, 1127799, 1217199, 899406, 938310, 1067152, 869906, 837960, 786001, 740538, 598449, 955178, 992428, 1084310, 864907, 743803, 847481, 858578, 1014734]
14688A014734O18595j06512P3728M20356j43715j62422j86897m02033J19667l37829
14678I07672l0761J5419K52138k58884k15442L51726j9277Q5728J38994o0230
14668A167083k99435j69613L23096k786O9075j09275k37443J96835k39989J82672
14658H80220J0356j1627r576j63936M32687K03711m80539M3908o1804o1290L28657
14647A110767p9979m3132p2277j70365K60090J6662L01565n68193J63950J89233
14637A108321M4179j26183K63214P4207m9567j83138p9672m72298L64444j47118
14627G96389N32245L2356k78530K01338o9701J9761R7516L8095j81163j23816
14617A064490P6699K76745j74862J46239j7253k10949k02164L90275j0309n3409
$$ y = [1014734, 1633329, 1526817, 1600545, 2020901, 1877186, 1714764, 1527867, 1125834, 1245501, 907672, 876911, 892330, 1144468, 885584, 670142, 1021868, 1002591, 1088319, 1227313, 1167083, 867648, 698035, 1021131, 1018345, 1087420, 978145, 740702, 937537, 697548, 880220, 890576, 878949, 869373, 705437, 1138124, 1341835, 861296, 905204, 843400, 782110, 1110767, 1030788, 987656, 915379, 745014, 1005104, 1021766, 1323331, 755138, 919088, 1108321, 1152500, 1026317, 1289531, 1363738, 1314171, 1131033, 1051361, 579063, 943507, 796389, 1328634, 1360990, 1082460, 1283798, 1214097, 1233858, 1331374, 1369469, 1188306, 1064490, 1141189, 1417934, 1243072, 1389311, 1372058, 1161109, 958945, 1349220, 1338911, 1285502]
14607A285502p3172J75357k43347K12072J19584m10290K13271l6941K55879k96395
14597A201520M07543m07339l2285J93802m1921l5776n870J48424K33652l88895
14587A272855N03874j75271Q1277j67200j06208K93853J11129N4596l47895L86159
14577A907169n16252L79080l91933M48979j57363J15986k46992M21272l8901J21403
14567B042448k05904j64000L24179K90393j35658n00533L00470K56627N3350m88955
14557A772417M32912J51080l26165N4740L2127J67947K00107j08786K58730L9329
14547B674438j63773L89652p152o5713J32457K15604r503O46780O4730O54111
14537D531631L77916R59303J430681J889930M128501P247902J1525910p14064
$$ y = [1285502, 1212330, 1387687, 1144340, 1356412, 1475996, 1065706, 1278977, 1242036, 1497915, 1201520, 1609063, 1201724, 1169439, 1363241, 1321320, 1285544, 1279674, 1428098, 1661750, 1272855, 1776729, 1601458, 1682735, 1515535, 1409327, 1703180, 1814309, 1868905, 1521010, 1907169, 1390917, 1769997, 1378064, 1827043, 1669680, 1785666, 1538674, 1959946, 1921045, 2042448, 1836544, 1672544, 1996723, 2287116, 2151458, 1650925, 1951395, 2208022, 2261372, 1772417, 2205329, 2356409, 2030244, 2084984, 2117111, 2285058, 2485165, 2376379, 2635109, 2674438, 2510665, 2900317, 2893165, 2827452, 2959909, 3175513, 3166010, 3812790, 3877520, 4531631, 4909547, 5868850, 7299531, 9189461, 13317962, 20565864, 32091774, 31377710]
14529C1377710j4339474o462815m032693j501631q56224l95721Q24211J68868
14521D782231j575482l49707k96854m21672J95939r6967j5446l21282M20789M9222
14511B370771j264J4093k32929K07313p5160j68468L12195L613K35781j09509
14501B556436j2689k5049j46210l2914K16179L21794j29136k15819N71883m71484
14491B632991M4942J0050J39612K56567p9363n249q1344L01031J173m27042M78531
14480C271899l31545J69071j82254N43592r8158L28833k06061J40140r4128O0697
14470C602086L43015n15142K55988J18976J15391j97414J27357J8049K03686K12898
14460D284890l42216J64466j34925K44331K00519k11725k83936O3121P2206N41956
$$ y = [31377710, 17038236, 10575421, 6542728, 5041097, 4184873, 3789152, 4613363, 4782231, 3206749, 2857042, 2560188, 2138516, 2334455, 2237488, 2222042, 1900760, 2321549, 2370771, 2369507, 2383600, 2150671, 2357984, 2282824, 2114356, 2426551, 2430164, 2665945, 2556436, 2543747, 2518698, 2372488, 2339574, 2555753, 2877547, 2748411, 2532592, 3104475, 2632991, 2677933, 2687983, 2827595, 3084162, 3004799, 2999550, 2918206, 3219237, 3220410, 2793368, 3271899, 2940354, 3109425, 2927171, 3470763, 3372605, 3701438, 3495377, 3635517, 3541389, 3602086, 3945101, 3429959, 3685947, 3804923, 3920314, 3722900, 3850257, 3868306, 4071992, 4284890, 3942674, 4107140, 3972215, 4216546, 4417065, 4205340, 3921404, 3984525, 4056731, 4598687]
14450D598687N0393Q1412p0060l14852L29406j59455J54071K16263M5017L58162
14440E289044l21458K21091q3660K57245j17782m8582n599r6608N25472L18977
14430E938140n6984j30721m41096M24201K69611J09975K47836j63380l5096L28219
14420F490705J56686m14092L13798J4472M53181k09135j5542R1082K52990K52598
14410G386743K35211P2918j74082O49345j06578L7168N82279k7246L2545m1391
14400H646912l6429q4139Q9750K51792K9090n084K71005M94699p7449J57414M30931
14389A0168492L3046J71675RJ83379m7789r008N40230k5566K81769j29074O77130
14378A1844293j6004N5728L47866r3558K88759k5132N31663K70307N53867k23662
$$ y = [4598687, 4649080, 4730492, 4660432, 4345580, 4674986, 4515531, 4669602, 4885865, 4930882, 5289044, 4967586, 5188677, 5105017, 5362262, 5244480, 5195898, 5190299, 5093691, 5619163, 5938140, 5881156, 5750435, 5309339, 5733540, 6003151, 6113126, 6360962, 6197582, 6162486, 6490705, 6647391, 6233299, 6547097, 6561569, 7014750, 6805615, 6790073, 6881155, 7134145, 7386743, 7621954, 7694872, 7520790, 8170135, 8063557, 8100725, 8683004, 8655758, 8688303, 8646912, 8610483, 8526344, 8616094, 8867886, 8896976, 8891892, 9162897, 9657596, 9580147, 9737561, 10168492, 10201538, 10373213, 10373222, 10556601, 10508812, 10499804, 11040034, 11014468, 11296237, 11167163, 11844293, 11828289, 11884017, 12231883, 12138325, 12427084, 12401952, 12933615, 13203922, 13757789, 13534127]
14368A3534127L84526K92039O69425J81876J32127K25312O0883M43159K99450
14359A6222924K74219N06586k2798N41888M66810M36382K90988L75773J15526
14350A9208298J189204O053P05791J1516L55900O25133O57215L41081P21392M4444
14340B3866027R37202L15097O73912O16966R52193N26515P79797N83814J051887
14331C0303410M40761P71036P74147J061073P78254J028080J197108P50889J084257
14322C8189015J159379J093753J365616J168019J255680J169861J693382J611290
14314D8705995J762706J463384J344983K074050J804826K129947J851846K288363
14306F3426100K570675J948312K761192K657792K908210K698050K954215L018314
$$ y = [13534127, 13918653, 14210692, 14880117, 15061993, 15194120, 15419432, 15480315, 15923474, 16222924, 16497143, 17003729, 16980931, 17522819, 17989629, 18426011, 18716999, 19092772, 19208298, 20397502, 20403555, 21109346, 21120862, 21476762, 22101895, 22759110, 23100191, 23821583, 23866027, 24803229, 25118326, 25792238, 26409204, 27361397, 27887912, 28667709, 29251523, 30303410, 30744171, 31515207, 32289354, 33350427, 34128681, 35156761, 36353869, 37104758, 38189015, 39348394, 40442147, 41807763, 42975782, 44231462, 45401323, 47094705, 48705995, 50468701, 51932085, 53277068, 55351118, 57155944, 59285891, 61137737, 63426100, 65996775, 67945087, 70706279, 73364071, 76272281, 78970331, 81924546, 84942860]
14298H4942860L499970L827846L947182L808187M996550M120589N271465N165577
14290A19580226N419848N875437O328381O402217P318441P390112Q037559Q383142
14282A74735363Q803390R276946R657614J0660489J1114814J1366256J2499780
14275B48114652J2829114J3327198J3822235J3843036J4033031J4143129J3676094
14268C43788489J4063501J3788138J3188648J2871426J1987041J0840768R456889
14261D29984900P911190P232182O486908M551544J416140M95119Q38359k487078
14253D56429264r715240p574055p110543j0828796j1139459j1606317j4030082
14246C84424772j2666148j4150759j4677323j4499795j4224799j3430140j3612369
$$ y = [84942860, 88442830, 92270676, 96217858, 100026045, 105022595, 109143184, 114414649, 119580226, 125000074, 130875511, 137203892, 143606109, 150924550, 158314662, 166352221, 174735363, 183538753, 192815699, 202473313, 213133802, 224248616, 235614872, 248114652, 260943766, 274270964, 288093199, 301936235, 315969266, 330112395, 343788489, 357851990, 371640128, 384828776, 397700202, 409687243, 420528011, 429984900, 437896090, 445128272, 451615180, 456166724, 457582864, 458077983, 458916342, 456429264, 446714024, 439139969, 432029426, 421200630, 410061171, 398454854, 384424772, 371758624, 357607865, 342930542, 328430747, 314205948, 300775808, 287163439]
14239B87163439j3497389j2804355j2583022j1783025j1526990j1120033j0799576
14232B03049049j0312642r721351r125249q573283p837309p703234p101850p067068
14224A35607063o189328n358527n460418n421598m827805m874736m576232l603033
14216I5295386l837290l685388l666121l399771l156964k924777k676053k360470
14208F9588552k828340k295363k142313j970438k162064j890295k129949j678901
14200E2490889j651932j387805j226674j685490j545813j172515j401597j117939
14192D1301124j218204q42767j070418j356613j112145p72042m77425q26073r66742
14183C2658695j355386m99609j123541n18218p10062q21941m84426p13991n86096
$$ y = [287163439, 273666050, 260861695, 248278673, 236495648, 224968658, 213848625, 203049049, 192736407, 183015056, 173889807, 165316524, 157479215, 149775981, 142674131, 135607063, 129417735, 124059208, 118598790, 113177192, 108349387, 103474651, 98898419, 95295386, 91458096, 87772708, 84106587, 80706816, 77549852, 74625075, 71949022, 69588552, 66760212, 64464849, 62322536, 60352098, 58190034, 56299739, 54169790, 52490889, 50838957, 49451152, 48224478, 46538988, 44993175, 43820660, 42419063, 41301124, 40082920, 39240153, 38169735, 36813122, 35700977, 34928935, 34451510, 33625437, 32658695, 31303309, 30803700, 29680159, 29161941, 28451879, 27629938, 27145512, 26431521, 25845425]
14174B5845425q16638m43119q49909j47086n33183m08277q61134j15102p22644
14165B0948333k03007m02276o65094m64181j26675m05767n91981k00523n38181
14156A7350648K7170m65675l63448m09451m11577p6115j84367m84004k71990k06498
14146A4504693k72716j85888m75719Q3086j87557m07801R875l47406m55503K01324
14136A2466388m69180j73761l27801J71476n91590K25907l19396k46805J42360
14127A0877598l07417j74124O4354n82167l61036k20923L90147o55098J74029
14118I205363K09939l36394k75424L69644n18755r487k49679J17975j27762l03802
14108H081618l56619K48774N8738o9500l84769j71847P5232k88160O0182O1776
$$ y = [25845425, 25028787, 24585668, 23735759, 23588673, 23055490, 22647213, 21786079, 21670977, 20948333, 20745326, 20343050, 19677956, 19213775, 19087100, 18681333, 18089352, 17888829, 17350648, 17377818, 16912143, 16548695, 16139244, 15727667, 15651552, 15467185, 14983181, 14711191, 14504693, 14231977, 14046089, 13570370, 13653456, 13465899, 13058098, 13067973, 12720567, 12265064, 12466388, 11997208, 11823447, 11495646, 11667122, 11075532, 11301439, 10982043, 10735238, 10877598, 10570181, 10396057, 10460411, 9878244, 9517208, 9296285, 9686432, 9031334, 9205363, 9415302, 9078908, 8803484, 9173128, 8654373, 8644886, 8395207, 8513182, 8385420, 8081618, 7724999, 7973773, 8032511, 7963011, 7578242, 7406395, 7481627, 7193467, 7253649, 7315425]
14098G315425m97623K15655R0254k57150k39304k85965J10538j9129l07362P2582
14088F197921k08599J71072j20381K64736m99846J17872k63617j48058K94524
14079E805624m37071J91965P4254o7714l40877j286k94604K47002j82149j2620
14069D982524j14007k47849K0875J87590o7557j13260j57112J2039J83569k59151
14059D427661j42689M87849k69965k11356R2017P2095j74514j04908l6324J73324
14049D313190j48043J02959j95359K30090r5429J39922M1209o14395j25983N82104
14039D230265l79934j56129J69392j57005j31811j91453L47732l12811j8134L20472
14029C720584k42923J63275k80895j08535q9570L82830m32111j13242J38093L33427
$$ y = [7315425, 6817802, 7033457, 7123711, 6866561, 6627257, 6341292, 6451830, 6432701, 6125339, 6197921, 5989322, 6160394, 6040013, 6304749, 5804903, 5922775, 5659158, 5511100, 5805624, 5368553, 5560518, 5634772, 5567058, 5226181, 5224895, 4930291, 5177293, 4995144, 4982524, 4868517, 4620668, 4641543, 4829133, 4761576, 4648316, 4491204, 4503243, 4686812, 4427661, 4284972, 4772821, 4502856, 4291500, 4383517, 4455612, 4281098, 4176190, 4139866, 4313190, 4165147, 4268106, 4072747, 4302837, 4207408, 4347330, 4388539, 3774144, 3648161, 4230265, 3850331, 3694202, 3863594, 3706589, 3574778, 3383325, 3731057, 3418246, 3400112, 3720584, 3477661, 3640936, 3360041, 3251506, 3161936, 3544766, 3112655, 2999413, 3137506, 3470933]
14019C470933l52307k09078J00564K06370l10966K15497l7160l37040L97650k49263
14009B895200q4849M7640J8941l30234m9011M02646l38080j58817J68948j6908
13999B555476m1951Q69J36377r0908l11528L87913j30252l21184L11600r8884
13989B397528j88832j378q3040L77093l60474O2515L47980j03022k4381r7642
13979B326347L80227J65782M02155O01268O40184J276383L054775O156187J1689400
13970B6692708P330628j2968222o859401m217112k811938j452670p35525p19526
13962D258942k20787n78522K82209q04774j52367r483j44882j20901J29841k62004
13952B377272K81450o45000N4296K98069k3767k2508k70344o8575R4009L8717
$$ y = [3470933, 3118626, 2909548, 3010112, 3216482, 2905516, 3121013, 3083853, 2746813, 3144463, 2895200, 2810351, 2857991, 2876932, 2546698, 2497687, 2900333, 2562253, 2403436, 2572384, 2555476, 2513525, 2514394, 2650771, 2559863, 2248335, 2636248, 2505996, 2184812, 2496412, 2397528, 2208696, 2207318, 2124278, 2501371, 2140897, 2203412, 2551392, 2448370, 2423989, 2326347, 2706574, 2872356, 3274511, 3875779, 4515963, 5792346, 8847121, 15003308, 26692708, 34023336, 21055114, 14195713, 9978601, 7166663, 5713993, 4978468, 4258942, 4038155, 3459633, 3741842, 2937068, 2784701, 2775218, 2630336, 2509435, 2639276, 2377272, 2658722, 2013722, 2068018, 2366087, 2342320, 2319812, 2049468, 1980893, 2074902, 2113619]
13942B113619L23546p3999l69599k07745L63068m21425J90228N5959j44050J73735
13932B003337J11936n38362J25309L0611j76850K08318N5473j45088J86107r5214
13922A765577j73254L17289M3877j47750k37834K44123l15217K27573J7583j18646
13912A623321l2122J00145r7419j64105K50249l68269L3916K66387O9501l9968
13902A641636j07687K24895m84477n6153K99036K42221n88603K26578k3742l08690
13892A065014L19335M53256l41785k87071K73647j09854M30N1392Q493r9320j02231
13881A231306J8573l43436K39248K40897j49927l7217Q6683K9492J04907J2234
13871A432760m30490L37477j05160J42447k41312L72574j20925j68700K20641
$$ y = [2113619, 2437165, 2363166, 1993567, 1785822, 2148890, 1727465, 1917693, 1973652, 1829602, 2003337, 2115273, 1576911, 1702220, 1732831, 1555981, 1764299, 1819772, 1674684, 1860791, 1765577, 1592323, 1909612, 1953489, 1805739, 1567905, 1812028, 1496811, 1724384, 1741967, 1623321, 1591199, 1691344, 1593925, 1429820, 1680069, 1311800, 1345716, 1612103, 1681604, 1641636, 1533949, 1758844, 1274367, 1218214, 1517250, 1759471, 1170868, 1397446, 1373704, 1065014, 1384349, 1837605, 1495820, 1208749, 1482396, 1372542, 1372972, 1424364, 1432857, 1333537, 1231306, 1249879, 906443, 1145691, 1386588, 1236661, 1199444, 1286127, 1315619, 1420526, 1432760, 1002270, 1339747, 1234587, 1377034, 1135722, 1508296, 1387371, 1218671, 1439312]
13862A439312n73184M67424m34389L04649l6108K56820k53169k391j38329L90840
13852A421475m09047K26233j73056j34508J04972L7540J85799j96875P2639K06529
13842A341701E94421N44529j23211k31668N20585k83208k23948L06294K5154M3895
13832A172843m58593K08051l089J95479m21506L97533j20328J99570k37778l33486
13822E98696L99999lK18461o0961J20624F25123M49640j93064K8234j07444K7189
13811H29678j03302P8207K91258l76651K10980j22957J26139j69068P8231J82099
13801A024614J552j98257p1359J09759O1104k58049R6434L25046k07670j23200
13791G59974j68879M53729j78659J94857k02096o803K08013n03810L93594o1778
$$ y = [1439312, 866128, 1333552, 899163, 1203812, 1167704, 1424524, 1171355, 1168964, 1030635, 1421475, 1012428, 1238661, 1065605, 931097, 1036069, 1073609, 1259408, 1062533, 1135172, 1341701, 594421, 1138950, 1015739, 784071, 1304656, 1021448, 797500, 1103794, 1128948, 1172843, 714250, 922301, 919212, 1114691, 693185, 1090718, 970390, 1169960, 932182, 598696, 998695, 998692, 1217153, 1156192, 1276816, 625123, 1074763, 881699, 909933, 802489, 829678, 726376, 804583, 1095841, 719190, 930170, 807213, 933352, 764284, 842515, 1024614, 1026166, 827909, 756550, 866309, 927413, 669364, 765798, 1090844, 883174, 759974, 591095, 1044824, 866165, 1061022, 858926, 852123, 1060136, 556326, 949920, 888142]
13781H88142l0932n7320M6973J46074D41395M32192M3436j34150k1301Q2576j60452
13770F83696j79275J25151Q1520K4910J72771k4244k18745p2796O9049K51524
13760I13561m9493k42327p1763M68808j70576l9643M8499m13406L27001j0781
13750G59880K01398j61198p3649l2372j80709K3185K32707l27435J96384C05639
13739I85583m47747j16102L05208k27781p4455M79071j48504j03506o3816K80935
13729H68886q1160k21545J63845M083k49562K31242R1517j31638m7191l0882J61723
13718G59318j96830j1214l1819l0132j23101L6040P4069j91926M24528j25635
13708E83298J13656k5895k05650l5145K95569m4279k23347J2719J00088n5804
$$ y = [888142, 857210, 799890, 846863, 992937, 441395, 873587, 917023, 782873, 761572, 844148, 683696, 504421, 629572, 711092, 736002, 908773, 884529, 665784, 592988, 662037, 913561, 864068, 621741, 549978, 1018786, 848210, 808567, 857066, 443660, 770661, 759880, 961278, 800080, 726431, 694059, 513350, 536535, 769242, 441807, 638191, 305639, 985583, 537836, 421734, 726942, 499161, 424706, 903777, 755273, 651767, 587951, 868886, 787726, 566181, 730026, 734109, 484547, 715789, 807306, 675668, 628477, 597595, 759318, 562488, 551274, 519455, 489323, 366222, 402262, 476331, 284405, 708933, 583298, 696954, 671059, 465409, 430264, 725833, 681554, 458207, 470926, 571014, 515210]
13698E15210k2057j0586K73188j66818j99559J00492j0567J12099J89787l57595
13688D23594K69772j99384j40946K58997J47777k38466P7398j34306K51345M323
13678G20104j72543K88429l95920A24288M56494o3620j7576L2864Q0814k36383
13668C76881J18331A96142L22942o5858k17130M80264j61922R1984k49578J29384
13658E26228j58471j67586L21902J3614p3805q6499n5341B4998L02855A44979
13647C85440J35205J82808l04515A72304L82435P21j44383J33552r3765j80121
13637B70743K75580j84079J82590k33705K16677k49416J40369J75270j31233A54062
13626B71624p2851K6763A03053L56327j25466m2387J33610j64364K89031K13283
$$ y = [515210, 493153, 482567, 755755, 588937, 389378, 489870, 479303, 591402, 781189, 423594, 693366, 493982, 353036, 612033, 759810, 521344, 598742, 464436, 715781, 720104, 547561, 835990, 440070, 124288, 580782, 517162, 499586, 532450, 613264, 376881, 495212, 196142, 519084, 453226, 236096, 716360, 554438, 646422, 396844, 526228, 367757, 200171, 522073, 535687, 461882, 375383, 320042, 24998, 327853, 144979, 385440, 520645, 703453, 398938, 172304, 554739, 555460, 411077, 544629, 450864, 270743, 546323, 362244, 544834, 311129, 527806, 278390, 418759, 594029, 462796, 154062, 271624, 198773, 225536, 103053, 459380, 333914, 291527, 425137, 260773, 549804, 763087]
13616G63087l59775J06595B41880L57686B05265K52206j32763J95803N0004p3521
13606D96994n7691O7259j36654F9002M68011m2843h1065D06182P415j31444j16135
13595A66018K32534n7274A34696K14488j7796M544p0537K23929m7299K6055k24864
13584B43216J55856q8359j46160R5676R2885f9408B04801J91179j28826J41342
13574D08496l3227j41536M24871B0284N73784B78628J38085M1815j14329j60723
13564A83476Q8083K63423H9337N9377M08149B70979A6350K55846J38503m2729
13554C67970j05805J58401r7928L0521K98477B92218j12396j4265J53091l7759
13544B80889K74608j72475j28577P5320j0230r2149K67025I6660m6406M36520
$$ y = [763087, 403312, 509907, 241880, 599566, 205265, 457471, 324708, 520511, 570515, 496994, 439303, 506562, 369908, 69002, 537013, 494170, -81065, 406182, 413597, 282153, 166018, 398552, 341278, 134696, 349184, 331388, 335932, 265395, 489324, 442025, 468080, 243216, 399072, 310713, 164553, 260229, 353114, -69408, 204801, 395980, 267154, 408496, 375269, 233733, 658604, 20284, 594068, 278628, 416713, 458528, 344199, 183476, 271559, 534982, 89337, 148714, 556863, 270979, 16350, 272196, 410699, 367970, 262165, 420566, 322638, 353159, 651636, 292218, 179822, 165557, 318648, 280889, 555497, 383022, 254445, 329765, 319535, 227386, 494411, 96660, 50254, 486774]
13534D86774B6639K85543l5391j20212A3650L63936k0247j61096L03895m2422
13524D57716A04598L11856k5695k1202m6277A28283J26142K05059p9150E5343
13513G274K61596J17059J95885A87319L14533A96839J5844K82474E3604K21434
13503B75038j36826K1560J25124K25391k43047j05891J14500m021K70153A37946
13492B51864K24100K00422B75712L38533k25829m8246K1062A56132K37463p6304
13482C17291P4828d4988H924K06190J6352J86901j38349J98398i8439D15375A6148
13470C03380a00966A12326k5925J5272L5627m0313J01648m1720N176L14054j72732
13459C03413j46125J76636j45578M57448B26021i2921k5300A87817n371K66389
$$ y = [486774, 26639, 312182, 276791, 156579, 13650, 377586, 357339, 196243, 500138, 457716, 104598, 416454, 390759, 369557, 323280, 128283, 254425, 459484, 380334, 55343, 7274, 268870, 385929, 581814, 187319, 501852, 196839, 212683, 495157, 53604, 275038, 138212, 159772, 284896, 510287, 267240, 161349, 275849, 271828, 541981, 137946, 251864, 475964, 676386, 275712, 614245, 388416, 340170, 361232, 156132, 393595, 317291, 392119, -44988, 8924, 215114, 231466, 418367, 280018, 478416, -98439, 415375, 16148, 303380, -100966, 112326, 86401, 101673, 137300, 96987, 198635, 156915, 162091, 476145, 303413, 157288, 333924, 188346, 645794, 226021, -92921, -118221, 187817, 182446, 448835]
13449D48835B07090e5893j2500C63183r8750Q2967j50363K11007A0339h0378A14483
13437C59137A77132a3872k6062A75521Q5483Q0718A47816a35969E2267J9113L01470
13426C72850j2412k8887j44825L8871K07033r8481j46900l5713j0302E0296K71948
13415C22244R6015j27551N3851b0555A21271N0697J62797I9995J12890o459G9119
13403A60119K28080k4697m6721j05908J84062j55641Q7203j16664J35660A15845
13392D57521A26350l0614J06832C528J03542L52098A56698B0616J32621F7699
13381H1517g1183q881p0881D06143B9833M50825j94668B4527g4130C56099a15950
13369A98507F4722J55329j06820b35183A77338K92317o6717d7073A27424M0974
$$ y = [448835, 207090, -55893, -68393, 363183, 264433, 347400, 197037, 408044, 10339, -80378, 114483, 359137, 177132, -13872, -39934, 175521, 261004, 341722, 147816, -135969, 52267, 71380, 372850, 360438, 331551, 186726, 225597, 432630, 334149, 187249, 151536, 141234, 50296, 322244, 418259, 290708, 344559, -20555, 121271, 171968, 334765, 99995, 212885, 206426, 79119, 160119, 388199, 363502, 316781, 210873, 394935, 239294, 326497, 209833, 345493, 115845, 457521, 126350, 95736, 202568, 3528, 107070, 459168, 156698, 20616, 153237, 67699, 81517, -71183, -80064, -150945, 406143, 29833, 480658, 285990, 24527, -74130, 356099, -115950, 198507, 64722, 220051, 113231, -235183, 177338, 469655, 402938, -47073, 127424, 168398]
13359A68398L2497R6069b099A3112j764K9611L39639j33497h0703D66211j8696
13348D47515k12033M7652J86214e4141D0423Q9656a18420D28848j89037L6523
13338B76334b5080C32872l9482A45877K72352G3110L10989A07310j039L02997
13328D09268A76711K75258A00992K2260K061Q265J2822B8719J5537g1758A5889
13316A40598C5787Q9249K96128A22696f8061r4682H6519L92431b41844D46512
13305G80779B06617a88132F4136A9708R2153J99458K1512m3920J49169k01980
13295B36100b2723n8913C06998a44257B38879p8900A0718M45813O9233j96845
13285C28919a5307A33668K2400f0942D46369a26448B98012h6804B75511J7677
$$ y = [168398, 200895, 296964, -2099, 13112, 11348, 40959, 380598, 247101, -80703, 466211, 447515, 235482, 283134, 469348, -54141, 40423, 130079, -118420, 428848, 239811, 276334, -25080, 332872, 293390, 145877, 418229, 73110, 384099, 107310, 106271, 409268, 176711, 451969, 100992, 123252, 125313, 133578, 146400, 28719, 44256, -71758, 15889, 140598, 35787, 125036, 421164, 122696, -68061, -162743, 86519, 478950, -241844, 446512, 780779, 206617, -188132, 64136, 19708, 111861, 311319, 332831, 288911, 438080, 236100, -22723, -81636, 306998, -144257, 238879, 159979, 10718, 456531, 525764, 328919, -15307, 133668, 156068, -60942, 446369, -126448, 298012, -86804, 275511, 293188]
13275B93188j23153E4266J468d1678B72526Q999O3092h6146D17203A66468F2994
13263A82518q1848M37067D1340M2324b34980I7696L33789A77307J40K07878f7931
13251H9594J22352G0599L00070p6582G9310L4423b96777f0450D05668c4087k9193
13240f3280L313l2268D24858j58703j6744L8226r5298A0310R5603L891k4023M6419
13228A32200K22569E1829J07754O1201h7311b8918I5300J21158c34939A825J23844
13217A25669h240C74425A29421b32855D40688A39412b03241B66925m9259B5259
13206C07312a09343B49780J15837i6845j6616A95873b886q704B51190m7156A00584
13194d4824C60171j49003a05659C0605K6942L00283j18931E0161h4201C89267
$$ y = [293188, 170035, 54266, 55734, -41678, 272526, 281525, 344617, -86146, 417203, 166468, 62994, 182518, 100670, 537737, 41340, 83664, -234980, 97696, 431485, 177307, 177447, 385325, -67931, 89594, 211946, 70599, 370669, 294087, 79310, 113733, -296777, -60450, 405668, -34087, -63280, -59967, -92235, 424858, 266155, 249411, 287637, 192339, 10310, 105913, 109804, 85781, 132200, 354769, 51829, 159583, 220784, -87311, -28918, 95300, 216458, -334939, 1825, 125669, -8240, 374425, 129421, -232855, 440688, 139412, -203241, 266925, 217666, 25259, 307312, -109343, 249780, 365617, -96845, -113461, 195873, -2886, -11590, 251190, 204034, 100584, -44824, 360171, 211168, -105659, 30605, 57547, 357830, 238899, 50161, -84201, 389267]
13183e8000H6752d3028F4512C1199a15996B78830A12262C3349b91717A82544L369
13172A85913r319d3987k25305C32982A8283c87831h5168B23430j9982G4112R367
13161H3479h643D4518C580d5791j33038E4192A3411K51384j24780F6131J17830
13150A83961D5276g6791m7860B15100J85594a61985B21999F0469b28458A70893
13139B95074o8037K26577A45913a03880G1336M3273O1720a3012C3124M48981k37377
13128B44728A03725m3221K0248a14374E5131I393g1690A23181b7035A53393J73317
13117C26710A5640J03466b3080B38069b7872j6119k0032j05086A14293l8878b2055
13105A01747G798g3517I5955D2753i4019J176n5086a7296B23620a92529g5155
$$ y = [-58000, 86752, -43028, 64512, 31199, -115996, 278830, 112262, 33349, -291717, 182544, 185913, 176594, -43987, -269292, 332982, 18283, -387831, -85168, 223430, 203448, 74112, 83479, -8643, 44518, 3580, -45791, -178829, 54192, 13411, 264795, 140015, 66131, 183961, 45276, -76791, -124651, 215100, 400694, -161985, 221999, 60469, -228458, 170893, 295074, 227037, 453614, 145913, -103880, 71336, 114609, 176329, -13012, 33124, 482105, 244728, 103725, 60504, 80752, -114374, 55131, 9393, -71690, 123181, -27035, 153393, 326710, 15640, 119106, -23080, 238069, -27872, -43991, -64023, -169109, 114293, 75415, -22055, 101747, 7798, -73517, 95955, 42753, -94019, -92843, -147929, -17296, 223620, -192529, -75155]
13093B4102L0901Q4953k8987K9359j5370J62305j27799F6460f1828a4505B53160
13081C52984C0139a10525F3537R3285J07580P1673P3637D0870M51464C4007J07890
13070A41897J58433A601a60877E9804K47187A09738d6048C6386d19416a22987
13059E2629J57390Q8576r6439m3027M6428L45128A78535a62594P8369A41460D7728
13047A52712K869J09325B2623a04241B07360h238k52114C67799a26777j32783
13037b59560B53719b91038h529p2402A12157C5432a84992A49460J06667F6145
13026G8885J37393p3625F1974d2177l4589A89460K60041k04069p4522a36869H259
13014B40895p6467B2114A0355e5037A52495K9612O7791J33420a0820k03918A02385
$$ y = [24102, 55003, 139956, 110969, 140328, 124958, 287263, 159464, 66460, -61828, -14505, 253160, 352984, 30139, -110525, 63537, 156822, 264402, 336075, 409712, 40870, 492334, 34007, 141897, 300330, 1601, -160877, 59804, 306991, 109738, -46048, 36386, -419416, -122987, 52629, 210019, 298595, 202156, 159129, 205557, 550685, 178535, -162594, -84225, 141460, 47728, 152712, 155581, 264906, 22623, -104241, 207360, -8238, -260352, 367799, -126777, -259560, 253719, -291038, -8529, -80931, 112157, 35432, -184992, 149460, 256127, 66145, 78885, 216278, 142653, 61974, -42177, -76766, 189460, 449501, 245432, 170910, -136869, 8259, 240895, 164428, 22114, 10355, -55037, 152495, 182107, 249898, 383318, -10820, -214738, 102385]
13002D588J10192J57260P8694f1734C47780a12472A88817a97123G9391J40110
12992B19501K03152b82495B15499b51011D67233A95894J44105c354I6380K66298
12982C62678m7096a91712C65827a1054j07845o7831M7366B26731f0314a0122F4461
12970B98382E8924a41868A40150a59704A27960L48202e9590c754j15804A7548
12959a47289A19404D6883K62396a12627B13563E3975b79844A26019D2297M9943
12949I2240O4802h1533C04030j05322a2017B98793A19781a70025B5802J06742
12939A32544O5144f828C33967a84681D5663g2288c2465p2774e1718H4646J67486
12928B52132K7723d576A46872B1549r954P3400a00392k97257B23524b83240b7889
$$ y = [4588, 114780, 272040, 350734, -61734, 347780, -112472, 188817, -197123, 79391, 219501, 422653, -282495, 215499, -251011, 467233, 195894, 339999, -3354, 96380, 362678, 315582, -191712, 365827, -11054, -118899, -186730, -139364, 226731, -60314, -10122, 64461, 298382, 58924, -141868, 140150, -159704, 127960, 476162, -59590, -3754, -119558, 17548, -147289, 119404, 46883, 309279, -112627, 213563, 53975, -279844, 126019, 42297, 92240, 157042, -81533, 304030, 198708, -12017, 298793, 119781, -170025, 25802, 132544, 197688, -6828, 333967, -184681, 45663, -72288, -32465, -105239, -51718, 84646, 252132, 279855, -4576, 146872, 21549, 11595, 84995, -100392, -397649, 223524, -283240, -27889]
12916i283l18251A32734N2263G6155a36457e2771B70891d4175B27264I2777J89027
12905B81804D6638P7581J80292K7070j51878e791j04939c1557j85733C23105a7314
12893H4585I705J80130D9121K52492O1701g3636A80027m5805a61662j81717E0439
12881a15002C8671J8114J17706p2036D8951g6620j09659f2522C00485q6387d1171
12869C0538J89666g9766j01314e0522l0144b2764j31429A69643a81262E8406J80931
12858B39337a21277c7190A73034b67188f6101E085P018c46994e8009K2191N420
12847c0398k3963l2821C62568j75533l3000a53639B82058j01804F0094Q9837b03063
12835B07329K62237d8575K262A17210j4500K85976j27734G6667B1636K03187h020
$$ y = [-9283, -327534, 132734, 184997, 76155, -136457, -52771, 270891, -44175, 227264, 92777, 281804, 46638, 124219, 304511, 331581, 179703, -5791, -110730, -31557, -217290, 323105, -17314, 84585, 9705, 189835, 49121, 301613, 363314, -73636, 180027, 134222, -161662, -343379, 50439, -115002, 38671, 56785, 174491, 102455, 48951, -76620, -186279, -62522, 300485, 214098, -41171, 30538, 220204, -79766, -181080, -50522, -80666, -22764, -154193, 169643, -181262, 58406, 239337, -121277, -37190, 173034, -267188, -66101, 5085, 12103, -346994, -58009, -35818, -30398, -54361, -87182, 362568, 187035, 154035, -153639, 282058, 180254, 60094, 149931, -203063, 207329, 469566, -48575, -46313, 117210, 102710, 388686, 260952, 76667, 21636, 224823, -8020]
12823e7516j52906F7769a74811B93995c27911A98720B1610J47562a08787c4837
12812f6672r2919A3597e8932A58530c76047A50952o9374l1940d3205B1370J05237
12801A26607a73767G8961M6421a24192c6737B55460e6281j57728L3887E5344a60337
12789a33418O1482j67669A9202R2207a24195A26336K4720L9836H1008L01349A23631
12777B41152q9474o8235a2691j4053j63780h471j88731c4683k44542B7098b54366
12765B64084p5124e6463D6301A9654P7785b30881I3231a00481a9747j55167D01170
12753A91847D5503a30279F9893J350c24008I9869J59017g3391B30913c464j18412
12742a21876j7749f8585k2852n7039f8762j51502A47917f2684E7564d4596j4412
$$ y = [-57516, -210422, 67769, -174811, 293995, -327911, 198720, 21610, 169172, -108787, -34837, -66672, -159591, 13597, -58932, 158530, -376047, 150952, 81578, 49638, -43205, 21370, 126607, -173767, 78961, 125382, -124192, -36737, 255460, -56281, -214009, -180122, 55344, -160337, -133418, -71936, -239605, 19202, 111409, -124195, 126336, 151056, 190892, 81008, 382357, 123631, 241152, 151678, 83443, -12691, -26744, -190524, -8471, -197202, -34683, -279225, 27098, -254366, 264084, 188960, -56463, 46301, 19654, 97439, -230881, 93231, -100481, -19747, -174914, 401170, 191847, 45503, -130279, 69893, 71243, -324008, 99869, 258886, -73391, 230913, -3464, -121876, -139625, -68585, -91437, -148476, -68762, -220264, 147917, -62684, 57564, -44596, -59008]
12731e9008C68207I4208a76347A05582c55438a19305G8721M0393M213K76507A50622
12719B78557g659C71579I0367B3896J60270a56478O4755b818k73841B27004B9366
12707e1111l74664A5909J54277e8871R559I5217d1472m8142C05228H7447K02453
12696B89900B1408O0464J00887c9788A20483a5611A77104K44405G5229P7093J7060
12685A69382Q9906h1364A58849k7375J4916K3776g040N68L187A41843b80845H1722
12672B10198n2443b45685A14571m7671a84222B01571a67012P2565M5281F0723
12661D0507J38184J54617K5236A71598m9949A94K14484j02914i6380M0512q5594
12650a41462l0290D1498J64937o4274o2668O5791i828A9000N6843b72352Q9937
$$ y = [-59008, 368207, 94208, -176347, 105582, -355438, -119305, 78721, 119114, 123327, 399834, 150622, 278557, -7659, 371579, 90367, 23896, 184166, -156478, -91723, -2818, -276659, 227004, 29366, -51111, -425775, 15909, 170186, -58871, -49312, 95217, -41472, -89614, 305228, 87447, 289900, 21408, 81872, 182759, -39788, 120483, -15611, 177104, 421509, 75229, 152322, 169382, 259288, -81364, 158849, 131474, 146390, 170166, -7040, -6472, -3285, 141843, -280845, 81722, 210198, 157755, -245685, 114571, 66900, -184222, 201571, -167012, -94447, -49166, 60723, 40507, 178691, 333308, 358544, 171598, 121649, 194, 214678, 111764, -96380, -55868, -141462, -171752, 41498, 206435, 142161, 79493, 145284, -9828, 19000, 75843, -272352, -182415]
12639a82415P5990n6959D77490B27088e2025F155J41732o1355J28670A4631d9322
12627a99059C34263a33728A57953d2970H3020a680A119O8198b2063k8068A2363
12615e7923F0473a54948j83934D1858d9433A05651a80132C34905d8571k7445k4695
12604a00711k4483A0056J83279c4750k8376F0467a2441j15594A03985a70751A08815
12592i3110j12629B66224D7287R3337e7705A3106a34605C2579J71524a30217B91696
12580G6685M1037Q319a47136B40488A00499l0819M8694b98005B28961G9620i242
12568a74713q8510A81462a72494D088a14055F7886a36700N0540B7379J72607R1872
12557B91858j45646K31383A17578L673C3448c0441j28009A1279O4147h1326k5082
$$ y = [-182415, -106425, -163384, 477490, 227088, -52025, 6155, 147887, 86532, 215202, 14631, -49322, -199059, 334263, -133728, 157953, -42970, 83020, -1680, 1119, 69317, -22063, -50131, 12363, -57923, 60473, -154948, -338882, 41858, -49433, 105651, -180132, 334905, -48571, -76016, -100711, -125194, 10056, 193335, -34750, -63126, 60467, -12441, -128035, 103985, -170751, 108815, -93110, -205739, 266224, 47287, 140624, -57705, 13106, -134605, 32579, 204103, -130217, 291696, 76685, 117722, 126041, -147136, 240488, 100499, 69680, 118374, -298005, 228961, 79620, -9242, -174713, -263223, 181462, -172494, 4088, -114055, 67886, -136700, -86160, 27379, 199986, 291858, 146212, 377595, 117578, 121251, 33448, -30441, -158450, 11279, 75426, -81326, -106408]
12546a06408j28029k1072a01322k0704C40699d17914E1341A0095K33786e6322
12535B37805e0962j04230o9091B75150c6285C7892a98514A37579J44829j25662
12525A56746b23309f5908A30544J53980a10771e2681A92714a01739j39002B29151
12514B803L3139c8738I4306L3121J69256p97c75702J78517F476K48790C5662b47890
12501a63221A28090b48189a11225j517A19336b1175A19914h8706B17479l3727
12491A83752a81799b8379D5881R6756a5893r4123B66893G6801k0398K0781j857
12480G5327c2515D3079Q6517b43349j873B05999G9601e8666j16073f0715n463
12469f6178M023a8824A19575J35194A02181P451f2324A86929d31688J71374B44673
$$ y = [-106408, -234437, -255509, -101322, -122026, 340699, -417914, 51341, 10095, 243881, -56322, 237805, -50962, -155192, -224283, 275150, -36285, 37892, -198514, 137579, 282408, 156746, -223309, -65908, 130544, 284524, -110771, -52681, 192714, -101739, -240741, 229151, 2803, 35942, -38738, 94306, 127427, 296683, 295886, -375702, -197185, 6476, 255266, 35662, -247890, -163221, 128090, -248189, -111225, -112742, 119336, -21175, 119914, -88706, 217479, 183752, -181799, -28379, 45881, 142637, -15893, -110016, 266893, 76801, 56403, 77184, 75327, -32515, 43079, 129596, -243349, -245222, 205999, 79601, -58666, -174739, -60715, -66178, -62155, -18824, 119575, 254769, 102181, 109632, -62324, 186929, -431688, -260314, 244673]
12457B309b10244B51137a43117G114b6230e553C7935c90102a23773m8020j0137
12446a81930I530K56090E3617c51332A9883h4231j78828f048G5700M124i0706
12434B4894b28455A49871c8096j695j59982R1318k54782p4946a45669k95115h9824
12422a80905B15928h0270D57548f5833l4968A92671P385c18087C12487C4919Q4836
12411A19755b6873A95052a48738d5142m104A88784Q1187B7937R0169n6935a43592
12399b52063B5465b85525e5200b5494G7748a08826R785A87467a68570B02281A6654
12387A0115d3784A44633l9269e7387l13357Q5208e5812l9582e54j12423C71127
12375B5642f485k900A80856a26331e4508A51491E9589H701M88441k08736F5896
$$ y = [2309, -210244, 251137, -143117, 7114, -26230, -5553, 37935, -390102, -123773, -171793, -181930, 9530, 265620, 53617, -351332, 19883, -84231, -263059, -6048, 75700, 79824, -90706, 24894, -228455, 149871, -38096, -39791, -199773, -108455, -363237, -438183, -145669, -440784, -89824, -180905, 215928, -80270, 457548, -65833, -100801, 192671, 200056, -318087, 312487, 34919, 119755, -26873, 195052, -148738, -45142, -49246, 188784, 269971, 27937, 118106, 61171, -143592, -252063, 25465, -285525, -55200, -25494, 77748, -108826, -99041, 187467, -168570, 202281, 16654, 10115, -43784, 144633, 105364, -57387, -370744, -285536, -55812, -95394, -554, -112977, 371127, 25642, -6485, -9385, 180856, -126331, -54508, 151491, 59589, 8701, 497142, 288406, 65896]
12363E6378M2085a49312A13165k629D1985J94428o4991A9655a12370f89A12711
12351A34457a1350j00420B22098A9160M1297a15075J5221n121J6267A69910l7843
12340A32067d0449L162o3126A84596c5726E8838J2284J8536B3695h189A57683
12328a70413e1229n4994B81764b8622G0106a05004A82422F8380d3434c859k18977
12317b22836E0980A7753J69371R0482N7606E7031J84501l5808M3607A1757M4733
12306E6490J36625J2441M1423J62731j60724a6836k64366D41069p3789A82254
12295G185K08680k8742f0738k35883a41871A88025a20308B12736J65055G5107
12284f2910A11458J90366g0236m1585f911B83040C4982J0056R3839b233k58271
$$ y = [56378, 98463, -149312, 113165, 110536, 41985, 236413, 171422, 19655, -112370, -689, 112711, 134457, -11350, -111770, 222098, 19160, 60457, -115075, -99854, -104975, -88708, 169910, 132067, -40449, -37287, -100413, 184596, -35726, 58838, 71122, 89658, 23695, -8189, 157683, -170413, -51229, -106223, 281764, -28622, 70106, -105004, 182422, 68380, -43434, -3859, -222836, 50980, 17753, 187124, 277606, 335212, 57031, 241532, 205724, 249331, 11757, 56490, 193115, 205556, 246979, 409710, 248986, -16836, -281202, 441069, 367280, 182254, 7185, 215865, 187123, -60738, -296621, -141871, 188025, -120308, 212736, 377791, 75107, -62910, 111458, 301824, -70236, -111821, -6911, 283040, 34982, 45038, 138877, -2233, -260504]
12273b60504A90883B6012m134R287J77437J25664p4915A13388P0139J24336f8277
12261D73184A25715M26365C6938Q1602M53837F8297J04143J50230H3714L9652
12251A23366K30L02454a62559b3751E18087B15532o9985e4684k1286A29879n9839
12240G0040L90153e3875F4781J93994h6502c3710C94136e9865l412F9332a7275
12228C12492H5914B7811L09260A56924E6383o838J58819J99026a31445p7255A95279
12216B1871c4388n0863j13965C72900A3283M03318A18725P9445Q6424R8747A21553
12204C80873h1333B19036B3703J09350K55731j19103b63463I9300j9085R0519
12194A70734a9830C82084j47066B0803a68678H4450a92728e1294C75776j65038
$$ y = [-260504, 190883, 26012, 21878, 31165, 208602, 334266, 259351, 113388, 183527, 307863, -68277, 473184, 125715, 552080, 36938, 118540, 572377, 68297, 172440, 322670, 83714, 123366, 123596, 426050, -162559, -23751, 518087, 215532, 145547, -54684, -75970, 129879, 70040, 460193, -53875, 64781, 258775, -86502, -33710, 394136, -59865, -63277, 69332, -17275, 312492, 85914, 27811, 337071, 156924, 56383, 49545, 208364, 407390, -131445, -208700, 195279, 21871, -34388, -85251, -199216, 372900, 13283, 416601, 118725, 198170, 284594, 383341, 121553, 380873, -81333, 219036, 23703, 133053, 388784, 269681, -263463, 99300, 80215, 170734, -19830, 382084, 235018, 20803, -168678, 84450, -192728, -51294, 375776, 210738]
12184B10738n6220D3746K61143c19825b3521B61803f8421B98369A0007i8846A19243
12172H9402j7430K07348J40785H0675l6173M49937f4100q1611F0113O1283a5839
12160B84375G6286L10037A58148K5122D4875B647J21113o1462J16696J42216l9216
12149B81994j24107L26768k28597f9277B40966D0132B964J75049m4557E4067j9673
12138C4394K51098A04071K74085B0744K08704A08538K47951d48016B5189R5556
12128A20745a72446c6896j71418N6709C73299o4270q5583E1371J63008j2761l7077
12117A64541f3294C40644g3642B27161d0951A4869J01615m1519i5240F34373b00197
12105A11801k7857a83843J3748a7293B38884J05186A00466l4593d5390C50917
$$ y = [210738, 154518, 43746, 304889, -319825, -23521, 261803, -68421, 298369, 10007, -98846, 119243, 89402, 71972, 279320, 420105, 80675, 44502, 494439, -64100, -145711, 60113, 121396, -15839, 284375, 76286, 386323, 158148, 183270, 44875, 2647, 123760, 62298, 178994, 321210, 281994, 157887, 484655, 256058, -69277, 240966, 40132, 2964, 178013, 133456, 54067, 34394, 285492, 104071, 378156, 20744, 229448, 108538, 356489, -448016, 25189, 120745, -172446, -36896, -208314, -151605, 373299, 309029, 223446, 51371, 214379, 201618, 164541, -63294, 340644, -73642, 227161, -40951, 14869, 116484, 74965, -95240, 634373, -200197, 111801, 83944, -183843, -170095, -17293, 238884, 344070, 100466, 65873, -45390, 350917]
12094C72596A64504E146R7598C5091K17920e69A32501i489C28745H1729K9812
12083A11541a64612A8506L71170a87586B41270n0774a67349C13855j44121J0083
12073A79817k1780N017M7044e8648j17299N7419N7610B01427n3905a13246L2067
12062h1179B78713K6198H2567P3292M48031A26732l5251p884J85722J21137A67887
12050b60144A15619a03549c5617B25486c7747A87749p0829J84644a06799A06742
12039A47992a04302I0356P3368g9450b8587r3427G0617L59501j62685A28152b98054
12027A17145J73349b33777B49504K73A16618C9961c72844a63731C9438a92362
12016i6038A22494a66601B78005F2267a27090A75938p2383Q0646L06701A33703
$$ y = [372596, 164504, 5146, 102744, 35091, 253011, -569, 132501, -9489, 328745, 81729, 111541, -164612, 18506, 389676, -187586, 241270, 190496, -167349, 313855, 169734, 179817, 158037, 163054, 210098, -58648, -175947, -118528, -60918, 201427, 147522, -113246, -81179, 278713, 304911, 82567, 155859, 603890, 126732, 91481, 83597, 269319, 390456, 167887, -260144, 115619, -103549, -35617, 225486, -37747, 187749, 116920, 301564, -106799, 106742, 147992, -104302, 90356, 163724, -79450, -28587, -122014, 70617, 430118, 267433, 128152, -298054, 117145, 290494, -233777, 249504, 249777, 116618, 39961, -372844, -163731, 39438, -192362, -96038, 122494, -166601, 278005, 62267, -127090, 175938, 103555, 184201, 490902, 133703]
12005D47909j49294q5362A7868c4470j7554n8130A69667B5152i470j05383B06394
11993A17334i1672e594C42853I3034e12036A774J28236c76587E143L19321a28523
11981A98200j6455O5693L5961h957B97127A20260E9934P604b37976Q3913o7337
11970b21400a01169c7505C50652b96365B7180h8415p6219k3568K032b1937G502
11958f3735C45a34305G7464a2971l58917A77624J6478D3913b05247C3952J58876
11947A92828A0717e7456F1869a42470n4676o5468c7313A20909c21978A01695F736
11935A37250n1725a86508f9884G8872b44071E5982a08299F0745a01701k46891
11925c48592I8277h7272A81596b2522E69e74209B80676f7447K3691k06128c1368
$$ y = [447909, 298615, 213253, 17868, -34470, -52024, -110154, 169667, 25152, -9470, -114853, 206394, 117334, -91672, -5594, 342853, 93034, -512036, 1774, 130010, -376587, 5143, 324464, -128523, 198200, 181745, 247438, 283399, -8957, 297127, 120260, 59934, 67538, -237976, -154063, -221400, -101169, -37505, 350652, -296365, 27180, -88415, -164634, -188202, -186170, -21937, 7502, -63735, 345, -134305, 77464, -12971, -371888, 177624, 194102, 43913, -205247, 33952, 192828, 10717, -57456, 61869, -142470, -197146, -262614, -37313, 120909, -321978, 101695, 6736, 137250, 85525, -186508, -69884, 78872, -244071, 55982, -108299, 60745, -101701, -348592, 98277, -87272, 181596, -22522, 569, -574209, 280676, -67447, -43756, -249884, -31368]
11913b59004D7250J78324D6999B0985a25098p7406D15819e18572F3988K78227
11903C42215b7016o1864B89717b68896G9568J03845G8398J66585g6160A87500
11892B94373f5703B0793b22661B9088P8545a73862b5959j14446A23835a15749
11881B74187F6057J40745a1471B04650A5886K0226d5135F0303a23730l88100E1024
11869c74017Q4575C3387J12880c14813B35163f2495I159N1154b80924o2832i8525
11857H0560d1565l02927A49778b2207J049n5455B38740G6224J40151B2648O3216
11846H5864h8938d1186a0495I5073C2563a27327a0721I2316k2826q700d8974H0080
11833b17647j22984A526b67575B8117a6974k07301o8647A75023K6261b1866A27154
$$ y = [-259004, 47250, 225574, 46999, 20985, -125098, -202504, 415819, -518572, 63988, 342215, -27016, -88880, 289717, -268896, 79568, 183413, 78398, 244983, -76160, 187500, 294373, -65703, 20793, -222661, 29088, 107633, -173862, -25959, -140405, 123835, -115749, 274187, 66057, 206802, -11471, 204650, 15886, 36112, -45135, 60303, -123730, -511830, 51024, -374017, -289442, 33387, 146267, -314813, 235163, -62495, 9159, 60313, -280924, -343756, -98525, 80560, -41565, -344492, 149778, -22207, -21158, -76613, 238740, 76224, 216375, 22648, 85864, -88938, -41186, -10495, 95073, 32563, -127327, -10721, 92316, 69490, 60790, -48974, 80080, -217647, -340631, 1526, -267575, 28117, -16974, -224275, -292922, 175023, 201284, -21866, 127154]
11821D9257O8691J5247c38512J3500J59104k9368J9443P8285G5762b33045B57401
11809f9575q4820A80256a65009A70763H1442j3483P953b61929m8480f8261I366
11797a0443l66793g0542A69578a95405A60878b54564J18649K7499C0101g4692
11786H9735h7363C3267e4688r558k1786B92770c15153a46972j60937f7500k63794
11775c31294A65805F3117Q4959m9687N0829b21813K4190l3975e6371k84418e56
11763A88565a09485A07351c55403B9414I472a08944E6126a30801m7588L9604j36564
11752b75349C2391c9075j31880N5238j00766c2193k71869A60783a3900C04801
11741D58749A9307N0125h0593l1042B28244o8686b5194D7434B2845a23361r2114
$$ y = [49257, 117948, 133195, -338512, -325012, -165908, -195276, -175833, -97548, 75762, -233045, 257401, -69575, -154395, 180256, -165009, 170763, 81442, 67959, 75912, -261929, -310409, -68261, 9366, -10443, -377236, -70542, 169578, -195405, 160878, -254564, -135915, -108416, 30101, -74692, 89735, -87363, 33267, -54688, -64246, -86032, 292770, -315153, -146972, -307909, -67500, -331294, 165805, 63117, 148076, 98389, 149218, -221813, -197623, -231598, -56371, -340789, -556, 188565, -109485, 107351, -355403, 29414, 9472, -108944, 56126, -130801, -178389, -138785, -275349, 32391, -39075, -170955, -115717, -216483, -32193, -304062, 160783, -13900, 304801, 458749, 19307, 69432, -80593, -111635, 228244, 159558, -25194, 47434, 22845, -123361, -215475]
11730b15475B57550k2883J29889f4604p9475l2239C44975A07105e1934b5444A64163
11718C43704e130A9799a7063q3163a8163k290j31707e0407B18337a61350G5163
11706b38099K8653N2569A66295a09980A57840m0633e9030A65309J29816E8888
11695B17460e2974j53639A70858a66707E3565b3824j5892k5565D58656B10787
11684a14497E7303a84018D8428K55703a02954j13115I9103b03117A1827K7483
11674C9310K16313A14022B7760J14659n5409m728a19961D09025a13623a2678A03342
11662A48917D9736a07613B81957G3718J895K50447j59614G4276a55539D09099
11651B59392H8332M329f861r959A01144A5833Q8961C3351Q5657D2025J60548g7663
$$ y = [-215475, 257550, 234667, 364556, -64604, -144079, -176318, 344975, 107105, -51934, -25444, 164163, 343704, -5130, 19799, -17063, -100226, -18163, -20453, -152160, -50407, 218337, -161350, 75163, -238099, -209446, -156877, 166295, -109980, 157840, 117207, -59030, 165309, 295125, 58888, 217460, -52974, -206613, 170858, -166707, 53565, -23824, -39716, -65281, 458656, 210787, -114497, 57303, -184018, 48428, 304131, -102954, -216069, 99103, -203117, 11827, 39310, 255623, 114022, 27760, 142419, 87010, 82282, -119961, 409025, -113623, -12678, 103342, 148917, 49736, -107613, 281957, 73718, 75613, 326060, 166446, 74276, -155539, 409099, 259392, 88332, 92661, -6861, -16820, 101144, 15833, 104794, 33351, 119008, 42025, 202573, -77663]
11638a35675j1839A76643n9662f0093j80747C44739A06503a01479G2006J03905
11628A75911J52422q0985H0457N4713k0495a45675A3810J13536e2408F8598J10478
11617A79076a04001G5113J58313b13271c3069B61188b04646g5C02625q7494l3522
11606A81609H7534J77903b4583A9962f4874k52695H769f9643C34586B4514a11007
11594a17580K0994A77430M1342b35912A28596a39650O595e9571H5711Q1330c92550
11582c6549a2005k12699C29487B626a8969A48611c1920B70553H1337J39082b25575
11570i9710n3507A13900m5096L34207A39134K13861j15400C5867a49368B1849
11559I3505C8603F524J96835F8907J0912j8774A534J09500J55862L0298r1484
$$ y = [-135675, -147514, 176643, 116981, -60093, -240840, 344739, 106503, -101479, 72006, 175911, 328333, 247348, 80457, 135170, 114675, -145675, 13810, 127346, -52408, 68598, 179076, -104001, 75113, 233426, -213271, -33069, 261188, -204646, -75, 302625, 215131, 181609, 87534, 265437, -24583, 19962, -64874, -317569, 8769, -69643, 334586, 24514, -111007, -117580, -96586, 177430, 218772, -235912, 128596, -139650, -133055, -59571, 85711, 167041, -392550, -36549, -12005, -224704, 329487, 2626, -18969, 148611, -31920, 270553, 81337, 220419, -225575, -99710, -153217, 113900, 68804, 403011, 139134, 352995, 237595, 35867, -149368, 21849, 93505, 38603, 6524, 203359, 68907, 79819, 61045, 1534, 111034, 266896, 297194, 205710]
11548B05710H0537L52174b49690C4471a90586C00809j37321M6047k1015R9278
11538B87798g9888A52738g9647A44427F5593a06110B22867b46318C06549q4051
11528B22498c02983A00830P8568G2160i089j2205l04445i53q9152E046b4013r1139
11516a15152d1626H0249c6851A57893H873Q397a53393C51893A29224k1545g8721
11504a23923B7956i0706d3236j02056B34458I7091b59235B82771a21202A65579
11493B6821J4596P5643e7498A79055K3322F2634J84833a32358D9714J55282R8572
11482C03568I368J93749c1586j79614A64641k4971b40098f897p7646k79625B3952
11470a1528D9779d1660o6756B37927j7505H5440O0890A9465F104R2432H486c4144
$$ y = [205710, 80537, 432711, -249690, 34471, -190586, 300809, 163488, 209535, 188520, 287798, -79888, 152738, -79647, 144427, 65593, -106110, 222867, -246318, 306549, 222498, -302983, 100830, 179398, 72160, -9089, -21294, -325739, -953, -90105, 5046, -24013, -115152, -41626, 80249, -36851, 157893, 8873, 17270, -153393, 351893, 129224, 107679, -78721, -123923, 27956, -90706, -43236, -145292, 234458, 97091, -259235, 282771, -121202, 165579, 26821, 41417, 117060, -57498, 179055, 202377, 62634, 247467, -132358, 49714, 204996, 303568, 9368, 203117, -31586, -211200, 164641, 139670, -240098, -6897, -84543, -364168, 23952, -11528, 49779, -41660, -108416, 237927, 220422, 85440, 146330, 19465, 6104, 98536, 8486, -34144]
11457f2109B82898l1381r5929p1925c0426B62681f0548A94971p5819J32465F7810
11445A87255i6781m0407A57829j3454J5735l1710m2399K77641H2203b65343C29450
11433A91142J14494B7954K14689j07895j9913c8152C65365B4515b112B96483q4773
11422B11710d5763B12976k4221e200k12806A33048a39627D42222A23249b82653
11411B97754H9332R0243H6585P9370F9365J61394a52277J2007q5731A64407L1067
11400A95474b61969B93273a95962Q3427k81043e884l0475A19234j0704A8111J26547
11389A44658n5548k9915c5914r1967M9222F2983A859J89282F5252a03528M4163
11378e9365B22517b95166G8559Q3513A4134K37511b6836B37837F9838l0945b6471
$$ y = [-62109, 282898, 251517, 155588, 83663, -30426, 262681, -60548, 194971, 119152, 251617, 67810, 187255, -96781, -137188, 157829, 144375, 160110, 128400, 86001, 363642, 82203, -265343, 329450, 191142, 305636, 27954, 242643, 134748, 114835, -38152, 365365, 24515, -2112, 296483, 211710, -45763, 212976, 188755, -5200, -218006, 133048, -139627, 442222, 123249, -282653, 297754, 89332, 179575, 86585, 165955, 69365, 230759, -152277, -140270, -226001, 164407, 195474, -261969, 293273, -195962, -112535, -393578, -5884, -36359, 119234, 108530, 18111, 144658, 89110, 59195, -35914, -127881, -78659, 62983, 1859, 191141, 65252, -103528, -59365, 222517, -295166, 78559, 162072, 14134, 251645, -26836, 237837, 69838, 38893, -26471]
11366a22910B31984a5052j6942I9386J02804J29788j2827a35253B99554c45906
11355a73243B78480g5947J9437A56868Q1572f1429K9040r175k18035A69069A796
11343b9196j09240J7307M8370A1612K2768a04743B2875h8856j77194K2067A4454
11331a57399P1344J4902J3250Q46H2980O9094a831j487j4924A42500a30476b6803
11318A82760a68510C793b3396A39896f904j15966p620A61302K15941a6068A06136
11306A06338J26123G4109b52654B4832b17435A84156a75564j73K9425l9078E3916
11294f4269j02618b7386D5705J01195b84824J14568k3713h3064c3072k7576k8940
11283h9588n9290a8035p8876j8304R128B43942c1304k24066R8236A08217K6912
$$ y = [-122910, 231984, -15052, -31994, 99386, 202190, 331978, 319151, -135253, 299554, -345906, -173243, 278480, -75947, -56510, 156868, 238440, -61429, -32389, -41564, -259599, 169069, 1796, -29196, -138436, -121129, -72759, 11612, 34380, -104743, 22875, -88856, -266050, -243983, 14454, -157399, -86055, -71153, -57903, -57057, 82980, 152074, -1831, -3318, -18242, 142500, -130476, -26803, 182760, -168510, 3793, -23396, 139896, -6904, -122870, -130490, 161302, 377243, -16068, 106136, 106338, 232461, 74109, -252654, 24832, -217435, 184156, -175564, -175737, -146312, -185390, 53916, -64269, -166887, -27386, 45705, 146900, -284824, -170256, -193969, -83064, -33072, -60648, -89588, -148878, -18035, -96911, -115215, -106087, 243942, -31304, -255370, -157134, 108217, 135129]
11272A35129g8067B3026e5311m2108L3417I0255a51588B38658d32649A08689g6507
11260b72023h2273k07240J02654P0302n3467d8352j57593N2015A4323b56686a02944
11248b48774m8711A04583b80313J38056b7215o2862C46446i698H2530b59629a02204
11236A03049h1481a6394k32939e9807A24440n6249i060A53815a88926C5869b6869
11224D0018a0449G8413c4997j64524j01290a04248A47305L2315E9910b765H5550
11212d057j12259B1507g0317B36598a44520I8707a13354j9634B00649e43583e5347
11200F9219a30985B10385h2874j57693i1417b8021P32k2409A29871b97759C9953
11188B52244j491q8166b54633c2702G5772M2168a62624g4738b4321o7696j41929
$$ y = [135129, -78067, 23026, -55311, -97419, -64002, 90255, -151588, 238658, -432649, 108689, -76507, -272023, -82273, -289513, -186859, -116557, -170024, -48352, -205945, -153930, 14323, -256686, -102944, -248774, -297485, 104583, -280313, -142257, -27215, -90077, 346446, -9698, 82530, -259629, -102204, 103049, -81481, -16394, -249333, -59807, 124440, 68191, -9060, 153815, -188926, 35869, -26869, 40018, -10449, 78413, -34997, -199521, -300811, -104248, 147305, 179620, 59910, -2765, 85550, -4057, -116316, 21507, -70317, 236598, -144520, 98707, -113354, -132988, 200649, -543583, -55347, 69219, -130985, 210385, -82874, -240567, -91417, -28021, -27289, -49698, 129871, -297759, 39953, 252244, 250753, 162587, -254633, -32702, 75772, 117940, -162624, -74738, -24321, -92017, -233946]
11177b33946H448b6882j31066J779P5311A24289e1246p4334M0044j03707j65214
11166c54457A21946f0931B09016j5933G1104e7774q9852Q484O3006j89513H3073
11154D0877M618c63710a81678D82158b48783B12444h5568d2236j98318A16390
11143a9028D0256h3794F4137a34841k6756B09425a4268B6802b49922i6998B1593
11131a34635L5760c4530o9491j15947I2179b61673B47630o8593h5987a9223C006
11119a7589q1165A28271J07849B9209O0712J8236l7936G496a69337A41595J07228
11108B48823b936j05905B34543M3964D7049K49389D5869d436o7981E2464O1327
11097A13791D4150a44923B24562H5617f877j58326f9282A30077E489L12707k9018
$$ y = [-233946, 8448, -26882, -157948, -156169, -80858, 124289, -51246, -125580, -85536, -189243, -354457, 121946, -60931, 209016, 193083, 71104, -57774, -147626, -139142, -76136, -265649, 83073, 40877, 45495, -363710, -181678, 482158, -248783, 212444, -85568, -42236, -240554, 116390, -19028, 40256, -83794, 64137, -134841, -161597, 209425, -14268, 26802, -249922, -96998, 21593, -134635, -98875, -34530, -104021, -219968, 92179, -261673, 247630, 179037, -85987, -19223, 3006, -17589, -98754, 128271, 236120, 29209, 89921, 108157, 70221, 7496, -169337, 141595, 248823, -2936, -108841, 234543, 278507, 47049, 296438, 45869, -4436, -72417, 52464, 113791, 44150, -144923, 224562, 85617, -6877, -165203, -69282, 130077, 5489, 318196, 289178]
11086B89178f4711D2691K80760j55828l7918R6806A5184a22765M6407C1142a77155
11074F9831K14901E2224R0003a19552E24226k24292J86356A92226m8199l1665
11064A12362a43446c7824A36365E8761M1530K4399n7961A7286J26702M1728q7318
11053I8398a37104D35208J3566A84474a7065E42246B32312A8815b1395B35058
11042C28080L483K44081B27266J77729R8869n6834J05836J36846k74388K05070
11032F20394J47389k22867Q9784k13989M46981k02396k9064J87102C99504J00987
11022E00491K51154j71553K9868k6226p6018j72876N41453B90615N11381k93727
11012E08269J2931J30168k2482K98222m08823A68048M57044l7693m6952B27925
$$ y = [289178, -64711, 42691, 323451, 167623, 129705, 226511, 15184, -122765, -76358, 31142, -177155, 69831, 284732, 52224, 142227, -119552, 524226, 299934, 486290, 192226, 144027, 112362, -143446, -37824, 136365, 58761, 100291, 124690, 66729, 17286, 143988, 185716, 98398, -137104, 435208, 448774, 184474, -17065, 542246, 232312, 18815, -21395, 235058, 328080, 331563, 575644, 227266, 404995, 503864, 447030, 552866, 689712, 415324, 620394, 767783, 544916, 634700, 420711, 867692, 665296, 636232, 823334, 399504, 500491, 751645, 580092, 609960, 583734, 507716, 334840, 876293, 290615, 801996, 508269, 521200, 651368, 628886, 927108, 518285, 168048, 625092, 587399, 540447, 227925]
11001F61432Q5102l62845j5568J74697k62522L5604A31379J75011k3467J88537
10991D71460j77498M50368B29554N68183l90857q422M38871j59206j56852O3478
10981E84749K46382k07377k55392M02566o7486j72211K41765k33201J88227j28622
10971E99400J68384l535K4893P0950j23559P0590k23884K71705L7047K33675k06941
10960I18725O80441J7412l44650K10569J55386K72240K02886j05236R6029j31066
10950A972736o3091n42j71677J42650l79490j56975O22014n08912J04228L41809
10940A902750l19506K39269j46573r9428N5721l69361j29116N24154k07371m62947
10930I87592j8799k95309n2892j31388B15824F1399A4597L00056M811a02620A61758
$$ y = [661432, 746534, 383689, 368121, 542818, 280296, 315900, 131379, 306390, 282923, 471460, 293962, 744330, 229554, 797737, 406880, 398458, 837329, 678123, 521271, 584749, 831131, 623754, 368362, 770928, 703442, 531231, 772996, 539795, 728022, 599400, 767784, 764249, 789142, 860092, 736533, 807123, 583239, 854944, 891991, 1125666, 918725, 1599166, 1616578, 1271928, 1482497, 1637883, 1910123, 2113009, 2007773, 2103802, 1972736, 1909645, 1909103, 1737426, 1880076, 1500586, 1343611, 1965625, 1456713, 1560941, 1902750, 1583244, 1822513, 1675940, 1576512, 1632233, 1262872, 1133756, 1657910, 1450539, 987592, 968793, 673484, 620592, 489204, 215824, 61399, 14597, 314653, 319464, -102620, 161758]
10918E54503a5281A61628K20246j68856c21133a06761n644B52999A22854f7538
10907d801l7102p2645D69400B10017f3048j5731B64782q3294C1356h2038k32877
10896c14915N0877Q4864B09152b60722B05937b41728n8301J21007j0338N5861
10886a33499j65917a01138j33828a08396B05086r817d6757B45324a21171n0285
10876a71456d3566p0914A00122l3891d8713l3606A23409i6818I878e69061a33599
10864H4722b7576n9517L4169j43914A72386a22294J4543M3377A62037b26510r228
10853b35738N2654A22937Q3611b1688E003O1239g2915k18068Q8965R7234b3926
10841B34884e4514C0879J89453b19619A92453m420b01143C0151j1726c81283J42795
$$ y = [554503, -15281, 161628, 381874, 213018, -321133, -106761, -112405, 252999, 122854, -67538, -4801, -41903, -114548, 469400, 210017, -63048, -78779, 264782, 181488, 31356, -82038, -314915, -264038, -179174, 209152, -260722, 205937, -241728, -300029, -179022, -189360, -133499, -299416, -101138, -234966, -108396, 205086, 195269, -46757, 245324, -121171, -171456, -43566, -114480, 100122, 66231, -48713, -82319, 123409, -96818, 9878, -569061, -133599, 84722, -27576, -87093, -52924, -196838, 172386, -122294, -107751, -64374, 162037, -226510, -235738, -183084, 122937, 206548, -21688, 5003, 66242, -72915, -290983, -202018, -104784, -23926, 234884, -54514, 30879, 220332, -219619, 192453, 188033, -201143, 30151, 18425, -381283, -238488]
10830b38488a01394j95591A61526e3562j18843k3274R6937A62513L3754a0628
10819a25526B4311b69637f037H1547a72461A1010a20550q3462r5786a25347A54356
10807a54536o7050A0310J38512g2195k75350c8735A7891a9790A68146a28286k03141
10796c31427A13451f392J153E8592c2642k2367q8662I7705k6731a90045A06440
10784c03110O5191R6110e9336A84551d28062i8655A1238L49934A68068F8932O6994
10773A35926c7134j14263k67661a20251B234d4579B08936b27105a08686o675A83482
10761b26934h1336A275c70598B6525J04641I123J27222b70587J25210D9188p788
10750D1400a55172J3890j07165G9439a00942B30965I661a71892L938P2459M7093
$$ y = [-238488, -101394, -296985, 161526, -53562, -172405, -195679, -98742, 162513, 196267, -10628, -125526, 24311, -269637, -6037, 81547, -172461, 11010, -120550, -204012, -299798, -125347, 154356, -154536, -221586, 10310, 148822, -72195, -347545, -38735, 17891, -19790, 168146, -128286, -331427, 113451, -6392, -5239, 58592, -32642, -55009, -143671, 97705, 70974, -190045, 106440, -303110, -237919, -141809, -59336, 184551, -428062, -98655, 11238, 361172, 168068, 68932, 135926, -37134, -151397, -419058, -120251, 2234, -44579, 208936, -227105, -108686, -115361, 183482, -226934, -81336, 1275, -370598, 26525, 131166, 9123, 136345, -270587, -145377, 49188, 41400, -155172, -141282, -248447, 79439, -100942, 230965, 9661, -171892, -167954, -95495, -48402]
10739d8402b2292l1929l3330J9548H6257C0393J16322b09202F202K33860I0202
10727B70748I9565a5039O949j35750j56067I1140J06271o3692b05904C10968g9222
10715B09761a83456b595C992e1152I4666a26631j88708B1096b40434J8312N5906
10704a66216B86655b89981P2268k04712A89188a05138j68373a7506G1655C2900
10693a69709B73507b71606E8087a07671J4161l62141d6136m676j01564I7342g051
10681b67722M1459A48987b48298B6339m823c40669i1761C07003a0779r8527J6576
10670i2730m0205l3850j3337f7584k13890C910J61349l6375b26521B43436c30805
10658G9656c14022B01661p2358c04020d3137A3067a3469C49257A02738a27967
$$ y = [-48402, -22292, -54221, -87551, -68003, 86257, 30393, 146715, -209202, 6202, 240062, 90202, 270748, 99565, -15039, -8090, -143840, -299907, 91140, 197411, 133719, -205904, 310968, -79222, 209761, -183456, -2595, 3992, -51152, 94666, -126631, -315339, 21096, -240434, -222122, -166216, 286655, -289981, -217713, -422425, 189188, -105138, -273511, -17506, 71655, 32900, -169709, 273507, -271606, 58087, -107671, -93510, -455651, -46136, -50812, -152376, 97342, -7051, -267722, -226263, 148987, -248298, 26339, 21516, -340669, -91761, 307003, -10779, -109306, -92730, -132935, -166785, -180122, -67584, -281474, 3910, 165259, 128884, -226521, 243436, -330805, 79656, -314022, 201661, 129303, -304020, -43137, 13067, -13469, 349257, 102738, -127967]
10647A754R8239e270A16181a98493d8832A15131a07078e0382B19855p7612E5474
10635b0107A40181b08361a4710o296I8175b0396E4707J16986f6879A04810P1544
10624A76354B5252d84069K18795I080a82227B52183E8999b95047a19037F975M6383
10613E3358c50913G2053B2772d0539D5942a77979j39009D9065B2183J8136c29006
10601A0708a42400j55520J44299A4469c99635Q1646A99494c5440k67802a38968
10590b38449g3027I3324L1363d7884J1490p0757k2225L0274j6624o0904H6651
10578c21950C0135K2972c41520A65442o7372a51665B0691P579J7575b45597R8818
10567a46779A67615F654a58117H2021b98153B14282a79166G9330I033b11076Q8865
$$ y = [1754, 99993, -5270, 116181, -198493, -48832, 115131, -107078, -50382, 219855, 142243, 55474, -20107, 140181, -208361, -14710, -21006, 98175, -20396, 54707, 171693, -66879, 104810, 176354, 25252, -484069, -265274, 9080, -182227, 252183, 58999, -295047, -119037, 6975, 53358, -350913, 72053, 22772, -40539, 45942, -177979, -316988, 49065, 22183, 40319, -329006, 10708, -142400, -297920, -153621, 14469, -399635, -317989, 199494, -35440, -303242, -138968, -238449, -73027, 93324, 124687, -47884, -36394, -107151, -129376, -99102, -115726, -176630, 86651, -321950, 30135, 53107, -341520, 165442, 98070, -151665, 20691, 28270, 45845, -245597, -146779, 167615, 6654, -158117, 82021, -298153, 214282, -179166, 79330, 9033, -211076, -122211]
10556a22211A56560a55514A3902b00899H9674c56991B99171B9982a17151G7669
10545b07050i3422n8617B62299b03462e6727A18959a70317E7374c15068B36019
10534i2915a6921C43533a04929j37835e5732A05257i2115j7784k7544l9660q7294
10523b64397M4199B0054i8195m973B2205a82025I9590b06865j67g6347H7832D390
10510a10157A981i0543J9271L5259A28574a86536q4695A76687b84439A80913F3262
10498a71719L6574j09013B65937b530B6647a84547j61637a05817A57462m8800
10488A08662d532B9433R4135O4826o7310K29882b35358r2504e0111K1621l95146
10477d23636J25782b9647n6281k4668b257B05593a25048j1536B77652A26464A8015
$$ y = [-122211, 156560, -155514, 13902, -200899, 89674, -356991, 299171, 29982, -117151, 77669, -207050, -93422, -152039, 262299, -203462, -56727, 118959, -170317, 57374, -315068, 236019, -92915, -16921, 343533, -104929, -242764, -55732, 105257, -92115, -109899, -137443, -177103, -264397, -220198, 20054, -98195, -103168, 22205, -182025, 99590, -206865, -207032, -76347, 87832, 4390, -110157, 1981, -90543, -71272, -36013, 128574, -186536, -271231, 176687, -284439, 180913, 63262, -171719, -135145, -244158, 265937, -2530, 26647, -184547, -346184, -105817, 157462, 108662, -4532, 29433, 123568, 188394, 121084, 350966, -235358, -327862, -50111, -28490, -423636, -297854, -29647, -85928, -110596, -2257, 205593, -125048, -136584, 277652, 126464, 18015]
10465B27566J0651F833L54217j14337E3004J89776O9845J5086K23821k25854p5721
10454B49957I259J25195J31935A25523h3401G5197j0662d5177j37494j46634b382
10442A65248A9445q626a82374b5597E2556i5337B21877a37495o3858c2361A35092
10430H0887b08176p7211A54182J43671d19737J51705a18015K2975d3516h489I6737
10418A23621i6442G420b06376A99536g0333A92043f2461b7022J1343D6112a06471
10406E2315c59368d099A08883a30393j98282G7704j7182d82564a19896d0141B4946
10394G755c2784A13406Q1673i561l6771H9378b0389j171D9444J41978D2160L5810
10382G7970a31645N1121B18173c8372A91335C4959a41511B05436G7771D42a52002
$$ y = [227566, 238217, 6833, 361050, 246713, 53004, 242780, 312625, 327711, 551532, 325678, 249957, 9259, 134454, 266389, 125523, -83401, 75197, 64535, -45177, -182671, -329305, -2382, 165248, 19445, 10819, -182374, -25597, 52556, -95337, 221877, -137495, -201353, -32361, 135092, 80887, -208176, -285387, 154182, 297853, -419737, -268032, -118015, -95040, -43516, -8489, 96737, 123621, -96442, 7420, -206376, 199536, -70333, 192043, -62461, -27022, -15679, 46112, -106471, 52315, -359368, -4099, 108883, -130393, -328675, 77704, 60522, -482564, -119896, -40141, 24946, 7755, -32784, 113406, 195079, -9561, -46332, 89378, -20389, -21560, 49444, 191422, 42160, 77970, -131645, -80524, 218173, -38372, 191335, 34959, -141511, 205436, 77771, 442, -152002]
10370a1073A34129J21616J05872j61104a4231M32n4968A83446b0504B61904b31168
10358H4036b981A43852B0642h0436A35029Q4046J95151k90c6688D37362j18917
10347C18445p9771P2818k7075g6737C95943j63816N9383f204B97052m4664H5669
10335D18293j06013a83367A99216R8750j18685K60280N5424J36255k98124J3198
10325C46314j68842K30801k464A93863f4311B01867g0180c4563k6124G116L87418
10314C94534G2157M84038I5047O6036N7852f0382n70Q40B67835a49700B96181
10302A69801Q8559b48559C10925R1584B0837J12739e4405B96732j15004A8290
10291D8110I731N9901P3239a34987m9409R934P907M0269A86786H477h0740A67373
$$ y = [-11073, 134129, 255745, 361617, 200513, -14231, -13799, -68767, 183446, -20504, 261904, -231168, 84036, -2981, 143852, 20642, -80436, 135029, 219075, 414226, 413936, -36688, 437362, 318445, 238674, 311492, 284417, -76737, 395943, 232127, 291510, -6204, 297052, 252388, 85669, 418293, 312280, -183367, 199216, 297966, 179281, 439561, 494985, 631240, 333116, 346314, 177472, 408273, 405809, 193863, -64311, 201867, -70180, -34563, -60687, 7116, 394534, 72157, 556195, 95047, 161083, 218935, -60382, -60952, -60112, 267835, -149700, 296181, 169801, 258360, -248559, 310925, 402509, 20837, 133576, -54405, 296732, 181728, 18290, 48110, 9731, 69632, 142871, -134987, -184396, -174462, -166555, -126286, 186786, 8477, -80740, 167373]
10278d9463l72501C8140A8370a51079d025E2821b3195k33725O7750e7129C01250
10266b33862C22589l0891b60270O9581j92688G6599b90889A81156a86153C9997
10255a37566A44813f5030H7905b9418p4653F4920e5811B84534j12655f7865A23
10243b09830A39125E3317J70841J57132A62439J28409A44852d8378E78867B26697
10232B20101g2467A5201c15174B74727A36428d2638A15846a49461j8602B00466
10221a32254B2807i3092a2892A03890a4826m7391m9522B44885j7642F7795a45660
10209a97958k0008K6409R3802j49366j41987a82304c2299k7120F2261c8454n42058
10198e80512A33254c38818B8500J52483B5510K0923R7614g9136b0590l20413e2089
$$ y = [-49463, -421964, 38140, 18370, -151079, -4025, 52821, -23195, -256920, -189170, -57129, 301250, -233862, 322589, 291698, -260270, -190689, -383377, 76599, -290889, 181156, -186153, 39997, -137566, 144813, -65030, 87905, -29418, -104071, 64920, -55811, 284534, 171879, -67865, 123, -209830, 139125, 53317, 224158, 381290, 162439, 290848, 144852, -48378, 578867, 226697, 220101, -72467, 15201, -315174, 274727, 136428, -42638, 115846, -149461, -168063, 200466, -132254, 22807, -93092, -12892, 103890, -14826, -62217, -111739, 244885, 227243, 67795, -145660, -197958, -217966, -191557, -97755, -247121, -389108, -182304, -32299, -59419, 62261, -38454, -580512, 133254, -338818, 28500, 180983, 25510, 46433, 144047, -79136, -20590, -341003, -52089]
10186G8220P7844c05535k807a529A00207a2373A89869b5495A18981a00005B885
10174a80029e2666j46957G1266b35855a0794k47060J21926L8476n6829L1795j18957
10163b41443A03931a7747F3167C183L5022J84058a48451n27A38128C9487a19140
10151a22285A32894a49162N2021j63981f3959F159L40129a32927o9081j328B9450
10139E57K6117M679b44348J01407b9142k66080A73767G2112a86285A7377M074
10128B1451a38931l7705A57614f1777o4797a7381j04633n7358A56966O2076a256
10116H834L17486B1082a17793A60736c30082A38734n4779a08987k29870J50831
10106a88026b6166A09719a709o5349A4623b12984L8477B06971H3782d28628F0518
$$ y = [78220, 156064, -305535, -308342, -1529, 100207, -12373, 189869, -25495, 118981, -100005, 2885, -180029, -52666, -199623, 71266, -235855, -10794, -257854, -135928, -97452, -154281, -122486, -241443, 103931, -17747, 63167, 3183, 38205, 222263, -148451, -148978, 138128, 39487, -119140, -122285, 132894, -149162, -97141, -261122, -63959, 6159, 346288, -132927, -202008, -203336, 29450, 557, 26674, 31353, -244348, -142941, -29142, -295222, 173767, 72112, -186285, 17377, 21451, -138931, -176636, 157614, -61777, -126574, -17381, -122014, -179372, 156966, 219042, -1256, 8834, 326320, 21082, -117793, 160736, -330082, 138734, 83955, -108987, -338857, -188026, -26166, 109719, -1709, -67058, 14623, -212984, -174507, 206971, 83782, -428628, 60518]
10094F7871c23927a35161E4159a67319j13242i5281A5896b57482G9562c18778
10083b02163A52846a13457C35153b91479q2146c735B09007f0543B93428b65872
10072a24717p7843E7544a13978r4475a2777k16523d9718j30009A30263a64688
10061b96925B00775r1469b91470j0208g2266C4209e29707G9146B9442d9219j24025
10050a73244j41925d5794j362l3597j19905P6196j02662C4178J18455f1298n5925
10039a17223H4938d95726a17264c3807k38394j03324B5660c25075A92374C4963
10028B37161H4514i2710B45945k4093H2981k0122j0034g427k82683A59825a73241
10016h2570G3245K8051e0059C269a33168C9989a7397j92386p6249J34239B910
$$ y = [67871, -323927, -135161, 54159, -167319, -280561, -95281, 15896, -257482, 79562, -318778, -202163, 152846, -113457, 335153, -291479, -373625, -3735, 209007, -60543, 293428, -265872, -124717, -202560, 57544, -113978, -208453, -12777, -229300, -49718, -179727, 130263, -164688, -296925, 200775, 109306, -291470, -301678, -72266, 34209, -529707, 79146, 29442, -49219, -173244, -315169, -45794, -47156, -80753, -200658, -124462, -227124, 34178, 152633, -61298, -117223, 84938, -495726, -117264, -33807, -272201, -375525, 25660, -325075, 192374, 34963, 237161, 84514, -92710, 245945, 221852, 82981, 62859, 52825, -7427, -290110, 159825, -173241, -82570, 73245, 101296, -50059, 3269, -133168, 39989, -17397, -209783, -286032, -151793, 2910]
10004D5316L46540j68894N8253a69439K0369k429B6355L3066e4716K3544C8231
9992B02893G4475h2926B98731d3690n4951o2793L9693A97822a12225C4676b20511
9980A26187c66137B30206C6549f2544B4436i2607M885E4380a20037l43484A48635
9968c52420a23877E5408d45249d6288j11812j59029K9970j83587b31399j3304
9958b44703a00293b989A24233p507Q9513b18478B5172d74440J91588J06297A68505
9946A29788E2003B750O1505i2084D658b49775R8777A7613d32578e57B59161G6700
9933B10463o2599i7287n4893l65299A80867b34037D9016b56366B223a60662c5392
9921a44189c3237n2776K6253j67426J05546A28838b46650p2531g8604A14421H586
$$ y = [45316, 391856, 222962, 281215, -169439, -149070, -151499, 26355, 59421, -54716, -31172, 38231, 202893, 74475, -82926, 298731, -43690, -98641, -161434, -121741, 197822, -112225, 34676, -220511, 126187, -366137, 230206, 36549, -62544, 24436, -92607, -87722, 54380, -120037, -463521, 148635, -352420, -123877, 55408, -445249, -46288, -158100, -317129, -287159, -470746, -231399, -244703, -100293, -2989, 124233, 116726, 206239, -218478, 25172, -474440, -282852, -176555, 168505, 129788, 52003, 2750, 64255, -92084, 4658, -249775, -150998, 17613, -432578, -557, 259161, 76700, 210463, 147864, -97287, -152180, -517479, 180867, -234037, 49016, -256366, 2223, -160662, -35392, -144189, -33237, -86013, -59760, -227186, -121640, 128838, -246650, -319181, -78604, 114421, 8586]
9909a36000o8015A7944J71609A0285b51278A45834c85280I3413K11809b88514
9898b95681a09048c0606k9365R196k22712Q9176k31682a92554N3797J8305C04055
9886a92254k31409a12048j6855N5487M920l7913G7608g8233K5280A90661l4701
9875A55960P7262a18237q788N158K7632b9236F1675b24799I4880N8012J80388
9864C33280e2398B8752J73855I3250e3496l8533l4590c9803l65686Q0250b9163
9852c59173A40980a121j05671L9100o3074k9084A09311j936b2566B01238a70881
9840a36304C8598d7825b0535D3870J41820c1877A2047B168a85885A18830D6267
9828c94642B46648b23029o4554h6449k9089G1120P9181b00889B03083b63615J29380
$$ y = [-136000, -204015, 17944, 189553, 10285, -251278, 145834, -385280, 93413, 305222, -288514, -295681, -109048, -30606, -59971, -50775, -273487, -184311, -415993, -192554, -138757, -120452, 304055, -192254, -423663, -112048, -128903, -73416, -68496, -106409, 77608, -78233, -52953, 190661, 155960, 233222, -118237, -127025, -121867, -94235, -29236, 61675, -224799, 94880, 152892, 333280, -52398, 28752, 202607, 93250, -53496, -92029, -126619, -39803, -405489, -325239, -29163, -359173, 140980, -1121, -106792, -67692, -130766, -159850, 109311, 107375, -22566, 201238, -170881, -136304, 38598, -47825, -20535, 43870, 185690, -31877, 12047, 2168, -185885, 118830, 46267, -394642, 246648, -223029, -287583, -86449, -115538, 71120, 150301, -200889, 203083, -263615, -134235]
9817a34235C521R2786a42146K9741j02166A07361f052F1020R2237b51293a11665
9805A39924a70326Q4510k9600A54944a33532l4027M7032m1168A4251J67492f70147
9793A70508b30383F1930Q1300h2052A3495d7636j63551a8193k78653E6548d5403
9781A55704a16220A79851A5605b10166J7277m4669B94975b8615j93740j48876
9771c71231B70183b8437l15730J65085L7331n709O7535j39734b6018l31547I9812
9759A0086b14731I9219b76664A57519a51291F6561e3648a2669k81534a10366C7225
9747H5814a3261j03901f134I7151a41192e737G5427d64561i5823A44333a62848
9735A6641d8762r7042Q344j1706K1309G9757b05387A82223g6344o7666o178J2920
$$ y = [-134235, 3521, 96307, -142146, -112405, -214571, 107361, -6052, 61020, 153257, -251293, -111665, 139924, -170326, -85816, -115416, 154944, -133532, -167559, -120527, -161695, 14251, 181743, -670147, 170508, -230383, 61930, 143230, -82052, 13495, -47636, -211187, -18193, -296846, 56548, -45403, 155704, -116220, 179851, 15605, -210166, -192889, -237558, 294975, -28615, -222355, -371231, 270183, -28437, -344167, -179082, -141751, -147460, -79925, -219659, -26018, -357565, 99812, 10086, -214731, 99219, -276664, 157519, -151291, 66561, -53648, -12669, -294203, -110366, 37225, 85814, -13261, -117162, -6134, 97151, -141192, -5737, 75427, -464561, -95823, 144333, -162848, 16641, -48762, -145804, -137460, -149166, -127857, 79757, -205387, 182223, -76344, -144010, -150188, -137268]
9723a37268C6189N1025i1611G5852b56144N9265c6914j01070q888e7677k53229
9712c10906h7441a895j98610R8072N135A28335c1312l03852B01655a52354N6406
9701i5948P555A12695c54798A45549o3520a31987p0066A01583g3632o064K5400
9690e4296B55336e7141j16077G3677R5274o8567c00335D5615a16015i132j36086
9679a45218o8941p3799g366k04391i3263k81820J49168a01151j10009A96612a2244
9667B83588J32336j56721B3721h8995A86249i3498m8849j42060H0605j4917R5341
9656A61029c13414a52396M2726c2894I8309L6903C8594K45073h3226e811p9705
9645h5516A44987b84367m8948A77204a23799d8928l0637k1628C2325a57574A08785
$$ y = [-137268, 36189, 87214, -91611, 75852, -256144, -196879, -36914, -137984, -146872, -57677, -310906, -87441, -1895, -200505, -102433, -97298, 128335, -31312, -335164, 201655, -152354, -95948, -88393, 112695, -354798, 145549, 82029, -131987, -202053, 101583, -73632, -79696, -54296, 255336, -57141, -173218, 73677, 168951, 100384, -300335, 45615, -116015, -9132, -145218, -214159, -287958, -7366, -211757, -93263, -375083, -225915, -101151, -211160, 196612, -12244, 283588, 415924, 259203, 23721, -88995, 186249, -93498, -142347, -284407, 80605, 65688, 161029, -313414, -152396, -109670, -32894, 98309, 135212, 38594, 283667, -83226, -5811, -85516, 144987, -284367, -333315, 177204, -123799, -48928, -79565, -101193, 32325, -157574, 108785]
9633D02470b40143A07293h0899a1096j40661f0377p1605a2637k76825I606a09785
9621g3068b5253A9561f7288j30875C67715b07242m0085A07277b46397A93631H9049
9609G4390l5234J8766b02004D5957j1800i9010A35375b09142F6229b41386P1639
9598a69747E2054K4669a51955A33860h66I8043J6779k8061K8260d430l27629J36114
9586a95945L4473F3535Q210b01068E7524M049k3195c6605k90878A60239b2376
9574B57040c706q7908H4480a36135j76840J16744B3928i2497p0195L897M6958
9563a11837K9501A03586J8265b94235B03198b70088e484E178Q91b38279a8385
9551a59233M1587B32475a09676j10316c2907k8046l27444a54256e9309a7848H8996
$$ y = [402470, -240143, 107293, -80899, -11096, -151757, -60377, -131982, -12637, -289462, 9606, -109785, -73068, -25253, 19561, -67288, -198163, 367715, -207242, -247327, 107277, -246397, 193631, 89049, 74390, 39156, 57922, -202004, 45957, 34157, -99010, 135375, -209142, 66229, -241386, -169747, 52054, 76723, -151955, 133860, -866, 98043, 114822, 86761, 115021, -4430, -332059, -195945, -161472, 63535, 71745, -201068, 57524, 61573, 38378, -36605, -327483, 160239, -22376, 257040, -3706, -91614, 84480, -136135, -312975, -196231, 23928, -92497, -162692, -158795, -111837, -82336, 103586, 121851, -294235, 203198, -270088, -5484, 5178, 6069, -238279, -18385, -159233, -117646, 232475, -109676, -219992, -32907, -60953, -388397, -154256, -59309, -17848, 88996]
9539a11203A44890b56818I2181a61225A05124M5149g8416j94032J30989N2047
9529h9412j57483D4522a97336P9735d3488A50509b62736L5277P5071m1883c4300
9517B9059g1635c3511p0868A16192a66253a9168k63723a4934A38290a72018K4884
9506a47134b2506A3376e2259E3960g1003A61750b94745J4801i294l22044A7504
9494A8152N3180d7879j18314k3238A57180O790b74363n2199A3812g0320k99320
9483c69640D1320e10907a81127A0728a30031J3087G0550a89641H723p66a55906
9471B82426j20795F6341e5809j75296G0716c80775A88007q6180J67328c70762
9460a30870j50805A58888a89604O0886j25338N4472f3556B13129C563a78159b873
$$ y = [-111203, 144890, -256818, 92181, -161225, 105124, 150273, -78416, -272448, -141459, -89412, -246895, 44522, -197336, -117601, -43488, 150509, -262736, -227459, -152388, -194271, -34300, 29059, -71635, -33511, -104379, 116192, -166253, -19168, -282891, -14934, 138290, -172018, -147134, -22506, 13376, -52259, 53960, -71003, 161750, -294745, -279944, -9294, -331338, 17504, 18152, 71332, -47879, -166193, -189431, 157180, 163970, -274363, -326562, 13812, -70320, -369640, 41320, -510907, -181127, 10728, -130031, -116944, 70550, -189641, 8723, 7957, -155906, 282426, 161631, 66341, -55809, -231105, 70716, -380775, 188007, 101827, 269155, -370762, -130870, -281675, 158888, -189604, -128718, -254056, -199584, -63556, 213129, 3563, -178159, -2873]
9448d9969a591j04942b4591F7005c0142A03081n573a27149a378A64737L1351d2267
9435b48454A40974e27697G46b84754J23853d6424j03942K0842b0132o6877j44824
9424b31833j80136F730J1024h0105J9435j92501B42051b64818c4324B4057J70807
9413A94864e2461r6415e7221A00397a55956p1065h3248D4729a46662a5519j00440
9402a15959B12334H3186a71804P9851A96232d1460k69357a15281l0614k51450
9392c97345A92369G5045a12696A4178M43250A11236C7082c14922K6367g0935H5803
9380a69253C8349a22312r897n6210C26232a07465C9306K6261b19001p5168A71185
9368h3109j76099B03448M8957E2201c00949J24988E7983M1220J21573o6777c11901
$$ y = [-49969, -1591, -106533, -24591, 67005, -30142, 103081, 97508, -127149, -1378, 164737, 196088, -42267, -248454, 140974, -527697, 746, -284754, -160901, -46424, -150366, -129524, -20132, -87009, -231833, -411969, 6730, 17754, -80105, -60670, -253171, 242051, -264818, -34324, 24057, 194864, -52461, -148876, -57221, 100397, -155956, -227021, -83248, 44729, -146662, -15519, -115959, 212334, 83186, -171804, -91953, 196232, -41460, -310817, -115281, -145895, -397345, 192369, 75045, -112696, 14178, 457428, 111236, 37082, -314922, -288555, -70935, 85803, -169253, 38349, -122312, -132209, -188419, 326232, -107465, 39306, 65567, -219001, -294169, 171185, -83109, -259208, 203448, 252405, 52201, -300949, -175961, 57983, 99203, 220776, 153999, -311901]
9356B64110d4254k6569A438f3208C15591E2913A4704a43421A05787b9661B1083
9344C25056A19842d9711C51835g6295j74961a13727L6098A16873j3866a47491
9333D5897c28235A22946a27005k18627J40673j9187p9871b9090p4188M4814A1133
9321c63340D7260N8237a31739k03996J49197J9916m5012i0628m23983J97990Q2993
9310b33628L4117l3036F2312g1733J4983n6638k06404M3158G2807Q6524J41745
9299C01076a57428n32122F358b05648j59102D9402b91978L5658g0922o4509H3240
9287A37121J39282a76433j5230P9410E4332J13379i7799n523A40203E5945a00823
9275A68673c4298G4175a01535l37639a33079A2034a94963m9599J21084C9182h3667
$$ y = [264110, -44254, -70823, 1438, -63208, 315591, 52913, 14704, -143421, 105787, -29661, 21083, 325056, 119842, -49711, 351835, -76295, -251256, -113727, -77629, 116873, 103007, -147491, 45897, -328235, 122946, -127005, -345632, -204959, -224146, -304017, -29090, -103278, -58464, 11133, -363340, 47260, 105497, -131739, -335735, -186538, -166622, -211634, -90628, -514611, -316621, -233628, -199511, -232547, 62312, -71733, -56750, -113388, -319792, -276634, 72807, 159331, 301076, -157428, -689550, 6358, -205648, -364750, 49402, -291978, -256320, -70922, -135431, 83240, 137121, 276403, -176433, -191663, -112253, 54332, 167711, -97799, -103322, 140203, 55945, -100823, 168673, -34298, 74175, -101535, -439174, -133079, 12034, -194963, -244562, -123478, 39182, -83667]
9263B47929b36319A71459m7785a30779E345b93009N4989g551A9966a68646k3066
9252a91712g7530b2471n1581j36443i3456A50210J0556b67393A28770g6792j008
9241g7800D6269k0787b016A56506b621G1927A1545e0640a5242j35465e0997C0596
9228a25864N4299l52450a11856B08043l7375a92179j30084C51227a40126C0421
9217a71368k24488a00637p2834A7448c55201n1820A61328A2820M7456e6500l11861
9206c68361D9626K48841g0116j18887F3093j7642N1023H320Q2340a26214p638
9195a33852b9200D74140h0406J6517F3301a96049A4568i1509C5138c74739A64390
9183h5874b6033A39032h9839A75481b57942J4697g6128p3852D23476B02832h8625
$$ y = [247929, -236319, 171459, 123674, -130779, 5345, -293009, -238020, -7551, 19966, -168646, -191712, -77530, -22471, -74052, -210495, -93456, 150210, 160766, -267393, 128770, -76792, -77800, 46269, 25482, -2016, 156506, -2621, 71927, 11545, -50640, -15242, -150707, -50997, 30596, -125864, -71565, -424015, -111856, 208043, 170668, -192179, -322263, 351227, -140126, 30421, -171368, -395856, -100637, -173471, 17448, -355201, -407021, 161328, 12820, 60276, -56500, -368361, 49626, 298467, -70116, -189003, 63093, 45451, 96474, 8320, 90660, -126214, -133852, -29200, 474140, -80406, -63889, 63301, -196049, 14568, -91509, 35138, -374739, 164390, -85874, -26033, 139032, -89839, 175481, -257942, -243245, -76128, -149980, 423476, 202832, -88625]
9171B32176j03385J9554a4131A22556a71508G2636b74851d681j1947k03799f2012
9159e0476k3408j51057I6404c1952j68091A41871L5192E4455i4199p4117c2104
9147E3040m857J49539b23406B68157g66j83494A02541h4089j40073A0964J19124
9136A30088g5141K060k11658h3797j93626K2404d0273j13437k46054a24583B6750
9124c53817B5293g7364b1941n3771k93386B8188a02126k07326C16027F1689J65072
9113B26761b52718a13229C7008a41192j32981e3240o1379G9848e682p2121j14757
9102a92560P7811q2621P5043j2507B01142b98978K4773J26738A92904c16429i3680
9090B13725o1636b45003F8657b34809N9058m6790a09032f543j70186e908l92426
$$ y = [232176, 128791, 148345, -14131, 122556, -171508, 72636, -274851, -4681, -16628, -220427, -62012, -50476, -73884, -224941, 96404, -31952, -200043, 141871, 177063, 54455, -94199, -168316, -32104, 53040, 48183, 197722, -223406, 268157, -766, -184260, 102541, -84089, -224162, 10964, 130088, -75141, -73081, -284739, -83797, -277423, -255019, -40273, -153710, -399764, -124583, 26750, -353817, 25293, -77364, -21941, -75712, -369098, 28188, -102126, -309452, 316027, 61689, 226761, -252718, -113229, 37008, -141192, -274173, -53240, -114619, 79848, -5682, -77803, -192560, -114749, -197370, -122327, -134834, 201142, -298978, -274205, -147467, 192904, -316429, -93680, 213725, 152089, -245003, 68657, -234809, -175751, -222541, -109032, -6543, -176729, -5908, -398334]
9079c98334A11998b29880g0193j03169O2078j04402q9057a40138j4260A65070
9068A76241e0444B1599g0155B02939i8070A79681k8903m7609C5616f561B44086
9056A28469c78279G517c85644i6656j95551F9199a92818j83992J66905c1059A55846
9044A63764e8095p7108C32460j55853A103Q3334A1210a04409J831J3815C20816
9032a24567k9366b7658c736k03314A51704B9002L2643c4449B8502b64006f2207
9020C3551c66112k70051d547p1855j71527D4136c5742F1441J8987c00424J43577
9009a56847j95712a15780E2059R6724a2018F6275d16802f593l2735k9164F0750
8997A25782i3199j40466M4104A88203c5042A728J68133E8783a9927j28283C0331
$$ y = [-398334, 111998, -229880, -70193, -173362, -111284, -215686, -304743, -140138, -154398, 165070, 176241, -50444, 21599, -70155, 202939, -98070, 179681, 150778, 103169, 35616, -6561, 244086, 128469, -378279, 7517, -385644, -96656, -292207, 69199, -192818, -376810, -209905, -31059, 155846, 163764, -58095, -135203, 332460, 176607, 1103, 84437, 11210, -104409, -102578, -88763, 320816, -124567, -153933, -27658, -3736, -207050, 151704, 29002, 61645, -34449, 28502, -264006, -62207, 33551, -366112, -636163, -4547, -76402, -247929, 44136, -35742, 61441, 80428, -300424, -156847, -352559, -115780, 52059, 148783, -12018, 66275, -416802, -6593, -39328, -68492, 60750, 125782, -93199, -233665, -189561, 188203, -35042, 1728, 169861, 58783, -19927, -148210, 30331]
8985b36590A8721a41648l7490n9014a06684d9299o8204G7965h8498N922n0927
8974a33503I8705b76765B8243O1017b86691B87748j35576a93967D8800b4377l76502
8963d00879b00201J6415F2502J60855g2973l34123A12127a0548H1226J05348b16032
8951a30743n6529B14061C9462P9569a38067A71158A3313b82275a26369M2608A75175
8939b47407H3778h9272l0888c0373I9937b60356C388c36867A43185B3949b30131
8927A73219e18849H9567C2159e3307j15080A93016h43B550J87681B8834J30710
8916A59544K64933H7784l562K5902Q2477h9778G2129J63421M34070L43006m00517
8905F12109J646028K306183M539100C976631j846854H26180R3513D17008A51366
$$ y = [-236590, 18721, -141648, -179138, -238152, -106684, -49299, -117503, 77965, -88498, -82576, -133503, 98705, -276765, 28243, 89260, -286691, 287748, 152172, -193967, 48800, -24377, -400879, -200201, -183786, 62502, 223357, -72973, -407096, 112127, -10548, 81226, 186574, -216032, -130743, -187272, 214061, 39462, 119031, -138067, 171158, 13313, -282275, -126369, -83761, 175175, -247407, 83778, -89272, -120160, -30373, 99937, -260356, 3388, -336867, 143185, 23949, -230131, 173219, -518849, 89567, 32159, -53307, -168387, 193016, -843, 2550, 190231, 28834, 159544, 424477, 87784, 84222, 110124, 192601, -89778, 72129, 235550, 669620, 1012626, 612109, 2258137, 4564320, 9103420, 3976631, 2129777, 826180, 919693, 417008, 151366]
8895D87216A07243a59098B18910a6197F9468J53941J48159a12790p7115B22813
8884b06645b4315j41028B60457a32847A4290a00654A08530b94897C2405L27338
8874C59743h578q4252B2625f440k639m6889j05378j6818j1282B16724g8010d141
8861a52740j21702h2181l17536A68888N9220a10820p9029D592J66526A7437b78641
8849c03339F063J95901E0730c69051a29381B19577A00636D5355b66262a2712q2924
8838i5636E9504f4471n0348o7295A11274a9651j52678a3298C39952p9200a22967
$$ y = [487216, 107243, -159098, 218910, -16197, 69468, 223409, 371568, -112790, -189905, 222813, -206645, -24315, -165343, 260457, -132847, 14290, -100654, 108530, -294897, 32405, 359743, -8578, -92830, 22625, -6440, -9079, -55968, -161346, -178164, -189446, 216724, -78010, -4141, -152740, -274442, -82181, -399717, 168888, 228108, -110820, -189849, 4592, 171118, 17437, -278641, -303339, 6063, 201964, 50730, -369051, -129381, 219577, 100636, 45355, -266262, -12712, -95636, 59504, -64471, -114819, -182114, 111274, -19651, -172329, -13298, 339952, 260752, -122967]
$$ [...]
##END NTUPLES=NMR SPECTRUM
##END=
