
##TITLE=AC1197_CPAAH12060_5946785_4O4TSD0MWf
##JCAMPDX= 6.0         $$ Bruker NMR JCAMP-DX V2.0
##DATA TYPE= NMR SPECTRUM
##DATA CLASS= NTUPLES
##ORIGIN= BRUKER
##OWNER= Administrator
$$ 1.72 TOPSPIN		Version 2.1
$$ 2012-04-10 23:59:27.609 -0500  Administrator@TOPSPIN
$$ Compression mode = diff/dup
##.OBSERVE FREQUENCY= 400.13188235
##.OBSERVE NUCLEUS= ^1H
##.ACQUISITION MODE= SIMULTANEOUS (DQD)
##.ACQUISITION SCHEME= undefined
##.AVERAGES= 64
##.DIGITISER RES= 22
##SPECTROMETER/DATA SYSTEM= spect
##.PULSE SEQUENCE= noesygpps1d.comp
##.SOLVENT NAME= COFFEE_meoh
##.SHIFT REFERENCE= INTERNAL, COFFEE_meoh, 1, 14.96843
##AUDIT TRAIL= $$ (NUMBER, WHEN, WHO, WHERE, PROCESS, VERSION, WHAT)
$$ ##TITLE= Audit trail, TOPSPIN		Version 2.1
$$ ##JCAMPDX= 5.01
$$ ##ORIGIN= Bruker BioSpin GmbH
$$ ##OWNER= Administrator
$$ $$ C:\Bruker\TOPSPIN/data/COFFEE/nmr/AC1197_CPAAH12060_5946785_4O4TSD0MWf/12/pdata/1/auditp.txt
$$ ##AUDIT TRAIL=  $$ (NUMBER, WHEN, WHO, WHERE, PROCESS, VERSION, WHAT)
(   1,<2012-04-10 23:59:22.578 -0500>,<Administrator>,<TOPSPIN>,<go>,<TOPSPIN 2.1>,
      <created by zg
	started at 2012-04-10 23:47:51.000 -0500,
	POWCHK enabled, PULCHK disabled,
       configuration hash MD5:
       1A 1E CE 29 27 FD 77 03 67 4E F0 E3 C4 B2 CB 90
       data hash MD5: 64K
       E1 82 54 81 C3 C2 41 DC CE 9B F1 A5 18 B0 AE 46>)
(   2,<2012-04-10 23:59:25.328 -0500>,<Administrator>,<TOPSPIN>,<proc1d>,<TOPSPIN 2.1>,
      <Start of raw data processing
       efp LB = 0.3 FT_mod = 6 PKNL = 1 PHC0 = 0 PHC1 = 0 SI = 128K 
       data hash MD5: 128K
       F9 18 D8 E3 A9 B9 A0 34 D9 0C 71 89 3D 96 82 5F>)
(   3,<2012-04-10 23:59:26.562 -0500>,<Administrator>,<TOPSPIN>,<proc1d>,<TOPSPIN 2.1>,
      <pk PHC0 = 33.10181 PHC1 = 0 
       data hash MD5: 128K
       6C 6A 84 13 B5 D8 1D F5 79 C9 EC BB 0A 09 1B 2E>)
(   4,<2012-04-10 23:59:27.093 -0500>,<Administrator>,<TOPSPIN>,<proc1d>,<TOPSPIN 2.1>,
      <abs ABSG = 1 
       data hash MD5: 128K
       6C 78 E6 D1 B5 DD 7A CC 01 44 F8 FA A6 15 21 A0>)
(   5,<2012-04-10 23:59:27.171 -0500>,<Administrator>,<TOPSPIN>,<proc1d>,<TOPSPIN 2.1>,
      <abs ABSG = 2 
       data hash MD5: 128K
       D5 67 80 B7 5B 5F B7 C6 9F 82 87 D4 01 F8 1B 6C>)
(   6,<2012-04-10 23:59:27.296 -0500>,<Administrator>,<TOPSPIN>,<proc1d>,<TOPSPIN 2.1>,
      <abs ABSG = 3 
       data hash MD5: 128K
       5B AC 14 45 BE 32 ED 00 A8 DA 08 FA 02 01 E8 9C>)
(   7,<2012-04-10 23:59:27.468 -0500>,<Administrator>,<TOPSPIN>,<proc1d>,<TOPSPIN 2.1>,
      <abs ABSG = 4 
       data hash MD5: 128K
       74 DA 5D 08 19 36 04 64 3B 9E BA 04 3B 67 93 71>)
(   8,<2012-04-10 23:59:27.515 -0500>,<Administrator>,<TOPSPIN>,<proc1d>,<TOPSPIN 2.1>,
      <abs ABSG = 5 
       data hash MD5: 128K
       2F C4 68 2B 33 50 21 79 52 EF 8F CF 57 5A 22 C6>)
$$ ##END=
$$ 
$$ $$ hash MD5
$$ $$ 3F B5 B3 D8 46 31 70 BF 75 68 1A 12 E5 92 AB F0
##$RELAX= 
##$RELAX= 
##$RELAX= 
##$RELAX= 
##$RELAX= 
##$RELAX= 
##$RELAX= 
##$RELAX= 
$$ Bruker specific parameters
$$ [...]
##$TP07= 0
##$TPNAME0= <>
##$TPNAME1= <>
##$TPNAME2= <>
##$TPNAME3= <>
##$TPNAME4= <>
##$TPNAME5= <>
##$TPNAME6= <>
##$TPNAME7= <>
##$TPOAL= (0..7)
0.5 0.5 0.5 0.5 0.5 0.5 0.5 0.5
##$TPOFFS= (0..7)
0 0 0 0 0 0 0 0
##$TUNHIN= 0
##$TUNHOUT= 0
##$TUNXOUT= 0
##$USERA1= <user>
##$USERA2= <user>
##$USERA3= <user>
##$USERA4= <user>
##$USERA5= <user>
##$V9= 5
##$VALIST= <valist>
##$VCLIST= <CCCCCCCCCCCCCCC>
##$VD= 0
##$VDLIST= <DDDDDDDDDDDDDDD>
##$VPLIST= <PPPPPPPPPPPPPPP>
##$VTLIST= <TTTTTTTTTTTTTTT>
##$WBST= 1024
##$WBSW= 4
##$XGAIN= (0..3)
0 0 0 0
##$XL= 0
##$YL= 0
##$YMAX_a= 14031606
##$YMIN_a= -6194640
##$ZGOPTNS= <>
##$ZL1= 120
##$ZL2= 120
##$ZL3= 120
##$ZL4= 120
##$ABSF1= 14.96843
##$ABSF2= -5.584101
##$ABSG= 5
##$ABSL= 3
##$ALPHA= 0
##$AQORDER= 0
##$ASSFAC= 0
##$ASSFACI= 0
##$ASSFACX= 0
##$ASSWID= 0
##$AUNMP= <proc_prof1d_extract.lims>
##$AXLEFT= 0
##$AXNAME= <>
##$AXNUC= <1H>
##$AXRIGHT= 0
##$AXTYPE= 0
##$AXUNIT= <>
##$AZFE= 0.1
##$AZFW= 0.1
##$BCFW= 0
##$BC_mod= 0
##$BYTORDP= 0
##$COROFFS= 0
##$CY= 15
##$DATMOD= 1
##$DC= 0
##$DFILT= <>
##$DTYPP= 0
##$F1P= 0
##$F2P= 0
##$FCOR= 0.5
##$FTSIZE= 131072
##$FT_mod= 6
##$GAMMA= 0
##$GB= 0
##$INTBC= 1
##$INTSCL= 1
##$ISEN= 128
##$LB= 0.3
##$LEV0= 0
##$LPBIN= 0
##$MAXI= 10000
##$MC2= 0
##$MEAN= 0
##$ME_mod= 0
##$MI= 0
##$NCOEF= 0
##$NC_proc= -3
##$NLEV= 6
##$NOISF1= 0
##$NOISF2= 0
##$NSP= 0
##$NTH_PI= 0
##$NZP= 0
##$OFFSET= 14.96843
##$PC= 1
##$PHC0= 33.10181
##$PHC1= 0
##$PH_mod= 1
##$PKNL= yes
##$PPARMOD= 0
##$PPDIAG= 0
##$PPIPTYP= 0
##$PPMPNUM= 2147483647
##$PPRESOL= 1
##$PSCAL= 4
##$PSIGN= 0
##$PYNMP= <proc.py>
##$REVERSE= no
##$SF= 400.130004872408
##$SI= 131072
##$SIGF1= 0
##$SIGF2= 0
##$SINO= 400
##$SIOLD= 131072
##$SPECTYP= <>
##$SREGLST= <1H.CDCl3>
##$SSB= 0
##$STSI= 131072
##$STSR= 0
##$SW_p= 8223.68421052632
##$SYMM= 0
##$S_DEV= 0
##$TDeff= 65536
##$TDoff= 0
##$TI= <>
##$TILT= no
##$TM1= 0
##$TM2= 0
##$TOPLEV= 0
##$USERP1= <user>
##$USERP2= <user>
##$USERP3= <user>
##$USERP4= <user>
##$USERP5= <user>
##$WDW= 1
##$XDIM= 131072
##$YMAX_p= 520048788
##$YMIN_p= -380641367
##$CURPLOT= <Network HP LaserJet P1505>
##$CURPRIN= <$Network HP LaserJet P1505>
##$DFORMAT= <normdp>
##$LAYOUT= <+/1D_H.xwp>
##$LFORMAT= <normlp>
##$PFORMAT= <normpl>
##$SURQMSG= 1
$$ End of Bruker specific parameters
$$ ---------------------------------
##NTUPLES= NMR SPECTRUM
##VAR_NAME=  FREQUENCY,     SPECTRUM/REAL,   SPECTRUM/IMAG
##SYMBOL=    X,             R,               I
##VAR_TYPE=  INDEPENDENT,   DEPENDENT,       DEPENDENT
##VAR_FORM=  AFFN,          ASDF,            ASDF
##VAR_DIM=   131072,        131072,          131072
##UNITS=     HZ,            ARBITRARY UNITS, ARBITRARY UNITS
##FACTOR=    0.0627417313425165, 1,          1
##FIRST=     8223.62146879498, -3248,        -93226
##LAST=      0,             -556,            -93881
##MIN=       0,             -380641367,      0
##MAX=       8223.62146879498, 520048788,    0
$$ Real data points
##PAGE= N=1
##DATA TABLE= (X++(R..R)), XYDATA
$$ [...]
62884A493512j4626j4126j4408j5046j5816j6186j5584j4679j5036j6659j7326
62873A324020j5688j3589j3561j5128j5570j3828j1424r753q571p477o991p397
62861A185043p930p940p801q002q090p255n503l767l087l734m811m886l583k325
62847A106329k603l755l583j393Q41J046k73q91J46J506J610N96k62n08r62k138
62831A095706l212l163k421k390l486m698n163n063m633l545j996j273k203l757
62817A048703m307l658k839k453k356k530l077l635l884m264n108n503m478l034
62803I97577l248n163o377n414l900m233o210p367o189l688j815j389j880k565
62789I38139l225l779l865l209k302k017k403k436j433n1P31J025J477J816J127
$$ y = [1493512, 1478886, 1464760, 1450352, 1435306, 1419490, 1403304, 1387720, 1373041, 1358005, 1341346, 1324020, 1308332, 1294743, 1281182, 1266054, 1250484, 1236656, 1225232, 1215479, 1206908, 1199431, 1192440, 1185043, 1177113, 1169173, 1161372, 1153370, 1145280, 1138025, 1132522, 1128755, 1125668, 1121934, 1117123, 1112237, 1108654, 1106329, 1103726, 1099971, 1096388, 1094995, 1095836, 1096882, 1096609, 1095718, 1095864, 1097370, 1098980, 1099576, 1099314, 1098806, 1097844, 1095706, 1092494, 1089331, 1086910, 1084520, 1081034, 1076336, 1071173, 1066110, 1061477, 1057932, 1055936, 1054663, 1052460, 1048703, 1044396, 1040738, 1037899, 1035446, 1033090, 1030560, 1027483, 1023848, 1019964, 1015700, 1010592, 1005089, 1000611, 997577, 994329, 989166, 982789, 977375, 973475, 969242, 963032, 955665, 949476, 945788, 943973, 942584, 940704, 938139, 934914, 931135, 927270, 924061, 921759, 919742, 917339, 914903, 913470, 913419, 914150, 915175, 916652, 918468, 919595]
62774I19595m44j458r17O60K190L199L693L647L231L008L368L985M134L443K300
62759I53634J667K363M078N383N263M381M111M595M804M426M424N450O887Q067
62745A019533R357J1268J3251J4379J4819J5821J8250K1698K4931K6999K8051
62734A218357K9225L1363L3937L5751L6767L8351M1553M6018N0934N6060O1182
62723A679498O5646O9331P3325P8551Q4478R0209R6157J03257J10982J17681J22744
62712B691859J26934J30452J32256J31678J29172J24746J17113J05418R0726P4483
62702C854837N6393L5261J1434j2973l6208n7775p7300r3919j07284j18046j26657
62691C327763j32580j35353j35713j34838j33028j29908j25430j19929j13477
$$ y = [919595, 919151, 917693, 916776, 917436, 919626, 922825, 926518, 930165, 933396, 936404, 939772, 943757, 947891, 951334, 953634, 955301, 957664, 961742, 967125, 972388, 976769, 980880, 985475, 990279, 994705, 999129, 1004579, 1011466, 1019533, 1028890, 1040158, 1053409, 1067788, 1082607, 1098428, 1116678, 1138376, 1163307, 1190306, 1218357, 1247582, 1278945, 1312882, 1348633, 1385400, 1423751, 1465304, 1511322, 1562256, 1618316, 1679498, 1745144, 1814475, 1887800, 1966351, 2050829, 2141038, 2237195, 2340452, 2451434, 2569115, 2691859, 2818793, 2949245, 3081501, 3213179, 3342351, 3467097, 3584210, 3689628, 3780354, 3854837, 3911230, 3946491, 3957925, 3944952, 3908744, 3850969, 3773669, 3679750, 3572466, 3454420, 3327763, 3195183, 3059830, 2924117, 2789279, 2656251, 2526343, 2400913, 2280984, 2167507]
62682B167507j06149r8653r1849q5570p8886p1682o5167o0451n7208n4168n0395
62671A347329m5757m0642l5747l1772k8789k6047k2768j9017j5468j2534j0088
62660A058700p855n682l468j298L68J127J508K931O317J0843J4703J7139J9169
62647A114502K2003K5412K8454L1182L4478L8338M1830M5010M9240N4747N9469
62636A544665O1772O3105O6151P1172P6222Q0228Q3561Q5715Q5084Q1569P7058
62625B376302P2388O6005N6673M5441L3592K0629N995r015k2980l6465n0314o3107
62613B495144p2751p9595q5471r0264r2161r1137q9432q8008q5146p9521p2698
62602A568960o7250o3883o1593n9499n7218n4151m9718m4207l8784l4633l2094
$$ y = [2167507, 2061358, 1962705, 1870856, 1785286, 1706400, 1634718, 1569551, 1509100, 1451892, 1397724, 1347329, 1301572, 1260930, 1225183, 1193411, 1164622, 1138575, 1115807, 1096790, 1081322, 1068788, 1058700, 1050845, 1045163, 1041695, 1040397, 1040765, 1041892, 1043400, 1046331, 1052648, 1063491, 1078194, 1095333, 1114502, 1136505, 1161917, 1190371, 1221553, 1256031, 1294369, 1336199, 1381209, 1430449, 1485196, 1544665, 1606437, 1669542, 1735693, 1806865, 1883087, 1963315, 2046876, 2132591, 2217675, 2299244, 2376302, 2448690, 2514695, 2571368, 2616809, 2650401, 2671030, 2677025, 2668010, 2645030, 2608565, 2558251, 2495144, 2422393, 2342798, 2257327, 2167063, 2074902, 1983765, 1894333, 1806325, 1721179, 1641658, 1568960, 1501710, 1437827, 1376234, 1316735, 1259517, 1205366, 1155648, 1111441, 1072657, 1038024, 1005930]
62591A005930l0351k8031k4676k1424j9693j9398j9288j8647j7681j6507j5007
62580G75227j3623j3027j2964j2553j1643j0656r338p266n480n612p108p380n445
62567F53132l319k797k907k087j068j521k924k987p16K588N164O344O615P115
62553F60632Q684J0487J0453Q246O657Q282J1772J3653J3532J4795J9640K5811
62541H12644K9559L0120K9770L0709L3412L7316M1594M5437M8720N2251N6568
62530A248100O0695O3117O3822O4377O5793O7287O7377O5357O1192N4848M6542
62519A928507L7026K6890J5962M196p317j7372k6413l5910m5750n3673n7954n9433
62507A708759n9984o0086n9157n7392n5635n3849n1243m7894m4819m2360l9806
$$ y = [1005930, 975579, 947548, 922872, 901448, 881755, 862357, 843069, 824422, 806741, 790234, 775227, 761604, 748577, 735613, 723060, 711417, 700761, 691423, 684157, 678677, 673065, 665957, 658577, 653132, 649813, 647016, 644109, 642022, 640954, 639433, 636509, 633522, 632806, 635394, 640558, 646902, 653517, 660632, 669316, 679803, 690256, 698502, 705159, 713441, 725213, 738866, 752398, 767193, 786833, 812644, 842203, 872323, 902093, 932802, 966214, 1003530, 1045124, 1090561, 1139281, 1191532, 1248100, 1308795, 1371912, 1435734, 1500111, 1565904, 1633191, 1700568, 1765925, 1827117, 1881965, 1928507, 1965533, 1992423, 2008385, 2012581, 2005264, 1987892, 1961479, 1925569, 1879819, 1826146, 1768192, 1708759, 1648775, 1588689, 1529532, 1472140, 1416505, 1362656, 1311413, 1263519, 1218700, 1176340, 1136534]
62496A136534l6894l4356l2550l0789k8540k6325k4725k3374k1610j9467j7514
62485H40390j6225j5862j6268j6466j5319j3025j1106j0454j0256r328p548n347
62473F93186k793j00J841K475K536L171M660O762R452J2327J4062J3882J3151
62460G74612J4019J6689J9284K0577K1466K3439K6589K9872L2624L5130L7862
62449A052163M0691M3021M4645M6134M7961M9354M8738M5488M0599L5310K9852
62438A523956K3927J7467J0335K194o506j4386k0920k7341l4502m0848m4159m4532
62426A344685m3838m2742m0491l7517l5734l5601l5054l2454k8799k5727k2822
62415I63906j8577j3084q126n082l940l935l950k724N1K917M093L646L318M223
$$ y = [1136534, 1099640, 1065284, 1032734, 1001945, 973405, 947080, 922355, 898981, 877371, 857904, 840390, 824165, 808303, 792035, 775569, 760250, 747225, 736119, 725665, 715409, 706081, 698533, 693186, 690393, 690293, 692134, 694609, 697145, 700316, 704976, 711738, 721190, 733517, 747579, 761461, 774612, 788631, 805320, 824604, 845181, 866647, 890086, 916675, 946547, 979171, 1014301, 1052163, 1092854, 1135875, 1180520, 1226654, 1274615, 1323969, 1372707, 1418195, 1458794, 1494104, 1523956, 1547883, 1565350, 1575685, 1577879, 1571373, 1556987, 1536067, 1508726, 1474224, 1433376, 1389217, 1344685, 1300847, 1258105, 1217614, 1180097, 1144363, 1108762, 1073708, 1041254, 1012455, 986728, 963906, 945329, 932245, 924119, 919037, 915097, 911162, 907212, 904488, 904539, 907456, 911549, 915195, 918513, 922736]
62401I22736N767O897P365P575Q027R228J1307J3422J4366J4162J4233J5417J6699
62388A067201J6646J5388J4121J3190J1890R988Q065O035K618k936r357j4405
62376A138444j7049j8111j9168k1271k4231k6576k6729k4778k2552k1354k0423
62365H96202j8576j6397j5197j4354j1834p554m148l468m065l431j412K28P64
62352G96758J343L093N818Q567J0424J0787R832Q895R489J1690J4011J4896J3945
62339I19548J1784R419P650O581N557L994K076L36j156k557l561l767l559l806
62325I48539m601n092m538k964o92J998M672O931R011J1597J4904J8503K2190
62312A020458K6309L0924L5282L8649M1327M4531M9334N5805O2868O9045P3684
$$ y = [922736, 928503, 935400, 942765, 950340, 958367, 967595, 978902, 992324, 1006690, 1020852, 1035085, 1050502, 1067201, 1083847, 1099235, 1113356, 1126546, 1138436, 1148424, 1156489, 1162524, 1165142, 1162206, 1152849, 1138444, 1121395, 1103284, 1084116, 1062845, 1038614, 1012038, 985309, 960531, 937979, 916625, 896202, 877626, 861229, 846032, 831678, 819844, 812290, 808142, 804674, 800609, 797178, 795766, 795994, 796758, 798101, 801194, 807012, 815579, 826003, 836790, 846622, 855517, 865006, 876696, 890707, 905603, 919548, 931332, 940751, 948401, 954982, 960539, 964533, 966609, 966945, 965789, 963232, 959671, 955904, 952345, 948539, 943938, 938846, 934308, 931344, 930652, 932650, 937322, 944253, 953264, 964861, 979765, 998268, 1020458, 1046767, 1077691, 1112973, 1151622, 1192949, 1237480, 1286814, 1342619, 1405487, 1474532, 1548216]
62301A548216P7378Q0759Q3083Q2964Q0539P7805P6117P4216O9574O1145M9939
62290B361735L7290K3828J0266k129j2650k2035l1301m0048m6885n1553n5469
62279B171049n9706o3365o4854o4194o2904o1753n9912n6616n2577m9073m6360
62268A529735m3753m0825l7851l5397l3883l3249l2565l0582k7151k3684k1494
62257A169301k0223j8621j6453j4508j2963j0934p979n145l849m162m723m340
62245A045401l351l254m980p782j0131j1474j2393j3105j2820j1129q999p573
62233I38410o589n014k738o54P15J744K992M739O993R322J1028J2074J3422J5700
62219A002144J8166J9893K1281K3237K5436K6843K7488K8198K8906K9112K9723
$$ y = [1548216, 1625594, 1706353, 1789436, 1872400, 1952939, 2030744, 2106861, 2181077, 2250651, 2311796, 2361735, 2399025, 2422853, 2433119, 2430990, 2418340, 2396305, 2365004, 2324956, 2278071, 2226518, 2171049, 2111343, 2047978, 1983124, 1918930, 1856026, 1794273, 1734361, 1677745, 1625168, 1576095, 1529735, 1485982, 1445157, 1407306, 1371909, 1338026, 1304777, 1272212, 1241630, 1214479, 1190795, 1169301, 1149078, 1130457, 1114004, 1099496, 1086533, 1075599, 1067620, 1062475, 1058626, 1054464, 1049741, 1045401, 1042050, 1038796, 1033816, 1026034, 1015903, 1004429, 992036, 978931, 966111, 954982, 945983, 938410, 931821, 926807, 924069, 923415, 924130, 925874, 928866, 933605, 940598, 949920, 960948, 973022, 986444, 1002144, 1020310, 1040203, 1061484, 1084721, 1110157, 1137000, 1164488, 1192686, 1221592, 1250704, 1280427]
62208A280427L2478L7121M1175M3229M4683M7348N0977N4335N7389O0980O5143
62197A815285O8925P1320P1567O9261O4944N9805N3969M5937L4672K1494Q866
62186B386045k062j1722k0732k9446l8301m7294n5294o1030o4678o7423o9537
62175A918526o9901o7618o3116n7497n1629m6192m1855l8716l5898l2195k7318
62164A386591k2297j8482j6166j4344j2031r448p472o270n293m485m384m850m865
62151A256204m122l680m147m265k540L66K277K349J960K562L817M532M706N751
62137A265770Q624J2261J4384J3973J2482J2226J3919J6462J8819K0991K3097
62126A433008K4711K5676K6540K7584K8292K8382K8483K9139L0071L1191L3190
$$ y = [1280427, 1312905, 1350026, 1391201, 1434430, 1479113, 1526461, 1577438, 1631773, 1689162, 1750142, 1815285, 1884210, 1955530, 2027097, 2096358, 2161302, 2221107, 2275076, 2321013, 2355685, 2377179, 2386045, 2383983, 2372261, 2351529, 2322083, 2283782, 2236488, 2181194, 2120164, 2055486, 1988063, 1918526, 1848625, 1781007, 1717891, 1660394, 1608765, 1562573, 1520718, 1482002, 1446104, 1413909, 1386591, 1364294, 1345812, 1329646, 1315302, 1303271, 1293823, 1286351, 1280081, 1274788, 1270303, 1265919, 1261069, 1256204, 1252082, 1248402, 1244255, 1239990, 1237450, 1237816, 1240093, 1242442, 1244402, 1246964, 1250781, 1255313, 1260019, 1265770, 1274394, 1286655, 1301039, 1315012, 1327494, 1339720, 1353639, 1370101, 1388920, 1409911, 1433008, 1457719, 1483395, 1509935, 1537519, 1565811, 1594193, 1622676, 1651815, 1681886, 1713077, 1746267]
62115A746267L6151L8684L9716M0362M2497M6094M9495N1897N3916N5963N7623
62104B258665N8714N9336N8573N4641M6982L7285K7942K0202J3974Q553L160k452
62092B645575p645j1637j4435j6498j7805j8357j9155k1172k3404k3538k1007
62081B450922j7848j5973j4980j3503j1376r416q018p103o712o611n904m019j658
62068B327801J45J472L236N779Q564J0999J2990J4758J6752J9456K2812K6069
62056B470833K8597L0511L2196L3678L4876L6001L7230L8540M0268M3071M6743
62045B872544M9838N1369N2217N3915N6603N9246O1377O3472O5820O8242P0787
62034C525430P3561P5856P6487P5102P2218O8228O3588N9958N9453O2190O5860
$$ y = [1746267, 1782418, 1821102, 1860818, 1901180, 1943677, 1989771, 2039266, 2091163, 2145079, 2201042, 2258665, 2317379, 2376715, 2435288, 2489929, 2536911, 2574196, 2602138, 2622340, 2636314, 2644867, 2648027, 2645575, 2637930, 2626293, 2611858, 2595360, 2577555, 2559198, 2540043, 2518871, 2495467, 2471929, 2450922, 2433074, 2417101, 2402121, 2388618, 2377242, 2367826, 2359808, 2352705, 2345993, 2339382, 2333478, 2329459, 2327801, 2327946, 2329418, 2332654, 2338433, 2346997, 2357996, 2370986, 2385744, 2402496, 2421952, 2444764, 2470833, 2499430, 2529941, 2562137, 2595815, 2630691, 2666692, 2703922, 2742462, 2782730, 2825801, 2872544, 2922382, 2973751, 3025968, 3079883, 3136486, 3195732, 3257109, 3320581, 3386401, 3454643, 3525430, 3598991, 3674847, 3751334, 3826436, 3898654, 3966882, 4030470, 4090428, 4149881, 4212071, 4277931]
62023D277931O8365O9655P0230O9342O6166O1852N8757N7891N8437N9586O1458
62012D979670O4175O7311P0763P4980P9805Q4051Q6946Q9237R1870R4123R4069
62001E877000R0870Q5724Q0419P5641P0841O5179N8273N0592M3447L8133L4570
61990F570689L1141K6360K0465J4954J0835P904N490L204J021p51j542j210n53
61977F688007m37n88j66M47j71k233m056m434m393n418p299r113j1196j4221j7021
61962F607708j7673j6432j5297j4594j2500q786o372p588j0656j1791r653o103
61950F470263l476k706l365m080l392j460k26p58j519p29O86N86q69j609j150
61935F446196j185k726n156q354j3078j8609k2603k4535k6832l1155l5758l8346
$$ y = [4277931, 4346296, 4415951, 4486181, 4555523, 4621689, 4683541, 4742298, 4800189, 4858626, 4918212, 4979670, 5043845, 5111156, 5181919, 5256899, 5336704, 5420755, 5507701, 5596938, 5688808, 5782931, 5877000, 5967870, 6053594, 6134013, 6209654, 6280495, 6345674, 6403947, 6454539, 6497986, 6536119, 6570689, 6601830, 6628190, 6648655, 6663609, 6674444, 6682348, 6687838, 6691042, 6692063, 6691312, 6689770, 6688560, 6688007, 6687570, 6686982, 6686816, 6687263, 6687092, 6684859, 6680803, 6676369, 6671976, 6666558, 6659259, 6650146, 6638950, 6624729, 6607708, 6590035, 6573603, 6558306, 6543712, 6531212, 6522426, 6516054, 6508466, 6497810, 6486019, 6476366, 6470263, 6466787, 6464081, 6460716, 6456636, 6453244, 6451784, 6451558, 6450800, 6449281, 6448552, 6449238, 6449824, 6448955, 6447346, 6446196, 6445011, 6442285, 6437129, 6428775, 6415697, 6397088, 6374485, 6349950, 6323118, 6291963, 6256205, 6217859]
61923F217859l9555m1402m3809m5154m5321m5833m7358m9142n0575n1622n1914
61912E706174n1174n0313n0571n1645n2106n1397n0028m8150m5704m3555m2688
61901E168843m2400m1222l9445l8633l8559l7121l3777l0530k8632k6761k3757
61890D788006k0905j9542j8426j5674j1925r255p931o499m423k245N45N329J1775
61877D688830J7536K1100K3362K5789K8719L2251L7297M4480N2845O0762O7768
61866E100739P4869Q3432R4252J07052J20513J33387J46149J60952J79396K00935
61856F401676K24055K48413K74989L04736L38064L75245M16164M59688N04443
61847I547473N50432N99020O51030P05802P62414Q20697Q80009R37422R87745
$$ y = [6217859, 6178304, 6136902, 6093093, 6047939, 6002618, 5956785, 5909427, 5860285, 5809710, 5758088, 5706174, 5655000, 5604687, 5554116, 5502471, 5450365, 5398968, 5348940, 5300790, 5255086, 5211531, 5168843, 5126443, 5085221, 5045776, 5007143, 4968584, 4931463, 4897686, 4867156, 4838524, 4811763, 4788006, 4767101, 4747559, 4729133, 4713459, 4701534, 4692279, 4684348, 4677849, 4673426, 4671181, 4671726, 4677055, 4688830, 4706366, 4727466, 4750828, 4776617, 4805336, 4837587, 4874884, 4919364, 4972209, 5032971, 5100739, 5175608, 5259040, 5353292, 5460344, 5580857, 5714244, 5860393, 6021345, 6200741, 6401676, 6625731, 6874144, 7149133, 7453869, 7791933, 8167178, 8583342, 9043030, 9547473, 10097905, 10696925, 11347955, 12053757, 12816171, 13636868, 14516877, 15454299, 16442044]
61838A6442044J024812J041793J030498R81575Q86323P39349N41385L01566L7219
61829B3026564k29977m79370o94729q65317r86764j061696j097716j102961j083293
61820A5424741j043466r89255r26988q61464p95341p30158o67117o07169n51301
61811H252482n00663m55755m15768l79323l45650l14478k85491k58750k35032
61802E061572k14714j96755j79931j64534j51491j40122j28550j16391j05317
61793C663767r6534q9242q2160p5150o8468o1666n4345m7127m0949l6015l2109
61782B980002k9171k6810k4101k0679j7380j4890j2523r269n474k419o09N10J573
61769B818760K871M679P004R131J0354J1116J2702J5812K0034K4642K9119L3032
$$ y = [16442044, 17466856, 18508649, 19539147, 20520722, 21407045, 22146394, 22687779, 22989345, 23026564, 22796587, 22317217, 21622488, 20757171, 19770407, 18708711, 17610995, 16508034, 15424741, 14381275, 13392020, 12465032, 11603568, 10808227, 10078069, 9410952, 8803783, 8252482, 7751819, 7296064, 6880296, 6500973, 6155323, 5840845, 5555354, 5296604, 5061572, 4846858, 4650103, 4470172, 4305638, 4154147, 4014025, 3885475, 3769084, 3663767, 3567233, 3477991, 3395831, 3320681, 3252213, 3190547, 3136202, 3089075, 3048126, 3012111, 2980002, 2950831, 2924021, 2899920, 2879241, 2861861, 2846971, 2834448, 2825179, 2819705, 2817286, 2816677, 2817187, 2818760, 2821631, 2826310, 2833314, 2842445, 2852799, 2863915, 2876617, 2892429, 2912463, 2937105, 2966224, 2999256]
61757B999256L6221L9290M3250M8352N3813N8977O4301P0698P8108Q5310R1335
61746C668911R6809J03405J12023J21976J32211J42632J53754J65629J78078J91566
61736E066994K06742K23254K40245K58068K78208L01240L26117L52104L80186
61727G633158M11928M47993M88577N34088N84464O38742O96410P58431Q26043
61718A3019834Q99247R77326J059978J146923J237302J330635J427443J527275
61710B2625963J626476J718926J798049J856028J880868J855807J762603J586053
61702C6710773J317983R61093N31831N9697m17815q62909j245479j548541j768244
61693C3738389j908808j977703j985001j944153j869548j772440j660309j539626
$$ y = [2999256, 3035477, 3074767, 3118017, 3166369, 3220182, 3279159, 3343460, 3414158, 3492266, 3577576, 3668911, 3765720, 3869125, 3981148, 4103124, 4235335, 4377967, 4531721, 4697350, 4875428, 5066994, 5273736, 5496990, 5737235, 5995303, 6273511, 6574751, 6900868, 7252972, 7633158, 8045086, 8493079, 8981656, 9515744, 10100208, 10738950, 11435360, 12193791, 13019834, 13919081, 14896407, 15956385, 17103308, 18340610, 19671245, 21098688, 22625963, 24252439, 25971365, 27769414, 29625442, 31506310, 33362117, 35124720, 36710773, 38028756, 38989849, 39521680, 39581377, 39163562, 38300653, 37055174, 35506633, 33738389, 31829581, 29851878, 27866877, 25922724, 24053176, 22280736, 20620427, 19080801]
61685A9080801j417109j297947j184614j078146r79495q89257q07295p33160o66237
61676A0027541o05541n50298n00581m56449m16779l80260l46996l17638k91302
61667F161697k66332k42860k22493k05332j89599j74513j61179j49942j39354
61658D410093j28813j19827j13201j07130r9856r2316q6249q1377p6480p1790
61648C433054o8110o4805o0922n7351n5573n5089n4349n3464n3403n3023m9920
61637B807045m4516m0509m0276m1987m2437m0922l9085l8277l8341l8157l6538
61626B366000l3329l0093k8672k8689k7759k4876k2045k1374k1907k0962j7887
61615B088407j4714j3366j3742j4604j4977j4387j2886j1394j1188j2383j3494
$$ y = [19080801, 17663692, 16365745, 15181131, 14102985, 13123490, 12234233, 11426938, 10693778, 10027541, 9422000, 8871702, 8371121, 7914672, 7497893, 7117633, 6770637, 6452999, 6161697, 5895365, 5652505, 5430012, 5224680, 5035081, 4860568, 4699389, 4549447, 4410093, 4281280, 4161453, 4048252, 3941122, 3841266, 3748950, 3662701, 3581324, 3504844, 3433054, 3364944, 3300139, 3239217, 3181866, 3126293, 3071204, 3016855, 2963391, 2909988, 2856965, 2807045, 2762529, 2722020, 2681744, 2639757, 2597320, 2556398, 2517313, 2479036, 2440695, 2402538, 2366000, 2332671, 2302578, 2273906, 2245217, 2217458, 2192582, 2170537, 2149163, 2127256, 2106294, 2088407, 2073693, 2060327, 2046585, 2031981, 2017004, 2002617, 1989731, 1978337, 1967149, 1954766, 1941272]
61604A941272j3107j1686j0958j1643j2410j1557r352p958q808j0602j0732q498
61592A813961n908n019n512n690m967m112l500k651j666j574k497k765r86J736
61578A768850L003K227J213J579K820L461L216L117L959N270N903N212L731K780
61564A816341L285M782N753N038K811K45j459j773j169q97j956l979n558o068
61550A815396o547q312j1107j3416j4295j4177j3863j3503j2870j2023j1209j0290
61538A673784q775o529m185k631k094j970j617r52p3J318L605O544R473J2034
61524A677932J4136J5504J6209J7432K0531K5114K9305L2158L4608L7447L9920
61513A960296M1347M2741M5386M8713N1154N2466N3686N5233N6591N7531N8209
$$ y = [1941272, 1928165, 1916479, 1905521, 1893878, 1881468, 1869911, 1860559, 1852601, 1843793, 1833191, 1822459, 1813961, 1808053, 1803034, 1797522, 1791832, 1786865, 1782753, 1779253, 1776602, 1774936, 1773362, 1770865, 1768100, 1767114, 1768850, 1771853, 1774080, 1775293, 1776872, 1779692, 1783153, 1786369, 1789486, 1793445, 1798715, 1804618, 1809830, 1813561, 1816341, 1819626, 1824408, 1830161, 1835199, 1838010, 1838255, 1836796, 1835023, 1833854, 1832957, 1831001, 1827022, 1821464, 1815396, 1808849, 1800537, 1789430, 1776014, 1761719, 1747542, 1733679, 1720176, 1707306, 1695283, 1684074, 1673784, 1665009, 1658480, 1654295, 1651664, 1649570, 1647600, 1645983, 1645031, 1644958, 1646276, 1649881, 1656425, 1665898, 1677932, 1692068, 1707572, 1723781, 1741213, 1761744, 1786858, 1816163, 1848321, 1882929, 1920376, 1960296, 2001643, 2044384, 2089770, 2138483, 2189637, 2242103, 2295789, 2351022, 2407613, 2465144, 2523353]
61502B523353N8196N6890N4752N2769N0790M7924M4497M1828L9864L6816L1861
61491C039540K6601K2867K0313J7221J2858P946L306j026n470j0103j4227j6853
61479C102973j7959j8860k0418k1388j9878j6277j3076j1454r764o096p57M793
61467B951839J0135J5743K1671K7722L4293M1884N0239N8912O8174P8440Q9366
61456C448418J00515J12518J26391J41880J57507J72417J87380K03760K22009
61447D872795K41445K61171K80962L01084L21428L41170L59556L76242L90065
61438G745918L97961L96378L83593L59308L22315K70753K05778J33211O0043r837
61428A0265421p5445j35508j87194k27832k56586k74481k83533k85647k81693
$$ y = [2523353, 2581549, 2638439, 2693191, 2745960, 2796750, 2844674, 2889171, 2930999, 2970863, 3007679, 3039540, 3066141, 3089008, 3109321, 3126542, 3139400, 3147346, 3150652, 3149626, 3144156, 3134053, 3119826, 3102973, 3085014, 3066154, 3045736, 3024348, 3004470, 2988193, 2975117, 2963663, 2953899, 2947803, 2947046, 2951839, 2961974, 2977717, 2999388, 3027110, 3061403, 3103287, 3153526, 3212438, 3280612, 3359052, 3448418, 3548933, 3661451, 3787842, 3929722, 4087229, 4259646, 4447026, 4650786, 4872795, 5114240, 5375411, 5656373, 5957457, 6278885, 6620055, 6979611, 7355853, 7745918, 8143879, 8540257, 8923850, 9283158, 9605473, 9876226, 10082004, 10215215, 10275258, 10265421, 10189976, 10054468, 9867274, 9639442, 9382856, 9108375, 8824842, 8539195, 8257502]
61419H257502k71786k56765k38656k19178j98607j76716j54041j31352j08819
61410F501582q6637o5719m6581k8197r312R539K6591M1086N3698O4942P4417Q1807
61398F617216Q7588R2429R6462R9252J00107R8706R5840R3081R1166Q9258Q6579
61387G647684Q3907Q2421Q1617P9886P6989P4500P3509P3027P1129O6929O1067
61376H472665N4789M8856M2924L5842K6819J6402O059l200j1563j9977k8994l7843
61364H602779m4744m8747n1157n4101n7541n8951n6494n1250m5462l9997l4661
61353H059674k9721k5573k1650j7184j2483q272m547j529p41l337p939j1972j4652
61340G900074j6763j7923j6372j1583m937K656J2107K4585M0201N8701P9974J03300
$$ y = [8257502, 7985716, 7728951, 7490295, 7271117, 7072510, 6895794, 6741753, 6610401, 6501582, 6414945, 6349226, 6302645, 6274448, 6265136, 6274675, 6301266, 6342352, 6396050, 6460992, 6535409, 6617216, 6704804, 6797233, 6893695, 6992947, 7093054, 7191760, 7287600, 7380681, 7471847, 7561105, 7647684, 7731591, 7814012, 7895629, 7975515, 8052504, 8127004, 8200513, 8273540, 8344669, 8411598, 8472665, 8527454, 8576310, 8619234, 8655076, 8681895, 8698297, 8704356, 8701156, 8689593, 8669616, 8640622, 8602779, 8558035, 8509288, 8458131, 8404030, 8346489, 8287538, 8231044, 8179794, 8134332, 8094335, 8059674, 8029953, 8004380, 7982730, 7965546, 7953063, 7944791, 7940244, 7938715, 7937974, 7934637, 7926698, 7914726, 7900074, 7883311, 7865388, 7849016, 7837433, 7832496, 7835152, 7847259, 7871844, 7912045, 7970746, 8050720, 8154020]
61328H154020J27464J52150J78168K05908K34680K63645K92229L19585L45103
61319A0272952L69333L92598M12482M24626M26486M18238L99394L67016L18924
61310A3802049K57001J85800J09340L0974m5094j14724j76309k30904k79922l23513
61300A3214698l60798l90686m12611m26999m34743m35996m30448m19100m04525
61291I498792l88417l70105l48572l24851l00967k77389k53210k28324k03799
61282F803158j80281j57467j35180j13733r3115p2908n3267l5022j8607l594J0592
61271E950576K4150L7050M9065N9537O7739P3574P7616Q0488Q2550Q3872Q4020
61260F670237Q2163P7988P2318O6337O0382N3992M6909L9579L2876K7591K3728
$$ y = [8154020, 8281484, 8433634, 8611802, 8817710, 9052390, 9316035, 9608264, 9927849, 10272952, 10642285, 11034883, 11447365, 11871991, 12298477, 12716715, 13116109, 13483125, 13802049, 14059050, 14244850, 14354190, 14385164, 14340070, 14225346, 14049037, 13818133, 13538211, 13214698, 12853900, 12463214, 12050603, 11623604, 11188861, 10752865, 10322417, 9903317, 9498792, 9110375, 8740270, 8391698, 8066847, 7765880, 7488491, 7235281, 7006957, 6803158, 6622877, 6465410, 6330230, 6216497, 6123382, 6050474, 5997207, 5962185, 5943578, 5939984, 5950576, 5974726, 6011776, 6060841, 6120378, 6188117, 6261691, 6339307, 6419795, 6502345, 6586217, 6670237, 6752400, 6830388, 6902706, 6969043, 7029425, 7083417, 7130326, 7169905, 7202781, 7230372, 7254100]
61249G254100J9895J4155O110k502j0136j7536k6410l6674m6463n4567o1426o7755
61237F970791p3654p9254q4878r0113r3890r5923r7002r7504r6709r4086r0199
61226E977579q5673q0318p4047o7614o1510n5107m7974m1287l6627l3817l1404
61215E362201k9093k8248k9683l2164l3698l3565l2454l1125k9496k6823k2308
61204E033544j5730p725O49Q745J6759K5456L5635M7692O1191P4919Q7877J00309
61192E469321J13309J27361J41716J55198J67013J76472J82561J84106J80017
61183F897074J69124J50371J23515Q9171M8024Q83m9908j00064j45384j83795
61173F999011k14622k36710k48824k51793k48739k42703k34844k24970k12732
$$ y = [7254100, 7273995, 7288150, 7294260, 7291758, 7281622, 7264086, 7237676, 7201002, 7154539, 7099972, 7038546, 6970791, 6897137, 6817883, 6733005, 6642892, 6549002, 6453079, 6356077, 6258573, 6161864, 6067778, 5977579, 5891906, 5811588, 5737541, 5669927, 5608417, 5553310, 5505336, 5464049, 5427422, 5393605, 5362201, 5333108, 5304860, 5275177, 5243013, 5209315, 5175750, 5143296, 5112171, 5082675, 5055852, 5033544, 5017814, 5010089, 5010738, 5019483, 5036242, 5061698, 5097333, 5145025, 5206216, 5281135, 5369012, 5469321, 5582630, 5709991, 5851707, 6006905, 6173918, 6350390, 6532951, 6717057, 6897074, 7066198, 7216569, 7340084, 7429255, 7477279, 7478162, 7428254, 7328190, 7182806, 6999011, 6784389, 6547679, 6298855, 6047062, 5798323, 5555620, 5320776, 5095806, 4883074]
61164D883074j97974j81140j63927j48601j35898j24265j11811r8554q6184p6187
61154C558533o8774o3106n7903n2105m5438l8295l0959k3437j6147r997n361j545
61142C145466K271O175R868J3124J5414J5939J4698J2817J1062Q765M928j91n506
61129C254830j0407j4763j8335k1185k4309k8573l3298l6935l9005m0404m1907
61118B945709m3301m4064m4013m3236m2046m1079m0775m0792m0404l9399l8246
61107B488354l7683l8458m0885m4092m6371m6977m6968m7449m7864m7081m5346
61096A999180m3749m2380m0538l8377l6739l5620l4406l3557l4167l5724l6097
61085A587826l4418l2295l1374l1115l0007k7797k5368k3076k0361j6780j2642
$$ y = [4883074, 4685100, 4503960, 4340033, 4191432, 4055534, 3931269, 3819458, 3720904, 3634720, 3558533, 3489759, 3426653, 3368750, 3316645, 3271207, 3232912, 3201953, 3178516, 3162369, 3152372, 3147011, 3145466, 3147737, 3153912, 3163780, 3176904, 3192318, 3208257, 3222955, 3235772, 3246834, 3255599, 3260527, 3260336, 3254830, 3244423, 3229660, 3211325, 3190140, 3165831, 3137258, 3103960, 3067025, 3028020, 2987616, 2945709, 2902408, 2858344, 2814331, 2771095, 2729049, 2687970, 2647195, 2606403, 2565999, 2526600, 2488354, 2450671, 2412213, 2371328, 2327236, 2280865, 2233888, 2186920, 2139471, 2091607, 2044526, 1999180, 1955431, 1913051, 1872513, 1834136, 1797397, 1761777, 1727371, 1693814, 1659647, 1623923, 1587826, 1553408, 1521113, 1489739, 1458624, 1428617, 1400820, 1375452, 1352376, 1332015, 1315235, 1302593]
61074A302593q585m922j439K130N344P209P526P571Q693J0618J2123J2937J3829
61061A375627J4994J5800J6106J6535J7144J7032J5612J3398J1341J0254J0801
61050A534644J2818J4768J5028J3781J2316J0677P802M021J340M95k95k570n300
61037A619525o519n906m522l230k694l874p010j0686j3127j3966j4028j4088j4718
61024A505157j6401j8674j9907j9035j6970j5239j3986j2478j0948j0332j0401
61013A340786r708p685n596m848n183n200m251l083k643k729k306j038J10J30
60999A286756p13j362j292o35N53K134L276L188K490K721M319O124P062P291P426
60984A329338P640P963Q583R590J0984J3062J5970J9065K1471K3184K4673K5880
$$ y = [1302593, 1294008, 1289086, 1287647, 1289777, 1295121, 1302330, 1309856, 1317427, 1326120, 1336738, 1348861, 1361798, 1375627, 1390621, 1406421, 1422527, 1439062, 1456206, 1473238, 1488850, 1502248, 1513589, 1523843, 1534644, 1547462, 1562230, 1577258, 1591039, 1603355, 1614032, 1621834, 1625855, 1627195, 1627690, 1627395, 1624825, 1619525, 1613006, 1607100, 1602578, 1599348, 1596654, 1592780, 1585770, 1575084, 1561957, 1547991, 1533963, 1519875, 1505157, 1488756, 1470082, 1450175, 1431140, 1414170, 1398931, 1384945, 1372467, 1361519, 1351187, 1340786, 1331078, 1323393, 1317797, 1312949, 1307766, 1302566, 1298315, 1295232, 1292589, 1289860, 1287554, 1286516, 1286626, 1286756, 1286043, 1284681, 1283389, 1282754, 1283307, 1285441, 1288717, 1291905, 1294395, 1297116, 1301435, 1307559, 1314621, 1321912, 1329338, 1336978, 1344941, 1353524, 1363114, 1374098, 1387160, 1403130, 1422195, 1443666, 1466850, 1491523, 1517403]
60972A517403K6760K8300L1382L4995L7463L9169M1922M5597M7865M7832M7536
60961A946224M8944N1537N4058N6700O0291O4815O9974P5962Q2742Q9695R6639
60950B697581J04017J11780J19608J28396J39499J52300J64720J76500J89403
60941C983804K03739K17773K31584K48364K70501K97381L28566L65860M10056
60932F557628M58784N09964N64866O25879O94249P71756Q60814R60604J067600
60923A3072144J182951J314712J469472J647897J853079K095346K381224K706125
60915B7722950L066722L460207L833472M028811L831430L133721K070821R68965
60907E2117099J36247l03018l92362k26286R3687M00263M43355J8805q58694j932588
$$ y = [1517403, 1544163, 1572463, 1603845, 1638840, 1676303, 1715472, 1757394, 1802991, 1850856, 1898688, 1946224, 1995168, 2046705, 2100763, 2157463, 2217754, 2282569, 2352543, 2428505, 2511247, 2600942, 2697581, 2801598, 2913378, 3032986, 3161382, 3300881, 3453181, 3617901, 3794401, 3983804, 4187543, 4405316, 4636900, 4885264, 5155765, 5453146, 5781712, 6147572, 6557628, 7016412, 7526376, 8091242, 8717121, 9411370, 10183126, 11043940, 12004544, 13072144, 14255095, 15569807, 17039279, 18687176, 20540255, 22635601, 25016825, 27722950, 30789672, 34249879, 38083351, 42112162, 45943592, 49077313, 51148134, 52117099, 52253346, 51950328, 51557966, 51331680, 51425367, 51825630, 52268985, 52287790, 51429096, 49496508]
60897D9496508k873912l480975l738072l734053l565363l302928k998867k688642
60889B3113696k388787k105419j844498j610132j399722j208974j039428q95837
60881A0620899p78740o84356o09166n49760n00372m55692m15262l81071l51884
60872E894596l23926k96183k70979k49409k30044k12377j98162j88311j80936
60863C744269j73500j65120j56157j47012j38005j29428j21192j13052j05118
60854B495685r7639r0604q4098p8438p3345o7839o1739n6320n2591m9867m6999
60843A736206m4002m1302l8518l5334l2578l0933k9399k6650k3256k0880j9720
60832A393634j8431j6387j4297j2527j0389p632n348m603m822m310k214N29K337
$$ y = [49496508, 46622596, 43141621, 39403549, 35669496, 32104133, 28801205, 25802338, 23113696, 20724909, 18619490, 16774992, 15164860, 13765138, 12556164, 11516736, 10620899, 9842159, 9157803, 8548637, 7998877, 7498505, 7042813, 6627551, 6246480, 5894596, 5570670, 5274487, 5003508, 4754099, 4524055, 4311678, 4113516, 3925205, 3744269, 3570769, 3405649, 3249492, 3102480, 2964475, 2835047, 2713855, 2600803, 2495685, 2398046, 2307442, 2223344, 2144906, 2071561, 2003722, 1941983, 1885663, 1833072, 1783205, 1736206, 1692204, 1650902, 1612384, 1577050, 1544472, 1513539, 1484140, 1457490, 1434234, 1413354, 1393634, 1375203, 1358816, 1344519, 1331992, 1321603, 1313971, 1308623, 1304020, 1299198, 1294888, 1292674, 1293203, 1295540]
60819A295540K850L120L866M297L418J807Q49N81j33j453k308k432k813l694m029
60804A299466l689m184o036p188n647k414k06j72j235j825j124P55K755L758M065
60789A277079N051O945Q511R598J2028J6585K1051K2964K2641K1658K0032J7267
60777A461410J4748J4167J4487J3313J0970J0315J2213J3966J3042J0300Q269
60766A597200P827P841P264O404O309P406Q772Q910P368N231L752L118K907K729
60752A683038J897l79l532n631n966o373q506j1203j2467j2838j4269j6411j6937
60739A570423j5530j4726j6027j7593j7034j4662j2591j1817j1444j0156p496
60728A421347m089j131O41J589K441L265L959N309Q262J2244J5503J7252J8225
$$ y = [1295540, 1298390, 1301510, 1305376, 1309673, 1313091, 1314898, 1315747, 1316328, 1316195, 1314742, 1312434, 1310002, 1307189, 1303495, 1299466, 1295777, 1291593, 1285557, 1278369, 1272722, 1270308, 1270102, 1269930, 1268695, 1266870, 1265746, 1266501, 1269256, 1273014, 1277079, 1282130, 1289075, 1297586, 1307184, 1319212, 1335797, 1356848, 1379812, 1402453, 1424111, 1444143, 1461410, 1476158, 1490325, 1504812, 1518125, 1529095, 1539410, 1551623, 1565589, 1578631, 1588931, 1597200, 1605027, 1612868, 1620132, 1626536, 1632845, 1640251, 1649023, 1657933, 1665301, 1670532, 1674284, 1677402, 1680309, 1683038, 1684935, 1684556, 1681024, 1675393, 1669427, 1663054, 1654548, 1643345, 1630878, 1618040, 1603771, 1587360, 1570423, 1554893, 1540167, 1524140, 1506547, 1489513, 1474851, 1462260, 1450443, 1438999, 1428843, 1421347, 1417258, 1416127, 1416768, 1418357, 1420798, 1424063, 1428022, 1433331, 1441593, 1453837, 1469340, 1486592, 1504817]
60715A504817J9044J9591K0237K2113K5384K8558L0359L1150L1668L1519L0092
60704A794532K8149K7079K6832K5842K3087J9246J5510J1989Q002L755R18R25
60692A985866K965M491L904K078P54K13n48j881k904k921k426k396l213m597o070
60677A973315p297q171q804r396j0135j1155j2218j2489j1425j0081j0510j3153
60665A848481j5698j5486j2433q656n991m940n277o003n183j600L199O030N606
60652A782049L719K664K763K880K154N60j362k789l310l702n164p448q802q265
60638A755947p041o752p287p347o555n790n617n523n093m998o196q401j0166j0632
60624A658549j0628j1476j3151j4461j5063j6124j8458k0894k1555k0276j8723
$$ y = [1504817, 1523861, 1543452, 1563689, 1585802, 1611186, 1639744, 1670103, 1701253, 1732921, 1764440, 1794532, 1822681, 1849760, 1876592, 1902434, 1925521, 1944767, 1960277, 1972266, 1980268, 1984023, 1984941, 1985866, 1988831, 1993322, 1997226, 1999304, 2000058, 2000271, 1999723, 1997842, 1994938, 1992017, 1989591, 1987195, 1983982, 1979385, 1973315, 1966018, 1957847, 1949043, 1939647, 1929512, 1918357, 1906139, 1893650, 1882225, 1872144, 1861634, 1848481, 1832783, 1817297, 1804864, 1796208, 1790217, 1785277, 1780000, 1773997, 1768814, 1767214, 1770413, 1776443, 1782049, 1785768, 1788432, 1791195, 1794075, 1796229, 1796789, 1795427, 1792638, 1789328, 1785626, 1780462, 1773014, 1764212, 1755947, 1748906, 1742154, 1734867, 1727520, 1720965, 1715175, 1709558, 1704035, 1698942, 1693944, 1687748, 1679347, 1669181, 1658549, 1647921, 1636445, 1623294, 1608833, 1593770, 1577646, 1559188, 1538294, 1516739, 1496463, 1477740]
60613A477740j8283j8710j8824j7780j5570j2877j0528q657o571l874j398l57
60601A344311p55j379j280n25L80J142J595J603J204N95J1j77M28J612K557K921
60585A354243L364M309M878M116K674K078K539K844K358J832K025K704L423M325
60571A397712N726P646J0063J2996J6000J8252J9429K0079K0927K2279K4121K6240
60559A601470K8231K9901L1604L3564L5061L5157L4238L3836L4593L5271L4235
60548A967161L1394K8099K5369K2692J8557J2150M304l399j0273j6658k2568k7292
60536B029536l0715l3670l6152l6507l3793k9804k6972k5084k2128j7869j4291
60525A722551j2427j1130r551q583q786q811p354n373m874o188p803q332p596
$$ y = [1477740, 1459457, 1440747, 1421923, 1404143, 1388573, 1375696, 1365168, 1356511, 1349940, 1346066, 1344668, 1344311, 1343556, 1342177, 1340897, 1340372, 1340752, 1341894, 1343489, 1345092, 1346296, 1346891, 1346902, 1346725, 1347153, 1348765, 1351322, 1354243, 1357607, 1361916, 1366794, 1370910, 1373584, 1375662, 1378201, 1381045, 1383403, 1385235, 1387260, 1389964, 1393387, 1397712, 1403438, 1411084, 1421147, 1434143, 1450143, 1468395, 1487824, 1507903, 1528830, 1551109, 1575230, 1601470, 1629701, 1659602, 1691206, 1724770, 1759831, 1794988, 1829226, 1863062, 1897655, 1932926, 1967161, 1998555, 2026654, 2052023, 2074715, 2093272, 2105422, 2109726, 2106327, 2096054, 2079396, 2056828, 2029536, 1998821, 1965151, 1928999, 1892492, 1858699, 1828895, 1801923, 1776839, 1754711, 1736842, 1722551, 1710124, 1698994, 1689443, 1680860, 1672074, 1663263, 1655909, 1650536, 1645662, 1639474, 1631671, 1623339, 1615743]
60512A615743o122m536l319k458j410J67J962L494M715N887P238Q945J1046J3075
60498A654427J4275J4488J4488J5283J7207J9714K1798K2790K3136K3999K5684
60487A867289K6989K6897K6264K6610K7751K8269K8300L0074L5022M1693M7362
60476B212520N0773N2474N3182N2450M8700M0425K7860J3346o31j3491k5590l5759
60464B476259m1591m2507m0716l8288l4778k8706k0154j0727j754O437J4032K1292
60452B258799K7988L2945L5062L5327L6588M0461M5538M9701N3197N8182O6002
60441B739790P6373Q8724J02918J18645J35342J52953J72046J92927K15020K37179
60431D231917K58405K78399K97697L17255L37832L60121L85148M13623M44396
$$ y = [1615743, 1609621, 1605085, 1601766, 1599308, 1597898, 1598065, 1600027, 1603521, 1608236, 1614123, 1621361, 1630306, 1641352, 1654427, 1668702, 1683190, 1697678, 1712961, 1730168, 1749882, 1771680, 1794470, 1817606, 1841605, 1867289, 1894278, 1921175, 1947439, 1974049, 2001800, 2030069, 2058369, 2088443, 2123465, 2165158, 2212520, 2263293, 2315767, 2368949, 2421399, 2470099, 2510524, 2538384, 2551730, 2551099, 2537608, 2512018, 2476259, 2434668, 2392161, 2351445, 2313157, 2278379, 2249673, 2229519, 2218792, 2217038, 2223475, 2237507, 2258799, 2286787, 2319732, 2354794, 2390121, 2426709, 2467170, 2512708, 2562409, 2615606, 2673788, 2739790, 2816163, 2904887, 3007805, 3126450, 3261792, 3414745, 3586791, 3779718, 3994738, 4231917, 4490322, 4768721, 5066418, 5383673, 5721505, 6081626, 6466774, 6880397, 7324793]
60422G324793M73706M95508N01741M83086M31969L46418K30830R3226n6624k06366
60412A0118287l41496m49741n25377n68962n84276n76844n53582n20864m82297
60403E514848m39692l95873l54788l18625k86442k56265k27553k01237j78256
60394B856117j58637j41430j25310j09843r6138q5618p8059p1707o5311n9203
60384A864861n4081m9798m5974m2980m1240l9960l7580l3750k9987k7844k6868
60373A434799k5129k1738j8054j6027j5988j6658j6865j6377j5236j3312j0759
60362A248656q243o383n393n233n441m898k764K11K256K730K644K718K374J468
60348A224702J529L698O379O814M814L095L667N506O532O522O839Q025R117R414
$$ y = [7324793, 7798499, 8294007, 8795748, 9278834, 9710803, 10057221, 10288051, 10381277, 10324653, 10118287, 9776791, 9327050, 8801673, 8232711, 7648435, 7071591, 6518009, 5997145, 5514848, 5075156, 4679283, 4324495, 4005870, 3719428, 3463163, 3235610, 3034373, 2856117, 2697480, 2556050, 2430740, 2320897, 2224759, 2139141, 2061082, 1989375, 1924064, 1864861, 1810780, 1760982, 1715008, 1672028, 1630788, 1590828, 1553248, 1519498, 1489511, 1461667, 1434799, 1409670, 1387932, 1369878, 1353851, 1337863, 1321205, 1304340, 1287963, 1272727, 1259415, 1248656, 1240413, 1234030, 1228637, 1223404, 1217963, 1213065, 1210301, 1210512, 1212768, 1215498, 1218142, 1220860, 1223234, 1224702, 1226231, 1229929, 1236308, 1243122, 1247936, 1251031, 1254698, 1260204, 1266736, 1273258, 1280097, 1288122, 1297239, 1306653]
60334A306653R624J0605J1674J1240R020O661N897O762Q022Q627Q037N884K321
60321A411027j550m523o428p632p855o681m988m375m963n225m341l305l035k763
60307A343363j390O63K050K340K229K465L313M612N722N943N638O189Q100R840
60293A401077R661P998P011P964J0055J1720J2205J1803J1371J1770J3244J4978
60281A530857J5653J4590J2304R946Q203O755M915K778J418J576K653L647M663
60268A619958O546R224J1559J2798J3076J2435J0583P754M575R53l629q415j1576
60255A685841j2579j2788j3085j2582j0681q641p767p377o120m201k816k202j747
60242A583255j215o09M63J999L074L412M407O944R245Q862O310M543M971O048
$$ y = [1306653, 1316277, 1326882, 1338556, 1349796, 1358816, 1365477, 1371374, 1378136, 1386158, 1394785, 1402822, 1408706, 1411027, 1409477, 1404954, 1398526, 1390894, 1383039, 1376358, 1371370, 1366995, 1362032, 1356807, 1352466, 1349161, 1346126, 1343363, 1341973, 1342636, 1344686, 1347026, 1349255, 1351720, 1355033, 1359645, 1365367, 1371310, 1376948, 1383137, 1391237, 1401077, 1410738, 1418736, 1425747, 1433711, 1443766, 1455486, 1467691, 1479494, 1490865, 1502635, 1515879, 1530857, 1546510, 1561100, 1573404, 1583350, 1591553, 1598308, 1603223, 1606001, 1607419, 1608995, 1611648, 1615295, 1619958, 1626504, 1635728, 1647287, 1660085, 1673161, 1685596, 1696179, 1703933, 1708508, 1709461, 1705832, 1697417, 1685841, 1673262, 1660474, 1647389, 1634807, 1624126, 1615485, 1607718, 1600341, 1594221, 1590020, 1587204, 1585002, 1583255, 1582040, 1581431, 1581894, 1583893, 1586967, 1590379, 1594786, 1601730, 1610975, 1619837, 1626147, 1630690, 1635661, 1641709]
60228A641709O073N497N659O663P411P163O385O290P547R360J0258J0142J0668
60215A740825J2862J5433J6620J6843J7835J9763K1042K0997K0965K2430K5462
60204A951077K9333L3431L7139L9901M2060M4860M9211N4901O1093O7170P3102
60193B483278P9526Q7293R6363J05567J13999J22212J31181J40759J50190J59593
60183C669961J69590J79840J89322J97839K05782K12510K16442K16901K14498
60174E472685K09458K00943J88403J72392J53724J32934J11001Q9325O8412M7508
60164F846785K6194N539j2783k7848l9507m7817n2872n4717n3052m7509l8333
60153F504080k6362j2285L486K0337L7562N5039P3117R1798J10678J29517J48001
$$ y = [1641709, 1647782, 1653279, 1658938, 1665601, 1673012, 1680175, 1686560, 1692850, 1700397, 1709757, 1720015, 1730157, 1740825, 1753687, 1769120, 1785740, 1802583, 1820418, 1840181, 1861223, 1882220, 1903185, 1925615, 1951077, 1980410, 2013841, 2050980, 2090881, 2132941, 2177801, 2227012, 2281913, 2343006, 2410176, 2483278, 2562804, 2650097, 2746460, 2852027, 2966026, 3088238, 3219419, 3360178, 3510368, 3669961, 3839551, 4019391, 4208713, 4406552, 4612334, 4824844, 5041286, 5258187, 5472685, 5682143, 5883086, 6071489, 6243881, 6397605, 6530539, 6641540, 6730865, 6799277, 6846785, 6872979, 6878518, 6865735, 6837887, 6798380, 6750563, 6697691, 6642974, 6589922, 6542413, 6504080, 6477718, 6465433, 6468919, 6489256, 6526818, 6581857, 6654974, 6746772, 6857450, 6986967, 7134968]
60142G134968J64943J78730J88724J95352J98649J97614J91291J79699J63355
60133H793325J42606J17852Q9925O0035K9611J46k7435n3245p7737j00545j20345
60122H854193j35696j45482j49035j46588j39300j28098j12902r3809p2347n0350
60112G680586k8088m933J8609M1208O2793Q4244J04751J21562J33057J40211J43988
60101H497988J42960J35090J20855J03094Q4314O5326M6197K7345R706n376j6329
60090I211170k2032k2413j8238j0196J790J8448M0298O6692R5921J26400J57520
60079I645360J89123K20991K53536K88036L24954L62662L99360M35705M73637
60070A2593364N12501N48507N78624O03182O23550O38767O45917O42832O29049
$$ y = [7134968, 7299911, 7478641, 7667365, 7862717, 8061366, 8258980, 8450271, 8629970, 8793325, 8935931, 9053783, 9143708, 9203743, 9233354, 9233500, 9206065, 9152820, 9075083, 8974538, 8854193, 8718497, 8573015, 8423980, 8277392, 8138092, 8009994, 7897092, 7803283, 7730936, 7680586, 7652498, 7647565, 7666174, 7707382, 7770175, 7854419, 7959170, 8080732, 8213789, 8354000, 8497988, 8640948, 8776038, 8896893, 8999987, 9084301, 9149627, 9195824, 9223169, 9232875, 9227499, 9211170, 9189138, 9166725, 9148487, 9138291, 9140081, 9158529, 9198827, 9265519, 9361440, 9487840, 9645360, 9834483, 10055474, 10309010, 10597046, 10922000, 11284662, 11684022, 12119727, 12593364, 13105865, 13654372, 14232996, 14836178, 15459728, 16098495, 16744412, 17387244, 18016293]
60061A8016293O04711N69872N24763M69931M06178L34819K57696J76498R2392
60052B1453153O477p9877j65316k48336l26403l95995m54112m99320n30947n48119
60042A8211205n50369n38770n15667m83409m43705l98013l47961k95288k41401
60033A4396622j86879j31778p6920k4748K1852O1661R5344J23306J44084J55185
60023A4577729J55104J44324J24794R8767O7751L2431o273m6395q5724j23101
60013A4939407j58223j90479k18983k43662k65285k84153k99666l11167l18273
60004A2649516l20328l16602l07380k93838k76597k55371k30316k02671j73524
59995A0272889j42927j10775p7817m5194j3587J6801M6024P4463J02424J29180
$$ y = [18016293, 18621004, 19190876, 19715639, 20185570, 20591748, 20926567, 21184263, 21360761, 21453153, 21459630, 21379753, 21214437, 20966101, 20639698, 20243703, 19789591, 19290271, 18759324, 18211205, 17660836, 17122066, 16606399, 16122990, 15679285, 15281272, 14933311, 14638023, 14396622, 14209743, 14077965, 14001045, 13976297, 13998149, 14059810, 14155154, 14278460, 14422544, 14577729, 14732833, 14877157, 15001951, 15100718, 15168469, 15200900, 15194627, 15148232, 15062508, 14939407, 14781184, 14590705, 14371722, 14128060, 13862775, 13578622, 13278956, 12967789, 12649516, 12329188, 12012586, 11705206, 11411368, 11134771, 10879400, 10649084, 10446413, 10272889, 10129962, 10019187, 9941370, 9896176, 9882589, 9899390, 9945414, 10019877, 10122301, 10251481]
59985A0251481J52896J71832J85218J92987J95112J91227J80404J61628J35225
59976A1818010J03445O8693L1662p691m7945q6693j22910j56950j88105k14018
59966A1197498k32937k44789k49692k47313k38310k24503k06816j84868j59372
59957I208898j32925j07186q1107n3305k4352M772L4734O6311R8182J28369J56959
59946I299350J85428K13930K40912K64758K84072K97004L02225L00109K91314
59937A1679102K74630K48300K13366J73743J32622R0403M6453J292m3739q7602
59927A2728570j29320j67226j99245k23788k40173k48426k48894k41885k27732
59918A0801881k07307j82091j53432j22047q8602n4395k1005J0507L9916O7760
$$ y = [10251481, 10404377, 10576209, 10761427, 10954414, 11149526, 11340753, 11521157, 11682785, 11818010, 11921455, 11990148, 12021810, 12014119, 11966174, 11879481, 11756571, 11599621, 11411516, 11197498, 10964561, 10719772, 10470080, 10222767, 9984457, 9759954, 9553138, 9368270, 9208898, 9075973, 8968787, 8887680, 8834375, 8810023, 8814795, 8849529, 8915840, 9014022, 9142391, 9299350, 9484778, 9698708, 9939620, 10204378, 10488450, 10785454, 11087679, 11387788, 11679102, 11953732, 12202032, 12415398, 12589141, 12721763, 12812166, 12858619, 12859911, 12816172, 12728570, 12599250, 12432024, 12232779, 12008991, 11768818, 11520392, 11271498, 11029613, 10801881, 10594574, 10412483, 10259051, 10137004, 10048402, 9994007, 9973002, 9983509, 10023425, 10091185]
59908A0091185R5091J22286J47721J68525J83326J93396K00337K03668K01817
59899A1607352J94622J83513J69759J54019J37442J21664J07385R4041Q1421P0969
59889A2922187O5080O5229P0979Q0812R4127J12403J37806J70691K09151K51121
59879A4179586K95758L42437L89927M37542M85772N34208N79732O18436O48712
59870A8512110O70638O82383O79009O55386O09035N39776M48000L34769K03712
59861B3334818O2121q0553k16005l39257m47484n37290o04533o47406o68327o71549
59851A9184535o59668o33588n95055n47530m94597m38719l81432l23541k65054
59842A4845351k06008j47607r1636l8688J2055O1029J06997J47829J81987K08983
$$ y = [10091185, 10186276, 10308562, 10456283, 10624808, 10808134, 11001530, 11201867, 11405535, 11607352, 11801974, 11985487, 12155246, 12309265, 12446707, 12568371, 12675756, 12769797, 12851218, 12922187, 12987267, 13052496, 13123475, 13204287, 13298414, 13410817, 13548623, 13719314, 13928465, 14179586, 14475344, 14817781, 15207708, 15645250, 16131022, 16665230, 17244962, 17863398, 18512110, 19182748, 19865131, 20544140, 21199526, 21808561, 22348337, 22796337, 23131106, 23334818, 23396939, 23316386, 23100381, 22761124, 22313640, 21776350, 21171817, 20524411, 19856084, 19184535, 18524867, 17891279, 17296224, 16748694, 16254097, 15815378, 15433946, 15110405, 14845351, 14639343, 14491736, 14400100, 14361412, 14373467, 14434496, 14541493, 14689322, 14871309, 15080292]
59832A5080292K28826K41076K44085K35217K12354J75163J24721O2323j0556r1120
59822A6502381j74791k56243l30820l95276m47841m87879n15540n31562n37075
59813A2825354n33020n19926m98875m72464m43701m13739l81827l47922l14013
59804H899867k82124k52207k23191j95253j69830j47991j29844j15078j03162
59795G281187r3498q6253q2321q1651q2281q2036q0367p7571p3139o6428n8259
59784F417383n0314m3292l7122l2636l1444l4224m0384m9071n9133o8372p4612
59773E896779p7677p8942p8844p6303p0767o3242n4783m5275l4392k2780j1620
59762E282154j714O715J4042K1272K9295L7878M6182N4348O3636P4555Q5651R4584
$$ y = [15080292, 15309118, 15550194, 15794279, 16029496, 16241850, 16417013, 16541734, 16604057, 16593501, 16502381, 16327590, 16071347, 15740527, 15345251, 14897410, 14409531, 13893991, 13362429, 12825354, 12292334, 11772408, 11273533, 10801069, 10357368, 9943629, 9561802, 9213880, 8899867, 8617743, 8365536, 8142345, 7947092, 7777262, 7629271, 7499427, 7384349, 7281187, 7187689, 7101436, 7019115, 6937464, 6855183, 6773147, 6692780, 6615209, 6542070, 6475642, 6417383, 6367069, 6323777, 6286655, 6254019, 6222575, 6188351, 6147967, 6098896, 6039763, 5971391, 5896779, 5819102, 5740160, 5661316, 5585013, 5514246, 5451004, 5396221, 5350946, 5316554, 5293774, 5282154, 5280440, 5287155, 5301197, 5322469, 5351764, 5389642, 5435824, 5490172, 5553808, 5628363, 5714014, 5808598]
59750E808598J00082J02688J04010J05153J05490J03123R7069Q8580P9637P0807
59740F765237O1505N1955M3457L6962L2723L1369L3906M0336M9534O1016P5722
59729G283722R4478J16542J40262J64566J89446K15512K43494K73727L05937L39763
59719I367449L75344M12980M52445M93108N34053N72920O04796O23003O20521
59710A4056619N89834N23099M16223K74587J13771m6601j89959l05571l88333
59701A5043669m38519m60840m61395m44842m14690l75023l30354k83706k36086
59692A1598214j88068j41079r6670n5142j5433K3616O2268J00092J36857J72866
59682A1597521K08520K44022K79692L16203L54297L94538M37352M82714N29572
$$ y = [5808598, 5908680, 6011368, 6115378, 6220531, 6326021, 6429144, 6526213, 6614793, 6694430, 6765237, 6826742, 6878697, 6922154, 6959116, 6991839, 7023208, 7057114, 7097450, 7146984, 7208000, 7283722, 7378200, 7494742, 7635004, 7799570, 7989016, 8204528, 8448022, 8721749, 9027686, 9367449, 9742793, 10155773, 10608218, 11101326, 11635379, 12208299, 12813095, 13436098, 14056619, 14646453, 15169552, 15585775, 15860362, 15974133, 15927532, 15737573, 15432002, 15043669, 14605150, 14144310, 13682915, 13238073, 12823383, 12448360, 12118006, 11834300, 11598214, 11410146, 11269067, 11172397, 11117255, 11101822, 11125438, 11187706, 11287798, 11424655, 11597521, 11806041, 12050063, 12329755, 12645958, 13000255, 13394793, 13832145, 14314859, 14844431]
59673A4844431N76606O24118O74324P28837P86592Q45473R05214R67115J030998
59664B1983708J094124J153442J207357J254575J292418J317408J327098J320668
59656C1950798J298284J260983J211537J155179J098974J049925J012986R90431
59648D1029097R82512R88026J003992J025498J046473J060588J061516J043514
59640D9241216J002493R36348Q44240P26903N88534M37105K81593J29724j0821
59631E4177335j30993k23069k84490l16830l21090k96383k43526j67309p3727
59622E2119918L3517J52663K81617M17607N58178P01049Q43314R81821J113932
59613E7203616J236567J344304J429108J481965J493987J455861J357516J190468
$$ y = [14844431, 15421037, 16045155, 16719479, 17448316, 18234908, 19080381, 19985595, 20952710, 21983708, 23077832, 24231274, 25438631, 26693206, 27985624, 29303032, 30630130, 31950798, 33249082, 34510065, 35721602, 36876781, 37975755, 39025680, 40038666, 41029097, 42011609, 42999635, 44003627, 45029125, 46075598, 47136186, 48197702, 49241216, 50243709, 51180057, 52024297, 52751200, 53339734, 53776839, 54058432, 54188156, 54177335, 54046342, 53823273, 53538783, 53221953, 52900863, 52604480, 52360954, 52193645, 52119918, 52153435, 52306098, 52587715, 53005322, 53563500, 54264549, 55107863, 56089684, 57203616, 58440183, 59784487, 61213595, 62695560, 64189547, 65645408, 67002924, 68193392]
59605F8193392R51820O46518K86278j12297n27809r34311j305436j620942j869722
59596F3707491k047488k154199k194783k179637k121270k030537j917410j794173
59588D7267994j675344j574413j501791j464565j464902j497345j548979j603288
59580C4937367j644634j661684j649974j612122j554068j480746j395772j303743
59572B2634624j209896j117329j026746r39189q56973p81514p12371o48940n91173
59563A4750493n38139m88039m40609l97616l59987l26196k94592k65643k40570
59554A1399102k19227k00735j85166j73286j65289j60852j59838j62169j67380
59545I805160j74727j83057j90463j95069j96555j96003j94084j90460j85029
$$ y = [68193392, 69145212, 69791730, 70078008, 69965711, 69437902, 68503591, 67198155, 65577213, 63707491, 61660003, 59505804, 57311021, 55131384, 53010114, 50979577, 49062167, 47267994, 45592650, 44018237, 42516446, 41051881, 39586979, 38089634, 36540655, 34937367, 33292733, 31631049, 29981075, 28368953, 26814885, 25334139, 23938367, 22634624, 21424728, 20307399, 19280653, 18341464, 17484491, 16702977, 15990606, 15341666, 14750493, 14212354, 13724315, 13283706, 12886090, 12526103, 12199907, 11905315, 11639672, 11399102, 11179875, 10979140, 10793974, 10620688, 10455399, 10294547, 10134709, 9972540, 9805160, 9630433, 9447376, 9256913, 9061844, 8865289, 8669286, 8475202, 8284742, 8099713]
59536H099713j78272j69977j59109j45518j30556j15526j00630q5965p2106n9240
59526F882814m6919l5101k4141j3493k050R756J9929K7708L4673M2184M9367N4831
59514F999558N8854O2765O7243P2349P8295Q5241R3155J02431J13771J27143J41994
59503H002799J58427J76547J94882K11815K28872K49665K74546K99344L21041
59494A0117938L41897L65809L92989M20863M47880M73464M95995N14182N29177
59485A4100194N42106N50434N50229N41656N28692N13232M92988M66210M35220
59476A8720961M03327L70425L34010K93510K51764K12520J77877J48385J24693
59467B1037472J08228R9916R8543J01385J06985J16400J30573J46720J58335J58783
$$ y = [8099713, 7921441, 7751464, 7592355, 7446837, 7316281, 7200755, 7100125, 7014160, 6942054, 6882814, 6835895, 6800794, 6776653, 6763160, 6761110, 6770866, 6790795, 6818503, 6853176, 6895360, 6944727, 6999558, 7058412, 7121177, 7188420, 7260769, 7339064, 7424305, 7517460, 7619891, 7733662, 7860805, 8002799, 8161226, 8337773, 8532655, 8744470, 8973342, 9223007, 9497553, 9796897, 10117938, 10459835, 10825644, 11218633, 11639496, 12087376, 12560840, 13056835, 13571017, 14100194, 14642300, 15192734, 15742963, 16284619, 16813311, 17326543, 17819531, 18285741, 18720961, 19124288, 19494713, 19828723, 20122233, 20373997, 20586517, 20764394, 20912779, 21037472, 21145700, 21245616, 21344159, 21445544, 21552529, 21668929, 21799502, 21946222, 22104557, 22263340]
59457B2263340J44320J14272O9694J2292n6171j34023k19162l08445l97820m82926
59447B1005371n59613o24638o76369p14476p38568p47694p41610p22052o92273
59438A4788078o55603o14621n70795n24469m75812m26232l78221l33394k91428
59429A0517503k51327k12871j76335j41609j08261p5847m3811j1922J9058M8209
59419I562787P6211J04854J34523J63790J92106K20909K50852K79965L06114L29639
59409A1621750L51639L70944L84961L92441L93214L85837L67824L38045K97067
59400A4903722K45188J82064J08572K7650n6909j41403k22077k95497l59394m12459
59390A3979457m53546m82042m98793n05618n03997m95004m80095m60923m38578
$$ y = [22263340, 22407660, 22521932, 22591626, 22603918, 22547747, 22413724, 22194562, 21886117, 21488297, 21005371, 20445758, 19821120, 19144751, 18430275, 17691707, 16944013, 16202403, 15480351, 14788078, 14132475, 13517854, 12947059, 12422590, 11946778, 11520546, 11142325, 10808931, 10517503, 10266176, 10053305, 9876970, 9735361, 9627100, 9551253, 9507442, 9495520, 9514578, 9562787, 9638998, 9743852, 9878375, 10042165, 10234271, 10455180, 10706032, 10985997, 11292111, 11621750, 11973389, 12344333, 12729294, 13121735, 13514949, 13900786, 14268610, 14606655, 14903722, 15148910, 15330974, 15439546, 15467196, 15410287, 15268884, 15046807, 14751310, 14391916, 13979457, 13525911, 13043869, 12545076, 12039458, 11535461, 11040457, 10560362, 10099439, 9660861]
59381I660861m13909l88168l62371l36459l10107k83937k58822k34497k10328
59372F862263j87118j66634j49163j32870j16011r8723q2271o7376n3919m1665
59362E766513l0596k0479j0602l40R944J9128K6928L4648M3475N2786O1364O9559
59350F022328P8048Q4768Q6028Q1618P6378P5327P9353Q7181R8943J15443J35747
59339G021162J58189J82424K07938K31725K50544K65197K80181K99257L23583
59330I220200L53601L89822M31246M75361N20791N68467O19590O73727P29304
59321A3982109P84897Q39574Q92623R42773R86901J020041J037813J038618J022523
59312B2547872R89018R37802Q71478P95587P15577O34614N54097M74832L97599
$$ y = [9660861, 9246952, 8858784, 8496413, 8159954, 7849847, 7565910, 7307088, 7072591, 6862263, 6675145, 6508511, 6359348, 6226478, 6110467, 6011744, 5929473, 5862097, 5808178, 5766513, 5735917, 5715438, 5704836, 5704496, 5714440, 5733568, 5760496, 5795144, 5838619, 5891405, 5952769, 6022328, 6100376, 6185144, 6271172, 6352790, 6429168, 6504495, 6583848, 6671029, 6769972, 6885415, 7021162, 7179351, 7361775, 7569713, 7801438, 8051982, 8317179, 8597360, 8896617, 9220200, 9573801, 9963623, 10394869, 10870230, 11391021, 11959488, 12579078, 13252805, 13982109, 14767006, 15606580, 16499203, 17441976, 18428877, 19448918, 20486731, 21525349, 22547872, 23536890, 24474692, 25346170, 26141757, 26857334, 27491948, 28046045, 28520877, 28918476]
59303B8918476L23521K53704J87568J22133N4207j7170r1470j68918k49926l32656
59293B8999469m12880m86434n50459o02663o41456o67348o83152o92351o98005
59284B3564721p02849p09077p17709p28534p40269p50260p55131p53106p44995
59275A6962791p31956p13445o88713o59009o26284n90761n51875n11062m71246
59266A1418440m33815l97891l62356l27033k92367k59591k30412k04740j79815
59257H730420j53727j28622j07839r0802p3960n6046l8985k3609q322P353K1539
59246H077400L3645M6124O0830P6089Q9104R9357J08002J15575J22012J27545
59236H955683J32113J34703J34426J31718J27983J24580J22057J19483J15040
$$ y = [28918476, 29241997, 29495701, 29683269, 29805402, 29859609, 29842439, 29750969, 29582051, 29332125, 28999469, 28586589, 28100155, 27549696, 26947033, 26305577, 25638229, 24955077, 24262726, 23564721, 22861872, 22152795, 21435086, 20706552, 19966283, 19216023, 18460892, 17707786, 16962791, 16230835, 15517390, 14828677, 14169668, 13543384, 12952623, 12400748, 11889686, 11418440, 10984625, 10586734, 10224378, 9897345, 9604978, 9345387, 9114975, 8910235, 8730420, 8576693, 8448071, 8340232, 8249430, 8175470, 8119424, 8080439, 8056830, 8048508, 8055861, 8077400, 8111045, 8157169, 8217999, 8294088, 8383192, 8482549, 8590551, 8706126, 8828138, 8955683, 9087796, 9222499, 9356925, 9488643, 9616626, 9741206, 9863263, 9982746, 10097786]
59227A0097786J08707J03685J03117J06000J08883J11304J16457J26127J38243
59218A1120309J50408J62705J75346J86260J93086J95677J94773J89744J78964
59209A2747272J60827J33342R5009M8014j248m6861q7388j23814j55297j79181
59199A2590675j94111k01021k01416j96229j85953j70763j50996j28265j05232
59190A1056689q3399o2112m0457j8975J427K0713L8662N3963O5949P6167Q6694
59179A1195321R7794J08796J20338J33933J49782J66838J85044K06045K31427
59170A2595318K61097K93667L27842L63311M00397M38636M75595N07566N31378
59161A6194807N44818N45354N29700M95109M40239L64682K69135J56712L2850
$$ y = [10097786, 10206493, 10310178, 10413295, 10519295, 10628178, 10739482, 10855939, 10982066, 11120309, 11270717, 11433422, 11608768, 11795028, 11988114, 12183791, 12378564, 12568308, 12747272, 12908099, 13041441, 13136450, 13184464, 13183216, 13136355, 13048967, 12925153, 12769856, 12590675, 12396564, 12195543, 11994127, 11797898, 11611945, 11441182, 11290186, 11161921, 11056689, 10973290, 10911178, 10870721, 10851746, 10853173, 10873886, 10912548, 10966511, 11032460, 11108627, 11195321, 11293115, 11401911, 11522249, 11656182, 11805964, 11972802, 12157846, 12363891, 12595318, 12856415, 13150082, 13477924, 13841235, 14241632, 14680268, 15155863, 15663429, 16194807, 16739625, 17284979, 17814679, 18309788, 18750027, 19114709, 19383844, 19540556, 19573406]
59152A9573406r6941k28291l56425m74864n77161o59533p21154p62593p84859
59143A4911585p89481p78550p54672p20995o80784o36700n90784n44909n00436
59134H914274m57644m16486l77753l42561l10932k82269k56827k35034k15623
59125F019145j96510j77767j61568j48621j36756j23975j10993r9627r0273q2115
59115D690940p4459o6740n8411m9739m1659l4221k6391j7860r447j310P437J6525
59103D334665K4037K9331L4524M1619M9693N6595O1993O7269P3447Q0627Q8525
59092D942325R6272J02677J07757J12996J19168J25183J29971J34069J38164J41486
59082F150068J43091J43376J42966J41249J37405J31780J24906J16368J05909
$$ y = [19573406, 19476465, 19248174, 18891749, 18416885, 17839724, 17180191, 16459037, 15696444, 14911585, 14122104, 13343554, 12588882, 11867887, 11187103, 10550403, 9959619, 9414710, 8914274, 8456630, 8040144, 7662391, 7319830, 7008898, 6726629, 6469802, 6234768, 6019145, 5822635, 5644868, 5483300, 5334679, 5197923, 5073948, 4962955, 4863328, 4773055, 4690940, 4616481, 4549741, 4491330, 4441591, 4399932, 4365711, 4339320, 4321460, 4312013, 4310703, 4318140, 4334665, 4358702, 4388033, 4422557, 4464176, 4513869, 4570464, 4632457, 4699726, 4773173, 4853800, 4942325, 5038597, 5141274, 5249031, 5362027, 5481195, 5606378, 5736349, 5870418, 6008582, 6150068, 6293159, 6436535, 6579501, 6720750, 6858155, 6989935, 7114841, 7231209, 7337118]
59073G337118R4508Q3045P1228N9258M9187M2907L9879L8592L9162M2665M8855
59062G946404N6667O6387P9281R5277J12799J30944J50296J71364J93398K14981
59052I217798K35013K53223K70236K86913L03148L17570L28637L35360L36533
59043A1884431L30127L13881K86008K45498J92952J31274O4287n420p5738j42492
59033A3224808k00115k45576k79582l03526l18035l25191l28778l30278l27604
59024A0566123l19988l11272l05381l01109k95059k87709k82630k80579k78564
59015G903832k74657k70056k65793k60595k53150k44200k35156k26257k16967
59006E657001k07055j96641j85927j75091j63901j51781j39143j27822j19125
$$ y = [7337118, 7431626, 7514671, 7585899, 7645157, 7694344, 7737251, 7777130, 7815722, 7854884, 7897549, 7946404, 8003071, 8069458, 8148739, 8244016, 8356815, 8487759, 8638055, 8809419, 9002817, 9217798, 9452811, 9706034, 9976270, 10263183, 10566331, 10883901, 11212538, 11547898, 11884431, 12214558, 12528439, 12814447, 13059945, 13252897, 13384171, 13448458, 13443038, 13367300, 13224808, 13024693, 12779117, 12499535, 12196009, 11877974, 11552783, 11224005, 10893727, 10566123, 10246135, 9934863, 9629482, 9328373, 9033314, 8745605, 8462975, 8182396, 7903832, 7629175, 7359119, 7093326, 6832731, 6579581, 6335381, 6100225, 5873968, 5657001, 5449946, 5253305, 5067378, 4892287, 4728386, 4576605, 4437462, 4309640, 4190515]
58997D190515j12070j04868r7406r0853q5502q0660p6179p2482o9412o6468o3952
58986C270663o2495o1917o1748o2176o3068o2865o0206n6123n2844n0830m8565
58975B627826m4946m0209l4868k9503k5279k2974k1607j9554j6719j4033j1254
58964B346880p291k651N19J183O10M03Q23J507K370L188L393K930K616L254M776
58949B364510O421P415P572P702R022J1693J4433J6130J7112J8166J9126J9423
58937B518725J9392J9986K1546K3661K5706K6918K6718K5707K5457K6602K8022
58926B788440K8752K9415L0776L2189L2774L2981L3620L4407L4920L5861L7894
58915C152029M0236M1902M3292M5159M7134M8949N1782N6497O1644O5188O7302
$$ y = [4190515, 4078445, 3973577, 3876171, 3785318, 3699816, 3619156, 3542977, 3470495, 3401083, 3334615, 3270663, 3208168, 3146251, 3084503, 3022327, 2959259, 2896394, 2836188, 2780065, 2727221, 2676391, 2627826, 2582880, 2542671, 2507803, 2478300, 2453021, 2430047, 2408440, 2388886, 2372167, 2358134, 2346880, 2339589, 2336938, 2337457, 2338640, 2339250, 2339653, 2340476, 2341983, 2344353, 2347541, 2350934, 2353864, 2356480, 2359734, 2364510, 2370931, 2378346, 2385918, 2393620, 2402642, 2414335, 2428768, 2444898, 2462010, 2480176, 2499302, 2518725, 2538117, 2558103, 2579649, 2603310, 2629016, 2655934, 2682652, 2708359, 2733816, 2760418, 2788440, 2817192, 2846607, 2877383, 2909572, 2942346, 2975327, 3008947, 3043354, 3078274, 3114135, 3152029, 3192265, 3234167, 3277459, 3322618, 3369752, 3418701, 3470483, 3526980, 3588624, 3653812, 3721114]
58904C721114O9548P2330P5276P8951Q3711Q7744Q9014Q8713R0159R4347R9266
58893D650173J03459J07620J12254J16527J20448J26035J34982J46593J58998
58884E777089J71255J83364J95289K07074K19510K33974K51438K71678K93492
58875G804163L15997L39676L65473L93046M21166M50123M82063N18240N57534
58866A1647481N98576O41641O87265P34802P83901Q35607Q90193R45533R99633
58857A8764632J053212J107399J159946J206189J243017J269682J285148J286209
58849B8375434J267636J222903J146087J034990Q91520P18144N16241K90106N0244
58840C5513305j90233m21154o34981q23733r80619j104020j196252j258757j291750
$$ y = [3721114, 3790662, 3862992, 3938268, 4017219, 4100930, 4188674, 4277688, 4366401, 4456560, 4550907, 4650173, 4753632, 4861252, 4973506, 5090033, 5210481, 5336516, 5471498, 5618091, 5777089, 5948344, 6131708, 6326997, 6534071, 6753581, 6987555, 7238993, 7510671, 7804163, 8120160, 8459836, 8825309, 9218355, 9639521, 10089644, 10571707, 11089947, 11647481, 12246057, 12887698, 13574963, 14309765, 15093666, 15929273, 16819466, 17764999, 18764632, 19817844, 20925243, 22085189, 23291378, 24534395, 25804077, 27089225, 28375434, 29643070, 30865973, 32012060, 33047050, 33938570, 34656714, 35172955, 35463061, 35513305, 35323072, 34901918, 34266937, 33443204, 32462585, 31358565, 30162313, 28903556, 27611806]
58831B7611806j298076j283628j253551j210709j157828j098236j034330r67784
58823A8307664r01260q37460p76797p18494o63588o14170n70055n29283m91688
58814A2204869m58993m31206m05867l81101l56962l33678l11151k90151k71364
58805H964396k53287k33705k13207j94500j78266j62522j46098j29950j14844
58796G338017j00411q6687p3964o1104m6685l1755j8713p495M317J7660L1255
58785F964435M4577N8455P2652Q5978R9045J13811J30215J46385J62291J79872
58775H057716J99258K18337K36631K56204K78080L00969L24297L49278L76429
58766A0597199M05094M35998M70907N09201N48256N87890O30892O78370P28293
$$ y = [27611806, 26313730, 25030102, 23776551, 22565842, 21408014, 20309778, 19275448, 18307664, 17406404, 16568944, 15792147, 15073653, 14410065, 13795895, 13225840, 12696557, 12204869, 11745876, 11314670, 10908803, 10527702, 10170740, 9837062, 9525911, 9235760, 8964396, 8711109, 8477404, 8264197, 8069697, 7891431, 7728909, 7582811, 7452861, 7338017, 7237606, 7150919, 7076955, 7015851, 6969166, 6937411, 6918698, 6911203, 6915520, 6933180, 6964435, 7009012, 7067467, 7140119, 7226097, 7325142, 7438953, 7569168, 7715553, 7877844, 8057716, 8256974, 8475311, 8711942, 8968146, 9246226, 9547195, 9871492, 10220770, 10597199, 11002293, 11438291, 11909198, 12418399, 12966655, 13554545, 14185437, 14863807, 15592100]
58757A5592100P79514Q33308Q89532R45101R98132J050033J101444J149086J188311
58748B4526561J215934J228835J222771J194234J140893J058907R43084P91707
58740C3322926O08763M00476J72949o5272l02121n26197p29913r07357j052680
58731C0921574j163212j241435j291356j314945j313922j292486j255963j208511
58723B0839744j153608j094563j033111r69705r06370q46650p91608p38978o87671
58714A2617480o40013n97799n59497n23353m90008m59883m31148m02832l76926
58705H136021l54725l33929l12083k90318k70801k52903k34763k16547j99354
58696E670598j82915j67053j53548j43731j35795j26953j16979j07520r9396r2447
$$ y = [15592100, 16371614, 17204922, 18094454, 19039555, 20037687, 21087720, 22189164, 23338250, 24526561, 25742495, 26971330, 28194101, 29388335, 30529228, 31588135, 32531219, 33322926, 33931689, 34332165, 34505114, 34439842, 34137721, 33611524, 32881611, 31974254, 30921574, 29758362, 28516927, 27225571, 25910626, 24596704, 23304218, 22048255, 20839744, 19686136, 18591573, 17558462, 16588757, 15682387, 14835737, 14044129, 13305151, 12617480, 11977467, 11379668, 10820171, 10296818, 9806810, 9346927, 8915779, 8512947, 8136021, 7781296, 7447367, 7135284, 6844966, 6574165, 6321262, 6086499, 5869952, 5670598, 5487683, 5320630, 5167082, 5023351, 4887556, 4760603, 4643624, 4536104, 4436708, 4344261]
58686D344261q6569q1190p5326o9499o5673o4051o2350n9493n7191n6418n5502
58675C610999n3671n3062n4639n5425n2889m9264m8213m9635n0952n1364n1510
58664C040375n0996m9565m9031n0955n3740n4816n4243n3597n3047n2178n1946
58653B466261n2949n3247n0726m6375m2760m0576l8898l7241l5171l1669k7163
58642B009486k4389k4885k6472k6468k5273k4402k3332k1202j9421j9528k0153
58631A753961j9177j7186j5967j5229j3712j1900j0776r458o876m193k925k338
58619A624224j360j063k439l744l134j979k404l557l598l438m803o324n405k682
58605A578294r25n68O9J136J320Q00P89R47K30n15K60K077L595N377Q553J2076
$$ y = [4344261, 4257692, 4176502, 4101176, 4031677, 3966004, 3901953, 3839603, 3780110, 3722919, 3666501, 3610999, 3557328, 3504266, 3449627, 3394202, 3341313, 3292049, 3243836, 3194201, 3143249, 3091885, 3040375, 2989379, 2939814, 2890783, 2839828, 2786088, 2731272, 2677029, 2623432, 2570385, 2518207, 2466261, 2413312, 2360065, 2309339, 2262964, 2220204, 2179628, 2140730, 2103489, 2068318, 2036649, 2009486, 1985097, 1960212, 1933740, 1907272, 1881999, 1857597, 1834265, 1813063, 1793642, 1774114, 1753961, 1734784, 1717598, 1701631, 1686402, 1672690, 1660790, 1650014, 1640556, 1633680, 1629487, 1626562, 1624224, 1622864, 1621801, 1619362, 1615618, 1612484, 1610505, 1608101, 1604544, 1600946, 1597508, 1592705, 1586381, 1580976, 1578294, 1577369, 1576801, 1576870, 1578006, 1579326, 1580126, 1580915, 1581862, 1582092, 1581577, 1581837, 1583914, 1587509, 1592886, 1601439, 1613515]
58589A613515J4323J6122J9182K2879K5659K8273L2346L7161M1084M4669M8980
58578A944193N2568N3881N5163N9855O7309P4183P9982Q6967R5486J03870J12538
58567B785995J23647J36643J48486J58738J70438J85341K01815K18201K34964
58558D364268K52788K71328K90483L10366L29715L46476L60015L70397L75998
58549G271834L74116L63366L42787L09467K60291J96082J21453M1096m1110j20116
58539I119266j90345k48706k94671l27782l47688l56062l55815l48687l35814
58530F313696l19667l02594k84176k62951k40089k18478j98912j80087j61720
58521D145022j44772j29084j13702r9112q6599p6020o6677n9327n4723n1460m8070
$$ y = [1613515, 1627838, 1643960, 1663142, 1686021, 1711680, 1739953, 1772299, 1809460, 1850544, 1895213, 1944193, 1996761, 2050642, 2105805, 2165660, 2232969, 2307152, 2387134, 2474101, 2569587, 2673457, 2785995, 2909642, 3046285, 3194771, 3353509, 3523947, 3709288, 3911103, 4129304, 4364268, 4617056, 4888384, 5178867, 5489233, 5818948, 6165424, 6525439, 6895836, 7271834, 7645950, 8009316, 8352103, 8661570, 8921861, 9117943, 9239396, 9280492, 9239382, 9119266, 8928921, 8680215, 8385544, 8057762, 7710074, 7354012, 6998197, 6649510, 6313696, 5994029, 5691435, 5407259, 5144308, 4904219, 4685741, 4486829, 4306742, 4145022, 4000250, 3871166, 3757464, 3658352, 3571753, 3495733, 3429056, 3369729, 3315006, 3263546, 3215476]
58510C215476m5874m6526m8118m7353m4615m3306m4839m7603n0181n2387n3737
58499B690937n4020n4631n6663n8750n9425n9788o0744n9872n4959m8686m5310
58488B078089m4378m2307l8637l5730l3448k9492k4508k1688k1355k0771j9283
58477A746492j8901j9695j9299j7385j6178j6105j5120j2690j0514r007o983m813
58465A579802m072m130l017j436j732l245l026j092n60k389m395n504o774q194
58451A530236q690r411j2584j7002j8955j7706j5901j4812j3612j2933j4254j5818
58439A358558j4188j0046p511p564p213n479m788n758n859m381l748m722m969
58426A272332l594k697l361m224m751n862o874o085m512m760o204o008m489m299
$$ y = [3215476, 3169602, 3123076, 3074958, 3027605, 2982990, 2939684, 2894845, 2847242, 2797061, 2744674, 2690937, 2636917, 2582286, 2525623, 2466873, 2407448, 2347660, 2286916, 2227044, 2172085, 2123399, 2078089, 2033711, 1991404, 1952767, 1917037, 1883589, 1854097, 1829589, 1807901, 1786546, 1765775, 1746492, 1727591, 1707896, 1688597, 1671212, 1655034, 1638929, 1623809, 1611119, 1600605, 1591598, 1584615, 1579802, 1575730, 1571600, 1568583, 1567147, 1565415, 1562170, 1559144, 1558052, 1557492, 1555103, 1550708, 1545204, 1538430, 1530236, 1521546, 1512135, 1499551, 1482549, 1463594, 1445888, 1429987, 1415175, 1401563, 1388630, 1374376, 1358558, 1344370, 1334324, 1326813, 1319249, 1312036, 1306557, 1301769, 1296011, 1290152, 1285771, 1282023, 1277301, 1272332, 1268738, 1266041, 1262680, 1258456, 1253705, 1247843, 1240969, 1234884, 1230372, 1225612, 1219408, 1213400, 1208911, 1204612]
58412A204612m718k630R29J543q97j748K73J247l84j163M59J130q43k043J87L727
58396A199681O279Q759J1624J2889J2372J3031J5509J6195J3200R483P590N936
58384A332548K851l28k682n796j0035j2958j3717j4729j6896j7587j5481j3123
58372A212067j2451j2053j0820j0096j0350r856q359p861q277o887l461j251j419
58359A108926j232P23K389K682L213M302M276L797N618R044J0291R332J0294J3829
58345A187484J5656J4270J3521J5390J6871J6293J6292J7994J8646J7501J7728
58334A367646J9982K0534J8218J6625J6964J5587J1372Q429Q521P863M575K131
58322A518447J971J11n089q969q486p045p493p311m982l999n961o617l439k81
$$ y = [1204612, 1199894, 1197264, 1198193, 1199736, 1198839, 1197091, 1197364, 1198611, 1198227, 1197064, 1197523, 1198653, 1197810, 1195767, 1195954, 1199681, 1205960, 1214719, 1226343, 1239232, 1251604, 1264635, 1280144, 1296339, 1309539, 1319022, 1326612, 1332548, 1335399, 1335071, 1332389, 1326593, 1316558, 1303600, 1289883, 1275154, 1258258, 1240671, 1225190, 1212067, 1199616, 1187563, 1176743, 1166647, 1156297, 1146441, 1138082, 1130221, 1121944, 1115057, 1111596, 1110345, 1108926, 1107694, 1108417, 1110806, 1113488, 1116701, 1121003, 1125279, 1129076, 1134694, 1143738, 1154029, 1163361, 1173655, 1187484, 1203140, 1217410, 1230931, 1246321, 1263192, 1279485, 1295777, 1313771, 1332417, 1349918, 1367646, 1387628, 1408162, 1426380, 1443005, 1459969, 1475556, 1486928, 1495357, 1503878, 1511741, 1516316, 1518447, 1520418, 1520529, 1515440, 1506471, 1497985, 1490940, 1483447, 1476136, 1471154, 1467155, 1461194, 1454577, 1451138, 1450857]
58308A450857M9R00M582P041N126K616L583N679N248L506K815K374J829L361O388
58293A505954O544L529K828O006P167L385K88K177M847L951K386L336L905J994
58279A558297J810O028R890R512Q619J0689J2222J0452R915J4192J8752J9123
58267A689501J8668K1055K2744K0439J8329K0186K1775J8929J5658J6373J7697
58256A901354J5932J4871J8001K0855J9581J9019K3392K7190K4782K1042K2565
58245B128584K5974K5327K3762K7101L2499L4028L3460L5293L7157L4958L1731
58234B469874L1880L2836L1444L1768L7352M2958M3428M3247M7691N2463N2241
58223B917182N1259N4832N8624N7273N5338N8543O2601O2197O2344O8783P5910
$$ y = [1450857, 1450906, 1451806, 1456388, 1463429, 1468555, 1471171, 1474754, 1480433, 1485681, 1489187, 1492002, 1494376, 1496205, 1499566, 1505954, 1512498, 1516027, 1518855, 1524861, 1532028, 1535413, 1535701, 1537878, 1542725, 1546676, 1549062, 1552398, 1556303, 1558297, 1560107, 1566135, 1576025, 1585537, 1594156, 1604845, 1617067, 1627519, 1637434, 1651626, 1670378, 1689501, 1708169, 1729224, 1751968, 1772407, 1790736, 1810922, 1832697, 1851626, 1867284, 1883657, 1901354, 1917286, 1932157, 1950158, 1971013, 1990594, 2009613, 2033005, 2060195, 2084977, 2106019, 2128584, 2154558, 2179885, 2203647, 2230748, 2263247, 2297275, 2330735, 2366028, 2403185, 2438143, 2469874, 2501754, 2534590, 2566034, 2597802, 2635154, 2678112, 2721540, 2764787, 2812478, 2864941, 2917182, 2968441, 3023273, 3081897, 3139170, 3194508, 3253051, 3315652, 3377849, 3440193, 3508976, 3584886]
58212C584886P6827P6687Q3004R1315R3809R3788R8035J03292J04092J05518J14076
58201D625329J24321J28536J31053J38894J47455J50155J52755J62810J74758
58192E936066J81116J88325K04858K23957K35433K44341K60210K78204K89506
58183H042016K99930L19166L41918L59027L76567M04130M35359M60489M86309
58174A1524911N22501N60950N91048O22278O67785P19075P62268Q05592Q64009
58165A7640417R30529R90753J051743J127273J209312J285280J368550J479024
58157B7082881J608793J740960J885743K061312K256557K453032K666903K927680
58149D4683861L233694L572480L963986M434458M969389N546501O191950O942918
$$ y = [3584886, 3661713, 3738400, 3821404, 3912719, 4006528, 4100316, 4198351, 4301643, 4405735, 4511253, 4625329, 4749650, 4878186, 5009239, 5148133, 5295588, 5445743, 5598498, 5761308, 5936066, 6117182, 6305507, 6510365, 6734322, 6969755, 7214096, 7474306, 7752510, 8042016, 8341946, 8661112, 9003030, 9362057, 9738624, 10142754, 10578113, 11038602, 11524911, 12047412, 12608362, 13199410, 13821688, 14489473, 15208548, 15970816, 16776408, 17640417, 18570946, 19561699, 20613442, 21740715, 22950027, 24235307, 25603857, 27082881, 28691674, 30432634, 32318377, 34379689, 36636246, 39089278, 41756181, 44683861, 47917555, 51490035, 55454021, 59888479, 64857868, 70404369, 76596319, 83539237]
58141H3539237P777395Q649215R573842J0612401J1797484J3148493J4718704
58134A59816771J6524955J8467272K0447742K2565117K5092390K8301548L2373696
58127C23589491L7181542M1621354M3118763L8563842K6622122R351674q746380
58120E11302408k3494333l3054696l7804276l9018973l7924497l5482651l2400765
58113B72122217k9106373k5814009k2665825j9769962j7153875j4786332j2656481
58106A30169360j0783071r160663p747349o499407n384815m374698l450163k609683
58098H0159511j851287j147214m29398L96714J351053K205550K461089J671355
58090H4817373j12681k281971m115067n254065n751957n804434n565806n156930
$$ y = [83539237, 91316632, 99965847, 109539689, 120152090, 131949574, 145098067, 159816771, 176341726, 194808998, 215256740, 237821857, 262914247, 291215795, 323589491, 360771033, 402392387, 445511150, 484074992, 510697114, 520048788, 511302408, 487808075, 454753379, 416949103, 377930130, 340005633, 304522982, 272122217, 243015844, 217201835, 194536010, 174766048, 157612173, 142825841, 130169360, 119386289, 110225626, 102478277, 95978870, 90594055, 86219357, 82769194, 80159511, 78308224, 77161010, 76731612, 77128326, 78479379, 80684929, 83146018, 84817373, 84704692, 82422721, 78307654, 73053589, 67301632, 61497198, 55931392, 50774462]
58082E0774462m685473m208554l736620l289295k901318k575743k283395k012735
58074B5081329j778167j580410j401493j240237j113188j018405r33910q53342
58066A5162177p89917p44381p00967o55944o19949n91401n56288n14801m80671
58057I507858m54096m22080l85176l57192l38354l15286k88247k72340k69982
58048F405105k67013k58255k52948k52467k46020k31806k20421k13951k02630
58039D259594j85353j72926j67466j58380j42719j30481j25852j21162j13207
58030B942048j08191j06657j00436q8517p9873p7052p2540o4515o0566o2255o1372
58019B060074n5222n1046n1631n0782m6646m5497m8597m8785m3763l9810l9085
$$ y = [50774462, 46088989, 41880435, 38143815, 34854520, 31953202, 29377459, 27094064, 25081329, 23303162, 21722752, 20321259, 19081022, 17967834, 16949429, 16015519, 15162177, 14372260, 13627879, 12926912, 12270968, 11651019, 11059618, 10503330, 9988529, 9507858, 9053762, 8631682, 8246506, 7889314, 7550960, 7235674, 6947427, 6675087, 6405105, 6138092, 5879837, 5626889, 5374422, 5128402, 4896596, 4676175, 4462224, 4259594, 4074241, 3901315, 3733849, 3575469, 3432750, 3302269, 3176417, 3055255, 2942048, 2833857, 2727200, 2626764, 2538247, 2458374, 2381322, 2308782, 2244267, 2183701, 2121446, 2060074, 2004852, 1953806, 1902175, 1851393, 1804747, 1759250, 1710653, 1661868, 1618105, 1578295, 1539210]
58008A539210l6129l0158k7772k9905k8850k1984j6297j5570j4965j1994j1093
57997A294493j3477j3825j0933j0726j4888j7195j4800j2744j3673j3339r965
57986A148928q111r532r754p061n587o487n350j350N13r38o81K522L392K79j599
57971A099184q6K39k537m098l045m059q414j0694q769p839j0587j2280j0007p973
57957A009035r258j0545r566r671j2409j3356r991o636o945q448q579r368j1826
57944H82437j2391r220n906n175m730k841j837k813k944j210p10k493l366k492
57930H24309l403o600p152k992J259K222K715N114O581M984L305L996M708L442
57916H42488K329K655J791j324l297k394j977m471p381q565r729j1539j1098p782
$$ y = [1539210, 1503081, 1472923, 1445151, 1415246, 1386396, 1364412, 1348115, 1332545, 1317580, 1305586, 1294493, 1281016, 1267191, 1256258, 1245532, 1230644, 1213449, 1198649, 1185905, 1172232, 1158893, 1148928, 1140817, 1131285, 1121531, 1114470, 1108883, 1102396, 1097046, 1095696, 1096209, 1095271, 1094590, 1097112, 1100504, 1100783, 1099184, 1099098, 1099337, 1096800, 1092702, 1089657, 1085598, 1077184, 1066490, 1057721, 1049882, 1039295, 1027015, 1017008, 1009035, 999777, 989232, 979666, 969995, 957586, 944230, 934239, 927603, 920658, 912210, 903631, 894263, 882437, 870046, 860826, 854920, 849745, 845015, 842174, 840337, 837524, 834580, 833370, 832660, 830167, 826801, 824309, 820906, 814306, 807154, 804162, 805421, 807643, 810358, 815472, 822053, 827037, 830342, 834338, 839046, 842488, 844817, 847472, 849263, 847939, 844642, 842248, 840271, 835800, 828419, 819854, 810125, 798586, 787488, 779706]
57902G79706n753p181q618p503o448p564q457p541p435r244r339n899k900l399
57888F82425m437k891p97m69J92K835M383K420l2K49J250J97j239p72j24j313
57872F81877k567k396l267o839r821r231p497p809q461o605l693k441k020p31
57858F08499K21j88L25L072N079M313L997O988J0063R118O102N316O300O084N313
57843F80602O254P401N844K843J535J164j038m019m427k598j987l605n634p531
57829F74804j0006j1855j1184r147q601r674j0124r239q033o537m212k139j715
57816E72338k007j190M94J834L175N240O915P010O714P583Q653Q301P279P177
57802F39516P441O685N459N004M716L369J403k27j891l824m839m643n292q004
$$ y = [779706, 773953, 766772, 758154, 750651, 744203, 736639, 728182, 720641, 713206, 703962, 694623, 688724, 685824, 682425, 677988, 675097, 674300, 673831, 674023, 676858, 681241, 683661, 683629, 683878, 685128, 685325, 684086, 683314, 683190, 681877, 679310, 676914, 673647, 666808, 656987, 647756, 640259, 632450, 623989, 617384, 613691, 611250, 609230, 608499, 608720, 608532, 608857, 611929, 617008, 621321, 625318, 632306, 642369, 651487, 657589, 662905, 669205, 675289, 680602, 686856, 694257, 700101, 702944, 704479, 705643, 704605, 700586, 696159, 693561, 691574, 687969, 682335, 674804, 664798, 652943, 641759, 632612, 624011, 614337, 604213, 594974, 586941, 580404, 576192, 574053, 572338, 570331, 569141, 569635, 571469, 574644, 579884, 586799, 593809, 600523, 608106, 616759, 625060, 632339, 639516, 646957, 653642, 659101, 664105, 668821, 672190, 673593, 673366, 671475, 667651, 662812, 658169, 652877, 644873]
57788F44873j0750j1404j0975j1198j1381j0408r482r966j0727j0315r544r226
57776E19497p978n236l812n993r423j0353q908p761p559p218p034p955r195r592
57762D11480r860j0794j1134r901q777r240r659q343p017p712q542o558k917j170
57748B99856j828k477k018j184J35K501M764N406N106N340N783N783O638R272
57734C43077J1496J0798Q278O653O022M931L791L703L529J716l89o26J20m07j727
57719D00965j851j244j806l193l712l708m537n409m810l792m210n042m001j617
57705C52033j12L50P82M63j190j627J514N725O785N223M806N958O046N364P031
57690C99151J0795J2591J1061R465J0020J0987J0711J0251J0473J0175Q676P103
$$ y = [644873, 634123, 622719, 611744, 600546, 589165, 578757, 569275, 559309, 548582, 538267, 528723, 519497, 511519, 506283, 502471, 496478, 487055, 476702, 467794, 460033, 452474, 445256, 438222, 430267, 421072, 411480, 401620, 390826, 379692, 369791, 361014, 351774, 342115, 333772, 326755, 319043, 310501, 303943, 301026, 299856, 298028, 295551, 293533, 292349, 292484, 294985, 299749, 305155, 310261, 315601, 321384, 327167, 333805, 343077, 354573, 365371, 373649, 380302, 386324, 391255, 395046, 398749, 402278, 403994, 403605, 402979, 403099, 402692, 400965, 399114, 397870, 396064, 392871, 389159, 385451, 380914, 375505, 370695, 366903, 362693, 357651, 353650, 352033, 351921, 352271, 353053, 353516, 352326, 350699, 352213, 357938, 364723, 369946, 374752, 380710, 386756, 392120, 399151, 409946, 422537, 433598, 443063, 453083, 464070, 474781, 485032, 495505, 505680, 514356, 521459]
57678E21459O064M999M468N914Q548R744R097Q882R938J0536J0014J0067J1513
57665F31243J3025J4023J5687J8202K0141K1530K4302K8652L1981L2788L2770
57654H84344L3672L4790L5049L5095L5915L7381L9329M2215M5808M9165N2542
57643A325305N7274O3199O8436P2401P6886Q3294R0841R8255J05551J13556J23200
57632B278198J35354J49640J63549J74999J85713J99604K17724K37300K55956
57623C998037K74174K92834L10882L26431L38346L45738L47254L41138L25081
57614F899915K96735K56285K07867J56538J04777N3957P050l4454p5646j25239
57604G747785j85888k50157l06704l47755l70662l76317l68091l50075l24990
$$ y = [521459, 527523, 532522, 536990, 542904, 551452, 561196, 570293, 579175, 589113, 599649, 609663, 619730, 631243, 644268, 658291, 673978, 692180, 712321, 733851, 758153, 786805, 818786, 851574, 884344, 918016, 952806, 987855, 1022950, 1058865, 1096246, 1135575, 1177790, 1223598, 1272763, 1325305, 1382579, 1445778, 1514214, 1586615, 1663501, 1746795, 1837636, 1935891, 2041442, 2154998, 2278198, 2413552, 2563192, 2726741, 2901740, 3087453, 3287057, 3504781, 3742081, 3998037, 4272211, 4565045, 4875927, 5202358, 5540704, 5886442, 6233696, 6574834, 6899915, 7196650, 7452935, 7660802, 7817340, 7922117, 7976074, 7983124, 7948670, 7873024, 7747785, 7561897, 7311740, 7005036, 6657281, 6286619, 5910302, 5542211, 5192136, 4867146]
57595D867146k95056k64138k36031k10726j85627j60596j38363j19844j02870
57586C153895q6261p1307n8284m5382l2409k1649j3317l954Q587K1956L3313M3245
57574B928433N3445O3588P3254Q4170R7624J11868J24811J37304J51148J65636
57564C991281J78921J91400K04949K19577K32995K42813K47466K45712K36850
57555E991964K20652J96014J60834J14612O0146J547n8187j16423j69227k12458
57545F189474k44267k65572k78544k85059k85795k80421k69408k55507k41953
57536C782948k29235k15352j99388j82823j67169j52681j39776j29267j20379
57527B246878j11004j00926r2342q6132q0127p2472o4405n8076n3626n0036m6870
$$ y = [4867146, 4572090, 4307952, 4071921, 3861195, 3675568, 3514972, 3376609, 3256765, 3153895, 3067634, 2996327, 2938043, 2892661, 2860252, 2838603, 2825286, 2821332, 2829919, 2851875, 2885188, 2928433, 2981878, 3045466, 3118720, 3202890, 3300514, 3412382, 3537193, 3674497, 3825645, 3991281, 4170202, 4361602, 4566551, 4786128, 5019123, 5261936, 5509402, 5755114, 5991964, 6212616, 6408630, 6569464, 6684076, 6744222, 6745769, 6687582, 6571159, 6401932, 6189474, 5945207, 5679635, 5401091, 5116032, 4830237, 4549816, 4280408, 4024901, 3782948, 3553713, 3338361, 3138973, 2956150, 2788981, 2636300, 2496524, 2367257, 2246878, 2135874, 2034948, 1942606, 1856474, 1776347, 1703875, 1639470, 1581394, 1527768, 1477732, 1430862]
57516A430862m3722l9712l5144l1842l0458k9183k6459k3101k0327j7775j4956
57505A118183j2708j1382r472n821j516K038N094P964R550R586J0428J4095J9041
57492A155080K2321K3833K5827K9169L2629L5583L9007M3679M9091N4337N8960
57481A569516O3062O7349P2757P9331Q6167R3029J00978J10610J20796J30272
57471B493867J39431J49412J60226J70812J80318J88455J95131K00071K02130
57462D079853J99050J89085J72615J50530J21452Q3235L7572r807n4468r5904
57452D873213j33628j64146j84385j95743k01868k04114k01811j95507j87072
57443C204939j77216j65337j51511j36823j22244j08546r6684q6809p7622o8014
$$ y = [1430862, 1387140, 1347428, 1312284, 1280442, 1249984, 1220801, 1194342, 1171241, 1150914, 1133139, 1118183, 1105475, 1094093, 1084621, 1078800, 1077284, 1079322, 1084416, 1092380, 1101930, 1111516, 1121944, 1136039, 1155080, 1177401, 1201234, 1227061, 1256230, 1288859, 1324442, 1363449, 1407128, 1456219, 1510556, 1569516, 1632578, 1699927, 1772684, 1852015, 1938182, 2031211, 2132189, 2242799, 2363595, 2493867, 2633298, 2782710, 2942936, 3113748, 3294066, 3482521, 3677652, 3877723, 4079853, 4278903, 4467988, 4640603, 4791133, 4912585, 4995820, 5033392, 5023585, 4969117, 4873213, 4739585, 4575439, 4391054, 4195311, 3993443, 3789329, 3587518, 3392011, 3204939, 3027723, 2862386, 2710875, 2574052, 2451808, 2343262, 2246578, 2159769, 2082147, 2014133]
57433B014133n8543n0209m2737l5226k7486j9641j1497l326L973J0334J6836K3758
57421A820369L0092L5868M2881N1885O1088O8915P6103Q3559R0533R6866J04663
57410B562822J15272J26618J36054J44041J52472J61065J68084J72998J75512
57401C914938J73322J63673J46134J21362Q8604M7469R68m6191r1438j33596j69673
57390D215572j96090k12744k22560k27203k26243k20315k11807k02009j90536
57381B306065j77811j65494j54039j42386j30496j19718j10285j00903r1371q3185
57371A030377p6921p1243o5224n9716n5470n1692m7420m2897l8834l5459l2805
57360D52696l1008k9941k9295k8856k8004k5704k2188j9718k0016k1704k2074
$$ y = [2014133, 1955590, 1905381, 1862644, 1827418, 1799932, 1780291, 1768794, 1765468, 1769441, 1779775, 1796611, 1820369, 1850461, 1886329, 1929210, 1981095, 2042183, 2111098, 2187201, 2270760, 2361293, 2458159, 2562822, 2678094, 2804712, 2940766, 3084807, 3237279, 3398344, 3566428, 3739426, 3914938, 4088260, 4251933, 4398067, 4519429, 4608033, 4655502, 4656470, 4610279, 4518841, 4385245, 4215572, 4019482, 3806738, 3584178, 3356975, 3130732, 2910417, 2698610, 2496601, 2306065, 2128254, 1962760, 1808721, 1666335, 1535839, 1416121, 1305836, 1204933, 1113562, 1030377, 953456, 882213, 816989, 757273, 701803, 650111, 602691, 559794, 520960, 485501, 452696, 421688, 391747, 362452, 333596, 305592, 279888, 257700, 237982, 217966, 196262, 174188]
57349A74188k0611j8803j7392j6172j5765j6841j7916j6769j3963G730d417j1513
57337a5930r351p741q349r711r471p535n673n336o715q826j0023r582q706q604
57323a31553q104n426k075j845n374q717q563o192m628m377m070l457l334l698
57309b01413m032m689o128p340o726m324j885p91r00j300j300p25Q0M37o9j098
57293b42203j709j125L66J314M68j479k419j668r67j607k120o42J582J725k61
57278b50745j634j304j325l174n297n713m798l918l025j444K11P02Op91r65n16
57262b83730M53J834L269M412N102N214M841M670N384O701P858Q889J0297J1671
57248b03135J2075J1816J2229J3587J4891J5964J7864K0664K2781K3459a3664
$$ y = [174188, 153577, 134774, 117382, 101210, 85445, 68604, 50688, 33919, 19956, 7730, -4417, -15930, -25281, -33022, -41371, -51082, -60553, -68088, -73761, -79097, -85812, -94638, -104661, -114243, -122949, -131553, -139657, -145083, -147158, -149003, -154377, -163094, -171657, -177849, -182477, -186854, -190924, -194381, -197715, -201413, -205445, -210134, -216262, -223602, -230328, -234652, -236537, -237328, -238228, -239528, -240828, -241553, -241473, -241036, -241105, -242203, -243912, -245037, -244671, -243357, -242889, -244368, -246787, -248455, -249422, -251029, -253149, -253791, -252209, -250484, -250745, -252379, -253683, -255008, -258182, -263479, -269192, -273990, -277908, -280933, -282377, -282166, -281464, -281458, -282249, -283214, -283730, -283277, -281443, -278174, -273762, -268660, -263446, -258605, -253935, -248551, -241850, -233992, -225103, -214806, -203135, -191060, -179244, -167015, -153428, -138537, -122573, -104709, -84045, -61264, -37805, -13664]
57236A2557K8922L0633L1168L1383L1694L2173L3206L4890L6477L7436L8351L9959
57224D18849M1896M3319M4075M4549M4814M4612M3699M1827L8936L5533L2128
57213H74237K8193K2580J5111O599k603j2671k2726l0908l6655m1362m6037m9877
57201G03881n1966n2824n3166n2485n0070m6322m2007l7342l2831k9665k8084
57190B27119k6480k3415j9621j6679j4707j2589r793o592l196K47L212N360O945
57177A09811P927P598N962M486M292M588M227L917N325Q360J0894J1215R731Q203
57163B06536Q077R465J1286J2539J3601J5667J8707K1081K1728K1555K2015K3255
57151D05512K4585K5681K6334K5991K4637K3377K3176K3762K4527K5531K6961
$$ y = [12557, 41479, 72112, 103280, 134663, 166357, 198530, 231736, 266626, 303103, 340539, 378890, 418849, 460745, 504064, 548139, 592688, 637502, 682114, 725813, 767640, 806576, 842109, 874237, 902430, 925010, 940121, 946720, 944117, 931446, 908720, 877812, 841157, 799795, 753758, 703881, 651915, 599091, 545925, 493440, 443370, 397048, 355041, 317699, 284868, 255203, 227119, 200639, 177224, 157603, 140924, 126217, 113628, 103835, 97243, 94047, 94294, 97506, 102866, 109811, 117738, 125336, 131298, 135784, 140076, 144664, 148891, 152808, 158133, 166493, 177387, 188602, 198333, 206536, 214613, 224078, 235364, 247903, 261504, 277171, 295878, 316959, 338687, 360242, 382257, 405512, 430097, 455778, 482112, 508103, 532740, 556117, 579293, 603055, 627582, 653113, 680074]
57140F80074K8734L1464L6434M3441N0106N4630N7802O0836O2816O2272N9864
57129A228473N7246N4229M9576M3916L9297L6105L2776K8684K5072K2859K1501
57118A639734K0442J9972K0180K0502K0711K1117K1649K1915K2225K3173K4201
57107A875821K3967K2214K0060J8462J7622J7779J9210K1511K4036K6762K9400
57096B116844L0497K9059K6352K3853K0037J2011L29j0664j7692k1239k2997k3648
57084B162742k4270k7202l3893m3804n6471p2376r0543j07721j21562j32651j42180
57073A310069j50143j57443j67149j81108j97408k13474A3569b34567k68419k89514
57063g92500l12140l37766l66373l97895m34444m78251n28775n84476o45706p12854
$$ y = [680074, 708808, 740272, 776706, 820147, 870253, 924883, 982685, 1043521, 1106337, 1168609, 1228473, 1285719, 1339948, 1389524, 1433440, 1472737, 1508842, 1541618, 1570302, 1595374, 1618233, 1639734, 1660176, 1680148, 1700328, 1720830, 1741541, 1762658, 1784307, 1806222, 1828447, 1851620, 1875821, 1899788, 1922002, 1942062, 1960524, 1978146, 1995925, 2015135, 2036646, 2060682, 2087444, 2116844, 2147341, 2176400, 2202752, 2226605, 2246642, 2258653, 2258982, 2248318, 2230626, 2209387, 2186390, 2162742, 2138472, 2111270, 2077377, 2033573, 1977102, 1904726, 1814183, 1706462, 1584900, 1452249, 1310069, 1159926, 1002483, 835334, 654226, 456818, 243344, 13569, -234567, -502986, -792500, -1104640, -1442406, -1808779, -2206674, -2641118, -3119369, -3648144, -4232620, -4878326, -5591180]
57053e591180p83497q55156r29476j010251j099132j197419j310586j446372j609645
57044a5832714j803944k036987k320160k664660l084577l603109m250047n053142
57036d0649340o032210p189526q494646r893486j1358003j2914525j4572684j6211016
57028a27315436j7600136j8627905j9512049k0709429k2516975k4699599k6480845
57021b77462374k6908949k5322005k1620522j6235809r873583l218125L229510
57014c77411857R133652J4230601J8293069K1178953K2888678K3565571K3443651
57007b44677682K2778683K1787797K0615678J9339486J7999024J6620521J5222372
57000a10314121J3818668J2429085J1081959R804090Q612228P516709O526577
$$ y = [-5591180, -6374677, -7229833, -8159309, -9169560, -10268692, -11466111, -12776697, -14223069, -15832714, -17636658, -19673645, -21993805, -24658465, -27743042, -31346151, -35596198, -40649340, -46681550, -53871076, -62365722, -72259208, -83617211, -96531736, -111104420, -127315436, -144915572, -163543477, -183055526, -203764955, -226281930, -250981529, -277462374, -304371323, -329693328, -351313850, -367549659, -377423242, -380641367, -377411857, -368278205, -354047604, -335754535, -314575582, -291686904, -268121333, -244677682, -221898999, -200111202, -179495524, -160156038, -142157014, -125536493, -110314121, -96495453, -84066368, -72984409, -63180319, -54568091, -47051382, -40524805]
56993d0524805N646544M874036M203861L631798L149961K743394K396511K100303
56985a1778397J849615J637022J454154J296550J162311J047391R46205Q55806
56977a529343g53528d8572E92072N81362N26779M76459M30507L90563L57832L30879
56967C686453L06904K84130K61548K38194K14478J92434J72695J53049J31980
56958E641865J11668R5061Q1852O9780N8092M7169L6508K6045J7922J3936J2420
56947F212318J0474P988O242L690l162j4532k5766l1023k7417j7835j3206k9945
56935F077826p8865j53891k34119k98349l36884l50940l45908l27622l01841k73340
56925C376067k44905k18000j93880j73427j56631j42883j31500j21962j14144
$$ y = [-40524805, -34878261, -30004225, -25800364, -22168566, -19018605, -16275211, -13878700, -11778397, -9928782, -8291760, -6837606, -5541056, -4378745, -3331354, -2385149, -1529343, -753528, -48572, 592072, 1173434, 1700213, 2176672, 2607179, 2997742, 3355574, 3686453, 3993357, 4277487, 4539035, 4777229, 4991707, 5184141, 5356836, 5509885, 5641865, 5753533, 5848594, 5930446, 6000226, 6058318, 6105487, 6141995, 6168040, 6185962, 6199898, 6212318, 6222792, 6230780, 6237022, 6240712, 6237550, 6223018, 6197252, 6166229, 6138812, 6120977, 6107771, 6077826, 5998961, 5845070, 5610951, 5312602, 4975718, 4624778, 4278870, 3951248, 3649407, 3376067, 3131162, 2913162, 2719282, 2545855, 2389224, 2246341, 2114841, 1992879, 1878735]
56916A878735j08224j04001j00629r7430r4156q9982q3490p4524o4848n5844m6924
56905I58683l7422k8460k1219j5014r086m609k478o57L199P507Q343M699r81p026
56891H55479j3851k0897k5732k7212k6847k6071k4439k1404j7700j4080j0544
56880F26702p421n382l850j409J786M051N197P405J2273J8780K4698K8019K6535
56867G37384J8620N895o720j5161j9420k1843k3872k5449k6184k5736k3926k1282
56855E52306j8880j7204j5971j4990j4052j2104q296l841j090m90k94N27J277
56842D46898J979M309Q898J3588J5849J5641J4806J4874J6339J8829K1082K1925
56830F15017K1831K2461K4310K6295K7840K9296K9739K6650J9097R506J006n411
$$ y = [1878735, 1770511, 1666510, 1565881, 1468451, 1374295, 1284313, 1200823, 1126299, 1061451, 1005607, 958683, 921261, 892801, 871582, 856568, 847482, 842873, 840395, 839738, 842937, 850444, 858787, 863486, 862505, 855479, 841628, 820731, 794999, 767787, 740940, 714869, 690430, 669026, 651326, 637246, 626702, 619281, 613899, 610049, 608640, 610426, 614477, 619674, 627079, 639352, 658132, 682830, 710849, 737384, 756004, 761899, 755179, 740018, 720598, 698755, 674883, 649434, 623250, 597514, 573588, 552306, 533426, 516222, 500251, 485261, 471209, 459105, 450809, 446968, 445878, 445388, 445094, 445621, 446898, 448877, 453186, 462084, 475672, 491521, 507162, 521968, 536842, 553181, 572010, 593092, 615017, 636848, 659309, 683619, 709914, 737754, 767050, 796789, 823439, 842536, 852042, 853048, 847637]
56818H47637j0031j2602j2945j2082j1214j0435r310p623m857m86M341P194P664
56805G75251Q608J2704J9181K5495L0750L5667M0169M2776M1675L5279K2788N941
56793A096284j0571k2066k7269k8127k7103k5559k3709k0749j5535q197n83N580
56781H92396J0424J5291K1177K8345L6376M3986M9904N4504N9173O3204O2721
56770A337501N3868L6193J2599j2371l3566m7075n2957n4844n5355n3338m6974
56759A083681l7683k8850k1969j6229j0885n825n19N525J1660J7071K2309K8287
56747A046573L4318L8553L9518L5814K5543Q517j1399k8325l9000m4242m6226
56736A059644m6044m3813l9628l4123k8727k4896k2314j8825j3223p053k343J204
$$ y = [847637, 837606, 825004, 812059, 799977, 788763, 778328, 769018, 761395, 756538, 756052, 760393, 767587, 775251, 783859, 796563, 815744, 841239, 871989, 907656, 947825, 990601, 1032276, 1067555, 1090343, 1096284, 1085713, 1063647, 1036378, 1008251, 981148, 955589, 931880, 911131, 895596, 887399, 886816, 892396, 902820, 918111, 939288, 967633, 1004009, 1047995, 1097899, 1152403, 1211576, 1274780, 1337501, 1391369, 1427562, 1440161, 1427790, 1394224, 1347149, 1294192, 1239348, 1183993, 1130655, 1083681, 1045998, 1017148, 995179, 978950, 968065, 962240, 961721, 967246, 978906, 995977, 1018286, 1046573, 1080891, 1119444, 1158962, 1194776, 1220319, 1228836, 1217437, 1189112, 1150112, 1105870, 1059644, 1013600, 969787, 930159, 896036, 867309, 842413, 820099, 801274, 788051, 780998, 778655, 779859]
56724G79859N094R329J2872J5782J8585K0052J7926J1707K835p407j7997k6701
56712H41936l1183l1846l1295l0740k9164k6278k3696k2229k0298j6507j2115
56701E66585r438q951r272r198q496p279n783m597m300m761n080m336k452m08
56687D82234N72K90l77q93j745l185m124l401j629o53j333k839l927m083l609
56672D51298l330l921n026n458m827m118m040l816k615j125m78o28j069k055l522
56657D05270l913k073N23J484P64R3j92j299l129l870k723r39K89J106J762J951
56641C95104J712J454Q99k89r61M07K934L905K532Q50L76L41P1N72K260L352K402
56624D17921O76J77P03P51K43K87R84J304Q68K47k37o20l65J236L568M879M250
$$ y = [779859, 784953, 794282, 807154, 822936, 841521, 861573, 879499, 891206, 894041, 886634, 868637, 841936, 810753, 778907, 747612, 716872, 687708, 661430, 637734, 615505, 595207, 578700, 566585, 557147, 548196, 538924, 529726, 521230, 513951, 508168, 503571, 499271, 494510, 489430, 485094, 482642, 482234, 482806, 483096, 482719, 481826, 480081, 476896, 472772, 469371, 467742, 467089, 465756, 462917, 458990, 454907, 451298, 447968, 444047, 439021, 433563, 428736, 424618, 420578, 416762, 414147, 413022, 412544, 411916, 410847, 408792, 405270, 401357, 399284, 399807, 401291, 402055, 402148, 401956, 400657, 397528, 393658, 390935, 389996, 390285, 391391, 393153, 395104, 396816, 398270, 399169, 398880, 397919, 398326, 401260, 405165, 407697, 408547, 408923, 409264, 409335, 409907, 412167, 415519, 417921, 418597, 418774, 419477, 420228, 420471, 420758, 421742, 423046, 423914, 424161, 423924, 423304, 422939, 424175, 427743, 432622, 436872]
56607D36872K523R31l68j769k843k440l38J831K031K6k413l613l614l439l557
56592D19820l739l651k944j417J48J03k035m450n106m319l831l973l502k034o91
56577C78379j96M3N76J090J356J707K131K101J641J492J848K055J821J601J512
56562C99157J018M9o52o66l52l5K54J77o08j338p46J002K317K426K202K326K138
56545D08669J024l27r75j001r35p90m52k58n05r48j201j063l27R58J851J195o91
56528D04224j975j362N48K203K665K045J229J308K469L484L141K036J827K817
56514D26659L637L357K529J959J817K292L727N686P028P274O952O423N560M602
56500D89502M079L833L443L481M721O237O197M752M122N332O839P057O259N167
$$ y = [436872, 439395, 440326, 439958, 438189, 435346, 432906, 432568, 434399, 436430, 436456, 434043, 430430, 426816, 423377, 419820, 416081, 412430, 409486, 408069, 408217, 408320, 406285, 401835, 396729, 392410, 388579, 384606, 381104, 379070, 378379, 378183, 378226, 378802, 379892, 381248, 382955, 385086, 387187, 388828, 390320, 392168, 394223, 396044, 397645, 399157, 400175, 400224, 399572, 398906, 398554, 398519, 398773, 398950, 398342, 397004, 396258, 397260, 399577, 402003, 404205, 406531, 408669, 409693, 409366, 408391, 407390, 406455, 405665, 405213, 404955, 404450, 403502, 402301, 401238, 400911, 401869, 403720, 404915, 404224, 402249, 400887, 401435, 403638, 406303, 408348, 409577, 410885, 413354, 416838, 419979, 422015, 423842, 426659, 430296, 433653, 436182, 438141, 439958, 442250, 445977, 451663, 458691, 465965, 472917, 479340, 484900, 489502, 493581, 497414, 500857, 504338, 509059, 515296, 521493, 526245, 530367, 535699, 542538, 549595, 555854, 561021]
56486E61021L541J356k57n51m02j010k378l872n097n603n008m053m160n296n721
56471E22510m615l406l566m526m765l857k452j358j284k434l746l755k634k046
56457D78066k637l287l242l157l353l004j955j502k374l663m612n654o741o642
56443D26243n036l415k741k111r72m93j271j739o59P56J064J134K296L526K855
56428D19437N75j136j110k5R83J109J20r55k97K381N139O424O891P480P505O261
56412D60782M875M690N179N252N223N700N897N020M014M010M354M143M254N697
56398E29090P119O465M121K093R61n5p25LJ780L021L166L045L250L593L767L257
56382E73951J359j403l009k481j454j544j701l38J345Q67j646l797m577n050n679
$$ y = [561021, 564562, 565918, 565661, 565110, 564708, 563698, 561320, 557448, 552351, 546748, 541740, 537687, 533527, 528231, 522510, 517895, 514489, 510923, 506397, 501632, 497775, 495323, 493965, 492681, 490247, 486501, 482746, 480112, 478066, 475429, 472142, 468900, 465743, 462390, 459386, 457431, 455929, 453555, 449892, 445280, 439626, 432885, 426243, 421207, 417792, 415051, 412940, 411968, 411475, 410204, 408465, 407806, 408562, 409626, 410760, 413056, 416582, 419437, 420012, 418876, 417766, 417741, 418724, 419833, 419953, 418998, 418701, 421082, 426221, 432645, 439536, 447016, 454521, 460782, 465657, 470347, 475526, 480778, 486001, 491701, 497598, 502618, 506632, 510642, 514996, 519139, 523393, 529090, 536209, 542674, 546795, 548888, 549849, 549794, 549069, 549072, 550852, 553873, 557039, 560084, 563334, 566927, 570694, 573951, 575310, 573907, 570898, 568417, 566963, 565419, 563718, 563380, 564725, 565592, 563946, 560149, 555572, 550522, 544843]
56367E44843n588m584l754l731m085m402m492l780k152j020j873m064n586n647
56353D90085m926l889k535j364q84o59j85k5o32j029l99Q2r33k336j996j37J071
56336D69309P70J7m71r10j055k82Q87J247P26K70K91O85J720L311M233L803L371
56319D87922M360N902O390O169O383O397N044L421L577N002N286L885K534K222
56305E54494K368K746L691M583M571M391N155N903M962L142K710L594L712K812
56291F08834K823M198M967L966K299J194P44J118K563M002L861K509J794K342
56277F47214L550N645R042J2041J2360J0791J0300J1424J1817J0609R789J0590
56265G65172J1633J1705J1606J2197J2968J3449J3935J4272J3969J3788J5038
$$ y = [544843, 539255, 534671, 530917, 527186, 523101, 518699, 514207, 510427, 508275, 507255, 505382, 501318, 495732, 490085, 485159, 481270, 478735, 477371, 476487, 475828, 475643, 475618, 474986, 473957, 473558, 473640, 472707, 470371, 468375, 468238, 469309, 470079, 470096, 469625, 468715, 467660, 467378, 468265, 469512, 470238, 470508, 470799, 471484, 473204, 476515, 480748, 484551, 487922, 492282, 498184, 504574, 510743, 517126, 523523, 528567, 531988, 535565, 540567, 545853, 549738, 552272, 554494, 556862, 559608, 563299, 567882, 572453, 576844, 581999, 587902, 592864, 596006, 598716, 602310, 606022, 608834, 611657, 615855, 620822, 624788, 627087, 628281, 629025, 630143, 632706, 636708, 640569, 643078, 644872, 647214, 650764, 656409, 665451, 677492, 689852, 700643, 710943, 722367, 734184, 744793, 754582, 765172, 776805, 788510, 800116, 812313, 825281, 838730, 852665, 866937, 880906, 894694, 909732]
56254I09732J7164J8300J8109J7674J6890J4707J1838J0163R466P924N711M805
56242A062483N174M794L781M565P173Q371O841N515P009R991J2022J3212J5013
56229A165944J7693K0759K4001K6888K8658K9817L1844L5042L8670M3087M9061
56218A511464N5024N8273N9343O1933O7843P5108Q1863Q8702R6324J04128J12305
56207B372310J22272J33947J45550J56794J69350J83471J97632K12009K28576
56198C921911K46747K62999K76045K88442L01442L12299L18573L21300L21530
56189F571288L17206L05870K87438K62256K29561J90174J47715J04898O1207J6176
56179H493789k7899o8432j04935j36915j62231j79773j91467j99772k05340k08425
$$ y = [909732, 926896, 945196, 963305, 980979, 997869, 1012576, 1024414, 1034577, 1044043, 1051967, 1057678, 1062483, 1067657, 1072451, 1076232, 1080797, 1087970, 1096341, 1103182, 1108697, 1115706, 1125697, 1137719, 1150931, 1165944, 1183637, 1204396, 1228397, 1255285, 1283943, 1313760, 1345604, 1380646, 1419316, 1462403, 1511464, 1566488, 1624761, 1684104, 1746037, 1813880, 1888988, 1970851, 2059553, 2155877, 2260005, 2372310, 2494582, 2628529, 2774079, 2930873, 3100223, 3283694, 3481326, 3693335, 3921911, 4168658, 4431657, 4707702, 4996144, 5297586, 5609885, 5928458, 6249758, 6571288, 6888494, 7194364, 7481802, 7744058, 7973619, 8163793, 8311508, 8416406, 8477613, 8493789, 8465890, 8397458, 8292523, 8155608, 7993377, 7813604, 7622137, 7422365, 7217025, 7008600]
56169G008600k09974k10169k08572k06709k07436k10644k12997k12913k12318
56160E116868k12359k11403k08661k05582k02084j95764j86679j78473j72476
56151C343387j65286j54588j42931j32983j23546j13332j04226r7409r0409q1578
56141B137099p3456o8241o3842n8189n3336n1179m8908m3289l6326l2157l0969
56130A577207l0110k8610k6717k3404j8263j3694j1708j0826r070p317o550m941
56118A385997j134K622M130N028P425R872J0413J0560J2394J4645J5391J5721
56106A493064J6870J6900J4202J1317J1065J1816J0614Q208O832N965M394L704
56094A614951N499P922Q976J0335J3886J7802K0325K3857L0562L7309M0411M2258
$$ y = [7008600, 6798626, 6588457, 6379885, 6173176, 5965740, 5755096, 5542099, 5329186, 5116868, 4904509, 4693106, 4484445, 4278863, 4076779, 3881015, 3694336, 3515863, 3343387, 3178101, 3023513, 2880582, 2747599, 2624053, 2510721, 2406495, 2309086, 2218677, 2137099, 2063643, 1995402, 1931560, 1873371, 1820035, 1768856, 1719948, 1676659, 1640333, 1608176, 1577207, 1547097, 1518487, 1491770, 1468366, 1450103, 1436409, 1424701, 1413875, 1404805, 1397488, 1390938, 1385997, 1384863, 1387485, 1391615, 1396643, 1404068, 1413940, 1424353, 1434913, 1447307, 1461952, 1477343, 1493064, 1509934, 1526834, 1541036, 1552353, 1563418, 1575234, 1585848, 1594056, 1600888, 1606853, 1611247, 1614951, 1620450, 1628372, 1637348, 1647683, 1661569, 1679371, 1699696, 1723553, 1754115, 1791424, 1831835, 1874093]
56082A874093M7686N6318O4058P0049P6840Q5471R5341J07035J20479J32257J39179
56071B868806J42356J43434J39852J28995J14395J02330R4232Q7485Q1275P6017
56061C979177O9008N6353L8287J8110k392k2184l8112m7879n4150o1302p0148
56050C864768p9740r1355j05762j19344j27891j31706j32553j28940j19487j07537
56040B720453r6972q6669p4426o2740n4881m8775m1075l3734l0300k8953k5874
56029B136054k2273k1421k1833k0033j7052j5634j4319j0942q380r681j1209q147
56017A955130l087j411j797N59M810P045Q495J2460J6367J6026J4638J8185K4597
56004B072017K7061K5594K5758K8079K8437K7027K7368K8226K5912K2670K3391
$$ y = [1874093, 1921779, 1978097, 2042155, 2112204, 2189044, 2274515, 2369856, 2476891, 2597370, 2729627, 2868806, 3011162, 3154596, 3294448, 3423443, 3537838, 3640168, 3734400, 3821885, 3903160, 3979177, 4048185, 4104538, 4142825, 4160935, 4158543, 4136359, 4098247, 4050368, 3996218, 3934916, 3864768, 3785028, 3693673, 3587911, 3468567, 3340676, 3208970, 3076417, 2947477, 2827990, 2720453, 2623481, 2536812, 2462386, 2399646, 2344765, 2295990, 2254915, 2221181, 2190881, 2161928, 2136054, 2113781, 2092360, 2070527, 2050494, 2033442, 2017808, 2003489, 1992547, 1984167, 1974486, 1963277, 1955130, 1952043, 1950632, 1948835, 1949394, 1954204, 1961249, 1969744, 1982204, 1998571, 2014597, 2029235, 2047420, 2072017, 2099078, 2124672, 2150430, 2178509, 2206946, 2233973, 2261341, 2289567, 2315479, 2338149, 2361540]
55993B361540K6291K6288K5074K8028L3572L6030L6505M0325M6079M8106M7705
55982B755543N0591N5354N5931N3526N4397N7685N7392N4744N6400O1890O5042
55971C378495O6294P1277P8780Q2712Q4394R0102R8447J03254J06715J15642J26988
55960D403100J31775J31453J35089J42280J44893J44081J48828J58657J64948
55951E705104J68793J79792J97248K10497K18213K29493K45421K57931K67357
55942G679849K82513L02791L19221L33516L56398L86783M13172M35688M65299
55933A0975230N01149N31486N57587N92937O37798O79345P18036P67692Q28031
55924A6789291Q84357R36411R99017J072293J141619J209802J297316J407285
$$ y = [2361540, 2387831, 2414119, 2439193, 2467221, 2500793, 2536823, 2573328, 2613653, 2659732, 2707838, 2755543, 2806134, 2861488, 2917419, 2970945, 3025342, 3083027, 3140419, 3195163, 3251563, 3313453, 3378495, 3444789, 3516066, 3594846, 3677558, 3761952, 3852054, 3950501, 4053755, 4160470, 4276112, 4403100, 4534875, 4666328, 4801417, 4943697, 5088590, 5232671, 5381499, 5540156, 5705104, 5873897, 6053689, 6250937, 6461434, 6679647, 6909140, 7154561, 7412492, 7679849, 7962362, 8265153, 8584374, 8917890, 9274288, 9661071, 10074243, 10509931, 10975230, 11476379, 12007865, 12565452, 13158389, 13796187, 14475532, 15193568, 15961260, 16789291, 17673648, 18610059, 19609076, 20681369, 21822988, 23032790, 24330106, 25737391]
55916B5737391J523429J645901J793166J964630K140460K324371K546355K816993
55908D2492696L122016L467765L884018M373958M913549N510640O208486P018492
55900H0991620P909905Q879001R961591J1164260J2463141J3891422J5540700
55893A60801640J7452611J9607634K2039706K4830266K7956574L1295615L4739092
55886C38723138L7875726L9260245L6418026K7416991J2855565l914741j8812846
55879D69822104k9351495l5257326l7500280l7221004l5360764l2654760k9590312
55872B32886163k6417324k3292977k0368670j7731660j5374758j3278235j1460047
55865A04962492r923111q623962p523939o615566n875934n247902m691096m206470
$$ y = [25737391, 27260820, 28906721, 30699887, 32664517, 34804977, 37129348, 39675703, 42492696, 45614712, 49082477, 52966495, 57340453, 62254002, 67764642, 73973128, 80991620, 88901525, 97780526, 107742117, 118906377, 131369518, 145260940, 160801640, 178254251, 197861885, 219901591, 244731857, 272688431, 303984046, 338723138, 376598864, 415859109, 452277135, 479694126, 492549691, 488634950, 469822104, 440470609, 405213283, 367713003, 330491999, 295131235, 262476475, 232886163, 206468839, 183175862, 162807192, 145075532, 129700774, 116422539, 104962492, 95039381, 86415419, 78891480, 72275914, 66399980, 61152078, 56460982, 52254512]
55857E2254512l792785l423405l083647k788564k544343k328787k126372j947706
55849C0218903j798322j661086j525325j403374j303224j212320j121947j041464
55841A9151841r75682r13077q48505p93888p54710p18384o76563o37301o05182
55832A2228549n70897n30633m95129m69496m43778m13041l87476l72842l59423
55823H185834l40030l21355l08247k93972k75308k60613k53731k45650k30876
55814E656052k16795k08429j99196j85271j74171j70363j66540j57678j50101
55805D027508j48418j46691j40567j35135j32863j26801j13741j01610r5765r0079
55795B795838p9504o9627o5748o4064o1429o2588o9677p5276p3801o9725o7385
$$ y = [52254512, 48461727, 45038322, 41954675, 39166111, 36621768, 34292981, 32166609, 30218903, 28420581, 26759495, 25234170, 23830796, 22527572, 21315252, 20193305, 19151841, 18176159, 17263082, 16414577, 15620689, 14865979, 14147595, 13471032, 12833731, 12228549, 11657652, 11127019, 10631890, 10162394, 9718616, 9305575, 8918099, 8545257, 8185834, 7845804, 7524449, 7216202, 6922230, 6646922, 6386309, 6132578, 5886928, 5656052, 5439257, 5230828, 5031632, 4846361, 4672190, 4501827, 4335287, 4177609, 4027508, 3879090, 3732399, 3591832, 3456697, 3323834, 3197033, 3083292, 2981682, 2885917, 2795838, 2716334, 2646707, 2580959, 2516895, 2455466, 2392878, 2323201, 2247925, 2174124, 2104399, 2037014]
55784B037014o3054n4373m7119m5044m2809l6392l0717k9775k8853k4038k0112
55773A614728k1590k4767k5725k7262l1071l2182k8325k5736k8468l0776k7573
55762A311253k3568k4195k5986k4122k1631k2732k4269k1931j8474j8028j8435
55751A067882j6477j4561j5227j5207j1718q519q950r177n150k12J021N94K209
55738I66508L920K496j42j247k873p127j0963j1538j1592j3988j6238j6002j6233
55725H64981j9131k0795j7853j3743j2455j1839r109p058q341r306o415l476n522
55712G19938j0428j3370j4877j7694k0145j9428j7490j7166j6582j3375j0159
55701E49224r777r664p146n530q322j1987j1526q973r187j1126j0712q924r505
$$ y = [2037014, 1973960, 1919587, 1872468, 1827424, 1784615, 1748223, 1717506, 1687731, 1658878, 1634840, 1614728, 1593138, 1568371, 1542646, 1515384, 1484313, 1452131, 1423806, 1398070, 1369602, 1338826, 1311253, 1287685, 1263490, 1237504, 1213382, 1191751, 1169019, 1144750, 1122819, 1104345, 1086317, 1067882, 1051405, 1036844, 1021617, 1006410, 994692, 986173, 977223, 968046, 962896, 962684, 963705, 964299, 966508, 970428, 972924, 972782, 971535, 968662, 961535, 950572, 939034, 927442, 913454, 897216, 881214, 864981, 845850, 825055, 807202, 793459, 781004, 769165, 760056, 752998, 744657, 735351, 728936, 725460, 719938, 709510, 696140, 681263, 663569, 643424, 623996, 606506, 589340, 572758, 559383, 549224, 539447, 529783, 522637, 517107, 508785, 496798, 485272, 476299, 467112, 455986, 445274, 436350, 426845]
55688D26845j1419j0786q128o951p189o199m397m006m344l546k760l577m063k302
55674C47178o76j549k255J16K707J703n07M07K680J606k043l839l671m859p081
55659C29917p102n407n463p162p128m928l382l161k292m54Q83J819L288M187L322
55644B96937K558L885N508M973L773M162M209J280k180k040N46J335K70O12K396
55629C28224K766J790K226M125M983M512M412M285K590O21Q14K269K511K214L357
55614C71699M430K682l87j168k25q95k815k524J84K013J847J524J413L35o97M04
55598C77820K412K434J201J814L887M105K070M99J8j199k860k783j546k055m528
55583C81289o464p272q357r192q241p186r049j2396j2674r268o093n175m858m487
$$ y = [426845, 415426, 404640, 396512, 389561, 382372, 376173, 371776, 367770, 363426, 359880, 357120, 353543, 349480, 347178, 346502, 344953, 342698, 342814, 345521, 347224, 346717, 347124, 349804, 351410, 349367, 345528, 341857, 336998, 329917, 322815, 317408, 311945, 304783, 297655, 292727, 289345, 286184, 283892, 283438, 284321, 286140, 289428, 293615, 296937, 299495, 303380, 308888, 313861, 317634, 321796, 326005, 327285, 325105, 323065, 323611, 324946, 325216, 325828, 328224, 330990, 332780, 335006, 339131, 344114, 348626, 353038, 357323, 359913, 360534, 361348, 363617, 366128, 368342, 371699, 376129, 378811, 378424, 377256, 377031, 376136, 373321, 370797, 370981, 372994, 374841, 376365, 377778, 378113, 377416, 377820, 380232, 382666, 383867, 385681, 389568, 393673, 395743, 396242, 396260, 395061, 392201, 389418, 387872, 385817, 381289, 374825, 367553, 359196, 350004, 341763, 334577, 325528, 313132, 300458, 291190, 285097, 279922, 275064, 270577]
55569B70577n562p613q013o671o333p572p951o591n267m663l853l489n030o809
55555A85160n714k667j488k318j556J309K525O20j414j678j925l012k899r70L04
55540A64277k35o72j66n36k159k714j553j109k293k816j681j069j875j723M96
55525A44172K255J816J063J614J818K91j083l53J208J572J159J218J394J068R81
55510A60193J734K575L062L901N126N663N531O053P100O795M795L056K468J620
55496B19672k54k000l163m833o941p749p038o738p360p003n046l525l505l279
55482A51238j754n35r26j694j537j122j021k06J704L122K982K463K868L806M556
55467A63944N167N318M273K608J776J531L78j311j575n80o94k266k937j975j547
$$ y = [270577, 265015, 257402, 249389, 242718, 236385, 228813, 220862, 214271, 209004, 204341, 200488, 196999, 191969, 185160, 179446, 176779, 175291, 172973, 171417, 172726, 175251, 175871, 174457, 172779, 170854, 167842, 164943, 163973, 164277, 164042, 163370, 163204, 162668, 160509, 157795, 156242, 155133, 152840, 150024, 148343, 147274, 145399, 143676, 144172, 146427, 148243, 149306, 150920, 152738, 153029, 151946, 151593, 152801, 154373, 155532, 156750, 158144, 159212, 160193, 161927, 164502, 167564, 171465, 176591, 182254, 187785, 193838, 200938, 207733, 212528, 215584, 218052, 219672, 219418, 217418, 214255, 209422, 202481, 194732, 187694, 180956, 173596, 166593, 161547, 158022, 154517, 151238, 149484, 148949, 148023, 146329, 144792, 143670, 142649, 142443, 144147, 147269, 150251, 152714, 155582, 159388, 163944, 169111, 174429, 178702, 181310, 183086, 184617, 184995, 183684, 182109, 181529, 180835, 178569, 175632, 173657, 172110]
55452A72110k567l020j971j519k986m521m482l966m055l677k214j308j982k719
55438A31123k369k198l082l431j977j79J32p24j721k647k918j611jr75m318n907
55422I7197l541k09O41k86p93j088j977k092l38J218K33k048k895k316k202k738
55406G6766k667j930j393q81J55R86O06m86j271j763k075j400L71J552Q92n03
55390F6959j096j148j412j378o19j97q13j168j79Q12R8j528k042j195k16M18J038
55373E6334J476J337R82R16R53Q20O83M80o9l31O86K193K141M06q47o97o78j442
55355F5343j190R16K619J907j3j130j585k048j488R24L532M330L709L026K023
55340H0875Nk030k620j991j149k68M82K12q66q36Q48J743m3k615l027j483l05
$$ y = [172110, 169543, 166523, 164552, 163033, 160047, 155526, 151044, 147078, 143023, 139346, 137132, 135824, 133842, 131123, 128754, 126556, 123474, 120043, 118066, 117887, 118019, 117295, 115574, 112927, 110009, 108398, 108397, 107422, 103104, 97197, 93656, 93447, 94088, 93802, 93009, 91921, 89944, 87852, 87514, 88732, 88965, 86917, 84022, 81706, 79504, 76766, 74099, 72169, 70776, 69895, 70050, 71036, 71642, 71156, 69885, 68122, 66047, 64647, 65018, 66570, 67462, 66959, 65863, 64715, 63303, 61925, 61306, 61109, 60296, 59128, 58949, 59761, 59859, 58331, 56289, 55094, 54878, 55296, 56334, 57810, 59147, 60129, 61045, 61998, 62818, 63501, 63981, 63912, 63581, 64267, 66460, 68601, 69007, 68160, 67463, 66785, 65343, 64153, 65069, 67688, 69595, 69582, 68452, 66867, 64819, 63331, 64255, 67787, 72117, 75826, 78852, 80875, 80880, 78850, 76230, 74239, 73090, 72822, 73304, 73516, 72650, 71814, 72662, 74405, 74362, 71747, 68720, 67237, 66932]
55323F6932j57J17R85J849K383K409J393m03j494j333j368k459l100j992m70l27
55307F2965r42p58j8J40j28k55q68k442l690l300k023j208o47L92J460K062K790
55290E3530L601K862qk838l686l493l732l618k133o72q60j474m45J611K654K491
55274D3790K190J577R0j241j237p32q97r13J25P27o91k591k455q02o9o98j305
55257C4868j551j884j533K49J994J937J004J057J531Q81n3M39J372O56p17l2K325
55240D2543L348K440K046L034L270J444r44k190k360k033j404r53r68m54J392
55225D8211L102K661O94n55o83p50l86J402L069J882j524l496k629j260j193j292
55209D7253l44Q01J189J355J803K077K110K544L092K633J377P77J002O11p59j714
$$ y = [66932, 66775, 66892, 67877, 69726, 72109, 74518, 75911, 75508, 74014, 72681, 71313, 68854, 65754, 63762, 63292, 62965, 62023, 61265, 61247, 61387, 61259, 61004, 60136, 57694, 54004, 50704, 48681, 47473, 46826, 47218, 48678, 50740, 53530, 57131, 59993, 59985, 57147, 53461, 49968, 46236, 42618, 40485, 39813, 38953, 37479, 37034, 38645, 41299, 43790, 45980, 47557, 47647, 46406, 45169, 44437, 43540, 42627, 42752, 43479, 42788, 40197, 37742, 36940, 36871, 36173, 34868, 33317, 31433, 29900, 30149, 32143, 34080, 35084, 36141, 37672, 38553, 38500, 38939, 40311, 40967, 40250, 40218, 42543, 45891, 48331, 50377, 53411, 56681, 58125, 57181, 54991, 52631, 50598, 49194, 48241, 47273, 46819, 48211, 51313, 53974, 54668, 54113, 53430, 52680, 52294, 53696, 56765, 58647, 57123, 53627, 50998, 49738, 48545, 47253, 46909, 47710, 48899, 50254, 52057, 54134, 56244, 58788, 61880, 64513, 65890, 66667, 67669, 68280, 67521, 65807]
55193F5807j442o75J45J437K817K957J711M35j54n83q90m19M39L95n29j020q91
55176F9540j381k667l275k460j177l07K61N16J61k05L77J295R47p40k240k812
55160E5833k916k377n50J658K334J499J131J961K569K081J425J355J370J175J234
55145F9782J389Q69jL6J041J832K045K316K454J697O58N99Q06o91l596n290m643
55128G1303l254k460j761q67o56j318j823j847j992j808r0K440L476K642J991
55113F3976K398K336R27o45j668k905m108l413n62K061K763K415J914P18q34p13
55097F4660J611L730L693K344R16r49l081l596j923m52r96k000j484l28j99m73
55081F1473J57Q99L53p74j008p16r35r87J89J447Q56j074k065j410m18L1L82R98
$$ y = [65807, 64365, 63690, 63835, 65272, 68089, 71046, 72757, 73192, 73038, 72455, 71565, 71146, 71585, 71980, 71451, 70431, 69540, 68159, 65492, 62217, 59757, 58580, 58273, 58534, 59050, 59211, 59006, 59383, 60678, 61625, 60885, 58645, 55833, 52917, 50540, 49990, 51648, 53982, 55481, 56612, 58573, 61142, 63223, 64648, 66003, 67373, 68548, 69782, 71171, 72040, 72039, 72075, 73116, 74948, 76993, 79309, 81763, 83460, 84118, 84717, 85523, 84832, 81236, 75946, 71303, 68049, 65589, 63828, 62961, 62305, 60987, 59164, 57317, 55325, 53517, 53427, 55867, 59343, 61985, 63976, 66374, 68710, 69637, 68992, 67324, 64419, 60311, 56898, 56336, 58397, 61160, 63575, 65489, 66207, 65373, 64660, 66271, 70001, 73694, 76038, 76954, 76005, 72924, 69328, 67405, 66953, 65957, 63957, 62473, 62145, 61946, 61473, 61630, 62529, 62882, 62108, 61100, 60384, 59449, 58462, 58651, 60098, 60954, 59880, 57815, 56405, 55987, 56018, 56400, 57398]
55063E7398J650K251K767K621J421n9o40j22R27K063K814K550J458Q90J631K623
55047H2243K321P32p16p33R81L662N720N927M780L814L490K964K040J615J823
55032A20663J611P31L54R85J662J901K384K842J625j353l408k517p7J320J185
55017A29908N49j85j005j212l85N85P49L83L8l46n21K47J374R13j517l689l940
55000A21946l292k956k084j0J581J104j92m10k74j518l471m052l113k225j933
54985I9101j682j739k640l264j932Q03K654K655J894J399J161J059J138J075O31
54970A02313K11R2j15k31Q79L136M222K622K49j75J011J563J253J680K789K482
54954A23981qk826l943l066r57J410K917L027K591K633K744K058J160J231J791
$$ y = [57398, 59048, 61299, 64066, 66687, 68108, 68049, 67409, 67287, 68214, 70277, 73091, 75641, 77099, 77989, 79620, 82243, 84564, 85296, 84580, 83847, 84828, 88490, 94210, 100137, 104917, 108731, 112221, 115185, 117225, 118840, 120663, 122274, 123005, 123359, 124344, 126006, 127907, 130291, 133133, 134758, 133405, 129997, 127480, 127403, 128723, 129908, 130457, 130272, 129267, 128055, 127670, 128255, 129004, 129387, 129425, 129079, 128558, 128805, 130179, 131092, 129575, 125886, 121946, 118654, 115698, 113614, 113604, 115185, 116289, 116097, 115687, 115413, 113895, 110424, 106372, 103259, 101034, 99101, 97419, 95680, 93040, 89776, 87844, 88647, 91301, 93956, 95850, 97249, 98410, 99469, 100607, 101682, 102313, 102524, 102616, 102501, 102270, 103149, 106285, 110507, 113129, 113378, 113203, 114214, 115777, 117030, 118710, 121499, 123981, 123973, 121147, 117204, 114138, 113181, 114591, 117508, 120535, 123126, 125759, 128503, 130561, 131721, 132952, 134743]
54939A34743J328n8o64Q7Q39M60o60j684k226k008r80J3q0r42j160j42J133J366
54921A29365J94j609k614j830J12J624K396L630N389N608L246O16L85J791K320
54906A50623J902K490M238N077M115K736K101K002K432L987O210P588P709P713
54892B10923Q257Q817R203R995J1206J2313J3691J6208J9181K0648J9975J8253
54880C78670J5889J1927O235L39m687r253j3477j6308j7330j7644j7908j7199
54868B99254j4946j2441j1113j0480r254p437o086n730o093o822p355o620l892
54855A90985M7L279M351L476K418L063N627Q263R069Q340Q036R358J1775J4355
54841B82442J6745J8503J8691J6738J3108Q859M971J978n80m191r796j6030k0143
$$ y = [134743, 136071, 136013, 135349, 135436, 136275, 136735, 136075, 134391, 132165, 130157, 129177, 129190, 129110, 128168, 127008, 126866, 127999, 129365, 129559, 127950, 125336, 123506, 123618, 125242, 127638, 131268, 136657, 142265, 145511, 146127, 146512, 148303, 150623, 152525, 155015, 159253, 164330, 168445, 171181, 173282, 175284, 177716, 181703, 187913, 195501, 203210, 210923, 219180, 227997, 237200, 247195, 258401, 270714, 284405, 300613, 319794, 340442, 360417, 378670, 394559, 406486, 412721, 413060, 408373, 399120, 385643, 369335, 352005, 334361, 316453, 299254, 284308, 271867, 260754, 250274, 241020, 233583, 227497, 221767, 215674, 208852, 201497, 194877, 190985, 191032, 194311, 198662, 202138, 204556, 207619, 213246, 221509, 230578, 238918, 246954, 256312, 268087, 282442, 299187, 317690, 336381, 353119, 366227, 375086, 380057, 382035, 381455, 377264, 367468, 351438, 331295]
54828C31295k0871j9498j7940j6777j5524j3917j2250j0988j0320r861q874p234
54816A67241n789n177m719l435j644m38j0K08J15p91j809j440L08J528R07p20
54800A44335j835k102k046j936j728j495j221p14m7L81L86J06m16j129j597j523
54784A27419j423j867k184j228N68J231k18k347l081k019m90P6o23j615j524k6
54768A10649J573J718N23m44k20O34J178J215J067R95J111J351J449J431J918
54753A26148L345N013N775N391M597L937L347K744K275K168K762M260N875O170
54739A83807N088M664O414R022J0348J0776J2467J5825J8998K0884K2122K2829
54727C43244K1718J8355J4243J0598O733J824l221o963r410j1546j3551j4622
$$ y = [331295, 310424, 290926, 272986, 256209, 240685, 226768, 214518, 203530, 193210, 183349, 174475, 167241, 161452, 156275, 151556, 148121, 146477, 146039, 146029, 146237, 146352, 145561, 143752, 142312, 142620, 144148, 145055, 144335, 142500, 140398, 138352, 136416, 134688, 133193, 131972, 131258, 131211, 131592, 131978, 132084, 131668, 130539, 128942, 127419, 125996, 124129, 121945, 120717, 121285, 122516, 122298, 119951, 116870, 114851, 114361, 114437, 113814, 112199, 110675, 110649, 112222, 113940, 114463, 114019, 113799, 114433, 115611, 116826, 117893, 118888, 119999, 121350, 122799, 124230, 126148, 129493, 134506, 140281, 145672, 150269, 154206, 157553, 160297, 162572, 164740, 167502, 171762, 177637, 183807, 188895, 193559, 199973, 208995, 219343, 230119, 242586, 258411, 277409, 298293, 320415, 343244, 364962, 383317, 397560, 408158, 414891, 416715, 413494, 406531, 397121, 385575, 372024, 357402]
54715C57402j4207j2715j1173j0397j0204r525p832o100n445n261m043j784L9
54702B58755Q90J914L868N948P138P381O929O015N677P326J0756J3950J5653J6804
54688C69004J8584K0441K1228K1073K0847K0546J9388J7129J4195J0828O819J979
54676E62061l421q557j2339j4489j6179j8853k2312k4799k5039k3335k0760j8361
54664C53617j7029j6806j6369j4478j1962j0644j0345q975o005l681l796n192
54652B28335n813n554n498n641n062l604j905l45R45J493J052J96m49j079k024
54637A95047k751k453j165L66J567K218K366K424K765K892J876P3p79K27J792
54622B06465K205J558J224J792K591K902K784K747L130L685L725L000K282K455
$$ y = [357402, 343195, 330480, 319307, 308910, 298706, 289181, 281349, 275249, 269804, 264543, 260500, 258716, 258755, 259645, 261559, 265427, 271375, 278513, 285894, 292823, 298838, 304515, 311841, 322597, 336547, 352200, 369004, 387588, 408029, 429257, 450330, 471177, 491723, 511111, 528240, 542435, 553263, 560082, 562061, 558640, 550083, 537744, 523255, 507076, 488223, 465911, 441112, 416073, 392738, 371978, 353617, 336588, 319782, 303413, 288935, 276973, 266329, 255984, 247009, 241004, 237323, 233527, 228335, 222522, 216968, 211470, 205829, 200767, 197163, 195258, 194913, 195858, 197351, 198403, 198599, 198150, 197071, 195047, 192296, 189843, 188678, 189044, 190611, 192829, 195195, 197619, 200384, 203276, 205152, 205225, 204446, 204673, 206465, 208670, 210228, 211452, 213244, 215835, 218737, 221521, 224268, 227398, 231083, 234808, 237808, 240090, 242545]
54608B42545L260L934M759O616Q988J0130R520Q577Q454Q675Q611Q557Q533P674
54594C48833N906M633M611M582L332J683J090J590K562M219O638Q484Q535P711
54580D14409P808Q907R762J0247J1518J3859J6029J6953J6875J6669J6796J6970
54568E76802J6281J3978J0536P239M088p19q126j6009k1027k2186k1308k0526
54556E19023k0537k0901k0753j9368j6936j4525j2643j0561p810n303l936l116
54544C62634k048j422k081k922k136j43P13p18l316n625p073p315o246m942m928
54529C12432o096o892o818p133q552r925j0040r371q992q858q245p120o040n137
54515B03213m089k916k147k186k839l414l247k335j386r75r11q23j033j968k932
$$ y = [242545, 245805, 249739, 254498, 261114, 270102, 280232, 289752, 298329, 306783, 315458, 324069, 332626, 341159, 348833, 354739, 359372, 363983, 368565, 371897, 373580, 374670, 376260, 378822, 383041, 389679, 398163, 406698, 414409, 422217, 431124, 440886, 451133, 462651, 476510, 492539, 509492, 526367, 543036, 559832, 576802, 593083, 607061, 617597, 624836, 628924, 628205, 620079, 604070, 583043, 560857, 539549, 519023, 498486, 477585, 456832, 437464, 420528, 406003, 393360, 382799, 374989, 369686, 365750, 362634, 360586, 359164, 357083, 354161, 352025, 351882, 352595, 351877, 348561, 342936, 335863, 328548, 322302, 317360, 312432, 306336, 299444, 292626, 285493, 276941, 267016, 256976, 247605, 238613, 229755, 221510, 214390, 208350, 203213, 199124, 196208, 194061, 191875, 189036, 185622, 182375, 180040, 178654, 177679, 176768, 175945, 174912, 172944, 170012]
54500A70012k496l95J810K381J131p37j987k317k240k362k560k025m24J299J941
54485A61031J685J939L413N102N537M418K693J522J505K562M108N392N937N670
54471B12514M829L970L894N138P400R642J0833J0608R459Q449Q384Q903Q679O917
54457C19619M334K172N27j514m302p030q943j0305j1709j2953j3277j2476j1153
54444B32990r829q314o288m177l027l367m544n278m759l218j645j053j566k147
54430A73778j686m95j09j172k359k124p78K12L73L88M67J14l89J87K139M042M329
54413A76917K918R15l90p4J745L423L215J566Q26K159M000M285K952J296M0q40
54397B04953j154o43K78Q11N25n48k066l222l209k221j314j035j109j670l362
$$ y = [170012, 167516, 167121, 168931, 171312, 172443, 171706, 169719, 167402, 165162, 162800, 160240, 158215, 157791, 159090, 161031, 162716, 164655, 168068, 173170, 178707, 183125, 185818, 187340, 188845, 191407, 195515, 200907, 206844, 212514, 217343, 221313, 225207, 230345, 237745, 247387, 258220, 268828, 278287, 286736, 295120, 304023, 312702, 319619, 323953, 326125, 326652, 325138, 320836, 313806, 304863, 294558, 282849, 269896, 256619, 244143, 232990, 223161, 214847, 208559, 204382, 201355, 197988, 193444, 188166, 183407, 180189, 178544, 177491, 175925, 173778, 172092, 171597, 171488, 170316, 167957, 165833, 165055, 165267, 165640, 166028, 166495, 166609, 166220, 166407, 168546, 172588, 176917, 179835, 180750, 180360, 180286, 182031, 185454, 188669, 190235, 191061, 193220, 197220, 201505, 204457, 205753, 205793, 204953, 203799, 203156, 203434, 204245, 204770, 204222, 202156, 198934, 195725, 193504, 192190, 191155, 190046, 188376, 185014]
54382A85014n640o459m725j888j12R3m23r05q65L6J191J161l12j597j394l83M54
54365A63246J492K946L363J699l53m11J178K169J965J898K434K596K173K175K851
54350A91421L270L157L295L788L738L133L251M541N741N839N574O149P523Q679
54336B59099Q775P588N647M286M561N862O479N819N019N076N401M788L024Q68
54322C32292r10k046k738l430m354n182n452n186m792m612m910n844o892o928
54308B69016n651m312m119m591m609m347m642m977l958j711q9r1o63n58M1L47
54292B25086L06K93M23P52J529K666L575L894L951M197M688N184N403N078M294
54277B71319L718M028N154O462P367P379O105L952K222J651J370K99j125j857
$$ y = [185014, 179374, 172915, 168190, 166302, 166190, 166283, 165860, 164955, 164090, 164126, 165317, 166478, 166166, 164569, 163175, 162792, 163246, 164738, 167684, 171047, 172746, 172393, 171982, 173160, 175329, 177294, 179192, 181626, 184222, 186395, 188570, 191421, 194691, 197848, 201143, 204931, 208669, 211802, 215053, 219594, 225335, 231174, 236748, 242897, 250420, 259099, 267874, 275462, 281109, 285395, 289956, 295818, 302297, 308116, 313135, 318211, 323612, 328400, 331424, 332292, 331382, 329336, 326598, 323168, 318814, 313632, 308180, 302994, 298202, 293590, 288680, 282836, 275944, 269016, 263365, 259053, 254934, 250343, 245734, 241387, 236745, 231768, 227810, 226099, 226010, 225919, 225256, 224698, 224739, 225086, 225392, 225685, 226108, 226860, 228389, 231055, 234630, 238524, 242475, 246672, 251360, 256544, 261947, 267025, 271319, 275037, 279065, 284219, 290681, 298048, 305427, 311532, 315484, 317706, 319357, 320727, 321026, 319901, 318044]
54263C18044k277l778o475r005j0595j1663j2190j1212q621o198n768p124q428
54250B14710q189o407m224k908k900l594m078l917l220k434k293l284m781n563
54236A56918n578o042p074o802m117q64N08K25J03K84m55j732j687o6J308J425
54220A26354J228J475J530Q79n1j078k437l311k119J007L782M565M027L420K808
54205A42079J858R15M89O17J226J994J907M06j119p86P84J043o89k312k345j729
54189A44338j346l72J488K484J353n24j266j159j398j684j054L6L52j67o69q84
54173A39528j009q55l01J28J95M76J070R78r1o46M23J936K220J653J527J573O31
54156A49436q43j210l86p2j126k426k680k000j142k97P50J896K577K237R56k89
$$ y = [318044, 315767, 311989, 305514, 296509, 285914, 274251, 262061, 250849, 242228, 236030, 230262, 223138, 214710, 206521, 200114, 195890, 192982, 190082, 186488, 182410, 178493, 175273, 172839, 170546, 167262, 162481, 156918, 151340, 145298, 138224, 131422, 127305, 126441, 126949, 127174, 127277, 127561, 127106, 125374, 123687, 123621, 124929, 126354, 127582, 129057, 130587, 131466, 131415, 130337, 127900, 124589, 122470, 123477, 127259, 131824, 135851, 139271, 142079, 143937, 144852, 145341, 145958, 147184, 149178, 151085, 151491, 150372, 149586, 150370, 151413, 150724, 148412, 146067, 144338, 142992, 142620, 144108, 146592, 147945, 147421, 146155, 144996, 143598, 141914, 140860, 140896, 141248, 141081, 140412, 139528, 138519, 137664, 137363, 137491, 137686, 138162, 139232, 140210, 140119, 139473, 139896, 141832, 144052, 145705, 147232, 148805, 149436, 148593, 147383, 146997, 146925, 145799, 143373, 140693, 138693, 137551, 137254, 138004, 139900, 142477, 144714, 145670, 145381]
54140A45381m09M85J149Q17Lo55j320k082k237j462q45j566l073l694k772j251
54124A26469l21k36l57O7J090J904J835J342J145O71j193l667m295k278J40P62
54108A23078J86K30J106J758J771J238r0j857k315l75K341L302K278R10j66j622
54092A31773l198l449k061n11M1K6J88L68K03k5P3L33K98k49j103j761j830j718
54074A17398k342l607l936k275J33J176O54J78O24J133P86j71j055j613j678r56
54058A04449K86J044O85j82m78n8J83k82o05M22K315K817O87k267l313k371j594
54041A01738j530k71K835N144M150J037j206j748j855k021j624q08l42J47J699
54026A05345L830M840M305L385K619J347l70j229p02K6j14o39n81P1P27J071R88
$$ y = [145381, 144972, 145457, 146606, 147423, 147426, 146771, 145451, 143369, 141132, 139670, 138825, 137259, 134186, 130492, 127720, 126469, 126148, 125912, 125555, 125622, 126712, 128616, 130451, 131793, 132938, 133609, 132416, 128749, 124454, 122176, 122316, 123078, 123264, 123494, 124600, 126358, 128129, 129367, 129277, 127420, 125105, 124730, 127071, 130373, 132651, 133561, 133395, 131773, 128575, 125126, 123065, 122554, 122595, 122621, 122809, 123177, 123380, 123355, 123428, 123761, 124059, 123810, 122707, 120946, 119116, 117398, 115056, 111449, 107513, 105238, 105371, 106547, 107201, 107379, 108003, 109136, 109922, 109751, 108696, 107083, 105405, 104449, 104735, 105779, 106464, 106282, 105804, 105746, 105929, 105647, 105042, 105464, 107779, 110596, 111283, 109016, 105703, 103332, 101738, 100208, 99937, 102772, 107916, 112066, 113103, 111897, 110149, 108294, 106273, 104649, 103841, 103499, 103646, 105345, 109175, 114015, 118320, 121705, 124324, 125671, 125301, 124072, 123370, 123396, 123282, 122643, 122062, 122133, 122860, 123931, 124919]
54009A24919L76n14j117j262j124n05J003L009M399M626M166L575K934K359K189
53994A49033K389K454K154J767J513J368J393J656J929K264L476N972Q264Q096
53980A93728N317K429J691K759L778L958M082M868N838O057N534N484P013R768
53966B62304J2285J3543J3582J2501R998O468L599K760L441M210M577M905N067
53953C59240M618L872L530L395K728J688J069P33k56j800k594k256k210l642n672
53938C62443o496n790m982n317o311o393m951l271l080m315n277n116m975n957
53924B90212p086o537m195j588J49R63R20J04p35q06n31r28j872k277j951j820
53908B62022k246k499k120j479p22N14J936K402J483J24o74j017j342j448p97
$$ y = [124919, 125295, 124781, 123664, 122402, 121278, 120773, 121776, 124785, 129184, 133810, 137976, 141551, 144485, 146844, 149033, 151422, 153876, 156030, 157797, 159310, 160678, 162071, 163727, 165656, 167920, 171396, 177368, 185632, 193728, 199045, 201474, 203165, 205924, 209702, 213660, 217742, 222610, 228448, 234505, 240039, 245523, 252536, 262304, 274589, 288132, 301714, 314215, 324213, 330681, 334280, 337040, 340481, 344691, 349268, 354173, 359240, 363858, 367730, 371260, 374655, 377383, 379071, 380140, 380873, 380617, 378817, 376223, 373967, 371757, 368115, 362443, 355947, 350157, 345175, 339858, 333547, 327154, 322203, 318932, 315852, 311537, 306260, 301144, 296169, 290212, 283126, 276589, 272394, 270806, 270955, 271918, 272838, 272942, 272207, 271401, 270870, 269942, 268070, 265793, 263842, 262022, 259776, 257277, 255157, 253678, 252956, 253470, 255406, 257808, 259291, 259415, 258741, 257724, 256382, 254934, 254137]
53893B54137P29K751M585N441N015L957L235L118L355M022N251O387O454N509
53879C13946M595M503N402P346R928J1670J1174Q962P065O664P178P579P318O035
53865D19365L694J224j44m20o05r69q25K5J108K486M539O457O671N277M289M909
53849D57081O162O859P265P897Q292Q115Q187R121R852Q809N939K675L79m41o2
53834E46130N97L44j374m031o468p483o475m453l866o034r017r699p995o947q406
53819D64823j0804j1974j1941j1617j0786r190q137q967j0766j1384j0273q821
53807C40163q231q299q084o860m709k873k984n166p548q416q126q071q453q179
53793B44164o552m172k431k537m412o184n651k941o74o86j714j529k27J37j292
$$ y = [254137, 254866, 257617, 262202, 267643, 272658, 276615, 279850, 282968, 286323, 290345, 295596, 301983, 308437, 313946, 318541, 323044, 328446, 335792, 345720, 357390, 368564, 377526, 384591, 391255, 398433, 406012, 413330, 419365, 423059, 424283, 424139, 423719, 423114, 422145, 421320, 421345, 422453, 424939, 429478, 435935, 442606, 447883, 452172, 457081, 463243, 470102, 477367, 485264, 493556, 501671, 509858, 518979, 528831, 537640, 543579, 546254, 546633, 546192, 546130, 546727, 547071, 545697, 541666, 535198, 527715, 521240, 516787, 512921, 506887, 497870, 488171, 480176, 473229, 464823, 454019, 442045, 430104, 418487, 407701, 398511, 390374, 381407, 370641, 359257, 348984, 340163, 331932, 323633, 315549, 308689, 303980, 301107, 298123, 292957, 285409, 276993, 268867, 260796, 252343, 244164, 237612, 233440, 231009, 228472, 224060, 217876, 212225, 209284, 208610, 207924, 206210, 204681, 204454, 204591, 203299]
53778B03299l107l662k805j378N8J494K932L863L435J549l28m08J071J823M23
53763B08259j851k949k674k194j897j273l92N8J36O59J750K551K577K439K808
53748B08007L505L931L981M042M290M311L495J943P49J116L062N432P112P863
53734B62839Q028Q074Q428R015Q923P422N442M954O484Q279Q373O643M226K084
53720C59214P67O19J276J587Q01o18j874k718l081k753k061k001k895l754l670
53705C38839l045k715k770k926l249l710l856l718m167n594p025p268o256m598
53691B77942k909k060k766m130m067k227r03j768l363l430k189j198m49R86K300
53676B49769J691m98j842j095O23K017K941L310K665J325M42M41P79J327K528
$$ y = [203299, 200192, 196530, 193725, 192347, 192405, 193899, 196831, 200694, 204129, 205678, 205350, 204942, 206013, 207836, 208259, 206408, 203459, 200785, 198591, 196694, 195421, 195029, 195087, 195223, 195882, 197632, 200183, 202760, 205199, 208007, 211512, 215443, 219424, 223466, 227756, 232067, 235562, 237505, 238254, 239370, 242432, 247864, 254976, 262839, 270867, 278941, 287369, 296384, 305307, 312729, 318171, 323125, 329609, 337888, 346261, 352904, 357130, 359214, 359981, 360600, 361876, 363463, 364264, 363646, 361772, 359054, 355973, 353220, 351159, 349158, 346263, 342509, 338839, 335794, 333079, 330309, 327383, 324134, 320424, 316568, 312850, 308683, 303089, 296064, 288796, 282540, 277942, 275033, 272973, 270207, 266077, 262010, 259783, 258880, 257112, 253749, 250319, 248130, 246932, 246483, 247469, 249769, 251460, 250962, 249120, 248025, 248648, 250665, 253606, 256916, 259581, 260906, 261348, 261789, 262568, 263895, 266423]
53661B66423L993M575M211M061M383L982K405J081J234J957J647M52MJ093K657
53646C04158L132K146P02r6l00p78j703k117j449o21o50r29j52J477K475K307
53630C07602J853J618J071R3m22n0L43M8l07K18J505K808L760M275M062L015J706
53613C33198R21R53J615K509L041K770J998J557J685J678R97Q0l31o7O52J684
53597C54940K661K732J405n68j794j793j393j489j951k093j788j557j616j536
53583C44160j075p09q00q37l50l7q00j875j450O84K624L006K626K641K720K250
53567C52778J901K471L163K719J453N61J74j95l3J279K545J993L59L61K651M610
53551C78790M026K130J651L129M651M539L266K736M216O899Q610Q247O966O393
$$ y = [266423, 270416, 274991, 279202, 283263, 287646, 291628, 294033, 295114, 296348, 298305, 299952, 300404, 300408, 301501, 304158, 307290, 309436, 310138, 310042, 309742, 308964, 307261, 305144, 303695, 303074, 302424, 301495, 301343, 302820, 305295, 307602, 309455, 311073, 312144, 312237, 311815, 311765, 312108, 312156, 311849, 312067, 313572, 316380, 320140, 324415, 328477, 331492, 333198, 334119, 335072, 336687, 339196, 342237, 345007, 347005, 348562, 350247, 351925, 352922, 353002, 352671, 352604, 353256, 354940, 357601, 360333, 361738, 361170, 359376, 357583, 356190, 354701, 352750, 350657, 348869, 347312, 345696, 344160, 343085, 342376, 341576, 340739, 340389, 340352, 339552, 337677, 336227, 336911, 339535, 342541, 345167, 347808, 350528, 352778, 354679, 357150, 360313, 363032, 364485, 365046, 365220, 365025, 364992, 366271, 368816, 370809, 371168, 371529, 374180, 378790, 382816, 384946, 386597, 389726, 394377, 398916, 402182, 404918, 409134, 416033, 424643, 432890, 439856, 446249]
53537D46249O356N748M827M844N656N747M816M247M593M700M069L976N146O174
53523E17148N685M385L425K384P25j85J165L470L764J396j194j790o39Q23J704
53508E42266J544J24j701k155o17J271J570M46m47m33l13n01q9J545L323L753
53492E49586L059K782L463L997L579L030L462M603N378N460N339N303N389N854
53478F10284O697P109O517N838O387P747Q179P336O995Q537J1038J2688J3149
53465G18501J3419J4073J4591J4248J3073J1892J1766J3167J5490J7559J8719
53454H76498J9250J9793K0773K2278K4072K5673K6793K7575K8090K8047K7597
53443A146439K7814K9384L1287L1979L1712L2243L4176L6061L6573L6238L6304
$$ y = [446249, 452605, 458353, 463180, 468024, 473680, 479427, 484243, 488490, 493083, 497783, 501852, 505828, 510974, 517148, 522833, 527218, 530643, 533027, 533752, 533567, 534732, 538202, 541966, 543362, 542168, 540378, 539739, 540562, 542266, 543810, 543934, 542233, 540078, 539461, 540732, 542302, 542748, 542301, 541868, 541555, 541054, 540965, 542510, 545833, 549586, 552645, 555427, 558890, 562887, 566466, 569496, 572958, 577561, 582939, 588399, 593738, 599041, 604430, 610284, 616981, 624090, 630607, 636445, 642832, 650579, 658758, 666094, 673089, 681626, 692664, 705352, 718501, 731920, 745993, 760584, 774832, 787905, 799797, 811563, 824730, 840220, 857779, 876498, 895748, 915541, 936314, 958592, 982664, 1008337, 1035130, 1062705, 1090795, 1118842, 1146439, 1174253, 1203637, 1234924, 1266903, 1298615, 1330858, 1365034, 1401095, 1437668, 1473906, 1510210]
53432A510210L6936L7388L7241L6791L6601L7076L7972L8321L7451L6095L5602
53421A917684L6028L6111L5233L4182L3692L3425L3007L2753L2757L2278L0807
53410B287957K8820K6883K4991K3295K2336K1905K0737J8258J5528J3573J1819
53399B516102R217N922K692n02m036p433r878j1508j3167j5295j7850k0769k3585
53386B409910k5253k5453k5450k6556k8308k9254k9109k8816k8855k8813k8436
53375B105607k7919k7189k6029k4874k4370k4126k3030k0973j9168j8428j7940
53364A851561j6311j3267r893p430o056m759k538K55K210K800L285N072P775R902
53350A822606J0996J1954J3529J5620J8147K1410K5101K7952K9077K9199K9965
$$ y = [1510210, 1547146, 1584534, 1621775, 1658566, 1695167, 1732243, 1770215, 1808536, 1845987, 1882082, 1917684, 1953712, 1989823, 2025056, 2059238, 2092930, 2126355, 2159362, 2192115, 2224872, 2257150, 2287957, 2316777, 2343660, 2368651, 2391946, 2414282, 2436187, 2456924, 2475182, 2490710, 2504283, 2516102, 2525319, 2531241, 2533933, 2533431, 2529395, 2521962, 2512084, 2500576, 2487409, 2472114, 2454264, 2433495, 2409910, 2384657, 2359204, 2333754, 2307198, 2278890, 2249636, 2220527, 2191711, 2162856, 2134043, 2105607, 2077688, 2050499, 2024470, 1999596, 1975226, 1951100, 1928070, 1907097, 1887929, 1869501, 1851561, 1835250, 1821983, 1812090, 1804660, 1798604, 1793845, 1791307, 1791562, 1793772, 1796572, 1799857, 1804929, 1812704, 1822606, 1833602, 1845556, 1859085, 1874705, 1892852, 1914262, 1939363, 1967315, 1996392, 2025591, 2055556]
53339B055556L2197L5159L7551L9018M0544M3277M7090N0709N3282N5281N7556
53328B547220O0123O2393O4158O5771O7566O9556P1536P3123P3940P3973P3449
53317C302808P2307P0430O8470O7435O7091O5817O2747N8981N5923N3448N0657
53306C996114M7211M2620L5569K5898J6355J0149P059L986q74o772j3237k1257
53294D142821l0573l8353m2439m4369m7295n2040n6963o0862o3943o6112o6396
53283C573476o4593o2275o1234o1557o1819o0916n9246n8043n7848n7850n6879
53272B911216n4762n2318n0200m8359m6693m5413m4422m2940m0407l7330l4622
53261B413750l2489l0453k8244k5973k3554k0750j8055j6884j8231k1153k3176
$$ y = [2055556, 2087753, 2122912, 2160463, 2199481, 2240025, 2283302, 2330392, 2381101, 2434383, 2489664, 2547220, 2607343, 2669736, 2733894, 2799665, 2867231, 2936787, 3008323, 3081446, 3155386, 3229359, 3302808, 3375115, 3445545, 3514015, 3581450, 3648541, 3714358, 3777105, 3836086, 3892009, 3945457, 3996114, 4043325, 4085945, 4121514, 4147412, 4163767, 4173916, 4180975, 4184961, 4184087, 4177315, 4164078, 4142821, 4112248, 4073895, 4031456, 3987087, 3939792, 3887752, 3830789, 3769927, 3705984, 3639872, 3573476, 3508883, 3446608, 3385374, 3323817, 3261998, 3201082, 3141836, 3083793, 3025945, 2968095, 2911216, 2856454, 2804136, 2753936, 2705577, 2658884, 2613471, 2569049, 2526109, 2485702, 2448372, 2413750, 2381261, 2350808, 2322564, 2296591, 2273037, 2252287, 2234232, 2217348, 2199117, 2177964, 2154788]
53250B154788k2582k0198j8369j8179j8346j7313j5472j4254j3579j1752q168
53239A976576m504k470j556j58K053M154N782P403R045J0242J1401J3767J7556
53226B049291K1281K3604K4943K6395K8008K9104K9686L0442L1404L1822L1393
53215B357373L0751L0408K9879K8369K5870K3113K0651J8370J5866J3050J0280
53204B603980P855N439K315j580n203p501q776j0409j3258j7003k0917k4479k7092
53191B483371k8215k8333k8904l0663l2601l3392l3178l3114l3666l4459l5313
53180B131533l6218l6453l5013l2099k9144k7178k6087k5559k5527k5416k4323
53169A808516k2607k2003k3209k4463k3732k1472j9804j9498j9370j8500j7346
$$ y = [2154788, 2132206, 2112008, 2093639, 2075460, 2057114, 2039801, 2024329, 2010075, 1996496, 1984744, 1976576, 1972072, 1969602, 1968046, 1967888, 1969941, 1974095, 1979877, 1987280, 1996325, 2006567, 2017968, 2031735, 2049291, 2070572, 2094176, 2119119, 2145514, 2173522, 2202626, 2232312, 2262754, 2294158, 2325980, 2357373, 2388124, 2418532, 2448411, 2476780, 2502650, 2525763, 2546414, 2564784, 2580650, 2593700, 2603980, 2611835, 2617274, 2619589, 2618009, 2612806, 2605305, 2596529, 2586120, 2572862, 2555859, 2534942, 2510463, 2483371, 2455156, 2426823, 2397919, 2367256, 2334655, 2301263, 2268085, 2234971, 2201305, 2166846, 2131533, 2095315, 2058862, 2023849, 1991750, 1962606, 1935428, 1909341, 1883782, 1858255, 1832839, 1808516, 1785909, 1763906, 1740697, 1716234, 1692502, 1671030, 1651226, 1631728, 1612358, 1593858, 1576512]
53158A576512j6288j4669j2108r729q974r775j0908j1721j2499j3273j3473j3057
53146A430038j3011j4092j5704j6731j7051j7404j7982j8105j7432j6570j6108
53135A249848j5751j5006j4221j4253j5265j6463j7011j6790j6306j6127j6472
53124A076183j7150j7927j8875k0051k0948k0845j9912j9207j9273j9400j8811
53113H63784j7824j7117j6513j5384j3813j2425j1445j0784j0611j0912j0920
53102G16036j0050r039q999r641r692q907q375q796r719j0553j1085j0895r506
53089E90779p369n608m601l920l631m339n803o937p379p586p292n617l157k053
53075E15487l121m614m828m306m297m523l950k705j747j423j476j794k168k064
$$ y = [1576512, 1560224, 1545555, 1533447, 1523718, 1514744, 1504969, 1494061, 1482340, 1469841, 1456568, 1443095, 1430038, 1417027, 1402935, 1387231, 1370500, 1353449, 1336045, 1318063, 1299958, 1282526, 1265956, 1249848, 1234097, 1219091, 1204870, 1190617, 1175352, 1158889, 1141878, 1125088, 1108782, 1092655, 1076183, 1059033, 1041106, 1022231, 1002180, 981232, 960387, 940475, 921268, 901995, 882595, 863784, 845960, 828843, 812330, 796946, 783133, 770708, 759263, 748479, 737868, 726956, 716036, 705986, 696947, 687948, 678307, 668615, 659708, 651333, 642537, 632818, 622265, 611180, 600285, 590779, 583410, 577802, 573201, 569281, 565650, 561311, 555508, 548571, 541192, 533606, 526314, 520697, 517540, 515487, 512366, 507752, 502924, 498618, 494321, 489798, 485848, 483143, 481396, 479973, 478497, 476703, 474535, 472471]
53061D72471j475j090r15J26K263L906L674K182P71j47k82J311M395O437N522
53046D99149L208K275K633K123O18L72K134L737L300J487l06k057m200o133p014
53031E01326p133p486q497r789j0662j0425q868o860n865o436p574p831o817n618
53017C91465n781p674r603r224o300l282k437l244l688l155k698l076m115n519
53003C21669o763o599m450k035j714l204l859k463p00l91j219k010k577l137l302
52988B77246k859k519k873l396l396l113l031k842j997p78r0m54j653k863l038
52973B42344j869n53o75k107l020k391j270r55j154r35m30k92l51o6J04p81k312
52956B23287k734j144J218K318J501j42j167j057j97Q63J665J671N72r91j625
$$ y = [472471, 470996, 469906, 468991, 469117, 471380, 475286, 478960, 481142, 481913, 481766, 481484, 482795, 487190, 493627, 499149, 502357, 504632, 507265, 509388, 510006, 510378, 512512, 516249, 519549, 521036, 520730, 518673, 514473, 508340, 501326, 494193, 486707, 478210, 468421, 457759, 447334, 438466, 431606, 425741, 419305, 411731, 403900, 397083, 391465, 385684, 378010, 368407, 359183, 352883, 349601, 347164, 343920, 340232, 337077, 334379, 331303, 327188, 321669, 314906, 308307, 303857, 301822, 300108, 296904, 293045, 290582, 289882, 289491, 288272, 286262, 283685, 280548, 277246, 274387, 271868, 268995, 265599, 262203, 259090, 256059, 253217, 251220, 250442, 250352, 249898, 248245, 245382, 242344, 240475, 239922, 239247, 237140, 234120, 231729, 230459, 229504, 228350, 227415, 226985, 226693, 226342, 226276, 226380, 225599, 223287, 220553, 219409, 220627, 222945, 224446, 224304, 223137, 222080, 221883, 222746, 224411, 226082, 226654, 225663, 224038]
52941B24038o27J138K307K490K172J715J219R53R85P99J19k71L36J123P97j83
52925B39110k3J629L086L061K118J099j32j474j668k1K084K886K770L609N913
52910B64047Q043Q432P437O609O783P398P466O788O080N984O331O572O615O730
52896C61315O866O674O127N553N154N041N447O184O165M378J278j663l629m768
52882D10122n171m850m624n482o816o856n327m155m733o013o258n481m840m482
52868C35034l498j656l4J71j153l007m136m054l304k470j247P46K430J960p40
52853C15042l388l939k720j336n25l2L04L88L47K51k31j204k007j856p59O42J682
52836C00659J868J095J21J69J655L765N392N873M877K628M28l09Q0r1j179j452
$$ y = [224038, 223411, 224549, 226856, 229346, 231518, 233233, 234452, 235405, 236390, 237189, 237308, 237037, 237373, 238496, 239293, 239110, 239087, 240716, 243802, 246863, 248981, 250080, 249948, 248474, 246806, 246785, 248869, 251755, 254525, 258134, 264047, 272090, 280522, 287959, 294568, 301351, 308749, 316215, 323003, 329083, 335067, 341398, 347970, 354585, 361315, 368181, 374855, 380982, 386535, 391689, 396730, 402177, 408361, 414526, 418904, 420182, 418519, 414890, 410122, 404951, 400101, 395477, 389995, 383179, 376323, 370996, 366841, 362108, 356095, 349837, 344356, 339516, 335034, 331536, 329880, 329846, 330017, 328864, 325857, 321721, 317667, 314363, 311893, 310646, 311392, 313822, 315782, 315042, 311654, 307715, 304995, 303659, 303134, 303102, 303406, 303794, 304141, 304392, 304161, 302957, 300950, 299094, 298335, 298977, 300659, 302527, 303622, 303743, 303912, 305567, 309332, 314724, 320597, 325474, 328102, 328530, 328221, 328301, 328210, 327031, 325579]
52820C25579J69K157K479J376O41R12J301J188R53J060J437J796J838J430R96
52805C45312J256K130K528J824Q08N75J190K030K652K718J977J072J342L031M627
52790C75072M800L956L028K069J090J037K429M033M539M566N453O860P410P040
52776D33382O906P301P472P221O945O315M614K362R37M70k16j576k769l376l987
52761D72001m746m866m161l729m423n709o758p651q747r548r065p039m448k838
52747C88273l107m626n718n331l984k787k088j782k184l599n435o704p113o809
52733C27006n676l847k334j845j635r45q35k684n303n803l542j108p44j724k157
52718B86824j799j818k822m240m952m050j649O29R19o82k133k006r93l71l03l48
$$ y = [325579, 325748, 327905, 330384, 331760, 332401, 333313, 334614, 335802, 336755, 337815, 339252, 341048, 342886, 344316, 345312, 346568, 348698, 351226, 353050, 353858, 354433, 355623, 357653, 360305, 363023, 365000, 366072, 367414, 370445, 375072, 379872, 383828, 386856, 388925, 390015, 391052, 393481, 397514, 402053, 406619, 412072, 418932, 426342, 433382, 440288, 447589, 455061, 462282, 469227, 475542, 480156, 482518, 483455, 483925, 483709, 482133, 479364, 475988, 472001, 467255, 462389, 458228, 454499, 450076, 444367, 437609, 429958, 421211, 411663, 402598, 395559, 391111, 388273, 385166, 380540, 374822, 369491, 365507, 362720, 360632, 358850, 356666, 353067, 347632, 340928, 333815, 327006, 321330, 317483, 315149, 313304, 311669, 310724, 309889, 307205, 301902, 296099, 292557, 291449, 290705, 288981, 286824, 285025, 283207, 280385, 276145, 271193, 267143, 265494, 266123, 267042, 266360, 264227, 262221, 261228, 260857, 260554, 260206]
52702B60206o20j409k376l020l339l455l237k852k952l644l997l309k218j913
52688B21865k706l982n001n188m277k798j888j944k049j303j47L36o8o61q43m93
52672A88853K09O46r6k075l898m150l217k651k922k807j342O60J587J091L21K99
52656A70508O50L19p80j425n84J105K004J471N74O25J555K195J810Q04L7N9J078
52639A82005L105N557P061O429M200K640L466N794P055N999L854K380J919J997
52625B43461K740M444O327P006O123M345K058p60l311m141l023j595j552k842
52611B59280m188m637m100l042k377l122n379p851q876p956o020m427l873m091
52597A89341m282l934l347l098l125k740j561r3Q34Q63K64l79n18l2N75O40M4
$$ y = [260206, 259586, 258177, 255801, 252781, 249442, 245987, 242750, 239898, 236946, 233302, 229305, 225996, 223778, 221865, 219159, 215177, 210176, 204988, 200711, 197913, 196025, 194081, 192032, 190729, 190582, 190918, 190850, 190189, 189346, 188853, 189062, 189708, 189612, 187537, 183639, 179489, 176272, 173621, 170699, 167892, 166550, 167210, 168797, 169888, 170209, 170508, 171158, 171477, 170697, 169272, 168688, 169793, 171797, 173268, 173842, 174467, 176022, 178217, 180027, 180831, 180868, 180927, 182005, 185110, 190667, 197728, 204157, 208357, 210997, 214463, 220257, 227312, 233311, 237165, 239545, 241464, 243461, 246201, 250645, 256972, 263978, 270101, 274446, 276504, 275744, 272433, 268292, 265269, 263674, 262122, 259280, 255092, 250455, 246355, 243313, 240936, 237814, 232435, 224584, 215708, 207752, 201732, 197305, 193432, 189341, 185059, 181125, 177778, 174680, 171555, 168815, 167254, 167161, 167995, 168858, 169122, 168743, 168225, 168193, 168768, 169408, 169452]
52580A69452p82j492k028k298k070j423q82q52j046o40R59L291M834M248J878
52565A71149m71j552j825k162k290j526m66m00j217j174P25L229M136K529o14
52550A68071l424m412l381j431R7O81M60m58j724k218q86J768L999M719M295L369
52534A69525J977J76j378j964j385J30J994L128K663J070j40j49L87M82qn52o28
52517A75328m0Q81J274O48k09k7J305K744L577L857L534K513J657K108L272L134
52501B05556J208m05R0J643J995P47n26m37J120L390N106M987L031R43M14J316
52485B30178K330K678K377J516M37J34J192K613K901K106J677K258K812K139M33
52470B57781j084j400l20J591L345M154L988L372K625J641M53l51j59P78J325
$$ y = [169452, 168670, 167178, 165150, 162852, 160782, 159359, 158477, 157625, 156579, 155939, 156898, 160189, 165023, 169271, 171149, 170678, 169126, 167301, 165139, 162849, 161323, 160857, 160457, 159240, 158066, 158791, 162020, 166156, 168685, 168071, 164647, 160235, 156854, 155423, 155520, 156201, 156661, 156203, 154479, 152261, 151375, 153143, 157142, 161861, 166156, 169525, 171502, 171678, 170300, 168336, 166951, 167081, 169075, 172203, 174866, 175936, 175796, 175647, 176034, 176516, 176508, 175956, 175328, 175288, 176169, 177443, 178091, 177882, 177855, 179160, 181904, 185481, 189338, 192872, 195385, 197042, 199150, 202422, 205556, 206764, 206359, 206449, 208092, 210087, 210834, 210308, 209871, 210991, 214381, 219487, 224474, 227505, 228448, 228862, 230178, 232508, 235186, 237563, 239079, 239516, 239650, 240842, 243455, 246356, 248462, 250139, 252397, 255209, 257348, 257781, 256697, 255297, 254977, 256568, 259913, 264067, 268055, 271427, 274052, 275693, 276146, 275795, 275636, 276414, 277739]
52455B77739O00r90k201k453k196j651j81K312M283M146K474J309J407J750J567
52440B87915J193P55k38j485j817j036k93oP49J967K025N07m30O48J769N17j790
52423B90950j729J161L766L738J921K36o18p65m28k86j017j936j485L50J671J298
52407B96827L79M76J395J981K058K273K591K231R86k35m15N35J841K686K923L011
52391C21543L348L753L676K751J088o39j369m78J298K363K121J604J726J818Q35
52376C45438p66j628j382o41L29J553K283J713N90M47J203J339O35O68J979K937
52360C56697K499K140L353M829M253J834n7l11k6k01m76n01q19j556j732p22N44
$$ y = [277739, 278339, 277349, 275148, 272695, 270499, 268848, 268667, 270979, 275262, 279408, 281882, 283191, 284598, 286348, 287915, 289108, 289863, 289625, 288140, 286323, 285287, 284994, 284988, 285737, 287704, 289729, 290236, 289806, 290454, 292223, 292740, 290950, 289221, 290382, 294148, 297886, 299807, 300043, 299425, 298660, 298232, 297946, 296929, 294993, 293508, 293858, 295529, 296827, 297206, 297682, 299077, 301058, 303116, 305389, 307980, 310211, 311197, 310962, 310547, 311082, 312923, 315609, 318532, 321543, 324891, 328644, 332320, 335071, 336159, 335520, 334151, 333673, 334971, 337334, 339455, 341059, 342785, 344603, 345438, 344672, 343044, 341662, 341021, 341350, 342903, 345186, 346899, 347489, 347936, 349139, 350478, 351113, 351781, 353760, 356697, 359196, 361336, 364689, 369518, 373771, 375605, 375548, 375237, 375211, 375010, 374534, 374033, 373214, 371658, 369926, 369204, 369748]
$$ [...]
##END NTUPLES=NMR SPECTRUM
##END=
