
##TITLE=AC1198_BRAAS12062_5946697_X4Bg9drMUj
##JCAMPDX= 6.0         $$ Bruker NMR JCAMP-DX V2.0
##DATA TYPE= NMR SPECTRUM
##DATA CLASS= NTUPLES
##ORIGIN= BRUKER
##OWNER= Administrator
$$ 1.72 TOPSPIN		Version 2.1
$$ 2012-04-11 01:43:28.296 -0500  Administrator@TOPSPIN
$$ Compression mode = diff/dup
##.OBSERVE FREQUENCY= 400.13188235
##.OBSERVE NUCLEUS= ^1H
##.ACQUISITION MODE= SIMULTANEOUS (DQD)
##.ACQUISITION SCHEME= undefined
##.AVERAGES= 8
##.DIGITISER RES= 22
##SPECTROMETER/DATA SYSTEM= spect
##.PULSE SEQUENCE= zg30
##.SOLVENT NAME= COFFEE_meoh
##.SHIFT REFERENCE= INTERNAL, COFFEE_meoh, 1, 14.98061
##AUDIT TRAIL= $$ (NUMBER, WHEN, WHO, WHERE, PROCESS, VERSION, WHAT)
$$ ##TITLE= Audit trail, TOPSPIN		Version 2.1
$$ ##JCAMPDX= 5.01
$$ ##ORIGIN= Bruker BioSpin GmbH
$$ ##OWNER= Administrator
$$ $$ C:\Bruker\TOPSPIN/data/COFFEE/nmr/AC1198_BRAAS12062_5946697_X4Bg9drMUj/10/pdata/1/auditp.txt
$$ ##AUDIT TRAIL=  $$ (NUMBER, WHEN, WHO, WHERE, PROCESS, VERSION, WHAT)
(   1,<2012-04-11 01:43:21.265 -0500>,<Administrator>,<TOPSPIN>,<go>,<TOPSPIN 2.1>,
      <created by zg
	started at 2012-04-11 01:42:14.250 -0500,
	POWCHK enabled, PULCHK disabled,
       configuration hash MD5:
       1A 1E CE 29 27 FD 77 03 67 4E F0 E3 C4 B2 CB 90
       data hash MD5: 64K
       3E 82 F4 C3 CF 39 55 63 E3 49 E1 BC BC 4F C9 B0>)
(   2,<2012-04-11 01:43:23.875 -0500>,<Administrator>,<TOPSPIN>,<proc1d>,<TOPSPIN 2.1>,
      <Start of raw data processing
       efp LB = 0 FT_mod = 6 PKNL = 1 PHC0 = 0 PHC1 = 0 SI = 32K 
       data hash MD5: 32K
       9D EA 0D 90 E3 AD 97 DD EF 4D BE CA DB 8C AF E2>)
(   3,<2012-04-11 01:43:24.296 -0500>,<Administrator>,<TOPSPIN>,<proc1d>,<TOPSPIN 2.1>,
      <pk PHC0 = 208.9325 PHC1 = 0 
       data hash MD5: 32K
       57 1C C1 46 BB 34 DD 47 47 E5 AC A3 D7 33 EB 2A>)
(   4,<2012-04-11 01:43:24.406 -0500>,<Administrator>,<TOPSPIN>,<proc1d>,<TOPSPIN 2.1>,
      <abs ABSG = 1 
       data hash MD5: 32K
       4A 6C EB 8A 5B E2 3A BA 0B DB AF D5 5A 3F CB 0A>)
(   5,<2012-04-11 01:43:24.437 -0500>,<Administrator>,<TOPSPIN>,<proc1d>,<TOPSPIN 2.1>,
      <abs ABSG = 2 
       data hash MD5: 32K
       B1 C3 FF 3F 27 2C 26 B6 EE 8F 79 CE CB EA 75 85>)
(   6,<2012-04-11 01:43:24.468 -0500>,<Administrator>,<TOPSPIN>,<proc1d>,<TOPSPIN 2.1>,
      <abs ABSG = 3 
       data hash MD5: 32K
       20 EB C9 09 6F BF B3 96 AC B2 44 17 A0 F1 44 55>)
(   7,<2012-04-11 01:43:24.500 -0500>,<Administrator>,<TOPSPIN>,<proc1d>,<TOPSPIN 2.1>,
      <abs ABSG = 4 
       data hash MD5: 32K
       EA 1D F2 ED CD 70 07 68 EC 4F F8 54 BD AC 1E 17>)
(   8,<2012-04-11 01:43:24.531 -0500>,<Administrator>,<TOPSPIN>,<proc1d>,<TOPSPIN 2.1>,
      <abs ABSG = 5 
       data hash MD5: 32K
       97 04 6C 3B F9 04 3A AB D0 C7 BD 10 D0 39 5B 6D>)
$$ ##END=
$$ 
$$ $$ hash MD5
$$ $$ 2D A1 D9 66 46 AF DA AF 03 73 0F B3 00 57 80 45
##$RELAX= 
##$RELAX= 
##$RELAX= 
##$RELAX= 
##$RELAX= 
##$RELAX= 
##$RELAX= 
$$ Bruker specific parameters
$$ --------------------------
$$ [...]
##$TP= (0..7)
150 150 150 150 150 150 150 150
##$TP07= 0
##$TPNAME0= <>
##$TPNAME1= <>
##$TPNAME2= <>
##$TPNAME3= <>
##$TPNAME4= <>
##$TPNAME5= <>
##$TPNAME6= <>
##$TPNAME7= <>
##$TPOAL= (0..7)
0.5 0.5 0.5 0.5 0.5 0.5 0.5 0.5
##$TPOFFS= (0..7)
0 0 0 0 0 0 0 0
##$TUNHIN= 0
##$TUNHOUT= 0
##$TUNXOUT= 0
##$USERA1= <user>
##$USERA2= <user>
##$USERA3= <user>
##$USERA4= <user>
##$USERA5= <user>
##$V9= 5
##$VALIST= <valist>
##$VCLIST= <CCCCCCCCCCCCCCC>
##$VD= 0
##$VDLIST= <DDDDDDDDDDDDDDD>
##$VPLIST= <PPPPPPPPPPPPPPP>
##$VTLIST= <TTTTTTTTTTTTTTT>
##$WBST= 1024
##$WBSW= 4
##$XGAIN= (0..3)
0 0 0 0
##$XL= 0
##$YL= 0
##$YMAX_a= 516973
##$YMIN_a= -648375
##$ZGOPTNS= <>
##$ZL1= 120
##$ZL2= 120
##$ZL3= 120
##$ZL4= 120
##$ABSF1= 14.98061
##$ABSF2= -5.57192
##$ABSG= 5
##$ABSL= 3
##$ALPHA= 0
##$AQORDER= 0
##$ASSFAC= 0
##$ASSFACI= 0
##$ASSFACX= 0
##$ASSWID= 0
##$AUNMP= <proc_prof1d_extract_pilot.lims>
##$AXLEFT= 0
##$AXNAME= <>
##$AXNUC= <1H>
##$AXRIGHT= 0
##$AXTYPE= 0
##$AXUNIT= <>
##$AZFE= 0.1
##$AZFW= 0.1
##$BCFW= 0
##$BC_mod= 0
##$BYTORDP= 0
##$COROFFS= 0
##$CY= 15
##$DATMOD= 1
##$DC= 0
##$DFILT= <>
##$DTYPP= 0
##$F1P= 0
##$F2P= 0
##$FCOR= 0.5
##$FTSIZE= 32768
##$FT_mod= 6
##$GAMMA= 0
##$GB= 0
##$INTBC= 1
##$INTSCL= 1
##$ISEN= 128
##$LB= 0
##$LEV0= 0
##$LPBIN= 0
##$MAXI= 10000
##$MC2= 0
##$MEAN= 0
##$ME_mod= 0
##$MI= 0
##$NCOEF= 0
##$NC_proc= -8
##$NLEV= 6
##$NOISF1= 0
##$NOISF2= 0
##$NSP= 0
##$NTH_PI= 0
##$NZP= 0
##$OFFSET= 14.98061
##$PC= 1
##$PHC0= 208.9325
##$PHC1= 0
##$PH_mod= 1
##$PKNL= yes
##$PPARMOD= 0
##$PPDIAG= 0
##$PPIPTYP= 0
##$PPMPNUM= 2147483647
##$PPRESOL= 1
##$PSCAL= 4
##$PSIGN= 0
##$PYNMP= <proc.py>
##$REVERSE= no
##$SF= 400.13
##$SI= 32768
##$SIGF1= 0
##$SIGF2= 0
##$SINO= 400
##$SIOLD= 32768
##$SPECTYP= <>
##$SREGLST= <1H.CDCl3>
##$SSB= 0
##$STSI= 32768
##$STSR= 0
##$SW_p= 8223.68421052632
##$SYMM= 0
##$S_DEV= 0
##$TDeff= 65536
##$TDoff= 0
##$TI= <>
##$TILT= no
##$TM1= 0
##$TM2= 0
##$TOPLEV= 0
##$USERP1= <user>
##$USERP2= <user>
##$USERP3= <user>
##$USERP4= <user>
##$USERP5= <user>
##$WDW= 1
##$XDIM= 32768
##$YMAX_p= 463066801
##$YMIN_p= -670596
##$CURPLOT= <Network HP LaserJet P1505>
##$CURPRIN= <$Network HP LaserJet P1505>
##$DFORMAT= <normdp>
##$LAYOUT= <+/1D_H.xwp>
##$LFORMAT= <normlp>
##$PFORMAT= <normpl>
##$SURQMSG= 1
$$ End of Bruker specific parameters
$$ ---------------------------------
##NTUPLES= NMR SPECTRUM
##VAR_NAME=  FREQUENCY,     SPECTRUM/REAL,   SPECTRUM/IMAG
##SYMBOL=    X,             R,               I
##VAR_TYPE=  INDEPENDENT,   DEPENDENT,       DEPENDENT
##VAR_FORM=  AFFN,          ASDF,            ASDF
##VAR_DIM=   32768,         32768,           32768
##UNITS=     HZ,            ARBITRARY UNITS, ARBITRARY UNITS
##FACTOR=    0.250966925370066, 1,           1
##FIRST=     8223.43324360095, -43053,       -73981
##LAST=      0,             180710,          54873
##MIN=       0,             -670596,         0
##MAX=       8223.43324360095, 463066801,    0
$$ Real data points
##PAGE= N=1
##DATA TABLE= (X++(R..R)), XYDATA
$$ [...]
$$ plain form
19454 -453282 -238422 15387 93266 -35740 -158100 2698 -134370 120536 -173520 71990 -104284
19442 -289757 64670 98878 -87555 -100541 50726 53954 10854 -261840 -3682 -101034 -138018 -308055
19430 -308055 -91690 -275017 -544576 -386575 -223608 -100508 -353190 -141285 60853 -118135
19419 -57316 307725 288525 -48136 -318145 178214 -387702 66025 -108358 -377178 41981
19408 -112710 -417712 -131941 -57620 339641 55229 66759 -193170 -32369 -161112 -120117
19398 -120117 -440969 85212 -22764 81717 -183583 184649 -81558 175668 -361592 77829
19387 -199020 -145021 -101043 77865 -69506 211564 -41089 -217528 -64638 63711 -192302 -229685
19376 -229685 -39270 193101 -337710 -212752 -190515 -59971 -130773 -33095 -19375 160851 153698
$$ packed form
19454d53282K14860A5387P7879c5740j22360B698a34370A20536a73520G1990a04284
19442b89757F4670L4208h7555j2986E0726L228A0854b61840c682r7352l6984j70037
19430c08055i1690j83327k69559J58001J62967a00508k52682a41285F0853a18135
19419e7316C07725j9200d8136k70009A78214c87702F6025a08358k68820D1981
19408a12710l05002a31941e7620C39641E5229J1530a93170c2369j28743M0995
19398a20117l20852H5212b2764H1717a83583A84649h1558A75668c61592G7829
19387a99020N3999M3978G7865f9506B11564d1089j76439f4638F3711a92302l7383
19376b29685c9270A93101c37710J24958K2237e9971p0802c3095J3720A60851p153
$$ plain form
19365 153698 -115949 163246 -179302 -34758 -233457 230641 100686 110685 5262 -71648 -207496
19354 -207496 -26920 -154854 -361516 -92467 -58369 3094 -129425 364802 -4231 217254 -491
19342 173537 -372475 -464545 -171670 63983 170518 176335 193758 -58501 -329089 60776 -43154
19330 118123 -352038 178577 -151518 155615 -193993 -58274 268215 35389 160770 120791
19320 120791 -22697 38533 16019 -235683 -104556 -26309 46195 -151719 261521 59343 -195152
19308 199341 109211 -119258 9717 -222198 4773 -96071 -16625 -72083 -147998 14729 -123771
19296 -39061 -42853 -132156 -134297 5386 35353 -214047 -582 93641 -213791 -360873 -242284 -119414
19283 -354939 -331581 97890 -103612 -26943 177814 -40287 -349936 -82152 242871 -204803
$$ packed form
19365A53698a15949A63246a79302c4758j98699B30641A00686R999E262g1648j35848
19354b07496b6920j27934k06662i2467L4098C094a29425C64802d231B17254d91
19342A73537c72475r2070a71670F3983J06535N817J7423e8501k70588F0776d3154
19330A18123c52038A78577a51518A55615a93993e8274B68215C5389J25381l9979
19320A20791b2697C8533A6019b35683a04556b6309D6195a51719B61521E9343a95152
19308A99341r0130a19258I717b22198D773i6071a6625n5458p5915A4729a23771
19296c9061l792q9303k141E386K9967b14047e82I3641b13791j47082J18589a19414
19283c54939K3358I7890a03612b6943A77814d0287l09649h2152B42871b04803
$$ plain form
19272 -320967 -12308 112209 67616 -35722 -263536 -289689 34241 -104570 -115770 30714 -290705
19260 -36197 -265877 -142570 -82985 -99723 118612 -98401 2058 -72159 -80945 -28507 -186204
19249 -186204 162812 -112849 -364569 77544 -8106 -281795 -103217 -129326 -93803 28437 193783
19238 193783 153615 -35384 -96366 -19529 -104541 -570347 -120231 8375 -38245 -91753 -38308
19226 154720 152709 -60526 -162090 -211366 69527 -82762 147558 -113893 204391 -32988 76256
19214 -561834 -96550 177195 -351250 -54969 31003 89395 -89968 73099 206669 2730 -169098
19202 174918 -119803 -336033 23552 -181775 -100586 -373411 -302681 -166800 -243457 -76368
19191 127141 149384 -302662 230830 -373705 -170841 172954 -148088 -28366 268200 74749
$$ packed form
19272c20967a2308A12209m4593c5722k27814k6153C4241a04570j1200C0714b90705
19260c6197k29680J23307N9585j6738A18612i8401B058g2159q786b8507j57697
19249a86204A62812a12849k51720G7544h106k73689a03217k6109L5523B8437J65346
19238A93783m0168c5384o0982a9529q5012m65806a20231H375c8245n3508c8308
19226A54720k011f0526j01564m9276F9527h2762A47558a13893B04391c2988G6256
19214e61834i6550A77195c51250e4969C1003N8392h9968G3099J33570B730a69098
19202A74918a19803k16230B3552a81775Q1189k72825P0730J35881p6657g6368
19191A27141K2243c02662B30830c73705a70841A72954a48088b8366B68200G4749
$$ plain form
19180 56653 -117150 -140901 -178801 -209542 -46123 -152219 -164040 -198449 -264645 -225391 -583 31719
19167 -47394 79217 -152109 -30568 -151929 -135802 -6416 224376 -42952 167106 -55303 -168845
19156 -168845 -255344 -40727 85735 -51797 -73118 -227308 -104086 -1644 162646 -292704 36774
19144 1829 -70760 37674 -70349 -273732 -150510 -38646 216661 -41985 -433822 -102992 -110512
19133 -110512 -261367 -264880 -60537 80860 59230 68638 -172307 -201573 -178849 -280508 -197997
19122 -197997 -164748 -278195 -64068 95733 187408 -250308 -217016 -307603 33489 -50974 306777
19110 128645 290859 -329518 -225084 -100532 -95131 113739 -241605 -64286 -405407 143155
19099 -224279 -16233 52866 -135325 -189334 -385809 -346953 -103145 232689 -430386 -400320
$$ packed form
19180E6653a17150k3751l7900l0741d6123j06096j1821l4409o6196L9254e83C1719
19167d7394G9217a52109c0568j21361J6127f416B24376d2952A67106e5303j13542
19156a68845q6499d0727H5735e1797k1321j54190a04086a644A62646b92704C6774
19144A829g0760C7674g0349k03383J23222c8646B16661d1985l91837a02992p520
19133a10512j50855l513f0537H0860k1630R408a72307k9266K2724j01659Q2511
19122a97997L3249j13447f4068I5733R1675b50308L3292r0587C3489e0974C06777
19110A28645J62214c29518J04434a00532N401A13739b41605f4286l41121A43155
19099b24279a6233E2866a35325n4009j96475L8856a03145B32689d30386L0066
$$ plain form
19089 -400320 -6424 269178 -135636 57042 -133783 -47939 171137 -189617 185456 234287
19079 234287 64498 -98551 -54197 99351 -83783 -49515 -73298 76831 -67585 62862 -158871
19067 -219316 117391 -166000 -88673 1027 -137147 153053 -9943 -12119 -160130 187353 262029
19056 262029 30888 -27595 -262162 21328 175991 -125772 -69972 88076 -298043 21108 -160680
19044 326897 133448 138953 -80193 164563 -139324 65063 -51705 -58267 78353 176388 -213805
19032 -2739 75493 -132968 -165292 -282131 -376799 -75820 -110699 -29980 149625 -110562 51298
19020 133810 -289053 17678 -20866 -23548 11269 -24957 169001 216578 117389 24990 149714
19009 149714 49654 -53398 415718 162890 162158 220955 -119435 5627 -283928 43727 -259923
$$ packed form
19089d00320f424B69178a35636E7042a33783d7939A71137a89617A85456M8831
19079B34287F4498i8551M4354I9351h3783L4268k3783G6831f7585F2862a58871
19067b19316A17391a66000P7327A027a37147A53053i943k176j48011A87353P4676
19056B62029C0888b7595k34567B1328J54663a25772N5800H8076b98043B1108a60680
19044C26897A33448N505h0193A64563a39324F5063e1705o562G8353R8035b13805
19032b739G5493a32968l2324j16839r4668g5820l4879b9980A49625a10562E1298
19020A33810b89053A7678b0866k682A1269b4957A69001M7577r9189B4990J24724
19009A49714D9654e3398D15718A62890p32N8797a19435E627b83928D3727b59923
$$ plain form
18997 -266127 -58029 73645 -110982 -1308 35252 22575 -61223 -271653 -184829 -242004 -141754
18986 -141754 -361887 -144723 -76756 -184597 65637 166769 -450400 151471 -375634 -132712
18975 250264 -121769 17402 -116387 -120523 -126212 108382 -99737 -60728 286875 187302 -3648
18963 47159 6792 -398524 330402 198893 345350 673027 389882 26427 161360 -163641
18952 67002 -278518 -65319 138696 148128 -163156 -129085 48585 91007 -211719 -241639 -81901
18940 -136698 -151636 -145996 -14196 410474 351170 184843 -38421 174954 132275 -121269 -30325
18928 72329 183866 194077 -18951 147523 -69851 -226225 332459 48231 46631 -231962 -70491
18916 105973 -183747 -103036 263821 2029 -94206 110198 95864 -38615 -303042 -16842 -126653
$$ packed form
18997b66127e8029G3645a10982a308C5252j2677f1223k10430Q6824n7175J00250
18986a41754k20133a44723O7967j07841F5637J01132d50400A51471c75634a32712
18975B50264a21769A7402a16387m136n689A08382i9737L9009B86875r9573c648
18963D7159F792c98524C30402j31509J46457L27677k83145B6427J34933a63641
18952F7002b78518f5319A38696R432a63156L4071D8585M2422b11719k9920h1901
18940a36698j4938N640a4196D10474n9304j66327c8421A74954m2679a21269c0325
18928G2329J11537J0211a8951A47523f9851j56374C32459D8231j600b31962g0491
18916A05973a83747Q0711B63821B029i4206A10198j4334c8615k64427a6842j09811
$$ plain form
18905 -126653 -279485 164960 -186453 113494 -48250 10545 -66713 -1216 -7368 -146483 432994
18893 420249 78919 -23628 325948 -6125 410969 -171514 159811 59587 -134546 -90627 -377403
18882 -377403 -223518 4317 -114901 -227006 106026 -354649 203536 -67969 -61196 12321 -70385
18870 27096 341852 -157502 -241848 189527 19320 318431 -20058 -97372 131849 -78017 -299299
18859 -299299 -327442 64738 -267077 -102268 -289790 -197281 -89885 -296511 -258487 -224594 -48477
18847 -273360 47729 199745 -18164 134428 72509 57152 -174816 13811 -45221 331249 101571
18835 -160865 19211 -220920 -175173 -105722 171614 -42890 -328310 -181309 -189356 136872 25271
18823 -111039 259692 -66930 -65447 104803 21242 -457868 112489 -74741 31669 68063 182492
$$ packed form
18905a26653j52832A64960a86453A13494d8250A0545f6713a216o152j39115D32994
18893D20249G8919b3628C25948f125D10969a71514A59811E9587a34546M3919k86776
18882c77403J53885D317a14901j12105A06026c54649B03536f7969O773A2321g0385
18870B7096L14756a57502q4346A89527A9320K99111b0058p7314A31849g8017k21282
18859b99299k8143F4738b67077a02268j87522R2509h9885k06626L8024L3893d8477
18847b73360D7729J52016a8164A34428o1919j5357a74816A3811d5221C31249A01571
18835a60865A9211b20920M5747O9451A71614d2890k85420J47001q047A36872B5271
18823a11039B59692f6930J483A04803B1242d57868A12489g4741C1669L6394J14429
$$ plain form
18812 182492 -22807 -210098 -235530 30756 202901 32959 236720 -51460 -73881 -90268 -276717
18801 -276717 -236093 -443326 211501 -218518 17626 183310 299537 124337 -101255 75894
18790 -90701 137902 -103665 -302402 -184523 -253029 130130 -94527 -274781 102623 214878
18780 214878 328235 462445 245860 27088 192670 49018 10592 96404 -516936 -101176
18769 -124942 60269 -212832 -430303 -118334 -107060 43971 115537 -153560 -132419 -415510
18759 -415510 -308696 -302469 92291 135277 562734 82047 -348860 -159127 -8138 -159800 -100549
18748 -100549 49614 131320 -40097 -296636 88552 -154882 89456 -63888 -324420 -5537 -74047
18737 -74047 314973 -62730 99841 5887 244604 -154744 -222474 -230773 -352177 18276 -92505
$$ packed form
18812A82492b2807j87291k5432C0756J72145C2959K03761e1460k2421j6387j86449
18801b76717M0624k07233B11501b18518A7626J65684J16227A24337a01255G5894
18790i0701A37902a03665j98737J17879o8506A30130i4527j80254A02623J12255
18780B14878J13357J34210k16585B7088J65582D9018A0592Q5812e16936a01176
18769a24942F0269b12832k17471a18334J1274D3971P1566a53560K1141k83091
18759d15510J06814O227I2291M2986M27457H2047c48860a59127h138j51662N9251
18748a00549D9614Q1706d0097k56539H8552a54882H9456f3888k60532e537o8510
18737g4047C14973f2730I9841E887K38717a54744o7730q299j21404A8276i2505
$$ plain form
18725 -219423 -103737 103455 271079 -130266 102383 -148326 92953 45534 -258327 -132978
18715 -132978 92148 -92156 362630 -56720 28357 225290 -344893 -261845 299662 -52061 -22038
18703 -118153 82680 -2137 -291439 64781 -317506 -241618 36178 -194684 126361 -229927 -29934
18691 169140 134169 -314292 -123179 53689 -14803 -58229 -75919 8719 -233422 -493036 -246037
18679 21523 249516 -280052 175783 -37766 -64147 -58271 83336 -70312 -393939 276880 -149408
18667 -183227 -96984 -39385 -134954 14134 644 261634 250652 304223 -129040 -213807 -131031
18656 -131031 171055 -234328 -33630 26943 43212 -54865 266725 -272659 -42793 74283 -172829
18644 164467 152589 -276566 16311 33715 -72560 -112997 127400 63383 294816 2337 -41120
$$ packed form
18725b19423a03737A03455J67624a30266A02383a48326I2953D5534b58327J25349
18715a32978I2148i2156C62630e6720B8357J96933c44893Q3048B99662e2061b2038
18703a18153H2680b137k89302F4781c17506P5888C6178a94684A26361b29927b9934
18691A69140l4971c14292a23179E3689a4803m3426j7690H719b33422k59614b46037
18679B1523K27993b80052A75783c7766k6381N876H3336g0312l23627B76880a49408
18667a83227Q6243c9385r5569A4134F44K60990j0982N3571a29040q4767Q2776
18656a31031A71055b34328c3630B6943J6269e4865B66725b72659d2793G4283a72829
18644A64467j1878b76566A6311J7404g2560m0437A27400F3383K31433B337d1120
$$ plain form
18632 30444 -141144 -120134 -1046 78602 289887 157893 -141541 195565 -55612 -95350 -9269
18620 -281045 -35522 -150997 -17847 -392171 75723 -13157 37186 -205053 44089 252572 -134248
18608 -331583 -338623 -84084 -202557 -198552 26514 14647 -142537 9161 -105135 146474 19055
18596 -317951 -50827 193997 222684 -101189 -176547 -182418 225136 -286753 -247103 -413548 -73166
18584 163706 83697 -326868 -316974 132966 29058 -80594 -226448 -221992 213225 244345 -374551
18572 64752 -146119 27988 -152742 -131218 -30584 -141920 81119 42838 205300 -147573 -51138
18560 88672 -64776 -228207 -132974 155103 -303313 32071 90491 34146 226695 -308263 -172065
18549 -172065 -158146 -65322 175412 -316450 255324 3518 57691 52091 -85961 -38258 -82447
$$ packed form
18632C0444a41144K1010a046G8602K11285j31994a41541A95565e5612l9738i269
18620b81045c5522j15475a7847l74324G5723a3157C7186b05053D4089K08483a34248
18608c31583p040h4084j18473M005B6514j1867a42537I161a05135A46474A9055
18596c17951e0827A93997K8687a01189p5358n871B25136b86753L9650j66445g3166
18584A63706q0009c26868R894A32966B9058h0594j45854M456B13225L1120c74551
18572F4752a46119B7988a52742K1524c0584j11336H1119l8281J62462a47573e1138
18560H8672f4776j63431R5233A55103c03313C2071N8420C4146J92549c08263J36198
18549a72065J3919f5322A75412c16450B55324C518N4173n600h5961c8258m4189
$$ plain form
18538 -82447 -68591 -113787 -237590 121860 -111278 -66162 -87450 206616 -47726 3132 -150218
18526 -126882 41628 -195043 -66075 -158855 -5172 163843 -23669 114269 -103191 -43442 293293
18514 -249823 -383500 -106302 55717 177883 31640 -93348 -20384 42181 221 -81173 -53838
18503 -53838 -186541 -228688 -281453 -372502 -136651 217559 359000 -19059 153071 -220490
18492 -201083 -169100 -100517 -92862 -85730 -121189 259470 -118105 -257457 -38747 -356372 114474
18480 -230297 -247450 -112165 -183203 66404 127109 81986 -252173 98754 -67200 13418 50814
18469 50814 -139126 220527 -12203 -263406 -15835 17456 236960 -199851 -214079 -247129 -92577
18457 -94308 237444 167603 -238868 -184951 208926 219785 -241955 119477 -4772 41112 -68734
$$ packed form
18538h2447J3856m5196j23803A21860a11278M5116k1288B06616d7726C132a50218
18526a26882D1628a95043f6075r2780e172A63843b3669A14269a03191d3442B93293
18514b49823j33677a06302E5717J22166C1640i3348b0384D2181B21h1173K7335
18503e3838j32703m2147n2765r1049a36651B17559J41441a9059A53071b20490
18492b01083L1983O8583P655P132l5459B59470a18105j39352c8747l17625A14474
18480b30297j7153a12165p1038F6404O0705m5123b52173I8754f7200A3418L7396
18469E0814a39126B20527a2203k51203a5835A7456K19504a99851j4228l3050i2577
18457i4308B37444o9841b38868N3917B08926J0859b41955A19477d772D1112f8734
$$ plain form
18445 147481 148355 -269657 101770 94197 -255775 -169386 135154 -29035 -94176 -32570 167789
18433 -135756 224592 145012 -245811 73190 -87063 -201098 192124 12163 -14175 -261214
18423 -261214 -480460 120697 -158683 61074 -367515 159407 38460 -194913 21381 -192131
18412 70739 -165015 -215919 -329419 18142 14025 -139295 -65543 -161005 212819 177827 -58742
18400 -40200 -106187 243113 -107402 374789 -226202 -145228 336718 216949 38421 -88021
18389 -91504 161661 295838 100757 98863 323465 -79652 -291463 -86481 138629 -221441
18378 -135449 23671 -314216 107866 -184054 227695 -43801 -381149 106179 -268371 121435
18367 -181567 -193655 143429 -231960 -83748 35034 -207693 -111739 -239051 273583 -40340
$$ packed form
18445A47481Q74b69657A01770p573b55775Q6389A35154b9035o5141c2570A67789
18433a35756B24592p9580b45811G3190h7063j14035A92124A2163a4175k47039
18423b61214k19246A20697a58683F1074c67515A59407C8460a94913B1381a92131
18412G0739a65015n0904j13500A8142m117a39295f5543r5462B12819l4992e8742
18400d0200o5987B43113a07402C74789b26202Q0974C36718j19769C8421h8021
18389i1504A61661J34177A00757j894K24602g9652k11811h6481A38629b21441
18378a35449B3671c14216A07866a84054B27695d3801l37348A06179b68371A21435
18367a81567j2088A43429b31960h3748C5034b07693R5954j27312B73583d0340
$$ plain form
18356 -217948 -38130 271008 -77418 161585 11300 8169 -166644 -221396 27868 -65294 -16409
18344 203266 -210287 -218141 -90622 222885 -257451 75603 238146 192371 -119126 -297046
18334 -297046 -74556 -11611 -153127 215043 -239687 110608 -70102 38175 58815 136666 -250591
18322 29012 -152976 -8371 -39792 99784 -298347 204003 -152913 179804 26929 -382325 -379492
18311 -379492 160359 -114019 114603 172874 -55698 87738 96970 -1512 -127057 -83366 122172
18299 -83629 -97707 -144551 -132008 -52505 -72042 -20426 -180278 87867 -200820 -260000 -16599
18287 329885 79096 -47623 120378 61374 -66363 -109088 -37465 -69198 -190224 278095 53602
18275 -154646 -23107 -97806 41474 -197383 37819 -233190 115591 -142321 104842 -274148
$$ packed form
18356b17948c8130B71008g7418A61585A1300l131a66644n4752B7868f5294a6409
18344B03266b10287p854i0622B22885b57451G5603J62543m5775a19126j77920
18334b97046g4556a1611j41516B15043b39687A10608g0102C8175K0640P7851b50591
18322B9012a52976h371l1421I9784b98347B04003a52913A79804B6929c82325K833
18311c79492A60359a14019A14603N8271e5698H7738R232a512j25545M3691A22172
18299h3629j4078m6844J2543e2505j9537b0426j59852H7867b00820n9180a6599
18287C29885G9096d7623A20378n9004f6363m2725c7465l1733j21026B78095E3602
18275a54646b3107p4699D1474a97383C7819b33190A15591a42321A04842b74148
$$ plain form
18264 24840 -218914 -24877 34745 53466 -345631 -3660 -80762 -240957 -39523 299054 233234
18253 233234 -53649 137687 88229 4937 20051 -349651 -46416 -82617 -149613 -66370 172809
18241 -32655 -160474 -79398 -5561 -209985 -115677 -165051 -51496 124172 -100677 -230750 21111
18229 -21556 306481 -333328 -33283 89289 -215921 -198313 147256 38745 119620 -309499 150088
18217 259211 -38934 -180591 -106441 114224 57795 50468 197769 -145102 -30907 92064 -3162
18205 -27629 87067 155661 226316 -38389 35638 -76750 206992 150365 -174271 -3903 -47863
18194 -47863 -151577 419832 -61591 211504 108889 -58429 -312694 -75937 -49385 55283 -138163
18182 192393 -70437 -149236 -252983 19577 82868 334643 -149806 109203 -194317 -17741
$$ packed form
18264B4840b18914b4877C4745J8721c45631c660p7102j60195c9523B99054o5820
18253B33234e3649A37687m9458D937J5114c49651d6416l6201o6996f6370A72809
18241c2655j27819g9398e561k04424R4308m9374e1496A24172a00677j30073B1111
18229b1556C06481c33328c3283H9289b15921J7608A47256C8745Q0875c09499A50088
18217B59211c8934j41657P4150A14224n6429p327J47301a45102c0907I2064c162
18205b7629H7067O8594P0655c8389C5638g6750B06992n6627a74271c903m3960
18194d7863j03714D19832f1591B11504j02615e8429k54265g5937K6552E5283a38163
18182A92393g0437p8799j03747A9577O3291K51775a49806A09203a94317a7741
$$ plain form
18171 126038 63926 -172195 -323072 -389844 -28394 112565 210744 344387 154930 355754
18161 355754 56620 -43264 -237437 -73126 154383 -281970 -316601 -150134 62009 91672 -291292
18149 -15198 -46040 -32062 -171130 67815 -55353 250444 269293 -136832 -179585 90336 36363
18137 127640 47998 494126 69344 -16377 37097 -428675 118356 140278 -213651 21798 43512
18126 43512 -57385 -101431 -17710 -62119 -320560 172236 -68018 217282 -407772 -293035 -113569
18114 29198 308715 38038 -79244 65066 12523 155789 278256 146920 79995 -28483 195105
18102 90804 116020 -91264 10458 113068 93740 -243750 -130659 -176278 36912 -112439 -103362
18091 -103362 28763 -235012 -61236 93037 29638 -212477 -80166 455589 -305411 -50512 83486
$$ packed form
18171A26038o2112a72195j50877o6772b8394A12565R8179J33643A54930K00824
18161C55754E6620d3264j94173g3126A54383b81970l4631a50134F2009K9663b91292
18149a5198l0842J3978j39068F7815e5353B50444J8849a36832m2753I0336C6363
18137A27640D7998M46128F9344a6377C7097d28675A18356K1922b13651B1798K1714
18126D3512e7385m4046a7710m4409k58441A72236f8018B17282d07772J14737a13569
18114B9198K79517C8038g9244F5066A2523J43266J22467j31336o6925b8483A95105
18102I0804K5216i1264A0458J02610j9328b43750J13091m5619C6912a12439R077
18091a03362B8763b35012f1236I3037B9638b12477h0166D55589c05411e0512H3486
$$ plain form
18079 130430 260418 102290 -21846 391147 -48130 319287 -74902 -180690 -168026 -117997
18069 -117997 -110444 160979 70289 -8351 -227185 -77204 -121117 135764 -40117 421534 -66796
18057 -385261 -3775 -133442 -38312 -230737 -103622 -133833 73018 -23060 113425 -64945 127794
18045 200608 63761 -116591 171748 -37789 -171437 106875 139545 255899 -145614 -105638
18035 -105638 -10581 -87485 -37327 -2503 -53621 -686 172374 -142397 42339 273538 150246
18024 150246 259488 24648 122217 51255 41225 -5728 53100 61577 -28602 -280907 -90983
18012 56275 -126843 53712 203786 73666 -44519 -302813 -201501 -193641 -33639 126331 129725
18001 129725 -28499 -130069 147398 495311 -162198 163750 -189827 393590 34330 152153
$$ packed form
18079A30430J29988A02290b1846C91147d8130C19287g4902j05788J2664N0029
18069a17997P553A60979G0289h351k18834g7204m3913A35764d0117D21534f6796
18057c85261c775j29667c8312j92425a03622l0211G3018b3060A13425f4945A27794
18045B00608F3761a16591A71748c7789j33648A06875L2670J16354a45614L9976
18035a05638a0581p6904c7327b503n1118f86A72374a42397D2339K31199j23292
18024A50246J09242B4648R7569E1255j0030e728E3100Q477b8602k52305i0983
18012E6275a26843E3712J50074G3666d4519k58294J01312P860c3639A26331L394
18001A29725b8499j01570A47398L47913a62198A63750a89827C93590C4330J17823
$$ plain form
17991 152153 -19171 -125082 -193444 -312341 -206580 -27735 -152657 301064 519722 149706
17980 -50491 64935 -88254 -143101 84599 -127255 94478 130973 -116905 44264 -115977 -134728
17969 -134728 186826 -60900 -45652 -3283 -369240 -68243 -276637 -24977 -53820 74651 -181095
17957 -438409 40949 -156561 -174696 -61435 -65655 -47279 193752 316512 -66273 -255615 115061
17945 346534 45645 -21099 -97128 101859 304757 66387 -64073 44140 -27775 37269 -188599
17933 -111468 108342 155271 243840 26393 -244448 -305639 112462 -68889 46158 139675 -84686
17921 219896 144752 179427 -181148 96900 373531 224798 253531 -15669 -9055 -56310 8754
17909 -26482 -54039 43312 -114426 -149934 -268050 -224473 -68981 -12065 68056 186643 48264
$$ packed form
17991A52153a9171j05911o8362j18897J05761b7735j24922C01064K18658A49706
17980e0491F4935h8254n4847H4599a27255I4478L6495a16905D4264a15977j8751
17969a34728A86826f0900J5248c283l65957f8243k08394b4977k8843G4651a81095
17957d38409D0949a56561j8135f1435m220J8376A93752J22760f6273j89342A15061
17945C46534D5645b1099p6029A01859K02898F6387f4073D4140b7775C7269a88599
17933a11468A08342M6929Q8569B6393b44448o1191A12462f8889D6158R3517h4686
17921B19896p5144L4675a81148I6900K76631j48733K8733a5669O614m7255H754
17909b6482k7557D3312a14426l5508j18116M3577f8981a2065F8056J18587D8264
$$ plain form
17897 -59164 -251773 292958 -181627 56315 467147 157674 98902 -187380 -45427 -228895
17887 -228895 4729 -91743 -108194 311656 238218 45635 -105349 192164 424727 105098 559232
17876 559232 -54514 43163 -75215 -256180 74137 181290 143301 -50121 211069 -221852 -189966
17865 -189966 -98960 34564 16266 -432230 -45852 318273 -22664 -29529 -189022 55795 -124809
17853 159428 93679 -52936 74852 315521 -159124 -281004 -177121 -326579 141868 -101689
17842 54971 108021 209721 343600 -26533 -6078 97068 101643 116736 73827 -27393 10673 -202417
17829 92958 250807 227349 1929 -161069 251304 -145739 -136298 198936 -254527 -123246 -23091
17817 -195453 -14924 -88933 85748 78278 138831 -138266 -80434 94179 97944 -116061 -132046
$$ packed form
17897e9164j92609B92958a81627E6315M10832A57674n8772a87380d5427j83468
17887b28895D729i1743j6451C11656p3438D5635a05349A92164K32563A05098M54134
17876E59232e4514D3163g5215j80965G4137J07153l7989e0121B11069b21852L1886
17865a89966R1006C4564A6266d32230d5852C18273b2664o865j59493E5795a24809
17853A59428o5749e2936G4852K40669a59124j21880J03883j49458A41868a01689
17842E4971N3050J01700J33879b6533f078I7068M575J5093m2909b7393A0673b02417
17829I2958J57849k3458A929a61069B51304a45739R441A98936b54527a23246b3091
17817a95453a4924p4009H5748p470O0553a38266N7832I4179L765a16061j5985
$$ plain form
17806 -132046 199338 8094 34218 49829 29076 157659 -133525 99137 95738 -55467 177924
17794 43117 511837 -83143 118327 141602 173645 -175372 438778 16348 -115698 149574
17783 269879 155741 -116880 45570 -215978 342461 117022 379461 56236 14854 348525
17773 348525 -293062 116115 13030 11008 144019 -17527 76819 126132 -98823 143967 -48506
17761 344061 172325 179124 -199004 412780 134447 -28289 174341 -75709 -315880 310005
17750 66184 69495 -70761 269873 136135 186162 -89456 166558 -79328 340418 -231255 397850
17738 274976 155595 66468 212641 106736 51776 -30252 -62863 -163995 -92330 10899 -5563
17726 14958 -52737 -282575 44341 -78351 104391 59672 121082 268548 262803 -268072 71035
$$ packed form
17806a32046A99338H094K6124J5611k0753J28583a33525I9137l399e5467A77924
17794D3117M68720h3143A18327K3275L2043a75372D38778A6348a15698A49574
17783B69879j14138a16880D5570b15978C42461A17022K62439E6236A4854L33671
17773C48525b93062A16115A3030k022J33011a7527G6819M9313i8823A43967d8506
17761C44061j71736O799a99004D12780A34447b8289A74341g5709k40171C10005
17750F6184L311g0761B69873j33738N0027h9456A66558g9328C40418b31255C97850
17738B74976j19381F6468J46173j05905E1776c0252l2611j01132P1665A0899e563
17726A4958e2737k29838D4341g8351A04391m4719O1410J47466n745b68072G1035
$$ plain form
17714 -36994 173805 193940 155571 -78326 187067 115327 98873 -29377 -235755 76941 235825
17703 235825 331391 29178 -110344 203600 -46256 -93371 26450 -169514 -273966 29702 39434
17692 39434 179265 -90550 351909 210746 81777 245303 -124027 177116 -62732 203908
17681 430946 20295 96252 238177 96284 328012 -199283 18082 377729 274445 28641
17670 -146224 256379 307076 44954 260057 228095 277092 77947 109684 177798 291128 -62439
17658 497485 22831 28258 -86968 385638 39440 -22282 216590 271901 -127101 299023 88315
17646 -9730 615 151723 55654 -271783 -53629 439260 155388 117117 -247441 -188355 -96897
17635 -96897 76946 -43908 -70478 94341 16635 91743 129235 -252449 148528 147222 175861
$$ packed form
17714c6994A73805K0135l8369g8326A87067p1740j6454b9377k06378G6941J58884
17703B35825R5566B9178a10344B03600d6256m7115B6450a69514j04452B9702R732
17692C9434J39831i0550C51909j41163H1777J63526a24027A77116f2732B03908
17681D30946B0295P5957J41925I6284K31728a99283A8082L59647j03284B8641
17670a46224B56379N0697D4954K15103l1962M8997G7947L1737O8114J13330f2439
17658D97485B2831N427h6968C85638C9440b2282B16590N5311a27101B99023H8315
17646i730F15J51108E5654b71783e3629D39260A55388l8271b47441N9086R1458
17635i6897G6946d3908k6570I4341A6635P5108L7492b52449A48528j306K8639
$$ plain form
17624 175861 -31160 60984 64791 33782 -286267 14093 288016 55048 17471 -167433 143070
17612 16242 -21933 -156726 -86164 264010 108728 -41485 370032 133353 352503 60168
17601 278501 -97827 231969 45782 70365 80648 -21816 -139769 95988 494263 182432 38782
17589 256312 -96378 79430 72687 189940 110336 -121657 231370 358632 247440 320498 -97194
17577 163403 102151 -96837 -337352 -55247 -152845 144522 365122 287846 -97378 145223 -41141
17565 -92702 39056 -80791 33757 96929 261173 -82171 119302 214501 -376675 98726 108088
17554 108088 102879 274991 7116 29278 144753 -99145 -41278 19371 97525 298679 -76226
17542 211351 175761 285889 315468 44157 181900 188051 440992 189700 425423 109973
$$ packed form
17624A75861c1160F0984L807l1009b86267A4093K73923E5048A7471a67433A43070
17612A6242b1933j34793P0562B64010A08728d1485C70032A33353K19150F0168
17601B78501i7827B31969D5782K4583J0283b1816j17953I5988L98275A82432C8782
17589B56312i6378G9430o743J17253p9604a21657B31370J27262j11192P3058i7194
17577A63403o1252i6837k40515e5247r7598A44522K20600p7276i7378A45223d1141
17565i2702C9056h0791C3757O3172J64244h2171A19302R5199c76675I8726R362
17554A08088n209J72112G116K2162J15475i9145d1278A9371P8154K01154g6226
17542B11351l5590J10128K9579D4157J37743O151K52941A89700K35723A09973
$$ plain form
17531 162708 77094 204511 375181 340789 272292 155534 327681 253971 231325 488055
17521 488055 51563 417065 637133 459835 74587 216394 479322 738346 629320 595079
17511 595079 539997 771258 899744 676869 1005037 524087 265622 495318 247648 348773
17501 348773 225734 350542 430991 489311 560657 525310 796875 1101058 700618 1258160
17491 1258160 792343 689118 877284 539850 429336 323861 244427 159679 193538 327979
17481 327979 270728 355337 290665 175622 152831 240789 280004 258707 426419 209402 151828
17470 151828 -114842 462189 144178 141195 302770 256223 233079 121684 89172 560237
17460 560237 272943 -93905 580964 434846 152253 204415 65374 112651 355991 319689
$$ packed form
17531A62708G7094J27417J70670l4392o8497j16758J72147p3710k2646K56730
17521D88055E1563L65502K20068j77298G4587J41807K62928K59024j09026l4241
17511E95079n5082K31261J28486k22875L28168m80950k58465K29696B47648J01125
17501C48773j23039J24808Q0449N8320P1346l5347K71565L04183m00440N57542
17491A258160m65817j03225J88166l37434j10514j05475p9434q4748L3859J34441
17481C27979n7251Q4609o4672j15043k2791Q7958L9215k1297J67712B09402n7574
17470A51828a14842D62189A44178k983J61575m6547k3144j11395l2512M71065
17460E60237B72943i3905E80964j46118A52253N2162F5374M7277K43340l6302
$$ plain form
17450 319689 197934 454367 476096 107236 -11133 212299 38380 233438 581126 164801
17439 403052 177034 395420 223981 352851 97039 593869 476705 318153 334816 459855
17429 459855 124206 771362 442816 597852 545253 310845 339299 262131 277759 194242
17419 194242 136327 428614 388746 143582 253212 467342 161923 18230 420014 469867
17409 469867 462333 -13331 307844 125369 90742 515985 372961 242433 98773 262953
17399 262953 156563 200446 -101876 495964 503823 369854 225091 -25638 -139009 -21776
17388 296872 324159 403134 12824 222629 227912 272288 246004 402881 64213 89750 274028
17377 274028 458311 526440 62389 444309 392720 99457 324384 276895 398058 53378 218571
$$ packed form
17450C19689j21755K56433K1729A07236a1133B12299C8380J95058L47688A64801
17439D03052A77034K18386j71439J28870I7039M96830j17164j58552J6663J25039
17429D59855A24206O47156l28546J55036n2599k34408K8454p7168J5628q3517
17419A94242n7915K92287l9868A43582J09630K14130A61923A8230M01784M9853
17409D69867p534a3331C07844A25369l4627M25243j43024j30528I8773J64180
17399B62953j06390M3883a01876D95964P859j33969j44763b5638j13371b1776
17388B96872K7287P8975A2824K09805N283M4376k6284J56877F4213K5537J84278
17377B74028J84283O8129F2389L81920n1589I9457K24927m7489J21163E3378J65193
$$ plain form
17366 218571 178730 23288 76867 23 242525 314413 196238 313972 197446 54069 3303
17354 379824 233616 -43523 432245 217980 245998 66520 210868 540911 168672 248546
17344 248546 482945 94025 367086 657735 399993 273061 412388 303025 468082 351686
17334 351686 242720 173809 294750 -17040 151228 404037 194457 248882 487953 -57501
17323 203199 510266 480383 298718 283976 196231 345543 370933 190084 223794 579581
17313 579581 134034 554633 552706 354721 363845 257746 476994 290580 373451 596941
17303 596941 99001 180265 230292 76739 415467 268949 -5019 689290 207686 233654 110698
17291 468750 418322 126185 70190 308694 308286 50224 35808 233255 483810 373398 69263
$$ packed form
17366B18571l9841B3288N3579B3K42502P1888j18175J17734j16526E4069C303
17354C79824j46208d3523D32245k14265K8018F6520J44348L30043A68672P9874
17344B48546K34399I4025K73061K90649k57742j26932J39327j09363J65057j16396
17334C51686j08966o8911J20941a7040A51228K52809A94457N4425K39071e7501
17323B03199L07067k9883j81665j4742q7745J49312K5390j80849L3710L55787
17313E79581A34034M20599j927j97985R124j06099K19248j86414Q2871K23490
17303E96941I9001Q1264N0027G6739L38728j46518e019F89290B07686K5968A10698
17291D68750n0428A26185n5995K38504m08E0224j4416J97447K50555j10412F9263
$$ plain form
17279 50807 347312 183678 626550 154928 791148 377022 175661 327115 383380 227199
17269 227199 316457 420265 638786 469247 336265 280188 85798 443299 433627 284779
17259 284779 195931 581878 -31159 509179 190218 414670 463931 376030 407866 -200222
17248 491712 519249 191390 475746 73284 100246 412743 233723 171619 203659 450179
17238 450179 173510 148225 325209 19031 405380 356257 257562 155398 400022 346376
17228 346376 447986 292762 497087 278607 148726 162001 197649 436864 359608 251242
17218 251242 302333 290789 119642 182528 267724 430882 520608 598541 381818 674524 409822
17207 409822 684559 466122 350400 372246 237349 250315 217285 406095 289550 331888
$$ packed form
17279E0807K96505j63634M42872A54928O36220C77022A75661J51454N6265j56181
17269B27199Q9258J03808K18521j69539j32982n6077H5798L57501r672j48848
17259B84779q8848L85947c1159E09179A90218K24452M9261q7901L1836b00222
17248D91712K7537A91390K84356G3284K6962L12497j79020o2104L2040K46520
17238D50179A73510k5285J76984A9031L86349m9123r8695j02164K44624n3646
17228C46376J01610j55224K04325k18480j29881J3275L5648K39215p7256j08366
17218B51242N1091j1544A19642O2886Q5196J63158Q9726P7933k16723K92706k64702
17207D09822K74737k18437j15722K1846j34897J2966l3030J88810j16545M2338
$$ plain form
17197 331888 264850 516424 483701 281172 414028 403700 316899 233118 423801 420369 281508
17186 281508 450437 260336 442930 464633 536173 410747 288950 308270 319683 155463
17175 572277 372586 363826 153845 411466 431062 356116 283150 417448 394000 313234 532264
17164 532264 325031 405555 355018 271916 544488 467432 677170 571908 716131 672240
17154 672240 475973 208059 587732 507782 418606 352031 594909 190561 139394 552893
17144 552893 469158 435891 569226 141583 707338 675835 456856 347896 469737 421791
17134 421791 538861 522362 336337 544460 389078 338743 530304 654912 411898 572246
17124 572246 623996 502739 335693 556273 304760 643166 609939 978769 479523 605982
$$ packed form
17197C31888o7038K51574l2723k02529J32856j0328q6801q3781J90683l432j38861
17186B81508J68929j90101J82594K1703P1540j25426j21797J9320J1413A55463
17175E72277j99691q760A53845K57621J9596p4946p2966J34298k3448q0766K19030
17164E32264k07233Q0524n0537q3102K72572p7056K09738j05262J44223m3891
17154F72240j96267B08059L79673p9950q9176o6575K42878A90561n1167M13499
17144E52893q3735l3267J33335A41583N65755l1503k18979j08960J21841m7946
17134D21791J17070j6499j86025K08123j55382n0335J91561J24608k43014J60348
17124E72246N1750j21257j67046K20580k51513L38406l3227L68830D79523J26459
$$ plain form
17114 605982 587162 537213 435625 546531 687128 825117 603198 436090 621396 666990
17104 666990 622707 532905 459678 720334 845881 838331 306007 456496 839634 436361
17094 436361 728298 561732 854774 603097 377566 207654 571475 777525 827721 583952
17084 583952 283780 607820 702474 622991 402726 848678 558906 635991 752374 830075
17074 830075 636180 656062 708441 601083 766537 546468 541089 663536 838488 485744
17064 485744 516533 847378 666919 1292157 819636 1092477 568481 675465 483002 576626
17054 576626 835339 1014819 895264 1224698 691337 665326 717906 1165398 825168 727253
17044 727253 720479 1085695 886989 606498 965158 1041218 1275400 856261 642878 943935
$$ packed form
17114F05982j8820m9949j01588J10906J40597J37989k21919j67108J85306M5594
17104F66990m4283q9802p3227K60656J25547p550C06007J50489L83138m03273
17094D36361K91937j66566K93042k51677k25531j69912L63821K06050N0196k43769
17084E83952B83780L24040R4654p9483k20265M45952k89772P7085J16383P7701
17074H30075j93895J9882N2379j07358J65454k20069n379J22447J74952l52744
17064D85744L0789L30845j80459O25238m72521K72841n23996J06984j92463R3624
17054E76626K58713J79480j19555L29434n33361k6011N2580M47492l40230r7915
17044G27253o774L65216j98706k80491L58660P6060K34182m19139k13383L01057
$$ plain form
17034 943935 1012360 874070 746300 1426784 641834 1150444 1104556 1171669 804453 890752
17024 890752 980232 1097789 842461 854610 907580 1058718 908359 1091087 871069 1009333
17014 1009333 853316 1022851 845011 950722 670297 880006 980602 996561 1127050 941717
17004 941717 1087240 1356278 906529 1153353 1147412 967152 716921 883665 1216409 792458
16994 792458 1180135 1149385 1092748 840194 1101177 1150192 1561393 1176673 1091464 1133857
16984 1133857 1390703 1444488 1324794 1225949 1189539 1318121 1212935 1551964 1321114 897688
16974 897688 1634398 1318580 1157248 1448198 1470006 1417222 1383902 1414528 1508224 2034638
16964 2034638 1397475 1111123 1266391 1651665 1499536 1689563 1341396 1501828 1534325 1616919
$$ packed form
17034I43935O8425j38290j27770O80484F41834N08610m5888O7113l67216Q6299
17024H90752Q9480J17557k55328J2149N2970J51138j50359J82728k20018J38264
17014A009333j56017J69535j77840J05711k80425K09709J00596J5959J30489j85333
17004I41717J45523K69038m49749K46824n941j80260k50231J66744L32744m23951
16994G92458L87677l0750n6637k52554K60983M9015M11201l84720q5209M2393
16984A133857K56846N3785j19694r8845l6410J28582j05186L39029k30850m23426
16974H97688P36710l15818j61332K90950K1808n2784l3320L0626R3696N26414
16964B034638o37163k86352J55268L85274j52129J90027l48167J60432L2497Q2594
$$ plain form
16954 1616919 1370354 1663402 1404659 1346526 1288196 1693472 1599082 1546043 1697758 1869385
16944 1869385 1346709 1797290 1317878 1611199 1764994 1473673 1562111 1982374 1926840 2154763
16934 2154763 1681894 1666709 1739751 1772140 1610514 1653290 1504797 1928424 1914675 1784597
16924 1784597 2205872 1818337 2034735 1942267 2224536 2422748 2252053 1926655 2122028 2505532
16914 2505532 2022923 2129900 1968930 2210902 2167091 2317228 2378927 2184118 2090035 2561854
16904 2561854 2408969 2269615 2829291 2406901 2767263 2385737 2220069 2701613 2657113 2762242
16894 2762242 2696569 2925699 2723841 2932294 2572543 2665256 3097861 2859864 2708866 3065777
16884 3065777 2994295 2909480 3153298 2913628 3193289 3172331 3194103 3073144 2997079 3134186
$$ packed form
16954A616919k46565K93048k58743n8133n8330M05276r4390n3039J51715J71627
16944A869385n22676M50581m79412K93321J53795k91321Q8438M20263n5534K27923
16934B154763m72869j5185P3042L2389j61626M2776j48493M23627j3749j30078
16924A784597M21275l87535K16398r2468K82269J98212j70695l25398J95373L83504
16914B505532m82609J06977j60970K41972m3811J50137O1699j94809r4083M71819
16904B561854j52885j39354N59676m22390L60362l81526j65668M81544m4500J05129
16894B762242o5673K29130k01858K08453l59751R2713M32605k37997j50998L56911
16884C065777p1482q4815K43818k39670K79661k0958K1772j20959p6065J37107
$$ plain form
16874 3134186 3245756 3202925 3474368 3507695 3471201 3102192 3576364 3644701 3566372 3951698
16864 3951698 3735884 3537714 3948192 3659162 4133996 3684058 4019346 3940611 4242494 4201138
16854 4201138 4218743 4211525 4380710 4046254 4377157 4579577 4711913 4674969 4667907 4543689
16844 4543689 5085343 5197608 4729406 4788682 5192942 5093217 5453427 5171759 5809091 5775692
16834 5775692 5709181 5539550 5934196 5749319 5729821 5842972 6120188 6044079 6418845 6447690
16824 6447690 6386280 6425328 6469796 6624376 7219579 7018840 7148655 7426895 7176300 7523798
16814 7523798 7727393 7808379 8192330 8063747 8386153 8350596 8528053 8743470 8992071 9131187
16804 9131187 9192528 9321713 9527516 9531895 9655057 10129170 10591976 10690725 10763447 10914287
$$ packed form
16874C134186J11570m2831K71443L3327l6494l69009M74172O8337p8329L85326
16864C951698k15814j98170M10478k89030M74834m49938L35288p8735L01883m1356
16854D201138J7605p218J69185l34456L30903K02420J32336l6944p062j24218
16844D543689N41654J12265m68202N9276M04260r9725L60210k81668O37332l3399
16834E775692o6511j69631L94646j84877j9498J13151K77216p6109L74766K8845
16824F447690o1410L9048M4468J54580N95203k00739J29815K78240k50595L47498
16814G523798K03595Q0986L83951j28583L22406l5557J77457K15417K48601J39116
16804I131187O1341J29185K05803M379J23162M74113M62806R8749P2722J50840
$$ plain form
16794 10914287 11307581 11123619 11451898 11856599 12055281 12214453 12859474 13196876 13226273
16785 13226273 13703635 13880317 14484283 14573597 14837752 15481771 15556716 16475797 16619020 16919957
16775 16919957 17463150 17727624 18141209 18848648 19213054 19629013 20562355 20935283 21388401
16766 21388401 21851108 22670480 23113170 23873020 24603845 25656563 26085630 26759819 27444824
16757 27444824 28341255 29741572 30294221 31381084 32438329 33248306 34489854 35603398
16749 35603398 36939178 37925654 39140803 40570014 42391192 43349323 45095706 46556533
16741 46556533 48319899 50001144 52110194 53561831 55758309 57695651 59690258 62115271
16733 62115271 64212515 66539170 69157030 70899301 74106371 76475202 79133301 81883161
$$ packed form
16794A0914287L93294j83962L28279M04701J98682J59172O45021L37402K9397
16785A3226273M77362J76682O03966Q9314K64155O44019P4945R19081J43223L00937
16775A6919957N43193K64474M13585P07439L64406M15959R33342L72928M53118
16766B1388401M62707Q19372M42690P59850P30825J052718M29067O74189O85005
16757B7444824Q96431J400317N52649J086863J057245Q09977J241548J113544
16749C5603398J335780R86476J215149J429211J821178R58131J746383J460827
16741D6556533J763366J681245K109050J451637K196478J937342J994607K425013
16733F2115271K097244K326655K617860J742271L207070K368831K658099K749860
$$ plain form
16725 81883161 84481282 87126169 90136924 93155897 95740545 98455217 101235801 103734375
16717 103734375 106462522 108932634 110994171 113208576 115070253 117021566 118253802 119330126
16709 119330126 120388129 120902520 121487467 121614886 121230886 120898074 119909528 119033618 117334981
16700 117334981 115888021 114142200 111880899 109762949 107360816 104830299 102353790 99767455
16692 99767455 96876933 94183868 91183471 88380403 85467169 82485294 79994537 77254504
16684 77254504 74905646 71767254 69736362 67017194 64691413 62353994 60022211 58179214
16676 58179214 55677941 53986751 51867373 50104691 48274264 46346367 44951648 43194632
16668 43194632 42048629 40192969 39011491 37984304 36445516 35311781 33972714 32878066
$$ packed form
16725H1883161K598121K644887L010755L018973K584648K714672K780584K498574
16717A03734375K728147K470112K061537K214405J861677J951313J232236J076324
16709A19330126J058003N14391N84947J27419l84000l32812r88546q75910j698637
16700A17334981j446960j745821k261301k117950k402133k530517k476509k586335
16692I9767455k890522k693065l000397k803068k913234k981875k490757k740033
16684G7254504k348858l138392k030892k719168k325781k337419k331783j842997
16676E8179214k501273j691190k119378j762682j830427j927897j394719j757016
16668D3194632j146003j855660j181478j027187j538788j133735j339067j094648
$$ plain form
16660 32878066 32199342 31222752 30018657 28882689 28344563 27133760 26356495 25530469 24959076
16651 24959076 24265472 23647971 23054404 22416015 21369609 20911105 20034597 19625066 19251112
16642 19251112 18698499 18206660 18016720 17442411 16907057 16526717 16114888 15701139 15500388
16633 15500388 14835976 14677331 13963035 14053050 13493994 12918819 12895707 12677884 12423238 12299153
16623 12299153 11849541 11654952 11324410 11082791 11002529 10711663 10271577 10176610 10082681 9483779
16613 9483779 9435778 9274144 9417399 8763097 8863891 8708915 8439739 8850495 8292321 8031751
16603 8031751 7867658 7610645 7649767 7658148 7422682 7219325 7340077 7245653 6547697 6737741
16593 6737741 6493254 6498760 6353777 6300481 6308149 6372890 6244513 5638796 5983200 5691955
$$ packed form
16660C2878066o78724r76590j204095j135968n38126j210803p77265q26026n71393
16651B4959076o93604o17501n93567o38389j046406m58504q76508m09531l73954
16642A9251112n52613m91839j89940n74309n35354l80340m11829m13749k00751
16633A5500388o64412j58645p14296R0015n59056n75175k3112k17823k54646j24085
16623A2299153m49612j94589l30542k41619q0262k90866m40086r4967r3929n98902
16613I483779m8001j61634J43255o54302J00794j54976k69176M10756n58174k60570
16603H031751j64093k57013L9122Q381k35466k03357J20752r4424o97956J90044
16593F737741k44487N506j44983n3296P668O4741j28377o05717L44404k91245
$$ plain form
16583 5691955 5589841 5334213 5483398 5101853 5221455 5280789 5411735 5035597 4899868 4949800
16573 4949800 5024112 5019257 4864466 4352501 4674955 4717385 4750832 4418212 4201065 4401328
16563 4401328 4026181 4459842 4189963 4246540 4015898 4131038 3946106 3731074 3667320 3709705
16553 3709705 4012316 3593459 4048475 3568948 3309781 3613173 3647788 3393058 3349905 3286162
16543 3286162 3167588 3081562 3076683 3124642 2877438 2972711 2685784 2827987 3179687 2792860
16533 2792860 2722334 3303722 2630684 2518748 3111806 2709383 2561192 2841816 2816218 2919408
16523 2919408 2663667 2636040 2515521 2492769 2626893 2581957 2417122 2506147 2316158 2261039
16513 2261039 2557343 2493991 2611759 2264791 2232062 2084963 1965570 2108433 1950499 2203249
$$ packed form
16583E691955j02114k55628J49185l81545J19602N9334J30946l76138j35729M9932
16573D949800P4312m855j54791n11965L22454M2430L3447l32620k17147K00263
16563D401328l75147M33661k69879N6577k30642J15140j84932k15032o3754M2385
16553C709705L02611m18857M55016m79527k59167L03392L4615k54730m3153o3743
16543C286162j18574q6026m879M7959k47204R5273k86927J42203L51700l86827
16533B792860p0526N81388o73038j11936N93058m02423j48191K80624k5598J03190
16523B919408k55741k7627j20519k2752J34124m4936j64835Q9025j89989n5119
16513B261039K96304o3352J17768l46968l2729j47099j19393J42863j57934K52750
$$ plain form
16503 2203249 2225932 2294877 1959780 2286960 2234692 1670960 2109961 1944676 1838450 1883554
16493 1883554 2060904 1857419 1959680 2239320 1614418 2000992 1731370 2103475 1763420
16484 1763420 1885315 1727103 1691265 1429225 1482056 1955865 1796209 1873783 1355324 1769918
16474 1769918 1844540 1743655 1627821 1600241 1550879 1485683 1522984 1538239 1527975 1472619 1566396
16463 1566396 1671560 1736705 1314927 1514762 1446241 1334934 1448667 1160311 1241041 1528051
16453 1528051 1171840 1364413 1288302 1458377 1248187 1593986 1485053 1436894 1000605 1274265
16443 1274265 940151 1529242 1460495 1212830 1187780 1158118 1109204 1273151 1360996 1324412
16433 1324412 928096 1404412 1047115 1414240 1034927 842922 1260878 1025660 1005398 1080116
$$ packed form
16503B203249K2683O8945l35097L27180n2268n63732M39001j65285j06226M5104
16493A883554J77350k03485J02261K79640o24902L86574k69622L72105l40055
16484A763420J21895j58212l5838k62040N2831M73809j59656P7574n18459M14594
16474A769918P4622j00885j15834k7580m9362o5196L7301J5255j0264n5356R3777
16463A566396J05164O5145m21778J99835o8521j11307J13733k88356Q0730K87010
16453A528051l56211J92573p6111J70075k10190L45799j08933m8159m36289K73660
16443A274265l34114N89091o8747k47665k5050k9662m8914J63947Q7845l6584
16433A324412l96316M76316l57297L67125l79313j92005M17956k35218k0262P4718
$$ plain form
16423 1080116 881856 1460140 1301462 1133870 1167210 1053948 1088580 1004075 863585 1342047
16413 1342047 984268 1170754 1046062 864490 998522 1047812 723674 899837 750218 727316
16403 727316 1020941 893542 965282 1112915 753727 840734 744982 849546 673992 823879
16393 823879 1177763 880057 522992 922776 670455 988736 927979 685592 1085615 668686
16383 668686 822150 1045831 618797 845421 1015232 814819 785495 526744 758667 1011798
16373 1011798 758041 384640 689904 786779 754653 563542 769188 680341 556247 646438
16363 646438 750298 789762 622547 825922 904461 653945 589470 714843 800262 660835
16353 660835 831041 1033347 510070 485958 489802 734478 706477 594691 846915 762324
$$ packed form
16423A080116j98260N78284j58678j67592L3340j13262L4632q4505j40490M78462
16413A342047l57779J86486j24692j81572J34032M9290l24138J76163j49619k2902
16403G27316K93625j27399P1740J47633l59188Q7007r5752J04564j75554J49887
16393H23879L53884k97706l57065L99784k52321L18281o0757k42387M00023m16929
16383F68686J53464K23681m27034K26624J69811k00413k9324k58751K31923K53131
16373A011798k53757l73401L05264R6875l2126j91111K05646q8847j24094R0191
16363F46438J03860L9464j67215K03375P8539k50516o4475J25373Q5419j39427
16353F60835J70206K02306E10070k4112L844K44676k8001j11786K52224q4591
$$ plain form
16343 762324 737343 685759 861173 433999 637034 308352 592148 608158 677139 415892
16333 415892 579431 489680 826683 491152 725121 360092 560997 519075 239328 468671
16323 468671 843520 725499 328302 566681 447394 512053 412591 664767 709865 963427
16313 963427 217082 590722 689576 528888 582649 668928 45204 337412 359408 544997
16303 544997 714538 573901 275018 674994 471049 580870 390385 460612 691383 624226
16293 624226 220305 358893 301000 703745 599516 405292 372589 669292 511209 304950
16283 304950 590914 465145 709427 189773 104501 349905 296366 453749 678778 543182
16273 543182 344726 445378 455964 636068 358656 367945 282614 160351 321787 441736
$$ packed form
16343G62324k4981n1584J75414m27174K03035C08352K83796J6010O8981k61247
16333D15892J63539q9751L37003l35531K33969C60092K00905m1922B39328K29343
16323D68671L74849j18021C28302K38379j19287O4659r9462K52176M5098K53562
16313I63427B17082L73640R8854j60688N3761Q6279D5204K92208K1996J85589
16303E44997J69541j40637B75018L99976k03945J09821j90485P0227K30771o7157
16293F24226B20305J38588n7893M02745j04229j94224l2703K96703j58083k06259
16283C04950K85964j25769K44282A89773q5272K45404n3539J57383K25029j35596
16273E43182j98456J00652J0586J80104k77412R289q5331j22263J61436J19949
$$ plain form
16263 441736 578733 306554 516924 414569 265875 421176 461937 628189 175552 196413
16253 196413 130042 463852 256473 613942 291822 294946 549506 253153 457938 132157
16242 165674 248088 113595 214278 277065 313413 415031 425651 275993 220567 454701
16232 454701 165913 462651 206448 633913 202519 442001 429031 484723 579531 223165
16221 186575 255392 -16148 369495 622605 146180 308270 208796 424213 188370 168689
16211 168689 152767 304630 -14909 336003 270504 21992 383987 230440 376747 489687
16201 489687 655284 133978 35254 432037 375799 456671 232019 175671 535150 128906
16190 206267 383171 323343 -85162 319175 38745 305262 492162 317534 265930 153715
$$ packed form
16263D41736J36997k72179K10370j02355j48694J55301M0761J66252A75552K0861
16253A96413o6371L33810k07379L57469B91822L124K54560B53153K04785A32157
16242A65674Q2414A13595J00683O2787L6348J01618J0620j49658n5426K34134
16232D54701A65913K96738B06448M27465B02519K39482j2970N5692R4808B23165
16221A86575O8817a6148C69495K53110A46180J62090r9474K15417A88370j9681
16211A68689j5922J51863a4909C36003o5499B1992L61995j53547J46307J12940
16201D89687J65597A33978C5254L96783n6238Q0872k24652n6348L59479A28906
16190B06267J76904n9828h5162C19175C8745K66517J86900j74628n1604j12215
$$ plain form
16180 153715 287838 142653 241641 503383 107954 280016 264868 186355 351962 84827
16169 225658 110916 177810 427768 224507 204794 153183 -42916 242675 36400 331603
16159 331603 383422 172572 82495 368906 389835 189801 162567 -6293 58211 83964 492601
16148 492601 -262073 49078 158158 -44844 561093 -32418 338058 250839 -5855 105760 53312
16137 53312 275141 200718 156972 66887 167768 -89688 204466 -4723 375882 288003 -122056
16125 -18747 -116310 293588 108714 2585 84611 194789 -141610 244290 -68220 163217 377912
16114 377912 -6587 602543 38367 -112501 188859 -45351 138169 432086 198521 54477
16103 190469 139529 65809 337903 176487 -37992 301377 81914 76079 530884 342585 152018
$$ packed form
16180A53715J34123A42653R8988K61742A07954J72062j5148p8513J65607H4827
16169B25658A10916O6894K49958k03261j9713n1611d2916B42675C6400K95203
16159C31603N1819A72572H2495K86411K0929A89801k7234f293E8211K5753M08637
16148D92601b62073D9078J09080d4844E61093c2418C38058q7219e855A05760n2448
16137E3312K21829p4423m3746F6887J00881h9688B04466d723C75882q7879a22056
16125a8747r7563B93588A08714B585Q2026J10178a41610B44290f8220A63217K14695
16114C77912f587F02543C8367a12501A88859d5351A38169K93917A98521E4477
16103A90469n0940F5809K72094j61416c7992C01377H1914n835M54805j88299A52018
$$ plain form
16091 -29635 259503 158553 -85600 30881 163455 338946 234384 264693 197134 204202 123206
16080 123206 246082 243532 351420 113328 -54675 -26114 43084 -41369 -112372 106588 159083
16069 159083 295021 23530 84022 28385 204589 -92063 86559 246849 -195086 97520 176612
16058 176612 72307 61635 54396 236894 52116 74490 38657 337428 175999 91505 11162
16046 -213527 -153652 411882 342630 675241 -23764 1733 -177828 87736 22062 264326 164141
16035 164141 -194239 50881 133448 258823 143962 222238 -70576 -39696 32431 -88978 100901
16023 156229 -214490 282171 50209 70696 254610 101884 -85177 22790 194038 232740
16013 232740 80642 47207 -13210 15700 61226 42053 178354 122310 73220 101418 72460
$$ packed form
16091b9635B59503j00950h5600C0881J32574J75491j04562L0309o7559P068q0996
16080A23206J22876k550J07888A13328e4675b6114D3084d1369p1003A06588N2495
16069A59083J35938B3530O0492B8385J76204i2063H6559J60290a95086I7520P9092
16058A76612G2307j0672p239J82498E2116K2374l5833K98771j61429q4494A1162
16046b13527N9875D11882o9252L32611b3764A733a77828H7736B2062K42264j00185
16035A64141a94239E0881Q2567J25375j14861P8276g0576L0880C2431h8978A00901
16023A56229b14490B82171E0209K0487J83914A01884h5177B2790J71248L8702
16013B32740H0642l3435a3210A5700M5526j9173J36301n6044m9090K8198k8958
$$ plain form
16002 72460 292779 -59515 -80348 -172169 80588 118996 152410 20685 183197 -237157 -133046
15991 -133046 94525 -142674 459695 -9001 272988 -3374 18867 212647 -122330 153728 38060
15979 -17424 50399 9534 102923 492530 790650 437157 410251 837862 695033 1004028 1045725
15968 1045725 1132863 607487 350327 295697 371900 375785 359792 335283 63052 -198586 288561
15956 324359 -99458 -147886 117399 -495447 -36716 233920 232866 158066 143558 136259 159195
15945 159195 164562 -247512 -173826 24923 134770 5149 215741 -235542 205937 221979 -87085
15933 -344308 -130283 -20238 193509 77114 -136432 -51667 -363347 -99318 132286 -42833
15922 52206 111028 -254236 33758 117527 -299921 110125 -284642 138121 1919 -333428 -345162
$$ packed form
16002G2460K20319e9515k0833r1821H0588L8408L3414B0685J62512b37157J04111
15991a33046I4525a42674D59695i001B72988c374A8867J93780a22330A53728C8060
15979a7424E0399I534R3389L89607K98120l53493k6906M27611j42829L08995M1697
15968A045725Q7138n25376k57160n4630P6203L885j5993k4509F3052a98586B88561
15956C24359i9458m8428A17399d95447c6716B33920j054p4800j4508p299K2936
15945A59195N367b47512P3686B4923J09847E149K10592b35542B05937J6042h7085
15933c44308a30283b0238A93509G7114a36432e1667l11680i9318A32286d2833
15922E2206N8822b54236C3758Q3769b99921A10125b84642A38121A919c33428j1734
$$ plain form
15911 -345162 98902 59654 455148 -304229 -532033 -232392 -119271 -180075 -229766 19927
15900 -72460 -218630 85256 -87380 254416 71136 238703 86310 -112120 -468288 219323
15889 168427 142522 -271818 -159327 -348291 76588 77555 -242138 -31457 106743 6760 25188
15878 25188 98030 -48547 27207 40159 32456 -51806 204256 -211330 -137609 -194461 30959
15866 124784 -49896 -34594 -436716 -22437 -67517 -285821 -89094 309164 25078 231091 -36696
15854 62087 -87499 -397279 -42656 -27830 70175 -125421 48641 -168692 -15031 -84559 -314442
15843 -314442 211622 12113 -112303 327082 -218150 -209130 20910 -65324 -95781 -42756 6141
15831 58790 -305400 345195 -78003 -92227 -150200 95219 -268961 437441 -137407 93550 -214537
$$ packed form
15911c45162I8902l9248L95494c04229k27804b32392J13121o0804m9691A9927
15900g2460j46170H5256h7380B54416G1136J67567H6310a12120l56168B19323
15889A68427k5905b71818J12491j88964G6588R67b42138c1457A06743F760J8428
15878B5188P2842d8547B7207J2952p703e1806B04256b11330P3721n6852C0959
15866A24784d9896J5302m02122b2437m5080k18304h9094C09164B5078K06013c6696
15854F2087h7499l09780d2656J4826G0175a25421D8641a68692a5031o9528k29883
15843c14442B11622A2113a12303C27082b18150R020B0910f5324l0457d2756F141
15831E8790c05400C45195g8003j4224n7973I5219b68961D37441a37407I3550b14537
$$ plain form
15819 214961 -34141 -2859 19111 -71618 48701 -63577 -6998 -99366 -176935 29247 212359 219122
15807 219122 20455 14688 118713 30280 -32317 -95324 196285 223725 106282 34068 222227
15796 222227 -168587 318228 -470247 180656 85492 89096 -49566 271555 -43099 250145
15785 193348 -130749 -10472 -225973 184884 109011 144965 97012 -19599 -112520 166331 510178
15774 510178 80070 -263298 376080 39566 -24415 -258925 114559 9639 230998 63318 -272777
15762 -61409 53011 -18549 -35306 -332552 20755 69115 -155452 -18227 143443 171339 148990
15751 148990 195216 -37001 -57365 -121432 150476 -122312 230977 284283 67230 -36418 148461
15739 248282 64873 -3687 5506 29161 42896 80124 599568 299182 317874 -264501 236021
$$ packed form
15819B14961c4141b859A9111g1618D8701f3577f998r2368p7569B9247J83112O763
15807B19122B0455n767J04025C0280c2317o3007A96285K7440A06282C4068J88159
15796B22227a68587C18228d70247A80656H5492L604d9566B71555d3099B50145
15785A93348a30749a0472k15501A84884p5873L5954m7953a9599r2921A66331L43847
15774E10178H0070b63298C76080C9566b4415k34510A14559I639K21359F3318b72777
15762f1409E3011a8549j6757k97246B0755M8360a55452a8227A43443K7896k2349
15751A48990M6226c7001k0364o4067A50476a22312B30977N3306F7230c6418A48461
15739B48282F4873c687E506K3655J3735L7228N19444B99182J8692b64501B36021
$$ plain form
15727 84658 -322297 -205254 -70437 -32494 -174874 77096 -19109 88959 -120048 19547 293873
15716 293873 -177695 -334841 -43723 -20457 15283 21385 21826 -99503 -168438 -170592 -38333 66233
15703 -39972 -258105 -115982 -343001 -169634 227969 -285888 -283474 138602 -282781 346716
15692 -195089 19231 -152397 -53728 526695 -150397 68998 -83334 -114577 -110708 83422 77854
15681 77854 120873 -16337 138956 54101 257026 133992 51746 67061 237601 157022 151471
15670 151471 176434 -195039 -144445 -23501 44352 -110655 -84257 -38732 -336921 58623 -206693
15658 291443 -61336 -338900 182504 118833 74250 -115145 -164441 147322 66337 -152066
15647 -136763 -131179 -275689 18807 -70893 -153050 -157167 -191756 150081 16508 -173125 209764
$$ packed form
15727H4658c22297J17043g0437c2494j42380G7096a9109H8959a20048A9547K74326
15716B93873a77695j57146d3723b0457A5283O102M41i9503o8935k154c8333F6233
15703c9972k18133a15982k27019a69634B27969b85888K414A38602b82781C46716
15692a95089A9231a52397e3728E26695a50397F8998h3334l1243L869H3422n568
15681G7854M3019a6337A38956E4101K02925j23034E1746J5315J70540q0579n551
15670A51471K4963a95039N0594b3501D4352a10655K6398c8732k98189E8623b06693
15658B91443f1336k77564A82504o3671m4583a15145m9296A47322F6337a52066
15647a36763N584j44510A8807g0893q2157m117l4589A50081A6508a73125B09764
$$ plain form
15635 134044 61535 77197 -174545 -37683 -451233 -210843 -44706 -191987 170730 189281
15625 189281 -163288 -61099 213199 -435206 131880 23148 122508 -146258 156342 -104927
15614 -101922 -137962 -194678 -158293 -63480 -20818 -165829 -175690 -227765 -378857 94978 22850
15602 291195 -88055 116764 -148409 -235214 -166593 78856 -154845 -5159 -16353 -204399 148372
15590 120883 31454 -60345 9295 -78257 -172033 -87427 -328288 -319897 123109 -238727 137728
15578 534279 227045 103551 -115371 195517 -97214 -247587 -230296 -503498 372406 -156842
15567 165481 -158839 175576 119065 81414 -266413 50794 -69978 59810 18669 50998 -183228
15555 -306188 -203410 -57920 136700 -92410 -104003 212947 -38347 -173601 407832 60390
$$ packed form
15635A34044F1535J5662a74545c7683m13550b10843d4706j47281A70730J8551
15625A89281a63288f1099B13199d35206A31880B3148R9360a46258A56342a04927
15614a01922l6040n6716L6385f3480b0818j45011r861n2075j51092I4978B2850
15602B91195h8055A16764a48409q6805O8621G8856a54845e159j1194j88046A48372
15590A20883C1454f0345I295g8257r3776Q4606k40861Q391A23109b38727A37728
15578E34279B27045A03551a15371A95517i7214j50373J7291k73202C72406a56842
15567A65481a58839A75576n6511l7651b66413E0794f9978E9810A8669L2329a83228
15555c06188J02778e7920A36700i2410j1593B12947c8347j35254D07832F0390
$$ plain form
15544 216941 52367 -188776 84594 101788 -135334 127828 -48694 184618 196328 -168747
15533 -39314 326610 47669 -196779 29024 46599 39574 166780 220140 -68278 71031 84042
15522 84042 -95321 -52193 5193 9360 60922 -54522 288416 -100867 136348 31860 244204
15511 244204 56501 162227 -63952 216858 58150 261435 168524 9960 -49620 181673 308839
15500 308839 -78978 139397 74206 166509 231576 310153 458870 -50587 479048 372432 38056
15488 180286 186091 324325 264011 -166390 206102 247039 195170 652219 108398 -17526 120234
15476 371448 119476 -210092 -63303 192615 316661 239379 131024 29383 399392 509077
15466 509077 8867 202846 111005 -1541 262480 238132 291773 184977 156746 464501 485366
$$ packed form
15544B16941E2367a88776H4594J7194a35334A27828d8694A84618J1710a68747
15533c9314C26610D7669a96779B9024J7575p025J27206N3360f8278G1031J3011
15522H4042i5321M3128E193M167N1562e4522B88416a00867A36348C1860K12344
15511B44204E6501J05726f3952B16858E8150K03285r2911I960d9620A81673J27166
15500C08839g8978A39397o5191R2303O5067P8577J48717e0587D79048j06616C8056
15488A80286N805J38234o0314a66390B06102M0937n1869M57049A08398a7526A20234
15476C71448A19476b10092f3303A92615J24046p7282j08355B9383L70009J09685
15466E09077H867J93979r1841a541B62480k4348N3641j06796k8231L07755K0865
$$ plain form
15455 485366 545772 116871 163230 -10804 147736 93287 -96232 -254463 159249 81391 -231608
15443 -90772 97806 -202062 7176 3627 125364 24336 -167938 -48143 275436 -250355 32725
15431 175902 -107959 125808 277805 174605 707373 591133 786340 987306 860340 461809
15421 461809 -32711 451773 421486 -364749 -93685 87981 -189152 204642 -69067 216761
15410 61077 7387 -205070 190980 -75463 40048 94766 -218005 -72599 62299 240604 178441
15399 178441 184772 294114 -68940 153022 -151629 71377 -6381 160563 -34025 -242673 -120751
15387 156542 -52042 143192 -59415 226054 265141 -86483 -253886 -146842 -62558 414712
15376 -304164 -166812 -18083 -313273 204401 -59585 323454 -94902 -26673 504614 328896
$$ packed form
15455D85366O0406A16871M6359a0804A47736n4449i6232j58231A59249p7858b31608
15443i0772I7806b02062G176l549J21737B4336a67938d8143B75436b50355C2725
15431A75902a07959A25808J51997j03200N32768j16240J95207K00966j26966l98531
15421D61809c2711D51773l0287c64749i3685H7981a89152B04642f9067B16761
15410F1077G387b05070A90980g5463D0048N4718b18005g2599F2299J78305o2163
15399A78441O331J09342f8940A53022a51629G1377f381A60563c4025k08648a20751
15387A56542e2042A43192e9415B26054L9087h6483j67403J07044f2558D14712
15376c04164J37352a8083k95190B04401e9585C23454i4902b6673E04614j75718
$$ plain form
15366 328896 7657 45826 -382734 -64043 -282508 127431 42516 159239 398493 158993
15355 186643 344263 134535 210321 174908 204062 97282 119997 116343 275534 260265 -127587
15343 4879 127984 -184023 -172141 7858 466579 -132970 37872 397815 -203298 -128522 124631
15331 -26988 134657 -14522 231480 236470 202129 158573 125830 543369 281723 -32995 -188354
15320 -188354 229849 177119 -14256 212789 -3723 1921 -60779 172943 290736 198116 214403
15309 214403 332611 82165 151692 -198061 264719 19364 -97380 -5103 167512 21028 364829
15298 364829 79575 201885 100125 -151963 167368 220505 223871 348498 74634 131083 361677
15287 361677 92738 42763 158682 92425 12863 44917 158596 -83801 272015 34092 54783
$$ packed form
15366C28896G657L8169c82734f4043k18465A27431D2516J16723K39254A58993
15355A86643J57620A34535P5786l5413K9154I7282K2715l654J59191j5269a27587
15343D879J23105a84023J1882G858M58721a32970C7872L59943b03298P4776A24631
15331b6988A34657a4522B31480M990l4341m3556l2743M17539k61646c2995j55359
15320a88354B29849n2730a4256B12789c723A921f0779A72943J17793r2620J6287
15309B14403J18208H2165O9527a98061B64719A9364i7380e103A67512B1028L43801
15298C64829G9575J22310A00125a51963A67368N3137L366J24627G4634N6449K30594
15287C61677I2738D2763J15919o6257A2863L2054J13679h3801B72015C4092K0691
$$ plain form
15276 54783 -198159 -63090 -292375 142670 108440 -30246 305904 153693 314071 351912
15266 351912 76983 39047 -157815 -183115 -48811 -46600 89596 109959 135845 282039 167997
15255 167997 27171 252312 -83420 -208315 202782 -129093 71766 -202485 77366 118223
15245 118223 -74941 54079 -42624 339001 -52713 16724 -243807 32898 -77393 -97680 112379
15233 -139891 533461 259895 305674 140780 582883 1185808 1329396 1052750 1083691 899720
15223 899720 451547 207175 362823 614256 11235 190492 223104 15684 227572 180537
15213 180537 206707 -270490 77807 -90896 116424 2538 -77471 144087 -179436 283814 148437
15202 148437 -85590 -139592 8544 272070 222474 -238331 15717 -28667 119553 -174517 426418
$$ packed form
15276E4783a98159f3090k29285A42670l4230c0246C05904j52211J60378L7841
15266C51912G6983l7936a57815k5300d8811K211H9596K0363K5886J46194j14042
15255A67997B7171K25141h3420j24895B02782a29093G1766b02485G7366M0857
15245A18223g4941E4079d2624C39001e2713A6724b43807C2898g7393k0287A12379
15233a39891E33461B59895M5779A40780M42103O02925J43588k76646L0941j83971
15223H99720m48173B07175J55648K51433A1235J79257L2612A5684K11888m7035
15213A80537K6170b70490G7807i0896A16424B538g7471A44087a79436B83814j35377
15202A48437h5590n4002H544K63526m9596b38331A5717b8667A19553a74517D26418
$$ plain form
15190 -3605 -328916 6430 -133541 -66774 195115 111760 189887 254251 28363 75121 -117789
15178 155122 189406 53137 157960 33818 219623 -493959 146621 -40145 -61030 -77561 12639
15166 38134 105510 -149703 296344 322188 -53368 -215309 50578 262691 188989 160630 292791
15155 292791 -147183 209106 17998 121892 358468 -106490 194567 34016 49269 128854
15145 128854 157125 221668 249671 -268036 415941 194661 168911 113929 58677 36207 280044
15134 280044 86719 -7123 -22517 85350 162713 -18434 -101069 -117735 -118959 46248 118680 199702
15122 199702 -66139 232199 227727 25545 335740 39064 -49042 -2316 56576 170573 -162981
15110 376000 72073 252172 360934 293099 111838 405474 19858 288120 60575 97161
$$ packed form
15190c605l25311F430a33541O6767A95115q3355P8127O4364B8363M6758a17789
15178A55122L4284E3137J04823C3818J85805d93959A46621d0145k0885j6531A2639
15166C8134O7376a49703B96344K5844e3368j61941E0578K12113p3702k8359J32161
15155B92791a47183B09106A7998J03894K36576a06490A94567C4016J5253P9585
15145A28854K8271O4543K8003b68036D15941A94661k5750n4982n5252k2470K43837
15134B80044H6719g123j5394H5350P7363a8434q2635j6666j224D6248P2432Q1022
15122A99702f6139B32199m472B5545L10195C9064d9042b316E6576J13997a62981
15110C76000G2073J80099J08762o7835A11838K93636A9858K68262F0575L6586
$$ plain form
15100 97161 15470 51074 -132429 67366 208806 136229 207369 89914 -87653 189492 202513
15089 202513 -108630 -36802 -331946 143227 59206 202089 346532 -182430 65767 26351
15078 -117189 95235 212534 -116488 -140456 100332 173495 -229209 121362 150847 -1996 39073
15066 -17747 131133 108700 55456 322022 69444 -73008 236461 54925 16853 160382 59944
15054 152149 -113796 -105507 186639 179589 199716 183452 142482 277102 297499 174022 370473
15043 370473 450201 248524 32334 239069 303775 319389 363837 456491 348199 216683 558822
15032 558822 394370 444183 400953 398558 308538 339948 450095 301718 317960 -114921 243689
15020 549051 323227 415137 415474 246289 827037 411672 547377 361850 794237 863733
$$ packed form
15100I7161A5470L5604a32429F7366J41440p2577P1140H9914h7653A89492J3021
15089B02513a08630c6802k95144A43227E9206J42883J44443a82430F5767B6351
15078a17189I5235J17299a16488k3968A00332P3163b29209A21362K9485a996C9073
15066a7747A31133k2433n3244K66566F9444g3008B36461E4925A6853J43529E9944
15054A52149a13796Q289A86639p050K0127j6264m0970J34620K0397j23477J96451
15043C70473P9728k01677C2334K06735O4706J5614M4448R2654j08292j31516L42139
15032E58822j64452M9813m3230k395r0020L1410J10147j48377J6242a14921B43689
15020E49051k25824R1910L37j69185N80748D11672J35705j85527M32387O9496
$$ plain form
15010 863733 659646 577657 594363 297165 505140 316992 551001 421782 261700 451389
15000 451389 356184 782193 669834 46977 119231 198776 443263 285086 126329 780205
14990 780205 415768 202684 464155 535353 360166 361697 634785 246055 574768 496542
14980 496542 346856 190101 551849 223253 167126 205170 404887 601658 324254 540834
14970 540834 380207 352050 572886 577526 727109 856389 566707 470314 605336 453301
14960 453301 428419 260725 439525 654464 706681 578515 303195 689419 931923 -117574
14949 143224 486924 564257 376459 287062 152972 362940 530792 347635 229294 39651
14938 190280 318074 263218 624294 738249 129260 175722 363534 393393 680925 643423
$$ packed form
15010H63733k04087q1989J6706B97165K07975j88148K34009j29219j60082J89689
15000D51389r5205M26009j12359D6977P2254P9545K44487j58177A26329O53876
14990G80205l64437B02684K61471P1198j75187J531K73088B46055L28713p8226
14980D96542j49686j56755L61748B23253n6127L8044J99717J96771k77404K16580
14970E40834j60627k8157K20836M640J49583J29280k89682r6393J35022j52035
14960D53301k4882j67694J78800K14939N2217j28166k75320L86224K42504a17574
14949A43224L43700P7333j87798q9397j34090K09968J67852j83157j18341C9651
14938A90280J27794n4856L61076J13955A29260M6462J87812K9859K87532l7502
$$ plain form
14928 643423 660041 625135 623266 601175 409905 182124 267298 588788 209231 775479 631430
14917 631430 839858 911157 632366 1140120 1238760 982940 936273 1198999 1581687 1695096
14907 1695096 1450692 1927300 1619811 1653520 1377970 1932067 1933996 2129941 1760826 1413949
14897 1413949 1149338 1339877 717352 1291691 640754 854375 500714 674937 670843 434546
14887 434546 -3004 427914 380075 476782 523973 659001 176604 375461 507060 656574
14877 656574 450384 136396 359546 723002 382882 659146 535660 723978 584672 642893
14867 642893 301679 670831 853327 631566 757854 654387 460419 520147 616619 500256
14857 500256 434760 291738 375383 96893 517301 565919 674514 666078 514738 764650 737097
$$ packed form
14928F43423J6618l4906j869k2091j91270A82124Q5174L21490B09231N66248j44049
14917F31430K08428P1299k78791N07754R8640k55820m6667K62726L82688J13409
14907A695096k44404M76608l07489L3709k75550N54097J929J95945l69115l46877
14897A413949k64611J90539o22525N74339F40754K13621l53661J74223m094k36297
14887D34546c004D27914m7839R6707M7191J35028A76604J98857J31599J49514
14877F56574k06190A36396K23150L63456l40120K76264j23486J88318j39306N8221
14867F42893C01679L69152J82496k21761J26288j03467j93968N9728R6472j16363
14857E00256o5496j43022Q3645I6893M20408M8618J08595q436j51340K49912k7553
$$ plain form
14846 737097 330253 570797 155071 615654 473953 420254 707877 137392 443737 271027
14836 271027 535043 269072 257434 350394 765864 377322 735982 726555 976852 1048697
14826 1048697 791027 1243027 1153958 806916 881404 907613 752046 707677 651958 479084
14816 479084 766359 448522 633574 495001 430307 799133 590607 499167 871421 867586
14806 867586 570014 819593 687796 847090 742804 509444 565541 641824 666427 538964
14796 538964 854099 637679 829695 623320 825597 842912 620657 877681 1025075 623080
14786 623080 888236 796016 401041 821369 461670 625593 265347 576461 614997 279875
14775 358642 553777 601706 319596 526267 305350 803801 780551 760713 866587 966615
$$ packed form
14846G37097C30253K40544A55071M60583j41701n3699K87623A37392L06345j72710
14836B71027K64016k65971j1638R2960M15470C77322L58660r427K50297P1845
14826A048697k57670M52000q9069l47042P4488K6209j55567m4369n5719j72874
14816D79084K87275l17837J85052j38573o4694L68826k08526r1440L72254l835
14806H67586k97572K49579j31797J59294j04286k33360N6097P6283K4603j27463
14796E38964L15135k16420J92016k06375K02277J7315k22255K57024J47394m01995
14786F23080K65156r2220l94975M20328l59699J63923B65347L11114L8536B79875
14775C58642J95135M7929k82110K06671k20917M98451k3250j9838J05874J00028
$$ plain form
14765 966615 1048185 599257 779817 587219 1112263 1307437 652199 1044733 1112163 792925
14755 792925 315354 801915 666765 1015847 537186 733076 359287 629941 583189 678494
14745 678494 683804 542775 694553 463749 541724 725061 501807 910023 665153 732813
14735 732813 381419 644136 741767 630149 656242 803537 973324 1023833 683820 666907
14725 666907 661903 712017 678121 597914 750863 533805 865983 568890 832654 851315 1118500
14714 1118500 1457284 1260336 1803484 1673785 1735835 1523834 1425619 1267637 1217938 1138193
14704 1138193 823156 818619 1156367 757851 713195 847780 1241098 753217 602117 1212083
14694 1212083 1186751 698296 974636 1281464 1072896 1290369 1288148 1440156 1632981 1674187
$$ packed form
14765I66615Q1570m48928J80560j92598N25044J95174F52199L92534O7430l19238
14755G92925C15354M86561j35150L49082m78661J95890C59287K70654m6752R5305
14745F78494N310j41029J51778k30804P7975J83337k23254M08216k44870O7660
14735G32813l51394K62717R7631j11618K6093J47295J69787N0509l40013j6913
14725F66907n004N0114l3896q0207J52949k17058L32178k97093K63764J8661K67185
14714A118500L38784j96948N43148j29699O2050k12001r8215j57982m9699p9745
14704A138193l15037m537L37748l98516m4656J34585L93318m87881j51100O09966
14694A212083k5332m88455K76340L06828k08568K17473k221J52008J92825M1206
$$ plain form
14684 1674187 1539177 1726938 1560321 1294081 1227348 1133311 1184058 859089 837359 1310744
14674 1310744 1128327 840343 816577 772147 880606 997299 987629 1097196 974121 787129
14664 787129 867010 1044380 962260 1288727 872860 796023 975751 1062917 821112 764202
14654 764202 1062197 1075314 1040077 1014881 1173091 1107815 1367995 898635 951699 670869
14644 670869 1023568 1204526 975973 956102 1189994 1108949 1252055 1440560 1368536 1176909
14634 1176909 1081231 665828 895287 1462275 1307683 933537 1344873 1103178 1043926 1235150
14624 1235150 1130110 1263652 1296529 1183091 976997 1024218 1269345 1155151 1037007 1123360
14614 1123360 1478594 1215766 1231501 1300243 1049673 1308016 1331175 1655988 1242147 1174370
$$ packed form
14684A674187j35010J87761j66617k66240o6733r4037N0747l24969k1730M73385
14674A310744j82417k87984k3766m4430J08459J16693r670J09567j23075j86992
14664G87129P9881J77370q2120L26467m15867p6837J79728Q7166k41805n6910
14654G64202K97995J3117l5237k5196J58210o5276K60180m69360N3064k80830
14644F70869L52699J80958k28553j9871K33892q1045J43106J88505p2024j91627
14634A176909r5678m15403K29459N66988j54592l74146M11336k41695n9252J91224
14624A235150j05040J33542L2877j13438k06094M7221K45127j14194j18144Q6353
14614A123360L55234k62828J5735O8742k50570K58343K3159L24813m13841o7777
$$ plain form
14604 1174370 1268712 1451217 1482081 1507940 1524963 1245628 1118124 1502510 1511865 1543210 1641345
14593 1641345 1545877 1678629 1600419 1473770 1681324 1543009 1393222 1780969 1858226 1579145
14583 1579145 1862983 1622872 1685818 1784373 1390775 1645887 1732299 1742582 1708888 1706018 1927983
14572 1927983 1634837 1768569 1889795 1715731 1814144 2066438 2026018 1880380 2141704 1792348
14562 1792348 1868434 1855710 1855920 1969825 2372394 2183835 2087767 2287647 2203188 2183138 2094999
14551 2094999 2298823 2468175 2621101 2576461 2571751 2360230 2770372 3063152 2962849 3096807
14541 3096807 3323980 3941227 4182855 4226580 4726754 5272833 6760524 8649500 11948370
14532 11948370 17559864 27086538 32319243 22333491 13921944 9028123 5982407 5047974
$$ packed form
14604A174370R4342J82505L0864K5859J7023k79335j27504L84386R355L1345R8135
14593A641345r5468J32752p8210j26649K07554j38315j49787L87747P7257k79081
14583A579145K83838k40111O2946R8555l93598K55112Q6412J0283l3694k870K21965
14572A927983k93146J33732J21226j74064R8413K52294m0420j45638K61324l49356
14562A792348P6086j2724K10J13905M02569j88559r6068J99880q4459k0050q8139
14551B094999K03824J69352J52926m4640m710k11521M10142K92780j00303J33958
14541C096807K27173O17247K41628M3725N00174N46079J487691J888976L298870
14532A1948370N611494R526674N232705r985752q411547m893821l045716r34433
$$ plain form
14524 5047974 4385619 4589947 3454703 3119189 2636315 2259112 2322475 2101664 2293081
14515 2293081 2217950 1994565 2271575 2466307 2386523 2593755 2421076 2432489 2707017 2445699
14505 2445699 2533953 2401638 2514423 2921139 2564549 2431773 2661220 2729523 2558390 2690415
14495 2690415 2807535 2822322 2778609 2772249 2985785 2898796 2822074 3364188 2788941 3188161
14485 3188161 3173956 3272640 3241490 3085416 3445844 3410329 3490550 3268934 3560505 3354851
14475 3354851 3707626 3414138 3546918 3665209 3897039 3630873 3750411 3593261 3693112 4085197
14465 4085197 3697879 3646916 3702975 3896007 4120013 4291851 3816527 3731254 3917792 4390332
14455 4390332 4166421 4121762 4411186 4431184 4456903 4362456 4448862 4677926 4605618 4693096 4849188
$$ packed form
14524E047974o62355K04328j135244l35514m82874l77203O3363k20811J91417
14515B293081p5131k23385K77010J94732p9784K07232j72679J1413K74528k61318
14505B445699Q8254j32315J12785M06716l56590j32776K29447O8303j71133J32025
14495B690415J17120J4787m3713o360K13536q6989p6722N42114n75247L99220
14485C188161j4205R8684l1150j56074L60428l5515Q0221k21616K91571k05654
14475C354851L52775k93488J32780J18291K31830k66166J19538j57150R9851L92085
14465D085197l87318n0963N6059J93032K24006J71838m75324q5273J86538M72540
14455D390332k23911m4659K89424J9998K5719r4447Q6406K29064p2308Q7478J56092
$$ plain form
14444 4849188 4734742 4891478 4865741 4994619 5239057 4990765 5111447 5105333 5152816 5383457
14434 5383457 5877613 5557107 5613490 5662528 5897625 5798417 6092123 5965098 6088512 5884066
14424 5884066 6099104 6170379 6177788 6493830 6450825 6387105 6662407 6780967 6600358 7141232
14414 7141232 7183403 7152792 7070914 7428116 7386579 7607639 7646662 7887556 7888053 8230908 8147516
14403 8147516 8673154 8112366 8826801 8524363 8718825 8796725 8616283 8941663 8957111 9483297
14393 9483297 9385794 9908761 9470801 9761152 10086499 10360899 10329129 10677071 10418127 10677611
14383 10677611 11009059 10902185 11285609 11294556 11496798 11629823 12336007 12246846 12585575 12780922
14373 12780922 13006062 13216593 12890929 13404992 13744014 14200354 14544609 14754710 14743773
$$ packed form
14444D849188j14446J56736k5737J28878K44438k48292J20682o114M7483K30641
14434E383457M94156l20506N6383M9038K35097r9208K93706j27025J23414k04446
14424E884066K15038P1275P409L16042m3005o3720K75302J18560j80609N40874
14414G141232M2171l0611q1878L57202m1537K21060L9023K40894M97L42855q3392
14403H147516N25638n60788P14435l02438J94462P7900j80442L25380J5448N26186
14393I483297r7503N22967m37960K90351L25347K74400l1770L47942k58944K59484
14383A0677611L31448j06874L83424Q947K02242J33025P06184q9161L38729J95347
14373A2780922K25140K10531l25664N14063L39022M56340L44255K10101j0937
$$ plain form
14364 14743773 15365767 15269913 15654278 15853464 16526076 16600459 17103836 17258178 17662399 17951129
14354 17951129 18435775 18841197 19312525 19503287 20108789 20728261 21112901 21230117 21821266
14345 21821266 22344822 22417501 23297642 23975188 24371858 24646289 25287080 25723665 26750961
14336 26750961 27169205 27689126 28621323 29117327 29819285 30662713 31799462 32380431 33302315
14327 33302315 34102429 35484331 36114213 37266495 37967494 39299454 40769720 41737009 42974074
14318 42974074 44201443 45814928 47191528 48689256 49944925 52036720 53292170 55288536
14310 55288536 57374601 58939417 61201629 63535369 65952238 67912597 70632167 73397438
14302 73397438 76021508 78865998 81763890 85090400 88817363 92616903 96303808 100499100
$$ packed form
14364A4743773O21994r5854L84365J99186O72612P4383N03377J54342M04221K88730
14354A7951129M84646M05422M71328J90762O05502O19472L84640J17216N91149
14345B1821266N23556P2679Q80141O77546L96670K74431O40791M36585J027296
14336B6750961M18244N19921R32197M96004P01958Q43428J136749N80969R21884
14327C3302315Q00114J381902O29882J152282P00999J331960J470266R67289J237065
14318D2974074J227369J613485J376600J497728J255669K091795J255450J996366
14310E5288536K086065J564816K262212K333740K416869J960359K719570K765271
14302G3397438K624070K844490K897892L326510L726963L799540L686905M195292
$$ plain form
14294 100499100 104994665 109415712 114367546 119941391 125435946 131630018 137334707 144317381
14286 144317381 151234867 158944322 166418419 175183416 183804390 193337364 203619848 213871321
14278 213871321 225165170 236932663 249144338 261931011 275116783 288955935 303132639
14271 303132639 317393169 331671211 346175222 360231712 374089171 387552637 400140717
14264 400140717 412186190 422621534 433150179 442086638 449969349 456750848 461952584
14257 461952584 463066801 462737129 461888636 456455527 449972109 443119875 436705091 428787573
14249 428787573 418631528 406712395 392244118 377305720 363550651 349289994 334143343
14242 334143343 319526562 305325503 291227130 277757173 264568614 252123760 239970302
$$ packed form
14294A00499100M495565M421047M951834N573845N494555O194072N704689O982674
14286A44317381O917486P709455P474097Q764997Q620974R532974J0282484J0251473
14278B13871321J1293849J1767493J2211675J2786673J3185772J3839152J4176704
14271C03132639J4260530J4278042J4504011J4056490J3857459J3463466J2588080
14264D00140717J2045473J0435344J0528645Q936459P882711O781499N201736
14257D61952584J114217l29672q48493n433109o483418o852234o414784p917518
14249D28787573j0156045j1919133j4468277j4938398j3755069j4260657j5146651
14242C34143343j4616781j4201059j4098373j3469957j3188559j2444854j2153458
$$ plain form
14235 239970302 228233441 217649171 206235494 195644986 185385793 176054103 167686297
14228 167686297 159478728 151930969 144405301 137794790 131211240 125540049 119888447 114712140
14220 114712140 109948140 104884622 100658570 96503819 92608880 88939690 85553656 82283921
14212 82283921 78690690 75894127 73031027 70003097 68006223 65417351 63224384 61071599
14204 61071599 58941602 57035584 55313931 53186674 51903575 50059404 48965601 47082116
14196 47082116 45498213 44081461 42899778 42125205 40768670 40078460 38619911 37622238
14188 37622238 36624600 35492003 34958851 33649669 33009148 32130471 31309203 30402725 29408278
14179 29408278 28986523 28394105 27282577 27000636 25913902 25557673 25010474 24733112 24062620
$$ packed form
14235B39970302j1736861j0584270j1413677j0590508j0259193r331690q367806
14228A67686297q207569p547759p525668o610511o583550n671191n651602n176307
14220A14712140m764000n063518m226052m154751l894939l669190l386034l269735
14212H2283921l593231k796563k863100l027930j996874k588872k192967k152785
14204F1071599k129997j906018j721653k127257j283099j844171j093803j883485
14196D7082116j583903j416752j181683p74573j356535o90210j458549r97673
14188C7622238r97638j132597n33152j309182o40521q78677q21268r06478r94447
14179B9408278m21755n92418j111528k81941j086734l56229n47199k77362o70492
$$ plain form
14170 24062620 23263099 22786009 22356679 21965434 21032002 21048170 20372671 20063846 19555748
14161 19555748 18996335 18736498 18035284 18212953 17560409 17088009 17295679 16741534 16258863
14152 16258863 16275023 15736764 15619622 15213169 14906014 14986176 14357327 14214200 13899439 13791274
14142 13791274 13183494 13590542 13035215 12938587 12843091 12216407 12018624 11942800 11681351 11288118
14132 11288118 11265234 11339847 11322828 10979287 10574585 10830924 10235699 10262633 10222464 10045159
14122 10045159 9754227 9705013 9199777 9578242 9165860 9141177 9245323 8933399 8623486 8613858
14112 8613858 8221945 8042129 8431854 8236297 8066585 7753321 7640449 7686328 7650892 7389535
14102 7389535 7607019 7141604 7625208 7208109 6946736 6941713 6741681 7063417 6505980 6515753
$$ packed form
14170B4062620p99521m77090m29330l91245r33432J6168o75499l08825n08098
14161A9555748n59413k59837p01214J77669o52544m72400K07670n54145m82671
14152A6258863J6160n38259j17142m06453l07155Q0162o28849j43127l14761j08165
14142A3791274o07780M07048n55327r6628r5496o26684j97783p5824k61449l93233
14132A1288118k2884P4613j7019l43541m04702K56339n95225K6934m0169j77305
14122A0045159k90932m9214n05236L78465m12382k4683J04146l11924l09913r628
14112H613858l91913j79816L89725j95557j69712l13264j12872M5879l5436k61357
14102G389535K17484m65415M83604m17099k61373n023k00032L21736n57437R773
$$ plain form
14092 6515753 6345866 6474979 6384957 6487113 6226390 6079652 6212977 6191158 6018109 5954801
14082 5954801 5740380 5493848 5525520 5664244 5555724 5482526 5654973 5459216 5526963 5303577
14072 5303577 5169590 5356811 4969236 5225707 4858738 4872322 4708792 4875923 5084801 4942914
14062 4942914 4854922 4675886 4781257 4626902 4274714 4556384 4364059 4347496 4016042 4440756
14052 4440756 4146398 4407932 4062175 3779135 4327629 3873252 3903441 4013736 4020895 4028553
14042 4028553 4128876 3565311 3774425 3959256 3635549 3491724 3692799 3678822 3373001 3731747
14032 3731747 3546747 3485834 3626044 3604113 3449167 3047472 3250761 3253041 3209688 3408405
14022 3408405 3209260 3138459 3241081 3406083 3291211 3272946 2917517 3024470 2888784 3245283
$$ packed form
14092F515753j69887J29113r0022J02156k60723j46738J33325k1819j73049o3308
14082E954801k14421k46532L1672J38724j08520p3198J72447j95757O7747k23386
14072E303577j33987J87221l87575K56471l66969J3584j63530J67131K08878j41887
14062D942914q7992j79036J05371j54355l52188K81670j92325j6563l31454M24714
14052D440756k94358K61534l45757k83040N48494m54377L0189J10295P159P658
14042D028553J00323n63565K09114J84831l23707j43825K01075j3977l05821L58746
14032C731747j85000o0913J40210k1931j54946m01695K03289K280m3353J98717
14022C408405j99145p0801J02622J65002j14872j8265l55429J06953j35686L56499
$$ plain form
14012 3245283 3360079 2671366 2863392 2591376 2713924 2828696 2577212 2601887 2746659 2750411
14002 2750411 2841718 2507265 2787225 2349432 2373930 2633901 2353693 2482082 2436665 2314376
13992 2314376 2400453 2027973 2168385 2143248 2294863 2612200 2082974 2638373 2377301 2385956
13982 2385956 2408761 2783321 2490794 2866000 2951428 3177232 3677330 3937003 5178761 7442583
13972 7442583 12516346 21581347 31618793 25695321 17509175 12269644 8658248 6638669
13964 6638669 5356519 4278493 4105219 3691324 3571144 2997517 3121032 3137191 2765742
13955 2765742 2488043 2573652 2602584 2329827 2404738 2157165 2114932 2289675 2328555 1922397
13945 1922397 2233305 2008295 2334498 2222112 1592403 2187579 1859289 2190158 1609141
$$ packed form
14012C245283J14796o88713J92026k72016J22548J14772k51484K4675J44772L752
14002B750411R1307l34453K79960m37793K4498K59971k80208J28389m5417j22289
13992B314376Q6077l72480J40412k5137J51615L17337n29226N55399k61072Q655
13982B385956K2805L74560k92527L75206Q5428K25804N00098K59673J241758K263822
13972G442583N073763R065001J0037446n923472q186146n239531l611396k019579
13964F638669j282150j078026j73274m13895j20180n73627J23515J6159l71449
13955B765742k77699Q5609K8932k72757P4911k47573m2233J74743L8880m06158
13945A922397L10908k25010L26203j12386o29709N95176l28290L30869n81017
$$ plain form
13936 1609141 2064128 2001447 2048928 2248007 1834104 1784865 1963909 1724931 1599044 1899345
13926 1899345 2175609 1836593 1611152 1780209 1575507 1901747 1619815 1623914 1924488 1948609
13916 1948609 1819322 1839803 1716668 1634179 1586818 2057260 1857707 1361606 1451002 1326017
13906 1326017 1607123 1186501 1642655 1328101 1520079 1186536 1493035 1651163 1469361
13897 1469361 1437464 1252234 1621557 1389910 1375545 1346948 1474953 1201419 1193573 1465732
13887 1465732 1099025 1340973 1118857 1668428 1274387 1421500 1268678 1111629 1297248
13878 1297248 1401956 726997 1432588 1126949 974128 1232421 1335387 1133773 1310948
13869 1310948 1398128 969584 1085537 1084277 1283045 1129469 1324719 1094637 870853 1199940
$$ packed form
13936A609141M54987o2681M7481J99079m13903m9239J79044k38978j25887L00301
13926A899345K76264l39016k25441J69057k04702L26240k81932M099L00574K4121
13916A948609j29287K0481j23135q2489m7361M70442j99553m96101Q9396j24985
13906A326017K81106m20622M56154l14554J91978l33543L06499J58128j81802
13897A469361l1897j85230L69323k31647j4365k8597J28005k73534p846K72159
13887A465732l66707K41948k22116N49571l94041J47113j52822j57049J85619
13878A297248J04708o74959P05591l05639j52821K58293J02966k01614J77175
13869A310948Q7180m28544J15953j260J98768j53576J95250k30082k23784L29087
$$ plain form
13859 1199940 1274560 1163332 1033464 1098869 794389 1276304 1135555 1276323 1028834 1130874
13849 1130874 922194 1105646 785955 1169364 707170 1105232 896369 990713 795337 922125
13839 922125 1149842 1039885 739506 726231 819516 954212 1105127 831108 1095972 1117190
13829 1117190 815462 963434 806066 1338920 871775 1239746 984189 822506 1130514
13820 1130514 699172 989118 997716 986804 864088 814993 1075351 696778 759316 843188
13810 843188 1105328 993646 779444 823504 710895 834326 843872 840578 956011 1017663 983990
13799 983990 1040959 955357 589424 1054139 794885 778166 971791 707099 804298 892310
13789 892310 786469 626710 979709 832315 890813 227694 1031435 897139 732177 624852
$$ packed form
13859A199940P4620j11228j29868O5405l04480M81915j40749J40768k47489J02040
13849A130874k08680J83452l19691L83409m62194L98062k08863R4344j95376J26788
13839I22125K27717j09957l00379j3275R3285J34696J50915k74019K64864K1218
13829A117190l01728J47972j57368N32854m67145L67971k55557j61683L08008
13820A130514m31342K89946Q598j0912j22716m9095K60358l78573O2538Q3872
13810H43188K62140j11682k14202M4060j12609J23431R546l294J15433O1652l3673
13799I83990N6969q5602l65933M64715k59254j6719J93625k64692R7199Q8012
13789H92310j05841j59759L52999j47394N8498B27694Q03741j34296j64962j07325
$$ plain form
13779 624852 660259 655603 365265 973588 772665 726641 670782 969582 780394 560585
13769 560585 624712 539339 725250 692699 755743 737962 1000023 921244 812082 821386 752620
13758 752620 627896 648176 630185 929907 978062 548646 902954 705686 832202 456348
13748 456348 794548 828170 685696 705374 554761 851100 536280 745301 627088 690334
13738 690334 699712 898032 682900 549829 561391 461907 590793 800030 368562 736450
13728 736450 356863 801437 533981 672926 434862 790758 656426 472445 764401 584907
13718 584907 374642 611600 823590 404832 700972 737250 484562 786753 402568 588383
13708 588383 812455 557530 692515 596806 594402 661733 617062 485208 605149 414140
$$ packed form
13779F24852L5407m656k90338O08323k00923m6024n5859K98800j89188k19809
13769E60585O4127q5373J85911l2551O3044j7781K62061p8779j09162R304o8766
13758G52620j24724K0280j7991K99722M8155m29416L54308j97268J26516l75854
13748D56348L38200L3622j42474J9678j50613K96339l14820K09021j18213O3246
13738F90334R378J98320k15132j33071J1562r9484J28886K09237C68562L67888
13728G36450C56863M44574k67456J38945k38064L55896j34332j83981K91956j79494
13718E84907k10265K36958K11990D04832K96140L6278k52688L02191l84185J85815
13708E88383K24072k54925J34985r5709k404O7331m4671j31854J19941j91009
$$ plain form
13698 414140 260300 629453 720042 559820 461340 589235 427383 418601 466537 587545
13688 587545 447501 420326 492677 720019 352280 356770 758587 628748 506767 475919
13678 475919 392491 439081 575685 469683 536922 538305 329208 319494 234627 555141 425798
13667 425798 565142 568041 512635 304000 96980 265618 679536 607746 366410 737671
13657 737671 142734 131301 687565 835387 426448 398984 641245 727718 345446 331447
13647 331447 576771 814368 400918 308456 275595 345780 557346 396270 95692 741714
13637 741714 636733 585940 384045 624112 593368 606247 234358 394880 270550 398020
13627 398020 280412 152255 504654 461555 474360 244224 322972 214086 284150 599792
$$ packed form
13698D14140j53840L69153R0589j60222r8480J27895j61852q782M7936J21008
13688E87545j40044k7175P2351K27342C52280M490M01817j29839j21981l0848
13678D75919q3428M6590J36604j06002O7239J383k09097r714q4867L20514j29343
13667D25798J39344K899n5406k08635I6980J68638M13918p1790k41336L71261
13657G37671A42734j1433N56264J47822m08939k7464K42261Q6473C45446j3999
13647C31447K45324K37597D00918r2462l2861P0185K11566j61076I5692O46022
13637G41714j04981n0793k01895K40067l0744J2879B34358J60522j24330J27470
13627C98020j17608j28157L52399m3099J2805k30136P8748j08886P0064L15642
$$ plain form
13617 599792 87368 345639 462863 256389 348876 132433 525202 538433 131973 619578
13607 619578 629066 208357 477928 714404 361979 34873 246065 583003 374714 233015
13597 233015 358985 94152 267321 84731 273721 425682 200727 226531 572598 692735
13587 692735 397281 304862 49830 423307 83686 656237 257826 107447 271405 491718
13577 491718 316977 406320 376017 352199 478076 202876 167745 -10409 144997 441011
13567 441011 414705 458534 246109 85009 348569 400997 606703 552906 20701 233520 251071
13556 251071 293433 286598 181362 564114 517740 -167642 311495 145380 243731 378161
13546 378161 600199 604903 518015 432483 121725 192002 264523 352270 325227 301550 30056
$$ packed form
13617E99792H7368K58271J17224k06474R2487A32433L92769J3231A31973M87605
13607F19578R488B08357K69571K36476l52425C4873K11192L36938k08289j41699
13597B33015J25970I4152J73169H4731J88990J51961B00727K5804L46067J20137
13587F92735k95454r2419D9830L73477H3686N72551B57826A07447J63958K20313
13577D91718j74741Q9343l0303k3818J25877B02876l5131a0409A44997K96014
13567D41011k6306M3829k12425H5009K63560N2428K05706n3797B0701K12819J7551
13556B51071M2362o835j05236L82752m6374a67642C11495A45380R8351J34430
13546C78161K22038M704q6888q5532A21725P0277P2521Q7747k7043k3677C0056
$$ plain form
13534 190726 388919 252085 152652 341684 -125013 221736 104822 214045 153672 634429
13524 634429 29976 -42957 218690 169861 312051 21489 436046 449635 60866 445606 421227
13513 421227 177131 283823 15997 -51329 317200 481565 459694 196940 -149648 329949
13502 152722 245960 255992 369106 559394 442639 293905 371817 468838 305026 542992
13492 542992 125976 392130 284955 202406 25511 446869 250803 8012 404463 -72566
13481 183107 206110 583081 -17281 229674 115685 162928 150889 640224 445934 78740
13470 287105 208495 363770 165020 210604 133943 66668 375406 410596 242221 147534 198
13458 290560 402575 256370 302725 269934 205512 38246 92841 85360 175412 328212 247514
$$ packed form
13534A90726J98193j36834r9433J89032a25013B21736A04822J09223o0373M80757
13524F34429B9976d2957B18690m8829J42190B1489M14557J3589F0866L84740k4379
13513D21227A77131J06692A5997e1329C17200J64365k1871A96940a49648C29949
13502A52722R3238J0032J13114J90288j16755j48734P7912R7021j63812K37966
13492E42992A25976K66154j07175q2549B5511M21358j96066H012L96451g2566
13481A83107K3003L76971a7281B29674j13989M7243j2039M89335j94290G8740
13470B87105p8610J55275A65020M5584p6661F6668L08738L5190j68375r4687A98
13458B90560J12015j46205M6355l2791o4422C8246N4595p481R0052J52800q0698
$$ plain form
13447 247514 129159 130703 306302 216121 108435 114712 273157 408324 216927 -152792
13436 67446 326176 342988 265199 243530 206911 -252062 211338 262010 -4799 262221 384111
13425 384111 391330 273218 30067 632183 168049 195830 260117 -160744 251335 -35215 -110034
13414 -110034 343932 88002 333616 187510 125395 42904 -20233 215330 393393 177551
13403 422166 328238 -99949 190935 33780 474170 276049 370951 263536 35695 148654
13393 148654 143087 551667 236797 478011 469473 151539 130925 63683 42927 327324 -62478
13381 -43913 204627 78882 6026 -6982 -174352 128211 87427 499567 214736 19285 92616
13370 92616 -68468 24379 87564 26411 -94612 387591 157059 198433 260038 240454 30608
$$ packed form
13447B47514j18355J544J75599r0181j07686O277J58445J35167j91397a52792
13436F7446K58730J6812p7789k1669l6619b52062B11338N0672d799B62221J21890
13425C84111P219j18112C0067O02116A68049K7781O4287a60744B51335c5215p4819
13414a10034C43932H8002K45614j46106o2115D2904b0233B15330J78063A77551
13403D22166r3928i9949A90935C3780M40390j98121R4902j07415C5695J12959
13393A48654n567M08580B36797K41214q538A51539k0614F3683k0756K84397f2478
13381d3913B04627G8882F026f982j67370A28211m0784M12140B14736A9285P3331
13370I2616f8468B4379O3185B6411i4612C87591A57059M1374O1605j9584C0608
$$ plain form
13358 386270 449036 138395 408386 150218 355237 191906 234601 74629 95976 379168
13348 379168 132477 188858 218589 198100 19585 271538 275346 86786 -7154 108304 260951
13337 260951 382323 -19660 99141 -2242 -21640 245682 301339 210598 351246 52121 343093
13326 343093 135348 207528 -46541 162213 365684 405886 444495 285366 276661 394810 357946
13315 357946 72461 -14638 161258 353870 -30501 225533 -28645 243881 -16191 119297
13304 450941 269366 154992 276930 312566 237356 8522 105976 148780 85777 121539 -113899
13292 176249 227720 71350 7580 240367 164430 -248921 254355 9570 395278 257105 91985
13280 -159358 142331 137713 41543 82064 380744 343240 -79771 237833 270920 36337 159220
$$ packed form
13358C86270O2766A38395K69991A50218K05019j63331M2695G4629K1347K83192
13348C79168A32477N6381K9731k0489A9585K51953L808H6786g154A08304J52647
13337B60951J21372a9660I9141b242j9398B45682N5657r0741J40648E2121K90972
13326C43093A35348P2180d6541A62213K03471M0202L8609j59129q705J18149l6864
13315C57946G2461a4638A61258J92612c0501B25533b8645B43881a6191A19297
13304D50941j81575j14374J21938L5636p5210H522R7454M2804o3003L5762a13899
13292A76249N1471G1350G580K32787p5937b48921B54355I570L85708j38173I1985
13280a59358A42331m618D1543M0521K98680l7504g9771B37833L3087C6337J22883
$$ plain form
13269 159220 139708 267251 -7206 32888 118887 38644 109815 -193389 112264 290386 106410
13257 -8151 211904 63703 16811 71786 -41673 82394 -76169 134747 151114 77586 76791 38517
13245 38517 109450 91176 347997 75802 -133665 350036 387001 70834 31394 -187397 -48866
13233 -23466 -323729 269146 424561 -279864 346269 73388 132969 -178484 -38173 -193409
13223 -193409 -50352 104366 173410 66963 130084 15638 -112875 58298 100071 665326 -460502
13211 443970 88409 33888 166891 87130 -127564 42806 150094 248598 -119120 391593
13200 -147598 108027 223055 311491 -43761 -84713 -18077 27225 19792 111367 -50001 7961
13188 -207511 164180 11688 -22837 44511 94545 -78891 183811 84936 -99657 136750 158224
$$ packed form
13269A59220j9512J27543g206C2888Q5999C8644P1171a93389A12264J78122A06410
13257h151B11904F3703A6811N4975d1673H2394g6169A34747J6367p3528p95l8274
13245C8517P0933j8274K56821G5802a33665C50036L6965G0834C1394a87397d8866
13233b3466l00263B69146J55415b79864C46269G3388N9581a78484c8173j55236
13223a93409e0352A04366O9044F6963O3121A5638a12875E8298M1773N65255d60502
13211D43970H8409C3888J33003p9761a27564D2806J07288R8504a19120C91593
13200a47598A08027J15028Q8436d3761m0952a8077B7225p433R1575e0001G961
13188b07511A64180A1688b2837D4511N0034g8891A83811H4936i9657A36750K1474
$$ plain form
13177 158224 267386 131936 213756 135318 150351 -115284 302783 11521 -64708 99875 313151
13166 313151 -133701 205524 383751 -93421 274504 -97699 14919 74856 -2365 576 5943
13155 5943 -68188 112657 12105 48016 243729 -75890 175791 198668 305983 -83415 -192365
13144 -192365 204436 -241029 -107325 -109413 228387 162083 115551 4885 144609 124693 -5578
13132 152837 69832 96736 315679 -237340 88318 -121963 34254 -89424 35403 -29103 273338
13120 58701 -154755 262714 301595 125046 -96965 103821 142446 -211903 576727 283749
13109 -17605 -3007 -86676 207080 13139 -154902 -152108 -79707 488435 -189160 -205108 -24319
13097 146335 37613 181919 212380 112918 34975 176363 308082 -125603 -66719 69519 27595
$$ packed form
13177A58224J09162A31936Q1820p8438J5033a15284C02783A1521f4708I9875K13276
13166C13151a33701B05524J78227i3421B74504i7699A4919N9937b365E76N367
13155E943f8188A12657A2105L5911J95713g5890A75791K2877J07315h3415j08950
13144a92365B04436b41029a07325k088B28387o6304m6532D885J39724j9916e578
13132A52837F9832K6904K18943b37340H8318a21963C4254h9424C5403b9103B73338
13120E8701a54755B62714L8881A25046i6965A03821L8625b11903E76727B83749
13109a7605c007q3669B07080A3139a54902K794P2401D88435a89160j5948b4319
13097A46335C7613J44306L0461r9462C4975J41388J31719a25603N8884F9519B7595
$$ plain form
13085 6563 138865 303881 -200135 -81641 -150943 -99538 50854 447800 265912 13991 83521
13074 83521 -87849 46683 332193 263183 -3741 -144285 56163 -278135 -198659 -54333 -22489
13062 32284 -57361 83321 -28308 -59336 -108947 156996 377923 236734 164646 34782 16057
13050 83956 144015 253568 101311 70937 215912 -8325 34203 93201 -2531 129224 -66371
13038 189673 176121 -80774 52073 -105935 -49731 -113919 255838 -14301 299146 120233 144293
13027 144293 101015 42011 -190499 186837 302069 523858 117600 -27947 -127546 73280
13016 -60366 -271986 -134987 88419 248291 325654 151457 75054 370020 447887 296531
13006 296531 302207 126497 63695 1499 238086 94597 -119717 58596 -69896 57901 149751
$$ packed form
13085F563J32302J65016b00135h1641o9302N1405E0854L96946j81888A3991O9530
13074H3521h7849D6683K85510o9010c741j40544E6163b78135P9476e4333b2489
13062C2284e7361H3321b8308l1028m9611A56996K20927j41189p2088C4782A6057
13050H3956O0059J09553A01311l0374J44975h325C4203N8998b531A29224f6371
13038A89673j3552h0774E2073a05935d9731o4188B55838a4301B99146A20233K4060
13027A44293m3278D2011a90499A86837J15232K21789A17600b7947r9599G3280
13016f0366k11620a34987H8419J59872P7363A51457G5054K94966P7867j51356
13006B96531N676A26497o2802A499K36587I4597a19717E8596f9896E7901R1850
$$ plain form
12995 149751 93501 106238 63760 -141743 -28501 -110392 -135195 -139211 -262454 102819 -97753
12983 -111981 266138 40720 215322 -118985 67904 393368 -119323 -32606 -13203 54131
12972 -355093 -156722 286019 20366 -24959 -99922 -221143 -101198 17034 -15141 207577
12961 237210 78353 -260808 -6980 -5784 196940 19896 93709 373722 -19796 27453 319700
12950 319700 317058 -220343 -88343 70220 239771 -175534 -180524 223267 -115047 -182293 286789
12938 -167985 -157506 -147489 -28513 -37337 -65667 -6068 55084 -157927 -138758 274991 -235231
12926 -68170 -344380 -264450 173401 311523 -8196 -52025 116001 -199999 -10994 -59692 16707
12914 -38765 -325415 -2717 -53950 168660 -173861 57097 -43870 22618 -23326 -108830 264335
$$ packed form
12995A49751n6250J2737m2478a41743b8501q1891k4803m016j23243A02819i7753
12983a11981B66138D0720J74602a18985F7904L25464a19323c2606a3203E4131
12972c55093a56722B86019B0366b4959p4963j21221a01198A7034a5141B07577
12961B37210G8353b60808f980J196A96940A9896P3813K80013a9796B7453K92247
12950C19700k642b20343h8343G0220J69551a75534m990B23267a15047o7246B86789
12938a67985J0479J0017b8513q824k8330f068E5084a57927J9169B74991b35231
12926f8170k76210P9930A73401J38122h196m3829A16001a99999a0994m8698A6707
12914c8765k86650b717n1233A68660a73861E7097d3870B2618b3326q5504B64335
$$ plain form
12902 -228970 -74463 42567 1621 -103934 -128419 48163 -183393 -206545 99271 284966 -137930
12890 91051 -407442 -12365 85950 -260514 -125835 -28557 164396 121984 39018 121435 -254283
12878 -57849 -63296 48758 -93205 -335300 152957 -28566 24952 -145956 178771 -91238 101608
12866 155817 135645 162058 153540 -75351 -194736 -81652 281874 69399 -122880 -17375 -72153
12855 -72153 -269502 -162472 112281 16891 82954 -6122 -52314 -64410 183843 -168765 -268590
12844 -268590 -11197 -80445 -76894 -7387 -3910 139524 -72201 148821 -139262 236425 176637
12833 176637 148353 -343149 385480 49885 -215053 59300 21805 83904 64981 123194 133026
12822 133026 207474 27514 -9868 30003 -15044 -100683 -65724 42278 -134280 149792 -67499
$$ packed form
12902b28970g4463D2567A621a03934k4485D8163a83393k3152I9271J85695a37930
12890I1051d07442a2365H5950b60514a25835b8557A64396m2412C9018Q2417b54283
12878e7849n447D8758i3205k42095A52957b8566B4952a45956A78771i1238A01608
12866A55817k0172K6413q518g5351j19385h1652B81874F9399a22880a7375n4778
12855g2153j97349J07030A12281A6891O6063f122m6192j2096A83843a68765r9825
12844b68590a1197o9248L551g387L477A39524g2201A48821a39262B36425n9788
12833A76637k8284c43149C85480D9885b15053E9300B1805O2099j8923N8213R832
12822A33026P4448B7514i868C0003a5044q5639L4959D2278a34280A49792f7499
$$ plain form
12810 -225980 78287 -283333 157461 142171 1777 -94769 96311 71725 184934 94498 -68031
12798 -69698 -9880 180074 172632 83472 192760 182249 -66969 241950 -26530 -87343 151657
12786 151186 -227767 73040 72176 -193659 -97226 149863 148309 17900 -207067 -259312 -70567
12774 116179 260377 348123 -131449 51202 407094 -94576 -287222 178327 -30683 100564
12763 -54497 -78273 109551 -272079 -103027 -274463 -210173 92024 -148486 286107 144935
12753 144935 252982 188974 136201 -224862 -316615 59736 25941 109288 96394 -50680 -8283
12741 85294 -58831 3503 -51664 108070 285076 -144211 65959 -46204 277498 -182393 36680
12729 67965 -191223 254295 138332 370007 -113143 81102 65248 56493 -51093 59491 66475
$$ packed form
12810b25980G8287b83333A57461j5290A777i4769I6311k4586J13209r0436f8031
12798f9698i880A80074p442H3472J09288j0511f6969B41950b6530o0813A51657
12786A51186b27767G3040q64a93659R6433A49863j554A7900b07067n2245g0567
12774A16179J44198Q7746a31449E1202L55892i4576j92646A78327c0683A00564
12763e4497k3776A09551b72079a03027j71436O4290I2024a48486B86107j41172
12753A44935J08047o4008n2773b24862r1753E9736B5941Q3347j2894e0680h283
12741H5294e8831C503e1664A08070J77006a44211F5959d6204B77498a82393C6680
12729F7965a91223B54295j15963K31675a13143H1102j5854q755e1093E9491O984
$$ plain form
12718 66475 265650 -97646 -29606 -46288 172742 -264701 284353 326692 -85460 83223 -30736
12706 -46804 -244874 -134626 155690 26295 -18443 137188 -57296 13332 -139383 -21309 11383
12694 185117 5833 -2978 286137 -117176 -76547 -98338 377381 -18758 184712 24246 375569
12683 375569 -52897 -74795 34288 7903 574238 206790 205254 -1779 -108725 -87069 48540
12671 -104364 153114 127722 -5743 42335 57141 -258458 208724 -49697 167978 -88142 119679
12659 -125713 -14548 164852 -268214 -185646 124456 -27998 49174 614245 91561 -14632 -98321
12648 -98321 -271428 105879 -113087 -194862 4881 -106362 61638 -69365 199214 -155692 182994
12636 -21812 -64371 177993 52264 -8053 57712 258855 -76270 -40524 182677 196579 106990
$$ packed form
12718F6475J99175i7646b9606j6682A72742b64701B84353M2339h5460H3223c0736
12706d6804j98070J10248A55690B6295a8443A37188e7296A3332a39383b1309A1383
12694A85117E833b978B86137a17176M0629k1791C77381a8758A84712B4246L51323
12683C75569e2897k1898C4288G903N66335B06790j536a779j06946K1656D8540
12671a04364A53114k5392e743D2335J4806b58458B08724d9697A67978h8142A19679
12659a25713a4548A64852b68214Q2568A24456b7998D9174N65071I1561a4632q3689
12648i8321j73107A05879a13087q1775D881a06362F1638f9365A99214a55692A82994
12636b1812m2559A77993E2264h053E7712K01143g6270L5746A82677J3902q9589
$$ plain form
12625 106990 -145116 -61197 -281243 214617 43779 102683 -258520 97724 -125964 255593
12614 343928 532839 62015 240010 241108 270313 259600 47872 119785 -109971 -15017 -115055
12603 -115055 116570 -113794 53857 -153422 146984 82304 -181363 -9285 83733 -117884
12592 -38459 341786 -109344 153172 356094 249164 132107 327658 35183 153222 26025
12581 210404 119334 -35963 -82734 75124 157137 -77171 -11472 -68557 -93071 267250 25885
12569 481705 -39248 18126 -49341 -60369 197998 4063 -361547 254932 -120770 -160672 -46379
12557 155 75113 -184595 70716 -253677 348125 -33720 193792 -251040 133246 -114082 264388
12545 -203560 15987 -151861 -230830 10131 -7995 105723 -214214 287010 26489 245166 75081
$$ packed form
12625A06990a45116f1197k20046B14617D3779N8904b58520I7724a25964B55593
12614C43928J88911F2015J77995J098K9205j0713D7872P1913a09971a5017j00038
12603a15055A16570a13794E3857a53422A46984o4680a81363i285H3733a17884
12592c8459C41786a09344A53172K02922j06930j17057J95551C5183J18039B6025
12581B10404r1070c5963m6771G5124Q2013g7171a1472n7085k4514B67250B5885
12569D81705c9248A8126d9341j1028A97998D063c61547B54932a20770l9902d6379
12557A55P4958a84595G0716b53677C48125c3720A93792b51040A33246a14082B64388
12545b03560A5987a51861p8969A0131g995A05723b14214B87010B6489K18677G5081
$$ plain form
12533 40024 -62203 86490 63674 -84285 -257609 -214537 -152029 23306 -53118 45975 -1870 -197857
12521 -197857 -42676 17607 -47591 162332 -107152 1360 -432668 -145639 35278 120079 93243
12510 93243 167970 63045 89661 -256543 11143 -134443 321813 -10607 354370 -82264 213718
12498 -55603 96142 -16545 13737 143637 57114 -24553 383954 -148796 -21620 -310168 -225865
12487 -225865 139127 -324158 -143130 161071 -144598 131747 240853 -162371 -118833 -80580
12477 -80580 5218 -136841 -63668 -261464 -41188 -52592 53444 -36414 159998 -303601 -307986
12466 -307986 -222373 85588 42944 39506 -82358 61187 42832 -346050 -94281 -171016 -48875
12454 132092 -44543 -319182 -118314 -131262 105359 -36629 -383416 -3130 22069 294502 -109104
$$ packed form
12533D0024f2203H6490k2816h4285j73324M3072O2508B3306e3118D5975a870j95987
12521a97857d2676A7607d7591A62332a07152A360d32668a45639C5278Q4801k6836
12510I3243P4727F3045K6616b56543A1143a34443C21813a0607C54370h2264B13718
12498e5603I6142a6545A3737J29900E7114b4553C83954a48796b1620k88548Q4303
12487b25865A39127c24158a43130A61071a44598A31747J09106a62371M3538L8253
12477h0580E218a36841f3668j97796d1188j1404E3444c6414A59998c03601m385
12466c07986Q5613H5588m2644l438h2358F1187j8355c46050i4281p6735d8875
12454A32092d4543k74639a18314j2948A05359c6629l46787c130B2069K72433a09104
$$ plain form
12442 178582 -27957 -206478 -57904 -267231 73616 274409 -171783 138763 129302 85608 88637
12431 88637 81872 -139532 -191109 382898 -30635 -26997 -160544 43161 168349 67549 -13796
12419 -52625 148970 -166678 161929 455817 174650 -158570 -110679 191183 -233536 143945
12408 -145869 -108883 -115631 55327 149070 53376 -22663 -58511 89025 -5208 -163459 -174147 -92377
12396 -92377 66345 91688 142039 -35469 47120 141453 168946 -73721 200642 107877 87628
12385 87628 225135 107642 35779 -54685 -346197 52359 -28360 -40740 -177347 -206626 31613
12373 272988 160203 -237578 -11439 -190977 -267035 15595 308172 117027 180325 -238410
12362 207957 208973 140207 340441 -45103 178366 5420 -43323 201315 -48560 -72823 149411
$$ packed form
12442A78582b7957j78521e7904k09327G3616K00793a71783A38763r461m3694L029
12431H8637o765a39532n1577C82898c0635L638j33547D3161J25188F7549a3796
12419e2625A48970a66678A61929K93888A74650a58570M7891A91183b33536A43945
12408a45869L6986o748E5327R3743E3376b2663l5848H9025e208j58251j0688Q1770
12396i2377F6345K5343N0351c5469D7120R4333K7493g3721B00642r2765k0249
12385H7628J37507A07642C5779e4685k91512E2359b8360j2380j36607k9279C1613
12373B72988j12785b37578a1439j79538p6058A5595K92577A17027O3298b38410
12362B07957J016o8766K00234d5103A78366E420d3323B01315d8560k4263A49411
$$ plain form
12350 46380 -197148 223262 -26102 244696 248364 28684 51489 -41120 181513 94109 170219
12339 170219 -24260 -199581 43662 251151 -152841 -13800 35830 -206040 66011 142216 104518
12328 104518 98944 67708 -146984 44272 136007 -84494 -168754 54275 -158346 183495 -50387
12316 212729 251350 159853 213564 -150093 175155 -111529 557836 180836 -37567 39215
12305 -140109 -228356 51979 -37782 383627 56633 470940 96042 -68693 32951 223582 187963
12294 187963 257119 -5921 75889 136061 -54815 106920 305183 598563 -99013 -11586 -60763
12283 -60763 -159473 376397 333101 -233703 -187890 -63501 123095 262201 194064 230633 -134948
12271 164430 149419 -73968 378288 215941 376762 13510 16674 286609 -49701 163729 -243768
$$ packed form
12350D6380a97148B23262b6102B44696L668B8684K2805d1120A81513q7404P6110
12339A70219b4260j75321D3662K07489a52841a3800C5830b06040F6011P6205l7698
12328A04518n574l1236a46984D4272R1735h4494q4260E4275a58346A83495e0387
12316B12729L8621r1497N3711a50093A75155a11529E57836A80836c7567C9215
12305a40109q8247E1979c7782C83627E6633M14307I6042f8693C2951J90631l5619
12294A87963O9156e921G5889O0172e4815A06920J98263K93380i9013a1586m9177
12283f0763r8710C76397m3296b33703M5813f3501A23095J39106o8137L6569a34948
12271A64430j5011g3968C78288j62347J60821A3510L164K69935d9701A63729b43768
$$ plain form
12259 78868 180083 52650 -22548 128716 170536 367644 14119 345476 259434 -37349 35587
12247 291698 152174 402545 120170 298696 -1356 -36824 31764 77419 3315 588645 -16086
12235 66144 118332 113731 150337 177594 333741 40575 67321 118972 162530 219232 162847 141366
12223 141366 43207 356030 -287273 -17924 6657 88293 211337 161874 -140247 -78605 -151413
12212 -151413 403277 78891 130615 90993 136804 386675 143662 141924 4814 120413 -12438
12200 258756 77534 -152615 148712 -95013 35406 -57372 57630 4991 166021 336940 166537
12188 299167 77569 52593 165521 -46796 287872 17128 290825 372042 164533 35382 157873
12177 157873 -72698 264833 -48299 150216 232837 109844 97688 28895 -306076 203513
$$ packed form
12259G8868J01215E2650b2548A28716M1820J97108A4119L31357q6042c7349C5587
12247B91698j39524K50371A20170J78526a356l5468C1764M5655C315N85330a6086
12235F6144N2188m601L6606K7257J56147D0575K6746N1651M3558N6702n6385k1481
12223A41366D3207L12823b87273a7924F657Q1636J23044m9463a40247O1642p2808
12212a51413D03277G8891N1724l9622M5811K49871A43662j738D814J15599a2438
12200B58756G7534a52615A48712i5013C5406e7372E7630D991J61030J70919A66537
12188B99167G7569k4976J12928d6796B87872A7128K73697Q1217A64533C5382J22491
12177A57873g2698B64833d8299A50216Q2621A09844j2156B8895c06076B03513
$$ plain form
12166 211280 292599 285979 183648 145336 281350 81546 258736 123703 180113 138977 41907
12154 230496 221262 341673 297768 77907 -16435 -60897 509469 360505 123886 243964 591740
12143 591740 129395 -213516 48530 262590 134932 -125401 132196 121869 135431 157275
12133 157275 171260 8035 -163354 250942 -46885 66172 -186013 -38245 125204 -41639 169463
12121 254943 153973 -30101 311606 -3398 -118609 -155516 -192997 73479 33977 385766 78698
12109 108036 -103844 238847 229810 45238 17226 436826 -50191 374013 133837 77189 580603
12098 580603 134955 148613 288715 143178 -207525 -1990 119196 238339 -165834 59905
12087 64092 188119 49685 -27344 158889 -101277 172606 57079 230020 12843 -62598 -91765
$$ packed form
12166B11280Q1319o620j02331l8312J36014H1546J77190A23703N6410m1136D1907
12154B30496r234J20411m3905G7907a6435m4462E09469j48964A23886J20078L47776
12143E91740A29395b13516D8530K14060j27658a25401A32196j0327J3562K1844
12133A57275J3985H035a63354B50942d6885F6172a86013c8245A25204d1639A69463
12121B54943j00970c0101C11606c398j15211l6907l7481G3479C3977L51789G8698
12109A08036a03844B38847r037D5238A7226M19600e0191C74013A33837n6648N03414
12098E80603A34955J3658J40102A43178b07525a990A19196J19143a65834E9905
12087F4092J24027D9685b7344A58889a01277A72606E7079J72941A2843f2598k9167
$$ plain form
12076 -91765 -92573 77803 156771 59744 183281 300094 239780 21827 51286 -166899 189773
12064 216853 35325 22721 193333 362658 168277 244671 25354 -186441 -135280 310093
12053 278563 190616 20590 -94653 -47090 -221349 70858 280243 233738 70209 454534 72701
12041 -130275 244271 54289 122118 214127 36806 -110432 -61859 -91719 -134427 20723 228796
12030 228796 -161720 39172 232301 -32089 115347 -57094 32810 -265411 -135558 -238643
12020 -238643 18169 86728 -69206 178895 -235625 -139323 -49819 80911 18019 -163759 426815
12008 -52890 24123 143959 -22928 197939 -140809 -115153 -160706 162747 124283 111386 -80990
11996 104296 -211691 94360 -99061 112616 232101 350756 12524 59927 111364 -78693 -235336
$$ packed form
12076i1765q08G7803P8968E9744J23537J16813o0314B1827K9459a66899A89773
12064B16853C5325j2604J70612J69325A68277P6394B5354a86441N1161C10093
12053B78563q7947B0590i4653d7090j74259G0858K09385m6505G0209L84325G2701
12041a30275B44271E4289O7829R2009C6806a10432M8573k9860m2708B0723K08073
12030B28796a61720C9172J93129c2089A15347e7094C2810b65411J29853j03085
12020b38643A8169O8559f9206A78895b35625R6302d9819H0911A8019a63759D26815
12008e2890B4123J19836b2928A97939a40809K5656m5553A62747l8464j2897h0990
11996A04296b11691I4360i9061A12616J19485J18655A2524M7403N1437g8693j56643
$$ plain form
11985 -235336 143617 -55614 -65263 -87763 -296195 28277 -83628 -15281 -23853 51261 -25594
11973 113287 -204799 27316 152901 -33127 -100514 -89179 15416 50213 -49874 -60180 115482
11961 -59872 156509 148826 58559 -113435 236624 112460 260528 188279 -186846 -381480
11951 -381480 -224132 -223597 15817 -92687 161476 15986 -17957 -75139 -140092 -190280 162652
11939 -77518 189347 -7379 108745 -375180 8709 -220323 63481 -113356 19487 -83669 -120503
11928 -120503 -358258 -268763 -144973 136987 17305 -250324 10279 125959 243172 -345171
11917 -31216 -67523 -153620 79850 178874 73953 -41130 -137732 136183 288540 -195767 -69611
11905 95512 360051 254731 -153822 205424 1944 -28726 134278 -186671 -189961 223477 170781
$$ packed form
11985b35336A43617e5614r649k2500k08432B8277h3628a5281q572E1261b5594
11973A13287b04799B7316J25585c3127o7387J1335A5416L4797d9874j0306A15482
11961e9872A56509p683E8559a13435B36624A12460J48068p2249a86846j94634
11951c81480J57348N35A5817i2687A61476A5986a7957n7182o4953n0188A62652
11939g7518A89347g379A08745c75180H709b20323F3481a13356A9487h3669l6834
11928a20503k37755Q9495J23790A36987A7305b50324A0279J15680J17213c45171
11917c1216l6307q6097G9850R9024G3953d1130r6602A36183J52357a95767f9611
11905I5512K64539j05320a53822B05424A944b8726A34278a86671l290B23477n2696
$$ plain form
11894 170781 1694 -70889 -231363 -321324 -49932 -148725 -27080 -258055 -33439 117541 247013
11883 247013 -220611 257370 292648 30695 -114521 -125606 190269 123985 119052 -209836 115796
11871 201472 -231661 -74902 -201553 46293 72189 151200 162131 112053 -144457 119226 -54275
11859 67739 -298399 157789 -128752 -422392 -109069 77144 224159 320129 86403 228485
11849 228485 -346984 28693 155404 -432519 -102205 -37347 -236091 106231 -132338 -254810
11839 -254810 95931 -150369 -109753 -230520 -277498 -12972 68163 193790 -190333 135336
11828 127914 -126582 -162880 50935 -122531 89069 -18049 -130104 85287 -23861 193960 -6334
11816 134670 50018 91303 -391457 171321 -35241 -71211 -86027 180859 131648 -161257 39788
$$ packed form
11894A70781A694g0889j60474q9961d9932r8793b7080k30975c3439A17541J29472
11883B47013b20611B57370L5278C0695a14521j1085A90269o6284m933b09836A15796
11871B01472b31661g4902j26651D6293K5896P9011J0931n0078a44457A19226e4275
11859F7739b98399A57789a28752k93640a09069G7144J47015R5970H6403J42082
11849B28485c46984B8693J26711d32519a02205c7347j98744A06231a32338j22472
11839b54810I5931a50369M0616j20767m6978a2972F8163J25627a90333A35336
11828A27914a26582l6298E0935a22531H9069a8049j12055H5287b3861A93960f334
11816A34670E0018M1285c91457A71321c5241l5970j4816A80859m9211a61257C9788
$$ plain form
11804 -368819 290275 97077 -225492 277650 -128139 -37230 -212247 -33616 -86356 299874
11793 110393 131236 -15160 -140940 -390956 -334997 -175366 -161299 282024 -70212 167796
11782 -118734 -152115 -193917 -554 152634 114825 -116886 -53935 -173222 -12590 215673 -59235
11770 -37457 160246 115098 -142586 -159057 174667 115740 -62108 -97662 149125 -170146 -70170
11758 262208 -197298 206204 -134710 -277547 46433 -37868 -209326 -33763 -50572 62540
11747 -212485 362968 -177028 -194390 -104391 134820 -116876 185768 -241568 -118143 -91426
11737 -91426 5669 10136 -196485 -87620 -40628 30236 -127787 4145 -136812 -192066 12523 -73392
11724 175059 24158 -97300 57227 -54512 -54497 -186305 628 27027 -299430 -45469 -40524 -81519
$$ packed form
11804c68819B90275I7077b25492B77650a28139c7230j75017c3616n2740B99874
11793A10393K0843a5160j25780k50016N5959J59631J4067B82024g0212A67796
11782a18734l3381m1802e54A52634l7809a16886e3935j19287a2590B15673e9235
11770c7457A60246m5148a42586j6471A74667n8927f2108l5554A49125a70146g0170
11758B62208a97298B06204a34710j42837D6433c7868j71458c3763j6809F2540
11747b12485C62968a77028j7362Q9999A34820a16876A85768b41568a18143K6717
11737i1426E669M467a96485h7620d0628C0236a27787D145a36812n5254A2523g3392
11724A75059B4158i7300E7227e4512J5j31808F28K6399b99430d5469M945m0995
$$ plain form
11712 -81519 205202 -60652 86513 222610 -269644 71118 65568 -386338 21948 -84706 89810
11700 65375 -235106 288035 342924 -70179 150530 50152 4438 -315100 146840 223598 -58446
11688 182199 42273 -43092 211653 199036 -26432 136729 -2697 -33945 -53562 -108547 -9668
11676 255626 268151 -202752 -84754 -124949 261632 204072 217828 -40349 -32309 460263 66488
11664 130988 248542 201945 170805 75066 1818 134697 70762 249163 -126798 372761 124017
11652 314800 379816 84664 107839 -43982 -109486 61709 -148134 156676 -95880 43302 36367
11641 36367 -299452 88923 -271483 203623 238549 86158 91068 131777 -69273 -79209 -61652
11630 -61652 145638 337553 -55367 -353811 -140469 93089 -36271 366053 -5481 32937 283597
$$ packed form
11712h1519B05202f0652H6513J36097b69644G1118n550c86338B1948h4706H9810
11700F5375b35106B88035N4889g0179A50530E0152D438c15100A46840P6758e8446
11688A82199D2273d3092B11653j2617b6432A36729b697l1248j9617n4985i668
11676B55626J2525b02752h4754m0195B61632n7560J3756d0349Q040D60263F6488
11664A30988J17554m6597l1140G5066A818J32879o3935J78401a26798C72761A24017
11652C14800O5016H4664K3175d3982o5504F1709a48134A56676i5880D3302o935
11641C6367b99452H8923b71483B03623L4926H6158M910M0709f9273r936J7557
11630f1652A45638J91915e5367k98444a40469I3089c6271C66053e481C2937K50660
$$ plain form
11619 283597 -115003 156969 -240652 -67647 -252327 -249306 -50805 -6338 39899 -107254 261920
11607 -10015 13887 119011 62170 -180628 37455 120453 -167223 -124427 -101454 332709 -193432
11595 33047 -53433 49348 115123 122964 246850 -41639 276489 -179650 24982 55890 -109212
11583 168912 -202112 531 225600 88076 323900 59618 -216185 119431 28067 165571 174512
11572 174512 -383466 -42545 129202 -54116 10689 58316 45438 -23174 142107 -251426 -80970
11560 105276 80386 -179947 20563 34448 -237985 -262925 363417 -47585 -25540 -142105 -2374
11548 84032 -9966 175780 200657 -114729 250004 339580 156133 180205 -19842 71299 -7131
11536 157415 -404975 -64717 112101 80014 287963 -229763 150212 -34939 91452 -349899
$$ packed form
11619B83597a15003A56969b40652f7647j84680L021e0805f338C9899a07254B61920
11607a0015A3887J05124n6841a80628C7455Q2998a67223M2796K2973C32709a93432
11595C3047e3433D9348O5775P841J23886d1639B76489a79650B4982L0908a09212
11583A68912b02112E31K25069H8076K35824E9618b16185A19431B8067J37504Q941
11572A74512c83466d2545A29202e4116A0689M7627j2878b3174A42107b51426h0970
11560A05276k4890a79947B0563J3885b37985k4940C63417d7585K2045j16565b374
11548H4032i966A75780K4877a14729B50004Q9576A56133K4072a9842G1299g131
11536A57415d04975f4717A12101l2087K07949b29763A50212c4939I1452c49899
$$ plain form
11525 -28059 199172 277920 226101 231467 -179941 70664 -181932 250120 70883 148187 111065
11514 111065 58672 -237965 426000 81125 266264 13780 -39419 -199603 -8414 312160 108994
11502 -3635 282918 26182 -7149 66286 203358 162137 -3541 -48349 -139626 29299 247476 207567
11490 207567 138740 305593 46825 90763 18451 168166 31623 123863 347035 48977 -87274
11478 -91203 -139035 194337 -91103 10193 -207884 2852 -174048 100856 -113334 195693 -196642
11466 350811 -14677 -166557 296355 -54146 240361 -69050 216606 -41399 280615 -74432
11455 -150426 226870 451031 229653 295077 -122956 68174 322315 396193 50949 53080 321088
11444 321088 152894 212152 32219 304168 319457 215525 -19886 66162 -9802 113731 48772
$$ packed form
11525b8059A99172P8748n1819N366a79941G0664a81932B50120G0883P7304l7122
11514A11065n2393b37965D26000H1125J85139A3780c9419j60184h414C12160A08994
11502c635B82918B6182g149F6286J37072m1221c541m4808r1277B9299K18177l9909
11490B07567o8827J66853D6825M3938A8451J49715C1623R2240K23172D8977h7274
11478i1203m7832A94337i1103A0193b07884B852a74048A00856a13334A95693a96642
11466C50811a4677j51880B96355e4146B40361f9050B16606d1399B80615g4432
11455a50426B26870K24161k21378O5424a22956F8174K54141P3878E0949K131K68008
11444C21088A52894N9258C2219K71949J5289j03932a9886F6162i802A13731D8772
$$ plain form
11432 412548 -130265 262689 109347 -40811 159938 -182727 180265 225484 94077 -22162
11421 179346 94524 -113221 75253 -44709 68047 76643 -47546 139674 -151655 -196401 -20646
11409 -256069 -55305 177666 -289276 -361819 -165112 -84708 -12380 133092 232666 62499 122833
11398 122833 -304057 -332311 -95199 -167731 -488568 316131 234729 105188 259905 217145
11388 217145 -23495 -43698 123742 221237 115123 138429 268269 -121988 -32125 -249840
11378 -249840 -104601 89230 -144273 148766 -10988 -161831 211350 357886 -182925 108247
11367 175156 213674 -165866 -17975 36062 165 331239 -115381 182496 39475 -313188 -125580
11355 -289912 -30319 45646 92610 282461 77538 -223576 -77164 -89323 -20153 -49250 -133190
$$ packed form
11432D12548a30265B62689A09347d0811A59938a82727A80265M5219I4077b2162
11421A79346q4822a13221G5253d4709F8047Q596d7546A39674a51655m4746b0646
11409b56069e5305A77666b89276p2543a65112Q0404a2380A33092R9574F2499O0334
11398A22833c04057k8254i5199p2532l20837C16131q1402A05188J54717m2760
11388B17145b3495k0203A23742R7495j06114K3306J29840a21988c2125k17715
11378b49840a04601H9230a44273A48766a0988j50843B11350J46536a82925A08247
11367A75156L8518a65866a7975C6062A65L31074a15381A82496C9475c13188a25580
11355b89912c0319D5646M6964J89851G7538b23576g7164j2159b0153k9097q3940
$$ plain form
11344 -133190 -89087 -17967 -123978 -357216 50106 63274 -129096 9945 -207647 -272309 67398
11332 -9254 -187770 300155 -71497 -6208 41938 93679 -142835 210086 111494 30894 -765 -11735
11320 -11735 -91360 170316 -128177 72355 124775 -160023 80343 98433 30402 -386158 -39114
11308 -104584 192810 154748 -57672 82499 -143364 5816 -116656 -28327 31939 71649 179151
11297 179151 -25330 -248728 -211589 -203456 16477 191832 187255 87754 -52550 -184846 97346
11285 1454 -356795 -222330 -138893 -83656 -38854 -35850 187416 -268465 -211531 -215967 70097
11273 -91206 -73381 -554675 164549 -42091 -70805 -331270 -149806 -272657 23227 -118598
11262 -229813 -142311 29082 -66069 -82270 240610 52947 238455 149115 -161074 -66833 -169771
$$ packed form
11344a33190M4103a7967j06011k33238E0106J3168a29096I945b07647o4662F7398
11332i254j78516C00155g1497f208D1938N1741a42835B10086r8592C0894g65j0970
11320a1735p9625A70316a28177G2355N2420a60023H0343J8090C0402c86158c9114
11308a04584A92810l8062e7672H2499a43364E816a16656b8327C1939L9710J07502
11297A79151b5330k23398L7139Q133A6477J75355m577H7754e2550j32296I7346
11285A454c56795J34465Q3437N5237c8854L004A87416b68465N6934m436G0097
11273i1206J7825m81294A64549d2091k8714k60465a49806j22851B3227a18598
11262b29813Q7502B9082f6069j6201B40610E2947J85508q9340a61074f6833j02938
$$ plain form
11251 -169771 -166196 -85934 151099 49836 -22733 -75092 -101965 -117192 -172099 37677 79372
11240 79372 -334881 104740 -192917 -95313 -275520 -217867 -142774 209144 181762 368975
11230 368975 181712 4493 -176587 70975 39733 8764 -326491 14790 148094 58518 197560
11219 197560 -52067 45831 206379 27426 45100 -191661 -144894 -269262 -135209 -161962 140021
11207 -196523 -168870 293143 -74107 -20631 -297113 -9679 -99916 -146608 102171 76801 -248048
11195 13574 266675 -33496 -43882 -436627 -262107 36600 -391160 139654 -148004 -47307
11184 -13535 -215985 134152 -277862 -126358 36235 -1186 -70263 216138 -79238 242369 -258115
11172 -115591 -346315 133596 -203050 -362701 -228397 63321 -123509 -68304 -178485 -152016
$$ packed form
11251a69771L575Q0262A51099D9836b2733n2359k6873j5227n4907C7677M1695
11240G9372c34881A04740a92917i5313j80207N7653P5093B09144k7382J87213
11230C68975A81712D493a76587G0975l1242H764c26491A4790J33304E8518J39042
11219A97560e2067D5831J60548B7426J7674a91661M6767j24368J34053k6753A40021
11207a96523K7653B93143g4107b0631k76482i679r0237m6692A02171k5370b48048
11195A3574K53101c3496j0386l92745J74520C6600c91160A39654a48004d7307
11184a3535k02450A34152b77862a26358C6235a186o9077B16138g9238B42369b58115
11172a15591k30724A33596b03050j59651J34304F3321a23509N5205j10181K6469
$$ plain form
11162 -152016 -191926 -67332 -35281 12626 -40180 133132 211711 -375324 -3395 226735 -236181
11150 104741 148679 20666 22226 24562 -61930 -124314 -218474 -232578 -126936 -80942 58446 54386
11138 54386 -649620 -1452 76084 -191828 53793 183728 -123814 45163 145920 -284823 -32630
11126 -300401 22911 -138310 122429 46762 52916 -20445 143674 -46459 -266248 35020 -234672
11114 -156026 33231 -50127 100263 -265218 155210 16276 -75544 235149 -256063 -54453
11103 21714 207241 209882 -196423 182858 24889 272001 90747 -336199 -1920 3956 102295
11092 102295 252686 312722 347324 258776 172667 55464 89857 288042 58378 251371 -9997
11080 -64937 -26681 87662 -7063 -107831 162088 68426 406797 -46796 110273 282580 47542
$$ packed form
11162a52016l9910f7332L2051A2626d0180A33132P8579c75324c395B26735b36181
11150A04741M3938B0666J560K336f1930o2384r4160j4104J05642M5994E8446m060
11138E4386f49620a452G6084a91828E3793J29935a23814D5163J00757b84823c2630
11126c00401B2911a38310A22429D6762O154b0445A43674d6459k19789C5020b34672
11114a56026C3231e0127A00263b65218A55210A6276g5544B35149b56063e4453
11103B1714J85527K641a96423A82858B4889K47112I0747c36199a920C956R8339
11092A02295J50391O0036L4602q8548q6109E5464L4393J98185E8378J92993i997
11080f4937b6681H7662g063j00768A62088F8426L38371d6796A10273J72307D7542
$$ plain form
11068 91328 261493 -158840 540418 203998 115327 73494 248859 122603 154822 28607
11057 228173 198218 325830 205717 397853 318227 111484 240952 161288 -42220 69265
11046 579529 154561 18084 399394 330914 295916 764560 574524 503201 476462 560058 605259
11035 605259 552667 469010 740803 372761 432252 782069 501775 566397 374586 609443
11025 609443 565386 457580 693847 709566 452531 363677 397210 553210 494483 583247 305434
11014 305434 451806 616445 580040 666042 208446 666558 581307 549010 694869 688116 585502
11003 585502 613816 534422 633211 632067 345783 632968 482349 444022 259740 405107 388090
10992 388090 362003 487669 252133 273116 537695 620631 731834 595506 535168 302815
$$ packed form
11068I1328J70165a58840E40418B03998q8671m1833J75365A22603L2219B8607
11057B28173k9955J27612j20113J92136p9626A11484J29468p9664d2220F9265
11046E79529A54561A8084L81310o8480l4998M68644j90036p1323k6739Q3596M5201
11035F05259n2592q3657K71793l68042N9491L49817k80294O4622j91811K34857
11025F09443m4057j07806K36267J5719k57035q8854L3533J56000n8727Q8764k77813
11014C05434J46372J64639l6405Q6002B08446M58112q5251l2297J45859o753j02614
11003E85502K8314p9394R8789j144k86284K87185j50619l8327j84282J45367j7017
10992C88090k6087J25666k35536K0983K64579Q2936J11203j36328o0338k32353
$$ plain form
10982 302815 526315 399979 351342 648729 141164 349452 736264 369207 785288 244331
10971 613228 521745 734434 749801 732324 801464 824680 861893 1174103 826400 794769 922317
10960 922317 831486 1318703 1443318 1444803 1779112 1773374 1820706 2008082 1789384 2350693 2209941
10949 2209941 1891350 1948992 1672657 1642319 1900889 1354191 1548183 1645285 1550077 1266694
10939 1266694 1377924 1434923 1472705 1209128 1538328 1283810 1229121 1032568 1031282 874288
10929 874288 761159 946616 395100 431050 191193 420933 538672 105443 106008 195606
10919 195606 142286 358427 84066 -98773 66693 132759 137192 22596 -99912 434123 -317599
10907 -55016 142483 -130908 157902 212821 -117246 11004 -77611 139610 -197946 173647
$$ packed form
10982C02815K23500j26336m8637K97387A41164K08288L86812l67057M16081B44331
10971F13228r1483K12689J5367j7477O9140K3216L7213L12210l47703l1631J27548
10960I22317r0831M87217J24615J485L34309n738M7332J87376k18698N61309j40752
10949B209941l18591N7642k76335l0338K58570n46698J93992R7102r5208k83383
10939A266694J11230N6999L7782k63577L29200k54518n4689j96553j286j56994
10929H74288j13129J85457C95100L5950A91193K29740J17739A05443N65Q9598
10919A95606n3320K16141H4066i8773F6693O6066M433B2596i9912D34123c17599
10907e5016A42483a30908A57902N4919a17246A1004g7611A39610a97946A73647
$$ plain form
10896 18716 84470 -140084 -45209 256760 -45864 162863 199723 178326 -251269 56953 -103996
10884 -78890 -82248 39127 3486 24783 -221625 -11784 21359 178807 -172676 49138 -200691
10872 104804 -311572 -145957 -81712 -166717 -53134 -181201 -5676 -39502 198518 -4171 244955
10860 -295917 -13920 -49344 -147834 -362588 -74009 -36339 -40628 -158288 -7824 -69334 -177546
10849 -177546 91505 -62993 16945 245913 167760 -243475 -148861 -34648 917 -205182 165138
10837 -93725 -329077 105248 -161955 -62298 -33251 -95066 -115194 -93542 187548 -34001 1509
10825 -4057 98515 -53811 105436 147939 -52071 -207989 -296335 -174200 254376 143939 -13042
10813 -228782 113378 -48502 -157998 -189046 -142941 42027 -9226 -138949 202244 -60514 -82240
$$ packed form
10896A8716O5754a40084d5209B56760d5864A62863L6860k1397b51269E6953a03996
10884g8890l358C9127C486K1297b21625a1784B1359J57448a72676D9138b00691
10872A04804c11572a45957O4245q5005e3134j28067e676l3826A98518d171B44955
10860b95917a3920l5424r8490k14754g4009c6339m289j17660g824o1510j08212
10849a77546I1505f2993A6945K28968p8153b43475R4614c4648I17b05182A65138
10837i3725k35352A05248a61955f2298K9047o1815k0128K1652A87548c4001A509
10825d057I8515e3811A05436M2503e2071j55918q8346J22135B54376j10437a3042
10813b28782A13378d8502j09496l1048M6105D2027i226j29723B02244f0514k1726
$$ plain form
10802 -82240 -245607 -64647 -10590 -189383 -94646 113021 81637 -257183 115532 69776 4115
10790 -221026 -101900 -161020 61030 232403 -79819 -20704 -42959 46461 299640 -96365 14985
10778 101255 -41066 -13808 33482 -265507 -72594 18285 85958 22421 77946 -325250 -121125
10766 295081 256292 149874 310265 -211893 -194163 -7300 -194104 136534 -91858 62470 -48161
10754 -20005 -184119 45794 329291 363396 -230259 -298201 14497 -173281 -198699 -248266 -24656
10742 -63799 -135798 -14731 13591 -445430 79180 -84137 5268 -178411 382375 -145678 5960
10730 -207185 33395 38243 351700 -209235 -194303 -459222 -71958 -51877 -153950 121766 -165723
10718 -58461 -302720 -63062 200835 58738 -86275 68555 417270 -358410 -387510 -142442 -18689
$$ packed form
10802h2240j63367f4647a0590j78793i4646A13021l1384b57183A15532m5756D115
10790b21026a01900n9120F1030J71373g9819b0704k2255D6461K53179i6365A4985
10778A01255d1066a3808C3482b65507g2594A8285O7673B2421N5525c25250a21125
10766B95081l8789j06418J60391b11893J7730g300j86804A36534i1858F2470d8161
10754b0005j64114D5794K83497L4105b30259o7942A4497a73281k5418m9567b4656
10742f3799p1999a4731A3591d45430G9180h4137E268a78411C82375a45678E960
10730b07185C3395M848L13457b09235J4932k64919g1958K0081j02073A21766a65723
10718e8461k44259f3062B00835E8738h6275F8555L48715c58410k9100a42442a8689
$$ plain form
10706 -289003 -104701 -179420 -212333 -189052 46758 -35251 -243612 112404 -198917 21241 -286897
10694 -177094 227974 -182111 55452 18193 5448 -75689 -430893 39993 -2401 157379 -329196
10682 -30056 -394907 -142427 -26285 -132371 241474 189180 -105022 -295621 -149302 37903
10671 -116865 -22565 -64225 -158105 -58576 55295 23217 -70593 -203398 36248 47988 -362633
10659 37701 -82573 230759 43646 -84075 -364309 -75654 -308094 -354273 22131 246016 -132771
10647 149165 -402528 -237393 1335 211638 -297399 -156510 -22640 35699 31905 36871 -45667
10635 -392243 65929 110584 -33930 -57090 -101 163182 -7264 -65826 127943 -153139 -242739
10624 -242739 -71017 42329 -44751 -60440 -164965 -18251 -113017 -4770 -34069 -92043 74511
$$ packed form
10706b89003a04701p4719l2913K3281D6758c5251k08361A12404a98917B1241b86897
10694a77094B27974a82111E5452A8193E448g5689l55204C9993b401A57379c29196
10682c0056l64851a42427b6285j06086B41474n2294a05022j90599J46319C7903
10671a16865b2565m1660r3880e8576E5295B3217g0593j32805C6248J1740c62633
10659C7701h2573B30759D3646h4075k80234g5654k32440m6179B2131K23885a32771
10647A49165d02528J65135A335K10303b97399J40889b2640C5699l794M966d5667
10635c92243F5929M4655c3930k3160a01A63182g264n8562A27943a53139q9600
10624b42739g1017D2329d4751j5689j04525a8251r4766d770k9299n7974G4511
$$ plain form
10612 27231 -180292 -176708 -73630 -265033 -146520 -61258 -291396 -35039 -190206 -52494 9745
10600 -115241 -22696 -179907 -104598 257152 -162711 -10717 66787 -183563 -10894 49171 -216562
10588 83416 -15235 -189832 -239523 48988 -81079 49317 -307151 46702 -114794 486685 -203420
10576 -4312 130678 -111139 -74118 -11735 -199896 -72475 -33446 -99866 27983 336512 -148373
10564 173893 -79447 -178377 139577 -217532 4116 -38474 -19735 -216538 -199308 35836 -56357
10552 149778 48693 -111176 259592 101386 25148 24969 58024 -248052 -448627 26465 -155516
10540 49714 81378 56884 108490 -294361 -63869 1844 -14633 -71546 119328 122159 -201696
10528 -169154 170004 -81355 13305 -132618 -328591 45222 -101161 -264633 -253754 -253026 -349420
$$ packed form
10612B7231a80292L584g3630j91403J18513f1258k30138c5039j55167e2494I745
10600a15241b2696j57211P5309B57152a62711a0717F6787a83563a0894D9171b16562
10588H3416a5235j74597m9691D8988h1079D9317c07151D6702a14794D86685b03420
10576d312A30678a11139L7021a1735j88161g2475c3446o6420B7983L08529a48373
10564A73893g9447r8930A39577b17532D116c8474J8739j96803J7230C5836e6357
10552A49778D8693a11176B59592A01386B5148j79L3055b48052k00575B6465a55516
10540D9714L1664k4494N1606b94361f3869A844a4633n6913A19328K831b01696
10528a69154A70004h1355A3305a32618j95973D5222a01161j63472J0879P28r6394
$$ plain form
10517 -349420 41918 202411 112778 -23878 210850 379380 -114619 -184703 -5784 -127051 12216
10505 -292750 -161258 -108845 295846 -146330 194156 -64208 -83026 110116 -50810 -146660
10495 -146660 -110950 -77676 -1585 3691 133120 -631642 -68066 -124276 -559599 -249307 -6484
10483 -69953 -248082 -272360 186331 -98527 5488 -93431 214472 -104438 232122 -27648 -100412
10472 -100412 138061 -309601 -111071 -93096 -39722 109290 7598 23140 273289 73351 -55778
10460 343777 316075 585244 306706 239888 337779 -101041 195339 96880 2961 8960 -196261
10448 -202611 -146285 -149967 35144 -50641 331883 -248369 -113347 276412 -196224 -142323 183785
10436 -180084 5457 56353 -135901 155282 -157246 123988 -538900 -441500 -393212 138629
$$ packed form
10517c49420D1918J60493q9633b3878B10850J68530a14619p0084e784j21267A2216
10505b92750J31492N2413B95846a46330A94156f4208j8818A10116e0810r5850
10495a46660L5710L3274a585C691J29429f31642f8066n6210m35323b49307f484
10483f9953j78129k4278A86331i8527E488i3431B14472a04438B32122b7648p2764
10472a00412A38061c09601a11071J7975c9722A09290G598J5542K50149G3351e5778
10460C43777k7702K69169k78538o6818R7891a01041A95339I6880B961N999a96261
10448b02611N6326l682C5144e0641C31883b48369a13347B76412a96224N3901A83785
10436a80084E457N0896a35901A55282a57246A23988e38900R7400M8288A38629
$$ plain form
10425 170480 -38900 -17267 -139411 -15256 -365893 -150426 -59323 371292 -93220 -113735 -119333
10414 -119333 -82325 -56728 111757 -383285 88224 -91862 -175556 139306 44539 -182190 165558
10402 -156989 -118003 -102937 -16230 503036 204426 113349 -189788 -70925 -139499 121989 -9415
10390 -176704 268972 58060 55211 -454036 28644 -185009 -193414 153765 -25465 -89128 76055
10378 1459 -48656 -161197 -137410 12607 141499 -118751 29882 -50475 215922 -15335 -66184
10367 -66184 172891 -100753 305701 -194300 83220 104227 1885 99130 151561 -128337 233650
10355 -75634 -144863 37918 312866 214289 -8914 278948 49081 378156 64312 313097 552094
10344 552094 69743 -5328 182910 340317 419324 287068 -261053 107803 280573 125006
$$ packed form
10425A70480c8900a7267j22144a5256l50637a50426e9323C71292i3220k0515n598
10414a19333L7008K5597A11757c83285H8224i1862q3694A39306D4539a82190A65558
10402a56989L8986J5066a6230E03036B04426r1077a89788g0925o8574A21989i415
10390a76704B68972E8060k849d54036B8644a85009q405A53765b5465o3663G6055
10378A459d8656j12541K3787A2607J28892a18751B9882e0475B15922a5335n0849
10367f6184A72891a00753C05701a94300H3220K1007A885R7245N2431a28337B33650
10355g5634o9229C7918K74948r8577h914B78948D9081L29075F4312K48785K38997
10344E52094F9743e328A82910J57407P9007j32256b61053A07803J72770A25006
$$ plain form
10333 111923 229638 179261 365060 -101512 174552 349094 -100197 238209 220791 500407
10323 500407 360309 337088 68321 464516 256106 -105108 132968 130495 69748 277376
10313 277376 -173635 236667 78149 199435 86012 -36761 -37754 182756 -135156 125705 143663
10302 143663 199301 58293 299349 133583 77635 48234 -70750 52297 44321 90832 242966
10291 242966 -3044 137170 189758 464210 -139770 -128449 320337 56938 -279258 -87308 175929
10279 -257254 80341 1508 24386 57365 142961 -50505 107537 -177549 113427 -105868 283764
10267 89249 -60652 -234449 37788 -119561 -40057 12569 -147079 85648 -207493 -18367 -43002
10256 -43002 -120810 262741 180713 3302 -296771 -32186 -102725 -37554 -130306 271088 111056
$$ packed form
10333A11923J17715n0377J85799a01512A74552J74542a00197B38209j7418K79616
10323E00407j40098k3221F8321L96195k08410a05108A32968k473o0747K07628
10313B77376a73635B36667G8149J21286H6012c6761r93A82756a35156A25705J7958
10302A43663N5638E8293K41056A33583n5948k9401g0750E2297p976M6511J52134
10291B42966c044A37170N2588K74452a39770J1321C20337E6938b79258h7308A75929
10279b57254H0341A508K2878L2979Q5596e0505A07537a77549A13427a05868B83764
10267H9249f0652j73797C7788a19561d0057A2569a47079H5648b07493a8367k4635
10256d3002p7808B62741q2028C302b96771c2186p0539c7554r2752B71088A11056
$$ plain form
10244 168384 6676 10472 -150001 -154673 303507 331051 298633 5343 -18696 375770 118286
10232 108349 247750 -381196 -196032 114590 -458597 176214 101946 -231129 -46874 138297
10221 5068 140781 -213996 -135760 -62585 14335 54812 -195718 -393759 -278148 -420911 1671
10209 -112251 -72897 -220605 -74148 195230 130227 -36916 -118809 -82639 69095 532123 -99898
10197 -318235 -46087 -91437 -18026 -166749 235661 -169106 175204 -34708 -29882 138770 -326759
10185 -108639 -52161 21878 -137178 -124502 -247866 -81243 -36607 -74452 -61337 -82983 57126
10173 -3579 20467 -124734 -300272 -248067 140633 -77638 -54755 -262242 225226 -79419 -238358
10162 -238358 111029 126114 81939 68889 -210748 -47347 110799 35646 -230445 -16421 -35237
$$ packed form
10244A68384F676L796a50001m672C03507K7544l2418E343a8696C75770A18286
10232A08349J39401c81196J85164A14590d58597A76214p4268b31129d6874A38297
10221E068J35713b13996P8236f2585A4335M0477a95718j98041J15611j42763A671
10209a12251L9354j47708g4148A95230o5003c6916q1893L6170F9095M63028i9898
10197c18235d6087m5350a8026j48723B35661a69106A75204c4708M826A38770c26759
10185a08639e2161B1878a37178J2676j23364h1243c6607l7845J3115k1646E7126
10173c579B0467a24734j75538N2205A40633g7638K2883k07487B25226g9419j58939
10162b38358A11029J5085m4175j3050b10748d7347A10799C5646b30445a6421j8816
$$ plain form
10151 -35237 -59890 190655 -53345 -145649 54552 -104956 -249550 286567 -324286 -209420
10141 -209420 36231 -66464 -286581 -92670 -181683 -112549 137467 -270706 -220638 -87513 -214579
10130 -214579 -164636 -49105 -218105 156462 -171709 -21322 -88107 -198990 -265834 245842
10119 244207 338261 -17196 27070 293038 -111302 -226953 57075 -206453 -291594 -121030
10108 -39459 -56051 -86219 -124682 61004 -44129 -128151 -54212 153966 -29457 -134360 99699
10096 -121822 -188732 165918 89578 -418816 -472922 -88298 -20946 -425537 -63321 -306345 28043
10084 -89204 92157 -52687 189705 103764 12977 -207189 -281548 -3134 -72693 210935 -152807
10072 -60207 29218 300221 -295576 191888 -128845 203332 2632 23536 -365917 -93039 -260756
$$ packed form
10151c5237k4653A90655e3345r2304E4552a04956j44594B86567c24286J14866
10141b09420C6231f6464k20117i2670q9013O9134A37467b70706N0068h7513j27066
10130b14579M9943d9105j69000A56462a71709b1322o6785j10883o6844B45842
10119B44207R4054a7196B7070K65968a11302j15651E7075b06453q5141a21030
10108c9459j6592l0168l8463F1004d4129q4022e4212A53966b9457j04903I9699
10096a21822o6910A65918p6340d18816n4106h8298b0946m04591f3321k43024B8043
10084h9204I2157e2687A89705q5941A2977b07189p4359c134o9559B10935a52807
10072f0207B9218K71003b95576A91888a28845B03332B632K0904c65917i3039j67717
$$ plain form
10061 -260756 260990 -32091 7411 -126564 -207551 -275766 -95363 -5023 91740 21744 -162239
10049 -309590 -221242 111880 -28718 -75934 -223432 -143602 87526 154026 -73267 -16906 -214312
10038 -214312 53298 -250743 -84909 -275453 -27362 202366 -342070 -256485 -322763 -194629
10028 -194629 -101255 244269 -114069 262169 -158268 52003 -228633 -46754 2038 -266362
10017 -166130 -41147 -261741 -73322 -55099 -192515 -32493 -107554 -122003 -131595 -111078 4557
10005 -71511 -268610 -217911 -332436 53581 -327351 5572 22044 158597 -298066 -180783 44536
9993 24597 50689 -129312 -265930 -59084 -104272 41140 -189554 -133534 227816 -239867 14281
9981 -173816 -117812 -57796 -184106 162368 53990 -126929 185932 81079 22793 -414565 -44379
$$ packed form
10061b60756B60990c2091G411a26564q0987o8215i5363e023I1740B1744a62239
10049c09590Q8348A11880b8718m7216j47498P9830H7526O6500g3267a6906j97406
10038b14312E3298b50743h4909j90544b7362B02366c42070Q5585o6278J28134
10028a94629R3374B44269a14069B62169a58268E2003b28633d6754B038b66362
10017a66130d1147k20594g3322J8223j37416c2493p5061j4449r592K0517D557
10005g1511j97099N0699j14525E3581c27351E572J6472J36553b98066J17283D4536
9993B4597K6092a29312j36618e9084m5188D1140a89554N6020B27816b39867A4281
9981a73816N6004e7796j26310A62368E3990a26929A85932H1079B2793d14565d4379
$$ plain form
9969 96903 -152308 103285 82987 -59987 -250163 -14159 -120330 145234 2921 309373 -228892
9957 -300658 134669 -261687 -185908 -123607 -238900 -405576 -23111 -259161 111174 -52474
9946 -26349 16171 109146 -244237 54289 -174439 175631 -133369 -225948 -103991 23981 -230122
9934 -400765 -288396 14527 -165238 105408 -192111 27693 -82602 67867 -38661 -342593 -186105
9923 -186105 244046 -107384 -76257 -58885 -94760 -96199 80650 -122669 -176863 -33486 -323680
9912 -323680 -83350 -55922 -425363 -148282 -209617 -22992 -66248 -20754 -110614 5276 161862
9901 161862 -470442 -7285 -118044 -54278 -127603 -133838 -33404 -268327 -180754 -385454 4310
9889 -195792 -331648 105882 185479 -73266 -391 -161333 -201000 -395711 -237408 -28441 17069
$$ packed form
9969I6903a52308A03285k0298e9987j90176a4159j06171A45234B921L06452b28892
9957c00658A34669b61687P5779O2301j15293j66676b3111k36050A11174e2474
9946b6349A6171R2975b44237E4289a74439A75631a33369r2579a03991B3981b30122
9934d00765J12369A4527a65238A05408a92111B7693h2602F7867c8661l03932J56488
9923a86105B44046a07384L1127J7372l5875j439H0650a22669n4194c3486k90194
9912c23680h3350K7428l69441a48282o1335b2992m3256b0754q9860E276J56586
9901A61862d70442g285j10759e4278p3325o235c3404k34923Q7573k04700D310
9889a95792j35856A05882P9597g3266c91j60942l9667j94711J58303b8441A7069
$$ plain form
9877 -35669 -46544 -48295 173500 -113199 -87514 -234851 -207151 -134391 132633 156200 -92174
9865 -269996 -214925 -103203 -373089 82742 -256221 164269 284711 -129743 -205077 90020
9854 -279431 225471 439853 126022 24809 -73400 -473242 35602 -21581 -120446 57174 -275921
9842 215405 56910 -194834 -99644 -24911 -311409 -4626 -32980 -464309 77083 -21135 397074
9830 -69840 -83526 -171329 -216477 342115 98410 221180 -98404 -8323 73585 -24526 15042 -84687
9817 -361090 -125073 -55743 132606 222518 -87544 -324581 -104157 502377 -299572 203806
9806 147286 391749 -170840 29251 -76687 11885 26909 110620 -92567 204539 -209102 -495186
9795 -495186 -255551 -175252 150391 -426519 77967 -83802 -184434 -35566 -331351 -109463
$$ packed form
9877c5669j0875j751A73500a13199K5685j47337K7700P2760A32633K3567i2174
9865b69996N5071a03203k69886H2742b56221A64269J20442a29743p5334I0020
9854b79431B25471K14382A26022B4809g3400l99842C5602b1581r8865E7174b75921
9842B15405E6910a94834R5190b4911k86498d626k8354m31329G7083b1135C97074
9830f9840j3686q7803m5148C42115I8410J22770i8404h323G3585b4526A5042h4687
9817c61090a25073e5743A32606Q9912h7544k37037a04157E02377b99572B03806
9806A47286K44463a70840B9251g6687A1885J5024Q3711i2567B04539b09102k86084
9795d95186K39635Q0299A50391d26519G7967h3802j00632c5566k95785a09463
$$ plain form
9784 -324385 -47474 261938 -79 -153326 -206372 14470 -26100 187005 -365616 -182200 12325
9772 21097 153475 26319 -35852 -236847 -154671 -54572 -71369 62655 -27854 -191774 -166960
9761 -166960 -12461 23729 -129003 -84415 -58876 -88950 -131296 -43483 12581 -164678 98511
9749 -295854 -99151 160975 -155787 66530 27881 -282645 130324 89016 -186743 -41634 82510
9737 99483 14469 43552 -257127 203268 52158 -7844 -5499 -188926 -474757 -15911 -74175
9726 -74175 -104609 -61668 -111606 -35245 253730 -221531 -28635 -189830 67135 54669 -215834
9714 -291149 -45960 -20503 -223751 -273971 -481 -78248 -163500 74708 -202081 157874 -422457
9702 -384973 50136 -71755 -275293 61558 -94361 -308047 -195835 -26839 -53132 -269101 -93996
$$ packed form
9784c24385d7474B61938g9j53247n3046A4470b6100A87005c65616a82200A2325
9772B1097J32378B6319c5852k00995Q2176e4572j6797F2655b7854j63920K4814
9761a66960a2461B3729a29003M4588K5539l0074m2346d3483A2581a64678I8511
9749b95854i9151A60975a55787F6530B7881b82645A30324m1308a86743d1634H2510
9737I9483A4469K9083b57127B03268E2158g844K345j83427k85831a5911n8264
9726g4175l0434M2941m9938c5245B53730b21531b8635j61195F7135j2466b15834
9714b91149d5960b0503k03248n0220d81p7767q5252G4708b02081A57874d22457
9702c84973E0136g1755k03538F1558i4361k13686J12212b6839k6293k15969i3996
$$ plain form
9690 -86624 -291391 246372 -119281 167945 -102882 -125859 21984 191944 -129723 -181667
9680 -181667 230513 -155509 -206115 -207318 99531 -235490 -28429 67092 -115589 -211523 45654
9668 -162118 -55700 156035 -190938 114372 -310790 -229311 -69599 -649703 -256283 -105096
9657 -336190 90805 -2532 111870 421859 -58765 -21620 -185479 -88726 -138222 -63663 -100055
9646 -100055 -61531 150432 -240445 68551 -244263 -219883 -159558 -168921 -68027 140918 52252
9634 -46102 186607 -174392 -255370 -280242 152198 -226072 93978 202435 79076 303512 52961
9622 -339312 -365836 -150867 -129129 -44097 -219413 -82104 -87767 -90756 -85663 -70020 -403870 184738
9609 -222618 30047 -4933 112490 182279 -52108 -177656 -167863 -116358 -113455 -111363 -135217 249092
$$ packed form
9690h6624k04767B46372a19281A67945a02882k2977B1984J69960a29723n1944
9680a81667B30513a55509n0606j203I9531b35490b8429F7092a15589r5934D5654
9668a62118e5700A56035a90938A14372c10790Q1479f9599n80104b56283a05096
9657c36190I0805b532A11870L09989e8765b1620j63859h8726m9496f3663l6392
9646a00055L8524A50432b40445F8551b44263K4380O0325r363f8027A40918E2252
9634d6102A86607a74392q0978k4872A52198b26072I3978J08457G9076K24436E2961
9622c39312k6524a50867K1738d4097j75316h2104n663k989N093J5643l33850A84738
9609b22618C0047d933A12490O9789e2108j25548R793N1505K903K092k3854B49092
$$ plain form
9596 -105321 92113 62951 -123277 146957 -46976 65332 49 116695 119932 -120612 -16016 14956
9583 -12098 -537637 -117052 173077 -163069 147867 111723 -35007 -244656 -38123 -73661 -42935
9572 -42935 8168 -142777 -270319 -95035 2552 16114 -48445 -81568 -533463 -148823 -48414
9560 -394805 30042 -79463 -250789 95963 93828 -514727 -129394 45964 -125039 -136619 166859
9548 78848 -20034 -180081 196479 24281 -439065 124586 181959 -54836 367403 -449309 -482342
9537 -482342 40798 -268505 -94249 -197820 345605 -241084 -126260 -140560 -19269 20548 45405
9526 45405 70265 -10081 -113649 111062 168843 -463023 22557 -56184 -161510 -148464 319781
9514 -398467 33833 -89743 313777 -19315 -5946 166940 28319 -161279 -587969 -160667 -175835
$$ packed form
9596a05321I2113k9162a23277A46957d6976F5332D9J16646L237a20612a6016A4956
9583a2098n25539a17052A73077a63069A47867l6144c5007k09649c8123l5538L0726
9572d2935H168a42777j27542i5035B552J3562d8445l3123m51895a48823d8414
9560c94805C0042g9463j71326I5963k135e14727a29394D5964a25039j1580A66859
9548G8848b0034j60047A96479B4281d39065A24586N7373e4836C67403d49309l3033
9537d82342D0798b68505i4249j03571C45605b41084J14824j4300a9269B0548K4857
9526D5405K4860a0081j03568A11062N7781d63023B2557e6184j05326J3046C19781
9514c98467C3833h9743C13777a9315e946A66940B8319a61279m26690a60667j5168
$$ plain form
9503 -175835 -572409 118214 -59484 145336 -209941 77464 315702 -9106 -215418 -129367 -282555
9492 -282555 -122375 -141598 -388207 -365505 -106151 3053 234155 2300 -213207 -106262 137825
9480 -35165 82896 -150074 -109177 -87031 95178 -123492 -240129 -230068 -116981 -452995 -191322
9468 -27818 -51396 -127604 -42131 116391 41161 -135659 832 243862 -312630 -191799 156832
9456 -267938 17909 -303556 -437164 67417 48067 5886 218603 23692 153727 95176 55242
9445 55242 -395078 -63764 -123506 -34583 -194901 -197887 243174 -15785 100711 -27071 -106446
9434 -106446 259267 -173355 -25583 -55473 -195533 -381857 190556 -15594 -428384 -425134 100163
9422 87352 -231648 -44799 190116 33245 -141383 -72877 228767 121735 -163475 -6026 251202
$$ packed form
9503a75835l96574A18214e9484A45336b09941G7464K38238i106k06312Q6051j53188
9492b82555a22375j9223k46609K2702a06151C053K31102B300b13207a06262A37825
9480c5165H2896a50074M0897K2146I5178a23492j16637J0061J13087l36014a91322
9468b7818k3578p6208d2131A16391D1161a35659H32K43030c12630J20831A56832
9456b67938A7909c03556j33608F7417j9350E886K12717B3692J30035n8551l9934
9445E5242c95078f3764n9742c4583j60318k986B43174a5785A00711b7071p9375
9434a06446B59267a73355b5583k9890j40060j86324A90556a5594m12790L250A00163
9422H7352b31648d4799A90116C3245a41383O8506B28767j07032a63475f026B51202
$$ plain form
9410 -58425 -107525 -31378 123443 91589 -173636 310461 175296 82219 339824 299064 34866
9398 -178647 -274046 -159250 176162 20064 -119757 79641 -181946 -100729 -36401 11263 -262590
9386 -112065 -181278 149686 -251243 -33308 2103 -23138 -303546 -243127 265343 -17438 -112087
9375 -112087 -136569 -235861 218923 -57593 -163839 174402 -156400 83177 -225563 23628 -87544
9363 -71837 -115922 -19853 38639 -337373 -261502 247074 -54407 -105167 -155013 38522 -137747
9351 -38460 -6749 1846 -248897 -194767 194028 -342934 -219074 -172122 -21709 187290 -283100
9339 -345083 -96375 234005 -5806 -57443 209160 -92781 -314029 109208 193383 -150350 -12083
9327 42584 -46439 -28829 36793 -272754 -79975 79371 -217666 -184318 228261 121755 70405
$$ packed form
9410e8425m9100c1378A23443l1854a73636C10461j35165H2219K57605m0760C4866
9398a78647r5399J14796A76162B0064a19757G9641a81946Q1217c6401A1263b62590
9386a12065o9213A49686b51243c3308B103b3138k80408O0419B65343a7438r4649
9375a12087k4482r9292B18923e7593j06246A74402a56400H3177b25563B3628h7544
9363g1837m4085a9853C8639c37373P5871B47074e4407n0760m9846C8522a37747
9351c8460f749A846b48897N4130A94028c42934J23860M6952b1709A87290b83100
9339c45083i6375B34005e806n1637B09160i2781k21248A09208Q4175a50350a2083
9327D2584d6439J7610C6793b72754g9975G9371b17666L3348B28261j06506n1350
$$ plain form
9316 70405 -100359 64767 139086 214448 -409453 15167 33455 -101186 -127095 178274 -122199
9304 -17097 -98292 -255267 -45915 -134820 -314055 -58903 -158715 -8925 -327677 -156918 -140178
9293 -140178 48184 -207441 -120711 -251768 -3435 129015 -526075 23939 101043 4293 -332663
9281 160558 -35436 16508 -62150 -11527 -57242 -233044 -191749 17220 -223389 -127699 97882
9269 -29301 -22817 217497 11619 -72875 -75771 -21628 -165109 -253713 -35876 -148485 -381184
9258 -381184 -198928 -45613 -265626 -391517 -21294 -124288 -537778 -65383 316818 165884
9248 165884 -53821 53739 -40608 -96316 -22545 -13016 62340 -278197 144757 -8317 56677 40833
9236 40833 -98616 -13026 -58647 -312741 151222 211549 -340892 -135887 29948 24424 -256599
$$ packed form
9316G0405a00359F4767P4319P5362d09453A5167J8288a01186k5909A78274a22199
9304a7097q1195j56975d5915q8905j79235e8903r9812h925l18752a56918J6740
9293a40178D8184b07441Q6730j31057c435A29015e26075B3939P7104D293c32663
9281A60558c5436A6508f2150a1527m5715j75802M1295A7220b23389R5690I7882
9269b9301O484B17497A1619g2875k896b1628j43481q8604c5876j12609k32699
9258c81184J82256d5613k20013j25891b1294j02994m13490f5383C16818j50934
9248A65884e3821E3739d0608n5708b2545R529F2340b78197A44757h317E6677j5844
9236D0833i8616a3026m5621k54094A51222O0327c40892a35887B9948n524b56599
$$ plain form
9224 307423 -87250 -140112 -291153 -353288 -165311 100555 -186115 -55573 -149857 111689 343497
9213 343497 -16763 24578 -109784 198391 -82947 -70019 -92963 241993 -37757 -126412 91919
9201 78711 -194979 -222667 79006 -347787 -61044 -184800 -212526 103335 -266399 -193209 53823
9189 -57637 -353755 96861 -41990 173197 -265020 38412 45041 341799 -509582 -184083 -51800
9177 -46749 -122779 -104529 88293 -285222 -49355 -138062 376097 128272 -25274 -94541 99179
9165 123503 -80660 419192 258287 29807 -88809 -56289 178268 -339833 -197054 -226368 -361244
9154 -361244 -30874 -50841 -456310 219616 -7788 106844 84325 -154003 -189076 -119488 -179271
9143 -179271 218917 -612832 291120 62467 261279 -104573 -102393 573 -28342 -88330 167141
$$ packed form
9224C07423h7250n2862j51041o2135a65311A00555a86115e5573r4284A11689K31808
9213C43497a6763B4578a09784A98391h2947J2928k2944B41993c7757q8655I1919
9201G8711a94979k7688G9006c47787f1044j23756k7726A03335b66399P3190E3823
9189e7637k96118I6861d1990A73197b65020C8412O629K96758e09582a84083e1800
9177d6749p6030J8250H8293b85222d9355q8707C76097A28272b5274o9267I9179
9165A23503h0660D19192j60905B9807h8809L2520A78268c39833J42779k9314j34876
9154c61244c0874j9967m05469B19616g788A06844k2519a54003l5073O9588n9783
9143a79271B18917f12832B91120F2467J98812a04573K180E73b8342n9988A67141
$$ plain form
9131 -150340 -83684 -121482 92303 143842 -59083 25992 131649 -54886 222780 284182 -125884
9119 -25840 151901 61508 -60741 144400 97382 -217858 89417 -168510 41121 9831 -220613
9107 -138599 -190019 -288525 154455 -47171 -117598 -239228 45951 160797 -11359 82370 -356619
9095 -120703 -105684 -152703 -199471 -432427 236763 14723 -263962 -135639 -155745 -315977 178130
9083 -230428 -147013 157847 -62565 -415802 -56713 183020 -18994 68181 166510 -49867 83854
9071 155284 -163035 -123847 123775 182732 80692 -153906 -152829 -432 -256201 158918 14764
9059 -136893 142607 -314967 -45410 186639 84924 -49373 -166210 -515538 -63671 -198924
9049 -198924 205420 -311972 -102362 163441 -138957 -64803 105069 190088 100211 24361
$$ packed form
9131a50340O6656l7798I2303N1539e9083B5992J05657e4886B22780O1402a25884
9119b5840A51901F1508f0741A44400m7018b17858H9417a68510D1121I831b20613
9107a38599n1420r8506A54455d7171p0427j21630D5951J14846a1359H2370c56619
9095a20703J5019m7019m6768k32956B36763A4723b63962J28323k0106j60232A78130
9083b30428Q3415A57847f2565l53237e6713A83020a8994F8181R8329d9867H3854
9071A55284a63035L9188A23775N8957H0692a53906J077d32k55769A58918A4764
9059a36893A42607c14967d5410A86639H4924d9373j16837l49328f3671j35253
9049a98924B05420c11972a02362A63441a38957f4803A05069Q5019q9877B4361
$$ plain form
9038 -197027 26859 -45345 -22981 28613 8963 73183 58254 59216 -30429 -118844 -86399 15441
9025 118424 19634 165426 188981 77706 -135290 -74936 -65875 260642 -296161 -576319 -205666
9013 -67380 -28412 -155460 -48849 -129543 -263190 -13009 -201564 71946 -56316 -236597 132576
9001 88569 -87365 -72948 -203897 -88804 17519 -239271 -112116 162889 -170699 -98224 249807
8989 23394 -87761 -371176 -72872 -41904 27592 193314 -189938 144214 -32016 33675 -5146
8977 -211885 53695 -259532 41681 13274 -387817 214431 259408 -173179 363795 -355925
8966 -155656 85138 68649 249633 7698 -126567 45932 -180714 -42104 -257811 -53427 166044
8954 -166171 -96387 8592 138812 -189133 28915 78433 62097 -23503 2878 -75373 -179789
$$ packed form
9038a97027B6859d5345K2364B8613H963O4220j4929R62c0429q8415L2445A5441
9025A18424A9634J45792K3555G7706a35290O0354R061B60642b96161k80158b05666
9013f7380b8412j27048d8849q0694j33647a3009j88555G1946e6316j80281A32576
9001H8569h7365J4417j30949h8804A7519b39271a12116A62889a70699P2475B49807
8989B3394h7761k83415g2872L0968B7592J65722a89938A44214c2016C3675e146
8977b11885E3695b59532D1681A3274c87817B14431M4977a73179C63795c55925
8966a55656H5138j6489J80984G698a26567D5932a80714d2104k15707e3427A66044
8954a66171O9784H592J30220a89133B8915M9518j6336b3503B878g5373j04416
$$ plain form
8943 -179789 -279631 -350471 228708 135883 -421886 -269420 50618 59339 -238531 81278 -171283
8931 -537685 -351899 -198346 -54067 -245488 -41973 -211279 82677 8350 116685 -177356 -137318
8920 -137318 -90001 199159 -383146 121706 99638 -60913 -37995 293469 -10888 -17986 -109907
8909 -109907 530208 480848 843601 901043 1224896 3333353 6503253 6077103 3149857 2023615
8899 2023615 933811 491631 420846 -30700 401399 -43402 233672 421665 255506 98272
8888 131286 77572 -200386 30402 254022 -97868 94786 131006 -64456 -26974 -101247 -285089
8877 -285089 212372 -18086 -60796 191478 25010 -170893 -366325 429513 94352 -11506 -143622
8866 -143622 67704 -83533 -57544 -81303 -104929 -232926 116554 120850 -298809 -62266 -89823
$$ packed form
8943a79789r9842p0840B28708r2825d21886J52466E0618Q721b38531H1278a71283
8931e37685J85786J53553e4067j91421d1973j69306H2677H350J08335a77356M0038
8920a37318M7317A99159c83146A21706k2068f0913K2918B93469a0888p098r1921
8909a09907E30208m9360L62753N7442L23853K108457L169900m26150k927246j126242
8899B023615I33811m42180p0785c0700D01399d3402B33672J87993j66159I8272
8888A31286n3714b00386C0402K23620i7868I4786L6220f4456b6974p4273j83842
8877b85089B12372a8086m2710A91478B5010a70893j95432D29513I4352a1506j32116
8866a43622F7704h3533K5989k3759k3626j27997A16554M296b98809f2266k7557
$$ plain form
8855 -89823 108991 154238 23694 150033 -63115 -86098 -461299 110084 88954 118997 167903
8844 167903 -92796 -120015 183426 292397 -297890 -6551 -9434 184340 -175893 -165933 4370
8832 -178671 -294027 311107 -556183 -162665 -102172 -316849 -99607 138194 23232 -176202
8821 -71532 -253528 -287732 29698 -128438 11222 145408 -8676 249052 -36452 -311847 -109845
$$ packed form
8855h9823A08991M5247B3694J26339f3115k2983l75201A10084k1130L0043M8906
8844A67903i2796k7219A83426J08971b97890f551k883A84340a75893R960D370
8832a78671j15356C11107e56183a62665O0493k14677i9607A38194B3232a76202
8821g1532j81996l4204B9698a28438A1222J34186h676B49052c6452k75395a09845
$$ [...]
##END NTUPLES=NMR SPECTRUM
##END=
