
##TITLE=AC1198_BRAAS12062_5946697_X4Bg9drMUj
##JCAMPDX= 6.0         $$ Bruker NMR JCAMP-DX V2.0
##DATA TYPE= NMR SPECTRUM
##DATA CLASS= NTUPLES
##ORIGIN= BRUKER
##OWNER= Administrator
$$ 1.72 TOPSPIN		Version 2.1
$$ 2012-04-11 01:57:03.937 -0500  Administrator@TOPSPIN
$$ Compression mode = diff/dup
##.OBSERVE FREQUENCY= 400.13188235
##.OBSERVE NUCLEUS= ^1H
##.ACQUISITION MODE= SIMULTANEOUS (DQD)
##.ACQUISITION SCHEME= undefined
##.AVERAGES= 64
##.DIGITISER RES= 22
##SPECTROMETER/DATA SYSTEM= spect
##.PULSE SEQUENCE= noesygpps1d.comp
##.SOLVENT NAME= COFFEE_meoh
##.SHIFT REFERENCE= INTERNAL, COFFEE_meoh, 1, 14.96874
##AUDIT TRAIL= $$ (NUMBER, WHEN, WHO, WHERE, PROCESS, VERSION, WHAT)
$$ ##TITLE= Audit trail, TOPSPIN		Version 2.1
$$ ##JCAMPDX= 5.01
$$ ##ORIGIN= Bruker BioSpin GmbH
$$ ##OWNER= Administrator
$$ $$ C:\Bruker\TOPSPIN/data/COFFEE/nmr/AC1198_BRAAS12062_5946697_X4Bg9drMUj/12/pdata/1/auditp.txt
$$ ##AUDIT TRAIL=  $$ (NUMBER, WHEN, WHO, WHERE, PROCESS, VERSION, WHAT)
(   1,<2012-04-11 01:56:59.125 -0500>,<Administrator>,<TOPSPIN>,<go>,<TOPSPIN 2.1>,
      <created by zg
	started at 2012-04-11 01:45:27.406 -0500,
	POWCHK enabled, PULCHK disabled,
       configuration hash MD5:
       1A 1E CE 29 27 FD 77 03 67 4E F0 E3 C4 B2 CB 90
       data hash MD5: 64K
       02 60 23 05 81 11 E4 1D 24 DD 4A 3B 21 56 7A 30>)
(   2,<2012-04-11 01:57:01.937 -0500>,<Administrator>,<TOPSPIN>,<proc1d>,<TOPSPIN 2.1>,
      <Start of raw data processing
       efp LB = 0.3 FT_mod = 6 PKNL = 1 PHC0 = 0 PHC1 = 0 SI = 128K 
       data hash MD5: 128K
       B6 F3 48 C3 60 EC C8 2B 31 66 5C 35 7A 24 7D 76>)
(   3,<2012-04-11 01:57:03.171 -0500>,<Administrator>,<TOPSPIN>,<proc1d>,<TOPSPIN 2.1>,
      <pk PHC0 = 30.92102 PHC1 = 0 
       data hash MD5: 128K
       68 7B E1 2D D7 16 98 D3 B1 D8 E2 34 E4 E6 5D 29>)
(   4,<2012-04-11 01:57:03.406 -0500>,<Administrator>,<TOPSPIN>,<proc1d>,<TOPSPIN 2.1>,
      <abs ABSG = 1 
       data hash MD5: 128K
       ED BC B8 75 7E 5C 2A EF 87 4C E0 1D A7 3E 6A 16>)
(   5,<2012-04-11 01:57:03.500 -0500>,<Administrator>,<TOPSPIN>,<proc1d>,<TOPSPIN 2.1>,
      <abs ABSG = 2 
       data hash MD5: 128K
       03 04 5E A7 4D 32 76 74 67 E0 53 85 D6 B5 21 49>)
(   6,<2012-04-11 01:57:03.703 -0500>,<Administrator>,<TOPSPIN>,<proc1d>,<TOPSPIN 2.1>,
      <abs ABSG = 3 
       data hash MD5: 128K
       26 A3 76 8A B7 85 9A 51 3D 8D E5 3D 8C 7D AB 19>)
(   7,<2012-04-11 01:57:03.781 -0500>,<Administrator>,<TOPSPIN>,<proc1d>,<TOPSPIN 2.1>,
      <abs ABSG = 4 
       data hash MD5: 128K
       A1 89 4A 75 32 A8 80 D7 65 2F 47 23 46 81 F4 A2>)
(   8,<2012-04-11 01:57:03.843 -0500>,<Administrator>,<TOPSPIN>,<proc1d>,<TOPSPIN 2.1>,
      <abs ABSG = 5 
       data hash MD5: 128K
       24 4C 38 69 9B F6 8A 07 27 EE C2 1F 0D 3C 02 E5>)
$$ ##END=
$$ 
$$ $$ hash MD5
$$ $$ 30 FB 57 9E 76 05 B9 AF 9D C8 D3 25 6F 21 4B 32
##$RELAX= 
##$RELAX= 
##$RELAX= 
##$RELAX= 
##$RELAX= 
##$RELAX= 
##$RELAX= 
##$RELAX= 
$$ Bruker specific parameters
$$ [...]
##$TP07= 0
##$TPNAME0= <>
##$TPNAME1= <>
##$TPNAME2= <>
##$TPNAME3= <>
##$TPNAME4= <>
##$TPNAME5= <>
##$TPNAME6= <>
##$TPNAME7= <>
##$TPOAL= (0..7)
0.5 0.5 0.5 0.5 0.5 0.5 0.5 0.5
##$TPOFFS= (0..7)
0 0 0 0 0 0 0 0
##$TUNHIN= 0
##$TUNHOUT= 0
##$TUNXOUT= 0
##$USERA1= <user>
##$USERA2= <user>
##$USERA3= <user>
##$USERA4= <user>
##$USERA5= <user>
##$V9= 5
##$VALIST= <valist>
##$VCLIST= <CCCCCCCCCCCCCCC>
##$VD= 0
##$VDLIST= <DDDDDDDDDDDDDDD>
##$VPLIST= <PPPPPPPPPPPPPPP>
##$VTLIST= <TTTTTTTTTTTTTTT>
##$WBST= 1024
##$WBSW= 4
##$XGAIN= (0..3)
0 0 0 0
##$XL= 0
##$YL= 0
##$YMAX_a= 13525947
##$YMIN_a= -5911156
##$ZGOPTNS= <>
##$ZL1= 120
##$ZL2= 120
##$ZL3= 120
##$ZL4= 120
##$ABSF1= 14.96874
##$ABSF2= -5.58379
##$ABSG= 5
##$ABSL= 3
##$ALPHA= 0
##$AQORDER= 0
##$ASSFAC= 0
##$ASSFACI= 0
##$ASSFACX= 0
##$ASSWID= 0
##$AUNMP= <proc_prof1d_extract.lims>
##$AXLEFT= 0
##$AXNAME= <>
##$AXNUC= <1H>
##$AXRIGHT= 0
##$AXTYPE= 0
##$AXUNIT= <>
##$AZFE= 0.1
##$AZFW= 0.1
##$BCFW= 0
##$BC_mod= 0
##$BYTORDP= 0
##$COROFFS= 0
##$CY= 15
##$DATMOD= 1
##$DC= 0
##$DFILT= <>
##$DTYPP= 0
##$F1P= 0
##$F2P= 0
##$FCOR= 0.5
##$FTSIZE= 131072
##$FT_mod= 6
##$GAMMA= 0
##$GB= 0
##$INTBC= 1
##$INTSCL= 1
##$ISEN= 128
##$LB= 0.3
##$LEV0= 0
##$LPBIN= 0
##$MAXI= 10000
##$MC2= 0
##$MEAN= 0
##$ME_mod= 0
##$MI= 0
##$NCOEF= 0
##$NC_proc= -3
##$NLEV= 6
##$NOISF1= 0
##$NOISF2= 0
##$NSP= 0
##$NTH_PI= 0
##$NZP= 0
##$OFFSET= 14.96874
##$PC= 1
##$PHC0= 30.92102
##$PHC1= 0
##$PH_mod= 1
##$PKNL= yes
##$PPARMOD= 0
##$PPDIAG= 0
##$PPIPTYP= 0
##$PPMPNUM= 2147483647
##$PPRESOL= 1
##$PSCAL= 4
##$PSIGN= 0
##$PYNMP= <proc.py>
##$REVERSE= no
##$SF= 400.130004751336
##$SI= 131072
##$SIGF1= 0
##$SIGF2= 0
##$SINO= 400
##$SIOLD= 131072
##$SPECTYP= <>
##$SREGLST= <1H.CDCl3>
##$SSB= 0
##$STSI= 131072
##$STSR= 0
##$SW_p= 8223.68421052632
##$SYMM= 0
##$S_DEV= 0
##$TDeff= 65536
##$TDoff= 0
##$TI= <>
##$TILT= no
##$TM1= 0
##$TM2= 0
##$TOPLEV= 0
##$USERP1= <user>
##$USERP2= <user>
##$USERP3= <user>
##$USERP4= <user>
##$USERP5= <user>
##$WDW= 1
##$XDIM= 131072
##$YMAX_p= 476917033
##$YMIN_p= -406036554
##$CURPLOT= <Network HP LaserJet P1505>
##$CURPRIN= <$Network HP LaserJet P1505>
##$DFORMAT= <normdp>
##$LAYOUT= <+/1D_H.xwp>
##$LFORMAT= <normlp>
##$PFORMAT= <normpl>
##$SURQMSG= 1
$$ End of Bruker specific parameters
$$ ---------------------------------
##NTUPLES= NMR SPECTRUM
##VAR_NAME=  FREQUENCY,     SPECTRUM/REAL,   SPECTRUM/IMAG
##SYMBOL=    X,             R,               I
##VAR_TYPE=  INDEPENDENT,   DEPENDENT,       DEPENDENT
##VAR_FORM=  AFFN,          ASDF,            ASDF
##VAR_DIM=   131072,        131072,          131072
##UNITS=     HZ,            ARBITRARY UNITS, ARBITRARY UNITS
##FACTOR=    0.0627417313425165, 1,          1
##FIRST=     8223.62146879498, 2008,         -101686
##LAST=      0,             6698,            -102429
##MIN=       0,             -406036554,      0
##MAX=       8223.62146879498, 476917033,    0
$$ Real data points
##PAGE= N=1
##DATA TABLE= (X++(R..R)), XYDATA
$$ [...]
62940C154274R29R124J6368K2580K7695L2305L7231M2258M6078M7662M7169M5427
$$ 3154274 3155203 3164327 3180695 3203275 3230970 3263275 3300506 3342764 3388842 3436504 3483673 3529100
62928C529100M3237M1210L9430L7059L3149K7985K2637J6860Q801k475j5192k6831
$$ 3529100 3572337 3613547 3652977 3690036 3723185 3751170 3773807 3790667 3799468 3796993 3781801 3754970
62916C754970l7028m7288n8369o9364p9273q7981r5320j00367j02417j02091j00716
$$ 3754970 3717942 3670654 3612285 3542921 3463648 3375667 3280347 3179980 3077563 2975472 2874756
62905B874756r8932r6419r2992q9341q6314q3620p9825p4041o7269o1389n6866
$$ 2874756 2775824 2679405 2586413 2497072 2410758 2327138 2247313 2173272 2106003 2044614 1987748
62894A987748n2390m7017m1646l7607l4631l1425k7917k5503k4868k4710k3361
$$ 1987748 1935358 1888341 1846695 1809088 1774457 1743032 1715115 1689612 1664744 1640034 1616673
62883A616673k0907j8887j8239j8453j8621j8525j8225j7324j5477j3444j2680
$$ 1616673 1595766 1576879 1558640 1540187 1521566 1503041 1484816 1467492 1452015 1438571 1425891
62872A425891j3552j4739j4903j4222j3531j2689j1211j0046j0943j3538j4848
$$ 1425891 1412339 1397600 1382697 1368475 1354944 1342255 1331044 1320998 1310055 1296517 1281669
62861A281669j2765q905o637o944p782p244n900n558o763q274q710q134p722p911
$$ 1281669 1268904 1259999 1253362 1246418 1238636 1231392 1225492 1219934 1213171 1204897 1196187 1188053 1180331 1172420
62847A172420p475n259k537k156m805p587p577n489m190m368l976j767Q09J904
$$ 1172420 1164945 1159686 1157149 1154993 1150188 1142601 1135024 1129535 1125345 1120977 1117001 1115234 1116043 1117947
62833A117947J497L84j404l846n758n955m989m455m779m827l691j878o65q76k418
$$ 1117947 1119444 1119828 1118424 1114578 1108820 1102865 1097876 1093421 1088642 1083815 1080124 1078246 1077581 1076705 1074287
62818A074287m435n818n939n006l672k472j809k006k905l692l639k922k390k663
$$ 1074287 1069852 1064034 1058095 1053089 1049417 1046945 1045136 1043130 1040225 1036533 1032894 1029972 1027582 1024919
62804A024919l734m997n365l850q01J849K265N62j596k976l475l242k254r81m17
$$ 1024919 1021185 1016188 1010823 1006973 1006172 1008021 1010286 1010848 1009252 1006276 1002801 999559 997305 996324 995907
62789I95907r15j732k138k252k387k301j728j014n57j43N66J351J869K213K380
$$ 995907 994992 993260 991122 988870 986483 984182 982454 981440 980883 980740 981306 982657 984526 986739 989119
62774I89119J805M00n29L66K458L701L184K021J606K252L642N315O248N346L086
$$ 989119 990924 991324 990795 991161 993619 997320 1000504 1002525 1004131 1006383 1010025 1015340 1021588 1026934 1030020
62759A030020J479J616K280K017J386J921L655N236O051O638P196P178O599O600
$$ 1030020 1031499 1033115 1035395 1037412 1038798 1040719 1044374 1049610 1055661 1062299 1069495 1076673 1083272 1089872
62745A089872Q259J1515J5285J8094J8901J8169J7858J9356K1703K3046K3472
$$ 1089872 1098131 1109646 1124931 1143025 1161926 1180095 1197953 1217309 1239012 1262058 1285530
62734A285530K4908K8214L2142L5426L8254M1095M3824M6806N1248N7242O2794
$$ 1285530 1310438 1338652 1370794 1406220 1444474 1485569 1529393 1576199 1627447 1684689 1747483
62723A747483O6255O8771P2991P9937Q8341R6407J03113J08427J13470J19856
$$ 1747483 1813738 1882509 1955500 2035437 2123778 2220185 2323298 2431725 2545195 2665051
62713B665051J27620J34345J37634J37859J37070J35556J31340J23017J11354
$$ 2665051 2792671 2927016 3064650 3202509 3339579 3475135 3606475 3729492 3840846
62704C840846R7616Q1719O2928M1520J9048k670k2564m0829n8509p6125r2686
$$ 3840846 3938462 4020181 4083109 4124629 4143677 4141007 4118443 4077614 4019105 3942980 3850294
62693C850294j06588j17204j24987j30327j33309j34441j34456j33364j30701
$$ 3850294 3743706 3626502 3501515 3371188 3237879 3103438 2968982 2835618 2704917
62684B704917j26726j22199j16939j10021j01817r4465q9394q5450q0365p3424
$$ 2704917 2578191 2455992 2339053 2229032 2127215 2032750 1943356 1857906 1777541 1704117
62674A704117o5849n9129n3811m9545m5516m1027l6101l1431k7547k4398k1754
$$ 1704117 1638268 1579139 1525328 1475783 1430267 1389240 1353139 1321708 1294161 1269763 1248009
62663A248009j9440j7037j4178j1330r412q320o806m317j808oJ989N234Q936J1493
$$ 1248009 1228569 1211532 1197354 1186024 1176612 1168292 1161486 1157169 1155361 1155355 1157344 1162578 1171514 1183007
62649A183007J3003J5259J9187K3691K7250K9767L2420L6400M2067M8725N5109
$$ 1183007 1196010 1211269 1230456 1254147 1281397 1311164 1343584 1379984 1422051 1470776 1525885
62638A525885O0413O4909O9191P3227P6854Q0812Q6077R2069R6576R7881R6222
$$ 1525885 1586298 1651207 1720398 1793625 1870479 1951291 2037368 2129437 2226013 2323894 2420116
62627B420116R2748Q7881Q1243P2583O2175N0495L7931K4502R806o254k2548l7203
$$ 2420116 2512864 2600745 2681988 2754571 2816746 2867241 2905172 2929674 2939480 2933226 2910678 2873475
62615B873475m9511o0678p1954q2597r0532r4855r6764r7931r8712r8261r5902
$$ 2873475 2823964 2763286 2691332 2608735 2518203 2423348 2326584 2228653 2129941 2031680 1935778
62604A935778r1987q7570q3434p9488p5149p0294o5505o1229n7146n2858m8767
$$ 1935778 1843791 1756221 1672787 1593299 1518150 1447856 1382351 1321122 1263976 1211118 1162351
62593A162351m5544m2956m0072l6654l3418l0728k8040k5105k2744k1624k1040
$$ 1162351 1116807 1073851 1033779 997125 963707 932979 904939 879834 857090 835466 814426
62582H14426j9921j8488j7729j7527j6587j4298j1566r454q037p071o762p205
$$ 814426 794505 776017 758288 740761 724174 709876 698310 688856 680819 673748 666986 659781
62570F59781p778p862p620p283o251l833o63J491J545J36j137j127J12J524K082
$$ 659781 652003 644141 636521 629238 622987 619154 618491 619982 621527 621663 620526 619399 619511 621035 623117
62555F23117J909K226L842O078P776Q896J0305J2167J3653J4392J5110J6420J7893
$$ 623117 625026 627252 631094 637172 644948 653844 664149 676316 689969 704361 719471 735891 753784
62542G53784J9091K0762K4018K8558L2722L5467L7586M0529M4534M8592N2099
$$ 753784 772875 793637 817655 846213 878935 914402 951988 992517 1037051 1085643 1137742
62531A137742N5708O0173O4793O7885O8619O7721O6254O4573O2670O0478N7143
$$ 1137742 1193450 1253623 1318416 1386301 1454920 1522641 1588895 1653468 1716138 1776616 1833759
62520A833759N0960M1182K9453J8322Q613o76j0325j9989k9276l8119m5872n1454
$$ 1833759 1884719 1925901 1955354 1973676 1982289 1981613 1971288 1951299 1922023 1883904 1838032 1786578
62508A786578n4940n7703o0353o1735o0811n8304n5522n2650m9395m6478m4845
$$ 1786578 1731638 1673935 1613582 1551847 1491036 1432732 1377210 1324560 1275165 1228687 1183842
62497A183842m3806m1478l7230l2595k9542k8584k8764k8797k7938k6177k3838
$$ 1183842 1140036 1098558 1061328 1028733 999191 970607 941843 913046 885108 858931 835093
62486H35093k1068j7966j5168j3552j2932j1967j0017q228p786p954p178n408
$$ 835093 814025 796059 780891 767339 754407 742440 732423 724195 716409 708455 701277 695869
62474F95869l691j928R45M428O246N523M420N353P874R766J0317J0971J2905J5442
$$ 695869 692178 690250 691195 695623 701869 707392 711812 717165 725039 734805 745122 756093 768998 784440
62460G84440J7132J7637J8133K0067K3657K7622L0635L2936L5915M0054M4134
$$ 784440 801572 819209 837342 857409 881066 908688 939323 972259 1008174 1048228 1092362
62449A092362M6896M8611N0308N2134N3304N3179N1589M8512M4237L9480L4509
$$ 1092362 1139258 1187869 1238177 1290311 1343615 1396794 1448383 1496895 1541132 1580612 1615121
62438A615121K8537K0848J2081L362n380j4880k4455l2041l6676l9495m1749m3149
$$ 1615121 1643658 1664506 1676587 1679949 1674569 1659689 1635234 1603193 1566517 1527022 1485273 1442124
62426A442124m3137m2595m2883m3780m3649m1572l8276l4955l2148k9946k8491
$$ 1442124 1398987 1356392 1313509 1269729 1226080 1184508 1146232 1111277 1079129 1049183 1020692
62415A020692k7720k6986k5368k2413j8491j4490j1188q893p623p341p662p537
$$ 1020692 992972 965986 940618 918205 899714 885224 874036 865143 857520 850179 842517 834980
62403H34980n956l094j69K021L765N378O491P003P779R415J1080J1762J2042J3154
$$ 834980 829024 825930 825761 827782 831547 836925 843416 850419 858198 867613 878693 890455 902497 915651
62389I15651J4658J4720J2747J0130Q068O259M315K770J667l49m111q284j1075
$$ 915651 930309 945029 957776 967906 975974 982233 986548 989318 990985 990636 986525 978241 967166
62376I67166j2774j4906j7477j8869j8372j7150j6463j6351j6406j6511j6225
$$ 967166 954392 939486 922009 903140 884768 867618 851155 834804 818398 801887 785662
62365G85662j4699j1923r189p546o547n313m206m321n535n984l824Q31N952R361
$$ 785662 770963 759040 749851 742305 735758 730445 726239 721918 716383 710399 706575 707406 713358 722719
62351G22719J0460J0302J0226J0721J1588J2564J3266J3090J2030J1279J1972
$$ 722719 733179 743481 753707 764428 776016 788580 801846 814936 826966 838245 850217
62340H50217J3347J3331J1275Q866P758P413O219L762Q90j761m067n568n626m489
$$ 850217 863564 876895 888170 897036 904794 912207 918426 922188 923078 921317 917250 911682 906056 901567
62326I01567l228k489k049j569r08L32K577N345P431Q402R213J0975J3864J7597
$$ 901567 898339 895850 893801 892232 891324 891656 894233 899578 907009 915411 924624 935599 949463 967060
62312I67060K2122K7122L1577L4790L7530M1295M6589N2643N8564O3844O7879
$$ 967060 989182 1016304 1047881 1082671 1120201 1161496 1208085 1260728 1319292 1383136 1451015
62301A451015P0111P0927P1426P1874P1164O8427O4208N9182N2561M3205L1959
$$ 1451015 1521126 1592053 1663479 1735353 1806517 1874944 1939152 1998334 2050895 2094100 2126059
62290B126059K1277J2224L332o838j7200k5337l0474l3995l7456m1274m5255m9163
$$ 2126059 2147336 2159560 2162892 2156054 2138854 2113517 2083043 2049048 2011592 1970318 1925063 1875900
62278A875900n2495n4625n5501n5538n4687n2496m9297m6340m4215m2049l9078
$$ 1875900 1823405 1768780 1713279 1657741 1603054 1550558 1501261 1454921 1410706 1368657 1329579
62267A329579l6107l4306l3115l0725k6686k2705k0419j9344j7814j5205j2406
$$ 1329579 1293472 1259166 1226051 1195326 1168640 1145935 1125516 1106172 1088358 1073153 1060747
62256A060747j0352r004p892o956o465o501o863p289p533p473p359p691q479q995
$$ 1060747 1050395 1041391 1033499 1026543 1020078 1013577 1006714 999425 991892 984419 977060 969369 960890 951895
62242I51895q722q260q489r068q811p675p076p688q135o910m595k886k177j607
$$ 951895 943173 934913 926424 917356 908545 900870 893794 886106 877971 871061 866466 863580 861403 859796
62228H59796q67k34R26L648P199R388R634R888J1593J3589J4313J4467J5730J7998
$$ 859796 858929 858695 859621 863269 870468 879856 889490 899378 910971 924560 938873 953340 969070 987068
62214I87068J9849K1081K2816K5305K7389K8355K8896L0011L2004L4780L8152
$$ 987068 1006917 1027998 1050814 1076119 1103508 1131863 1160759 1190770 1222774 1257554 1295706
62203A295706M1748M5401M9503N4036N7599N8624N7622N6770N7013N6777N3912
$$ 1295706 1337454 1382855 1432358 1486394 1543993 1602617 1660239 1717009 1774022 1830799 1884711
62192A884711M7820L9371K9840K0535J2328M846l145j2064k0932k8735l5401m0964
$$ 1884711 1932531 1971902 2001742 2022277 2034605 2039451 2036306 2024242 2003310 1974575 1939174 1898210
62180A898210m5008m7606m9800n2163n3762n3468n1533m8906m5830m2290l9151
$$ 1898210 1853202 1805596 1755796 1703633 1649871 1596403 1544870 1495964 1450134 1407844 1368693
62169A368693l7290l5963l3414k9180k4632k1094j8603j6648j5030j3573j1891
$$ 1368693 1331403 1295440 1262026 1232846 1208214 1187120 1168517 1151869 1136839 1123266 1111375
62158A111375r997q455p463o406m786l046j947j523j222p66k40N35K102M568P124
$$ 1111375 1101378 1092923 1085460 1079054 1074268 1071222 1069275 1067752 1066530 1065764 1065524 1066059 1068161 1072729 1079853
62143A079853Q690R037R023R582J0724J1834J2790J4216J6494J9075K1178K2677
$$ 1079853 1088543 1097580 1106603 1116185 1126909 1138743 1151533 1165749 1182243 1201318 1222496 1245173
62131A245173K3803K4410K4297K3958K4151K4847K5316K5341K5468K5855K5694
$$ 1245173 1268976 1293386 1317683 1341641 1365792 1390639 1415955 1441296 1466764 1492619 1518313
62120A518313K4219K1816J9793J9423K1312K4971K8829L1351L2739L4799L8687
$$ 1518313 1542532 1564348 1584141 1603564 1624876 1649847 1678676 1710027 1742766 1777565 1816252
62109A816252M3394M7086M9206N0392N0968N0514M8664M5352M0481L4385K8431
$$ 1816252 1859646 1906732 1955938 2006330 2057298 2107812 2156476 2201828 2242309 2276694 2305125
62098B305125K3905K0188J5286Q540J729l069n718p477r190j0963j2910j5067
$$ 2305125 2329030 2349218 2364504 2373044 2374773 2371704 2365986 2358509 2349319 2338356 2325446 2310379
62086B310379j6877j7699j7653j7294j6697j5714j4813j4538j4253j2556r374
$$ 2310379 2293502 2275803 2258150 2240856 2224159 2208445 2193632 2179094 2164841 2152285 2142911
62075B142911o645o264p935r678r978q775o679m005q34K467N206O945Q012R224
$$ 2142911 2136266 2130002 2122067 2112389 2102411 2093636 2086957 2082952 2082118 2084585 2089791 2096736 2104748 2113972
62061B113972J1030J3106J4998J6910J9427K2529K5295K6786K7047K7149K8423
$$ 2113972 2125002 2138108 2153106 2170016 2189443 2211972 2237267 2264053 2291100 2318249 2346672
62050B346672L1406L5270L8425M0141M1266M2931M4892M6101M6769M8602N2534
$$ 2346672 2378078 2413348 2451773 2491914 2533180 2576111 2621003 2667104 2713873 2762475 2815009
62039B815009N7224O0607O2272O3511O5470O7864O9372O8846O6516O4338O4550
$$ 2815009 2872233 2932840 2995112 3058623 3124093 3191957 3261329 3330175 3396691 3461029 3525579
62028C525579O7271P0203P1311P1199P1825P3500P4537P3697P1628O9600O8121
$$ 3525579 3592850 3663053 3734364 3805563 3877388 3950888 4025425 4099122 4170750 4240350 4308471
62017D308471O7312O7528O8629O9427O8815O7373O6972O8743P1954P4955P6887
$$ 4308471 4375783 4443311 4511940 4581367 4650182 4717555 4784527 4853270 4925224 5000179 5077066
62006E077066P8182P9534Q0686Q0498P8227P4490P0613O7298O4250O1040N7810
$$ 5077066 5155248 5234782 5315468 5395966 5474193 5548683 5619296 5686594 5750844 5811884 5869694
61995E869694N4891N2183M9182M5577M1686L8275L5860L4240L2892L1948L2248
$$ 5869694 5924585 5976768 6025950 6071527 6113213 6151488 6187348 6221588 6254480 6286428 6318676
61984F318676L4015L5960L6436L5331L4026L3553L3651L3766L3916L4151L3919
$$ 6318676 6352691 6388651 6425087 6460418 6494444 6527997 6561648 6595414 6629330 6663481 6697400
61973F697400L2771L1130K9657K8200K6115K3321K0322J7253J3709R694O013L385
$$ 6697400 6730171 6761301 6790958 6819158 6845273 6868594 6888916 6906169 6919878 6929572 6935585 6938970
61961F938970J524m58k937n405p215q409r647j1320j2873j3182j1776r631q545
$$ 6938970 6940494 6940036 6937099 6931694 6924479 6916070 6906423 6895103 6882230 6869048 6857272 6847641 6839096
61948F839096r417j1173j1562r188m779m34K220L035K963L195M510O670Q255P784
$$ 6839096 6829679 6818506 6806944 6797756 6792977 6792543 6794763 6797798 6800761 6803956 6808466 6815136 6823391 6831175
61934F831175N477L263K564K566J470j055l625n133n991p285r496j2275j4749
$$ 6831175 6836652 6839915 6842479 6845045 6846515 6845460 6841835 6836702 6830711 6823426 6813930 6801655 6786906
61921F786906j6080j6411j7311k0302k4792k8534l0440l1824l4304l7587m0286
$$ 6786906 6770826 6754415 6737104 6716802 6692010 6663476 6633036 6601212 6566908 6529321 6489035
61910F489035m1978m3387m5110m7185m9433n1296n1841n1017n0379n1290n2715
$$ 6489035 6447057 6403670 6358560 6311375 6261942 6210646 6158805 6107788 6057409 6006119 5953404
61899E953404n2334m9756m7088m6045m6038m5769m5095m4264m2526l9026l4445
$$ 5953404 5901070 5851314 5804226 5758181 5712143 5666374 5621279 5577015 5534489 5495463 5461018
61888E461018l0318k7087k4110k1452k0108k0053j9365j6182j0938n797k221K19
$$ 5461018 5430700 5403613 5379503 5358051 5337943 5317890 5298525 5282343 5271405 5265608 5263387 5263606
61876E263606K693N604Q554J1515J5409K1166K8252L4747L9203M2229M5767N1055
$$ 5263606 5266299 5271903 5280457 5291972 5307381 5328547 5356799 5391546 5430749 5472978 5518745 5569800
61864E569800N7904O5723P4321Q3413R2351J01110J11066J23955J40192J58794
$$ 5569800 5627704 5693427 5767748 5851161 5943512 6044622 6155688 6279643 6419835 6578629
61854F578629J78852K00514K24652K52065K82982L16986L53631L93439M37798
$$ 6578629 6757481 6957995 7182647 7434712 7717694 8034680 8388311 8781750 9219548
61845I219548M87152N39725N93086O46676P01339P56090Q06562Q46975Q72153
$$ 9219548 9706700 10246425 10839511 11486187 12187526 12943616 13750178 14597153 15469306
61836A5469306Q76530Q52721P93364O95056N60064L94854K08305J1340j83517
$$ 15469306 16345836 17198557 17991921 18686977 19247041 19641895 19850200 19861540 19678023
61827A9678023l64111n21102o49039p45811q11628q48722q61510q55976q37616
$$ 19678023 19313912 18792810 18143771 17397960 16586332 15737610 14876100 14020124 13182508
61818A3182508q09631p73505p31253o86164o41109n97125n54279n12992m73743
$$ 13182508 12372877 11599372 10868119 10181955 9540846 8943721 8389442 7876450 7402707
61809G402707m36348m00618l67156l36534l08232k81440k56308k33331k12056
$$ 7402707 6966359 6565741 6198585 5862051 5553819 5272379 5016071 4782740 4570684
61800D570684j91677j72525j55529j40598j26955j14794j04899r6689q8474p9872
$$ 4570684 4379007 4206482 4050953 3910355 3783400 3668606 3563707 3467018 3378544 3298672
61790C298672p2234o6171o0466n4098m7676m1996l6743l1656k7583k5092k3287
$$ 3298672 3226438 3160267 3099801 3045703 2998027 2956031 2919288 2887632 2860049 2834957 2811670
61779B811670k1148j9027j7415j5396j1816p432m246k922k071j26K938N670O455
$$ 2811670 2790522 2771495 2754080 2738684 2726868 2719436 2715190 2712268 2710197 2710071 2713009 2718679 2725134
61766B725134N245M294O334J1341J6169J8148J7977J8076J9477K1806K5036K9164
$$ 2725134 2730379 2734673 2741007 2752348 2768517 2786665 2804642 2822718 2842195 2864001 2889037 2918201
61754B918201L2977L5407L7746M2337M9124N5664O0744O5759P1951P8573Q4734
$$ 2918201 2951178 2986585 3024331 3066668 3115792 3171456 3232200 3297959 3369910 3448483 3533217
61743C533217R1220R9156J08207J17445J26907J37003J47338J57394J67801J79705
$$ 3533217 3624437 3723593 3831800 3949245 4076152 4213155 4360493 4517887 4685688 4865393
61733D865393J93299K07978K23544K40296K58275K77436K98521L22827L51143
$$ 4865393 5058692 5266670 5490214 5730510 5988785 6266221 6564742 6887569 7238712
61724G238712L83341M19043M58162N00933N48048O00733O60227P27069Q00941
$$ 7238712 7622053 8041096 8499258 9000191 9548239 10148972 10809199 11536268 12337209
61715A2337209Q81066R66522J056424J149982J246073J342308J434541J517076
$$ 12337209 13218275 14184797 15241221 16391203 17637276 18979584 20414125 21931201
61707B1931201J582771J622392J624418J576419J467682J292088J050621P52675
$$ 21931201 23513972 25136364 26760782 28337201 29804883 31096971 32147592 32900267
61699C2900267M15023N8630k94459o23053r08894j139868j312218j429227j497467
$$ 32900267 33315290 33373920 33079461 32456408 31547514 30407646 29095428 27666201 26168734
61690B6168734j524193j517101j484429j433890j371361j300857j225343j147183
$$ 26168734 24644541 23127440 21643011 20209121 18837760 17536903 16311560 15164377
61682A5164377j068084r89352r12492q39346p71250p08142o48868n92627n39858
$$ 15164377 14096293 13106941 12194449 11355103 10583853 9875711 9226843 8634216 8094358
61673H094358m91472m47583m07463l70506l36587l05610k77419k52328k30898
$$ 8094358 7602886 7155303 6747840 6377334 6040747 5735137 5457718 5205390 4974492
61664D974492k12818j96688j81316j66585j52676j39299j26518j15545j07384
$$ 4974492 4761674 4564986 4383670 4217085 4064409 3925110 3798592 3683047 3575663
61655C575663j00957r3797q4858p5735o8833o5059o3456o2217n9787n5734n1156
$$ 3575663 3474706 3380909 3296051 3220316 3151483 3086424 3022968 2960751 2900964 2845230 2794074
61644B794074m7742m5994m4757m2795m0174l7689l5793l4790l5388l7784m0488
$$ 2794074 2746332 2700338 2655581 2612786 2572612 2534923 2499130 2464340 2428952 2391168 2350680
61633B350680m1274l9574l6958l5034l3783l2419l0871k9599k8530k7219k5770
$$ 2350680 2309406 2269832 2232874 2197840 2164057 2131638 2100767 2071168 2042638 2015419 1989649
61622A989649k4814k4485k4159k3282k1845j9933j7433j4500j1962j0747j0925
$$ 1989649 1964835 1940350 1916191 1892909 1871064 1851131 1833698 1819198 1807236 1796489 1785564
61611A785564j1451j0938q786n773l407k501k477k334k070k647m613p326r611
$$ 1785564 1774113 1763175 1754389 1748616 1745209 1742708 1740231 1737897 1735827 1733180 1728567 1721241 1711630
61598A711630j0694j0340q770o752n351n121n737o567p252p537p112o090n259
$$ 1711630 1700936 1690596 1681826 1675074 1669723 1664602 1658865 1652298 1645046 1637509 1630397 1624307 1619048
61585A619048n269n788n927n359m525l848l264k613k093k045k342k168o92J882
$$ 1619048 1613779 1607991 1602064 1596705 1592180 1588332 1585068 1582455 1580362 1578317 1575975 1573807 1573115 1574997
61571A574997M176N063N074N666P137Q215Q003P203O759O303N146L952M017N133
$$ 1574997 1579173 1584236 1589310 1594976 1602113 1610328 1618331 1625534 1632293 1638596 1643742 1647694 1651711 1656844
61557A656844N636M581K720J062k86j544k622l594m900o474p437p284o691o538
$$ 1656844 1662480 1667061 1669781 1670843 1670557 1669013 1666391 1662797 1657897 1651423 1643986 1636702 1630011 1623473
61543A623473o829p246q095r740j1450j1846j0603q876p935p883p888p197n716
$$ 1623473 1616644 1609398 1601303 1591563 1580113 1568267 1557664 1548788 1540853 1532970 1525082 1517885 1512169
61530A512169l968k687k068j386L12L031N769P828R670J1980J4353J5748J6126
$$ 1512169 1508201 1505514 1503446 1502060 1502372 1505403 1511172 1519000 1528670 1540650 1555003 1570751 1586877
61517A586877J6795J8866K2097K5663K9222L2546L4959L6248L7657M0575M4428
$$ 1586877 1603672 1622538 1644635 1670298 1699520 1732066 1767025 1803273 1840930 1881505 1925933
61506A925933M7306M8708N0012N1803N2551N1067M8635M7089M6057M3989M1141
$$ 1925933 1973239 2021947 2071959 2123762 2176313 2227380 2276015 2323104 2369161 2413150 2454291
61495B454291L9313L8813L7856L5354L2391L0246K8452K5853K2407J8937J5816
$$ 2454291 2493604 2532417 2570273 2605627 2638018 2668264 2696716 2722569 2744976 2763913 2779729
61484B779729J2720R220N080N14l538o162p844j0167j3593j6453j7027j5781j4502
$$ 2779729 2792449 2801669 2806749 2807263 2803725 2797563 2789719 2779552 2765959 2749506 2732479 2716698 2702196
61471B702196j3743j2393r607o096l156j039J271M884R855J5308K0608K6064L2188
$$ 2702196 2688453 2676060 2666453 2660357 2657201 2656162 2657433 2662317 2672172 2687480 2708088 2734152 2766340
61458B766340L8698M4994N1501N9487O9312P9884R0336J01319J13826J27587J41583
$$ 2766340 2805038 2850032 2901533 2961020 3030332 3110216 3200552 3301871 3415697 3543284 3684867
61447C684867J55764J71222J88642K07358K26090K44226K62201K80714K99423
$$ 3684867 3840631 4011853 4200495 4407853 4633943 4878169 5140370 5421084 5720507
61438E720507L16484L29591L37340L38933L32789L16722K89959K54006K10917
$$ 5720507 6036991 6366582 6703922 7042855 7375644 7692366 7982325 8236331 8447248
61429H447248J61827J08147N3102N36m7470r0528j27961j58263j80715j96170
$$ 8447248 8609075 8717222 8770324 8770860 8723390 8632862 8504901 8346638 8165923 7969753
61419G969753k05920k10642k10738k06813j99413j88934j76085j61827j46630
$$ 7969753 7763833 7553191 7342453 7135640 6936227 6747293 6571208 6409381 6262751
61410F262751j30415j13508r6892q1041o5201m8510l1508j5791k288R434K0157
$$ 6262751 6132336 6018828 5921936 5840895 5775694 5727184 5695676 5679885 5677597 5687031 5707188
61399E707188K9924L8325M5466N2045N8496O4465O9305P2635P4204P3790P1789
$$ 5707188 5737112 5775437 5820903 5872948 5931444 5995909 6065214 6137849 6212053 6285843 6357632
61388F357632O9616O8732O9297P0421P1517P2510P2870P1784O9657O8189O8074
$$ 6357632 6427248 6495980 6565277 6635698 6707215 6779725 6852595 6924379 6994036 7062225 7130299
61377G130299O7751O5454O1683N8191N5112N0670M3736L5246K6683J8271R377
$$ 7130299 7198050 7263504 7325187 7383378 7438490 7489160 7532896 7568142 7594825 7613096 7622473
61366G622473k3q992j6559k2733k8592l5324m2847m9379n2813n2556m9870m6587
$$ 7622473 7622450 7613458 7596899 7574166 7545574 7510250 7467403 7418024 7365211 7312655 7262785 7216198
61354G216198m3741m1191l8073l3697k8299k2808j7806j3164r025o312n534n747
$$ 7216198 7172457 7131266 7093193 7059496 7031197 7008389 6990583 6977419 6968394 6962082 6956548 6950801
61342F950801n702n580o401q085r452j0050j0506j0728r171m639K308J0556K0223
$$ 6950801 6945099 6939519 6933118 6925033 6915581 6905531 6895025 6884297 6875126 6870487 6872795 6883351 6903574
61329F903574L2288M7079O4021Q2647J02983J25008J48323J72462J97222K22629
$$ 6903574 6935862 6982941 7046962 7129609 7232592 7357600 7505923 7678385 7875607 8098236
61319H098236K48640K74601K98886L19502L35384L46752L53788L54964L47158
$$ 8098236 8346876 8621477 8920363 9239865 9575249 9922001 10275789 10630753 10977911
61310A0977911L27622K95990K54370K05578J51402R2979L2574k6079p9992j28803
$$ 10977911 11305533 11601523 11855893 12061471 12212873 12305852 12338426 12312347 12232355 12103552
61300A2103552j73526k14024k49057k78320l02690l22275l36087l44355l49290
$$ 12103552 11930026 11716002 11466945 11188625 10885935 10563660 10227573 9883218 9533928
61291I533928l52202l51331l44329l31936l17295l02159k85808k67616k48494
$$ 9533928 9181726 8830395 8486066 8154130 7836835 7534676 7248868 6981252 6732758
61282F732758k29198k09103j87878j66958j47854j29900j11250r1818p3567n7708
$$ 6732758 6503560 6294457 6106579 5939621 5791767 5661867 5550617 5458799 5385232 5327524
61272E327524m3070k7892j2333J914J3934K4497L4610M4085N1861N7196O0246
$$ 5327524 5284454 5256562 5244229 5246143 5260077 5284574 5319184 5363269 5415130 5472326 5532572
61261E532572O1869O3194O4868O6256O5766O2641N8185N4463N1882M9014M4853
$$ 5532572 5594441 5657635 5722503 5788759 5854525 5917166 5975351 6029814 6081696 6130710 6175563
61250F175563M0145L5824L1129K4518J6067P702Q04n375j2350k0069k6921l1963
$$ 6175563 6215708 6251532 6282661 6307179 6323246 6330948 6331752 6326377 6314027 6293958 6267037 6235074
61238F235074l6364m2172m9820n7420o2759o5823o8706p2863p7021p8598p6997
$$ 6235074 6198710 6156538 6106718 6049298 5986539 5920716 5852010 5779147 5702126 5623528 5546531
61227E546531p4440p3106p2398o9952o4887n8709n3032m7829m2607l7997l4822
$$ 5546531 5472091 5398985 5326587 5256635 5191748 5133039 5080007 5032178 4989571 4951574 4916752
61216D916752l2233k8593k4160k1281k1167k1983k1304j9460j8936k0733k2944
$$ 4916752 4884519 4855926 4831766 4810485 4789318 4767335 4746031 4726571 4707635 4686902 4663958
61205D663958k3114k0837j7478j4282j1455q476m634N83P120J4569K2942L2873
$$ 4663958 4640844 4620007 4602529 4588247 4576792 4568316 4563682 4564265 4571385 4585954 4608896 4641769
61193D641769M4752N8101P2215Q7052J02747J18413J32097J42311J49133J53566
$$ 4641769 4686521 4744622 4816837 4903889 5006636 5125049 5257146 5399457 5548590 5702156
61183E702156J55880J54775J48097J34378J13823Q7939N8255K5422j0353m8019
$$ 5702156 5858036 6012811 6160908 6295286 6409109 6497048 6555303 6580725 6570372 6522353
61173F522353q5019j18109j44965j65146j79627j89591j95626j97859j96451j91726
$$ 6522353 6437334 6319225 6174260 6009114 5829487 5639896 5444270 5246411 5049960 4858234
61163D858234j84145j74554j64326j54712j45861j36906j27373j18009j09741
$$ 4858234 4674089 4499535 4335209 4180497 4034636 3897730 3770357 3652348 3542607
61154C542607j02101r3489q3136p2214o2678n5427m9848m4585l8399l0719k2125
$$ 3542607 3440506 3347017 3263881 3191667 3128989 3073562 3023714 2979129 2940730 2910011 2887886
61143B887886j4103p707k604J980N757P787Q292Q799R972J0525R046O031L104
$$ 2887886 2873783 2866076 2863472 2865452 2871209 2878996 2887288 2896087 2906059 2916584 2925630 2931661 2934765
61130B934765R81p71k558m543p175j0734j4555j7790k0597k3423k5604k6367k6816
$$ 2934765 2935746 2934975 2932417 2927874 2920699 2909965 2895410 2877620 2857023 2833600 2807996 2781629 2754813
61117B754813k8865l2014l3527l2496l1315l1847l2417l0678k7721k6859k9191
$$ 2754813 2725948 2693934 2660407 2627911 2596596 2564749 2532332 2501654 2473933 2447074 2417883
61106B417883l2873l6177l8840m0538m0533l9408l9069m0141m0999m0145l8206
$$ 2417883 2385010 2348833 2309993 2269455 2228922 2189514 2150445 2110304 2069305 2029160 1990954
61095A990954l6619l5729l5261l5682l7632m0355m1899m1073l8609l6230l4830
$$ 1990954 1954335 1918606 1883345 1847663 1810031 1769676 1727777 1686704 1648095 1611865 1577035
61084A577035l3786l2121l0105k9008k9001k8199k4792j9538j4871j1872r598
$$ 1577035 1543249 1511128 1481023 1452015 1423014 1394815 1370023 1350485 1335614 1323742 1314144
61073A314144p275n447m391l014k92L181O028P676Q389Q519Q526R123J0536J2061
$$ 1314144 1306869 1301422 1297031 1294017 1293725 1296906 1302934 1310610 1318999 1327518 1336044 1345167 1355703 1367764
61059A367764J2960J3283J3404J3433J3701J4960J7206J8937J8644J6704J4908
$$ 1367764 1380724 1394007 1407411 1420844 1434545 1449505 1466711 1485648 1504292 1520996 1535904
61048A535904J4392J4704J4649J3291J0414O731L524J485J80r62j663j608j503
$$ 1535904 1550296 1565000 1579649 1592940 1603354 1610085 1613609 1615094 1615274 1614312 1612649 1611041 1609538
61035A609538k192l100l000k301l034n999r302j0759j0737j1327j3127j4406j3765
$$ 1609538 1607346 1604246 1601246 1598945 1595911 1589912 1580610 1569851 1559114 1547787 1534660 1520254 1506489
61022A506489j2283j2037j3148j3600j2142j0165r937j1635j3177j2821j0916
$$ 1506489 1494206 1482169 1469021 1455421 1443279 1433114 1423177 1411542 1398365 1385544 1374628
61011A374628q942p777p415p638q084p985o614m161j736l97l56j054j741j926
$$ 1374628 1365686 1357909 1350494 1342856 1334772 1326787 1320173 1316012 1314276 1313879 1313523 1312469 1310728 1308802
60997A308802j439k97J368L093M098L897K990K588L392M890N989O281O529P888
$$ 1308802 1307363 1307066 1308434 1311527 1315625 1319522 1322512 1325100 1328492 1333382 1339371 1345652 1352181 1360069
60983A360069J0629J3721J5782J6454J6518J6792J7540J9104K2064K6083K9406
$$ 1360069 1370698 1384419 1400201 1416655 1433173 1449965 1467505 1486609 1508673 1534756 1564162
60972A564162L0628L0497L0934L2662L4977L7394M0031M2512M4163M5433M7676
$$ 1564162 1594790 1625287 1656221 1688883 1723860 1761254 1801285 1843797 1887960 1933393 1981069
60961A981069N1072N4303N6597N8671O1077O3378O5700O9482P5490Q2435Q8821
$$ 1981069 2032141 2086444 2143041 2201712 2262789 2326167 2391867 2461349 2536839 2619274 2708095
60950B708095R4984J01992J09699J17264J24668J32368J40375J48990J59412J72110
$$ 2708095 2803079 2905071 3014770 3132034 3256702 3389070 3529445 3678435 3837847 4009957
60940D009957J85570J98415K12018K29175K50752K75390L02014L30775L62184
$$ 4009957 4195527 4393942 4605960 4835135 5085887 5361277 5663291 5994066 6356250
60931F356250L97522M39895M92805N57659O34463P24030Q26768R40134J061786
$$ 6356250 6753772 7193667 7686472 8244131 8878594 9602624 10429392 11369526 12431312
60922A2431312J196159J353483J540353J755331J994875K253384K504978K687023
$$ 12431312 13627471 14980954 16521307 18276638 20271513 22524897 25029875 27716898
60914B7716898K718567K550717K202477J746806J267213Q32364M99581L12742
$$ 27716898 30435465 32986182 35188659 36935465 38202678 39035042 39534623 39847365
60906C9847365K72635L10559L10125J71801j35409n75155j079915j579484k008774
$$ 39847365 40120000 40430559 40740684 40912485 40777076 40201921 39122006 37542522 35533748
60897C5533748k314164k469401k486086k403146k263408k097544j923102j750212
$$ 35533748 33219584 30750183 28264097 25860951 23597543 21499999 19576897 17826685
60889A7826685j585083j430585j286853j152921j028532r15005q14276p26766
$$ 17826685 16241602 14811017 13524164 12371243 11342711 10427706 9613430 8886664
60881H886664o50557n83167n23706m72566m29145l90844l54711l19709k87171
$$ 8886664 8236107 7652940 7129234 6656668 6227523 5836679 5481968 5162259 4875088
60872D875088k59181k36593k18460k03052j89234j76880j66307j57599j50305
$$ 4875088 4615907 4379314 4160854 3957802 3768568 3591688 3425381 3267782 3117477
60863C117477j43495j36142j27865j19309j11480j04735r8626r2525q6020p8928
$$ 3117477 2973982 2837840 2709975 2590666 2479186 2374451 2275825 2183300 2097280 2018352
60853B018352p1426o4253n8335n4077n1166m8873m6263m2585l8059l3985l1393
$$ 2018352 1946926 1882673 1824338 1770261 1719095 1670222 1623959 1581374 1543315 1509330 1477937
60842A477937k9824k8145k6284k5057k4400k3034k0316j7284j5238j4043j2597
$$ 1477937 1448113 1419968 1393684 1368627 1344227 1321193 1300877 1283593 1268355 1254312 1241715
60831A241715j0493q465p333o929o121l841k91K954M402M058L083K335K022K445
$$ 1241715 1231222 1222757 1215424 1208495 1202374 1198533 1198242 1201196 1205598 1209656 1212739 1215074 1217096 1219541
60817A219541L830N296N260L481J674J305J672J179j90q40P8J376J152j175m372
$$ 1219541 1223371 1228667 1233927 1237408 1239082 1240387 1242059 1243238 1243048 1242208 1242286 1243662 1244814 1243639 1239267
60802A239267o583o798n375l430k008j699k591m112n091m632l000j218K17J697
$$ 1239267 1232684 1225886 1220511 1217081 1215073 1213374 1210783 1206671 1201580 1196948 1193948 1192730 1192947 1194644
60788A194644L632N798P664Q864R210Q812Q324Q659J0184J2395J4295J4919J3962
$$ 1194644 1198276 1204074 1211738 1220602 1229812 1238624 1246948 1255607 1265791 1278186 1292481 1307400 1321362
60775A321362J2372J1765J2354J2221R817O584N386O618P967Q154Q570J0363J2089
$$ 1321362 1333734 1345499 1357853 1370074 1379891 1386475 1391861 1398479 1406446 1414600 1423170 1433533 1445622
60762A445622J1824R973Q302P453O977O771O803O280M730L165K645K391J090p35
$$ 1445622 1457446 1467419 1475721 1483174 1490151 1496922 1503725 1510005 1514735 1517900 1520545 1522936 1524026 1523291
60748A523291j529j468k324m625o978q376r339j0450j1514j2592j4204j5882j6147
$$ 1523291 1521762 1520294 1517970 1513345 1506367 1497991 1488652 1478202 1466688 1454096 1439892 1424010 1407863
60735A407863j4760j3572j4191j5931j7002j6639j5206j3192j1044r149p107l855
$$ 1407863 1393103 1379531 1365340 1349409 1332407 1315768 1300562 1287370 1276326 1267177 1260070 1256215
60723A256215N51M109M962L699K519K639L690N219P445J0433J3574J6064J7403
$$ 1256215 1256766 1260875 1265837 1269536 1272055 1274694 1278384 1283603 1291048 1301481 1315055 1331119 1348522
60710A348522J7483J6825J6476J6927J7368J6816J5767J5616J6465J6730J5299
$$ 1348522 1366005 1382830 1399306 1416233 1433601 1450417 1466184 1481800 1498265 1514995 1530294
60699A530294J3002J1293J0376R538Q676Q467R056R513Q820P042N410N388P351
$$ 1530294 1543296 1554589 1564965 1574503 1583179 1591646 1600702 1610215 1619035 1626077 1631487 1636875 1644226
60686A644226R842J0456Q170M723K887L354M078L059P15j178k173l447n633p706
$$ 1644226 1654068 1664524 1672694 1677417 1680304 1683658 1687736 1690795 1691510 1690332 1688159 1684712 1679079 1671373
60672A671373q516q481q991j0599j2479j3472j3122j1892j0823j0725j1259j1014
$$ 1671373 1662857 1654376 1645385 1634786 1622307 1608835 1595713 1583821 1572998 1562273 1551014 1540000
60660A540000r150o733n667o329p155o826n873n509n736n674n386o072q248j0756
$$ 1540000 1530850 1524117 1518450 1512121 1504966 1498140 1492267 1486758 1481022 1475348 1469962 1463890 1455642 1444886
60646A444886j2164j2354j2077j1539j0370q736p398o564n595m194l029k684k663
$$ 1444886 1432722 1420368 1408291 1396752 1386382 1377646 1370248 1363684 1358089 1353895 1350866 1348182 1345519
60633A345519k133r94M20K085L695M049K368jr50p66k021n595q798r033p796q701
$$ 1345519 1343386 1342392 1342812 1344897 1348592 1352641 1355009 1355008 1354058 1353292 1351271 1345676 1336878 1327845 1320049 1311348
60617A311348j2300j5349j5389j3707j2857j3268j3796j4180j4984j5731j4929
$$ 1311348 1299048 1283699 1268310 1254603 1241746 1228478 1214682 1200502 1185518 1169787 1154858
60606A154858j2245r304p838p760p562o128l766j726r28j155j472j427j398j595
$$ 1154858 1142613 1133309 1125471 1117711 1110149 1104021 1100255 1098529 1097601 1096446 1094974 1093547 1092149 1090554
60592A090554j315n4J195Q81p42j461J73K945M584M490L834L435K800J448P6j02
$$ 1090554 1089239 1089185 1090380 1091261 1090519 1089058 1089231 1092176 1096760 1101250 1105084 1108519 1111319 1112767 1112843 1112741
60576A112741J300L494N251N886N780O125P714R942J1465J1961J2655J4748J7822
$$ 1112741 1114041 1117535 1122786 1128672 1134452 1140577 1148291 1158233 1169698 1181659 1194314 1209062 1226884
60563A226884K0377K1595K1975K2413K3294K4627K6357K8182K9316K8925K6960
$$ 1226884 1247261 1268856 1290831 1313244 1336538 1361165 1387522 1415704 1445020 1473945 1500905
60552A500905K4370K2351K1350K0819J9892J8110J5540J2490R361O473L599mm628
$$ 1500905 1525275 1547626 1568976 1589795 1609687 1627797 1643337 1655827 1665188 1671661 1675260 1675256 1670628
60539A670628r281j2574j4421j6068j8266k0257k1058k0797k0114j8923j6704
$$ 1670628 1661347 1648773 1634352 1618284 1600018 1579761 1558703 1537906 1517792 1498869 1482165
60528A482165j3659j0604p956n628l792k928l066l600l894l560k483j218j112
$$ 1482165 1468506 1457902 1449946 1444318 1440526 1437598 1434532 1430932 1427038 1423478 1420995 1419777 1418665
60515A418665k982n719p224o836n865n529n384m335k190M01K867M718N340M678
$$ 1418665 1415683 1409964 1402740 1395904 1390039 1384510 1379126 1374791 1372601 1373002 1375869 1380587 1385927 1390605
60501A390605L950M810P614J0954J2921J2763J1390J0472J0966J2380J3620J4407
$$ 1390605 1394555 1399365 1406979 1417933 1430854 1443617 1455007 1465479 1476445 1488825 1502445 1516852
60489A516852J5501J7519K0088K2379K4059K5453K7150K9690L3235L7371M1426
$$ 1516852 1532353 1549872 1569960 1592339 1616398 1641851 1669001 1698691 1731926 1769297 1810723
60478A810723M5013M7852M9230M8362M5365M0944L4897K6099J4613K759o999j4533
$$ 1810723 1855736 1903588 1952818 2001180 2046545 2087489 2122386 2148485 2163098 2165857 2158858 2144325
60466B144325k1131k6608k8983k7264k3132j9061j5585j1466o064n05L826P100
$$ 2144325 2123194 2096586 2067603 2040339 2017207 1998146 1982561 1971095 1965031 1964526 1968352 1975452
60454A975452J0651J5022J9230K2193K4243K6744L0629L5891M2107M8631N4607
$$ 1975452 1986103 2001125 2020355 2042548 2066791 2093535 2124164 2160055 2202162 2250793 2305400
60443B305400N9875O5864P4412Q5470R7156J08607J21511J37877J57327J77809
$$ 2305400 2365275 2431139 2505551 2591021 2688177 2796784 2918295 3056172 3213499 3391308
60433C391308J98260K19099K40482K61606K81931L01888L21934L41677L59915
$$ 3391308 3589568 3808667 4049149 4310755 4592686 4894574 5216508 5558185 5918100
60424E918100L74292L80367L72219L45301K98835K35058J56859O7193k9222j24835
$$ 5918100 6292392 6672759 7044978 7390279 7689114 7924172 8081031 8148224 8119002 7994167
60414G994167k11015k81275l33111l67393l86526l92983l88864l76271l57706
$$ 7994167 7783152 7501877 7168766 6801373 6414847 6021864 5633000 5256729 4899023
60405D899023l35846l12625k88773k64710k41603k20858k02545j85376j68626
$$ 4899023 4563177 4250552 3961779 3697069 3455466 3234608 3032063 2846687 2678061
60396B678061j53053j39267j26332j13154j00411q9600q0755p2688o5225n9314
$$ 2678061 2525008 2385741 2259409 2146255 2045844 1956244 1875489 1802801 1737576 1678262
60386A678262n4892n0572m5902m2097l9780l7631l4395l0721k7899k5935k4157
$$ 1678262 1623370 1572798 1526896 1484799 1445019 1407388 1372993 1342272 1314373 1288438 1264281
60375A264281k2573k1373j9991j7939j5806j4239j2758j0787r035q458q616q419
$$ 1264281 1241708 1220335 1200344 1182405 1166599 1152360 1139602 1128815 1119780 1111322 1102706 1094287
60363A094287p804p199n998l390k60J448J268N31K81L72O17J306K324L088L569
$$ 1094287 1086483 1079284 1073286 1069896 1069636 1071084 1072352 1072883 1073164 1073536 1074153 1075459 1077783 1080871 1084440
60348A084440M261N149N809O356O978O893N453M098N063P930R662Q770P242P296
$$ 1084440 1088701 1093850 1099659 1106015 1112993 1119886 1125339 1129437 1134500 1142430 1152092 1160862 1168104 1175400
60334A175400Q272Q376P820Q158R541J0619J0541R372O956L181o30k456k042j322
$$ 1175400 1183672 1192048 1199868 1208026 1217567 1228186 1238727 1248099 1255055 1258236 1257606 1255150 1253108 1251786
60320A251786j857l050l486k988k402k049j541r15r14j816k826l086k752k360
$$ 1251786 1249929 1246879 1243393 1240405 1238003 1235954 1234413 1233498 1232584 1230768 1227942 1224856 1222104 1219744
60306A219744j601K28K603L730K789J308J440L334N190N650N188N070N796O884
$$ 1219744 1218143 1218371 1220974 1224704 1227493 1228801 1230241 1233575 1238765 1244415 1249603 1254673 1260469 1267353
60292A267353P725Q240Q850R796J0591J0467R551R023R688J0867J1186J0035P758
$$ 1267353 1275078 1283318 1292168 1301964 1312555 1323022 1332573 1341596 1351284 1362151 1373337 1383372 1391130
60279A391130N083L005K436L078L274J990K31n45n05n71k62J551M199N641N459
$$ 1391130 1396213 1399218 1401654 1404732 1408006 1409996 1410227 1409682 1409177 1408606 1408344 1409895 1414094 1419735 1425194
60264A425194N297N923N975M396K224Q25j29j623l526n019n912o339o060n014
$$ 1425194 1430491 1436414 1442389 1446785 1449009 1449834 1449705 1448082 1444556 1439537 1433625 1427286 1421226 1416212
60250A416212l900l209k454j200j32j15q16j235j086q05o06l48P4Q48K302M238
$$ 1416212 1412312 1409103 1406649 1405449 1405317 1405202 1404386 1403151 1402065 1401260 1400654 1400306 1400380 1401228 1403530 1407768
60234A407768N656N657M278K087k72j754j157J422M085N061M566M072M321M978
$$ 1407768 1413424 1419081 1423359 1425446 1425174 1423420 1422263 1423685 1427770 1432831 1437397 1441469 1445790 1450768
60220A450768N769O839Q173R448J0587J1917J3760J5939J7653J7967J7014J6479
$$ 1450768 1456537 1463376 1471549 1480997 1491584 1503501 1517261 1533200 1550853 1568820 1585834 1602313
60208A602313J8047K1286K4167K5718K6961K8953L1405L3882L6855M0584M4264
$$ 1602313 1620360 1641646 1665813 1691531 1718492 1747445 1778850 1812732 1849587 1890171 1934435
60197A934435M7385N0811N5398O0594O5500P0247P5176P9814Q4034Q9194R6587
$$ 1934435 1981820 2032631 2088029 2148623 2214123 2284370 2359546 2439360 2523394 2612588 2709175
60186B709175J05589J14765J23888J33313J42345J50027J56829J63738J70250
$$ 2709175 2814764 2929529 3053417 3186730 3329075 3479102 3635931 3799669 3969919
60177C969919J75109J78351J80519J80360J75646J66300J54502J41588J27090
$$ 3969919 4145028 4323379 4503898 4684258 4859904 5026204 5180706 5322294 5449384
60168E449384J11155R5359Q0297O4560M7339L0255J5248K214r757k0001k6857
$$ 5449384 5560539 5655898 5736195 5800755 5848094 5878349 5893597 5895811 5886054 5866053 5839196
60157E839196l0030l0794l0023k7160k1328j2722k558Q130J9569L2879M8446O5018
$$ 5839196 5809166 5778372 5748349 5721189 5699861 5687139 5684581 5692711 5712280 5745159 5793605 5858623
60145E858623Q0994R6182J11372J26407J39949J51139J60075J66308J68317J65333
$$ 5858623 5939617 6035799 6147171 6273578 6413527 6564666 6724741 6891049 7059366 7224699
60135G224699J58482J49115J36770J20063R9187P6485N4403L3486J2553r510l2257
$$ 7224699 7383181 7532296 7669066 7789129 7888316 7964801 8019204 8052690 8065243 8055733 8023476
60124H023476n3953p3105q9249j02155j10918j14647j13604j08777j00702q9591
$$ 8023476 7969523 7896418 7807169 7705014 7594096 7479449 7365845 7257068 7156366 7066775
60114G066775p6303o1813m5927k7873q254J1003K8837M5686O1494P4816Q4728
$$ 7066775 6990472 6928659 6882732 6854859 6846605 6857608 6886445 6932131 6993625 7068441 7153169
60103G153169R2119R7814J00604R8616R1984Q2739P2410O0927M7909L3916K0202
$$ 7153169 7245288 7343102 7443706 7542322 7634306 7717045 7789455 7850382 7898291 7932207 7952409
60092G952409P833k664j0928j6180j7350j4134p525J468J3370K9333M8881P0132
$$ 7952409 7960242 7957578 7946650 7930470 7913120 7898986 7891461 7892929 7906299 7935632 7984513 8054645
60080H054645R2536J17532J45657J74802K02906K31017K61821K95829L30820L64608
$$ 8054645 8147181 8264713 8410370 8585172 8788078 9019095 9280916 9576745 9907565 10272173
60070A0272173L96761M27652M57259M84985N09451N28450N40136N44285N41503
$$ 10272173 10668934 11096586 11553845 12038830 12548281 13076731 13616867 14161152 14702655
60061A4702655N31517N13317M86812M52830M11530L62249L05432K43369J78379
$$ 14702655 15234172 15747489 16234301 16687131 17098661 17460910 17766342 18009711 18188090
60052A8188090J11190M1796k8916r9131j67004k30844k88690l38463l78480m07735
$$ 18188090 18299280 18341076 18312160 18213029 18046025 17815181 17526491 17188028 16809548 16401813
60042A6401813m25932m33598m31874m21995m04952l81473l51976l16603k75934
$$ 16401813 15975881 15542283 15110409 14688414 14283462 13901989 13550013 13233410 12957476
60033A2957476k31719j86468j42111r9438n8740k0440J4904M6488P2900R2488
$$ 12957476 12725757 12539289 12397178 12297740 12239000 12218560 12233464 12279952 12352852 12445340
60023A2445340J04476J09288J07477R8895Q3293O1445L5275P062k1374m9155p6371
$$ 12445340 12549816 12659104 12766581 12865476 12948769 13010214 13045489 13052551 13031177 12982022 12905651
60012A2905651j03392j29938j55054j77989j98637k16988k32729k45609k55504
$$ 12905651 12802259 12672321 12517267 12339278 12140641 11923653 11690924 11445315 11189811
60003A1189811k61678k62561k57071k45978k31420k15160j97663j78569j57389
$$ 11189811 10928133 10665572 10408501 10162523 9931103 9715943 9518280 9339711 9182322
59994I182322j33809j07980q0814n3712k7683k636K2365M7970P3333R6208J14703
$$ 9182322 9048513 8940533 8859719 8806007 8778324 8775688 8798053 8846023 8919356 9015564 9130267
59983I130267J29003J40666J50014J54944J52841J43132J27298J07047Q3443N7430
$$ 9130267 9259270 9399936 9549950 9704894 9857735 10000867 10128165 10235212 10318655 10376085
59973A0376085K9995J602k7721n7561q6868j14506j39230j59373j73681j82672
$$ 10376085 10406080 10407682 10379961 10322400 10235532 10121026 9981796 9822423 9648742 9466070
59963I466070j88088j90499j88546j81115j69297j55164j39444j21510j01236
$$ 9466070 9277982 9087483 8898937 8717822 8548525 8393361 8253917 8132407 8031171
59954H031171p9561n7266l4138r574J6568M3728P0762R6437J20422J43677J67156
$$ 8031171 7951610 7894344 7860206 7850632 7867200 7910928 7981690 8078127 8198549 8342226 8509382
59943H509382J90200K10789K27213K38746K44807K44440K36982K22628K02201
$$ 8509382 8699582 8910371 9137584 9376330 9621137 9865577 10102559 10325187 10527388
59934A0527388J76949J48483J17966Q5128M9010J0183k8643o4708r7128j26127
$$ 10527388 10704337 10852820 10970786 11055914 11104924 11115107 11086464 11021756 10924628 10798501
59924A0798501j51277j71428j85850j94351j96480j91676j80373j64311j45425
$$ 10798501 10647224 10475796 10289946 10095595 9899115 9707439 9527066 9362755 9217330
59915I217330j24804j02711p9213n4677k9840n422J8496M2377O6185Q8656J08193
$$ 9217330 9092526 8989815 8910602 8855925 8826085 8820663 8839159 8881536 8947721 9036377 9144570
59904I144570J24365J37978J49498J57924J61581J59871J53926J45499J35585
$$ 9144570 9268935 9406913 9556411 9714335 9875916 10035787 10189713 10335212 10470797
59895A0470797J24337J12144J00026Q8698P7895O7538N9137N4900N5354N9025
$$ 10470797 10595134 10707278 10807304 10896002 10973897 11041435 11100572 11155472 11210826 11269851
59885A1269851O4926P4222Q8761J08982J34241J64341J99304K38040K78555L19655
$$ 11269851 11334777 11408999 11497760 11606742 11740983 11905324 12104628 12342668 12621223 12940878
59875A2940878L61475M04090M46348M86113N21086N49192N68649N77649N73741
$$ 12940878 13302353 13706443 14152791 14638904 15159990 15709182 16277831 16855480 17429221
59866A7429221N53912N15923M59536L86136K97884J98003R1165j7711j24770k26202
$$ 17429221 17983133 18499056 18958592 19344728 19642612 19840615 19931780 19914069 19789299 19563097
59856A9563097l16616l90606m46476m86715n14028n28376n28839n16744m95292
$$ 19563097 19246481 18855875 18409399 17922684 17408656 16880280 16351441 15834697 15339405
59847A5339405m66898m32614l93723l52180l09154k64438k17784j69999j22363
$$ 15339405 14872507 14439893 14046170 13693990 13384836 13120398 12902614 12732615 12610252
59838A2610252p5682l0342J3170N4281R2480J26945J56223J78607J92765J97781
$$ 12610252 12534570 12504228 12517398 12571679 12664159 12791104 12947327 13125934 13318699 13516480
59828A3516480J92717J76589J48988J10509O2561P113n3103j14572j73944k29203
$$ 13516480 13709197 13885786 14034774 14145283 14207844 14214957 14161854 14047282 13873338 13644135
59818A3644135k79448l23533l59681l86858m05600m16732m19920m14771m02935
$$ 13644135 13364687 13041154 12681473 12294615 11889015 11472283 11052363 10637592 10234657
59809A0234657l87586l70467l50766l27568l02150k76856k52606k28918k06027
$$ 10234657 9847071 9476604 9125838 8798270 8496120 8219264 7966658 7737740 7531713
59800G531713j85444j68089j52925j38260j23897j11361j02070r5767r0866q5954
$$ 7531713 7346269 7178180 7025255 6886995 6763098 6651737 6549667 6453900 6363034 6277080
59790F277080q0603p4701o7593n8550m8108l8323l1158k6953k4785k3931k4350
$$ 6277080 6196477 6121776 6054183 5995633 5947525 5909202 5878044 5851091 5826306 5802375 5778025
59779E778025k6063k9020l3688m0717m9436n7464o2713o5309o6536o6408o3650
$$ 5778025 5751962 5722942 5689254 5648537 5599101 5541637 5478924 5413615 5347079 5280671 5217021
59768E217021n8230n2229m7327m2742l6793k9549k2380j5578q209l7Q279J6959
$$ 5217021 5158791 5106562 5059235 5016493 4979700 4950151 4927771 4912193 4903984 4903947 4912226 4929185
59756D929185K7143L8603M9275N7899O5392P2513P7989Q0601Q1570Q2755Q3485
$$ 4929185 4956328 4994931 5044206 5102105 5167497 5240010 5317999 5398600 5480170 5562925 5646410
59745E646410Q1497P6487P0414O4378N7503M9361M1507L5727L2280L0624L0740
$$ 5646410 5727907 5804394 5874808 5939186 5996689 6046050 6087557 6123284 6155564 6186188 6216928
59734F216928L2852L6905M2932N1280O2006P4986R0763J10120J32473J56049J80378
$$ 6216928 6249780 6286685 6329617 6380897 6442903 6517889 6608652 6718772 6851245 7007294 7187672
59723G187672K07210K38031K71773L06141L40348L75230M11148M46607M78379
$$ 7187672 7394882 7632913 7904686 8210827 8551175 8926405 9337553 9784160 10262539
59714A0262539N01843N11603N02924M72913M20321L45319K50769J43532L3464
$$ 10262539 10764382 11275985 11778909 12251822 12672143 13017462 13268231 13411763 13445227
59705A3445227o9514j57793k26931k75655l05160l17860l16535l04539k85660
$$ 13445227 13375713 13217920 12990989 12715334 12410174 12092314 11775779 11471240 11185580
59696A1185580k62696k36474k07050j75522j43727j12522q1505n0440j9842J0130
$$ 11185580 10922884 10686410 10479360 10303838 10160111 10047589 9966084 9915644 9895802 9905932
59686I905932M0276P1242J02528J33350J63924J95103K27034K59142K91515L25348
$$ 9905932 9946208 10017450 10119978 10253328 10417252 10612355 10839389 11098531 11390046 11715394
59676A1715394L61453L99076M37132M76185N18081N63584O11678O61510P13514
$$ 11715394 12076847 12475923 12913055 13389240 13907321 14470905 15082583 15744093 16457607
59667A6457607P67552Q21206Q71540R17932R61452J001599J035231J058785J070231
$$ 16457607 17225159 18046365 18917905 19835837 20797289 21798888 22834119 23892904 24963135
59658B4963135J068860J055112J031321J001311R68530R35525R05555Q82986Q71002
$$ 24963135 26031995 27087107 28118428 29119739 30088269 31023794 31929349 32812335 33683337
59649C3683337Q69760Q77423Q91787R10166R28989R44600R53637R51784R33560
$$ 33683337 34553097 35430520 36322307 37232473 38161462 39106062 40059699 41011483 41945043
59640D1945043Q94795Q34650P54522O56290N43102M20705K96036J74876O2146
$$ 41945043 42839838 43674488 44429010 45085300 45628402 46049107 46345143 46520019 46582165
59631D6582165l6516j15686j72620k07311k20174k11244j81500j33170o8260J1913
$$ 46582165 46545649 46429963 46257343 46050032 45829858 45618614 45437114 45303944 45235684 45247597
59621D5247597J05561K10093L23319M43798N69478O96934Q22188R41263J049520
$$ 45247597 45353158 45563251 45886570 46330368 46899846 47596780 48418968 49360231 50409751
59612E0409751J141309J210418J249985J251830J207439J110731R59812P56486
$$ 50409751 51551060 52761478 54011463 55263293 56470732 57581463 58541275 59297761
59604E9297761N05968K18220r1482m05046p05259r77663j210743j396620j532345
$$ 59297761 59803729 60021949 59930467 59525421 58820162 57842499 56631756 55235136 53702791
59595E3702791j619811j663848j670425j646520j600861j543748j485515j434925
$$ 53702791 52082980 50419132 48748707 47102187 45501326 43957578 42472063 41037138
59587D1037138j398569j380614j381864j398823j424496j450739j470092j476203
$$ 41037138 39638569 38257955 36876091 35477268 34052772 32602033 31131941 29655738
59579B9655738j464584j434313j388489j331893j268132j199199j126841j053175
$$ 29655738 28191154 26756841 25368352 24036459 22768327 21569128 20442287 19389112
59571A9389112r80299r10123q44159p82543p23744o66370o10969n59066n10779
$$ 19389112 18408813 17498690 16654531 15871988 15148244 14481874 13870905 13311839 12801060
59562A2801060m64819m20689l79436l42082l08502k78184k50917k26473k04634
$$ 12801060 12336241 11915552 11536116 11194034 10885532 10607348 10356431 10129958 9925324
59553I925324j85829j70771j59298j50665j45136j43833j46482j50619j53913
$$ 9925324 9739495 9568724 9409426 9258761 9113625 8969792 8823310 8672691 8518778
59544H518778j56253j58804j61927j64822j66361j65451j61445j55051j48082
$$ 8518778 8362525 8203721 8041794 7876972 7710611 7545160 7383715 7228664 7080582
59535G080582j41392j33773j23845j12237j00747r0019p9323o8256n7188m6189
$$ 7080582 6939190 6805417 6681572 6569335 6468588 6378569 6299246 6230990 6173802 6127613
59525F127613l4884k3562j3177l960M851J3475K0904K6479L1215L6553M2387M7404
$$ 6127613 6092729 6069167 6055990 6052030 6056881 6070356 6091260 6117739 6148954 6185507 6227894 6275298
59513F275298N1114N4480N8532O3348O8802P5401Q3545R2503J01085J09374J18921
$$ 6275298 6326412 6380892 6439424 6502772 6571574 6646975 6730520 6823023 6924108 7033482 7152403
59502G152403J30926J44940J59815J75457J92772K12141K32766K53779K75301
$$ 7152403 7283329 7428269 7588084 7763541 7956313 8168454 8401220 8654999 8930300
59493H930300K97927L21471L44772L66801L87543M07475M26358M42889M55691
$$ 8930300 9228227 9549698 9894470 10261271 10648814 11056289 11482647 11925536 12381227
59484A2381227M64250M68605M68419M63003M52347M37419M19046L96944L70362
$$ 12381227 12845477 13314082 13782501 14245504 14697851 15135270 15554316 15951260 16321622
59475A6321622L39474L05716K70894K36438K03549J73748J48940J30573J18468
$$ 16321622 16661096 16966812 17237706 17474144 17677693 17851441 18000381 18130954 18249422
59466A8249422J10723J05599J03671J07214J16937J29963J41723J49068J50539
$$ 18249422 18360145 18465744 18569415 18676629 18793566 18923529 19065252 19214320 19364859
59457A9364859J44275J27410R8012N6632N379n3886j19883j90940k64382l36809
$$ 19364859 19509134 19636544 19734556 19791188 19796567 19742681 19622798 19431858 19167476 18830667
59447A8830667m04854m65696n17271n58261n88044o06643o14464o11995o00109
$$ 18830667 18425813 17960117 17442846 16884585 16296541 15689898 15075434 14463439 13863330
59438A3863330n80599n55804n27390m95843m61488m25411l88957l52844l17397
$$ 13863330 13282731 12726927 12199537 11703694 11242206 10816795 10427838 10074994 9757597
59429I757597k83048k49962k17518j85067j53025j22495r3916o6657l9651j1944
$$ 9757597 9474549 9224587 9007069 8822002 8668977 8546482 8452566 8385909 8346258 8334314
59419H334314J7022M6872P6312J04416J31678J59137J86935K14433K41253K67002
$$ 8334314 8351336 8398208 8474520 8578936 8710614 8869751 9056686 9271119 9512372 9779374
59409I779374K90429L10058L25600L37362L44319L43978L34423L15312K86697
$$ 9779374 10069803 10379861 10705461 11042823 11387142 11731120 12065543 12380855 12667552
59400A2667552K48231K00150J44036Q2009J5967n1907j18711j81529k38206k87268
$$ 12667552 12915783 13115933 13259969 13341978 13357945 13306038 13187327 13005798 12767592 12480324
59390A2480324l27861l59999l84155m00355m08441m09414m05349l97531l85609
$$ 12480324 12152463 11792464 11408309 11007954 10599513 10190099 9784750 9387219 9001610
59381I001610l69306l50113l30439l11541k93012k73928k53869k33129k12462
$$ 9001610 8632304 8282191 7951752 7640211 7347199 7073271 6819402 6586273 6373811
59372F373811j92635j73980j56367j39498j22929j06212q9702p4870o2806n2478
$$ 6373811 6181176 6007196 5850829 5711331 5588402 5482190 5392488 5317618 5254812 5202334
59362E202334m1671k9655j7684o711L691J3586K1651K7334L2659M0033M8843N5984
$$ 5202334 5160663 5131008 5113324 5106613 5110304 5123890 5145541 5172875 5205534 5245567 5294410 5350394
59350E350394N9620O0867O1700O2772O4051O6317P0847P8133Q7827R9786J14167
$$ 5350394 5410014 5470881 5532581 5595353 5659404 5725721 5796568 5874701 5962528 6062314 6176481
59339F176481J30241J45997J59714J71532J82842J94512K06879K21379K40503
$$ 6176481 6306722 6452719 6612433 6783965 6966807 7161319 7368198 7589577 7830080
59330G830080K65313K94234L25331L58814L96002M36855M80142N25381N72552
$$ 7830080 8095393 8389627 8714958 9073772 9469774 9906629 10386771 10912152 11484704
59321A1484704O20316O66580P10905P54138P95133Q29739Q53837Q65711Q64917
$$ 11484704 12105020 12771600 13482505 14236643 15031776 15861515 16715352 17581063 18445980
59312A8445980Q50933Q24218P86876P40855O86842O26329N63178N01232M41253
$$ 18445980 19296913 20121131 20908007 21648862 22335704 22962033 23525211 24026443 24467696
59303B4467696L81841L22453K63581K04600J43542P9303J2596n5456j24451j94008
$$ 24467696 24849537 25171990 25435571 25640171 25783713 25863016 25875612 25820156 25695705 25501697
59293B5501697k62764l28235l87422m37925m79164n12320n38746n59129n74831
$$ 25501697 25238933 24910698 24523276 24085351 23606187 23093867 22555121 21995992 21421161
59284B1421161n88728o03178o17726o30324o40436o49185o56378o59452o56219
$$ 21421161 20832433 20229255 19611529 18981205 18340769 17691584 17035206 16375754 15719535
59275A5719535o47327o34862o19374n99569n74651n45857n15332m84181m52272
$$ 15719535 15072208 14437346 13817972 13218403 12643752 12097895 11582563 11098382 10646110
59266A0646110m19587l87013l55516l25189k95727k67321k40265k14060j88064
$$ 10646110 10226523 9839510 9483994 9158805 8863078 8595757 8355492 8141432 7953368
59257G953368j62953j40206j19874j00176p9882n9939m2058k6697j3007L26J4869
$$ 7953368 7790415 7650209 7530335 7430159 7350277 7290338 7248280 7221583 7208576 7208902 7223771
59246G223771L1601M9253O4950P7718Q9909J03640J17322J28064J36281J44975
$$ 7223771 7255372 7304625 7369575 7447293 7537202 7640842 7758164 7886228 8022509 8167484
59236H167484J54653J62011J64379J62978J60521J57715J53775J48881J44103
$$ 8167484 8322137 8484148 8648527 8811505 8972026 9129741 9283516 9432397 9576500
59227I576500J39404J33468J25678J17248J10215J05919J04526J05534J08456
$$ 9576500 9715904 9849372 9975050 10092298 10202513 10308432 10412958 10518492 10626948
59218A0626948J13198J19770J27561J34868J39329J39038J33514J23584J10169
$$ 10626948 10740146 10859916 10987477 11122345 11261674 11400712 11534226 11657810 11767979
59209A1767979R3294P2581M8556K2635m271l2259o0884q7951j10752j28155j40670
$$ 11767979 11861273 11933854 11982410 12005045 12000774 11968515 11907631 11819680 11708928 11580773 11440103
59198A1440103j48806j52344j51014j45112j35325j22555j07749r1349p3015n2529
$$ 11440103 11291297 11138953 10987939 10842827 10707502 10584947 10477198 10385849 10312834 10260305
59188A0260305l0860r843R111K5678M0400N4208O7733Q0525R1454J00310J08313
$$ 10260305 10229445 10219602 10228713 10254391 10294791 10348999 10416732 10497257 10588711 10689021 10797334
59177A0797334J16359J23796J30022J36486J45527J57790J72439J89596K10832
$$ 10797334 10913693 11037489 11167511 11303997 11449524 11607314 11779753 11969349 12180181
59168A2180181K36846K66248K97116L28426L59370L88276M12861M30642M38734
$$ 12180181 12417027 12683275 12980391 13308817 13668187 14056463 14469324 14899966 15338700
59159A5338700M34143M14942L80584L30955K66057J87090R6893j216j04084k07697
$$ 15338700 15772843 16187785 16568369 16899324 17165381 17352471 17449364 17448148 17344064 17136367
59149A7136367l06565l95403m71257n33327n81228o14450o33426o40075o36646
$$ 17136367 16829802 16434399 15963142 15429815 14848587 14234137 13600711 12960636 12323990
59140A2323990o24392o03979n77205n47415n17510m87659m56142m22645l89696
$$ 12323990 11699598 11095619 10518414 9970999 9453489 8965830 8509688 8087043 7697347
59131G697347l60005l33469l07983k82553k58079k35434k14491j95184j78010
$$ 7697347 7337342 7003873 6695890 6413337 6155258 5919824 5705333 5510149 5332139
59122E332139j62896j48801j34976j21689j09275r7629q7165p8938p2888o6916
$$ 5332139 5169243 5020442 4885466 4763777 4654502 4556873 4469708 4390770 4317882 4250966
59112D250966n8863m8867l8829l0020k2157j4496o779R40Q530J5585K1481K6046
$$ 4250966 4192103 4143236 4104407 4074387 4052230 4037734 4030955 4031895 4040425 4056010 4077491 4103537
59100D103537L0196L5649M3610N3364O2418O8791P3214P8337Q5658R4087J01933
$$ 4103537 4133733 4169382 4212992 4266356 4328774 4397565 4470779 4549116 4634774 4728861 4830794
59089D830794J09167J16820J24829J31951J37714J43225J49485J55685J60070
$$ 4830794 4939961 5056781 5181610 5313561 5451275 5594500 5743985 5899670 6059740
59080F059740J62194J63526J65480J67419J67199J63462J56666J47721J36687
$$ 6059740 6221934 6385460 6550940 6718359 6885558 7049020 7205686 7353407 7490094
59071G490094J23535J09507R6511Q5236P4832O4626N5262M7981M3561M2348M4531
$$ 7490094 7613629 7723136 7819647 7904883 7979715 8044341 8099603 8147584 8191145 8233493 8278024
59060H278024M9884N7829O8188Q1366R7371J15212J33714J52430J71291J89986
$$ 8278024 8327908 8385737 8453925 8535291 8632662 8747874 8881588 9034018 9205309 9395295
59050I395295K08260K26204K43372K58036K68271K73472K73806K68190K54089
$$ 9395295 9603555 9829759 10073131 10331167 10599438 10872910 11146716 11414906 11668995
59041A1668995K29764J95844J54270J06742N5177K857m6396r0359j28766j61415
$$ 11668995 11898759 12094603 12248873 12355615 12410792 12413649 12367253 12276894 12148128 11986713
59031A1986713j87075k04887k15918k22358k25631k26097k24255k21206k18045
$$ 11986713 11799638 11594751 11378833 11156475 10930844 10704747 10480492 10259286 10041241
59022A0041241k15657k15034k16742k19962k23139k25962k29702k35102k40800
$$ 10041241 9825584 9610550 9393808 9173846 8950707 8724745 8495043 8259941 8019141
59013H019141k44736k46331k46447k45740k44034k41149k37339k32855k27627
$$ 8019141 7774405 7528074 7281627 7035887 6791853 6550704 6313365 6080510 5852883
59004E852883k21505k14391k06142j96609j85852j74318j62915j52826j44595
$$ 5852883 5631378 5416987 5210845 5014236 4828384 4654066 4491151 4338325 4193730
58995D193730j37319j29318j19956j10317j01944r5546r0964q7409q3418p7759
$$ 4193730 4056411 3927093 3807137 3696820 3594876 3499330 3408366 3320957 3237539 3159780
58985C159780p1027o5260o1265n7531n2702m7780m4389m2024l8814l4330k9779
$$ 3159780 3088753 3023493 2962228 2904697 2851995 2804215 2759826 2717802 2678988 2644658 2614879
58974B614879k5777k1757j7546j3805j0672p604m643k433p21J619M700P258Q525
$$ 2614879 2589102 2567345 2549799 2535994 2525322 2517718 2513075 2510642 2509921 2511540 2516240 2523498 2532023
58961B532023R048R095P861N178K604J581J430M60j589l430m116l940l432k495
$$ 2532023 2541071 2550166 2558027 2563205 2565809 2567390 2568820 2569280 2567691 2564261 2560145 2556205 2552773 2550278
58947B550278q11J500M008O501R004J1244J2423J1904J0187Q709Q346Q597Q697
$$ 2550278 2549467 2550967 2554975 2561476 2570480 2581724 2594147 2606051 2616238 2624947 2633293 2641890 2650587
58934B650587Q971J0246J2203J3357J2912J1824J1701J3164J5565J7910J9674
$$ 2650587 2659558 2669804 2682007 2695364 2708276 2720100 2731801 2744965 2760530 2778440 2798114
58923B798114K0874K1677K2224K2877K4254K6409K8225K8619K8414K9858L3818
$$ 2798114 2818988 2840665 2862889 2885766 2910020 2936429 2964654 2993273 3021687 3051545 3085363
58912C085363L8568M2052M4207M6164M8471N1340N5458O0735O5129O6640O6200
$$ 3085363 3123931 3165983 3210190 3256354 3304825 3356165 3411623 3472358 3537487 3604127 3670327
58901C670327O6874P0211P4915P9033Q1966Q4205Q6434Q9164R2282R5107R7611
$$ 3670327 3737201 3807412 3882327 3961360 4043326 4127531 4213965 4303129 4395411 4490518 4588129
58890D588129J01076J06453J12811J18857J25283J33714J43920J54185J64241
$$ 4588129 4689205 4795658 4908469 5027326 5152609 5286323 5430243 5584428 5748669
58881E748669J75571J88692K02252K15272K28405K42463K57480K73650K91549
$$ 5748669 5924240 6112932 6315184 6530456 6758861 7001324 7258804 7532454 7824003
58872G824003L11154L32173L55463L82183M11515M41475M72353N06953N46681
$$ 7824003 8135157 8467330 8822793 9204976 9616491 10057966 10530319 11037272 11583953
58863A1583953N89799O34416O80796P29418P79146Q28982Q79592R31192R81395
$$ 11583953 12173752 12808168 13488964 14218382 14997528 15826510 16706102 17637294 18618689
58854A8618689J026912J065830J096413J114953J116851J099034J059758R96887
$$ 18618689 19645601 20711431 21807844 22922797 24039648 25138682 26198440 27195327
58846B7195327R08117P92612O51608M88371L08795J21014o7028k49289m20467
$$ 27195327 28103444 28896056 29547664 30036035 30344830 30465844 30398816 30149527 29729060
58837B9729060n74802p07611q17151r03677r67670j010239j034054j042066j035870
$$ 29729060 29154258 28446647 27629496 26725819 25758149 24747910 23713856 22671790 21635920
58828B1635920j016735r87419r51304r10288q65168q17648p70250p24324o79599
$$ 21635920 20619185 19631766 18680462 17770174 16905006 16087358 15317108 14592784 13913185
58819A3913185o35732n93095n52105n12948m76130m42417m12043l84477l58885
$$ 13913185 13277453 12684358 12132253 11619305 11143175 10700758 10288715 9904238 9545353
58810I545353l34411l10334k86596k63870k42766k23338k05594j89739j75365
$$ 9545353 9210942 8900608 8614012 8350142 8107376 7884038 7678444 7488705 7313340
58801G313340j61256j46599j31755j17358j03445r0018p7476o5827n4322m2554
$$ 7313340 7152084 7005485 6873730 6756372 6652927 6562909 6485433 6419606 6365284 6322730
58791F322730l1021j9920q453L853J6181K7704L8877N0506O2471P4381Q6619R9718
$$ 6322730 6291709 6271789 6263336 6267189 6283370 6311074 6349951 6400457 6462928 6537309 6623928 6723646
58779F723646J13436J27397J41720J56308J70506J84470J99744K17299K36060
$$ 6723646 6837082 6964479 7106199 7262507 7433013 7617483 7817227 8034526 8270586
58770H270586K54630K73437K93891L16240L39769L64430L90938M19759M51123
$$ 8270586 8525216 8798653 9092544 9408784 9748553 10112983 10503921 10923680 11374803
58761A1374803M85479N22869N62592O04441O49454O98303P49721Q01622Q52782
$$ 11374803 11860282 12383151 12945743 13550184 14199638 14897941 15647662 16449284 17302066
58752A7302066R02232R47999R87833J020261J043265J052650J043240J011340
$$ 17302066 18204298 19152297 20140130 21160391 22203656 23256306 24299546 25310886
58744B5310886R54917Q72507P63748O30566M76423L05007J21309o6669k49345
$$ 25310886 26265803 27138310 27902058 28532624 29009047 29314054 29435363 29368694 29119349
58735B9119349m19096n71605p04367q15548r04234r70531j015313j040543j049251
$$ 29119349 28700253 28128648 27424281 26608733 25704499 24733968 23718655 22678112 21628861
58726B1628861j044247j027274j000257r66330r28295q86869q41942p94871p48058
$$ 21628861 20584614 19557340 18557083 17590753 16662458 15775589 14933647 14138776 13390718
58717A3390718p02793o59024o16892n77039n39701n04746m72379m42748m15248
$$ 13390718 12687925 12028901 11412009 10834970 10295269 9790523 9318144 8875396 8460148
58708H460148l89172l64488l41079l18221k95917k75671k58426k42848k27114
$$ 8460148 8070976 7706488 7365409 7047188 6751271 6475600 6217174 5974326 5747212
58699E747212k11421j96933j83324j69317j54922j41182j28421j16610j06630
$$ 5747212 5535791 5338858 5155534 4986217 4831295 4690113 4561692 4445082 4338452
58690D338452r8979r1923q3299p3718o5696n9912n4742m9420m5107m2619m1289
$$ 4338452 4239473 4147550 4064251 3990533 3924837 3864925 3810183 3760763 3715656 3673037 3631748
58679C631748m0555m0645m1309m1652m1698m2495m4385m6576m8504m9998n0301
$$ 3631748 3591193 3550548 3509239 3467587 3425889 3383394 3339009 3292433 3243929 3193931 3143630
58668C143630m8786m6667m6034m6980m7724m7603m7820m8836m9388m8955m8923
$$ 3143630 3094844 3048177 3002143 2955163 2907439 2859836 2812016 2763180 2713792 2664837 2615914
58657B615914n0042n0598m8689m5049m2041m0696m0001l8740l6879l5208l4243
$$ 2615914 2565872 2515274 2466585 2421536 2379495 2338799 2298798 2260058 2223179 2187971 2153728
58646B153728l3630l2563l0804k8993k7699k6697k5586k4494k3562k2519k1521
$$ 2153728 2120098 2087535 2056731 2027738 2000039 1973342 1947756 1923262 1899700 1877181 1855660
58635A855660k1534k2792k3846k3374k2024k1152k0658j9616j8131j6796j5106
$$ 1855660 1834126 1811334 1787488 1764114 1742090 1720938 1700280 1680664 1662533 1645737 1630631
58624A630631j2308r117o651m316q66K842M453L344J238l17j173j439j070n79
$$ 1630631 1618323 1609206 1602555 1598239 1597373 1600215 1604668 1608012 1609250 1608933 1607760 1606321 1605251 1604672
58610A604672n03l67K65M29o40j386J54K976M293L735L381L880L746K763K862
$$ 1604672 1604169 1603802 1604067 1604496 1603856 1602470 1602624 1605600 1609893 1613628 1617009 1620889 1624635 1627398 1630260
58595A630260M645O043N594M616M892O459Q794J2065J5920J8943K0618K2266K5037
$$ 1630260 1634905 1640948 1646542 1651158 1656050 1662509 1671303 1683368 1699288 1718231 1738849 1761115 1786152
58582A786152K8478L1831L5182L8570M1604M4655M8789N3854N8244O1292O4348
$$ 1786152 1814630 1846461 1881643 1920213 1961817 2006472 2055261 2109115 2167359 2228651 2292999
58571B292999O8939P5328Q3252R2408J01723J10004J17847J27347J39440J53137
$$ 2292999 2361938 2437266 2520518 2612926 2714649 2824653 2942500 3069847 3209287 3362424
58561C362424J67489J82450J97791K13307K30193K49747K70275K87813L00564
$$ 3362424 3529913 3712363 3910154 4123461 4353654 4603401 4873676 5161489 5462053
58552E462053L10040L17041L19227L13821K99963K77040K43301J98174J44227
$$ 5462053 5772093 6089134 6408361 6722182 7022145 7299185 7542486 7740660 7884887
58543G884887Q5212K3925l6826r3236j42471j84174k18506k44175k60072k67606
$$ 7884887 7970099 7994024 7957198 7863962 7721491 7537317 7318811 7074636 6814564 6546958
58533F546958k69742k68415k63992k56369k45597k32226k17766k03961j91184
$$ 6546958 6277216 6008801 5744809 5488440 5242843 5010617 4792851 4588890 4397706
58524D397706j78425j65042j51307j37277j22770j08582r6136q5686p6538o8849
$$ 4397706 4219281 4054239 3902932 3765655 3642885 3534303 3438167 3352481 3275943 3207094
58514C207094o3214n8639n3406m8045m4841m4040m3259m1130l8783l7042l5168
$$ 3207094 3143880 3085241 3031835 2983790 2938949 2894909 2851650 2810520 2771737 2734695 2699527
58503B699527l3238l2866l4360l5896l6770l8692m2509m6378m8656n0048n1314
$$ 2699527 2666289 2633423 2599063 2563167 2526397 2487705 2445196 2398818 2350162 2300114 2248800
58492B248800n1460m9766m7195m4366m0685l6800l4990l5413l4844l1240k6883
$$ 2248800 2197340 2147574 2100379 2056013 2015328 1978528 1943538 1908125 1873281 1842041 1815158
58481A815158k4788k4548k4030k2884k1863k0752j9247j8202j7949j7246j5529
$$ 1815158 1790370 1765822 1741792 1718908 1697045 1676293 1657046 1638844 1620895 1603649 1588120
58470A588120j4127j3488j1721p922m592m269n907o947o947o869o658n936n451
$$ 1588120 1573993 1560505 1548784 1540862 1536270 1532001 1526094 1519147 1512200 1505331 1498673 1492737 1487286
58457A487286n769o178o514p924j0204j1021r789r413j1691j3926j3087j0552
$$ 1487286 1481517 1475339 1468825 1460901 1450697 1439676 1429887 1420474 1408783 1394857 1381770 1371218
58445A371218r443r638r101q092q267r050q554o937n607m191j603J026J705J052
$$ 1371218 1361775 1352137 1343036 1334944 1326677 1317627 1309073 1302136 1296529 1292338 1290735 1291761 1293466 1294518
58431A294518J291K455K644J452L53m2m82j128j331j102j015j043r79j272k182
$$ 1294518 1295809 1298264 1300908 1302360 1302713 1302671 1302189 1301061 1299730 1298628 1297613 1296570 1295591 1294319 1292137
58416A292137l092l723m602n406m929l757m319o816q134o806n602o699p776o253
$$ 1292137 1289045 1285322 1280720 1275314 1270385 1266628 1262309 1255493 1247359 1240553 1234951 1228252 1220476 1214223
58402A214223m011l817m018j351L157N819O201O809Q099Q233P075O242N724M220
$$ 1214223 1210212 1206395 1202377 1201026 1204183 1210002 1216203 1223012 1231111 1239344 1246419 1252661 1258385 1262605
58388A262605K242J278N35j959n613q055q923r666j0414j0448j0769j2551j4001
$$ 1262605 1264847 1266125 1266660 1264701 1259088 1251033 1242110 1232444 1222030 1211582 1200813 1188262 1174261
58375A174261j2461q915o677o314n677m405m340n666o455o122n913n988n251l969
$$ 1174261 1161800 1152885 1146208 1139894 1134217 1129812 1125472 1119806 1113351 1107229 1101316 1095328 1090077 1086108
58361A086108l422l128j547Q13K010K103K992N224P675R816J1527J1684R831Q097
$$ 1086108 1082686 1079558 1078011 1078824 1080834 1082937 1085929 1091153 1098828 1108644 1120171 1131855 1141686 1149783
58347A149783Q493R731R910J0356J2851J5084J3690J0367R690J1776J2599J1234
$$ 1149783 1158276 1168007 1177917 1188273 1201124 1216208 1229898 1240265 1249955 1261731 1274330 1285564
58335A285564J0970J2786J3284J0545P175N708N114L534J157j191l304m429l622
$$ 1285564 1296534 1309320 1322604 1333149 1340324 1346032 1351146 1354680 1355837 1354646 1351342 1346913 1343291
58322A343291k006j877l236l908l228k537k032l56K466M716N776O450O728O129
$$ 1343291 1341285 1339408 1336172 1332264 1329036 1326499 1324467 1324111 1326577 1331293 1337069 1343519 1350247 1356376
58308A356376N740O808P950P167N762O543Q831R391P846O986P825Q337P184N005
$$ 1356376 1362116 1368924 1376874 1384041 1389803 1396346 1405177 1414568 1422414 1429400 1437225 1445562 1452746 1457751
58294A457751K306l35o25K906P368Q653P308O939P788O972M485L581N085O384
$$ 1457751 1460057 1459722 1459097 1462003 1469371 1478024 1485332 1492271 1500059 1507031 1511516 1515097 1520182 1526566
58280A526566O375O600P341P350P541J0077J3726J4955J3696J3065J3653J3379
$$ 1526566 1532941 1539541 1546882 1554232 1561773 1571850 1585576 1600531 1614227 1627292 1640945 1654324
58268A654324J2773J4601J7985J8745J6236J4265J4581J5063J4828J5441J6419
$$ 1654324 1667097 1681698 1699683 1718428 1734664 1748929 1763510 1778573 1793401 1808842 1825261
58257A825261J5517J4102J6083K0663K2511K0315J8758K0389K2072K1667K1924
$$ 1825261 1840778 1854880 1870963 1891626 1914137 1934452 1953210 1973599 1995671 2017338 2039262
58246B039262K5007K8632L0376L1171L2329L3421L4724L7388M0136M0281L8581
$$ 2039262 2064269 2092901 2123277 2154448 2186777 2220198 2254922 2292310 2332446 2372727 2411308
58235B411308L8329L9600L9759L9412M1607M5265M6158M4611M5207M8493N0484
$$ 2411308 2449637 2489237 2528996 2568408 2610015 2655280 2701438 2746049 2791256 2839749 2890233
58224B890233N0876N3805N9439O3090O3983O6621P1803P4939P5346P8400Q5751
$$ 2890233 2941109 2994914 3054353 3117443 3181426 3248047 3319850 3394789 3470135 3548535 3634286
58213C634286R2019R4206R6007R9632J01851J01485J02549J06490J09416J10339
$$ 3634286 3726305 3820511 3916518 4016150 4118001 4219486 4322035 4428525 4537941 4648280
58203D648280J13808J21149J27606J31644J38285J49447J59876J66695J74236
$$ 4648280 4762088 4883237 5010843 5142487 5280772 5430219 5590095 5756790 5931026
58194E931026J85293J96197K04682K13964K25247K35010K43350K55640K72421
$$ 5931026 6116319 6312516 6517198 6731162 6956409 7191419 7434769 7690409 7962830
58185G962830K87380K99061L14183L35506L57176L76235L97430M22287M45138
$$ 7962830 8250210 8549271 8863454 9198960 9556136 9932371 10329801 10752088 11197226
58176A1197226M64857M88505N18268N47165N72760O02152O37933O72996P05243
$$ 11197226 11662083 12150588 12668856 13216021 13788781 14390933 15028866 15701862 16407105
58167A6407105P43229P90689Q40050Q88085R42843J007795J074790J140253J212231
$$ 16407105 17150334 17941023 18781073 19669158 20612001 21619796 22694586 23834839 25047070
58158B5047070J294129J379066J467955J574137J701568J838569J981869K144615
$$ 25047070 26341199 27720265 29188220 30762357 32463925 34302494 36284363 38428978
58150C8428978K330826K526630K728882K957003L223578L520829L850806M240008
$$ 38428978 40759804 43286434 46015316 48972319 52195897 55716726 59567532 63807540
58142F3807540M709296N261703N915639O712466P673076Q790244J0084082J1610794
$$ 63807540 68516836 73778539 79694178 86406644 94079720 102869964 112954046 124564840
58134A24564840J3385500J5353048J7467976J9737853K2167783K4787328K7784756
$$ 124564840 137950340 153303388 170771364 190509217 212677000 237464328 265249084
58127B65249084L1367983L5165751L7786039L7327652L2610585K3941520J2749431
$$ 265249084 296617067 331782818 369568857 406896509 439507094 463448614 476198045
58120D76198045P18988j0661086k0116488k6728450l0263774l1219609l0424876
$$ 476198045 476917033 466255947 446139459 419411009 389147235 357927626 327502750
58113C27502750k8615278k6320793k3923956k1654726j9570876j7644660j5869272
$$ 327502750 298887472 272566679 248642723 226987997 207417121 189772461 173903189
58106A73903189j4251781j2751392j1293894r841649q411899p038838n756692
$$ 173903189 159651408 146900016 135606122 125764473 117352574 110313736 104557044
58099A04557044m618474l698678l062279k733166k686982k866790l207464l644929
$$ 104557044 99938570 96239892 93177613 90444447 87757465 84890675 81683211 78038282
58091G8038282m099473m467323m659676m657851m512659m286630m014406l715781
$$ 78038282 73938809 69471486 64811810 60153959 55641300 51354670 47340264 43624483
58083D3624483l413620l122317k839258k563254k307035k080958j880056j698083
$$ 43624483 40210863 37088546 34249288 31686034 29378999 27298041 25417985 23719902
58075B3719902j539320j405568j286014j171911j068604r82127r06201q33292
$$ 23719902 22180582 20775014 19489000 18317089 17248485 16266358 15360157 14526865
58067A4526865p66865p11595o62240o13009n68006n31906m99570m65035m31945
$$ 14526865 13760000 13048405 12386165 11773156 11205150 10673244 10173674 9708639 9276694
58058I276694m05263l81156l54850l30690l14563l03433k91349k79202k69951
$$ 9276694 8871431 8490275 8135425 7804735 7490172 7186739 6895390 6616188 6346237
58049F346237k60791k48373k35729k26169k16355k02770j88837j78350j68206
$$ 6346237 6085446 5837073 5601344 5375175 5158820 4956050 4767213 4588863 4420657
58040D420657j55028j42654j35405j29817j20846j10732j04168r9708r3442q6508
$$ 4420657 4265629 4122975 3987570 3857753 3736907 3626175 3522007 3422299 3328857 3242349
58030C242349q1944p8569p4506p2164p3323p3965p0300o5210o2585o0328n5484
$$ 3242349 3160405 3081836 3007330 2935166 2861843 2787878 2717578 2652368 2589783 2529455 2473971
58019B473971n1219n1514n3388n1575m7151m4601m3891m2109l9658l8347l6372
$$ 2473971 2422752 2371238 2317850 2266275 2219124 2174523 2130632 2088523 2048865 2010518 1974146
58008A974146l1494k6165k3729k2435j9020j4930j3317j3048j1586j0688j3159
$$ 1974146 1942652 1916487 1892758 1870323 1851303 1836373 1823056 1810008 1798422 1787734 1774575
57997A774575j6766j7301j5392j4638j5462j6078j7079j9575k1299j9862j7505
$$ 1774575 1757809 1740508 1725116 1710478 1695016 1678938 1661859 1642284 1620985 1601123 1583618
57986A583618j7502j8326j6618j3310j1453j0530q367o338o962q465p338m410
$$ 1583618 1566116 1547790 1531172 1517862 1506409 1495879 1487512 1481174 1474212 1465747 1458409 1453999
57974A453999l049k997j493J079K008J386J363J571J57j959k566k494l864n631
$$ 1453999 1450950 1447953 1446460 1447539 1449547 1450933 1452296 1453867 1454024 1452065 1449499 1447005 1443141 1437510
57960A437510n538m854o252q549q665p315p609r162q979p244o844p766p220n213
$$ 1437510 1431972 1427118 1420866 1412317 1403652 1396337 1388728 1379566 1370587 1363343 1356499 1348733 1341513 1336300
57946A336300m821o661p748o403m252k789j519J27J969M107O148O215L470M22
$$ 1336300 1331479 1324818 1317070 1310667 1306415 1303626 1302107 1302234 1304203 1308310 1314458 1320673 1324143 1324565
57932A324565l45j65j683m018m439l326l272m444n037n214o342p389o417m649
$$ 1324565 1324220 1324055 1322372 1318354 1313915 1310589 1307317 1302873 1297836 1292622 1286280 1278891 1272474 1267825
57918A267825m726n816n064k999k701m133m234k573j971l333m468m522n131o535
$$ 1267825 1263099 1257283 1252219 1249220 1246519 1242386 1238152 1235579 1233608 1230275 1225807 1221285 1216154 1209619
57904A209619o790n621n091n741n680m137k357o08K046M650M772K544O75Q9q34
$$ 1209619 1202829 1197208 1192117 1186376 1180696 1176559 1174202 1173594 1175640 1180290 1185062 1187606 1188281 1188370 1187536
57889A187536k314k485j297j191k862m064l621l115l510l523k620k351l413m346
$$ 1187536 1185222 1182737 1181440 1180249 1177387 1173323 1169702 1166587 1163077 1159554 1156934 1154583 1151170 1146824
57875A146824m298m354n123n871o723q778j1253j1713j0089r251j0493j1697j1221
$$ 1146824 1142526 1138172 1133049 1127178 1120455 1111677 1100424 1088711 1078622 1069371 1058878 1047181 1035960
57862A035960j0386j0377r828p523m946m017m268m096l072j484P39L285N094N816
$$ 1035960 1025574 1015197 1005369 997846 992900 988883 984615 980519 977447 975963 976702 979987 985081 990897
57848I90897O299O966P224P017P158P700P766P407P487P419N301J044k888m550
$$ 990897 997196 1004162 1011386 1018403 1025561 1033261 1041027 1048434 1055921 1063340 1068641 1069685 1066797 1062247
57834A062247m478l994l716m233o091q429r609r701j0209j1153j0859r069p598
$$ 1062247 1057769 1053775 1050059 1045826 1039735 1031306 1021697 1011996 1001787 990634 979775 970706 963108
57821I63108p208o530m950l834l767l216j354K74M20L17J672M268O838Q647R132
$$ 963108 955900 949370 944420 940586 936819 933603 932249 932523 932943 933260 934932 939200 946038 954685 963817
57806I63817P881N953N408O417O787N315L528K951K770J665R4q23j130j429j700
$$ 963817 971698 977651 983059 989476 996263 1001578 1005106 1008057 1010827 1012492 1012586 1011763 1010633 1009204 1007504
57791A007504j962k807m330n818p123q902j0891j1602j0522q918p907p309o876
$$ 1007504 1005542 1002735 998405 992587 985464 976562 965671 954069 943547 934629 926722 919413 912537
57778I12537o703o057m040j967k515n642p917p165n303n144o755q597j0035j0943
$$ 912537 905834 899777 895737 893770 891255 885613 877696 870531 865228 860084 853329 844732 834697 823754
57764H23754j0746r588q843q958q599p215o485p613r154r244q161o978n564l771
$$ 823754 813008 803420 794577 785619 777020 769805 763320 755707 746553 737309 729148 722170 716606 712835
57750G12835k790l270l590k094L28J812K396L409N059O410O874O332M867L581
$$ 712835 710045 706775 703185 701091 701419 703231 705627 709036 714095 720505 727379 733711 738578 742159
57736G42159M190O483P826O633M574L758L774L402L190L954M564L842L143M167
$$ 742159 746349 752832 760658 767291 771865 775623 779397 782799 785989 789943 794507 798349 801492 805659
57722H05659N690N456M197M463O000N795K805n04j943k243l010m236n066n404
$$ 805659 811349 816805 821002 825465 831465 837260 840065 839561 837618 835375 832365 828129 823063 817659
57708H17659n682n944n822m880k886m34R78M30j012j330K52K854N269O710O726
$$ 817659 811977 806033 800211 795331 792445 792011 792989 793419 792407 791077 791329 794183 799452 806162 812888
57693H12888N536M162L421L230L528M962P632J0129J1126J1054J0949J0512Q957
$$ 812888 818424 822586 826007 829237 832765 837727 845359 855488 866614 877668 888617 899129 908086
57680I08086O867N523N011M708M951O326P848P993P271P645R376J0620J0511J0618
$$ 908086 914953 920476 925487 930195 935146 941472 949320 957313 964584 972229 981605 992225 1002736 1013354
57666A013354J2494J5397J7478J8145J8358J9228K0911K2544K3095K2617K2456
$$ 1013354 1025848 1041245 1058723 1076868 1095226 1114454 1135365 1157909 1181004 1203621 1226077
57655A226077K3673K5722K7408K8711L0544L3119L5722L7906L9785M1382M2818
$$ 1226077 1249750 1275472 1302880 1331591 1362135 1395254 1430976 1468882 1508667 1550049 1592867
57644A592867M5032M9008N4253N9203O3236O7246P2188P8078Q4665R2155J00871
$$ 1592867 1637899 1686907 1741160 1800363 1863599 1930845 2003033 2081111 2165776 2257931 2358802
57633B358802J10760J21341J31925J42286J53521J67405J84159K01598K17699
$$ 2358802 2469562 2590903 2722828 2865114 3018635 3186040 3370199 3571797 3789496
57624C789496K33061K49338K65880K79935K89956K96504K99299K95315K81129
$$ 3789496 4022557 4271895 4537775 4817710 5107666 5404170 5703469 5998784 6279913
57615F279913K56379K24023J87788J50041J11927P4789M0892J1823j4097m1892
$$ 6279913 6536292 6760315 6948103 7098144 7210071 7284860 7325752 7337575 7323478 7281586
57605G281586p6079j16755j59948k00988k36438k63604k80450k86674k83823k73876
$$ 7281586 7205507 7088752 6928804 6727816 6491378 6227774 5947324 5660650 5376827 5102951
57595E102951k58431k39307k18742j98606j79941j63151j47807j32462j15913
$$ 5102951 4844520 4605213 4386471 4187865 4007924 3844773 3696966 3564504 3448591
57586C448591r8784q2982o9450n7422m5881l4709k4044j3600l000P849J8929L0038
$$ 3448591 3349807 3266825 3197375 3139953 3094072 3059363 3035319 3021719 3018719 3026568 3045497 3075535
57574C075535M0599N0333O0172P1597Q4855R8565J11251J22722J34043J46743
$$ 3075535 3116134 3166467 3226639 3298236 3383091 3481656 3592907 3715629 3849672 3996415
57564C996415J61749J78160J93254K04679K12345K17075K17684K11059J95317
$$ 3996415 4158164 4336324 4529578 4734257 4946602 5163677 5381361 5592420 5787737
57555E787737J71399J41100J05084O3759J8879k6880p1240j12355j48151j76838
$$ 5787737 5959136 6100236 6205320 6269079 6287958 6261078 6189838 6077483 5929332 5752494
57545E752494j98047k12823k22375k27100k26834k21880k13655k04111j94362
$$ 5752494 5554447 5341624 5119249 4892149 4665315 4443435 4229780 4025669 3831307
57536C831307j84193j73215j62047j51723j42323j33092j23737j14699j06187
$$ 3831307 3647114 3473899 3311852 3160129 3017806 2884714 2760977 2646278 2540091
57527B540091r7815q9350q1142p3643o7130o1858n7837n4312n0136m4893l9283
$$ 2540091 2442276 2352926 2271784 2198141 2131011 2069153 2011316 1957004 1906868 1861975 1822692
57516A822692l4392l0912k8844k7460k5769k3535k1508k0215j8961j6765j3734
$$ 1822692 1788300 1757388 1728544 1701084 1675315 1651780 1630272 1610057 1591096 1574331 1560597
57505A560597j0629p580m376j572n1N34J623L983P045J0028J2698J4979J6802
$$ 1560597 1549968 1542388 1538012 1536440 1536389 1536923 1538546 1542529 1549574 1559602 1572300 1587279 1604081
57492A604081J8540K0796K3699K6984L0476L3782L6172L7861M0804M6603N3972
$$ 1604081 1622621 1643417 1667116 1694100 1724576 1758358 1794530 1832391 1873195 1919798 1973770
57481A973770N9970O3618O6684P0884P6296Q2849R1305J01616J11886J20347J27573
$$ 1973770 2033740 2097358 2164042 2234926 2311222 2394071 2485376 2586992 2698878 2819225 2946798
57470B946798J35631J45552J56344J66101J73481J78292J80696J79741J73177
$$ 2946798 3082429 3227981 3384325 3550426 3723907 3902199 4082895 4262636 4435813
57461D435813J59436J39178J13999Q4368N0363J3721k2712n7324q9468j17186
$$ 4435813 4595249 4734427 4848426 4932794 4983157 4996878 4974166 4916842 4827374 4710188
57451D710188j37714j50772j58956j64126j65575j62777j57558j51931j45584
$$ 4710188 4572474 4421702 4262746 4098620 3933045 3770268 3612710 3460779 3315195
57442C315195j37251j27285j17211j07775r8839r0303q1971p3335o4580n6786
$$ 3315195 3177944 3050659 2933448 2825673 2726834 2636531 2554560 2481225 2416645 2359859
57432B359859n0158m3171l4680k5771j8230j2073n953O85P092J2504J7023K1607
$$ 2359859 2309701 2266530 2231850 2206079 2187849 2175776 2169823 2170508 2177600 2190104 2207127 2228734
57420B228734K7578L5389M3646N0524N6460O3852P3617Q3956R3340J02471J12015
$$ 2228734 2256312 2291701 2335347 2385871 2442331 2506183 2579800 2663756 2757096 2859567 2971582
57409B971582J20806J28238J36272J46361J55941J60833J60076J55507J47253
$$ 2971582 3092388 3220626 3356898 3503259 3659200 3820033 3980109 4135616 4282869
57400D282869J32802J10690Q2518N0739J6605j9007n4443q7567j16302j38926
$$ 4282869 4415671 4526361 4608879 4659618 4676223 4657216 4602773 4515206 4398904 4259978
57390D259978j55018j66017j73600j77800j77935j74763j70048j64328j56876
$$ 4259978 4104960 3938943 3765343 3587543 3409608 3234845 3064797 2900469 2743593
57381B743593j47711j37995j28441j18991j10011j02138r5066q7973q1009p4750
$$ 2743593 2595882 2457887 2329446 2210455 2100444 1998306 1903240 1815267 1734258 1659508
57371A659508o8653o1980n5865n2078m9771m6089m0366l5169l2429l1029k9242
$$ 1659508 1590855 1528875 1473010 1420932 1371161 1325072 1284706 1249537 1217108 1186079 1156837
57360A156837k7082k4958k2285j9159j7367j7861j8722j7693j5404j4082j4120
$$ 1156837 1129755 1104797 1082512 1063353 1045986 1028125 1009403 991710 976306 962224 948104
57349I48104j4047j3125j1858j0390q553p302p989r870j0268p925m674l024l321
$$ 948104 934057 920932 909074 898684 890131 882829 874840 864970 854702 846777 842103 839079 835758
57336H35758m295n340o787q344q744p363n229l803l295k844k039j409j392j647
$$ 835758 831463 826123 819336 810992 802248 794885 789656 785853 782558 779714 777675 776266 774874 773227
57322G73227j681j444r46kJ114J526R58N10J323L123M940O582Q157Q794P523N340
$$ 773227 771546 770102 769156 769154 770268 771794 772752 773262 774585 777708 782648 789230 797387 806181 813704 819044
57306H19044M683O413Q707R465Q604P472O994P222P738P847P064N930N688O645
$$ 819044 823727 830140 838847 848312 856916 864388 871382 878604 886342 894189 901253 907183 912871 919516
57292I19516P662P754P439P758Q697R392R496R595J0419J2097J4023J5136J4628
$$ 919516 927178 934932 942371 950129 958826 968218 977714 987309 997728 1009825 1023848 1038984 1053612
57279A053612J2670J0370Q821Q337Q525Q795Q693Q170P518O892O168N638O152
$$ 1053612 1066282 1076652 1085473 1093810 1102335 1111130 1119823 1127993 1135511 1142403 1148571 1154209 1160361
57266A160361P894R548R773R066R015R843J0186R303Q101P671Q143R338J1163
$$ 1160361 1168255 1177803 1187576 1196642 1205657 1215500 1225686 1234989 1243090 1250761 1258904 1268242 1279405
57253A279405J2788J2757J0868Q914Q725J0219J2087J3519J4445J4813J4606J4269
$$ 1279405 1292193 1304950 1315818 1324732 1333457 1343676 1355763 1369282 1383727 1398540 1413146 1427415
57241A427415J4390J5174J6448J7917J9238K0417K2134K5024K8549L1346L2806
$$ 1427415 1441805 1456979 1473427 1491344 1510582 1530999 1553133 1578157 1606706 1638052 1670858
57230A670858L3513L4094L4713L5694L7483L9585M0740M0563M0076M0218M0898
$$ 1670858 1704371 1738465 1773178 1808872 1846355 1885940 1926680 1967243 2007319 2047537 2088435
57219B088435M1907M3600M6064M8561N0161N0185M7966M3454L8180L4163L1312
$$ 2088435 2130342 2173942 2220006 2268567 2318728 2368913 2416879 2460333 2498513 2532676 2563988
57208B563988K7384K0999J3275N950m79n950r846j1964j3090j3674j3245j2085
$$ 2563988 2591372 2612371 2625646 2631596 2631117 2625167 2615321 2603357 2590267 2576593 2563348 2551263
57196B551263j1920j3685j5925j6747j6129j4930j2924r412n021j289J015K155
$$ 2551263 2539343 2525658 2509733 2492986 2476857 2461927 2449003 2439591 2434570 2433281 2434296 2436451
57184B436451K598K882L564M557N309O100P928J0409J1480J0137Q003P015P134
$$ 2436451 2439049 2441931 2445495 2450052 2455361 2461461 2469389 2479798 2491278 2501415 2509418 2516433 2523567
57171B523567P525Q322R717J0886J1543J3004J6122J9592K2130K4675K8417L2244
$$ 2523567 2531092 2539414 2549131 2560017 2571560 2584564 2600686 2620278 2642408 2667083 2695500 2727744
57159B727744L4470L5695L7552L9824M1340M2674M5152M7941M8981M8453M8674
$$ 2727744 2762214 2797909 2835461 2875285 2916625 2959299 3004451 3052392 3101373 3149826 3198500
57148C198500N0729N3586N6435N9488O2449O4421O5451O6248O6571O5908O5557
$$ 3198500 3249229 3302815 3359250 3418738 3481187 3545608 3611059 3677307 3743878 3809786 3875343
57137C875343O7684P2135P6140P7484P6371P4207P2276P1544P2038P2396P1583
$$ 3875343 3943027 4015162 4091302 4168786 4245157 4319364 4391640 4463184 4535222 4607618 4679201
57126D679201P0852P2416P6476Q1132Q4897Q7611Q9320R0069R0534R1252R1544
$$ 4679201 4750053 4822469 4898945 4980077 5064974 5152585 5241905 5331974 5422508 5513760 5605304
57115E605304R0671Q9328Q8568Q8097Q7291Q6699Q6664Q5770Q2893P9539P7663
$$ 5605304 5695975 5785303 5873871 5961968 6049259 6135958 6222622 6308392 6391285 6470824 6548487
57104F548487P6559P4498P2106P0980P0146O7493O3914O2513O4014O6235O7680
$$ 6548487 6625046 6699544 6771650 6842630 6912776 6980269 7044183 7106696 7170710 7236945 7304625
57093G304625O8347O7410O3635N7976N2512M6834L8628K7522J5328K884j0154
$$ 7304625 7372972 7440382 7504017 7561993 7614505 7661339 7699967 7727489 7742817 7745701 7735547
57082G735547k2948l4284m4994n6356o7184p6263q6199j00458j17850j34799j52008
$$ 7735547 7712599 7678315 7633321 7576965 7509781 7433518 7347319 7246861 7129011 6994212 6842204
57071F842204j73446j99551k26989k54669k84419l16182l48579l83708m25054
$$ 6842204 6668758 6469207 6242218 5987549 5703130 5386948 5038369 4654661 4229607
57062D229607m70954n17031n64868o20912o86337F13712b13160r03082r86560
$$ 4229607 3758653 3241622 2676754 2055842 1369505 613712 -213160 -1116242 -2102802
57053b102802j076428j175552j290367j422291j568014j729661j915580k129832
$$ -2102802 -3179230 -4354782 -5645149 -7067440 -8635454 -10365115 -12280695 -14410527
57045a4410527k371206k643786k956931l312660l705718m139054m626997n182170
$$ -14410527 -16781733 -19425519 -22382450 -25695110 -29400828 -33539882 -38166879 -43349049
57037d3349049n815309o549920p417711q434037r593343j0882603j2267329j3673087
$$ -43349049 -49164358 -55714278 -63131989 -71566026 -81159369 -92041972 -104309301 -117982388
57029a17982388j5045996j6451870j8023256j9712062k1144333k1871857k1833314
$$ -117982388 -133028384 -149480254 -167503510 -187215572 -208359905 -230231762 -252065076
57022b52065076k1484537k1377138k1600047k1645567k0774365j8480304j4699359
$$ -252065076 -273549613 -294926751 -316526798 -338172365 -358946730 -377427034 -392126393
57015c92126393r748904m161257J486639O720577J1257655J5001119J7963326
$$ -392126393 -401875297 -406036554 -404549915 -397829338 -386571683 -371570564 -353607238
57008c53607238K0183235K1689328K2511768K2711238K2387142K1657786K0637342
$$ -353607238 -333424003 -311734675 -289222907 -266511669 -244124527 -222466741 -201829399
57001b01829399J9428188J8116547J6759938J5384552J4008603J2666936J1403635
$$ -201829399 -182401211 -164284664 -147524726 -132140174 -118131571 -105464635 -94061000
56994i4061000J0244962R191727Q235806P371125O588867N876655N227913M643465
$$ -94061000 -83816038 -74624311 -66388505 -59017380 -52428513 -46551858 -41323945 -36680480
56986c6680480M120875L650517L225008K844355K508416K211740J949510J721901
$$ -36680480 -32559605 -28909088 -25684080 -22839725 -20331309 -18119569 -16170059 -14448158
56978a4448158J528621J364514J224025J104963J004724R17568Q38792P67647
$$ -14448158 -12919537 -11555023 -10330998 -9226035 -8221311 -7303743 -6464951 -5697304
56970e697304P03711O44517N89022N39131M95297M54452M14541L77235L43955
$$ -5697304 -4993593 -4349076 -3760054 -3220923 -2725626 -2271174 -1856633 -1479398 -1135443
56961a135443L13044K83137K55579e2628A54754J83289J61116J43261J28454J13886
$$ -1135443 -822399 -539262 -283683 -52628 154754 338043 499159 642420 770874 884760
56951H84760R8649Q3332O8752N6637M8812M4359M0421L6934L6775L9291L7279
$$ 884760 983409 1066741 1135493 1192130 1240942 1285301 1325722 1362656 1399431 1438722 1476001
56940A476001K3215m084m0799q2503j24329j59796j83501j94217j93659j84165
$$ 1476001 1499216 1495132 1454333 1371830 1247501 1087705 904204 709987 516328 332163
56930C32163A62771H296a33970j30887j17394j02527q9339p8869o9857o1671n4828
$$ 332163 162771 8296 -133970 -264857 -382251 -484778 -574117 -652986 -722843 -784514 -839342
56919h39342m9326m4869m2191m2150m3670m4464m3417m0941l7401l2780k7636
$$ -839342 -888668 -933537 -975728 -1017878 -1061548 -1106012 -1149429 -1190370 -1227771 -1260551 -1288187
56908a288187k2956j8868j4458q940k491L880Q994J2342J4541J6710J9389K2399
$$ -1288187 -1311143 -1330011 -1344469 -1353409 -1355900 -1352020 -1343026 -1330684 -1316143 -1299433 -1280044 -1257645
56896a257645K5223K6775K5504K1159J5896J2124R594O349K076j512l392l967
$$ -1257645 -1232422 -1205647 -1180143 -1158984 -1143088 -1130964 -1121370 -1115021 -1112945 -1114457 -1117849 -1121816
56884a121816l189m50L384O305P998J0042J2930J5517J7847K1683K7187L1941
$$ -1121816 -1125005 -1125455 -1122071 -1115766 -1107768 -1097726 -1084796 -1069279 -1051432 -1029749 -1002562 -970621
56872i70621L4550L6610L9647M2476M3178M1446L7553L1127K2560J3731N979o43
$$ -970621 -936071 -899461 -859814 -817338 -774160 -732714 -695161 -664034 -641474 -627743 -621764 -622407
56860f22407n273o043l457j073r63j087Q50L646N235O389Q787J1446J2168J1066
$$ -622407 -627680 -633723 -637180 -638253 -639216 -640303 -639453 -635807 -630572 -624183 -615396 -603950 -591782 -580716
56846e80716R880R134Q581R029J0923J2538J2290J1607J2630J4339J4065J1825
$$ -580716 -570836 -561702 -553121 -544092 -533169 -520631 -508341 -496734 -484104 -469765 -455700 -443875
56834d43875R904Q926P835P201Q875J2060J3301J1334R034R357J1659J3159J2090
$$ -443875 -433971 -425045 -417210 -410009 -401134 -389074 -375773 -364439 -355405 -346048 -334389 -321230 -309140
56821c09140Q269K382m040r020j1629j2469j2306j1147q900o046l179m91K156
$$ -309140 -300871 -298489 -302529 -311549 -323178 -335647 -347953 -359100 -368000 -374046 -377225 -377716 -375560
56808c75560N073Q575J2514J6415K0334K4804K9477L3104L5736L9330M4556M8321
$$ -375560 -370487 -361912 -349398 -332983 -312649 -287845 -258368 -225264 -189528 -150198 -105642 -57321
56796e7321a0774B7949K7916J6964O750k341r419j3801j5305j4054j1072E224
$$ -57321 -10774 27949 55865 72829 79579 77238 67819 54018 38713 24659 13587 5224
56783a514m335R59C391J5003K0409K5984L2500L9230M5860N2703N8948O2827O3631
$$ -1514 -5849 -4890 3391 18394 38803 64787 97287 136517 182377 235080 294028 356855 420486
56770D20486O1445N5016M2490K4783N937j0364k2893l1496l6180l8107l9094l9215
$$ 420486 481931 536947 579437 604220 610157 599793 576900 545404 509224 471117 432023 392808
56758C92808l6942l2211k6992k2114j6048q092l14N359R985J5704K2572K9033
$$ 392808 355866 323655 296663 274549 258501 250409 250095 255454 265439 281143 303715 332748
56746C32748L4081L7042L6344L0504K0110P509n049j6157k4990l1357l5496l7175
$$ 332748 366829 403871 440215 470719 490829 498338 493289 477132 452142 420785 385289 348114
56734C48114l5772l1866k7527k4236k1480j8302j4985j2103r020m720O29O037
$$ 348114 312342 280476 252949 228713 207233 188931 173946 161843 152823 148103 148732 154769
56722A54769J0968J5075J7469J7416J5291J1871P241J337n110j1191j6752k1640
$$ 154769 165737 180812 198281 215697 230988 242859 250100 251437 246327 235136 218384 196744
56710A96744k4703k4858k2797k0450j8904j7917j7183j6871A6204b47j5191j3382
$$ 196744 172041 147183 124386 103936 85032 67115 49932 33061 16204 -247 -15438 -28820
56698b8820j1666j0503r905r353q094n887l399j624j086j631k564k964k448j724
$$ -28820 -40486 -50989 -60894 -70247 -78341 -84228 -87627 -89251 -90337 -91968 -94532 -97496 -99944 -101668
56684a01668j661j796q34J104K041P90j160j461J78K026K751K499J945J347O43
$$ -101668 -103329 -105125 -105959 -104855 -102814 -102024 -103184 -104645 -104467 -102441 -99690 -97191 -95246 -93899 -93256
56669i3256k82j478k714l533l748l535k915j793p08n47j008n50J413L435M140
$$ -93256 -93538 -95016 -97730 -101263 -105011 -108546 -111461 -113254 -113962 -114509 -115517 -116067 -114654 -111219 -107079
56654a07079M117M396M243K395k61j407n08P26J179J522K161K146J094N23J738
$$ -107079 -102962 -98566 -94323 -91928 -92189 -93596 -94104 -93378 -92199 -90677 -88516 -86370 -85276 -84753 -83015
56639h3015L662M300L632L446M583N926O293N905N446M680L042R88j98m9M61J74
$$ -83015 -79353 -75053 -71421 -67975 -63392 -57466 -51173 -45268 -39822 -35142 -32100 -31112 -31310 -31359 -30898 -30724
56623c0724r67k199k972l199k951k559k644l317l603k573r54m04j115j388j85
$$ -30724 -31691 -33890 -36862 -40061 -43012 -45571 -48215 -51532 -55135 -57708 -58662 -59066 -60181 -61569 -61754
56608f1754J230J164J1m51K15O47o1j064j228q87j234k360k804j300J467L391
$$ -61754 -60524 -59360 -59349 -59800 -59585 -58938 -58999 -60063 -61291 -62178 -63412 -65772 -68576 -69876 -68409 -65018
56592f5018L257K031J478J986K450K173J862K525M135N790O634O292N010L788
$$ -65018 -61761 -59730 -58252 -56266 -53816 -51643 -49781 -47256 -43121 -37331 -30697 -24405 -19395 -15607
56578a5607L686M569b280A978K761J893K204L171L748K918N32k025k980k363j954
$$ -15607 -11921 -7352 -2280 1978 4739 6632 8836 12007 15755 18673 19205 17180 14200 11837 9883
56563I883k572k860j735m30n71A81a492j283k015l777m528l517k516l092m402
$$ 9883 7311 4451 2716 2286 1715 181 -1492 -2775 -4790 -8567 -13095 -16612 -19128 -22220 -26622
56548b6622m681l645k300j323n90J42Q99J571J936J821J444J326J749K615L632
$$ -26622 -31303 -34948 -37248 -38571 -39161 -39019 -38120 -36549 -34613 -32792 -31348 -30022 -28273 -25658 -22026
56533b2026M292M010K951K281K707b607c34A71AP70J720J440O79O25J186J749
$$ -22026 -17734 -13724 -10773 -8492 -5785 -2607 -334 171 1 771 2491 3931 4610 5235 6421 8170
56517H170K397L248L637L221L068M313O195O828N812M779N189O582P393O766N100
$$ 8170 10567 13815 17452 20673 23741 28054 34249 41077 46889 51668 56857 63439 70832 77598 82698
56502H2698L359K387K648M055N808O779O431N497N302O242P277P224O199N233
$$ 82698 86057 88444 91092 95147 100955 107734 114165 119662 124964 131206 138483 145707 151906 157139
56488A57139M787M330L238J504l85j734j957j293j007k134m127n520n753n493
$$ 157139 161926 166256 169494 170998 170613 168879 166922 165629 164622 162488 158361 152841 147088 141595
56474A41595n244m747l885l015k283j552j190j728k592k448j199l52q36j831k489
$$ 141595 136351 131604 127719 124704 122421 120869 119679 117951 115359 112911 111712 111360 110524 108693 106204
56459A06204l355m908o005n241l120j511j399k348l737n175o048n796m809m096
$$ 106204 102849 97941 91936 86695 83575 82064 80665 78317 74580 69405 63357 57561 52752 48656
56445D8656m006l847k791p26J461K295R38j569l131l130l080l987m326k201J494
$$ 48656 44650 40803 38012 37286 38747 41042 41980 40411 37280 34150 31070 27083 22757 20556 22050
56430B2050L969M190L720L891M127L657L114L412M150M282L725L229L126L056
$$ 22050 26019 30209 33929 37820 41947 45604 48718 52130 56280 60562 64287 67516 70642 73698
56416G3698K856K974L809M989N555M883L398K357K800M667O834P884P012M695
$$ 73698 76554 79528 83337 88326 93881 98764 102162 104519 107319 111986 118820 126704 133716 138411
56402A38411K534J966K875L877M044L801L902M315M504M202L339J966O55K77P48
$$ 138411 140945 142911 145786 149663 153707 157508 161410 165725 170229 174431 177770 179736 180391 180668 181416
56387A81416P92k18j081m04J364K554K445J531K35j363k801l429l249k642j585
$$ 181416 182208 181990 180909 180505 181869 184423 186868 188399 188634 187271 184470 181041 177792 175150 173565
56372A73565k03M18o75k673l717l211k124j271o19k70p24k000l624n346o725o475
$$ 173565 173362 173780 173105 170432 166715 163504 161380 160109 159490 159220 158496 156496 152872 147526 140801 134326
56356A34326l872o29O37j15m31P63J659P16q69j279q35r33j520j429m71M88J022
$$ 134326 130454 129825 130462 130347 129916 130679 132338 133054 132185 130906 130071 129138 127618 126189 125718 126206 127228
56339A27228J417J658J407Q61P85J542K658L206K504Q85j81M63J900J925P9j404
$$ 127228 128645 130303 131710 132571 133356 134898 137556 140762 143266 144151 143970 144433 146333 148258 148337 146933
56323A46933n19J834L219K857K027J924K570L566M627N223M728L262J791J191
$$ 146933 146414 148248 151467 154324 156351 158275 160845 164411 169038 174261 178989 182251 184042 185233
56309A85233J587K583L771M880N695N859M980L234J671J327K094L070L899M804
$$ 185233 186820 189403 193174 198054 203749 209608 214588 217822 219493 220820 222914 225984 229883 234687
56295B34687N400M800L188J957J781J818J486J641K932M244M122K898K039K056
$$ 234687 240087 244887 248075 250032 251813 253631 255117 256758 259690 263934 268056 270954 272993 275049
56281B75049K324K484K683K815K709K831L738M951N493N443N892P228Q426Q388
$$ 275049 277373 279857 282540 285355 288064 290895 294633 299584 305077 310520 316412 323640 332066 340454
56267C40454P389O802P567R169J0201J0024R454R526J0023J0100R941J0458J1467
$$ 340454 347843 354645 362212 371381 381582 391606 401060 410586 420609 430709 440650 451108 462575
56254D62575J1799J1457J1799J2955J2942J0595P642O452P027P798Q175Q544Q777
$$ 462575 474374 485831 497630 510585 523527 534122 541764 548216 555243 563041 571216 579760 588537
56241E88537Q515Q319Q862R715J0278J1067J2392J2836J1069Q467P684R004J0470
$$ 588537 597052 605371 614233 623948 634226 645293 657685 670521 681590 690057 697741 706745 717215
56228G17215J1402J3366J7220K1511K4613K6645K8368K9785L0816L2220L4739
$$ 717215 728617 741983 759203 780714 805327 831972 860340 890125 920941 953161 987900
56217I87900L8043M1322M4365M7626N1629N6630O2388O8230P3661P8960Q4720
$$ 987900 1025943 1067265 1111630 1159256 1210885 1267515 1329903 1398133 1471794 1550754 1635474
56206A635474R1113R8117J06011J14977J24663J34901J46213J58758J71441J83182
$$ 1635474 1726587 1824704 1930715 2045692 2170355 2305256 2451469 2610227 2781668 2964850
56196B964850J94365K05731K16540K25348K32062K37469K40966K40479K34644
$$ 2964850 3159215 3364946 3581486 3806834 4038896 4276365 4517331 4757810 4992454
56187D992454K23672K08136J88518J65863J41326J15039Q6889N8273L1323O391
$$ 4992454 5216126 5424262 5612780 5778643 5919969 6035008 6121897 6180170 6211493 6217884
56177F217884j7801m1265o1927p8232r0877j01275j09937j17177j23896j30740
$$ 6217884 6200083 6158818 6096891 6018659 5927782 5826507 5716570 5599393 5475497 5344757
56167E344757j37434j43664j49594j54955j58840j61099j62962j65451j68047
$$ 5344757 5207323 5063659 4914065 4759110 4600270 4439171 4276209 4110758 3942711
56158C942711j69544j69424j67766j64608j60120j54931j49718j44609j39139
$$ 3942711 3773167 3603743 3435977 3271369 3111249 2956318 2806600 2661991 2522852
56149B522852j32599j24629j15855j07635j00642r4216q7692q1555p6286p1050
$$ 2522852 2390253 2265624 2149769 2042134 1941492 1847276 1759584 1678029 1601743 1530693
56139A530693o4941n8767n3894m9974m5658m1108l7682l5320l2443k8612k5196
$$ 1530693 1465752 1406985 1353091 1303117 1257459 1216351 1178669 1143349 1110906 1082294 1057098
56128A057098k2972k1032j8593j6131j4129j2221j0137q164o368m753m138n140
$$ 1057098 1034126 1013094 994501 978370 964241 952020 941883 933719 927351 922598 918460 913320
56116I13320o185m621l39L686N108M727M566N311O569Q114R772J1138J2188J3248
$$ 913320 907135 902514 902175 905861 910969 915696 920262 925573 932142 940256 950028 961166 973354 986602
56102I86602J4089J4124J3606J3289J2940J1830J0673J1115J3057J4493J4564
$$ 986602 1000691 1014815 1028421 1041710 1054650 1066480 1077153 1088268 1101325 1115818 1130382
56091A130382J4890J7219K1393K6242L0804L4240L6291L8412M2852N0028N8269
$$ 1130382 1145272 1162491 1183884 1210126 1240930 1275170 1311461 1349873 1392725 1442753 1501022
56080A501022O6455P5196Q5195R6183J07676J19013J28525J34564J37368J37970
$$ 1501022 1567477 1642673 1727868 1824051 1931727 2050740 2179265 2313829 2451197 2589167
56070B589167J35672J29095J19522J10231J02262R3834Q4137P4356O4425N2313
$$ 2589167 2724839 2853934 2973456 3083687 3185949 3279783 3363920 3438276 3502701 3555014
56060C555014L7722K3134R951l191j6913k9208l8908m7929n8188o9068p9741r1001
$$ 3555014 3592736 3615870 3625821 3622630 3605717 3576509 3537601 3489672 3431484 3362416 3282675 3191674
56048C191674j02652j11857j16420j17395j16408j12755j05372r5504q5294p5642
$$ 3191674 3089022 2977165 2860745 2743350 2626942 2514187 2408815 2313311 2228017 2152375
56038B152375o7170o1040n6991n2810m7524m2949m0437l8488l5265l1222k7555
$$ 2152375 2085205 2024165 1967174 1914364 1866840 1823891 1783454 1744966 1709701 1678479 1650924
56027A650924k4473k2354k1938k1914j9385j4456j1042j1176j1857r801n955k733
$$ 1650924 1626451 1604097 1582159 1560245 1540860 1526404 1515362 1504186 1492329 1482528 1476573 1473840
56015A473840j05K712M737N227N523O386O539O225Q581J4536J9967K1337K0812
$$ 1473840 1473735 1476447 1481184 1486411 1491934 1498320 1504859 1511084 1519665 1534201 1554168 1575505 1596317
56002A596317K2195K5099K7099K8493L0775L2939L3435L3393L4255L4646L3282
$$ 1596317 1618512 1643611 1670710 1699203 1729978 1762917 1796352 1829745 1864000 1898646 1931928
55991A931928L2280L3694L5466L4880L3522L4576L7617M0266M2676M6121M9287
$$ 1931928 1964208 1997902 2033368 2068248 2101770 2136346 2173963 2214229 2256905 2303026 2352313
55980B352313N0258N0453N2593N6455O0173O3740O7806P1277P3411P5881P9684
$$ 2352313 2402571 2453024 2505617 2562072 2622245 2685985 2753791 2825068 2898479 2974360 3054044
55969C054044Q2893Q4567Q7401R3086R8950J02938J07620J15137J22760J28141
$$ 3054044 3136937 3221504 3308905 3401991 3500941 3603879 3711499 3826636 3949396 4077537
55959D077537J34262J43824J53554J59887J65646J74786J85003J92290J98516
$$ 4077537 4211799 4355623 4509177 4669064 4834710 5009496 5194499 5386789 5585305
55950E585305K07393K17041K23894K30205K40131K52019K62243K73119K89109
$$ 5585305 5792698 6009739 6233633 6463838 6703969 6955988 7218231 7491350 7780459
55941G780459L08503L26669L44266L64534L85920M05421M25598M50261M76997
$$ 7780459 8088962 8415631 8759897 9124431 9510351 9915772 10341370 10791631 11268628
55932A1268628N01910N27436N57096N87562O15090O44646O82848P27039P71449
$$ 11268628 11770538 12297974 12855070 13442632 14057722 14702368 15385216 16112255 16883704
55923A6883704Q18273Q71715R27458R80321J036255J103664J179267J256265J339739
$$ 16883704 17701977 18573692 19501150 20481471 21517726 22621390 23800657 25056922 26396661
55914B6396661J438875J550872J669075J799880J953575K125259K304393K496820
$$ 26396661 27835536 29386408 31055483 32855363 34808938 36934197 39238590 41735410
55906D1735410K717057K966180L239924L551918L925422M370245M893269N521257
$$ 41735410 44452467 47418647 50658571 54210489 58135911 62506156 67399425 72920682
55898G2920682O283069P180645Q211959R409472J0817054J2451285J4344000J6601552
$$ 72920682 79203751 86384396 94596355 104005827 114822881 127274166 141618166 158219718
55890A58219718J9332889K2505687K5939776K9402544L2519458L4495957L4120888
$$ 158219718 177552607 200058294 225998070 255400614 287920072 322416029 356536917
55883C56536917L0353618K3062051J3203052K340722p965395j6496927k2523055
$$ 356536917 386890535 409952586 423155638 425496360 417530965 401034038 378510983
55876C78510983k5910895k7087537k6752956k5542447k3893708k2093935k0322624
$$ 378510983 352600088 325512551 298759595 273217148 249323440 227229505 206906881
55869B06906881j8650517j7078074j5605904j4250964j3012324j1866097j0796499
$$ 206906881 188256364 171178290 155572386 141321422 128309098 116443001 105646502
55862A05646502r802327q875170p999969p176714o417243n721406n078067m487741
$$ 105646502 95844175 86969005 78969036 71792322 65375079 59653673 54575606 50087865
55854E0087865l962898l506729l110743k771911k493238k267352k076734j910843
$$ 50087865 46124967 42618238 39507495 36735584 34242346 31974994 29898260 27987417
55846B7987417j768262j642843j523193j406237j297629j198480j104176j015654
$$ 27987417 26219155 24576312 23053119 21646882 20349253 19150773 18046597 17030943
55838A7030943r38889q73097q11169p51737o99615o54735o11730n70245n34853
$$ 17030943 16092054 15218957 14407788 13656051 12956436 12301701 11689971 11119726 10584873
55829A0584873n04849m74413m42903m15088l91438l67894l44955l27111l13297
$$ 10584873 10080024 9605611 9162708 8747620 8356182 7988288 7643333 7316222 7002925
55820G002925k97545k79338k63990k52510k40409k27051k16961k10735k03392
$$ 7002925 6705380 6426042 6162052 5909542 5669133 5442082 5225121 5014386 4810994
55811D810994j92982j82786j73991j64170j54034j47646j44597j39518j30659
$$ 4810994 4618012 4435226 4261235 4097065 3943031 3795385 3650788 3511270 3380611
55802C380611j21677j13863j04290r3186q5529q3124q1966p9528p7978p7979p5943
$$ 3380611 3258934 3145071 3040781 2947595 2862066 2778942 2696976 2617448 2539470 2461491 2385548
55791B385548p0345o4816o2108o0104n6494n2637n0138m7843m4663m1692l9566
$$ 2385548 2315203 2250387 2188279 2128175 2071681 2019044 1968906 1921063 1876400 1834708 1795142
55780A795142l7113l3897l0952k8283k5121k2850k3777k6733k8075k7181k6712
$$ 1795142 1758029 1724132 1693180 1664897 1639776 1616926 1593149 1566416 1538341 1511160 1484448
55769A484448k7279k6609k4273k2458k1527j9624j7334j7676k0540k2188k1418
$$ 1484448 1457169 1430560 1406287 1383829 1362302 1342678 1325344 1307668 1287128 1264940 1243522
55758A243522k1289k3274k4659k3556k1862k1165k0026j7501j5390j4816j4108
$$ 1243522 1222233 1198959 1174300 1150744 1128882 1107717 1087691 1070190 1054800 1039984 1025876
55747A025876j2112j0180r075p302m468k870l710m816m106k508j650j478j974
$$ 1025876 1013764 1003584 994509 987207 982739 979869 976159 971343 967237 964729 963079 961601 959627
55734I59627m335q448j1739j2566j2551j3753j5546j6144j5419j4454j3662j2749
$$ 959627 955292 946844 935105 922539 909988 896235 880689 864545 849126 834672 821010 808261
55722H08261j1550j0058q542p833q270q740q302q257j0413j3843j5910j6286j7120
$$ 808261 796711 786653 778111 770278 762008 753268 744966 736709 726296 712453 696543 680257 663137
55709F63137j9243k0900k0532j8377j5283j2251j0867j1629j2213j0224p204o710
$$ 663137 643894 622994 602462 584085 568802 556551 545684 534055 521842 511618 504414 497704
55697D97704q856j0364r814r003q833p903n990n003n355m952l143k290l896o201
$$ 497704 488848 478484 468670 459667 450834 442931 436941 431938 426583 421631 418488 416198 412302 406101
55683D06101p204p248p209o714n714n389o110o549n954n251m978m275k800j612
$$ 406101 398897 391649 384440 377726 372012 366623 360513 353964 348010 342759 337781 333506 330706 329094
55669C29094j356j512j828k601l288l094k955m541p202q583q162p453o807n195
$$ 329094 327738 326226 324398 321797 318509 315415 312460 307919 300717 292134 283972 276519 269712 264517
55655B64517l179k641l323l062j786j525k060o28L086N725N459M497M791N014
$$ 264517 261338 258697 255374 252312 250526 249001 246941 246313 249399 255124 260583 265080 269871 274885
55641B74885L778K396K142J863N41n77m36j42m98k47J339K685K651K535L466M145
$$ 274885 278663 281059 283201 285064 285605 285028 284592 284450 283952 283705 285044 287729 290380 292915 296381 300526
55625C00526L232J662P62K06m10k13J028J714Q75k09l19o5r3J36N63N0j054o27
$$ 300526 303758 305420 306182 306388 305978 305765 306793 308507 309382 309173 308854 308789 308696 308832 309395 309445 308391 307764
55607C07764J550K803J904J249K682M274L786K523K901M526N425N258M781L833
$$ 307764 309314 312117 314021 315270 317952 322226 326012 328535 331436 335962 341387 346645 351426 355259
55593C55259K357J585J985J830p0k093k369j826k368l904n375o910q761r806r397
$$ 355259 357616 359201 361186 363016 362946 360853 358484 356658 354290 350386 345011 338101 329340 319534 310137
55578C10137r053j0077j1172j0543q749p371o591o159o912r001j0445r777q390
$$ 310137 301084 291007 279835 269292 260543 253172 246581 240422 233510 224509 214064 204287 195897
55565A95897q031p907o760n722o248p065o318n164n874p601p444n000k653j744
$$ 195897 187866 179959 173199 167477 161229 154164 147846 142682 136808 129207 121763 116763 114110 112366
55551A12366j469j325j771k487k505k092k369l007k554j060l58j346k750k933
$$ 112366 110897 109572 107801 105314 102809 100717 98348 95341 92787 91727 91369 90023 87273 84340
55537H4340j783n25m54j716k893k372n09O12M1r02j061j123j729j891r24k22j148
$$ 84340 82557 82032 81578 79862 76969 74597 74088 74700 74741 73839 72778 71655 69926 68035 67111 66889 65741
55520F5741k707l141k525j980j664j242j081j243p48N84J215M00k21O46J711J687
$$ 65741 63034 59893 57368 55388 53724 52482 51401 50158 49410 49994 51209 51609 51388 52034 53745 55432
55504E5432J796L103L631J312j964k833j568j161k251k707j776r78r35n95K3n45
$$ 55432 57228 60331 63962 65274 63310 60477 58909 57748 55497 52790 51014 50036 49101 48506 48529 47984
55488D7984k296l101j758N43K293L217L356K509J234Q70J961L678M887M979M042
$$ 47984 45688 42587 40829 41372 43665 46882 50238 52747 53981 54851 56812 60490 65377 70356 74398
55473G4398L087L440M935N619M370K591K008K315K582L309M930N847M394J609
$$ 74398 77485 80925 85860 91479 95849 98440 100448 102763 105345 108654 113584 119431 123825 125434
55459A25434l18j120j642j423J04J318L63j630k400k458l807n620n183k776j745
$$ 125434 125116 123996 122354 120931 121035 122353 122716 121086 118686 116228 112421 106801 101618 98842 97097
55444I7097l394n490o278o546o909o473n234m756n360n396m375l994m906n163
$$ 97097 93703 88213 81935 75389 68480 62007 56773 52017 46657 41261 36886 32892 27986 22823
55430B2823l410j211o09j267j574j003o8O59N69o62k101k330j564j351j854j536
$$ 22823 19413 18202 17593 16326 14752 13749 13681 14340 14909 14247 12146 9816 8252 6901 5047 3511
55414C511k7R55L94m98o32p82A291g56j016K53p1j777l008k806j910j518k007
$$ 3511 3484 4439 4833 4335 3703 2921 1291 -756 -1772 -1519 -1590 -3367 -6375 -9181 -11091 -12609 -14616
55397a4616k676k355o40J349K170J803J341J225J088J063J622K096J196o93j549
$$ -14616 -17292 -19647 -20287 -18938 -16768 -14965 -13624 -12399 -11311 -10248 -8626 -6530 -5334 -6027 -7576
55382g576o48L09k27j551k232k328k732l240k610l74K310L689L042J337J69k3
$$ -7576 -8224 -7915 -8142 -9693 -11925 -14253 -16985 -20225 -22835 -23209 -20899 -17210 -14168 -12831 -12662 -12685
55366a2685k11r79j405n34J036K113K608L035L134a463e3G42K81m43eB35O94j12
$$ -12685 -12896 -13875 -15280 -15814 -14778 -12665 -10057 -7022 -3888 -1463 -53 742 1023 580 -5 235 929 817
55348H17C46J286L340K717J14j193p11j011B310c42k47A067Q25q62A55l5b94j590
$$ 817 346 1632 4972 7689 7803 6610 5899 4888 2310 -342 -589 1067 1892 1030 155 120 -294 -1884
55330a884j571p5J370d38F14j36e64r90o70j667l965n378m470k488j251q22m12
$$ -1884 -3455 -3530 -2160 -438 614 478 -564 -1554 -2224 -3891 -7856 -13234 -17704 -20192 -21443 -22265 -22677
55313b2677n7j0K57J007J442J057O27P04M69o56j511q08P79J477P38n00j222j059
$$ -22677 -22734 -22744 -22487 -21480 -20038 -18981 -18354 -17650 -17181 -17837 -19348 -20156 -19377 -17900 -17162 -17662 -18884 -19943
55295a9943j14J122K078K592K621J605n86k440k136k62P27m8r69r39q74j336j063
$$ -19943 -20057 -18935 -16857 -14265 -11644 -10039 -10625 -13065 -15201 -15463 -14736 -14784 -15753 -16692 -17566 -18902 -19965
55278a9965O85K342K280J097J72m69j198j319k76Q20N91o85j863k582k834k150
$$ -19965 -19280 -16938 -14658 -13561 -13389 -13858 -15056 -16375 -16651 -15831 -15240 -15925 -17788 -20370 -23204 -25354
55262b5354n81O20N73L8l7N8p5J56R33J006l93j953k174j634j650j921j335q3
$$ -25354 -25935 -25315 -24742 -24704 -24741 -24683 -24758 -24602 -23669 -22663 -23056 -25009 -27183 -28817 -30467 -32388 -33723 -33806
55244c3806Q36J337J896K317K332K401K520J407j350l594l047m30J824K930L606
$$ -33806 -32970 -31633 -29737 -27420 -25088 -22687 -20167 -18760 -20110 -23704 -26751 -27181 -25357 -22427 -18821
55229a8821L624K089j94j304j050r51j277n75J439K876K333P54l18q12j390j953
$$ -18821 -15197 -13108 -13302 -14606 -15656 -16607 -17884 -18459 -17020 -14144 -11811 -11057 -11375 -12187 -13577 -15530
55213a5530j995j614j211p20O0P38O94L6l70Q1J021J556J303N80l00j349k166
$$ -15530 -17525 -19139 -20350 -21070 -21010 -20272 -19578 -19542 -19912 -19831 -18810 -17254 -15951 -15371 -15671 -17020 -19186
55196a9186j826k99P84J26j124r37L90P36k43o63k0l38k451l903k592j56O60J64
$$ -19186 -21012 -21311 -20527 -20401 -21525 -22462 -22072 -21336 -21579 -22242 -22262 -22600 -25051 -28954 -31546 -31702 -31042 -30878
55178c0878N06J779K216J517J124J434J360N89P1J60K33J97M76M66r37l090l780
$$ -30878 -30372 -28593 -26377 -24860 -23736 -22302 -20942 -20353 -20282 -20122 -19889 -19692 -19216 -18750 -19687 -22777 -26557
55161b6557k121L58J849K049J518Q46Q24J928L194L016J493N03R51J484P48m66
$$ -26557 -28678 -28320 -26471 -24422 -22904 -22058 -21234 -19306 -16112 -13096 -11603 -11100 -10149 -8665 -7917 -8383
55145h383n83K85O26j43r06n47N23R30J51p76n41Q01J947J990J228K86o94j516
$$ -8383 -8966 -8681 -8055 -8198 -9104 -9651 -9128 -8198 -8047 -8823 -9364 -8563 -6616 -4626 -3398 -3112 -3806 -5322
55127e322j561p02J41J66j84j11K23J88p9K4M16N76O04R58J307Q30m20j269q18
$$ -5322 -6883 -7585 -7444 -7278 -7462 -7573 -7350 -7162 -7241 -7217 -6801 -6225 -5621 -4663 -3356 -2526 -2946 -4215 -5033
55108e033N98J851e67D32Ga453k156k940l301k088L77J948J238n71j666k098k847
$$ -5033 -4435 -2584 -567 432 7 -1453 -3609 -6549 -9850 -11938 -11561 -9613 -8375 -8946 -10612 -12710 -15557
55091a5557l547l009j483m85n25o59k61J90K63J72M9k01l00K61J367K399K989
$$ -15557 -19104 -22113 -23596 -24081 -24606 -25265 -25526 -25336 -25073 -24901 -24852 -25053 -25353 -25092 -23725 -21326 -18337
55074a8337K987K089N28m34J29J316J556R14P62J507K048J536L26p98j160j66
$$ -18337 -15350 -13261 -12733 -13167 -13038 -11722 -10166 -9252 -8490 -6983 -4935 -3399 -3073 -3871 -5031 -5197
55058e197J941B27L015J471J081K109K465R30j064j599o99M38J343K164K510J744
$$ -5197 -3256 227 3242 4713 5794 7903 10368 11298 10234 8635 7936 8374 9717 11881 14391 16135
55042A6135J44j213j699j690j691j414p7K308M253M059J816n33j498j594j992
$$ 16135 16279 15066 13367 11677 9986 8572 8495 10803 15056 19115 20931 20398 18900 17306 15314
55027A5314k545k233r56K94R10J190J513J882K207K338J962J153O47Q16Q37j94
$$ 15314 12769 10536 9580 9874 10784 11974 13487 15369 17576 19914 21876 23029 23676 24492 25329 25135
55011B5135j731k352j520J36J889L272L739L054J807P13j82q55o66N18J388Q37
$$ 25135 23404 21052 19532 19668 21557 24829 28568 31622 33429 34142 33960 33105 32439 32957 34345 35182
54995C5182j88m3J009J306N41nJ50N4o59r87l52L38N8r95j949k167j555p58q73
$$ 35182 34994 34951 35960 37266 37807 37802 37952 38006 37347 36360 36008 36346 36404 35409 33460 31293 29738 28980 28107
54976B8107j984k469j097P37P00r34j638n01O59N30K47J080K259K496K057J903
$$ 28107 26123 23654 22557 23294 23994 23060 21422 20921 21580 22110 22357 23437 25696 28192 30249 32152
54960C2152J885J230J0j022j456j279n28M95J287J880K720L461K970J073p32j059
$$ 32152 34037 35267 35277 34255 32799 31520 30992 31487 32774 34654 37374 40835 43805 44878 44146 43087
54944D3087j99O98J114J119P51J58j89j26j25n50j188j842k588l107k593q59J165
$$ 43087 42888 43586 44700 45819 46570 46728 46539 46413 46288 45738 44550 42708 40120 37013 34420 33561 34726
54927C4726K467K794K296J204J63j50j11q31k300k929j598Q39K861M149N191N755
$$ 34726 37193 39987 42283 43487 43650 43500 43389 42558 40258 37329 35731 36570 39431 43580 48771 54526
54911E4526M948K630k0j455r83Q72K900M159M455M068L418L178L988N540O694
$$ 54526 59474 62104 62084 60629 59646 60518 63418 67577 72032 76100 79518 82696 86684 92224 98918
54896I8918P276Q731J1792J4530J4635J2920J2441J4311J6675J7899J8241J8014
$$ 98918 106194 114925 126717 141247 155882 168802 181243 195554 212229 230128 248369 266383
54884B66383J6573J4221J2656J2124J0211N191j155n900q697j1186j3907j5913
$$ 266383 282956 297177 309833 321957 332168 337359 336204 330304 321607 310421 296514 280601
54872B80601j6796j7038j6574j4835j2171r944q970q965r351r642r093p121m328
$$ 280601 263805 246767 230193 215358 203187 193243 184273 175308 165957 156315 147222 140101 135773
54859A35773k246j766k182j903K1K954N158N526M933N324P363R739J1056J1465
$$ 135773 133527 131761 129579 127676 127697 130651 135809 141335 146268 151592 158955 168694 179750 191215
54845A91215J1948J2957J4481J6571J8714J9276J6745J1504N605P58k859n903
$$ 191215 203163 216120 230601 247172 265886 285162 301907 313411 319016 319774 316915 311012
54833C11012q598j0549j1617j2423j3617j4702j4425j2713j1361j1880j3396j3828
$$ 311012 302414 291865 280248 267825 254208 239506 225081 212368 201007 189127 175731 161903
54821A61903j2607j0867r415q125p131o793o438n036l281l062m371m887l385j485
$$ 161903 149296 138429 129014 120889 113758 106965 100527 95491 92210 89148 84777 79890 76505 75020
54807G5020r30j111p42k00n04j324j761j998k536k748j929j046j619l363m453
$$ 75020 74090 72979 72237 72037 71533 70209 68448 66450 63914 61166 59237 58191 56572 53209 48756
54792D8756l953k558j283o22q02j634k157j444K05J527J643O79n80j229r47n37
$$ 48756 44803 42245 40962 40340 39538 37904 35747 34303 34508 36035 37678 38357 37777 36548 35601 35064
54776C5064j221k897l986l423j909n85M71J684K896L729M145L882K425L29o45
$$ 35064 33843 30946 26960 23537 21628 21043 21514 23198 26094 29823 33968 37850 40275 40604 39959
54761C9959K67J754K526L071L962M048K198k32q20P44K830M542O166P352P140
$$ 39959 40226 41980 44506 47577 51539 55587 57785 57553 56733 57477 60307 64849 71015 78367 85507
54746H5507N845M989N079N217N153N978Q170J0454J1430J1284J1302J2394J4620
$$ 85507 91352 96341 101420 106637 111790 117768 125938 136392 147822 159106 170408 182802 197422
54733A97422J7357J9528K0154J9050J6818J4280J2009J0090P813M291o7l442m815
$$ 197422 214779 234307 254461 273511 290329 304609 316618 326708 334521 338812 338745 335303 330488
54720C30488n568p618j0547j2118j1378r777r058r282r367q537o872n017l694
$$ 330488 324920 317302 306755 294637 283259 273482 264424 255142 245775 237238 230366 225349 221655
54707B21655l130k984k932k929k671j572J02J129J213J934M566P883R803J0435
$$ 221655 218525 215541 212609 209680 207009 205437 205539 206668 207881 209815 214381 222264 232067 242502
54693B42502J1599J3667J5144J5543J6491J9112K2025K3087K2038K0178J8214
$$ 242502 254101 267768 282912 298455 314946 334058 356083 379170 401208 421386 439600
54682D39600J5507J1403O484K246l28j806l660o625j0079j3252j6148j8764k0289
$$ 439600 455107 466510 472994 475240 474912 473106 469446 462821 452742 439490 423342 404578 384289
54669C84289k0233j9649j9850k0371j9691j7814j6476j6491j6398j4409j0715
$$ 384289 364056 344407 324557 304186 284495 266681 250205 233714 217316 202907 192192
54658A92192p124n098m748n260n697n581n040m371l619k782k208k226k575k650
$$ 192192 185068 179970 175222 169962 164265 158684 153644 149273 145654 142872 140664 138438 135863 133213
54644A33213k215j569j203j537k558l413k993j440k93n41j315j274m64K55P52
$$ 133213 130998 129429 128226 126689 124131 120718 117725 116285 115992 115451 114136 112862 112398 112653 113405
54629A13405J402J915J738J171Q08L47p28j688j419m22l54j512k345j667R0J987
$$ 113405 114807 116722 118460 119631 120439 120786 120058 118370 116951 116529 116175 114663 112318 110651 110741 112728
54613A12728L603M561M341L120J891J393J618K465L896N368O103O106N976N723
$$ 112728 116331 120892 125233 128353 130244 131637 133255 135720 139616 144984 151087 157193 163169 168892
54599A68892M783L417K887L978O005P581P688O167M023L146M657P463R285R004
$$ 168892 173675 177092 179979 183957 189962 197543 205231 211398 215421 218567 223224 230687 239972 248976
54585B48976P293N353M224M843P253R808J0703J0319J0710J2757J5404J7663J9564
$$ 248976 256269 261622 265846 270689 277942 287750 298453 308772 319482 332239 347643 365306 384870
54572C84870K0911K0997K0131J9598J9364J7567J3221P815L023j649p433j3651
$$ 384870 405781 426778 446909 466507 485871 503438 516659 524474 527497 525848 518415 504764
54560E04764j8269k0496k1459k2332k3010k2706k1168j9064j7339j6248j5197
$$ 504764 486495 465999 444540 422208 399198 376492 355324 336260 318921 302673 287476
54549B87476j3785j2539j1908j1079q961o109m260l942m042l928m319n426n921
$$ 287476 273691 261152 249244 238165 229204 223095 218835 214893 210851 206923 202604 197178 191257
54536A91257m767k800j526j356j888k864l901m207l617l125l570m510n132n403
$$ 191257 186490 183690 182164 180808 178920 176056 172155 167948 164331 161206 157636 153126 147994 142591
54522A42591n531n244m481m017m383m950m909m447m012l335k231j556k054k890
$$ 142591 137060 131816 127335 123318 118935 113985 109076 104629 100617 97282 95051 93495 91441 88551
54508H8551k611j186R0M20Q6m84j014r66m1Q96N24j069k160j352Q80K801L076
$$ 88551 85940 84754 84844 85264 85350 84866 83852 82886 82845 83741 84265 83196 81036 79684 80564 83365 86441
54491H6441J708j11j022p48k84m86q06q4J592K769K564J836J948K987L860L786
$$ 86441 88149 88038 87016 86268 85984 85498 84692 84608 86200 88969 91533 93369 95317 98304 102164 105950
54475A05950L005K140J553J543K566M628O777P898P949P852Q132Q446Q653R356
$$ 105950 108955 111095 112648 114191 116757 121385 128162 136060 144009 151861 159993 168439 177092 186448
54461A86448J0798J1999J1791J0138P738M994K305N41j06j133l978p552r334q922
$$ 186448 197246 209245 221036 231174 238912 243906 246211 246752 246646 245513 241535 233983 224649 215727
54447B15727q514r382r981q711o803o636q222r232q325o779o504p507q044o824
$$ 215727 207213 197831 187850 179139 172336 165700 157478 148246 139921 133142 126638 119131 111087 104263
54433A04263m457k647k142j890m96J839L364K763M97j835k974k700j599m33M35
$$ 104263 99806 97159 95017 93127 92631 94470 97834 100597 101094 99259 96285 93585 91986 91553 91988
54418I1988R93J009R9j253j607m41O51j11j922k168J34L116M511L910K276N89
$$ 91988 92981 93990 94089 92836 91229 90788 91439 91328 89406 87238 87372 90488 94999 98909 101185 101774
54402A01774m58n97l90o40j137r88l45l81j250j591p93j55q73k140k443j748j150
$$ 101774 101316 100719 100329 99689 98552 97564 97219 96838 95588 93997 93204 93049 92176 90036 87593 85845 84695
54385H4695j162j482j978k756l506l624k929j793p26rM84J159J937J922O12q39
$$ 84695 83533 82051 80073 77317 73811 70187 67258 65465 64739 64730 65214 66373 68310 70232 70844 70005
54369G0005q12M99J314Q50R7j92n17j143j305p04j03L13J501L475M377L030Q59
$$ 70005 69193 69692 71006 71856 71953 71761 71244 70101 68796 68092 67989 68302 69803 73278 77655 80685 81544
54352H1544j95k74n32p26K36K133L565L766L009J787P80Q98K078K773J978R50
$$ 81544 81349 81075 80543 79817 80053 82186 85751 89517 92526 94313 95093 95991 98069 100842 102820 103770
54336A03770J541L506M968N069M575M231L917L331K304P22q94j181N76L093M343
$$ 103770 105311 108817 113785 118854 123429 127660 131577 134908 137212 137934 137040 135859 136435 139528 143871
54321A43871L806K570J626J090O26k90k107m315n521n184m399m065l505k083r12
$$ 143871 147677 150247 151873 152963 153589 153299 151192 146877 141356 136172 131773 127708 124203 122120 121208
54306A21208j120j608o17J153J303p14k972l953m031l853l220k149j378j260j311
$$ 121208 120088 118480 117863 119016 120319 119605 116633 112680 108649 104796 101576 99427 98049 96789 95478
54291I5478j191r97n46M46J375J246L24o0N26J199J534K271L799N138N138L877
$$ 95478 94287 93290 92744 93190 94565 95811 96135 96075 96601 97800 99334 101605 105404 110542 115680 119557
54275A19557K404J827K706M511N628M927L278K419K332J237j541m235m933m022
$$ 119557 121961 123788 126494 131005 136633 141560 144838 147257 149589 150826 149285 145050 140117 136095
54261A36095l297l496l846l645l300l632m683n594n634n129m932n052m553l190
$$ 136095 132798 129302 125456 121811 118511 114879 110196 104602 98968 93839 88907 83855 79302 76112
54247G6112k186k574l517l411k118q88l50M4O14P13k20j757k864k785j616m08
$$ 76112 73926 71352 67835 64424 62306 61418 61068 61112 61726 62439 62219 60462 57598 54813 53197 52789
54231E2789l12j039q00J282L481L350R05j458j960r48M06J366J406J52j861l233
$$ 52789 52477 51438 50638 51920 55401 58751 59656 58198 56238 55290 55696 57062 58468 58620 56759 53526
54215E3526k956j218R90K506K567J479N42N42P96L75m26p94p44n53K70J954L151
$$ 53526 50570 49352 50342 52848 55415 56894 57436 57978 58774 59149 58723 57929 57185 56632 56902 58856 62007
54198F2007K477Q13J89Q45J318J055P91M97o54k148k318j105l61q51j217o26j45
$$ 62007 64484 65297 65486 66331 67649 68704 69495 69992 69338 67190 64872 63767 63406 62555 61338 60712 60567
54181F0567m00j43J474L074L011J705N29k50r79j274p42j49m44j215j332n37M63
$$ 60567 60167 60024 61498 64572 67583 69288 69817 69567 68588 67314 66572 66423 65979 64764 63432 62895 63358
54164F3358J017R24M98P33K417M515M638J936j533l197k734j514n27N5Q4l93q14
$$ 63358 64375 65299 65797 66530 68947 73462 78100 80036 78503 75306 72572 71058 70531 70586 70670 70277 69463
54147F9463q06o49l99M85J838K245R20q75j558j428j737k319j910m57N72L03m79
$$ 69463 68657 68008 67609 68094 69932 72177 73097 72222 70664 69236 67499 65180 63270 62813 63385 63688 63209
54130F3209p29l93J01P53J693K433K082L70j817l185l265k602j728n66P19J155
$$ 63209 62480 62087 62188 62941 64634 67067 69149 69519 67702 64517 61252 58650 56922 56356 57075 58230
54114E8230K84n90J03J835K520J447n8r44j623k425k635j901r35r3J206K760L012
$$ 58230 58514 57924 58027 59862 62382 63829 63771 62827 61204 58779 56144 54243 53308 53215 54421 57181 60193
54097F0193J397l09m09L79L79m94j200j420j358p95O2j39k044l916l695j922o85
$$ 60193 61590 61281 60872 61251 61630 61136 59936 58516 57158 56363 56425 56286 54242 50326 46631 44709 44024
54080D4024k99P00K543L467K324J66j308j537r20n1M33J32o77j474k209k874k744
$$ 44024 43725 44425 46968 50435 52759 52925 51617 50080 49160 49109 49542 49674 48997 47523 45314 42440 39696
54063C9696j204R39K157K106J682J392R32L46L28J150K231K921K817J509q37k784
$$ 39696 38492 39431 41588 43694 45376 46768 47700 48046 48374 49524 51755 54676 57493 59002 58165 55381
54047E5381k835j422m24n94q23k21N70O43J40m30j025j476j063M14J961K566K431
$$ 55381 52546 51124 50700 50106 49283 49062 49632 50275 50415 49985 48960 47484 46421 46835 48796 51362 53793
54030E3793K180J674N51o29r52o10o79j384j686r48m7j01p01m76P36J419N61o69
$$ 53793 55973 57647 58198 57569 56617 56007 55328 53944 52258 51310 51263 51162 50461 49985 50721 52140 52701 52032
54012E2032l84J425K936L039K465K199K035J388L96o76k086l656m043k355J49
$$ 52032 51648 53073 56009 59048 61513 63712 65747 67135 67531 66855 64769 61113 57070 54715 54864
53997E4864J387J140R32J414J634J078Q36J849L279L684L077K742L460M757N749
$$ 54864 56251 57391 58323 59737 61371 62449 63285 65134 68413 72097 75174 77916 81376 86133 91882
53982I1882N917N078L295J139k86o5J629L567M664N168O271Q355J0126R997Q095
$$ 91882 97799 102877 106172 107311 107025 106960 108589 112156 116820 121988 128259 136614 146740 156737 164832
53967A64832O245N925O852P755P950P783P752P788P553P090O702O197M815K410
$$ 164832 171077 177002 183854 191609 199559 207342 215094 222882 230435 237525 244227 250424 255239 257649
53953B57649K83kJ424K672K284O51r98k091k675k688k172j735k016k772l201k956
$$ 257649 257932 257930 259354 262026 264310 264961 263963 261872 259197 256509 254337 252602 250586 247814 244613 241657
53937B41657k300j511o59J08M73O0j330l232m261l328j362p09k166l859l955l227
$$ 241657 239357 237846 237187 237295 237768 237828 236498 233266 229005 225677 224315 223606 221440 217581 213626 210399
53921B10399l391m086l578j945j223k103k825k023q18q22j655j928j768k553m447
$$ 210399 207008 202922 199344 197399 196176 194073 191248 189225 188407 187585 185930 184002 182234 179681 175234
53906A75234n675m634j748J123K499K196R36m13j200j064J5J643L138L922L916
$$ 175234 169559 164925 163177 164300 166799 168995 169931 169518 168318 167254 167269 168912 172050 175972 179888
53891A79888L491L062K791K641K704L318M696O394P460P417O810O362N933N062
$$ 179888 183379 186441 189232 191873 194577 197895 202591 208985 216445 223862 230672 237034 242967 248029
53877B48029M334N072P331R223Q980P038N364N226O210P097O949N648L851K349
$$ 248029 252363 257435 264766 273989 282969 290007 295371 300597 306807 313904 320853 326501 330352 332701
53863C32701J301M23j09K40J208J740J614J899L103M033L581K561K463L196L634
$$ 332701 334002 334425 334316 334556 335764 337504 339118 341017 344120 348153 351734 354295 356758 359954 363588
53848C63588L736M448N699O134N021L144J641R88J191J984K655K578J838P49q79
$$ 363588 367324 371772 377471 383605 388626 391770 393411 394399 395590 397574 400229 402807 404645 405394 404515
53833D04515k996m424m109k926k871m464o423p724q494q798q356p728q049q995
$$ 404515 401519 397095 392986 390060 387189 382725 376302 368578 360084 351286 342930 335202 327153 318158
53819C18158q715o530m244l759m658n302n220n191n669o329o754o737o239n589
$$ 318158 309443 302913 298669 294910 290252 284950 279730 274539 268870 262541 255787 249050 242811 237222
53805B37222n351n579n751n753o125o885p043o071m926m789n449n856n690n351
$$ 237222 231871 226292 220541 214788 208663 201778 194735 188664 183738 178949 173500 167644 161954 156603
53791A56603m871l867k488j532j546k364l443m191m104l063j511qJ207J957J824
$$ 156603 151732 147865 145377 143845 142299 139935 136492 132301 128197 125134 123623 123615 124822 126779 128603
53776A28603O06j141k453k770k245j418q34p08p08l06M60Q84N04j03J36J538L100
$$ 128603 129209 128068 125615 122845 120600 119182 118348 117640 116932 116626 117086 117970 118474 118371 118507 120045 123145
53759A23145L300J627o09j352J5J986K883K894L169L499K497K09j215j92K205
$$ 123145 126445 128072 127463 126111 126126 128112 130995 133889 137058 140557 143054 143263 142048 141856 144061
53744A44061L857M255M393M773M897M567M414M954N869O487O462N858M857L661
$$ 144061 147918 152173 156566 161339 166236 170803 175217 180171 186040 192527 198989 204847 209704 213365
53730B13365K643K425L489N381O655O244M775L809L926M499N129N987O425M902
$$ 213365 216008 218433 221922 227303 233958 240202 244977 248786 252712 257211 262340 268327 274752 279654
53716B79654J215k420l729k921j865j595j929k775m196n518n846n394n102n056
$$ 279654 280869 278449 274720 271799 269934 268339 266410 263635 259439 253921 248075 242681 237579 232523
53702B32523m564l695l332l526l275k273j470j403j362r92j263k645l588k508
$$ 232523 227959 224264 220932 217406 214131 211858 210388 208985 207623 206631 205368 202723 199135 196627
53688A96627n54m69k681m478l602j116M11L52J74P74J420J436J542K675M390N343
$$ 196627 196073 195604 192923 188445 184843 183727 184138 184490 184664 185438 186858 188294 189836 192511 196901 202244
53672B02244M920L681K475J742J486J289N17r31k153k153j104j25J52L2j31l32
$$ 202244 207164 210845 213320 215062 216548 217837 218354 217423 215270 213117 212013 211888 212040 212072 211941 211609
53656B11609k67O75K258L105K303O95k95n51j036j907k043p42R79J466M34p00
$$ 211609 211342 212017 214275 217380 219683 220378 220083 219532 218496 216589 214546 213804 214783 216249 216683 215983
53640B15983m51J111K524K522J297J90K62J252J995J683O66l2J78R76J759K415
$$ 215983 215532 216643 219167 221689 222986 223176 223438 224690 226685 228368 229034 229002 229180 230156 231915 234330
53624B34330L189L975M302M082L863M041M279M044L394K802K627L112M404N964
$$ 234330 237519 241494 245796 249878 253741 257782 262061 266105 269499 272301 274928 278040 282444 288408
53610B88408O413M885K340P46R66K163L121L211K237M23j179j332j83O58M4j365
$$ 288408 294821 299706 302046 302792 303758 305921 309042 312253 314490 314913 313734 312402 312219 312877 312921 311556
53594C11556k323k617k783k786k111r49k65n30j154j457j682k330k871j917Q83
$$ 311556 309233 306616 303833 301047 298936 297987 297722 297192 296038 294581 292899 290569 287698 285781 286664
53579B86664L726M215K069m33j059J10J376J697J421J262J457J841K004J423M4
$$ 286664 290390 294605 296674 296241 295182 295292 296668 298365 299786 301048 302505 304346 306350 307773 307817
53564C07817j382k050j941j364k30J378K498K340J728K138L507M352M104L728
$$ 307817 306435 304385 302444 301080 300850 302228 304726 307066 308794 310932 314439 318791 322895 326623
53550C26623L922M161M041M040M319M174L496L457M763O276O453N402M515M696
$$ 326623 330545 334706 338747 342787 347106 351280 354776 358233 362996 369272 375725 381127 385642 390338
53536C90338N710O772P139O641O007O027O244N520M145L903N399O941P031O404
$$ 390338 396048 402820 409959 416600 422607 428634 434878 440398 444543 448446 453845 460786 467817 474221
53522D74221O230N812L986J674R56K051L200L327L068L123L306L458L822M215
$$ 474221 480451 486263 490249 491923 492879 494930 498130 501457 504525 507648 510954 514412 518234 522449
53508E22449M052L458L266L563L431K495J695J928K736L009K474J950K404M016
$$ 522449 526501 529959 533225 536788 540219 542714 544409 546337 549073 552082 554556 556506 558910 562926
53494E62926O000P227P162O302N593N607O285P068P070N842M248L835M841N722
$$ 562926 568926 576153 583315 589617 595210 600817 607102 614170 621240 627082 631330 635165 640006 645728
53480F45728N398M898N674P252Q139Q262Q663R101Q181O125N335P203J0033J1202
$$ 645728 651126 656024 661698 668950 677089 685351 694014 703115 711296 717421 722756 729959 739992 751194
53466G51194J0316Q995Q444Q532Q894R721J1346J3602J5744J6799J6357J5212
$$ 751194 761510 770505 778949 787481 796375 806096 817442 831044 846788 863587 879944 895156
53454H95156J4829J5865J7571J8932J9871K0876K2012K2963K3864K5254K7140
$$ 895156 909985 925850 943421 962353 982224 1003100 1025112 1048075 1071939 1097193 1124333
53443A124333K8625K8833K8011K7389K7948K9477L1023L2112L3214L4776L6266
$$ 1124333 1152958 1181791 1209802 1237191 1265139 1294616 1325639 1357751 1390965 1425741 1462007
53432A462007L6691L5982L5221L5270L5691L5470L4610L4258L5055L5977L5496
$$ 1462007 1498698 1534680 1569901 1605171 1640862 1676332 1710942 1745200 1780255 1816232 1851728
53421A851728L3737L2629L3544L5561L6817L6855L6575L6211L4976L2952L1725
$$ 1851728 1885465 1918094 1951638 1987199 2024016 2060871 2097446 2133657 2168633 2201585 2233310
53410B233310L2216L2985L1993K9389K7198K6518K6252K4807K1993J8835J6092
$$ 2233310 2265526 2298511 2330504 2359893 2387091 2413609 2439861 2464668 2486661 2505496 2521588
53399B521588J3527J0522P054L888J685R8j845m522p343r662j1451j2936j4187
$$ 2521588 2535115 2545637 2552691 2556579 2558264 2558362 2556517 2551995 2544652 2534990 2523539 2510603 2496416
53386B496416j5366j6724j8124j9195k0098k1350k2735k3497k3830k4900k6814
$$ 2496416 2481050 2464326 2446202 2427007 2406909 2385559 2362824 2339327 2315497 2290597 2263783
53375B263783k8032k7693k7113k7698k8638k8244k6519k4738k3342k1961k0835
$$ 2263783 2235751 2208058 2180945 2153247 2124609 2096365 2069846 2045108 2021766 1999805 1978970
53364A978970k0367j9759j7914j5349j3421j1982r810p172n801o108o439n503
$$ 1978970 1958603 1938844 1920930 1905581 1892160 1880178 1870368 1863196 1857395 1851287 1844848 1839345
53352A839345l667j400J613N066P555Q440Q776R674J1121J3052J5940J9449K2124
$$ 1839345 1835678 1834278 1835891 1840957 1848512 1856952 1865728 1875402 1886523 1899575 1915515 1934964 1957088
53339A957088K3567K5299K8372L1550L3304L4193L5645L7639L9440M1695M5573
$$ 1957088 1980655 2005954 2034326 2065876 2099180 2133373 2169018 2206657 2246097 2287792 2333365
53328B333365N0307N3623N4742N5179N6417N8372O0512O2881O5313O6842O6946
$$ 2333365 2383672 2437295 2492037 2547216 2603633 2662005 2722517 2785398 2850711 2917553 2984499
53317B984499O6580O7130O8624O9696O9064O6589O3131N9941N8083N7767N7913
$$ 2984499 3051079 3118209 3186833 3256529 3325593 3392182 3455313 3515254 3573337 3631104 3689017
53306C689017N6753N3302M8244M3057L8334L3423K7779K1987J7052J3110R497
$$ 3689017 3745770 3799072 3847316 3890373 3928707 3962130 3989909 4011896 4028948 4042058 4051555
53295D051555N739J636l380r891j7234k3552k7602l0028l2351l5310l8587m1608
$$ 4051555 4057294 4058930 4055550 4045659 4028425 4004873 3977271 3947243 3914892 3879582 3840995 3799387
53283C799387m3995m5534m6344m7070m8324m9922n0975n0822m9668m8294m7398
$$ 3799387 3755392 3709858 3663514 3616444 3568120 3518198 3467223 3416401 3366733 3318439 3271041
53272C271041m7350m8292m9995n1476n1355m9240m6539m5104m4988m4505m2697
$$ 3271041 3223691 3175399 3125404 3073928 3022573 2973333 2926794 2881690 2836702 2792197 2749500
53261B749500m0569l9261l8076l5475l1323k7021k3876k2375k2459k3332k3541
$$ 2749500 2708931 2669670 2631594 2596119 2564796 2537775 2513899 2491524 2469065 2445733 2422192
53250B422192k2563k1737k2335k3424k3315k2508k2826k3912k3170j9681j5628
$$ 2422192 2399629 2377892 2355557 2332133 2308818 2286310 2263484 2239572 2216402 2196721 2181093
53239B181093j2958j0995q586o379n090l507m10K860M051L447L468N218P439Q950
$$ 2181093 2168135 2157140 2148554 2142175 2137085 2133578 2133168 2136028 2140079 2143526 2146994 2152212 2159651 2168601
53225B168601J0281J2502J5678J8972K1572K3248K4469K5783K6860K6713K5346
$$ 2168601 2178882 2191384 2207062 2226034 2247606 2270854 2295323 2321106 2347966 2374679 2400025
53214B400025K4304K4722K5670K5575K4485K3572K3009K1886J9939J7824J5781
$$ 2400025 2424329 2449051 2474721 2500296 2524781 2548353 2571362 2593248 2613187 2631011 2646792
53203B646792J3449J0984Q885O716L539j02k310k563k791m876q180j0669j1692
$$ 2646792 2660241 2671225 2680110 2686826 2690365 2690263 2687953 2685390 2682599 2677723 2669543 2658874 2647182
53190B647182j2534j4633j8090k1797k4488k5772k6465k7529k8717k8856k7709
$$ 2647182 2634648 2620015 2601925 2580128 2555640 2529868 2503403 2475874 2447157 2418301 2390592
53179B390592k6646k6858k7716k7744k6705k5629k5157k5010k5046k5665k6704
$$ 2390592 2363946 2337088 2309372 2281628 2254923 2229294 2204137 2179127 2154081 2128416 2101712
53168B101712k6924k5398k2893k1116k0780k1020k0612j9276j7713j6801j6777
$$ 2101712 2074788 2049390 2026497 2005381 1984601 1963581 1942969 1923693 1905980 1889179 1872402
53157A872402j6933j6111j4016j1916j1541j3117j5064j5823j5451j5159j5788
$$ 1872402 1855469 1839358 1825342 1813426 1801885 1788768 1773704 1757881 1742430 1727271 1711483
53146A711483j7258j8915j9953j9931j9346j9283k0010k0578k0375k0255k1098
$$ 1711483 1694225 1675310 1655357 1635426 1616080 1596797 1576787 1556209 1535834 1515579 1494481
53135A494481k2058k1667k0344k0080k1637k3638k4706k4925k4743k4067k3294
$$ 1494481 1472423 1450756 1430412 1410332 1388695 1365057 1340351 1315426 1290683 1266616 1243322
53124A243322k3633k5112k5649k3705k1010k0829k3765k6938k7511k5708k3796
$$ 1243322 1219689 1194577 1168928 1145223 1124213 1103384 1079619 1052681 1025170 999462 975666
53113I75666k3177k3278k2838k1559k0197j9383j8790j7730j6319j5313j4825
$$ 975666 952489 929211 906373 884814 864617 845234 826444 808714 792395 777082 762257
53102G62257j4007j2460j1177j1370j2781j3884j3672j2617j1918j2145j2778
$$ 762257 748250 735790 724613 713243 700462 686578 672906 660289 648371 636226 623448
53091F23448j2876j2193j1402j1028j0552r300p867p583q410q647p242n251m299
$$ 623448 610572 598379 586977 575949 565397 556097 548230 540647 532237 523590 516348 511097 506798
53078E06798m536m976n057m837m318l551l000k986l148l226l715m897n763n095
$$ 506798 502262 497286 492229 487392 483074 479523 476523 473537 470389 467163 463448 458551 452788 447693
53064D47693l175j411n52l11n27j498l057m371m790m285l139j859j187j360j505
$$ 447693 444518 443107 442555 442244 441717 440219 437162 432791 428001 423716 420577 418718 417531 416171 414666
53049D14666o54P28J148nj827l198l832l927l660l229k862k553k373k905m552
$$ 414666 414012 414740 415888 415883 414056 410858 407026 403099 399439 396210 393348 390795 388422 385517 380965
53034C80965o415o814n337l583l420n007o868p542o796n585m988n069m827l570
$$ 380965 374550 367736 362399 358816 355396 350389 343521 335979 329183 323598 318610 313541 308714 305144
53020C05144k065j669k514l388l516l512m085m675m236l009k462l382m666m622
$$ 305144 303079 301410 298896 295508 291992 288480 284395 279720 275484 272475 270013 266631 261965 257343
53006B57343l144j930k288l404l367j610N33J655J720J374Q19O3m80n25o29j519
$$ 257343 254199 252269 249981 246577 243210 241600 242133 243788 245508 246882 247701 247764 247284 246759 246130 244611
52990B44611k947l909l798k799j421k34K22r5o10j012j753l001l654k530k05J429
$$ 244611 241664 237755 233957 231158 229737 229503 229725 229630 229020 228008 226255 223254 219600 217070 216865 218294
52974B18294J452P07K70K01J15N3K67P11J173J522J578J073j2j273k163k371j985
$$ 218294 219746 220453 220723 220924 221039 221092 221359 222070 223243 224765 226343 227416 227404 226131 223968 221597 219612
52957B19612j468j170p75L13J784K339J385Q0j69L92M93j06m72k19l9m27j047
$$ 219612 218144 216974 216199 216512 218296 220635 222020 222100 221931 222323 222816 222710 222238 222019 221980 221553 220506
52940B20506j559k030k258j654k76Q31Q35K5p52j050r24n56j43J02M6m31j366
$$ 220506 218947 216917 214659 213005 212729 213560 214395 214420 213668 212618 211694 211138 210995 211097 211143 210712 209346
52923B09346k307k362j141O37K049K967L515L350K429J920K868M304M338L077
$$ 209346 207039 204677 203536 204173 206222 209189 212704 216054 218483 220403 223271 227575 231913 234990
52909B34990K774M675P310Q509P811O108M200K676K248L054M137M406L823L153
$$ 234990 237764 242439 249749 258258 266069 272177 276377 279053 281301 284355 288492 292898 296721 299874
52895B99874K932L043K876J742k90j917j868p38m25j436k098j163J31j68j849
$$ 299874 302806 305849 308725 310467 310177 308260 306392 305654 305229 303793 301695 300532 300663 300495 298646
52880B98646k907k336j172p74j187j511j151m26k02r61k101k401j533p25j400
$$ 298646 295739 293403 292231 291457 290270 288759 287608 287182 286980 286019 283918 281517 279984 279259 277859
52865B77859l360m830m276j829J127L316M358M395L444J451j033k808l049k047
$$ 277859 274499 269669 265393 263564 264691 268007 272365 276760 280204 281655 280622 277814 274765 272718
52851B72718n61J024K360K542J105o91q88O40J911J513L43JM80N91l6m87LJ071
$$ 272718 272157 273181 275541 278083 279188 278497 277609 278249 280160 281673 282016 282017 282497 283088 283052 282565 282568 283639
52833B83639J821J932J839K076K575K777K422J904J669J634J558J516J471Q95
$$ 283639 285460 287392 289231 291307 293882 296659 299081 300985 302654 304288 305846 307362 308833 309728
52819C09728l47j167m23J318K339J960J023K62l64o84r9J182K048K059J908J939
$$ 309728 309381 308214 307791 309109 311448 313408 314431 314693 314329 313645 313546 314728 316776 318835 320743 322682
52803C22682J568O81J71L68L82k10m61J59O21J11m65k12K0o70j036N85L209M187
$$ 322682 324250 324931 325102 325470 325852 325642 325181 325340 325961 326072 325607 325395 325415 324745 323709 324294 327503 331690
52785C31690L147K566M096O392P326O701N675M790L822K929K548K391J580J17
$$ 331690 334837 337403 341499 347891 355217 361918 367593 372383 376205 379134 381682 384073 385653 385770
52771C85770o42K98J789J474j220m085m860m146m213n486o088n006l761m076n495
$$ 385770 385128 385426 387215 388689 387469 383384 378524 374378 370165 364679 358591 353585 349824 345748 340253
52756C40253o475o474n714m087j779j29k42j393k114k207k373k505k017j400j791
$$ 340253 333778 327304 321590 317503 315724 315595 315353 313960 311846 309639 307266 304761 302744 301344 299553
52741B99553l085l959l673k537r77M47M32j800m622n312l563j911k142l131l058
$$ 299553 296468 292509 288836 286299 285322 285769 286201 284401 279779 274467 270904 268993 266851 263720 260662
52726B60662k157j938k809l857m339m189l548k721k342k728l246k943j764n56
$$ 260662 258505 256567 253758 249901 245562 241373 237825 235104 232762 230034 226788 223845 222081 221525
52712B21525r4m57j201j793j918j660j431j608k340l476m491m531l171j104L32
$$ 221525 221431 220974 219773 217980 216062 214402 212971 211363 209023 205547 201056 196525 193354 192250 192582
52697A92582M07n42j856l073l769l567k617j624j090r59j062j486k209k864l128
$$ 192582 192989 192447 190591 187518 183749 180182 177565 175941 174851 173892 172830 171344 169135 166271 163143
52682A63143l129l214l536l917l959l320k088q57j14K09K78j67j189j867j150
$$ 163143 160014 156800 153264 149347 145388 142068 139980 139123 139009 139218 139496 139329 138140 136273 135123
52667A35123M30J005l15k202k726j588j56K33n41j552j668n65Q02R40n47k346
$$ 135123 135553 136558 136243 134041 131315 129727 129571 129804 129263 127711 126043 125478 126280 127220 126673 124327
52651A24327k840j776k70N63N95M78Q60J715K280J880R90R42K172L281K571L09
$$ 124327 121487 119711 119441 120004 120599 121077 121937 123652 125932 127812 128802 129744 131916 135197 137768 138077
52635A38077j439j347k49L51L85R39K342L619L966L749L518K953J639L25K30J261
$$ 138077 136638 135291 135042 135393 135778 136717 139059 142678 146644 150393 153911 156864 158503 158828 159058 160319
52619A60319J923J242k68j793l234m490m755l594k061j603k233k828l003l404
$$ 160319 162242 163484 163216 161423 158189 153699 148944 145350 143289 141686 139453 136625 133622 130218
52605A30218m170m263k775j63K217L184K231j62k405k822j387J31L35k02j92K53
$$ 130218 126048 121785 119010 118847 121064 124248 126479 126317 123912 121090 119703 119834 120169 119967 119775 120028
52589A20028q6j403k336j900q29l29l70j73J58k20j264j758j169o29j294k462
$$ 120028 119942 118539 116203 114303 113474 113145 112775 112602 112760 112540 111276 109518 108349 107720 106426 103964
52573A03964k456r25Q23J692J767J430O65k52m66L02J015M80j143k663l309l247
$$ 103964 101508 100583 101406 103098 104865 106295 106960 106708 106242 106544 107559 108039 106896 104233 100924 97677
52557I7677k850k122q88P17K044K345J569O12L05M02J91j24K59J094J182L79J14
$$ 97677 94827 92705 91817 92534 94578 96923 98492 99104 99409 99811 100002 99878 100137 101231 102413 102792 102906
52540A02906J153K227J887N73m08q37j201j205k67J064J711J703J842K130K015
$$ 102906 104059 106286 108173 108746 108338 107501 106300 105095 104828 105892 107603 109306 111148 113278 115293
52525A15293J865K539L585L534K120P95O51J197J518J389Q43j84j244j433n46
$$ 115293 117158 119697 123282 126816 128936 129731 130382 131579 133097 134486 135329 135145 133901 132468 131922
52510A31922N31R73Q03M36J72L07Q71J303J205J320K488L874L728K031P50J085
$$ 131922 132453 133426 134229 134665 134837 135144 136015 137318 138523 139843 142331 146205 149933 151964 152714 153799
52494A53799K123K827L526M461M586L195J481R99J494J705J474J516J796J696
$$ 153799 155922 158749 162275 166736 171322 174517 175998 176997 178491 180196 181670 183186 184982 186678
52480A86678J366J436J588R26k44m62Q21K429L123L020K878K888K798K641K619
$$ 186678 188044 189480 191068 191994 191750 191288 192109 194538 197661 200681 203559 206447 209245 211886 214505
52465B14505K596K189J293J78q33j557j889j752j167j90J187K867M283M458K902
$$ 214505 217101 219290 220583 220761 219928 218371 216482 214730 213563 213373 214560 217427 221710 226168 229070
52450B29070M46j266j398n24N65J805K996K957R83j353j659j2R55j31j400p45
$$ 229070 229516 228250 226852 226328 226893 228698 231694 234651 235634 234281 232622 232610 233565 233434 232034 231289
52434B31289Q35P75j196k807k572j390n47O3J018K008K438K438K384K070J202
$$ 231289 232124 232899 231703 228896 226324 224934 224387 224450 225468 227476 229914 232352 234736 236806 238008
52419B38008K90k2j15r36k336l011k288j044k68L71J555K638K320Q22k3P62J942
$$ 238008 238298 238276 238161 237225 234889 231878 229590 228546 228278 228649 230204 232842 235162 235984 235961 236723 238665
52402B38665K019J524K125M093N760N507L323M37j720k239j220K31J084J386J705
$$ 238665 240684 242208 244333 248426 254186 259693 263016 263453 261733 259494 258274 258505 259589 260975 262680
52387B62680J871J216l0p63n87l07m61l51Q14K597L886M194L878L435L055K596
$$ 262680 264551 265767 265737 264974 264387 264080 263619 263268 264082 266679 270565 274759 278637 282072 285127 287723
52371B87723J686K53r42r26J06Q17N46K71J050K221K115L39j567j795q5K207L444
$$ 287723 289409 289662 288720 287794 287900 288717 289263 289534 290584 292805 294920 295259 293692 291897 291812 294019 297463
52354B97463L028J640L09n29r06o61L81J531J576L61o27N0J999L583L985L937
$$ 297463 300491 302131 302440 301911 301005 300344 300725 302256 303832 304193 303566 303616 305615 309198 313183 317120
52338C17120M432N332N550M368K344P60K88L59K4r30k017k807l102k662j562n85
$$ 317120 321552 326884 332434 336802 339146 339906 340194 340553 340577 339647 337630 334823 331721 329059 327497 326912
52322C26912m66q24p56l19l19n79J81K223L883L656K126R00M74L30M45J342K764
$$ 326912 326446 325622 324866 324547 324228 323649 323830 326053 329936 333592 335718 336618 337092 337422 337867 339209 341973
$$ [...]
##END NTUPLES=NMR SPECTRUM
##END=
