
##TITLE=AC1198_BRAAS12062_7165602_QtzWtNK4mk
##JCAMPDX= 6.0         $$ Bruker NMR JCAMP-DX V2.0
##DATA TYPE= NMR SPECTRUM
##DATA CLASS= NTUPLES
##ORIGIN= BRUKER
##OWNER= Administrator
$$ 1.72 TOPSPIN		Version 2.1
$$ 2012-12-02 02:05:42.442 -0500  Administrator@X
$$ Compression mode = diff/dup
##.OBSERVE FREQUENCY= 400.02188249412
##.OBSERVE NUCLEUS= ^1H
##.ACQUISITION MODE= SIMULTANEOUS (DQD)
##.ACQUISITION SCHEME= undefined
##.AVERAGES= 8
##.DIGITISER RES= 22
##SPECTROMETER/DATA SYSTEM= spect
##.PULSE SEQUENCE= zg30
##.SOLVENT NAME= COFFEE_meoh
##.SHIFT REFERENCE= INTERNAL, COFFEE_meoh, 1, 14.98509
##AUDIT TRAIL= $$ (NUMBER, WHEN, WHO, WHERE, PROCESS, VERSION, WHAT)
$$ ##TITLE= Audit trail, TOPSPIN		Version 2.1
$$ ##JCAMPDX= 5.01
$$ ##ORIGIN= Bruker BioSpin GmbH
$$ ##OWNER= Administrator
$$ $$ E:\/data/COFFEE/nmr/AC1198_BRAAS12062_7165602_QtzWtNK4mk/10/pdata/1/auditp.txt
$$ ##AUDIT TRAIL=  $$ (NUMBER, WHEN, WHO, WHERE, PROCESS, VERSION, WHAT)
(   1,<2012-12-02 02:05:34.083 -0500>,<Administrator>,<X>,<go>,<TOPSPIN 2.1>,
      <created by zg
	started at 2012-12-02 02:04:27.520 -0500,
	POWCHK enabled, PULCHK disabled,
       configuration hash MD5:
       86 BA 57 50 F2 9D 5C 9B 26 00 A9 28 5F 66 2E 89
       data hash MD5: 64K
       ED D7 44 3B 79 5F BF 2F BE D0 37 4E CB A0 9F A6>)
(   2,<2012-12-02 02:05:37.255 -0500>,<Administrator>,<X>,<proc1d>,<TOPSPIN 2.1>,
      <Start of raw data processing
       efp LB = 0 FT_mod = 6 PKNL = 1 PHC0 = 0 PHC1 = 0 SI = 32K 
       data hash MD5: 32K
       34 9D C6 E4 91 6A A8 FA 15 7B 4D B8 2B 6F EE 89>)
(   3,<2012-12-02 02:05:37.708 -0500>,<Administrator>,<X>,<proc1d>,<TOPSPIN 2.1>,
      <pk PHC0 = 97.27295 PHC1 = 0 
       data hash MD5: 32K
       92 5B 5B 71 38 87 37 4E 8D C2 EB 4E 1E 35 8B 8C>)
(   4,<2012-12-02 02:05:37.942 -0500>,<Administrator>,<X>,<proc1d>,<TOPSPIN 2.1>,
      <abs ABSG = 1 
       data hash MD5: 32K
       41 07 13 9E D7 81 6D 11 92 CD 12 35 12 6D 67 B7>)
(   5,<2012-12-02 02:05:38.098 -0500>,<Administrator>,<X>,<proc1d>,<TOPSPIN 2.1>,
      <abs ABSG = 2 
       data hash MD5: 32K
       5A 45 E1 BA 3C 31 52 F0 C8 B1 0A 25 15 B2 13 4B>)
(   6,<2012-12-02 02:05:38.239 -0500>,<Administrator>,<X>,<proc1d>,<TOPSPIN 2.1>,
      <abs ABSG = 3 
       data hash MD5: 32K
       A4 8E 77 ED B6 F4 89 7C C9 90 8F 34 96 36 BD 6A>)
(   7,<2012-12-02 02:05:38.380 -0500>,<Administrator>,<X>,<proc1d>,<TOPSPIN 2.1>,
      <abs ABSG = 4 
       data hash MD5: 32K
       9C 0B 6D BB 34 0E 50 CB 52 FF C7 B9 5D FC 46 24>)
(   8,<2012-12-02 02:05:38.536 -0500>,<Administrator>,<X>,<proc1d>,<TOPSPIN 2.1>,
      <abs ABSG = 5 
       data hash MD5: 32K
       34 EE 07 20 E3 A7 B1 98 A9 C2 05 FE 86 48 DE EC>)
$$ ##END=
$$ 
$$ $$ hash MD5
$$ $$ 89 18 16 37 CD C0 0A 87 CA 8E 55 51 F4 A7 95 AC
##$RELAX= 
##$RELAX= 
##$RELAX= 
##$RELAX= 
##$RELAX= 
##$RELAX= 
##$RELAX= 
$$ Bruker specific parameters
$$ --------------------------
##$DU= <E:\>
##$EXPNO= 10
##$NAME= <AC1198_BRAAS12062_7165602_QtzWtNK4mk>
$$ [...]
150 150 150 150 150 150 150 150
##$TP07= 0
##$TPNAME0= <>
##$TPNAME1= <>
##$TPNAME2= <>
##$TPNAME3= <>
##$TPNAME4= <>
##$TPNAME5= <>
##$TPNAME6= <>
##$TPNAME7= <>
##$TPOAL= (0..7)
0.5 0.5 0.5 0.5 0.5 0.5 0.5 0.5
##$TPOFFS= (0..7)
0 0 0 0 0 0 0 0
##$TUNHIN= 0
##$TUNHOUT= 0
##$TUNXOUT= 0
##$USERA1= <user>
##$USERA2= <user>
##$USERA3= <user>
##$USERA4= <user>
##$USERA5= <user>
##$V9= 5
##$VALIST= <valist>
##$VCLIST= <CCCCCCCCCCCCCCC>
##$VD= 0
##$VDLIST= <DDDDDDDDDDDDDDD>
##$VPLIST= <PPPPPPPPPPPPPPP>
##$VTLIST= <TTTTTTTTTTTTTTT>
##$WBST= 1024
##$WBSW= 4
##$XGAIN= (0..3)
0 0 0 0
##$XL= 0
##$YL= 0
##$YMAX_a= 575752
##$YMIN_a= -486381
##$ZGOPTNS= <>
##$ZL1= 120
##$ZL2= 120
##$ZL3= 120
##$ZL4= 120
##$ABSF1= 14.98509
##$ABSF2= -5.573092
##$ABSG= 5
##$ABSL= 3
##$ALPHA= 0
##$AQORDER= 0
##$ASSFAC= 0
##$ASSFACI= 0
##$ASSFACX= 0
##$ASSWID= 0
##$AUNMP= <proc_prof1d_extract_pilot.lims>
##$AXLEFT= 0
##$AXNAME= <>
##$AXNUC= <1H>
##$AXRIGHT= 0
##$AXTYPE= 0
##$AXUNIT= <>
##$AZFE= 0.1
##$AZFW= 0.1
##$BCFW= 0
##$BC_mod= 0
##$BYTORDP= 0
##$COROFFS= 0
##$CY= 15
##$DATMOD= 1
##$DC= 0
##$DFILT= <>
##$DTYPP= 0
##$F1P= 0
##$F2P= 0
##$FCOR= 0.5
##$FTSIZE= 32768
##$FT_mod= 6
##$GAMMA= 0
##$GB= 0
##$INTBC= 1
##$INTSCL= 1
##$ISEN= 128
##$LB= 0
##$LEV0= 0
##$LPBIN= 0
##$MAXI= 10000
##$MC2= 0
##$MEAN= 0
##$ME_mod= 0
##$MI= 0
##$NCOEF= 0
##$NC_proc= -8
##$NLEV= 6
##$NOISF1= 0
##$NOISF2= 0
##$NSP= 0
##$NTH_PI= 0
##$NZP= 0
##$OFFSET= 14.98509
##$PC= 1
##$PHC0= 97.27295
##$PHC1= 0
##$PH_mod= 1
##$PKNL= yes
##$PPARMOD= 0
##$PPDIAG= 0
##$PPIPTYP= 0
##$PPMPNUM= 2147483647
##$PPRESOL= 1
##$PSCAL= 4
##$PSIGN= 0
##$PYNMP= <proc.py>
##$REVERSE= no
##$SF= 400.02
##$SI= 32768
##$SIGF1= 0
##$SIGF2= 0
##$SINO= 400
##$SIOLD= 32768
##$SPECTYP= <>
##$SREGLST= <1H.CDCl3>
##$SSB= 0
##$STSI= 32768
##$STSR= 0
##$SW_p= 8223.68421052631
##$SYMM= 0
##$S_DEV= 0
##$TDeff= 65536
##$TDoff= 0
##$TI= <>
##$TILT= no
##$TM1= 0
##$TM2= 0
##$TOPLEV= 0
##$USERP1= <user>
##$USERP2= <user>
##$USERP3= <user>
##$USERP4= <user>
##$USERP5= <user>
##$WDW= 1
##$XDIM= 32768
##$YMAX_p= 441195085
##$YMIN_p= -734911
##$CURPLOT= <Network HP LaserJet P1505>
##$CURPRIN= <$Network HP LaserJet P1505>
##$DFORMAT= <normdp>
##$LAYOUT= <+/1D_H.xwp>
##$LFORMAT= <normlp>
##$PFORMAT= <normpl>
##$SURQMSG= 1
$$ End of Bruker specific parameters
$$ ---------------------------------
##NTUPLES= NMR SPECTRUM
##VAR_NAME=  FREQUENCY,     SPECTRUM/REAL,   SPECTRUM/IMAG
##SYMBOL=    X,             R,               I
##VAR_TYPE=  INDEPENDENT,   DEPENDENT,       DEPENDENT
##VAR_FORM=  AFFN,          ASDF,            ASDF
##VAR_DIM=   32768,         32768,           32768
##UNITS=     HZ,            ARBITRARY UNITS, ARBITRARY UNITS
##FACTOR=    0.250966925370066, 1,           1
##FIRST=     8223.43324360094, -80061,       -218736
##LAST=      0,             -95224,          -218603
##MIN=       0,             -734911,         0
##MAX=       8223.43324360094, 441195085,    0
$$ Real data points
##PAGE= N=1
##DATA TABLE= (X++(R..R)), XYDATA
$$ [...]
19512A90523I0688J03906H8967h049j6062q2821C04687K3066c03610a48029e3456
19500e2835j353l47057D075f5954A39414m6260b40554M8832g9946B10600c3796
19488d8380J7319o9181j5815j46040A46135a25174E2853a75676l1457b1008k14780
19477b35788Q7344A6498N6764a94552i5135A88766b31049l21b2240j73451E8373
19465A64665B8503b34932J09419K5507A99083r5894f4081D7337a5637l05480j75779
19454d96896A19695O1111p937e7955J0737o2510H9290A0258P0035b05835L6553
19443a69282j8946A9768K9446A5844c67169E1041b72158D8011O910a44181e8955
19431I1156J03444a22518c543k45497B936J5907m536a13421B29030a78176A44086
$$ y = [190523, 90688, 194594, 88967, -8049, -24111, -106932, 304687, 327753, -303610, -148029, -53456, -52835, -54188, -401245, 4075, -65954, 139414, 93154, -240554, -191722, -79946, 210600, -33796, -48380, -31061, -100242, -116057, -262097, 146135, -125174, 52853, -175676, -207133, -21008, -235788, -148444, 16498, 73262, -194552, -95135, 188766, -231049, -231370, -22240, -195691, 58373, 164665, 28503, -234932, -125513, -100006, 199083, 103189, -64081, 47337, -15637, -321117, -496896, 119695, 180806, 172869, -57955, -47218, -109728, 89290, 10258, 80293, -205835, -169282, -188228, 19768, 49214, 15844, -367169, 51041, -272158, 48011, 54921, -144181, -58955, 91156, 194600, -122518, -3543, -249040, 2936, 18843, 14307, -113421, 229030, -178176, 144086]
19419D8477b59724L5522g553k74024i5510j97573I042a78329B36565a12312m1233
19408a53545C0580b7117l45201A00116c00877C3037b22718G6429c7644C22Q6661
19397H6983i9363C0888g9444Q244A35752d06789e9800q8176F0905k591K10893
19386B69207b46329m1776a11613m7701c0665j49819P4744j28431i2163b1540o9302
19375i0842I756c2588n1765B77205B7711L577e09476A15132C5112b19570j3854
19364b33424A81279E0027O383G524P5722c96891c5173j57184k22928B23381d57020
19352b48872K4952I3318c31897J40054h3810k8787j09127k4768M9889j35506c4478
19340g377A73338F4105c8806A01564a78564O856f0330j09481B40220c12196A47396
$$ y = [48477, -259724, -224202, -7553, -281577, -95510, -293083, 9042, -178329, 236565, -112312, -153545, 30580, -27117, -372318, 100116, -300877, 33037, -222718, 76429, -37644, 322, 86983, -99363, 30888, -79444, -71200, 135752, -406789, -59800, -147976, 60905, 58314, 269207, -246329, -288105, -111613, -159314, -30665, -180484, -105740, -234171, -92163, -21540, -90842, 9756, -32588, -84353, 277205, 27711, 31288, -509476, 115132, 35112, -219570, -233424, 181279, 50027, 56410, 7524, 83246, -396891, -35173, -192357, -415285, 223381, -457020, -248872, -223920, 93318, -331897, -191843, -83810, -112597, -221724, -246492, -196603, -332109, -34478, -7377, 173338, 64105, -38806, 101564, -178564, -171708, -60330, -169811, 240220, -312196, 147396]
19328c29941h3087j73708L8907H9347J70767L0388a3682r1746A47283e64280d0969
19316b44916g1373A15217B0058d18837A37066b12612j18083I5433J37452b36454
19305g2846I829M3174a24982k50263a22824r6010A22157b24406A56602E4643b25406
19293h1912b3206C56017C0465b02246L148q8190e7295p4840a4074A3758L1270
19282D5028a45584c3719M264k04080A15377Q0509g4205r8139k2673p06A11733
19270b96358H2037a13639K8568l08852J45929j00048g2897o0429j28371e7426
19259C5133a64946J5192P953O5186h751l25896e1511j03404m0598D1952c0116
19247I0359K7008d3944l6623B59612k0454l2974A01750d92475i4726j48104f0803
$$ y = [-329941, -83087, -256795, -217888, 89347, 260114, 290502, -13682, -105428, 147283, -564280, -40969, -244916, -71373, 115217, 20058, -418837, 137066, -212612, -330695, 95433, 232885, -236454, -72846, 9829, 53003, -124982, -375245, -122824, -218834, 122157, -224406, 156602, 54643, -225406, -81912, -23206, 356017, 30465, -202246, -199098, -287288, -57295, -132135, -14074, 13758, 45028, -145584, -33719, -29455, -233535, 115377, 195886, -74205, -172344, -195017, -195723, 111733, -296358, 82037, -113639, -85071, -393923, -247994, -348042, -72897, -133326, -261697, -57426, 35133, -164946, -149754, -141801, -76615, -8751, -334647, -51511, -154915, -195513, 41952, -30116, 90359, 117367, -43944, -80567, 259612, 239158, 206184, 101750, -492475, -94726, -242830, -60803]
19235b292l03502h3358j07199K7671g3765H0451B6875F538J20993a05380A5483
19223d3495p3867a7721o7814H1129P5632K4656a45131K5139j73635H3a40861I6396
19210a48619k04590A38980a69555B24798b75404B15735a25206A01371f1069A49951
19199b457A73857a07192m4831P2821B5130a26976N1396j79718F1178Q6202a83783
19187G3131a28447j56526a34635K356A35270E1508d75889a78712D4102i691A0745
19175b1562F2420d17255a66181A95004b68263F7813a81939O7684C3429b97216
19164b85695m6586c0635A05118J00756e71585g859j00125H4425c61449f0641j4420
19153g5061j87316b1019k41678i2825A26093a48585d5806D0345e903j33528j2146
$$ y = [-2292, -305794, -83358, -190557, -162886, -73765, 80451, 26875, 6538, 127531, -105380, 15483, -43495, -117362, -17721, -85535, 81129, 156761, 181417, -145131, -119992, -293627, 83, -140861, 96396, -148619, -353209, 138980, -169555, 224798, -275404, 215735, -125206, 101371, -61069, 149951, -2457, 173857, -107192, -152023, -79202, 25130, -126976, -75580, -255298, 61178, 147380, -183783, 73131, -128447, -284973, -134635, -132279, 135270, 51508, -475889, -178712, 44102, -9691, 10745, -21562, 62420, -417255, -166181, 195004, -268263, 67813, -181939, -114255, 33429, -297216, -285695, -332281, -30635, 105118, 205874, -571585, -7859, -107984, 84425, -361449, -60641, -75061, -262377, -21019, -262697, -92825, 126093, -148585, -45806, 40345, -5903, -139431, -151577]
19142a51577C3787f6352b0440r9726p2375K0054K7753M5242l07277b2550j18953
19131a41503R816h111A99289f225B9639Q3560a87680l8969G732a08944j82596
19120b91540R8615D8333J60062f1816A82020b7243a2254j8207K513H4865a21062
19108b42234D7542b31897d0525r5943H11b87188C29141A05676c13326D2326M4608
19097H6934h8740B0222a88467E7456M2661l0291J22548A0551g0568b2979A69438
19085b01421B1915i8754B01547J40521i9986j91495B8748a2981A26034c30861
19074a74970M1859A73198P1488l6720E9263b98556a08532c526j24053o6098D4399
19062b1615l02596F6353h7552B9698c7382E1150P4612b46551A66971e75634H424
$$ y = [-151577, 33787, -66352, -20440, -120166, -192541, -172487, -144734, -99492, -406769, -22550, -141503, -131687, -8111, 199289, -6225, 29639, 113199, -187680, -226649, 7732, -108944, -291540, -192925, 48333, 208395, -61816, 182020, -27243, -12254, -30461, -27948, 84865, -121062, -242234, 47542, -231897, -40525, -136468, 811, -287188, 329141, 105676, -313326, 42326, 86934, -88740, 20222, -188467, 57456, 100117, 69826, 192374, 10551, -70568, -22979, 169438, -201421, 21915, -98754, 201547, 342068, -99986, -291481, 28748, -12981, 126034, -330861, -174970, -133111, 173198, 244686, 207966, 59263, -298556, -108532, -3526, -127579, -193677, 44399, -21615, -324211, 66353, -87552, 29698, -37382, 51150, 125762, -246551, 166971, -575634, 8424]
19050C66429d15886A44245c7016C0772a03413k42380K6679Q7530B33078C9034
19039b95006Q8746b9916j03590h28C2056b4108C5968a07586j53832A12891i0455
19027A6603L52995m6941a09818M0457A07665I336b583D1087N3213O0641q856C9756
19014a50982A81162q6215B0354K0924a79313L3810K553A45105a38478F9348h0984
19002A56699b65600B17875a35694j35103A41243A646d4496A32172b88901e4281
18991a98676B05127G4602a509p1030a3077k52041j64533i6637c1295j21658B44530
18979c51999B5332a2278F0381O5352b20874R3867C2968N1025L85799L56146B62217
18967E69890A21722n8576B1764a37426b5896k29785P9257l2101G1097a99799Q2519
$$ y = [366429, -415886, 144245, -37016, 30772, -103413, -345793, -319114, -231584, 233078, 39034, -295006, -206260, -29916, -133506, -828, 32056, -24108, 35968, -107586, -261418, 112891, -90455, 16603, 369598, 322657, -109818, -69361, 107665, 9336, -2583, 41087, 94300, 154941, 146085, 39756, -150982, 181162, 94947, 20354, 41278, -179313, -145503, -142950, 145105, -138478, 69348, -80984, 156699, -265600, 217875, -135694, -270797, 141243, 1646, -44496, 132172, -288901, -54281, -198676, 205127, 74602, -1509, -72539, -13077, -265118, -429651, -96637, -31295, -152953, 244530, -351999, 25332, -12278, 60381, 125733, -220874, -127007, 32968, 83993, 469792, 825938, 262217, 569890, 121722, 63146, 21764, -137426, -25896, -255681, -176424, -208525, 71097, -199799, -117280]
18956a17280r4006I4190M9043d6356j44886f3416A85652G4841a51875H8691b20000
18944a50994G1832c49815a26386e4546m0290k61600A39118a49396a5987B53328
18933c13356h1921B7875c07420L0435e1622B30549B1809b26107A42327e44563
18922a68287k5670G8671a61698n4570n416B38660a30688E0265c48039J56315A56728
18910B74723A6660d3838D60221O8742J4679k13399A7937a28703A07576M2352b02012
18898e0119j30747B57241a03517A9774d705B72525a33381C4939c15282j09495
18888d24777J92954e0681j59494k4572R7204d1687j68346N8388a4555j10434A26874
18876c76144A47421b53410D9120b95368A3294a19715j80808N2938p9371a11534
$$ y = [-117280, -211286, 94190, 143233, -46356, -191242, -63416, 185652, 74841, -151875, 88691, -220000, -150994, 71832, -349815, -126386, -54546, -94836, -356436, 139118, -149396, -15987, 253328, -313356, -81921, 27875, -307420, -276985, -51622, 230549, 21809, -226107, 142327, -544563, -168287, -193957, 78671, -161698, -216268, -221684, 238660, -130688, 50265, -348039, -191724, 156728, 274723, 16660, -43838, 460221, 528963, 543642, 330243, 17937, -128703, 107576, 149928, -202012, -50119, -180866, 257241, -103517, 19774, -4705, 272525, -133381, 34939, -315282, -424777, -231823, -50681, -210175, -234747, -137543, -41687, -210033, -151645, -14555, -124989, 126874, -376144, 147421, -253410, 49120, -295368, 13294, -119715, -300523, -247585, -326956, -111534]
18865B85634A00657f9005J0339b0304k85627g1583k15021A04633m0354a53137
18854d8666B20561a02551C03501C130K25270a31560H1337b45163E5011P6643Q0595
18843B12249a69347L3858p0878c0299l0474l06292i1665e238G5136c68147h9505
18831A01576B6726L970a53446G5040M0797b76099M3458a6950n9583m1791A5061
18819B95905b73107G3115J67031j15504K194J37384b24787A81320A4530L8165
18809E2695J40657j2059e1195I1565a29504c0057B40898b71012A50325a43844
18798A39932J07077A11362a28892N6733m656j61556M5394N1861C48566g8312E7086
18786a62189M1063A79871h3183C08070a04334n8024j28156J28201A38567c34302
$$ y = [285634, 100657, -69005, -58666, -20304, -305931, -71583, -286604, 104633, 64279, -153137, -48666, 220561, -102551, 303501, 3130, 228400, -131560, 81337, -245163, 55011, 131654, 212249, -169347, -135489, -206367, -30299, -60773, -367065, -91665, -5238, 75136, -368147, -89505, 101576, 26726, 30696, -153446, 75040, 115837, -276099, -232641, -16950, -76533, -118324, 15061, 295905, -273107, 73115, 240146, 124642, 126836, 264220, -224787, 181320, 14530, 52695, 193352, 181293, -51195, 91565, -129504, -30057, 240898, -271012, 150325, -143844, 139932, 247009, 111362, -128892, -72159, -76815, -238371, -192977, -141116, 348566, -78312, 57086, -162189, -121126, 179871, -83183, 308070, -104334, -162358, -290514, -162313, 138567, -334302]
18775F1130b49635I4126J8585a10366B21458a07496d6720j38557j12045C3303
18764b36823j42842O4656Q3822O408B5915R5441a67675r3395d8934I9478a3868
18752d5265j09126k00812l3192a81239J825f3056l89692b8909B6156c12098d3376
18740C6936c11437G1608B2322a26357c9025A34881a69993I08a85997L3188B22344
18728d8617p1344d2630o4218E2552J7023A158J20396i229n0044o0068B84668A16613
18715A25030b50052l7486A27955B296a31112B68889K0845b83886K3656b014k3784
18704b5798E9896J15114i0820l31001R5659B98406a17398B7497a87196B75392
18693a14623F8802a92750O8627B31826a0046j17851F9163a79280A61770N2905
$$ y = [61130, -249635, 94126, 112711, -110366, 221458, -107496, -46720, -185277, -297322, 33303, -236823, -379665, -315009, -231187, -224779, 25915, 121356, -167675, -261070, -48934, 99478, -13868, -45265, -154391, -355203, -388395, -181239, -179414, -63056, -452748, -28909, 26156, -312098, -43376, 36936, -311437, 71608, 22322, -126357, -39025, 134881, -169993, 908, -185997, -152809, 222344, -48617, -119961, -42630, -106848, 52552, 69575, 1158, 121554, -9229, -59273, -119341, 284668, 116613, 125030, -250052, -287538, 127955, 2296, -131112, 268889, 289734, -283886, -260230, -2014, -25798, 59896, 175010, -90820, -421821, -326162, 298406, -117398, 27497, -187196, 275392, -114623, 68802, -192750, -124123, 231826, -10046, -127897, 69163, -179280, 161770, 214675]
18683B14675b18017P1593j5458j36239A84143L6161a15814D5922O6982j4130a03763
18671d0548m4891A56094e9383k67089D2426R7566B9804a92794L673f3323B41527
18659i9655j31632A28106M2297b01660A40527a79058O257A41758a37855e3849
18648e0046o2868N152k33049r3384I9863l6948a92732F0853A1052i409j42246
18637a51655p7393M6827G376L47104a70976C9715d1883J7150A05507B872a16064
18625e3380A33974o6485b47781L5425j29019a42473m63679i3353A87137g7138
18614b67568f7601E1147a12837A08498B5701C928J99765a89387P779O7438D670
18602a50236k6820A97891a8975C107D96i0571K5706A30144C5141i1477j38610
$$ y = [214675, -218017, -146424, -161882, -298121, 184143, 220304, -115814, 45922, 112904, 98774, -103763, -40548, -85439, 156094, -59383, -326472, 42426, 139992, 29804, -192794, -189121, -63323, 241527, -99655, -231287, 128106, 170403, -201660, 140527, -179058, -172801, 141758, -137855, -53849, -50046, -112914, -107762, -340811, -434195, 99863, 62915, -192732, 60853, 11052, -9409, -151655, -229048, -182221, 7376, 354480, -170976, 39715, -41883, -24733, 105507, 2872, -116064, -53380, 133974, 67489, -247781, -212356, -341375, -142473, -606152, -93353, 187137, -77138, -267568, -67601, 51147, -112837, 108498, 25701, 3928, 203693, -189387, -181608, -114170, 4670, -150236, -177056, 197891, -18975, 3107, 496, -90571, -64865, 130144, 35141, -91477, -230087]
18591b30087A97833g596j67718N4015q3311A95901E8652d0742A78620K13207D4763
18579a74214f0538C04658A22106i1128I6010Q8864G76L44400h6168j57508M7820
18568a95856j44109H1573c86729B14905h95B3887c30504O2116a25832o7703B83611
18556c07123B66680g8254j52189I7220d22203d0160j9466D32075h3936l7654I0765
18544b29621A4051a25588r8281G0520a44473k28398a69353K7919A06558d6505
18533b37947m5386C10599a70023A46009G209M13758i3549B65872A7038c58037
18522f3785j2893j03079F7679h0039M693B4668J80451e01132G3703k5007i0750
18510c00645a14883I698J47608i3693A2045c63091a50917e9602L23j30132n4406
$$ y = [-230087, 197833, -7596, -175314, -121299, -204610, 195901, 58652, -40742, 178620, 391827, 44763, -174214, -60538, 304658, 122106, -91128, 96010, 184874, 776, 345176, -86168, -243676, -195856, -339965, 81573, -386729, 214905, -895, 23887, -330504, -268388, -125832, -193535, 283611, -307123, 266680, -78254, -230443, 97220, -422203, -40160, -59626, 432075, -83936, -121590, 90765, -229621, 14051, -125588, -223869, 70520, -144473, -372871, -169353, -141434, 106558, -46505, -237947, -283333, 310599, -170023, 146009, 7209, 420967, -93549, 265872, 17038, -358037, -63785, -76678, -179757, 67679, -80039, -75346, 24668, 205119, -501132, 73703, 48696, -90750, -300645, -114883, 9698, 157306, -93693, 12045, -363091, -150917, -59602, -59279, -189411, -243817]
18499b43817F0310a97758c6980A26068b51388C84987b6723k09645B0199d2669
18488I3177K25094K3445A5669a16866P977j2591A30709d9587k84470j5555J51848
18477a97764F0663O3942e6463j24091P2291M6841J0524I9704a76836k64033d9848
18465G0769A078J65451i3379k2907e0324E1949b77137P6920C111a1932N514C3015
18452f9386A22607b70007j6556c5627j94743F7363N1115e4695j92723A64087J05733
18441B69820A1433P2522a85993e192j57284k1673A20982b9263k45686L3092C08746
18429A79331a35659A4549K5615A2044g0298a0985m11312J25012B35543e2182l505
18418e5687J877m0344B95622A26706J13321a16439m4457M7565l0261L1061B8668
$$ y = [-243817, 60310, -197758, -36980, 126068, -251388, 384987, -26723, -236368, 20199, -42669, 93177, 318271, 341716, 15669, -116866, -108889, -121480, 130709, -49587, -334057, -349612, -197764, 60663, 124605, -56463, -180554, -108263, -61422, -50898, 99704, -176836, -440869, -49848, 70769, 1078, 166529, -93379, -116286, -50324, 51949, -277137, -200217, 3111, -11932, -6418, 33015, -69386, 122607, -270007, -286563, -35627, -230370, 67363, 118478, -54695, -247418, 164087, 269820, 11433, 83955, -185993, -5192, -162476, -184149, 120982, -29263, -274949, -241857, 308746, 179331, -135659, 14549, 40164, 12044, -70298, -10985, -422297, -297285, 235543, -52182, -55687, -53810, -94154, 295622, 126706, 240027, -116439, -160896, -113331, -143592, -112531, 28668]
18406b05199a012l24655B30924c0940B63661I272N16045h345j30838m4792O5243
18395a18732j7668F73K210G75e1046l22355A62967b55646a4976l6573J8115k41532
18383b74966g8140k9547E0677a00304A36439a06433p0085l2155A34769a55347
18372C46041a9069j9828C33143D4459P3075h9577k9917J2487C8984f3340m4847
18361a08187A1740a7100j17229N6420c504A85447l1416p6035a08015I2496J43629
18350B36125A03537a30310O0652o7826K6305A59656G1713a35581O5886A78154
18339A49850j0482a81382k16541B65969c1484j19835A52632N9656B9335a50417
18328a05343C9322C215K4538b3392A64070J48114b70575d002l76999a88715b1361
$$ y = [-205199, -1012, -325667, 230924, -30940, 263661, 9272, 525317, -8345, -139183, -183975, -118732, -136400, 673, 2883, 775, -51046, -373401, 162967, -255646, -14976, -51549, -33434, -274966, -78140, -107687, 50677, -100304, 136439, -106433, -176518, -208673, 134769, -155347, 346041, -19069, -38897, 333143, 44459, 117534, -89577, -119494, -107007, 38984, -63340, -108187, 11740, -17100, -134329, -77909, -3504, 185447, 154031, 77996, -108015, 92496, 236125, 103537, -130310, -69658, -137484, -111179, 159656, 71713, -135581, -69695, 178154, 149850, 139368, -181382, -397923, 265969, -31484, -151319, 152632, 212288, 29335, -150417, -105343, 39322, 3215, 27753, -23392, 164070, 312184, -270575, -4002, -381001, -188715, -21361]
18316a85120i415j19881b3625r5168A74748g8579A02092b57672j2214O1428h0534
18304B81010a05716L3571c2059k54633J2822L8449B5033d10709J70778J17125
18294a22806c6217E0306a3522j6356j87767A5953a64242j86477f7923a6635A09447
18282c3323D1846J26787o4083d28628f5347n2622b1540j82797B98905c9611k10456
18271b50067C45054o0194o4075k2586h6989j99187B19184b28035n5170n7804B68268
18259a06729k07435q6634F8529g5479B85376a89657h1533F6758l0062b10218A84762
18247a28866q1062o1668k8699g0750A74113p1925a83194D70626B24658D9542j2456
18236C7086a39143H3385k3667b15264A97743G1089J09530A312b97411K4341B99305
$$ y = [-185120, -9415, -129296, -23625, -118793, 174748, -78579, 102092, -257672, -269886, -208458, -80534, 281010, -105716, -72145, -32059, -286692, -273870, -235421, 25033, -410709, -239931, -122806, -36217, 50306, -13522, -29878, -217645, 15953, -164242, -350719, -67923, -16635, 109447, -33323, 41846, 168633, 104550, -428628, -65347, -117969, -21540, -204337, 298905, -39611, -250067, 345054, 284860, 220785, 198199, -86989, -286176, 219184, -228035, -283205, -341009, 268268, -106729, -314164, -400798, 68529, -75479, 285376, -189657, -81533, 66758, 36696, -210218, 184762, -128866, -209928, -271596, -300295, -70750, 174113, 102188, -183194, 470626, 224658, 49542, 37086, -139143, 83385, 59718, -215264, 197743, 71089, 180619, 1312, -297411, -273070, 299305]
18224a80121g1905j41723k42540J15620A75687C1294a83378B33865f4205A59687
18213b43640C2864d2403j02203O6869j74763f2040A82456a68655p605E3503d2149
18201a25647l9640c9274q4537K9460F5513h568j27014B34404a85031c8408k74855
18190c13263a6489q1044d6352E1222a71558f2765B01760b44242E9011b47344M7994
18179a99350B71793P629h8807j76905A31450b14734a5607C71186d05929K01930
18169b03999A4717a32323A07879e1736k65432B72322b40479H6233a99593M473
18159a95120b7737L496p1637C71468B132R6184m716l9627g994o4396B7408R5214
18147A22622i338k77202j24134E2260d76190A72375g9861A56958b23938F971c1900
$$ y = [-180121, -71905, -213628, -456168, -340548, 175687, 31294, -183378, 233865, -64205, 159687, -243640, 32864, -42403, -144606, -77737, -252500, -62040, 182456, -168655, -176260, 53503, -42149, -125647, -165287, -39274, -123811, -94351, 65513, -8568, -135582, 234404, -185031, -38408, -313263, -16489, -97533, -46352, 51222, -171558, -62765, 201760, -244242, 59011, -247344, -199350, 271793, 279422, -88807, -265712, 131450, -214734, -15607, 371186, -405929, -203999, 14717, -132323, 107879, -51736, -317168, 272322, -240479, 86233, -199593, -195120, -27737, -24241, -95878, 371468, 2132, 98316, 93600, 53973, -7994, -72390, 27408, 122622, -9338, -286540, -410674, 52260, -476190, 172375, -79861, 156958, -223938, 6971, -31900]
18135A66005f8363p9484E7870a34152b478A20086b75633a00849m663K7721B7679
18123C9829e3819I8229d2277r037k08534A10577a13628B43685H86P2846b10911
18111f392p6372B8898e1037B4793O8395g1763A99137a58957P9437m480k02568
18100b86568f5596j99H7674R1640h8215h035j79311B22093D3756b78030e7562
18088B02503a48211A11998e1062j85576F398d5097A26574a00677j37878c2049
18077b58891B47216b99968R3800i9624K9833B6768M1182b41977L3879q7580a31451
18065H0309L7561b8637n4702j81202B8869c03299i7647o37264C11556E1758a17568
18053C04280a679j7175p7975d5784H4710a40620N3424F3509b07897B99764A23735
$$ y = [166005, -68363, -147847, 57870, -134152, -2478, 120086, -275633, -100849, -105512, -77791, 27679, 39829, -53819, 98229, -42277, -51314, -259848, 110577, -113628, 243685, 886, 73732, -210911, -6392, -82764, 28898, -51037, 24793, 93188, -71763, 199137, -158957, -79520, -84000, -286568, -65596, -65795, 87674, 179314, -88215, -8035, -187346, 222093, 43756, -278030, -57562, 202503, -148211, 111998, -51062, -236638, 6398, -45097, 126574, -100677, -238555, -32049, -258891, 247216, -299968, -206168, -99624, -69791, 26768, 67950, -241977, -208098, -295678, -131451, 80309, 117870, -28637, -83339, -264541, 28869, -303299, -97647, -734911, 311556, 51758, -117568, 304280, -1679, -18854, -96829, -45784, 84710, -140620, -87196, 63509, -207897, 299764, 123735]
18041h9146l36328a87268q257b2189j73373I8305f8396j93464B39197b5047C6462
18029A06116m5996R3076m8660B4271h7404b0109o9259B07936A3595a0216D2330
18017a92237e2426j06860m5047A55316K05362A74196c5238q8838B9416O3031J05845
18006A98292d17814B09936a51140d448D72254E5151A5404c50855h0136q0702A91767
17994C14683j5892d7676o749A04666d74908e9251F432a61822O8734A22491b82763
17982A95444a12971K1435C10158b1704k1014B11386R1395F8048C0697a82609B4197
17970F4493L5780d5581p1225B62753d3211B55961b8632B09132h584C33624a46642
17958C43107A09732j8812J5972B508N5588a48690r1201j12219G961a21307j20476
$$ y = [-89146, -425474, -187268, -195525, -22189, -195562, 98305, -68396, -261860, 239197, -25047, 36462, 106116, 60120, 153196, 104536, 24271, -87404, -20109, -89368, 207936, 13595, -10216, 42330, -192237, -52426, -159286, -204333, 155316, 360678, 174196, -35238, -124076, 29416, 92447, 198292, -417814, 209936, -151140, -4448, 472254, 55151, 15404, -350855, -80136, -160838, 191767, 314683, 298791, -47676, -54425, 104666, -474908, -59251, 6432, -161822, -93088, 122491, -282763, 195444, -112971, -91536, 310158, -21704, -42718, 211386, 302781, 68048, 30697, -182609, 24197, 64493, 100273, -45581, -116806, 262753, -43211, 255961, -28632, 209132, -8584, 333624, -146642, 343107, 109732, 90920, 106892, 2508, 58096, -148690, -239891, -352110, 7961, -121307, -241783]
17947b41783O8854j23917A86309a35133B2365b01380F2492a59257A99747a79608
17936e7210H2080P9331G8405M2478J0714i2413D4033a43996r7216I9860R010a30310
17923A21638b03234f6227c1202j50393C9085h5810A41031c0479j8708l3204A92582
17911b56644e8372A21196b04984J520M6463D8827K980a5322n5794b313j7875E0482
17898C1286L03490A46439a04531r310d3908m2578C4120J8994A3637P7502c03629
17886I7202j0954c8700G2398h0349D0873a15395e0587J3834B87997b83277K560
17875b80717F8794L5903J28711a50901A79702B470b79164A23559c274k05400B51150
17863a67209L3588D17407A54668C9533b71046F650g1670l4894p2099g7123A47143
$$ y = [-241783, -172929, -296846, 186309, -135133, 22365, -201380, 62492, -159257, 199747, -179608, -57210, 82080, 161411, 78405, 120883, 131597, -92413, 44033, -143996, -241212, 99860, 108870, -130310, 121638, -203234, -66227, -31202, -181595, 39085, -85810, 141031, -30479, -49187, -82391, 192582, -256644, -58372, 121196, -204984, -203464, -157001, 48827, 51807, -15322, -71116, -2313, -20188, 50482, 31286, 334776, 146439, -104531, -113841, -43908, -86486, 34120, 53114, 13637, 91139, -303629, 97202, 86248, -38700, 72398, -80349, 40873, -115395, -50587, -36753, 287997, -283277, -280717, 68794, 104697, 233408, -150901, 179702, 2470, -279164, 123559, -3274, -208674, 251150, -167209, -133621, 417407, 154668, 39533, -271046, 6650, -71670, -106564, -178663, -77123, 147143]
17851f4161E3009J33121h8349n3627a4930k00571a05734q4175D3540f9263L3148
17840c6115k35679J12440A01608P711j6348a71828m4908C11419a92122g4661m6710
17829a21371M1714F68669B36519A08443i3874A03709J67793e3551C8031g9533
17818a1014j21347O2080A62974a78938J7525B75674b22736g4553A66125a04098
17807i6363k1694A00134k9885L1758B0856Q6029K2681B2387P5445a98513a1888
17795d574j772D5947b2630C91317D5722N2378P4534K41832a49909k02658A04463
17783A080J90610C254b13390B14312i2583j34025D4556c95057a55551P2159d0794
17771i7996D02187K0258A39430o3641a94591L4729A02336Q1673j0954C7179a26897
$$ y = [-64161, 53009, 186130, -88349, -141976, -14930, -215501, -105734, -189909, 43540, -69263, -36115, -271794, -159354, 101608, 109319, 92971, -171828, -216736, 311419, -192122, -74661, -121371, -79657, 668669, 236519, 108443, -93874, 103709, 271502, -53551, 38031, -79533, -11014, -132361, -70281, 162974, -178938, -161413, 275674, -222736, -74553, 166125, -104098, -96363, -118057, 100134, 70249, 102007, 20856, 106885, 129566, 22387, 97832, -198513, -11888, -4574, -6346, 45947, -22630, 391317, 45722, 98100, 172634, 414466, -149909, -352567, 104463, 1080, 191690, 3254, -213390, 214312, -92583, -226608, 44556, -395057, -155551, -83392, -40794, -97996, 402187, 422445, 139430, 75789, -194591, -159862, 102336, 184009, 173055, 37179, -126897]
17759g7767B8624K52470J81208B09198C6551J96850A06880C3677R2998m7449b15284
17747A68673J04013a67292A0760J42832o8681J03198K6733A4468P9700d9074B12941
17735c21494B48722a84594N0995A84563A5071b47781I8960a15169m3569B07404
17724B06680f638A98943B3900J60293a33094B385i4699m43021h8677a4614H3265
17712B69516G4983g028l8102A60014M4763f7238b2851E9111j1238b4149A23626
17700c09903e5520E2301A4362M79066i4772B9869Q2474J44059C1359M6566J06436
17689A84361q8515L86669d9136k08373C3094d2282a1930I0698e1340A42139n3364
17678H8775L0126b3551B68534n1009E6123g4609K1920k6669j51384L5879P4296
$$ y = [-77767, 28624, 281094, 462302, 209198, 36551, 233401, 106880, 33677, 126675, 79226, -215284, 168673, 272686, -167292, 10760, 153592, 84911, 188109, 214842, 14468, 94168, -49074, 212941, -321494, 248722, -184594, -133599, 184563, 15071, -247781, 98960, -115169, -158738, 207404, 206680, -6638, 198943, 23900, 184193, -133094, 2385, -94699, -537720, -88677, -14614, 83265, 269516, 74983, -7028, -45130, 160014, 204777, -67238, -22851, 59111, 47873, -24149, 123626, -309903, -55520, 52301, 14362, 493428, -94772, 29869, 112343, 256402, 31359, 77925, 184361, 95846, 482515, -49136, -257509, 33094, -42282, -11930, 90698, -51340, 142139, 88775, 118901, -23551, 268534, 217525, 56123, -74609, -52689, -79358, -230742, -194863, -120567]
17667a20567E2340J49161l9909F0215a04439B49620h7430n3995B67362Q4992j57966
17656A94388E0956e0401d941B99395j15213a92171h6656B02246b00452f8271o0665
17645a28936A60989J45880d072D0296K16675H0068k3475e5147j39553B061J0742
17634A2803a19325B01631l5320g8001D522a17460l5278B02596b85266A59333F5091
17622B9100c1199A3308a07306A76407C3235J45315m1002k0132J89482E1302J7549
17611F8851L80b1024k85950A32467a51867B42138M6688j29301K05436a01299A42678
17599a06354A18163a21447A797R2869N9408N019B6379L26824e2977B23835a54746
17587a38751C12246g3344A95736b92906A44986c3494A25859E7265P3878J7648
$$ y = [-120567, 52340, 201501, 161592, 60215, -104439, 249620, -87430, -141425, 267362, 352354, 194388, 50956, -50401, -4941, 299395, 184182, -192171, -86656, 202246, -200452, -68271, -128936, 160989, 306869, -4072, 40296, 256971, 80068, 56593, -55147, -194700, 2061, 12803, -119325, 201631, 166311, -78001, 4522, -117460, -152738, 202596, -285266, 159333, 65091, 29100, -31199, 13308, -107306, 176407, 33235, 178550, 137548, 117416, 306898, 51302, 68851, 69231, -21024, -306974, 132467, -151867, 242138, 288826, 159525, 364961, -101299, 142678, -106354, 118163, -121447, 1797, 94666, 154074, 159093, 26379, 353203, -52977, 223835, -154746, -138751, 312246, -73344, 195736, -292906, 144986, -33494, 125859, 57265, 131143, 148791]
17577A48791d5937N796a7049C26543J22621C3161J76199b2014B75843O8904j52979
17566A91768L378J90640j52038L5955r8550c6190j79017B40398J3620d44819C03897
17554F2243a68638B88642j13845j8060e730A33517M6507o8746J68878J09277F0403
17542B57127J65486e630D25010A52779p2701K3919L15790A7322M87850A67548
17531C50940c1251n8738B7743N46277j84288L36448Q5663L050K05103o5146l19998
17520F34852R1108o5193k01015j9309B17603M71599k57470J22299B11150L11353
17510E22503L68871J3575m8602J41434m67003J39745r1441B51707K93265B21246
17499C27359C5975K09520O7431k216j29497K73929j33924r3593A7370M63164j16673
$$ y = [148791, -45937, -40141, -17049, 326543, 449164, 33161, 209360, -22014, 275843, 344747, 191768, 195146, 385786, 233748, 269703, 171153, -36190, -215207, 240398, 254018, -444819, 303897, 62243, -168638, 288642, 174797, 156737, -5730, 133517, 180024, 111278, 280156, 389433, 60403, 257127, 422613, -5630, 425010, 152779, 80078, 103997, 419787, 17322, 505172, 167548, 350940, -31251, -89989, 27743, 574020, 389732, 726180, 811843, 814893, 1019996, 954850, 634852, 725960, 660767, 459752, 440443, 217603, 689202, 431732, 554031, 211150, 522503, 891374, 904949, 856347, 997781, 530778, 670523, 579082, 251707, 544972, 221246, 327359, 35975, 245495, 312926, 310710, 181213, 455142, 321218, 227625, 17370, 480534, 363861]
17488C63861r2293K60058F5095N75575n9471a19748F73523A44320J08071K00202
17478D52593l9307E840J37476K10851J33108o3436G4900Q8860N5255g4283C48130
17466D72503B26952I0516J14721B0426K01678J33398l4327k0404H7576J29991
17456B17567I5811d6048E02913C2618J60702J12741H1769N09818k41250A47564
17445B47202J82218J68549j31603J16703k29939j50892m1670J1562J81232R9434
17435D52796r2108K03526j34652A21601K45454C9285L78378N1887n9771j53456
17425B56323o5659F3879J00987K78617j37002R3211A23406K11080r0645B5706
17414D68201k05798J56426q1674R2251j36383L3147j20472Q6846J82821d3901
$$ y = [363861, 271568, 531626, 65095, 640670, 581199, -119748, 673523, 144320, 252391, 452593, 413286, 5840, 143316, 354167, 487275, 423839, 74900, 163760, 219015, -74283, 348130, 472503, 226952, 90516, 205237, 20426, 222104, 355502, 321175, 300771, 87576, 217567, 95811, -46048, 502913, 32618, 193320, 306061, 81769, 591587, 350337, 147564, 247202, 429420, 597969, 466366, 583069, 353130, 202238, 160568, 172130, 353362, 452796, 360688, 564214, 429562, 121601, 367055, 39285, 417663, 469550, 409779, 256323, 190664, 63879, 164866, 443483, 306481, 399692, 123406, 334486, 243841, 25706, 468201, 262403, 418829, 337155, 429406, 293023, 326170, 205698, 292544, 475365, -43901]
17403E05114H5603Q9531J6521O815M02069A99041K19398g2103L2580l6722A40305
17391B33406I8364M09333e5488A20527J85667a8421l3703A78200M7432o4000L8152
17380A99784H1030L38836l3138Q248m479C7379l281R5674R8063J0405b0901E9900
17367A72628K96305k6423B16242J42554J97034A81362R8559n6303m6309R6554
17357B73863j19097j1693J22725G5608J00545N7999R6459h2400A87968a33438
17346C71111k035p6969K2895J0625A56928K98442g6485D60466k11128l5203J77841
17335C91976A68317J9225K14706l532A93479Q0894r4545J50073A55118K98389
17325D53507i2943B78762J15034o6584q1999J10851k547C3432L20103N9199A19057
$$ y = [505114, 85603, 175134, 191655, 198470, 600539, 199041, 418439, -72103, -39523, -76245, 140305, 233406, 98364, 507697, -55488, 120527, 306194, -18421, -52124, 178200, 225632, 161632, 199784, 81030, 419866, 386728, 394976, 390497, 37379, 34098, 129772, 227835, 238240, -20901, 59900, 172628, 468933, 442510, 216242, 358796, 555830, 181362, 279921, 223618, 177309, 273863, 154766, 143073, 265798, 75608, 176153, 234152, 330611, -82400, 187968, -133438, 371111, 369076, 292107, 315002, 325627, 156928, 455370, -76485, 460466, 249338, 214135, 391976, 168317, 187542, 402248, 398716, 193479, 274373, 179828, 329901, 155118, 453507, -92943, 278762, 393796, 327212, 245213, 356064, 353517, 33432, 353535, 412734, 119057]
17313E92107l6338j38697A30935F4568K52100K14458q6309j02335j6804n2704
17303B72974Q8607J56636A0096L90126j07166M3441j5679m2988j15778D7539P5579
17292A23118N2091R500J41856J73318i9011C12438r322E8646J901J93155K39294
17281D92996E7929N03307A87108K11837n9714j7704P3270d9099C25553j14131
17271B11422K38602n2541j48658K35167j95314R7344M3140L810k03190K49883
17261D79665g9459D47043N406N6865j79465j12099K59219j12274A81253O683M19753
17250F07689r1862I0545M59901A48593A5785C808a17466D78028A73444L98544
17240E71988a8669C00397M6308J30321q2879A20245P5517K52012B11346j05295
$$ y = [592107, 555769, 417072, 130935, 64568, 316668, 531126, 444817, 342482, 325678, 272974, 361581, 518217, 10096, 400222, 293056, 336497, 320818, 277830, 162052, 47539, 123118, 175209, 184709, 326565, 499883, -99011, 312438, 303116, 58646, 60547, 253702, 492996, 57929, 561236, 187108, 398945, 339231, 321527, 394797, -49099, 325553, 211422, 450024, 397483, 248825, 483992, 288678, 386022, 429162, 432972, 229782, 479665, -79459, 447043, 452449, 509314, 329849, 217750, 476969, 364695, 181253, 187936, 607689, 515827, 90545, 550446, 148593, 15785, 3808, -117466, 478028, 173444, 571988, -18669, 300397, 346705, 477026, 394147, 120245, 195762, 447774, 211346, 106051]
17230A06051J29862H0699O0499B3323K89994J47434k03802J18147a62343B43572
17219F67380B88664L6756J01473K03170R1896A64685N18723A72031R2552K601
17209B67184J4795n0437K38351d6581B73449K93382B5178J67373J84219K8326
17199D05096l0881r0841o4745r618K09549J0254G7127M29948k07970J7307J24876
17188D41288J13033K2849k45079N7349J20877j46296j57599L8668K84574j38460
17178C91204K10202B01335O427L6314L15182B05970K26707P6377B36298M52518
17168F88816n8706j59190j08991m816K47626j10548j42700m8539L03857Q75j0534
17157E97150B17607J39797K65694N7918A17748M00531o5644o8025o0936A26784
$$ y = [106051, 235913, 80699, 141198, 23323, 313317, 460751, 256949, 375096, -162343, 243572, 667380, 288664, 325420, 426893, 630063, 721959, 164685, 683408, 172031, 264583, 267184, 281979, 231542, 469893, -46581, 273449, 566831, 25178, 192551, 376770, 405096, 374215, 283374, 218629, 209011, 418560, 428814, 77127, 507075, 299105, 316412, 441288, 554321, 577170, 332091, 389440, 510317, 364021, 206422, 245090, 529664, 391204, 601406, 201335, 207762, 244076, 559258, 205970, 432677, 509054, 236298, 688816, 630110, 470920, 361929, 357113, 604739, 494191, 351491, 302952, 606809, 607684, 597150, 217607, 357404, 623098, 681016, 117748, 518279, 452635, 384610, 323674, 126784]
17146F01769B43468G6630J38488K48631j90083L22926n2473P7807j26502j66060
17136C29364L17720k91074K82731L98787D96565j22099L22049k63191K84236B06234
17125F99341k92082Q783K56680C13494L91151r4178j08891R2836A45768N98482
17115G44250K65947C00506J21227R612r0647k0990j56826M90653p1279K37464
17105H19720B97973P6279K02256j03861j86784M06737k11457n8759q3612Q8271
17095D27043J03122j2655p3821K29911J2511C28965L02024q32r6005O330k9060
17084E11422J03331j43192J7675P9800L14886o6826j98098J57235J7831k96079
17074D97985j23981M89862k77857J36988C20885L78083L34736k50895j60331j27845
$$ y = [601769, 243468, 76630, 215118, 463749, 273666, 596592, 544119, 621926, 495424, 329364, 647084, 356010, 638741, 1037528, 496565, 374466, 696515, 433324, 717560, 206234, 699341, 407259, 416042, 672722, 313494, 704645, 610467, 501576, 594412, 145768, 744250, 1010197, 300506, 421733, 431345, 340698, 319708, 162882, 653535, 582256, 819720, 297973, 374252, 576508, 472647, 285863, 692600, 481143, 422384, 338772, 427043, 530165, 517510, 443689, 673600, 686111, 328965, 630989, 630157, 534152, 540482, 511422, 614753, 471561, 489236, 569036, 883922, 817096, 618998, 776233, 794064, 497985, 374004, 863866, 586009, 722997, 320885, 698968, 1033704, 782809, 622478, 494633]
17064D94633K60666q2780j31661N0951K63448m03534K46204L31010L2309l08940
17054G52306J97575j47960Q1826j57528n8968j17898J72417l43807K64704L57332
17044I99999n8555Q4859k45162r2575M24944D77571N18313j53996k96151K76459
17034H22196P9411l44484L19512J6296K10192j67835k72216j18612L05769M9785
17024I00014l8452j05853J53468k0751M5365n4596O4490K95875k97837l44426
17014E97297L94865k1729m6759P5799K33281n20813J17969J20244j06435o1052
17004G82667J25183n5297K78059q8285m7005J5740L21451l07975D52726O19655
16994A072381N3727J19255j23406k7448j25103O3119J28791m69583N39400p2315
$$ y = [494633, 755299, 672519, 540858, 591809, 855257, 451723, 697927, 1028937, 1061246, 752306, 949881, 801921, 883747, 726219, 667251, 549353, 721770, 377963, 642667, 999999, 941444, 1026303, 781141, 688566, 1113510, 477571, 995884, 841888, 545737, 822196, 901607, 557123, 876635, 892931, 1103123, 935288, 663072, 544460, 850229, 900014, 861562, 755709, 909177, 888426, 933791, 879195, 943685, 1239560, 941723, 597297, 992162, 970433, 923674, 999473, 1232754, 711941, 829910, 950154, 843719, 782667, 907850, 852553, 1130612, 1042327, 995322, 1011062, 1332513, 1024538, 452726, 1072381, 1126108, 1245363, 1121957, 1094509, 969406, 1032525, 1161316, 691733, 1231133, 1158818]
16984A158818k19321P4895J92794j81177Q1375N7660K42419q8188M4597K72811
16974A636683m68488M47248j50910p2714P049k43074J74033Q1154L63185m90239
16964A283927J02500K63055k79042L2350r9725o8607J24074K72940r1129m6965
16954A493378k73061K15547j57368L26461k02071O2391J6966J07577l29636K85183
16944A545367k96627L46435J4551j21258J04678o3405J70556m4805K58767j24894
16934A789365l55976N40879j48885j24433J73644p5460J91609n51982M86367K54827
16924B179955l70430M50266l53341K33479o3867K59343j42490q163j34699J90095
16914B240148p963q4261l09979N10404k26833J94203M16685l67060j12937l667
$$ y = [1158818, 939497, 1014392, 1207186, 1026009, 1107384, 1165044, 1407463, 1319275, 1363872, 1636683, 1168195, 1615443, 1464533, 1391819, 1398868, 1155794, 1329827, 1410981, 1774166, 1283927, 1386427, 1649482, 1370440, 1402790, 1303065, 1234458, 1358532, 1631472, 1540343, 1493378, 1220317, 1435864, 1278496, 1604957, 1402886, 1465277, 1482243, 1589820, 1260184, 1545367, 1248740, 1595175, 1609726, 1488468, 1593146, 1529741, 1700297, 1655492, 1914259, 1789365, 1433389, 1974268, 1825383, 1700950, 1874594, 1799134, 1990743, 1438761, 1925128, 2179955, 1809525, 2259791, 1906450, 2139929, 2076062, 2335405, 2192915, 2184752, 2050053, 2240148, 2232185, 2147924, 1837945, 2348349, 2121516, 2315719, 2732404, 2365344, 2252407, 2248740]
16904B248740J92605j61718k9101K42472R7417J5266k41045M71032q0540m11707
16894B343421K77253J20766K4826j39956K20372R6571k67188K07110O4503J40295
16884C087973K05869j77525k33758P8770J3835L53538P5128m29295M28195r9881
16874C302849j141L75959k65479J77858k48213P4533K11086N10249l48409J06151
16864C895443m31745M14190n414M3531J3012j6272J41533M1157P9127k4593J13024
16853D262993N73272m04356J93343j34147O619J57644l7617L51379R0561k64058
16843D795633M14325j59840k7472K89308J92700K15991n0086K85623k07126K20548
16833E969604k33950M43671k26439Q1535J26041K05485J93548O07108l10690J07742
$$ y = [2248740, 2441345, 2279627, 2250526, 2492998, 2590415, 2605681, 2364636, 2835668, 2755128, 2343421, 2620674, 2741440, 2766266, 2626310, 2846682, 2943253, 2676065, 2883175, 2947678, 3087973, 3293842, 3116317, 2882559, 2961329, 2975164, 3328702, 3403830, 2974535, 3402730, 3302849, 3301708, 3677667, 3412188, 3590046, 3341833, 3416366, 3627452, 4137701, 3789292, 3895443, 3463698, 3877888, 3872474, 3916005, 3929017, 3912745, 4054278, 4095435, 4174562, 4149969, 4262993, 4836265, 4431909, 4625252, 4491105, 4497724, 4655368, 4617751, 4969130, 5059691, 4795633, 5209958, 5050118, 5022646, 5311954, 5504654, 5720645, 5670559, 5956182, 5749056, 5969604, 5735654, 6179325, 5952886, 6034421, 6160462, 6365947, 6559495, 7166603, 6855913, 6963655]
16823F963655o8880J36019j2186L46380M33833k04153L95154J28004J82318p8663
16813H221481M6944L95291K87340j93583M16332K02374M65843j91428J19404N22788
16803A0292786J26465R9895j74238J069861J62332J27194L58631L08891J78219
16794A2550036J28140O77753m03M89722J0882P70396N4352Q67258j26371K81380
16784A5703145O31869K97444Q25042J35702P26668N33994R1203Q14908O21419
16775B0381394J3734J183634R95236L42611R67314M02061R80214O78336R85934
16766B6930468Q80067P25617Q72794J484581P06348Q27708J319632R43991J475711
16757C6166917J479635Q29338J652697J825078J484162J643701J525559J664531
$$ y = [6963655, 6894775, 7030794, 7018608, 7364988, 7798821, 7594668, 7989822, 8117826, 8300144, 8221481, 8268425, 8663716, 8951056, 8757473, 9173805, 9376179, 9842022, 9650594, 9769998, 10292786, 10419251, 10519146, 10344908, 11414769, 11577101, 11704295, 12062926, 12371817, 12550036, 12678176, 13355929, 13355526, 13845248, 13856130, 14626526, 14680878, 15548136, 15421765, 15703145, 16335014, 16632458, 17457500, 17593202, 18319870, 18853864, 18945067, 19759975, 20381394, 20395128, 21578762, 22573998, 22916609, 23883923, 24285984, 25266198, 25944534, 26930468, 27810535, 28536152, 29408946, 30893527, 31599875, 32427583, 33747215, 34691206, 36166917, 37646552, 38475890, 40128587, 41953665, 43437827, 45081528, 46607087, 48271618]
16749D8271618K203819J718672J930150K000205J803092K569482K427165K513746
16741F5437949K217384K701914K569630K645622K358559K724026K740506K882662
16733H6278252K644969K392955K878838K584033K644433J637703K623773J590007
16725A05274963J937456J093290J475263J114325J40912M18770K0066l85483q87574
16716A10201988p19084j430462j227077k092084j942123k369853k222341k538156
16708I5660808k349545k723427k880820k465718k809125k912722k675502k591972
16700G4251977k616715k503734k691046k938012k137616k118145k185302k461630
16692E4599777j864692j788102k119066j996588j605217j693581j563885j633588
$$ y = [48271618, 50475437, 52194109, 54124259, 56124464, 57927556, 60497038, 62924203, 65437949, 67655333, 70357247, 72926877, 75572499, 77931058, 80655084, 83395590, 86278252, 88923221, 91316176, 94195014, 96779047, 99423480, 101061183, 103684956, 105274963, 107212419, 108305709, 109780972, 110895297, 111036209, 111454979, 111475045, 111089562, 110201988, 109482904, 108052442, 106825365, 104733281, 102791158, 100421305, 98198964, 95660808, 93311263, 90587836, 87707016, 85241298, 82432173, 79519451, 76843949, 74251977, 71635262, 69131528, 66440482, 63502470, 61364854, 59246709, 57061407, 54599777, 52735085, 50946983, 48827917, 46831329, 45226112, 43532531, 41968646, 40335058]
16684D0335058j259313j724714j222181j525161q27602j117266j177889j310173
16676C0170759r37466j165134p25507j174821o09861o85670q18797q45389o04663
16667B2603451q68044p68856l30287p38295n98551q16589j11988p24275l38905
16658A7307661q63249l27254l16845l48033o76782l03174m73989m40582k00373
16649A3357380j63637l78504k03718l11473k99843m91202m98399L7456n47904
16640A0500156J22655k62349l13589k87634l20174O4867k96070j86364k48060
16631H773438l12170k2562j91019k48771k60274j26064j36492k34204J46426l53438
16621G034870k57776o6936N7360m9011m00389J47598j77878j28586k66298o8481
$$ y = [40335058, 39075745, 37351031, 36128850, 34603689, 33776087, 32658821, 31480932, 30170759, 29233293, 28068159, 27342652, 26167831, 25557970, 24872300, 24053503, 23208114, 22603451, 21735407, 20966551, 20636264, 19897969, 19299418, 18482829, 18370841, 17646566, 17307661, 16444412, 16117158, 15800313, 15452280, 14775498, 14472324, 13998335, 13557753, 13357380, 13193743, 12815239, 12611521, 12300048, 12000205, 11509003, 11010604, 11048060, 10500156, 10622811, 10360462, 10046873, 9759239, 9439065, 9503932, 9207862, 9021498, 8773438, 8461268, 8438706, 8247687, 7998916, 7738642, 7612578, 7476086, 7241882, 7388308, 7034870, 6777094, 6710158, 6767518, 6718507, 6318118, 6465716, 6287838, 6159252, 5892954, 5824473]
16611E824473J43931n02211P5590L52671o62743K48487m87051J58915k18194k28980
16601D704888K27685r7458l79909j63784O30882n97918M3730L1774j7019k60384
16591D122487q0123j03249q3155j60800M18902N9745l38252q7149J90111l67129
16581C571388k20584j43533J14276L7471m4878O2865K7483k23515k15783J78058
16571C143248j62397m53525N23409p9227j65371j23457J9477j46258J32738J37639
16561B826276l06949K00146k19580L0713j53950J88275j27812K15071M7819n26778
16551B173231L28418n40608K32411P5455j8478m84552N37967l1037n30509M7647
16541A789945O7541j33257K44399j26779J92064k85445m9714J80153l07074N670
$$ y = [5824473, 5968404, 5466193, 5541783, 5894454, 5231711, 5480198, 4993147, 5152062, 4933868, 4704888, 4932573, 4835115, 4455206, 4291422, 4922304, 4324386, 4368116, 4399890, 4382871, 4122487, 4042364, 3939115, 3855960, 3695160, 4114062, 4173807, 3835555, 3748406, 3938517, 3571388, 3350804, 3207271, 3321547, 3359018, 3314140, 3377005, 3404488, 3180973, 2965190, 3143248, 2980851, 2527326, 3050735, 2971508, 2806137, 2682680, 2702157, 2555899, 2688637, 2826276, 2519327, 2719473, 2499893, 2530606, 2376656, 2564931, 2437119, 2652190, 2700009, 2173231, 2501649, 1961041, 2193452, 2268907, 2250429, 1765877, 2303844, 2272807, 1742298, 1789945, 1857486, 1724229, 1968628, 1841849, 2033913, 1748468, 1698754, 1878907, 1571833, 1577503]
16531A577503M10797j91511r5043j9000M9091J83369N9075p1346l38684p6233
16521A488018q285J53074n2589n1379m0859P3042L10489k40228q3714j51273k33939
16510A162357k03747N47648k65823J90710J00514k0300m4687m36000M45598j87344
16500A288926K39742m66954N80776n21847l8335K79828j76915j1175O3522k9298
16490A208270J23596q4052n1709m5210j95129r4631K88803J68265j02838j62978
16480A052387j27791Q0880j14321L21762k17427j29627o2281k79159L21770N02228
16470A348421l07950k04960K5770K46128k33597J15977j8910k07011M8109K12198
16460A024175l16981J91093L1895k69398K05619n8925O9915K70759k95527j35460
$$ y = [1577503, 1988300, 1796789, 1701746, 1682746, 1731837, 1915206, 1974281, 1902935, 1564251, 1488018, 1479733, 1632807, 1580218, 1528839, 1487980, 1561022, 1871511, 1631283, 1547569, 1396296, 1162357, 958610, 1506258, 1240435, 1431145, 1531659, 1511359, 1466672, 1030672, 1476270, 1288926, 1528668, 1061714, 1642490, 1120643, 1082308, 1362136, 1185221, 1174046, 1237568, 1208270, 1331866, 1247814, 1196105, 1150895, 955766, 861135, 1149938, 1318203, 1215365, 1052387, 924596, 1005476, 891155, 1212917, 995490, 865863, 803582, 524423, 846193, 1348421, 1040471, 835511, 861281, 1107409, 873812, 989789, 970879, 763868, 811977, 1024175, 707194, 898287, 930182, 660784, 866403, 807478, 877393, 1148152, 852625, 717165]
16450G17165j26259L0956L53053n6785l62755L08042J10470r7625q3704M8720
16440H41278C48113M04057j26123q8157k1411K6980J28844j0635j55408M48349
16430I54609j04670k60002J42284K04046l5250j63069J33089M9800m7766q3647
16420G89424j82114K46412j76747K7847k96046j93238K48971L83938D18556L7041
16410D55597J51040P9733q3481L10976k06908l50586L51619A92394R8932L35659
16400F26985O9992j17541j12843M15071j81054j10336N0128G5706P87010j80638
16390F82078k37102q9293J71022k20023J03649j83960M468J59035J21598M6530
16380E58002k32412J64901A71566N40153l45341L23925k60660L41105j90794j84481
$$ y = [717165, 590906, 621862, 974915, 918130, 555375, 863417, 973887, 876262, 792558, 841278, 348113, 752170, 626047, 537890, 516479, 543459, 672303, 661668, 506260, 954609, 849939, 589937, 732221, 936267, 901017, 737948, 871037, 920837, 873071, 789424, 607310, 853722, 676975, 704822, 408776, 215538, 464509, 848447, 418556, 455597, 606637, 686370, 602889, 913865, 706957, 356371, 707990, 192394, 291326, 626985, 696977, 579436, 466593, 881664, 700610, 590274, 640402, 75706, 862716, 682078, 444976, 355683, 526705, 306682, 410331, 226371, 230839, 389874, 511472, 558002, 325590, 490491, 171566, 711719, 366378, 690303, 429643, 770748, 579954, 395473]
16370C95473o8890p670K36958B42494K44452B38270R0223J77485j8253F7644L20062
16359C87706j42602M5617G7715M47271P0437m8862j26536K63778A26592J91402
16349C17994I6807K77227A02080Q6805J26835M6658n9034j3646K02463j71857
16339C20304R2108q4440a08791B72096P0855r4951j04149E1083K62258J52037
16329D65378j43600o75O3129I6150J25331Q3470P9262j74650J08409a2686A16167
16317B14012J0391r0412J74370L75423B51410Q6989a23349C31650o8749J73518
16307D36419A33617J8078N25760B10836K12114F2262l0539N95270B16209K88117
16297E04326j36690m049A4866L65926q6621n131F9093K91948j71706P6095n1848
$$ y = [395473, 326583, 318913, 555871, 242494, 486946, 238270, 328493, 505978, 487725, 67644, 387706, 245104, 290721, 77715, 524986, 595423, 546561, 420025, 683803, 126592, 317994, 96807, 374034, 102080, 188885, 315720, 362378, 303344, 289698, 492161, 320304, 412412, 327972, -108791, 272096, 342951, 248000, 143851, 51083, 313341, 465378, 321778, 321103, 384232, 96150, 221481, 304951, 384213, 209563, 317972, -12686, 116167, 214012, 224403, 133991, 308361, 683784, 251410, 338399, -123349, 331650, 262901, 436419, 133617, 151695, 677455, 210836, 422950, 62262, 31723, 626993, 216209, 504326, 367636, 363587, 14866, 380792, 294171, 289040, 69093, 361041, 189335, 265430, 213582]
16286B13582L6448K06137j79065A17874m9653h6080I7675J77389L581D6932g6243
16274C08686I4496J33245A12389L14013e9590q4803A13531B4059M827J74562J09691
16263C13139A17551H415O9156K48056j0798M72B6491K39885A22135B0700c3406
16251A91459P8685L1399P4861j68612n310I1864K6184P139C7214L17937c1975
16239A36404k9637L09214a3763E44415g0169C24706j24296F334O8018O0774b22162
16227D18800a13987A62652P7320J5377d3841H2918J47464a61916B02603f283l5366
16216d1649A15744J77444p8589e27039a27151B13196J11515A20426N8325d5039
16205c9557C33931A2603J07175b01795r29A82434O2322D8098a15756B10169i32
$$ y = [213582, 250030, 456167, 277102, 117874, 68221, -86080, 97675, 275064, 278645, 46932, -76243, 308686, 94496, 227741, 112389, 426402, -59590, -144393, 113531, 24059, 28886, 203448, 313139, 117551, 8415, 77571, 325627, 314829, 315301, 26491, 266376, 122135, 20700, -33406, 191459, 270144, 301543, 376404, 207792, 202482, 91864, 118048, 125187, 37214, 355151, -31975, 136404, 106767, 415981, -13763, 544415, -70169, 324706, 200410, 6334, 74352, 135126, -222162, 418800, -113987, 162652, 239972, 255349, -43841, 82918, 230382, -161916, 202603, -6283, -41649, 115744, 293188, 214599, -527039, -127151, 213196, 324711, 120426, 178751, -45039, -39557, 333931, 12603, 119778, -201795, -202724, 182434, 244756, 48098, -115756, 210169, -932]
16193D4796A3856N61171k29424K2394j55652p2689J50645j12237k8693M1801q5284
16182A05888K25984B1593f8039C42064D2912O1433h1331A26207A046a53829A17771
16170a4047B46829a17469D8162K29431j22425e2288F3687a02124p3984b8349J0409
16159a7940m1235p9474O1506A71067d0965j88615G3549O9836i3584B00869a61668
16147A84527j7092o7866c3039j81441C57908j09666l0147c02376J23165H4029
16136B76770I5143Q8765G9373i5562A12614b9860C46983p9266j6815j5103a9786
16124B13514J7786b62950P9937H7978O6228F4609J39202a08073K2072b0199C34449
16112A16076J10527c07141D8751Q0137b01424C9621K11670J0125O8877c2062j7660
$$ y = [44796, 13856, 575027, 345603, 367997, 212345, 139656, 290301, 178064, 149371, 191172, 105888, 331872, 21593, -68039, 342064, 42912, 104345, -81331, 126207, 1046, -153829, 117771, -14047, 246829, -117469, 48162, 277593, 155168, -52288, 63687, -102124, -176108, -28349, -17940, -59175, -138649, -77143, 171067, -40965, -229580, 73549, 143385, -93584, 200869, -161668, 184527, 167435, 99569, -33039, -214480, 357908, 248242, 218095, -302376, -179211, 84029, 276770, 95143, 183908, 79373, -95562, 112614, -29860, 346983, 267717, 250902, 235799, -19786, 213514, 231300, -262950, -183013, 87978, 154206, 64609, 203811, -108073, -86001, -20199, 334449, 116076, 226603, -307141, 48751, 128888, -201424, 39621, 251291, 261416, 330293, -32062, -49722]
16101d9722a6581l0666D5399M33295A76362G561b17763A87548R4520G2183j3389
16090E8794a39381a2846l8262l13404J70989C03907b98978A67076F4392K63115
16080C27507j29257a0654H7478K48775A47258m8773O3476G2766i9486B71116A18920
16068B42605c6447j28733A46566b68793E2377P3685C4308a95421D3955K0493b7470
16056a32860D0810K09610c39517H3598a2395k8252b133j27105H2125c82246B21861
16044A53060n3973m2778a70019K1143k06790C7139Q5690d03569J72241H8024d4407
16032I3520a84457f209A5894b08470e7848C4002K4678a96255K5230A01753E0078
16020B49817c98811A02734R2978H5052c43295a10797A7358a8481k78260A38552
$$ y = [-49722, -16581, -47247, 45399, 478694, 176362, 7561, -217763, 187548, 282068, 72183, 58794, -139381, -12846, -51108, -364512, -193523, 303907, -298978, 167076, 64392, 327507, 198250, -10654, 87478, 336253, 147258, 98485, 161961, 72766, -99486, 271116, 118920, 242605, -36447, -165180, 146566, -268793, 52377, 126062, 34308, -195421, 43955, 64448, -27470, -132860, 40810, 250420, -339517, 83598, -12395, -40647, -2133, -129238, 82125, -382246, 221861, 153060, 99087, 56309, -170019, -148876, -355666, 37139, 122829, -403569, -231328, 88024, -44407, 93520, -184457, -6209, 15894, -208470, -57848, 34002, 58680, -196255, -171025, 101753, 50078, 249817, -398811, 102734, 195712, 85052, -343295, -110797, 17358, -18481, -296741, 138552]
16009a72506B56378h6187j29341A23305a94324R1147A18778K04937B4454e7252
15998C28710g7429G6405k6589c1098B23235f0482a7438p0413A16848l7974K40339
15987C19213J51807K93046N46329n5310l08739n7619J06291C19879j52532J63917
15977C31264H9106a23073f1345D1379f3000E7247N8454a72638C20828r1858G885
15965i3807d5814k05664C6715i5692k6231A49088Q3957m5791c3782j42482P640
15954a68624P6079j11106m4287A1068O0708J98130b36577a2476k1830A48410a0048
15942i7142j30808J06644A7081L2453c31039J62117B96486c8575A03235k1790
15932H1445B3985P5879a45058A38244h9436A3776J53917b10905k29241a26406
$$ y = [-172506, 256378, -86187, -215528, 123305, -194324, -103177, 118778, 323715, 24454, -57252, 328710, -77429, 76405, 49816, -31098, 223235, -60482, -17438, -87851, 116848, 78874, 319213, 471020, 764066, 1310395, 1255085, 946346, 888727, 995018, 319879, 167347, 331264, 89106, -123073, -61345, 41379, -63000, 57247, 115701, -172638, 320828, 228970, 7885, -93807, -45814, -251478, 36715, -95692, -121923, 149088, 233045, 187254, -33782, -176264, -168624, -92545, -203651, -247938, 11068, 71776, 269906, -236577, -12476, -34306, 148410, -10048, -97142, -227950, -121306, 17081, 49534, -331039, -168922, 296486, -38575, 103235, 81445, 23985, 99864, -145058, 138244, -89436, 13776, 167693, -210905, -440146, -126406]
15921d4048A70083f0711K6777j93831a12546N4346F3503Q427c22260c9129p866
15910d6995A65664a90043d5271A60614B8886Q21R5550K9009b40780h1212c0431
15898c41835A88580c17381B2542g7110B55055c95457d2752G2367L3281j1097f291
15886e0776B50558D9351j5052a14577F8962d116A2668l087P3004a33130F5345
15874b30905H7893b12384B9166J59418n5090e6858E6764J8062h3959b4559j32781
15863a57340n2455J02606I2551a72033g2651B87281c58297C66226A11344J51150
15853B62494k6746l1360C7280a94101j82090J83995E0841N0062c47882a20042
15842a69555o3166a01843H9579c37008a03411A14862i5249H9834M6930g3895j46253
$$ y = [-44048, 170083, -60711, -33934, -227765, -112546, -58200, 63503, 71930, -322260, -39129, -46995, 165664, -190043, -45271, 160614, 28886, 29707, 125257, 154266, -240780, -81212, -30431, -341835, 188580, -317381, 22542, -77110, 255055, -395457, -42752, 72367, 105648, 94551, -6291, -50776, 250558, 49351, 34299, -114577, 68962, -4116, 12668, 9581, 82585, -133130, 65345, -230905, 87893, -212384, 29166, 188584, 133494, -56858, 56764, 74826, -83959, -24559, -157340, -209795, -107189, 92551, -172033, -72651, 287281, -358297, 366226, 111344, 262494, 235748, 204388, 37280, -194101, -376191, -192196, 50841, 100903, -347882, -120042, -169555, -232721, -101843, 89579, -337008, -103411, 114862, -95249, 89834, 136764, -73895, -220148]
15831b20148B58518j22241c79929M5476F6204K7069b16473J00693j125B43080
15820E3302J2453h7959D3307a78383B64694A7440c90222p9881a43249D5693b69569
15808a50181C88028b45435J07358N1482k06522g2985A62101a40755B45839a26304
15797C36938r2534a47101q8160B57701N2249b22840B13672a19354A14763j6000
15787I8763D2189J53833O194E069L75538A70739B2696J3838i6366L4627n3874
15776a15613j24118A84936B0647P145J57852b07641O6772I9287m685i9260E9145
15764f0295C04467Q3668A0913f6881C67644i3917A50855b36738A89979H0643M7598
15753A28241h4091B90305j06521a7373k18785h9656C16907F3030a0453m7046C6324
$$ y = [-220148, 258518, 136277, -379929, -334453, 66204, 93273, -216473, -115780, -116905, 243080, 53302, 65755, -87959, 43307, -178383, 264694, 17440, -390222, -470103, -143249, 45693, -269569, -150181, 388028, -245435, -138077, -86595, -293117, -72985, 162101, -140755, 245839, -126304, 336938, 244404, -147101, -235261, 257701, 309950, -222840, 213672, -119354, 114763, 98763, 42189, 196022, 202216, 5069, 380607, 170739, 22696, 36534, -96366, -61739, -115613, -239731, 184936, 20647, 27792, 185644, -207641, -140869, 99287, 94602, -99260, 59145, -60295, 304467, 388135, 10913, -66881, 367644, -93917, 150855, -236738, 189979, 80643, 128241, -84091, 290305, 183784, -17373, -236158, -89656, 316907, 63030, -10453, -57499, 36324]
15741E3241L53410r2234C6849a29169B08624c9082A69836R1674H5433P649a88114
15729E8853c97186f1470k15724d3699r5109c8983H5593b47839p2581J29828A87070
15717a25241a6626m1394r3543M3847j47713J03867O435r9789J03209F4053i0290
15705H9358e6655B55507a02667K8671A12738b67515j04306h4051k78841D2534
15694C16370b00046c6539A2717a53733B24462c10375I9768g5789C38585h3590
15683a5347j91760k82020c8879j49965A0594a0352r0565B1380J23035e5320B26287
15671a12711I5355a29257j0090O7627r1509D06622d66570b02739a781j01699D4307
15659a03364a1552m37395b9354n32379f8019D4430O0800f1099H0638Q4392b0467
$$ y = [53241, 406651, 314417, 36849, -129169, 208624, -39082, 169836, 261510, 85433, 93082, -188114, 58853, -397186, -61470, -277194, -43699, -138808, -38983, 85593, -247839, -320420, -190592, 187070, -125241, -16626, -58020, -151563, -107716, -255429, -151562, -145127, -244916, -141707, 64053, -90290, 89358, -56655, 255507, -102667, -73996, 112738, -267515, -371821, -84051, -362892, 42534, 316370, -200046, -36539, 12717, -153733, 224462, -310375, 99768, -75789, 338585, -83590, -15347, -207107, -489127, -38879, -188844, 10594, -10352, -100917, 21380, 144415, -55320, 226287, -112711, 95355, -129257, -139347, -71720, -163229, 406622, -466570, -202739, -1781, -103480, 44307, -103364, -11552, -448947, -29354, -561733, -68019, 44430, 105230, -61099, 80638, 165030, -20467]
15647A41087D2865a9166q2749A48313c3277A27965L3245m3207g7398B78320D1025
15635f2557B62144A3639g2704j39602C8344a62683g5508j56617i26F1407P7321
15624A38728b82729O7117o4294H2471a8100j75473a2830F8549Q0592j0708b64606
15612I3906a03022j73719B4910O7599J9349M502a1406j75759P7891L2502j6210
15601i2982j4136k6198G5493J62796a03981n6017B86129j37178b61143D25030
15590A8869M6056A9115a3317G0785J18392a01651k00732a13126r6875E8023b21493
15578e1506J5837A78097j4897D4474k0067a47682m0501e4533A30877a60874q9012
15567b49886c9738m7432b9678k36499d5665A56314p6929b99394D0560L7924j800
$$ y = [141087, 42865, -19166, -101915, 148313, -33277, 127965, 161210, 118003, -77398, 278320, 41025, -62557, 262144, 13639, -72704, -212306, 38344, -162683, -75508, -232125, -926, 61407, 138728, -282729, -215612, -279906, 82471, -18100, -193573, -12830, 68549, 149141, 138433, -264606, 93906, -103022, -276741, 24910, 92509, 111858, 116360, -11406, -187165, -109274, -76772, -92982, -107118, -133316, 75493, 238289, -103981, -159998, 286129, 148951, -261143, 425030, 18869, 64925, 19115, -13317, 70785, 189177, -101651, -302383, -113126, -210001, 58023, -221493, -51506, -35669, 178097, 163200, 44474, 24407, -147682, -188183, -54533, 130877, -160874, -249886, -39738, -87170, -29678, -266177, -45665, 156314, 79385, -299394, 40560, 78484, 76684]
15556G6684J50485F6391b38017A74346b32469B5103b97781I9010a36607A31980
15545F7316a14285A18181a43418j23363B10863a7687C0503a49199n6670B03100
15534A7615E424b2533A30983b3516A14678a2071A54600c43530B96101i3173D4196
15522C33919a42424A84092G8546L6833g8090H2944J4130f7884I444b5289B79837
15510E6112j0979J72590f5121I7883J25769H7091P7535K6987m1357a13376F4244
15498C60777H2109d8269L029A38892Q5463l3192o7402b5222A69357a00496A32115
15486B45647F3326J39912K05145a86546D5277O283o005d7678A23777K22272j13691
15475B32358O2486P9338K97791p3845k84812L495j15016A2080h0385B97039B7395
$$ y = [76684, 227169, 66391, -238017, 174346, -232469, 25103, -297781, 99010, -136607, 131980, 67316, -114285, 118181, -143418, -266781, 210863, -17687, 30503, -149199, -205869, 203100, 17615, 5424, -22533, 130983, -23516, 114678, -12071, 154600, -343530, 296101, -93173, 44196, 333919, -142424, 184092, 78546, 115379, -78090, 82944, 97074, -67884, 9444, -25289, 279837, 56112, 45133, 217723, -65121, 97883, 223652, 87091, 164626, 191613, 150256, -113376, 64244, 360777, 82109, -48269, -45240, 138892, 224355, 191163, 123761, -25222, 169357, -100496, 132115, 245647, 63326, 203238, 408383, -186546, 45277, 51560, 45555, -47678, 123777, 346049, 232358, 294844, 374182, 671973, 598128, 313316, 316811, 201795, 12080, -80385, 297039, 27395]
15463E08604A90510a80770d8576B0091e2427C9412b45402A42521K4368a40194
15452g1643A16981J15967a54529j5012A47788a20168F4468J16937l2952j0479
15442A37974K07850O10987J47041J49956n40618p430h6612j04177H2076a09163
15431g8291A85064m6610a70261b055k715B83185F5463A3450K33330q6876b08407
15419a21187d0172k03999I9791L5482Q9709b55435G5021a17440C3446F83P20888
15408G21571B0004a3142j10399E866h8977o4818O2968G1054a40692J5674I5052
15396A51406h5332l43491d4751C3588d93527A97422D5709a22734C08001A06527
15385A9058p068O6614K47089A39196i2334j7330B2478A37a52469C3226L4548K21070
$$ y = [508604, 190510, -180770, -48576, 20091, -52427, 39412, -245402, 142521, 166889, -140194, -71643, 116981, 232948, -154529, -169541, 147788, -120168, 64468, 181405, 148453, 137974, 345824, 956811, 1103852, 1253808, 713190, 705760, -86612, -190789, 82076, -109163, -78291, 185064, 138454, -170261, -2055, -4770, 283185, 65463, 13450, 246780, 159904, -208407, -121187, -40172, -244171, 99791, 135273, 224982, -255435, 75021, -117440, 33446, 683, 721571, 20004, -13142, -123541, 5866, -88977, -153795, -90827, 71054, -140692, -125018, 95052, 151406, -85332, -428823, -44751, 33588, -493527, 197422, 45709, -122734, 308001, 106527, 19058, 11990, 78604, 325693, 139196, -92334, -109664, 22478, 137, -152469, 33226, 67774, 288844]
15373B88844j15023k0407A4423a97480H0889J07295h2986j82088C17303K7254
15363C44557K7833e5321A5755K04939l9495J51810c7344C93393o4198A30030b25298
15351C71101d6254B08547a56126a7164k39502B71264q0804R6365n8265P0308J82669
15340D81537A45780P5830j01733r565C1675J75422K33067o6200G9940J71727m7930
15329B03737P3797E5942b3884k8067a9495j6836A99975l1817L75700B49614l0395
15318B19219l6256a2173A32051B7069n110J03148a52820A62129b94007C21518
15307G0591J22971p8364a83520A61386Q6164a73097J3364n1070C09073a38023
15296a25716C33880a0720j0092C0380a56929J2678j95074M7640a25687F010P1085
$$ y = [288844, 173821, 153414, 14423, -197480, 80889, 188184, -82986, -265074, 317303, 344557, 372390, -55321, 15755, 220694, 181199, 333009, -37344, 393393, 329195, 130030, -225298, 371101, -46254, 208547, -156126, -17164, -256666, 271264, 190460, 286825, 228560, 298868, 481537, 145780, 221610, 119877, 110312, 31675, 207097, 440164, 373964, 79940, 251667, 203737, 277534, 55942, -23884, -51951, -19495, -36331, 199975, 168158, 543858, 249614, 219219, 182963, -12173, 132051, 27069, 21959, 125107, -152820, 162129, -294007, 321518, 70591, 193562, 115198, -183520, 161386, 247550, -173097, -159733, -210803, 309073, -138023, -125716, 333880, -10720, -20812, 30380, -156929, -144251, -339325, -291685, -125687, 6010, 77095]
15285G7095M5978c2662O260A06153a34486c2508A79786B8090O8739K54093c3178
15273H3210J01489G4426J83415N4757b25478B67183j04762j6747D8254j308J18509
15262A65455a79115A33546b9841C6206J0159P3117a62503j88188J60775A92467
15251b49890A96230j7338l8152n872a4070A62822J1187J80650m9725O00618R89533
15240A895085p38436K26325J447B85828J00096A44127B7136n621J81897M4863
15230B48275c7229A9384a10876o6933A64560G062L1222K51583N2710A32088E0421
15218A22034K75162e8981m29420B57095h0177A94320H0657b02066k30274a33559
15207C748K98323a38182O2863C23850I7149b6964j59168f5558i610A75263h9999
$$ y = [77095, 123073, -32662, -26402, 106153, -134486, -32508, 179786, 28090, 96829, 350922, -33178, 83210, 184699, 74426, 257841, 312598, -225478, 267183, 162421, 145674, 48254, 46946, 165455, -179115, 133546, -29841, 36206, 46365, 119482, -162503, -350691, -189916, 192467, -249890, 196230, 178892, 140740, 134868, -14070, 162822, 174009, 354659, 304934, 905552, 1895085, 1156649, 1382974, 1384421, 285828, 385924, 144127, 27136, 21515, 203412, 248275, -37229, 19384, -110876, -177809, 164560, 7062, 38284, 289867, 342577, 132088, 50421, 122034, 397196, -58981, -488401, 257095, -80177, 194320, 80657, -202066, -432340, -133559, 3748, 302071, -138182, -75319, 323850, 97149, -26964, -186132, -65558, -9610, 175263, -89999]
15195a07896C9415g7242F0312J79589l3521F0068B7460K2861J30438C2915O5884
15184I8799J50683D6447b34896i43m7021k87592B23096A05598J4730B7340K3442
15173E0782A5197d0073D00516b50227A92615P1297a51729J3288k27337B91359
15162A19088a25816J6224B39510a27801A587K43230k5820j08932E1274M6895M3643
15151A41812g1707a1650j69106B00305A8053K71122g4899A57670P6006A1078b93012
15139A10623l228D7624J87405a43658m7630A99152a55355J8794A13105l0346b00188
15127A68076B9435i9975B44215e3982C65547F5160a3247B10039J50831r4714J50855
15116D17011J3761r2772A19640n3627K11167e7628C58939J5711b55177E7756J44564
$$ y = [-107896, 39415, -77242, 60312, 239901, 206380, 60068, 27460, 50321, 180759, 32915, 98799, 249482, 46447, -234896, -943, -47964, -335556, 223096, 105598, 120328, 27340, 50782, 15197, -40073, 400516, -250227, 192615, 263912, -151729, -138441, -365778, 291359, 119088, -125816, -109592, 239510, -127801, 1587, 244817, 218997, 110065, 51274, 98169, 141812, -71707, -11650, -180756, 200305, 18053, 289175, -74899, 157670, 233676, 11078, -293012, 110623, 107395, 47624, 235029, -143658, -191288, 199152, -155355, -136561, 113105, 82759, -200188, 168076, 29435, -99975, 244215, -53982, 365547, 65160, -13247, 210039, 360870, 266156, 417011, 430772, 338000, 119640, 66013, 277180, -57628, 358939, 374650, -255177, 57756, 202320]
15105B02320J9665J32621j70422d16062h0330A93243E9314O9369f1797D5724J52827
15094A98551f4918B02611q435g3767A78374O8205b571G2596J30605o2144L046
15083A44103N4559b5412A87125C5039K01385k0898q2190E5146k0348b38035A71882
15071C41216m0241j08431K39559j71722H7024b77285J03783C48865A70397f3515
15060a47398L9655B01462K49871j49957q5231p6429J1083F0870j7783R5172J14840
15049B53099K09121P8679G8591J99531P3581m1344F196a3490D23544j5285j56295
15038B51964K25122j61077o3840j04702M63225p5792m9763j3017K4388q6256A04641
15026F85849B06148J10218a2256D11766G294M53615P0883j71150A00695L92267
$$ y = [202320, 221985, 354606, 184184, -416062, -80330, 193243, 59314, 128683, -61797, 45724, 198551, -64918, 202611, 194176, -73767, 178374, 246579, -2571, 72596, 203201, 141057, 144103, 198662, -25412, 187125, 35039, 236424, 215526, 133336, 55146, 34798, -238035, 171882, 341216, 300975, 192544, 432103, 260381, 87024, -277285, -173502, 348865, 170397, -63515, -147398, -107743, 201462, 451333, 301376, 216145, 139716, 150799, 60870, 43087, 138259, 253099, 462220, 540899, 78591, 278122, 351703, 310359, 6196, -13490, 423544, 408259, 251964, 477086, 316009, 252169, 147467, 610692, 534900, 485137, 472120, 496508, 410252, 104641, 685849, 206148, 316366, -12256, 411766, 7294, 460909, 531792, 360642, 100695, 492962]
15016D92962D4110J82295N5564A09421L33378J10793j36072n9911J20823j34470
15006C43962J41621A89793K37486E4233N55691p2662m1541k05693K41957L17944
14996H49929B46090l1538P5740N7356A10552K91845R9845k29127j14747J88996
14986C47364Q2563B08026M12696j43846M79619J22912l24814k98999J1376A50641
14975A50012e6253C57238J36070j93596K49619j24889P445j31985o5529E0849
14964I5624J03006J76592J20998A19157M94355B30936R7394K06987B16579Q9642
14954C06221J96490j06704A51128J51932C3706P1540k7782L54302B04904K51809
14944D56713o1375o051J46606k36933J41735j50788k9432L38087k95788J19037
$$ y = [492962, 44110, 226405, 281969, 109421, 442799, 553592, 417520, 357609, 478432, 343962, 485583, 189793, 427279, 54233, 609924, 537262, 495721, 290028, 531985, 849929, 246090, 214552, 290292, 347648, 110552, 402397, 502242, 273115, 158368, 347364, 429927, 208026, 620722, 476876, 956495, 1079407, 754593, 455594, 466970, 150641, 150012, -56253, 357238, 493308, 299712, 549331, 424442, 431887, 299902, 234373, 50849, 95624, 198630, 375222, 496220, 119157, 613512, 230936, 328330, 535317, 216579, 306221, 502711, 396007, 151128, 303060, 33706, 105246, 77464, 431766, 204904, 456713, 395338, 389287, 535893, 298960, 440695, 289907, 260475, 598562, 302774, 421811]
14934D21811q4861K30709k78336Q6333N72374j54551J39117P5435R6651m5366
14924A059316K40684J74906k87375L45846m05516J95477M35343N6748L36168L6927
14914B188524n84113k27692k27418j9392E58877q6450P8516j72163Q622H7346
14903D98244l6480a91305B85221K2904K03776H6405K2347K88063j66590Q0862
14893C11087a5169B17719L033N78542k65606k13176P9544N29358C00719O24365
14883I25084j63344K68431q5572r1906o8303J23323k30156J63825k91254A56754
14872C02151A15092J49177r4251J26789k7463K37003j24976K31048k48664P5205
14862D38960J12063J1315k74752R6187k7640N8473A76482O8312K42744k14212
$$ y = [421811, 336950, 567659, 289323, 375656, 948030, 793479, 932596, 1008031, 1104682, 1059316, 1300000, 1474906, 1187531, 1533377, 1127861, 1323338, 1758681, 1815429, 2151597, 2188524, 1604411, 1376719, 1149301, 1129909, 558877, 472427, 550943, 378780, 387402, 87346, 498244, 461764, -191305, 285221, 308125, 511901, 86405, 108752, 396815, 230225, 311087, -15169, 217719, 220752, 799294, 533688, 320512, 400056, 929414, 300719, 925084, 761740, 1030171, 944599, 852693, 784390, 907713, 677557, 841382, 550128, 156754, 302151, 115092, 264269, 170018, 296807, 269344, 506347, 381371, 612419, 363755, 438960, 551023, 562338, 287586, 383773, 356133, 414606, 176482, 244794, 487538, 273326]
14852B73326M62082A32318L7733J20143M45444A09951L82020l0192M95690J43333
14842A100802k94869m7465o7131M39011j35499j70395j53030m9693R3303k79169
14832D35865M8179j27572J05471K70489J2059n2452j20842J10124l34266J87880
14822E34935A92696J57711K51160L866j07140J30556J40490n0537j35281j35238
14812D48283K98348l12972K58480j82754Q1384k18530L51471K02282k14022K03932
14802I15902m3125k46661k02314R3805B09973r0486J57605o3664K52357L21046
14792G86831C01167O422O2010M2138E9566K13391L44516P4759j02434k25862L09697
14781F73633A15228M44110M6971J58869j01346Q9213J51185j84816M6661j12044
$$ y = [273326, 735408, 132318, 170051, 290194, 735638, 109951, 491971, 461779, 957469, 1100802, 805933, 758468, 691337, 1130348, 994849, 824454, 671424, 621731, 715034, 435865, 484044, 356472, 461943, 732432, 744491, 692039, 571197, 681321, 347055, 534935, 192696, 350407, 601567, 605433, 498293, 628849, 769339, 718802, 583521, 448283, 746631, 433659, 692139, 509385, 590769, 372239, 723710, 925992, 711970, 915902, 872777, 626116, 423802, 517607, 209973, 119487, 277092, 213428, 465785, 786831, 301167, 307589, 369599, 411737, 59566, 272957, 617473, 692232, 589798, 363936, 673633, 115228, 559338, 606309, 765178, 663832, 753045, 904230, 719414, 766075, 654031]
14771F54031P4458k78866K17075j19385j43454j3977K91266l632r3214k63911
14761C20391K54322j96297N7531M5003k0755J75543r2467J64825k51886j36726
14751C19484L99158k43873l0026J54962J09962l19901K66587l15097K6514J74812
14741E42582A73039L63533Q5499B85665J32508K65889R7120L1489K34288n14146
14731E32813P63010k90669q7618O31598P442J28136M7400m27721n01592L745K96515
14720A103059j78111j85321q4673K87145l82406O8753J69766l01571M13616k00052
14710G10205j16296j74899P90480m67186k0139K07216L93684k74132M79574j18260
14700A410247L80449k78639m56729N643E30049Q9042P233J85517l28938J37271
$$ y = [654031, 728489, 449623, 666698, 547313, 403859, 389882, 681148, 677516, 584302, 320391, 574713, 378416, 435947, 480950, 460195, 635738, 543271, 708096, 456210, 319484, 718642, 474769, 444743, 599705, 709667, 389766, 656353, 341256, 367770, 542582, 173039, 536572, 622071, 285665, 418173, 684062, 781182, 812671, 1046959, 532813, 1295823, 1005154, 917536, 1549134, 1556576, 1684712, 1732112, 1304391, 802799, 806544, 1103059, 924948, 739627, 654954, 942099, 559693, 628446, 798212, 496641, 910257, 710205, 593909, 419010, 1209490, 742304, 722165, 929381, 1323065, 1048933, 1528507, 1410247, 1790696, 1512057, 1055328, 1060971, 530049, 619091, 626324, 811841, 482903, 620174]
14690F20174k75751L30352r8722N1369M14544D77494j9451L65995l44776N45410
14680A024672j08423j79485r5509K51187P2519l05619k8497L32764k61059j88329
14670E14221L80908J79645m80708J31082L1349K6823K86806n16940J05982C26918
14659F53660j73996O35794j68409l4373k66588N23000J07878j56053l0675l08733
14649G81505K37197K69250n28000K93194k38053J51288j82364O54274k66079j75462
14639I96750q1768L22273k78621l89349L06759J80436Q5697l55221J14761J15241
14629A016958N0962k10320J11358j33475K90353j61308J39086J57144k47397q0064
14619I33297K40615j81288K2411j69223K02686j30791L09959n17663L66881k20679
$$ y = [620174, 344423, 674775, 576053, 627422, 1041966, 477494, 458043, 824038, 479262, 1024672, 916249, 736764, 641255, 892442, 964961, 659342, 630845, 963609, 702550, 514221, 895129, 1074774, 594066, 725148, 756497, 783320, 1070126, 553186, 659168, 326918, 653660, 479664, 1115458, 947049, 912676, 646088, 1169088, 1276966, 1120913, 1090238, 781505, 1018702, 1287952, 759952, 1053146, 815093, 966381, 784017, 1438291, 1172212, 996750, 914982, 1237255, 958634, 569285, 876044, 1056480, 1142177, 786956, 901717, 1016958, 1067920, 857600, 968958, 835483, 1125836, 964528, 1103614, 1260758, 1013361, 933297, 1173912, 992624, 1015035, 845812, 1048498, 917707, 1227666, 710003, 1076884, 856205]
14609H56205L90097K20715O8907l03397m6472N7302l21241N73234k57301J28413
14599A366462J37858k9474K1336k17362l58200K63898j54406L82278m15046J41336
14589A138680J6314L38156J97174l53363J16550J45700J05169j72914n8612J19771
14579A592625K2858p2221l57027Q7656K36337p7676R7482J54542J39922r2981
14569A731517k63751J15213K55281j4368L34495k70577J29109n64109O10840j39278
14559A924372j8203q249K57045j35110J77314M34578P3565L09847p9121J136935
14549D072973J378791L469653Q235943J8294816J0366868A7678089E835725k421084
14541C414641j219783k09127j1911J031805J572654j882427m83899p49359K04505
$$ y = [856205, 1246302, 1467017, 1535924, 1232527, 1186055, 1243357, 922116, 1495350, 1238049, 1366462, 1504320, 1474846, 1496182, 1278820, 920620, 1184518, 1030112, 1412390, 997344, 1138680, 1154994, 1493150, 1690324, 1336961, 1453511, 1599211, 1704380, 1531466, 1472854, 1592625, 1615483, 1543262, 1186235, 1273891, 1510228, 1432552, 1530034, 1684576, 1824498, 1731517, 1467766, 1582979, 1838260, 1823892, 2158387, 1887810, 2016919, 1452810, 2063650, 1924372, 1906169, 1897920, 2154965, 2019855, 2197169, 2631747, 2705312, 3015159, 2936038, 4072973, 5451764, 8921417, 17157360, 35452176, 45819044, 17678089, 5835725, 3414641, 2194858, 1985731, 1973820, 3005625, 4578279, 2695852, 2211953, 1462594, 1667099]
14532A667099Q3112n4122k09163O8996K54560N4527O8253j89860M21420m75000
14522A689822K96722J29209j46528J29943k69159K69931j89566M39954k37079
14513B113249j92507M57668j93117j94235N17609k97493o8424N9953J57837L91217
14503B751757n20031L03806l90550L51605P4684k11361N50861m22347j8154L66343
14493B836613k38667n1036L73284j42714j14282p4766O6319K80074q9124j66253
14483B679448M55636L779j5359j4713J07630j1941K19805k08256k26646J63399
14473C152782J88267J98870m10151N61802l86011K83165J37316m28958K48677
14464C545759k05043K99790J29123J34531q417J63287q0516J4643J97124J17017
$$ y = [1667099, 1750211, 1696089, 1486926, 1555922, 1810482, 1865009, 1933262, 1743402, 2164822, 1689822, 1986544, 2115753, 1969225, 2099168, 1830009, 2099940, 1910374, 2350328, 2113249, 1920742, 2378410, 2185293, 1991058, 2508667, 2211174, 2142750, 2202703, 2360540, 2751757, 2231726, 2535532, 2144982, 2496587, 2571271, 2359910, 2910771, 2488424, 2470270, 2836613, 2597946, 2546910, 2920194, 2777480, 2663198, 2588432, 2654751, 2934825, 2845701, 2679448, 3135084, 3138863, 3123504, 3108791, 3216421, 3204480, 3424285, 3216029, 2989383, 3152782, 3341049, 3539919, 3129768, 3691570, 3305559, 3588724, 3726040, 3297082, 3545759, 3340716, 3640506, 3769629, 3904160, 3895743, 4059030, 3978514, 3993157, 4190281, 4307298]
14454D307298P45k4939K34441j70079o1455L81616k46371R2164j00505L13003
14444D725918J015j23293L69749p578l84126N47535J71799k48668J88597k39985
14434E000963K61617J31538Q5446L36809j59648l04802K07417J15272o6278L57889
14424E966223L50614j52457Q8644n60O71616l9736K20892k22520J27297L51424
14414G361437l42275J15798k23518K24343K06293J23458N6471K71112o1978J63878
14404G895019P82287j49271k00174J89776p1184J93856p5547K40689L18484q7212
14394I036723L98760J55908R5982K71277j65287O3382J89135K62393M18520M75857
14384A1202650J07935J23925J02323N69274K04218j61573J98679J62237q492P20129
$$ y = [4307298, 4308043, 4283104, 4517545, 4347466, 4286011, 4667627, 4421256, 4513420, 4412915, 4725918, 4726933, 4603640, 4973389, 4965811, 4581685, 5129220, 5301019, 5052351, 5240948, 5000963, 5262580, 5394118, 5479564, 5816373, 5656725, 5351923, 5559340, 5674612, 5608334, 5966223, 6316837, 6164380, 6253024, 6252464, 6924080, 6884344, 7105236, 6882716, 7010013, 7361437, 7019162, 7134960, 6911442, 7135785, 7342078, 7465536, 7522007, 7793119, 7731141, 7895019, 8677306, 8528035, 8327861, 8517637, 8446453, 8640309, 8564762, 8805451, 9123935, 9036723, 9435483, 9591391, 9687373, 9958650, 9793363, 9856745, 10045880, 10308273, 10726793, 11202650, 11310585, 11434510, 11536833, 12106107, 12310325, 12148752, 12347431, 12509668, 12501176, 13221305]
14374A3221305K67135J16902J31216P20394j12790K64718L83291M88175p9220
14365A5401126Q89649J88184K55837J03818j7380N48045M72764M59082J32162
14356A8433287O52147L12635P07602O23428M28806L22955P61398N86042N48606
14347B3376906N43880O52932P81746O86017O01308M99235N79781J140158P70970
14338B9632933P75060O54738R49765Q89158J112984R65608J362274Q89485J330767
14329C8562772J218306J363349J371228J400943J509681J489194J337029J792551
14321E0045053J821953K168043J990889K404269K014315K263012K124247K603802
14313F7435583K660622L226775L037137K658779M113300L232456M199514M277424
$$ y = [13221305, 13488440, 13605342, 13736558, 14456952, 14344162, 14608880, 14992171, 15480346, 15401126, 16290775, 16478959, 16734796, 16838614, 16821234, 17369279, 17842043, 18301125, 18433287, 19085434, 19398069, 20105671, 20729099, 21157905, 21480860, 22242258, 22828300, 23376906, 23920786, 24573718, 25355464, 26041481, 26642789, 27142024, 27721805, 28861963, 29632933, 30407993, 31062731, 32012496, 32901654, 34014638, 34980246, 36342520, 37232005, 38562772, 39781078, 41144427, 42515655, 43916598, 45426279, 46915473, 48252502, 50045053, 51867006, 54035049, 56025938, 58430207, 60444522, 62707534, 64831781, 67435583, 70096205, 73322980, 76360117, 79018896, 83132196, 86364652, 90564166, 94841590]
14305I4841590M136816M504547N301846N377194N498916O463520O305265O953596
14297A39383290P116673Q082793Q219299R068933R718434R717332J1048108J1504075
14289B13858937J2042456J2870709J3286816J4509049J4413194J5036741J5819663
14282C11837565J5977720J6047535J5966986J5584630J5090610J3911100J2673202
14275D17089348J0914113Q305227M886397k50419j907974k616564j447126l056879
14267D31916123n059727r484844j0826731j1660116j3198300j4872607j5741774
14260C51072024j6234719j6006028j5626635j5818552j4603306j4769352j3460470
14253B44552962j3291022j2219773j1880344j1242480j0262680q686820q461650
$$ y = [94841590, 98978406, 103482953, 108784799, 114161993, 119660909, 126124429, 132429694, 139383290, 146499963, 154582756, 162802055, 171870988, 181589422, 191306754, 202354862, 213858937, 225901393, 238772102, 252058918, 266567967, 280981161, 296017902, 311837565, 327815285, 343862820, 359829806, 375414436, 390505046, 404416146, 417089348, 428003461, 436308688, 441195085, 440944666, 439036692, 436420128, 434973002, 431916123, 426856396, 417371552, 406544821, 394884705, 381686405, 366813798, 351072024, 334837305, 318831277, 303204642, 287386090, 272782784, 258013432, 244552962, 231261940, 219042167, 207161823, 195919343, 185656663, 176969843, 168508193]
14246A68508193r391996q305913p428835o606567o905076o276452n912004n496658
14238A12184692m831979m846816m734542m385173m272748l821754l480216k778404
14230G9033060l292898l211782k516477l253185k551208k192102k112891k587323
14222E7315194j819192k022831j687157j661268j689449j567737j830489j206709
14214D3830362j358886j257986j173889j580793r91833j358569q28662r5650j227112
14205C3956982j744470l75008j195118q56343n56932l15211r19065j252353p25770
14196B6016712o47179o37796j59725n68779p13548o20877q77423m55961l54521
14187B0980903o02893l06565r57990P0m48593m73179o73858J10120o65292o3321
$$ y = [168508193, 159116197, 150810284, 143381449, 136774882, 129869806, 123593354, 117681350, 112184692, 107352713, 102505897, 97771355, 93386182, 89113434, 85291680, 81811464, 79033060, 75740162, 72528380, 70011903, 66758718, 64207510, 62015408, 59902517, 57315194, 55496002, 53473171, 51786014, 50124746, 48435297, 46867560, 45037071, 43830362, 42471476, 41213490, 40039601, 38458808, 37466975, 36108406, 35279744, 35184094, 33956982, 32212512, 31837504, 30642386, 29786043, 29229111, 28913900, 27994835, 26742482, 26016712, 25369533, 24731737, 24572012, 24003233, 23289685, 22668808, 21791385, 21335424, 20980903, 20378010, 20071445, 19113455, 19113525, 18664932, 18191753, 17517895, 17628015, 16962723, 16899402]
14177A6899402n39868J07362q33329k64871k39278m89432j24873o6599l73665
14168A4074849n34845M42840p80099l78973P6940m80845j10750p1523k98521l23593
14158A1615480k56551k83680l52234K35521k00503n4546k28872l74196l35578
14149I764841L00436l2761q43988L75689m71805m1335P8602l31770J48314l34298
14139H611925k57549m36903J03727K32238l52953o1181l66397J76101j57775J30750
14129G621983l33781j54162l93817j5351L6317K57619k92119j44901j79034q5410
14119F317344k14793P0182J40879k83012n04222L16151J64265j8462q4988k91470
14109E611874O0156j69309j03727n8320L15770k87807k7768j50837K19321k98167
$$ y = [16899402, 16359534, 16466896, 15633567, 15368696, 15129418, 14639986, 14515113, 14448514, 14074849, 13540004, 13982844, 13202745, 12823772, 12900712, 12419867, 12309117, 12237594, 11939073, 11615480, 11358929, 11075249, 10723015, 10958536, 10758033, 10703487, 10474615, 10100419, 9764841, 10065277, 10032516, 9188528, 9564217, 9092412, 9051077, 9129679, 8797909, 8946223, 8611925, 8354376, 7917473, 8021200, 8253438, 7900485, 7839304, 7472907, 7649008, 7491233, 7621983, 7288202, 7134040, 6740223, 6724872, 6761189, 7018808, 6726689, 6581788, 6402754, 6317344, 6102551, 6172733, 6313612, 6030600, 5526378, 5842529, 6006794, 5988332, 5903344, 5611874, 5672030, 5502721, 5398994, 5340674, 5656444, 5368637, 5340869, 5190032, 5409353, 5111186]
14099E111186k30822j51746k44060M82562k23663o1521r6436k00340j30896r3332
14089D160932L14322j04324J25593k81554j05532k3790j4815n5782r6047Q7178
14079D006181M5260J89673m95278J242n2402J61908O5117m52730P4863j0034j69761
14068C364039K72435m01202r0851L51398k74602l585J02673J86163j80753o3179
14058C262536M795q611o2141L902J42342k78925L51363l60316J07500K46722n59782
14047B849385J28007k72605L68081j74252j97748K91299m55033K85053k05370
14038B616817k32473J71843j7417k8370k18309K10843J76863Q1081j70482j91755
14028B398641K90535j13324j62367l99801M81498l7832K8255l71400m0144J77238
$$ y = [5111186, 4880364, 4728618, 4484558, 4967120, 4743457, 4681936, 4585500, 4385160, 4254264, 4160932, 4475254, 4370930, 4496523, 4214969, 4109437, 4085647, 4070832, 4015050, 3919003, 4006181, 4051441, 4241114, 3745836, 3747078, 3694676, 3856584, 3921701, 3468971, 3543834, 3533800, 3364039, 3636474, 3235272, 3144421, 3495819, 3221217, 3217632, 3320305, 3506468, 3325715, 3262536, 3267331, 3258720, 3196579, 3200481, 3342823, 3063898, 3415261, 3054945, 3162445, 3409167, 2849385, 2977392, 2704787, 3072868, 2898616, 2700868, 2992167, 2537134, 2822187, 2616817, 2384344, 2556187, 2538770, 2510400, 2292091, 2502934, 2679797, 2760878, 2590396, 2398641, 2689176, 2575852, 2413485, 2013684, 2495182, 2457350, 2485605, 2114205, 2074061, 2251299]
14018B251299J12561k01856R792l54245K24958J7862J89834j66975j03834K18203
14008B197599j57650l34769L58603j93513J4899k41292J34632k06387K8607j30827
13998A469902K91200l74463K13413K8263J8641l45151Q8233K11960M2066Q22505
13988B466569K010919N912926J6203629K2207745k3626272A0944013m250601j614789
13980E078623j206046p78905L50791o49183j34974o3803l99989R9485k53328L9882
13970B082553O320q1494J98940p8920o6140K0982m67738L33382k35275J41642
13960A854252n6101r1827J3433J66127l6589P5202j71027l09174O6525m6359K66850
13949A731312k46075K15962M3399j92514J53382j69474j87774K50247j22724j40340
$$ y = [2251299, 2363860, 2162004, 2171796, 1817551, 2042509, 2060371, 2250205, 2083230, 1979396, 2197599, 2039949, 1705180, 2063783, 1870270, 1885169, 1643877, 1778509, 1572122, 1600729, 1469902, 1761102, 1386639, 1600052, 1628315, 1646956, 1301805, 1390038, 1601998, 1644064, 2466569, 4477488, 10390414, 26594043, 48801788, 25175516, 10944013, 6693412, 5078623, 3872577, 3093672, 3444463, 2795280, 2660306, 2596503, 2196514, 2295999, 2042671, 2082553, 2088873, 2007379, 2206319, 2127399, 2061259, 2082241, 1614503, 1947885, 1712610, 1854252, 1798151, 1706324, 1719757, 1885884, 1849295, 1924497, 1753470, 1444296, 1510821, 1464462, 1731312, 1485237, 1701199, 1744598, 1552084, 1705466, 1535992, 1348218, 1598465, 1475741, 1335401]
13939A335401k99151L12485L1634J49311l25l56326L03469n15600L81474J51190
13929A493562l48545J8783M3525M23386o23570N77503j89202j42818L24018n17249
13919A059393L20055m7289j3799O1985K46766m92293L17527k76598j41940L06377
13909A340184m46645O6488K42885k25082K85974j05705Q9081J9446l6561j70962
13899A059103R3674j54339J55454K46333m46076J14763j36555K38022O1943k50638
13889I81684j1583L071k4525J53464l47027M50570K8512j91129R637j59653j79969
13878G13052N05922j80456l87101N15789l03901J32374j06778n6787K37769k56696
13868H13187K25775k23225p2983j3646J43404J02907K85575m59455r939q7274
$$ y = [1335401, 1036250, 1348735, 1380369, 1529680, 1529355, 1173029, 1476498, 960898, 1342372, 1493562, 1145017, 1163800, 1207325, 1630711, 1007141, 1584644, 1395442, 1252624, 1576642, 1059393, 1379448, 1332159, 1318360, 1380345, 1627111, 1134818, 1452345, 1175747, 1033807, 1340184, 893539, 960027, 1202912, 977830, 1263804, 1158099, 1247180, 1266626, 1230065, 1059103, 1152777, 998438, 1153892, 1400225, 954149, 1068912, 932357, 1170379, 1232322, 981684, 970101, 973172, 948647, 1102111, 755084, 1205654, 1234166, 1043037, 1052674, 893021, 713052, 1218974, 1038518, 651417, 1167206, 863305, 995679, 888901, 832114, 1069883, 813187, 1038962, 815737, 742754, 729108, 872512, 975419, 1260994, 801539, 791600, 704326]
13858G04326K44968k3607j69564L33933r3888j40434P2424J2304J80798k10384
13848I10876K21340J12532l59263K7407N6278j70042p4588L98082l93748r6010
13838F32864k79307J77247N3351M70818l21347p6658O4537q618p3433P663J21954
13827G69071j09883N9506O361k9931j99999p7463J41769J22513J47492B72867
13816D70314j94535M05943Q809p6079J99408J0676l4184l08339J67655J40787
13806G90455o9792j80463K30784j55587n1071k19L34867j96824A42924L53742
13796D96666L29322N5232k01545p709r9729J41669l0157j33439M483n0121n5358
13785D49314J40932l2240N09781D52699M13532C95551L30079j09671F4657L95506
$$ y = [704326, 949294, 925687, 756123, 1090056, 996168, 855734, 928158, 940462, 1121260, 910876, 1132216, 1244748, 885485, 912892, 969170, 799128, 724540, 1122622, 728874, 632864, 353557, 530804, 584155, 1054973, 733626, 656968, 721505, 712887, 639454, 647117, 769071, 659188, 718694, 725055, 695124, 495125, 417662, 559431, 681944, 829436, 272867, 470314, 275779, 681722, 690531, 614452, 813860, 824536, 790352, 482013, 649668, 790455, 720663, 540200, 770984, 615397, 564326, 564107, 898974, 702150, 142924, 496666, 825988, 881220, 679675, 671966, 572237, 713906, 683749, 550310, 554793, 504672, 449314, 590246, 558006, 1067787, 452699, 866231, 395551, 725630, 615959, 64657, 460163]
13775D60163j50210K0414J08958L1021K593j56476J30077L54716l71988N0497
13765D79765j58279K00642K09766l22701L94725j31960k8538j08092K0991J53164
13755G09483k48328L62130B67327L42915J69189C46434K98208j19625P8775A45242
13744F72710m4264j5623j14671J96947B00491K55503k07293N22365k26663M9840
13734E94243p7911n5226J32661n8690k8421k2681J87377J45240C82467L00455
13724F82922l20332J49748k5807q5858N6389J21610J31622k0843k0057j50630
13714E18764k020B22857J34613M68428C84388m343R3351B23266M00623O9474B36468
13702D50779j16363I9420K65910R2859N6217A5475M19113K09938k02977M4042
$$ y = [460163, 309953, 330367, 439325, 470346, 472939, 316463, 446540, 801256, 429268, 479765, 321486, 522128, 731894, 409193, 803918, 671958, 643420, 535328, 556319, 709483, 461155, 823285, 267327, 610242, 779431, 346434, 644642, 525017, 603792, 145242, 672710, 628446, 612823, 498152, 695099, 200491, 455994, 248701, 771066, 544403, 594243, 516332, 461106, 593767, 535077, 506656, 483975, 671352, 816592, 382467, 682922, 362590, 512338, 486531, 400673, 457062, 578672, 710294, 689451, 669394, 518764, 516744, 222857, 357470, 825898, 384388, 380045, 473396, 223266, 623889, 693363, 236468, 450779, 334416, 99420, 365330, 458189, 514406, 15475, 434588, 644526, 441549, 485591]
13692D85591k09105J14249J00678j70433J04088j21187r9035L56082r3852J06463
13682E73539q3835j38332K41278r2634p2401J21051Q4573A35251J92788j10203
13672B17836b23942E85255A76762L89813A56002L36781k0881O7424j65751j66531
13662B07044K47192k24334K22875j10905j23468P1095M50531B58858m0289K72657
13652D91226j35559m8352l2J23738A54432K12519J66824j79181K58421k22721
13642C90294J40637l4673K02814k33763k22455K49654k03331E2112L31103J24723
13632E07938E9941R1179o2425L04654A65589K9037j91K46938j37001M7031j24910
13621B26493M212d3197G9646L91286j94205q0587J96257A79451J82657J4157J00098
$$ y = [485591, 276486, 390735, 491413, 320980, 425068, 303881, 204846, 560928, 467076, 573539, 489704, 351372, 592650, 500016, 427615, 548666, 633239, 135251, 328039, 217836, -223942, 585255, 176762, 566575, 156002, 492783, 471902, 539326, 373575, 207044, 454236, 229902, 452777, 341872, 218404, 289499, 740030, 258858, 218569, 491226, 355667, 307315, 307283, 431021, 154432, 366951, 533775, 354594, 613015, 390294, 530931, 496258, 699072, 465309, 242854, 492508, 289177, 52112, 383215, 507938, 59941, 151120, 88695, 393349, 165589, 194626, 194435, 441373, 304372, 351403, 226493, 230705, -43197, 79646, 470932, 276727, 196140, 392397, 179451, 362108, 376265, 476363]
13610D76363o9249r455j9228A22441K14307A24651k270R9001a1313C47097J2164
13599C59261j16593m2217I6048Q0251K3227l9080N0263q5694K29901K20516H0320
13587B6311J91572C9909K50574K9321j05689q4256J96129k9701K62468J32912
13577F91667B76027K56888E0857K45434A21470j9162l6916a572H9777L62632B19110
13565D37504J60526k88726K00922j53248j45419F6832J12246l8150B8320K28437
13555B56757j8952k360b4937A08013J00759R4334r1295O0497L6258J03779n8568
13544C53777A72368K42509L3377A56860k8415J86489l1477I1069K19217A40571
13533C86752n1591q25c506C39694A00641j1524d6207I4903P5464H1942K58201
$$ y = [476363, 407114, 397659, 378431, 122441, 336748, 124651, 122381, 221382, -11313, 347097, 359261, 242668, 200451, 96048, 176299, 199526, 160446, 210709, 125015, 354916, 575432, 80320, 26311, 217883, 39909, 290483, 319804, 214115, 129859, 325988, 296287, 558755, 691667, 276027, 532915, 50857, 296291, 121470, 102308, 65392, -1572, 89777, 452409, 219110, 437504, 598030, 309304, 510226, 356978, 211559, 66832, 179078, 140928, 28320, 256757, 237805, 235445, -24937, 108013, 208772, 303106, 211811, 272308, 308566, 412345, 353777, 172368, 414877, 448254, 156860, 128445, 314934, 283457, 91069, 310286, 140571, 386752, 335161, 334336, -3506, 339694, 100641, 89117, -46207, 94903, 170367, 81942, 340143]
13522C40143Q0669b1792C56622A60747b5924B26857A11781L5589J67658j06944
13512B08084r5453J54958G4983J82156b4743A08696O8483l2278o1241O2578J23860
13501B70098q378J46483j98967m8889D824J58480K41751j46760e944B05308a92556
13489b06901q4C47035N530A10743J11449q8657C3268o866a98785C22527g1376
13477E60103A15847M3191P5858o6045l757J14367m7260O6230A11348M0826l4380
13466A17794L8972E9370M8372J76904j23178m7294L5566m047K53600A6794K02342
13455B19136c7386B09022D8346C674J63355K60219A08588l63K09765D3031J2891
13444E5922L2204J08215a76263B05406D9251J05587J16480j23193g6743C55413
$$ y = [340143, 420812, -21792, 356622, 160747, -25924, 226857, 111781, 147370, 315028, 208084, 112631, 267589, 74983, 257139, -24743, 108696, 177179, 144901, 83660, 146238, 270098, 261720, 408203, 209236, 160347, 4824, 163304, 405055, 258295, -5944, 205308, -192556, -206901, -206985, 347035, 352565, 110743, 222192, 133535, 33268, 26402, -198785, 322527, -71376, 560103, 115847, 159038, 234896, 168851, 165094, 279461, 232201, 298431, 111348, 152174, 117794, 156766, 59370, 107742, 284646, 161468, 114174, 149740, 145693, 399293, 16794, 219136, -37386, 209022, 48346, 3674, 167029, 427248, 108588, 108225, 317990, 43031, 55922, 88126, 196341, -176263, 205406, 49251, 154838, 271318, 148125, -76743, 355413]
13433A5785K93620R3211k2131b75590c1147C23272M60541I2874a7712M209B81928
13421d2761A86063m3179J11832G2468K8677O73d0212C3692L29156A58941G5825
13409B55979a81195A67770l5180k4112d5488k01386C8256K08146b47091E9343
13398A77312C9850K09488F8092R3455R0881A15718P995J14281i1149M4834B13246
13386B24742N3273K11427k12884E3447k4773R0424J40953k3952J26407j26004
13376B36502M0743f0305B00589N5619o9289a70165H9820l8961L4062L62430B8736
13364B28161p4554P7082R2556J22762E3213K3727M51822B08024M07714A50193
13353a47107F7510I837J21094m7099B524O8586P2292J76509K209O1901D140K95623
$$ y = [15785, 309405, 402616, 380485, -275590, -31147, 323272, 783813, 92874, -17712, -13503, 281928, -42761, 186063, 142884, 254716, 72468, 101145, 101818, -40212, 33692, 362848, 158941, 75825, 255979, -181195, 167770, 132590, 108478, -45488, -246874, 38256, 246402, -247091, 59343, 177312, 39850, 249338, 68092, 161547, 252428, 115718, 123713, 237994, -91149, -46315, 213246, 224742, 278015, 489442, 276558, 53447, 28674, 119098, 260051, 236099, 362506, 236502, 277245, -60305, 200589, 256208, 186919, -170165, 89820, 50859, 84921, 447351, 28736, 228161, 153607, 230689, 323245, 446007, 53213, 76940, 528762, 208024, 615738, 150193, -147107, 67510, 9837, 130931, 83832, 2524, 71110, 143402, 319911, 322120, 384021, 4140, 299763]
13341B99763l6775r1189M34890B63618A10569J72195j29485L00815E4250K80105
13331C34355B4602J24656J57138r2956D4665c3757B99017a28880A07108K28597
13321C35705F0351A6771K31103A0726J59178K4084o2257M9592J08074I3925L01189
13310C95114C9376a22261D17301j99964a34824C90340H2104L85943A58340J41272
13300B99612J01542j10116A37381e3429B93923o0026F6212e23109f8418B06596
13289f7306D6087j8101L12122A14391C3108a27146B42235m4534m9521H273a51760
13277A11759a6807k9577A01461K58556A47256p160J13014j2253L8692A12090m2999
13266F9091J69736N9219E5215K25136a15662j09870c4127A05886b59877d5444
$$ y = [299763, 262988, 171799, 606689, 263618, 110569, 282764, 153279, 454094, 54250, 334355, 24602, 149258, 306396, 213440, 44665, -33757, 299017, -128880, 107108, 335705, 60351, 16771, 247874, 10726, 169904, 193988, 131731, 181323, 289397, 93925, 395114, 39376, -122261, 417301, 217337, -134824, 390340, 82104, 468047, 158340, 299612, 401154, 291038, 137381, -53429, 293923, 233897, 66212, -523109, -68418, 206596, -67306, 46087, 27986, 340108, 114391, 33108, -127146, 242235, 197701, 148180, 8273, -151760, 111759, -16807, -46384, 101461, 360017, 147256, 140096, 253110, 240857, 279549, 112090, 69091, 238827, 298046, 55215, 280351, -115662, -225532, -34127, 105886, -259877, -45444]
13255G7982j6666N9177e8023j08076b3768A34152L12937G5301N1557J82919m4784
13244B64993A31023a40371e655j28044b5181A02724D0848J65407f7856E2002a18615
13232C7196j8342a01752B2406g3603k1742B65101f2225D69648j16900j16254J4628
13221B51122c1905l1059A45850o4066l4523R0887J10920o4813i882k40950B23182
13209B99635a1590A89676j155Q7086m2260p3676a8902p9546C7337J11415k5061
13198A23691b4129j5038j7887A09372d8429B78431g8317C99711A65789B8433h195
13186A7855a158A0909b19284I8773C5131b3471A4329c68049F3227M0919J19425
13175B23571G5861j2881J29916c8914m9106A68577p8228e221p2059j21480E4107
$$ y = [77982, 61316, 120493, -58023, -166099, -23768, 134152, 447089, 75301, 126858, 309777, 264993, 131023, -140371, -5655, -133699, -25181, 102724, 40848, 206255, -67856, 52002, -118615, 37196, 18854, -101752, 22406, -73603, -95345, 265101, -62225, 469648, 352748, 236494, 251122, -31905, -62964, 145850, 81784, 47261, 138148, 249068, 184255, -9882, -250832, 223182, 299635, -11590, 189676, 188521, 275607, 233347, 159671, -18902, -98448, 37337, 148752, 123691, -24129, -39167, -57054, 109372, -48429, 278431, -78317, 399711, 165789, 28433, -8195, 17855, -1158, 10909, -219284, 98773, 35131, -23471, 14329, -368049, 63227, 104146, 223571, 75861, 62980, 192896, -38914, -88020, 168577, 90349, -5221, -77280, -198760, 54107]
13163A12458R3799q6260i2789o9401B07599E5183O3538a09313F2027c7427A14883
13151d6944B82759A10792J43501A20753a01936j61867B42402o8349L5201J16662
13141C25916e5590l1841r3473C74551I4403i4256A27137A2339L50214e4664l1532
13130h6196B84760C7317K10378a18154r6062C65543A1167P6064J63858i968j61001
13119a70969e9524p5729A27853c19973A91252g628l3937A53116J5179a49136j28018
13108b77154A85376f6583k8496Q043B9297J4298e6939j26044h5772B3118K11019
13097B34137A10716N152A3503c86621A55543a1932n9808c1328H2359c54854B17815
13085G5154J93106a69576A09580a85083C69480j62495a24830e160A59695c9677
$$ y = [112458, 206257, 119997, -92789, -162190, 207599, 55183, 118721, -109313, 62027, -37427, 114883, -46944, 282759, 110792, 254293, 120753, -101936, -263803, 242402, 174053, 209254, 325916, -55590, -87431, -180904, 374551, 94403, -94256, 127137, 12339, 362553, -54664, -86196, 284760, 37317, 247695, -118154, -214216, 365543, 11167, 87231, 251089, -9968, -170969, -59524, -135253, 127853, -319973, 191252, -7628, -41565, 153116, 168295, -149136, -277154, 185376, -66583, -95079, -87036, 29297, 43595, -56939, -182983, -85772, 23118, 234137, 110716, 115868, 13503, -386621, 155543, -11932, -71740, -31328, 82359, -354854, 217815, 75154, 268260, -169576, 109580, -185083, 369480, 206985, -124830, -5160, 159695, -39677]
13074f7593B68939a12024n2174H1840b07269C8177K32487j13995Q3939d39318
13063d1741A5908a3171m0304j95743c4596A84643d74C05399C7536J62122c5447
13051A56887Q3309P9623H4755K0271d0962a3955A69929J57761A02824J22346m2175
13040A82995o2146C6595a98841A67801C5171Q6313a7600A14833N6865h5084B36951
13028A37536J27373a09607B67753a5366o1015D2250J9789L21360A65398b79848
13017E4509c3775l4967A40998K6377k1509a54065d3094F9079J44503f3758E9711
13005E9116J97613B6554L09769J8489j66262a54920D0590c86451f4599k32469
12995b97068A52104l1988f1958b3478m7849C7225F713d1103k06683K3159A29798
$$ y = [-67593, 268939, -112024, -164198, 81840, -207269, 38177, 270664, 156669, 240608, -439318, -41741, 15908, -13171, -53475, -249218, -34596, 184643, -474, 305399, 37536, 199658, -35447, 156887, 240196, 319819, 84755, 105026, -40962, -13955, 169929, 327690, 102824, 225170, 182995, 120849, 36595, -198841, 167801, 35171, 121484, -17600, 114833, 171698, -85084, 236951, 137536, 264909, -109607, 267753, -15366, -76381, 42250, 62039, 383399, 165398, -279848, 54509, -33775, -68742, 140998, 167375, 145866, -154065, -43094, 69079, 213582, -63758, 59711, 59116, 256729, 26554, 336323, 354812, 188550, -154920, 40590, -386451, -64599, -297068, 152104, 120116, -61958, -23478, -71327, 37225, 6713, -41103, -247786, -224627, 129798]
12983h2316m8245A82452p0754I556M41806A50750j1571K8017a51464a0600j06257
12972a16857a3287B77482K28605A74370b27830j18064A06253J6189a67538B38925
12961b3824I2670a23002A89290K8084n9952d27251f3012B85316J7310a4219C83836
12949i2339E4176c26002A3781K47654d1086H295c75144a18406j14439b0378j46383
12938a66761d692j40662A88750J7620e6147m3239k21206g9659C82626b8908p4094
12927a03002a6979A16271a78434N6678A60307E4765P5581O347a66146b601C63097
12915a59437n8940f3019J1404B11066b89454K4813j89791g0462A11380L8410b83800
12903B16306G1439b41775P8582C536R1037L9487A4105O5987P0489a00123B240
$$ y = [-82316, -130561, 182452, 111698, 9556, 451362, 150750, 139179, 167196, -151464, -10600, -116857, -13287, 277482, 506087, 174370, -227830, -345894, 106253, 122442, -167538, 238925, -23824, 92670, -123002, 189290, 217374, 157422, -427251, -63012, 285316, 302626, -14219, 383836, -92339, 54176, -326002, 13781, 261435, -41086, 8295, -375144, -118406, -232845, -20378, -166761, -4692, -145354, 188750, 206370, -56147, -99386, -320592, -79659, 382626, -28908, -103002, -16979, 116271, -178434, -121756, 160307, 54765, 130346, 136693, -166146, -2601, 363097, -159437, -218377, -63019, -51615, 211066, -289454, -264641, -454432, -70462, 111380, 149790, -283800, 216306, 71439, -241775, -163193, 3536, 94573, 134060, 14105, 80092, 150581, -100123, 2240]
12891A4857J39934b08602M411b9471C59297d2952A08244i0178G2910a79411A61938
12879A24617J26729A05641b26775R9853C02417j07510d9243I1773b11956C79818
12868e0235B10908p8578c88595C9742K52327n8826I0338O0581b60513e0395a8112
12856b31543k17654d8532o9524a292C54579H0799b58337B97917b20705J4966A93376
12844h5710C56106a38873A29243c34C6827e1329k17862A92830R6117b1994B79371
12832A23280I197a37444i313j53723K3366C64347b9484j54022r1414P7370H1225
12820A41357J68911a54830B3404d9561A41172h681j9500C82454D3901K6152a82149
12808C3909K3551e732A05768a30306e6479D4417e233m4964A2624J40958p0653
$$ y = [14857, 154791, -208602, -204191, -29471, 359297, -42952, 108244, -90178, 72910, -179411, 161938, 124617, 251346, 105641, -226775, -126922, 302417, 194907, -49243, 91773, -211956, 379818, -50235, 210908, 132330, -388595, 39742, 292069, 233243, 90338, 150919, -260513, -50395, -18112, -231543, -449197, -48532, -118056, -1292, 354579, 80799, -258337, 297917, -220705, -205739, 193376, -85710, 356106, -138873, 129243, -334, 36827, -51329, -269191, 192830, 288947, -21994, 279371, 123280, 9197, -137444, -9313, -163036, -139670, 364347, -29484, -183506, -274920, -197550, 81225, 141357, 310268, -154830, 23404, -49561, 141172, -8681, -28181, 382454, 43901, 70053, -182149, 33909, 57460, -5732, 105768, -130306, -56479, 44417, -5233, -50197, 12624, 153582, 82929]
12797H2929a38155C8461r623J59613H4502b4235m2278B01922F8244a81533B38839
12785A98409g1159B14658b10333Q9633I635a2269j40305b8184k76795A33707J83744
12774C17451b70349j1679h3348m4411A09369b23987m2947H5855g974k5738j47117
12763a80829A03940i2359G013b9711C1269K08095b3116G67O2771i3816C1746c81826
12750F339i6016j61805i3601C7269b98133M0998J24171b7167j0361g278l3515
12739d0793B12772m1952f6360D1669K23944c9870D6791b10427j14049J55251d3151
12727e2058I5932J13948I5494K86998d42538a3158A63549a11626J0584j27433
12717b28475O1692d4609j005B0697J05459P7489E7531a4839A67153J39408B2783
$$ y = [82929, -138155, 38461, 28838, 188451, 84502, -24235, -66513, 201922, 68244, -181533, 238839, 198409, -71159, 214658, -210333, -120700, 9635, -12269, -152574, -28184, -304979, 133707, 317451, -270349, -282028, -83348, -127759, 109369, -223987, -266934, 85855, -7974, -33712, -180829, 103940, -92359, 7013, -29711, 31269, 239364, -23116, 767, 63538, -93816, 31746, -381826, 6339, -96016, -257821, -93601, 37269, -298133, -257135, -132964, -27167, -37528, -7278, -40793, 212772, 170820, -66360, 41669, 265613, -39870, 46791, -210427, -324476, -169225, -43151, -52058, 95932, 209880, 95494, 382492, -442538, -13158, 163549, -111626, -101042, -228475, -166783, -44609, -45614, 20697, 126156, 203645, 57531, -14839, 167153, 306561, 22783]
12705B21374p8579J55724j34486n8864q796O4846F9244a40122f536j0332F1123
12693c5595j82957c4923B57092j11977J04944m3509r1517a95532M1135C24317
12682F7602J38534a81509E5665J72539a98439C16247G6388l29k5462J99907A13112
12670e3914C7852M7185p672O8808B2892K31527d0006k5886F0773g0783j69241
12659b40024B55678c47510G040b85474A85018P5330g7523A74939l2231f122H848
12647a22187A02379J76518a5515j67919L6909A45293g2067J7197b2779A31125
12636C6897b8575j31716H6904a19375A99049J4329L6956H5755Q2454b06435A68110
12624d3030a5740j49166B85435m1243A19053a89485A09391a3654l487m3935k6838
$$ y = [221374, 142795, 298519, 164033, 105169, 96373, 161219, 69244, -140122, -6536, -16868, 61123, -35595, -218552, -34923, 257092, 145115, 250059, 206550, 115033, -195532, -154397, 324317, 67602, 206136, -181509, 55665, 228204, -198439, 316247, 76388, 76059, 50597, 250504, 113112, -53914, 37852, 85037, 77365, 146173, 22892, 254419, -40006, -65892, 60773, -70783, -240024, 255678, -347510, 7040, -285474, 185018, 260348, -77523, 174939, 142708, -6122, 8848, -122187, 102379, 278897, -15515, -183434, -146525, 145293, -72067, -54870, -22779, 131125, 36897, -28575, -160291, 86904, -119375, 199049, 213378, 250334, 85755, 168209, -206435, 168110, -43030, -15740, -164906, 285435, 244192, 119053, -189485, 109391, -13654, -17141, -61076, -87914]
12613h7914k34011G6788d1226r2687A29568C2907R1578C292J98105F7230O2498
12602A29728a32494B46119o3105c4845C6935r409L15668a30812A30901e5377A80198
12590A74428a30752A18498d683A57026l3881a16286G325a61100L2349c7329A44899
12578B0473J82397f2005L0403J2151j75778l59040a39980R35G2163H344a09126
12566C8305M7378a2622F7436a97405j65712J56735A93407b74728b9520j52998
12556a82518A12634N7031J23569j19926a24706b907k9486A36100c41655a08865
12545A81078a90684E5795d0989a7435m3295A01308M8251b6126C16912a53926k72132
12534d26058E6928b35134B82739i8245j03960i6387A30762d0673A86056i7903
$$ y = [-87914, -321925, 76788, -41226, -133913, 129568, 32907, 124485, 3292, 201397, 67230, 129728, -132494, 246119, 183014, -34845, 36935, 27526, 343194, -130812, 130901, -55377, 180198, 174428, -130752, 118498, -4683, 157026, 123145, -116286, 7325, -161100, -128751, -37329, 144899, 20473, 202870, -62005, -31602, -19451, -195229, -554269, -139980, -139045, 72163, 8344, -109126, 38305, 85683, -12622, 67436, -197405, -363117, -206382, 193407, -274728, -29520, -182518, 112634, 169665, 293234, 173308, -124706, -2907, -32393, 136100, -341655, -108865, 181078, -190684, 55795, -40989, -17435, -60730, 101308, 149559, -26126, 316912, -153926, -426058, 56928, -235134, 282739, -98245, -202205, -96387, 130762, -40673, 186056, -97903]
12523A27224C1785b31546J08783C4147c1882C4658E658K35213H0468b43006A97469
12511a52628A29251J51841p7164q3450J14106D3376a06936o2030L6330N081O835
12500a20720j64672q4383A16464E7826b6363A57650g8227D63310j59325o3303
12490B40682b18098R9610k69382i882G5575b86728A67878a69971C52053A41727
12479A19168L04696F3261M005M2040J39136e7759H0775J53886a5217A48759h96
12467g6098l19808E5017a44660k38422A22031l6034J48028b88852J06930A768
12456g561H0303k0307P0430e4318B93206j41699n7864K23216G8227k2848g4685
12444B10158L968g7770B48883b01208A71090a36540I2606a36203A48639a21966
$$ y = [127224, 31785, -231546, -122763, 34147, -31882, 34658, 5658, 240871, 80468, -243006, 197469, -152628, 129251, 281092, 203928, 120478, 234584, 43376, -106936, -168966, -132636, -127555, -120720, -285392, -369775, 116464, 57826, -26363, 157650, -78227, 463310, 303985, 240682, -218098, -118488, -387870, -9882, 75575, -286728, 167878, -169971, 352053, 141727, 119168, 423864, 63261, 67266, 109306, 248442, -57759, 80775, 234661, -15217, 148759, -896, -76098, -395906, 55017, -144660, -383082, 122031, 85997, 234025, -288852, -181922, 1768, -7561, 80303, 59996, 130426, -54318, 293206, 151507, 93643, 316859, 78227, 55379, -74685, 210158, 214126, -77770, 248883, -201208, 171090, -136540, 92606, -136203, 148639, -121966]
12433h1267j66877J02223l509l35315a73352j29515B77060B3325c14821a7965
12422B58555b67147E6731c2899J6123C5665a94130A11149m6645K57622a4472A24707
12410c8148a4148j64396I3791M6622d4963J0152B28216q0112a9291L419B2262
12398a35252a0159l56018A09203d4860G1157J4503f8581B7053M4643J61894b06366
12386a23294A32403P5859D5962L17173h9606A0738J66964b23456B76b52278A45278
12374c4039A88543m3970K0018o2583G324K64635A02537K5267d04685B7983K23931
12363B51914j6956b38018I4712e0401p1338M9187j28025D8087K70285a26211B18959
12351B11241A4481J16541b88379r66A85832a58182C4806c2562l79417h3605b1553
$$ y = [-81267, -248144, -145921, -149430, -484745, -173352, -302867, 277060, 23325, -314821, -17965, 258555, -267147, 56731, -32899, -16776, 35665, -194130, 111149, 64504, 322126, -14472, 124707, -38148, -14148, -178544, 93791, 140413, -44963, -34811, 228216, 148104, -19291, -15872, 22262, -135252, -10159, -366177, 109203, -44860, 71157, 85660, -68581, 27053, 71696, 233590, -206366, -123294, 132403, 208262, 45962, 363135, -89606, 10738, 177702, -223456, 276, -252278, 145278, -34039, 188543, 144573, 164591, 102008, 7324, 271959, 102537, 127804, -404685, 27983, 251914, 234958, -238018, 94712, -50401, -121739, -72552, -200577, 48087, 318372, -126211, 218959, 211241, 14481, 131022, -288379, -289345, 185832, -158182, 34806, -32562, -411979, -83605, -21553]
12339D0947N2019d7554F8940i7318r5018A89804I2149P3859e4487H1647a61215
12327e4418B92503o6982B3341b8296A12279J09687Q5183a22160G5317J25714M9095
12316B50126O4916j15529Q180a3671q9864B05639H4004K18467b11389B77499A1608
12304B55935b52355A10523j3511a25693N5026B61565b4348n31172B64329A32097
12293C75925c49191B82941o0732A8254J15345b70647h9552j10680A33870K926
12283A36796E8416h5993B44370N6795k6349m441a85811A30768M2096L5636J04904
12272C13404C9250M47469b1804B33415m0272N7833j21735L1967a74603A67535
12261c38694B72474j29892J83804b26301c6j00746C46192O5372j20043q2190a59869
$$ y = [40947, 92966, -47554, 68940, -97318, -192336, 189804, 92149, 166008, -54487, 81647, -161215, -54418, 292503, 225521, 23341, -28296, 112279, 221966, 307149, -122160, 75317, 201031, 250126, 315042, 199513, 207693, -13671, -103535, 205639, 84004, 302471, -211389, 277499, 11608, 255935, -252355, 110523, 97012, -125693, -70667, 261565, -24348, -555520, 264329, 132097, 375925, -349191, 282941, 222209, 18254, 133599, -270647, -89552, -200232, 133870, 136796, 58416, -85993, 244370, 301165, 274816, 270375, -185811, 130768, 172864, 208500, 313404, 39250, 486719, -21804, 233415, 193143, 250976, 129241, 161208, -174603, 167535, -338694, 272474, 142582, 326386, -226301, -36, -100782, 346192, 411564, 291521, 209331, -159869]
12249a37488D91342B26180q3679Q9747G622b23610c6688A38916F4013K61864F1856
12237B47523i708A80669F0904a05913K5747c7353A81635H9225i8529D3666K20312
12226B63978B0282K42180A07920N7993J24240E1703J54586m8725o6617J35656
12216B26603B0304M99418B52980J92125H0322L35234A63305b35544F7082c3362
12205C28220A03226J60394l8314b5848E2042J34930J20767b0052j2279D49718
12194A56412L58246j38791n095j14338j5261j04585K27161j05560J51476a763
12183D10228i5183B05387h5840H0060J53310M7107K32690A93364K28652p8924
12173C43092o2524l1762F1978B5818K50998k6422l2300J23015N0704A25618L29336
$$ y = [-137488, 491342, 226180, 142501, 232248, 7622, -223610, -36688, 138916, 64013, 325877, 61856, 247523, -9708, 180669, 60904, -105913, -80166, -37353, 181635, 89225, -98529, 43666, 263978, 20282, 262462, 107920, 165913, 290153, 51703, 206289, 157564, 90947, 226603, 20304, 519722, 252980, 445105, 80322, 415556, 163305, -235544, 67082, -33362, 328220, 103226, 263620, 225306, -25848, 52042, 186972, 307739, -20052, -32331, 449718, 156412, 514658, 375867, 370772, 256434, 241173, 136588, 363749, 258189, 409665, -1763, 410228, -95183, 205387, -85840, 80060, 233370, 280477, 513167, 193364, 422016, 343092, 280568, 248806, 61978, 25818, 276816, 250394, 218094, 341109, 391813, 125618, 454954]
12162D54954j70106m8710G5870a9632H6904g91K58F8302O0351J13915a4465q7156
12150a01621A13203k0165a82370M3742d9318j0674C5131e5767l53864B64389p7149
12139A87240g7003A93839E2615M90868d1068D24531A31222K7074E1434e7433b7168
12127C43846a10417I156P9956J38211o3023p9048J49578A03641L10452D4485K82890
12116C27375j15052J24123b25449A49751J32045e7961C31012I2782d68705d0743
12105a08312k5743F3114L69815E6756L68826k04749c7499B54852b62307f4713
12094C13420r3264r5421a93866j39624A76712k4518J6917P0033J43436o9003A10023
12082B25521L7973j21648b53386B73233E0019J45537p0909i9670C24855F8576
$$ y = [454954, 284848, 236138, 75870, -19632, 86904, -791, -533, 68302, 128653, 242568, -14465, -101621, 113203, 93038, -182370, -138628, -49318, -59992, 35131, -55767, -409631, 264389, 187240, -77003, 193839, 52615, 543483, -41068, 424531, 131222, 158296, 51434, -57433, -27168, 343846, -110417, 9156, 89112, 227323, 164300, 85252, 234830, 103641, 414093, 44485, 327375, 212323, 336446, -225449, 149751, 281796, -57961, 331012, 92782, -468705, -40743, -108312, -134055, 63114, 432929, 56756, 425582, 220833, -37499, 254852, -262307, -64713, 313420, 220156, 124735, -193866, -333490, 176712, 152194, 169111, 239144, 382580, 313577, 110023, 225521, 263494, 141846, -253386, 273233, 50019, 195556, 124647, -99670, 324855, 68576]
12071A44770J90303A17173b75549A18794L9533P6906j9723j06536m153K4780f3405
12059F397J12360A4610i7092A52899a26056L784r1496A38793J1849L36913b64350
12047a28789p090A69010m5899K28353c48598F236B103P2367a97167K3631e6006
12035A207R5164L4213c0353j54262G4180C6841K41348A35167o3487a55613B4476
12023A6267e7332A30115a00046r7456B60480I9965K24829c33447A74120a81717
12012A36334a7354j14263J9855A45414A0405J52409a89432C96128I991a83319
12001B19712a63790B98475B4464a09372g426j34768D0845j2909c49995a10279
11990B73998B8037R1375c2079B10564l0173a58107p7600B17826G4694A6250K304
$$ y = [144770, 335073, 117173, -275549, 118794, 158327, 235233, 215510, 108974, 104821, 129601, -63405, 6397, 118757, 14610, -97092, 152899, -126056, -122272, -213768, 138793, 150642, 487555, -264350, -128789, -135879, 169010, 123111, 351464, -348598, 6236, 2103, 74470, -197167, -173536, -56006, 1207, 96371, 130584, -30353, -184615, 74180, 36841, 278189, 135167, 71680, -155613, 24476, 16267, -57332, 130115, -100046, -197502, 260480, 99965, 324794, -333447, 174120, -181717, 136334, -17354, -131617, -111762, 145414, 10405, 162814, -189432, 396128, 9991, -183319, 219712, -163790, 298475, 24464, -109372, -7426, -142194, 40845, 27936, -349995, -110279, 273998, 28037, 119412, -32079, 210564, 180391, -158107, -235707, 217826, 74694, 16250, 18554]
11979A8554a84909C51867b49900k8832l9519N0709m0296e388j55350e1717B50031
11967E2623b47273A46336n4559r025c4234k08694g62l9511D3214K79505a71391
11955G7432a46354p9523A49564a775o5774m4280A55444b16265k21526g1671j3270
11944h4941l86437a461F8157h2912F2203h0038A02201B6019d51161A30494a64373
11932d6815E7427K37898i1261A9553J56290E9842f5882k440n8791N999B36891
11920A71649M9280c0075j00559L4841M7768A16205m7742F72b4615k02465e4814
11908a31530l7870B1890O4574K25707c97924h0366A32844f2274k52873A81600
11897C21324d1548F5847B4053d9504j08440b3259q343k7980k10038c6394B564
$$ y = [18554, -184909, 351867, -249900, -278732, -318251, -267542, -307838, -5388, -160738, -51717, 250031, 52623, -247273, 146336, 91777, 82752, -34234, -242928, -762, -40273, 43214, 322719, -171391, 77432, -146354, -225877, 149564, -1775, -67549, -111829, 155444, -216265, -437791, -71671, -84941, -471378, -1461, 68157, -82912, 62203, -80038, 102201, 26019, -451161, 130494, -164373, -46815, 57427, 295325, -91261, 19553, 175843, 59842, -65882, -68322, -127113, -121114, 236891, 171649, 220929, -30075, -130634, -95793, -48025, 116205, 68463, 672, -24615, -227080, -54814, -131530, -169400, 21890, 86464, 312171, -397924, -80366, 132844, -62274, -315147, 181600, 321324, -41548, 65847, 24053, -49504, -157944, -23259, -31602, -59582, -269620, -36394, 2564]
11885b64643R9353J1068B39376a65046O8995B22332b651l39812G3576g407A60306
11873f2262B849e1437k11264k34115K12948P6852E2691Q7227J18315n5152a89758
11861b66180a389r3405k4768j0534A09945D8376A0423N177d8857B16635b628D2097
11848C7930A5187P2512B2436f0789r3257j936B59887j22622e4606A35136a30905
11836G1138J09227J2397b06344e3640B00888b08330g8610k60512J44525b2851
11825f6575B4546N5253b90750C9748J02807a12804C1678b54132R6293k4295p3397
11814b55531a08612j52873g7597D2718a55294L2450J0802j49436J12794G423J80583
11803A88006d9013j17764C71342g0948d371j3766j18814j1876j52222A87658n1235
$$ y = [-264643, -165290, -154222, 239376, -165046, -96051, 222332, -2651, -342463, 73576, -7407, 160306, -62262, 2849, -51437, -262701, -496816, -283868, -207016, 52691, 139918, 258233, 203081, -189758, -266180, -1389, -94794, -119562, -130096, 109945, 48376, 10423, 15600, -48857, 216635, -2628, 42097, 37930, 15187, 87699, 22436, -60789, -154046, -155982, 259887, 137265, -54606, 135136, -130905, 71138, 180365, 192762, -206344, -53640, 200888, -208330, -78610, -339122, -194597, -22851, -66575, 24546, 79799, -290750, 39748, 142555, -112804, 31678, -254132, -157839, -182134, -255531, -108612, -261485, -77597, 42718, -155294, -122844, -112042, -261478, -148684, 7423, 188006, -49013, -166777, 371342, -70948, -4371, -18137, -136951, -148827, -301049, 187658, 136423]
11792A36423q698E5826a39644d3222j05467C7280a06231A76363D4907a53169D900
11780A19035J26947Q7499A24378b15261A51213e5306g764o8341B9479Q4513n2568
11769F1424K643c8811r339g55j98535L7729A96110A7284h8182b7614j44111P7430
11757i4295I5743B953N9168R5236e23286K20515f4207b1283k03357R1734j43639
11746b76545E9112K74955A8920M9784c40927h0134j4703A99856O4185a20361j31239
11735b51600J2289M3676A49670a8760H282c16662B9948a98376b0502o3420c4929
11723d9578m0524D7099M1147b8051k8486l832l2858D46248k04682G8355b9388
11711a9713A09611Q2714q0615A1399J14084k5014K44655A02509m0121j1307g6414
$$ y = [136423, 127725, 55826, -139644, -43222, -148689, 37280, -106231, 176363, 44907, -153169, 4900, 119035, 245982, 333481, 124378, -215261, 151213, -55306, -7764, -76105, 29479, 113992, 61424, 64067, -38811, -48150, -755, -199290, -161561, 196110, 17284, -88182, -27614, -171725, -94295, 95743, 2953, 62121, 157357, -523286, -302771, -64207, -21283, -224640, -132906, -276545, 59112, 334067, 18920, 68704, -340927, -80134, -94837, 199856, 264041, -120361, -251600, -239311, -195635, 149670, -18760, 8282, -316662, 29948, -198376, -20502, -83922, -34929, -49578, -90102, 47099, 88246, -28051, -56537, -60369, -93227, 446248, 241566, 78355, -29388, -19713, 109611, 192325, 111710, 11399, 125483, 100469, 345124, 102509, 62388, 51081, -76414]
11699f6719I6878J10020a19494A20036N4283K22601H7698L976J39888l7715J00452
11688B94299a7766k24391H2083P5645a15855A44058g7720m1316B21808j05890
11678A15918J76991A02739a29193j65508J34029F9735g2199B96451a7691k53272
11668b70963c2663B95089A31355J72000b39354A39519a5901m35799H6123F117
11657C65593B1953J01976C9965r127D755J30748K63894I4568a76884B37991j06010
11646A31981J04029H0275L32037A64450A2472e6369b2758j19314b1660F0831J39325
11635B00156c7618F9477C689O798a0945J207n0954J1339D8638j2442P8206K57756
11623C72158a46744G3557b6231F9352f9985E9536a38739A53608E3794a82725l15433
$$ y = [-66719, 96878, 206898, -119494, 120036, 174319, 396920, 87698, 91674, 231562, 193847, 294299, -17766, -242157, 82083, 157728, -115855, 144058, -77720, -119036, 221808, 115918, 292909, 102739, -129193, -294701, -160672, 69735, -72199, 296451, -17691, -270963, -32663, 295089, 131355, 303355, -239354, 139519, -15901, -451700, 86123, 6117, 365593, 21953, 123929, 39965, 30838, 4755, 135503, 399397, 94568, -176884, 237991, 131981, 236010, 80275, 412312, 164450, 12472, -56369, -22758, -142072, -21660, 60831, 200156, -37618, 69477, 3689, 10487, -10945, -9738, -60692, -49353, 48638, 36196, 114402, 372158, -146744, 73557, -26231, 69352, -69985, 59536, -138739, 153608, 53794, -182725, -498158]
11612d98158a86033F3796f4395B65883e3823J3774m605G4366e2978B05118H4161
11600a56615H8593h3910F3032J7421J39546g6033F534J53007J02458g8136I7728
11588G1077j0718b25091Q8959n517b6493o4173H3349M6444J52694a7116A78361
11576B02270d5682K0582C27466I6326b32751A14737g5994B27L51403A17281m5361
11565G1920d3796A02929e5614a3873C4187K4426q283e952l04196A67198F9401
11553a08570A12033A2633i8601a7869A61603o7983D956g3050a1008D03755E5971
11541a9612E4269a9011A93248h3913A1733J92219Q3067b4625A24548L10157f058
11529D3555f1818A83360J44720b61125D37261h149B9193N1114P6180c13151B37718
$$ y = [-498158, -186033, 63796, -64395, 265883, -53823, -40049, -44654, 74366, -52978, 205118, 84161, -156615, 88593, -83910, 63032, 80453, 219999, -76033, 6534, 159541, 261999, -78136, 97728, 71077, 60359, -225091, -136132, -141649, -26493, -90666, 83349, 129793, 282487, -17116, 178361, 202270, -45682, -25100, 327466, 96326, -232751, 114737, -75994, 227, 351630, 117281, 71920, -43796, 102929, -55614, -13873, 34187, 58613, 50330, -5952, -310148, 167198, 69401, -108570, 112033, 12633, -98601, -17869, 161603, 93620, 4956, -73050, -11008, 403755, 55971, -19612, 54269, -19011, 193248, -83913, 11733, 203952, 287019, -24625, 124548, 434705, -6058, 43555, -61818, 183360, 328080, -261125, 437261, -8149, 29193, 80307, 156487, -313151, 237718]
11517i1750K5614G6707Q7512J7788B5337Q1819a8186A7339R9102J75313A30149
11505a13801A72566B8818R9076M022l2390a255D42926b03839D15542D6027R913
11494E5940K24832J2518e8026C47303A43815L19262a96683B72779A24452a49510
11483b6779k04093A6401P6261e4974F13e9520A74561K54112A83854G0820L55358
11472D26178B12636J65983G4416K30829C3177L8731O17422A15603b6869B53012
11461C00348K4116a02717B08407J41118A06494J13809g1494B10070a84616A32454
11450H6883K4730J61666b0417j90235B42411E6774j670e49431a4501B93902G9077
11438E27807A56994J32167m3782b6577A28125j900C7107G356K02504a92517c6407
$$ y = [-91750, -66136, 76707, 164219, 182007, 25337, 107156, -18186, 17339, 116441, 291754, 130149, -113801, 172566, 28818, 127894, 131916, 99526, -1255, 442926, -203839, 415542, 46027, 55940, 280772, 293290, -58026, 347303, 143815, 463077, -196683, 272779, 124452, -149510, -26779, -230872, 16401, 92662, -54974, 613, -59520, 174561, 428673, 183854, 70820, 426178, 212636, 378619, 74416, 305245, 33177, 71908, 689330, 115603, -26869, 253012, 300348, 324464, -102717, 208407, 349525, 106494, 220303, -71494, 210070, -184616, 132454, 86883, 111613, 273279, -20417, -210652, 242411, 56774, 55104, -549431, -14501, 293902, 79077, 527807, 156994, 289161, 245379, -26577, 128125, 126225, 37107, 7356, 209860, -192517, -36407]
11426i257l0953a1211j53222H1281K6434J35496K9500A3626K06990K19738a2087
11414E6634J7508e150q8320j28298B16999F3741k3098j8499J23205O4866b40288
11402E7447L4375J02872f6460B68879a19211B12037a52187J4327G7929b47791
11391A84136b19625A4638b97239A19744j7929a87818l2141A40810a39683J5188
11381a24495A50373O3118h2948C7417b7237i588G6507l7373b55201A01404N8028
11370A59432J196G9591l4623L00628D251d42558a73475D332K5108O1002K3304
11359A13746d3428j14200i860A32417n4758b82026B09568b58239a15693G4584
11348c88312g9415A168J72552E8017P3699c01114A2077J10833a48622K9058L5849
$$ y = [-9257, -40210, -11211, -164433, 81281, 107715, 243211, 272711, 13626, 220616, 440354, -12087, 56634, 74142, -5150, -93470, -221768, 216999, 63741, 40643, 22144, 145349, 210215, -240288, 57447, 91822, 194694, -66460, 268879, -119211, 212037, -152187, -137860, 77929, -247791, 184136, -219625, 14638, -297239, 119744, 101815, -187818, -219959, 140810, -139683, -124495, 150373, 213491, -82948, 37417, -27237, -9588, 76507, 39134, -255201, 101404, 159432, 160628, 79591, 44968, 345596, 4251, -442558, -173475, 4332, 29440, 90442, 113746, -43428, -157628, -9860, 132417, 77659, -282026, 209568, -258239, -115693, 74584, -388312, -79415, 1168, 173720, 58017, 131716, -301114, 12077, 122910, -148622, -119564, -83715]
11337h3715m9658j1303A83330b83214L4794h6669C1091b7875A79466e6514l6053
11326i2567D4222e3259B00413b34749r5377C33703c51912I9903M9248o7162a43370
11314f9929C45061a75179k2062A98301L3760G6604c2968j31581g5896B60053a4922
11302d00247A03878d0239P32m5942j8537l6063f7183m0538r9797f2661o3280A29618
11289a26948k1690A44202d41005i688B53615n9996i1814A54239p3098k2453L4502
11278I3190a84996A71951i8667H0693J342i7294j07349N5233k3628D9837c802
11266a01001Q155B9110b79604c3549k39837E1631m804a13851A0295g2148j36909
11255b09057g2564J8358q7336k52578C24944A01078g067q8953r7652E4672h137
$$ y = [-83715, -133373, -144676, 183330, -283214, -248420, -86669, 31091, -27875, 179466, -56514, -92567, 44222, -53259, 200413, -234749, -330126, 333703, -351912, 99903, 149151, 81989, -143370, -69929, 345061, -175179, -197241, 198301, 232061, 76604, -32968, -164549, -75896, 260053, -14922, -400247, 103878, -40239, -39507, -85449, -103986, -140049, -67183, -107721, -207518, -62661, -125941, 129618, -126948, -148638, 144202, -441005, -9688, 253615, 193619, -91814, 154239, 81141, 58688, 93190, -184996, 171951, -98667, 80693, 82035, -97294, -204643, -149410, -173038, 49837, -3802, -101001, -92846, 29110, -279604, -33549, -273386, 51631, 46827, -113851, 10295, -72148, -209057, -72564, -54206, -141542, -394120, 324944, 101078, -7067, -96020, -193672, 54672, -8137]
11243a36731K6982p281k04103B17832a49661a8613d490l92270a83875A90291b02400
11231f9359m9823G6785a77940l3911A05801a9782k35186E4235j787J93016F0877
11219B27747a48686r5016J15368j8559j58008A57150o7113l5843K3407f4685q0888
11208a45573k28549e1415r5239R071m4461A28934R1409c7954J0980k728j21523
11197a51225d4360l6591A5790b31153A06591b40490M4741c8741o5578n8212C56751
11185E9615a00456a259A68013B7649a79362J8402k24481A44604g3184j90812D04616
11173g0246C0035R99K38219c00780G6798d30662B62918a10707e3218A09257e1714
11161a32170p1456A7386L7197b31797h3650j65562A3300c52831B91207j4712b23197
$$ y = [-136731, -109749, -117030, -321133, 217832, -149661, -18613, -4490, -396760, -183875, 190291, -202400, -69359, -119182, 76785, -177940, -211851, 105801, -19782, -254968, 54235, 52448, 245464, 60877, 227747, -148686, -243702, -128334, -146893, -304901, 157150, 90037, 54194, 77601, -64685, -145573, -374122, -51415, -146654, -137583, -182044, 128934, 220343, -37954, -26974, -29702, -151225, -44360, -80951, 15790, -231153, 106591, -240490, -195749, -38741, -104319, -162531, 356751, 59615, -100456, -1259, 168013, 27649, -179362, -160960, -385441, 144604, -73184, -263996, 404616, -70246, 30035, 31034, 269253, -300780, 76798, -430662, 262918, -110707, -53218, 109257, -51714, -132170, -203626, 17386, 54583, -231797, -83650, -249212, 13300, -352831, 291207, 276495, -223197]
11149B06107m4085J96444j47804g6949o7031J5931j16378d6619A45322Q4988b24691
11137B40795g5323k7899B35221q4342J0887e1518B08215H7526b74691I6378Q863
11126A05241K06488c8917J4046A652f3817A42906L5518c8307B67069A17038N9271
11115A76309g2202o2122a2454A58399D5010a1635k58734A1885h0527B6232a54320
11103B12110j5208a72421D6498L89127a18110G9846J46378J32766A130L66191
11093C67321A61984J02221o7004M8112K1764d5387F7903J60629J17399i9884B45016
11081B83519J57511k17429J57705B989J4695K32714J0131j5506J13314m2446j02108
11070B13783P1612A08447J75063J06998j39736J09118j53486N4234N44980k67557
$$ y = [206107, 162022, 358466, 210662, -76949, -143980, -128049, -244427, -46619, 145322, 230310, -224691, 240795, -75323, -103222, 235221, 150879, 161766, -51518, 208215, 87526, -274691, 96378, 105241, 311729, -38917, -24871, 1652, -63817, 142906, 178424, -38307, 267069, 117038, 176309, -72202, -134324, -12454, 158399, 45010, -11635, -270369, 11885, -80527, 26232, -154320, 212110, 196902, -172421, 46498, 435625, -118110, 79846, 226224, 358990, 1130, 367321, 161984, 264205, 197201, 245313, 267077, -45387, 67903, 228532, 345931, -99884, 245016, 283519, 441030, 223601, 381306, 2989, 17684, 250398, 260529, 245023, 358337, 315891, 213783, 285395, 108447, 283510, 390508, 250772, 359890, 206404, 260638, 805618, 538061]
11060E38061o9209m6480L3309K70649R4344C57488J44371K08542k18854L57595
11050H49142j3151K320k6760L8768j78548j6121N92053k77735l4304J70863M46040
11039A552567m15511k87575N56443k18079j72186O0638k67680J70267J17113l7943
11029A058054j41479j00049J66036J0566j12451J56824J91812k66414j96919m2127
11019G23853M03468j54698j16218k16994R0568j1444K89838j06580j98757j99975
11009E03061M63754j6146m5155k44087J92434L45O7771l45798L25942D41777M21860
10998H63637j52072P344j95704M10440j67121K17733l57683L09969k83242J29017
10988G82318J85808l67782L72303r4233j28253L06652J52401j28574J41400L9805
$$ y = [538061, 468852, 422372, 455681, 726330, 820674, 357488, 501859, 710401, 491547, 849142, 835991, 838311, 811551, 850319, 671771, 655650, 1247703, 969968, 935664, 1106527, 1552567, 1137056, 849481, 1405924, 1187845, 1015659, 1076297, 808617, 978884, 1095997, 1058054, 916575, 816526, 982562, 993128, 880677, 1037501, 1229313, 962899, 765980, 723853, 1127321, 972623, 856405, 639411, 729979, 718535, 1008373, 901793, 703036, 503061, 966815, 950669, 905514, 661427, 853861, 854206, 921977, 576179, 902121, 441777, 863637, 711565, 718909, 523205, 933645, 766524, 984257, 626574, 936543, 653301, 782318, 968126, 600344, 972647, 878414, 750161, 1056813, 1209214, 1080640, 1222040, 1261845]
10978A261845j09627Q0999N1288M12912l5778J89068L18880L30682M1942K78109
10968B820320N89111J84869J24746j85599j57251n8126j8689n35566n97501P3714
10958B240028l68266n2653P5489l65156J15732J0951j56666J84017k79908J5177
10948A418745k12541l0515l19472k45338J32633k07744k0937k15615j35839K20318
10938C83695j56212E2521k2135K53625G5299L00123A28813N264g8965L5509C45569
10926A85240a63682A23694P691J20055a8565B04653h525E3690b1721C8212a05575
10914c5612j58212i313G3020a00238A31100a56262k93749A0387a21817o2977b3569
10902H8440a61843O2280F6351b75592B98931A27561A5986J1494K88573A32619
$$ y = [1261845, 1152218, 1233217, 1284505, 1697417, 1661639, 1850707, 2169587, 2500269, 2542211, 2820320, 3409431, 3594300, 3719046, 3533447, 3376196, 3318070, 3299381, 2763815, 2166314, 2240028, 1871762, 1819109, 1894598, 1529442, 1645174, 1656125, 1499459, 1683476, 1403568, 1418745, 1206204, 1175689, 856217, 610879, 743512, 535768, 514831, 299216, 163377, 383695, 227483, 52521, 30386, 284011, 75299, 375422, 128813, 134077, -78965, -43456, 345569, 185240, -163682, 123694, 131385, 251440, -18565, 204653, -8525, 53690, -21721, 38212, -105575, -35612, -193824, -9313, 73020, -100238, 131100, -156262, -450011, 10387, -121817, -184794, -23569, 88440, -161843, -99563, 66351, -275592, 298931, 127561, 15986, 27480, 316053, 132619]
10891d1298p5012A6808c2963j44374k60625a7388j1642A25178a35724O3163D1538
10879B3124J93326H7515h3238l25604b3570r4263B8034b11581j77321D9518J73174
10868B22692b34285B9933Q3991B1604Q7250b93345L5681A81815a90630l2463I9265
10856E6920J68461a40588B01315c7046j40712d8371n83333F9579J11245f43201
10845B41198a93885A06454K43412a5672A04754b75026k0734a46249j87264i9631
10834B9480c5614j92437b8826E7326d0166o546B20512b51696B54624F959K87010
10823B93969F6079J07069a39661B65283A6027b58183J15503F0035b11062P6823
10813a34239H8535L10545j28654a39263j71418p7238a58356B2365K61777h0007
$$ y = [-41298, -116310, 16808, -32963, -177337, -437962, -17388, -29030, 125178, -135724, -72561, 41538, 23124, 216450, 87515, -83238, -408842, -23570, -117833, 28034, -211581, -388902, 49518, 222692, -234285, 29933, 113924, 21604, 108854, -293345, -257664, 181815, -190630, -223093, 99265, 56920, 225381, -140588, 201315, -37046, -177758, -48371, -631704, 69579, 180824, -643201, 241198, -193885, 106454, 349866, -15672, 104754, -275026, -295760, -146249, -333513, -99631, 29480, -35614, -228051, -28826, 57326, -40166, -46712, 220512, -251696, 254624, 6959, 293969, 66079, 173148, -139661, 265283, 16027, -258183, -142680, 60035, -211062, -134239, 88535, 399080, 270426, -139263, -310681, -387919, -158356, 22365, 284142, -80007]
10802g2053A8245b21464r6491B11174C4162d97133I9947J0041N0630a70328K7554
10791a42774b8898E7197Q1142Q7552B1833b17733a06394d3908j98589Q5473g4920
10779D5973c39294E4164J0632B2168b09001n829c0997B03643a09843K2042H8321
10767a22731o9798k22916C32162f9874k95853a52206j1655N6984o7929K5125d6202
10755b22711k127B03705a25600p4063g3127p8339A36205n514E627J86494H6965
10743A51227b89950J25113F2675A2818K7274K16882C8522b57117C5294c14152
10732A11971M1429a262k9620l00976A7472a41772B7797f1924B86903A06023a30502
10720a27991n381B02341F0559J50329I5001B0067b16601j35860A5427d60736b10394
$$ y = [-72053, 18245, -221464, -317955, 211174, 34162, -497133, 99947, 109988, 160618, -170328, -142774, -28898, 57197, 138339, 225891, 21833, -217733, -106394, -43908, -242497, -157024, -74920, 45973, -339294, 54164, 64796, 22168, -209001, -214830, -30997, 203643, -109843, -87801, 88321, -122731, -192529, -415445, 332162, -69874, -365727, -152206, -163861, -106877, -174806, -149681, -46202, -222711, -224838, 203705, -125600, -199663, -73127, -151466, 136205, 130691, 5627, 192121, 86965, 151227, -289950, -164837, 62675, 12818, 40092, 256974, 38522, -257117, 35294, -314152, 111971, 153400, -1262, -30882, -331858, 17472, -141772, 27797, -61924, 286903, 106023, -130502, -127991, -133372, 202341, 60559, 210888, 95001, 20067, -216601, -352461, 15427, -460736, -210394]
10708H3597g0607j5268m7745D4774J17145K10184a41020K3367j62036K4062d4739
10696B12295R993a72646j70570d5214b0154A14380c29696G8314b45632h2966C4308
10684a26346e945j21797A1975b33375B1039F789b7364k49835A31092i7539A48081
10672a59286d8470j86866i1183A7704a42758a5155j50105j10685A14486b3625
10661B57116F517a54469B44132A8788h8991k57640c8492A16238b69291R2591A27243
10649c59175a25700l0691L9226C30701G5647g4297B31035p3893f4379j71266N6134
10638a79511K1560A99962a71636Q319J6595A10982d19997D13096b16951A54913
10627i3490E13608c00884A52707c22444l5697r1539c51k86796D9796c97375A68
$$ y = [83597, -70607, -85875, -133620, 44774, 161919, 372103, -141020, -117653, -279689, -255627, -44739, 212295, 222288, -172646, -343216, -45214, -20154, 114380, -329696, 78314, -245632, -82966, 34308, -126346, -5945, -127742, 11975, -233375, 21039, 6789, -27364, -277199, 131092, -97539, 148081, -159286, -48470, -235336, -91183, 17704, -142758, -15155, -165260, -275945, 114486, -23625, 257116, 6517, -154469, 244132, 18788, -88991, -346631, -38492, 116238, -269291, -176700, 127243, -359175, -125700, -156391, -117165, 330701, 75647, -74297, 231035, 157142, -64379, -235645, -179511, -157951, 199962, -171636, -163317, -146722, 110982, -419997, 413096, -216951, 154913, -93490, 513608, -300884, 152707, -322444, -358141, -449680, -351, -287147, 49796, -397375, 168]
10615A67023D7232O5607A0896N8118j0122K22794j18647J24965c91760A40363
10604c29268h7273k59326A83893r1191D0753J69843m4584j5545g4093L6054m80311
10593e18350J89619R7128A59989a17720r7087J2876B3546e6823o4945p9809O0890
10582a40687o0230A60745b53286O9038q6346A04589J77553A09558D7428K01209
10572B48637e7801m47289I9086j7275J38142a832D5998J03398J68345G1438a38590
10560h1464k19536A47867L4226H6351C1179K86649a31835A47320E1413j110J7079
10549F7382L2918i7639A85550b53284k11184C59791b83150R2706O0089O2114J5968
10538e2273p0388B25182e3742J5332A24477C2806a5561n1584j2187r041j4543
$$ y = [167023, 47232, 112839, 10896, 69014, 58892, 281686, 163039, 288004, -391760, 140363, -329268, -87273, -346599, 183893, 92702, 40753, 210596, 166012, 150467, -74093, -38039, -518350, -328731, -231603, 159989, -117720, -214807, -201931, 23546, -56823, -121768, -201577, -140687, -200917, 160745, -253286, -184248, -270594, 104589, 282142, 109558, 47428, 248637, -57801, -505090, 99086, 81811, 219953, -1832, 45998, 149396, 317741, 71438, -138590, -81464, -301000, 147867, 182093, 86351, 31179, 317828, -131835, 147320, 51413, 50303, 67382, 100300, -97639, 185550, -253284, -464468, 359791, -283150, -190444, -130355, -68241, -52273, -122661, 225182, -53742, -38410, 124477, 32806, -15561, -67145, -79332, -88373, -102916]
10527a02916r4180A19475a70046e9961B53714J16773a08810c8228j53897c3168
10516A37108f70A41818B6102b20002A88754D896d80747b20054G4803J2827c701
10504c26274A09306e6877r3861j14012a29943j55104O7164R7896C18703E8576
10493B9565L5869b24723C03575a10673J4455o193r4186A16314a16251l07243e6220
10481E7819b74379A34587a25962d5922f124A26346O40593C06181K98174B09277
10470B41144r1092b14826f9711j30648G107J97091P3928i9205p1004D6473K88047
10459C34520E8523K4415a6571j45370j3133A13147m0182a89368A429b06180p2647
10448b78827N7870k2409N8824D0570b97548f3390k2215j06640B3766P68b13775
$$ y = [-102916, -197096, 119475, -170046, -59961, 253714, 370487, -108810, -38228, -192125, -33168, 137108, -670, 141818, 26102, -220002, 188754, 4896, -480747, -220054, 74803, 87630, -3701, -326274, 109306, -56877, -150738, -264750, -129943, -285047, -217883, -119987, 318703, 58576, 29565, 65434, -224723, 303575, -110673, -96218, -102411, -196597, 116314, -116251, -423494, -56220, 57819, -274379, 134587, -125962, -45922, -6124, 126346, 766939, 306181, 604355, 209277, 241144, 150052, -214826, -69711, -200359, 7107, 204198, 278126, -99205, -170209, 46473, 334520, 58523, 82938, -16571, -161941, -175074, 113147, 72965, -189368, 1429, -206180, -278827, -220957, -243366, -184542, 40570, -297548, -63390, -85605, -192245, 23766, 24534, -213775]
10436i1407A69620a56557A02037b28745q697i9623d6741q4813O0166L0770H1569
10424G5870h6015k79366a13817N4903E6789j0626c8890F812K043J0394b02232
10412c31555a1018k58140j60824J58473B2742b74759F8194b35449H0875J13514
10402A94389a31572E8961j1866a14018F6181a20301g67j84934A27280O9592i6362
10390e4734F2526K10585l4901M5193C5410a86756b820j13241M2648k06859C45610
10378B75842A05120k7937K94713j19340K36558a00290A17200Q7456N5613J47729
10368D07998j4690P4768j9556J74062K036B04889N25658O2448k11634B40939A01388
10356A18940K52987Q3539F2700L85319q8476A34378K82165J21787L0336L63083
$$ y = [-91407, 169620, -156557, 102037, -228745, -237442, -99623, -46741, -131554, -71388, -40618, 81569, 75870, -86015, -365381, -113817, -58914, 56789, 46163, -38890, 6812, 8855, 19249, -202232, -331555, -11018, -269158, -429982, -271509, 22742, -274759, 68194, -235449, 80875, 194389, -131572, 58961, 47095, -114018, 66181, -120301, -767, -185701, 127280, 196872, -96362, -54734, 62526, 273111, 238210, 283403, 35410, -186756, -2820, -116061, -73413, -280272, 345610, 275842, 105120, 77183, 371896, 252556, 489114, -100290, 117200, 204656, 260269, 407998, 393308, 468076, 448520, 622582, 624618, 204889, 730547, 792995, 581361, 240939, 101388, 118940, 371927, 455466, 62700, 448019, 359543, 134378, 416543, 538330, 568666, 931749]
10346I31749l32143k91105P6512Q5931I9887L22357L42414l04972j99378A03678
10335A43535K6048K91008B10435A01629J94225J30771I3362b32950f2920D0608
10324b09250A26006h12C17148a1236E11105B28647r6918L57160A62749J7208J16379
10313B96336j3334G6328e1109A61140d3677C10249a25268A52452J49436h5388
10302b01894L0795e001C0557c47950B25265a74882g3548C68594A26120C0421c03366
10290D7229a87614j3973A26184J46282d17967a69402r1163A19925d2090C1487
10279B00200f9733l4558j4647m1601M4267d4517j28501c5696A68264b966A98822
10267a90161L2178I8654b70458e0464A14711f9276A61228a06110L4590p3992p2515
$$ y = [931749, 599606, 308501, 385013, 470944, 99887, 422244, 764658, 459686, 260308, 103678, 143535, 169583, 460591, 210435, 101629, 295854, 426625, 93362, -232950, -62920, 40608, -209250, 126006, -812, 317148, -11236, 511105, 228647, 131729, 488889, 162749, 179957, 296336, 283002, 76328, -51109, 161140, -43677, 310249, -125268, 152452, 301888, -85388, -201894, -171099, -5001, 30557, -347950, 225265, -174882, -73548, 368594, 126120, 30421, -303366, 47229, -187614, -201587, 126184, 272466, -417967, -169402, -260565, 119925, -42090, 31487, 200200, -69733, -104291, -118938, -160539, -116272, -44517, -173018, -35696, 168264, -2966, 198822, -190161, -157983, 98654, -270458, -50464, 114711, -69276, 161228, -106110, -71520, -145512, -218027]
10256b18027A14521C7477J45633J09419j10040K40491K40812C19603I6649K15801
10246C12450a44935B09105d6751B59108g6253C68537b12063j21879J65470b2986
10235a20391E1302a53844O1132j31457j95820A74387c78l3703r2548q5740c6680
10223c54041a61241A87390Q025A0377P5436m0500K58651h2064o1359d6434d598
10211B87376b71037B99210C7504b6479j81941I452b31849a08637B53206c66470
10200c98944G0427a5016O100A18250n1768a13214a9050k37464D49573f0619J4144
10189d6475n7163k5726M0353B18860A6563a38896p3229c3808A71604c7237r7947
10178a35184b0107j8585E7117d6070j15253q9891d2577m8155o8480m9541B6534
$$ y = [-218027, 114521, 37477, 183110, 292529, 182489, 422980, 663792, 319603, 96649, 312450, -144935, 209105, -46751, 259108, -76253, 368537, -212063, -333942, -168472, -22986, -120391, 51302, -153844, -92712, -224169, -419989, 174387, -378, -34081, -126629, -212369, -36680, -354041, -161241, 187390, 195415, 10377, 85813, 45313, 303964, -82064, -143423, -46434, -4598, 287376, -271037, 299210, 37504, -26479, -208420, 9452, -231849, -108637, 253206, -366470, -398944, 70427, -15016, -8916, 118250, 66482, -113214, -19050, -256514, 449573, -60619, -46475, -103638, -129364, -89011, 218860, 16563, -138896, -212125, -33808, 171604, -37237, -135184, -20107, -38692, 57117, -46070, -161323, -251214, -42577, -90732, -159212, -208753, 26534]
10166a74643N3564l61641a68007l9645b0685m6630F7275b57050D10373H1604K523
10155H4127i8450A20909K8210d39201A98645A546b47922J07130A41029a05095
10144c62981g041l3231m1717j37037k7295h1831j64755A98718d02589I1169d5432
10132h8405L8750j32507B1376g8599l58860A02730b66434H3215a47231C1970a9167
10120c01778A74105c37059e1988k69139a56974c535k73323j42616a73765q8018
10110b61783a8526B72602b67748B7044J44318b10645A0565g0797m9640b4829j33371
10099a58200B06841m5172c6241B01533a97879d8096k55251L5198j33189a16460
10088h9328k6941a5337k10183A85021a20476b5342l22347J48694f5705D2726b13291
$$ y = [-174643, -121079, -482720, -168007, -207652, -20685, -67315, 67275, -257050, 410373, 81604, 84127, -98450, 120909, 149119, -439201, 198645, 1546, -247922, -140792, 141029, -105095, -362981, -7041, -40272, -81989, -219026, -246321, -81831, -246586, 198718, -402589, 91169, -45432, -88405, -49655, -182162, 21376, -78599, -437459, 102730, -266434, 83215, -147231, 31970, -19167, -301778, 174105, -337059, -51988, -321127, -156974, -3535, -276858, -419474, -173765, -261783, -18526, 272602, -267748, 27044, 171362, -210645, 10565, -70797, -120437, -24829, -158200, 206841, 161669, -36241, 201533, -197879, -48096, -303347, -268149, -401338, -116460, -89328, -116269, -15337, -225520, 185021, -120476, -25342, -347689, -198995, -65705, 42726, -213291]
10076a17825a9191j43995f7122G9129a77533n3580H8838J11691c48849a45877
10065d6081B16853a88458K9735A86705q6247a52244A0013b36122a10461A82474
10054H0550e0290G6254a99801H0738b07442g3783q2187N3064j2105a4501j8780
10043c3281A83502c43655a07175q7774C6529J47062i0687A00476a15686f279B7401
10031b43154A74278L37224a12453G6626P1275B7764o025d9546F5596a44709A40534
10019h7813C2347N7323a04742l0260c9364j43621K2951A04352k2874L983a65859
10007a11937D2360b17562n9338N0282c9495k77573i5646p9249f2311j19046d9175
9995C25257A5042J7791d90151b7723A68576a42729J3717A31043A6481a15809c8042
$$ y = [-117825, -19191, -163186, -67122, 79129, -177533, -231113, 88838, 200529, -348849, -145877, -46081, 216853, -188458, -158723, 186705, 100458, -152244, 10013, -236122, -110461, 182474, 80550, -50290, 76254, -199801, 80738, -207442, -73783, -155970, -102906, -115011, -14501, -33281, 183502, -343655, -107175, -194949, 36529, 183591, -90687, 100476, -115686, -6279, 27401, -243154, 174278, 511502, -112453, 76626, 147901, 27764, 21739, -49546, 65596, -144709, 140534, -87813, 32347, 89670, -104742, -135002, -39364, -182985, -160034, 104352, 81478, 85461, -165859, -111937, 42360, -217562, -276900, -226618, -39495, -317068, -95646, -174895, -62311, -181357, -49175, 325257, 15042, 32833, -490151, -27723, 168576, -142729, -129012, 131043, 16481, -115809, -38042]
9983b51009l4412J19829M6510A02940a17661j96089H0460a4166o2534j5393q3430
9972a75523N5193e9272A26347o1500a9796A38984m6804b20851R7920M7240l7132
9961a12823B08018d37889C1920C974b45094a10861K3940k71582a19727n8543e7867
9949B7687D644b172j19434j13561B489d1435j1499K2767C3128e7342j4263D8071
9936a2407q4442l87K4081b131A15031b56905j07558c5329k15425H0868b23113
9924C2043f1250q1872a0330l47046O0802J40418F9575b46890h9379c5871B03781
9912G9348a63622J5809A33374J3667j9512a23395n2022B00537e8328A84671a64318
9900b56399A15681J2177C0948d5057m0123F3275M4123h1010k02929K8375l860
$$ y = [-251009, -285421, -165592, -119082, 102940, -117661, -313750, 80460, -14166, -76700, -92093, -175523, -120330, -59272, 126347, 64847, -19796, 138984, 92180, -220851, -122931, -75691, -112823, 208018, -437889, 31920, 3974, -245094, -110861, -86921, -358503, -119727, -178270, -57867, 27687, 4644, -2172, -121606, -235167, 2489, -41435, -52934, -30167, 33128, -57342, -71605, 48071, -12407, -96849, -97236, -73155, -2131, 115031, -256905, -364463, -35329, -250754, 80868, -223113, 32043, -61250, -143122, -10330, -357376, -296574, -156156, 69575, -246890, -89379, -35871, 203781, 79348, -163622, -147813, 133374, 147041, 127529, -123395, -175417, 200537, -58328, 184671, -164318, -256399, 115681, 127858, 30948, -45057, -85180, 63275, 107398, -81010, -283939, -255564, -259424]
9889b59424F1535a38125B7896b82404b3516j87381A06791b40434D4933i5911c9532
9877h7148p5743N5086k1364p2922A83539i2421j98280a05736c5327q8417D8028
9865b13761J8378n2554O3701C0500b102l1058o8648k71283b6081I3362c6081j50202
9853a86283A42709J1847j4036J1169M7788c50806O8767d0508A27581K6112d38701
9841B02055a31926k6239g0641b1300d597B57566f5390l5319B63414h9141B30873
9829b59313B31123a49346e0116j10247M1307k00160e7386k6587j56458f8952j1874
9818h0826p8218H0052J1540J06242c20499d6479K2610A7211O8778g9348E8122
9806b77388a1409B44121C5804b49801g4570I9800M7694c54071A52414b7145a2487
$$ y = [-259424, 61535, -138125, 27896, -282404, -23516, -210897, 106791, -240434, 44933, -95911, -39532, -87148, -162891, -107805, -129169, -202091, 183539, -92421, -290701, -105736, -35327, -123744, 48028, -213761, -195383, -247937, -184236, 30500, -2102, -33160, -101808, -373091, -26081, 93362, -36081, -186283, 142709, 154556, 140520, 151689, 199477, -350806, -282039, -40508, 127581, 153693, -438701, 202055, -131926, -158165, -70641, -21300, -4597, 257566, -65390, -100709, 263414, -89141, 230873, -259313, 231123, -149346, -50116, -160363, -119056, -319216, -57386, -83973, -240431, -68952, -80826, -159044, 80052, 91592, 197834, -320499, -46479, -23869, 17211, 85989, -79348, 58122, -277388, -11409, 244121, 35804, -249801, -74570, 99800, 147494, -354071, 152414, -27145, -12487]
9794g7239j3716A92272a22792l60077a84408b7425j55953d4207A21194n3792a79525
9782b02273B47518a04376j14436J1983A41650j6483a27595q2346h0911C2084b20009
9770a48947b634C5798b01184B79212b67368a28142I852c37207a01859b4556k12809
9759b37365C5616d60553b7565a0179k07751J06852J2603K797j95563F7493D380
9747c78199b5073D41987a03358A4032a37915I2823c33756d8045C11504b67155
9736c07990J23524P1282M784C01960a32801b5546n17944H7993L8243h0023o3782
9725a43805F83a9690j58072c9862D8171a86979g3928j45365d1378I1196b57306
9713a27315A02704B0872c3433A24149f1439A57813g8197L0477m6465q8370A4437
$$ y = [-77239, -90955, 192272, -122792, -482869, -184408, -27425, -183378, -44207, 121194, 67402, -179525, -202273, 247518, -104376, -218812, -206829, 141650, 125167, -127595, -209941, -80911, 32084, -220009, -148947, -2634, 35798, -201184, 279212, -267368, -128142, 9852, -337207, -101859, -24556, -237365, 35616, -460553, -27565, -10179, -217930, -111078, -98475, -95678, -291241, 67493, 4380, -378199, -25073, 441987, -103358, 14032, -137915, 92823, -333756, -48045, 311504, -267155, -307990, -184466, -113184, -108400, 301960, -132801, -25546, -543490, 87993, 126236, -80023, -143805, 683, -19690, -177762, -39862, 48171, -186979, -73928, -219293, -41378, 91196, -257306, -127315, 102704, 20872, -33433, 124149, -61439, 157813, -78197, -47720, -94185, -182555, 14437]
9701a02097A77198b55604A36536b09391e091n9312e37j8221D468L8413b56227
9689A32669a58264G5491J69468n6676c8595o4016o7128H6085J10515b30453G7894
9677d24998a2157m70169B08713b22035j26954a56929c1688k14507A20090i6589
9666a49696p901L8621j72990h1920n2229j74319O9993a17533B55334i408I4658
9654h7035C1305K9479P7539b10348l0293J08333B07174a77836D6266J84060a36628
9642a44445B30941e133G906b7443j30812K0639k36337J61071e1463a0893D543
9630i2035b4142m5079E0509J02267d59501B98345D489a17848l39719D0503a21982
9618A32775J36090a4833B5631b73091O7804A13312A5157c7196j49194C3588a03451
$$ y = [-102097, 177198, -255604, 136536, -209391, -5091, -64403, -537, -18758, 4468, 42881, -256227, 132669, -158264, 75491, 244959, 188283, -38595, -102611, -169739, 86085, 196600, -230453, 77894, -424998, -12157, -482326, 208713, -222035, -348989, -156929, -31688, -246195, 120090, -96589, -149696, -157597, -118976, -291966, -81920, -134149, -308468, -238475, -117533, 255334, -9408, 94658, -87035, 31305, 60784, 138323, -210348, -240641, -132308, 207174, -177836, 46266, 230326, -136628, -144445, 230941, -5133, 7906, -27443, -158255, -137616, -373953, -212882, -51463, -10893, 4543, -92035, -24142, -69221, 50509, 152776, -459501, 298345, 4489, -117848, -457567, 40503, -121982, 132775, 268865, -14833, 25631, -273091, -205287, 113312, 15157, -37196, -186390, 33588, -103451]
9606e7678h866E6414b48168J04368R969N9411K4495n8680A31555f6265b5282B74126
9593a20922A46538a72245A17993b44311a03342K2632l5247j1451k487j39587c6185
9581A52613h8196A17586g4045j57015J07495B21963h5972l77823J94960P6044
9571a92791A1453e0980A84017a66806A8339J69896a57484A54349A1a180k71336
9560b72516h0118B43637m4487b10792h8744B03482p4717j4819d4980B21189g4036
9548b73406P892K4223i5495n2708f3799c0562j46682A02756a13373o9397k5542
9537b08312o6475G655O6705g8646A66858i5521c1038A5882h2033R331B05210p0950
9525A34260e5584j75087R2723J1965j242p672B96122e0154B6054b88379C07484
$$ y = [-57678, -8866, 56414, -248168, -143800, -133831, -74420, -49925, -108605, 131555, -66265, -25282, 274126, -120922, 146538, -172245, 117993, -244311, -103342, -80710, -115957, -127408, -129895, -269482, -36185, 152613, -88196, 117586, -74045, -231060, -123565, 221963, -85972, -463795, -268835, -192791, 11453, -50980, 184017, -166806, 18339, 188235, -157484, 154349, 11, -1180, -272516, -80118, 243637, 199150, -210792, -88744, 203482, 128765, 113946, -44980, 221189, -74036, -273406, -265514, -241291, -95495, -148203, -63799, -30562, -177244, 102756, -113373, -182770, -208312, -274787, 7655, 74360, -78646, 166858, -95521, -31038, 15882, -82033, -72702, 205210, 134260, -55584, -230671, -137948, -125983, -127225, -134897, 296122, -50154, 26054, -288379, 307484]
9513A81306F2497c50506f8821k26305j74819E8885A6174J41448a22652L8840A07316
9501d12486J50795i054m7869k17237R4152j06393I5993d0889j05335B2715a28113
9489F7984k4419a42497a6826k66851B92750b52283j3575g742A66897b34478b0131
9477h6171J1547j31632C14526b39907j88879a8158j61144G0013d15166A08289
9466c95958a6521n9393o3588e4931E2014J03873b66376F5221b24566k3798F2499
9454a58519J191B02414I4166b87199a8906p6617A85309b85672B1088b78163Q8018
9443a90145K2862q6585E7513c1565l49222D0541A3738m218E24N5924E592R975
9431A5567b84221h7049L6664j16349A20758b5614k86602m1336a45596L9021D1350
$$ y = [181306, 62497, -350506, -68821, -295126, -469945, 58885, 16174, 157622, -122652, -83812, 107316, -412486, -261691, -9054, -56923, -274160, -180008, -286401, 95993, -40889, -146224, 22715, -128113, 67984, 43565, -142497, -16826, -283677, 292750, -252283, -265858, -7742, 166897, -234478, -20131, -86171, -74624, -206256, 314526, -239907, -428786, -18158, -179302, 70013, -415166, 108289, -395958, -16521, -75914, -139502, -54931, 52014, 155887, -266376, 65221, -224566, -248364, 62499, -158519, -157328, 202414, 94166, -287199, -18906, -95523, 185309, -285672, 21088, -278163, -190145, -167283, -253868, 57513, -31565, -380787, 40541, 13738, 9520, 524, 56448, 5592, 15567, -284221, -87049, -50385, -166734, 120758, -25614, -312216, -353552, -145596, -106575, 41350]
9419F0767d1481C81134A32417K63694a34872e8529C78g6081c7532H3846c43925
9407I2646m5568Q0508a5298D6487J11797b09652q296J01177e068k9956k9414E2866
9394d47375E3540P4355h3812j30355c6161j15937n134M5396e0533a8558I0080
9382a95564b9142C9055d0014j07058A9368c49224J33551b6729k60346f5781G9140
9370a62083l9054H145K51411n898c30890I0124N486a5823k97138a37532q1421
9359b18953R0399m9990J6247H315g1408k4952B45098d6696r4847H8134k4361f331
9346b51316c0979A62769d0578m7682B3598c88262A32252b86580D6538a86850A404
9334B35460b10796A27869a98088j78907B04427a26l24508g2452E3365R9163q903
$$ y = [60767, -41481, 381134, 132417, 396111, -134872, -58529, 378, -76081, -37532, 83846, -343925, 92646, 47078, 127586, -15298, 46487, 158284, -209652, -217948, -116771, -5068, -35024, -64438, 52866, -447375, 53540, 127895, -83812, -214167, -36161, -152098, -157232, -111836, -50533, -18558, 90080, -195564, -29142, 39055, -40014, -147072, 19368, -349224, -215673, -26729, -287075, -65781, 79140, -162083, -201137, 8145, 259556, 253658, -330890, 90124, 95610, -15823, -312961, -137532, -218953, -128554, -178544, -162297, 8315, -71408, -96360, 245098, -46696, -141543, 88134, 63773, -6331, -251316, -30979, 162769, -40578, -88260, 23598, -388262, 132252, -286580, 46538, -186850, 1404, 235460, -210796, 127869, -198088, -376995, 204427, -126, -324634, -72452, 53365, 152528, 143625]
9323A43625a34693b9013l06555O1462D7040J24154a78822P2743A0699L3569K85538
9312C29806d0332G8069a78443e8644o4813j52348f0654A20375j8951a70028N830
9301a64198j76957J31764D13554f0320j00656A95992a63880Q0091J2010o7303
9291a39082b8487o06346i2367j25349a0155j54707q1313j47399J41260G7482B4235
9279b41196a14357j58692A6204b30358B9329o922K46439a34j49577o1107P7329
9268a33489N4160n4022c8978B71908c1572B67594d5468k40023a14925e4402n0606
9257a05008l49946J88286A53682h3976p5054A98554h3707K4352A89324c79695
9246B2134b50406D4926b3794n4653j14775A11871k7599k8080i7808j68202b8429
$$ y = [143625, -134693, -29013, -335568, -274106, 47040, 171194, -178822, -106079, 10699, 44268, 329806, -40332, 78069, -178443, -58644, -123457, -275805, -60654, 120375, 101424, -170028, -164198, -341155, -209391, 413554, -60320, -160976, 195992, -163880, -83789, -71779, -139082, -28487, -634833, -92367, -217716, -10155, -164862, -246175, -393574, -252314, 77482, 24235, -241196, -114357, -273049, 16204, -230358, 29329, 22407, 268846, -134, -149711, -210818, -133489, -79329, -133351, -38978, 271908, -31572, 267594, -45468, -285491, -114925, -54402, -105008, -454954, -266668, 153682, -83976, -159030, 198554, -83707, -59355, 189324, -379695, 22134, -250406, 44926, -23794, -78447, -193222, 111871, 84272, 56192, -97808, -266010, -28429]
9234d78242h0884B04943b41071m4691Q3213G6503a24225N8569n5972E508e3063
9222B61640h9872q3736f0978m0438j27318A45138e2904H6344e0208j22053f7081
9210A40466a906k66748g4034j61803P5931A3001J02088n4320M08527A20619n5148
9199F5471l0308d27972a41146d3047k5645j21190A54135a11997o4814g3941l0976
9188a04917a6295P048G7570R5574o7561a48777k0592b7332q9764m343k1628B49672
9175b92932i2595j25973D181O8300J03703b5845a302j44300j92867E0454d4161
9163i2532j34285K5031e0841r8612B5760O5554a4633k27477D35932A07380n2063
9152E5317e3839H4310C7133b74227M0250P3512F5512b65595h2729J7544n1319
$$ y = [-478242, -80884, 204943, -241071, -285762, -202549, 76503, -124225, -65656, -121628, 5508, -53063, 261640, -89872, -173608, -60978, -101416, -228734, 145138, -52904, 86344, -50208, -172261, -67081, 140466, -1906, -268654, -74034, -235837, -159906, 13001, 115089, 60769, 469296, 120619, 65471, 35163, -427972, -141146, -43047, -68692, -189882, 154135, -111997, -176811, -73941, -104917, -16295, -9247, 77570, 173144, 105583, -148777, -169369, -27332, -117096, -121439, -143067, 249672, -292932, -92595, -218568, 4181, 72481, 176184, -25845, -1302, -145602, -338469, 50454, -44161, -92532, -226817, -201786, -50841, -149453, 25760, 91314, -14633, -242110, 435932, 107380, 55317, -53839, 84310, 37133, -274227, -233977, -160465, 65512, -265595, -82729, -65185, -116504]
9141a16504e918C6704a12923A19544c4332B00124d23522A25990e2399k51928B57483
9129A21705a11974C9279j6960b94359F8215a43705B02231a63314e8894j93295
9119b52189F7923F979b96005a4929k08564P0211P970j41724N3185a3641A77993
9107e8975m4412A67642G6732o884B7601c1724j49651q3368g598k79232G5537N4229
9095A29766B6180d1687B34145O2119C9453J89625e6947B09179I5819K489d30941
9083d9761j32492A15851b18436B2297M5240b12694A09372d69334K25650p8674
9073c22358J03638C1943d0054D9653f6445m989C37657b48667k20490a57347H8845
9061a2898j87497j13460F1269b52697B0199a34495a3221G2455b6953B7231a46804
$$ y = [-116504, -5918, 36704, -112923, 119544, -34332, 200124, -423522, 125990, -52399, -304327, 257483, 121705, -111974, 39279, 22319, -294359, 68215, -143705, 202231, -163314, -58894, -252189, 67923, 6979, -296005, -14929, -223493, -153282, -145312, -287036, -233851, -13641, 177993, -58975, -103387, 167642, 76732, 69848, 27601, -31724, -181375, -264743, -7598, -286830, 75537, 129766, 26180, -41687, 234145, 296264, 39453, 229078, -56947, 209179, 95819, 98308, -430941, -49761, -182253, 115851, -218436, 22297, 67537, -212694, 109372, -469334, -243684, -322358, -218720, 31943, -40054, 49653, -66445, -71434, 337657, -248667, -469157, -157347, 88845, -12898, -200395, -313855, 61269, -252697, 20199, -134495, -13221, 72455, -26953, 27231, -146804]
9049d2228B6064L8091i2770r1585K691N9381M2402k26788a21419j4659K0842B04560
9036a53179j17218g8774F9331c35742i2450k92521J62313A95278d87235K41913
9026b45322e523l67685A4080K82301a0125H6473a71551o4701M8862C1235d5345
9014b25816J12395C84539I2727g7317o3843j07393R5863a9077k98833b3482B01754
9002G6286a53758A33225m4522c21663B1413h6084r3351j68099m8517J43353E5489
8990B82745o8401a81374l3162R8163N4978k7706A42990C486a83036b6614j29653
8979a56267a9268B85833H539M4830d9309m07989a43452k104k87709a30452C86290
8967f9224B10605c29050C9149L00145b2672j47563c8446J3125m50379C96646i2331
$$ y = [-42228, 26064, 64155, -92770, -184355, -181664, -122283, -79881, -306669, -121419, -136078, -115236, 204560, -153179, -270397, -78774, 69331, -335742, -92450, -384971, -222658, 195278, -487235, -245322, -5523, -373208, 14080, 296381, -10125, 86473, -171551, -236252, -187390, 31235, -45345, -225816, -113421, 384539, 92727, -77317, -141160, -248553, -152690, -19077, -317910, -23482, 201754, 76286, -153758, 133225, 88703, -321663, 21413, -86084, -179435, -347534, -396051, -252698, 55489, 282745, 214344, -181374, -214536, -116373, -61395, -89101, 142990, 3486, -183036, -26614, -156267, -19268, 285833, 8539, 53369, -49309, -457298, -143452, -145556, -433265, -130452, 386290, -69224, 210605, -329050, 39149, 339294, -22672, -170235, -38446, -25321, -475700, 396646, -92331]
8955a8700j40387A6483a53618J6668j17146A3910K58339a67979H2213B6751Q0597
8944A07348f8862f330k6215l40164G4000N8251a37202A31353f0838G778e94B19290
8931B37538h5939r7137a510j98314A08600i5066A74683e1911B84739L27461Q31475
8920A443675K945611Q078640C596659G54752k09288B67659j28925K53940q4943
8911C07731j07467I4981a91238H0473K54309r6804D7150L32402j45775a13270
8900e2947g323H2415a16661N5916A02652M5877a09019A88990d567l40265i1093
8888A72095n5398N630e4435l6319c4760j5323p3191A33726D1416b08318C8124
8876b82566a26851A2479a09931j3213E9785c13677Q0924f9135I6700J00348i6727
$$ y = [-18700, -159087, 16483, -153618, -136950, -254096, 13910, 272249, -167979, 82213, 26751, 107348, -68862, -6330, -32545, -372709, 74000, 132251, -137202, 131353, -60838, 7778, -594, 219290, 237538, -85939, -183076, -1510, -199824, 108600, -95066, 174683, -51911, 284739, 612200, 1443675, 4389286, 12467926, 3596659, 754752, 545464, 267659, 138734, 392674, 307731, 200264, 94981, -191238, 80473, 334782, 237978, 47150, 379552, 233777, -113270, -52947, -7323, 82415, -116661, -60745, 102652, 148529, -109019, 188990, -4567, -344832, -91093, 172095, 116697, 122327, -54435, -90754, -34760, -50083, -123274, 133726, 41416, -208318, 38124, -282566, -126851, 12479, -109931, -123144, 59785, -313677, -232753, -69135, 96700, 197048, -96727]
8864a32447I4660J6561A7471f9395j2282j75320D311i0233l5723K8666j68107
8853b65397b3670k23384J15168G9537k8193N542g8529C6182c4863j33732A99265
8841f6329A79979b69044A85928a30536O1716r1080c0153A89742d2697q2549d5471
8829E1418c45405g3581A0467l682J98230a7534m575m6510C22493b3320A73294
$$ y = [-132447, 94660, 111221, 17471, -69395, -81677, -256997, 4311, -90233, -125956, -97290, -265397, -23670, -247054, -131886, 79537, 51344, 56886, -78529, 36182, -34863, -168595, 199265, -66329, 179979, -269044, 185928, -130536, -68820, -159900, -30153, 189742, -42697, -125246, -45471, 51418, -345405, -73581, 10467, 6785, 205015, -17534, -22109, -68619, 322493, -23320, 173294]
$$ [...]
##END NTUPLES=NMR SPECTRUM
##END=
