
##TITLE=AC1198_BRAAS12062_7165602_QtzWtNK4mk
##JCAMPDX= 6.0         $$ Bruker NMR JCAMP-DX V2.0
##DATA TYPE= NMR SPECTRUM
##DATA CLASS= NTUPLES
##ORIGIN= BRUKER
##OWNER= Administrator
$$ 1.72 TOPSPIN		Version 2.1
$$ 2012-12-02 02:18:45.366 -0500  Administrator@X
$$ Compression mode = diff/dup
##.OBSERVE FREQUENCY= 400.02188249412
##.OBSERVE NUCLEUS= ^1H
##.ACQUISITION MODE= SIMULTANEOUS (DQD)
##.ACQUISITION SCHEME= undefined
##.AVERAGES= 64
##.DIGITISER RES= 22
##SPECTROMETER/DATA SYSTEM= spect
##.PULSE SEQUENCE= noesygpps1d.comp
##.SOLVENT NAME= COFFEE_meoh
##.SHIFT REFERENCE= INTERNAL, COFFEE_meoh, 1, 14.96238
##AUDIT TRAIL= $$ (NUMBER, WHEN, WHO, WHERE, PROCESS, VERSION, WHAT)
$$ ##TITLE= Audit trail, TOPSPIN		Version 2.1
$$ ##JCAMPDX= 5.01
$$ ##ORIGIN= Bruker BioSpin GmbH
$$ ##OWNER= Administrator
$$ $$ E:\/data/COFFEE/nmr/AC1198_BRAAS12062_7165602_QtzWtNK4mk/12/pdata/1/auditp.txt
$$ ##AUDIT TRAIL=  $$ (NUMBER, WHEN, WHO, WHERE, PROCESS, VERSION, WHAT)
(   1,<2012-12-02 02:18:39.428 -0500>,<Administrator>,<X>,<go>,<TOPSPIN 2.1>,
      <created by zg
	started at 2012-12-02 02:07:09.067 -0500,
	POWCHK enabled, PULCHK disabled,
       configuration hash MD5:
       86 BA 57 50 F2 9D 5C 9B 26 00 A9 28 5F 66 2E 89
       data hash MD5: 64K
       70 29 2B FE C5 19 8B 48 7D 4C 1A 39 3B 56 DE FC>)
(   2,<2012-12-02 02:18:42.553 -0500>,<Administrator>,<X>,<proc1d>,<TOPSPIN 2.1>,
      <Start of raw data processing
       efp LB = 0.3 FT_mod = 6 PKNL = 1 PHC0 = 0 PHC1 = 0 SI = 128K 
       data hash MD5: 128K
       AA 09 03 96 56 67 EC 06 84 D7 DB FE AE A4 1B AB>)
(   3,<2012-12-02 02:18:43.600 -0500>,<Administrator>,<X>,<proc1d>,<TOPSPIN 2.1>,
      <pk PHC0 = -81.99646 PHC1 = 0 
       data hash MD5: 128K
       8E 53 2C FA 0C D8 26 88 6F E1 7A CD E8 7E 2B 2B>)
(   4,<2012-12-02 02:18:44.288 -0500>,<Administrator>,<X>,<proc1d>,<TOPSPIN 2.1>,
      <abs ABSG = 1 
       data hash MD5: 128K
       2C 59 DB 52 AA 1F 27 B4 1A 96 52 10 2D 92 58 7C>)
(   5,<2012-12-02 02:18:44.475 -0500>,<Administrator>,<X>,<proc1d>,<TOPSPIN 2.1>,
      <abs ABSG = 2 
       data hash MD5: 128K
       E6 07 CE 36 D5 36 8A E7 4B 0A 6B 7F E8 18 D3 A7>)
(   6,<2012-12-02 02:18:44.631 -0500>,<Administrator>,<X>,<proc1d>,<TOPSPIN 2.1>,
      <abs ABSG = 3 
       data hash MD5: 128K
       D3 65 64 E7 C7 48 B2 08 42 43 84 7F D0 5C EC 94>)
(   7,<2012-12-02 02:18:44.835 -0500>,<Administrator>,<X>,<proc1d>,<TOPSPIN 2.1>,
      <abs ABSG = 4 
       data hash MD5: 128K
       52 23 E4 6E 4F C6 DB 15 AB E6 68 01 C3 B7 18 A1>)
(   8,<2012-12-02 02:18:45.006 -0500>,<Administrator>,<X>,<proc1d>,<TOPSPIN 2.1>,
      <abs ABSG = 5 
       data hash MD5: 128K
       6C CA DC D2 D5 18 29 57 9D 0A A7 B5 CF 19 94 68>)
$$ ##END=
$$ 
$$ $$ hash MD5
$$ $$ AA CF D7 56 DE 72 41 0A A4 57 01 63 44 3D CA 38
##$RELAX= 
##$RELAX= 
##$RELAX= 
##$RELAX= 
##$RELAX= 
##$RELAX= 
##$RELAX= 
##$RELAX= 
$$ Bruker specific parameters
$$ --------------------------
##$DU= <E:\>
##$EXPNO= 12
$$ [...]
##$TP07= 0
##$TPNAME0= <>
##$TPNAME1= <>
##$TPNAME2= <>
##$TPNAME3= <>
##$TPNAME4= <>
##$TPNAME5= <>
##$TPNAME6= <>
##$TPNAME7= <>
##$TPOAL= (0..7)
0.5 0.5 0.5 0.5 0.5 0.5 0.5 0.5
##$TPOFFS= (0..7)
0 0 0 0 0 0 0 0
##$TUNHIN= 0
##$TUNHOUT= 0
##$TUNXOUT= 0
##$USERA1= <user>
##$USERA2= <user>
##$USERA3= <user>
##$USERA4= <user>
##$USERA5= <user>
##$V9= 5
##$VALIST= <valist>
##$VCLIST= <CCCCCCCCCCCCCCC>
##$VD= 0
##$VDLIST= <DDDDDDDDDDDDDDD>
##$VPLIST= <PPPPPPPPPPPPPPP>
##$VTLIST= <TTTTTTTTTTTTTTT>
##$WBST= 1024
##$WBSW= 4
##$XGAIN= (0..3)
0 0 0 0
##$XL= 0
##$YL= 0
##$YMAX_a= 8369405
##$YMIN_a= -17880339
##$ZGOPTNS= <>
##$ZL1= 120
##$ZL2= 120
##$ZL3= 120
##$ZL4= 120
##$ABSF1= 14.96238
##$ABSF2= -5.595801
##$ABSG= 5
##$ABSL= 3
##$ALPHA= 0
##$AQORDER= 0
##$ASSFAC= 0
##$ASSFACI= 0
##$ASSFACX= 0
##$ASSWID= 0
##$AUNMP= <proc_prof1d_extract.lims>
##$AXLEFT= 0
##$AXNAME= <>
##$AXNUC= <1H>
##$AXRIGHT= 0
##$AXTYPE= 0
##$AXUNIT= <>
##$AZFE= 0.1
##$AZFW= 0.1
##$BCFW= 0
##$BC_mod= 0
##$BYTORDP= 0
##$COROFFS= 0
##$CY= 15
##$DATMOD= 1
##$DC= 0
##$DFILT= <>
##$DTYPP= 0
##$F1P= 0
##$F2P= 0
##$FCOR= 0.5
##$FTSIZE= 131072
##$FT_mod= 6
##$GAMMA= 0
##$GB= 0
##$INTBC= 1
##$INTSCL= 1
##$ISEN= 128
##$LB= 0.3
##$LEV0= 0
##$LPBIN= 0
##$MAXI= 10000
##$MC2= 0
##$MEAN= 0
##$ME_mod= 0
##$MI= 0
##$NCOEF= 0
##$NC_proc= -2
##$NLEV= 6
##$NOISF1= 0
##$NOISF2= 0
##$NSP= 0
##$NTH_PI= 0
##$NZP= 0
##$OFFSET= 14.96238
##$PC= 1
##$PHC0= -81.99646
##$PHC1= 0
##$PH_mod= 1
##$PKNL= yes
##$PPARMOD= 0
##$PPDIAG= 0
##$PPIPTYP= 0
##$PPMPNUM= 2147483647
##$PPRESOL= 1
##$PSCAL= 4
##$PSIGN= 0
##$PYNMP= <proc.py>
##$REVERSE= no
##$SF= 400.020009083332
##$SI= 131072
##$SIGF1= 0
##$SIGF2= 0
##$SINO= 400
##$SIOLD= 131072
##$SPECTYP= <>
##$SREGLST= <1H.CDCl3>
##$SSB= 0
##$STSI= 131072
##$STSR= 0
##$SW_p= 8223.68421052631
##$SYMM= 0
##$S_DEV= 0
##$TDeff= 65536
##$TDoff= 0
##$TI= <>
##$TILT= no
##$TM1= 0
##$TM2= 0
##$TOPLEV= 0
##$USERP1= <user>
##$USERP2= <user>
##$USERP3= <user>
##$USERP4= <user>
##$USERP5= <user>
##$WDW= 1
##$XDIM= 131072
##$YMAX_p= 445340779
##$YMIN_p= -11968
##$CURPLOT= <Network HP LaserJet P1505>
##$CURPRIN= <$Network HP LaserJet P1505>
##$DFORMAT= <normdp>
##$LAYOUT= <+/1D_H.xwp>
##$LFORMAT= <normlp>
##$PFORMAT= <normpl>
##$SURQMSG= 1
$$ End of Bruker specific parameters
$$ ---------------------------------
##NTUPLES= NMR SPECTRUM
##VAR_NAME=  FREQUENCY,     SPECTRUM/REAL,   SPECTRUM/IMAG
##SYMBOL=    X,             R,               I
##VAR_TYPE=  INDEPENDENT,   DEPENDENT,       DEPENDENT
##VAR_FORM=  AFFN,          ASDF,            ASDF
##VAR_DIM=   131072,        131072,          131072
##UNITS=     HZ,            ARBITRARY UNITS, ARBITRARY UNITS
##FACTOR=    0.0627417313425164, 1,          1
##FIRST=     8223.62146879497, 1064,         -67263
##LAST=      0,             3572,            -67833
##MIN=       0,             -11968,          0
##MAX=       8223.62146879497, 445340779,    0
$$ Real data points
##PAGE= N=1
##DATA TABLE= (X++(R..R)), XYDATA
$$ [...]
63222H16997K8199K6413K4701K3337K2510K2182K2251K2735K3479K3897K3449
$$ 816997 845196 871609 896310 919647 942157 964339 986590 1009325 1032804 1056701 1080150
63211A080150K2189K0388J7752J3683Q246K088m520j1695j8926k5068k9677l3426
$$ 1080150 1102339 1122727 1140479 1154162 1162408 1164496 1159976 1148281 1129355 1104287 1074610 1041184
63199A041184l6725l8931l9477l8792l7390l4901l0925k6193k1908j8302j4711
$$ 1041184 1004459 965528 926051 887259 849869 814968 784043 757850 735942 717640 702929
63188G02929j0731o545k508R69L456N250P543J1040J4713J6899J7363J7374J7918
$$ 702929 692198 685653 683145 684114 687570 692820 700363 711403 726116 743015 760378 777752 795670
63175G95670J8858J9768K0567K1165K1335K1205K1178K1215K0804J9851J8840
$$ 795670 814528 834296 854863 876028 897363 918568 939746 960961 981765 1001616 1020456
63164A020456J7842J6098J3016R037N030J173l066q008j3262j8108k2111k5294
$$ 1020456 1038298 1054396 1067412 1076449 1081479 1082652 1079586 1071578 1058316 1040208 1018097 992803
63152I92803k7839k9688l0525l0254k9394k8644k8075k7045k5042k2408k0037
$$ 992803 964964 935276 904751 874497 845103 816459 788384 761339 736297 713889 693852
63141F93852j8367j6890j4734j1774q967p399p098p040o356n133l994l259k757
$$ 693852 675485 658595 643861 632087 623120 615721 608623 601583 595227 590094 586100 582841 580084
63128E80084k110r79O42K105K484J650O74P08J741K859L517L952M491N048N395
$$ 580084 577974 576995 577637 579742 582226 583876 584550 585258 586999 589858 593375 597327 601818 606866 612261
63113F12261N487N458N512N866O469O891O766O335O183O487O857O917O677O285
$$ 612261 617748 623206 628718 634584 641053 647944 654710 661045 667228 673715 680572 687489 694166 700451
63099G00451N717M935M073L319K702K079J312M49k30m53k91j00n9j8P4q8o84j275
$$ 700451 706168 711103 715176 718495 721197 723276 724588 725037 724807 724354 724063 723963 723904 723886 723960 723872 723188 721913
63081G21913j179k49J023K133K973L759M804O211P630Q460Q662R033J0252J1857
$$ 721913 720734 720485 721508 723641 726614 730373 735177 741388 749018 757478 766140 775173 785425 797282
63067G97282J2809J2974J3397J4867J6860J8312J9010J9759K1346K3798K6682
$$ 797282 810091 823065 836462 851329 868189 886501 905511 925270 946616 970414 997096
63056I97096K9644L2499L5041L7168L9188M1742M5103M8737N1806N4089N6023
$$ 997096 1026740 1059239 1094280 1131448 1170636 1212378 1257481 1306218 1358024 1412113 1468136
63045A468136N7840N9048N9136N8383N7582N7064N6407N5138N3331N1492N0066
$$ 1468136 1525976 1585024 1644160 1702543 1760125 1817189 1873596 1928734 1982065 2033557 2083623
63034B083623M9238M9020M9326M9931N0391N0056M8279M4639L8961L1195K1475
$$ 2083623 2132861 2181881 2231207 2281138 2331529 2381585 2429864 2474503 2513464 2544659 2566134
63023B566134J0223k093j5241k8977m2449n4356o3898p1241p6785q0415q1777
$$ 2566134 2576357 2574264 2559023 2530046 2487597 2433241 2369343 2298102 2221317 2140902 2059125
63012B059125q0905p8043p3148o6162n7746m9113m1024l3330k5612j7885j0537
$$ 2059125 1978220 1900177 1827029 1760867 1703121 1654008 1612984 1579654 1554042 1536157 1525620
63001A525620l828K276P954J3335J8436K3175K7430L1026L3713L5276L5811L5729
$$ 1525620 1521792 1524068 1532022 1545357 1563793 1586968 1614398 1645424 1679137 1714413 1750224 1785953
62989A785953L5369L4752L3818L2730L1675L0486K8696K5937K2112J7211J1230
$$ 1785953 1821322 1856074 1889892 1922622 1954297 1984783 2013479 2039416 2061528 2078739 2089969
62978B089969M254l475j1715k0343k9306l8386m7029n4576o0765o5797o9731p2000
$$ 2089969 2094223 2090748 2079033 2058690 2029384 1990998 1943969 1889393 1828628 1762831 1693100 1621100
62966A621100p1989o9999o7084o3893o0207n5743n0844m6015m1304l6627l2277
$$ 1621100 1549111 1479112 1412028 1348135 1287928 1232185 1181341 1135326 1094022 1057395 1025118
62955A025118k8650k5669k2890k0041j7188j4539j2429j1173j0589r972q862p603
$$ 1025118 996468 970799 947909 927868 910680 896141 883712 872539 861950 851978 843116 835513
62943H35513o832o683o895p369q136q969r559r905j0166j0216r828r184q766q800
$$ 835513 828681 821998 815103 807734 799598 790629 781070 771165 760999 750783 740955 731771 723005 714205
62929G14205r102r339r151q260o829n539m936m833m662m235l779l530l644m207
$$ 714205 705103 695764 686613 678353 671524 665985 661049 656216 651554 647319 643540 640010 636366 632159
62915F32159m853m729l492k018j530k165l024l446l496l329k934k561k588k822
$$ 632159 627306 622577 619085 617067 615537 613372 610348 606902 603406 600077 597143 594582 591994 589172
62901E89172k555j551l62M63R32J195J210J019Q68P73M47k16j021j950l141m211
$$ 589172 586617 585066 584704 585167 586099 587294 588504 589523 590391 591164 591611 591395 590374 588424 585283 581072
62885E81072m306l234j959j531j912k290k170j729j325j200j414j753j841j565
$$ 581072 576766 573532 571573 570042 568130 565840 563670 561941 560616 559416 558002 556249 554408 552843
62871E52843j205r64o86k72qr9k20j5K95K56p2k58k76m71q63j047r64j133j821
$$ 552843 551638 550674 549988 549716 549708 549609 549389 549374 549669 549925 549853 549595 549319 548848 547985 546938 545974 544841 543020
62852E43020k471k416j803j296j091q35m79n40j262k088k358k132j869j657j277
$$ 543020 540549 538133 536330 535034 533943 533108 532629 532089 530827 528739 526381 524249 522380 520723 519446
62837E19446q01n10l49j66l54j422k781k967j527Q5K14j069k406k990l090l064
$$ 519446 518645 518135 517786 517620 517266 515844 513063 510096 508569 508654 508868 507799 505393 502403 499313 496249
62821D96249k819k301j742j375j334j769k554l036k607j486m01L59R81J446J606
$$ 496249 493430 491129 489387 488012 486678 484909 482355 479319 476712 475226 474825 475184 476165 477611 479217
62806D79217J780K501L577M218M220M200M517M831N025N700P215Q970J0193J0932
$$ 479217 480997 483498 487075 491293 495513 499713 504230 509061 514086 519786 527001 535971 546164 557096
62792E57096J1700J2684J3854J5404J7408J9369K0750K1826K3392K5728K8398
$$ 557096 568796 581480 595334 610738 628146 647515 668265 690091 713483 739211 767609
62781G67609L1028L3849L7340M1705M6806N2434N8482O4902P1479P7780Q3526
$$ 767609 798637 832486 869826 911531 958337 1010771 1069253 1134155 1205634 1283414 1366940
62770A366940Q8941R4340R9304J02600J03164J00892R6328Q9899Q1633P1248N8274
$$ 1366940 1455881 1550221 1649525 1752125 1855289 1956181 2052509 2142408 2224041 2295289 2353563
62759B353563M2406K4156M919j3871l1525m7865o2563p5097q5150r2665r7660
$$ 2353563 2395969 2420125 2425044 2411173 2379648 2331783 2269220 2194123 2108973 2016308 1918648
62748A918648j00214j00635r9261r6289r2007q7023q1917p6787p1457o6001o0725
$$ 1918648 1818434 1717799 1618538 1522249 1430242 1343219 1261302 1184515 1113058 1047057 986332
62737I86332n5724n0850m6101m1723l7763l3965l0250k7012k4662k2985k1282
$$ 986332 930608 879758 833657 791934 754171 720206 689956 662944 638282 615297 594015
62726E94015j9174j6971j5145j3577j1720r486p566o574o130n238l543j741o33
$$ 594015 574841 557870 542725 529148 517428 507942 500376 493802 487672 482434 478891 477150 476517
62713D76517j86K52J112K328L665N018O424Q037J0077J2616J5397J7951J9959
$$ 476517 476331 476583 477695 480023 483688 488706 495130 503167 513244 525860 541257 559208 579167
62700E79167K1538K3206K5558K8830L2736L6797M0826M5019M9633N4642N9718
$$ 579167 600705 623911 649469 678299 711035 747832 788658 833677 883310 937952 997670
62689I97670O4339O8005P0523P2072P2737P2088O9445O4539N7564M8651L7693
$$ 997670 1062009 1130014 1200537 1272609 1345346 1417434 1486879 1551418 1608982 1657633 1695326
62678A695326K4872J0955l102j6662k9377m0964n1205n9877o6575p0865p2829
$$ 1695326 1720198 1731153 1728051 1711389 1682012 1641048 1589843 1529966 1463391 1392526 1319697
62667A319697p3218p2752p1504o9136o5580o1230n6536n1740m6958m2352l8127
$$ 1319697 1246479 1173727 1102223 1033087 967507 906277 849741 798001 751043 708691 670564
62656F70564l4423l1169k8119k5206k2734k0973j9572j7821j5602j3589j2279
$$ 670564 636141 604972 576853 551647 528913 507940 488368 470547 454945 441356 429077
62645D29077j1337j0295r402r142r195q598p080n596n248o055o999p033n871m080
$$ 429077 417740 407445 398043 388901 379706 371108 364028 358432 353184 347129 340130 333097 327226 323146
62631C23146k618k123k432k832k867k700k626k528k095j398q68p29p54o35l08
$$ 323146 320528 318405 315973 313141 310274 307574 304948 302420 300325 298927 298059 297330 296576 295941 295633
62616B95633J32N94R85J277J682K452L362L749L335K767K944M034N441O583P313
$$ 295633 295765 296359 297344 298621 300303 302755 306117 309866 313201 315968 318912 322946 328387 334970 342283
62601C42283P788Q368R511J1280J3097J4503J5941J8182K1161K4173K7115L0482
$$ 342283 350071 358439 367950 379230 392327 406830 422771 440953 462114 486287 513402 543884
62589E43884L4149L7309L9973M3237M7414N1083N2875N3170N2877N1527M7970
$$ 543884 578033 615342 655315 698552 745966 797049 849924 903094 955971 1007498 1055468
62578A055468M2325L5689K8322J9607R697k86r751j8899k7327l3865l8192m1387
$$ 1055468 1097793 1133482 1161804 1181411 1191108 1190822 1181071 1162172 1134845 1100980 1062788 1021401
62566A021401m4214m6045m6146m5002m3589m2052l9920l7006l3522k9815k6506
$$ 1021401 977187 931142 884996 839994 796405 754353 714433 677427 643905 614090 587584
62555E87584k4292k3078k1820j9796j7442j5553j4215j3116j2239j1643j1045
$$ 587584 563292 540214 518394 498598 481156 465603 451388 438272 426033 414390 403345
62544D03345j0305r810r751r496q427o985o096n773n162l875k502j779j675j560
$$ 403345 393040 383230 373479 363983 355556 348571 342475 336702 331540 327665 325163 323384 321709 320149
62530C20149q93K83J412K033K405L206M552N737O178O194O492P313Q494R951J1627
$$ 320149 319256 319539 320951 322984 325389 328595 333147 338884 345062 351256 357748 365061 373555 383506 395133
62515C95133J3266J4752J6406J8541K0954K3297K5610K8144L0878L3692L6632
$$ 395133 408399 423151 439557 458098 479052 502349 527959 556103 586981 620673 657305
62504F57305L9540M1755M2697M2504M1606L9854L6616L1595K5051J7376Q910J39
$$ 657305 696845 738600 781297 823801 865407 905261 941877 973472 998523 1015899 1024809 1024948
62492A024948q320j5972k2543k7994l2524l6215l8588l9062l7974l6512l5246
$$ 1024948 1016628 1000656 978113 950119 917595 881380 842792 803730 765756 729244 693998
62481F93998l3528l0864k8068k6109k4603k2514j9878j7594j5763j3537j0662
$$ 693998 660470 629606 601538 575429 550826 528312 508434 490840 475077 461540 450878
62470D50878p928n915m315k883k020j871j665o14J030K393L050L249L328L451
$$ 450878 442950 437035 432720 429837 427817 425946 424281 423667 424697 427090 430140 433389 436717 440168
62456D40168L739M287N086O063P084P952Q520Q862R131R305R267R078Q878Q544
$$ 440168 443907 448194 453280 459343 466427 474379 482899 491761 500892 510197 519464 528542 537420 545964
62442E45964P796O476M505J707j804n280p950r892j1754j3591j4738j4896j4613
$$ 545964 553760 560236 564741 566448 564644 559364 551414 541522 529768 516177 501439 486543 471930
62429D71930j4352j3826j2725j1445j0571j0024r327q354p202n600l236o51R93
$$ 471930 457578 443752 431027 419582 409011 398987 389660 381306 374104 368504 365268 364617 365610
62416C65610J328J341K200L888N465O302O578O734P072P899R410J1083J1794J0999
$$ 365610 366938 368279 370479 374367 379832 386134 392712 399446 406518 414417 423827 434910 446704 457703
62402D57703R478Q353P680O707N234L845K783J502k90k010l120l994n292o910
$$ 457703 467181 475534 483214 489921 495155 499000 501783 503285 502995 500985 497865 493871 488579 481669
62388D81669q194q804q803q240p236o190n284m088k213j56J248K008K959M601
$$ 481669 473475 464671 455868 447628 440392 434202 428918 424830 422617 422461 423709 425717 428676 433277
62374D33277O556Q291R777J1429J3736J6957K0769K4347K7190K9756L2782L6243
$$ 433277 439833 448124 457901 469330 483066 500023 520792 545139 572329 602085 634867 671110
62362F71110L9551M2534M5495M8311N0337N1296N1497N1027M9433M6490M2516
$$ 671110 710661 753195 798690 847001 897338 948634 1000131 1051158 1100591 1147081 1189597
62351A189597L7570L1015K2426J2526K726n988j3368j9446k4278k8025l0939l3298
$$ 1189597 1227167 1258182 1280608 1293134 1295860 1289872 1276504 1257058 1232780 1204755 1173816 1140518
62339A140518l5367l7239l8623l9009l8241l6634l4510l1986k9292k6885k4900
$$ 1140518 1105151 1067912 1029289 990280 952039 915405 880895 848909 819617 792732 767832
62328G67832k2933k0706j8672j7473j6957j6199j4524j2229j0123q607p391o078
$$ 767832 744899 724193 705521 688048 671091 654892 640368 628139 618016 609409 602018 595940
62316E95940m758l827l298k721j866j143r94j248j505j907k843m106n082n820
$$ 595940 591182 587355 584057 581336 579470 578327 577333 576085 574580 572673 569830 565724 560642 554822
62302E54822p017q663r586q954p564o880p134p239o451n220m216l322k064n23
$$ 554822 547805 539142 529556 520602 513038 506158 499024 491785 485334 480114 475898 472576 470512 469989
62288D69989O87J223J265J083P81N25O64J451K736M076N065N489N454N474O075
$$ 469989 470676 471899 473164 474247 475028 475553 476217 477668 480404 484480 489545 495034 500488 505962 512037
62273E12037P167Q016Q180Q183Q861J0278J1844J3378J5345J7991K0894K3652
$$ 512037 519204 527220 535400 543583 552444 562722 574566 587944 603289 621280 642174 665826
62261F65826K6425K9507L2842L6317M0060M4122M8241N2217N5951N8760N9192
$$ 665826 692251 721758 754600 790917 830977 875099 923340 975557 1031508 1090268 1149460
62250A149460N6207N0187M2143L2441K0996Q497l534j3914k2426k9250l4466l8291
$$ 1149460 1205667 1255854 1297997 1330438 1351434 1359931 1356397 1342483 1320057 1290807 1256341 1218050
62238A218050m1265m3827m5927m7124m6931m5152m2086l8359l4341k9997k5544
$$ 1218050 1176785 1132958 1087031 1039907 992976 947824 905738 867379 833038 803041 777497
62227G77497k1756j9115j7057j4676j1987r769q307p020n408l748k685k581l268
$$ 777497 755741 736626 719569 704893 692906 683137 674830 667810 662402 658654 655969 653388 650120
62214F50120m009l762k097J26J531J748J645K009K716L360M042N089O446P752
$$ 650120 646111 642349 640252 640378 641909 643657 645302 647311 650027 653387 657429 662518 668964 676716
62200F76716Q821R753J0720J1874J3376J5397J8005K0959K3581K5212K6028K7068
$$ 676716 685537 695290 706010 717884 731260 746657 764662 785621 809202 834414 860442 887510
62188H87510K9042L1404L3076L3727L3751L3148L1250K7596K2513J6792J1266
$$ 887510 916552 947956 981032 1014759 1048510 1081658 1112908 1140504 1163017 1179809 1191075
62177A191075O648L148K65k576n148o637o572n026k097K061O808J1395J5825K0525
$$ 1191075 1197723 1200871 1201136 1198560 1193412 1186775 1180203 1175177 1173080 1175141 1181949 1193344 1209169 1229694
62163A229694K5126K8376K9438K8535K6111K2268J7314J2059P132K631j198l689
$$ 1229694 1254820 1283196 1312634 1341169 1367280 1389548 1406862 1418921 1426053 1428684 1427486 1423797
62151A423797m760n517p188r765j2267j3985j4934j5290j4988j3891j2064r807
$$ 1423797 1419037 1413520 1406332 1396567 1384300 1370315 1355381 1340091 1325103 1311212 1299148 1289341
62139A289341p517n473l710k140p05O68K084L346L961L853L809M739O612Q679
$$ 1289341 1281824 1276351 1272641 1270501 1269796 1270464 1272548 1275894 1279855 1283708 1287517 1292256 1298868 1307547
62125A307547J0464J2001J3387J4870J7025K0008K2737K3969K4072K4639K6276
$$ 1307547 1318011 1330012 1343399 1358269 1375294 1395302 1418039 1442008 1466080 1490719 1516995
62114A516995K7980K8937K9597L0414L0741K9937K8641K7990K8099K8230K7990
$$ 1516995 1544975 1573912 1603509 1633923 1664664 1694601 1723242 1751232 1779331 1807561 1835551
62103A835551K7714K7880K8707L0039L1319L2055L2599L3885L6136L8497M0302
$$ 1835551 1863265 1891145 1919852 1949891 1981210 2013265 2045864 2079749 2115885 2154382 2194684
62092B194684M1976M4126M6464M8236M9104M9013M7834M5951M4642M5118M7385
$$ 2194684 2236660 2280786 2327250 2375486 2424590 2473603 2521437 2567388 2612030 2657148 2704533
62081B704533N0601N4080N7326N9502N9764N8025N4869N0970M7073M4174M3024
$$ 2704533 2755134 2809214 2866540 2926042 2985806 3043831 3098700 3149670 3196743 3240917 3283941
62070C283941M3464M4741M6331M8072M9766N1091N1782N1571N0165M7592M4330
$$ 3283941 3327405 3372146 3418477 3466549 3516315 3567406 3619188 3670759 3720924 3768516 3812846
62059C812846M0790L6973L2823K8507K4157J9739J5505J1999R192O188K232k402
$$ 3812846 3853636 3890609 3923432 3951939 3976096 3995835 4011340 4023339 4032531 4038719 4040951 4038549
62047D038549o924j1012j4782j8226k1167k3498k5096k5873k6145k6408k6543
$$ 4038549 4031625 4020613 4005831 3987605 3966438 3942940 3917844 3891971 3865826 3839418 3812875
62036C812875k5816k4080k2177k0727j9311j7437j5502j4018j2667j1053r783
$$ 3812875 3787059 3762979 3740802 3720075 3700764 3683327 3667825 3653807 3641140 3630087 3620304
62025C620304r664j0232j0187r170q125p912q284q342p407n432k982p12J390L942
$$ 3620304 3610640 3600408 3590221 3581051 3572926 3565014 3556730 3548388 3540981 3535549 3532567 3531855 3533245 3537187
62011C537187P109J0139J2371J4074J5752J7304J8598K0293K3068K6426K9064
$$ 3537187 3544296 3554435 3566806 3580880 3596632 3613936 3632534 3652827 3675895 3702321 3731385
62000C731385L0235L0030K8640K6030K1999J6017P447l421j5146k6584l7850m8988
$$ 3731385 3761620 3791650 3820290 3846320 3868319 3884336 3891783 3888362 3873216 3846632 3808782 3759794
61988C759794n8624o5206o8949p1149p2046p0966o8217o5208o2548n9603n6144
$$ 3759794 3701170 3635964 3567015 3495866 3423820 3352854 3284637 3219429 3156881 3097278 3041134
61977C041134n2995n0574m8135m5081m1954l9561l8002l6946l6092l4918l2824
$$ 3041134 2988139 2937565 2889430 2844349 2802395 2762834 2724832 2687886 2651794 2616876 2584052
61966B584052k9966k7235k5122k3316k1570k0088j8766j7071j5078j3634j2979
$$ 2584052 2554086 2526851 2501729 2478413 2456843 2436755 2417989 2400918 2385840 2372206 2359227
61955B359227j2166j0461q426o778n104k658K36K734N056Q271J2490J6339J8678
$$ 2359227 2347061 2336600 2328174 2321396 2316292 2313634 2313870 2316604 2321660 2329931 2342421 2358760 2377438
61942B377438K0115K2214K5447K8543L0010K9904K9662L0237L1022L0820K9421
$$ 2377438 2397553 2419767 2445214 2473757 2503767 2533671 2563333 2593570 2624592 2655412 2684833
61931B684833K7608K5970K4388K2641K0745J8615J6065J3423J1671J1710J3763
$$ 2684833 2712441 2738411 2762799 2785440 2806185 2824800 2840865 2854288 2865959 2877669 2891432
61920B891432J7627K3189L0568M0051N1873O5849Q1390R8226J16839J37570J59642
$$ 2891432 2909059 2932248 2962816 3002867 3054740 3120589 3201979 3300205 3417044 3554614 3714256
61909C714256J81840K04176K28045K54710K84554L18029L56308M00426M50395
$$ 3714256 3896096 4100272 4328317 4583027 4867581 5185610 5541918 5942344 6392739
61900F392739N05601N65198O27058O86424P36008P67114P70151P34767O51510
$$ 6392739 6898340 7463538 8090596 8777020 9513028 10280142 11050293 11785060 12436570
61891A2436570N15752L31903J14803j13446l29680n15338o58899p55633q06698
$$ 12436570 12952322 13284225 13399028 13285582 12955902 12440564 11781665 11026032 10219334
61882A0219334q18140p98962p58512p04719o43855n80772n18905m60405m06542
$$ 10219334 9401194 8602232 7843720 7139001 6495146 5914374 5395469 4935064 4528522
61873D528522l57871l14286k75467k41389k11997j86434j63364j42141j23167
$$ 4528522 4170651 3856365 3580898 3339509 3127512 2941078 2777714 2635573 2512406
61864B512406j06811r2485p9074o5824n2633l9867k8104j7627p959J739J1613
$$ 2512406 2405595 2313110 2234036 2168212 2115579 2075712 2047608 2029981 2022022 2023761 2035374
61853B035374K0845K8595L4799L9863M3918M6674M7668M6453M2792L6887K9212
$$ 2035374 2056219 2084814 2119613 2159476 2203394 2250068 2297736 2344189 2386981 2423868 2453080
61842B453080K0098R847o77r959j6634k0253k1264k0378j7996j3977q060o87O788
$$ 2453080 2473178 2483025 2482348 2472389 2455755 2435502 2414238 2393860 2375864 2361887 2353827 2353140 2359928
61829B359928J3059J7794K1138K2566K0983J5942Q075j691j2727k4346l5521m5232
$$ 2359928 2372987 2390781 2411919 2434485 2455468 2471410 2479485 2477794 2465067 2440721 2405200 2359968
61817B359968n2809n7929o0713o1700o1245n9020n4688m8846m2514l5861k8434
$$ 2359968 2307159 2249230 2188517 2126817 2065572 2006552 1951864 1903018 1860504 1824643 1796209
61806A796209k0620j3667p928k190M625J2010J8778K4661L0278L6151M2431M9225
$$ 1796209 1775589 1761922 1753994 1751804 1756429 1768439 1787217 1811878 1842156 1878307 1920738 1969963
61794A969963N6517O4019P1538P9202Q7044R4926J03277J13254J25647J40085
$$ 1969963 2026480 2090499 2162037 2241239 2328283 2423209 2526486 2639740 2765387 2905472
61784B905472J55963J73649J94084K17639K44272K74680L10502L53098M02681
$$ 2905472 3061435 3235084 3429168 3646807 3891079 4165759 4476261 4829359 5232040
61775E232040M58890N21999N93364O74653P66558Q68031R76629J089130J201147
$$ 5232040 5690930 6212929 6806293 7480946 8247504 9115535 10092164 11181294 12382441
61766A2382441J305711J392033J445233J447066J378143J222599R74454O42682
$$ 12382441 13688152 15080185 16525418 17972484 19350627 20573226 21547680 22190362
61758B2190362K52223j60009n53134q91836j153387j329237j422220j442995j407212
$$ 22190362 22442585 22282576 21729442 20837606 19684219 18354982 16932762 15489767 14082555
61749A4082555j332286j233808j123768j011132r02342q00765p07161o22006n46728
$$ 14082555 12750269 11516461 10392693 9381561 8479219 7678454 6971293 6349287 5802559
61740E802559m82012m26099l76266l31509k92449k58930k29225k01809j76638
$$ 5802559 5320547 4894448 4518182 4186673 3894224 3635294 3406069 3204260 3027622
61731C027622j54273j34665j17312j01988q8792p7849o9299o3282n9650n7830
$$ 3027622 2873349 2738684 2621372 2519384 2430592 2352743 2283444 2220162 2160512 2102682
61721B102682n7188n7342n8039n8853n9121n8218n5953n2766m9393m6220m3078
$$ 2102682 2045494 1988152 1930113 1871260 1812139 1753921 1697968 1645202 1595809 1549589 1506511
61710A506511l9708l6220l2881k9768k6836k4223k2177k0754j9766j8927j8017
$$ 1506511 1466803 1430583 1397702 1367934 1341098 1316875 1294698 1273944 1254178 1235251 1217234
61699A217234j7064j6374j6238j6461j6493j5985j5027j3866j2781j2218j2421
$$ 1217234 1200170 1183796 1167558 1151097 1134604 1118619 1103592 1089726 1076945 1064727 1052306
61688A052306j2833j2428j1020r580q946q776q325p668p422p579p447o700n837
$$ 1052306 1039473 1027045 1016025 1006445 997499 988723 980398 972730 965308 957729 950282 943582 937745
61675I37745n442n461n420m982m212l418k914k827l102l627m231m621m577m265
$$ 937745 932303 926842 921422 916440 912228 908810 905896 903069 899967 896340 892109 887488 882911 878646
61661H78646m097m215m405m525m653m716m313l161j446L76J921K987L677M416
$$ 878646 874549 870334 865929 861404 856751 852035 847722 844561 843115 843491 845412 848399 852076 856492
61647H56492N476O452O729O421O259O429O265N348M285L886M153M557M880N445
$$ 856492 861968 868420 875149 881570 887829 894258 900523 905871 910156 914042 918195 922752 927632 933077
61633I33077O811R477J3368J7323J9718K0014J9188J8179J6594J3450Q635K958
$$ 933077 939888 949365 962733 980056 999774 1019788 1038976 1057155 1073749 1087199 1095834 1098792
61621A098792k834q349j3207j7066j9880k1720k2540k2517k2177k1734k0694j8677
$$ 1098792 1095958 1087609 1074402 1057336 1037456 1015736 993196 970679 948502 926768 906074 887397
61609H87397j6245j4362j3294j2618j1970j1250j0393r635r523j0114j0393r367
$$ 887397 871152 856790 843496 830878 818908 807658 797265 787630 778107 767993 757600 748233
61597G48233p442n929n286m832m067l391l170k882j765J35J954K949L211L502
$$ 748233 740791 734862 729576 724744 720677 717286 714116 711234 709469 709604 711558 714507 717718 721220
61583G21220M506O189P964R467J0882J2429J3912J5141J6389J7990J9685K0944
$$ 721220 725726 731915 739879 749346 760228 772657 786569 801710 818099 836089 855774 876718
61571H76718K1818K2926K4613K6514K8036K8904K9184K9078K8851K8753K8785
$$ 876718 898536 921462 946075 972589 1000625 1029529 1058713 1087791 1116642 1145395 1174180
61560A174180K8537K7402K5180K2601K0941K0734K1119K0883K0000J9399J9387
$$ 1174180 1202717 1230119 1255299 1277900 1298841 1319575 1340694 1361577 1381577 1400976 1420363
61549A420363J9201J8228J6655J4559J1371O860J820k948p574j2360j6764k0092
$$ 1420363 1439564 1457792 1474447 1489006 1500377 1507237 1509057 1506109 1498535 1486175 1469411 1449319
61537A449319k2541k4631k6074k6191k5121k3630k1936j9690j6972j4329j1865
$$ 1449319 1426778 1402147 1376073 1349882 1324761 1301131 1279195 1259505 1242533 1228204 1216339
61526A216339r138o062l081l06K781O584J0843J5051J9012K2907K7154L2198L8130
$$ 1216339 1207201 1201139 1198058 1197752 1200533 1207117 1217960 1233011 1252023 1274930 1302084 1334282 1372412
61513A372412M4582N1304N8693O7392P7653Q9356J02348J16352J30887J45872
$$ 1372412 1416994 1468298 1526991 1594383 1672036 1761392 1863740 1980092 2110979 2256851
61503B256851J61961J79761J98843K18024K36215K52423K65203K72636K72555
$$ 2256851 2418812 2598573 2797416 3015440 3251655 3504078 3769281 4041917 4314472
61494D314472K62431K39817K04008J57270J03805M7720p533n8632j02734j38455
$$ 4314472 4576903 4816720 5020728 5177998 5281803 5329523 5321990 5263358 5160624 5022169
61484E022169j65654j84316j94556j97478j94966j88313j77915j64387j49118
$$ 5022169 4856515 4672199 4477643 4280165 4085199 3896886 3718971 3554584 3405466
61475C405466j33440j17928j02683q7716p2971n8534m4905l2491k0876r345J907
$$ 3405466 3272026 3154098 3051415 2963699 2890728 2832194 2787289 2754798 2733922 2724577 2726484
61464B726484J1856J9980K6779L2912L8512M3494M7792N1141N3268N4407N4929
$$ 2726484 2738340 2758320 2785099 2818011 2856523 2900017 2947809 2998950 3052218 3106625 3161554
61453C161554N4461N2271M8752M5628M4285M4545M5471M6683M8317N0193N1612
$$ 3161554 3216015 3268286 3317038 3362666 3406951 3451496 3496967 3543650 3591967 3642160 3693772
61442C693772N1881N0781M8715M6480M4627M2943M0810L7921L4349L0120K5253
$$ 3693772 3745653 3796434 3845149 3891629 3936256 3979199 4020009 4057930 4092279 4122399 4147652
61431D147652K0031J4607Q476J001p558j6265k4647l2816m0430m6441n0223n2203
$$ 4147652 4167683 4182290 4190766 4191767 4184209 4167944 4143297 4110481 4070051 4023610 3973387 3921184
61419C921184n3132n3260n2453n0463m6905m1600l5122k8400k1748j4923q215
$$ 3921184 3868052 3814792 3762339 3711876 3664971 3623371 3588249 3559849 3538101 3523178 3514963
61408C514963k599J422M240O047O192M114K90m343r271j4231j8712k2189k4437
$$ 3514963 3512364 3513786 3518026 3524073 3530265 3534379 3534669 3530326 3521055 3506824 3488112 3465923 3441486
61395C441486k5146k3734j9994j4501p818L57J0770K3600L8373N4644P2312R1355
$$ 3441486 3416340 3392606 3372612 3358111 3350293 3350650 3361420 3385020 3423393 3478037 3550349 3641704
61383C641704J11677J33124J55469J78420K01740K25124K47782K68273K84749
$$ 3641704 3753381 3886505 4041974 4220394 4422134 4647258 4895040 5163313 5448062
61374E448062K95228K97765K90849K73639K45696K06774J57789J02050M4645r916
$$ 5448062 5743290 6041055 6331904 6605543 6851239 7058013 7215802 7317852 7362497 7352581
61364G352581n9279j02676j39764j70539j95615k15793k31471k42722k49608k52075
$$ 7352581 7293302 7190626 7050862 6880323 6684708 6468915 6237444 5994722 5745114 5493039
61354E493039k49988k43741k34597k23966k12473k00025j86607j72677j58901
$$ 5493039 5243051 4999310 4764713 4540747 4328274 4128249 3941642 3768965 3610064
61345C610064j45784j33504j21885j10577r9317q7996p6533o4931n3420m2250
$$ 3610064 3464280 3330776 3208891 3098314 2998997 2911001 2834468 2769537 2716117 2673867
61335B673867l1349k0479r760K84R244J7187K4372L0902L6663M1382M4781M6800
$$ 2673867 2642518 2622039 2612279 2612563 2621807 2638994 2663366 2694268 2730931 2772313 2817094 2863894
61323B863894M7640M7492M6463M4911M3325M1554L8761L4719L0623K7726K5644
$$ 2863894 2911534 2959026 3005489 3050400 3093725 3135279 3174040 3208759 3239382 3267108 3292752
61312C292752K3107K0080J7850J6895J5958J3651R935N530P46m427r824j5255
$$ 3292752 3315859 3335939 3353789 3370684 3386642 3400293 3410228 3415758 3416504 3412077 3402253 3386998
61300C386998k0667k5786l0146l3889l7861m2430m6774m9836n1551n2647n3638
$$ 3386998 3366331 3340545 3310399 3276510 3238649 3196219 3149445 3099609 3048058 2995411 2941773
61289B941773n4447n4642n3627n0927m6650m1439l5738k9508k2838j6420j1010
$$ 2941773 2887326 2832684 2779057 2728130 2681480 2640041 2604303 2574795 2551957 2535537 2524527
61278B524527o718l133J38L123N392O228N353L536K045J379J122R83J303K274
$$ 2524527 2517809 2514676 2514814 2517937 2523329 2529557 2534910 2538446 2540491 2541870 2542992 2543975 2545278 2547552
61264B547552L459M322M630M100K447K03j142l36K775P844J4798K3624L3970M5562
$$ 2547552 2551011 2555333 2559963 2564063 2566510 2566713 2565571 2565235 2568010 2575854 2590652 2614276 2648246 2693808
61250B693808N8424P2245Q6025R8822J10365J20396J27871J31293J29435J21239
$$ 2693808 2752232 2824477 2910502 3009324 3119689 3240085 3367956 3499249 3628684 3749923
61240C749923J05538Q1671N0421J3973k4816o2938r7561j26581j48856j63844
$$ 3749923 3855461 3937132 3987553 4001526 3976710 3913772 3816211 3689630 3540774 3376930
61230C376930j71387j72108j67540j59340j48548j35892j22471j09701r8589q9249
$$ 3376930 3205543 3033435 2865895 2706555 2558007 2422115 2299644 2189943 2091354 2002105
61220B002105q0946p2727o4306n6414m9941m4809m0173l5561l1140k6828k2080
$$ 2002105 1921159 1848432 1784126 1727712 1677771 1632962 1592789 1557228 1526088 1499260 1477180
61209A477180j6802j1664p111k801J615N827R424J2459J5041J7007J8349J9383
$$ 1477180 1460378 1448714 1441603 1438802 1440417 1446244 1455668 1468127 1483168 1500175 1518524 1537907
61197A537907K0010J9530J7670J5144J2703J0323P819N580L955K551Q88p65j956
$$ 1537907 1557917 1577447 1595117 1610261 1622964 1633287 1641106 1646686 1650641 1653192 1654080 1653315 1651359
61184A651359k996m590o828r259j1661j4121j6617j9044k1491k4007k6305k8113
$$ 1651359 1648363 1643773 1636945 1627686 1616025 1601904 1585287 1566243 1544752 1520745 1494440 1466327
61172A466327k9486l0481l0910l0788l0527l0356l0024k9491k9339k9927l0673
$$ 1466327 1436841 1406360 1375450 1344662 1314135 1283779 1253755 1224264 1194925 1164998 1134325
61161A134325l0722k9890k8437k6547k4508k2889k1850k0760j9154j7528j6650
$$ 1134325 1103603 1073713 1045276 1018729 994221 971332 949482 928722 909568 892040 875390
61150H75390j6566j6989j8056j9781k1257k1394k0238j8699j7162j5273j2930
$$ 875390 858824 841835 823779 803998 782741 761347 741109 722410 705248 689975 677045
61139F77045j0676q972p710o488m972l058j017O67K005L629N853P995R218R643
$$ 677045 666369 657397 649687 643199 638227 635169 634152 634819 636824 640453 646306 654301 663519 673162
61125F73162R962J0376J0626J0771J1170J1869J2663J3541J4473J5020J4903J4675
$$ 673162 683124 693500 704126 714897 726067 737936 750599 764140 778613 793633 808536 823211
61113H23211J5049J5757J5872J5163J4220J3312J1993R953P471M824J891j385
$$ 823211 838260 854017 869889 885052 899272 912584 924577 934530 942001 946825 948716 947331
61101I47331m704p772j0421j2265j2815j2224j1395j1033j0976j0766j0528j0779
$$ 947331 942627 934855 924434 912169 899354 887130 875735 864702 853726 842960 832432 821653
61089H21653j1534j2148j2134j1850j1993j2643j3143j3062j2778j2795j2826
$$ 821653 810119 797971 785837 773987 761994 749351 736208 723146 710368 697573 684747
61078F84747j2114j0567q958p960p439o829n756m232k647j638j465j560j166m26
$$ 684747 672633 662066 653108 645148 637709 630880 625124 620892 618245 616607 615142 613582 612416 611990
61064F11990j58n76r68q65p23j121j962k764l174k958k128j334j323j856j869
$$ 611990 611832 611256 610288 609423 608700 607579 605617 602853 599679 596721 594593 593259 591936 590080 588211
61049E88211j035j72J82O81K033L931N745P386Q727R088Q271P402P735R053J0177
$$ 588211 587176 587004 587186 587867 589900 593831 599576 606962 615689 624777 633048 640450 648185 657238 667415
61034F67415J0631J0898J1308J1619J1600J1347J1000J0689J0641J0946J1299
$$ 667415 678046 688944 700252 711871 723471 734818 745818 756507 767148 778094 789393
61023G89393J1252J0595R453Q270P686P924Q263P801O811O561P633R275J0696
$$ 789393 800645 811240 820693 828963 836649 844573 852836 860637 867448 874009 881642 890917 901613
61010I01613J2113J4091J6651J9420K2080K4384K6360K8701L2129L6368M0507
$$ 901613 913726 927817 944468 963888 985968 1010352 1036712 1065413 1097542 1133910 1174417
60999A174417M4288M7953N1129N3325N5601N9990O7097P5850Q5746R7390J10493
$$ 1174417 1218705 1266658 1317787 1371112 1426713 1486703 1553800 1629650 1715396 1812786 1923279
60988A923279J23485J35763J48538J63190J81116K05528K40637K88390L48728
$$ 1923279 2046764 2182527 2331065 2494255 2675371 2880899 3121536 3409926 3758654
60979C758654M23298N15251O25244P53092R04958J092510J322234J592301J899946
$$ 3758654 4181952 4697203 5322447 6075539 6980497 8073007 9395241 10987542 12887488
60970A2887488K230856K518681K625802K408133J836283J055046L06359k15748
$$ 12887488 15118344 17637025 20262827 22670960 24507243 25562289 25868648 25652900
60962B5652900m42556l98169j43333K20829N22848N59839K16342m43758j211553
$$ 25652900 25210344 24812175 24668842 24889671 25412519 25972358 26188700 25744942 24533389
60953B4533389j865046k279231k440155k395104k208234j944068j658729j388850
$$ 24533389 22668343 20389112 17948957 15553853 13345619 11401551 9742822 8353972
60945H353972j149544r44395p73878o35287n22446m30183l56747l00474k57312
$$ 8353972 7204428 6260033 5486155 4850868 4328422 3898239 3541492 3241018 2983706
60936B983706k23388j97186j77498j61642j47273j33935j21645j09847r8624q8845
$$ 2983706 2760318 2563132 2385634 2223992 2076719 1942784 1821139 1711292 1612668 1523823
60926A523823q0175p1082o1626n4072m9782m7597m6125m5338m4923m3410m0282
$$ 1523823 1443648 1372566 1310940 1256868 1207086 1159489 1113364 1068026 1023103 979693 939411
60915I39411l6924l4247l1313k7506k3932k1392j8971j6021j3599j2422j1337
$$ 939411 902487 868240 836927 809421 785489 764097 745126 729105 715506 703084 691747
60904F91747r400p688p371p591o987n835n008m161k669j141l92N3J000K151L059
$$ 691747 682347 674659 667288 659697 652710 646875 641867 637706 635037 633896 633504 633557 634557 636708 639767
60889F39767M301O304P965Q006O784N515M565L661K774J608o95m166p318r020
$$ 639767 644068 650372 658337 666343 673127 678642 683207 686868 689642 691250 690555 686389 679071 670051
60875F70051r988j1196j2093j1813j0999j0758j0800j0181r065q215p394n864
$$ 670051 660063 648867 636774 624961 613962 603204 592404 582223 573158 564943 557549 551685
60863E51685l928k607k092j765j271n30P66K658M393N359N939O714P528Q196R240
$$ 551685 547757 545150 543058 541293 540022 539492 540258 542916 547309 552668 558607 565321 572849 581045 590285
60848E90285J0988J2777J3950J4850J5936J6844J7214J7450J7759J7477J6333
$$ 590285 601273 614050 628000 642850 658786 675630 692844 710294 728053 745530 761863
60837G61863J5196J4511J3257J0633P562N232L363J348j52l97j62m58p46k19J48
$$ 761863 777059 791570 804827 815460 823022 828254 831617 832965 832813 832416 832254 831796 831050 830831 830979
60822H30979j152l544n073n236n266n927o880q016r572j1054j1586j1401j1517
$$ 830979 829827 826283 821210 815974 810708 804781 797901 789885 780313 769259 757673 746272 734755
60809G34755j2044j2162j1658j1154j0873j0468r957r586r005p677n977m722l830
$$ 734755 722711 710549 698891 687737 676864 666396 656439 646853 637848 630171 624194 619472 615642
60796F15642k634j241l74o0M13J307K327L438M778O041O924P863R348J0945J1964
$$ 615642 613008 611767 611393 611333 611746 613053 615380 618818 623596 629637 636561 644424 653772 664717 676681
60781F76681J2581J3136J3093J1916J0375R494Q873P619O327O359P444P977P600
$$ 676681 689262 702398 715491 727407 737782 747276 756149 763768 770095 776454 783898 791875 799475
60768G99475P641Q770R933J0048R258Q093O664N147L979L169K329J516J112Q25
$$ 799475 807116 815886 825819 835867 845125 853218 859882 865029 869008 872177 874506 876022 877134 877959
60754H77959p4j476k426k541k418k508k541k291j925j470p83k02m47j750l672
$$ 877959 877885 876409 873983 871442 869024 866516 863975 861684 859759 858289 857506 857304 856857 855107 851435
60739H51435n685p318q082p982p836q222q570q060o968o073n339m410l825m338
$$ 851435 845750 838432 830350 822368 814532 806310 797740 789680 782712 776639 771300 766890 763065 758727
60725G58727n341n448m529l731l643l744l672l588l317k441j335q65j014r79o08
$$ 758727 753386 747938 743409 739678 736035 732291 728619 725031 721714 719273 717938 717073 716059 715080 714472
60710G14472n07p95j020j231j770k119j420j06N03K48J75M79J99q13j452j340
$$ 714472 713965 713170 712150 710919 709149 707030 705610 705504 706007 706255 706430 706909 707108 706295 704843 703503
60694G03503j537k616l777m646o229q942j1272j1728j1014j0886j1699j2360j2133
$$ 703503 701966 699350 695573 690927 684698 675756 664484 652756 641742 630856 619157 606797 594664
60681E94664j1286j0350r663r409r338q682p029m996l505k640j803p01L10Q18
$$ 594664 583378 573028 563365 553956 544618 535936 528907 523911 520406 517766 515963 515262 515572 516390
60667E16390R20J097J723K606L182L223L135L289L427L188K817K781K958K927
$$ 516390 517310 518407 520130 522736 525918 529141 532276 535565 538992 542180 544997 547778 550736 553663
60653E53663K750K754K811K674K741L603N019O201O998P765Q297P972O942O100
$$ 553663 556413 559167 561978 564652 567393 570996 576015 582216 589214 596979 605276 613248 620190 626290
60639F26290N770N508N252N641O943Q629J0166J1481J2465J2920J3078J3352J3513
$$ 626290 632060 637568 642820 648461 655404 664033 674199 685680 698145 711065 724143 737495 751008
60626G51008J3007J2072J1530J1417J0802R090O614L802Q01j983m015n495p175
$$ 751008 764015 776087 787617 799034 809836 818926 825540 829342 830143 828160 824145 818650 811475
60613H11475r068j0321j0550j0340j0161r760q912p908o926n658l921j955kJ754
$$ 811475 802407 792086 781536 771196 761035 751275 742363 734455 727529 721871 717950 715995 715993 717747
60599G17747K773K497J198k52j432k487l322l620l517l337k704r53J490L272L748
$$ 717747 720520 723017 724215 723963 722531 720044 716722 713102 709585 706248 703544 702591 704081 707353 711101
60584G11101L621L833M639N749O493O028M231K272J318J007L01n97o95j57k60
$$ 711101 714722 718555 723194 728943 735436 741464 745695 747967 749285 750292 750593 749996 749301 749144 748884
60569G48884j338k440l051l572l923l392k235j856k909m548n915p023p880q121
$$ 748884 747546 745106 742055 738483 734560 731168 728933 727077 724168 719620 713705 706682 698802 690681
60555F90681p835p478o745m909k409n67M06J496K979M252N655Q200J1237J2750
$$ 690681 682846 675368 668623 663714 661305 660738 661144 662640 665619 669871 675526 683726 694963 707713
60541G07713J2759J3984J7996K3012K6889L0124L4140L8579M2104M4414M5489
$$ 707713 720472 734456 752452 775464 802353 832477 866617 905196 947300 991714 1037203
60530A037203M4141L9119L0717J9885O997o913j9135k7399l2156l5014l5903l3772
$$ 1037203 1081344 1120463 1151180 1171065 1178062 1171149 1152014 1124615 1092459 1057445 1021542 987770
60518I87770k9154k3870j8529j2379n582K06L857N904P402Q725R718J0149R885
$$ 987770 958616 934746 916217 903838 898256 898462 902319 908223 915625 924350 934068 944217 954102
60505I54102R186Q789R202J0318J2095J5119J9751K5404L1407L8057M5983N5100
$$ 954102 963288 972077 981279 991597 1003692 1018811 1038562 1063966 1095373 1133430 1179413 1234513
60493A234513O4954P5592Q7215R9567J12451J26231J41072J56414J72134J89584
$$ 1234513 1299467 1375059 1462274 1561841 1674292 1800523 1941595 2098009 2270143 2459727
60483B459727K10491K35295K63206K92637L19944L38224L39094L16313K67698
$$ 2459727 2670218 2905513 3168719 3461356 3781300 4119524 4458618 4774931 5042629
60474E042629J94750J02167k269j08607k06445k86470l42078l71244l76853l64344
$$ 5042629 5237379 5339546 5337277 5228670 5022225 4735755 4393677 4022433 3645580 3281236
60464C281236l39027l05717k69451k34626k03344j75605j51120j30101j12580
$$ 3281236 2942209 2636492 2367041 2132415 1929071 1753466 1602346 1472245 1359665
60455A359665r8018q5799p5480o6557n8547n1259m4681l8822l3912l0185k7125
$$ 1359665 1261647 1175848 1100368 1033811 975264 924005 879324 840502 806590 776405 749280
60444G49280k3621j9457j5895j4002j3146j2007j0498r594r656r933r661q843
$$ 749280 725659 706202 690307 676305 663159 651152 640654 631060 621404 611471 601810 592967
60432E92967p965p515p605p704p043n548l966k762j673o33k17n23o16J78J258
$$ 592967 585002 577487 569882 562178 555135 549587 545621 542859 541186 540553 540336 539813 539197 539375 540633
60417E40633J883K350L054L351K618J662J732K577K917K463K172K557L080L246
$$ 540633 542516 544866 547920 551271 553889 555551 557283 559860 562777 565240 567412 569969 573049 576295
60403E76295L271L480L827M132M279M191M146M760O119P252P159O051M941M321
$$ 576295 579566 583046 586873 591005 595284 599475 603621 608381 614500 621752 628911 634962 639903 644224
60389F44224L973L736L714L754L473K741J791R12K82j45p92k070l692m876n305
$$ 644224 648197 651933 655647 659401 662874 665615 667406 668318 668600 668455 667663 665593 661901 657025 651720
60374F51720n249m764l677k464j975k022j486k33M99K08O3R32J931K015J616J509
$$ 651720 646471 641707 638030 635566 633591 631569 630083 629850 630349 630557 630620 631552 633483 635498 637114 638623
60358F38623J421J102J392K801M159M316M037M587N506N640N402O011P180P594
$$ 638623 640044 641146 642538 645339 649498 653814 657851 662438 667944 673584 678986 684997 692177 699771
60344F99771P215P156P511P249O105M833L644K100M78k91j80j25m94q30r34r14
$$ 699771 706986 714142 721653 728902 735007 739840 743484 745584 746062 745771 745591 745466 744972 744142 743208 742294
60328G42294l30J234K951L534L206L371M383N097M656L369J689k59k052l103l578
$$ 742294 741964 743198 746149 749683 752889 756260 760643 765740 770396 773765 775454 775195 773143 770040 766462
60313G66462m055m393m059l346k977k723j907j057j400k756l590l300k843k823
$$ 766462 762407 758014 753955 750609 747632 744909 743002 741945 740545 737789 734199 730899 728056 725233
60299G25233k632j844j003m20M33J762K865L261L352L511L488L138K722K215J275
$$ 725233 722601 720757 719754 719334 719767 721529 724394 727655 731007 734518 738006 741144 743866 746081 747356
60284G47356J37l59mM98O74P93J096J457J993L018M239N015N493O499Q158R597
$$ 747356 747493 747134 747130 747628 748302 749095 750191 751648 753641 756659 760898 765913 771406 777905 786063 795660
60268G95660J0325J0817J1556J2446J3421J4743J6473J8438K0725K3379K5768
$$ 795660 805985 816802 828358 840804 854225 868968 885441 903879 924604 947983 973751
60257I73751K7294K8706L1482L5864M0583M4672M8430N2560N7487O3621P1125
$$ 973751 1001045 1029751 1061233 1097097 1137680 1182352 1230782 1283342 1340829 1404450 1475575
60246A475575P9242Q6879R3929J00948J07652J12999J16786J19726J21796J21901
$$ 1475575 1554817 1641696 1735625 1836573 1944225 2057224 2174010 2293736 2415532 2537433
60236B537433J19427J14722J07824R8229Q6346P3693O1024M7520L2508J6824J828
$$ 2537433 2656860 2771582 2879406 2977635 3063981 3137674 3198698 3246218 3278726 3295550 3297378
60225C297378j1850k4049l4560m3427n0769n5829n7249n4765m9727m3440l5987
$$ 3297378 3285528 3261479 3226919 3183492 3132723 3076894 3019645 2964880 2915153 2871713 2835726
60214B835726k7035j6773n483O899K0143L3510M6563N9595P2885Q6235R9322J11603
$$ 2835726 2808691 2791918 2786435 2793334 2813477 2846987 2893550 2953145 3026030 3112265 3211587 3323190
60202C323190J21804J28569J31782J32215J29794J23452J12862R9006Q2770O4302
$$ 3323190 3444994 3573563 3705345 3837560 3967354 4090806 4203668 4302674 4385444 4449746
60192D449746M4148K3627L441j6849l7336n6823p3963q8241r9323j06581j09820
$$ 4449746 4493894 4517521 4520962 4504113 4466777 4409954 4335991 4247750 4148427 4041846 3932026
60181C932026j09582j06174r9335q9227p6713o2335m6231k9317j3119K131J7720
$$ 3932026 3822444 3716270 3616935 3527708 3450995 3388660 3342429 3313112 3299993 3302124 3319844
60170C319844L4115M9737O2960P3811Q2643Q8484R0046Q7551Q2195P4450O3974
$$ 3319844 3353959 3403696 3466656 3540467 3623110 3711594 3801640 3889191 3971386 4045836 4109810
60159D109810N0745L5460J9153L027j1796k4873l6272m5548n1669n4238n3762
$$ 4109810 4160555 4196015 4215168 4218195 4206399 4181526 4145254 4099706 4048037 3993799 3940037
60148C940037n0368m3292l2258j8331k748J4223L2625N2068P2309R3668J16181
$$ 3940037 3889669 3846377 3814119 3795788 3793040 3807263 3839888 3891956 3964265 4057933 4174114
60137D174114J39211J62604J87223K13701K41431K69484K97525L25126L51044
$$ 4174114 4313325 4475929 4663152 4876853 5118284 5387768 5685293 6010419 6361463
60128F361463L73923L92883M06767M13813M12838M03970L87493L62956L30236
$$ 6361463 6735386 7128269 7535036 7948849 8361687 8765657 9153150 9516106 9846342
60119I846342K90564K45588J96043J42227Q4987K5552l5046r5682j54859k11118
$$ 9846342 10136906 10382494 10578537 10720764 10805751 10831303 10796257 10700575 10545716 10334598
60109A0334598k62989l08198l43950l68557l82014l84695l76762l59283l34531
$$ 10334598 10071609 9763411 9419461 9050904 8668890 8284195 7907433 7548150 7213619
60100G213619l04327k69357k30758j90864j51274j11627p1482l2056N226M0462
$$ 7213619 6909292 6639935 6409177 6218313 6067039 5955412 5883930 5851874 5857100 5897562
60090E897562P3861J03665J27326J44047J54423J58133J53803J40986J20768R4615
$$ 5897562 5971423 6075088 6202414 6346461 6500884 6659017 6812820 6953806 7074574 7169189
60080G169189O4032L1193j432l2265o0546q5413j06214j23652j39333j53943j66657
$$ 7169189 7233221 7264414 7262982 7230717 7170171 7084758 6978544 6854892 6715559 6561616 6394959
60069F394959j76391j82842j86236j86805j84672j79781j71910j61202j48512
$$ 6394959 6218568 6035726 5849490 5662685 5478013 5298232 5126322 4965120 4816608
60060D816608j34791j20206j04242q6560o7477m7803k8280r001J0617L0786N0473
$$ 4816608 4681817 4561611 4457369 4370809 4303332 4255529 4227249 4218248 4228865 4259651 4310124
60049D310124O8294Q4177R9085J13052J24633J32583J36743J36794J31531J20313
$$ 4310124 4378418 4462595 4561680 4674732 4799365 4931948 5068691 5205485 5337016 5457329
60039E457329J04196Q4767O2713L8315J2290j4669m2240o9549r4777j16500j34508
$$ 5457329 5561525 5646292 5709005 5747320 5759610 5744941 5702701 5633152 5538375 5421875 5287367
60028E287367j48679j58144j62502j62622j59198j51681j39787j25021j09329
$$ 5287367 5138688 4980544 4818042 4655420 4496222 4344541 4204754 4079733 3970404
60019C970404r3182p6277n9184m2777k6651r668Q424K7137M6470O6643Q7084J06952
$$ 3970404 3877222 3800945 3741761 3698984 3672333 3662665 3671089 3698226 3744696 3811339 3898423 4005375
60007D005375J26309J45554J64092J80557J93870K03030K06486K03056J93063
$$ 4005375 4131684 4277238 4441330 4621887 4815757 5018787 5225273 5428329 5621392
59998E621392J77434J56218J29295R8106O5270L2536K83l1293o1575q9996j15975
$$ 5621392 5798826 5955044 6084339 6182445 6247715 6280251 6280534 6249241 6187666 6097670 5981695
59987E981695j38450j56274j68852j75829j76730j71785j62403j49807j33862
$$ 5981695 5843245 5686971 5518119 5342290 5165560 4993775 4831372 4681565 4547703
59978D547703j14364r2753p1132n0074k8812p209J3902L4102N3550P1762Q7546
$$ 4547703 4433339 4340586 4269454 4219380 4190568 4183359 4197261 4231363 4284913 4356675 4444221
59967D444221J00298J10321J17732J22040J22833J20136J14120J05239R4420Q2344
$$ 4444221 4544519 4654840 4772572 4894612 5017445 5137581 5251701 5356940 5451360 5533704
59957E533704O8803N3565L7564K2314Q633l213j2444j7996j9519j7201j0857q8
$$ 5533704 5602507 5656072 5693636 5715950 5724583 5721370 5708926 5690930 5671411 5654210 5643353 5643265
59945E643265J5007L4156N7560Q5286J16546J50595J87763K28434K71390L14498
$$ 5643265 5658272 5692428 5749988 5835274 5951820 6102415 6290178 6518612 6790002 7104500
59935G104500L56565L97170M34835M66661M89586N00844M97221M75325M32927
$$ 7104500 7461065 7858235 8293070 8759731 9249317 9750161 10247382 10722707 11155634
59926A1155634L69560K86372J86640P6323l7197j47200k48070l34561m02395m49801
$$ 11155634 11525194 11811566 11998206 12074529 12037332 11890132 11642062 11307501 10905106 10455305
59916A0455305m77548m87423m81558m62940m35198m01403l63604l23328k81814
$$ 10455305 9977757 9490334 9008776 8545836 8110638 7709235 7345631 7022303 6740489
59907F740489k39858j98169j57591j18368p9743m1124l096L3529O8981J03655
$$ 6740489 6500631 6302462 6144871 6026503 5946760 5905636 5902540 5936069 6005050 6108705
59897F108705J36632J66297J91874K13042K28422K35864K33867K21566J97740
$$ 6108705 6245337 6411634 6603508 6816550 7044972 7280836 7514703 7736269 7934009
59888G934009J61486J13815N7445m747o9769j33578j91838k41788k82327l12575
$$ 7934009 8095495 8209310 8266755 8262008 8192239 8058661 7866823 7625035 7342708 7030133
59878G030133l31820l40749l41244l34780l22091l04245k82786k58906k33609
$$ 7030133 6698313 6357564 6016320 5681540 5359449 5055204 4772418 4513512 4279903
59869D279903k08357j84283j61047j37922j15739r6313q0042o5693n2477m0953
$$ 4279903 4071546 3887263 3726216 3588294 3472555 3376242 3296200 3230507 3178030 3137077
59859C137077l1847k5464k2198k2184k4294k6805k8932l0576l0904k8825k4630
$$ 3137077 3105230 3079766 3057568 3035384 3011090 2984285 2955353 2924777 2893873 2865048 2840418
59848B840418j9489j3469n896K353Q972J2870J4815J5026J2098N014n332j7245
$$ 2840418 2820929 2807460 2801564 2803917 2812889 2825759 2840574 2855600 2867698 2872712 2867380 2850135
59836B850135k9435m0598m9378n5450n9483o1517o0669n6783n0987m4175l6311
$$ 2850135 2820700 2780102 2730724 2675274 2615791 2554274 2493605 2436822 2385835 2341660 2305349
59825B305349k7656j9186j1235l116N385J3423K0520K7182L3528L8768M2734M6575
$$ 2305349 2277693 2258507 2247272 2244156 2249541 2262964 2283484 2310666 2344194 2382962 2425696 2472271
59813B472271N1237N6343O1272O5943O9796P1169O8612O2092N2422M0525K7663
$$ 2472271 2523508 2579851 2641123 2707066 2776862 2848031 2916643 2978735 3031157 3071682 3099345
59802C099345J5201L655p045j6009k1523k3185k2462k0487j6684j0345k153O958
$$ 3099345 3114546 3118201 3111156 3095147 3073624 3050439 3027977 3007490 2990806 2980461 2978308 2985266
59790B985266J7214K9292M3101N8252P4867R3156J13020J34871J59976J89240
$$ 2985266 3002480 3031772 3074873 3133125 3207992 3301148 3414168 3549039 3709015 3898255
59780C898255K22340K58573K97540L38222L78156M13939M41366M54166M43838
$$ 3898255 4120595 4379168 4676708 5014930 5393086 5807025 6248391 6702557 7146395
59771G146395M02538L27004K20605R3371l9541j61478k59437l27323l65296l77178
$$ 7146395 7548933 7875937 8096542 8189913 8150372 7988894 7729457 7402134 7036838 6659660
59761F659660l68579l45616l13622k76713k38443k01845j68417j37918j09847
$$ 6659660 6291081 5945465 5631843 5355130 5116687 4914842 4746425 4608507 4498660
59752D498660q4457o2056m2154k3912o771R731K6043M2175N7826P3246Q9152J05721
$$ 4498660 4414203 4352147 4309993 4286081 4279310 4289041 4315084 4357259 4415085 4488331 4577483 4683204
59740D683204J22570J39880J58488J78612J99684K21686K45577K72061L01042
$$ 4683204 4805774 4945654 5104142 5282754 5482438 5704124 5949701 6221762 6522804
59731F522804L32659L67545M05585M45522M86211N27070N66900O03469O34710
$$ 6522804 6855463 7223008 7628593 8074115 8560326 9087396 9654296 10257765 10892475
59722A0892475O58998O73874O76029O63499O36975N98760N52068N01972M55298
$$ 10892475 11551473 12225347 12901376 13564875 14201850 14800610 15352678 15854650 16309948
59713A6309948M18180L94433L86503L96142M22973M63686N13815N69142O24644
$$ 16309948 16728128 17122561 17509064 17905206 18328179 18791865 19305680 19874822 20499466
59704B0499466O73772P10228P29330P26592O96698O36075N45876M31258K98741
$$ 20499466 21173238 21883466 22612796 23339388 24036086 24672161 25218037 25649295 25948036
59695B5948036J55868J2313j21283k36264l27217l91044m26452m34294m17149
$$ 25948036 26103904 26116217 25994934 25758670 25431453 25040409 24613957 24179663 23762514
59686B3762514l78077l20182k46971j62143o8689L1624J38203K51288L71021M96374
$$ 23762514 23384437 23064255 22817284 22655141 22586452 22618076 22756279 23007567 23378588 23874962
59676B3874962O25167P54967Q82845J003801J110222J193148J242958J248585
$$ 23874962 24500129 25255096 26137941 27141742 28251964 29445112 30688070 31936655
59668C1936655J198026J081875Q97121O48275L46895J1387l34056o63010r51457
$$ 31936655 33134681 34216556 35113677 35761952 36108847 36120234 35786178 35123168 34171711
59659C4171711j181222j341924j431805j456498j425974j352050j247603j125830
$$ 34171711 32990489 31648565 30216760 28760262 27334288 25982238 24734635 23608805
59651B3608805r98890q77816p73988o99048o61717o64319p01838p62816q31309
$$ 23608805 22609915 21732099 20958111 20259063 19597346 18933027 18231189 17468373 16637064
59642A6637064q90857r29620r42626r29906q94298q41369p78746p12983o47352
$$ 16637064 15746207 14816587 13873961 12944055 12049757 11208388 10429642 9716659 9069307
59633I069307n83355n22908m67701m17695l72019l30691k94121k61700k32268
$$ 9069307 8485952 7963044 7495343 7077648 6705629 6374938 6080817 5819117 5586849
59624E586849k05365j80984j58742j38349j20065j03712q8177p3014n9488m8885
$$ 5586849 5381484 5200500 5041758 4903409 4783344 4679632 4591455 4518441 4458953 4410068
59614D410068m0766l4292l0204k9784l2762l7845m4725n3820o4427p4789q3802
$$ 4410068 4369302 4335010 4304806 4275022 4242260 4204415 4159690 4105870 4041443 3966654 3882852
59603C882852r1341r7074j00309j00891r9195r5427q9841q3265p6421o9149o1188
$$ 3882852 3791511 3694437 3594128 3493237 3394042 3298615 3208774 3125509 3049088 2979939 2918751
59592B918751n3104m5448l7694k9190k0494j2617n478J539Q157J3641J8161K2251
$$ 2918751 2865647 2820199 2782505 2753315 2732821 2720204 2714726 2716265 2724422 2738063 2756224 2778475
59580B778475K5365K6470K5897K5109K4661K3784K2052K0157J8856J8241J8334
$$ 2778475 2803840 2830310 2856207 2881316 2905977 2929761 2951813 2971970 2990826 3009067 3027401
59569C027401J9542K2233K6429L1989L8606M5823N3538O2234P2236Q3124R4446
$$ 3027401 3046943 3069176 3095605 3127594 3166200 3212023 3265561 3327795 3400031 3483155 3577601
59558C577601J06525J19942J34697J50478J67335J85389K04383K24018K44256
$$ 3577601 3684126 3804068 3938765 4089243 4256578 4441967 4646350 4870368 5114624
59549E114624K64677K84158L01654L16692L28647L36485L39748L38804L33591
$$ 5114624 5379301 5663459 5965113 6281805 6610452 6946937 7286685 7625489 7959080
59540G959080L23186L07506K88396K68248K48431K29596K11880J93948J73572
$$ 7959080 8282266 8589772 8878168 9146416 9394847 9624443 9836323 10030271 10203843
59531A0203843J50822J29492J13886J05191J02329J04686J11888J21906J31518
$$ 10203843 10354665 10484157 10598043 10703234 10805563 10910249 11022137 11144043 11275561
59522A1275561J38195J39696J32642J13620Q1674L8169j5266p7021j44204k12957
$$ 11275561 11413756 11553452 11686094 11799714 11881388 11919557 11904291 11827270 11683066 11470109
59512A1470109k80033l42665l97409m40836m71464m89674m96125m91650m78237
$$ 11470109 11190076 10847411 10450002 10009166 9537702 9048028 8551903 8060253 7582016
59503G582016m58467m33948m05486l74414l42403l10342k78741k48711k21102
$$ 7582016 7123549 6689601 6284115 5909701 5567298 5256956 4978215 4729504 4508402
59494D508402j95271j70295j46852j26185j07814r0186p3185n7945m4366l0868
$$ 4508402 4313131 4142836 3995984 3869799 3761985 3671799 3598614 3540669 3496303 3465435
59484C465435j6740k768J0671K4362L8742N3312O7952Q3320R9697J16775J34853
$$ 3465435 3448695 3445927 3456598 3480960 3519702 3573014 3640966 3724286 3823983 3940758 4075611
59473D075611J54816J76618J99082K21307K43056K63610K81589K96033L06237
$$ 4075611 4230427 4407045 4606127 4827434 5070490 5334100 5615689 5911722 6217959
59464F217959L10322L05360K89362K62137K24139J75812J18442N4572j2788q0512
$$ 6217959 6528281 6833641 7123003 7385140 7609279 7785091 7903533 7958105 7945317 7864805
59454G864805j44990k02573k50778k88448l14939l30195l35481l32938l24299
$$ 7864805 7719815 7517242 7266464 6978016 6663077 6332882 5997401 5664463 5340164
59445E340164l10781k93855k75039k55131k34585k14309j95047j76508j58313
$$ 5340164 5029383 4735528 4460489 4205358 3970773 3756464 3561417 3384909 3226596
59436C226596j41301j26542j13559j01006q8729p7623o7717n8067m8455l9662
$$ 3226596 3085295 2958753 2845194 2744188 2655459 2577836 2510119 2452052 2403597 2363935
59426B363935l1981k4893j8200j2205o769j420L715Q160J2002J5522J8461K0848
$$ 2363935 2331954 2307061 2288861 2276656 2269887 2268467 2272182 2280342 2292344 2307866 2326327 2347175
59414B347175K3747K7782L1892L5193L8956M4306M8858M8535M2788L5467L0532
$$ 2347175 2370922 2398704 2430596 2465789 2504745 2549051 2597909 2646444 2689232 2724699 2755231
59403B755231K9405L2502M0225N1479O3876P6763R1945J10082J28292J42900J53443
$$ 2755231 2784636 2817138 2857363 2908842 2972718 3049481 3141426 3251508 3379800 3522700 3676143
59392C676143J62774J74369J90604K12664K40826K74843L14174L57539M02772
$$ 3676143 3838917 4013286 4203890 4416554 4657380 4932223 5246397 5603936 6006708
59383F006708M48147M93327N37585N77522O08283O26872O32486O24082O00199
$$ 6006708 6454855 6948182 7485767 8063289 8671572 9298444 9930930 10555012 11155211
59374A1155211N61770N12954M58379M01119L43767K89217K39339J94327J53963
$$ 11155211 11716981 12229935 12688314 13089433 13433200 13722417 13961756 14156083 14310046
59365A4310046J18006Q4698N0598J2851k9457p6459j28292j83888k40276k93677
$$ 14310046 14428052 14512750 14563348 14576199 14546742 14470283 14341991 14158103 13917827 13624150
59355A3624150l40284l75952l97011m02191l92785l71077l40286l05928k74631
$$ 13624150 13283866 12907914 12510903 12108712 11715927 11344850 11004564 10698636 10424005
59346A0424005k50629k34871k27834k30798k43492k62736k84791l07311l28043
$$ 10424005 10173376 9938505 9710671 9479873 9236381 8973645 8688854 8381543 8053500
59337H053500l43637l51537l51855l46043l34907l18937k99260k76965k52513
$$ 8053500 7709863 7358326 7006471 6660428 6325521 6006584 5707324 5430359 5177846
59328E177846k26765k01516j78001j55899j34692j14873r6931q0239o4040m8544
$$ 5177846 4951081 4749565 4571564 4415665 4280973 4166100 4069169 3988930 3924890 3876346
59318C876346l4199k0691p417N768J8825L1653M3592N3817O2575P0888P8671Q4473
$$ 3876346 3842147 3821456 3814039 3819807 3838632 3870285 3913877 3967694 4030269 4101157 4179828 4264301
59306D264301Q7426Q8024Q6462Q1678P2851O0708M6728L2025J7396L257j0732
$$ 4264301 4351727 4439751 4526213 4607891 4680742 4741450 4788178 4820203 4837599 4840856 4830124
59295D830124k4759l7383m6395n1262n3195n2741m9198m2577l4027k3878j1291
$$ 4830124 4805365 4767982 4721587 4670325 4617130 4564389 4515191 4472614 4438587 4414709 4403418
59284D403418L642J9590L6281N4882P5240R5195J13572J31515J49538J65700J78213
$$ 4403418 4407060 4426650 4462931 4517813 4593053 4688248 4801820 4933335 5082873 5248573 5426786
59273E426786J87619J94538J97147J92916J81315J62955J37482J04492O5661K4556
$$ 5426786 5614405 5808943 6006090 6199006 6380321 6543276 6680758 6785250 6850911 6875467
59263F875467j4947m9247p5514r3143j03689j08510j07710j02170r4596q7171
$$ 6875467 6860520 6811273 6735759 6642616 6538927 6430417 6322707 6220537 6125941 6038770
59253F038770p9800p2187o5831o2295o1000o0620o1262o3480o6243o7689o7032
$$ 6038770 5958970 5886783 5820952 5758657 5697657 5637037 5575775 5512295 5446052 5378363 5311331
59242E311331o4219n8732n0183l9003k5207p656J4209L9168O6252R6422J30718
$$ 5311331 5247112 5188380 5138197 5099194 5073987 5066331 5080540 5119708 5185960 5282382 5413100
59231E413100J68099K06978K47474K90012L32594L71521M04027M28335M41694
$$ 5413100 5581199 5788177 6035651 6325663 6658257 7029778 7433805 7862140 8303834
59222H303834M40427M21777L84608L29012K56675J71051P5921k5543j29235k28807
$$ 8303834 8744261 9166038 9550646 9879658 10136333 10307384 10383305 10357762 10228527 9999720
59212I999720l17709l91970m49940m90409n12676n17833n08426m87336m57960
$$ 9999720 9682011 9290041 8840101 8349692 7837016 7319183 6810757 6323421 5865461
59203E865461m24388l89774l55043l20350k86952k56330k28466k02503j78436
$$ 5865461 5441073 5051299 4696256 4375906 4088954 3832624 3604158 3401655 3223219
59194C223219j56872j37769j20747j05913r3296q2244p2440o4537n8743n3791
$$ 3223219 3066347 2928578 2807831 2701918 2608622 2526378 2453938 2389401 2330658 2276867
59184B276867m8495m3240l8708l4342k9399k4373j9969j5761j1155o548k296K243
$$ 2276867 2228372 2185132 2146424 2112082 2082683 2058310 2038341 2022580 2011425 2004877 2002581 2004824
59172B004824P303J1803J5261J9046K4109K9111L2639L5724L9976M4796M8778
$$ 2004824 2012127 2023930 2039191 2058237 2082346 2111457 2144096 2179820 2219796 2264592 2313370
59161B313370N2614N7950O4335O9889P4413P9360Q5163R0924R6334J01586J05741
$$ 2313370 2365984 2423934 2488269 2558158 2632571 2711931 2797094 2888018 2984352 3085938 3191679
59150C191679J07378J06738J05130J02392R6930Q8162P6969O3899M8839L2527
$$ 3191679 3299057 3405795 3510925 3613317 3710247 3798409 3875378 3939277 3988116 4020643
59140D020643J6501J454j2834k5952l6706m4489m9439n1466n0401m6773m1181
$$ 4020643 4037144 4038598 4025764 3999812 3963106 3918617 3869178 3817712 3767311 3720538 3679357
59129C679357l3281k2751j0595J980J5435L0978M8259O5726Q2964J01026J20613
$$ 3679357 3646076 3623325 3612730 3614710 3630145 3661123 3709382 3775108 3858072 3959098 4079711
59118D079711J41492J63444J86345K09435K31797K53242K73673K91981L06748
$$ 4079711 4221203 4384647 4570992 4780427 5012224 5265466 5539139 5831120 6137868
59109F137868L17255L22428L19454L05050K77706K37706J86078J25209N9734n030
$$ 6137868 6455123 6777551 7097005 7402055 7679761 7917467 8103545 8228754 8288488 8283458
59099H283458o5264j18233j61038j91864k11914k24303k31482k34992k36634k37948
$$ 8283458 8218194 8099961 7938923 7747059 7535145 7310842 7079360 6844368 6607734 6369786
59089F369786k39178k40357k42546k46129k48878k47910k42984k35986k27948
$$ 6369786 6130608 5890251 5647705 5401576 5152698 4904788 4661804 4425818 4197870
59080D197870k18603k08184j97347j85795j73051j60206j48844j38799j28888
$$ 4197870 3979267 3771083 3573736 3387941 3214890 3054684 2905840 2767041 2638153
59071B638153j19248j10900j03604r6366q9428q3615p8235p1935o5092n9071n3676
$$ 2638153 2518905 2408005 2304401 2208035 2118607 2034992 1956757 1884822 1819730 1760659 1706983
59060A706983m7748m1697l6911l3120k8970k4943k2904k2829k2710k1748k1039
$$ 1706983 1659235 1617538 1580627 1547507 1518537 1493594 1470690 1447861 1425151 1403403 1382364
59049A382364k0907k0238j8689j7071j5245j2083p886m334j619J922O763J1094
$$ 1382364 1361457 1341219 1322530 1305459 1290214 1278131 1270245 1265911 1264292 1266214 1272977 1284071
59037A284071J3460J4320J4396J3567J2220J1661J2453J3860J5543J8109K1598
$$ 1284071 1297531 1311851 1326247 1339814 1352034 1363695 1376148 1390008 1405551 1423660 1445258
59026A445258K4950K7393K8833K8701K6128K1471J6105J0639M882n78m576p035
$$ 1445258 1470208 1497601 1526434 1555135 1581263 1602734 1618839 1629478 1634360 1633782 1629206 1622171
59014A622171q682r258p928n196k413M40M331Q851J2553J5341J8080J9901J8690
$$ 1622171 1613489 1604231 1596303 1591107 1588694 1589134 1593465 1602316 1614869 1630210 1648290 1668191 1686881
59001A686881J4395R240M376j118p432j2986j6850j9734k1913k2454k1252j9559
$$ 1686881 1701276 1710516 1714892 1713774 1706342 1693356 1676506 1656772 1634859 1612405 1591153 1571594
58989A571594j7855j5333j2020r153o902m053o16J653K154K483L830N548P111
$$ 1571594 1553739 1538406 1526386 1517233 1510331 1506278 1505662 1507315 1509469 1511952 1515782 1521330 1528441
58976A528441R160J1689J3477J4378J6030J9208K2547K4946K7163K9949L2612
$$ 1528441 1537601 1549290 1562767 1577145 1593175 1612383 1634930 1659876 1687039 1716988 1749600
58965A749600L4602L6629L8971M0452M0362L9763L9793M0133M0209M0358M0938
$$ 1749600 1784202 1820831 1859802 1900254 1940616 1980379 2020172 2060305 2100514 2140872 2181810
58954B181810M1652M2537M4246M6670M8844N0848N4206N9661O6167P2709P9625
$$ 2181810 2223462 2265999 2310245 2356915 2405759 2456607 2510813 2570474 2636641 2709350 2788975
58943B788975Q7505R6220J05724J16354J27942J39877J52193J65096J77651J88852
$$ 2788975 2876480 2972700 3078424 3194778 3322720 3462597 3614790 3779886 3957537 4146389
58933D146389J99936K13467K30141K48846K69904K95499L26443L61109L98385
$$ 4146389 4346325 4559792 4789933 5038779 5308683 5604182 5930625 6291734 6690119
58924F690119M39155M84049N32155N82779O36094O90998P44483P93865Q37404
$$ 6690119 7129274 7613323 8145478 8728257 9364351 10055349 10799832 11593697 12431101
58915A2431101Q71921Q92158Q93357Q72246Q25030P47485O38502N01495L41628
$$ 12431101 13303022 14195180 15088537 15960783 16785813 17533298 18171800 18673295 19014923
58906A9014923J64443k1701k05049l74590n23296o46648p41089q05800q43800
$$ 19014923 19179366 19157665 18952616 18578026 18054730 17408082 16666993 15861193 15017393
58897A5017393q59114q54389q32439p97958p55872p09397o60755o12009n64062
$$ 15017393 14158279 13303890 12471451 11673493 10917621 10208224 9547469 8935460 8371398
58888H371398n16756m70919m28485l89835l53432l18968k88356k62460k39586
$$ 8371398 7854642 7383723 6955238 6565403 6211971 5893003 5604647 5342187 5102601
58879E102601k18544k00506j86148j73502j60635j48129j37097j26917j16805
$$ 5102601 4884057 4683551 4497403 4323901 4163266 4015137 3878040 3751123 3634318
58870C634318j07450r9268r0953q1711p3011o6347o1120n6265n2084m8762m5065
$$ 3634318 3526868 3427600 3336647 3254936 3181925 3115578 3054458 2998193 2946109 2897347 2852282
58859B852282m0199l5117l0475k5289j9116j3392q920m245J808Q155J3723J9433
$$ 2852282 2812083 2776966 2746491 2721202 2702086 2688694 2679774 2675529 2677337 2685492 2699215 2718648
58847B718648K6021L2281L7414M2938N0036N7252O3024O8478P5353Q3115R0518
$$ 2718648 2744669 2776950 2814364 2857302 2907338 2964590 3027614 3096092 3171445 3254560 3345078
58836C345078R8238J07534J17861J28133J38927J51382J65250J79993J96226K14348
$$ 3345078 3443316 3550850 3668711 3796844 3935771 4087153 4252403 4432396 4628622 4842970
58826D842970K33400K53183K75678L02552L33059L66283M03345M45335M91025
$$ 4842970 5076370 5329553 5605231 5907783 6240842 6607125 7010470 7455805 7946830
58817G946830N38819N88994O41698O94521P44238P88969Q26260Q50981Q57597
$$ 7946830 8485649 9074643 9716341 10410862 11155100 11944069 12770329 13621310 14478907
58808A4478907Q42846Q03949P36578O37720N09345L56950J86442N045j76792l48036
$$ 14478907 15321753 16125702 16862280 17500000 18009345 18366295 18552737 18557782 18380990 18032954
58798A8032954n01076o31030p33182q04388q46119q63136q59695q39120q05726
$$ 18032954 17531878 16900848 16167666 15363278 14517159 13654023 12794328 11955208 11149482
58789A1149482p64173p17533o68055o18740n71882n27135m83328m41222m02485
$$ 11149482 10385309 9667776 8999721 8380981 7809099 7281964 6798636 6357414 5954929
58780E954929l67210l34670l05148k78861k54497k31123k10130j93024j78788
$$ 5954929 5587719 5253049 4947901 4669040 4414543 4183420 3973290 3780266 3601478
58771C601478j65800j54617j46195j38981j30713j21876j14340j07840j00615
$$ 3601478 3435678 3281061 3134866 2995885 2865172 2743296 2628956 2521116 2420501
58762B420501r2550q4807p7205o8813o0341n3238m7131m0582l3634k7250k1178
$$ 2420501 2327951 2243144 2165939 2097126 2036785 1983547 1936416 1895834 1862200 1834950 1813772
58751A813772j4877r465o258m223j346K382N648Q430J1422J3893J4571J3732J1985
$$ 1813772 1798895 1789430 1783172 1778949 1777603 1779985 1785633 1794063 1805485 1819378 1833949 1847681 1859666
58738A859666Q158Q34q855j8388k6675l3612l8221l9853l9927m0005l9473l7504
$$ 1859666 1867824 1868658 1859803 1841415 1814740 1781128 1742907 1703054 1663127 1623122 1583649 1546145
58726A546145l5688l5767l6459l5574l3894l3692l4678l4753l3725l2941l2160
$$ 1546145 1510457 1474690 1438231 1402657 1368763 1335071 1300393 1265640 1231915 1198974 1166814
58715A166814l0073k7150k4780k2458j8952j5385j3841j3702j2748j1129j0870
$$ 1166814 1136741 1109591 1084811 1062353 1043401 1028016 1014175 1000473 987725 976596 965726
58704I65726j1948j2262j1231j0185r487q264o820o358o589o272n667n790n989
$$ 965726 953778 941516 930285 920100 910613 902349 895529 889171 882582 876310 870643 864853 858864
58691H58864n066m009m675o571p950r073j1166j3075j2532j0184q788q775q108
$$ 858864 853798 849789 845114 838543 830593 821520 810354 797279 784747 774563 765775 757000 748892
58678G48892o168m446l338j630Q99L254N474Q221J0540J0899R935R324Q723O909
$$ 748892 742724 738278 734940 733310 734209 737463 742937 751158 761698 772597 782532 791856 800579 807488
58664H07488N031N233O792P186O287N808N257K523j835m904n938o682p249n728
$$ 807488 812519 817752 824544 831730 838017 843825 849082 851605 849770 844866 838928 832246 824997 819269
58650H19269k179R16K696M856P987J0490J1763J3075J4804J5877J6425J7960K0618
$$ 819269 817090 818006 820702 825558 833545 844035 855798 868873 883677 899554 915979 933939 954557
58637I54557K3192K5828K9689L4031L7031L9370M3605M9925N6160O1991O9472
$$ 954557 977749 1003577 1033266 1067297 1104328 1143698 1187303 1237228 1293388 1355379 1424851
58626A424851P9139Q9316R9769J12456J28018J44862J62249J81073K01157K20868
$$ 1424851 1503990 1593306 1693075 1805531 1933549 2078411 2240660 2421733 2622890 2843758
58616B843758K39699K57980K73817K83417K84526K76296K56165K20791J70563
$$ 2843758 3083457 3341437 3615254 3898671 4183197 4459493 4715658 4936449 5107012
58607E107012J09896M3056k6684r4096j52581j98638k32429k53946k62455k59915
$$ 5107012 5216908 5259964 5233280 5139184 4986603 4787965 4555536 4301590 4039135 3779220
58597C779220k50716k37328k19788j99669j80431j63232j46436j29902j15800
$$ 3779220 3528504 3291176 3071388 2871719 2691288 2528056 2381620 2251718 2135918
58588B135918j04575r4076q3480p4199o6258n7759m8658m0997l4770k7627j9503
$$ 2135918 2031343 1937267 1853787 1779588 1713330 1655571 1606913 1565916 1531146 1503519 1484016
58577A484016j3276r909p144m098k831m007n014l884j374K015P249J3800J9144
$$ 1484016 1470740 1460831 1453687 1449589 1446758 1442751 1437737 1433853 1432479 1434494 1441743 1455543 1474687
58564A474687K2389K4736K5573K2069J3620K842q695k1532l4389m3665m8253n0570
$$ 1474687 1497076 1521812 1547385 1569454 1583074 1585916 1577221 1555689 1521300 1477635 1429382 1378812
58552A378812n1704m9921m5235m0830l8211l5363l1333k8297k7244k5975k3404
$$ 1378812 1327108 1277187 1231952 1191122 1152911 1117548 1086215 1057918 1030674 1004699 981295
58541I81295k1616k1677k1401j9369j7268j6281j5004j2788j1335j1149j0180
$$ 981295 959679 938002 916601 897232 879964 863683 848679 835891 824556 813407 803227
58530H03227p836o495p304q339q566r523j1414j1706r577p789q104q745q192p531
$$ 803227 795391 788896 781592 773253 764687 755164 743750 732044 722467 714678 706574 697829 689637 682106
58516F82106p266n847l238j881k352k068k3J412J116J299L196M993N831P432J0015
$$ 682106 674840 668993 665755 663874 661522 659454 659431 660843 661959 663258 666454 671447 677278 684710 694725
58501F94725J1188J0720J1710J5101J7893J8738K0229K3545K6042K6532K7619
$$ 694725 705913 716633 728343 743444 761337 780075 800304 823849 849891 876423 904042
58490I04042L0119L0440K6536K1316J7165J2226N290q24m298p787j3331j8536
$$ 904042 934161 964601 991137 1012453 1029618 1041844 1047134 1046310 1042012 1034225 1020894 1002358
58478A002358k1291k3550k6809k8562k7015k4825k4431k4034k1784j9540j8805
$$ 1002358 981067 957517 930708 902146 875131 850306 825875 801841 780057 760517 741712
58467G41712j7417j3975j1153j0915j0772q581o577o919p511o144m458m064l164
$$ 741712 724295 710320 699167 688252 677480 668899 662322 655403 647892 641748 637290 633226 630062
58454F30062p01N59j004k308p59J450K008K769N465P866Q361R626J3610J7493
$$ 630062 629361 629920 628916 626608 625849 627299 629307 632076 637541 645407 653768 663394 677004 694497
58440F94497J8897K0330K4078K7496K7892K7329K7879K6826K1358J3598O343j508
$$ 694497 713394 733724 757802 785298 813190 840519 868398 895224 916582 930180 936523 935015
58428I35015j0676j7642j9953k0673k2623k3211k0022j6385j5734j5396j1840
$$ 935015 924339 906697 886744 866071 843448 820237 800215 783830 768096 752700 740860
58417G40860p382n649m860j711K205L942N173Q676J2720J4683J6373K0101K3375
$$ 740860 733478 727829 722969 721258 723463 727405 732578 741254 753974 768657 785030 805131 828506
58404H28506K3128K1169J9910J6937R714J372m103q234j3643j7823j7568j5491
$$ 828506 851634 872803 892713 909650 919364 920736 916633 908399 894756 876933 859365 843874
58392H43874j5629j6494j4710j1662j0302r277o369l816m087m544k290kq87k418
$$ 843874 828245 811751 797041 785379 775077 765800 759431 755615 751528 746984 744694 744692 743805 741387
58378G41387j381k06j769k933k44K982K488J059L114O310O326N264P183R822R023
$$ 741387 740006 739800 738031 735098 734854 737836 740324 741383 744497 750807 757133 762397 769580 779402 788425
58363G88425P066Q355J0984J0853R930J2141J5216J5084J4202J6966K0953K1398
$$ 788425 795491 803846 814830 825683 835613 847754 862970 878054 892256 909222 930175 951573
58351I51573K0149K1320K2274J8068J1015O564L573k159q516j0636j0147j1509
$$ 951573 971722 993042 1015316 1033384 1044399 1050963 1054536 1052377 1043861 1033225 1023078 1011569
58339A011569j2900j0136n762m728m867j343L378L996K715M870Q295P599N170
$$ 1011569 998669 988533 982771 978043 973176 971833 975211 979207 981922 986792 995087 1002686 1007856
58326A007856P023J1295J1812R739J0744J3969J4732J4833J8940K4199K4740K3174
$$ 1007856 1014879 1026174 1037986 1047725 1058469 1072438 1087170 1102003 1120943 1145142 1169882 1193056
58314A193056K5991L1035L1244K7496K5703K4491J8105Q588K762L3m686r287q171
$$ 1193056 1219047 1250082 1281326 1308822 1334525 1359016 1377121 1385709 1388471 1388504 1383818 1374531 1366360
58301A366360m170l942n035o54O303P760N500P550J2857J4038J2261J4630J9574
$$ 1366360 1362190 1358248 1353213 1352559 1358862 1366622 1372122 1379672 1392529 1406567 1418828 1433458 1453032
58288A453032J9938J7820K1074K7644K8949K6458K9005L5940L9016L8881M3442
$$ 1453032 1472970 1490790 1511864 1539508 1568457 1594915 1623920 1659860 1698876 1737757 1781199
58277A781199N1703N5644N6127O0445O6272O4910N8180N4864N2951M3384K8805
$$ 1781199 1832902 1888546 1944673 2005118 2071390 2136300 2194480 2249344 2302295 2345679 2374484
58266B374484K0113J6805R851J432J864R099J1760J0635J6254K7097L1935L1989
$$ 2374484 2394597 2411402 2421253 2422685 2424549 2433648 2445408 2456043 2472297 2499394 2531329 2563318
58254B563318L8390M9257N2403M9488N3673O4278O8229O5918P0396Q1227Q5088
$$ 2563318 2601708 2650965 2703368 2752856 2806529 2870807 2939036 3004954 3075350 3156577 3241665
58243C241665Q2276Q6181R6434R9703R7218J03401J17032J22862J22019J30500
$$ 3241665 3323941 3410122 3506556 3606259 3703477 3806878 3923910 4046772 4168791 4299291
58233D299291J47232J55356J55777J66325J86600J98308K01861K16530K42299
$$ 4299291 4446523 4601879 4757656 4923981 5110581 5308889 5510750 5727280 5969579
58224E969579K59300K67491K87659L20271L44444L60812L92234M38601M76461
$$ 5969579 6228879 6496370 6784029 7104300 7448744 7809556 8201790 8640391 9116852
58215I116852N07182N57252O26802O89230P46439Q29466R39565J048076J160390
$$ 9116852 9624034 10181286 10808088 11497318 12243757 13073223 14012788 15060864 16221254
58206A6221254J316254J520741J745003K002655K349145K798089L324220L959852
$$ 16221254 17537508 19058249 20803252 22805907 25155052 27953141 31277361 35237213
58198C5237213M794804N870033P175272Q758196J0711763J3053228J5779056J9049577
$$ 35237213 40032017 45902050 53077322 61835518 72547281 85600509 101379565 120429142
58190A20429142K3109188K7988287L3516604L9558193M5583975M9576523M7969067
$$ 120429142 143538330 171526617 205043221 244601414 290185389 339761912 387730979
58183C87730979L7846589J9763211j890619k1588357l5743600m3553327m5890057
$$ 387730979 425577568 445340779 443450160 421861803 386118203 342564876 296674819
58176B96674819m4146722l9838843l4406478k8885096k3794969j9364204j5705383
$$ 296674819 252528097 212689254 178282776 149397680 125602711 106238507 90533124
58169I0533124j2785022j0441058q536472p016722n811338m802781l921289l168347
$$ 90533124 77748102 67307044 58770572 51753850 45942512 41139731 37218442 34050095
58161C4050095k524099j923676j337878p83885k43102L42039R82435J644020K323237
$$ 34050095 31525996 29602320 28264442 27480557 27237455 27579494 28561929 30205949 32529186
58152C2529186K984166L389183L146162K048839L29067j490854k955675l866958
$$ 32529186 35513352 38902535 42048697 44097536 44426603 42935749 39980074 36113116
58144C6113116m233936m169354l828336l356522k849983k363910j938612j593462
$$ 36113116 31879180 27709826 23881490 20524968 17674985 15311075 13372463 11779001
58136A1779001j316185j087160r03786p65226o54173n54593m70295m07737l58001
$$ 11779001 10462816 9375656 8471870 7706644 7052471 6497878 6027583 5619846 5261845
58127E261845l12226k76730k56501k41129k22155k06928k01019j94380j78857
$$ 5261845 4949619 4672889 4416388 4175259 3953104 3746176 3545157 3350777 3171920
58118C171920j62173j51222j38723j19484j02627r4453q6026p0915n8817n8414
$$ 3171920 3009747 2858525 2719802 2600318 2497691 2403238 2317212 2246297 2187480 2129066
58108B129066o2364o2104o2192o7249o9781o3863n6936n5662n3602m4671l5403
$$ 2129066 2066702 2004598 1942406 1875157 1805376 1741513 1684577 1628915 1575313 1530642 1495239
58097A495239l2120k9110k1157j5012j6965k1221k1758k3674l1659l9029l9304
$$ 1495239 1463119 1434009 1412852 1397840 1380875 1359654 1337896 1314222 1282563 1243534 1204230
58086A204230l7546l9561m0801l6470l1852l2266l3047k9442k6200k7580k8147
$$ 1204230 1166684 1127123 1086322 1049852 1018000 985734 952687 923245 897045 869465 841318
58075H41318k3302j8773j9856k1141j6919j2069j2593j4549j2335r167r618j0240
$$ 841318 818016 799243 779387 758246 741327 729258 716665 702116 689781 680614 670996 660756
58063F60756p124m458o315q069n164k288m744q617q603p823j0715j3735j2299
$$ 660756 653632 649174 642859 634790 629626 627338 622594 613977 605374 597551 586836 573101 560802
58050E60802r820j0915j2447j0046o832p049p704m930k128l373n187l183n87j839
$$ 560802 550982 540067 527620 517574 510742 503693 495989 491059 488931 485558 480371 477188 476601 474762
58036D74762l897k156Q30P43j66J848M222L232J466K494L574J232j299K03L109
$$ 474762 470865 468709 469539 470282 470116 471964 476186 479418 480884 483378 486952 488184 486885 487088 490197
58021D90197L240K660M791P133O277M970O735Q687P106M953O325Q540P413N403
$$ 490197 493437 496097 500888 508021 514298 519268 526003 534690 541796 546749 553074 561614 569027 574430
58007E74430O749R295Q953P782R701J2501J1901R607R553R948O630R00l336o737
$$ 574430 581179 590474 599427 607209 616910 629411 641312 650919 660472 670420 677050 677950 674614 667877
57993F67877j1789j6449j7592j7405j9454k1811k0805j8124j7274j6624j2940
$$ 667877 656088 639639 622047 604642 585188 563377 542572 524448 507174 490550 477610
57982D77610q410p122p707o365l988l521l416o95K582K762J493K465M307L608
$$ 477610 469200 462078 454371 448006 444018 440497 437081 436386 438968 441730 443223 445688 449995 453603
57968D53603J926K798M628L661J379J849M168M620L977N586Q351Q578O944O770
$$ 453603 455529 458327 462955 466616 467995 469844 474012 478632 482609 488195 496546 505124 512068 518838
57954E18838P348N666K945K569L345J575j812k905k044k646m246l523j125q20
$$ 518838 526186 531852 534797 537366 540711 542286 540474 537569 535525 532879 528633 525110 523985 523165
57940E23165k704l638l579n224q150r460r555j1229j3797j4091j2618j2839j4818
$$ 523165 520461 516823 513244 508020 499870 490410 480855 469626 455829 441738 429120 416281 401463
57927D01463j5358j4004j3308j3524j2499j0401r364q986p175m785m252m544k726
$$ 401463 386105 372101 358793 345269 332770 322369 313005 304019 296844 292059 287807 283263 280537
57914B80537L79J548J197K508N210N995M717M621O481P878Q265R463J1121J0731
$$ 280537 280916 282464 283661 286169 291379 297374 302091 306712 313193 321071 329336 338799 349920 360651
57900C60651Q390O732O206M940L119K813L673L315J770J113J100l23k609l322
$$ 360651 369041 375773 381979 386919 390038 392851 396524 399839 401609 402722 403822 403499 400890 397568
57886C97568k764l373n010n365m552m591n010l701j586j607l462m149l241k866
$$ 397568 394804 391431 386421 381056 376504 371913 366903 363202 361616 360009 356547 352398 349157 346291
57872C46291k947j443J078K072J847K839M473L914J639R48K056J917O8p32M5r3
$$ 346291 343344 341901 342979 345051 346898 349737 354210 358124 359763 360711 362767 364684 364752 364020 364065 363972
57856C63972j508j750o04p91k708l450j950m50O3J199L143L753K753K430L333
$$ 363972 362464 360714 360110 359319 356611 353161 351211 350761 350824 352023 355166 358919 361672 364102 367435
57841C67435L496K631K731L765L206O91j186j535k300l942m408l490l898o673
$$ 367435 370931 373562 376293 380058 383264 383955 382769 381234 378934 374992 370584 367094 363196 356523
57827C56523r533j0859j1590j2177j1512r866r140r447q972p732p653q533q056
$$ 356523 346990 336131 324541 312364 300852 290986 281846 272399 263427 255695 248042 239509 231453
57814B31453o218n504o143n591l394k074k358k066o32k13j121p67J563L336L454
$$ 231453 225235 219731 213588 207997 204603 202529 200171 198105 197473 197260 196139 195372 196935 200271 203725
57799B03725L938N522O152N383N853Q488J0543J0270R429R270Q210N558L521L265
$$ 203725 207663 213185 219337 224720 230573 239061 249604 259874 269303 278573 286783 292341 295862 299127
57785B99127K788Q84m65J54R80M60j62J68Q3j297k352k031j954l436n244o161
$$ 299127 301915 302799 302334 302488 303468 303928 303766 303934 304017 302720 300368 298337 296383 292947 287703 281542
57769B81542o868p662p228n410m136m055l237q29J290J994K802M578N694N324
$$ 281542 274674 267012 259784 254374 250238 246183 242946 242117 243407 245401 248203 252781 258475 263799
57755B63799N250O401O834N200L177K370J794M17p25q76j166k007j783K7J370
$$ 263799 269049 275450 282284 287484 290661 293031 294825 295242 294517 293641 292475 290468 288685 288712 290082
57740B90082J090Q90J999K962K627K262K724K639J455J223L097M985M987M313
$$ 290082 291172 292062 294061 297023 299650 301912 304636 307275 308730 309953 313050 318035 323022 327335
57726C27335M651N420N819O712Q361R145Q641R090J1560J3672J3496J2720J3509
$$ 327335 331986 337406 343225 349937 358298 367443 376084 385174 396734 410406 423902 436622 450131
57713D50131J5116J6137J7364J9668K1743K2505K3306K5347K7459K8903L1553
$$ 450131 465247 481384 498748 518416 540159 562664 585970 611317 638776 667679 699232
57702F99232L6657M2208M6267N0301N6411O3901P1481Q0324R1763J04375J16573
$$ 699232 735889 778097 824364 874665 931076 994977 1066458 1146782 1238545 1342920 1459493
57691A459493J29936J46721J65998J85476K05241K26419K47599K65690K79043
$$ 1459493 1589429 1736150 1902148 2087624 2292865 2519284 2766883 3032573 3311616
57682C311616K86803K86371K74339K49167K11178J61666J04242M5468q347n3694
$$ 3311616 3598419 3884790 4159129 4408296 4619474 4781140 4885382 4930850 4922503 4868809
57672D868809q7965j07559j10595r9565p9339n5213l5566l2690n5603j01877j59007
$$ 4868809 4780844 4673285 4562690 4463125 4383786 4328573 4293007 4260317 4204714 4102837 3943830
57661C943830k12998k53805k75736k77754k63906k40523k12487j83068j55391
$$ 3943830 3730832 3477027 3201291 2923537 2659631 2419108 2206621 2023553 1868162
57652A868162j31284j09780q9357p0778n5739m3980l4005k5394j8167j1171l413
$$ 1868162 1736878 1627098 1537741 1466963 1411224 1367244 1333239 1307845 1289678 1278507 1275094
57641A275094M244J0872J7636K6008L5311M4242N3379O3919P5507Q7536J00990
$$ 1275094 1279338 1290210 1307846 1333854 1369165 1413407 1466786 1530705 1606212 1693748 1794738
57630A794738J16618J32957J48646J64957J83306K01832K17240K28491K35740
$$ 1794738 1911356 2044313 2192959 2357916 2541222 2743054 2960294 3188785 3424525
57621C424525K36986K28831K09620J79262J37367Q4553K4814l6147r4132j45980
$$ 3424525 3661511 3890342 4099962 4279224 4416591 4501144 4525958 4489811 4395679 4249699
57611D249699j87768k16678k33687k41677k41909k34843k22914k09280j94667
$$ 4249699 4061931 3845253 3611566 3369889 3127980 2893137 2670223 2460943 2266276
57602B266276j78345j61353j45767j31702j17946j04851r3818q4663p6138o8389
$$ 2266276 2087931 1926578 1780811 1649109 1531163 1426312 1332494 1247831 1171693 1103304
57592A103304o2249n6991n1381m6029m2055l8534l3993k9386k6613k5137k3033
$$ 1103304 1041055 984064 932683 886654 844599 806065 772072 742686 716073 690936 667903
57581F67903k0423j8813j7903j6206j4007j2606j1452r270p182p268q667q598
$$ 667903 647480 628667 610764 594558 580551 567945 556493 547223 540041 532773 524106 515508
57569E15508o782n310m570k979o42N26N39J584M113O008O298O489P523Q412Q765
$$ 515508 508726 503416 498846 495867 495225 495751 496290 497874 501987 507995 514293 520782 528305 536717 545482
57554E45482R848J2259J4864J6890J8886K1166K3345K5786K9422L3920L8067M2009
$$ 545482 555330 567589 582453 599343 618229 639395 662740 688526 717948 751868 789935 831944
57542H31944M7049N3338N9955O7061P5633Q5335R5006J05139J17245J30974J44362
$$ 831944 878993 932331 992286 1059347 1134980 1220315 1315321 1420460 1537705 1668679 1813041
57531A813041J56855J69359J81377J90600J95311J94528J85973J66899J37194
$$ 1813041 1969896 2139255 2320632 2511232 2706543 2901071 3087044 3253943 3391137
57522C391137R9236N4868N462m5211r1510j29947j60101j81481j92739j94489
$$ 3391137 3490373 3545241 3550703 3505492 3413982 3284035 3123934 2942453 2749714 2555225
57512B555225j89848j81335j69741j56340j43221j30763j17675j04175r2330q2591
$$ 2555225 2365377 2184042 2014301 1857961 1714740 1583977 1466302 1362127 1269797 1187206
57502A187206p2950o2512n2994m5621l9254l2749k6681k1582j6820j2257q756
$$ 1187206 1114256 1051744 998750 953129 913875 881126 854445 832863 816043 803786 795030
57491G95030o095k658J906N982Q860J1926J6206K0948K5575L0782L6800M2867
$$ 795030 788935 786277 788183 794165 803025 814951 831157 852105 877680 908462 945262 988129
57479I88129M9194N7152O6769P6421Q5801R6647J09617J23087J36055J49574J63853
$$ 988129 1037323 1094475 1161244 1237665 1323466 1420113 1529730 1652817 1788872 1938446 2102299
57468B102299J76491J84992J88710J86787J76571J55829J24898Q5363L8734j2137
$$ 2102299 2278790 2463782 2652492 2839279 3015850 3171679 3296577 3381940 3420674 3408537
57458C408537o2325j07244j44595j73204j91924k00998k02557j98547j89634j76971
$$ 3408537 3346212 3238968 3094373 2921169 2729245 2528247 2325690 2127143 1937509 1760538
57448A760538j62925j48971j34794j20450j07398r6278q5925p5801o7257o0977
$$ 1760538 1597613 1448642 1313848 1193398 1086000 989722 903797 827996 760739 699762
57438F99762n5379m9173m3412l9404l6435l3290l0230k7751k5103k1770j8954
$$ 699762 644383 595210 551798 512394 475959 442669 412439 384688 359585 337815 318861
57427C18861j7771j7302j6046j4112j2531j1479j0649j0243j0344j0282r609q721
$$ 318861 301090 283788 267742 253630 241099 229620 218971 208728 198384 188102 178493 169772
57415A69772p819o526n161m836n522n742m908m199m262m096l209k806l487l838
$$ 169772 161953 155427 150266 145430 139908 134166 129258 125059 120797 116701 113492 110686 107199 103361
57401A03361k826j730k054l103l330k647j888j298q86j039j567j471o66m66j348
$$ 103361 100535 98805 96751 93648 90318 87671 85783 84485 83599 82560 80993 79522 78856 78390 77042
57386G7042j984j560j203j790k243j501m70l88q32r10r05j239j287p11n07j281
$$ 77042 75058 73498 72295 70505 68262 66761 66291 65903 65071 64161 63256 62017 60730 60019 59512 58231
57370E8231j948j570r71j133j493j325j188j546j582q51n07j299k015j565r47
$$ 58231 56283 54713 53742 52609 51116 49791 48603 47057 45475 44624 44117 42818 40803 39238 38291
57355C8291j334j887j323k39R4p4J09L19Qj42N09J010L59n94n12K72P02Q49J183
$$ 38291 36957 35070 33747 33508 33602 33528 33637 33956 33964 33822 34331 35341 35700 35106 34594 34866 35568 36417 37600
57336C7600J204M76j21J25L25l59r76m32M54L93j55j16J00m28j195j184o96m21
$$ 37600 38804 39280 39159 39284 39609 39250 38274 37842 38296 38689 38534 38418 38518 38090 36895 35711 35015 34594
57318C4594J50J571K856K914K549L073M063M352M209M542M976M694M232M585N364
$$ 34594 34744 36315 39171 42085 44634 47707 51770 56122 60331 64873 69849 74543 78775 83360 88724
57303H8724N629N683O318P162P527P828Q559R023Q697Q643R801J1233J1873J2559
$$ 88724 94353 100036 106354 113516 121043 128871 137430 146453 155150 163793 173594 184827 196700 209259
57289B09259J4374J6395J7276J7639J8672J9824K0291K1269K4028K6981K7614
$$ 209259 223633 240028 257304 274943 293615 313439 333730 354999 379027 406008 433622
57278D33622K6337K5500K5375K4075K0952J7174J3121P954J749m350j0131j6313
$$ 433622 459959 485459 510834 534909 555861 573035 586156 594110 595859 591509 581378 565065
57266E65065k2603k7774l1477l4143l5435l4783l3032l1637l0530k8650k5998
$$ 565065 542462 514688 483211 449068 413633 378850 345818 314181 283651 255001 229003
57255B29003k3477k1205j8844j6857j5681j4445j2333j0238r185q322o549m796
$$ 229003 205526 184321 165477 148620 132939 118494 106161 95923 86738 78416 71867 67071
57243F7071m416m606m004l462m423n738n234l432k508k472j675m45o57k022k308
$$ 67071 62655 58049 54045 50583 46160 40422 35188 31756 29248 26776 25101 24656 23999 21977 19669
57228A9669j210o78j343j764j459j531k057j855j117j376k540a41k203k123k855
$$ 19669 18459 17781 16438 14674 13215 11684 9627 7772 6655 5279 2739 -141 -2344 -4467 -7322
57213g322k702j215J8K62O04J499J980J823J931h54A007J123J455K458K336J246
$$ -7322 -10024 -11239 -11221 -10959 -10355 -8856 -6876 -5053 -3122 -854 1007 2130 3585 6043 8379 9625
57197I625J203K412K810J736R43J280J493J052J110J827J790R52J140K708L652
$$ 9625 10828 13240 16050 17786 18729 20009 21502 22554 23664 25491 27281 28233 29373 32081 35733
57182C5733L067K554L080L406K831K552L081L092K139J813K827L641L338L199
$$ 35733 38800 41354 44434 47840 50671 53223 56304 59396 61535 63348 66175 69816 73154 76353
57168G6353M138N102N418O099P497Q178P533P075P749Q360P976P568Q021Q781
$$ 76353 80491 85593 91011 97110 104607 112785 120318 127393 135142 143502 151478 159046 167067 175848
57154A75848R553J0949J2604J3133J2878J3846J6138J7399J6835J6512J7518J8202
$$ 175848 185401 196350 208954 222087 234965 248811 264949 282348 299183 315695 333213 351415
57142C51415J7678J7637J9019K0185K0224K0782K2684K4087K3930K4018K5509
$$ 351415 369093 386730 405749 425934 446158 466940 489624 513711 537641 561659 587168
57131E87168K6696K6526K6988K9581L2552L4163L5612L8260M1071M3265M6311
$$ 587168 613864 640390 667378 696959 729511 763674 799286 837546 878617 921882 968193
57120I68193N0850N4819N7119N9807O4088O7856O9935P3006P9453Q8080R7868
$$ 968193 1019043 1073862 1130981 1190788 1254876 1322732 1392667 1465673 1545126 1633206 1731074
57109A731074J10742J27393J44891J62065J82766K09940K41765K78266L26595
$$ 1731074 1841816 1969209 2114100 2276165 2458931 2668871 2910636 3188902 3515497
57100C515497L94585M84408N98342P45197R34190J167367J444314J767593K134799
$$ 3515497 3910082 4394490 4992832 5738029 6672219 7839586 9283900 11051493 13186292
57091A3186292K531259K939409L348457L744698M101374M392157M605753M731933
$$ 13186292 15717551 18656960 22005417 25750115 29851489 34243646 38849399 43581332
57083D3581332M751037M673004M577677M555066M565522M389854L773651K638424
$$ 43581332 48332369 53005373 57583050 62138116 66703638 71093492 74867143 77505567
57075G7505567J143487m42344j901617l123233m069343m739182n155494n350932
$$ 77505567 78649054 78206710 76305093 73181860 69112517 64373335 59217841 53866909
57067E3866909n353483n188626m891172m504427m067838l612120l163876k745815
$$ 53866909 48513426 43324800 38433628 33929201 29861363 26249243 23085367 20339552
57059B0339552k370954k042506j760782j526040j334399j176066j039965r18208
$$ 20339552 17968598 15926092 14165310 12639270 11304871 10128805 9088840 8170632
57051H170632q06335p02605o08023n24585m52327l89630l36056k92444k57931
$$ 8170632 7364297 6661692 6053669 5529084 5076757 4687127 4351071 4058627 3800696
57042C800696k29399k04602j83646j66604j51859j38013j25514j15104j06126
$$ 3800696 3571297 3366695 3183049 3016445 2864586 2726573 2601059 2485955 2379829
57033B379829r7625q9877q3428p7735p2050o6651o2075n7911n3591m9554m6363
$$ 2379829 2282204 2192327 2108899 2031164 1959114 1892463 1830388 1772477 1718886 1669332 1622969
57022A622969m3430l9913l6200l3197l0703k7940k5118k3030k1448j9412j6859
$$ 1622969 1579539 1539626 1503426 1470229 1439526 1411586 1386468 1363438 1341990 1322578 1305719
57011A305719j4452j2025q677m246Q61O989J4728K3370L1858M1231N3854P0421
$$ 1305719 1291267 1279242 1270565 1266319 1267180 1274169 1288897 1312267 1344125 1385356 1439210 1509631
56999A509631R0253J14098J41815J64885J65666J30105O1969j7894q6568j32161
$$ 1509631 1599884 1713982 1855797 2020682 2186348 2316453 2378422 2360528 2273960 2141799
56989B141799j54621j59079j50963j35027j15336r4785p5018n7292m3418l5652
$$ 2141799 1987178 1828099 1677136 1542109 1426773 1331988 1256970 1199678 1156260 1120608
56979A120608l5047l9874m6391n1567n4474n4954n2378m6808m0127l4455k9826
$$ 1120608 1085561 1045687 999296 947729 893255 838301 785923 739115 698988 664533 634707
56968F34707k4764j8771j2776p366k075L364Q376J2604J6620K1124K6037L0687
$$ 634707 609943 591172 578396 571030 568955 572319 580695 593299 609919 631043 657080 687767
56956F87767L4097L4867L1383K2903J0450l523j6250k5695l1090l2819l1845k9118
$$ 687767 721864 756731 788114 811017 821467 817944 801694 775999 744909 712090 680245 651127
56944F51127k5330k0929j6262j1768p872m524j083K933P292J1751J6743K2742
$$ 651127 625797 604868 588606 576838 568966 564442 563359 566292 573584 585335 602078 624820
56932F24820K9355L6040M2774M8332M8516L8718J9193m059k4401l8957m7656n0559
$$ 624820 654175 690215 732989 781321 829837 868555 887748 883689 859288 820331 772675 722116
56920G22116m8182m2782l7091l2140k7622k3486j9873j6416j2926j0154q679p878
$$ 722116 673934 631152 594061 561921 534299 510813 490940 474524 461598 451444 442765 434887
56908D34887p046o560o655o168m133j645m58m03J90J930L979N795P698R852J2052
$$ 434887 427841 421281 414626 408458 404325 402680 402222 401819 402009 403939 407918 413713 421411 431263 443315
56893D43315J4437J7340K0573K3800K7172L0714L3779L6082L8261M0109L9162
$$ 443315 457752 475092 495665 519465 546637 577351 611130 647212 685473 725582 764744
56882G64744L2724K0908O378q172k0873k9922l4169l4343l2240k8758k3975j8514
$$ 764744 797468 818376 824754 816582 795709 765787 731618 697275 665035 636277 612302 593788
56870E93788j3289q188k530L563R611J6110K3868L2456M1069N0452O1999P4662
$$ 593788 580499 572311 569781 573344 582955 599065 622933 655389 696458 746910 808909 883571
56858H83571Q4059Q4770P2971M8199J4706j9291m6026o2461o9775o9816o3997
$$ 883571 967630 1052400 1125371 1173570 1188276 1168985 1122959 1060498 990723 920907 856910
56847H56910n4624m4373l4141k3254j1887j193Q816J9364L0792M2435N4826O9658
$$ 856910 802286 757913 723772 700518 688631 687438 696254 715618 746410 788845 843671 913329
56835I13329Q7107J05228J22073J35397J39414J25343Q8604L5002k1953o9644
$$ 913329 1000436 1105664 1227737 1363134 1502548 1627891 1716495 1751497 1729544 1659900
56825A659900j02120j19504j24559j20320j09504r4744p8543o2587m7370l2901
$$ 1659900 1557780 1438276 1313717 1193397 1083893 989149 910606 848019 800649 767748
56815G67748j9543p637L263J4032K5185L7120N0569O5756Q1240R4032J00031R4054
$$ 767748 748205 740568 743831 757863 783048 820168 870737 936493 1017733 1111765 1211796 1305850
56803A305850P1747L4147j0196m9959p8278r4537j00594r8138q9520p7997o5908
$$ 1305850 1377597 1411744 1401548 1351589 1273311 1178774 1078180 980042 890522 812525 746617
56792G46617n3955m2616l2605k3720j4938o068K200R901J7880K6101L3679M0584
$$ 746617 692662 650046 617441 593721 578783 572715 574915 584816 602696 628797 662476 703060
56780G03060M7256N1994N0731M0414K1704j661k4762m2951n3685n7813n7942n5436
$$ 703060 750316 802310 853041 893455 915159 913498 888736 845785 792100 734287 676345 620909
56768F20909n0318m3551l7130l1742k6517k1430j7740j5580j3425j0665q549p709
$$ 620909 570591 527040 489910 458168 431651 410221 392481 376901 363476 352811 344262 336553
56756C36553o913n294l812l359l236k720k420k905l396l066k328j817j345p62
$$ 336553 329640 324346 320534 317175 313939 311219 308799 305894 302498 299432 297104 295287 293942 293180
56742B93180n89j001j314j222j292j634j517q80p74j602k456k771l115l646l482
$$ 293180 292591 291590 290276 289054 287762 286128 284611 283731 282957 281355 278899 276128 273013 269367 265885
56727B65885k373j436j349j368r17o87j256k067k538k802k693j559J76R33K22
$$ 265885 263512 262076 260727 259359 258442 257755 256499 254432 251894 249092 246399 244840 245016 245949 246171
56712B46171o21o27m15m91j80P45J237Q16N35J036J385R21N05P60Q46J82l16J4
$$ 246171 245550 244923 244508 244017 243837 244582 245819 246635 247170 248206 249591 250512 251017 251777 252623 252805 252489 252503
56694B52503K36l46p16L2R37P87O8j81j93o53j292j605j875k233j976r44k38m93
$$ 252503 252739 252393 251677 251709 252646 253433 253501 253320 253127 252474 251182 249577 247702 245469 243493 242549 242311 241818
56676B41818q51q07j326k863l929l382k475k907m131m507l964l631l745l696l409
$$ 241818 240967 240160 238834 235971 232042 228660 226185 223278 219147 214640 210676 207045 203300 199604 196195
56661A96195l133k617j778j421j925k191j255R8O60Q35J809L513M830N242M990
$$ 196195 193062 190445 188667 187246 185321 183130 181875 181973 182633 183468 185277 188790 193620 198862 203852
56646B03852M337L706L902N061O171O456O386O522O433N671M698L848K603Q24
$$ 203852 208189 211895 215797 220858 227029 233485 239871 246393 252826 258497 263195 267043 269646 270470
56632B70470n00o87m06k90J22J067J622J217O59N50J66r06j573j029k23j41j23
$$ 270470 269970 269283 268877 268587 268709 269776 271398 272615 273274 273824 273990 273084 271511 270482 270259 270118 269995
56615B69995N93J111L81q80j333j008o86m41j95m82j307j489n21K53l02j220j064
$$ 269995 270588 271699 272080 271200 269867 268859 268173 267732 267537 267055 265748 264259 263738 263991 263689 262469 261405
56598B61405j60L12J88o8m79r00n95L34N31m72j334j280j447k419k561o65J716
$$ 261405 261245 261557 261745 261677 261198 260298 259703 260037 260568 260096 258762 257482 256035 253616 251055 250390 252106
56581B52106K592K321K121J673M49l56L85J536J551J094J585K590K982L171L900
$$ 252106 254698 257019 259140 260813 261262 260906 261291 262827 264378 265472 267057 269647 272629 275800 279700
56566B79700M323L640L213M503O298O539N585N108N072M496M004M804O051N964
$$ 279700 284023 287663 290876 295379 301677 308216 313801 318909 323981 328477 332481 337285 343336 349300
56552C49300M710L678K871J497K46K57P64K31j019j766k428m001n538n450m407
$$ 349300 354010 357688 360559 362056 362302 362559 363323 363554 362535 360769 358341 354340 348802 343352 338945
56537C38945m263m921n017m839n596o600o126m481l477l367l098k815l320l730
$$ 338945 334682 329761 324744 319905 314309 307709 301583 297102 293625 290258 287160 284345 281025 277295
56523B77295k709j358j786l327l402j794p84j201j535j106r87j437j309m14N1
$$ 277295 274586 273228 271442 268115 264713 262919 262135 260934 259399 258293 257306 255869 254560 254146 254197
56508B54197k52m80n76j246j985j579m62k38r03r43j01L63P5j27r4l55m56L82
$$ 254197 253945 253465 252889 251643 249658 248079 247617 247379 246476 245533 245432 245795 245870 245743 245649 245294 244838 245220
56490B45220J356J218O72J243K348K236J189R48J479J414J143K214L938L992K398
$$ 245220 246576 247794 248466 249709 252057 254293 255482 256430 257909 259323 260466 262680 266618 270610 273008
56475B73008J575K318K883K447K230K758L007K783L161M045M006L018K656L233
$$ 273008 274583 276901 279784 282231 284461 287219 290226 293009 296170 300215 304221 307239 309895 313128
56461C13128L351K595K088K032J379J79k96L2n8o32o68m45j165k275k032o19J35
$$ 313128 316479 319074 321162 323194 324573 324752 324456 324488 324430 323798 323130 322685 321520 319245 317213 316594 316729
56444C16729J7L96J036L15j377j807p23j77p15o89K13K00j188k151j972k065k956
$$ 316729 316746 317142 318178 318493 317116 315309 314586 314409 313694 313005 313218 313418 312230 310079 308107 306042 303086
56427C03086l297k731k697l616m121l773l701l966l172j274K2K39N58J117P99
$$ 303086 299789 297058 294361 290745 286624 282851 279150 275184 272012 270738 270760 270999 271557 272674 273473
56412B73473n0J52J083R05j12R0J263R16j076j941p82J39k45j94J019J633J031
$$ 273473 273423 273575 274658 275563 275451 275541 276804 277720 276644 274703 273921 274060 273815 273621 274640 276273 277304
56395B77304R71J918J887L83k80Q70J726J083O26J320J489K59n67L2L34q23j974
$$ 277304 278275 280193 282080 282463 282183 283053 284779 285862 286488 287808 289297 289556 288989 289021 289355 288532 286558
56378B86558k010k029k564k194n30O72Q57J780L843M831L938L340M114M272K830
$$ 286558 284548 282519 279955 277761 277231 277903 278760 280540 284383 289214 293152 296492 300606 304878 307708
56363C07708J979L075M052L183J927J786J692Q09O25J851K539J570Q54J687K286
$$ 307708 309687 312762 316814 319997 321924 323710 325402 326211 326836 328687 331226 332796 333650 335337 337623
56348C37623J302N42J615K926K667J890K114K606K450K559L399L455K089J118
$$ 337623 338925 339467 341082 344008 346675 348565 350679 353285 355735 358294 361693 365148 367237 368355
56334C68355J601K017J525J770L495M723M441M627O354P520O781O152P119P834
$$ 368355 369956 371973 373498 375268 378763 383486 387927 392554 398908 406428 413209 419361 426480 434314
56320D34314O813N899O594P074N784M589N244O058N189L982L917L484J336o84
$$ 434314 441127 447026 453620 460694 466478 471067 476311 482369 487558 491540 495457 498941 500277 499593
56306D99593q77r06k385l452k141j89%n56J59J420J709J837K921L824L629L934
$$ 499593 498716 497810 495425 491973 489832 489643 489643 489087 489246 490666 492375 494212 497133 500957 504586 508520
56290E08520N788P263O941O816Q624J0530J0627J0523J2094J3912J4375J5206
$$ 508520 514308 521571 528512 535328 543952 554482 565109 575632 587726 601638 616013 631219
56278F31219J8168K1385K2676K3551K6212K9486L1521L3607L7564M2135M5741
$$ 631219 649387 670772 693448 716999 743211 772697 804218 837825 875389 917524 963265
56267I63265M9998N6824O4775P1951P9612Q9330R9575J08859J19124J32093J45375
$$ 963265 1013263 1070087 1134862 1206813 1286425 1375755 1475330 1584189 1703313 1835406 1980781
56256A980781J56149J65652J75926J85180J90644J92907J93185J89286J78838
$$ 1980781 2136930 2302582 2478508 2663688 2854332 3047239 3240424 3429710 3608548
56247C608548J63643J46423J26064J00580P1997M3852J6613j0110l3798n2079
$$ 3608548 3772191 3918614 4044678 4145258 4217255 4261107 4277720 4267610 4233812 4181733
56237D181733o6605p9448q8695r2334r3210r5041r6656r5473r3629r4901r8250
$$ 4181733 4115128 4035680 3946985 3854651 3761441 3666400 3569744 3474271 3380642 3285741 3187491
56226C187491j00244j01521j05026j09892j12812j13841j15337j16780j15904
$$ 3187491 3087247 2985726 2880700 2770808 2657996 2544155 2428818 2312038 2196134
56217B196134j13401j11432j09086j04244r8154r3290q8620q1859p4322o8630
$$ 2196134 2082733 1971301 1862215 1757971 1659817 1566527 1477907 1396048 1321726 1253096
56207A253096o3692n7066n0105m5610m2541l8191l3492l0919k9289k6016k2297
$$ 1253096 1189404 1132338 1082233 1036623 994082 955891 922399 891480 862191 836175 813878
56196H13878k0695j9792j6772j3084j1946j2274j0786q077o962o743m831k159
$$ 813878 793183 773391 756619 743535 731589 719315 708529 700452 693490 686747 681916 679757
56184F79757j402j782r75K2o95j119J352M460M767M002N651Q058P605N894O888
$$ 679757 678355 676573 675598 675620 674925 673806 675158 679618 684385 688387 694038 702096 709701 715595 722483
56169G22483R309R058O931O740P746O332L415K885M235L847K178K540M273M087
$$ 722483 731792 740850 747781 754521 762267 768599 772014 774899 779134 782981 785159 787699 791972 796059
56155G96059K730L373N088M866M309P141J1887J4360J5453J9080K4400K7832L0824
$$ 796059 798789 802162 807250 812116 816425 823566 835453 849813 865266 884346 908746 936578 967402
56142I67402L7539M6703N4004O0859P2331Q7767J01958J14077J26708J37276J39536
$$ 967402 1004941 1051644 1105648 1166507 1238838 1326605 1428563 1542640 1669348 1806624 1946160
56131A946160J33006J22572J09789R3177P6077O4927N9954N5802N0471M5324L7810
$$ 1946160 2079166 2201738 2311527 2404704 2480781 2545708 2605662 2661464 2711935 2757259 2795069
56120B795069K3763O095p970j7494k6794l5439l9577m2165n1193o7521q4318r8325
$$ 2795069 2818832 2824927 2816957 2799463 2772669 2737230 2697653 2655488 2604295 2536774 2452456 2354131
56108B354131j11525j21938j23626j16734j07616r8396q6001p1506o0274n2479
$$ 2354131 2242606 2120668 1997042 1880308 1772692 1674296 1588295 1516789 1456515 1404036
56098A404036m3635l4512l0358l0253k7999k3566k2680k4985k3975j9155j6716
$$ 1404036 1360401 1325889 1295531 1265278 1237279 1213713 1191033 1166048 1142073 1122918 1106202
56087A106202j7413j5467j0378q081r145p625k915j035k737k143J523K695J122
$$ 1106202 1088789 1073322 1062944 1054863 1045718 1038093 1035178 1034143 1031406 1029263 1030786 1033481 1034603
56074A034603K604O912P390M001L991Q201R657P288P718J1657J2200Q716Q617
$$ 1034603 1037207 1044119 1051509 1055510 1059501 1067702 1077359 1084647 1092365 1104022 1116222 1124938 1133555
56061A133555J2983J4373J1383J1206J5162J6119J2972J3010J7023J7111J2411
$$ 1133555 1146538 1160911 1172294 1183500 1198662 1214781 1227753 1240763 1257786 1274897 1287308
56050A287308J1535J6086J7444J3610J3142J8291K0559J7527J7520K2756K4602
$$ 1287308 1298843 1314929 1332373 1345983 1359125 1377416 1397975 1415502 1433022 1455778 1480380
56039A480380K0713K0094K5635K8568K5861K5959L1358L3104K8734K7969L4102
$$ 1480380 1501093 1521187 1546822 1575390 1601251 1627210 1658568 1691672 1720406 1748375 1782477
56028A782477L7698L5278L5932M2515M5119M0544L9220M5138M8217M4388M3574
$$ 1782477 1820175 1855453 1891385 1933900 1979019 2019563 2058783 2103921 2152138 2196526 2240100
56017B240100M9597N2343M8302M8334N6313O1035N8258N9157O7735P2206O8466
$$ 2240100 2289697 2342040 2390342 2438676 2494989 2556024 2614282 2673439 2741174 2813380 2881846
56006B881846O9072P8808Q4984Q2611Q4575R5776J02554R9676J01578J14339J23452
$$ 2881846 2950918 3029726 3114710 3197321 3281896 3377672 3480226 3579902 3681480 3795819 3919271
55995C919271J22573J26458J41472J52316J52638J58760J77483J91516J93282
$$ 3919271 4041844 4168302 4309774 4462090 4614728 4773488 4950971 5142487 5335769
55986E335769K00728K22147K39410K44553K57474K87468L14378L29027L53314
$$ 5335769 5536497 5758644 5998054 6242607 6500081 6787549 7101927 7430954 7784268
55977G784268L97527M38952M67205N07330N71706O35140O86227P54513Q55936
$$ 7784268 8181795 8620747 9087952 9595282 10166988 10802128 11488355 12242868 13098804
55968A3098804R63621J066523J201075J388215J599925J829086K126797K526076
$$ 13098804 14062425 15128948 16330023 17718238 19318163 21147249 23274046 25800122
55960B5800122L001974L558829M277719N221153O379449P771448R490919J1584981
$$ 25800122 28802096 32360925 36638644 41859797 48239246 56010694 65501613 77086594
55952G7086594J4026167J6901804K0462075K4843570K9933690L5616050M1660438
$$ 77086594 91112761 108014565 128476640 153320210 183253900 218869950 260530388
55945B60530388M6739117M7775041M1345406K6555798O467141j3651819k9506214
$$ 260530388 307269505 355044546 396389952 422945750 429412891 415761072 386254858
55938C86254858l9419177m3733351m3589736m0362891l5489207l0156041k5056010
$$ 386254858 346835681 303102330 259512594 219149703 183660496 153504455 128448445
55931A28448445k0503861j6662278j3568915j1107318r123156p540107o308441
$$ 128448445 107944584 91282306 77713391 66606073 57482917 49942810 43634369
55924D3634369n328881m508936l831039l296692k858867k467917k129865j861986
$$ 43634369 38305488 33796552 29965513 26668821 23809954 21342037 19212172 17350186
55916A7350186j637302j423864j234874j091234r73592q55914p49876o73915o12197
$$ 17350186 15712884 14289020 13054146 11962912 10989320 10133406 9383530 8709615 8097418
55907H097418n43810m81128m41818m11993l72327l33261l10902k93949k66501
$$ 8097418 7553608 7072480 6630662 6218669 5846342 5513081 5202179 4908230 4641729
55898D641729k39166k26953k19259k00862j80863j72855j67434j51321j33934
$$ 4641729 4402563 4175610 3956351 3755489 3574626 3401771 3234337 3083016 2949082
55889B949082j28825j27505j16703j03668j00247r9144q9353p8588p7745p8959
$$ 2949082 2820257 2692752 2576049 2472381 2372134 2272990 2183637 2105049 2027304 1948345
55879A948345p0996o1045o0048o1280n4421m6338m7411n0941m6217l8898l8890
$$ 1948345 1877349 1816304 1756256 1694976 1640555 1594217 1546806 1495865 1449648 1410750 1371860
55868A371860m0727l5069k7539k7586l0261k7060k3116k6068k9290k3828j5903
$$ 1371860 1331133 1296064 1268525 1240939 1210678 1183618 1160502 1134434 1105144 1081316 1065413
55857A065413j5163j6370j0047j032P71j721r51j127r543k0354k3628k2385k4799
$$ 1065413 1050250 1033880 1023833 1022801 1023572 1021851 1020900 1019773 1010230 989876 966248 943863 919064
55844I19064k7746k3951j7625j7165j9455j6754j2188j3426j7614j7299j4919
$$ 919064 891318 867367 849742 832577 813122 796368 784180 770754 753140 735841 720922
55833G20922j7106k0886j9585j6352j7910k0883j8070j2569j2015j4300j2513
$$ 720922 703816 682930 663345 646993 629083 608200 590130 577561 565546 551246 538733
55822E38733q729r465j2443j1055p408p989j0833r559n863n623o787l461K049
$$ 538733 530004 520539 508096 497041 489633 481644 470811 461252 455389 449766 442979 439518 441567
55809D41567L332K074M356Q561Q750O368O995Q884O358J362K09J833L40l653n117
$$ 441567 444899 446973 451329 459890 468640 475008 482003 490887 497245 498607 498816 500649 500989 497336 492219
55794D92219n144q538j3553j4632j2862j3434j5261j3394r271q366r847q597n262
$$ 492219 487075 478537 464984 450352 437490 424056 408795 395401 386130 377764 367917 359320 354058
55781C54058m537n643m116r89n99j556N86L734J960m027q405j0276j3033j5617
$$ 354058 349521 343878 339762 338773 338174 336618 337204 340938 342898 338871 330466 320190 307157 291540
55767B91540j3890r281o991o833m444j29J957J922K968L834Q10m344o795p137
$$ 291540 277650 268369 261378 254545 250101 249972 251929 253851 256819 260653 261463 257119 250324 243187
55753B43187r326j2096j1100p755p265r259r005o497n715o270m401j157j002l268
$$ 243187 233861 221765 210665 202910 195645 186386 177381 170884 165169 158899 154498 153341 152339 149071
55739A49071l399j668k190m268l299L63J906R35J546L971M305K343J597J783p69
$$ 149071 145672 144004 141814 137546 134247 134610 136516 137451 138997 142968 147273 149616 151213 152996 152227
55724A52227n296p077n693n280o556o154l804k773l122j782P92J162j31O05K854
$$ 152227 146931 139854 134161 128881 122325 116171 112367 109594 106472 104690 105482 106644 106513 107118 109972
55709A09972K702O24R58L890N519N687P934J1599J1905Q352N366M169J601k329
$$ 109972 112674 113298 114256 118146 123665 129352 137286 148885 160790 169142 174508 178677 180278 177949
55695A77949l530j426r9p71l80J362R09j962l086j442q06k416k909j107j81j229
$$ 177949 174419 172993 172894 172123 171743 173105 174014 172052 168966 167524 166718 164302 161393 160286 160105 158876
55679A58876j148J280L273L574M174N201M176J558R92K700K828O36l2K022L063
$$ 158876 157728 159008 162281 165855 170029 175230 179406 180964 181956 184656 187484 188120 188088 190110 193173
55664A93173J311j21P88J874J759K259L794L821J884R69J970K084M20j93J111
$$ 193173 194484 194363 195151 197025 198784 201043 204837 208658 210542 211511 213481 215565 215985 215792 216903
55649B16903J181j454l998m624n325p414q940q683q267q383p397n304m696o132
$$ 216903 218084 216630 212632 208008 202683 195269 186329 177646 169379 160996 153599 148295 143599 137467
55635A37467o974o196n880o660o347m451l399l914l844k775l070m943n476l887
$$ 137467 130493 124297 118417 111757 105410 100959 97560 93646 89802 87027 83957 79014 73538 69651
55621F9651k940l646l531j666m92j000j007J43J12j515j895k15O69l48n75J114
$$ 69651 66711 63065 59534 57868 57376 56376 55369 55512 55624 54109 52214 51999 52668 52320 51745 52859
55605E2859J982O64k97N54Q56p19j701m78O96Rq11k62J00q35j324k95M38l06r76
$$ 52859 54841 55505 55208 55762 56618 55899 54198 53720 54416 54425 53614 53352 53452 52617 51293 50998 51436 51130 50154
55586E0154o70q54j851j614J64Q00o82j696q57k77j128j346KN07r73j735N8K154
$$ 50154 49484 48630 46779 45165 45329 46129 45447 43751 42894 42617 41489 40143 40145 40652 39679 37944 38002 40156
55568D0156K353J961K493K717J681J051J841K336J598J467K717K953P90j505j903
$$ 40156 42509 44470 46963 49680 51361 52412 54253 56589 58187 59654 62371 65324 66114 64609 62706
55553F2706j586j725j076P03J279k72j246K04J960J887J256J549J578N08J68J559
$$ 62706 61120 59395 58319 59022 60301 60029 58783 58987 60947 62834 64090 65639 67217 67725 67893 69452
55537F9452K528J775J510L295M786L769K058K144L135L198L017L692M041L052
$$ 69452 71980 73755 75265 78560 83346 87115 89173 91317 94452 97650 100667 104359 108400 111452
55523A11452K212K607K555Q78m33L50J616J587J476K453K546j60l964o358p718
$$ 111452 113664 116271 118826 119704 119271 119621 121237 122824 124300 126753 129299 129139 125175 118817 111099
55508A11099r235r846q508o955p030p537o726n506n250m821k863p93m72j113j266
$$ 111099 101864 92018 83510 76555 69525 61988 55262 49756 44506 39685 36822 36029 35557 34444 33178
55493C3178j699l327m655m097k810k393k015o12L77n72k019j900r29q31j108l75
$$ 33178 31479 28152 23497 19400 16590 14197 12182 11570 11947 11375 9356 7456 6527 5696 4588 4213
55477D213Q04J148R83J023N69p66j516p05K80J89K2N54L92j242k373j439l6M4
$$ 4213 5017 6165 7148 8171 8740 7974 6458 5753 6033 6222 6244 6798 7190 5948 3575 2136 2100 2144
55459B144j88N55R73j79j215k79J301J417O72O38Q15K10k25M25Q66J2o70Q9P95
$$ 2144 1956 2511 3484 3305 2090 1811 3112 4529 5201 5839 6654 6864 6639 7064 7930 7942 7272 7361 8156
55440H156Q4m87N49J482N05q06m38L32l89j282l69J092R97M01J240K301J456o0
$$ 8156 8240 7753 8302 9784 10289 9483 9045 9377 8988 7706 7337 8429 9426 9827 11067 13368 14824 14764
55422A4764K83J783K028J278J308J501J82j516j232K70L60q89j216l20K33L68
$$ 14764 15047 16830 18858 20136 21444 22945 23127 21611 20379 20649 21009 20120 18904 18584 18817 19185
55406A9185J113J791J093R0O79J934J513j94r17n27o40j067l90O36m5j908k492
$$ 19185 20298 22089 23182 23272 23951 25885 27398 27204 26287 25760 25120 24053 23663 24299 24254 22346 19854
55389A9854j582j250j960j999p98K93N89O56M91k46o26L87J733J705Q53Q43J366
$$ 19854 18272 17022 15062 13063 12265 12558 13147 13803 14294 14048 13422 13809 15542 17247 18100 18943 20309
55372B0309R96Q0q8kp89j422k30J654J738K33o00m58r30k023k199j514j387j598
$$ 20309 21305 21385 21297 21295 20506 19084 18854 20508 22246 22479 21879 21421 20491 18468 16269 14755 13368 11770
55354A1770p22P09P54m71j024n12l07n84k72L27n2q99n89M80M83l80j84J134J614
$$ 11770 11048 11757 12511 12040 11016 10504 10197 9613 9341 9668 9616 8717 8128 8608 9091 8711 8527 9661 11275
55335A1275O85k50n38p89q12J19J117O52o03o97K19L63k97k25N34N24j00Q6O95
$$ 11275 11960 11710 11172 10383 9571 9690 10807 11459 10856 10159 10378 10741 10444 10219 10753 11277 11177 11263 11958
55316A1958J12j144j005L62Q07J63L77J579J638J25p84p1P57O63M41M68Jp05l69
$$ 11958 12070 10926 9921 10283 11090 11253 11630 13209 14847 14972 14188 14117 14874 15537 15978 16446 16447 15742 15373
55297A5373P77J086L88J1j13j272k796k440k74J087P13M69J315J826J272R56J418
$$ 15373 16150 17236 17624 17635 17522 16250 13454 11014 10740 11827 12540 13009 14324 16150 17422 18378 19796
55280A9796J323J74o83p12j049j864j668k40O06J57n6P73J282O16j01p0j21o45
$$ 19796 21119 21293 20610 19898 18849 16985 15317 15077 15683 15840 15784 16557 17839 18455 18354 18284 18163 17518
55262A7518o18K31O41J19j72K83N05J80L07Q79M82j023j837j166l98m78n14N9
$$ 17518 16900 17131 17772 17891 17719 18002 18507 18687 18994 19873 20355 19332 17495 16329 15931 15453 14939 14998
55244A4998L86J62L28R56Q07j97m69M38R62L61j61J8q4o31j81J464K287J256k9
$$ 14998 15384 15546 15874 16830 17637 17440 16971 17409 18371 18732 18571 18589 18505 17874 17693 19157 21444 22700 22671
55225B2671j69l7n86r57l34L71J82l40l75q0L80J188J707Q90n94q45J77N70r7
$$ 22671 22502 22465 21879 20922 20588 20959 21141 20801 20426 20346 20726 21914 23621 24511 23917 23072 23249 23819 23722
55206B3722j52P66Q07n35j190k09M67m61j386q77j54l63k47J141K058Q33j099
$$ 23722 23570 24336 25143 24608 23418 23209 23676 23215 21829 20952 20798 20435 20188 21329 23387 24220 23121
55189B3121j454m31M31R69J644J758O68n77p94n55p91j027o26k35l68j68P48R83
$$ 23121 21667 21236 21667 22636 24280 26038 26706 26129 25335 24780 23989 22962 22336 22101 21733 21565 22313 23296
55171B3296l46j727j554o16l75m17K99J187J135O25O63P87R1q41r21m99n52r22
$$ 23296 22950 21223 19669 19053 18678 18261 18560 19747 20882 21507 22170 22957 23048 22207 21286 20787 20235 19313
55153A9313r02o41m57R2J044J202mj095o24N78Q90L76L4k03q87j475j099j04P51
$$ 19313 18411 17770 17313 17405 18449 19651 19647 18552 17928 18506 19396 19772 19806 19603 18716 17241 16142 16038 16789
55134A6789J634K764L153J987K96l40N2L99M69O71Q70P91Q63J289J232J43j020
$$ 16789 18423 21187 24340 26327 26623 26283 26335 26734 27203 27874 28744 29535 30398 31687 32919 33062 32042
55117C2042j207q58q11p53k30M5n83j208o98L50O31K19J15M50O85Q44J192J303
$$ 32042 30835 29977 29166 28413 28183 28228 27645 26437 25739 26089 26720 26939 27054 27504 28189 29033 30225 31528
55099C1528P92K80L72N53K36n6J96K88m43j099n48P17J419J437J335J018L42K21
$$ 31528 32320 32600 32972 33525 33761 33705 33901 34189 33746 32647 32099 32816 34235 35672 37007 38025 38367 38588
55081C8588J363K653K536J352O50P16O01J72K73R14J010J37q10j001o77m88n45
$$ 38588 39951 42604 45140 46492 47142 47858 48459 48631 48904 49818 50828 50965 50155 49154 48477 47989 47444
55064D7444m05L08J307J628O59q20j387q05j61p0m1M8m81j534j801q63j43o50
$$ 47444 47039 47347 48654 50282 50941 50121 48734 47929 47768 47698 47657 47705 47224 45690 43889 43026 42883 42233
55046D2233j300p57M29R14O47M33M33L89M67O95M33m73j037o39r4j28n8P80J483
$$ 42233 40933 40176 40605 41519 42166 42599 43032 43421 43888 44583 45016 44543 43506 42867 42773 42645 42587 43367 44850
55027D4850J028J08P4Q74J450J460J248Q63L00J1J40O0m78o67r2L54J4l35O2N63
$$ 44850 45878 45986 46060 46934 48384 49844 51092 51955 52255 52266 52406 52466 51988 51321 51229 51583 51597 51262 51324 51887
55007E1887M21J88M23L55o77j689j488n58n8L7L24N08J29k69j42j19p55j192n87
$$ 51887 52308 52496 52919 53274 52597 50908 49420 48862 48804 48841 49165 49673 49802 49533 49391 49272 48517 47325 46738
54988D6738K03n9r94j389j097o23R0J104J684J491J451K084K296J245N9KL54k5
$$ 46738 46941 46882 45888 44499 43402 42779 42869 43973 45657 47148 48599 50683 52979 54224 54283 54285 54639 54614
54970E4614m74J44J169J382J332K219L529M016M069M835N833N749M899M701N345
$$ 54614 54140 54284 55453 56835 58167 60386 63915 67931 72000 76835 82668 88417 93316 98017 103362
54955A03362O076P092Q959J0788J1346J1349J2466J4514J5816J5835J5165J3450
$$ 103362 109438 116530 125489 136277 147623 158972 171438 185952 201768 217603 232768 246218
54943B46218R766M710j35m583r406j3873j6130j6067j5433j5047j4094j2304j0603
$$ 246218 255984 260694 260559 255976 246570 232697 216567 200500 185067 170020 155926 143622 133019
54930A33019r394q153o929o356o042m824k821j416j016o56R2O16Q05J326K111
$$ 133019 123625 115472 108543 102187 96145 91321 88500 87084 86068 85412 85504 86120 86925 88251 90362
54915I0362K285J921K245L843N973P813R152R906J0291J1298J3563J5972J6767
$$ 90362 92647 94568 96813 100656 106629 114442 123594 133500 143791 155089 168652 184624 201391
54902B01391J5681J3610J0699O539J754k458o099r882j3294j5071j5336j5317
$$ 201391 217072 230682 241381 247920 249674 247216 241117 231235 217941 202870 187534 172217
54890A72217j5117j3791j1487r509q213o827n336m595m526m094l167k539k151
$$ 172217 157100 143309 131822 122313 114100 107273 101937 97342 92816 88722 85555 83016 80865
54877H0865j237j88k68j322j804j276r13j367j974k293k585k621j901j027j041
$$ 80865 79628 79440 79172 77850 76046 74770 73857 72490 70516 68223 65638 63017 61116 60089 59048
54862E9048j475j018l8j57j322j728q74k03l39k08N19O46j19l67M35Q75J66m70
$$ 59048 57573 56555 56517 56360 55038 53310 52436 52233 51894 51686 52205 52851 52732 52365 52800 53675 53841 53371
54844E3371j69q6j260k669k865k068j254m75O28J755K460K867K999K460J365N96
$$ 53371 53202 53116 51856 49187 46322 44254 43000 42525 43153 44908 47368 50235 53234 55694 57059 57655
54828E7655N48O54M68J60k81j016j410o28P46J293J037J281K017J740K80m80M54
$$ 57655 58203 58857 59325 59485 59204 58188 56778 56150 56896 58189 59226 60507 62524 64264 64544 64064 64518
54811F4518J717K058K186K932L532L243K953L693M891N557N972O961Q446R889
$$ 64518 66235 68293 70479 73411 76943 80186 83139 86832 91723 97280 103252 110213 118659 128548
54797A28548J1188J2244J2702J2888J3842J5589J6568J5590J3136R958N875Q73
$$ 128548 139736 151980 164682 177570 191412 207001 223569 239159 252295 262253 268128 269001
54785B69001l939p587j0308j2485j3633j3435j2654j2053j1377j0228q923p717
$$ 269001 265062 257475 247167 234682 221049 207614 194960 182907 171530 161302 152379 144662
54773A44662o323m780l690k966j633M02J807J873J650K186L010L450M049N527
$$ 144662 138339 133559 129869 126903 125270 125672 127479 129352 131002 133188 136198 139648 143697 149224
54759A49224P500R335J1247J3472J5448J6808J8136J9804K1110K1448K1225K0661
$$ 149224 156724 166059 177306 190778 206226 223034 241170 260974 282084 303532 324757 345418
54747C45418J8804J4746Q930K293m718j1526j6902k0221k2183k3465k3681k2459
$$ 345418 364222 378968 387898 390191 385473 373947 357045 336824 314641 291176 267495 245036
54735B45036k0382j8040j5274j2261j0052r082q457p611p272p688p471n593l291
$$ 245036 224654 206614 191340 179079 169027 159945 151488 143877 136605 128917 121446 115853 112562
54722A12562k398k855l311l233k906k262j222n16q01j474j552j130q65p46m43
$$ 112562 110164 107309 103998 100765 97859 95597 94375 93859 93058 91584 90032 88902 88037 87291 86848
54707H6848k09k83j17P05J439J141J13o66q92q08m47J12M01L29N93J478K146J886
$$ 86848 86639 86356 86239 86944 88383 89524 89637 88971 88079 87271 86824 86936 87337 87666 88259 89737 91883 93769
54689I3769J177O28p7j130j657r45K41P75P38P84Q41O13N01Q12Q77J98l69J69
$$ 93769 94946 95574 95497 94367 92710 91765 92006 92781 93519 94303 95144 95757 96258 97070 97947 98145 97776 97945
54671I7945J323J970K101K409K845K912K792K955L219L319L731M838N899O109
$$ 97945 99268 101238 103339 105748 108593 111505 114297 117252 120471 123790 127521 132359 138258 144367
54657A44367N936O196O544O168N412N251N826O665P911R923J2186J3847J4962
$$ 144367 150303 156499 163043 169211 174623 179874 185700 192365 200276 210199 222385 236232 251194
54644B51194J6008J6733J6678J6235J5890J4902J2161P861L037k096p863j3592
$$ 251194 267202 283935 300613 316848 332738 347640 359801 367662 370699 368603 360740 347148
54632C47148j7864k0218k1309k1508k0588j8684j6454j4291j2317j0873j0058
$$ 347148 329284 309066 287757 266249 245661 226977 210523 196232 183915 173042 162984
54621A62984r143p472n577m400l826l111k338k118k253j949j145m51N5P27J282
$$ 162984 153841 146369 140792 136392 132566 129455 127117 124999 122746 120797 119652 119201 119256 119983 121265
54606A21265J067K86j95j82j91l67m49o83j562k692l071k541j921j693j542j299
$$ 121265 122332 122618 122423 122241 122050 121683 121234 120551 118989 116297 113226 110685 108764 107071 105529 104230
54590A04230j315j708k106k231k160j917j525j314j578k057k255k080j663j016
$$ 104230 102915 101207 99101 96870 94710 92793 91268 89954 88376 86319 84064 81984 80321 79305
54576G9305m46o88j781k446j615l7P43N08L03N74P16M12J52K67L97J77l30q60
$$ 79305 78859 78171 76390 73944 72329 72292 73035 73543 73846 74420 75136 75548 75700 75967 76364 76541 76211 75351
54558G5351j065n52N90J500J513J095J083J431J500J250J167J330J427J496J798
$$ 75351 74286 73734 74324 75824 77337 78432 79515 80946 82446 83696 84863 86193 87620 89116 90914
54543I0914K217K557L145M274N448O036O389P297Q652R600R800R602R162Q238
$$ 90914 93131 95688 98833 103107 108555 114591 120980 128277 136929 146529 156329 165931 175093 183331
54529A83331O769M864K477k70k726m425n746p179q435r049r230r268q717p276
$$ 183331 190100 194964 197441 197171 194445 190020 184274 177095 168660 159611 150381 141113 132396 125120
54515A25120n793n225n138m475l345k734k788k733k287j884j646j325j099j294
$$ 125120 119327 114102 108964 104489 101144 98410 95622 92889 90602 88718 87072 85747 84648 83354
54501H3354j455q87M6L43j06n43p16j011j289q86J28Q80J016R98J035P35M5l76
$$ 83354 81899 81012 81058 81401 81295 80752 80036 79025 77736 76850 76978 77858 78874 79872 80907 81642 81687 81311
54483H1311r4N75J040R74M67O0L60J159J485J006O31R79J199M39n12l76N47R50
$$ 81311 81217 81792 82832 83806 84273 84333 84693 85852 87337 88343 88974 89953 91152 91591 91079 90703 91250 92200
54465I2200N53N8m30j289k077j928j099o02o00n70o44j192j435l20J445K043J199
$$ 92200 92753 92811 92381 91092 89015 87087 85988 85386 84786 84216 83572 82380 80945 80625 82070 84113 85312
54448H5312K81j54r22k088k364j201K53Q73P63L03m92j165r29p1J68m49p97l81
$$ 85312 85593 85439 84517 82429 80065 78864 79117 79990 80753 81056 80564 79399 78470 78399 78567 78118 77321 76940
54430G6940r3l98m94O6M19K8k67K53Q63O50l3l42k53j66j1L78P34Q93J093J267
$$ 76940 76847 76449 75955 76021 76440 76468 76201 76454 77317 77967 77934 77592 77339 77173 77162 77540 78274 79167 80260 81527
54410H1527Q40k08r59p71r7M83J086J814K186J931J605J748K075K175K269K736
$$ 81527 82367 82159 81200 80429 80332 80815 81901 83715 85901 87832 89437 91185 93260 95435 97704 100440
54394A00440L445M012M245M063L502K974K812K554J504Qr12j180j708k623k856
$$ 100440 103885 107897 112142 116205 119707 122681 125493 128047 129551 129559 128647 127467 125759 123136 120280
54379A20280j938q45m93o52r25j595k683l416l374l123k965k247q07J78j22p55
$$ 120280 118342 117497 117004 116352 115427 113832 111149 107733 104359 101236 98271 96024 95217 95395 95273 94518
54363I4518m71K59J22q27j287o86K60Q42J082J150R66N56J40k15n21n16J27J253
$$ 94518 94047 94306 94428 93601 92314 91628 91888 92730 93812 94962 95928 96484 96624 96409 95888 95372 95499 96752
54345I6752K225K570K370K082K054K240K338K263K295K574K747K507K076J750
$$ 96752 98977 101547 103917 105999 108053 110293 112631 114894 117189 119763 122510 125017 127093 128843
54331A28843J290M34l89o87q42j497k387k880l235m025m608l897k525k423l896
$$ 128843 130133 130567 130178 129491 128649 127152 124765 121885 118650 114625 110017 106120 103595 101172 97276
54316I7276m979m358l111k643k556j879j054j141j861j936r27L60J027Q09J5o29
$$ 97276 92297 87939 84828 82185 79629 77750 76696 75555 73694 71758 70831 71191 72218 73027 73042 72413
54300G2413m40K70L06q47k188k486j756q48k34O3l4m43o47l36M7o5n39q90r23
$$ 72413 71973 72243 72549 71702 69514 67028 65272 64424 64190 64253 64219 63776 63129 62793 62840 62775 62236 61346 60423
54281F0423o74j20N38Q39O73M69M43L38J75M75J206J408N30n69p29l6M91L38j22
$$ 60423 59749 59629 60167 61006 61679 62148 62591 62929 63104 63579 64785 66193 66723 66154 65425 65389 65880 66218 66096
54262F6096l56j86K78P60J050J215J401J415J020N72O37R82Q37J94j18J98N24
$$ 66096 65740 65554 65832 66592 67642 68857 70258 71673 72693 73265 73902 74884 75721 75915 75797 75995 76519
54245G6519N90Q75J384J267K79n94o85o65j167j537j002r4J85r2k56l07o81j205
$$ 76519 77109 77984 79368 80635 80914 80320 79635 78970 77803 76266 75264 75170 75355 75263 75007 74700 74019 72814
54227G2814j383j289j236r40m1R16R31q6j173j420o60O92J912K274J600M59m22
$$ 72814 71431 70142 68906 67966 67925 68841 69772 69686 68513 67093 66433 67125 69037 71311 72911 73370 72948
54210G2948p15m28J97N58J39p02j002n40j03k19m11k06R5J43J76L98M30N9k98
$$ 72948 72233 71805 72002 72560 72699 71997 70995 70455 70352 70133 69722 69516 69611 69754 69930 70328 70758 70817 70519
54191G0519l12k21j23K88Q06N80m84j241r22k38r2k56j93j84n37p04k21K15k13
$$ 70519 70207 69986 69863 70151 70957 71537 71053 69812 68890 68652 68560 68304 68111 67927 67390 66686 66465 66680 66467
54172F6467j107j574j616j683j567r35k50n4R0P32J296R01%k01M32R70J027J097
$$ 66467 65360 63786 62170 60487 58920 57985 57735 57681 57771 58503 59799 60700 60700 60499 60931 61901 62928 64025
54154F4025J359J349R13N10M00L34P6l02o54q15n72o6J67o4k54p8j3m60q96o40
$$ 64025 65384 66733 67646 68156 68556 68890 68966 68664 68010 67195 66623 66557 66724 66660 66406 66328 66315 65855 64959 64319
54134F4319LJ89l14j095j761j993j463l15O58R64R04P16R0q55j080o8J138J327
$$ 64319 64322 64511 64197 63102 61341 59348 57885 57570 58228 59192 60096 60812 60902 60047 58967 58899 60037 61364
54116F1364Q07N25M46m6o73o23Q4P29J029J087P20q8n77j34N75N30o6k91n8Lk27
$$ 61364 62171 62696 63142 63096 62423 61800 61884 62613 63642 64729 65449 65361 64784 64650 65225 65755 65689 65398 65340 65343 65116
54095F5116m64q73j598j856q77N80J020K58n85q97j020j090p47n2M92Q20J182
$$ 65116 64652 63779 62181 60325 59448 60028 61048 61306 60721 59824 58804 57714 56967 56915 57407 58227 59409
54078E9409J296P12j32l45R6N16P79J226J606J340O60L18L48K79L43J054J823
$$ 59409 60705 61417 61285 60940 61036 61552 62331 63557 65163 66503 67163 67481 67829 68108 68451 69505 71328
54061G1328J459O4r85r99n53p1O93J609J934J537J151J146J132R74J053J322J241
$$ 71328 72787 72851 71866 70867 70314 70243 70936 72545 74479 76016 77167 78313 79445 80419 81472 82794 84035
54044H4035R00J024J647J957J679J466J651J821J937K628L976N099N451N459N476
$$ 84035 84935 85959 87606 89563 91242 92708 94359 96180 98117 100745 104721 109820 115271 120730 126206
54029A26206N185M562M305M734N232N338N530O143O509N885M661L833L674L582
$$ 126206 131391 135953 140258 144992 150224 155562 161092 167235 173744 179629 184290 188123 191797 195379
54015A95379L019K115J420J222J083K54j247k397k506k244k632l512l991l961
$$ 195379 198398 200513 201933 203155 204238 204492 203245 200848 198342 196098 193466 189954 185963 182002
54001A82002m017m195m047l821m148m626m122k622j408j173j310j330j564k050
$$ 182002 177985 173790 169743 165922 161774 157148 153026 150404 148996 147823 146513 145183 143619 141569
53987A41569k116j629j368j578j429n23K51J37l66n95q22j395j779j413o93j81
$$ 141569 139453 137824 136456 134878 133449 132926 133177 133314 132948 132353 131531 130136 128357 126944 126251 126070
53971A26070L79J351K214K287J866J696J779J601J153R13R80J005Q15N12P5n36
$$ 126070 126449 127800 130014 132301 134167 135863 137642 139243 140396 141309 142289 143294 144109 144621 144696 144160
53955A44160r76p35K33J336J813J380N32J74P58J817K622L097L593M072M210M150
$$ 144160 143184 142449 142682 144018 145831 147211 147743 147917 148675 150492 153114 156211 159804 163876 168086 172236
53939A72236M360M800N029N076N286N217L869J248j295k697l216l411l121k132
$$ 172236 176596 181396 186425 191501 196787 202004 205873 207121 205826 203129 199913 196502 193381 191249
53925A91249j065p53j178j623j496o26P89K159K867K989L254M051M935N386N444
$$ 191249 190184 189431 188253 186630 185134 184508 185297 187456 190323 193312 196566 200617 205552 210938 216382
53910B16382N350N113M819M844N438O361P138P357O730N285L553K081Q88j55p12
$$ 216382 221732 226845 231664 236508 241946 248307 255445 262802 269532 274817 278370 280451 281339 281184 280472
53895B80472n55l90j115k332k782k277j997k669l688m405m943n349n165m559m628
$$ 280472 279917 279527 278412 276080 273298 271021 269024 266355 262667 258262 253319 247970 242805 238246 233618
53880B33618n825p021p032o158n404n010m678m509m746n001m690l919l303l190
$$ 233618 227793 220772 213740 207582 202178 197168 192490 187981 183235 178234 173544 169625 166322 163132
53866A63132l527m129m563m257l213k225j901j993j953j716j428j044p26j006
$$ 163132 159605 155476 150913 146656 143443 141218 139317 137324 135371 133655 132227 131183 130457 129451
53852A29451j975k770k491j340l42j41n20q47p17l18k73q52j465j360p60n44q98
$$ 129451 127476 124706 122215 120875 120533 120392 119872 119025 118308 117990 117717 116865 115400 114040 113280 112736 111838
53835A11838j127q76n81n16l65m2ol52n13k68j21k57j20M97R79J031J248J839
$$ 111838 110711 109835 109254 108738 108373 108331 108325 107973 107460 107192 107071 106814 106694 107191 108170 109201 110449 112288
53817A12288J907R09j42lR70J458J087O34O68R69J164J193J098J000J156J703
$$ 112288 114195 115104 114962 114959 115929 117387 118474 119108 119776 120745 121909 123102 124200 125200 126356 128059
53801A28059K473L174L589L498K968K691L345M513N100M917M840N202N259M693
$$ 128059 130532 133706 137295 140793 143761 146452 149797 154310 159410 164327 169167 174369 179628 184321
53787A84321M374M783M949L916K347J568J796K294K549K289J140p05k023j879
$$ 184321 188695 193478 198427 202343 204690 206258 208054 210348 212897 215186 216326 215621 213598 211719
53773B11719q82k73l29o53j381k852m453m979m209l128k679k919l309l196k226
$$ 211719 210837 210564 210235 209582 208201 205349 200896 195917 191708 188580 185901 182982 179673 176477 174251
53758A74251q73k16o58j277j045k04K27j84j062j915k365k105j312o69m30oR17
$$ 174251 173378 173162 172504 171227 170182 169978 170205 170021 168959 167044 164679 162574 161262 160593 160163 160157 161074
53741A61074J588J262L92q5q1o8j50k18m84r74j086n61k44q20j544j405q88j140
$$ 161074 162662 163924 164316 164231 164150 164082 163932 163714 163230 162256 161170 160609 160365 159545 158001 156596 155708 154568
53723A54568j934j971r89m3L41P62J548K081J877J293P75L37O1K71R30J553J933
$$ 154568 152634 150663 149674 149631 149972 150734 152282 154363 156240 157533 158308 158645 158706 158977 159907 161460 163393
53706A63393K298K696K879K821K754K623K267K015K365L053L325L243L761N193
$$ 163393 165691 168387 171266 174087 176841 179464 181731 183746 186111 189164 192489 195732 199493 204686
53692B04686O392O023M189K319J670K274L258L939M411M999N441N169M349L811
$$ 204686 211078 217101 221290 223609 225279 227553 230811 234750 239161 244160 249601 254770 259119 262930
53678B62930L713L182J844P62R77J897K194J693J266J222J043N21M2k53o20j026
$$ 262930 266643 269825 271669 272431 273408 275305 277499 279192 280458 281680 282723 283244 283286 283033 282413 281387
53662B81387j182j197j375j465j019l28j14l65m38k34k28l74q2N67P34K01k00
$$ 281387 280205 279008 277633 276168 275149 274821 274707 274342 273904 273670 273442 273068 272986 273553 274287 274488 274288
53645B74288RJ24n44j466j601q88l04o57j711k532k413j530o68k90o8M47J045
$$ 274288 274297 274421 273877 272411 270810 269922 269618 268961 267250 264718 262305 260775 260107 259817 259749 260196 261241
53628B61241J226J051J044J341J543J381J011O45L93M83J093J992K777L397M088
$$ 261241 262467 263518 264562 265903 267446 268827 269838 270483 270876 271359 272452 274444 277221 280618 284706
53613B84706M781N078M804M267L949M152M818N498N738N661N785O149O192N805
$$ 284706 289487 294565 299369 303636 307585 311737 316555 322053 327791 333452 339237 345386 351578 357383
53599C57383N749O438P100O898O236O057O425O745O966P434P904P788P240O956
$$ 357383 363132 369570 376670 383568 389804 395861 402286 409031 415997 423431 431335 439123 446363 453319
53585D53319P038O988O753O715O781O512O086O106O394O054M921L859L401L033
$$ 453319 460357 467345 474098 480813 487594 494106 500192 506298 512692 518746 523667 527526 530927 533960
53571E33960K270J505J286J411J283O98p4o48o99j54O04R10L65q77k205k838k390
$$ 533960 536230 537735 539021 540432 541715 542413 542339 541691 540992 540838 541442 542352 542717 541840 539635 536797 534407
53554E34407j436j129j815k516k242j269n20k67k50n27j214j768j525p08j2M71
$$ 534407 532971 531842 530027 527511 525269 524000 523480 523213 522963 522436 521222 519454 517929 517221 517209 517680
53538E17680J041J465J370J224J722K419K239J315R91J893L155L852M075M288
$$ 517680 518721 520186 521556 522780 524502 526921 529160 530475 531466 533359 536514 540366 544441 548729
53524E48729M656N327O529Q053R322J0181J0960J1734J2268J2647J3146J3574
$$ 548729 553385 558712 565241 573294 582616 592797 603757 615491 627759 640406 653552 667126
53512F67126J3652J3906J5149J7092J8555J9181J9790K0931K2135K2958K3677
$$ 667126 680778 694684 709833 726925 745480 764661 784451 805382 827517 850475 874152
53501H74152K4665K5891K7325K8991L0486L1268L1565L2079L2777L3027L3018
$$ 874152 898817 924708 952033 981024 1011510 1042778 1074343 1106422 1139199 1172226 1205244
53490A205244L3759L5357L6509L6173L4839L3648L3194L3559L4623L5836L6539
$$ 1205244 1239003 1274360 1310869 1347042 1381881 1415529 1448723 1482282 1516905 1552741 1589280
53479A589280L6821L7345L8147L8525L8287L7986L7600L6227L3561L0561K8141
$$ 1589280 1626101 1663446 1701593 1740118 1778405 1816391 1853991 1890218 1923779 1954340 1982481
53468A982481K6201K4475K3238K2472K1412J9707J8184J7722J8051J8399J8497
$$ 1982481 2008682 2033157 2056395 2078867 2100279 2119986 2138170 2155892 2173943 2192342 2210839
53457B210839J8243J7121J4723J1417P796L992P6l498o376q834j1277j3727j6167
$$ 2210839 2229082 2246203 2260926 2272343 2280139 2284131 2284207 2280709 2274333 2265499 2254222 2240495 2224328
53444B224328j8830k1742k4515k6910k9111l1174l2886l4347l5964l7611l8622
$$ 2224328 2205498 2183756 2159241 2132331 2103220 2072046 2039160 2004813 1968849 1931238 1892616
53433A892616l8898l9176l9824m0233l9797l8664l7104l5084l2837l1006k9712
$$ 1892616 1853718 1814542 1774718 1734485 1694688 1656024 1618920 1583836 1550999 1519993 1490281
53422A490281k8390k6926k5868k5098k3402k0178j6567j3904j1975r650o538l063
$$ 1490281 1461891 1434965 1409097 1383999 1360597 1340419 1323852 1309948 1297973 1288323 1281785 1278722
53410A278722M39L804O678Q969J1195J3855J6774J9589K2310K4932K7091K8615
$$ 1278722 1279161 1282965 1289643 1298612 1309807 1323662 1340436 1360025 1382335 1407267 1434358 1462973
53398A462973K9864L1155L2513L4314L7199M0940M4333M6788M8994N1466N3674
$$ 1462973 1492837 1523992 1556505 1590819 1628018 1668958 1713291 1760079 1809073 1860539 1914213
53387A914213N5393N7681O1269O5159O8072P0514P3898P8250Q2247Q5182Q7550
$$ 1914213 1969606 2027287 2088556 2153715 2221787 2292301 2366199 2444449 2526696 2611878 2699428
53376B699428Q9769R1556R2637R3078R2860R1895R0478Q9074Q7623Q5576Q2529
$$ 2699428 2789197 2880753 2973390 3066468 3159328 3251223 3341701 3430775 3518398 3603974 3686503
53365C686503P8440P3538O8336O3481N9141N4953N0805M7084M3814M0282L6000
$$ 3686503 3764943 3838481 3906817 3970298 4029439 4084392 4135197 4182281 4226095 4266377 4302377
53354D302377L1186K5840J9332J1647M079k376q590j6279k6109l7668n0474o3704
$$ 4302377 4333563 4359403 4378735 4390382 4394461 4392085 4383495 4367216 4341107 4303439 4252965 4189261
53342D189261p5546q4263q9743r3024r4649r4515r3018r1165q9608q8444q7738
$$ 4189261 4113715 4029452 3939709 3846685 3752036 3657521 3564503 3473338 3383730 3295286 3207548
53331C207548q7390q6762q5398q3825q2820q2160q1038p9300p7310p4898p1664
$$ 3207548 3120158 3033396 2947998 2864173 2781353 2699193 2618155 2538855 2461545 2386647 2314983
53320B314983o7979o4574o1206n6953n1799m6833m2706l9057l5614l2855l1123
$$ 2314983 2247004 2182430 2121224 2064271 2012472 1965639 1922933 1883876 1848262 1815407 1784284
53309A784284k9883k8294k6047k3341k0542j8017j5885j3794j1276q281n246k770
$$ 1784284 1754401 1726107 1700060 1676719 1656177 1638160 1622275 1608481 1597205 1588924 1583678 1580908
53297A580908j434j479k193k156p14J264K720L854N415P155Q304R288J1666J6098
$$ 1580908 1579474 1577995 1575802 1573646 1572932 1574196 1576916 1580770 1586185 1593340 1601644 1610932 1622598 1638696
53283A638696K1443K6091K9447L1863L3900L5952L8048L9800M0823M1280M1635
$$ 1638696 1660139 1686230 1715677 1747540 1781440 1817392 1855440 1895240 1936063 1977343 2018978
53272B018978M2027M2259M2235M1884M0909L9185L7182L5493L4091L2690L1401
$$ 2018978 2061005 2103264 2145499 2187383 2228292 2267477 2304659 2340152 2374243 2406933 2438334
53261B438334L0472K9635K8380K6637K4484K1536J7364J2286P018J874l072p460
$$ 2438334 2468806 2498441 2526821 2553458 2577942 2599478 2616842 2629128 2636146 2638020 2634948 2627488
53249B627488j1236j5338k0674k6615l1589l5158l8410m2204m6076m9114n1050
$$ 2627488 2616252 2600914 2580240 2553625 2522036 2486878 2448468 2406264 2360188 2311074 2260024
53238B260024n2196n2975n3689n4199n3769n1843m9029m6674m5464m5030m4786
$$ 2260024 2207828 2154853 2101164 2046965 1993196 1941353 1892324 1845650 1800186 1755156 1710370
53227A710370m4521m4167m3708m3308m3076m2758m2197m1815m1987m2229m1663
$$ 1710370 1665849 1621682 1577974 1534666 1491590 1448832 1406635 1364820 1322833 1280604 1238941
53216A238941m0074l7755l4845l1596k8892k7306k6050k4088k1990k1309k2212
$$ 1238941 1198867 1161112 1126267 1094671 1065779 1038473 1012423 988335 966345 945036 922824
53205I22824k3181k3206k2796k2528k2036k1072k0171j9617j8792j7349j6019
$$ 922824 899643 876437 853641 831113 809077 788005 767834 748217 729425 712076 696057
53194F96057j5501j5341j4740j3794j3228j3338j3845j4372j4595j4362j4063
$$ 696057 680556 665215 650475 636681 623453 610115 596270 581898 567303 552941 538878
53183E38878j4337j5091j5400j4817j4066j3935j4062j3528j2219j0797r673q695
$$ 538878 524541 509450 494050 479233 465167 451232 437170 423642 411423 400626 390953 382258
53171C82258p804p343p522p929p729o423m494l186l356m598n728o056n808n392
$$ 382258 374454 367111 359589 351660 343931 337508 333014 329828 326472 321874 316146 310090 304282 298890
53157B98890m876m256l744l448l151k628j968j437j237j407j771k018k047j999
$$ 298890 294014 289758 286014 282566 279415 276787 274819 273382 272145 270738 268967 266949 264902 262903
53143B62903j830j183j19N84L56k14j82M30R14J173J642K118J808O86k43l35l8
$$ 262903 261073 259890 259771 260355 260711 260497 260315 260745 261659 262832 264474 266592 268400 269086 268843 268508 268470
53126B68470J21K87O79J015R98P61M44p0o52q56o59o29j045j537j870k423l394
$$ 268470 268591 268878 269557 270572 271570 272331 272775 272705 272053 271197 270538 269909 268864 267327 265457 263034 259640
53109B59640m242m432m119l695l154k460k058k364l117l658l690l372k993k843
$$ 259640 255398 250966 246847 243152 239998 237538 235480 233116 229999 226341 222651 219279 216286 213443
53095B13443l075l413l290k567j773j435j492j594j620j670j819k104k424k399
$$ 213443 210368 206955 203665 201098 199325 197890 196398 194804 193184 191514 189695 187591 185167 182768
53081A82768j701p01k49o96j524k105k334k266j778r08j33J16q7l75n12m24j84
$$ 182768 181067 180366 180117 179421 177897 175792 173458 171192 169414 168506 168373 168489 168402 168027 167515 167091 166907
53064A66907j20n12j053r80pJ239J948J925J466Q94M25K43L43M58L66J42L4J71
$$ 166907 166787 166275 165222 164242 164235 165474 167422 169347 170813 171707 172132 172375 172718 173176 173542 173684 173718 173889
53046A73889M00L46k04q85j066p79q49j657k310j780m32M76M98K10l6m80j013
$$ 173889 174289 174635 174431 173546 172480 171701 170852 169195 166885 165105 164673 165149 165647 165857 165821 165341 164328
53029A64328j036n52m31j186k211k612k198j387p50p72j454k027j753r82o60q47
$$ 164328 163292 162740 162309 161123 158912 156300 154102 152715 151965 151193 149739 147712 145959 144977 144317 143470
53013A43470p12n9L94M13O71J323J425M71n54n74P0M26M27O36J072J200Q11J71
$$ 143470 142758 142699 143093 143506 144177 145500 146925 147396 146842 146268 146338 146764 147191 147827 148899 150099 150910 151081
52995A51081m35p72n95J5O50J153J730K241K177J688J739K692L591L616L352L682
$$ 151081 150646 149874 149279 149294 149944 151097 152827 155068 157245 158933 160672 163364 166955 170571 173923 177605
52979A77605M177L753K418J330J205J718K284K527K100Q90n04j273j417j660k262
$$ 177605 181782 185535 187953 189283 190488 192206 194490 197017 199117 200007 199503 198230 196813 195153 192891
52964A92891k588k124j317j078j658k378k446j827j232j197j458j469j257j264
$$ 192891 190303 188179 186862 185784 184126 181748 179302 177475 176243 175046 173588 172119 170862 169598
52950A69598j496j468j039o61o14n87k89J02L37M33L63L6k41Q3Q73J205O38j02
$$ 169598 168102 166634 165595 164934 164320 163733 163444 163546 163883 164316 164679 164715 164474 164557 165430 166635 167273 167171
52932A67171j54L28O04M04M4j32P0O31J138J056M99K22M46M17m02j325j287k53
$$ 167171 167017 167345 167949 168353 168397 168265 168335 168966 170104 171160 171659 171881 172327 172744 172342 171017 169730 169477
52914A69477Q32J204Q77L04p9j44j18j88j27L21Q02P28L30L24O13L46m14m52P16
$$ 169477 170309 171513 172390 172694 172615 172471 172353 172165 172038 172359 173161 173889 174219 174543 175156 175502 175088 174636 175352
52895A75352J883J899J222P80M53j48l70N77J969K271J211L3k34L00R98J404J357
$$ 175352 177235 179134 180356 181136 181589 181441 181071 181648 183617 185888 187099 187132 186898 187198 188196 189600 190957
52878A90957J115J144J357J034J08k62P04J937J886P72J92P63J560J799J726J604
$$ 190957 192072 193216 194573 195607 195715 195453 196157 198094 199980 200752 200944 201707 203267 205066 206792 208396
52862B08396J189N23K94Q82J823K506K767K601J940R95L04J52L69O89R54R56O31
$$ 208396 209585 210108 210402 211284 213107 215613 218380 220981 222921 223916 224220 224372 224741 225430 226384 227340 227971
52845B27971L15L58N19K95k11l66R3O66P55J45j028k372l327l582l414l219k904
$$ 227971 228286 228644 229163 229458 229247 228881 228974 229640 230395 230540 229512 227140 223813 220231 216817 213598 210694
52828B10694k193j308p69o66p13q46j214j658j842j826j950k250k460k496k456
$$ 210694 208501 207193 206424 205758 205045 204199 202985 201327 199485 197659 195709 193459 190999 188503 186047
52813A86047k163j371l14M53P02N43m8j131k267k731k293j402o21k89n63j267
$$ 186047 183884 182513 182199 182652 183354 183897 183849 182718 180451 177720 175427 174025 173404 173115 172552 171285
52797A71285j760j493p25l02o99j581k234k114j185n2L88k13j309k141k425k194
$$ 171285 169525 168032 167307 167005 166306 164725 162491 160377 159192 159140 159528 159315 158006 155865 153440 151246
52781A51246j520p50n11q82j090o27j28m70j466k215k328k050j539q99n91r32
$$ 151246 149726 148976 148465 147583 146493 145866 145738 145268 143802 141587 139259 137209 135670 134771 134180 133248
52765A33248j339j006q3N64O31N35M93K68k03p46j424k372l181l239k608j906
$$ 133248 131909 130903 130820 131384 132015 132550 133043 133311 133108 132362 130938 128566 125385 122146 119538 117632
52749A17632j449j114r46j165j654k053k211k143j800j432j527j868j362K97J630
$$ 117632 116183 115069 114123 112958 111304 109251 107040 104897 103097 101665 100138 98270 96908 97205 98835
52734I8835J242p9n50n2J15k84j81N61P06j18n95J64J280J661J531J552J614J481
$$ 98835 100077 99998 99448 99396 99511 99227 99046 99607 100313 100195 99600 99764 101044 102705 104236 105788 107402 108883
52716A08883J508J826J767J005L07L25M89J08l19L8Q35J071O36K14q0p90j895
$$ 108883 110391 112217 113984 114989 115296 115621 116110 116218 115899 115937 116772 117843 118479 118693 118613 117823 115928
52699A15928k533k157j282p11n94n62m51m78p88j098j045p30o04p75q68p98j134
$$ 115928 113395 111238 109956 109245 108651 108089 107638 107160 106372 105274 104229 103499 102895 102120 101252 100454 99320
52682I9320k156l036k759j572p27q48j392j603j225k40J087J888J375P4o02j87
$$ 99320 97164 94128 91369 89797 89070 88222 86830 85227 84002 83762 84849 86737 88112 88186 87584 87397
52666H7397K95J7n17n67m16p42j372j536r94k53J35K7l47n49k55L85R43J267J462
$$ 87397 87692 87709 87192 86625 86209 85467 84095 82559 81565 81312 81447 81474 81127 80578 80323 80708 81651 82918 84380
52647H4380J343O02m22r05p01o28j204j817j605o09M48J010J001O75N22R06J512
$$ 84380 85723 86325 85903 84998 84297 83669 82465 80648 79043 78434 78882 79892 80893 81568 82090 82996 84508
52630H4508J658J270R17P87L60m88r99p02k70m90j017r59k77K51K06r9k75k56
$$ 84508 86166 87436 88353 89140 89500 89012 88013 87311 87041 86551 85534 84575 84298 84549 84755 84656 84381 84125
52612H4125n0L58P61P97L80j28k41J99Q49J244J348J577K006J974J008j52k89
$$ 84125 84075 84433 85194 85991 86371 86243 86002 86201 87050 88294 89642 91219 93225 95199 96207 96055 95766
52595I5766O24J360J119M33N9p9l23m13J38J226K208K586K260J527R57R88J390
$$ 95766 96390 97750 98869 99302 99361 99282 98959 98546 98684 99910 102118 104704 106964 108491 109448 110436 111826
52578A11826J525J288J231J680K273K575K563K283J691R94O30N82L80r0l50j20
$$ 111826 113351 114639 115870 117550 119823 122398 124961 127244 128935 129929 130559 131141 131521 131431 131081 130961
52562A30961L78R65J605J814R25p14j732j382l29N74J302J947K085J553R88Q43
$$ 130961 131339 132304 133909 135723 136648 135934 134202 132820 132491 133065 134367 136314 138399 139952 140940 141783
52546A41783O48M4l82o2N34P27O91P72N62l19j126q23L82J417J789J728J339O89
$$ 141783 142431 142475 142093 142031 142565 143292 143983 144755 145317 144998 143872 143049 143431 144848 146637 148365 149704 150393
52528A50393K99N22P06P5q70r94l62j10o13j013p93n73q62j080m93O35J448J655
$$ 150393 150692 151214 151920 151995 151125 150131 149769 149659 149046 148033 147240 146667 145805 144725 144232 144867 146315 147970
52510A47970J661J788J807J319L91l23k52L78P35M03j07j43K53O04P06O38M07
$$ 147970 149631 151419 153226 154545 154936 154613 154361 154739 155474 155877 155770 155627 155880 156484 157190 157828 158235
52493A58235M6k00k14k38l90k59M32J196J395J131R76J040R99Q18P37P34O15N40
$$ 158235 158281 158081 157867 157629 157239 156980 157412 158608 160003 161134 162110 163150 164149 164967 165704 166438 167053 167593
52475A67593Q39J362J660J704J865K185K229J736R09J05m36n27j87K67N33O89
$$ 167593 168432 169794 171454 173158 175023 177208 179437 181173 182082 182187 181751 181224 181037 181304 181837 182526
52459A82526R28J173J237J103P24q5j156j765j477q33o34r09j195j399j641j631
$$ 182526 183454 184627 185864 186967 187691 187606 186450 184685 183208 182375 181741 180832 179637 178238 176597 174966
52443A74966j098n64p88j509j756j354j094j328j382p78j15k02r15j480j418q09
$$ 174966 173868 173304 172516 171007 169251 167897 166803 165475 164093 163315 163200 162998 162083 160603 159185 158376
52427A58376K1O13N42j04o08l45M41R01N40k36n75j30N09M12n35j314p91R92K803
$$ 158376 158397 159010 159552 159448 158840 158495 158936 159837 160377 160141 159566 159436 159945 160357 159822 158508 157717 158709 161512
52408A61512L416K630J178Jl47J80J300K621L700M117L752K948K152J421O38O6
$$ 161512 164928 167558 168736 168737 168390 168570 169870 172491 176191 180308 184060 187008 189160 190581 191219 191285
52392A91285R3M33K84m37p46O6J343J916J585J152J304K031K852L200K784K055
$$ 191285 191378 191811 192095 191658 190912 190978 192321 194237 195822 196974 198278 200309 203161 206361 209145 211200
52376B11200J892K523L159L121K735K587K428J762R21O72R82J189J215J628K473
$$ 211200 213092 215615 218774 221895 224630 227217 229645 231407 232328 233000 233982 235171 236386 238014 240487
52361B40487L059L065L025L341L513K807J358J82K52J548L003L460K871K329K652
$$ 240487 243546 246611 249636 252977 256490 259297 260655 260837 261089 262637 265640 269100 271971 274300 276952
52346B76952L348L369K551J700J504J970K760L504L842L694L396L230K977K464
$$ 276952 280300 283669 286220 287920 289424 291394 294154 297658 301500 305194 308590 311820 314797 317261
52332C17261K117K387K854K745K082J599J555J541J501K009L282M582N018M522
$$ 317261 319378 321765 324619 327364 329446 331045 332600 334141 335642 337651 340933 345515 350533 355055
52318C55055L782L562M184N316O182O328O242O811Q163R453R910R678R475R725
$$ 355055 358837 362399 366583 371899 378081 384409 390651 397462 405625 415078 424988 434666 444141 453866
52304D53866J0258J0652J0849J1280J2349J3757J4736J4987J4977J5183J5566
$$ 453866 464124 474776 485625 496905 509254 523011 537747 552734 567711 582894 598460
52293E98460J6057J6939J8264J9465K0038K0125J9963J9383J8456J7923J8229
$$ 598460 614517 631456 649720 669185 689223 709348 729311 748694 767150 785073 803302
52282H03302J8706J8560J8039J7742J7367J6288J4875J3974J3384J2111J0038
$$ 803302 822008 840568 858607 876349 893716 910004 924879 938853 952237 964348 974386
52271I74386Q086O720N445L952K630J736J033L86j40q80k406m514o238p006p066
$$ 974386 982472 989192 994637 998589 1001219 1002955 1003988 1004374 1004234 1003354 1000948 996434 990196 983190 976124
52256I76124o773o236n670n202m371k729r11q1k67k87O37K208M036O075P984R230
$$ 976124 969351 963115 957445 952243 947872 945143 944232 944151 943884 943597 944234 946442 950478 956553 964537 973767
52240I73767J0118J1544J3424J4561J4498J4253J4750J5584J6025J6054J5793
$$ 973767 983885 995429 1008853 1023414 1037912 1052165 1066915 1082499 1098524 1114578 1130371
52229A130371J4915J3427J2129J1534J1097J0109Q595O765M504K108N53J60j90
$$ 1130371 1145286 1158713 1170842 1182376 1193473 1203582 1212177 1218942 1223446 1225554 1226107 1226267 1226077
52216A226077j617l702n319o313p348q620r707j0419j0908j1183j1273j1592j2465
$$ 1226077 1224460 1220758 1215439 1209126 1201778 1193158 1183451 1173032 1162124 1150941 1139668 1128076 1115611
52203A115611j3439j3720j3093j1983j0866j0118r972j0042r341p429n279m239
$$ 1115611 1102172 1088452 1075359 1063376 1052510 1042392 1032420 1022378 1013037 1005608 1000329 996090
52191I96090m373m496l752k511j609j319j237r17m15j92m97r70j126r79q39o72
$$ 996090 991717 987221 983469 980958 979349 978030 976793 975876 975461 975269 974772 973802 972676 971697 970858 970186
52175I70186k94m4m79j349j785j668j839k644l230k911k319k472l372m262m678
$$ 970186 969892 969848 969369 968020 966235 964567 962728 960084 956854 953943 951624 949152 945780 941518 936840
52160I36840m601m124l622l711m452n053m948m509m219l791k949k275k414k960
$$ 936840 932239 928115 924493 920782 916330 911277 906329 901820 897601 893810 890861 888586 886172 883212
52146H83212l148l125l512m106m204l968m304n402o408o710o600o460o136n444
$$ 883212 880064 876939 873427 869321 865117 861149 856845 851443 845035 838325 831725 825265 819129 813685
52132H13685m660m136l871l693l492l215k889k800l180l742l874l368k659k224
$$ 813685 809025 804889 801018 797325 793833 790618 787729 784929 781749 778007 774133 770765 768106 765882
52118G65882k077j918j495p98L1Q06J480K108K717L321M037M963N892O586P303
$$ 765882 763805 761887 760392 759594 759625 760431 761911 764019 766736 770057 774094 779057 784949 791535 798838
52103G98838Q582J0373J1935J2923J3961J5716J7882J9670K0846K1752K2600K3348
$$ 798838 807420 817793 829728 842651 856612 872328 890210 909880 930726 952478 975078 998426
52091I98426K4023K4654K5067K5166K5190K5268K5014K4020K2520K1088J9917
$$ 998426 1022449 1047103 1072170 1097336 1122526 1147794 1172808 1196828 1219348 1240436 1260353
52080A260353J8750J7317J5407J2871J0016P652O203N043L275Q99j340k981m145
$$ 1260353 1279103 1296420 1311827 1324698 1334714 1342366 1348569 1353612 1356887 1357786 1356446 1353465 1349320
52067A349320n037n887p208r292j1490j2677j2557j1908j1484j1232j0779j0109
$$ 1349320 1344283 1338396 1331188 1321896 1310406 1297729 1285172 1273264 1261780 1250548 1239769 1229660
52055A229660r422q723p821o587n037l316j684l17Q85K184L653N096O289P224
$$ 1229660 1220238 1211515 1203694 1197107 1192070 1188754 1187070 1186753 1187638 1189822 1193475 1198571 1204860 1212084
$$ [...]
##END NTUPLES=NMR SPECTRUM
##END=
