
##TITLE=AC1198_BRAAS12062_7165602_QtzWtNK4mk
##JCAMPDX= 6.0         $$ Bruker NMR JCAMP-DX V2.0
##DATA TYPE= NMR SPECTRUM
##DATA CLASS= NTUPLES
##ORIGIN= BRUKER
##OWNER= Administrator
$$ 1.72 TOPSPIN		Version 2.1
$$ 2013-01-30 00:30:47.423 -0500  Administrator@X
$$ Compression mode = diff/dup
##.OBSERVE FREQUENCY= 400.02188249412
##.OBSERVE NUCLEUS= ^1H
##.ACQUISITION MODE= SIMULTANEOUS (DQD)
##.ACQUISITION SCHEME= undefined
##.AVERAGES= 8
##.DIGITISER RES= 22
##SPECTROMETER/DATA SYSTEM= spect
##.PULSE SEQUENCE= zg30
##.SOLVENT NAME= COFFEE_meoh
##.SHIFT REFERENCE= INTERNAL, COFFEE_meoh, 1, 14.98509
##AUDIT TRAIL= $$ (NUMBER, WHEN, WHO, WHERE, PROCESS, VERSION, WHAT)
$$ ##TITLE= Audit trail, TOPSPIN		Version 2.1
$$ ##JCAMPDX= 5.01
$$ ##ORIGIN= Bruker BioSpin GmbH
$$ ##OWNER= Administrator
$$ $$ E:\/data/COFFEE/nmr/AC1198_BRAAS12062_7165602_QtzWtNK4mk/20/pdata/1/auditp.txt
$$ ##AUDIT TRAIL=  $$ (NUMBER, WHEN, WHO, WHERE, PROCESS, VERSION, WHAT)
(   1,<2013-01-30 00:30:39.235 -0500>,<Administrator>,<X>,<go>,<TOPSPIN 2.1>,
      <created by zg
	started at 2013-01-30 00:29:32.673 -0500,
	POWCHK enabled, PULCHK disabled,
       configuration hash MD5:
       86 BA 57 50 F2 9D 5C 9B 26 00 A9 28 5F 66 2E 89
       data hash MD5: 64K
       95 7E F8 26 F7 A0 D4 4C 09 38 42 42 15 9B CF C2>)
(   2,<2013-01-30 00:30:42.345 -0500>,<Administrator>,<X>,<proc1d>,<TOPSPIN 2.1>,
      <Start of raw data processing
       efp LB = 0 FT_mod = 6 PKNL = 1 PHC0 = 0 PHC1 = 0 SI = 32K 
       data hash MD5: 32K
       3C 66 AA 75 3D 2A C4 92 79 43 2C CF 3E 1A FF 85>)
(   3,<2013-01-30 00:30:42.813 -0500>,<Administrator>,<X>,<proc1d>,<TOPSPIN 2.1>,
      <pk PHC0 = 99.98108 PHC1 = 0 
       data hash MD5: 32K
       42 BD 01 1B 0F 1A DE 09 44 9A 49 A7 AF F6 C6 F7>)
(   4,<2013-01-30 00:30:43.048 -0500>,<Administrator>,<X>,<proc1d>,<TOPSPIN 2.1>,
      <abs ABSG = 1 
       data hash MD5: 32K
       49 93 D7 83 D6 AD 11 12 72 7E 7E 98 44 97 E8 46>)
(   5,<2013-01-30 00:30:43.204 -0500>,<Administrator>,<X>,<proc1d>,<TOPSPIN 2.1>,
      <abs ABSG = 2 
       data hash MD5: 32K
       F3 44 97 D3 A7 66 3C B6 D1 9D FB 9B 4E EA 69 53>)
(   6,<2013-01-30 00:30:43.345 -0500>,<Administrator>,<X>,<proc1d>,<TOPSPIN 2.1>,
      <abs ABSG = 3 
       data hash MD5: 32K
       8A 4C 31 C7 72 FA 75 B2 A3 E1 F4 89 56 93 CD 1B>)
(   7,<2013-01-30 00:30:43.485 -0500>,<Administrator>,<X>,<proc1d>,<TOPSPIN 2.1>,
      <abs ABSG = 4 
       data hash MD5: 32K
       48 3E 52 40 53 54 DE D6 C6 C8 5B 55 9C E5 9C 75>)
(   8,<2013-01-30 00:30:43.642 -0500>,<Administrator>,<X>,<proc1d>,<TOPSPIN 2.1>,
      <abs ABSG = 5 
       data hash MD5: 32K
       28 72 FB 2F 5E DA 8F 07 34 25 FE 16 11 FF 42 BF>)
$$ ##END=
$$ 
$$ $$ hash MD5
$$ $$ B1 02 29 26 3E F1 04 22 40 74 5C 1E E3 62 DC 05
##$RELAX= 
##$RELAX= 
##$RELAX= 
##$RELAX= 
##$RELAX= 
##$RELAX= 
##$RELAX= 
$$ Bruker specific parameters
$$ --------------------------
##$DU= <E:\>
##$EXPNO= 20
##$NAME= <AC1198_BRAAS12062_7165602_QtzWtNK4mk>
$$ [...]
150 150 150 150 150 150 150 150
##$TP07= 0
##$TPNAME0= <>
##$TPNAME1= <>
##$TPNAME2= <>
##$TPNAME3= <>
##$TPNAME4= <>
##$TPNAME5= <>
##$TPNAME6= <>
##$TPNAME7= <>
##$TPOAL= (0..7)
0.5 0.5 0.5 0.5 0.5 0.5 0.5 0.5
##$TPOFFS= (0..7)
0 0 0 0 0 0 0 0
##$TUNHIN= 0
##$TUNHOUT= 0
##$TUNXOUT= 0
##$USERA1= <user>
##$USERA2= <user>
##$USERA3= <user>
##$USERA4= <user>
##$USERA5= <user>
##$V9= 5
##$VALIST= <valist>
##$VCLIST= <CCCCCCCCCCCCCCC>
##$VD= 0
##$VDLIST= <DDDDDDDDDDDDDDD>
##$VPLIST= <PPPPPPPPPPPPPPP>
##$VTLIST= <TTTTTTTTTTTTTTT>
##$WBST= 1024
##$WBSW= 4
##$XGAIN= (0..3)
0 0 0 0
##$XL= 0
##$YL= 0
##$YMAX_a= 602770
##$YMIN_a= -510054
##$ZGOPTNS= <>
##$ZL1= 120
##$ZL2= 120
##$ZL3= 120
##$ZL4= 120
##$ABSF1= 14.98509
##$ABSF2= -5.573092
##$ABSG= 5
##$ABSL= 3
##$ALPHA= 0
##$AQORDER= 0
##$ASSFAC= 0
##$ASSFACI= 0
##$ASSFACX= 0
##$ASSWID= 0
##$AUNMP= <proc_prof1d_extract_pilot.lims>
##$AXLEFT= 0
##$AXNAME= <>
##$AXNUC= <1H>
##$AXRIGHT= 0
##$AXTYPE= 0
##$AXUNIT= <>
##$AZFE= 0.1
##$AZFW= 0.1
##$BCFW= 0
##$BC_mod= 0
##$BYTORDP= 0
##$COROFFS= 0
##$CY= 15
##$DATMOD= 1
##$DC= 0
##$DFILT= <>
##$DTYPP= 0
##$F1P= 0
##$F2P= 0
##$FCOR= 0.5
##$FTSIZE= 32768
##$FT_mod= 6
##$GAMMA= 0
##$GB= 0
##$INTBC= 1
##$INTSCL= 1
##$ISEN= 128
##$LB= 0
##$LEV0= 0
##$LPBIN= 0
##$MAXI= 10000
##$MC2= 0
##$MEAN= 0
##$ME_mod= 0
##$MI= 0
##$NCOEF= 0
##$NC_proc= -8
##$NLEV= 6
##$NOISF1= 0
##$NOISF2= 0
##$NSP= 0
##$NTH_PI= 0
##$NZP= 0
##$OFFSET= 14.98509
##$PC= 1
##$PHC0= 99.98108
##$PHC1= 0
##$PH_mod= 1
##$PKNL= yes
##$PPARMOD= 0
##$PPDIAG= 0
##$PPIPTYP= 0
##$PPMPNUM= 2147483647
##$PPRESOL= 1
##$PSCAL= 4
##$PSIGN= 0
##$PYNMP= <proc.py>
##$REVERSE= no
##$SF= 400.02
##$SI= 32768
##$SIGF1= 0
##$SIGF2= 0
##$SINO= 400
##$SIOLD= 32768
##$SPECTYP= <>
##$SREGLST= <1H.CDCl3>
##$SSB= 0
##$STSI= 32768
##$STSR= 0
##$SW_p= 8223.68421052631
##$SYMM= 0
##$S_DEV= 0
##$TDeff= 65536
##$TDoff= 0
##$TI= <>
##$TILT= no
##$TM1= 0
##$TM2= 0
##$TOPLEV= 0
##$USERP1= <user>
##$USERP2= <user>
##$USERP3= <user>
##$USERP4= <user>
##$USERP5= <user>
##$WDW= 1
##$XDIM= 32768
##$YMAX_p= 459146184
##$YMIN_p= -736596
##$CURPLOT= <Network HP LaserJet P1505>
##$CURPRIN= <$Network HP LaserJet P1505>
##$DFORMAT= <normdp>
##$LAYOUT= <+/1D_H.xwp>
##$LFORMAT= <normlp>
##$PFORMAT= <normpl>
##$SURQMSG= 1
$$ End of Bruker specific parameters
$$ ---------------------------------
##NTUPLES= NMR SPECTRUM
##VAR_NAME=  FREQUENCY,     SPECTRUM/REAL,   SPECTRUM/IMAG
##SYMBOL=    X,             R,               I
##VAR_TYPE=  INDEPENDENT,   DEPENDENT,       DEPENDENT
##VAR_FORM=  AFFN,          ASDF,            ASDF
##VAR_DIM=   32768,         32768,           32768
##UNITS=     HZ,            ARBITRARY UNITS, ARBITRARY UNITS
##FACTOR=    0.250966925370066, 1,           1
##FIRST=     8223.43324360094, -83496,       -40785
##LAST=      0,             37575,           -269705
##MIN=       0,             -736596,         0
##MAX=       8223.43324360094, 459146184,    0
$$ Real data points
##PAGE= N=1
##DATA TABLE= (X++(R..R)), XYDATA
$$ [...]
19503b97766C7445c9014A55536g3274H8830e7993p1766N3832A72908K2492m3801
$$ -297766 37445 -39014 155536 -73274 88830 -57993 -129759 -75927 172908 195400 151599
19492A51599K11575e396m40578a82826N479n3505n2803j12419a91121a1525l4990
$$ 151599 363174 -5396 -445974 -182826 -177347 -230852 -283655 -396074 -191121 -11525 -46515
19481d6515B1369c3978D7735a85691r2636a9144j22797C47005b3869k8045j01986
$$ -46515 21369 -33978 47735 -185691 -278327 -19144 -141941 347005 -23869 -51914 -153900
19470a53900n9148l7969A62726c28871B51551e8750A5376c36753O0039e7874k56122
$$ -153900 -213048 -251017 162726 -328871 251551 -58750 15376 -336753 -276714 -57874 -313996
19459c13996A12678a92097A81822h5841c0857A96418A8768a26175N5009A00037
$$ -313996 112678 -192097 181822 -85841 -30857 196418 18768 -126175 -71166 100037
19448a84505K3260J1072C0337M1151J7004a72950E4226b26152e3843A8948b5122
$$ -184505 -161245 -150173 30337 71488 88492 -172950 54226 -226152 -53843 18948 -25122
19436E0847a35776d381F6031c24724J10442A34367b5247B22665i2069G7923d6397
$$ 50847 -135776 -4381 66031 -324724 -214282 134367 -25247 222665 -92069 77923 -46397
19424B08838b83512O5118c6680n5204j01287N296H4738i1611n57551a35775k65993
$$ 208838 -283512 -218394 -36680 -91884 -193171 -187875 84738 -91611 -649162 -135775 -401768
19413d01768B0382a56387j92968C50361c84708A50913b20895A81324b09846F171
$$ -401768 20382 -156387 -349355 350361 -384708 150913 -220895 181324 -209846 6171
19402b72965J09761H3595a03394e549l4104A37420c05665g0927j17137A27872
$$ -272965 -163204 83595 -103394 -5549 -39653 137420 -305665 -70927 -188064 127872
19391B7983J50939e94j35220A07053C5996c03765a7515D781O8633K05898c4346
$$ 27983 178922 -594 -135814 107053 35996 -303765 -17515 4781 73414 279312 -34346
19379f4679m3547A5601g8482k48990J24607G8882b67616L5796A63350K41201a55760
$$ -64679 -108226 15601 -78482 -327472 -202865 78882 -267616 -231820 163350 404551 -155760
19367a27084k04360R8805Q9732Q244j53131B14004b39396E0206d1363o363n3752
$$ -127084 -331444 -232639 -142907 -134663 -287794 214004 -239396 50206 -41363 -47726 -101478
19356a01478j58513A56746a354A34914g3691B43989d15530a14898j52362R2761
$$ -101478 -259991 156746 -1354 134914 -73691 243989 -415530 -114898 -267260 -174499
19346a74499K054R818N4242n7168c6731c592j29267A19410K26879g191r4648H438
$$ -174499 -172445 -162627 -108385 -165553 -36731 -3592 -132859 119410 346289 -7191 -101839 8438
19333c5977A3116K23222c49759a00084n6033L1651K9058c4767A80067a50679e3565
$$ -35977 13116 236338 -349759 -100084 -156117 -124466 -95408 -34767 180067 -150679 -53565
19321c91000b5207j90357Q2033c9895r2304j80431g3380j15568a8923j56420o288
$$ -391000 -25207 -215564 -133531 -39895 -132199 -312630 -73380 -188948 -18923 -175343 -181631
19310a81631c8927A83693l4656a28684a9510H1011b52089k53394i8138F7524P592
$$ -181631 -38927 183693 149037 -128684 -19510 81011 -252089 -505483 -98138 67524 75116
19299G5116J84180a92343p9134A80359J853c27563e3680B8076a287l26734E9087
$$ 75116 259296 -192343 -271477 180359 182212 -327563 -53680 28076 -1287 -328021 59087
19287A24136C8880J88534f840B0391a24155j88169h0829p2093A63918d7849j04873
$$ 124136 38880 227414 -6840 20391 -124155 -312324 -80829 -152922 163918 -47849 -152722
19276a52722P4322o7861f7398b5749A46578e0545j95515l28323B9726a49560k67754
$$ -152722 -78400 -146261 -67398 -25749 146578 -50545 -246060 -574383 29726 -149560 -417314
19265d17314J64513f9725g488k7663A43996M0488a54846j75194h4921A95421b26383
$$ -417314 -252801 -69725 -7488 -35151 143996 184484 -154846 -330040 -84921 195421 -226383
19253b48089B457J64164i7976B03737i1083j9121B32548d60544e672j77205L2723
$$ -248089 2457 166621 -97976 203737 -91083 -110204 232548 -460544 -5672 -182877 -150154
19242a50154A35242b18876n3551a5241B0010a22548I4865a43107K9337d4439A72973
$$ -150154 135242 -218876 -272427 -15241 20010 -122548 94865 -143107 -113770 -44439 172973
19230A78361c31439b4643B2293K80257C0275a76500B10710A1715c8664q373q7928
$$ 178361 -331439 -24643 22293 302550 30275 -176500 210710 11715 -38664 -47037 -134965
19219a34965j13829j84722a94229O364o9803K4162B51751a33350o2862f9414m2987
$$ -134965 -248794 -433516 -194229 -187865 -257668 -233506 251751 -133350 -196212 -69414 -112401
19208a12401j09128j48790B10572e4433k0652N74j1540A64534B5239e22265a9570
$$ -112401 -221529 -370319 210572 -54433 -75085 -74511 -86051 164534 25239 -522265 -19570
19196A8870K42730h6177P868j51956m1106A90791d45234G625b5559m18656A0322
$$ 18870 261600 -86177 -78309 -230265 -271371 190791 -445234 7625 -25559 -444215 10322
19184h686k47648K610N2177A43439j7884f3796j82647C8984J80948c05981J6290
$$ -8686 -256334 -253724 -201547 143439 125555 -63796 -246443 38984 219932 -305981 -289691
19173b89691a10877c7397J7780F179a71843g1541L0978D508a6905o4601k72428
$$ -289691 -110877 -37397 -19617 6179 -171843 -71541 -40563 4508 -16905 -81506 -353934
19162c53934J28580f9269A96512a13442j37822k6730i8316J8863H9349a77940
$$ -353934 -225354 -69269 196512 -113442 -251264 -277994 -98316 -79453 89349 -177940
19151A42897a34305B48224A827h7901j27377K3472i4531l5144b328k72700P6224
$$ 142897 -134305 248224 1827 -87901 -215278 -191806 -94531 -129675 -2328 -275028 -198804
19140a98804j86408A12767E3187J27796f3270L0137l3118a9393k90539F3413J17742
$$ -198804 -385212 112767 53187 180983 -63270 -33133 -66251 -19393 -309932 63413 181155
19129A81155h0722F8728b35964m771B88786F1666g1107B21549f6583r5983j00695
$$ 181155 -80722 68728 -235964 -240735 288786 61666 -71107 221549 -66583 -162566 -263261
19118b63261M6799E0812a07462r9339e0638k47989J24282a6345k3951l70493l1358
$$ -263261 -216462 50812 -107462 -206801 -50638 -298627 -174345 -16345 -40296 -410789 -442147
19107d42147a14456H525L5739h3120H8363E099J11488A7912P988e758j68152j01135
$$ -442147 -114456 8525 44264 -83120 88363 5099 116587 17912 25900 -5758 -173910 -275045
19095b75045k8280d0853j710k38495C3299J18775j0758c1667j5345l29908d0174
$$ -275045 -303325 -40853 -42563 -281058 33299 152074 141316 -31667 -47012 -376920 -40174
19083a06134h410j06470B96573A18840b36852F4125a20956j10529k50668J65052
$$ -106134 -8410 -114880 296573 118840 -236852 64125 -120956 -231485 -482153 -317101
19073c17101J11639d9208B28893E0505a55724m6811B3606a89066p6923A57441
$$ -317101 -205462 -49208 228893 50505 -155724 -202535 23606 -189066 -265989 157441
19062f0977b0379j66201k668d0663I9036B1121M7773b24579f9162B07559i491
$$ -60977 -20379 -186580 -189248 -40663 99036 21121 68894 -224579 -69162 207559 -9491
19050h8608A03666C3185R4388a61126b1078d955l18060C84954D2720a43927k2718
$$ -88608 103666 33185 127573 -161126 -21078 -4955 -323015 384954 42720 -143927 -166645
19039a66645m6103j40612a8047A67792a61878B71768h6479H066a43748M6640j0280
$$ -166645 -212748 -353360 -18047 167792 -161878 271768 -86479 8066 -143748 -97108 -107388
19028a07388j57521G8230J45755a13669d5680A37240l8611c4510q1050j9468a1924
$$ -107388 -264909 78230 223985 -113669 -45680 137240 98629 -34510 -115560 -135028 -11924
19016I1718b9962j26179A40619g1875A00154a52653f8918A67448b8275k15810
$$ 91718 -29962 -156141 140619 -71875 100154 -152653 -68918 167448 -28275 -244085
19006b44085M0875q3328f3704B12103b53559a3095A40212b32832J00711E2315
$$ -244085 -203210 -286538 -63704 212103 -253559 -13095 140212 -232832 -132121 52315
18995B3675i3826j30165j8681G7705f8657f685j79728M4092A64004a04393F1416
$$ 23675 -93826 -223991 -242672 77705 -68657 -6685 -186413 -142321 164004 -104393 61416
18983a4561A43930g2050m1413a4005k79486J17662Q0899a6690A5799J30677N7534
$$ -14561 143930 -72050 -113463 -14005 -293491 -175829 -94930 -16690 15799 146476 204010
18972B04010L0596K63409J80740B35289J99309a24810c6089p0764C76503a77655
$$ 204010 234606 498015 678755 235289 434598 -124810 -36089 -106853 376503 -177655
18961d760a439j19285q2002a00885m35227A58446g1128c469k24059N0343d1901
$$ -4760 -1439 -120724 -202726 -100885 -536112 158446 -71128 -3469 -227528 -177185 -41901
18949B71739a70784p7914b9548G9736c7663A50645d41968A11057b06400E2475
$$ 271739 -170784 -248698 -29548 79736 -37663 150645 -441968 111057 -206400 52475
18938D7466J91625d3593p2838C3526J22653e3385j46899P9324C5352i890B90837
$$ 47466 239091 -43593 -116431 33526 156179 -53385 -200284 -120960 35352 -9890 290837
18926b24670a07821E9298N6416b89931i8524m7090c6133k4792j46249j69410a42273
$$ -224670 -107821 59298 115714 -289931 -98524 -145614 -36133 -60925 -207174 -376584 -142273
18914g8051A25692k8871A8630M2189b02657B53253q5768O13169j05069B09281
$$ -78051 125692 96821 18630 60819 -202657 253253 167485 780654 675585 209281
18903i1735n9605B97388B0584L7295O5262k1420G090c61004a73581A07386R6039
$$ -91735 -151340 297388 20584 57879 123141 101721 7090 -361004 -173581 107386 203425
18892B03425E0519f2084A30209a99341j52498a12064j60529i3528o6439M1028
$$ 203425 50519 -62084 130209 -199341 -351839 -112064 -272593 -93528 -159967 -118939
18882a18939M62F7652c37631f8997F1804o875b5893D0879N8300M127a92883Q8440
$$ -118939 -118477 67652 -337631 -68997 61804 54929 -25893 40879 99179 103306 -192883 -104443
18870a04443k3868Q392B39186a36370B04997B2766a23438A55933F0796h6897A15211
$$ -104443 -128311 -119919 239186 -136370 204997 22766 -123438 155933 60796 -86897 115211
18858c25707d8526F8131d6991A84503a45405q1018J07448d0131A39122a15937
$$ -325707 -48526 68131 -46991 184503 -145405 -226423 -118975 -40131 139122 -115937
18847B06790E4874P9638C3034b31666H3810f8336j81113J01814p2766k46924a85320
$$ 206790 54874 134512 33034 -231666 83810 -68336 -249449 -147635 -220401 -467325 -185320
18835f7040g431D6007a85166G803J50187l8850l1698k9613M1758d81290e5639
$$ -67040 -7431 46007 -185166 7803 157990 119140 87442 57829 99587 -481290 -55639
18823d7241j37151I5386b83633I1757g2768C2767N568M39067d6416A59663C2493
$$ -47241 -184392 95386 -283633 91757 -72768 32767 38335 477402 -46416 159663 32493
18811B48184l6516c1290j1965B63792L5468B7653c126m4978j14073A41878b0156
$$ 248184 211668 -31290 -43255 263792 299260 27653 -3126 -48104 -162177 141878 -20156
18799A32865O5637c07161a42685a3823k29079A5772R1368a33544G5939b23058
$$ 132865 198502 -307161 -142685 -13823 -242902 15772 107140 -133544 75939 -223058
18788A7763R179a48640j45938a29157R57F4180N6054d05952a85320h6231j30377
$$ 17763 26942 -148640 -294578 -129157 -128200 64180 120234 -405952 -185320 -86231 -216608
18777b16608O1833B59889a58156E9650B1743K17300j07572J21532M2776B2064
$$ -216608 -154775 259889 -158156 59650 21743 239043 131471 253003 295779 22064
18766a37093m3464A04903f0736o75860K68036b01877I1641c71388a8337l91942
$$ -137093 -180557 104903 -60736 -736596 -468560 -201877 91641 -371388 -18337 -410279
18756d10279a45389n654k9572k76062b02447B99490A30265a38188K0296p5293
$$ -410279 -145389 -151043 -180615 -456677 -202447 299490 130265 -138188 -117892 -193185
18746a93185m1191f2419j33009M9852k15785g8721q2783A69260a0480n5460a0343
$$ -193185 -234376 -62419 -195428 -145576 -361361 -78721 -161504 169260 -10480 -65940 -10343
18734a66727k6132L7145c8927k27154o8462a60704l76178I7106a77511l8626A1071
$$ -166727 -192859 -155714 -38927 -266081 -334543 -160704 -536882 97106 -177511 -216137 11071
18722c37366n5668J83319E0950a92593G1677e151j57729D40708I5865h8883A3397
$$ -337366 -393034 -209715 50950 -192593 71677 -5151 -162880 440708 95865 -88883 13397
18710A14275b2906k30048A17105b84960a12332A07154i1289D6048c1399n2905
$$ 114275 -22906 -252954 117105 -284960 -112332 107154 -91289 46048 -31399 -84304
18700h4304M1542a9207l79304B17622a1434D05439a48812I5883D6835b24492B22457
$$ -84304 -42762 -19207 -398511 217622 -11434 405439 -148812 95883 46835 -224492 222457
18688a14489I4352a82534j73978J40818q9890H8138b04599A90372l2718c39855
$$ -114489 94352 -182534 -356512 -215694 -305584 88138 -204599 190372 157654 -339855
18677F7624a42350c433A34451g1106r266K0669j60418m0933P6483H7285J181L7944
$$ 67624 -142350 -3433 134451 -71106 -80372 -59703 -220121 -261054 -184571 87285 88466 126410
18665A26410a8459j58603c8918j54120D10837c83516a44829j82361c8438A2889
$$ 126410 -18459 -177062 -38918 -193038 410837 -383516 -144829 -327190 -38438 12889
18654i2618k03221A51208b70508F2930J3696a72313j72781A0063e34189b02504
$$ -92618 -295839 151208 -270508 62930 76626 -172313 -345094 10063 -534189 -202504
18643b05165a4405A12193J1061a88416n3983A1629c45801J58649g4023K7217j50445
$$ -205165 -14405 112193 123254 -188416 -242399 11629 -345801 -187152 -74023 -46806 -197251
18632a97251I5690e9411n3228J3640j87017C9628K31493A11619j2563g2768J6636
$$ -197251 95690 -59411 -112639 -98999 -286016 39628 271121 111619 99056 -72768 -56132
18621e6132q4389e9253K4949j7105r2856a3193p4024k26421J32101k63747b16446
$$ -56132 -140521 -59253 -34304 -51409 -144265 -13193 -87217 -313638 -181537 -445284 -216446
18609a37432H8977K8173l3266h0271n9492E905a59002P9352k13363a26127B9371
$$ -137432 88977 117150 83884 -80271 -139763 5905 -159002 -79650 -293013 -126127 29371
18597D87896F2942b16123H0508a05381a6021p0835j20A92186k9083g1009j2436
$$ 487896 62942 -216123 80508 -105381 -16021 -86856 -86976 192186 163103 -71009 -83445
18586h3445b6822j08931G9639b50706i2450E8777K43429c37449a08782a1810j22857
$$ -83445 -26822 -135753 79639 -250706 -92450 58777 302206 -337449 -108782 -11810 -134667
18575a34667d9767l7071r883H7373c06460k585J7445A4690J43493d4962B81659
$$ -134667 -49767 -86838 -96721 87373 -306460 -309045 -291600 14690 158183 -44962 281659
18563a7702k06225r7442J11892k2657A96807n2848a99753g2925D0923r970b59163
$$ -17702 -223927 -321369 -209477 -232134 196807 143959 -199753 -72925 40923 30953 -259163
18551B11370c20416J16613A38934n9682J48434A4802c83407a58637H5506e8053
$$ 211370 -320416 -203803 138934 79252 227686 14802 -383407 -158637 85506 -58053
18540I4617c65609C2062a89766M0981j5924b8771q2498M6226j67463D16973a51536
$$ 94617 -365609 32062 -189766 -148785 -164709 -28771 -111269 -65043 -232506 416973 -151536
18528d11434J91825A46136b87709A43030C654b61487N8223k07803a61492B00810
$$ -411434 -219609 146136 -287709 143030 3654 -261487 -203264 -411067 -161492 200810
18517e7646m1822k87650A12943c61295J56647D9087f0021k04053b1248k41955
$$ -57646 -99468 -387118 112943 -361295 -204648 49087 -60021 -264074 -21248 -263203
18507b63203K8120A01137a03978d0330j02856j72648B465c6362R538k11145A94064
$$ -263203 -235083 101137 -103978 -40330 -143186 -315834 2465 -36362 -26824 -237969 194064
18495A09350J40884D2145c34185k4374G5550F444a48E8098b17665B7770b21039
$$ 109350 250234 42145 -334185 -358559 75550 6444 -148 58098 -217665 27770 -221039
18483a48186L1476o4677F4259J76639B3828a29314r5734g8481m192d892l37233
$$ -148186 -116710 -181387 64259 240898 23828 -129314 -225048 -78481 -82673 -4892 -342125
18472c42125a17356B38992H9485J10309M6921a02619K1925O316A01998c76596
$$ -342125 -117356 238992 89485 199794 246715 -102619 -80694 -74378 101998 -376596
18461E7483k3546K09191m3778h4954G0936b36121A31021b00221A80989d3125j7029
$$ 57483 33937 243128 199350 -84954 70936 -236121 131021 -200221 180989 -43125 -60154
18450f0154p2542E0867P2509C687O1352c68926F6441j1447f3406k93982B38207
$$ -60154 -132696 50867 123376 3687 65039 -368926 66441 54994 -63406 -357388 238207
18438G6907b35200A94737n2452d2257l84997a96324l70808a5390k11613h7330
$$ 76907 -235200 194737 142285 -42257 -427254 -196324 -567132 -15390 -227003 -87330
18427b928m03055I2480h6519K0819o9096A1860c55365B38209b8806j68923J7924
$$ -2928 -405983 92480 -86519 -65700 -134796 11860 -355365 238209 -28806 -197729 -179805
18416a79805j23384A18450b73680j17613a39216J341a0997m5420j0136k97460
$$ -179805 -303189 118450 -273680 -391293 -139216 -137875 -10997 -56417 -66553 -364013
18406c64013d9589p0461C49297A08777c56726B91623c12537C3265K07881B5212
$$ -364013 -49589 -120050 349297 108777 -356726 291623 -312537 33265 241146 25212
18395B94454a59471A90821b20320g8752j04065O8205b968p2080B3088J1178J01146
$$ 294454 -159471 190821 -220320 -78752 -182817 -114612 -2968 -75048 23088 34266 135412
18384A35412b8714q0597D30625r4124c46262d3892A57d4503E8150c91868b6844
$$ 135412 -28714 -109311 430625 336501 -346262 -43892 157 -44503 58150 -391868 -26844
18372B9330f7674A52355E0479a27327B42767a28344j88063C7723a45335A25070
$$ 29330 -67674 152355 50479 -127327 242767 -128344 -316407 37723 -145335 125070
18361b80159g4792l66754C7671b261j10981J729A63758a40754O8520j48582M9913
$$ -280159 -74792 -441546 37671 -2261 -113242 -111513 163758 -140754 -72234 -220816 -170903
18350a70903A01653g8586p0557A59475D0546h7994A18760c3258J3455A77694a80010
$$ -170903 101653 -78586 -149143 159475 40546 -87994 118760 -33258 -19803 177694 -180010
18338b18881k816n6618a3576k11464Q4912P064a1411m1579A342a88843D5544b73219
$$ -218881 -221697 -278315 -13576 -225040 -140128 -133064 -11411 -52990 1342 -188843 45544 -273219
18325c6198m4641A8821c6541n8138b2425A23801A4596a5E3640c11532b4420B50661
$$ -36198 -80839 18821 -36541 -94679 -22425 123801 14596 -15 53640 -311532 -24420 250661
18312d0198A815a22469E6972J20610n3333D0048a86587h8342M0978j0070j00992
$$ -40198 1815 -122469 56972 177582 124249 40048 -186587 -88342 -47364 -57434 -158426
18301a58426B16778a40246C2858g8611k8674B39712A6458c64867d0348H7449B26
$$ -158426 216778 -140246 32858 -78611 -107285 239712 16458 -364867 -40348 87449 226
18289i1606H4699C6769a80969E2518a37185k22498a30660J5708F5672c43371a26238
$$ -91606 84699 36769 -180969 52518 -137185 -359683 -130660 -114952 65672 -343371 -126238
18277f9294j27888q9036b6531j98111N9004N2897k27416e1072A88717H5817j4821
$$ -69294 -197182 -286218 -26531 -224642 -165638 -112741 -340157 -51072 188717 85817 70996
18266G0996g6466k78695A17879c3092k96897E082N4410P133B8126J45712J42753
$$ 70996 -76466 -355161 117879 -33092 -329989 5082 59492 66625 28126 173838 316591
18255C16591b07973c6377l5008b0854A21183c303F2443a592D4824K54556D4667
$$ 316591 -207973 -36377 -71385 -20854 121183 -3303 62443 -1592 44824 299380 44667
18243c43939d1077k84580J00575b3665E1426a48412F9606a47012I3836e9080j34739
$$ -343939 -41077 -325657 -225082 -23665 51426 -148412 69606 -147012 93836 -59080 -193819
18232a93819k65387K23025r0665A25443c79934A78482F9862J33129A1864c17575
$$ -193819 -459206 -236181 -326846 125443 -379934 178482 69862 202991 11864 -317575
18221a32716o922J4899j60321n9169A04106L4095m2330K31906j32570a07522B76132
$$ -132716 -139638 -124739 -285060 -344229 104106 138201 95871 327777 195207 -107522 276132
18209E8483b50288a13123k3856J0477B9474a66627B3035a27734A61456C3832g7503
$$ 58483 -250288 -113123 -136979 -126502 29474 -166627 23035 -127734 161456 33832 -77503
18197A27666C2074J321a94940A024K49632A04127a49764D7101f1627k07664J22861
$$ 127666 32074 33395 -194940 1024 250656 104127 -149764 47101 -61627 -269291 -146430
18186a46430g979k14356G8788e7917j18626j15917H9846J2800L9993g6148C230
$$ -146430 -7979 -222335 78788 -57917 -176543 -292460 89846 102646 142639 -76148 3230
18174a77303A66518b07912B21574b8328c353r519E456a73137A13579b485E66489
$$ -177303 166518 -207912 221574 -28328 -3353 -12872 5456 -173137 113579 -2485 566489
18162a232A10334a16031L9589F4761J40491D1123E282b56375Q6100A34334b01842
$$ -1232 110334 -116031 -76442 64761 205252 41123 5282 -256375 -170275 134334 -201842
18150b49262F7599K33509q8467B3081g3692g611E7435J913O2086j0575a0916r8917
$$ -249262 67599 301108 212641 23081 -73692 -7611 57435 59348 121434 110859 -10916 -109833
18138a09833j55877a03029o4390c8091j26669E5937b38070J06324A49970b63541
$$ -109833 -265710 -103029 -167419 -38091 -164760 55937 -238070 -131746 149970 -263541
18127B47292A1677a65520A80508b75690a22164c6055I3097Q5277a60823I8217
$$ 247292 11677 -165520 180508 -275690 -122164 -36055 93097 178374 -160823 98217
18116A72632a27366J2666n3225J1208g8225C0167a67975I3513a1602j64122l3752
$$ 172632 -127366 -114700 -167925 -156717 -78225 30167 -167975 93513 -11602 -175724 -209476
18105b09476h5801A2797R0932e1862R477j02983k20841A96087a33996B35895c07966
$$ -209476 -85801 12797 103729 -51862 -42385 -145368 -366209 196087 -133996 235895 -307966
18093C4731A1882K8951b41119A21187j6349D8712c26782b3264k49841H1973l7088
$$ 34731 11882 40833 -241119 121187 104838 48712 -326782 -23264 -273105 81973 44885
18082D4885g6235k42751i5547j94880b1164H2212k663a24945e4028m4481j32650
$$ 44885 -76235 -318986 -95547 -290427 -21164 82212 79549 -124945 -54028 -98509 -231159
18071b31159B8709a03024a3q0118A20723a83349A89015e5685I0434c146j81681
$$ -231159 28709 -103024 -13 -80131 120723 -183349 189015 -55685 90434 -3146 -184827
18060a84827q064d977H5271P062f7548e995E4441J88310j17869a86474A8147c7992
$$ -184827 -192891 -4977 85271 92333 -67548 -5995 54441 242751 124882 -186474 18147 -37992
18047c46303C4634a98634A36317b16809I54g446H8493O2173a68122o8524B98851
$$ -346303 34634 -198634 136317 -216809 954 -7446 88493 150666 -168122 -236646 298851
18035c5842D35891b88242h517A76264E351O3355j0057j3519b11700A2613d3570
$$ -35842 435891 -288242 -8517 176264 5351 68706 58649 45130 -211700 12613 -43570
18023A09374a02710B9311e46135A80821q2379d9486j74259N269D00430H5727a23294
$$ 109374 -102710 29311 -546135 180821 98442 -49486 -223745 -218476 400430 85727 -123294
18011b56884A07489c7621B5738J67120r3379D3687A3702d6818H3861a04893A34676
$$ -256884 107489 -37621 25738 192858 99479 43687 13702 -46818 83861 -104893 134676
17999a50826r3786B08775o6439b84175c774F4155a16029C30918a22175M1655a8859
$$ -150826 -244612 208775 142336 -284175 -3774 64155 -116029 330918 -122175 -80520 -18859
17987E4528a5669l6791A47478E6349a4534C05944c337A73344a99568d0815A59796
$$ 54528 -15669 -52460 147478 56349 -14534 305944 -3337 173344 -199568 -40815 159796
17975g8136k26294B72096F361a0314j92204M173M7710J335B83259D5224a94882
$$ -78136 -304430 272096 6361 -10314 -202518 -198345 -150635 -149300 283259 45224 -194882
17963A43947k7646b14159I3156b12178A53089a14874C4533K29516j19160b4734
$$ 143947 116301 -214159 93156 -212178 153089 -114874 34533 264049 144889 -24734
17952F8050N3892J43013b15791c556j09355B08228D3845a66717A33399j3402b76916
$$ 68050 121942 264955 -215791 -3556 -112911 208228 43845 -166717 133399 119997 -276916
17940a3856l6665i811l4761C72873b6956C57059h7590B19820b08845h7297E02565
$$ -13856 -50521 -9811 -44572 372873 -26956 357059 -87590 219820 -208845 -87297 502565
17928a62003J6766k2174n7865C52015d824n666A32297L6884J37745a03909N537
$$ -162003 -145237 -167411 -225276 352015 -4824 -10490 132297 169181 306926 -103909 -98372
17917i8372l71084A11308a54285B06328b72057a09322C3343J99550a07490B9130
$$ -98372 -469456 111308 -154285 206328 -272057 -109322 33343 232893 -107490 29130
17906c6603j86796m10608A54736c26559Q2179R1237j73645C8996a78447h5021
$$ -36603 -223399 -634007 154736 -326559 -244380 -153143 -326788 38996 -178447 -85021
17895b27179G6210N2055N3877B197M63152A79063b92259a45664L5625e2851j6354
$$ -227179 76210 128265 182142 2197 465349 179063 -292259 -145664 -110039 -52851 -69205
17884f9205b6728k11940H3566P6028A3604K50565c23622F19088i2977A05229g4648
$$ -69205 -26728 -238668 83566 159594 13604 264169 -323622 619088 -92977 105229 -74648
17872b11513H0273i8806B26035I5003f6360E7589b25722e0814r057k0085c4395
$$ -211513 80273 -98806 226035 95003 -66360 57589 -225722 -50814 -59871 -79956 -34395
17860b02486c9878I5991o031b16762A2571a78036D02829a09054j75299B62407
$$ -202486 -39878 95991 89960 -216762 12571 -178036 402829 -109054 -284353 262407
17849h6313L8989B35950i9106M2882l9619j87303J08110B13681e7680I6325a19383
$$ -86313 -47324 235950 -99106 -56224 -95843 -283146 -175036 213681 -57680 96325 -119383
17837a03519r6688D04160H344N8422l1920a90248d4997l37414A18593m6708J07893
$$ -103519 -200207 404160 8344 66766 34846 -190248 -44997 -382411 118593 71885 179778
17826A79778H1560R696d4165A17338E5451Q2913c94891A43693Q321b7699m9314
$$ 179778 81560 91256 -44165 117338 55451 138364 -394891 143693 152014 -27699 -77013
17815g7013A427d377A40200b11961J4373A59881g6939B6552Q3501b6667I6467
$$ -77013 1427 -4377 140200 -211961 -197588 159881 -76939 26552 110053 -26667 96467
17803c89330G3519n436J06243g6449k27307f903j70561a3894A84033p5866j1832
$$ -389330 73519 68083 174326 -76449 -303756 -6903 -177464 -13894 184033 108167 96335
17792I6335d0266B7828a14834H0373f2904A82655o7867O91n427g334A74551a2374
$$ 96335 -40266 27828 -114834 80373 -62904 182655 114788 115479 110052 -7334 174551 -12374
17779h5570l30253A9006a64264A00541b16457A30531c76618D9126J75000a86444
$$ -85570 -415823 19006 -164264 100541 -216457 130531 -376618 49126 224126 -186444
17768F4442b60010A28920b06505C66291l7970j47269i7572B7684q336c5786D18700
$$ 64442 -260010 128920 -206505 366291 328321 181052 -97572 27684 19348 -35786 418700
17756E6697J09062p5437a00965C55593b4110k48353J35703A60473l5181J7418
$$ 56697 165759 90322 -100965 355593 -24110 -272463 -136760 160473 125292 142710
17746A42710f4489g325D81320k39369A11062b29328f3889m9929B39187k5284C004
$$ 142710 -64489 -7325 481320 241951 111062 -229328 -63889 -113818 239187 213903 3004
17734A68693A2083a8655B38491E0903b75255A93542A8278g3327A715a50607k8409
$$ 168693 12083 -18655 238491 50903 -275255 193542 18278 -73327 1715 -150607 -179016
17723a79016P7137B74688C1893N9180l2742b08383C1605M0116h270A10307E237
$$ -179016 -101879 274688 31893 91073 58331 -208383 31605 71721 -8270 110307 5237
17711B23263r3178e4028k36729a10688D77870A38582n9423a05322m7534B19833
$$ 223263 130085 -54028 -290757 -110688 477870 138582 79159 -105322 -152856 219833
17700a71051A0744K47182I0134j8227a90253B3402f4936E4820K73856j48960b34132
$$ -171051 10744 257926 90134 71907 -190253 23402 -64936 54820 328676 179716 -234132
17688a35741c8566B28161e9970D3531K14104b29439A52794D4257i1158m7201g9
$$ -135741 -38566 228161 -59970 43531 257635 -229439 152794 44257 -91158 -138359 -79
17676a61232A32770P9040L07259k25051j17848P4881A20870j1396K19483a66957
$$ -161232 132770 211810 519069 294018 176170 251051 120870 109474 328957 -166957
17665a21433j11315C69009b86783h0343C23018f585H8337L52574A72258J00871
$$ -121433 -232748 369009 -286783 -80343 323018 -6585 88337 440911 172258 273129
17655B73129J0423f5132a5299C30935E8570a2277D3822J94437P1265d3372G5024
$$ 273129 283552 -65132 -15299 330935 58570 -12277 43822 238259 309524 -43372 75024
17643g1670A06762h9903A7728N7291K93942B236L68666r2347a71386E2289J47164
$$ -71670 106762 -89903 17728 75019 368961 2236 370902 278555 -171386 52289 199453
17632A99453G5637b33236b4262B18397J88455A11886a87672A04608l3882O2353
$$ 199453 75637 -233236 -24262 218397 406852 111886 -187672 104608 70726 133079
17622A33079b02947B77540b0640A93580r94a58199j06717F569a54328N8718A82297
$$ 133079 -202947 277540 -20640 193580 192586 -158199 -264916 6569 -154328 -95610 182297
17610A62009e5602C09396G6308Q2146d7162k0062j20165A32291o0689j2866J77985
$$ 162009 -55602 309396 76308 158454 -47162 -67224 -187389 132291 71602 58736 236721
17599B36721D5196K7824K01848I4760J14189j9885k9859J6890J09465A15742L2923
$$ 236721 45196 73020 274868 94760 208949 189064 159205 176095 285560 115742 148665
17588A48665G1103K46229B4959K27755p8173N2800N3958i687I465g2865B995N6078
$$ 148665 71103 317332 24959 252714 174541 227341 281299 -9687 9465 -72865 2995 59073
17576E9073L5543P3342m3718k9167i1382A18271J1817k0805N5805J65019a65960
$$ 59073 94616 167958 124240 95073 -91382 118271 130088 109283 165088 330107 -165960
17564H0776K54157j57935K1249c0012m8873H9116J01090l0475A9324J09049G343
$$ 80776 334933 176998 198247 -30012 -78885 89116 190206 159731 19324 128373 7343
17552A62618m7717g0135C66748j46139e1879K027C10959J56232e1387B13225J72572
$$ 162618 114901 -70135 366748 220609 -51879 -49852 310959 467191 -51387 213225 385797
17541C85797B1726b6570A11887L5134l713E5425K48603J9275E9030J13083o1654
$$ 385797 21726 -26570 111887 147021 143308 55425 304028 323303 59030 172113 110459
17530A10459L3881K10106K6868K01662p4133K90070L64648k31912J87144l79571
$$ 110459 144340 354446 381314 582976 508843 798913 1163561 931649 1118793 739222
17520G39222p4152r5332A80154L60801q2079A40899J24672J97726A38938M09466
$$ 739222 665070 569738 180154 540955 458876 140899 265571 463297 138938 548404
17510E48404M77892j19097L7814l42786P052B2138M42655k06598l4562p4728E7820
$$ 548404 1026296 907199 945013 602227 609279 22138 464793 258195 223633 148905 57820
17498B59612J5860q1565P1111l406J52562G6607A832K69672D0569K60760O2712
$$ 259612 275472 193907 265018 261612 414174 76607 1832 271504 40569 301329 364041
17487C64041q9013K38594k51470o5442K29766j14894m3073M1497p7705b46436
$$ 364041 275028 513622 262152 196710 426476 311582 268509 310006 232301 -246436
17476A66247o2932K2750L01185p1882j16600L36890k22036A27419K11893j50057
$$ 166247 103315 126065 427250 355368 238768 575658 353622 127419 339312 189255
17466A89255E3225J16021n6383L54394G7908J65608o2351K11873j20258A36372
$$ 189255 53225 169246 112863 467257 77908 243516 181165 393038 272780 136372
17455H0662K65275A25031B6687J77026N1482J74350n3077r1974M82626j6752m5458
$$ 80662 345937 125031 26687 203713 255195 429545 376468 284494 767120 750368 704910
17444G04910j46402P5526l10422p9171J78170M7614j82595J16239A69771J72931
$$ 704910 558508 634034 323612 244441 422611 470225 287630 403869 169771 342702
17434C42702J91856j06507o6688F5549J76179K59659A92290K62685q7968A27323
$$ 342702 534558 428051 361363 65549 241728 501387 192290 454975 367007 127323
17423C80856M7464J22936j97527R8484k23933L51006k74792g9224E67469j27162
$$ 380856 428320 551256 353729 452213 228280 579286 304494 -79224 567469 440307
17413D40307k01133L90693j7761J42390G3831J72795A0147J00097J59129I6339
$$ 440307 239174 629867 612106 754496 73831 246626 10147 110244 269373 96339
17402B87797j31921m690J20610A17574L07747A53031n1255R0847j5160J2577D8807
$$ 287797 155876 151186 271796 117574 425321 153031 101776 192623 177463 190040 48807
17390I8905J26912J21994q9182j22537J02797f863D7764K76392R8406a05558C20636
$$ 98905 225817 347811 258629 136092 238889 -6863 47764 324156 422562 -105558 320636
17378D72522A91535m2148p2317J75226q0009O9352B9589n942L03967P3097j14426
$$ 472522 191535 149387 77070 252296 172287 241639 29589 23647 327614 400711 286285
17367B86285h608A46500D7588L14165I1827L2456B4668P0728J86839m1343j18511
$$ 286285 -8608 146500 47588 361753 91827 124283 24668 95396 282235 240892 122381
17356A22381A420J10555L94912j60969a9821D58714B01978b0912A47768K71618
$$ 122381 1420 111975 506887 345918 -19821 458714 201978 -20912 147768 419386
17346D19386j02263j22002J85029B0183O3093L59816j62303n8525J05564A34798
$$ 419386 317123 195121 380150 20183 83276 443092 280789 222264 327828 134798
17335C06605E2945d7185D45284j87945K50338B7895K93262A54152k0927J19029
$$ 306605 52945 -47185 445284 257339 507677 27895 321157 154152 133225 252254
17325B52254J44003G5991L28027J73765A40037J62582F1573K81893A09079K60431
$$ 252254 396257 75991 404018 577783 140037 302619 61573 343466 109079 369510
17315C69510j41599J8864n4799e8111C51215L28861e2182C41914H9198J89152
$$ 369510 227911 246775 191976 -58111 351215 680076 -52182 341914 89198 278350
17305B78350l0418a91726A93010C1270M24662o3938A90880Q2209n0929L37361
$$ 278350 247932 -191726 193010 31270 455932 391994 190880 273089 222160 559521
17295E59521A25267M38396A44287b43379B43902n3197N5082q4125G7850N2113
$$ 559521 125267 563663 144287 -243379 243902 190705 245787 161662 77850 129963
17285A29963J34775A06676J13477N0063a74472B06753J90874j55600M8209q0305
$$ 129963 264738 106676 220153 270216 -174472 206753 397627 242027 290236 209931
17275B09931Q332o8792J20361E5808L11333A46086L37924A18296L86616a32472
$$ 209931 218263 149471 269832 55808 367141 146086 484010 118296 504912 -132472
17264C23380J38801J9254j73767J96656n1458P4456B49887q9001R576J64837j19057
$$ 323380 462181 481435 307668 504324 452866 527322 249887 160886 170462 335299 216242
17253B16242L8612J95090r6307j30499a05323F94793C2780N52022j99162k185
$$ 216242 254854 449944 353637 223138 -105323 694793 32780 584802 385640 383455
17243C83455j81843J95547R4703k30350K7719L11082A62230J89656j06784C1538
$$ 383455 201612 397159 491862 261512 289231 600313 162230 351886 245102 31538
17232D28584E1663O69597B42715K757K02770A495M21515j97510L12965k37772
$$ 428584 51663 721260 242715 245472 448242 1495 423010 225500 538465 300693
17222C00693N0794k2320K01197A62123L37463j03861p1190p3872j25231J15470
$$ 300693 351487 329167 530364 162123 499586 395725 324535 250663 125432 240902
17212B40902P7065J00685k3684O1842O4964O5683j31067A66192K49517L4119k3318
$$ 240902 317967 418652 394968 456810 521774 587457 456390 166192 415709 449828 426510
17201D26510A68226K30538n4392M5625Q9216K07754b16468D71470j24718J11004
$$ 426510 168226 398764 344372 389997 479213 686967 -216468 471470 346752 457756
17191D57756K33476C34972J12831j31168J06416p9846j05210J11042O3051L0635
$$ 457756 691232 334972 447803 316635 423051 343205 237995 349037 412088 442723
17181D42723j55837h4410D77727j59422R4719A36958M66479k39430L2650A74357
$$ 442723 286886 -84410 477727 318305 413024 136958 603437 364007 396657 174357
17170E86515P4057l12670K0341j16403j6207F0695P15289j22584r1166O7062o6918
$$ 586515 660572 347902 368243 251840 235633 60695 775984 653400 562234 629296 562378
17159E62378J10640k92613r528k2900J79423B58842K93985M6359J7194j56759
$$ 562378 673018 380405 370877 347977 527400 258842 552827 599186 616380 459621
17149D59621A28035R0673J68101N4171k0181j41537K89514n3679k37367L61993
$$ 459621 128035 218708 386809 440980 420799 279262 568776 515097 277730 639723
17139F39723k60918L3612k04255J31235j9511K18552j38423A68049K55470J03963
$$ 639723 378805 412417 208162 339397 319886 538438 400015 168049 423519 527482
17129E27482j8282A94349J70734K39296m5462K21586j34402C08452P585K78875
$$ 527482 509200 194349 365083 604379 558917 780503 646101 308452 316037 594912
17119E94912k3634N8034j65866J4349q40L30694o1808l63898J82078Q2552k23790
$$ 594912 571278 629312 463446 477795 476955 807649 745841 381943 564021 646573 422783
17108D22783L85887q988p6089j48646j71104J38061n303J26423k3656j1621j36979
$$ 422783 808670 799682 723593 574947 403843 541904 536601 663024 639368 627747 490768
17097D90768p1835J39237K7228L19520j63961M9808l3998Q7049l66499J05488
$$ 490768 418933 558170 585398 904918 740957 790765 756767 843816 477317 582805
17087E82805k55750K32591k59308L41934r9385L74076k65858r4850Q8670j26153
$$ 582805 327055 559646 300338 642272 542887 916963 651105 556255 644925 518772
17077E18772Q5861K04097j06059M9732m6967j30784L2420J79226J2942o3994K30564
$$ 518772 604633 808730 702671 752403 705436 574652 607072 786298 799240 735246 965810
17066I65810D74058M25235J95605l95325j34709N77757D84317K77480n2521r860
$$ 965810 474058 899293 1094898 699573 564864 1142621 484317 761797 709276 699416
17056F99416k17855J46828l3911j33005M47486j86592j31660J88142L74273l48368
$$ 699416 481561 628389 594478 461473 908959 722367 590707 778849 1153122 804754
17046H04754k6731J01697r1311K25370k42043j39484J01647O7871J85615j82611
$$ 804754 778023 879720 788409 1013779 771736 632252 733899 801770 987385 804774
17036H04774k17428M5511K00519j66602q3678J25089J34486m6032J78094L6698
$$ 804774 587346 632857 833376 666774 583096 708185 842671 796639 974733 1011431
17026A011431l10240O7816J2199J81841K94562k45138n4024N8314L8935j96397
$$ 1011431 701191 769007 781206 963047 1257609 1012471 958447 1016761 1055696 859299
17016H59299j50520K76401L65378m09801K79592j75839k14446M5306K65532l74536
$$ 859299 708779 985180 1350558 940757 1220349 1044510 830064 875370 1140902 766366
17006G66366M07568k17182L54525k97700M9676J26979J45684l80954L3488k9302
$$ 766366 1173934 956752 1311277 1013577 1063253 1190232 1335916 954962 988450 959148
16996I59148K84745k78872j87276K28131P0309J32737P9042P6897j05386l16341
$$ 959148 1243893 965021 777745 1005876 1076185 1208922 1287964 1364861 1259475 943134
16986I43134J30875J95215r2770J29419J59951k59119j03161J96369p2172K46513
$$ 943134 1074009 1269224 1176454 1305873 1465824 1206705 1103544 1299913 1227741 1474254
16976A474254j39705J24070J16201l57120j72437K71328j62315J73439K06804
$$ 1474254 1334549 1458619 1574820 1217700 1045263 1316591 1154276 1327715 1534519
16967A534519Q1558N7597o10645K28564O131L45004K67853R415l20112j8190k13252
$$ 1534519 1616077 1673674 1063029 1291593 1297724 1642728 1910581 1919996 1599884 1581694 1368442
16956A368442K40313L7110m8199k19695K05726j60652J11765J12126m6282j62339
$$ 1368442 1608755 1645865 1597666 1377971 1583697 1423045 1534810 1646936 1600654 1438315
16946A438315L71798n00297N47970j47494j33554J89861Q1839P3756k20224J3206
$$ 1438315 1810113 1309816 1857786 1710292 1576738 1766599 1848438 1922194 1701970 1715176
16936A715176P7402q2582J30519K79667n74025L82620K79130k92405Q7237j54178
$$ 1715176 1792578 1709996 1840515 2120182 1546157 1928777 2207907 1915502 2002739 1848561
16926A848561M91889k97111J77085k11112K1004K18387k99985m7701M13457l32728
$$ 1848561 2340450 2043339 2220424 2009312 2030316 2248703 1948718 1901017 2314474 1981746
16916A981746L26117k33956R1936K96734k33147k030K80066j85562J9129k42290
$$ 1981746 2307863 2073907 2165843 2462577 2229430 2227400 2507466 2321904 2341033 2098743
16906B098743J02375L74993k59471L51635J0063M0412m29864L43657J19719J13105
$$ 2098743 2201118 2576111 2316640 2668275 2678338 2718750 2288886 2632543 2752262 2865367
16896B865367j43590J00925P1969J587j64653Q1520p7781J98375L33689n08994
$$ 2865367 2721777 2822702 2894671 2896258 2731605 2813125 2735344 2933719 3267408 2758414
16886B758414L58188K06313k18163j44595J66547J2875N12K22098L01504k95794
$$ 2758414 3116602 3322915 3104752 2960157 3126704 3139579 3140091 3362189 3663693 3367899
16876C367899j99791N21103j19562Q034r3985k2934L00968M784o1976j00560M7513
$$ 3367899 3168108 3689211 3569649 3577683 3483698 3460764 3761732 3766516 3704540 3603980 3651493
16865C651493N59888k28910K3357N0195K15642o6419K38414k0332M6116k43078
$$ 3651493 4211381 3982471 4005828 4056023 4271665 4205246 4443660 4423328 4469444 4226366
16855D226366L33683K93595q2013j05036J18760L30981j04600o9615J10026L9578
$$ 4226366 4560049 4853644 4771631 4666595 4785355 5116336 5011736 4942121 5052147 5091725
16845E091725J23474L17153k98420J88644j33447N70810l7540K36009j63317J64001
$$ 5091725 5215199 5532352 5233932 5422576 5289129 5859939 5822399 6058408 5895091 6059092
16835F059092J80611j36291J85838L0452K37685J59759n6812M366L62815j66191
$$ 6059092 6239703 6103412 6289250 6319702 6557387 6717146 6660334 6664700 7027515 6861324
16825F861324J43705L3970N31805o6493J16522M33193k69919L12951N9734L24947
$$ 6861324 7005029 7038999 7570804 7504311 7620833 8054026 7784107 8097058 8156792 8481739
16815H481739M85762L4147L0290J53724L52915K02432p5608K43145N0090M93690
$$ 8481739 8967501 9001648 9031938 9185662 9538577 9741009 9665401 9908546 9958636 10452326
16805A0452326K86326r9665L50325N46248J31059J79989P2914J55309Q30007J03503
$$ 10452326 10738652 10638987 10989312 11535560 11666619 11846608 11919522 12074831 12904838 13008341
16795A3008341K28795J25386K42972L95736R18536r0170L37842K99917O55235
$$ 13008341 13237136 13362522 13605494 14001230 14919766 14829596 15167438 15467355 16122590
16786A6122590K24168M55949M33447N02284L63404N48024P60805K89104Q18970
$$ 16122590 16346758 16802707 17236154 17738438 18101842 18649866 19410671 19699775 20518745
16777B0518745J67054N03426J163039L40517M87053O65216O82107J007029R92819
$$ 20518745 20685799 21189225 22352264 22692781 23179834 23845050 24527157 25534186 26527005
16768B6527005Q55653J045724M60186Q00603J382371J071186Q77850J545402O40181
$$ 26527005 27382658 28428382 28888568 29689171 31071542 32142728 33020578 34565980 35206161
16759C5206161J589666J163529J358011J457715J244715J555911J607817J792571
$$ 35206161 36795827 37959356 39317367 40775082 42019797 43575708 45183525 46976096
16751D6976096J196173K168027K008865K166567J970061K216221J693139K737754
$$ 46976096 48172269 50340296 52349161 54515728 56485789 58702010 60395149 63132903
16743F3132903K284099K415819K421580K713228K609714K685050K708986K845474
$$ 63132903 65417002 67832821 70254401 72967629 75577343 78262393 80971379 83816853
16735H3816853K698927L066007K071777L158793K654652K624599K176641K628451
$$ 83816853 86515780 89581787 91653564 94812357 97467009 100091608 102268249 104896700
16727A04896700K097167K010971J267562J577737J137508R21608R85924J69607
$$ 104896700 106993867 109004838 110272400 111850137 112987645 113909253 114895177 115064784
16719A15064784j19323j93448q35568q56369r99591j615205j613394j971626k299929
$$ 115064784 114945461 114752013 113916445 113060076 112060485 110445280 108831886 106860260 104560331
16710A04560331k678632k261989l085227k314069k678929l038272k792008k899073
$$ 104560331 101881699 99619710 96534483 94220414 91541485 88503213 85711205 82812132
16702H2812132k691578k614838k886971k784524k237636k727656k976590k121869
$$ 82812132 80120554 77505716 74618745 71834221 69596585 66868929 63892339 61770470
16694F1770470k452433k119232j969582k183535k202045j778625j594504j488609
$$ 61770470 59318037 57198805 55229223 53045688 50843643 49065018 47470514 45981905
16686D5981905j957290j595249j936505j108853j522344j115773j564803j378504
$$ 45981905 44024615 42429366 40492861 39384008 37861664 36745891 35181088 33802584
16678C3802584j295108j202613q73818p74153j145326q46865j039016q16178r31425
$$ 33802584 32507476 31304863 30431045 29656892 28511566 27664701 26625685 25809507 24878082
16669B4878082r37255k37188r99263r44082l10361p11884m34064n59719q13820
$$ 24878082 23940827 23703639 22704376 21760294 21449933 20738049 20303985 19744266 18930446
16660A8930446q67987P018o79115n38183n59166m77201N183o84170l33858j65779
$$ 18930446 18062459 18069477 17390362 16852179 16293013 15815812 15820995 15136825 14802967 14637188
16650A4637188q67781j37110l42955n38489n05505J97274l31026l16997k83520
$$ 14637188 13769407 13632297 13289342 12750853 12245348 12442622 12111596 11794599 11511079
16641A1511079l11069l05524l01405j00456l36183k39802l26952K37691l07132
$$ 11511079 11200010 10894486 10593081 10492625 10156442 9916640 9589688 9827379 9520247
16632I520247l82276l06179j35577J3802p14493K96017o13035L66808k54383m81126
$$ 9520247 9137971 8831792 8696215 8710017 7995524 8291541 7678506 8045314 7790931 7309805
16622G309805j42434J4829j44231j02180P8400k94646j63019J24770l79603n2266
$$ 7309805 7167371 7182200 7037969 6935789 7014189 6719543 6556524 6681294 6301691 6249425
16612F249425l61610j79111K80226j53479J28673j30113m39419M9800P50p2450
$$ 6249425 5887815 5708704 5988930 5835451 5964124 5834011 5394592 5444392 5445142 5372692
16602E372692j28946q362k55567M6996j82627l18373J68048Q4853l03329k47521
$$ 5372692 5243746 5235384 4979817 5026813 4844186 4525813 4693861 4778714 4475385 4227864
16592D227864j39350K36769o0565j76785j47313J56080m81098L70052l63897K79561
$$ 4227864 4088514 4325283 4264718 4087933 3940620 4096700 3615602 3985654 3621757 3901318
16582C901318m63903R0931K19866l890k33649j00833K12382k83057R0990j40764
$$ 3901318 3437415 3528346 3748212 3744322 3510673 3409840 3622222 3339165 3430155 3289391
16572C289391L05059k87675r630L5100k46052p3746J16649l93995J45844j0302
$$ 3289391 3594450 3306775 3297145 3332245 3086193 3012447 3129096 2735101 2880945 2870643
16562B870643M1586j57570Q3509j42828K81149j86519l31832L9532q9831k2536
$$ 2870643 2912229 2754659 2838168 2695340 2976489 2789970 2458138 2497670 2407839 2385303
16552B385303k3887J32635j26466j7116o5996M16153m14875K08685j55877L73392
$$ 2385303 2361416 2494051 2367585 2350469 2284473 2700626 2285751 2494436 2338559 2711951
16542B711951p33082L92201k20712o0450N9707J62612L2644l56790J49J55834
$$ 2711951 1978869 2371070 2150358 2089908 2149615 2312227 2344871 1988081 1988230 2144064
16532B144064k77151j05349K26405k20065K56493l31797L30813j18504k52549
$$ 2144064 1866913 1761564 1987969 1767904 2024397 1692600 2023413 1904909 1652360
16523A652360n0806J33971m57754K31335L02331r8874j48418j19522L32754k71226
$$ 1652360 1601554 1735525 1277771 1509106 1811437 1712563 1564145 1444623 1777377 1506151
16513A506151J23918J5629j27742J16893j43409J1773m1402j40854j12914K42718
$$ 1506151 1630069 1645698 1517956 1634849 1491440 1503213 1461811 1320957 1208043 1450761
16503A450761n5521J42421l86665P7840j32803J30660K06680r4122J94234J10683
$$ 1450761 1395240 1537661 1150996 1228836 1096033 1226693 1433373 1339251 1533485 1644168
16493A644168o18841L31338p165K00300m08728k16185K62175k24679L69375K27220
$$ 1644168 1025327 1356665 1349500 1549800 1141072 924887 1187062 962383 1331758 1558978
16483A558978n62444J37321K12689j98981n2801L76726k0243j97274j73025N02605
$$ 1558978 996534 1133855 1346544 1147563 1094762 1471488 1451245 1253971 1080946 1583551
16473A583551m53006j25329j29685K51802L7573J48825q4029m7625k66860k19391
$$ 1583551 1130545 1005216 875531 1127333 1164906 1313731 1229702 1182077 915217 695826
16463F95826L58227j47855j3045J11884N4802J1910j20637j19279p5669L9592
$$ 695826 1054053 906198 893153 1005037 1059839 1071749 951112 831833 756164 795756
16453G95756m7106K59448j06831j4062j2445q9507J05592k29456k66450P8507
$$ 795756 748650 1008098 901267 887205 874760 785253 890845 661389 394939 473446
16443D73446J49203L01120j47072O5911J2035J9877q9364j03564K10579L4065
$$ 473446 622649 923769 776697 842608 854643 874520 785156 681592 892171 926236
16433I26236j85346M0357j51225j28516J0316j10226K78828J69237l71454J05411
$$ 926236 740890 781247 630022 501506 511822 401596 680424 849661 478207 583618
16423E83618j77156l0332N40029j98501l3153j54496K49551K71822m53907j44798
$$ 583618 406462 376130 916159 717658 684505 530009 779560 1051382 597475 452677
16413D52677K14627N6360l10476N35370l22051j33396J59086o991j62395L2373
$$ 452677 667304 723664 413188 948558 626507 493111 652197 645206 482811 515184
16403E15184L26963l24242J86436m9589J79059l53302K48196C38330P1208J02213
$$ 515184 842147 517905 704341 654752 833811 480509 728705 338330 409538 511751
16393E11751j92852L66242J7400k54592J57284K04655l54906A41514L26776r2228
$$ 511751 318899 685141 702541 447949 605233 809888 454982 141514 468290 376062
16383C76062L47853j77788L0086j82521J14701j37667J62540j32709K68409k42163
$$ 376062 723915 546127 576213 393692 508393 370726 533266 400557 668966 426803
16373D26803J98862k721J60470B24740M60063l28776I6081J27777M52294k59940
$$ 426803 625665 622944 783414 224740 684803 356027 96081 223858 676152 416212
16363D16212r8560L24252k42372K1086J17137B44482j10059L19137j1420K4353
$$ 416212 317652 641904 399532 420618 537755 244482 134423 453560 442140 466493
16353D66493P6950A09325J48966J4838C9419L01157p4819K12758L9387b0843B85496
$$ 466493 543443 109325 258291 273129 39419 340576 265757 478515 517902 -20843 285496
16341A51176K71906j90507K55914n186K45956E6722J81249G0971J97540j25464
$$ 151176 423082 232575 488489 483303 729259 56722 237971 70971 268511 143047
16331A43047D3945M68907N7715J84997B794L00091k118m1956J01730K11790A60339
$$ 143047 43945 512852 570567 755564 2794 302885 300767 258811 360541 572331 160339
16319B19257K59549A57726K105L54289A69496L32936L8382B37654K5429J02939
$$ 219257 478806 157726 159831 514120 169496 502432 540814 237654 263083 366022
16309C66022j24556J25725j03085j0531a39525A64349h3132B86165j12192L72895
$$ 366022 241466 367191 264106 253575 -139525 164349 -83132 286165 173973 546868
16299E46868N6535B93758B1823L95453J0336F77K82539p3023a40486C56095J9000
$$ 546868 603403 293758 21823 417276 427612 677 283216 210193 -140486 356095 375095
16288C75095A13339J87017E8775a36316A53422O6442P9242j2727q5236r467b2265
$$ 375095 113339 300356 58775 -136316 153422 219864 299106 286379 201143 191676 -22265
16276a22725B63778j28414r354J69620k7944J82826A67957K17546j84299K8348
$$ -122725 263778 135364 126010 295630 267686 450512 167957 385503 201204 229552
16266B29552K34178A28093m6159K3580M6033Q4675p8625a62435B39753R5375E8144
$$ 229552 463730 128093 81934 105514 151547 236222 157597 -162435 239753 335128 58144
16254H0437L8643e0945B58209H5474J45107l458d7191A49743k7799J38311n5636
$$ 80437 119080 -50945 258209 85474 230581 227123 -47191 149743 121944 260255 204619
16243B04619I973K31289a24142A40622L56330B1664J91317a79260B73371O7176
$$ 204619 9973 241262 -124142 140622 496952 21664 212981 -179260 273371 340547
16233C40547a6306G7359K68930K11172I0932B0886K98280p9024m6735A8805M8838
$$ 340547 -16306 77359 346289 557461 90932 20886 319166 240142 193407 18805 67643
16222F7643J48896K43831j36394j20350A9756K55833j02665P4759K93718A06525
$$ 67643 216539 460370 323976 203626 19756 275589 172924 247683 541401 106525
16211B37313B9478a55716A5629b49798B6386J12841o9244J50430n7096n7636B0573
$$ 237313 29478 -155716 15629 -249798 26386 139227 69983 220413 163317 105681 20573
16199E13221H8186L68533j37914a42174f828B7287R6774j4392i8606A92845c7557
$$ 513221 88186 456719 318805 -142174 -6828 27287 124061 109669 -98606 192845 -37557
16187a9923D4489J06916n6335m049J51685A21301L945j7971b23878I7016l1750
$$ -19923 44489 151405 95070 91021 242706 121301 125246 107275 -223878 97016 65266
16176F5266k4285l560d41923A31478L4247a02187A5540d3271A87025K5572g8866
$$ 65266 40981 37421 -441923 131478 165725 -102187 15540 -43271 187025 212597 -78866
16164a51463B58148r6877k0184F9464L59178c1727A66071B1927k515K25096A12600
$$ -151463 258148 161271 141087 69464 428642 -31727 166071 21927 19412 244508 112600
16152e0506F4024g3474l4517K5980j06462C79439a79932F05186B85076r7027O2689
$$ -50506 64024 -73474 -107991 -82011 -188473 379439 -179932 605186 285076 188049 250738
16141B50738C2137R9922l0185a8677A05407J85544h5920A1152J89242N911o7361
$$ 250738 32137 132059 101874 -18677 105407 290951 -85920 11152 200394 206305 138944
16130A38944C7424M1683a16814A92742a70906A50153G0627b00370A26767M5325
$$ 138944 37424 79107 -116814 192742 -170906 150153 70627 -200370 126767 172092
16120A72092J62768H1176J09876a37082L670o8419A36264A0595M06795a8540l4113
$$ 172092 334860 81176 191052 -137082 -133412 -201831 136264 10595 417390 -18540 -52653
16109e2653p1478B47878n0044l2094f755B4864J15031B2561K11583n1172A6639
$$ -52653 -124131 247878 197834 165740 -6755 24864 139895 22561 234144 182972 16639
16097I3945J60535K7235p9581a19055H8504J04698M5110b21082a05099H258a01885
$$ 93945 254480 281715 202134 -119055 88504 193202 238312 -221082 -105099 8258 -101885
16085d7536B15387D7478Q1525f5965j56542A30666n0887j5188a49927A80039h3721
$$ -47536 215387 47478 129003 -65965 -222507 130666 79779 64591 -149927 180039 -83721
16073A433O16736c56899O2954A14346K558k6815A6297L0339f543A16053C9941
$$ 1433 618169 -356899 -293945 114346 116904 90089 16297 46636 -6543 116053 39941
16061A58189b16098A21346N3060l8522M18699A02260p412g1812B33959c44720
$$ 158189 -216098 121346 174406 135884 554583 102260 94848 -71812 233959 -344720
16050c149g00p8493a0098B37882K1455E7239B4073j0295b34356g1510B6259M2125
$$ -3149 -700 -79193 -10098 237882 259337 57239 24073 13778 -234356 -71510 26259 68384
16038F8384c9386l3033B64521B5615J51752e9890k81940a35092D59254b83119
$$ 68384 -39386 -72419 264521 25615 177367 -59890 -341830 -135092 459254 -283119
16027a68077a4631A62445B6165b3288B52017o4202a49685j56394h837F2547K7935
$$ -168077 -14631 162445 26165 -23288 252017 187815 -149685 -306079 -8837 62547 90482
16016I0482K559i6111j9417O278F6241B0965h3510K6017l0308o5419M3852C09636
$$ 90482 93041 -96111 -115528 -109250 66241 20965 -83510 -57493 -87801 -153220 -109368 309636
16003D5763b42291b0476l177j25498B3121i5448A48013l6834A3925L25508I8015
$$ 45763 -242291 -20476 -23653 -149151 23121 -95448 148013 111179 13925 339433 98015
15991H0964K2191J03793I2258M92456j5828L10159j18496O09982R8812k43905
$$ 80964 103155 206948 92258 584714 568886 879045 760549 1370531 1469343 1225438
15981A225438E10693J8815j99259P7908b65332K327R1167J9213A73652a20136
$$ 1225438 510693 529508 330249 408157 -265332 -263005 -171838 -152625 173652 -120136
15970a53409B06686a22023B07151N555F9642h6210A19201J3633a8813m9716k56694
$$ -153409 206686 -122023 207151 212706 69642 -86210 119201 132834 -18813 -68529 -325223
15959c25223i0530k69830a17107D23274a76202r8634Q7045j80246O1181J38855
$$ -325223 -90530 -360360 -117107 423274 -176202 -274836 -187791 -368037 -306856 -168001
15949a68001D3840R3710a64242k339I2929J73564A07990O4174c43322a20846G8620
$$ -168001 43840 137550 -164242 -166581 92929 266493 107990 172164 -343322 -120846 78620
15937b7328m225D1621h7393a3609m641l0056k21326B25676l6272D1631f3352B61859
$$ -27328 -31553 41621 -87393 -13609 -18250 -48306 -269632 225676 189404 41631 -63352 261859
15924a08761n8205i484A0220a8350p410m9666A19167r259i444A48335a76378N3767
$$ -108761 -166966 -9484 10220 -18350 -25760 -75426 119167 109908 -9444 148335 -176378 -122611
15912a22611k41228A90102b2730A66780m6247a02668k12508M1477A57835a65266
$$ -122611 -363839 190102 -22730 166780 120533 -102668 -315176 -273699 157835 -165266
15901I3330c05142A39403b01157A2016L9552b30599D01456h1639K4757B07660
$$ 93330 -305142 139403 -201157 12016 51568 -230599 401456 -81639 -56882 207660
15890a65465c1515A04860b114E5004A7257J48193k525f4113k85850J60924B57676
$$ -165465 -31515 104860 -2114 55004 17257 165450 162925 -64113 -349963 -189039 257676
15878i6459j11479J5030b7508A68248a10597D093a82577c8298A40821i5961B8144
$$ -96459 -207938 -192908 -27508 168248 -110597 4093 -182577 -38298 140821 -95961 28144
15866b04748E05947A7175O3491b45053N8460A29731h8120j49232J8161C1159K70902
$$ -204748 505947 17175 80666 -245053 -186593 129731 -88120 -237352 -219191 31159 302061
15855C02061b42989D2740M5430J31075A03722b526m724H5563a7272k86175C82949
$$ 302061 -242989 42740 88170 219245 103722 -2526 -7250 85563 -17272 -303447 382949
15843h7838C6209c32752H5561J20565a57369c2183j16095e622j18816j21162J08886
$$ -87838 36209 -332752 85561 206126 -157369 -32183 -148278 -5622 -124438 -245600 -136714
15832a36714j91516C211b6197A20815m8436B7105K47187h7288C01657a1995j34871
$$ -136714 -328230 3211 -26197 120815 72379 27105 274292 -87288 301657 -11995 -146866
15821a46866g1267A12150B0981c08863H7109b08489N8338L0248N1179F7327e8142
$$ -146866 -71267 112150 20981 -308863 87109 -208489 -150151 -119903 -68724 67327 -58142
15809F5039a05774A80386E7218M5950b20913b1264C77472I7575b12901A96817
$$ 65039 -105774 180386 57218 103168 -220913 -21264 377472 97575 -212901 196817
15798d10931D1097K24636g6073b8096j04703A85954n9738L1445D679b23413A95510
$$ -410931 41097 265733 -76073 -28096 -132799 185954 126216 157661 4679 -223413 195510
15786g5367F0938R5142a44075E410a43406d7066D9365K14773A6318a12043A52473
$$ -75367 60938 156080 -144075 5410 -143406 -47066 49365 264138 16318 -112043 152473
15774H3033C3011L23973A60126J93889f4452l14517e651o4328q8680B39035b3065
$$ 83033 33011 356984 160126 354015 -64452 -378969 -5651 -69979 -158659 239035 -23065
15762A09295a82060A22421J11330f5370n0798k2962A03334b24473G6040J27698
$$ 109295 -182060 122421 233751 -65370 -116168 -139130 103334 -224473 76040 203738
15752B03738B3556a18960M4567L0573C4421J59045G3173J39698k0972a21049B78994
$$ 203738 23556 -118960 -74393 -43820 34421 193466 73173 212871 191899 -121049 278994
15740A31809d1109I4790e0969a7575B57825a48224K1421k4560A23631n5805K40103
$$ 131809 -41109 94790 -50969 -17575 257825 -148224 -126803 -151363 123631 67826 307929
15729C07929j42159G2814b22100Q9328k73796b7308K202n2142n2468E7126c70526
$$ 307929 165770 72814 -222100 -132772 -406568 -27308 -25106 -77248 -129716 57126 -370526
15717g3138r2140L9492m23992E9256j750a48201g3077j57580N8194q6713b6929
$$ -73138 -165278 -125786 -549778 59256 57506 -148201 -73077 -230657 -172463 -259176 -26929
15705B4990b80633l44056h6566M3047l7948E8676N706k2579d3187b453n07015
$$ 24990 -280633 -624689 -86566 -43519 -81467 58676 64382 41803 -43187 -2453 -509468
15694e09468F0477n287b9836B0103Q4659a55113A2980N223c747D7634J76626J70991
$$ -509468 60477 55190 -29836 20103 104762 -155113 12980 18203 -3747 47634 224260 395251
15682C95251a42410a3128n09819d8954H6754Q1621c13422Q5363c5473B51960a35394
$$ 395251 -142410 -13128 -522947 -48954 86754 168375 -313422 -228059 -35473 251960 -135394
15670F4783J33930a20640L6958L5590k29718J21551C7844b20335P7162j98350
$$ 64783 198713 -120640 -83682 -48092 -277810 -156259 37844 -220335 -143173 -341523
15660c41523J57839a2774D03989h8724B26282C4417L3814J45905r5920K9404C8956
$$ -341523 -183684 -12774 403989 -88724 226282 34417 68231 214136 118216 147620 38956
15648a33637I2589b06207A65491b80723J19740N0927M3805c0902A03407g9006
$$ -133637 92589 -206207 165491 -280723 -160983 -110056 -66251 -30902 103407 -79006
15637c06346B54158A944d8181B74484a60215I688a95529Q9124j31058e8045l7680
$$ -306346 254158 1944 -48181 274484 -160215 9688 -195529 -106405 -237463 -58045 -95725
15626i5725p5044A47N9042d37496a58592J9089A14876k6099N4817i6818A59799
$$ -95725 -170769 147 59189 -437496 -158592 -139503 114876 88777 143594 -96818 159799
15614c1084C4028M5740l2359d2803B99005n2032J02121j23534a14525d6155j22908
$$ -31084 34028 79768 47409 -42803 299005 246973 349094 225560 -114525 -46155 -169063
15603a69063O3964D0927a83156A13814h5408A27870K19110G4852A9524J12169
$$ -169063 -105099 40927 -183156 113814 -85408 127870 346980 74852 19524 131693
15593A31693a1054n2636H7243J27318a80199E4264b12708A06336n1051O9196c3318
$$ 131693 -11054 -63690 87243 214561 -180199 54264 -212708 106336 55285 124481 -33318
15581c57255F2906a41640A6834g4773k35514A56822l9125a59214A40122J25093
$$ -357255 62906 -141640 16834 -74773 -310287 156822 117697 -159214 140122 265215
15571B65215j01157c2062j34782B28091a83039C00660D5934J61169j6809k8236
$$ 265215 164058 -32062 -166844 228091 -183039 300660 45934 207103 190294 162058
15561A62058a38673B41107G7382d0057m4891A49909m1148a83136A30015C4696
$$ 162058 -138673 241107 77382 -40057 -84948 149909 108761 -183136 130015 34696
15550D82153a26236B26844b89796J00714O0051A11293P527J56184r2920N8759
$$ 482153 -126236 226844 -289796 -189082 -129031 111293 118820 275004 182084 240843
15540B40843b12411B0292J22415m8774d8246l1602b496j89296K4517j14832n5998
$$ 240843 -212411 20292 142707 93933 -48246 -79848 -2496 -191792 -167275 -282107 -338105
15529c38105L8874h4331j8102B14685e2223B83714a08509N3574D03652A64148
$$ -338105 -299231 -84331 -102433 214685 -52223 283714 -108509 -54935 403652 164148
15518i8820E9646c0327G9658C2181K99183d5646B14887M8544a52639F1652L36507
$$ -98820 59646 -30327 79658 32181 331364 -45646 214887 263431 -152639 61652 398159
15507C98159E9084B2240d4771A16538L6439O1722p5593p587A3115L72769A08008
$$ 398159 59084 22240 -44771 116538 152977 214699 139106 131519 13115 385884 108008
15495A19710J73222J8153n9794B3320J21335K7381a5269o2496A43819e9292C78554
$$ 119710 292932 311085 251291 23320 144655 172036 -15269 -77765 143819 -59292 378554
15483G7804N121e6952A36120o4361k969C3227K81272n1029J24142m8706L60584
$$ 77804 82925 -56952 136120 71759 68790 33227 314499 263470 387612 338906 699490
15472F99490r2201B20084R0797B1996J13537b04484J8009P721E7073M5625m5120
$$ 699490 607289 220084 310881 21996 135533 -204484 -186475 -178754 57073 102698 57578
15461E7578N1355j7512J76030c1690j45478q6908c9869G6683o632b25606G669
$$ 57578 108933 91421 267451 -31690 -177168 -264076 -39869 76683 70051 -225606 7669
15449g7042K9639P5o0124A25005J95905p7018J92071j41493M22560O27932j95252
$$ -77042 -47403 -47328 -107452 125005 320910 243892 435963 294470 717030 1344962 1149710
15438A149710E12081r7590k138A49981B4717L58868a88266O4628B58288K25389
$$ 1149710 512081 414491 412353 149981 24717 383585 -188266 -123638 258288 483677
15428D83677a24497r9269C6311A3526Q25J31547f8621A34955J08330a39242M5684
$$ 483677 -124497 -223766 36311 13526 14351 145898 -68621 134955 243285 -139242 -93558
15417i3558A16328E2446L23262a2510k79536P7197R2148F9256a77434E22719a12230
$$ -93558 116328 52446 375708 -12510 -292046 -214849 -122701 69256 -177434 522719 -112230
15405B0674a12805j60206a6749o7537B1519a49075A50564a19370a0985I6281D5668
$$ 20674 -112805 -273011 -16749 -84286 21519 -149075 150564 -119370 -10985 96281 45668
15393c0353B01386k5612a78662A69563e4738o3o9226j34772A05331j3567f8150
$$ -30353 201386 175774 -178662 169563 -54738 -54801 -124027 -258799 105331 91764 -68150
15381B02070a98511H7274J63325b29705h7872G6692g2922A51293L45896K0259
$$ 202070 -198511 87274 250599 -229705 -87872 76692 -72922 151293 497189 517448
15371E17448j21229A03439M8543a15632D19941a8319m8507k8147A82315a67815
$$ 517448 396219 103439 151982 -115632 419941 -18319 -66826 -94973 182315 -167815
15360B21422Q3576j16453L43110B09715O3882H86M50303j27920i1746C45543H087
$$ 221422 304998 188545 531655 209715 273597 886 451189 323269 -91746 345543 8087
15348a30935A93602A5521b56365A48614L23961j64607J10971B08138J21653k9848
$$ -130935 193602 15521 -256365 148614 472575 307968 418939 208138 329791 299943
15338B99943j03516q0855b9131j79030A82238J54234f4905J7409A12785B9409
$$ 299943 196427 115572 -29131 -208161 182238 336472 -64905 -47496 112785 29409
15327C65664e3989m0210A20835J2633n8727K11428d365l2167C23566l0006E1824
$$ 365664 -53989 -94199 120835 133468 74741 286169 -4365 -36532 323566 293560 51824
15315i1218B82674J9772j4680A8085J90760r7508J73983O5112A21545e2614I8377
$$ -91218 282674 302446 287766 18085 208845 111337 285320 350432 121545 -52614 98377
15303c6611p4083c4111j59893H2231r698A1617K53127K4618a22761n6499A72206
$$ -36611 -110694 -34111 -194004 82231 72533 11617 264744 289362 -122761 -179260 172206
15291C5451B409f0388H7209M7176B8409a2003I0223C8501L91321G9157K752b39145
$$ 35451 2409 -60388 87209 134385 28409 -12003 90223 38501 429822 79157 81909 -239145
15278D039a13736k0661M5832F8886B7487a03862E6478a61991B12074r0467M6233
$$ 4039 -113736 -134397 -88565 68886 27487 -103862 56478 -161991 212074 121607 167840
15267A67840J693c7056p0557D9315h483G2144a0907k59389A7029a15286B64456
$$ 167840 169533 -37056 -107613 49315 -8483 72144 -10907 -270296 17029 -115286 264456
15255C99246A3621K00456a06214D0267o02Q2584c5800D71149b5620k1373o0163
$$ 399246 13621 214077 -106214 40267 39665 122249 -35800 471149 -25620 -46993 -107156
15244a07156B69890P9951R79381K90711n29955O78779o03362B97389D249J98895
$$ -107156 269890 349841 1329222 1619933 1089978 1768757 1165395 297389 4249 203144
15234B03144L42027a60965B50390g7607j88004B62396h4550B0646Q2547d6216
$$ 203144 545171 -160965 250390 -77607 -265611 262396 -84550 20646 103193 -46216
15223d5554B66152C2960h2929J8636a9030k12291g179k00072A92731N0306r0637
$$ -45554 266152 32960 -82929 -64293 -19030 -231321 -7179 -207251 192731 243037 152400
15212A52400o4219L9715b55523C01182A24561o1823a3159A63789a88017q7598
$$ 152400 88181 127896 -255523 301182 124561 62738 -13159 163789 -188017 -275615
15202b75615J3493A07899I447i194A59835F041K3736K04101a00789k07993h3573
$$ -275615 -262122 107899 9447 -9194 159835 6041 29777 233878 -100789 -308782 -83573
15190E10936B01986K16487a00657c2061F1087K00505o0159a4553A08298c3925
$$ 510936 201986 418473 -100657 -32061 61087 261592 201433 -14553 108298 -33925
15179A10191f1120J9884B1238a09425o0193A61463N411E0342O0272M8320N9331
$$ 110191 -61120 -41236 21238 -109425 -169618 161463 166874 50342 110614 158934 218265
15168B18265h454j23821f1440C9377M3753a29584d1024B803K76671k4971g5213
$$ 218265 -8454 -132275 -61440 39377 83130 -129584 -41024 2803 279474 254503 -75213
15156A82999K0867A3981a80672P3623K5217A04857a146B31605Q1403A25391c79983
$$ 182999 203866 13981 -180672 -107049 -81832 104857 -1146 231605 313008 125391 -379983
15144g7198c7678m3309B77647F0057M8435A7491K13737A3584J76551d4544C0381
$$ -77198 -37678 -80987 277647 60057 108492 17491 231228 13584 190135 -44544 30381
15132B37242N7072j05589N7300b6261B13712a74723o7466B27153F6728F655K74501
$$ 237242 294314 188725 246025 -26261 213712 -174723 -242189 227153 66728 6655 281156
15121B81156o7054K68048B33145j2217J11863N5846j75470j2427q724H3030b7820
$$ 281156 214102 482150 233145 220928 332791 388637 213167 200740 192016 83030 -27820
15109E5430f4908A31269J46611A17074J24616j11045O5226i4129B04280g4161
$$ 55430 -64908 131269 277880 117074 241690 130645 195871 -94129 204280 -74161
15098b5240A87359a62101A04226J78937p8551A02082O3354g6891e702k65769E2725
$$ -25240 187359 -162101 104226 283163 204612 102082 165436 -76891 -5702 -271471 52725
15086A94362A7715J08665b5549A54065C4994g7914D2982J23807H2751P3404E0486
$$ 194362 17715 126380 -25549 154065 34994 -77914 42982 166789 82751 156155 50486
15074d9590A89954A913L31006g0658C11848a91333A03760e0988F4191J281b4745
$$ -49590 189954 1913 332919 -70658 311848 -191333 103760 -50988 64191 65472 -24745
15062C36742j64004M0073M783f5701D00990M3903j76703Q43H8838J23801K2817
$$ 336742 172738 212811 217594 -65701 400990 444893 268190 269033 88838 212639 235456
15051B35456m9264J5944n7977K11296D368N39699j61086K17417k61389K03342
$$ 235456 186192 202136 144159 355455 4368 544067 382981 600398 339009 542351
15041E42351A60695o9958L01639H3605c6908C03349m4548o0081K34690j28824
$$ 542351 160695 90737 392376 83605 -36908 303349 258801 198720 433410 304586
15031C04586J60875P4975K8067K64279k42870L4499G4486Q7228L02015m786M9756
$$ 304586 465461 540436 568503 832782 589912 624411 74486 161714 463729 458943 508699
15020E08699K95066m00890p2696o1440A02290l8501J98163m4537p2770N2659J46295
$$ 508699 803765 402875 330179 268739 102290 63789 261952 217415 144645 197304 343599
15009C43599L932A69573J84972K1673A52350k7819L38308C9697J68195G5686M13030
$$ 343599 347531 169573 354545 376218 152350 124531 462839 39697 207892 75686 488716
14998D88716N1297o1445E0794M80131j13280A39094M8787K37790B03801K79154
$$ 488716 540013 478568 50794 530925 417645 139094 187881 425671 203801 482955
14988D82955j26346r0543L08362k21770J84552n2194K00541M72718n63516k29062
$$ 482955 356609 266066 574428 352658 537210 485016 685557 1158275 594759 365697
14978C65697K49157k3236L5241B88803J66672A61143K27813J45432k55080L52896
$$ 365697 614854 591618 626859 288803 455475 161143 388956 534388 279308 632204
14968F32204B31914J66865j78568L431Q8931o0874O1985j0505A34489M64209L0437
$$ 632204 231914 398779 220211 223642 312573 251699 313684 303179 134489 598698 629135
14957F29135k45938l0175j18969J20192J6750A23448K43976j52042c1748C75187
$$ 629135 383197 353022 234053 354245 370995 123448 367424 215382 -31748 375187
14946B00149J44922p2282j5431K39522J00339N5288j95744B17106R3709J13849
$$ 200149 345071 272789 257358 496880 597219 652507 456763 217106 310815 424664
14936D24664A95607K6302M87450j74206n9220L27257N53945m82752n1796J62994
$$ 424664 195607 221909 709359 535153 475933 803190 1357135 874383 822587 985581
14926I85581L89288j69453K14569l9917l45937M7806M29698m67077P20132L02817
$$ 985581 1374869 1205416 1419985 1380068 1034131 1081937 1511635 1044558 1764690 2067507
14916B067507J02331m17756k45524j35952m32329j03242q2221o091A95228K28831
$$ 2067507 2169838 1752082 1506558 1370606 938277 835035 752814 746723 195228 424059
14906D24059K8128A49794L09360j08426K49277k50085j51176K57391A91036O3064
$$ 424059 452187 149794 459154 350728 600005 349920 198744 456135 191036 254100
14896B54100H2228N7357J80651J83797p9508q9903J46843j66483K0948L49426
$$ 254100 82228 139585 320236 504033 424525 334622 481465 314982 335930 685356
14886F85356o8611n8886k38983N83164K4371l1067m32748M82398j44922J148k67801
$$ 685356 616745 557859 318876 902040 926411 895344 462596 944994 800072 801220 533419
14875E33419k37937K03003E5864N95501A55279J28706l9732K27977m673j50750
$$ 533419 295482 498485 55864 651365 155279 283985 244253 472230 467557 316807
14865C16807L43564L03431l80012k58978o1618J38236j85930L94939A08244b5857
$$ 316807 660371 963802 583790 324812 263194 401430 215500 610439 108244 -25857
14854A03485K48643P8341K8069j05388j19853I1036P3613J18635J43209N56637
$$ 103485 352128 430469 458538 353150 233297 91036 164649 283284 426493 983130
14844I83130l04899N5537J17016L06572n57466J19543r1653J94137M6039j00527
$$ 983130 678231 733768 850784 1157356 599890 719433 627780 821917 867956 767429
14834G67429j21788j05788m862M7620m3578j18267K04310B06198K50152L56103
$$ 767429 645641 539853 534991 582611 539033 420766 625076 206198 456350 812453
14824H12453J22833l53449p1157K573O6169J35397N9893r2599M4392P9734l02776
$$ 812453 935286 581837 510680 513253 579422 714819 774712 682113 726505 806239 503463
14813E03463K02420a4315G70361C80998j0022M25569k51018K46796K90451k37482
$$ 503463 705883 -14315 770361 380998 370976 796545 545527 792323 1082774 845292
14803H45292O622n7014k35390j64067n198R8178j75827J97114k50327J23194N1254
$$ 845292 851914 794900 559510 395443 390245 488423 312596 509710 259383 382577 433831
14792D33831K41319k80554k7866Q8055N5304o2187r308J54455J03351k2932k86698
$$ 433831 675150 394596 366730 454785 510089 447902 438594 593049 696400 673468 386770
14781C86770A50882L33214Q6366k45062P91791l93310J44608k28200L87463E04004
$$ 386770 150882 484096 570462 325400 1117191 723881 868489 640289 1027752 504004
14770F53877C02673M46799k95913P4938J65348l35487j50241L17605K1030B63798
$$ 653877 302673 749472 453559 528497 693845 358358 208117 525722 546752 263798
14759F59928J9231P7744k74818K77188j90815q8466J87716j62337j20742r1465
$$ 659928 679159 756903 482085 759273 568458 479992 667708 505371 384629 293164
14749B93164L02782n7104j9563K16785C29951K52184k32646L99818l43350K98642
$$ 293164 595946 538842 519279 736064 329951 582135 349489 749307 405957 704599
14739G04599J50255j61600k165k4110j21256J82705K53738k16271j92136O47824
$$ 704599 854854 693254 691089 666979 545723 728428 982166 765895 573759 1221583
14729A221583k3285K51538M26727k57665k26216l41418l42003l9955j37696J71472
$$ 1221583 1198298 1449836 1876563 1618898 1392682 1051264 709261 669306 531610 703082
14719G03082j33046J41262J23831J03498k04126j66429K16104j53388M1384L72289
$$ 703082 570036 711298 835129 938627 734501 568072 784176 630788 672172 1044461
14709A044461l82693L57839l15714Q6578m9646L28945r5563L73827k8289L21461
$$ 1044461 661768 1019607 703893 790471 740825 1069770 974207 1348034 1319745 1641206
14699A641206n23784J24536k16039k21551n2478L6937l80760N19648j12778l8258
$$ 1641206 1117422 1241958 1025919 804368 751890 788827 408067 927715 814937 776679
14689G76679k40912L02331n6964p7827j015o8637J50724J42422j65109j70875
$$ 776679 535767 838098 781134 703307 702292 633655 784379 926801 761692 590817
14679E90817K44692K14124j52915J76786k32726k24788K36524j03381m809j8685
$$ 590817 835509 1049633 896718 1073504 840778 615990 852514 749133 744324 725639
14669G25639j81239J67302j15611L31835n1021J06780l16281J07645N3678j53530
$$ 725639 544400 711702 596091 927926 876905 983685 667404 775049 828727 675197
14659F75197n2631K22189L9588q7225l9596L56908J17394Q1883L0289j61338l24142
$$ 675197 622566 844755 884343 797118 757522 1114430 1231824 1313707 1343996 1182658 858516
14648H58516K03158l3431j31295R9315J70638o0589k24233l678M06789m01675
$$ 858516 1061674 1028243 896948 996263 1166901 1106312 882079 878401 1285190 883515
14638H83515j2021J4331Q0768K24666j82798p8528k55600K56699L35938l10195
$$ 883515 871494 885825 966593 1191259 1008461 929933 674333 931032 1266970 956775
14628I56775K15374m44721K29968J85343k18290K38967j56955K89840J11053j29260
$$ 956775 1172149 727428 957396 1142739 924449 1163416 1006461 1296301 1407354 1278094
14618A278094l63302J73745K73821j94264R490k42075L09789K7288M4827j41616
$$ 1278094 914792 1088537 1362358 1168094 1177584 935509 1245298 1272586 1317413 1175797
14608A175797j32182L58994j19203J75370m07268J92158K46833m27447K06871
$$ 1175797 1043615 1402609 1283406 1458776 1051508 1243666 1490499 1063052 1269923
14599A269923K6862L54306m88361k37962L57838K26582p5348j28727J54283n140
$$ 1269923 1296785 1651091 1162730 924768 1282606 1509188 1433840 1305113 1459396 1454256
14589A454256j8357J24217k66527N9448J29035k22048L771K85110j6025J27061
$$ 1454256 1435899 1560116 1293589 1353037 1482072 1260024 1263795 1548905 1532880 1659941
14579A659941J76819j33276k91510l9466J5352K01615k99410O21673k52560n0377
$$ 1659941 1836760 1703484 1411974 1372508 1387860 1589475 1290065 1911738 1659178 1608801
14569A608801K13024j00717M10299k46464L9591o4595L4121L2441Q2434m2037
$$ 1608801 1821825 1721108 2131407 1884943 1924534 1859939 1894060 1926501 2008935 1966898
14559A966898k4405K14517J48745J88963m24602P44766j92775P93020q123P82046
$$ 1966898 1942493 2157010 2305755 2494718 2070116 2814882 2622107 3415127 3407004 4189050
14549D189050J895679L053986Q075428K0809922J3051979A6493379D634100k188443
$$ 4189050 6084729 9138715 17214143 38024065 51076044 16493379 4634100 2445657
14541B445657m57238P7712K30986P28329K265034k527605j302520L03098j33440
$$ 2445657 1988419 2066131 2297117 3025446 5290480 2762875 1460355 1763453 1630013
14532A630013n51157Q52288l11015j7438K28655J12311k88075K04322R3764m1628
$$ 1630013 1078856 1931144 1620129 1602691 1831346 1943657 1655582 1859904 1953668 1912040
14522A912040j14454j19204L95338J99435l15271m5566J1560J41559M1601k1526
$$ 1912040 1797586 1678382 2073720 2273155 1957884 1912318 1923878 2065437 2107038 2085512
14512B085512J84425R0020j02310o7540J1291J53234J77312k26571J49472p1193
$$ 2085512 2269937 2359957 2257647 2190107 2201398 2354632 2531944 2305373 2454845 2383652
14502B383652n2962P3249J28733l4960Q7395J0613O6498M5871m67562K51191l1090
$$ 2383652 2330690 2403939 2532672 2497712 2585107 2595720 2662218 2708089 2240527 2491718 2460628
14491B460628L74314J64447O3365j51621j35133K98073l44456M31070l52887Q2609
$$ 2460628 2834942 2999389 3062754 2911133 2776000 3074073 2729617 3160687 2807800 2890409
14481B890409K43498J61937O913J68800P0053j29877j19450O563L69389k47330
$$ 2890409 3133907 3295844 3302757 3471557 3541610 3411733 3292283 3298846 3668235 3420905
14471C420905K2704k8079K76780n6309J29983P1460j63979j81345K87979j7529
$$ 3420905 3443609 3415530 3692310 3636001 3765984 3837444 3673465 3492120 3780099 3762570
14461C762570K66975J97209o03824O31205r4679J38609k04066n1040K57914R2776
$$ 3762570 4029545 4226754 3622930 4254135 4159456 4298065 4093999 4042959 4300873 4393649
14451D393649m74248J57168K57283K25563n7673j3065n0029J36965K57860J84694
$$ 4393649 3919401 4076569 4333852 4559415 4501742 4488677 4438648 4575613 4833473 5018167
14441E018167n23307p8794M83831K65854k44149K96841J28644L1675J08392R8545
$$ 5018167 4494860 4416066 4899897 5165751 4921602 5218443 5347087 5378762 5487154 5585699
14431E585699q8262r8991K55187Q27K08995K79322j47200L57750m745K19450K46612
$$ 5585699 5497437 5398446 5653633 5654460 5863455 6142777 5995577 6353327 6348582 6568032 6814644
14420F814644N2840J76329L4487l13912O36811m73199J59780J5535l53804R79088
$$ 6814644 6867484 7043813 7078300 6764388 7401199 6928000 7087780 7103315 6749511 7728599
14410G728599n8805l3333n5442P14520m0849L98748M5011j59446L2552K4809K48556
$$ 7728599 7669794 7636461 7581019 8295539 8254690 8653438 8698449 8539003 8571555 8596364 8844920
14399H844920n9681M91611k03108L32909o4420K00751J82556L10411r1616L44953
$$ 8844920 8785239 9276850 9073742 9406651 9342231 9542982 9725538 10035949 9944333 10289286
14389A0289286j98806L51938M79132J33673n430N84453M9088L02692J98340K20157
$$ 10289286 10090480 10442418 10921550 11055223 11049793 11634246 11683334 11986026 12184366 12404523
14379A2404523L94127j45840K35193L98177L5543O50116L7097P7376M80745L22812
$$ 12404523 12798650 12652810 12888003 13286180 13321723 13971839 14008936 14086312 14567057 14889869
14369A4889869N2544N05704L37196O41451K6974L01923k7757O72460N87513j4097
$$ 14889869 14942413 15448117 15785313 16426764 16453738 16755661 16727904 17400364 17987877 17973780
14359A7973780M34495N55222M04241K50339N27891O09211O47743K88548K10458
$$ 17973780 18408275 18963497 19367738 19618077 20145968 20755179 21402922 21691470 21901928
14350B1901928O65458M46398J112377K72046N66436P33052N10536Q93657N00542
$$ 21901928 22567386 23013784 24126161 24398207 24964643 25697695 26208231 27101888 27602430
14341B7602430Q44443P45775Q67631J060586P77746P78607J259532J041486Q70823
$$ 27602430 28446873 29192648 30060279 31120865 31898611 32677218 33936750 34978236 35849059
14332C5849059J018896J381976Q06269J558575J175446J605880J356264J451228
$$ 35849059 36867955 38249931 39056200 40614775 41790221 43396101 44752365 46203593
14324D6203593J676280J924310J555439J738520J609104K436854K187332J733968
$$ 46203593 47879873 49804183 51359622 53098142 54707246 57144100 59331432 61065400
14316F1065400K463328K287450K398909K884615K930233L088088K966859L409013
$$ 61065400 63528728 65816178 68215087 71099702 74029935 77118023 80084882 83493895
14308H3493895M088374L879293L856625M612563M472083N124737N486028N434986
$$ 83493895 87582269 91461562 95318187 99930750 104402833 109527570 115013598 120448584
14300A20448584N792252O492165O713687P496314P746814Q262654R120856R379044
$$ 120448584 126240836 132733001 139446688 146943002 154689816 162952470 172073326 181452370
14292A81452370J0248715J0521588J1452312J2160135J2602653J3933083J3836408
$$ 181452370 191701085 202222673 213674985 225835120 238437773 252370856 266207264
14285B66207264J4957233J5418853J5799362J6638017J6388690J6969887J6159842
$$ 266207264 281164497 296583350 312382712 329020729 345409419 362379306 378539148
14278C78539148J6487279J5328254J4400530J2752555J0768223N403014K654982
$$ 378539148 395026427 410354681 424755211 437507766 448275989 453679003 456333985
14271D56333985J247308O16628R48263j186594l477981q234326j0959358j1890416
$$ 456333985 457581293 458197921 459146184 457959590 454481609 446247283 435287925 423397509
14263D23397509j4353863j5268258j6072531j6907803j6775513j6730054j6694196
$$ 423397509 409043646 393775388 377702857 360795054 344019541 327289487 310595291
14256C10595291j5822856j5275816j5211306j3840647j3577191j2834453j2433779
$$ 310595291 294772435 279496619 264285313 250444666 236867475 224033022 211599243
14249B11599243j1144098r267712r525725r839810r010865p786778p946171p492796
$$ 211599243 200455145 191187433 181661708 171821898 162811033 155024255 147078084 139585288
14241A39585288o709958o550978n931686n366001n227052n327175m730397m544336
$$ 139585288 132875330 126324352 120392666 115026665 109799613 104472438 99742041 95197705
14233I5197705l861621l882060l119019m028757l261645l151356k511145k865556
$$ 95197705 91336084 87454024 84335005 80306248 77044603 73893247 71382102 68516546
14225F8516546k881015k687818k209969k134187k015380k217682j456812k088332
$$ 68516546 65635531 62947713 60737744 58603557 56588177 54370495 52913683 50825351
14217E0825351j868316j604408j379218j103188r56709j641983j422998j559528
$$ 50825351 48957035 47352627 45973409 44870221 43913512 42271529 40848531 39289003
14209C9289003j266975r14980k34981j162443j401656j091319r18335r10769r21339
$$ 39289003 38022028 37107048 36872067 35709624 34307968 33216649 32298314 31387545 30466206
14200C0466206Q8801j286173j147544r49739k41248o41771q88267k84029r10548
$$ 30466206 30555007 29268834 28121290 27171551 26930303 26288532 25400265 25116236 24205688
14191B4205688m19167p16489n45941n93580r1959j019564l13480m27501m45757
$$ 24205688 23786521 23070032 22524091 21930511 21838552 20818988 20505508 20078007 19632250
14182A9632250l40835o01169k18533m58133n08100l37680m24884m66399l67518
$$ 19632250 19291415 18690246 18471713 18013580 17505480 17167800 16742916 16276517 15908999
14173A5908999k98637k59109l70371j56497j87987o18238P0767k34734l69979
$$ 15908999 15610362 15351253 14980882 14824385 14636398 14018160 14088927 13854193 13484214
14164A3484214m63448J35182n97167k1219n12524L74249n06699j88135l96453
$$ 13484214 13020766 13155948 12558781 12537562 12025038 12399287 11892588 11704453 11308000
14155A1308000N168m19050n8239m775k21364m81064K82498j73233k17851l73038
$$ 11308000 11313168 10894118 10835879 10831104 10609740 10128676 10411174 10237941 10020090 9647052
14145I647052q6349k40464K68133k79685l12404K39371m92801n6554l95850J4265
$$ 9647052 9560703 9320239 9588372 9308687 8996283 9235654 8742853 8686299 8290449 8304714
14135H304714J14542n42187L40632j50149l97381J15638M08132r64426O3757j11526
$$ 8304714 8419256 7877069 8217701 8067552 7670171 7785809 8193941 7229515 7293272 7181746
14125G181746j68161J92630j29806j48857l38733M03258m88075p7464J11653p0834
$$ 7181746 7013585 7206215 7076409 6927552 6588819 6992077 6504002 6426538 6538191 6467357
14115F467357J12493j68909p58060O53328n04984L91828n35990j73469N29666
$$ 6467357 6579850 6410941 5652881 6306209 5801225 6193053 5657063 5483594 6013260
14106F013260n83281L79105m72401m7668J63966K2680j27565m97608R5548N5105
$$ 6013260 5429979 5809084 5336683 5289015 5452981 5475661 5348096 4850488 4946036 5001141
14096E001141j12887K54723m55798N3188P3397j20934J24928j62882l77787K11951
$$ 5001141 4888254 5142977 4687179 4740367 4813764 4692830 4817758 4654876 4277089 4489040
14086D489040O8450m14744L46672P8508k27072l25052J31690K9945j8669j44300
$$ 4489040 4557490 4142746 4489418 4567926 4340854 4015802 4147492 4177437 4158768 4014468
14076D014468J05416j45545q6990M7076j29183J14459l33631l73654M86551k50508
$$ 4014468 4119884 3974339 3887349 3934425 3805242 3919701 3586070 3212416 3698967 3448459
14066C448459L37417m43419O78431l05761k9189R9663l80386M35980j89346j93293
$$ 3448459 3785876 3342457 4020888 3715127 3685938 3785601 3405215 3841195 3651849 3458556
14056C458556K04223n51376J69385R3305q8230O6998k87297j07477J03876m5421
$$ 3458556 3662779 3111403 3280788 3374093 3285863 3352861 3065564 2958087 3061963 3016542
14046C016542J77764m01234L09882l38489j4528o683n0632j4209K8536K40604
$$ 3016542 3194306 2793072 3102954 2764465 2749937 2743254 2692622 2678413 2706949 2947553
14036B947553j52680l21094k1208M86925k37344k01434K98070p5737k75849j66789
$$ 2947553 2794873 2473779 2452571 2939496 2702152 2500718 2798788 2723051 2447202 2280413
14026B280413M6147L09325k02640L36768l98758J76571j74870Q464K58471l75709
$$ 2280413 2326560 2635885 2433245 2770013 2371255 2547826 2372956 2381420 2639891 2264182
14016B264182M15l47179R7575M27494M9715n91473K47420n4656l2446j0571j04394
$$ 2264182 2264597 1917418 2014993 2442487 2492202 1900729 2148149 2093493 2061047 2050476 1946082
14005A946082m9557L48406n17989K36254j11612J295j60729M1289K19117r3952
$$ 1946082 1896525 2244931 1726942 1963196 1851584 1852879 1692150 1733439 1952556 1858604
13995A858604o593k98468o6610O5260L29730L9834R03502J920945N924207J7870797
$$ 1858604 1852011 1553543 1486933 1552193 1881923 1921757 2825259 4746204 10670411 28541208
13985B8541208K6324713B5025228A0372185m471968j370935p70467k04539p26736
$$ 28541208 54865921 25025228 10372185 5900217 4529282 3758815 3554276 2827540
13977B827540J68131k45900k33503J4534k60402K21713j43963k84087J56205r2703
$$ 2827540 2995671 2749771 2516268 2530802 2270400 2492113 2348150 2064063 2220268 2127565
13967B127565p8490j27851L54706k89273j91704N34991n81895K46841Q9233l39204
$$ 2127565 2049075 1921224 2275930 1986657 1794953 2329944 1748049 1994890 2084123 1744919
13957A744919j31181N27539j49145j80558k09644M55795m27125l5510J05311j69807
$$ 1744919 1613738 2141277 1992132 1811574 1601930 2057725 1630600 1595090 1700401 1530594
13947A530594K65119k80167K1207n6017J37156p4311J66964J23726l28984l04016
$$ 1530594 1795713 1515546 1536753 1480736 1617892 1543581 1710545 1834271 1505287 1201271
13937A201271J59590j31740K33077K2734r9149K95930J41603m90883J86647j30655
$$ 1201271 1360861 1229121 1462198 1484932 1385783 1681713 1823316 1332433 1519080 1388425
13927A388425K78506k53962O7448r7697j40804J12285J69289o2047m67240K81842
$$ 1388425 1666931 1412969 1480417 1382720 1241916 1354201 1523490 1461443 994203 1276045
13917A276045j00257J09546j203p1303o1488k4957K71640P3752j57001J34835
$$ 1276045 1175788 1285334 1284131 1212828 1151340 1126383 1398023 1471775 1314774 1449609
13907A449609j87587R1431l47994J56697m9192j96721M41580O4433j64041j67470
$$ 1449609 1262022 1353453 1005459 1162156 1112964 916243 1357823 1422256 1258215 1090745
13897A090745K05176r7791k58101O54654o05965J93420J22239m5533q0656K11176
$$ 1090745 1295921 1198130 940029 1594683 988718 1182138 1304377 1258844 1178188 1389364
13887A389364l59530k4599Q5340m6008q5532K57318r6808j53615P7817M2613C75280
$$ 1389364 1029834 1005235 1090575 1044567 959035 1216353 1119545 965930 1043747 1086360 375280
13875A106844l96683K73769j12419j18943J66821Q6876j03266P5532k89979K7588
$$ 1106844 710161 983930 871511 752568 919389 1006265 902999 978531 688552 716140
13865G16140K75247k15144K26860P7353o7060o9282J17695j75946K07622j20367
$$ 716140 991387 776243 1003103 1080456 1013396 944114 1061809 885863 1093485 973118
13855I73118P5931J00096j94601J01243j5350k21100J94021J39131j04451l36551
$$ 973118 1049049 1149145 954544 1055787 1040437 819337 1013358 1152489 1048038 711487
13845G11487J84408Q8071k43440J82279l01743j3115J43531J70347p3629k25857
$$ 711487 895895 983966 740526 922805 621062 607947 751478 921825 848196 622339
13835F22339L37852k53991O8377j6935j28819Q0149N6222p2446L03653j51558
$$ 622339 960191 706200 774577 757642 628823 708972 765194 692748 996401 844843
13825H44843j43147K84029j07436k26259J16517j05370J60734j19295C15894K55820
$$ 844843 701696 985725 878289 652030 768547 663177 823911 704616 315894 571714
13815E71714K88365k13432K48142l76860L68331k05912J08712j49479J24057j56862
$$ 571714 860079 646647 894789 517929 886260 680348 789060 639581 763638 606776
13805F06776Q614L11585k25441K33953k31438j8254J22616j18073j80854K25080
$$ 606776 615390 926975 701534 935487 704049 685795 808411 690338 509484 734564
13795G34564j44659J03546J62651k87152J15674P7957j77905P9375m3585r8748
$$ 734564 589905 693451 856102 568950 684624 762581 584676 664051 620466 521718
13785E21718k6629l6778L89274q8442k34126J58242j44916L47997l61479K14671
$$ 521718 495089 458311 847585 759143 525017 683259 538343 886340 524861 739532
13775G39532j17568j32476J0286N33357B99838K70292J74494l68503L28035k69357
$$ 739532 621964 489488 499774 1033131 299838 570130 744624 376121 704156 434799
13765D34799p7811J03194J46717B33449L44890j3495J32046l22767K34118K63998
$$ 434799 356988 460182 606899 233449 578339 564844 696890 374123 608241 872239
13755H72239k97722q0276L30177j19125k4185M0518l29388L78106J14696C47532
$$ 872239 574517 494241 824418 705293 681108 721626 392238 770344 885040 347532
13744B41549J93545J00192j73844j6249R8889K6345j67020K74865r5285o7342
$$ 241549 435094 535286 361442 345193 444082 470427 303407 578272 482987 415645
13734D15645K55183K3716B89091j06210L50760j4310O5746j2646B48477K04887
$$ 415645 670828 694544 289091 182881 533641 519331 585077 572431 248477 453364
13724D53364J93030o2639j64882K9790L79547l41989R4861j09653k19887K43448
$$ 453364 646394 583755 418873 448663 828210 486221 581082 471429 251542 494990
13714D94990K7977O5041k34924J14956k1296r5469K31347k24212K99485B87126
$$ 494990 522967 588008 353084 468040 446744 351275 582622 358410 657895 287126
13703F87884l23333l9660O5069J14534P3665A64259J27402J03428K15316N1482
$$ 687884 364551 324891 389960 504494 578159 164259 291661 395089 610405 661887
13693F61887j48311J67762m8153j83506k03559K7782J58920j08580J03483j96669
$$ 661887 513576 681338 633185 449679 246120 273902 432822 324242 427725 231056
13683B31056K03137j14547J96470j21299Q6883j25003L98844C29614K35558j51218
$$ 231056 434193 319646 516116 394817 481700 356697 755541 329614 565172 413954
13673D13954L43332l15010L8669A83161L20805A66402O1671J09447P3118A70179
$$ 413954 757286 442276 480945 183161 503966 166402 228073 337520 410638 170179
13662C63666j04783J5764J53452P553k07683L67822q9280j05038A29938K81481
$$ 363666 258883 274647 428099 435652 227969 595791 506511 401473 129938 411419
13652D11419j14464L05990B48286K20884j12555N0718I4015N50774j61432A48694
$$ 411419 296955 602945 248286 469170 356615 407333 94015 644789 483357 148694
13641C37526J49340J37343k23641J41489H5018J1410d4668B64418K32610q2431
$$ 337526 486866 624209 400568 542057 85018 96428 -44668 264418 497028 414597
13631D14597j84932Q8889j292A45481K87255j02752M2127B0944K67395p9496Q9864
$$ 414597 229665 318554 317262 145481 432736 329984 372111 20944 288339 208843 298707
13620B98707J52405l0632J42644r9084A44956K81102j14360M5790A47147l26n747
$$ 298707 451112 420480 563124 464040 144956 426058 311698 357488 147147 146821 141074
13609A41074K32102A68737N4546j4147d7977B14875C1802K97578p1512M35482
$$ 141074 373176 168737 223283 209136 -47977 214875 31802 329380 257868 693350
13599F93350l41896A39716K7957N5479q2685a24103C28254l2622N5557J59956
$$ 693350 351454 139716 167673 223152 140467 -124103 328254 295632 351189 511145
13589E11145k19672j36773K8689f2854D97270k29779K7868p4097A7863K81919
$$ 511145 291473 154700 183389 -62854 497270 267491 295359 221262 17863 299782
13579B99782J46000k07500M5992N3052q7356j20724j2231K31871j0310J26771
$$ 299782 445782 238282 284274 337326 249970 129246 117015 348886 338576 465347
13569D65347A29534H612K63783e0361B03072J26514H1724f63A46517n4878K84390
$$ 465347 129534 8612 272395 -50361 203072 329586 81724 -663 146517 91639 376029
13558C76029L57006B83577i518C63483A52591N4956m9309K44430A32518O9419
$$ 376029 733035 283577 -9518 363483 152591 207547 158238 402668 132518 201937
13548B01937J81585j03759r4205m3279m9937L8759K63578m116A42447h1338K9539
$$ 201937 383522 279763 185558 142279 92342 131101 394679 390563 142447 -81338 -51799
13537e1799D56333B1178R6874C5795J56694K33004j78213K59506K9156A26600
$$ -51799 456333 21178 118052 35795 192489 425493 247280 506786 535942 126600
13526B75714K5266j40550L4588K25983F9386M03009j37372O9841j26520m4751
$$ 275714 300980 160430 195018 421001 69386 472395 335023 404864 278344 233593
13516B33593j9979d9297A90364n7158Q1385A04876N3750K02755a923o8815C30708
$$ 233593 213614 -49297 190364 133206 214591 104876 158626 361381 -1923 -70738 330708
13504D0618N10465B23309a52266A72479J31188g238F85039B46482J68075E446
$$ 40618 551083 223309 -152266 172479 303667 -7238 685039 246482 414557 5446
13493A30357J25346A14525R3989J73323A24979L44749k03070Q164d1229m0711
$$ 130357 255703 114525 208514 381837 124979 469728 266658 274822 -41229 -81940
13483h1940B77257a26719D03684a71191A22554L18903j16835A26147R4189m3273
$$ -81940 277257 -126719 403684 -171191 122554 441457 324622 126147 220336 177063
13473A77063J49029A42971L4369K09311A1708M31680a3704B54906m5050M6985
$$ 177063 326092 142971 177340 386651 11708 443388 -13704 254906 209856 256841
13463B56841o9147e718C834K50818m988j22135M31334B26266G0440L70385A07394
$$ 256841 187694 -5718 3834 254652 249664 127529 558863 226266 70440 440825 107394
13451h9700n4594a2427I4747J15386k2108H5388J53377b12955B00351K25421A27585
$$ -89700 -144294 -12427 94747 210133 188025 85388 238765 -212955 200351 425772 127585
13439C95684o8272m4807R44D357K28749o46R4991A27065J8708M0006A1077J21586
$$ 395684 327412 282605 283549 4357 233106 232460 327451 127065 145773 185779 11077 132663
13427A32663J74388e5510C44540g9939j01810B7400J16785N1210K5596h999B99082
$$ 132663 307051 -55510 344540 -79939 -181749 27400 144185 195395 220991 -8999 299082
13415D99958e0292n9698C31850m4916B7450L3568J47326r2909f9096A37539J04549
$$ 499958 -50292 -109990 331850 286934 27450 61018 208344 115435 -69096 137539 242088
13404B42088N1863I2767R6774O7G3075a79162A78149K45664j75035q6994l4212
$$ 242088 293951 92767 189541 189608 73075 -179162 178149 423813 248778 161784 127572
13393A27572h5930B85694d0569C12782J4095r1111E0039K18792j25852D1584j6791
$$ 127572 -85930 285694 -40569 312782 326877 235766 50039 268831 142979 41584 24793
13382B4793K00701a19656B07415I9976k3485C6428g9558A32260J45036M7905J05402
$$ 24793 225494 -119656 207415 99976 76491 36428 -79558 132260 277296 325201 430603
13371D30603b5296A66329O5448G1460M20307B25625K5087O3001O5698E9906K40664
$$ 430603 -25296 166329 231777 71460 491767 225625 250712 313713 379411 59906 300570
13360C00570L036H5219J69549g1782C65694j81104p5322K71796j87300D1370K14354
$$ 300570 303606 85219 254768 -71782 365694 184590 109268 381064 193764 41370 255724
13349B55724G1109J3357f2617A89802J66339j16254l82J26062K01440B63362K64596
$$ 255724 71109 84466 -62617 189802 356141 239887 239505 365567 567007 263362 527958
13338E27958G6906K67631j00034J31895H6910b6989E33000j81029A69534L8442
$$ 527958 76906 344537 244503 376398 86910 -26989 533000 351971 169534 207976
13328B07976K25027B9248K25125J40827I8266P1097N8552P4489C1671K42708h844
$$ 207976 433003 29248 254373 395200 98266 169363 227915 302404 31671 274379 -8844
13316d1066B77409K5081H786L74106q2410H5752J40985o4819n4442B2986J56972
$$ -41066 277409 302490 8786 382892 300482 85752 226737 161918 107476 22986 179958
13305A79958j1708J53381j5934n4194a8106A19106l2376l7561K40742j7581g221
$$ 179958 168250 321631 305697 251503 -18106 119106 86730 49169 289911 272330 -7221
13293A75623G4159J99542C7435M72696k39444o5144e3457o0976A48534a12666
$$ 175623 74159 273701 37435 510131 270687 205543 -53457 -114433 148534 -112666
13282B8661A1890K51204G7112N9765R9468J05274A07113J12452K328Q139o5733
$$ 28661 11890 263094 77112 136877 236345 341619 107113 219565 221893 230032 164299
13271A64299A5209a19738B96256A5155o537O2309h7289i664C04112J26832A56281
$$ 164299 15209 -119738 296256 15155 8618 70927 -87289 -9664 304112 430944 156281
13259B91840e0469B85826n1089a17522I5101b41509I9474H025R5264l4003P9441
$$ 291840 -50469 285826 234737 -117522 95101 -241509 99474 8025 103289 69286 148727
13248A48727a79130d7998A62440C2144G174K87391A08987M6708F6531O8114a72370
$$ 148727 -179130 -47998 162440 32144 7174 294565 108987 155695 66531 134645 -172370
13236B17731a2811M103q9571B02078Q836R7907a11669A33249B7893P688J14699
$$ 217731 -12811 -8708 -98279 202078 210914 308821 -111669 133249 27893 35581 150280
13225A50280n0295J95518j13175q7688k6148O9333L434J5489M5386f6944B31485
$$ 150280 99985 295503 182328 94640 68492 137825 141259 156748 202134 -66944 231485
13213B86996R4877J26635A16772M7795L5965e6482A04412a64517e2942B36225
$$ 286996 381873 508508 116772 164567 200532 -56482 104412 -164517 -52942 236225
13202B675O0817c1000e109C99140a654o1632l44596E1536j1386j9525b6109D49405
$$ 2675 63492 -31000 -5109 399140 -1654 -63286 -407882 51536 40150 20625 -26109 449405
13189A39959G999J38319a83098A40794b24983C69666a97292A53049C0376a33743
$$ 139959 7999 146318 -183098 140794 -224983 369666 -197292 153049 30376 -133743
13178a01684A01222J96894a65752B4165L66513b89980a25340C8544g3774D21149
$$ -101684 101222 298116 -165752 24165 390678 -289980 -125340 38544 -73774 421149
13167c8504G5951a98043F2812J42794D9898e3594A23798a95617B15973L6823A4788
$$ -38504 75951 -198043 62812 205606 49898 -53594 123798 -195617 215973 252796 14788
13155d6922C91577b67790J29322C179K13268J43634d64791d0454m6749A548b63488
$$ -46922 391577 -267790 -138468 3179 216447 360081 -464791 -40454 -87203 1548 -263488
13143d0036C22376D1686i6873l1866j0078B2748a83647B48446r3125E803N2439
$$ -40036 322376 41686 -96873 -128739 -138817 22748 -183647 248446 155321 5803 58242
13132E8242J61060R3243G0261P3274h494B37322B6493R9386B3204J56986Q3651
$$ 58242 219302 312545 70261 143535 -8494 237322 26493 125879 23204 180190 263841
13121B63841K6180d5823k99405g1198o6407K4811H1237c5533A55464b18704c6689
$$ 263841 290021 -45823 -345228 -71198 -137605 -112794 81237 -35533 155464 -218704 -36689
13109i6738A04705P7144D8237j9193M7274l7226G221J0030P8125a28592k14811
$$ -96738 104705 181849 48237 29044 76318 39092 7221 17251 95376 -128592 -343403
13098c43403H2584L2503c1402p5889o6230B29919O3145Q4771A18879a885l8777
$$ -343403 82584 115087 -31402 -107291 -173521 229919 293064 377835 118879 -1885 -40662
13087d0662p9344l8492C39552j64776b24508f729j5112D13372A77317J6447E7707
$$ -40662 -120006 -158498 339552 174776 -224508 -6729 -21841 413372 177317 193764 57707
13075a39018l5964Q4160A33063K4798D1968K04453J97357A45223g4133G2148J2590
$$ -139018 -174982 -90822 133063 157861 41968 246421 443778 145223 -74133 72148 84738
13064H4738R6853b00708p3245E6430a47087a5442B49862J56864A53592c4102q5310
$$ 84738 181591 -200708 -273953 56430 -147087 -15442 249862 406726 153592 -34102 -119412
13053a19412E6039M47178d8143n5964H0516M3738l4778B9313K80497a43542M4189
$$ -119412 56039 503217 -48143 -104107 80516 124254 89476 29313 309810 -143542 -99353
13042i9353B60344H8128L6416B5489K7453k3502c4543E75181A63291F24J14017
$$ -99353 260344 88128 124544 25489 52942 29440 -34543 575181 163291 624 114641
13031A14641a41008I8745K57247E6319a20221D84947f7547A19196Q0970a83938
$$ 114641 -141008 98745 355992 56319 -120221 484947 -67547 119196 200166 -183938
13020B09648n008d7434j14827A09715a8850j77706h3859F3362d4018k31593Q6914
$$ 209648 204640 -47434 -162261 109715 -18850 -196556 -83859 63362 -44018 -275611 -188697
13009a88697C33305E8410M21972o9340A79015n4102h9866A85533q7024c0466A24789
$$ -188697 333305 58410 480382 411042 179015 124913 -89866 185533 98509 -30466 124789
12997A87843d9862j38489B38966o2069f1808l50386e0653A83401m2361a40755
$$ 187843 -49862 -188351 238966 176897 -61808 -412194 -50653 183401 141040 -140755
12986B93495a06279b2992B76330k4491c64959h5604K3580C12816B4901a4363G6278
$$ 293495 -106279 -22992 276330 251839 -364959 -85604 -62024 312816 24901 -14363 76278
12974c37764H9135b25907K4906A36872b96500B37329L6067b45341g3167A83497
$$ -337764 89135 -225907 -201001 136872 -296500 237329 273396 -245341 -73167 183497
12963I4144b0149B0457o527J2112L3031b0498j61513F0863J42269J36759p1946
$$ 94144 -20149 20457 13930 26042 59073 -20498 -182011 60863 203132 339891 267945
12952B67945c8862j6562A24848K4082e8579E91195A50152h7632A4184P1004a89473
$$ 267945 -38862 -55424 124848 148930 -58579 591195 150152 -87632 14184 85188 -189473
12940e07A26445a11530c6154A5258c54950a43686C9385b05336j03976D1706d7046
$$ -507 126445 -111530 -36154 15258 -354950 -143686 39385 -205336 -309312 41706 -47046
12928h5248A70225l3249C1057i529n3743C3488k072b42842e8130J4474n3729b5527
$$ -85248 170225 136976 31057 -9529 -63272 33488 31416 -242842 -58130 -43656 -97385 -25527
12915F1611a16936j570A88787a90253B26315D7562a30534l5268B01048b26114
$$ 61611 -116936 -118506 188787 -190253 226315 47562 -130534 -165802 201048 -226114
12904H0387P8961f4218A23897b37749a7387j44553e5765A40220K5165Q806H1945
$$ 80387 159348 -64218 123897 -237749 -17387 -161940 -55765 140220 165385 174191 81945
12892F9714a99147C38492d04612a00507A27365d04890a86707A26564a98239M2946
$$ 69714 -199147 338492 -404612 -100507 127365 -404890 -186707 126564 -198239 -155293
12882a55293B41452C8165c9505D0751j9816a16607J8291j11414L3521A00972d1860
$$ -155293 241452 38165 -39505 40751 20935 -116607 -98316 -209730 -176209 100972 -41860
12870c9485B4880O7834j5624J173b93360i9205n1978D1440g5977C41349j36265
$$ -39485 24880 92714 77090 78263 -293360 -99205 -151183 41440 -75977 341349 205084
12859B05084C2431J29062n6818g1444A1501Q8104J36657h875E3339d0733A0397
$$ 205084 32431 161493 104675 -71444 11501 99605 236262 -8875 53339 -40733 10397
12847b1459j1564m7871j32960l04442J94722f0054A15382f1060A70182o5467n0591
$$ -21459 -33023 -80894 -213854 -518296 -323574 -60054 115382 -61060 170182 104715 54124
12836E4124a62133A67967b86858J7023p3619h0938E2208A7252a83812D42610a26521
$$ 54124 -162133 167967 -286858 -269835 -343454 -80938 52208 17252 -183812 442610 -126521
12824I5924P0692c31561a15201b2037n6132B57163c1729D8172j7800a42683c580
$$ 95924 166616 -331561 -115201 -22037 -78169 257163 -31729 48172 30372 -142683 -3580
12812D05345E0245a16490A07334J4399c81574e8342A06624d49430C2108b69174
$$ 405345 50245 -116490 107334 121733 -381574 -58342 106624 -449430 32108 -269174
12801B58524a99338E99513a24487l71785a49847r2783J6184B44899D3276J8661
$$ 258524 -199338 599513 -124487 -496272 -149847 -242630 -226446 244899 43276 61937
12791F1937a02899B81158j19493b64866a19124k7539j06164B61778A22635b29799
$$ 61937 -102899 281158 161665 -264866 -119124 -146663 -252827 261778 122635 -229799
12780E333f137l5884o3823B9794J20417n278c2953j48567B76508a57818H1916
$$ 5333 -6137 -42021 -105844 29794 150211 144933 -32953 -181520 276508 -157818 81916
12768a89287A83295a02674L2496q271F2451a42454B1973i4585C88142b06076g1958
$$ -189287 183295 -102674 -70178 -78449 62451 -142454 21973 -94585 388142 -206076 -71958
12756b66772B43283a22416M1369A19754b05048A67855a99910j7669f2391D6117
$$ -266772 243283 -122416 -81047 119754 -205048 167855 -199910 -217579 -62391 46117
12745h5642m6550L8199H4547B9112A958J88827J7080J12985j02432A2452g0494
$$ -85642 -132192 -93993 84547 29112 1958 190785 207865 320850 218418 12452 -70494
12733A73566K6669b16160D3196d0895B7094a76967c2215G1636O8464j6187b16163
$$ 173566 200235 -216160 43196 -40895 27094 -176967 -32215 71636 140100 123913 -216163
12721B36174d005A15349R5596a0085j25498e9487a1034A99391o0889c7353A07071
$$ 236174 -4005 115349 210945 -10085 -135583 -59487 -11034 199391 138502 -37353 107071
12709D16862A52747J59352o8010j8771P0931C6619K0877b2668q4948L5973B18992
$$ 416862 152747 312099 244089 225318 296249 36619 57496 -22668 -107616 -71643 218992
12697b00457C702P4327d6682k6593q68C9192J39268H8825e6107A47181d08624
$$ -200457 3702 78029 -46682 -73275 -74143 39192 178460 88825 -56107 147181 -408624
12685B42916c438C0482a76796A439e7791A72303a83943a4898B36634A5790K63876
$$ 242916 -3438 30482 -176796 1439 -57791 172303 -183943 -14898 236634 15790 279666
12674B79666n9562a99894D342K62304n367O4807a33737c1941A54829a484F5534
$$ 279666 220104 -199894 4342 266646 261279 326086 -133737 -31941 154829 -1484 65534
12662B18554o2119J15121o6690J97287j52605j21367b76743A72731O1006P4446
$$ 218554 156435 271556 204866 402153 249548 128181 -276743 172731 233737 308183
12652C08183A16193n3987a57021D8143a84599a7968l1677l0815k6798G3643O8861
$$ 308183 116193 62206 -157021 48143 -184599 -17968 -49645 -80460 -107258 73643 142504
12641A42504J71006j29449a28338A36387m8444C5000K25443j2029J74703B4908
$$ 142504 313510 184061 -128338 136387 87943 35000 260443 248414 423117 24908
12630a3441A88413c36942A48979P4758a9129A52541b6154A61175o5014K56760
$$ -13441 188413 -336942 148979 223737 -19129 152541 -26154 161175 96161 352921
12620C52921j23452b03308A31682a54558c2996l46346B38855q1899a41050A44077
$$ 352921 229469 -203308 131682 -154558 -32996 -379342 238855 156956 -141050 144077
12609A29981A2329J27703J41653b69235Q9352C3376f6621B09607a14941A6594
$$ 129981 12329 140032 281685 -269235 -179883 33376 -66621 209607 -114941 16594
12598G2856K18547E5650d1378A78729o9121j8449b22466B81523c86932A84216
$$ 72856 291403 55650 -41378 178729 109608 91159 -222466 281523 -386932 184216
12587A5879P489K44810d232A07020J38528j17370A8185j680Q4835F03M4722K02508
$$ 15879 23368 268178 -4232 107020 245548 128178 18185 16505 101340 603 45325 247833
12575B47833j06233J6210K27434A05745D702N424a38629c0109e124o0386E1566
$$ 247833 141600 157810 385244 105745 4702 10126 -138629 -30109 -5124 -65510 51566
12563A13329I411O6260B5149h9969o9254A54011J97413f1800A42842f0349D4598
$$ 113329 9411 75671 25149 -89969 -159223 154011 351424 -61800 142842 -60349 44598
12551D8970L6586f2940k53710A43989Q563a94537e9819G7003g3847j22040A10960
$$ 48970 85556 -62940 -316650 143989 152552 -194537 -59819 77003 -73847 -195887 110960
12539b05871L6168m04787a53232K4197b7046j978j51550h8553E7808d79263A55715
$$ -205871 -169703 -574490 -153232 -129035 -27046 -29024 -180574 -88553 57808 -479263 155715
12527E0259Q4375O5149a0434D5164a2935k50871A87102c35212H7015Q5667N8158
$$ 50259 134634 199783 -10434 45164 -12935 -263806 187102 -335212 87015 172682 230840
12516B30840H8073J52511J25543A75632q739C0274K99229A7840K09574b19208
$$ 230840 88073 240584 366127 175632 166893 30274 329503 17840 227414 -219208
12505B19643c16398F7119c938l2267B18261b07950A23477a38082C11539a66649
$$ 219643 -316398 67119 -3938 -36205 218261 -207950 123477 -138082 311539 -166649
12494D4338J16405B5228p427Q3724f0394B5363L05394q0230J9557C2230K38910
$$ 44338 160743 25228 17801 101525 -60394 25363 330757 250527 270084 32230 271140
12483B71140H8227P3886l473a83896q145c2247o6162A38022d8592E839b47361
$$ 271140 88227 162113 158640 -183896 -192041 -32247 -98409 138022 -48592 5839 -247361
12471D1905a7986q8467D1306a15404A09011c28467A8987j000b84192Q8716h6265
$$ 41905 -17986 -106453 41306 -115404 109011 -328467 18987 17987 -284192 -195476 -86265
12459A47698b9385A91406N7036m7843a36694A35134D6201K71554q0789B7374d06039
$$ 147698 -29385 191406 248442 200599 -136694 135134 46201 317755 236966 27374 -406039
12447A7393b65760c8617B7970a56753m7863B9088J2237g0965j4256L1843K2567
$$ 17393 -265760 -38617 27970 -156753 -204616 29088 41325 -70965 -85221 -53378 -30811
12436c0811l02728A8597j563K15728c43102B30856a98182A71446F1346b52526
$$ -30811 -333539 18597 17034 232762 -343102 230856 -198182 171446 61346 -252526
12425b31109c7328j43210A95803J3598H7981a35975A76765b090C987b3894A13645
$$ -231109 -37328 -180538 195803 209401 87981 -135975 176765 -2090 3987 -23894 113645
12413b04815I9249C3610b90666F0246J9368K4636B51J96511F4451J58738F2800
$$ -204815 99249 33610 -290666 60246 79614 104250 251 196762 64451 223189 62800
12401A32951M9063d1551j95031A59173l239b63341k46722C23817A34583D5118
$$ 132951 182014 -41551 -236582 159173 155934 -263341 -510063 323817 134583 45118
12390f17E34818A13766m0333K9377a04202A10355G350L00086h543A43760a69947
$$ -617 534818 113766 73433 102810 -104202 110355 7350 307436 -8543 143760 -169947
12378a5364D08789k03731a21891Q604n2199P2728B5323J55972b68203A6956J86834
$$ -15364 408789 205058 -121891 -113287 -165486 -92758 25323 181295 -268203 16956 203790
12367B03790E2050J36352k9809c87015C9717J30176N106C7886a41877A0631a31544
$$ 203790 52050 188402 158593 -387015 39717 169893 174999 37886 -141877 10631 -131544
12355B09050a75299A0577e6914n3260C4537Q3315l1254k4069a39232A1468J26561
$$ 209050 -175299 10577 -56914 -110174 34537 117852 86598 62529 -139232 11468 138029
12344A38029h6230J2576o84D61858f9784A98026e6291a3439A99519O6322J14353
$$ 138029 -86230 -73654 -74338 461858 -69784 198026 -56291 -13439 199519 265841 380194
12333C80194j08049J68169n8615A46230c7036B36608B4836Q8739a121m5269k06211
$$ 380194 272145 440314 381699 146230 -37036 236608 24836 113575 -1121 -46390 -252601
12322b52601D19400F2543A5857N6016R9123P3436A0034N6335J05265D6464M0199
$$ -252601 419400 62543 15857 71873 170996 244432 10034 66369 171634 46464 86663
12311H6663P9029J22736k419b18618A02869c016E3945K89150B599Q3542L43599
$$ 86663 165692 288428 286009 -218618 102869 -3016 53945 343095 2599 86141 429740
12300D29740A28180m1517e3279A27259C7396P5314a47321B22011b6545p8972c4817
$$ 429740 128180 86663 -53279 127259 37396 112710 -147321 222011 -26545 -105517 -34817
12288A42727E9126J40850b14323J9940B0100R8995g6559f802k9554A89669J07928
$$ 142727 59126 199976 -214323 -194383 20100 119095 -76559 -6802 -36356 189669 297597
12277B97597F621h022C44825J04742n2779H116L77553D5781J12671K40117E9882
$$ 297597 6621 -8022 344825 449567 396788 8116 385669 45781 158452 398569 59882
12265C3245g2489m2499C18983K09693j47155B5963Q5298a05161B69443l3755q2549
$$ 33245 -72489 -114988 318983 528676 381521 25963 111261 -105161 269443 235688 153139
12254A53139a9678A70341i7249j49863i1613B52504J194H9658J83108r4695J60314
$$ 153139 -19678 170341 -97249 -247112 -91613 252504 253698 89658 272766 178071 338385
12243C38385a50066B16628D9127a07765K869c162B29307a4047D42907A08332L24165
$$ 338385 -150066 216628 49127 -107765 -104896 -3162 229307 -14047 442907 108332 432497
12232D32497F6843e6396j37B12894K28265m7886j01813a74709A40474J75528J69932
$$ 432497 66843 -56396 -56533 212894 441159 393273 291460 -174709 140474 316002 485934
12221D85934j27823K78470A84231J18892J95654i7381B17558K9663a2574D53888
$$ 485934 358111 636581 184231 303123 498777 -97381 217558 247221 -12574 453888
12210A58979n5888J59704K92391A19833c7508B27548R4951A37605K09973a25571
$$ 158979 103091 262795 555186 119833 -37508 227548 322499 137605 347578 -125571
12199C07924A25553K00072O1608J8112j73934L84903B43130K97573C7233K05064
$$ 307924 125553 325625 387233 405345 231411 616314 243130 540703 37233 242297
12189B42297l8829K49061j07033o8028K7793n3572I2419B2711a22703C68621A62724
$$ 242297 203468 452529 345496 277468 305261 251689 92419 22711 -122703 368621 162724
12177D00282E6630J70769q6082R3516J55273r0605J7525i2537B85541o2974J8377
$$ 400282 56630 227399 141317 234833 390106 299501 317026 -92537 285541 222567 240944
12166B40944L67912B48759G0482J31777J24224J19051A13106R0173p7189P9557
$$ 240944 608856 248759 70482 202259 326483 445534 113106 203279 126090 205647
12156B05647L2454J39890A31577A9179N7692K43950I126h7903A97547G2354g1574
$$ 205647 238101 377991 131577 19179 76871 320821 9126 -87903 197547 72354 -71574
12144A6589b10370B26758a98871B85550p3398O158L107J48447j20514L1234a58317
$$ 16589 -210370 226758 -198871 285550 212152 218310 221417 369864 249350 280584 -158317
12132i2364A34607a3505B49809J56910j61805j16145b5494I7807J18129K351l8648
$$ -92364 134607 -13505 249809 406719 244914 128769 -25494 97807 215936 218287 179639
12121A79639g493B38754i9020B58882a48663B87507E4295c25993C9214i2415A57608
$$ 179639 -7493 238754 -99020 258882 -148663 287507 54295 -325993 39214 -92415 157608
12109A67409b9876G912J33252b16262k0366A47305f0564r4932B54951g0271B81139
$$ 167409 -29876 7912 141164 -216262 -236628 147305 -60564 -155496 254951 -70271 281139
12097D0036L3120g7546l7728n5197A89425k3159a48107A48564R0252e5576A67166
$$ 40036 73156 -77546 -115274 -170471 189425 166266 -148107 148564 238816 -55576 167166
12085A2312L02182j25083G5439b8140A8716a04201G1954P0661e1426A52727A3782
$$ 12312 314494 189411 75439 -28140 18716 -104201 71954 142615 -51426 152727 13782
12073B35178Q6778j07832F7408d7185b0148l368A73311b51901E4425b36110Q6537
$$ 235178 321956 214124 67408 -47185 -20148 -23516 173311 -251901 54425 -236110 -149573
12062a49573m4506h1075j12471A7751b02165j11311J56167H3147a71361c058C79398
$$ -149573 -194079 -81075 -193546 17751 -202165 -313476 -157309 83147 -171361 -3058 379398
12050A0100e5571a6096A76905a03968j5009n6355n6208A48654P2954k2305b2459
$$ 10100 -55571 -16096 176905 -103968 -118977 -175332 -231540 148654 221608 199303 -22459
12038A91868N0749b08679b0360C38151i5524n4989r8661C21721j47282g0828A06944
$$ 191868 242617 -208679 -20360 338151 -95524 -150513 -249174 321721 174439 -70828 106944
12026a13882A44027P9352G7694J6640M1760a31115c983A17975n2783a0713A15312
$$ -113882 144027 223379 77694 94334 136094 -131115 -3983 117975 65192 -10713 115312
12014f2071B86926r7571o0271L34409A34408b11763R6880d3839l021A62067J43912
$$ -62071 286926 189355 129084 463493 134408 -211763 -114883 -43839 -46860 162067 305979
12003C05979i6925n9191b3357I7688D7775K27215c51p8081K831L2565j88819k6093
$$ 305979 -96925 -156116 -23357 97688 47775 274990 -351 -78432 -75601 -43036 -231855 -257948
11991b57948f7954r5287f011l9998q0178l05662a40739G4258L00384b9236k35917
$$ -257948 -67954 -163241 -6011 -46009 -126187 -431849 -140739 74258 374642 -29236 -265153
11980b65153l5897h9048k83899E5142e63317A27116a50683f9543A62983a11156
$$ -265153 -301050 -89048 -372947 55142 -563317 127116 -150683 -69543 162983 -111156
11969E8079J00053B8045R4301j0630a71101C6357K14578a98867M4898A56673d8354
$$ 58079 158132 28045 122346 111716 -171101 36357 250935 -198867 -153969 156673 -48354
11957a49941H2571M00815a52937o9657P1057A31317b67498E7471K0267j0441d9828
$$ -149941 82571 483386 -152937 -222594 -151537 131317 -267498 57471 77738 67297 -49828
11945B6879g1150j22466C38178D5823b27541D8656J33185b2772M237A89493a653
$$ 26879 -71150 -193616 338178 45823 -227541 48656 181841 -22772 -18535 189493 -1653
11933C06402F1058j8857Q3595b53328A46353g5064q2399g7032B06563e2815o8389
$$ 306402 61058 42201 125796 -253328 146353 -75064 -157463 -77032 206563 -52815 -121204
11922a21204A33990b08716B44469a66294B72283c81101l2244A51680d2646j02220
$$ -121204 133990 -208716 244469 -166294 272283 -381101 -413345 151680 -42646 -144866
11912a44866p7640i0246J7750B43401A945b09473k97961K25290D6918c3840B86365
$$ -144866 -222506 -90246 -72496 243401 1945 -209473 -507434 -282144 46918 -33840 286365
11900a4386j08002e664k29872h395k73313a09613I0607J75619b2392B78536i2067
$$ -14386 -122388 -5664 -235536 -8395 -281708 -109613 90607 266226 -22392 278536 -92067
11888e4850m61846H6424J67025f8176J5915b861p0424l131C6334M7161c44589
$$ -54850 -516696 86424 253449 -68176 -52261 -2861 -73285 -76416 36334 83495 -344589
11876b71908B23110r2920B5741c29811g5668K3686D2323j6907b05977N5467B6697
$$ -271908 223110 130190 25741 -329811 -75668 -51982 42323 25416 -205977 -150510 26697
11864a16777C2170a06296H7304a05767j02996j15981J24182e4460D02444b65103
$$ -116777 32170 -106296 87304 -105767 -208763 -324744 -200562 -54460 402444 -265103
11853h156m04912B94666r5665p2028a63849d6598j81027q4384G3998j4230d00444
$$ -8156 -413068 294666 199001 126973 -163849 -46598 -227625 -312009 73998 59768 -400444
11841G6565J3007c57772B8192b48805a01514e0584I1147c92096J29616j24557
$$ 76565 89572 -357772 28192 -248805 -101514 -50584 91147 -392096 -262480 -387037
11831c87037D2501P8323a34187B50202e5399B33276j08434d4372J8255B09196
$$ -387037 42501 120824 -134187 250202 -55399 233276 124842 -44372 -26117 209196
11820b96877B56568H5760a16158a7336r920A02549a89897E4775a64353O168J2545
$$ -296877 256568 85760 -116158 -17336 -27256 102549 -189897 54775 -164353 -158185 -145640
11809a45640B02643a54824D2082h121A00464a44470A18864d44022b10363d7230
$$ -145640 202643 -154824 42082 -8121 100464 -144470 118864 -444022 -210363 -47230
11798A12285a53187C23325j24326I7891J70693a52404k27381K9454r4618A70236
$$ 112285 -153187 323325 198999 97891 268584 -152404 -379785 -350331 -444949 170236
11787e9689C1491b32125A49315a70110c2208D5163a50761D9666P8621g951k21981
$$ -59689 31491 -232125 149315 -170110 -32208 45163 -150761 49666 128287 -7951 -229932
11776b29932A91044a43248a9557C73011A22952b50114J14790C0287b05389A18971
$$ -229932 191044 -143248 -19557 373011 122952 -250114 -135324 30287 -205389 118971
11765a71546k72f5853C28132D5673h4064L2114A01800b38466D5548b87280M2499
$$ -171546 -171818 -65853 328132 45673 -84064 -51950 101800 -238466 45548 -287280 -244781
11754b44781b7164l1642A39946a43518B113e5722j06808b3074A94037d8316A17513
$$ -244781 -27164 -58806 139946 -143518 2113 -55722 -162530 -23074 194037 -48316 117513
11742A60908b8563j9166A45480b46741A05829b27894G0492d6778a5296j59219
$$ 160908 -28563 -47729 145480 -246741 105829 -227894 70492 -46778 -15296 -174515
11732a74515h6533A23057O2503E443b39275f3929R475G4401a56130H433b4566
$$ -174515 -86533 123057 185560 5443 -239275 -63929 -54454 74401 -156130 8433 -24566
11720C1387L18072G8197A6887c6535n4075I0061J45937l3583K68813F2328b76314
$$ 31387 349459 78197 16887 -36535 -90610 90061 235998 202415 471228 62328 -276314
11708B67017g0082A05092Q1923B4964J01540Q1369I9387l2666O6060b23383e9142
$$ 267017 -70082 105092 187015 24964 126504 207873 99387 66721 132781 -223383 -59142
11696A4933J7344a60990A39790J40041a57395c8400j19296C01411k8941A23529
$$ 14933 32277 -160990 139790 279831 -157395 -38400 -157696 301411 272470 123529
11685H0761i6271A53203D4171a12915D2562h2667B39127A0374N1401K21320o9888
$$ 80761 -96271 153203 44171 -112915 42562 -82667 239127 10374 61775 283095 213207
11674B13207a00943E2640d1912J3867L899m433r6533H3873K48312j40637J24490
$$ 213207 -100943 52640 -41912 -28045 -24146 -28579 -125112 83873 332185 191548 316038
11663C16038d643D6046b70076B55546j06945b46151A78444b47998b8114B79993
$$ 316038 -4643 46046 -270076 255546 148601 -246151 178444 -247998 -28114 279993
11652d676j83608A24309J244j2299C3684i9980E5070K9083b7459C4792d6717D9519
$$ -4676 -188284 124309 125553 113254 33684 -99980 55070 84153 -27459 34792 -46717 49519
11639c54120b6097B0030K3695a89761O925N1525B4049J93614r0749B672J1224
$$ -354120 -26097 20030 43725 -189761 -182836 -131311 24049 217663 126914 2672 13896
11628A3896K39011a9445c699G2157J84261a23148L0453d1782G8425N9793C2180
$$ 13896 252907 -19445 -3699 72157 256418 -123148 -92695 -41782 78425 138218 32180
11616F7054A8128a46606b8446P576m9563j4814b1697l05800E8303J92508d25729
$$ 67054 18128 -146606 -28446 -20870 -70433 -85247 -21697 -327497 58303 250811 -425729
11604I0622K53935H2939a71127I9802L8511n1543K68434A03118c5862A53579K25699
$$ 90622 344557 82939 -171127 99802 138313 86770 355204 103118 -35862 153579 379278
11593C79278E6317H088b51818b3995I9325a5683m5088A65600n4776M7083P3834
$$ 379278 56317 8088 -251818 -23995 99325 -15683 -60771 165600 110824 157907 231741
11582B31741j07944M4224c20902B08289C1680J58270M2836d7297K3607E6253P2100
$$ 231741 123797 168021 -320902 208289 31680 189950 232786 -47297 -23690 56253 128353
11571A28353k4495J64123H4543L87010j84914j11414Q8808J21633I2449a7315
$$ 128353 103858 267981 84543 471553 286639 175225 264033 385666 92449 -17315
11560i8820A71928H0555f2652A32903J14175K77246b61711H3797K29368A23798
$$ -98820 171928 80555 -62652 132903 247078 524324 -261711 83797 313165 123798
11549D9373A5939L08543b45634g503D3713j2437c3954k31057g2055I7722K00018
$$ 49373 15939 324482 -245634 -7503 43713 31276 -33954 -265011 -72055 97722 297740
11538B97740G1499K40858A37548M6768O2541c98899a51450A52620q43J94034A44588
$$ 297740 71499 312357 137548 184316 246857 -398899 -151450 152620 151777 345811 144588
11526A16620a51681B92447J39732b5101q2960A35817Q9632q7419C9024L2160b0728
$$ 116620 -151681 292447 432179 -25101 -108061 135817 225449 138030 39024 71184 -20728
11514a28670p7064C21912l8497a08545E1149K59268c5377A55700J98398j2130
$$ -128670 -205734 321912 283415 -108545 51149 310417 -35377 155700 354098 341968
11504C41968A65840m8594J23410p9391R0904F3153a69441C15438A43277d5682
$$ 341968 165840 117246 240656 161265 252169 63153 -169441 315438 143277 -45682
11493c488B50190N1885I2344e8592C58935A70779k1428a1400A47393j4724K58517
$$ -3488 250190 302075 92344 -58592 358935 170779 149351 -11400 147393 132669 391186
11482C91186j27686J47408j47298r5283p4586Q7863n3984l8790J50325K5964p6925
$$ 391186 263500 410908 263610 168327 93741 181604 127620 88830 239155 265119 188194
11471A88194Q2734I2069J97095j13159p0478K67139A00023M2344M16020A84257
$$ 188194 270928 92069 289164 176005 105527 372666 100023 142367 558387 184257
11460C41684n9108M3766E2443h7923B56594g3325G2568I440Q2169l7551K05753
$$ 341684 282576 326342 52443 -87923 256594 -73325 72568 9440 91609 54058 259811
11449B59811J78369A39418c27658B05328c58267C05338j06366K0507G4371M0278
$$ 259811 438180 139418 -327658 205328 -358267 305338 198972 219479 74371 114649
11439A14649b8407A96409c2788B3769J22904N9207H824J10919A9365R3653K0716
$$ 114649 -28407 196409 -32788 23769 146673 205880 8824 119743 19365 113018 133734
11428A33734A5085K64740g6845B8049J03256B554J27098H08J10466f2026j35044
$$ 133734 15085 279825 -76845 28049 131305 2554 129652 808 111274 -62026 -197070
11417a97070Q2003q966j8088B06244c03719A61985B9741a10942j4056c4239l6568
$$ -197070 -115067 -124033 -142121 206244 -303719 161985 29741 -110942 -124998 -34239 -70807
11406g0807A81251H2812b97864B5620a93523A41354a04455j30536n1951A36958
$$ -70807 181251 82812 -297864 25620 -193523 141354 -104455 -234991 -286942 136958
11395A75626h3851B52684E7650f9201p2515D5993d2411o8306D6638c444k40311
$$ 175626 -83851 252684 57650 -69201 -141716 45993 -42411 -110717 46638 -3444 -243755
11384b43755i2494m4985L540O6048k59623A56945i366A30534f2836C37179D6571
$$ -243755 -92494 -137479 -133939 -67891 -327514 156945 -9366 130534 -62836 337179 46571
11372E1371J66586b37144I9045D7747a73418j04602a05147A25791b69910b1408
$$ 51371 217957 -237144 99045 47747 -173418 -278020 -105147 125791 -269910 -21408
11361A06815M3839F3437N3063h0682m8608G8818J81105a57963B56151j03735h8065
$$ 106815 150654 63437 116500 -80682 -129290 78818 259923 -157963 256151 152416 -88065
11349H6369J9324a71065c7295r1084G6045C1238N1700J20960a7359j43782E886
$$ 86369 105693 -171065 -37295 -128379 76045 31238 82938 203898 -17359 -161141 5886
11337A03664C3810h3435k6908j42667a09353E2538a07157B2145L8809N5549g0807
$$ 103664 33810 -83435 -110343 -253010 -109353 52538 -107157 22145 60954 116503 -70807
11325H0365Q6427o9914b91336B47666b7524j1668A19939a12467k24837g806p574
$$ 80365 166792 96878 -291336 247666 -27524 -39192 119939 -112467 -337304 -7806 -15380
11314a5380C37563F8401O7277g2429m0988j97263J04373P5622b2129j9179j30223
$$ -15380 337563 68401 135678 -72429 -113417 -310680 -206307 -130685 -22129 -41308 -171531
11303a71531P0231A51381a23442e6464o9893G7558a3700I7362a25774m3380l746
$$ -171531 -101300 151381 -123442 -56464 -126357 77558 -13700 97362 -125774 -169154 -172900
11292a72900k22922J71229B7442a60842j11724b7042k86585F009a89939f0301
$$ -172900 -395822 -224593 27442 -160842 -272566 -27042 -313627 6009 -189939 -60301
11281B79384b78352J19254A70321c3441B6146h3271A24785a30262j88437e6024
$$ 279384 -278352 -159098 170321 -33441 26146 -83271 124785 -130262 -318699 -56024
11270b87859J4132J16812A08783K52186b67924a02294B5154b82441l1023J43303
$$ -287859 -273727 -156915 108783 360969 -267924 -102294 25154 -282441 -313464 -170161
11260a70161A09262j1272R5976b9398A18591A3838a51045A81268a0778j76522
$$ -170161 109262 97990 193966 -29398 118591 13838 -151045 181268 -10778 -187300
11250a87300Q2818B86411a59587d4071k07822O4822r0306A12410r511Q1350b36337
$$ -187300 -104482 286411 -159587 -44071 -251893 -187071 -277377 112410 102899 184249 -236337
11238b1491e235j71247M9715E4566K45530a8461j7709B27365j12964A9318b17976
$$ -21491 -5235 -176482 -126767 54566 300096 -18461 -36170 227365 114401 19318 -217976
11226G5815c32063H615K48927A02115b53636D2776a75457b2140k05332h4913j91909
$$ 75815 -332063 8615 257542 102115 -253636 42776 -175457 -22140 -227472 -84913 -276822
11215b76822a21736k61608a38754C3597L78198a99421o8010A29944h1006B28084
$$ -276822 -121736 -383344 -138754 33597 411795 -199421 -267431 129944 -81006 228084
11204A09986K0652L7948d5301C13075a01279A81826b75347F1399J60038k1629
$$ 109986 130638 168586 -45301 313075 -101279 181826 -275347 61399 221437 199808
11194A99808I3999P9080b61736A41787a69758d3255I133a75131g2081j85541B06525
$$ 199808 93999 173079 -261736 141787 -169758 -43255 9133 -175131 -72081 -257622 206525
11182B627a30359A08734a99216k37895a2958k66272F1560P8569F7457A4255Q6294
$$ 2627 -130359 108734 -199216 -437111 -12958 -279230 61560 140129 67457 14255 100549
11171A00549l6288c11693m8093J22965a779k77725B6372K80969a5949I0834a27508
$$ 100549 64261 -311693 -359786 -236821 -1779 -279504 26372 307341 -15949 90834 -127508
11159a88465n4840h7933K2036B21015b48363J18023B19784b29967e6707l8739
$$ -188465 -243305 -87933 -65897 221015 -248363 -130340 219784 -229967 -56707 -95446
11149i5446H0828b01402O9972A14043d7593j09684A31851h4002a9049A25346o1419
$$ -95446 80828 -201402 -131430 114043 -47593 -157277 131851 -84002 -19049 125346 63927
11138F3927J25948c42888b1345j00112A76589J05351A18009E8552J16682K1752
$$ 63927 189875 -342888 -21345 -121457 176589 281940 118009 58552 175234 196986
11128A96986C1662K19437a41805A21702M7471M5737M8977M2488G677g0833r6819
$$ 196986 31662 251099 -141805 121702 169173 214910 263887 306375 7677 -70833 -167652
11117a67652Q2501m83628B40950H698R6944L2300L4186G4731J56537h4170A53723
$$ -167652 -85151 -568779 240950 8698 105642 137942 172128 74731 231268 -84170 153723
11105B04798J56653a3084E1279K46557a03355C4143J05728l4992N25436k79173
$$ 204798 361451 -13084 51279 297836 -103355 34143 139871 104879 630315 351142
11095C51142L314H2035l1954K313A7032R6957J75641J78068j78688o4053Q0436
$$ 351142 354456 82035 50081 52394 17032 113989 289630 467698 289010 224957 305393
11084C05393A24676i2124A80903o1577J01903K49032K50253I0118K14655J67964
$$ 305393 124676 -92124 180903 119326 221229 470261 720514 90118 304773 472737
11074D72737j56860L83493B05965L18344p3715m9041L09500B66661K91103Q7060
$$ 472737 315877 699370 205965 524309 450594 401553 711053 266661 557764 644824
11064F44824k30463J48797k77457K21701q9831M28318J54385k89677n4200R8509
$$ 644824 414361 563158 285701 507402 417571 845889 1000274 710597 656397 754906
11054G54906K5271J19023m5537K1370J66786N5151p8945J05724j32463j92157
$$ 754906 780177 899200 853663 875033 1041819 1096970 1018025 1123749 991286 799129
11044G99129N94696J30180o22186L53876Q7067k9272L46677n26505O1752j81806
$$ 799129 1393825 1524005 901819 1255695 1342762 1313490 1660167 1133662 1195414 1013608
11034A013608L50297m67189M69750k9382k63862o0829l20056L44476K6680K54714
$$ 1013608 1363905 896716 1366466 1337084 1073222 1012393 692337 1036813 1063493 1318207
11024A318207m36928K93562q9386j6294k21122L47673q8583j22570J71226m79422
$$ 1318207 881279 1174841 1085455 1069161 848039 1195712 1107129 984559 1155785 676363
11014F76363K64705Q3110J55640l23766k4757o4205L06838k68432j53166K75729
$$ 676363 941068 1024178 1179818 856052 831295 767090 1073928 805496 652330 928059
11004I28059j51114L41515j1275j25584J84130n39242L95448j39985j12684l19721
$$ 928059 776945 1118460 1107185 981601 1165731 626489 1021937 881952 769268 449547
10994D49547L11814M35468l68036K77591k022M7594j07579K22583p5846j94133
$$ 449547 761361 1196829 828793 1106384 1104362 1151956 1044377 1266960 1191114 996981
10984I96981K7520M68557j28513j69504K1349J541K66321K44449Q5262l69095
$$ 996981 1024501 1493058 1364545 1195041 1216390 1217931 1484252 1728701 1813963 1444868
10974A444868M43656N32387J85144L84311N30136j20587N96881K93644J46761
$$ 1444868 1888524 2420911 2606055 2990366 3520502 3399915 3996796 4290440 4437201
10965D437201K29592J42089m75562l39031p83427n99769m23995l32798M3803K09589
$$ 4437201 4666793 4808882 4333320 3994289 3210862 2611093 2187098 1854300 1898103 2107692
10955B107692k92850j30709R0230K45383l68003j65052Q0148l18755Q0879l65788
$$ 2107692 1814842 1684133 1774363 2019746 1651743 1486691 1566839 1248084 1328963 963175
10945I63175j31512J57585D36733q449C8536J05814M6637J13027j06148l7992
$$ 963175 831663 989248 436733 428284 38536 144350 190987 304014 197866 159874
10935A59874o4244J18355o3506P8712g198j51877I899K4810K2575N0598k4183
$$ 159874 95630 213985 150479 229191 -7198 -159075 9899 34709 57284 107882 83699
10924H3699k0212J01800m4844e9877k5780C81320j8202A76334G5828c003m9283
$$ 83699 63487 165287 120443 -59877 -85657 381320 363118 176334 75828 -3003 -52286
10913e2286O854q3795e0007A4611J09389l6415c752m1945D68074A62330a09993
$$ -52286 -45432 -129227 -50007 14611 124000 87585 -3752 -45697 468074 162330 -109993
10901a43373A81357G6206f8654B03407b34000c4982j12988k62933A56177J19896
$$ -143373 181357 76206 -68654 203407 -234000 -34982 -147970 -410903 156177 276073
10891B76073G1004c9753B56016a63814R18C04113h4132C06534j36053a86220j51689
$$ 276073 71004 -39753 256016 -163814 -162896 304113 -84132 306534 170481 -186220 -337909
10880c37909a0966j84798Q9692j22333B8389c8597I2015J5474B9061L5025G488
$$ -337909 -10966 -195764 -106072 -228405 28389 -38597 92015 107489 29061 64086 7488
10868a33081A48025E8329a33577b3361o2538j50042A44913c41852B28425c31055
$$ -133081 148025 58329 -133577 -23361 -85899 -235941 144913 -341852 228425 -331055
10857A27175d53598b9458J93j78027I6319l775h3643n220B05008K2478j11044
$$ 127175 -453598 -29458 -29265 -207292 96319 92544 -83643 -88863 205008 227486 116442
10846A16442J05345L3380b03503c5565k2550d054j13292F8872c55059E8141g8232
$$ 116442 221787 255167 -203503 -35565 -58115 -4054 -117346 68872 -355059 58141 -78232
10834F734e3480F2816N4725r131K30313e86860j4021H4170a73400O4055i385j19043
$$ 6734 -53480 62816 117541 108410 338723 -586860 -600881 84170 -173400 -109345 -9385 -128428
10822a28428p3298N0782G8948a74997K3664q1432a15039B05416e6544j71425R7966
$$ -128428 -201726 -150944 78948 -174997 -151333 -232765 -115039 205416 -56544 -227969 -130003
10811a30003j769F1422P4375F2385a7824n7873F4769e4551k50471c0364k2600
$$ -130003 -131772 61422 135797 62385 -17824 -75697 64769 -54551 -305022 -30364 -52964
10800e2964j13270J0140F145O5992R1521j1203a0236k03985r2627M9861G5749
$$ -52964 -166234 -156094 6145 72137 163658 152455 -10236 -214221 -306848 -256987 75749
10788a92780g8240p4010m8114A52143J64684a0178F5787a32458K700A84417g611
$$ -192780 -78240 -152250 -200364 152143 316827 -10178 65787 -132458 -129758 184417 -7611
10776A1047a11081N5019A88349K2759a05461b195A00248a61366A54472c08079
$$ 11047 -111081 -56062 188349 211108 -105461 -2195 100248 -161366 154472 -308079
10765a17641B2067c61873G0268c21309n8862A0253a52758g0656H634g1403D1398
$$ -117641 22067 -361873 70268 -321309 -380171 10253 -152758 -70656 8634 -71403 41398
10753a07844q2332p4709O6972b6162q3938L8719l6129A43687a18268k95875o3208
$$ -107844 -190176 -264885 -197913 -26162 -110100 -71381 -107510 143687 -118268 -414143 -477351
10742d77351c8207A30734C9385b3046j0437I166J42565n3833b50727A63558J886
$$ -477351 -38207 130734 39385 -23046 -33483 9166 151731 97898 -250727 163558 165444
10731A65444a65214P2706K7529A18292g8267j87400J23764C3051O4909a3499B9619
$$ 165444 -165214 -92508 -64979 118292 -78267 -265667 -141903 33051 97960 -13499 29619
10719C4316J7253a50735A79270D8481e3512q450l6163L408n0700a062k58873G3288
$$ 34316 51569 -150735 179270 48481 -53512 -61962 -98125 -94717 -145417 -1062 -259935 73288
10706A63173K67909a94100P3627o5220Q7158a0758l9183m1489m1611M6158A20813
$$ 163173 431082 -194100 -120473 -185693 -98535 -10758 -49941 -91430 -133041 -86883 120813
10694b44089E7204a62883C3608b99007m503B27062J21729b25944c5626h343A4771
$$ -244089 57204 -162883 33608 -299007 -303510 227062 348791 -225944 -35626 -8343 14771
10682c42890a04092j27432o1234l604e6736j69291B6941a2544r0431j04386F8450
$$ -342890 -104092 -231524 -292758 -296362 -56736 -226027 26941 -12544 -102975 -207361 68450
10670B34185A05280a07692m803B26694a16541A21758i2929j43314A03454h84j95825
$$ 234185 105280 -107692 -112495 226694 -116541 121758 -92929 -236243 103454 -884 -196709
10659a96709K8928I7125B0606R9013l8662n750e2386n0141m18004c3986r6100
$$ -196709 -167781 97125 20606 119619 80957 75207 -52386 -102527 -520531 -33986 -130086
10648a30086l1957r4741a08037H5634f497k41509A20739g0809J7340a9633j13298
$$ -130086 -162043 -256784 -108037 85634 -6497 -248006 120739 -70809 -53469 -19633 -132931
10637a32931q1926P4203m9514Q1538o8663A39814b06255d4842A88117a6768O68
$$ -132931 -214857 -140654 -190168 -108630 -177293 139814 -206255 -44842 188117 -16768 -16100
10626a6100l4040A01618J36317A1688J40257f9099J5912o8723f0362r1484G7591
$$ -16100 -50140 101618 237935 11688 151945 -69099 -53187 -121910 -60362 -151846 77591
10614b86101M8995B959M5917b40838M1086C01109B5746b11514H6147J59802a17556
$$ -286101 -237106 2959 48876 -240838 -199752 301109 25746 -211514 86147 245949 -117556
10602B00773o70b77807P9143A17191a6217B00644b44581C10346D5177b24347B31803
$$ 200773 200103 -277807 -198664 117191 -16217 200644 -244581 310346 45177 -224347 231803
10590b94212G0708a34974J3839N3045j32283e1821K4580k82577f4353k107A31080
$$ -294212 70708 -134974 -121135 -68090 -200373 -51821 -27241 -309818 -64353 -66460 131080
10578a10070A66987d280j21426A27831a787C02808c2941j68422k8874A61293d9431
$$ -110070 166987 -4280 -125706 127831 -1787 302808 -32941 -201363 -230237 161293 -49431
10566A80617a68640A10443B2999c99346a85789I593O5331G858c05135D1023a18672
$$ 180617 -168640 110443 22999 -399346 -185789 9593 74924 7858 -305135 41023 -118672
10554a13435k33169d1263A95495P0397b1484l99758E2306M8674b14313a03479
$$ -113435 -346604 -41263 195495 265892 -21484 -421242 52306 100980 -214313 -103479
10543b6552m211j65795e7596j39643G5290a5325j52746C2080L19247a07164A62045
$$ -26552 -30763 -196558 -57596 -197239 75290 -15325 -168071 32080 351327 -107164 162045
10531D6141j7704L32179a30476b3394E5153b63289j63720a06168K7433j28656
$$ 46141 28437 360616 -130476 -23394 55153 -263289 -427009 -106168 -78735 -207391
10521b07391l1991A19643A8703b1112F2465e4373F6587J66762b56353L9738E2311
$$ -207391 -239382 119643 18703 -21112 62465 -54373 66587 233349 -256353 -216615 52311
10509c91433A17715a29135A97062a51636f6124F2155a4647q8102q0749e6772K2234
$$ -391433 117715 -129135 197062 -151636 -66124 62155 -14647 -102749 -183498 -56772 -34538
10498c4538k64118A9266a58084A3893c6305n1161o3444A1671J50244b8064A98176
$$ -34538 -298656 19266 -158084 13893 -36305 -87466 -150910 11671 161915 -28064 198176
10486A6015E572O1695b08611B9012g0155A59J37820l5006b68747g1709D50168
$$ 16015 5572 67267 -208611 29012 -70155 159 137979 102973 -268747 -71709 450168
10474E14201k39913J94698d33o2395D24569o4921o4411a40323o2519K7908A3957
$$ 514201 274288 468986 -433 -62828 424569 359648 295237 -140323 -202842 -174934 13957
10462b11212p8584c4k7142n9026d1031A90906c73100J54232e0457C124J0045K23352
$$ -211212 -289796 -34 -27176 -86202 -41031 190906 -373100 -218868 -50457 3124 13169 236521
10450B36521A15831m0935g217A02457g3799k14669g8230j19280N5789G8755B5018
$$ 236521 115831 74896 -7217 102457 -73799 -288468 -78230 -197510 -141721 78755 25018
10438a21808c8305j88412a2316d576B54067q8864a30891N7311o1365B8079a44423
$$ -121808 -38305 -226717 -12316 -4576 254067 165203 -130891 -73580 -134945 28079 -144423
10426d31456C719b32387I4011e3139A91185a13931G5991J24110d2056p2974E7560
$$ -431456 3719 -232387 94011 -53139 191185 -113931 75991 200101 -42056 -115030 57560
10414A39042a72466A73324n7285c38749R6686a14351A36095g2900A9544a8832
$$ 139042 -172466 173324 116039 -338749 -242063 -114351 136095 -72900 19544 -18832
10403c0555m3543C49a65243D5581J07512a06443p1308j36264B2564a30766B80278
$$ -30555 -74098 349 -165243 45581 153093 -106443 -177751 -314015 22564 -130766 280278
10391a26289A44676C0533j471K57690j7294n1497A3606J79784n6525C1274f7749
$$ -126289 144676 30533 29062 286752 269458 217961 13606 193390 136865 31274 -67749
10379E14110B21188m7475L23101A98712J59124A65343P0713N3722E8618L85157
$$ 514110 221188 173713 496814 198712 357836 165343 236056 289778 58618 443775
10369D43775j12133N0187K47991m1173j11448N90256k48463r1409l25026J44726
$$ 443775 331642 381829 629820 588647 477199 1067455 818992 727583 402557 547283
10359E47283j77329M2677D7166J30809p4210L30267A85412N5275M39152k11789
$$ 547283 369954 412631 47166 177975 103765 434032 185412 240687 679839 468050
10349D68050m2282N49423j87779k25331O8417A82252K59120j47549K32317j20986
$$ 468050 425768 975191 787412 562081 630498 182252 441372 293823 526140 405154
10339D05154q0492A21390L29859n9593G3556R8848J72643J7912Q2055j91963q5454
$$ 405154 324662 121390 451249 391656 73556 172404 345047 362959 445014 253051 167597
10328A67597d7778C31874d1454A19834B0096M05664k05224J96468j04284r0894
$$ 167597 -47778 331874 -41454 119834 20096 425760 220536 417004 312720 221826
10318B21826J25829d4963B67525N1584a28634A88081o9819h6494g919E0954b9246
$$ 221826 347655 -44963 267525 319109 -128634 188081 118262 -86494 -7919 50954 -29246
10306F5481e3218F9912J24554P8083e3709F1274o176J47572q4064a02517b698
$$ 65481 -53218 69912 194466 272549 -53709 61274 55098 202670 118606 -102517 -2698
10294F6835b70177A36111a26496D9263h3905B45967m9892J96121a00234p8991
$$ 66835 -270177 136111 -126496 49263 -83905 245967 196075 392196 -100234 -179225
10284a79225D7186Q4994M1443h8440o9815j10239Q8459h6051o6813A0344K1662
$$ -179225 47186 132180 173623 -88440 -158255 -268494 -180035 -86051 -152864 10344 32006
10273C2006a02686K9295f742E4766J85766d20808D9955b22261E3678a84926o4775
$$ 32006 -102686 -73391 -6742 54766 240532 -420808 49955 -222261 53678 -184926 -249701
10262b49701a21703A13200h8265j7271A73959K4669g6536B43049r2383k2571O516
$$ -249701 -121703 113200 -88265 -105536 173959 198628 -76536 243049 150666 128095 134611
10251A34611K53724N3822B19511r8669k7179m6170i7921B21972a4994F4021R3715
$$ 134611 388335 442157 219511 120842 93663 47493 -97921 221972 -14994 64021 157736
10240A57736a94273O5912p8933O4268m2695D5553a28542e060j79454E927b76432
$$ 157736 -194273 -128361 -207294 -143026 -185721 45553 -128542 -5060 -184514 5927 -276432
10228I6505b65681i7650a1358D8762K30231a23284j91672a27648h217l10441A49319
$$ 96505 -265681 -97650 -11358 48762 278993 -123284 -314956 -127648 -8217 -318658 149319
10216b65815F506K35663b1958o7574J2672E8871a64403k45830d3333b0033q8290
$$ -265815 6506 242169 -21958 -89532 -76860 58871 -164403 -410233 -43333 -20033 -108323
10205a08323B0327L5687b30604E9998a58389j246A39236i4914c8236l162A13504
$$ -108323 20327 56014 -230604 59998 -158389 -159635 139236 -94914 -38236 -41398 113504
10193f4870A86273c25818e2537j26090C0920b3974B06700a67498A24395b16050
$$ -64870 186273 -325818 -52537 -178627 30920 -23974 206700 -167498 124395 -216050
10182b52649L2834i7968j74985M9956N3535g5895L1749c485A00878b76086O3129
$$ -252649 -219815 -97968 -272953 -222997 -169462 -75895 -44146 -3485 100878 -276086 -212957
10171b12957d5744j10675A9371c4017k96799b352m41672i592G3522K67777j29393
$$ -212957 -45744 -156419 19371 -34017 -330816 -2352 -444024 -9592 73522 341299 211906
10160B11906d5169g147j41132D7970a39678K9551J4619q8167b0403A07572l8467
$$ 211906 -45169 -7147 -148279 47970 -139678 -110127 -95508 -183675 -20403 107572 69105
10149F9105a53869j7428A28220J25379d0561m538j4901G7108a598j80810K1170
$$ 69105 -153869 -171297 128220 253599 -40561 -45099 -60000 77108 -1598 -182408 -161238
10138a61238k79711a08775j94771C32905j52279a09506B7014b83158a21844L378
$$ -161238 -440949 -108775 -303546 332905 180626 -109506 27014 -283158 -121844 -118466
10128a18466o2174j43878H178J25846O1513f1614l8674j18832B74578C8349b68271
$$ -118466 -180640 -324518 8178 134024 195537 -61614 -100288 -219120 274578 38349 -268271
10116G6706a37349d1679j56556g5128K9444A90616e0361k02182f2035o6796a0241
$$ 76706 -137349 -41679 -198235 -75128 -45684 190616 -50361 -252543 -62035 -128831 -10241
10104D1072J60620m6790a66384B8924J88166a41983o2120f0719B24722k2656a18422
$$ 41072 201692 154902 -166384 28924 217090 -141983 -204103 -60719 224722 202066 -118422
10092a10922A24442c89008b9646D7753b80871c2314p8818A46539O1338d13649
$$ -110922 124442 -389008 -29646 47753 -280871 -32314 -111132 146539 207877 -413649
10081B52007j06029a10974K8451M1086C7298a2875p1202l6115j09694B92576A15813
$$ 252007 145978 -110974 -82523 -41437 37298 -12875 -84077 -120192 -229886 292576 115813
10069b00235j47403c4180D14523b09205j1853R7949A02318D7697K29504a34307
$$ -200235 -347638 -34180 414523 -209205 -221058 -123109 102318 47697 277201 -134307
10058b24451j12454e3392p3972c6381K397j38393A25488a9130A54647a43970B60548
$$ -224451 -336905 -53392 -127364 -36381 -33984 -172377 125488 -19130 154647 -143970 260548
10046B85616J23884j63238E818b03457Q2757B70937a16356F5685b96866a03229
$$ 285616 409500 246262 5818 -203457 -120700 270937 -116356 65685 -296866 -103229
10035F7329b67339l27335i0036B22789b24506D6468a477p6575n1876L9543A10957
$$ 67329 -267339 -594674 -90036 222789 -224506 46468 -1477 -78052 -129928 -90385 110957
10023b9160l5479j98405i1457o9345c5781l65878a05537c461B6738J43154J2963
$$ -29160 -64639 -263044 -91457 -160802 -35781 -401659 -105537 -3461 26738 169892 182855
10012A82855d9542j4218p4548A4684b43967H0932N7418c7430J6045j47419O8991
$$ 182855 -49542 -63760 -138308 14684 -243967 80932 138350 -37430 -21385 -168804 -99813
10001i9813b9623j693j9598E4442J4217j3841K9998J1641a94726g892A6028f7277
$$ -99813 -29623 -31316 -50914 54442 68659 54818 84816 96457 -194726 -7892 16028 -67277
9988A32377h376j8771j7955A82889q8124b27186P8991A62579a15399j31651B5268
$$ 132377 -8376 -27147 -45102 182889 94765 -227186 -148195 162579 -115399 -247050 25268
9976C01257A29644j5933a93310P3220K3082j65721R7434f18G8112B4281J29133
$$ 301257 129644 113711 -193310 -120090 -97008 -262729 -165295 -618 78112 24281 153414
9965A53414C4742a645k83728Q0791k62550a93872C22666a22511m4647k55323j30079
$$ 153414 34742 -1645 -285373 -204582 -467132 -193872 322666 -122511 -167158 -422481 -552560
9954e52560J96530a11570j58564f395B11732o4449b07657B22645a46276g093A10825
$$ -552560 -356030 -111570 -270134 -6395 211732 147283 -207657 222645 -146276 -7093 110825
9942d5350k4794l98573D6326b45771l15854A22955b38353a8414k6969k89714H0388
$$ -45350 -70144 -468717 46326 -245771 -561625 122955 -238353 -18414 -45383 -335097 80388
9930G3891a25306l11592b0778A67908a3457A20681a53992m823a1456k8142l21158
$$ 73891 -125306 -436898 -20778 167908 -13457 120681 -153992 -158815 -11456 -39598 -360756
9919c60756J57864Q1874b735j5078l1622C578a3814A30126O2412c6036j94002
$$ -360756 -202892 -121018 -2735 -17813 -49435 3578 -13814 130126 192538 -36036 -230038
9908b30038C6858b52236M0054D6366a50988j05000g7098B9364Q1186a59512j52300
$$ -230038 36858 -252236 -212182 46366 -150988 -255988 -77098 29364 110550 -159512 -311812
9897c11812N8508Q3397A40482a6134C6748a06502j4935A00225f999A24391b55297
$$ -311812 -253304 -169907 140482 -16134 36748 -106502 -121437 100225 -6999 124391 -255297
9885A88124e4007j84054J14145j28152a19632a0601l84814I6045i771k25547A81286
$$ 188124 -54007 -238061 -123916 -252068 -119632 -10601 -395415 96045 -9771 -235318 181286
9873f9936j88090O4054j99114B40604a84826Q7386J7285l8561l7926B9509M759
$$ -69936 -258026 -193972 -393086 240604 -184826 -97440 -80155 -118716 -156642 29509 34268
9862C4268a10879j00782E259d30886E3533b45985j4941O7399N0657A19317b10236
$$ 34268 -110879 -211661 5259 -430886 53533 -245985 -260926 -193527 -142870 119317 -210236
9850B62380b57631R8312a9291m22774a75044J7744Q210c9867k02296D1250g7567
$$ 262380 -257631 -159319 -19291 -442065 -175044 -157300 -149090 -39867 -242163 41250 -77567
9838a54475M7660q2338L9331n4342B51216c11338c7386A05782b55676j21368A12040
$$ -154475 -106815 -189153 -149822 -204164 251216 -311338 -37386 105782 -255676 -377044 112040
9826c46187B4324l988a5085l8786A79767b00671A24506h4180n33616g2039C28255
$$ -346187 24324 20336 -15085 -53871 179767 -200671 124506 -84180 -617796 -72039 328255
9814a25736C08059b06713r6201a33440a3255A19296K8024e0407q6688L7770A76077
$$ -125736 308059 -206713 -302914 -133440 -13255 119296 147320 -50407 -137095 -99325 176077
9802b47340g123A3533i5141c6294k77355J46587B92748a00154A8454K8864Q674
$$ -247340 -7123 13533 -95141 -36294 -313649 -167062 292748 -100154 18454 47318 55992
9791E5992J1120j9865d6257K1550j38710f6508r0954N2248o4838c7337O322B66071
$$ 55992 67112 47247 -46257 -24707 -163417 -66508 -157462 -105214 -170052 -37337 -31015 266071
9778h563k9623B2724h2413B6992a80745p9964f3350O661a7260A16221d6458H7082
$$ -8563 -38186 22724 -82413 26992 -180745 -260709 -63350 -56689 -17260 116221 -46458 87082
9765B23197b22283c5519n9718c0436B86604j14282A0518a70868B6560Q426K99952
$$ 223197 -222283 -35519 -95237 -30436 286604 172322 10518 -170868 26560 34986 334938
9754C34938A45436a59998i857B4991a06279k41548J33205d9455j10241D3141b21491
$$ 334938 145436 -159998 -9857 24991 -106279 -347827 -214622 -49455 -159696 43141 -221491
9742b59290J28420b8532A5960h3214B35857b62600C18465D4517b9935B13520b8464
$$ -259290 -130870 -28532 15960 -83214 235857 -262600 318465 44517 -29935 213520 -28464
9730b76812M0199A29432a74706j4029h0741m5378A20966g3126a8796p4896L9310
$$ -276812 -236613 129432 -174706 -188735 -80741 -126119 120966 -73126 -18796 -93692 -54382
9719e4382A34941C9126a32545I1104b67656B8410a10888l00780a64497B6601J40833
$$ -54382 134941 39126 -132545 91104 -267656 28410 -110888 -411668 -164497 26601 167434
9708A67434A5336a74646j793j45835A4018c32991g2390L765n60037b20743h2581
$$ 167434 15336 -174646 -176439 -322274 14018 -332991 -72390 -68625 -628662 -220743 -82581
9696F0488b22876A85097c9856I008c77659M4761B3563M2796N2776d1537q4615
$$ 60488 -222876 185097 -39856 9008 -377659 -332898 23563 66359 119135 -41537 -126152
9685a26152B8520J49711l2679K0796i0167l7043M7183j0244G1314d5678l60863
$$ -126152 28520 178231 145552 166348 -90167 -127210 -80027 -90271 71314 -45678 -406541
9674d06541J31689o6497O1531O6291e1298l12968R9112A73147D2015K1080b110
$$ -406541 -274852 -341349 -279818 -213527 -51298 -364266 -265154 173147 42015 63095 -2110
9662b68746d5704B37035a34270f0211j66692a6747C644b69336F761J19439d1080
$$ -268746 -45704 237035 -134270 -60211 -226903 -16747 3644 -269336 6761 126200 -41080
9650A20308b05092j57334H1524a06198j18958D5903p927c97451E3154K10852d19456
$$ 120308 -205092 -362426 81524 -106198 -225156 45903 37976 -397451 53154 264006 -419456
9638b35647k4581K8489F7159e4952H1875J2230a02646M9855r7352q7206L541f0652
$$ -235647 -260228 -231739 67159 -54952 81875 94105 -102646 -52791 -150143 -237349 -233808 -60652
9625B98111g8081A5514Q8156a75591n1643A01214J75959a96475l3701d3847j99624
$$ 298111 -78081 15514 103670 -175591 -227234 101214 277173 -196475 -230176 -43847 -243471
9614b43471E04820A1416L19a48238k1447a8117k96341J17454m181b7659k34849
$$ -243471 504820 11416 11735 -148238 -169685 -18117 -314458 -197004 -201185 -27659 -262508
9603b62508f2768r157A10017f2324j52078A19126c52680D9922j8945f1607F7854
$$ -262508 -62768 -71925 110017 -62324 -214402 119126 -352680 49922 30977 -61607 67854
9591b1581j89476j19321C5099b35767k0549B6688a28324A16721a19463c3971D11503
$$ -21581 -211057 -330378 35099 -235767 -256316 26688 -128324 116721 -119463 -33971 411503
9579b10400P5222k2478B16992j1106H1243a31755D3568J0338f9461k4047j26258
$$ -210400 -135178 -157656 216992 205886 81243 -131755 43568 53906 -69461 -93508 -219766
9568b19766E8352a33196A03732c36092b7817j40649n0770A01064B266K4045J58104
$$ -219766 58352 -133196 103732 -336092 -27817 -168466 -219236 101064 2266 26311 184415
9557A84415i02A50625b57911q285e2291B57727a23435o9077B32215f6268m09463
$$ 184415 -902 150625 -257911 -266196 -52291 257727 -123435 -192512 232215 -66268 -475731
9546d75731i2719I335J54994O421a28621C46310e5332o0905k11546A51563b16786
$$ -475731 -92719 9335 164329 170750 -128621 346310 -55332 -116237 -327783 151563 -216786
9534a28968m1882f2413J5423F0005a66440j46212b313q3530d1961A0597N0481
$$ -128968 -170850 -62413 -46990 60005 -166440 -312652 -2313 -85843 -41961 10597 61078
9523F1078a45402j39405A38517h0162A19168a8869k54985b1318k16323h2269j05862
$$ 61078 -145402 -284807 138517 -80162 119168 -18869 -273854 -21318 -237641 -82269 -188131
9512a88131K6013d1284A18372a54545B63052a55578R07G9521R5805m1451b48378
$$ -188131 -162118 -41284 118372 -154545 263052 -155578 -154671 79521 175326 133875 -248378
9500d7230q524B4397J26965c02729J16562B0889b04984d6209j41153B66036e6607
$$ -47230 -55754 24397 151362 -302729 -186167 20889 -204984 -46209 -187362 266036 -56607
9488c11031A3423d6484B6288a20051A2086i5516A6050R4400a47118p7659G0025
$$ -311031 13423 -46484 26288 -120051 12086 -95516 16050 110450 -147118 -224777 70025
9476B18939a95791K8138d6978G2966p0k4028k4161a05000r2806J9895Q1296M5079
$$ 218939 -195791 -167653 -46978 72966 72896 48868 24707 -105000 -197806 -177911 -96615 -51536
9464e1536k67228k1070J37366d6814j18743j21438f7043d104j41005A77878h324
$$ -51536 -318764 -339834 -202468 -46814 -165557 -286995 -67043 -4104 -145109 177878 -8324
9452a39087B24636a65989K1272j1924A94274E2878f3412A86668N0384b91072G4217
$$ -139087 224636 -165989 -144717 -156641 194274 52878 -63412 186668 237052 -291072 74217
9440c30445J12485B45159H6765a17461e7006k32586J30031O9540B9934a30150
$$ -330445 -217960 245159 86765 -117461 -57006 -289592 -159561 -90021 29934 -130150
9429A43215L4225D0677f0167q1045M6190D04068H2373C0654J30085a79r4944j48464
$$ 143215 177440 40677 -60167 -141212 -95022 404068 82373 30654 160739 -179 -95123 -243587
9417b43587L97A05457a80149A2527b69580j31185b9741E6266a15609k27801J41313
$$ -243587 -243190 105457 -180149 12527 -269580 -400765 -29741 56266 -115609 -343410 -202097
9406b02097a5453l5110I7006a91119L6279G007b26336d4056A4211J31568a56766
$$ -202097 -15453 -50563 97006 -191119 -154840 7007 -226336 -44056 14211 145779 -156766
9394a80780d1387G1371h759j27567f6744H2940d1196I7951a04842k80988D7347
$$ -180780 -41387 71371 -8759 -136326 -66744 82940 -41196 97951 -104842 -385830 47347
9382E8063r367Q3046c8782l1387k615A234b06229A70318Q8389b56776p9166a4405
$$ 58063 48696 131742 -38782 -70169 -72784 1234 -206229 170318 258707 -256776 -335942 -14405
9369f1237a9373j29970k89062a10180E7671N6955i9166K7973m8330B03110b31337
$$ -61237 -19373 -149343 -438405 -110180 57671 114626 -99166 -71193 -119523 203110 -231337
9357i5481A08982g4950j12258L35B54800q1372i8774B59759a5028l8209A65292
$$ -95481 108982 -74950 -187208 -186873 254800 173428 -98774 259759 -15028 -53237 165292
9345c34507d1210j38480R972l8637P7936C01544A7267a0180k38368L8791j55955
$$ -334507 -41210 -179690 -169718 -208355 -130419 301544 17267 -10180 -248548 -209757 -365712
9334c65712f6680A88409h6010M550n8574Q037k3254b7305j56062H5471K15247
$$ -365712 -66680 188409 -86010 -81460 -140034 -131997 -155251 -27305 -183367 85471 300718
9323C00718I9335a00669b8823B38088H7861J10708a65092Q0190L3798m36542G8260
$$ 300718 99335 -100669 -28823 238088 87861 198569 -165092 -84902 -51104 -487646 78260
9311a26786k6971f5395k20995A26663b36530P9469n4112h9448k2602o6289M7421
$$ -126786 -153757 -65395 -286390 126663 -236530 -157061 -211173 -89448 -112050 -178339 -130918
9300a30918k19409J74758M5837K8511j65758o3794e2844G4240J81889b25173J5785
$$ -130918 -350327 -175569 -129732 -101221 -266979 -330773 -52844 74240 256129 -225173 -209388
9289b09388L0085j2817I139c7196A21269a58745e8450J8439j98951M2491I6042
$$ -209388 -179303 -192120 9139 -37196 121269 -158745 -58450 -40011 -238962 -196471 96042
9277b5362n2971A03825D3929L7786B802f3413r36j7357C20396D2132b5598j34652
$$ -25362 -78333 103825 43929 81715 2802 -63413 -64349 -81706 320396 42132 -25598 -160250
9265a60250c3912j23210I9306b33184b0523j18640k69762i2974B27691C5050F064
$$ -160250 -33912 -157122 99306 -233184 -20523 -139163 -408925 -92974 227691 35050 6064
9253a89311F7515C2631j6169d0274l50834d4078j93581E5315L366I113J07271
$$ -189311 67515 32631 16462 -40274 -391108 -44078 -237659 55315 58681 9113 116384
9242A16384P1351q7176a69409j12803d0023A40342e7306A196f7343A17118a12365
$$ 116384 187735 100559 -169409 -282212 -40023 140342 -57306 1196 -67343 117118 -112365
9230c06099a44353j23806a0360j14437A50506L5875c08523a00722k49507A02456
$$ -306099 -144353 -268159 -10360 -124797 150506 186381 -308523 -100722 -350229 102456
9219e7885A16358D6649b35495a08958A42201A8082c56368j28567a66097H030M6482
$$ -57885 116358 46649 -235495 -108958 142201 18082 -356368 -484935 -166097 8030 54512
9208E4512a4819l0944B0630a31915g016I0722A3447K04858c07723a43561d4275
$$ 54512 -14819 -45763 20630 -131915 -7016 90722 13447 218305 -307723 -143561 -44275
9196i017D3222b58379A23179i5385r8764c0241k53778H7573k9127L5209M7070
$$ -9017 43222 -258379 123179 -95385 -194149 -30241 -284019 87573 58446 93655 140725
9185A40725b1791r3458R950a7283F1731a0546l09015c9627B87927d4334j05002
$$ 140725 -21791 -115249 -105299 -17283 61731 -10546 -319561 -39627 287927 -44334 -149336
9174a49336j6450j43174j53937A65680C2956a80412F3843b6357l2530A17809a17663
$$ -149336 -165786 -308960 -462897 165680 32956 -180412 63843 -26357 -58887 117809 -117663
9162a65803N1291D3992g7970A28871a30802b6702B023c21361C0439a5992C8193
$$ -165803 -114512 43992 -77970 128871 -130802 -26702 2023 -321361 30439 -15992 38193
9150A18645a67966e1224k02040A22921e5760G4223f5113J3145E3469K7555a66469
$$ 118645 -167966 -51224 -253264 122921 -55760 74223 -65113 -51968 53469 81024 -166469
9138b29620P1123k2733r7063m9236J46886j57699L448A9088J27466d8455m5714
$$ -229620 -158497 -181230 -278293 -327529 -180643 -338342 -334894 19088 146554 -48455 -94169
9127i4169M6287r7964j25408d3647l0309n4563Q329c3991A51032J06364b86183
$$ -94169 -47882 -145846 -271254 -43647 -73956 -128519 -120190 -33991 151032 257396 -286183
9115h2218p289j33603A32655o4489k5514e38955b2920l9231k21458A26339Q5197
$$ -82218 -89507 -223110 132655 68166 42652 -538955 -22920 -62151 -283609 126339 211536
9104B11536a55531A39896c02416A24151f7292H3004d34719h2470A4907d1209l0167
$$ 211536 -155531 139896 -302416 124151 -67292 83004 -434719 -82470 14907 -41209 -71376
9093g1376k13847F8079e1414f375k26292B34509k4456j4261a47546p9490j46906
$$ -71376 -285223 68079 -51414 -6375 -232667 234509 210053 195792 -147546 -227036 -373942
9082c73942D9529e40933i7846k0362l4192a6328A5755a29888k44237J61872j46295
$$ -373942 49529 -540933 -97846 -118208 -152400 -16328 15755 -129888 -374125 -212253 -358548
9071c58548a52111C9219b4193n9100E5365b4237j2076F3476k5122i2740A91898
$$ -358548 -152111 39219 -24193 -83293 55365 -24237 -36313 63476 38354 -92740 191898
9059a48723N7608A39070a17264F8586a46134E1698J04126P2976E8183J20484e9319
$$ -148723 -91115 139070 -117264 68586 -146134 51698 155824 228800 58183 178667 -59319
9047d6484j41751j8145J5397A64626J92066b72575B09300q6410b16998B00447
$$ -46484 -188235 -206380 -190983 164626 356692 -272575 209300 122890 -216998 200447
9036c92645l0729J68527a21485K93A33933L7473d57493K6033B8224K65779c555
$$ -392645 -423374 -254847 -121485 -121192 133933 171406 -457493 -431460 28224 294003 -3555
9024b34155J8259g9136f317j75940d9150c741m8486K5361f657r3271c3073k3775
$$ -234155 -215896 -79136 -6317 -182257 -49150 -3741 -52227 -26866 -6657 -99928 -33073 -56848
9012e6848k24923E3777a65640F6331a28485p0973g5683k58399A48062a22513r9601
$$ -56848 -281771 53777 -165640 66331 -128485 -199458 -75683 -334082 148062 -122513 -222114
9001b22114D5578Q0804J2716b24281B27009a53556L4976H2453h2900c3243c849
$$ -222114 45578 126382 139098 -224281 227009 -153556 -118580 82453 -82900 -33243 -3849
8989a11754O131j96578C21816b19872q182A81634G4681d3994B3192L3511f9649
$$ -111754 -105623 -302201 321816 -219872 -228054 181634 74681 -43994 23192 56703 -69649
8977c39599A19183A0141d1456C2163O1546R0319b85904i5517A43412p1427b08418
$$ -339599 119183 10141 -41456 32163 93709 184028 -285904 -95517 143412 71985 -208418
8965g102E5828a19597F5491b68501Q3806Q8332c4804q7523C1981g2123B02275
$$ -7102 55828 -119597 65491 -268501 -184695 -96363 -34804 -122327 31981 -72123 202275
8953a20769H4517d139l2207A39621E2733a74133j05653J37126C2426f1121k14359
$$ -120769 84517 -4139 -36346 139621 52733 -174133 -279786 -142660 32426 -61121 -275480
8942b75480h4270m0114A10090b26299N5785n2922o9690G2009a12615A15656K16778
$$ -275480 -84270 -124384 110090 -226299 -170514 -223436 -293126 72009 -112615 115656 332434
8931C32434p8984o49A2322L01108p7779A14203c28081A96130R5296P83317N81916
$$ 332434 253450 252801 12322 313430 235651 114203 -328081 196130 291426 1074743 1656659
8920A656659M681834J2859609E015190E22084B56855j15020c83A48119K74814
$$ 1656659 6338493 19198102 5015190 522084 256855 141835 -383 148119 422933
8911D22933H8305c14804e573k9696B73395K3988H2976K47542A37594i8097b1976
$$ 422933 88305 -314804 -5573 -35269 273395 297383 82976 330518 137594 -98097 -21976
8899A7201e1281p3901q796G5975d64256a01600d6814E7492Q2371m281a00478L1836
$$ 17201 -51281 -125182 -133978 75975 -464256 -101600 -46814 57492 139863 135582 -100478 -68642
8887f8642k3190H483e501m4893C5891a59535J5515J5298n9110D0357a36501r4766
$$ -68642 -91832 8483 -5501 -50394 35891 -159535 -144020 -128722 -187832 40357 -136501 -231267
$$ [...]
##END NTUPLES=NMR SPECTRUM
##END=
