
##TITLE=AC1199_HACAH12052_7165119_fidUH8b1TT
##JCAMPDX= 6.0         $$ Bruker NMR JCAMP-DX V2.0
##DATA TYPE= NMR SPECTRUM
##DATA CLASS= NTUPLES
##ORIGIN= BRUKER
##OWNER= Administrator
$$ 1.72 TOPSPIN		Version 2.1
$$ 2012-12-01 19:29:56.652 -0500  Administrator@X
$$ Compression mode = diff/dup
##.OBSERVE FREQUENCY= 400.02188249412
##.OBSERVE NUCLEUS= ^1H
##.ACQUISITION MODE= SIMULTANEOUS (DQD)
##.ACQUISITION SCHEME= undefined
##.AVERAGES= 64
##.DIGITISER RES= 22
##SPECTROMETER/DATA SYSTEM= spect
##.PULSE SEQUENCE= noesygpps1d.comp
##.SOLVENT NAME= COFFEE_meoh
##.SHIFT REFERENCE= INTERNAL, COFFEE_meoh, 1, 14.96228
##AUDIT TRAIL= $$ (NUMBER, WHEN, WHO, WHERE, PROCESS, VERSION, WHAT)
$$ ##TITLE= Audit trail, TOPSPIN		Version 2.1
$$ ##JCAMPDX= 5.01
$$ ##ORIGIN= Bruker BioSpin GmbH
$$ ##OWNER= Administrator
$$ $$ E:\/data/COFFEE/nmr/AC1199_HACAH12052_7165119_fidUH8b1TT/12/pdata/1/auditp.txt
$$ ##AUDIT TRAIL=  $$ (NUMBER, WHEN, WHO, WHERE, PROCESS, VERSION, WHAT)
(   1,<2012-12-01 19:29:49.896 -0500>,<Administrator>,<X>,<go>,<TOPSPIN 2.1>,
      <created by zg
	started at 2012-12-01 19:18:22.168 -0500,
	POWCHK enabled, PULCHK disabled,
       configuration hash MD5:
       86 BA 57 50 F2 9D 5C 9B 26 00 A9 28 5F 66 2E 89
       data hash MD5: 64K
       C1 8D 83 39 7F CC BA 09 32 EF BD 3B DE 8E 0E 9D>)
(   2,<2012-12-01 19:29:53.435 -0500>,<Administrator>,<X>,<proc1d>,<TOPSPIN 2.1>,
      <Start of raw data processing
       efp LB = 0.3 FT_mod = 6 PKNL = 1 PHC0 = 0 PHC1 = 0 SI = 128K 
       data hash MD5: 128K
       E5 E9 5D 00 E9 90 0C AB 4E 4D EE 5C D9 AC 3D 98>)
(   3,<2012-12-01 19:29:54.704 -0500>,<Administrator>,<X>,<proc1d>,<TOPSPIN 2.1>,
      <pk PHC0 = -80.32654 PHC1 = 0 
       data hash MD5: 128K
       2A 6C DC 3E 03 27 B1 30 79 F2 18 38 B8 47 AA B1>)
(   4,<2012-12-01 19:29:55.508 -0500>,<Administrator>,<X>,<proc1d>,<TOPSPIN 2.1>,
      <abs ABSG = 1 
       data hash MD5: 128K
       D0 E9 04 CF 95 20 FB 9C D5 69 23 7B DA 14 86 9E>)
(   5,<2012-12-01 19:29:55.759 -0500>,<Administrator>,<X>,<proc1d>,<TOPSPIN 2.1>,
      <abs ABSG = 2 
       data hash MD5: 128K
       5E 7F 63 7B 8A 7C 9B EF F5 9A 60 06 B5 31 08 76>)
(   6,<2012-12-01 19:29:55.919 -0500>,<Administrator>,<X>,<proc1d>,<TOPSPIN 2.1>,
      <abs ABSG = 3 
       data hash MD5: 128K
       6E A0 75 CD A3 A3 A1 47 BF EF 7E 6E 54 C3 4C DB>)
(   7,<2012-12-01 19:29:56.098 -0500>,<Administrator>,<X>,<proc1d>,<TOPSPIN 2.1>,
      <abs ABSG = 4 
       data hash MD5: 128K
       94 4E F7 F1 11 89 82 E5 8A 38 BC B0 9B B3 E0 CB>)
(   8,<2012-12-01 19:29:56.277 -0500>,<Administrator>,<X>,<proc1d>,<TOPSPIN 2.1>,
      <abs ABSG = 5 
       data hash MD5: 128K
       C8 49 E3 15 04 79 59 C4 E5 49 99 1C 97 CB 5F E6>)
$$ ##END=
$$ 
$$ $$ hash MD5
$$ $$ 1C EF F8 A2 96 21 A2 D8 D6 5F 43 B2 CD C4 14 CC
##$RELAX= 
##$RELAX= 
##$RELAX= 
##$RELAX= 
##$RELAX= 
##$RELAX= 
##$RELAX= 
##$RELAX= 
$$ Bruker specific parameters
$$ --------------------------
##$DU= <E:\>
##$EXPNO= 12
$$ [...]
##$TP07= 0
##$TPNAME0= <>
##$TPNAME1= <>
##$TPNAME2= <>
##$TPNAME3= <>
##$TPNAME4= <>
##$TPNAME5= <>
##$TPNAME6= <>
##$TPNAME7= <>
##$TPOAL= (0..7)
0.5 0.5 0.5 0.5 0.5 0.5 0.5 0.5
##$TPOFFS= (0..7)
0 0 0 0 0 0 0 0
##$TUNHIN= 0
##$TUNHOUT= 0
##$TUNXOUT= 0
##$USERA1= <user>
##$USERA2= <user>
##$USERA3= <user>
##$USERA4= <user>
##$USERA5= <user>
##$V9= 5
##$VALIST= <valist>
##$VCLIST= <CCCCCCCCCCCCCCC>
##$VD= 0
##$VDLIST= <DDDDDDDDDDDDDDD>
##$VPLIST= <PPPPPPPPPPPPPPP>
##$VTLIST= <TTTTTTTTTTTTTTT>
##$WBST= 1024
##$WBSW= 4
##$XGAIN= (0..3)
0 0 0 0
##$XL= 0
##$YL= 0
##$YMAX_a= 8667069
##$YMIN_a= -18259058
##$ZGOPTNS= <>
##$ZL1= 120
##$ZL2= 120
##$ZL3= 120
##$ZL4= 120
##$ABSF1= 14.96228
##$ABSF2= -5.595901
##$ABSG= 5
##$ABSL= 3
##$ALPHA= 0
##$AQORDER= 0
##$ASSFAC= 0
##$ASSFACI= 0
##$ASSFACX= 0
##$ASSWID= 0
##$AUNMP= <proc_prof1d_extract.lims>
##$AXLEFT= 0
##$AXNAME= <>
##$AXNUC= <1H>
##$AXRIGHT= 0
##$AXTYPE= 0
##$AXUNIT= <>
##$AZFE= 0.1
##$AZFW= 0.1
##$BCFW= 0
##$BC_mod= 0
##$BYTORDP= 0
##$COROFFS= 0
##$CY= 15
##$DATMOD= 1
##$DC= 0
##$DFILT= <>
##$DTYPP= 0
##$F1P= 0
##$F2P= 0
##$FCOR= 0.5
##$FTSIZE= 131072
##$FT_mod= 6
##$GAMMA= 0
##$GB= 0
##$INTBC= 1
##$INTSCL= 1
##$ISEN= 128
##$LB= 0.3
##$LEV0= 0
##$LPBIN= 0
##$MAXI= 10000
##$MC2= 0
##$MEAN= 0
##$ME_mod= 0
##$MI= 0
##$NCOEF= 0
##$NC_proc= -2
##$NLEV= 6
##$NOISF1= 0
##$NOISF2= 0
##$NSP= 0
##$NTH_PI= 0
##$NZP= 0
##$OFFSET= 14.96228
##$PC= 1
##$PHC0= -80.32654
##$PHC1= 0
##$PH_mod= 1
##$PKNL= yes
##$PPARMOD= 0
##$PPDIAG= 0
##$PPIPTYP= 0
##$PPMPNUM= 2147483647
##$PPRESOL= 1
##$PSCAL= 4
##$PSIGN= 0
##$PYNMP= <proc.py>
##$REVERSE= no
##$SF= 400.020009125977
##$SI= 131072
##$SIGF1= 0
##$SIGF2= 0
##$SINO= 400
##$SIOLD= 131072
##$SPECTYP= <>
##$SREGLST= <1H.CDCl3>
##$SSB= 0
##$STSI= 131072
##$STSR= 0
##$SW_p= 8223.68421052631
##$SYMM= 0
##$S_DEV= 0
##$TDeff= 65536
##$TDoff= 0
##$TI= <>
##$TILT= no
##$TM1= 0
##$TM2= 0
##$TOPLEV= 0
##$USERP1= <user>
##$USERP2= <user>
##$USERP3= <user>
##$USERP4= <user>
##$USERP5= <user>
##$WDW= 1
##$XDIM= 131072
##$YMAX_p= 446069763
##$YMIN_p= -11607
##$CURPLOT= <Network HP LaserJet P1505>
##$CURPRIN= <$Network HP LaserJet P1505>
##$DFORMAT= <normdp>
##$LAYOUT= <+/1D_H.xwp>
##$LFORMAT= <normlp>
##$PFORMAT= <normpl>
##$SURQMSG= 1
$$ End of Bruker specific parameters
$$ ---------------------------------
##NTUPLES= NMR SPECTRUM
##VAR_NAME=  FREQUENCY,     SPECTRUM/REAL,   SPECTRUM/IMAG
##SYMBOL=    X,             R,               I
##VAR_TYPE=  INDEPENDENT,   DEPENDENT,       DEPENDENT
##VAR_FORM=  AFFN,          ASDF,            ASDF
##VAR_DIM=   131072,        131072,          131072
##UNITS=     HZ,            ARBITRARY UNITS, ARBITRARY UNITS
##FACTOR=    0.0627417313425164, 1,          1
##FIRST=     8223.62146879497, -1239,        -69310
##LAST=      0,             1826,            -69484
##MIN=       0,             -11607,          0
##MAX=       8223.62146879497, 446069763,    0
$$ Real data points
##PAGE= N=1
##DATA TABLE= (X++(R..R)), XYDATA
$$ [...]
63214I41802K1161K0858K0034J9134J8293J6870J3794Q602K110m248r705j4544
$$ 941802 962963 983821 1003855 1022989 1041282 1058152 1071946 1080548 1082658 1078410 1068705 1054161
63202A054161j9247k3747k7650l0746l2956l4031l3693l2008k9366k6159k2730
$$ 1054161 1034914 1011167 983517 952771 919815 885784 852091 820083 790717 764558 741828
63191G41828j9475j6584j3693j0176n991j912J290L734O189R096J2069J4474J6177
$$ 741828 722353 705769 692076 681900 675909 673997 675287 679021 685210 694306 706375 720849 737026
63178G37026J7557J8965K0399K1620K2329K2236K1296J9979J9063J8979J9445
$$ 737026 754583 773548 793947 815567 837896 860132 881428 901407 920470 939449 958894
63167I58894J9790J9520J8455J6710J4615J2456J0021O656K066l181q272j3031
$$ 958894 978684 998204 1016659 1033369 1047984 1060440 1070461 1077117 1079183 1076002 1067730 1054699
63155A054699j7715k2131k5591k7830k9377l0734l1651l1548l0343k8470k6305
$$ 1054699 1036984 1014853 989262 961432 932055 901321 869670 838122 807779 779309 753004
63144G53004k3968k1579j9388j7519j5834j4142j2434j0843r444q154o862n624
$$ 753004 729036 707457 688069 670550 654716 640574 628140 617297 607853 599699 592837 587213
63132E87213m676m162l897l475k620j428k63N20Q61J047J415J976K477K823L223
$$ 587213 582537 578375 574478 571003 568383 566955 566692 567212 568073 569120 570535 572511 574988 577811 581034
63117E81034L750M106M070L873L852L953M015M265M912N488N234M222L403L367
$$ 581034 584784 588890 592960 596833 600685 604638 608653 612918 617830 623318 628552 632774 636177 639544
63103F39544L666L681L529L672M107M453M562M488M090L180J973R95M72J64j97
$$ 639544 643210 646891 650420 654092 658199 662652 667214 671702 675792 678972 680945 681940 682412 682576 682379
63088F82379n70p53o86n07l43j19L93J208J958K289K373K691L315L882M304N051
$$ 682379 681809 681056 680370 679863 679520 679401 679794 681002 682960 685249 687622 690313 693628 697510 701814 706865
63072G06865O388P838Q831R483J0282J1311J2349J3468J4880J6398J7661J8848
$$ 706865 713253 721091 729922 739405 749687 760998 773347 786815 801695 818093 835754 854602
63060H54602K0461K2341K3647K4094K4573K6023K8256L0460L2591L5395L9040
$$ 854602 875063 897404 921051 945145 969718 995741 1023997 1054457 1087048 1122443 1161483
63049A161483M2486M4675M5855M7078M8626M9681M9675M9211M9128M9196M8506
$$ 1161483 1203969 1248644 1294499 1341577 1390203 1439884 1489559 1538770 1587898 1637094 1685600
63038A685600M6953M5451M4695M4472M4467M4908M5916M6891M7150M6647M5389
$$ 1685600 1732553 1778004 1822699 1867171 1911638 1956546 2002462 2049353 2096503 2143150 2188539
63027B188539M2590L7285K9602K0634J1080P47j0580k2435l4023m4568n3303n9726
$$ 2188539 2231129 2268414 2298016 2318650 2329730 2330477 2319897 2297462 2263439 2218871 2165568 2105842
63015B105842o4111o7142o8797o8203o4932n9870n4327m8748m2800l6252k9206
$$ 2105842 2041731 1974589 1905792 1837589 1772657 1712787 1658460 1609712 1566912 1530660 1501454
63004A501454k1821j4451p851k515K175P424J3480J9106K2948K5044K6681K8901
$$ 1501454 1479633 1465182 1457331 1454816 1456991 1464415 1477895 1497001 1519949 1544993 1571674 1600575
62992A600575L1531L3640L4619L4722L4624L4683L4666L4134L2920L1172K8958
$$ 1600575 1632106 1665746 1700365 1735087 1769711 1804394 1839060 1873194 1906114 1937286 1966244
62981A966244K5990K1786J6116R196J374p264j6792k6817l6309m4371n1049n7015
$$ 1966244 1992234 2014020 2030136 2039332 2040706 2033442 2016650 1989833 1953524 1909153 1858104 1801089
62969A801089o2454o6723o9183o9922o9379o7702o4916o1378n7556n3529m9155
$$ 1801089 1738635 1671912 1602729 1532807 1463428 1395726 1330810 1269432 1211876 1158347 1109192
62958A109192m4656m0489l6689l2955k9405k6643k4740k2851k0286j7474j5309
$$ 1109192 1064536 1024047 987358 954403 924998 898355 873615 850764 830478 813004 797695
62947G97695j3829j2294j0368q554p353o697o462o855p876q845r055q670q438
$$ 797695 783866 771572 761204 752650 745297 738600 732138 725283 717407 708562 699507 690837 682399
62934F82399q591q589q012p279p175p891q753q888q056o777n706n018m518m185
$$ 682399 673808 665219 657207 649928 642753 634862 626109 617221 609165 602388 596682 591664 587146 582961
62920E82961m252m600m643m116l596l715m093l761k568j471j329j998k868l609
$$ 582961 578709 574109 569466 565350 561754 558039 553946 550185 547617 546146 544817 542819 539951 536342
62906E36342m061l929l088j900p96J69J001J363R87K63p7J69N93P80N89o4j191
$$ 536342 532281 528352 525264 523364 522568 522737 523738 525101 526088 526351 526274 526443 527036 527816 528405 528341 527150
62889E27150k421l174l224k945k869l182l566l436k492j234o20r83j568j567j166
$$ 527150 524729 521555 518331 515386 512517 509335 505769 502333 499841 498607 497987 497004 495436 493869 492703
62874D92703j007r85n08K32K84n65j248q95p5O0p01j589k008k021j945k033k473
$$ 492703 491696 490711 490203 490435 490719 490154 488906 488011 487936 487996 487295 485706 483698 481677 479732 477699 475226
62857D75226l203l731l549k738j866j375j378j843k593l158l088k469j831j561
$$ 475226 472023 468292 464743 462005 460139 458764 457386 455543 452950 449792 446704 444235 442404 440843
62843D40843j686k099k616k843k444j630j004p91o55l94l37o78r34n87Mm2q64
$$ 440843 439157 437058 434442 431599 429155 427525 426521 425730 425075 424681 424344 423666 422732 422145 422149 422107 421243
62826D21243j606j513q38l38k95m12m66n48p21q33p41n25l53l46m88n69j81Q71
$$ 421243 419637 418124 417286 416948 416653 416241 415775 415227 414506 413673 412932 412407 412054 411708 411220 410651 410470 411341
62808D11341K156K927K928K680K793L328L973M544N057N519N990O672P648Q707
$$ 411341 413497 416424 419352 422032 424825 428153 432126 436670 441727 447246 453236 459908 467556 476263
62794D76263R642J0564J1642J2749J3725J4798J6373J8423K0539K2515K4541K6853
$$ 476263 485905 496469 508111 520860 534585 549383 565756 584179 604718 627233 651774 678627
62782F78627K9515L2466L5479L8217M0763M3903M8334N3666N8895O3801O9175
$$ 678627 708142 740608 776087 814304 855067 898970 947304 1000970 1059865 1123666 1192841
62771A192841P5372Q1417Q5933Q8353Q8807Q7364Q4016P8992P2456O4077N3316
$$ 1192841 1268213 1349630 1435563 1523916 1612723 1700087 1784103 1863095 1935551 1999628 2052944
62760B052944M0121K5020Q832p438k2701l6312m8412n9294o8643p5775q0532q3431
$$ 2052944 2093065 2118085 2126917 2119479 2096778 2060466 2012054 1952760 1884117 1808342 1727810 1644379
62748A644379q4978q5204q3873q0922p6704p1981o7544o3551n9467n4916n0284
$$ 1644379 1559401 1474197 1390324 1309402 1232698 1160717 1093173 1029622 970155 915239 864955
62737H64955m6114m2235l8117l3898l0290k7434k4615k1416j8497j6727j5962
$$ 864955 818841 776606 738489 704591 674301 646867 622252 600836 582339 565612 549650
62726E49650j5210j3818j1986j0205q656p315o277n602n029m121k841j628p00
$$ 549650 534440 520622 508636 498431 489775 482460 476183 470581 465552 461431 458590 456962 456262
62713D56262M35K379M864O870P860Q339R058J0185J1561J3301J5517J7903K0159
$$ 456262 456697 459076 463940 470810 478670 487009 496067 506252 517813 531114 546631 564534 584693
62700E84693K2656K5986L0003L3931L7400M0820M4613M8668N2755N6971O1485
$$ 584693 607349 633335 663338 697269 734669 775489 820102 868770 921525 978496 1039981
62689A039981O6105P0183P2859P3485P2089O9290O5388N9794N1831M1813L0678
$$ 1039981 1106086 1176269 1249128 1322613 1394702 1463992 1529380 1589174 1641005 1682818 1713496
62678A713496J8702N513q540k2004l3738m3873n2876o0428o5840o9101p0716p0875
$$ 1713496 1732198 1737711 1729171 1707167 1673429 1629556 1576680 1516252 1450412 1381311 1310595 1239720
62666A239720o9479o6805o3570o0278n6980n3538m9805m5718m1561l7920l5030
$$ 1239720 1170241 1103436 1039866 979588 922608 869070 819265 773547 731986 694066 659036
62655F59036l2363k9317k6093k3380k1363j9589j7742j6053j4807j3895j3030
$$ 659036 626673 597356 571263 547883 526520 506931 489189 473136 458329 444434 431404
62644D31404j2081j1150j0432j0014r638q847p597o540o268o433o108m971l639
$$ 431404 419323 408173 397741 387727 378089 369242 361645 355105 348837 342404 336296 331325 327686
62631C27686k827k666k958l495l923l772l026k344k325k706k702k022j171p02
$$ 327686 324859 322193 319235 315740 311817 308045 305019 302675 300350 297644 294942 292920 291749 291047
62617B91047n13q7P96J809K504K763K751K663K653K894L401L899M171M536N548
$$ 291047 290534 290447 291243 293052 295556 298319 301070 303733 306386 309280 312681 316580 320751 325287 330835
62602C30835P145Q607R534J0415J1814J3537J5095J6702J9023K2052K4986K7344
$$ 330835 337980 346587 356121 366536 378350 391887 406982 423684 442707 464759 489745 517089
62590E17089K9624L2569L6175L9753M2678M4806M6277M7089M6899M5343M2470
$$ 517089 546713 579282 615457 655210 697888 742694 788971 836060 882959 928302 970772
62579I70772L8628L3750K7224J8876R782J391n926j2865j9857k6466l2064l6344
$$ 970772 1009400 1043150 1070374 1089250 1099032 1100423 1094497 1081632 1061775 1035309 1003245 966901
62567I66901l9049m0032l9785l9238l8703l7628l5637l3072l0238k6960k3443
$$ 966901 927852 887820 848035 808797 770094 732466 696829 663757 633519 606559 583116
62556E83116k0750j9582j9178j8233j6495j4740j3470j2530j1749j1148j0559
$$ 583116 562366 542784 523606 505373 488878 474138 460668 448138 436389 425241 414682
62545D14682r819r221r092r021q232o738n429m878m752m486l954l238k324j313
$$ 414682 404863 395642 386550 377529 369297 362559 357130 352252 347500 343014 339060 335822 333498 332185
62531C32185n24m4M74J393K673L894M562M450L991M174N597P713R429J0355J0961
$$ 332185 331661 331617 332091 333484 336157 340051 344613 349063 353054 357228 362825 370538 379967 390322 401283
62516D01283J1668J2531J3747J5681J8243K0883K3451K6354K9659L2829L5593
$$ 401283 412951 425482 439229 454910 473153 494036 517487 543841 573500 606329 641922
62505F41922L8329M1127M3224M3895M3229M1452L8192L3155K6954K0411J3446
$$ 641922 680251 721378 764602 808497 851726 893178 931370 964525 991479 1011890 1025336
62494A025336N575k823j0640j7364k3329k8600l2531l4741l5828l6592l6984l6271
$$ 1025336 1030911 1028088 1017448 1000084 976755 948155 915624 880883 845055 808463 771479 735208
62482G35208l4106l1118k8364k6337k4560k2259j9339j6457j4098j2084j0181
$$ 735208 701102 669984 641620 615283 590723 568464 549125 532668 518570 506486 496305
62471D96305q664p780p099o042m760l791l048j949n19M22M13Qk2L97R28J528K405
$$ 496305 487641 479861 472762 466720 461960 458169 455121 453172 452653 453075 453488 453496 453474 453871 454799 456327 458732
62454D58732L534M604N413O058O729P482Q163Q531Q512Q256P903P378O573N550
$$ 458732 462266 466870 472283 478341 485070 492552 500715 509246 517758 526014 533917 541295 547868 553418
62440E53418M315K640L71k232m818p378r945j2096j3353j3935j4478j4994j4797
$$ 553418 557733 560373 560744 558512 553694 546316 536371 524275 510922 496987 482509 467515 452718
62427D52718j3586j1952j0585r548q598p657o692n566m362l415k770k059j154
$$ 452718 439132 427180 416595 407047 398449 390792 384100 378534 374172 370757 367987 365928 364774
62414C64774l73K05J043K381L724M620N317O089O544O399O392P390Q808R081P777
$$ 364774 364401 364606 365649 368030 371754 376374 381691 387780 394324 400723 407115 414505 423313 432394 440171
62399D40171O213N688N963O008N415M460L313K000Q91L71Pj208l455n504o005
$$ 440171 446384 452072 458035 464043 469458 473918 477231 479231 480122 480493 480500 479292 475837 470333 464328
62384D64328n101m203m211m549m142k813j284j35P64J818L276N178P347R378J1074
$$ 464328 459227 455024 450813 446264 442122 439309 438025 437890 438654 440472 443748 448926 456273 465651 476725
62369D76725J2923J5631J9153K2671K5700K8606L1844L5267L8631M2153M6038
$$ 476725 489648 505279 524432 547103 572803 601409 633253 668520 707151 749304 795342
62358G95342M9884N3139N5743N7636N8081N6261N2400M7427M1547L4012K4512
$$ 795342 845226 898365 954108 1011744 1069825 1126086 1178486 1225913 1267460 1301472 1325984
62347A325984J4100M404l668j0189j5711k0830k5912l0876l5316l8938m1684m3454
$$ 1325984 1340084 1344488 1340820 1330631 1314920 1294090 1268178 1237302 1201986 1163048 1121364 1077910
62335A077910m4004m3279m1558l9128l6149l2875k9807k7388k5735k4690k3853
$$ 1077910 1033906 990627 949069 909941 873792 840917 811110 783722 757987 733297 709444
62324G09444k2660k0799j8630j6766j5209j3363j1109r189q128p317n871m015
$$ 709444 686784 665985 647355 630589 615380 602017 590908 581719 573591 566274 560403 556388
62312E56388k836k703k776k280j567j391j701j794j442j176j360j708j952k423
$$ 556388 553552 550849 548073 545793 544226 542835 541134 539340 537898 536722 535362 533654 531702 529279
62298E29279l504m799n496n363m808m033k837j340j45N52J302K347K952K500J740
$$ 529279 525775 520976 515480 510117 505309 501276 498439 497099 496954 497506 498808 501155 504107 506607 508347
62283E08347J929L086M112M612N387O773P720P293O302O373P765R114R391R175
$$ 508347 510276 513362 517474 522086 527473 534246 541966 549259 555561 561934 569699 578813 588204 597379
62269E97379R693J1283J3340J5404J7612K0165K2918K5760K8889L2419L6017L9445
$$ 597379 607072 618355 631695 647099 664711 684876 707794 733554 762443 794862 830879 870324
62257H70324M3232M8070N3498N7950O0353O0991O0253N7357N1157M1881L1004
$$ 870324 913556 961626 1015124 1073074 1133427 1194418 1254671 1312028 1363185 1405066 1436070
62246A436070J9601P823l934j4454k2801k9239l4562l9121m2908m6033m8492m9857
$$ 1436070 1455671 1463494 1459560 1445106 1422305 1393066 1358504 1319383 1276475 1230442 1181950 1132093
62234A132093m9691m8073m5315m1600l7316l3286l0057k7114k3530j9236j5180
$$ 1132093 1082402 1034329 989014 947414 910098 876812 846755 819641 796111 776875 761695
62223G61695j2142j0000q219o599n243m163l256k613k471k760k859k155q58M9
$$ 761695 749553 739553 731334 724735 719492 715329 712073 709460 706989 704229 701370 699215 698357 698406
62209F98406l4n66o06n3M96R19J783L252M672N621O591Q097R827J1343J2976J5177
$$ 698406 698372 697806 697200 697147 697643 698562 700345 703597 708269 713890 720481 728578 738405 749748 762724 777901
62193G77901J7498J9132K0246K1763K3946K6103K7815K9480L1285L2450L1956
$$ 777901 795399 814531 834777 856540 880486 906589 934404 963884 995169 1027619 1059575
62182A059575K9669K6265K2400J8285J3928R476N370K196K69n10k57J240M110
$$ 1059575 1089244 1115509 1137909 1156194 1170122 1179598 1184968 1187164 1187433 1186923 1186666 1187906 1192016
62169A192016P843J1607J5116J8698K2562K6400K9734L2092L2861L1567K8459
$$ 1192016 1199859 1211466 1226582 1245280 1267842 1294242 1323976 1356068 1388929 1420496 1448955
62158A448955K4311J9534J4064Q244L103o30l271n634q187j1055j4262j7431j9706
$$ 1448955 1473266 1492800 1506864 1515108 1518211 1517581 1514310 1508676 1500489 1489434 1475172 1457741 1438035
62145A438035k0536k0241j9472j8416j6966j5257j3432j1282q672o089m174k921
$$ 1438035 1417499 1397258 1377786 1359370 1342404 1327147 1313715 1302433 1293761 1287672 1283498 1280577
62133A280577j908j066n76j89N57J528K142K454L244M904O895Q674J0444J2574
$$ 1280577 1278669 1277603 1277027 1276838 1277395 1278923 1281065 1283519 1286763 1291667 1298562 1307236 1317680 1330254
62119A330254J4856J6844J8535K0147K1550K2426K2852K3205K3615K3910K4056
$$ 1330254 1345110 1361954 1380489 1400636 1422186 1444612 1467464 1490669 1514284 1538194 1562250
62108A562250K4285K4729K5258K5716K6138K6734K7721K9092L0520L1729L3028
$$ 1562250 1586535 1611264 1636522 1662238 1688376 1715110 1742831 1771923 1802443 1834172 1867200
62097A867200L5077L7925M0725M2848M4735M6931M8630M8196M5304M1695L9428
$$ 1867200 1902277 1940202 1980927 2023775 2068510 2115441 2164071 2212267 2257571 2299266 2338694
62086B338694L9081M0086M1975M4609M7511M9826N0911N0531M8731M5979M3326
$$ 2338694 2377775 2417861 2459836 2504445 2551956 2601782 2652693 2703224 2751955 2797934 2841260
62075B841260M1723M1185M1047M1014M1378M2208M3039M3605M4317M5559M6965
$$ 2841260 2882983 2924168 2965215 3006229 3047607 3089815 3132854 3176459 3220776 3266335 3313300
62064C313300M7783M7696M6836M5218M2674L9269L5390L1371K7259K3097J9120
$$ 3313300 3361083 3408779 3455615 3500833 3543507 3582776 3618166 3649537 3676796 3699893 3719013
62053C719013J5588J2471R463O283K932m09l739p301j1124j4629j7052j8246j8681
$$ 3719013 3734601 3747072 3756535 3762818 3765750 3765341 3761602 3754301 3743177 3728548 3711496 3693250 3674569
62040C674569j8672j8058j6823j5544j4772j4388j3931j3306j2651j1814j0537
$$ 3674569 3655897 3637839 3621016 3605472 3590700 3576312 3562381 3549075 3536424 3524610 3514073
62029C514073r085q081p699p557p426p576q287r432j0652j1516j1497j0373q782
$$ 3514073 3504988 3496907 3489208 3481651 3474225 3466649 3458362 3448930 3438278 3426762 3415265 3404892 3396110
62016C396110p806p643p221n512k732J21K468M405O143P914J0156J3123J6333
$$ 3396110 3388304 3380661 3373440 3367928 3365196 3365317 3367785 3372190 3378333 3386247 3396403 3409526 3425859
62003C425859J9023K1128K3228K5408K6841K6672K4830K1576J6754J0017J679
$$ 3425859 3444882 3466010 3489238 3514646 3541487 3568159 3592989 3614565 3631319 3641336 3643015
61992C643015p168j5490k3056l0251l7239m3434m7907n0300n1175n1280n0716
$$ 3643015 3635847 3620357 3597301 3567050 3529811 3486377 3438470 3388170 3336995 3285715 3234999
61981C234999m9192m6954m4889m3546m2482m0941l8854l6798l5212l4024l2965
$$ 3234999 3185807 3138853 3093964 3050418 3007936 2966995 2928141 2891343 2856131 2822107 2789142
61970B789142l1899l0799k9598k8176k6423k4486k2906k2238k2272k1956k0434
$$ 2789142 2757243 2726444 2696846 2668670 2642247 2617761 2594855 2572617 2550345 2528389 2507955
61959B507955j8009j5707j4087j2899j1764j0584r289p721n982m358k680k80L129
$$ 2507955 2489946 2474239 2460152 2447253 2435489 2424905 2415616 2407895 2401913 2397555 2394875 2394595 2397724
61946B397724O953J0557J4111J8107K2344K5969K8484L0107L1201L1933L2589
$$ 2397724 2404677 2415234 2429345 2447452 2469796 2495765 2524249 2554356 2585557 2617490 2650079
61935B650079L3640L5139L6446L6936L6693L6155L5255L3413L0484K7381K5401
$$ 2650079 2683719 2718858 2755304 2792240 2828933 2865088 2900343 2933756 2964240 2991621 3017022
61924C017022K5014K5580K6319K7450L0130L5402M3456N3940O6606Q1387R8096
$$ 3017022 3042036 3067616 3093935 3121385 3151515 3186917 3230373 3284313 3350919 3432306 3530402
61913C530402J16473J36481J58256J81760K06827K33593K62620K94462L29425
$$ 3530402 3646875 3783356 3941612 4123372 4330199 4563792 4826412 5120874 5450299
61904E450299L67940M10827M58748N11243N66372O21009O71027P10955P33630
$$ 5450299 5818239 6229066 6687814 7199057 7765429 8386438 9057465 9768420 10502050
61895A0502050P30629O93630O16398M96954L39447J54705m1430k31678m01093
$$ 10502050 11232679 11926309 12542707 13039661 13379108 13533813 13492383 13260705 12859612
61886A2859612n39375o41363p06568p38246p41977p24123o90839o47700n99319
$$ 12859612 12320237 11678874 10972306 10234060 9492083 8767960 8077121 7429421 6830102
61877F830102n48867m98241m48913m02345l59502l20454k84940k53010k24710
$$ 6830102 6281235 5782994 5334081 4931736 4572234 4251780 3966840 3713830 3489120
61868C489120j99513j76634j55849j37381j21030j05963r1527p7786o5118n3537
$$ 3489120 3289607 3112973 2957124 2819743 2698713 2592750 2501223 2423437 2358319 2304782
61858B304782m2590l1691k0600r739J05Q666J6543K4277L1288L6385L9150M0124
$$ 2304782 2262192 2230501 2209901 2200162 2200267 2208933 2225476 2249753 2281041 2317426 2356576 2396700
61846B396700L9645L7288L2725K6366J8879J0666K195n746j2441j7513k0540k1020
$$ 2396700 2436345 2473633 2506358 2532724 2551603 2562269 2564464 2558718 2546277 2528764 2508224 2487204
61834B487204j9040j5370j0509m278L144J0475J6280K0165K2255K2043J8692J2372
$$ 2487204 2468164 2452794 2442285 2438007 2441151 2451626 2467906 2488071 2510326 2532369 2551061 2563433
61822B563433M382m073j2656k1388l0001l7849m4105m8011m9374m8761m6956m4308
$$ 2563433 2567815 2563742 2551086 2529698 2499697 2461848 2417743 2369732 2320358 2271597 2224641 2180333
61810B180333m0816l6494l1259k4782j7091r045j643N054J1702J8652K5782L3147
$$ 2180333 2139517 2103023 2071764 2046982 2029891 2020846 2019203 2024257 2035959 2054611 2080393 2113540
61798B113540M0942M8820N6105O2850O9972P8080Q6810R5544J04269J13518J24034
$$ 2113540 2154482 2203302 2259407 2322257 2392229 2470309 2557119 2652663 2756932 2870450 2994484
61787B994484J36669J51956J69458J88202K08176K30928K58160K90228L26541
$$ 2994484 3131153 3283109 3452567 3640769 3848945 4079873 4338033 4628261 4954802
61778D954802L67181M13415M66711N27814N97009O74768P61690Q57571R60445
$$ 4954802 5321983 5735398 6202109 6729923 7326932 8001700 8763390 9620961 10581406
61769A0581406J066431J170020J263900J337988J378945J371494J301361J158720
$$ 10581406 11647837 12817857 14081757 15419745 16798690 18170184 19471545 20630265
61761B0630265R41399O57371L25228k8518l74394o85157r39992j127521j246584
$$ 20630265 21571664 22229035 22554263 22525745 22151351 21466194 20526202 19398681 18152097
61752A8152097j303926j310172j276846j215266j135813j046866r54520q63361
$$ 18152097 16848171 15537999 14261153 13045887 11910074 10863208 9908688 9045327
61744I045327p76866o96849o23479n56457m95960m42194l94756l52904l15962
$$ 9045327 8268461 7571612 6948133 6391676 5895716 5453522 5058766 4705862 4389900
61735D389900k83025k52935k25118j99989j77921j58280j40127j23451j08903
$$ 4389900 4106875 3853940 3628822 3428833 3250912 3092632 2952505 2829054 2720151
61726B720151r6589q5974p6907o9908o5300o2632o1137o0279n9742n9342n9076
$$ 2720151 2623562 2537588 2460681 2390773 2325473 2262841 2201704 2141425 2081683 2022341 1963265
61715A963265n8791n7780n5191n1103m6747m3293m0712l8217l5506l3052l1138
$$ 1963265 1904474 1846694 1791503 1740400 1693653 1650360 1609648 1571431 1535925 1502873 1471735
61704A471735k9253k6789k4008k1833k0726k0309k0109k0108k0271k0060j9051
$$ 1471735 1442482 1415693 1391685 1369852 1349126 1328817 1308708 1288600 1268329 1248269 1229218
61693A229218j7722j6945j6815j6627j6019j5367j4954j4426j3434j2212j1169
$$ 1229218 1211496 1194551 1177736 1161109 1145090 1129723 1114769 1100343 1086909 1074697 1063528
61682A063528j0334r591r049q832q706q277p403o277n281m786m788m739m166l418
$$ 1063528 1053194 1043603 1034554 1025722 1017016 1008739 1001336 995059 989778 984992 980204 975465 971299 967881
61668I67881l195l422l345k859k822l690m710n088n059n137n109m594l971l766
$$ 967881 964686 961264 957919 955060 952238 948548 943838 938750 933691 928554 923445 918851 914880 911114
61654I11114l620k806j389mJ294K930M806O296P153P566P450O481M978L794L273
$$ 911114 907494 904688 903299 903295 904589 907519 912325 918621 925774 933340 940790 947271 952249 956043 959316
61639I59316K919K279J535J149J419K452M079N810P344Q978J1075J3302J4995
$$ 959316 962235 964514 966049 967198 968617 971069 975148 980958 988302 997280 1008355 1021657 1036652
61626A036652J5933J6161J5345J3168J0086O735K891j991p359j1876j5143j7802
$$ 1036652 1052585 1068746 1084091 1097259 1107345 1114080 1116971 1114980 1107621 1095745 1080602 1062800
61614A062800j9910k0641j9950j9108j8871j8380j6771j4777j3663j3415j3096
$$ 1062800 1042890 1022249 1002299 983191 964320 945940 929169 914392 900729 887314 874218
61603H74218j2366j1597j0856r819q532p430o732o389o363o434o020m800l237
$$ 874218 861852 850255 839399 829580 821048 813618 806886 800497 794134 787700 781680 776880 773643
61590G73643j894o02J028K645L515L627L684M123M831N704O852Q219R620J1138
$$ 773643 771749 771147 772175 774820 778335 781962 785646 789769 794600 800304 807156 815375 824995 836133
61576H36133J2990J5053J7026J8890K0686K2153K3183K4375K6312K8473K9829
$$ 836133 849123 864176 881202 900092 920778 942931 966114 990489 1016801 1045274 1075103
61565A075103L0386L1119L2257L2833L2244L1116L0026K8529K6324K4417K3897
$$ 1075103 1105489 1136608 1168865 1201698 1233942 1265058 1295084 1323613 1349937 1374354 1398251
61554A398251K4119K3446K1594J9892J9159J8577J7174J5236J3549J1987R764
$$ 1398251 1422370 1445816 1467410 1487302 1506461 1525038 1542212 1557448 1570997 1582984 1592748
61543A592748O600K753j690o668j1404j4846j6982j8849k0971k2584k2855k2050
$$ 1592748 1599348 1602101 1600411 1593743 1582339 1567493 1550511 1531662 1510691 1488107 1465252 1443202
61531A443202k0849j9175j6567j3326j0346p827n057j588K158N676R117J2872
$$ 1443202 1422353 1403178 1386611 1373285 1362939 1355112 1350055 1348467 1350625 1356301 1365418 1378290
61519A378290J6909K0988K5251L0175L6134M3056N0500N7980O5556P4017Q4183
$$ 1378290 1395199 1416187 1441438 1471613 1507747 1550803 1601303 1659283 1724839 1798856 1883039
61508A883039R6020J08886J22551J37432J53750J71183J89492K08699K28157K46059
$$ 1883039 1979059 2087945 2210496 2347928 2501678 2672861 2862353 3071052 3299209 3545268
61498C545268K60370K69623K72308K66148K48977K20279J81331J34294Q1931K7902
$$ 3545268 3805638 4075261 4347569 4613717 4862694 5082973 5264304 5398598 5480529 5508431
61488E508431k3816p0275j10030j42380j66756j82967j91539j93504j90097j82654
$$ 5508431 5484615 5414340 5304310 5161930 4995174 4812207 4620668 4427164 4237067 4054413
61478D054413j72522j60800j48205j34980j20873j05601q9693p4517o1008m8664
$$ 4054413 3881891 3721091 3572886 3437906 3317033 3211432 3121739 3047222 2986214 2937550
61468B937550l6348k3850j1953j141Q914J8516K7337L4910M1183M6407N0836N4654
$$ 2937550 2901202 2877352 2865399 2864258 2873172 2891688 2919025 2953935 2995118 3041525 3092361 3147015
61456C147015N7770N9629N9785N8661N7213N5814N4142N2227N0810N0405N0766
$$ 3147015 3204785 3264414 3324199 3382860 3440073 3495887 3550029 3602256 3653066 3703471 3754237
61445C754237N1601N3078N5095N6679N6783N5288N2772M9690M6227M2511L8362
$$ 3754237 3805838 3858916 3914011 3970690 4027473 4082761 4135533 4185223 4231450 4273961 4312323
61434D312323L3267K7128K0711J4799R277L649k054p655j3734k1080k9208l6436
$$ 4312323 4345590 4372718 4393429 4408228 4417505 4421154 4419100 4411445 4397711 4376631 4347423 4310987
61422D310987m1565m4805m6739m7292m6201m3831m0838l7298l2804k7402k1891
$$ 4310987 4269422 4224617 4177878 4130586 4084385 4040554 3999716 3962418 3929614 3902212 3880321
61411C880321j7093j3089r372n723k778j526k245m201o586r426j3162j7544k1531
$$ 3880321 3863228 3850139 3840767 3835044 3832266 3830740 3828495 3824294 3817708 3808282 3795120 3777576 3756045
61398C756045k4298k5809k6233k5339k2736j8260j1716k705Q773K1829L5357M9282
$$ 3756045 3731747 3705938 3679705 3654366 3631630 3613370 3601654 3598949 3607722 3629551 3664908 3714190
61386C714190O4607Q2256J02177J23669J46092J68975J91861K14378K36396K57536
$$ 3714190 3778797 3861053 3963230 4086899 4232991 4401966 4593827 4808205 5044601 5302137
61376E302137K76391K90511K97381K95319K83396K60948K27769J84930J35104
$$ 5302137 5578528 5869039 6166420 6461739 6745135 7006083 7233852 7418782 7553886
61367G553886Q1802K8431k2144o7837j07727j42099j71689j96792k17239k32909
$$ 7553886 7635688 7664119 7641975 7574138 7466411 7324312 7152623 6955831 6738592 6505683
61357F505683k43861k50077k51561k48761k42640k34267k24513k13902k02424
$$ 6505683 6261822 6011745 5760184 5511423 5268783 5034516 4810003 4596101 4393677
61348D393677j89652j75582j61173j47539j34754j22161j09798r8490q8293p7946
$$ 4393677 4204025 4028443 3867270 3719731 3584977 3462816 3353018 3254528 3166235 3088289
61338C088289o6493n4626m3620l3547k3517j3198l121O294J5058K3029K9856L5552
$$ 3088289 3021796 2967170 2923550 2890003 2866486 2853288 2850167 2856461 2871519 2894548 2924404 2959956
61326B959956M0374M4174M6593M7911M8750M8924M7485M4268M0492L7341L4745
$$ 2959956 3000330 3044504 3091097 3139008 3187758 3236682 3284167 3328435 3368927 3406268 3441013
61315C441013L2107K9464K7154K4952K2352J9479J6871J4499J1636P740K962k279
$$ 3441013 3473120 3502584 3529738 3554690 3577042 3596521 3613392 3627891 3639527 3647267 3650229 3647950
61303C647950p783j3539j9433k5035k9742l3324l6391l9899m3981m7720n0349
$$ 3647950 3640167 3626628 3607195 3582160 3552418 3519094 3482703 3442804 3398823 3351103 3300754
61292C300754n2155n3695n4675n4403n2971n1007m8432m4471l9054l3288k8135
$$ 3300754 3248599 3194904 3140229 3085826 3032855 2981848 2933416 2888945 2849891 2816603 2788468
61281B788468k3384j8449j3556r421o262l798k137j873l212n429p417q534q722
$$ 2788468 2765084 2746635 2733079 2723658 2717396 2713598 2711461 2709588 2706376 2700947 2693530 2684996 2676274
61268B676274q125o841m997k775k92K336M759O390O931O872P234Q773J1635J5791
$$ 2676274 2668149 2661308 2656311 2653536 2653244 2655580 2660339 2666729 2673660 2680532 2687766 2696539 2708174 2723965
61254B723965K1484K9045L8470M9387O1303P3778Q6479R9191J11436J21912J28688
$$ 2723965 2745449 2774494 2812964 2862351 2923654 2997432 3083911 3183102 3294538 3416450 3545138
61243C545138J30182J25624J14442R5822O9634L7393J659l5282p1479j04461j31523
$$ 3545138 3675320 3800944 3915386 4011208 4080842 4118235 4119894 4084612 4013133 3908672 3777149
61232C777149j51177j63582j69424j69189j63849j55299j45414j35080j24531
$$ 3777149 3625972 3462390 3292966 3123777 2959928 2804629 2659215 2524135 2399604
61223B399604j14100j04000r3948q3728p3866o5146n7633n0853m4696l9482l5146
$$ 2399604 2285504 2181504 2087556 2003828 1929962 1864816 1807183 1756330 1711634 1672152 1637006
61212A637006l0999k6504k1834j7456j3518r755n783j379L294P717J1451J4599
$$ 1637006 1606007 1579503 1557669 1540213 1526695 1516940 1511157 1509778 1513072 1520789 1532240 1546839
61200A546839J7500K0101K1887K2554K2258K1067J8691J5169J1502Q905P496O209
$$ 1546839 1564339 1584440 1606327 1628881 1651139 1672206 1690897 1706066 1717568 1726473 1733969 1740178
61188A740178M183J700n42k586n064q127j1200j3859j6347j8961k1430k3293k4525
$$ 1740178 1744361 1746061 1745519 1742933 1737869 1729742 1718542 1704683 1688336 1669375 1647945 1624652 1600127
61175A600127k5375k5891k6090k6398k7359k8933l0474l1415l1637l1252l0472
$$ 1600127 1574752 1548861 1522771 1496373 1469014 1440081 1409607 1378192 1346555 1315303 1284831
61164A284831k9700k9309k9247k9104k8545k7392k5449k2793k0147j8385j7589
$$ 1284831 1255131 1225822 1196575 1167471 1138926 1111534 1086085 1063292 1043145 1024760 1007171
61153A007171j7104j6591j6513j7369j9015k0899k2530k3501k3555k2859k1855
$$ 1007171 990067 973476 956963 939594 920579 899680 877150 853649 830094 807235 785380
61142G85380k0642j8948j6771j4504j2253r750p118n077l910k924j378N81K374
$$ 785380 764738 745790 729019 714515 702262 692512 685394 680317 676407 673483 672105 672686 675060
61129F75060L816M932N583N894O575Q104R924J1120J1538J1634J1662J1659J1886
$$ 675060 678876 683808 689391 695285 701860 709964 719888 731008 742546 754180 765842 777501 789387
61116G89387J2499J3067J3170J3129J3404J3562J2802J1247R752Q513O895M679
$$ 789387 801886 814953 828123 841252 854656 868218 881020 892267 902019 910532 917427 922106
61104I22106K417L10k180n192p740q790q527p983p808p842p636p030o312n972
$$ 922106 924523 924833 922653 917461 909721 900931 892404 884421 876613 868771 861135 854105 847793 841821
61090H41821o194o678p162p912r266j0828j1783j2005j2176j2691j3120j3002
$$ 841821 835627 828949 821787 813875 804609 793781 781998 769993 757817 745126 732006 719004
61078G19004j2490j1832j0812r169p315o044n677n735n426m325k738j362n23J38
$$ 719004 706514 694682 683870 674701 667386 661342 655665 649930 644504 640179 637441 636079 635556 635694
61064F35694R36J542J560J407J802K591K918K595K373K700L118L209L202L268
$$ 635694 636630 638172 639732 641139 642941 645532 648450 651045 653418 656118 659236 662445 665647 668915
61050F68915L091K655K610L275M036M348M572N109N510N347N210N866O965P578
$$ 668915 672006 674661 677271 680546 684582 688930 693502 698611 704121 709468 714678 720544 727509 735087
61036G35087P637P752Q015Q161Q664J0352J2896J4875J5605J5783J6098J6303
$$ 735087 742724 750476 758491 766652 775316 785668 798564 813439 829044 844827 860925 877228
61024H77228J6167J6238J6912J7531J7265J6322J5541J5214J5062J5091J5631
$$ 877228 893395 909633 926545 944076 961341 977663 993204 1008418 1023480 1038571 1054202
61013A054202J6613J7688J8990K1175K4415K8076L1629L5409L9972M5053M9723
$$ 1054202 1070815 1088503 1107493 1128668 1153083 1181159 1212788 1248197 1288169 1333222 1382945
61002A382945N3453N6507N9339O2169O5468P0358P7965Q8417J00894J14572J29038
$$ 1382945 1436398 1492905 1552244 1614413 1679881 1750239 1828204 1916621 2017515 2132087 2261125
60991B261125J43832J58354J72830J89172K10396K39215K77412L26567L89000
$$ 2261125 2404957 2563311 2736141 2925313 3135709 3374924 3652336 3978903 4367903
60982D367903M68044N67735O92522Q47300J037547J269451J550007J885038K269591
$$ 4367903 4835947 5403682 6096204 6943504 7981051 9250502 10800509 12685547 14955138
60973A4955138K667095K988156L097236K869000K274115J430817N68667p9817
$$ 14955138 17622233 20610389 23707625 26576625 28850740 30281557 30850224 30770407
60965C0770407l81573l34467l5556L59857O63118O88708L26544l86268j264197
$$ 30770407 30388834 30054367 30018811 30378668 31041786 31730494 32057038 31670770 30406573
60956C0406573k064118k606105k837368k810197k616982k340161k036878j742495
$$ 30406573 28342455 25736350 22898982 20088785 17471803 15131642 13094764 11352269
60948A1352269j475680j242621j042640q73058p30594o11298n11638m29760l64748
$$ 11352269 9876589 8633968 7591328 6718270 5987676 5376378 4864740 4434980 4070232
60939D070232l14769k76565k46445k21360j99411j79992j63223j48748j35301
$$ 4070232 3755463 3478898 3232453 3011093 2811682 2631690 2468467 2319719 2184418
60930B184418j21863j08861r7551q8477q1278p5741p2118p0192o8899o7246o4943
$$ 2184418 2062555 1953694 1856143 1767666 1686388 1610647 1538529 1468337 1399438 1332192 1267249
60919A267249o1853n7615n2369m7253m3284m0090l6563l2597k9225k6910k4727
$$ 1267249 1205396 1147781 1095412 1048159 1004875 964785 928222 895625 866400 839490 814763
60908H14763k1751j8534j6373j5491j4872j3829j2820j2357j1838j0279p856n895
$$ 814763 793012 774478 758105 742614 727742 713913 701093 688736 676898 666619 658763 652868
60896F52868n185n014m295l035j999j281j01J784L430L986L970M482N528O023
$$ 652868 647683 642669 638374 635339 633340 632059 631958 633742 637172 641158 645128 649610 655138 661161
60882F61161N396M229L199K178P96p67k119l268m369n290n939o652p640q381q244
$$ 661161 666557 670786 673985 676163 676959 676192 674073 670805 666436 661146 655207 648555 640915 632534 624290
60867F24290p463o794o379n718m766m172m180m060l032j215P00K226L171L480
$$ 624290 616827 610033 603654 597936 593170 588998 584818 580758 577726 576511 577211 579437 582608 586088
60853E86088L451L812N094P099R287J1380J3237J4536J5171J5753J7106J9155
$$ 586088 589539 593351 598445 605544 614831 626211 639448 653984 669155 684908 702014 721169
60841G21169K0823K1098J9844J7531J4694J1818R400P711O620N903N535N509N406
$$ 721169 741992 763090 782934 800465 815159 826977 836377 844088 850708 856611 862146 867655 873061
60828H73061M568K735L27k010l865n015n211m502l594l365l859m293m214m178
$$ 873061 877629 880364 880691 878681 874816 869801 864590 860088 856494 853129 849270 844977 840763 836585
60814H36585m836n892o604p010p804r090j0110j0371j0280j0251r933q883p554
$$ 836585 831749 825857 819253 812243 804439 795349 785239 774868 764588 754337 744404 735521 727967
60801G27967o871p054p398p181o374n371m397l278j681L66K242L234L419L752
$$ 727967 721096 714042 706644 699463 693089 687718 683321 680043 678362 678728 680970 684204 687623 691375
60787F91375N074P226R339J0726J1217J0940J0240R685R717J0200J0570J0380
$$ 691375 696449 703675 713014 723740 734957 745897 756137 765822 775539 785739 796309 806689
60775H06689R567Q320O995O048N806O182O766P157P165O798O222N665N230M936
$$ 806689 816256 824576 831571 837619 843425 849607 856373 863530 870695 877493 883715 889380 894610 899546
60761H99546M873N032N008M245K834J567R79P28K92j58j11L66O94O50N45O00O39
$$ 899546 904419 909451 914459 918704 921538 923105 924084 924812 925104 924946 924835 925201 925895 926545 927090 927690 928329
60744I28329M29j31j138k557l938m768n160n771o905q118q780q643p814o579n458
$$ 928329 928758 928627 927489 924932 920994 916226 911066 905295 898390 890272 881492 872849 865035 858456 852998
60729H52998m979n097n132m529l454k501k045k109k509k942l121l068l105l411
$$ 852998 848019 842922 837790 833261 829807 827306 825261 823152 820643 817701 814580 811512 808407 804996
60715H04996l773l932l924l843l527k858k229k295l132l952l836k616j012Qp4
$$ 804996 801223 797291 793367 789524 785997 783139 780910 778615 775483 771531 767695 765079 764067 764075 764001
60700G64001j052k147k521j930r97p03j422k593l459l965m646n725o755p262p406
$$ 764001 762949 760802 758281 756351 755354 754651 753229 750636 747177 743212 738566 732841 726086 718824 711418
60685G11418p713q400r207r737r771r343q789q518q555q440p753o617n442m376
$$ 711418 703705 695305 686098 676361 666590 657247 648458 639940 631385 622945 615192 608575 603133 598757
60671E98757l338k412j806j410q18J32J148J967K731L672M586M945M560L956L842
$$ 598757 595419 593007 591201 589791 588973 589105 590253 592220 594951 598623 603209 608154 612714 616670 620512
60656F20512M277M594M364M086M545N581O124N563M598M359N112O183O748O329
$$ 620512 624789 629383 633747 637833 642378 647959 654083 659646 664244 668603 673715 679898 686646 692975
60642F92975M942L327K688L558M990N608N333N441O810Q768J0039J0257J0147
$$ 692975 697917 701244 703932 707490 712480 718088 723421 728862 735672 744440 754479 764736 774883
60629G74883J0446J1156J1804J2104J2150J2009J1410J0136Q552P315O398M906
$$ 774883 785329 796485 808289 820393 832543 844552 855962 866098 874650 881965 888363 893269
60617H93269K177j248m134n726o158o039o088o762p710p904o822n217m136l557
$$ 893269 895446 894198 890064 884338 878180 872141 866053 859291 851581 843677 836855 831638 827502 823945
60603H23945k715j496o15n66j223k411l996n401n975n967o274p067p504o969n748
$$ 823945 821230 819734 819119 818553 817330 814919 810923 805522 799547 793580 787306 780239 772735 765766 760018
60588G60018m240k468o73O33J613L118N149O405O122N367N424N760M914K909J367
$$ 760018 755778 753310 752637 753270 754883 758001 763150 769555 775677 781044 786468 792228 797142 800051 801418
60573H01418J237J678J504P15J18R4K45m1j021k411l646m377m675m749m730m949
$$ 801418 802655 804333 805837 806552 806670 806764 807009 806968 805947 803536 799890 795513 790838 786089 781359 776410
60557G76410n887p396q327p698n986m567l917l169j614K29J445K042K868M545
$$ 776410 770523 763127 754800 747102 741116 736549 732632 729463 727849 728078 729523 731565 734433 738978
60543G38978O955R706J2649J5919J9728K4191K9192L4356L9168M3152M5929M7008
$$ 738978 745933 755639 768288 784207 803935 828126 857318 891674 930842 973994 1019923 1066931
60531A066931M5671M1233L3580K3371J1592r38j3316k4066l1569l5177l5598l3837
$$ 1066931 1112602 1153835 1187415 1210786 1222378 1221440 1208124 1184058 1152489 1117312 1081714 1047877
60519A047877l0274k5041j8884j2914p655k920J395M933P360Q803R620J0049J0222
$$ 1047877 1017603 992562 973678 960764 953109 950189 951584 956517 963877 972680 982300 992349 1002571
60506A002571J0258J0243J0348J1079J3102J6627K1150K6039L1252L7344M4815
$$ 1002571 1012829 1023072 1033420 1044499 1057601 1074228 1095378 1121417 1152669 1190013 1234828
60495A234828N3645O3465P4046Q5446R7681J10437J23264J36159J49887J65643
$$ 1234828 1288473 1351938 1425984 1511430 1609111 1719548 1842812 1978971 2128858 2294501
60485B294501J84540K07334K34414K65526K99104L31477L56634L67048L55605
$$ 2294501 2479041 2686375 2920789 3186315 3485419 3816896 4173530 4540578 4896183
60476D896183L17824K53243J65614O2243m7122j51937k42678l12266l56881l76436
$$ 4896183 5214007 5467250 5632864 5695107 5647985 5496048 5253370 4941104 4584223 4207787
60466D207787l74600l57593l31869l02131k71038k40150k10815j84237j61126
$$ 4207787 3833187 3475594 3143725 2841594 2570556 2330406 2119591 1935354 1774228
60457A774228j41475j24650j09802r6344q4108p3117o3393n4967m7845m1834l6521
$$ 1774228 1632753 1508103 1398301 1301957 1217849 1144732 1081339 1026372 978527 936693 900172
60446I00172l1640k7280k3691k0938j8841j7119j5556j4168j3217j2895j2985
$$ 900172 868532 841252 817561 796623 777782 760663 745107 730939 717722 704827 691842
60435F91842j2979j2574j1853j0978j0023r129q492q091p659o997o066m831l392
$$ 691842 678863 666289 654436 643458 633435 624306 615814 607723 600064 593067 587001 582170 578778
60422E78778k241j914k209k264j544l63P56J686K427K838K948L075L258L114K580
$$ 578778 576537 574623 572414 570150 568606 568243 568999 570685 573112 575950 578898 581973 585231 588345 590925
60407E90925K284K612L009K829K410K533L226L890M344M853N305N226M724M590
$$ 590925 593209 595821 598830 601659 604069 606602 609828 613718 618062 622915 628220 633446 638170 642760
60393F42760N257O233O762O580N849M902M122L719L411K757J786R78N86L46o6
$$ 642760 648017 654250 661012 667592 673441 678343 682465 686184 689595 692352 694138 695116 695702 696048 695982
60378F95982p71j795l048m076m355l888l135k335j368k94N14R58J395K032K575
$$ 695982 695211 693416 690368 686292 681937 678049 674914 672579 671211 670917 671431 672389 673784 675816 678391
60363F78391K730K607K468K435K650L244L944M127L628L090L192L847M603N435
$$ 678391 681121 683728 686196 688631 691281 694525 698469 702596 706224 709314 712506 716353 720956 726391
60349G26391O595P857Q486Q128P256O610O424O442O451O466O328N527L715J291
$$ 726391 732986 740843 749329 757457 764713 771323 777747 784189 790640 797106 803434 808961 812676 813967
60335H13967q56k295l369m412n079m817l650k031j53K041M235N754O258N940M932
$$ 813967 813111 810816 807447 803035 797956 793139 789489 787458 787305 789346 793581 799335 805593 811533 816465
60320H16465L123P32j458k803l399l738m063m373m679m930m927m629m320m188
$$ 816465 819588 820320 818862 816059 812660 808922 804859 800486 795807 790877 785950 781321 777001 772813
60306G72813l927l154k072j296j126j250j231r39m47J73Q60J489J999K505L109
$$ 772813 768886 765732 763660 762364 761238 759988 758757 757818 757371 757544 758404 759893 761892 764397 767506
60291G67506L661L858L649L324L082K751K152J621J742K551L373L640L502L395
$$ 767506 771167 775025 778674 781998 785080 787831 789983 791604 793346 795897 799270 802910 806412 809807
60277H09807L385L325L325L562L793L558K928K579L055M263N744P125Q246R100
$$ 809807 813192 816517 819842 823404 827197 830755 833683 836262 839317 843580 849324 856449 864695 873795
60263H73795R820J0632J1742J3256J5034J6625J7785J9171K1968K6263L0410L2831
$$ 873795 883615 894247 905989 919245 934279 950904 968689 987860 1009828 1036091 1066501 1099332
60251A099332L4182L6716M1524M7371N2573N7025O1858O7840P4821Q2305Q9879
$$ 1099332 1133514 1170230 1211754 1259125 1311698 1368723 1430581 1498421 1573242 1655547 1745426
60240A745426R7189J04072J10636J16848J22174J25949J27919J28093J26179J21568
$$ 1745426 1842615 1946687 2057323 2174171 2296345 2422294 2550213 2678306 2804485 2926053
60230B926053J13911J03529R1250P7981O4354N0492L6039K0625M433j1604k6145
$$ 2926053 3039964 3143493 3234743 3312724 3377078 3427570 3463609 3484234 3488667 3477063 3450918
60219C450918l8050m6817n2558n5633n6354n5018n1873m6818l9431k9644j8258
$$ 3450918 3412868 3366051 3313493 3257860 3201506 3146488 3094615 3047797 3008366 2978722 2960464
60208B960464o284O094J9454L3966M8822O3050P6461Q9402J01929J13506J23416
$$ 2960464 2954180 2960274 2979728 3013694 3062516 3125566 3202027 3291429 3393358 3506864 3630280
60197C630280J31054J35836J37036J33987J26466J15004J00605Q4101O5830M5973
$$ 3630280 3761334 3897170 4034206 4168193 4294659 4409663 4510268 4594369 4660199 4706172
60187D706172K4979L477j8016l8975n8705p6506r1765j03569j10663j12448j09767
$$ 4706172 4731151 4734628 4716612 4677637 4618932 4542426 4450661 4347092 4236429 4123981 4014214
60176D014214j04089r5994q5091p1306n5503l8753k1678m610J2270K9031M5605
$$ 4014214 3910125 3814131 3729040 3657734 3602231 3563478 3541800 3537190 3549460 3578491 3624096
60165C624096O1121P4309Q4611R2225R6971R7964R4661Q7403P6649O2595M5984
$$ 3624096 3685217 3759526 3844137 3936362 4033333 4131297 4225958 4313361 4390010 4452605 4498589
60154D498589K8465J1459m620j9515l2239m1803m8147n1546n1626m7777m0175
$$ 4498589 4527054 4538513 4533893 4514378 4482139 4440336 4392189 4340643 4289017 4241240 4201065
60143D201065k9556j6368r09J5983L3323N0957O9500Q9493J11186J34876J60642
$$ 4201065 4171509 4155141 4154232 4170215 4203538 4254495 4323995 4413488 4524674 4659550 4820192
60132D820192J87846K15680K44100K73477L03322L32172L58850L82949M03751
$$ 4820192 5008038 5223718 5467818 5741295 6044617 6376789 6735639 7118588 7522339
60123G522339M19423M27866M28120M20521M05709L83834L54684L18220K74862
$$ 7522339 7941762 8369628 8797748 9218269 9623978 10007812 10362496 10680716 10955578
60114A0955578K25276J70192J10610M8046j5903q0186j43913k05122k60630l07637
$$ 10955578 11180854 11351046 11461656 11509702 11493799 11413613 11269700 11064578 10803948 10496311
60104A0496311l44915l72015l88031l92193l85310l69589l46993l18628k85569
$$ 10496311 10151396 9779381 9391350 8999157 8613847 8244258 7897265 7578637 7293068
60095G293068k49249k10697j70343j28949q8086m9152j2481K2027N3789Q1515
$$ 7293068 7043819 6833122 6662779 6533830 6445744 6396592 6384111 6406138 6459927 6541442
60085F541442J03936J20154J29473J31578J26838J16045R9855P8834N4074K7426
$$ 6541442 6645378 6765532 6895005 7026583 7153421 7269466 7369321 7448155 7502229 7529655
60075G529655Q09k4602m8472p0762r1342j10042j26814j41730j54964j66768j77098
$$ 7529655 7530464 7505862 7457390 7386628 7295286 7185244 7058430 6916700 6761736 6594968 6417870
60064F417870j85050j89121j88580j84341j77863j69408j58112j43839j27960
$$ 6417870 6232820 6043699 5855119 5670778 5492915 5323507 5165395 5021556 4893596
60055D893596j11952r5987p9439o2022m3793k4613m433J6195L6529N6295P5355
$$ 4893596 4781644 4685657 4606218 4544196 4500403 4475790 4471357 4487552 4524081 4580376 4655731
60044D655731R3171J09237J23568J35863J44569J47688J44553J35964J22747J05060
$$ 4655731 4748902 4858139 4981707 5117570 5262139 5409827 5554380 5690344 5813091 5918151
60034E918151Q3198N8116L0955K726k5433n2393p7684j01338j22877j41000j54441
$$ 5918151 6001349 6059465 6090420 6093146 6067713 6015320 5937636 5836298 5713421 5572421 5417980
60023E417980j62629j65452j63190j56796j47581j36226j22718j07356r1100p4654
$$ 5417980 5255351 5089899 4926709 4769913 4622332 4486106 4363388 4256032 4164932 4090278
60013D090278n7931m0782k3515o131J2132L1784N2167P2278R2171J12677J33913
$$ 4090278 4032347 3991565 3968050 3961919 3974051 4005835 4058002 4130280 4222451 4335128 4469041
60002D469041J54796J73964J90536K03709K12171K14323K09187J97018J79044
$$ 4469041 4623837 4797801 4988337 5192046 5404217 5618540 5827727 6024745 6203789
59993F203789J56517J30111J00399O8589L6173L770k8939o1782r3213j21395j45508
$$ 6203789 6360306 6490417 6590816 6659405 6695578 6699348 6670409 6608627 6515414 6394019 6248511
59982F248511j65249j79532j86751j86489j80057j69074j54142j35347j13469
$$ 6248511 6083262 5903730 5716979 5530490 5350433 5181359 5027217 4891870 4778401
59973D778401r0044o6349m2888j9911K034K2419M1306N9276P6653R2957J07222
$$ 4778401 4688357 4622008 4579120 4559209 4561243 4583662 4624968 4684244 4760897 4853854 4961076
59962D961076J18636J26749J31270J31909J28577J21628J11865J00210Q7262P3185
$$ 4961076 5079712 5206461 5337731 5469640 5598217 5719845 5831710 5931920 6019182 6092367
59952F092367N8194M3159K9378J7622P815l2n002n875k247N562J7491L3934N5014
$$ 6092367 6150561 6193720 6223098 6240720 6248535 6248503 6243501 6237626 6235379 6240941 6258432 6292366 6347380
59939F347380Q0464J10288J44738J83306K24472K66943L10381L54234L96398M33788
$$ 6347380 6427844 6538132 6682870 6866176 7090648 7357591 7667972 8022206 8418604 8852392
59929H852392M63900M84886M94221M88320M63907M19437L55201K73013J76414
$$ 8852392 9316292 9801178 10295399 10783719 11247626 11667063 12022264 12295277 12471691
59920A2471691P0905l6932j40829k35525l16656l80969m27037m55409m67655m65469
$$ 12471691 12542596 12505664 12364835 12129310 11812654 11431685 11004648 10549239 10081584 9616115
59910I616115m50933m27065l97139l63235l26028k86196k45312k04931j65423
$$ 9616115 9165182 8738117 8340978 7977743 7651715 7365519 7120207 6915276 6749853
59901F749853j26422q8028n0749j4508K1403N7195R2030J24693J54227J79720
$$ 6749853 6623431 6535403 6484654 6470146 6491549 6548744 6640774 6765467 6919694 7099414
59891G099414K00051K14089K20658K18106K04508J78838J41733R5008M0832j8267
$$ 7099414 7299465 7513554 7734212 7952318 8156826 8335664 8477397 8572405 8613237 8594970
59881H594970p9140j38351j92890k40373k78909l07210l24939l32781l32093l24520
$$ 8594970 8515830 8377479 8184589 7944216 7665307 7358097 7033158 6700377 6368284 6043764
59871F043764l11687k95058k75950k55390k33794k11052j87379j63961j42268
$$ 6043764 5732077 5437019 5161069 4905679 4671885 4460833 4273454 4109493 3967225
59862C967225j22705j04552q7330p1642n8441m8115m0695l6396l5322l6699l8954
$$ 3967225 3844520 3739968 3652638 3580996 3522555 3474440 3433745 3397349 3362027 3325328 3286374
59851C286374m0569m0819l9838l8095l5644l1847k6136j9039j2095o655l233k089
$$ 3286374 3245805 3204986 3165148 3127053 3091409 3059562 3033426 3014387 3002292 2995637 2992404 2990315
59839B990315l754q510j5830k4626l3733m1895m7943n1450n2808n2292m9560m4627
$$ 2990315 2986561 2978051 2962221 2937595 2903862 2861967 2814024 2762574 2709766 2657474 2607914 2563287
59827B563287l8554l2362k5738j7834r097j312M273P955J0678J3057J5618J9194
$$ 2563287 2524733 2492371 2466633 2448799 2439702 2438390 2442663 2450618 2461296 2474353 2489971 2509165
59815B509165K4464L1396L9470M8025N6125O2480O6118O7094O6244O4238O1064
$$ 2509165 2533629 2565025 2604495 2652520 2708645 2771125 2837243 2904337 2970581 3034819 3095883
59804C095883N6366N0047M2472L4184K5559J6816Q327P59n138q857j0160r030
$$ 3095883 3152249 3202296 3244768 3278952 3304511 3321327 3329654 3330413 3325275 3316418 3306258 3297228
59792C297228n707o36N924J4153K4362L6415M9694O3704P8764R6008J16646J41087
$$ 3297228 3291521 3290885 3296809 3310962 3335324 3371739 3421433 3485137 3563901 3659909 3776555 3917642
59780C917642J68817J99259K32637K69616L10098L52593L94490M31915M58804
$$ 3917642 4086459 4285718 4518355 4787971 5098069 5450662 5845152 6277067 6735871
59771F735871M66922M48085L97291L14538K05071P9076m9446j65666k58079l21337
$$ 6735871 7202793 7650878 8048169 8362707 8567778 8646854 8597408 8431742 8173663 7852326
59761G852326l56103l66785l59063l38405l09524k76321k41665k07230j73903
$$ 7852326 7496223 7129438 6770375 6431970 6122446 5846125 5604460 5397230 5223327
59752E223327j42563j14161q8919o5954m4163k3337l898J4120L1365M8508O5798
$$ 5223327 5080764 4966603 4877684 4811730 4767567 4744230 4740332 4754452 4785817 4834325 4900123
59741D900123Q3176J00486J17637J34945J53178J72914J94011K16139K39614K65176
$$ 4900123 4983299 5083785 5201422 5336367 5489545 5662459 5856470 6072609 6312223 6577399
59731F577399K93129L23340L56038L91884M31134M73180N17035N61598O05325
$$ 6577399 6870528 7193868 7549906 7941790 8372924 8846104 9363139 9924737 10530062
59722A0530062O46115O81702P09753P27575P32523P23182O99995O64893O21111
$$ 10530062 11176177 11857879 12567632 13295207 14027730 14750912 15450907 16115800 16736911
59713A6736911N73599N28654M92149M67969M58070M63146M82431N13101N50672
$$ 16736911 17310510 17839164 18331313 18799282 19257352 19720498 20202929 20716030 21266702
59704B1266702N90081O26182O53573O66755O60935O32787N80863N05833M10526
$$ 21266702 21856783 22482965 23136538 23803293 24464228 25097015 25677878 26183711 26594237
59695B6594237K99639J79406N7298n8696j61460k45871l08813l48613l64876l58724
$$ 26594237 26893876 27073282 27130580 27071884 26910424 26664553 26355740 26007127 25642251 25283527
59685B5283527l32500k88962k30638j59765p8337J1941J09736K14201L25024M41996
$$ 25283527 24951027 24662065 24431427 24271662 24193325 24205266 24315002 24529203 24854227 25296223
59675B5296223N63971O88091Q10141R25378J028511J112729J169120J187405J157591
$$ 25296223 25860194 26548285 27358426 28283804 29312315 30425044 31594164 32781569 33939160
59666C3939160J071763R25890P21409M66013J73271j38533m48124p33889r77429
$$ 33939160 35010923 35936813 36658222 37124235 37297506 37158973 36710849 35976960 34999531
59657C4999531j166574j296210j366956j383357j352934j285630j192737j085456
$$ 34999531 33832957 32536747 31169791 29786434 28433500 27147870 25955133 24869677
59649B4869677r74431q70469p84938p28211p06612p20024p61691q19886q80493
$$ 24869677 23895246 23024777 22239839 21511628 20805016 20084992 19323301 18503415 17622922
59640A7622922r30060r58935r63184r44201r06431q55078p95059p30791o65988
$$ 17622922 16692862 15733927 14770743 13826542 12920111 12065033 11269974 10539183 9873195
59631I873195o03342n44504m90325m40989l96008l54583l16277k81447k50738
$$ 9873195 9269853 8725349 8235024 7794035 7398027 7043444 6727167 6445720 6194982
59622F194982k24095k00368j78065j56472j35937j17098j00113q4844p1548o0925
$$ 6194982 5970887 5770519 5592454 5435982 5300045 5182947 5082834 4997990 4926442 4865517
59612D865517n3389m8618m6041m5577m7565n2088n8703o6784p5732q4694r2515
$$ 4865517 4812128 4763510 4717469 4671892 4624327 4572239 4513536 4446752 4371020 4286326 4193811
59601D193811r8334j02043j03911j03881j01640r7307r1605q5165p8005o9990
$$ 4193811 4095477 3993434 3889523 3785642 3684002 3586695 3495090 3409925 3331920 3261930
59591C261930o1503n3267m5459l7485k8874k0188j2540o202k10O358J2959J8091
$$ 3261930 3200427 3147160 3101701 3064216 3035342 3015154 3002614 2996412 2996202 3002560 3015519 3033610
59579C033610K1071K2732K4209K5698K6794K7390K7602K7206K5995K4644K4447
$$ 3033610 3054681 3077413 3101622 3127320 3154114 3181504 3209106 3236312 3262307 3286951 3311398
59568C311398K6097K9231L3240L8000M3680N0548N9030O9311Q0601R1570J01927
$$ 3311398 3337495 3366726 3399966 3437966 3481646 3532194 3591224 3660535 3741136 3832706 3934633
59557C934633J12971J26062J41077J56954J73243J90356K08618K27784K47348
$$ 3934633 4047604 4173666 4314743 4471697 4644940 4835296 5043914 5271698 5519046
59548E519046K66565K84289K99450L11676L20882L26200L26135L19951L08364
$$ 5519046 5785611 6069900 6369350 6681026 7001908 7328108 7654243 7974194 8282558
59539H282558K92682K73874K52743K30329K07264J82890J55694J25071R2595O1497
$$ 8282558 8575240 8849114 9101857 9332186 9539450 9722340 9878034 10003105 10095700 10157197
59529A0157197L4979J4940K001l814k662N181J9453L9995O6218R6297J27192J55535
$$ 10157197 10192176 10207116 10209117 10205303 10202641 10207822 10227275 10267270 10333488 10429785 10556977 10712512
59517A0712512J78051J91190J91359J76419J46629J03676M9233j4815q5321j58266
$$ 10712512 10890563 11081753 11273112 11449531 11596160 11699836 11749069 11734254 11648933 11490667
59507A1490667k30212k98470l59873m10604m47907m71267m81621m80099m68079
$$ 11490667 11260455 10961985 10602112 10191508 9743601 9272334 8790713 8310614 7842535
59498G842535m47715m21527l91551l59171l25480k91442k58020k26377j97594
$$ 7842535 7394820 6973293 6581742 6222571 5897091 5605649 5347629 5121252 4923658
59489D923658j71762j47890j25145j03667q3696o4525m5236k6141q409P800K3910
$$ 4923658 4751896 4604006 4478861 4375194 4291498 4226973 4181737 4155596 4147187 4154987 4178897
59478D178897M1320N9965P8872R7629J16729J36843J58151J80342K02778K24650
$$ 4178897 4220217 4280182 4359054 4456683 4573412 4710255 4868406 5048748 5251526 5476176
59468E476176K45098K63202K77804K87523K90989K87007K74453K52322K20129
$$ 5476176 5721274 5984476 6262280 6549803 6840792 7127799 7402252 7654574 7874703
59459G874703J78183J27461O9530O950n6550j16850j70850k17107k55273k85138
$$ 7874703 8052886 8180347 8249877 8256827 8200277 8083427 7912577 7695470 7440197 7155059
59449G155059l06331l18759l23069l20614l12898l01045k85768k67860k48604
$$ 7155059 6848728 6529969 6206900 5886286 5573388 5272343 4986575 4718715 4470111
59440D470111k29436k11159j93706j76717j60147j44226j29177j15319j03131
$$ 4470111 4240675 4029516 3835810 3659093 3498946 3354720 3225543 3110224 3007093
59431C007093r2701q3184p3384o3110n3456m5453l8787l2269k5373j8726j3125
$$ 3007093 2914392 2831208 2757824 2694714 2641258 2595805 2557018 2524749 2499376 2480650 2467525
59420B467525q476m031P01N539J0059J4135J8021K2109K6720L1938L7152M0685
$$ 2467525 2459049 2455018 2455719 2461258 2471317 2485452 2503473 2525582 2552302 2584240 2621392 2662077
59408B662077M0375L5246K6826J8523J3483J3039J6887K4060L3501M4266N5718
$$ 2662077 2702452 2737698 2764524 2783047 2796530 2809569 2826456 2850516 2884017 2928283 2984001
59397B984001O7319P7935Q5767Q9671R0684R1808R6162J05450J19890J38905J61614
$$ 2984001 3051320 3129255 3215022 3304693 3395377 3487185 3583347 3688797 3808687 3947592 4109206
59386D109206J87172K15129K45516K78536L14293L52925L94643M39295M85760
$$ 4109206 4296378 4511507 4757023 5035559 5349852 5702777 6097420 6536715 7022475
59377G022475N31900N75049O12493O41457O59088O62966O52027O27020N90026
$$ 7022475 7554375 8129424 8741917 9383374 10042462 10705428 11357455 11984475 12574501
59368A2574501N43758M91480M37059L84103L34704K89289K47745K10071J75621
$$ 12574501 13118259 13609739 14046798 14430901 14765605 15054894 15302639 15512710 15688331
59359A5688331J42449J08052P0502K8478j9075p2265j29261j86804k41848k92266
$$ 15688331 15830780 15938832 16009334 16037812 16018737 15946472 15817211 15630407 15388559 15096293
59349A5096293l36151l71617l97833m15860m27967m36438m43076m49224m55599
$$ 15096293 14760142 14388525 13990692 13574832 13146865 12710427 12267351 11818127 11362528
59340A1362528m62091m67970m72111m73026m69206m59997m45965m28053m06542
$$ 11362528 10900437 10432467 9960356 9487330 9018124 8558127 8112162 7684109 7277567
59331G277567l81357l53263l24162k95840k68755k42433k16785j92532j70213
$$ 7277567 6896210 6542947 6218785 5922945 5654190 5411757 5194972 5002440 4832227
59322D832227j49461j29646j10917r3950p8803o4673n0895l7548k4864j2709j062
$$ 4832227 4682766 4553120 4442203 4348253 4269450 4204777 4153882 4116334 4091470 4078761 4077699
59311D077699R572J8855K7285L5524M3418N0182N5337N8756O0167N9284N6388
$$ 4077699 4087271 4106126 4133411 4168935 4212353 4262535 4317872 4376628 4436795 4496079 4552467
59300D552467N1986M6048L8335K9360K0276J1689L437m372j0954j5747j8828k0084
$$ 4552467 4604453 4650501 4688836 4718196 4738472 4750161 4753598 4749226 4738272 4722525 4703697 4683613
59288D683613j8724j4217p122J600J1687K3487L7159N2444O8938Q6149J03421
$$ 4683613 4664889 4650672 4643550 4645150 4656837 4680324 4717483 4769927 4838865 4925014 5028435
59277E028435J20207J36237J51157J64191J74326J80535J81587J75985J62435
$$ 5028435 5148642 5284879 5436036 5600227 5774553 5955088 6136675 6312660 6475095
59268F475095J40448J10651P5022L6910O7l2896o0959q3749j00781j11995j18221
$$ 6475095 6615543 6726194 6801216 6838126 6838193 6805297 6744338 6660589 6559808 6447813 6329592
59257F329592j20338j18409j12331j03156r3007q3687p5828o9348o4162o0276
$$ 6329592 6209254 6090845 5978514 5875358 5782351 5698664 5622836 5553488 5489326 5429050
59247E429050n7602n5914n4997n4752n5076n5525n5171n3179m9455m4292l7332
$$ 5429050 5371448 5315534 5260537 5205785 5150709 5095184 5040013 4986834 4937379 4893087 4855755
59236D855755k7622j4937k72J5587L3433N4767Q0026J08412J39235J72493K08126
$$ 4855755 4828133 4813196 4812924 4828511 4861944 4916711 4996737 5105149 5244384 5416877 5625003
59225E625003K45636K84589L24673L64700M01917M32658M53532M61889M55603
$$ 5625003 5870639 6155228 6479901 6844601 7246518 7679176 8132708 8594597 9050200
59216I050200M32870L92365L33724K58280J69395P1794k9779j31180k28333l16586
$$ 9050200 9483070 9875435 10209159 10467439 10636834 10708628 10678849 10547669 10319336 10002750
59206A0002750l91223m48824m88149n09915n15935n08502m90181m63683m31670
$$ 10002750 9611527 9162703 8674554 8164639 7648704 7140202 6650021 6186338 5754668
59197E754668l96574l60533l25219k91608k60094k30999k04862j82005j62068
$$ 5754668 5358094 4997561 4672342 4380734 4120640 3889641 3684779 3502774 3340706
59188C340706j44326j28384j14307j02108r1535q2282p3990o6065n8036n0151
$$ 3340706 3196380 3067996 2953689 2851581 2760046 2677764 2603774 2537709 2479673 2429522
59178B429522m3169l7340l2162k7222k2734j8845j4985j0386n034L05M864Q435
$$ 2429522 2386353 2349013 2316851 2289629 2266895 2248050 2233065 2222679 2217645 2217950 2222814 2231249
59166B231249J1439J4679J8720K3318K7700L1548L5319L9453M3801M8177N2853
$$ 2231249 2242688 2257367 2276087 2299405 2327105 2358653 2393972 2433425 2477226 2525403 2578256
59155B578256N8029O3231O7795P1621P4941P7702P9717Q1037Q1648Q0900P8016
$$ 2578256 2636285 2699516 2767311 2838932 2913873 2991575 3071292 3152329 3233977 3314877 3392893
59144C392893P2945O6260N8255M8830L8116K6749J5314M054o741j6374k3932k8825
$$ 3392893 3465838 3532098 3590353 3639183 3677299 3704048 3719362 3723416 3716675 3700301 3676369 3647544
59132C647544l1249l2164l2413l1694k8835k3409j6465r145j131Q729K0551L3219
$$ 3647544 3616295 3584131 3551718 3520024 3491189 3467780 3451315 3442170 3441039 3449768 3470319 3503538
59120C503538M5886N8679P1826Q5025R8090J11429J25380J39596J53576J67454
$$ 3503538 3549424 3608103 3679929 3764954 3863044 3974473 4099853 4239449 4393025 4560479
59110D560479J81793J96880K12540K28341K43510K56866K67158K73546K75345
$$ 4560479 4742272 4939152 5151692 5380033 5623543 5880409 6147567 6421113 6696458
59101F696458K71334K59662K38709K08027J68410J21274O8327J1883m4894r8646
$$ 6696458 6967792 7227454 7466163 7674190 7842600 7963874 8032201 8044084 7999190 7900544
59091G900544j46882j88394k22896k50507k71538k86247k94736k97395k95303
$$ 7900544 7753662 7565268 7342372 7091865 6820327 6534080 6239344 5941949 5646646
59082E646646k89735k81262k70014k56812k43123k29604k15624k00821j86321
$$ 5646646 5356911 5075649 4805635 4548823 4305700 4076096 3860472 3659651 3473330
59073C473330j73563j62523j52008j41305j30624j20320j10646j02074r4825q8165
$$ 3473330 3299767 3137244 2985236 2843931 2713307 2592987 2482341 2380267 2285442 2197277
59063B197277q1049p3524o6591o0721n5423n0399m6091m2732l9743l6562l3354
$$ 2197277 2116228 2042704 1976113 1915392 1859969 1809570 1763479 1720747 1681004 1644442 1611088
59052A611088l0453k7764k5307k3672k3283k3495k3192k2116k0999k0372j9703
$$ 1611088 1580635 1552871 1527564 1503892 1480609 1457114 1433922 1411806 1390807 1370435 1350732
59041A350732j7954j4770j0896p448m901k914j095M40J460K292L608N652Q056
$$ 1350732 1332778 1318008 1307112 1299664 1294763 1291849 1290754 1291194 1292654 1294946 1298554 1304206 1312262
59028A312262J0543J3297J6417J9321K1003K0937J9519J7506J5154J2096Q225
$$ 1312262 1322805 1336102 1352519 1371840 1392843 1413780 1433299 1450805 1465959 1478055 1486280
59017A486280M393J723L65m78j279j574r38L11J853M040P096J0176J2178J3131
$$ 1486280 1490673 1492396 1492761 1492283 1491004 1489430 1488492 1488803 1490656 1494696 1501792 1511968 1524146 1537277
59003A537277J3870J4499J4046J1612P258J767l737q064j0598j1800j2598j3373
$$ 1537277 1551147 1565646 1579692 1591304 1598562 1600329 1596592 1588528 1577930 1566130 1553532 1540159
58991A540159j3967j4284j4180j3091j0653p548m837k702p14R33J676J951K999
$$ 1540159 1526192 1511908 1497728 1484637 1473984 1466436 1461599 1458897 1458183 1459116 1460792 1462743 1465742
58978A465742N090P155Q418R288J0306J1404J2671J4613J7131J9325K0922K2744
$$ 1465742 1470832 1477987 1486405 1495693 1505999 1517403 1530074 1544687 1561818 1581143 1602065 1624809
58966A624809K5085K6844K7267K7372K8409K9784L0029K9190K8745K9339L0091
$$ 1624809 1649894 1676738 1704005 1731377 1759786 1789570 1819599 1848789 1877534 1906873 1936964
58955A936964L0275L0445L1492L3488L5909L8367M0725M2967M5312M8218N2047
$$ 1936964 1967239 1997684 2029176 2062664 2098573 2136940 2177665 2220632 2265944 2314162 2366209
58944B366209N6810O2232O7823P3093P7986Q3111Q9229R6540J04585J12745J20681
$$ 2366209 2423019 2485251 2553074 2626167 2704153 2787264 2876493 2973033 3077618 3190363 3311044
58933C311044J28570J37185J47483J59796J73592J88320K04234K22016K41960
$$ 3311044 3439614 3576799 3724282 3884078 4057670 4245990 4450224 4672240 4914200
58924D914200K63952K88067L14585L43523L74727M08477M45468M86030N29710
$$ 4914200 5178152 5466219 5780804 6124327 6499054 6907531 7352999 7839029 8368739
58915H368739N75745O23476O71975P19535P63850Q02550Q33207Q52654Q56640
$$ 8368739 8944484 9567960 10239935 10959470 11723320 12525870 13359077 14211731 15068371
58906A5068371Q40516Q00492P34418O41811N23858L83829K27336O1759j04772
$$ 15068371 15908887 16709379 17443797 18085608 18609466 18993295 19220631 19282390 19177618
58897A9177618k64209m09316n34589o36779p14448p67436p97105q06610p99945
$$ 19177618 18913409 18504093 17969504 17332725 16618277 15850841 15053736 14247126 13447181
58888A3447181p80419p50494p12786o70298o25442n79654n34275m90969m50835
$$ 13447181 12666762 11916268 11203482 10533184 9907742 9328088 8793813 8302844 7852009
58879G852009m13696l78984l46905l18286k93537k72244k53540k36463k20282
$$ 7852009 7438313 7059329 6712424 6394138 6100601 5828357 5574817 5338354 5118072
58870E118072k04790j90147j76279j62849j49945j38255j28145j18985j09872
$$ 5118072 4913282 4723135 4546856 4384007 4234062 4095807 3967662 3848677 3738805
58861C738805j00612r1669q3466p6184o9828o3983n7818n0902m3782l7291l1507
$$ 3738805 3638193 3546524 3463058 3386874 3317046 3253063 3195245 3144343 3100561 3063270 3031763
58850C031763k5845j9906j3770p514j083N439J1825J8045K4331L0944L7956M5132
$$ 3031763 3005918 2986012 2972242 2964728 2963645 2969084 2980909 2998954 3023285 3054229 3092185 3137317
58838C137317N1894N7845O3566P0378P8799Q7709R5709J03031J11305J21444J32703
$$ 3137317 3189211 3247056 3310622 3381000 3459799 3547508 3643217 3746248 3857553 3978997 4111700
58827D111700J43996J55418J67953J82224J98146K15699K35360K57643K82528
$$ 4111700 4255696 4411114 4579067 4761291 4959437 5175136 5410496 5668139 5950667
58818E950667L09684L39150L71546M07573M47405M90591N36312N83640O31657
$$ 5950667 6260351 6599501 6971047 7378620 7826025 8316616 8852928 9436568 10068225
58809A0068225O79392P25320P66702P99703Q20522Q26105Q13435P78652P17859
$$ 10068225 10747617 11472937 12239639 13039342 13859864 14685969 15499404 16278056 16995915
58800A6995915O29288N14445L77414K23761O0186j05574k65447m11994n39151
$$ 16995915 17625203 18139648 18517062 18740823 18801009 18695435 18429988 18017994 17478843
58791A7478843o42807p21129p74407q04502q14426q07772p88007p58142p21205
$$ 17478843 16836036 16114907 15340500 14535998 13721572 12913800 12125793 11367651 10646446
58782A0646446o80347o37818n94351n50438n07765m68330m32356l98470l66082
$$ 10646446 9966099 9328281 8733930 8183492 7675727 7207397 6775041 6376571 6010489
58773F010489l36321l10282k87579k67200k48690k31860k16212k01336j87266
$$ 6010489 5674168 5363886 5076307 4809107 4560417 4328557 4112345 3911009 3723743
58764C723743j73980j61247j49262j38522j28801j19159j09443j00588r2960q5572
$$ 3723743 3549763 3388516 3239254 3100732 2971931 2852772 2743329 2642741 2549781 2464209
58754B464209p7639o9729o2518n5609m8663m2576l8238l4998l1581k7844k4412
$$ 2464209 2386570 2316841 2254323 2198714 2150051 2107475 2069237 2034239 2002658 1974814 1950402
58743A950402k1271j8057j5115j3037j1619j0497j0271j1690j4210j6670j8946
$$ 1950402 1929131 1911074 1895959 1882922 1871303 1860806 1850535 1838845 1824635 1807965 1789019
58732A789019k1500k3742k4523k4071k3834k4378k4884k4894k4980k5455k5835
$$ 1789019 1767519 1743777 1719254 1695183 1671349 1646971 1622087 1597193 1572213 1546758 1520923
58721A520923k6062k6955k8893l1044l2449l2968l2831l2208l1501l1115l0602
$$ 1520923 1494861 1467906 1439013 1407969 1375520 1342552 1309721 1277513 1246012 1214897 1184295
58710A184295k9002k6421k4169k2953k1963k0418j8846j8001j7392j5979j3814
$$ 1184295 1155293 1128872 1104703 1081750 1059787 1039369 1020523 1002522 985130 969151 955337
58699I55337j1913j0828j0234r879j0018j0720j1331j1049r817q365p350o649
$$ 955337 943424 932596 922362 912483 902465 891745 880414 869365 859548 851183 843833 837184
58687H37184n646m084k341q44L11R65P37l39j445j868j872k124k639k956k965
$$ 837184 831538 827454 825113 824269 824580 825545 826282 825943 824498 822630 820758 818634 815995 813039 810074
58672H10074k728j827N1K084K907K318J465J286J702K439L442M212L827K148J60
$$ 810074 807346 805519 805570 807654 810561 812879 814344 815630 817332 819771 823213 827425 831252 833400 833560
58657H33560j367k735m298n495n642n020m320l515k109j83J607K964M211N673
$$ 833560 832193 829458 825160 819665 814023 809003 804683 801168 799059 798876 800483 803447 807658 813331
58643H13331P397R386J1684J4082J6144J7579J8452J9088K0007K1779K4575K7834
$$ 813331 820728 830114 841798 855880 872024 889603 908055 927143 947150 968929 993504 1021338
58631A021338L0780L3340L6284M0277M5103N0088N5130O0758O7301P4517Q2356
$$ 1021338 1052118 1085458 1121742 1162019 1207122 1257210 1312340 1373098 1440399 1514916 1597272
58620A597272R1449J02322J14569J27541J41581J57567J75266J93140K10020K25991
$$ 1597272 1688721 1791043 1905612 2033153 2174734 2332301 2507567 2700707 2910727 3136718
58610C136718K41056K53763K61690K62626K54589K35661K04893J63258J13117
$$ 3136718 3377774 3631537 3893227 4155853 4410442 4646103 4850996 5014254 5127371
58601E127371N7166j526n9059j11392j55561j89971k14070k28406k34521k33972
$$ 5127371 5184537 5183011 5123952 5012560 4856999 4667028 4452958 4224552 3990031 3756059
58591C756059k27693k16780k03229j88959j74486j59430j43950j28768j14217
$$ 3756059 3528366 3311586 3108357 2919398 2744912 2585482 2441532 2312764 2198547
58582B198547j00305q7459p6286o6640n7815m9562m2107l5405k9261k4028k0243
$$ 2198547 2098242 2010783 1934497 1867857 1810042 1760480 1718373 1682968 1653707 1629679 1609436
58571A609436j7623j5216j2594j0211q640q051q247q648q619q372r149j1821j5815
$$ 1609436 1591813 1576597 1564003 1553792 1545152 1537101 1528854 1520206 1511587 1503215 1494066 1482245 1466430
58558A466430k0134k4722k9737l4292l7098l7954l7398l5455l2117k8526k6072
$$ 1466430 1446296 1421574 1391837 1357545 1320447 1282493 1245095 1209640 1177523 1148997 1122925
58547A122925k4523k2570k0005j7862j6546j5424j4361j3996j4300j4301j3591
$$ 1122925 1098402 1075832 1055827 1037965 1021419 1005995 991634 977638 963338 949037 935446
58536I35446j2832j2538j2499j2546j2698j2526j1562j0326r673r375q615p756
$$ 935446 922614 910076 897577 885031 872333 859807 848245 837919 828246 818871 810256 802500
58524H02500p973r263j0464j1193j2001j2689j2394j1476j1207j1351j0212p532
$$ 802500 794527 785264 774800 763607 751606 738917 726523 715047 703840 692489 682277 674745
58512F74745n104l908k923j552r15j462j575l6K011L084L592M465N199N084M906
$$ 674745 669641 665733 662810 661258 660343 658881 657306 657270 659281 662365 665957 670422 675621 680705 685611
58497F85611N721P041P975R044J1089J3326J4326J4231J4320J4864J4959J4137
$$ 685611 691332 698373 706348 715392 726481 739807 754133 768364 782684 797548 812507 826644
58485H26644J2776J1140R197P096M902K189j287m989q323j1306j3897j5464j5766
$$ 826644 839420 850560 859757 866853 871755 873944 872657 867668 859345 848039 834142 818678 802912
58472H02912j5537j5354j4822j3716j2821j2610j2264j1047r679r007q413o964
$$ 802912 787375 772021 757199 743483 730662 718052 705788 694741 685062 676055 667642 660678
58460F60678n205m268l918l081j759q88o62m57j16J8J48Q05J732K216K400L184
$$ 660678 655473 651205 647287 644206 642447 641559 640897 640440 640324 640342 640490 641295 643027 645243 647643 650827
58444F50827M863O809Q467R838J1104J2480J4319J6688J9034K0738K1673K1782
$$ 650827 655690 662499 670966 680804 691908 704388 718707 735395 754429 775167 796840 818622
58432H18622K0590J7768J3656Q827L651j259n006p407r252j0990j1949j1476j0033
$$ 818622 839212 856980 870636 879463 883114 881855 876849 869442 860190 849200 837251 825775 815742
58419H15742q482p184o332o103n795m031p49K220L508M067N560Q077J0627J2862
$$ 815742 807260 800076 793744 787641 781846 777815 777066 779286 782794 786861 792421 800498 811125 823987
58405H23987J4873J6212J6405J5736J4396J1720P444K743j212m808q717j2142
$$ 823987 838860 855072 871477 887213 901609 913329 920773 923516 922304 917496 908779 896637
58393H96637j3778j3758j3158j2237j0647q704p028n543m060l119k949k491q57
$$ 896637 882859 869101 855943 843706 833059 824355 817327 811784 807724 804605 801656 799165 798308
58380G98308J078K062K447L130L499K448P81M48J665K810L118L543M816O318P336
$$ 798308 799386 801448 803895 807025 810524 812972 813753 814201 815866 818676 821794 825337 830153 836471 843807
58365H43807Q020Q775R574J0219J0578J0597J0614J1235J2367J3065J2944J2881
$$ 843807 851827 860602 870176 880395 890973 901570 912184 923419 935786 948851 961795 974676
58353I74676J3556J4382J4841J5659J7302J8471J7529J4662J1100P157K577j979
$$ 974676 988232 1002614 1017455 1033114 1050416 1068887 1086416 1101078 1112178 1119335 1121912 1119933
58341A119933n391p452q547q634p801o905o398n415l298q81R63K812N319P705
$$ 1119933 1114542 1107090 1098543 1089909 1082108 1075203 1068805 1063390 1060092 1059211 1060174 1062986 1068305 1076010
58327A076010R246J0742J2824J4334J4370J4431J6217J8719J9874J9924K0629
$$ 1076010 1085256 1095998 1108822 1123156 1137526 1151957 1168174 1186893 1206767 1226691 1247320
58316A247320K2158K3314K3987K4956K5928K6003K5267K3913K0897J5735J0336
$$ 1247320 1269478 1292792 1316779 1341735 1367663 1393666 1418933 1442846 1463743 1479478 1489814
58305A489814O655L900O43j838j423R63K660L459N135P674R384J0255J1820J4028
$$ 1489814 1496469 1500369 1501012 1499174 1497751 1498714 1501374 1504833 1509968 1517642 1527026 1537281 1549101 1563129
58291A563129J5558J6732J8917K1459K2511K2529K3615K5759K7177K8034L0318
$$ 1563129 1578687 1595419 1614336 1635795 1658306 1680835 1704450 1730209 1757386 1785420 1815738
58280A815738L4073L7216L9066M0837M2800M4220M5834M8956N2398N3744N3288
$$ 1815738 1849811 1887027 1926093 1966930 2009730 2053950 2099784 2148740 2201138 2254882 2308170
58269B308170N3139N2897N0269M5672M2098M0401L8840L7303L7737M0160M2430
$$ 2308170 2361309 2414206 2464475 2510147 2552245 2592646 2631486 2668789 2706526 2746686 2789116
58258B789116M4304M7588N2084N5598N8139O1892O6837P0772P3740P7874Q2856
$$ 2789116 2833420 2881008 2933092 2988690 3046829 3108721 3175558 3246330 3320070 3397944 3480800
58247C480800Q6404Q9236R4381J01376J06741J10590J16821J26010J34208J40035
$$ 3480800 3567204 3656440 3750821 3852197 3958938 4069528 4186349 4312359 4446567 4586602
58237D586602J46890J56551J66619J76010J86999J99976K12111K23181K36788
$$ 4586602 4733492 4890043 5056662 5232672 5419671 5619647 5831758 6054939 6291727
58228F291727K53869K71003K87151L05842L28716L53315L79335M10210M46272
$$ 6291727 6545596 6816599 7103750 7409592 7738308 8091623 8470958 8881168 9327440
58219I327440M83567N21870N66496O19516O77147P38801Q10293Q94662R88588
$$ 9327440 9811007 10332877 10899373 11518889 12196036 12934837 13745130 14639792 15628380
58210A5628380J092057J212603J355529J519526J707239J930682K200695K521571
$$ 15628380 16720437 17933040 19288569 20808095 22515334 24446016 26646711 29168282
58202B9168282K902957L367049L937921M636984N499735O586785P969008R713891
$$ 29168282 32071239 35438288 39376209 44013193 49512928 56099713 64068721 73782612
58194G3782612J1896673J4608739J7937982K1953777K6717562L2234188L8225139
$$ 73782612 85679285 100288024 118226006 140179783 166897345 199131533 237356672
58187B37356672M3771626M7125714M6056100L8817533K5311328P630790j0586811
$$ 237356672 281128298 328254012 374310112 413127645 438438973 446069763 435482952
58180D35482952k5738519l5729584m0402851m0894392l8675867l4980141l0688877
$$ 435482952 409744433 374014849 333611998 292717606 254041739 219061598 188372721
58173A88372721k6386731k2404152j8875600j5829521j3249006j1083586r261350
$$ 188372721 161985990 139581838 120706238 104876717 91627711 80544125 71282775
58166G1282775p718242o407694n283202m292365l393079k558885j763529r74192
$$ 71282775 63564533 57156839 51873637 47581272 44188193 41629308 39865779 38891587
58158C8891587j62154O93598J606178K542018L346059L721059L346948K097872
$$ 38891587 38729433 39423031 41029209 43571227 46917286 50638345 53985293 56083165
58150E6083165J90680j878382l584472m627337n006314m904682m526772m019130
$$ 56083165 56273845 54395463 50810991 46183654 41177340 36272658 31745886 27726756
58142B7726756l476877k962401k506152k112527j778564j502635j277561j089569
$$ 27726756 24249879 21287478 18781326 16668799 14890235 13387600 12110039 11020470
58134A1020470r29140p94975o85246n93607n16241m54576m08052l71213l40592
$$ 11020470 10091330 9296355 8611109 8017502 7501261 7046685 6638633 6267420 5926828
58125E926828l17558l01625k87333k70701k53088k36043k17801j97676j78592
$$ 5926828 5609270 5307645 5020312 4749611 4496523 4260480 4042679 3845003 3666411
58116C666411j62286j46534j29824j14644j03686r6628r2695r2409r4717r6178
$$ 3666411 3504125 3357591 3227767 3113123 3009437 2912809 2820114 2727705 2632988 2536810
58106B536810r5021r2620q9516q3971p6058o9074o4738o0746n5118m9418m5435
$$ 2536810 2441789 2349169 2259653 2175682 2099624 2030550 1965812 1905066 1849948 1800530 1755095
58095A755095m2239l8825l6484l6147l6218l5313l4506l4879l5370l4991l4673
$$ 1755095 1712856 1674031 1637547 1601400 1565182 1529869 1495363 1460484 1425114 1390123 1355450
58084A355450l5109l5181l4320l3949l4806l5196l3638l1109k8989k7001k4755
$$ 1355450 1320341 1285160 1250840 1216891 1182085 1146889 1113251 1082142 1053153 1026152 1001397
58073A001397k3081k2252k0990j8788j7137j6943j6853j5587j3842j2449j0793
$$ 1001397 978316 956064 935074 916286 899149 882206 865353 849766 835924 823475 812682
58062H12682q614p255p466p893p375o870p577q915r914j0795j1694j1652j0429
$$ 812682 804068 796813 789347 781454 774079 767209 759632 750717 740803 730008 718314 706662 696233
58049F96233r501r761r890q610o828n968n706n022m040l252k284r54k15n96r89
$$ 696233 686732 676971 667081 658471 651643 645675 639969 634947 630907 627655 625371 624417 624202 623606 622617
58034F22617l67N92Q55O89O78M30l60q93o53n54j353k185k001j242p27j05J144
$$ 622617 622250 622842 623697 624386 625064 625494 625134 624241 623588 623034 621681 619496 617495 616253 615526 615421 616565
58017F16565K387K885L083L532L590K522R50j59r12j727k186j948j738k176k599
$$ 616565 618952 621837 624920 628452 632042 634564 635514 635355 634443 632716 630530 628582 626844 624668 622069
58002F22069k336k104k686l281k749j675j569k559l457l777m278n527p109q244
$$ 622069 619733 617629 614943 611662 608913 607238 605669 603110 599653 595876 591598 586071 578962 570718
57988E70718q491q000p492p629q020p533n961m481l965l759k872j372J30J482
$$ 570718 562227 554227 546735 539106 531086 523553 517592 513111 509146 505387 502515 501143 501273 502755
57974E02755K724L574L933M115M114L499K479J967K024J512Qj234j096j60M81
$$ 502755 505479 509053 512986 517101 521215 524714 527193 529160 531184 532696 532704 531470 530374 530214 530695
57959E30695P37Q24K49j255k801l467l571l807m017l812l495l344k869j714m35
$$ 530695 531432 532256 532505 531250 528449 524982 521411 517604 513587 509775 506280 502936 500067 498353 497918
57944D97918N01J478K613K994K087P58j53j119k645l969m345m557n645p144q020
$$ 497918 498419 499897 502510 505504 507591 508349 508196 507077 504432 500463 496118 491561 485916 478772 470752
57929D70752q505r460j0743j1681j2379j3122j3192j1837r772q246p182n738m048
$$ 470752 462247 452787 442044 430363 417984 404862 391670 379833 370061 361815 354633 348895 344847
57916C44847k850j892l49J538K809L458M325N550O572P395Q466R554J0045J0126
$$ 344847 341997 340105 339756 341294 344103 347561 351886 357436 364008 371403 379869 389423 399468 409594
57902D09594J0330J0230Q997P130O088O232O471O002N082M054K787J315q1j466
$$ 409594 419924 430154 439151 446281 452369 458601 465072 471074 476156 480210 482997 484312 484231 482765
57888D82765l048m436n125n527o495p824q420p864o846n956n145m344l704l128
$$ 482765 479717 475281 470156 464629 458134 450310 441890 434026 427180 421224 416079 411735 408031 404903
57874D04903k399j744j385p88P61K856M333M732M577M353M251M651N692O421N679
$$ 404903 402504 400760 399375 398587 399348 402204 406537 411269 415846 420199 424450 429101 434793 441214 446893
57859D46893L788K256J695J230J33j144j935k336k742l150l268k834j755m24K12
$$ 446893 450681 452937 454632 455862 455995 454851 452916 450580 447838 444688 441420 438586 436831 436407 436619
57844D36619l36j251j349p19m54r28j397j360j156j040p83m55o81j714l087m437
$$ 436619 436283 435032 433683 432964 432510 431582 430185 428825 427669 426629 425846 425391 424710 422996 419909 415472
57828D15472n888p403q551r237r903j0645j0907j0369r551r120r111r127q862
$$ 415472 409584 402181 393630 384393 374490 363845 352938 342569 333018 323898 314787 305660 296798
57815B96798q253p484o918o651o176m994l453k382j963j714j435j334j159q5K162
$$ 296798 288545 281061 274143 267492 261316 256322 252869 250487 248524 246810 245375 244041 242882 242797 244959
57800B44959M763O776Q167R568J1367J3285J4617J4748J3603J1539Q864N689K553
$$ 244959 249722 256498 264665 274233 285600 298885 313502 328250 341853 353392 362256 367945 370498
57787C70498M90jL49N41M63M62L19n09j982l652n358o961p881p839p610p965q297
$$ 370498 370988 370987 371336 371877 372340 372802 373121 372612 370630 366978 361620 354659 346778 338939 331329 323364 315067
57770C15067p609o431o221o982p067n598l595k253j459n84M15J325K146K640K261
$$ 315067 307458 301027 294806 287824 280757 275159 271564 269311 267852 267268 267683 269008 271154 273794 276055
57755B76055J114K15K77Q50J136J046J003J280J869K587L034K938K661K781L193
$$ 276055 277169 277384 277661 278511 279647 280693 281696 282976 284845 287432 290466 293404 296065 298846 302039
57740C02039L265K908K682K831K992K995L086L306L391L359L351L058K280J994
$$ 302039 305304 308212 310894 313725 316717 319712 322798 326104 329495 332854 336205 339263 341543 343537
57726C43537L445O048P625P180O115O166P378Q876J0325J1671J2440J2364J2041
$$ 343537 346982 353030 360655 367835 373950 380116 387494 396370 406695 418366 430806 443170 455211
57713D55211J2171J2716J3394J4303J5401J6235J6855J8124K0335K2366K3244
$$ 455211 467382 480098 493492 507795 523196 539431 556286 574410 594745 617111 640355
57702F40355K3703K5185K7900L1001L4199L7967M2430M7209N2427N8815O6661
$$ 640355 664058 689243 717143 748144 782343 820310 862740 909949 962376 1021191 1087852
57691A087852P5368Q4313R3668J04189J16599J31255J48062J66537J86065K06049
$$ 1087852 1163220 1247533 1341201 1445390 1561989 1693244 1841306 2007843 2193908 2399957
57681B399957K25797K44412K60720K73121K79528K77884K66821K45698K14554
$$ 2399957 2625754 2870166 3130886 3404007 3683535 3961419 4228240 4473938 4688492
57672D688492J74964J30917Q7738M9385J6820j1698l9977p3192j15305j65215
$$ 4688492 4863456 4994373 5082111 5131496 5148316 5136618 5096641 5023449 4908144 4742929
57662D742929k15802k57813k84910k95394k90924k75035k52209k26552k00752
$$ 4742929 4527127 4269314 3984404 3689010 3398086 3123051 2870842 2644290 2443538
57653B443538j76221j53755j33510j15002r7944q2772o9881n8862m9133m0672
$$ 2443538 2267317 2113562 1980052 1865050 1767106 1684334 1614453 1555591 1506458 1465786
57643A465786l3481k6861k0065j3222o753l90O330J2986J8752K3831K9581L7094
$$ 1465786 1432305 1405444 1385379 1372157 1365404 1365014 1371344 1384330 1403082 1426913 1456494 1493588
57631A493588M6322N6453O6671P6697Q7155R9207J13290J28509J43772J58970
$$ 1493588 1539910 1596363 1663034 1739731 1826886 1926093 2039383 2167892 2311664 2470634
57621B470634J74361J89206K01953K11341K16352K15184K05419J85477J55272
$$ 2470634 2644995 2834201 3036154 3247495 3463847 3679031 3884450 4069927 4225199
57612D225199J15702O8460J6581l5768q4590j27058j61414j86781k03323k12090
$$ 4225199 4340901 4409361 4425942 4390174 4305584 4178526 4017112 3830331 3627008 3414918
57602C414918k14350k11208k03864j93658j81743j68920j55875j43201j31171
$$ 3414918 3200568 2989360 2785496 2591838 2410095 2241175 2085300 1942099 1810928
57593A810928j19694j08602r7902q7890p9140p2078o6378o1116n5758n0624m6075
$$ 1810928 1691234 1582632 1484730 1396840 1317700 1245622 1179244 1118128 1062370 1011746 965671
57582I65671m1844l7636l3806l0749k8016k4924k1714j9306j8000j7176j6258
$$ 965671 923827 886191 852385 821636 793620 768696 746982 727676 709676 692500 676242
57571F76242j5184j3918j2311j0524r044q014p068n960m881m032l247k162n94
$$ 676242 661058 647140 634829 624305 615261 607247 600179 594219 589338 585306 582059 579897 579303
57558E79303J277K883L718M024M774O533Q690J0324J1447J2739J4382J5954J7354
$$ 579303 580580 583463 587181 591205 595979 602512 611202 621526 632973 645712 660094 676048 693402
57545F93402J9013K1148K3535K6097K9085L2606L6523M0890M5975N1760N7952
$$ 693402 712415 733563 757098 783195 812280 844886 881409 922299 968274 1020034 1077986
57534A077986O4555P1961Q0481R0170J01052J13016J25512J37825J49639J60759
$$ 1077986 1142541 1214502 1294983 1385153 1486205 1599221 1724733 1862558 2012197 2172956
57524B172956J70366J77021J79254J75618J64451J44510J16079Q0949M1363l70
$$ 2172956 2343322 2520343 2699597 2875215 3039666 3184176 3300255 3381204 3422567 3422197
57514C422197m1444p8759j09987j34023j50490j59585j62551j61280j56985j49828
$$ 3422197 3380753 3301994 3192007 3057984 2907494 2747909 2585358 2424078 2267093 2117265
57504B117265j40095j29006j17867j07014r6173q5494p5688o7331o0372n4271
$$ 2117265 1977170 1848164 1730297 1623283 1527110 1441616 1365928 1298597 1238225 1183954
57494A183954m8387m2415l6500l0886k5509k0260j5433j1447q111m716q16L485
$$ 1183954 1135567 1093152 1056652 1025766 1000257 979997 964564 953117 945006 940290 939474 942959
57482I42959P916J2237J6124J9574K3380K8443L4626M1035M7514N4943O3855P3715
$$ 942959 950875 963112 979236 998810 1022190 1050633 1085259 1126294 1173808 1228751 1292606 1366321
57470A366321Q3978R4970J07017J19479J31364J42365J52515J61181J66982J68439
$$ 1366321 1450299 1545269 1652286 1771765 1903129 2045494 2198009 2359190 2526172 2694611
57460B694611J64030J52048J31272J01932O5734K5007j7674n9338r6942j28181
$$ 2694611 2858641 3010689 3141961 3243893 3309627 3334634 3316960 3257622 3160680 3032499
57450C032499j51894j67770j76062j77737j74474j68073j59676j49659j38328
$$ 3032499 2880605 2712835 2536773 2359036 2184562 2016489 1856813 1707154 1568826
57441A568826j26609j15699j06018r6818q7225p7464o8696o1716n6276n1545m6873
$$ 1568826 1442217 1326518 1220500 1123682 1036457 958993 890297 828581 772305 720760 673887
57430F73887m2167l7880l4603l2249k9886k6840k3668k1388j9969j8486j6715
$$ 673887 631720 593840 559237 526988 497102 470262 446594 425206 405237 386751 370036
57419C70036j5399j4775j3939j2269j0549r940j0410j0976j1028j0712j0269r632
$$ 370036 354637 339862 325923 313654 303105 293165 282755 271779 260751 250039 239770 230138
57407B30138q645p286n770m563m050m028l894l443l051k869k508j775j114r05
$$ 230138 221493 214207 208437 203874 199824 195796 191902 188459 185408 182539 180031 178256 177142 176237
57393A76237r20r27j218k001k763k878k414j836j278p12l86m81o27m18n4K2j42
$$ 176237 175317 174390 173172 171171 168408 165530 163116 161280 160002 159290 158904 158423 157796 157378 157324 157346 157204
57376A57204k85n61j211j848j813j195p91j054j667k105k144j821j339j027j033
$$ 157204 156919 156358 155147 153299 151486 150291 149500 148446 146779 144674 142530 140709 139370 138343 137310
57361A37310j165j266j488j821j770j061k21J30K25O11J017O99k18p95o81m63
$$ 137310 136145 134879 133391 131570 129800 128739 128518 128648 128873 129484 130501 131200 130982 130187 129506 129043
57345A29043m28n2Q48J400Q16l48q54l29N01R44J035J162J466J807J999K019K026
$$ 129043 128615 128563 129411 130811 131627 131279 130425 130096 130597 131541 132576 133738 135204 137011 139010 141029 143055
57328A43055K181K412K440K092J547J167J209J696K417K946K919K435K118K557
$$ 143055 145236 147648 150088 152180 153727 154894 156103 157799 160216 163162 166081 168516 170634 173191
57314A73191L666M752N269N382N634O147O377N851M942M629N399O713P671Q013
$$ 173191 176857 181609 186878 192260 197894 204041 210418 216269 221211 225840 231239 237952 245623 253636
57300B53636Q325R272J0782J2088J2647J2853J3572J4941J6168J6835J7797K0039
$$ 253636 261961 271233 282015 294103 306750 319603 333175 348116 364284 381119 398916 418955
57288D18955K3024K5189K5986K6384K7245K8267K8920K9298K9417K8661K6778
$$ 418955 441979 467168 493154 519538 546783 575050 603970 633268 662685 691346 718124
57277G18124K4474K2131J8691J3047N952p68o562j2393j8659k4287k8321l1226
$$ 718124 742598 764729 783420 796467 802419 801651 795089 782696 764037 739750 711429 680203
57265F80203l3939l6362l7513l6806l4673l2042k9504k6994k4158k1020j8147
$$ 680203 646264 609902 572389 535583 500910 468868 439364 412370 388212 367192 349045
57254C49045j5956j4212j2434j0522q634o802n154m145l907l703k724j225j10
$$ 349045 333089 318877 306443 295921 287287 280485 275331 271186 267279 263576 260852 259627 259517
57241B59517L01L49R0o11j150m65J423L133L572L079K563K339K385K928M092N322
$$ 259517 259818 260167 260257 259646 258496 258031 259454 262587 266159 269238 271801 274140 276525 279453 283545 288867
57225B88867N839N530N012M981N644O533O787N962M717M238M912N981O565O530
$$ 288867 294706 300236 305248 310229 315873 322406 329193 335155 339872 344110 349022 355003 361568 368098
57211C68098O218N958O111O949Q140Q785Q432P619P161P300P805Q477R213R918
$$ 368098 374316 380274 386385 393334 401474 410259 418691 426310 433471 440771 448576 457053 466266 476184
57197D76184J0696J1738J2789J3139J2471J1308J0301R454Q477P541P268Q030
$$ 476184 486880 498618 511407 524546 537017 548325 558626 568080 576557 584098 591366 599396
57185E99396R603J1335J2551J3018J3115J3379J3898J4456J5169J6363J7719J8233
$$ 599396 608999 620334 632885 645903 659018 672397 686295 700751 715920 732283 750002 768235
57173G68235J7397J5957J5068J5034J5197J4903J4181J3606J3604J3996J4323
$$ 768235 785632 801589 816657 831691 846888 861791 875972 889578 903182 917178 931501
57162I31501J4771J6243J9034K1927K3429K3610K3774K4492K5136K5357K5734
$$ 931501 946272 962515 981549 1003476 1026905 1050515 1074289 1098781 1123917 1149274 1175008
57151A175008K6638K7611K8388K9366L0541L1057L0577L0054L0375L1135L1561
$$ 1175008 1201646 1229257 1257645 1287011 1317552 1348609 1379186 1409240 1439615 1470750 1502311
57140A502311L1737L2023L2148L1867L1855L2900L4748L6668L8514M0340M1536
$$ 1502311 1534048 1566071 1598219 1630086 1661941 1694841 1729589 1766257 1804771 1845111 1886647
57129A886647M1518M0831M0557M0994M1864M3348M5875M9145N2397N5534N9161
$$ 1886647 1928165 1968996 2009553 2050547 2092411 2135759 2181634 2230779 2283176 2338710 2397871
57118B397871O3688O9151P5580Q2740Q9755R5885J01452J07542J15130J25008
$$ 2397871 2461559 2530710 2606290 2689030 2778785 2874670 2976122 3083664 3198794 3323802
57108C323802J37936J54109J73091J95154K22142K56410K99683L53740M21206
$$ 3323802 3461738 3615847 3788938 3984092 4206234 4462644 4762327 5116067 5537273
57099E537273N04727O06303P28267Q73561J043768J238090J455335J694577J951644
$$ 5537273 6042000 6648303 7376570 8250131 9293899 10531989 11987324 13681901 15633545
57090A5633545K216471K475946K716861K923025L072944L147445L141200L063153
$$ 15633545 17850016 20325962 23042823 25965848 29038792 32186237 35327437 38390590
57082C8390590K925292K733318K483915K160754J731925J165759M64681l14612
$$ 38390590 41315882 44049200 46533115 48693869 50425794 51591553 52056234 51741622
57074E1741622j081205j753835k288409k674082k917479l034520l047994k982617
$$ 51741622 50660417 48906582 46618173 43944091 41026612 37992092 34944098 31961481
57066C1961481k859672k696260k507016k304119k096808j892405j696895j513770
$$ 31961481 29101809 26405549 23898533 21594414 19497606 17605201 15908306 14394536
57058A4394536j343972j188228j048251r24830q16378p20780o37402n65975n04653
$$ 14394536 13050564 11862336 10814085 9889255 9072877 8352097 7714695 7148720 6644067
57049F644067m50840m03321l62285l27648k98491k73946k53541k36714k22605
$$ 6644067 6193227 5789906 5427621 5099973 4801482 4527536 4273995 4037281 3814676
57040C814676k10195j98433j86569j74751j63730j53641j43665j33334j23302
$$ 3814676 3604481 3406048 3219479 3044728 2880998 2727357 2583692 2450358 2327056
57031B327056j14289j05948r7522q9029q1052p3825o7310o1603n6563n1568m6316
$$ 2327056 2212767 2106819 2009297 1920268 1839216 1765391 1698081 1636478 1579915 1528347 1482031
57020A482031m1456l7601l4282l0696k7037k4033k1499j8489j4743j0811o730
$$ 1482031 1440575 1402974 1368692 1337996 1310959 1286926 1265427 1246938 1232195 1221384 1214654
57009A214654j676M888J2666K1568L2376M6011O2961Q4022J10640J43023J77100
$$ 1214654 1212978 1217866 1230532 1252100 1284476 1330487 1393448 1477470 1588110 1731133 1908233
56998A908233K03150K08005J80728J19552L5521n1193j21112j64302j81923j81180
$$ 1908233 2111383 2319388 2500116 2619668 2655189 2603996 2482884 2318582 2136659 1955479
56988A955479j69485j52014j31936j11167r0933p2549n7866m8624m5080m5533
$$ 1955479 1785994 1633980 1502044 1390877 1299944 1227395 1169529 1120905 1075825 1030292
56978A030292m7442m8998m9588m8993m6896m3356l9242l5395l1536k6678k0676
$$ 1030292 982850 933852 884264 835271 788375 745019 705777 670382 638846 612168 591492
56967E91492j4691r780n676j457L058P238J0740J3979J7501K1413K5314K8232
$$ 591492 576801 567021 561345 559888 562946 570184 580924 594903 612404 633817 659131 687363
56955F87363K8588K4900J6983O344m702j4161k0807k4282k5077k4156k2308j9972
$$ 687363 715951 740851 757834 764178 759476 745315 724508 700226 675149 650993 628685 608713
56943F08713j7528j5242j2809r504n140m03M038Q335J3015J8261K4027L0260L6284
$$ 608713 591185 575943 563134 553630 548490 548087 552125 560460 573475 591736 615763 646023 682307
56930F82307M0179L9624L3399K1935O864r263k3267l2602l6786l7179l5422l2592
$$ 682307 722486 762110 795509 817444 824308 815045 791778 759176 722390 685211 649789 617197
56918F17197k9544k6887k4413k1376j7807j4724j2724j1189r384p548o201n086
$$ 617197 587653 560766 536353 514977 497170 482446 469722 458533 449149 441601 435400 430314
56906D30314l712k362j624j225l17J140K262K590K695L278M308N432O623Q065
$$ 430314 426602 424240 422616 421391 421074 422214 424476 427066 429761 433039 437347 442779 449402 457467
56892D57467R682J1276J2899J4871J7526K0931K4596K7239K7125K3076J5361N610
$$ 457467 467149 478425 491324 506195 523721 544652 569248 596487 623612 646688 662049 667659
56880F67659m126j2357j8407k2026k3002k1425j8219j4860j2220r751o232j217
$$ 667659 663533 651176 632769 610743 587741 566316 548097 533237 521017 511266 505034 503817
56868E03817M512R954J4975K0314K6724L4391M3016N2217O1356O8764P1330O5672
$$ 503817 508329 518283 533258 553572 580296 614687 657703 709920 771276 840040 911370 977042
56856I77042N0471K7889K656k0321l7805m8643n3237n2785m8646m2041l4123k5932
$$ 977042 1027513 1055402 1058058 1037737 999932 951289 898052 845267 796621 754580 720457 694525
56844F94525j8012j0210k033O836J6491K7028L8671N1746O6543Q2730R8649J11250
$$ 694525 676513 666303 664270 671106 687597 714625 753296 805042 871585 954315 1052964 1164214
56832A164214J16831J11692R2839N9820J6990k6862o2850q6522r8274j00432r5322
$$ 1164214 1281045 1392737 1485576 1545396 1562386 1535524 1472674 1386152 1287878 1187446 1092124
56821A092124q5616p4365o3428n2648m1277k9595j8590q577J177J1688K3553L6705
$$ 1092124 1006508 932143 868715 816067 774790 745195 726605 718028 719205 730893 754446 791151
56809G91151N0394O3493P4762Q2283Q2664P2020M9063J7229j6781m6540o8100
$$ 791151 841545 905038 979800 1062083 1144747 1216767 1265830 1283059 1266278 1219738 1151638
56798A151638p9998q2817p9033p2022o4191n6055m7267l8048k9167k0999j3270
$$ 1151638 1071640 988823 909790 837768 773577 717522 670255 632207 603040 582041 568771
56787E68771n739J469Q383J5543K3381L1524L8891M4177M5664M1054K8734R914
$$ 568771 563032 564501 572884 588427 611808 643332 682223 726400 772064 813118 841852 851766
56775H51766j1027k9091m1549m8323n0416m8868m4966m0228l5747l1859k8512
$$ 851766 840739 811648 770099 721776 671360 622492 577526 537298 501551 469692 441180
56764D41180k5470k2295j8805j5507j3046j1145q937o351m379l663l662l602l409
$$ 441180 415710 393415 374610 359103 346057 334912 325975 319624 315245 311582 307920 304318 300909
56751C00909l220k726j771r67r61j443j604j263q76p14p20r51j515k173k568k717
$$ 300909 297689 294963 293192 292225 291264 289821 288217 286954 286078 285364 284644 283693 282178 280005 277437 274720
56735B74720k834k825k524k170k090k163k103k073k342k587k274j627j338j419
$$ 274720 271886 269061 266537 264367 262277 260114 258011 255938 253596 251009 248735 247108 245770 244351
56721B44351j146l50K21J1n79r44j081j201j125n81K01P50Q47N28j22q43j161
$$ 244351 243205 242855 243076 243087 242508 241564 240483 239282 238157 237576 237777 238527 239374 239902 239780 238937 237776
56704B37776q72k91K16P00J273J641J390N55m34j209j583j442q79l34j75k27p0
$$ 237776 236904 236613 236829 237529 238802 240443 241833 242388 241954 240745 239162 237720 236841 236507 236332 236105 236035
56687B36035L41O26N21J09m57j079j519j445q12PO13R46J168J329J331J112P49
$$ 236035 236376 237002 237523 237632 237175 236096 234577 233132 232320 232327 232940 233886 235054 236383 237714 238826 239575
56670B39575L60M8q6M9M52R00J067Q46N62O72J228J807K000J855J750J979K543
$$ 239575 239935 239983 239897 239946 240398 241298 242365 243211 243773 244445 245673 247480 249480 251335 253085 255064 257607
56653B57607L148L355K943K289K102K514K728J965N35n07p41p79j269k015k445
$$ 257607 260755 264110 267053 269342 271444 273958 276686 278651 279186 278679 277938 277159 275890 273875 271430
56638B71430k430k256k076j929k046k653l487l927l671k949k070j160l52J53L28
$$ 271430 269000 266744 264668 262739 260693 258040 254553 250626 246955 244006 241936 240776 240424 240577 240905
56623B40905L22P7o87j854k709k658j920j191q04n72k53J84O54R47P80J96k15
$$ 240905 241227 241304 240617 238763 236054 233396 231476 230285 229481 228909 228656 228840 229494 230441 231221 231417 231202
56606B31202Q4P64R92N60J42K55N73N43K48J06J05j56p24j142j021m90J0J03k98
$$ 231202 231286 232050 233042 233602 233744 233999 234572 235115 235363 235469 235574 235418 234694 233552 232531 232041 232051 232154 231856
56587B31856q85j096o29J46N64M29J65J70L94O78J141J888K553K540J813J105
$$ 231856 230971 229875 229246 229392 229956 230385 230550 230720 231114 231792 232933 234821 237374 239914 241727 242832
56571B42832J165J956K805L260L506L929M546N117N633O367P472Q721R694J0067
$$ 242832 243997 245953 248758 252018 255524 259453 263999 269116 274749 281116 288588 297309 307003 317070
56557C17070R703Q796P890P438P204O492N109L791L251L246K973K173J290N83
$$ 317070 326773 335569 343459 350897 358101 364593 369702 373493 376744 379990 382963 385136 386426 387009
56543C87009k18j331k526l531m347m966n199n160n434o341p360p795p741p760
$$ 387009 386791 385460 382934 379403 375056 370090 364891 359731 354297 347956 340596 332801 325060 317300
56529C17300p813p266o018m797l982k880q55J245J736K00j800k468j719r26j098
$$ 317300 309487 302221 296203 291406 287424 284544 283689 284934 286670 286870 285070 282602 280883 279957 278859
56514B78859j891k445k560k638k830k734k097j320r69j000r23o31n24p68r01n65
$$ 278859 276968 274523 271963 269325 266495 263761 261664 260344 259375 258375 257452 256821 256297 255529 254628 254063
56498B54063j77l74j027j430j340j220j391j496j071j67Q43J670K083J930J434
$$ 254063 253886 253512 252485 251055 249715 248495 247104 245608 244537 244370 245213 246883 248966 250896 252330
56483B52330J138J259J471J546J738K123K148J492R23J501L088M429M701M261
$$ 252330 253468 254727 256198 257744 259482 261605 263753 265245 266168 267669 270757 275186 279887 284148
56469B84148L837L724L920M389M905N046M710M286M196M567N323O082O022M512
$$ 284148 287985 291709 295629 300018 304923 309969 314679 318965 323161 327728 333051 339133 345155 349667
56455C49667K057k8j133j822k596l003k584j956k050k714k950k368j564j113r62
$$ 349667 351724 351696 350563 348741 346145 343142 340558 338602 336552 333838 330888 328520 326956 325843 324881
56440C24881r68j297j972k551k605k231j829j631j620j751j922j916j549q86j79
$$ 324881 323913 322616 320644 318093 315488 313257 311428 309797 308177 306426 304504 302588 301039 300153 299974
56425B99974L76O93O82K42n73j434j980k149k229k453k698k672k350j963j634
$$ 299974 300350 301043 301725 301967 301394 299960 297980 295831 293602 291149 288451 285779 283429 281466 279832
56410B79832j249p02q2M33P27P32M88K54L55Q00J276J525J612J685J688J404P25
$$ 279832 278583 277881 277799 278232 278959 279691 280179 280433 280788 281588 282864 284389 286001 287686 289374 290778 291503
56393B91503j74q26p43J16J195J859J975J786J459J046P88Q77J007O98M0m14n01
$$ 291503 291329 290503 289760 289876 291071 292930 294905 296691 298150 299196 299984 300861 301868 302566 302606 302192 301691
56376C01691n73o86l87L94R50P54K35J14M32P53R38J155J413J578J711J922K053
$$ 301691 301118 300432 300045 300439 301389 302143 302378 302492 302924 303677 304615 305770 307183 308761 310472 312394 314447
56359C14447J866J449J155J230J613J947J790J126O66J099K055K436J968J498
$$ 314447 316313 317762 318917 320147 321760 323707 325497 326623 327289 328388 330443 332879 334847 336345
56345C36345J532J487R99Q95J864K964K737J299J58J53P62J374K093L127M291
$$ 336345 337877 339364 340363 341258 343122 346086 348823 350122 350280 350433 351195 352569 354662 357789 362080
56330C62080N366O277O794O763O615O922P455P459O943O781P400Q247Q819R348
$$ 362080 367446 373723 380517 387280 393895 400817 408272 415731 422674 429455 436855 445102 453921 463269
56316D63269R945R950Q853P287O341O151N873M938L728K876K416J840Q34l18j134
$$ 463269 473214 483164 492017 499304 505645 511796 517669 522607 526335 529211 531627 533467 534301 533983 532849
56301E32849j511j672j655j259n86j56k22l45l8N76J161J880L096M626N968P004
$$ 532849 531338 529666 528011 526752 526166 526010 525788 525443 525405 525981 527142 529022 532118 536744 542712 549716
56285E49716Q018R128J0334J1846J3705J5310J6153J6819J8354K0662K2590K3782
$$ 549716 557734 566862 577196 589042 602747 618057 634210 651029 669383 690045 712635 736417
56273G36417K5429K8627L2869L6819L9989M3013M6620N1102N6532O3024P0558
$$ 736417 761846 790473 823342 860161 900150 943163 989783 1040885 1097417 1160441 1230999
56262A230999P8881Q7678R6819J06467J16862J27875J38907J49344J58892J67188
$$ 1230999 1309880 1397558 1494377 1600844 1717706 1845581 1984488 2133832 2292724 2459912
56252B459912J73407J76747J77098J74615J68768J58452J43111J23302J00172
$$ 2459912 2633319 2810066 2987164 3161779 3330547 3488999 3632110 3755412 3855584
56243C855584P5014M9317K4422R43k1009m0901n7631p0514p9860q6365r0529r2846
$$ 3855584 3930598 3979915 4004337 4005280 3984271 3943370 3885739 3815225 3735365 3649000 3558471 3465625
56231C465625r4002r4468r4346r3898r3860r4895r6949r9401j01614j03216j04113
$$ 3465625 3371623 3277155 3182809 3088911 2995051 2900156 2803207 2703806 2602192 2498976 2394863
56220B394863j04419j04249j03551j02272j00523r8236r4892r0048q4115p8050
$$ 2394863 2290444 2186195 2082644 1980372 1879849 1781613 1686721 1596673 1512558 1434508
56210A434508p2397o7075o2019n7355n2924m8315m3527l9078l5222l1681k8259
$$ 1434508 1362111 1295036 1233017 1175662 1122738 1074423 1030896 991818 956596 924915 896656
56199H96656k5165k2520k0010j7394j4926j3040j1860j1148j0492r457p936o373
$$ 896656 871491 848971 828961 811567 796641 783601 771741 760593 750101 740644 732708 726335
56187G26335n319m795m363l717k874j860o47P10K251M164O296P903Q538Q838R787
$$ 726335 721016 716221 711858 708141 705267 703407 702760 703470 705721 709885 716181 724084 732622 741460 751247
56172G51247J1454J3134J4493J5655J6452J6532J6183J6088J6209J5799J4563
$$ 751247 762701 775835 790328 805983 822435 838967 855150 871238 887447 903246 917809
56161I17809J3016J1624J0378R146P712N626K918Q69Q94K733M783O297Q072J0919
$$ 917809 930825 942449 952827 961973 969685 975311 978229 979098 979992 982725 987508 993805 1001877 1012796
56147A012796J4722J9354K5239L2559M0913N0257O1231P4179Q8648J04145J20389
$$ 1012796 1027518 1046872 1072111 1104670 1145583 1195840 1257071 1331250 1419898 1524043 1644432
56136A644432J36349J49942J58978J61886J57610J46067J29145J10342R3039P9517
$$ 1644432 1780781 1930723 2089701 2251587 2409197 2555264 2684409 2794751 2887790 2967307
56126B967307P0875O6312O2471N5287M3129K7353J0049p014k1466l1033l6321
$$ 2967307 3038182 3104494 3166965 3222252 3265381 3292734 3302783 3295769 3274303 3243270 3206949
56115C206949m1176m9162o0996p5970r3771j13295j31310j44127j50083j49438
$$ 3206949 3165773 3116611 3055615 2979645 2885874 2772579 2641269 2497142 2347059 2197621
56105B197621j43014j32071j18523j03894q8693p3502n9760m8543l9536l2088
$$ 2197621 2054607 1922536 1804013 1700119 1611426 1537924 1478164 1429621 1390085 1357997
56095A357997k6286k2176j9063j6568j5282j5368j5601j4849j3449j2236j1245
$$ 1357997 1331711 1309535 1290472 1273904 1258622 1243254 1227653 1212804 1199355 1187119 1175874
56084A175874j0316r734r254p734m960k540j790j844j103N71K358M003N501O355
$$ 1175874 1165558 1155824 1146570 1138836 1133876 1131336 1129546 1127702 1126599 1127170 1129528 1133531 1139032 1145387
56070A145387O549P243R138J1143J1972J1955J2040J2118J1826J1820J2679J3551
$$ 1145387 1151936 1159179 1168317 1179460 1191432 1203387 1215427 1227545 1239371 1251191 1263870 1277421
56058A277421J3527J3373J4287J5876J6921J7347J7841J8357J8562J8986K0161
$$ 1277421 1290948 1304321 1318608 1334484 1351405 1368752 1386593 1404950 1423512 1442498 1462659
56047A462659K1388K1814K1943K2692K3759K4402K4941K6009K7190K7888K8635
$$ 1462659 1484047 1505861 1527804 1550496 1574255 1598657 1623598 1649607 1676797 1704685 1733320
56036A733320L0094L1608L2233L2390L3136L4700L6902L9943M3444M5995M7007
$$ 1733320 1763414 1795022 1827255 1859645 1892781 1927481 1964383 2004326 2047770 2093765 2140772
56025B140772M7858M9872N2484N4620N6285N7567N7939N7963N9630O3262O6334
$$ 2140772 2188630 2238502 2290986 2345606 2401891 2459458 2517397 2575360 2634990 2698252 2764586
56014B764586O7183O7587O9526P1998P3604P5707P9991Q5115Q9031R2492R7076
$$ 2764586 2831769 2899356 2968882 3040880 3114484 3190191 3270182 3355297 3444328 3536820 3633896
56003C633896J01846J05412J09356J15898J23964J31274J38504J47599J57742
$$ 3633896 3735742 3841154 3950510 4066408 4190372 4321646 4460150 4607749 4765491
55994D765491J66924J75950J86869J99013K10618K22648K36945K52422K67468
$$ 4765491 4932415 5108365 5295234 5494247 5704865 5927513 6164458 6416880 6684348
55985F684348K84116L05153L29084L52970L78301M08618M43262M79332N18135
$$ 6684348 6968464 7273617 7602701 7955671 8333972 8742590 9185852 9665184 10183319
55976A0183319N63573O15814O72919P37155Q12902Q99822R95338J102536J228178
$$ 10183319 10746892 11362706 12035625 12772780 13585682 14485504 15480842 16583378 17811556
55967A7811556J374581J542016J737913J974584K259182K596620L002332L501526
$$ 17811556 19186137 20728153 22466066 24440650 26699832 29296452 32298784 35800310
55959C5800310M117088M872956N812853P003116Q514487J0415636J2787000J5720714
$$ 35800310 39917398 44790354 50603207 57606323 66120810 76536446 89323446 105044160
55951A05044160J9297378K3578347K8603259L4274554M0045594M4581716M5802313
$$ 105044160 124341538 147919885 176523144 210797698 250843292 295425008 341227321
55944C41227321M1602571L1042232J5253205k698940j9084094l1115867l7847960
$$ 341227321 382829892 413872124 429125329 426426389 407342295 376226428 338378468
55937C38378468l9940902l8776649l5695554l1704313k7487691k3468058j9853709
$$ 338378468 298437566 259660917 223965363 192261050 164773359 141305301 121451592
55930A21451592j6712179j4044181j1814731r961680q418504p136095o076631
$$ 121451592 104739413 90695232 78880501 68918821 60500317 53364222 47287591
55923D7287591n198747m463439l846941l334504k906764k542845k231250j966835
$$ 47287591 42088844 37625405 33778464 30443960 27537196 24994351 22763101 20796266
55915B0796266j740942j543650j371886j226230j102442r93669q97971q16315
$$ 20796266 19055324 17511674 16139788 14913558 13811116 12817447 11919476 11103161
55907A1103161p45805o81612o23125n71829n25574m81060m39547m04202l73860
$$ 11103161 10357356 9675744 9052619 8480790 7955216 7474156 7034609 6630407 6256547
55898F256547l44988l17639k93992k73062k52236k32300k15718k01646j87571
$$ 6256547 5911559 5593920 5299928 5026866 4774630 4542330 4326612 4124966 3937395
55889C937395j74148j63462j54241j43847j33448j26168j21271j15179j07331
$$ 3937395 3763247 3599785 3445544 3301697 3168249 3042081 2920810 2805631 2698300
55880B698300j00182r4215q7681q0849p5879p2670o8907o4148o0009n6629n2665
$$ 2698300 2598118 2503903 2416222 2335373 2259494 2186824 2117917 2053769 1993760 1937131 1884466
55869A884466m8509m5849m4346m2187l9617l8387l8035l6244l2723k9271k6133
$$ 1884466 1835957 1790108 1745762 1703575 1663958 1625571 1587536 1551292 1518569 1489298 1463165
55858A463165k1734j6127j1454q854p888q961j3207j9765k6100l1129l5409l8412
$$ 1463165 1441431 1425304 1413850 1404996 1397108 1388147 1374940 1355175 1329075 1297946 1262537 1224125
55846A224125l8678l6639l4266l1832k7914k2779j8606j5987j3235r738p150o532
$$ 1224125 1185447 1148808 1114542 1082710 1054796 1032017 1013411 997424 984189 974451 967301 960769
55834I60769o907p447q656j0646j2478j3915j5710j7651j8453j8117j8188j9153
$$ 960769 953862 946415 937759 927113 914635 900720 885010 867359 848906 830789 812601 793448
55822G93448j9744j9470j9544k0517k1044k0039j8204j6540j5001j3440j2299
$$ 793448 773704 754234 734690 714173 693129 673090 654886 638346 623345 609905 597606
55811E97606j1531j0239q151o141m720l334j626o0J195K683M506N957O687P022
$$ 597606 586075 575836 567685 561544 556824 553490 551864 551804 552999 555682 560188 566145 572832 579854
55797E79854O895N660L236K43l031o543r486j0871j1141j1591j2189j1670r989
$$ 579854 586749 592409 595645 595888 592857 586314 576828 565957 554816 543225 531036 519366 509377
55784E09377q766q809q936p916n981l790j430O79J290k71l199o361r368j1993
$$ 509377 500611 491802 482866 474950 468969 465179 463749 464428 465718 465447 462248 455887 446519 434526
55770D34526j3487j3349j2062j0533r311q475p817o972n940n302n326n361m967
$$ 434526 421039 407690 395628 385095 375784 367309 359492 352520 346580 341278 335952 330591 325624
55757C25624m895n803o665o055m540l986m820n804o371p161q153q251p185o017
$$ 325624 320729 314926 308261 302206 297666 293680 288860 283056 276685 269524 261371 253120 245935 239918
55743B39918n423n103n120o005p119o832m949l191k591k209j120R1Q03J597K862
$$ 239918 234495 229392 224272 218267 211148 204316 199367 196176 193585 191376 190256 190347 191150 192747 195609
55728A95609L587K720O73j510l414m853n369m986m503m312l844k842j978j598
$$ 195609 199196 201916 202589 201079 197665 192812 187443 182457 177954 173642 169798 166956 164978 163380
55714A63380j082k40j5q14j380m30J552L240M327N331O238O513O058N256M294
$$ 163380 162298 162058 162043 161229 159849 159419 160971 164211 168538 173869 180107 186620 192678 197934 202228
55699B02228L019J271r08k959l711k429m1J682K281K845L923M626M329L786L758
$$ 202228 205247 206518 205610 202651 198940 196511 196470 198152 200433 203278 207201 211827 216156 219942 223700
55684B23700L760L154K390K170K285K132J672J086K37p97j486j706k007k510k502
$$ 223700 227460 230614 233004 235174 237459 239591 241263 242349 242586 241789 240303 238597 236590 234080 231578
55669B31578j708q99m98K33J768L186L516L173L033K910K184J131N94P67J294
$$ 231578 229870 228971 228473 228706 230474 233660 237176 240349 243382 246292 248476 249607 250201 250968 252262
55654B52262K017K761K995K503J800J238M07q97k006k590l549n591p765q604q170
$$ 252262 254279 257040 260035 262538 264338 265576 265983 265086 263080 260490 256941 251350 243585 234981 226811
55639B26811p714p823q069q152q222q230p935p430o961o492o035n970o320o304
$$ 226811 219097 211274 203205 195053 186831 178601 170666 163236 156275 149783 143748 137778 131458 125154
55625A25154n370m148l581l551l310k689k073j546j040q39j113j292q26j18J36
$$ 125154 119784 115636 112055 108504 105194 102505 100432 98886 97846 97007 95894 94602 93776 93658 93794
55610I3794N9J61K94K3l99m94n82j201j874j615n36J60j70r86j574j792j738j510
$$ 93794 93853 94014 94308 94331 93932 93438 92856 91655 89781 88166 87630 87790 87620 86634 85060 83268 81530 80020
55592H0020j338j299j000k60K06l52j340j356j73Q05K81j477l143l629k766j293
$$ 80020 78682 77383 76383 76123 76329 75977 74637 73281 73108 73913 74194 72717 69574 65945 63179 61886
55576F1886l49n17j221j474j081o40n81p90j076j357j408j080o96o83q40o23k8
$$ 61886 61537 61020 59799 58325 57244 56604 56023 55233 54157 52800 51392 50312 49616 48933 48093 47470 47442
55559D7442M69Q02J400K324L007L038K663K327K206K343K640K687K017Q15q4j31
$$ 47442 47911 48713 50113 52437 55444 58482 61145 63472 65678 68021 70661 73348 75365 76180 76096 75965
55543G5965L46O46N32L53N71J326K300K954K974K559K204K245K594K872K748K310
$$ 75965 76311 76957 77489 77842 78413 79739 82039 84993 87967 90526 92730 94975 97569 100441 103189 105499
55527A05499K063K331K779K802K306J625Q17k97j410j908j907k280l354m422m923
$$ 105499 107562 109893 112672 115474 117780 119405 120222 119925 118515 116607 114700 112420 109066 104644 99721
55512I9721n191n485n301m352l386l100l033k473j771j711k146k381k398k583
$$ 99721 94530 89045 83744 79392 76006 72906 69873 67400 65629 63918 61772 59391 56993 54410
55498E4410k637j964r40n95j101j595j503j059n59p0Q8m48j320j736j562j343
$$ 54410 51773 49809 48869 48274 47173 45578 44075 43016 42457 42387 42475 42027 40707 38971 37409 36066
55482C6066j323j265j168j212j040j40J005J213L28m40k03M62N94J40l35n74o28
$$ 36066 34743 33478 32310 31098 30058 29918 30923 32136 32464 32024 31821 32283 32877 33017 32682 32108 31480
55465C1480m60j52j01n29j031j007m11K12L16r2m82l86o3k68j147j738j145J87
$$ 31480 31020 30868 30767 30238 29207 28200 27789 28001 28317 28225 27743 27357 27294 27026 25879 24141 22996 23183
55447B3183J052J022O92N24L94K43K50K14l67j321j740j228m83k92n40o41l73
$$ 23183 24235 25257 25949 26473 26867 27110 27360 27574 27207 25886 24146 22918 22435 22143 21603 20962 20589
55430B0589J35P55J265J289Q22M50O29J007Q13j65j294j722j155m5Q32J085R42
$$ 20589 20724 21479 22744 24033 24855 25305 25934 26941 27754 27589 26295 24573 23418 23373 24205 25290 26232
55413B6232Q33Q75R83J122J267J239R38N73L58K03J2jK41K66l38j149j370q79
$$ 26232 27065 27940 28923 30045 31312 32551 33489 34062 34420 34623 34635 34634 34875 35141 34803 33654 32284 31405
55395C1405k53O2j6n74j543k323k240j433o07o3M20Q89J163J330J503J238P9j383
$$ 31405 31152 31214 31198 30624 29081 26758 24518 23085 22478 22415 22835 23724 24887 26217 27720 28958 29037 27654
55377B7654j940j352n26j54j08k66p95j310r73J72R59P73M66R04J583J504O73
$$ 27654 25714 24362 23836 23682 23574 23308 22513 21203 20230 20402 21361 22134 22600 23504 25087 26591 27264
55360B7264q0k64K0N36R55Q41J92l65m38m59q71j256r28m7N97O25L29M7j11m2
$$ 27264 27184 26920 26940 27476 28431 29272 29464 29099 28661 28202 27331 26075 25147 25100 25697 26322 26651 26698 26587 26545
55340B6545K95O14N15Lm60m31J53R44J420J316Q70M52k7q67j766j918j098o9M21
$$ 26545 26840 27454 27969 27972 27512 27081 27234 28178 29598 30914 31784 32236 32209 31342 29576 27658 26560 26491 26912
55321B6912M64N00N64M90L54K57N1k52k62J43M00K7n78p09l86j94l48m80l06Q5
$$ 26912 27376 27876 28440 28930 29284 29541 29592 29340 29078 29221 29621 29648 29070 28361 27975 27781 27433 26953 26647 26732
55301B6732N11P81O33j5p71j108r05m11J53O75R35Q01M82K85J84l1l29m69l83
$$ 26732 27243 28024 28657 28642 27871 26763 25858 25447 25600 26275 27210 28011 28493 28778 28962 28931 28602 28133 27750
55282B7750j94O5M64R69J433J713J631J043Q6p60j167j264j299j224r44o69o57
$$ 27750 27556 27621 28085 29054 30487 32200 33831 34874 34960 34200 33033 31769 30470 29246 28302 27633 26976
55265B6976p47n77j45K15M05O87J236J829K070J743R23n9p92j058r56p12m44j97
$$ 26976 26229 25652 25507 25722 26127 26814 28050 29879 31949 33692 34615 34556 33764 32706 31750 31038 30594 30397
55247C0397j02k65n70p28n47j19K79M52M82N94P83P91N68M40N38M04l28j083r06
$$ 30397 30295 30030 29460 28732 28185 28066 28345 28797 29279 29873 30656 31447 32015 32455 32993 33397 33069 31986 31080
55228C1080J45R04N88l33j016j300j397j195m66M68J002J070J176J622K043J849
$$ 31080 31225 32129 32717 32384 31368 30068 28671 27476 27010 27478 28480 29550 30726 32348 34391 36240
55212C6240R74J02M5Q12J469J165J52o03o65m49l27j85Q9K88K98J93j76j012j834
$$ 36240 37214 37316 37361 38173 39642 40807 40959 40356 39691 39242 38915 38730 38819 39107 39405 39598 39422 38410 36576
55193C6576j723o65J86O7m07l90r1j78n29n23n0N23J024J351J146L50l46l98k66
$$ 36576 34853 34188 34374 34441 34034 33644 33553 33375 32846 32323 32273 32796 33820 35171 36317 36667 36321 35923 35657
55174C5657n12o41N1R86R37J5m40L2L91n8o04m76j09k54p27r48r73j133j110l39
$$ 35657 35145 34504 34555 35541 36478 36493 36053 36085 36476 36418 35814 35338 35229 34975 34248 33300 32327 31194 30084 29745
55154B9745Q54J468J092L59JR4K68L30L30L28L18K95K81K38P0k62o40q51q41p19
$$ 29745 30599 32067 33159 33518 33519 33613 33881 34211 34541 34869 35187 35482 35763 36001 36071 35809 35169 34318 33477 32758
55134C2758m61K05J282K077J763M59p04q25j30O47J350K309L367L673K696R99
$$ 32758 32297 32502 33784 35861 37624 38083 37379 36554 36424 37071 38421 40730 44097 47770 50466 51465
55118E1465l01o41l52k2R6J17K11L82M13R5m40o83l27K09K10l73q46p43m14l18
$$ 51465 51164 50523 50171 50149 50245 50362 50573 50955 51368 51463 51023 50340 50013 50222 50432 50059 49213 48470 48056 47738
55098D7738k81P7O14Q98Q91P76M42k01n96q2R86J481R37po50q75o85N5J002J383
$$ 47738 47457 47534 48148 49046 49937 50713 51155 50954 50358 50276 51262 52743 53680 53673 53023 52148 51463 51518 52520 53903
55078E3903J049P78J076J428J248P75M90L33J30J56O06J040J042Q51P30L32m95
$$ 53903 54952 55730 56806 58234 59482 60257 60747 61080 61210 61366 61972 63012 64054 64905 65635 65967 65472
55061F5472j031p04j66k36m61L8P79N15n12o14P77K040J583r7j396j709j617j621
$$ 65472 64441 63737 63571 63335 62874 62912 63691 64206 63694 63080 63857 65897 67480 67383 65987 64278 62661 61040
55043F1040j615j469j263r78m30L90J152J451J140N33K11N01J060J235P87O5n27
$$ 61040 59425 57956 56693 55715 55285 55675 56827 58278 59418 59951 60162 60663 61723 62958 63745 63810 63283
55026F3283q50q61n30k1L65N22O07O56N09J58j27j83j69k35k20J90J046J956K318
$$ 63283 62433 61572 61042 61021 61386 61908 62515 63171 63680 63838 63711 63528 63359 63124 62904 63094 64140 66096 68414
55007F8414J813P63j18m28l81l11k49j48k13n69r61j141j276j529j597j179o37
$$ 68414 70227 70990 70872 70444 70063 69752 69503 69355 69142 68573 67612 66471 65195 63666 62069 60890 60253
54990F0253n22p53q61q06p99n19N37J940K551K058J390J351J605J493J052P15
$$ 60253 59731 58978 58117 57311 56512 55993 56530 58470 61021 63079 64469 65820 67425 68918 69970 70685
54974G0685N69N12O80J134J449J124L02l91n35k54J36M83Q83J492K196K540K234
$$ 70685 71254 71766 72446 73580 75029 76153 76455 76064 75529 75275 75411 75894 76777 78269 80465 83005 85239
54957H5239J691J692K464L494M321N006N695O206O460O918Q142J0063J1938J2972
$$ 85239 86930 88622 91086 94580 98901 103907 109602 115808 122268 129186 137328 147391 159329 172301
54943A72301J2746J1232Q638N365J974r54l162m986o978r126j0732j1355j1464
$$ 172301 185047 196279 204917 210282 212256 211302 208140 203154 196176 187050 176318 164963 153499
54930A53499j1663j1628j0580q671o999o174n580m422k841j598j110j157j260
$$ 153499 141836 130208 119628 110957 103958 97784 92204 87782 84941 83343 82233 81076 79816
54917G9816j087o50k62m8M08J553L097M252M710M872N136N590O430P845R433J0440
$$ 79816 78729 78079 77817 77769 78177 79730 82827 87079 91789 96661 101797 107387 113817 121662 131095 141535
54901A41535J0867J1429J2128J1754R369N545J517k172n525q215r867j0775j1542
$$ 141535 152402 163831 175959 187713 197082 202627 204144 201972 196447 188232 178365 167590 156048
54888A56048j2120j1961j0962r630q329p028n729m659l893l261k631k050j607
$$ 156048 143928 131967 121005 111375 103046 96018 90289 85630 81737 78476 75845 73795 72188
54875G2188j346j239j102o83n4L61L31R1j34n08j073j321p64K31P14J88r99k160
$$ 72188 70842 69603 68501 67818 67764 68125 68456 68547 68413 67905 66832 65511 64747 64978 65692 65880 64881 62721
54857F2721k758k566j743p95j68Q7J23o1m28o79n30j73l2k17m55n53n42m75l01
$$ 62721 59963 57397 55654 54859 54691 54778 54901 54840 54412 53733 53203 53030 52998 52781 52326 51773 51231 50756 50455
54838E0455K7M62Q54R80Q12P60J236J878J740N88n37n97J25O07O01P36J259J570
$$ 50455 50482 50944 51798 52778 53590 54350 55586 57464 59204 59792 59255 58658 58783 59390 59991 60727 61986 63556
54820F3556J172M31K9J87N94Q69Q43O04M31M97O42O25N31O86J169J694K040K250
$$ 63556 64728 65159 65188 65375 65969 66838 67681 68285 68716 69213 69855 70480 71011 71697 72866 74560 76600 78850
54802G8850K432K624K979L759M977O180O849O969P138Q059R852J1875J3245J3534
$$ 78850 81282 83906 86885 90644 95621 101801 108650 115619 122757 130816 140668 152543 165788 179322
54788A79322J2873J1539R665P378M841K033j178m569p450r274j0113j0277r819
$$ 179322 192195 203734 213399 220777 225618 227651 226473 221904 214454 205180 195067 184790 174971
54775A74971q722p339o233n604n114m247k811j241l85o69j409j422m25O65J151
$$ 174971 166249 158910 152677 147073 141959 137712 134901 133660 133275 132606 131197 129775 129350 130015 131166
54760A31166J553K741M637O483P935R145J0083J0624J1154J2300J3948J5323J6030
$$ 131166 132719 135460 140097 146580 154515 163660 173743 184367 195521 207821 221769 237092 253122
54747B53122J6316J6240J5227J2839R400N499J319l219p921j2174j5257j6756
$$ 253122 269438 285678 300905 313744 323144 328643 329962 326743 318822 306648 291391 274635
54735B74635j6894j6424j5953j5382j4324j2949j1900j1362j0701r290p263n290
$$ 274635 257741 241317 225364 209982 195658 182709 170809 159447 148746 139456 132193 126903
54723A26903l918l280l163l120k754k091j550j412j502j465j257j130j259j459
$$ 126903 122985 119705 116542 113422 110668 108577 107027 105615 104113 102648 101391 100261 99002 97543
54709I7543j315o27K19N62K18l14m79l07j20LJ47J59j13l46k5P98J438J316N05
$$ 97543 96228 95601 95820 96382 96600 96286 95807 95500 95380 95383 95530 95689 95576 95230 95205 96003 97441 98757 99262
54690I9262m67j028q96k91K47M69O25Q38P64L02J32P57J466J199J86l12J75Q50
$$ 99262 98795 97767 96871 96580 96827 97296 97921 98759 99523 99825 99957 100714 102180 103379 103565 103253 103428 104278
54672A04278J195J723K805L806M058L829L650L401K814K238K157K415K625K883
$$ 104278 105473 107196 110001 113807 117865 121694 125344 128745 131559 133797 135954 138369 140994 143877
54658A43877L385L780L680L395L382L380K939K570L310N165O922P775Q237R178
$$ 143877 147262 151042 154722 158117 161499 164879 167818 170388 173698 178863 185785 193560 201797 210975
54644B10975J0654J2136J3405J4671J6047J7220J7586J6614J4205J0765O735K124
$$ 210975 221629 233765 247170 261841 277888 295108 312694 329308 343513 354278 361013 363137
54632C63137l182q652j3104j5716j6744j7075j7276j7250j6632j5308j3632j2179
$$ 363137 359955 351303 338199 322483 305739 288664 271388 254138 237506 222198 208566 196387
54620A96387j1176j0216q762o906n298m282l474k418j278n18j57K23P93J221J148
$$ 196387 185211 174995 166233 159327 154029 149747 146273 143855 142577 142059 141902 142125 142918 144139 145287
54605A45287O14j17q24j317j399j122r94j586k846l944m074l376k905l468m587
$$ 145287 145901 145784 144960 143643 142244 141122 140128 138542 135696 131752 127678 124302 121397 117929 113342
54590A13342m898l698j811o69o84j002q51n21p31j430j843j566j056r41j270j658
$$ 113342 108444 104746 102935 102266 101582 100580 99729 99208 98477 97047 95204 93638 92582 91641 90371 88713
54574H8713j763j444p59q1M3n05j125j067k82N61P97L73k09l60Q5O92Q26L52k05
$$ 88713 86950 85506 84747 84666 84709 84204 83079 82012 81730 82291 83088 83461 83252 82892 82977 83669 84495 84847 84642
54555H4642k96P3N30Q49R83Q15L20j77k47J71P87J370J881K320K761L381M177
$$ 84642 84346 84419 84949 85798 86781 87596 87916 87739 87492 87663 88450 89820 91701 94021 96782 100163 104340
54538A04340M778M864M654M561M654M870N522O834Q125Q292P193N810M817L788
$$ 104340 109118 113982 118636 123197 127851 132721 138243 145077 153202 161494 168687 174497 179314 183102
54524A83102K156J91j568l222n122o984q043p996p227o254n340m549l864l314
$$ 183102 185258 185449 183881 180659 175537 168553 160510 152514 145287 139033 133693 129144 125280 121966
54510A21966l156l646m449m689l975k939k317j965j359o49l98n04k68M27Q77N90
$$ 121966 118810 115164 110715 106026 102051 99112 96795 94830 93471 92822 92424 91920 91652 92079 92956 93546
54494I3546p4o04r52j198j110m63N36J435J900J749J046K81J09O03J166J368J424
$$ 93546 93472 92868 91916 90718 89608 89145 89681 91116 93016 94765 95811 96092 96201 96804 97970 99338 100762
54477A00762J607J652J171L05m92j059j478j609j213l81M88J047J086N43j98l00
$$ 100762 102369 104021 105192 105497 105005 103946 102468 100859 99646 99265 99753 100800 101886 102429 102231 101931
54461A01931O04J677J740P78n9j3M39N05J44j97l56n01p44j089j549j939j875
$$ 101931 102535 104212 105952 106730 106671 106658 107097 107602 107746 107549 107193 106692 105948 104859 103310 101371 99496
54444I9496j313q05q65j301j524j302q30k75K63N68M52M8m11q76j217r75pR23
$$ 99496 98183 97378 96513 95212 93688 92386 91556 91281 91544 92112 92564 92612 92201 91325 90108 89133 89126 90049
54426I0049Q94P9m43j27M59O74N99N47M31R3k65l43r3M42J193J752J572Q23M65
$$ 90049 90943 91022 90579 90452 90911 91585 92184 92731 93162 93255 92990 92647 92554 92996 94189 95941 97513 98336 98801
54407I8801J034J895K188J969J848J977K131K360K843L356L574L688L940L903
$$ 98801 99835 101730 103918 105887 107735 109712 111843 114203 117046 120402 123976 127664 131604 135507
54393A35507L051J888J499J974K237J577M76m25j226k186k952l071k786k687k832
$$ 135507 138558 140446 141945 143919 146156 147733 148209 147784 146558 144372 141420 138349 135563 132876 130044
54378A30044k809k465k179k364l014l624l523k457j004j70l69j011j278j034p34
$$ 130044 127235 124770 122591 120227 117213 113589 110066 107609 106605 106435 106066 105055 103777 102743 102009
54363A02009o87p27m86J65R43J338J082M95J54J94J97j53n74n47K5P66J242J421
$$ 102009 101322 100595 100109 100274 101217 102555 103637 104132 104286 104480 104677 104524 103950 103403 103428 104194 105436 106857
54345A06857J685K424L470M054L651K754K402K926L552L395K379J028k22j174
$$ 106857 108542 110966 114436 118490 122141 124895 127297 130223 133775 137170 139549 140577 140355 139181
54331A39181j703j826j798j848j987k145k328k484k539k634l080l828m342m172
$$ 139181 137478 135652 133854 132006 130019 127874 125546 123062 120523 117889 114809 110981 106639 102467
54317A02467l431k525j738j232j168j486j865k124k392k643k465j615n54k3k36
$$ 102467 99036 96511 94773 93541 92373 90887 89022 86898 84506 81863 79398 77783 77229 77206 76970
54302G6970q17j277j307q15j51J8n91j377j499q90k07J17K74M64M04k55j257j823
$$ 76970 76153 74876 73569 72754 72603 72621 72030 70653 69154 68264 68057 68174 68448 68912 69316 69061 67804 65981
54284F5981j446m23M73Q26Q38Q22P05L73J69M50Q13M51n50j050l86O95J102R07
$$ 65981 64535 64112 64585 65411 66249 67071 67776 68149 68318 68768 69581 70032 69482 68432 68046 68741 69843 70750
54266G0750R96J636K194K156J691J185Q10O28O08M48j89j171j912k026j556o94
$$ 70750 71746 73382 75576 77732 79423 80608 81418 82046 82654 83102 82913 81742 79830 77804 76248 75554
54250G5554L72J220J319O15k62n49pR45J564J250O1j147j340k91J154J852J367
$$ 75554 75926 77146 78465 79080 78818 78269 78262 79207 80771 82021 82082 80935 79595 79304 80458 82310 83677
54233H3677K15p16r96q99q99j020r10m72r1j14m53r15j431j763j405l28O38P50
$$ 83677 83892 83176 82180 81281 80382 79362 78452 77980 77889 77775 77322 76407 74976 73213 71808 71480 72118 72868
54215G2868M10N28J067J049J12p92o42L46J161J324J188J154J115P34K6o22q79
$$ 72868 73278 73806 74873 75922 76034 75242 74600 74946 76107 77431 78619 79773 80888 81622 81648 81026 80147
54198H0147q74r63j269j587j831k153k442k094p90P65J426R41J64j44j69m70r59
$$ 80147 79273 78310 77041 75454 73623 71470 69028 66934 66144 66909 68335 69276 69440 69296 69127 68657 67698
54181F7698r05J03J516K233J744P04K52O85J166Q77M6n59o89o74o35l96q5j10
$$ 67698 66793 66896 68412 70645 72389 73093 73345 74030 75196 76073 76119 75560 74871 74197 73562 73166 73081 72971
54163G2971l91l41K03O08L33k82n26k28J79K94J01r9N7O36J175J065L54j83J7
$$ 72971 72580 72239 72442 73050 73383 73101 72575 72347 72526 72820 72921 72822 72879 73515 74690 75755 76109 75926 75943
54144G5943O04Q20M31j54m89m72k19P2J31k24r06j586j929j824j400r19n55l15
$$ 75943 76547 77367 77798 77644 77155 76683 76464 76536 76667 76443 75537 73951 72022 70198 68798 67879 67324 67009
54126F7009j53j07j88k98m39q66j656k241j906p88J21J22m08o58l74Q6M15O08
$$ 67009 66856 66749 66561 66263 65824 64958 63302 61061 59155 58367 58488 58610 58202 57544 57170 57256 57671 58279
54108E8279P50R05J143J382J323P69Jm11j81M16Q87R64P44N17M96O29O22J95o30
$$ 58279 59029 59934 61077 62459 63782 64551 64552 64141 63960 64376 65263 66227 66971 67488 67984 68613 69235 69430 68800
54089F8800j442j712j252m57Q8J85Q1n1l08n79l96L44R35O45k16o53k92L47P76
$$ 68800 67358 65646 64394 63937 64025 64210 64291 64240 63932 63353 62957 63301 64236 64881 64665 64012 63720 64067 64843
54070F4843J045J212J108Q53R35J359J408P04l8R9R34J485J268P23M15M49O77
$$ 64843 65888 67100 68208 69061 69996 71355 72763 73467 73429 73528 74462 75947 77215 77938 78353 78802 79479
54053G9479J003J297J329J004N42K83M21R08J575K252K768K932K667K231K058
$$ 79479 80482 81779 83108 84112 84654 84937 85358 86266 87841 90093 92861 95793 98460 100691 102749
54038A02749K214K263J991J943K703L906M621M658M712N118N372N142M924N160
$$ 102749 104963 107226 109217 111160 113863 117769 122390 127048 131760 136878 142250 147392 152316 157476
54024A57476N485N432N290N450N512M842L691K875K526K016J094K82N5K72N65
$$ 157476 162961 168393 173683 179133 184645 189487 193178 196053 198579 200595 201689 201971 202026 202298 202863
54009B02863P21M83m38j917l235l738l503l224l496m164m443l755k534j796j907
$$ 202863 203584 204067 203629 201712 198477 194739 191236 188012 184516 180352 175909 172154 169620 167824 165917
53994A65917k224k260k516l530m671m760l655k337j500r94o35o42r80j113p90
$$ 165917 163693 161433 158917 155387 150716 145956 142301 139964 138464 137470 136835 136193 135213 134100 133310
53979A33310m74n21o30m36j49r7j17O0J82j74q04j001m95J64K33l75j008j015
$$ 133310 132836 132315 131685 131249 131100 131003 130886 130946 131128 130954 130150 129149 128654 128818 129051 128676 127668 126653
53961A26653n34l62q81j415j077o5N29K43j85Q2R27J768K354K665K511J923J465
$$ 126653 126119 125757 124876 123461 122384 122319 122848 123091 122906 122988 123915 125683 128037 130702 133213 135136 136601
53944A36601J564J874J918K043K903M286N212N275M982M729M143K800R91n79j438
$$ 136601 138165 140039 141957 144000 146903 151189 156401 161676 166658 171387 175530 178330 179321 178742 177304
53929A77304j480q65q1K91K18K87R02J668J960J768J622J893K526L363M340N365
$$ 177304 175824 174959 174878 175169 175387 175674 176576 178244 180204 181972 183594 185487 188013 191376 195716 201081
53913B01081O227O734O794O423N821N371N424O046O950P595P438O394N007L894
$$ 201081 207308 214042 220836 227259 233080 238451 243875 249921 256871 264466 271904 278298 283305 287199
53899B87199K936J524k96j489j343n41l65j144k209l087l929m775n282n379n497
$$ 287199 290135 291659 291363 289874 288531 287990 287625 286481 284272 281185 277256 272481 267199 261820 256323
53884B56323n853o103o010n871n905n812n398n065n152n295n000m515m377m447
$$ 256323 250470 244367 238357 232486 226581 220769 215371 210306 205154 199859 194859 190344 185967 181520
53870A81520m102l281k621k564k886l213l431l569l659l799l935l672k759j707
$$ 181520 177418 174137 171516 168952 166066 162853 159422 155853 152194 148395 144460 140788 138029 136322
53856A36322j363j826k356k385k052j708j490j505j745j733r42J67L87o02j592
$$ 136322 134959 133133 130777 128392 126340 124632 123142 121637 119892 118159 117217 117384 117771 117169 115577
53841A15577j417m66P1j74o12q02p46m14J69N05J00o45p84j32M93M13j99q54j325
$$ 115577 114160 113694 113765 113591 112979 112177 111431 111017 111186 111691 111791 111146 110362 110230 110723 111136 110937 110083 108758
53822A08758j417q59J93R94J018O03M30O57R64J132J222J226R83N05J71M91J640
$$ 108758 107341 106482 106675 107669 108687 109290 109720 110377 111341 112473 113695 114921 115904 116409 116580 117071 118711
53805A18711L200M352M472L647K570J987K258L275M506N234N151M734M700N052
$$ 118711 121911 126263 130735 134382 136952 138939 141197 144472 148978 154212 159363 164097 168797 173849
53791A73849N142M779M673N417O380O331M906L006J705J283J402J759K182K379
$$ 173849 178991 183770 188443 193860 200240 206571 211477 214483 216188 217471 218873 220632 222814 225193
53777B25193K043J189J40q92j967l087l921m077l672l292l347l588l533l208l177
$$ 225193 227236 228425 228565 227673 225706 222619 218698 214621 210949 207657 204310 200722 197189 193981 190804
53762A90804l710m210l838k535j197p14j110j783k283k597k745k549j982j444
$$ 190804 187094 182884 179046 176511 175314 174600 173490 171707 169424 166827 164082 161533 159551 158107
53748A58107j348j555j527j065n84n54r46j321j332r95o44o72j250k104k705k715
$$ 158107 156759 155204 153677 152612 152028 151474 150528 149207 147875 146880 146236 145564 144314 142210 139505 136790
53732A36790k227j526p85p3M69O52M24pk55nO41J182J259J162J512K329K915K764
$$ 136790 134563 133037 132252 132179 132648 133300 133724 133717 133462 133457 134098 135280 136539 137701 139213 141542 144457 147221
53714A47221K263K175K671L263L482L265K816K403K263K404K513K316J958J810
$$ 147221 149484 151659 154330 157593 161075 164340 167156 169559 171822 174226 176739 179055 181013 182823
53700A82823J987K334K771L353L987M413M462M134L480K671K108K115K477K615
$$ 182823 184810 187144 189915 193268 197255 201668 206130 210264 213744 216415 218523 220638 223115 225730
53686B25730K303J921J909K238K542K573K415K306K380K455K174J434O92N44J085
$$ 225730 228033 229954 231863 234101 236643 239216 241631 243937 246317 248772 250946 252380 253072 253616 254701
53671B54701J785K093J879J389R67Q73J131J445J418R18J43o43j287j631j519
$$ 254701 256486 258579 260458 261847 262814 263687 264818 266263 267681 268599 268742 268099 266812 265181 263662
53656B63662r78l39n2l20q35j004n57K7J1o37j144j002o01m72m22NN83O89L35
$$ 263662 262684 262345 262293 261973 261138 260134 259577 259604 259615 258978 257834 256832 256231 255759 255337 255342 255925 256614 256949
53637B56949J23K01R3l87q14r32j018j161r39k34K95J21k60P8J326K867M089M750
$$ 256949 257072 257273 257366 256979 256165 255233 254215 253054 252115 251881 252176 252297 252037 252115 253441 256308 260397 265147
53619B65147M801M341L674L087K693K642L119L782L787K935K367L259N054N978
$$ 265147 269948 274289 277963 281050 283743 286385 289504 293286 297073 300008 302375 305634 310688 316666
53605C16666N351M431M610N617O234O137O109O610P093O962O542O542O922O936
$$ 316666 322017 326448 331058 336675 342909 349046 355155 361765 368858 375820 382362 388904 395826 402762
53591D02762O230N379N128N474N804N719N330M935M660M494M325L994L518L227
$$ 402762 408992 414371 419499 424973 430777 436496 441826 446761 451421 455915 460240 464234 467752 470979
53577D70979L392L719L550K624J318J23p69j261j183o10l2R9j66m46n01l60k12
$$ 470979 474371 478090 481640 484264 485582 485705 484936 483675 482492 481882 481850 481949 481783 481337 480836 480476 480264
53560D80264l35q99j694k267k477k606k780k649j963j112o95p83j026j238j461
$$ 480264 479929 479030 477336 475069 472592 469986 467206 464557 462594 461482 460787 460004 458978 457740 456279
53545D56279j566j323q15l89j73JK42N34R84J734K491K623J979J247J300K329
$$ 456279 454713 453390 452575 452186 452013 452014 452256 452790 453774 455508 457999 460622 462601 463848 465148 467477
53529D67477L800N132O078O619O799O786O929P494Q386R297J0102J0930J1697
$$ 467477 471277 476409 482487 489106 495905 502691 509620 517114 525500 534797 544899 555829 567526
53516E67526J1990J1668J1449J2250J4049J5895J7159J8129J9162J9990K0394
$$ 567526 579516 591184 602633 614883 628932 644827 661986 680115 699277 719267 739661
53505G39661K0945K2260K3944K5117K5818K6889K8527K9919L0597L1194L2313
$$ 739661 760606 782866 806810 831927 857745 884634 913161 943080 973677 1004871 1037184
53494A037184L3474L3890L3750L3851L4314L4512L4199L3869L3905L4108L4375
$$ 1037184 1070658 1104548 1138298 1172149 1206463 1240975 1275174 1309043 1342948 1377056 1411431
53483A411431L5092L6357L7391L7410L6786L6581L7020L7172L6327L4925L3683
$$ 1411431 1446523 1482880 1520271 1557681 1594467 1631048 1668068 1705240 1741567 1776492 1810175
53472A810175L2397L0358K7659K5356K4197K3776K3110K1775K0205J9137J8866
$$ 1810175 1842572 1872930 1900589 1925945 1950142 1973918 1997028 2018803 2039008 2058145 2077011
53461B077011J8884J8283J6711J4855J3559J2513J0370O361J263l484p117r757
$$ 2077011 2095895 2114178 2130889 2145744 2159303 2171816 2182186 2188547 2189810 2186326 2179209 2169452
53449B169452j1850j3908j6333j8948k1038k2413k4027k6794l0059l2193l2670
$$ 2169452 2157602 2143694 2127361 2108413 2087375 2064962 2040935 2014141 1984082 1951889 1919219
53438A919219l2655l3347l4632l5752l6504l7141l7593l7452l6558l5060l3125
$$ 1919219 1886564 1853217 1818585 1782833 1746329 1709188 1671595 1634143 1597585 1562525 1529400
53427A529400l1004k9197k8007k7025k5547k3479k1432j9867j8529j6814j4317
$$ 1529400 1498396 1469199 1441192 1414167 1388620 1365141 1343709 1323842 1305313 1288499 1274182
53416A274182j1011p259l768j205M74K001L991O419R090J2117J5494J8599K0830
$$ 1274182 1263171 1255912 1252144 1250939 1251413 1253414 1257405 1263824 1272914 1285031 1300525 1319124 1339954
53403A339954K2563K4779K7651L0277L1997L3198L4455L5694L6843L8613M1601
$$ 1339954 1362517 1387296 1414947 1445224 1477221 1510419 1544874 1580568 1617411 1656024 1697625
53392A697625M5092M7766M9537N1668N5028N9108O2974O6238O8916P1130P3395
$$ 1697625 1742717 1790483 1840020 1891688 1946716 2005824 2068798 2135036 2203952 2275082 2348477
53381B348477P6336P9703Q2444Q4179Q5697Q7435Q8489Q7986Q6676Q5902Q5604
$$ 2348477 2424813 2504516 2586960 2671139 2756836 2844271 2932760 3020746 3107422 3193324 3278928
53370C278928Q4519Q2135P9155P6013P2190O7238O1561N5866N0569M5988M2344
$$ 3278928 3363447 3445582 3524737 3600750 3672940 3740178 3801739 3857605 3908174 3954162 3996506
53359C996506L9276L5899L1609K6423K0443J3707O582l61p108j4170k1726k9501
$$ 3996506 4035782 4071681 4103290 4129713 4150156 4163863 4170445 4170084 4162976 4148806 4127080 4097579
53347D097579l7683m6972n7321o7340p5510q1416q5394q7696q8580q8590q8111
$$ 4097579 4059896 4012924 3955603 3888263 3812753 3731337 3645943 3558247 3469667 3381077 3292966
53336C292966q7062q5492q3993q2989q2123q0996p9879p9056p8059p6375p4435
$$ 3292966 3205904 3120412 3036419 2953430 2871307 2790311 2710432 2631376 2553317 2476942 2402507
53325B402507p2888p1277o8555o4795o1201n8302n5222n1165m6655m2729l9599
$$ 2402507 2329619 2258342 2189787 2124992 2063791 2005489 1950267 1899102 1852447 1809718 1770119
53314A770119l6814l4299l2436l1269l0156k8354k5674k2463j9193j6099j3247
$$ 1770119 1733305 1699006 1666570 1635301 1605145 1576791 1551117 1528654 1509461 1493362 1480115
53303A480115j0772q837p254n456l177r43M17P58P12R33J609K745M415O577R026
$$ 1480115 1469343 1460506 1453252 1447796 1444619 1443676 1444093 1444851 1445563 1446496 1448105 1450850 1455265 1461842 1470868
53288A470868J1645J4460J7357K0121K2869K5963K9358L2399L4599L6247L7844
$$ 1470868 1482513 1496973 1514330 1534451 1557320 1583283 1612641 1645040 1679639 1715886 1753730
53277A753730L9221L9722L9199L8347L7951L8077L8214L7926L7212L6239L5032
$$ 1753730 1792951 1832673 1871872 1910219 1948170 1986247 2024461 2062387 2099599 2135838 2170870
53266B170870L3458L1422K8938K6110K3187K0615J8711J7228J5479J3039J0027
$$ 2170870 2204328 2235750 2264688 2290798 2313985 2334600 2353311 2370539 2386018 2399057 2409084
53255B409084O571K368k697p968j2595j6634k0812k5303k9469l2924l6112l9489
$$ 2409084 2415655 2418023 2415326 2407358 2394763 2378129 2357317 2332014 2302545 2269621 2233509 2194020
53243B194020m2746m5386m7418m9005m9908m9959m9660m9572m9390m8313m6343
$$ 2194020 2151274 2105888 2058470 2009465 1959557 1909598 1859938 1810366 1760976 1712663 1666320
53232A666320m4388m3074m2061m0808l9418l8450l8237l8631l9182l9431l9227
$$ 1666320 1621932 1578858 1536797 1495989 1456571 1418121 1379884 1341253 1302071 1262640 1223413
53221A223413l8869l8623l8073l6363l3268k9662k6717k4877k3730k2653k1360
$$ 1223413 1184544 1145921 1107848 1071485 1038217 1008555 981838 956961 933231 910578 889218
53210H89218k0065j9209j8899j8615j7812j6755j6342j6908j7747j7988j7508
$$ 889218 869153 849944 831045 812430 794618 777863 761521 744613 726866 708878 691370
53199F91370j6655j5653j4714j4204j4140j3866j2922j1872j1562j1776j1512
$$ 691370 674715 659062 644348 630144 616004 602138 589216 577344 565782 554006 542494
53188E42494j0586j0035j0710j2159j3326j3723j3533j3050j2473j2040j1819
$$ 542494 531908 521873 511163 499004 485678 471955 458422 445372 432899 420859 409040
53177D09040j1508j0730r446p974o778o305o704p509p913p583o936o433n986n306
$$ 409040 397532 386802 377356 369382 362604 356299 349595 342086 334173 326590 319654 313221 307235 301929
53163C01929m538m053l873l731l588l698m122m539m607m268l702l091k506j905
$$ 301929 297391 293338 289465 285734 282146 278448 274326 269787 265180 260912 257210 254119 251613 249708
53149B49708j320j042j360k075k522k269j541q16k79M3jm82j102j559j952k412
$$ 249708 248388 247346 245986 243911 241389 239120 237579 236763 236484 236527 236526 236044 234942 233383 231431 229019
53133B29019k532j797n15L73L89J1r0J92N41O78M86R6n1M14J160J323N08o91j450
$$ 229019 226487 224690 224175 224548 224937 224948 224858 225050 225591 226269 226755 226851 226800 227214 228374 229697 230205 229514 228064
53114B28064j534j176m89M43J204J353J075J077J671K355K453J917J216O41L4
$$ 228064 226530 225354 224865 225308 226512 227865 228940 230017 231688 234043 236496 238413 239629 240270 240304
53099B40304p73j552j936j886j693j565j535j750k437l352l752l199k251j845
$$ 240304 239531 237979 236043 234157 232464 230899 229364 227614 225177 221825 218073 214874 212623 210778
53085B10778k221k840l273l578l798l686l156k609k461k617k670k443k047j667
$$ 210778 208557 205717 202444 198866 195068 191382 188226 185617 183156 180539 177869 175426 173379 171712
53071A71712j444j475j646j564r22O6P29N30l90j306j572j233q22o57n45k89r1
$$ 171712 170268 168793 167147 165583 164661 164727 165456 165986 165596 164290 162718 161485 160663 160006 159461 159172 159081
53054A59081j62k64j09Q4q9n01p02p36j070j695k024j848j640j694j664j258p78
$$ 159081 158919 158655 158546 158630 158541 158040 157338 156602 155532 153837 151813 149965 148325 146631 144967 143709 142931
53037A42931m92j97J74J31o19j452j574j083n95l04%J74j17o49q09n43m69r66
$$ 142931 142439 142242 142416 142547 141928 140476 138902 137819 137224 136920 136920 137094 136977 136328 135519 134976 134507 133541
53019A33541j679k057j846j053J12J091J284O99q7o29r45j119j058p99n93n36
$$ 133541 131862 129805 127959 126906 127018 128109 129393 130092 130005 129376 128431 127312 126254 125455 124862 124326
53003A24326m43j63K95R85J866K381J789K43j009r60k9N01Q5n78o06qM29J28o28
$$ 124326 123883 123720 124015 125000 126866 129247 131036 131279 130270 129310 129281 129782 129867 129289 128683 128675 129104 129232 128604
52984A28604j019o13J65N84N13N11R82J589J700J227P29P43J235J703J694J265
$$ 128604 127585 126972 127137 127721 128234 128745 129727 131316 133016 134243 134972 135715 136950 138653 140347 141612
52968A41612R27J119J747K368K776L173L674L923L504K628K072K376L278M006
$$ 141612 142539 143658 145405 147773 150549 153722 157396 161319 164823 167451 169523 171899 175177 179183
52954A79183M025L382K517J822J373R55L42l65p02l27M67R17N98j38p28j120j579
$$ 179183 183208 186590 189107 190929 192302 193257 193599 193234 192532 192205 192672 193589 194187 194049 193321 192201 190622
52937A90622j976j855j280j009j550k445k902k747k304j688q08Q4M85L56K22L81
$$ 190622 188646 186791 185511 184502 182952 180507 177605 174858 172554 170866 170058 170142 170627 170983 171205 171586
52921A71586M49j01j165k038k064j156J19R63R67M28m0j50p5lJ63O35J404K146
$$ 171586 172035 171934 170769 168731 166667 165511 165630 166593 167560 167988 167948 167798 167723 167720 167883 168518 169922 172068
52903A72068K389J925J127O86Q12R80O95K50J85L08m0q03j049k72Q11J107M07
$$ 172068 174457 176382 177509 178195 179007 179987 180682 180932 181117 181425 181385 180582 179533 179261 180072 181179 181586
52886A81586n86j118r08j28P64J258J172O97N1o59j129q92N2R93J238Q84N14M41
$$ 181586 181000 179882 178974 178846 179610 180868 182040 182737 182788 182129 181000 180108 180160 181153 182391 183275 183789 184230
52868A84230N40O62P03M72j03o84p72k72M32R00R37O43M02O57J355J792J406N80
$$ 184230 184770 185432 186135 186607 186504 185820 185048 184776 185208 186108 187045 187688 188090 188747 190102 191894 193300 193880
52850A93880K55P77J580K024K076K010J904J746J725K091K781L396L545L117K357
$$ 193880 194135 194912 196492 198516 200592 202602 204506 206252 207977 210068 212849 216245 219790 222907 225264
52835B25264J737J551J623J526J106N93J69k99r47j621k118k501k890l158l153
$$ 225264 227001 228552 230175 231701 232807 233400 233569 233270 232323 230702 228584 226083 223193 220035 216882
52820B16882l058l226l647l980m066m071m004l569k704j891j547j447j185r37
$$ 216882 213824 210598 206951 202971 198905 194834 190830 187261 184557 182666 181119 179672 178487 177550
52806A77550j193j826k089j704j329j609k245k431j930j238r26j152j697k068
$$ 177550 176357 174531 172442 170738 169409 167800 165555 163124 161194 159956 159030 157878 156181 154113
52792A54113j741p45J57K53l26r72j549k257k768k337j042n4k42j107j596j448
$$ 154113 152372 151627 151784 152037 151711 150739 149190 146933 144165 141828 140786 140732 140490 139383 137787 136339
52776A36339j187j155j233j286j358j438j425j336j200q88l88o1k48p97j301j674
$$ 136339 135152 133997 132764 131478 130120 128682 127257 125921 124721 123833 123445 123384 123136 122339 121038 119364
52760A19364k035k205j868j184p27p33r18j071j321j651j751j543j397j551j699
$$ 119364 117329 115124 113256 112072 111345 110612 109694 108623 107302 105651 103900 102357 100960 99409 97710
52745I7710j490j093q50p28n21l59n18q09p01j22K92No86r83n27K06M95J64k51
$$ 97710 96220 95127 94277 93549 93028 92669 92151 91342 90641 90519 90811 90816 90130 89147 88620 88826 89321 89485 89234
52726H9234j68L62P22M99K1kP07J680K157J772P52l57j146j579j862k067j947
$$ 89234 89066 89428 90150 90649 90670 90668 91375 93055 95212 96984 97736 97379 96233 94654 92792 90725 88778
52709H8778j234j16P58Q76L60k13m13k03K87R63J628J917J643J044N58L80M12
$$ 88778 87544 87428 88186 89062 89422 89209 88796 88593 88880 89843 91471 93388 95031 96075 96633 97013 97425
52692I7425N72Q28J040J126J412K382L844M690L929J873l4n82K24J400J876J209
$$ 97425 97997 98825 99865 100991 102403 104785 108629 113319 117248 119121 119087 118505 118729 120129 122005 123214
52676A23214k41j657k436k587k466k230j778j205q61r23j108j117j073j337j901
$$ 123214 122973 121316 118880 116293 113827 111597 109819 108614 107753 106830 105722 104605 103532 102195 100294
52661A00294k279j990j064j12Q8p89k209l041k519j004K85M36k77p61l21N99R62
$$ 100294 98015 96025 94961 94849 94937 94148 91939 88898 86379 85375 85660 86096 85819 85058 84737 85336 86298
52644H6298L52o12j058q11l24K2K33L63L58L12N01R42J278J290J226J300J225
$$ 86298 86650 86038 84980 84169 83845 83867 84100 84463 84821 85133 85634 86576 87854 89144 90370 91670 92895
52627I2895O28j94n53k79O3m2m64q26j020j118j056p15j91K82N87P70Q84R53R08
$$ 92895 93523 93329 92776 92497 92560 92518 92054 91228 90208 89090 88034 87319 87128 87410 87997 88767 89651 90604 91512
52608I1512N45k59j102j233l89P14J146Q50N47O71R43J064J232J686K124K047
$$ 91512 92057 91798 90696 89463 89074 89788 90934 91784 92331 93002 93945 95009 96241 97927 100051 102098
52592A02098J465R12P75R18R65P56M15K01K40M63O94Q57R38Q76O35M68P61J470
$$ 102098 103563 104475 105250 106168 107133 107889 108304 108505 108745 109208 109902 110759 111697 112573 113208 113676 114437 115907
52574A15907K062K197K249K675L156K915J829P03K72M10N74O29Q07J156J444J535
$$ 115907 117969 120166 122415 125090 128246 131161 132990 133693 133965 134375 134949 135578 136385 137541 138985 140520
52558A40520J511J419J195Q75O10M11J19k19k22L28R75R61K26l29J55J343J945
$$ 140520 142031 143450 144645 145520 146130 146541 146660 146441 146219 146547 147522 148483 148709 148380 148535 149878 151823
52541A51823J178l94j551j697j129l57L21O20K64n51j031n58N67J415J494J152
$$ 151823 153001 152607 151056 149359 148230 147873 148194 148814 149078 148527 147496 146938 147505 148920 150414 151566
52525A51566R32Q32M39l23r32q89m19k60p13j229j089l16M12O13N09N77R34J272
$$ 151566 152498 153330 153769 153446 152514 151625 151206 150946 150233 149004 147915 147599 148011 148624 149133 149710 150644 151916
52507A51916J254Q57M04K84N18O67L52j92l87j23J03J9M4N82J205J109K76m12
$$ 151916 153170 154027 154431 154715 155233 155900 156252 156060 155673 155550 155653 155672 155716 156298 157503 158612 158888 158476
52489A58476l01K29L64j8k17L21J200J443O41m53o75J96J152J113J81o59q34p05
$$ 158476 158175 158404 158768 158750 158533 158854 160054 161497 162138 161685 161010 161206 162358 163471 163652 162993 162159 161454
52471A61454p28o94j99M84O09j3o46m70M90J521K009J830J176L65k15l61k57j78
$$ 161454 160726 160032 159833 160317 160926 160913 160267 159797 160287 161808 163817 165647 166823 167188 166973 166612 166355 166177
52453A66177lN80J333J405M15q49j277p43j03O0L5K77O50O81K57k83n58m79k15
$$ 166177 166174 166754 168087 169492 169907 169058 167781 167038 166935 166995 167030 167307 167957 168638 168895 168612 168054 167575 167360
52434A67360k0j4j21k61n18r29j243j213j021j035j127p77N0O42M09m08j212j759
$$ 167360 167340 167326 167205 166944 166426 165497 164254 163041 162020 160985 159858 159081 159131 159773 160182 159774 158562 156803
52416A56803k065k018j561j034q04p77n84j00N76J354K001J986J122J01j33M47
$$ 156803 154738 152720 151159 150125 149321 148544 147960 147860 148436 149790 151791 153777 154899 155000 154867 155314
52400A55314R89R43O73P82J353K008K342K169J716J603K226L041K994J821M83
$$ 155314 156303 157246 157919 158701 160054 162062 164404 166573 168289 169892 172118 175159 178153 179974 180457
52385A80457L4M70R68R45M91Qj54J11N95R11R28R76J463K324L072L300L008K527
$$ 180457 180491 180961 181929 182874 183365 183373 183219 183330 183925 184836 185764 186740 188203 190527 193599 196899 199907 202434
52367B02434K228K246K389K407K289K230K260K153J768J314J177J607K537L525
$$ 202434 204662 206908 209297 211704 213993 216223 218483 220636 222404 223718 224895 226502 229039 232564
52353B32564L962L656L174L184L498L285K409J822K254L037K998K026J053O38
$$ 232564 236526 240182 243356 246540 250038 253323 255732 257554 259808 262845 265843 267869 268922 269560
52339B69560M17N1j03L84J254J859J958J769J518J256J080J163J498J872K094
$$ 269560 269977 270028 269925 270309 271563 273422 275380 277149 278667 279923 281003 282166 283664 285536 287630
52324B87630K166K176K161K098K017K020K200K486K747L058L723M861O076O825
$$ 287630 289796 291972 294133 296231 298248 300268 302468 304954 307701 310759 314482 319343 325419 332244
52310C32244P080P343P888Q399Q519Q516R048J0381J2045J3273J3551J2948J2163
$$ 332244 339324 346667 354555 362954 371473 379989 389037 399418 411463 424736 438287 451235 463398
52297D63398J2158J3368J5229J6705J7296J7259J6953J6451J5949J5930J6588
$$ 463398 475556 488924 504153 520858 538154 555413 572366 588817 604766 620696 637284
52286F37284J7397J7706J7585J7568J7747J7634J6909J5845J4841J3974J3160
$$ 637284 654681 672387 689972 707540 725287 742921 759830 775675 790516 804490 817650
52275H17650J2377J1516J0307Q700P059N759M714L578K250R48j41j019j696k114
$$ 817650 830027 841543 851850 860550 867609 873368 878082 881660 883910 884858 884717 883698 882002 879888
52261H79888k255k226k255k525l006l411l487l331l181k940k233j068mN49Q74
$$ 879888 877633 875407 873152 870627 867621 864210 860723 857392 854211 851271 849038 847970 847966 848515 849389
52246H49389J401K039K499L073M412O513Q512R699J0270J0932J2008J3241J4194
$$ 849389 850790 852829 855328 858401 862813 869326 877838 887537 897807 908739 920747 933988 948182
52233I48182J4648J4644J4339J3808J3033J2083J1214J0581J0011R276Q501P947
$$ 948182 962830 977474 991813 1005621 1018654 1030737 1041951 1052532 1062543 1071819 1080320 1088267
52221A088267P475O589N067L223J400l25j922l231m243n207o234p180q086r309
$$ 1088267 1095742 1102331 1107398 1110621 1112021 1111696 1109774 1106543 1102300 1097093 1090859 1083679 1075593 1066284
52207A066284j0837j1872j1712j0824j0438j1003j1639j1277r904q393p433p011
$$ 1066284 1055447 1043575 1031863 1021039 1010601 999598 987959 976682 966778 958385 950952 943941
52195I43941o760o408n874n156m314l443k600j815j185r07j069j496j849j931
$$ 943941 937181 930773 924899 919743 915429 911986 909386 907571 906386 905479 904410 902914 901065 899134
52181H99134j858j856j984k094k058j900j677j329q37m20m34r98j798k356k446
$$ 899134 897276 895420 893436 891342 889284 887384 885707 884378 883541 883121 882687 881689 879891 877535 875089
52166H75089k231k099k372l026l545l335k459j767j965k749l275l371l583m019
$$ 875089 872858 870759 868387 865361 861816 858481 856022 854255 852290 849541 846266 842895 839312 835293
52152H35293m074l584l363l959m603m342l602l544m259m820m902n005n128m603
$$ 835293 831219 827635 824272 820313 815710 811368 807766 804222 799963 795143 790241 785236 780108 775505
52138G75505l615l366m146m629l879k835k757l364l651l625l891m243m091l715
$$ 775505 771890 768524 764378 759749 755870 753035 750278 746914 743263 739638 735747 731504 727413 723698
52124G23698l759l901l439k803k961l617l534k565j727j213o9J819L107K962K298
$$ 723698 719939 716038 712599 709796 706835 703218 699684 697119 695392 694179 694110 695929 699036 701998 704296
52109G04296K324L155M438O106P732Q379Q040Q120R620J1803J3509J4763J6013
$$ 704296 706620 709775 714213 720319 728051 736430 744470 752590 762210 774013 787522 802285 818298
52096H18298J6938J7251J7823J9547K1697K2780K2692K2617K3088K3423K3094
$$ 818298 835236 852487 870310 889857 911554 934334 957026 979643 1002731 1026154 1049248
52085A049248K2404K1652K0644J9279J7854J6572J5327J3987J2448J0590Q640
$$ 1049248 1071652 1093304 1113948 1133227 1151081 1167653 1182980 1196967 1209415 1220005 1228645
52074A228645P235O431N145K507o08k494k924l311m593o139p111p698q473r300
$$ 1228645 1235880 1242311 1247456 1249963 1249355 1246861 1243937 1240626 1236033 1229894 1222783 1215085 1206612 1197312
$$ [...]
##END NTUPLES=NMR SPECTRUM
##END=
