
##TITLE=AC1199_HACAH12052_7165849_Av4UxNkm5f
##JCAMPDX= 6.0         $$ Bruker NMR JCAMP-DX V2.0
##DATA TYPE= NMR SPECTRUM
##DATA CLASS= NTUPLES
##ORIGIN= BRUKER
##OWNER= Administrator
$$ 1.72 TOPSPIN		Version 2.1
$$ 2012-12-01 23:17:14.640 -0500  Administrator@X
$$ Compression mode = diff/dup
##.OBSERVE FREQUENCY= 400.02188249412
##.OBSERVE NUCLEUS= ^1H
##.ACQUISITION MODE= SIMULTANEOUS (DQD)
##.ACQUISITION SCHEME= undefined
##.AVERAGES= 64
##.DIGITISER RES= 22
##SPECTROMETER/DATA SYSTEM= spect
##.PULSE SEQUENCE= noesygpps1d.comp
##.SOLVENT NAME= COFFEE_meoh
##.SHIFT REFERENCE= INTERNAL, COFFEE_meoh, 1, 14.961
##AUDIT TRAIL= $$ (NUMBER, WHEN, WHO, WHERE, PROCESS, VERSION, WHAT)
$$ ##TITLE= Audit trail, TOPSPIN		Version 2.1
$$ ##JCAMPDX= 5.01
$$ ##ORIGIN= Bruker BioSpin GmbH
$$ ##OWNER= Administrator
$$ $$ E:\/data/COFFEE/nmr/AC1199_HACAH12052_7165849_Av4UxNkm5f/12/pdata/1/auditp.txt
$$ ##AUDIT TRAIL=  $$ (NUMBER, WHEN, WHO, WHERE, PROCESS, VERSION, WHAT)
(   1,<2012-12-01 23:17:08.656 -0500>,<Administrator>,<X>,<go>,<TOPSPIN 2.1>,
      <created by zg
	started at 2012-12-01 23:05:38.810 -0500,
	POWCHK enabled, PULCHK disabled,
       configuration hash MD5:
       86 BA 57 50 F2 9D 5C 9B 26 00 A9 28 5F 66 2E 89
       data hash MD5: 64K
       D3 B8 CA 22 01 38 0F 74 DA 02 F8 D7 E4 D2 B3 F2>)
(   2,<2012-12-01 23:17:11.781 -0500>,<Administrator>,<X>,<proc1d>,<TOPSPIN 2.1>,
      <Start of raw data processing
       efp LB = 0.3 FT_mod = 6 PKNL = 1 PHC0 = 0 PHC1 = 0 SI = 128K 
       data hash MD5: 128K
       AA A5 7A 96 F4 F1 86 42 05 E9 8E D4 D4 A6 A7 FC>)
(   3,<2012-12-01 23:17:12.874 -0500>,<Administrator>,<X>,<proc1d>,<TOPSPIN 2.1>,
      <pk PHC0 = -79.11255 PHC1 = 0 
       data hash MD5: 128K
       7C 6C 1E 61 7D 75 26 C2 22 BB 00 BE DE 67 98 09>)
(   4,<2012-12-01 23:17:13.578 -0500>,<Administrator>,<X>,<proc1d>,<TOPSPIN 2.1>,
      <abs ABSG = 1 
       data hash MD5: 128K
       61 7E 2E 26 36 89 8E 72 04 CF 9C 3D 5A 41 B9 E3>)
(   5,<2012-12-01 23:17:13.749 -0500>,<Administrator>,<X>,<proc1d>,<TOPSPIN 2.1>,
      <abs ABSG = 2 
       data hash MD5: 128K
       CA B2 3A 86 57 8C 74 03 FE FC 91 D4 18 A6 E6 99>)
(   6,<2012-12-01 23:17:13.937 -0500>,<Administrator>,<X>,<proc1d>,<TOPSPIN 2.1>,
      <abs ABSG = 3 
       data hash MD5: 128K
       4C AF BD 08 BD 70 00 AE F1 F0 5E CF 88 E0 06 0A>)
(   7,<2012-12-01 23:17:14.093 -0500>,<Administrator>,<X>,<proc1d>,<TOPSPIN 2.1>,
      <abs ABSG = 4 
       data hash MD5: 128K
       6B C7 F7 84 B0 6C AF DA C4 60 2D 68 69 A6 7E 4B>)
(   8,<2012-12-01 23:17:14.265 -0500>,<Administrator>,<X>,<proc1d>,<TOPSPIN 2.1>,
      <abs ABSG = 5 
       data hash MD5: 128K
       D7 BD 02 32 5F 57 70 A9 54 E0 5A 40 81 60 BE 34>)
$$ ##END=
$$ 
$$ $$ hash MD5
$$ $$ 6C E4 53 D5 35 40 9B 40 93 3F C3 C4 4D 8E 94 07
##$RELAX= 
##$RELAX= 
##$RELAX= 
##$RELAX= 
##$RELAX= 
##$RELAX= 
##$RELAX= 
##$RELAX= 
$$ Bruker specific parameters
$$ --------------------------
##$DU= <E:\>
##$EXPNO= 12
$$ [...]
150 150 150 150 150 150 150 150
##$TP07= 0
##$TPNAME0= <>
##$TPNAME1= <>
##$TPNAME2= <>
##$TPNAME3= <>
##$TPNAME4= <>
##$TPNAME5= <>
##$TPNAME6= <>
##$TPNAME7= <>
##$TPOAL= (0..7)
0.5 0.5 0.5 0.5 0.5 0.5 0.5 0.5
##$TPOFFS= (0..7)
0 0 0 0 0 0 0 0
##$TUNHIN= 0
##$TUNHOUT= 0
##$TUNXOUT= 0
##$USERA1= <user>
##$USERA2= <user>
##$USERA3= <user>
##$USERA4= <user>
##$USERA5= <user>
##$V9= 5
##$VALIST= <valist>
##$VCLIST= <CCCCCCCCCCCCCCC>
##$VD= 0
##$VDLIST= <DDDDDDDDDDDDDDD>
##$VPLIST= <PPPPPPPPPPPPPPP>
##$VTLIST= <TTTTTTTTTTTTTTT>
##$WBST= 1024
##$WBSW= 4
##$XGAIN= (0..3)
0 0 0 0
##$XL= 0
##$YL= 0
##$YMAX_a= 5768532
##$YMIN_a= -11652756
##$ZGOPTNS= <>
##$ZL1= 120
##$ZL2= 120
##$ZL3= 120
##$ZL4= 120
##$ABSF1= 14.961
##$ABSF2= -5.597181
##$ABSG= 5
##$ABSL= 3
##$ALPHA= 0
##$AQORDER= 0
##$ASSFAC= 0
##$ASSFACI= 0
##$ASSFACX= 0
##$ASSWID= 0
##$AUNMP= <proc_prof1d_extract.lims>
##$AXLEFT= 0
##$AXNAME= <>
##$AXNUC= <1H>
##$AXRIGHT= 0
##$AXTYPE= 0
##$AXUNIT= <>
##$AZFE= 0.1
##$AZFW= 0.1
##$BCFW= 0
##$BC_mod= 0
##$BYTORDP= 0
##$COROFFS= 0
##$CY= 15
##$DATMOD= 1
##$DC= 0
##$DFILT= <>
##$DTYPP= 0
##$F1P= 0
##$F2P= 0
##$FCOR= 0.5
##$FTSIZE= 131072
##$FT_mod= 6
##$GAMMA= 0
##$GB= 0
##$INTBC= 1
##$INTSCL= 1
##$ISEN= 128
##$LB= 0.3
##$LEV0= 0
##$LPBIN= 0
##$MAXI= 10000
##$MC2= 0
##$MEAN= 0
##$ME_mod= 0
##$MI= 0
##$NCOEF= 0
##$NC_proc= -2
##$NLEV= 6
##$NOISF1= 0
##$NOISF2= 0
##$NSP= 0
##$NTH_PI= 0
##$NZP= 0
##$OFFSET= 14.961
##$PC= 1
##$PHC0= -79.11255
##$PHC1= 0
##$PH_mod= 1
##$PKNL= yes
##$PPARMOD= 0
##$PPDIAG= 0
##$PPIPTYP= 0
##$PPMPNUM= 2147483647
##$PPRESOL= 1
##$PSCAL= 4
##$PSIGN= 0
##$PYNMP= <proc.py>
##$REVERSE= no
##$SF= 400.020009637714
##$SI= 131072
##$SIGF1= 0
##$SIGF2= 0
##$SINO= 400
##$SIOLD= 131072
##$SPECTYP= <>
##$SREGLST= <1H.CDCl3>
##$SSB= 0
##$STSI= 131072
##$STSR= 0
##$SW_p= 8223.68421052631
##$SYMM= 0
##$S_DEV= 0
##$TDeff= 65536
##$TDoff= 0
##$TI= <>
##$TILT= no
##$TM1= 0
##$TM2= 0
##$TOPLEV= 0
##$USERP1= <user>
##$USERP2= <user>
##$USERP3= <user>
##$USERP4= <user>
##$USERP5= <user>
##$WDW= 1
##$XDIM= 131072
##$YMAX_p= 425514376
##$YMIN_p= -12334
##$CURPLOT= <Network HP LaserJet P1505>
##$CURPRIN= <$Network HP LaserJet P1505>
##$DFORMAT= <normdp>
##$LAYOUT= <+/1D_H.xwp>
##$LFORMAT= <normlp>
##$PFORMAT= <normpl>
##$SURQMSG= 1
$$ End of Bruker specific parameters
$$ ---------------------------------
##NTUPLES= NMR SPECTRUM
##VAR_NAME=  FREQUENCY,     SPECTRUM/REAL,   SPECTRUM/IMAG
##SYMBOL=    X,             R,               I
##VAR_TYPE=  INDEPENDENT,   DEPENDENT,       DEPENDENT
##VAR_FORM=  AFFN,          ASDF,            ASDF
##VAR_DIM=   131072,        131072,          131072
##UNITS=     HZ,            ARBITRARY UNITS, ARBITRARY UNITS
##FACTOR=    0.0627417313425164, 1,          1
##FIRST=     8223.62146879497, 1928,         -58080
##LAST=      0,             3177,            -58059
##MIN=       0,             -12334,          0
##MAX=       8223.62146879497, 425514376,    0
$$ Real data points
##PAGE= N=1
##DATA TABLE= (X++(R..R)), XYDATA
$$ [...]
61771D30080p11n85r83j370j077o8J003J536J494J156Q28Q33J344K058K459K491
$$ 430080 429369 428784 427801 426431 425354 425286 426289 427825 429319 430475 431303 432136 433480 435538 437997 440488
61755D40488K579K792K589J644M57l07o42r02j138j257j514k129k624k299j323
$$ 440488 443067 445859 448448 450092 450549 450242 449600 448698 447560 446303 444789 442660 440036 437737 436414
61740D36414p03j027j819k366k579k680k480j576j18J091J417J053O81O60P27
$$ 436414 435711 434684 432865 430499 427920 425240 422760 421184 421066 422157 423574 424627 425308 425968 426695
61725D26695N45K89N10J428K597L308L278K842K553K619K720K379J578Q48O19
$$ 426695 427240 427529 428039 429467 432064 435372 438650 441492 444045 446664 449384 451763 453341 454189 454808
61710D54808O46L70k79r22j493k385l642m596m699m296m099m234m244l829l128
$$ 454808 455454 455824 455545 454623 453130 450745 447103 442507 437808 433512 429413 425179 420935 417106 413978
61695D13978k439k043k181k805l460l713l570l244k811k428k462k954l301l092
$$ 413978 411539 409496 407315 404510 401050 397337 393767 390523 387712 385284 382822 379868 376567 373475
61681C73475k854l216l679l252k134j664k338l031k646j551p57n07m09l69n28
$$ 373475 370621 367405 363726 360474 358340 356676 354338 351307 348661 347110 346353 345846 345437 345068 344540
61666C44540o43m12j30l27p95p62K2R26J274J002M82J29J76N56R44J215J697K600
$$ 344540 343897 343485 343355 343028 342233 341471 341493 342419 343693 344695 345177 345306 345482 346038 346982 348197 349894 352494
61648C52494L400L358K598K092K424L123L442L319L201L265L194K607J469J13
$$ 352494 355894 359252 361850 363942 366366 369489 372931 376250 379451 382716 385910 388517 389986 390099
61634C90099r82j545j751k030k578l167l511l636l817m154m370m061l186k153
$$ 390099 389117 387572 385821 383791 381213 378046 374535 370899 367082 362928 358558 354497 351311 349158
61620C49158j325n16N73J502J311o6j265j111k71l60j643k803l023l059l699m350
$$ 349158 347833 347317 347890 349392 350703 350637 349372 348261 347990 347630 345987 343184 340161 337102 333403 329053
61604C29053m066l236l096l945m836m949m366l489k533j785j664k192k844l135
$$ 329053 324987 321751 318655 314710 309874 304925 300559 297070 294537 292752 291088 288896 286052 282917
61590B82917k988k466j655r02o70r00r91p00n46r67j506j383o27p6k24n90l85
$$ 282917 279929 277463 275808 274906 274236 273336 272345 271645 271099 270132 268626 267243 266616 266540 266316 265726 265341
61573B65341N06J404J563Q63j78r24j168j183j349j723j936j565n45O93J609K050
$$ 265341 265847 267251 268814 269677 269499 268575 267407 266224 264875 263152 261216 259651 259106 259799 261408 263458
61557B63458K252K328K026J188K45j18K24O97P32L43o1k04r7J08L24O49J287K217
$$ 263458 265710 268038 270064 271252 271497 271379 271603 272300 273032 273375 273314 273110 273013 273121 273445 274094 275381 277598
61539B77598L006L154K656J932J304Q33N99P26J028J052O95L80M17N38L43j06
$$ 277598 280604 283758 286414 288346 289650 290483 291082 291808 292836 293888 294583 294963 295380 295918 296261 296155
61523B96155m34m98m09k63j47k30n75r97j331j615j819j673j092m71j24K51J029
$$ 296155 295721 295223 294814 294551 294404 294174 293599 292602 291271 289656 287837 286164 285072 284601 284477 284728 285757
61506B85757J782J624L98j039j798j783j419j087r62r74p39M6R85J206M37n36
$$ 285757 287539 289163 289561 288522 286724 284941 283522 282435 281473 280499 279760 279806 280791 281997 282434 281898
61490B81898q18m34n6PJ4J81L85N28P37J059J278J300J440K041K787K832J768
$$ 281898 281080 280646 280590 280597 280611 280792 281177 281705 282442 283501 284779 286079 287519 289560 292347 295179 296947
61473B96947K70n39l45J27J52r3pM73Q40Q37P28P26O19J35o19j315j658j394m11
$$ 296947 297217 296678 296333 296460 296612 296519 296512 296985 297825 298662 299390 300116 300735 300870 300251 298936 297278 295884 295473
61454B95473R24J841J881J338Q03N22M58O37J014J176P15j08n01m0Q79J578J803
$$ 295473 296397 298238 300119 301457 302260 302782 303240 303877 304891 306067 306782 306674 306173 306133 307012 308590 310393
61437C10393J746J691J850K342L054L544L363K550J653J230J329J498J256N27
$$ 310393 312139 313830 315680 318022 321076 324620 327983 330533 332186 333416 334745 336243 337499 338026
61423C38026k89o18j20J007K097K491K116J490J123J004Q14N03L40M30M71J45
$$ 338026 337737 337119 336999 338006 340103 342594 344710 346200 347323 348327 349141 349644 349984 350414 350885 351030
61407C51030n08j268k022k619k694k017j000m63q08j642k331k641k681k419j637
$$ 351030 350522 349254 347232 344613 341919 339902 338902 338439 337631 335989 333658 331017 328336 325917 324280
61392C24280l67R07J625J663J305Q31L02k30n36m58j79qO7L56R04J305J207Q57
$$ 324280 323913 324820 326445 328108 329413 330244 330546 330316 329780 329322 329143 329135 329202 329558 330462 331767 332974 333831
61374C33831Q02J169J554J579J340J143J143J299J538J736J710J424J146J181
$$ 333831 334633 335802 337356 338935 340275 341418 342561 343860 345398 347134 348844 350268 351414 352595
61360C52595J537K048K719L622M494M870M765M862N703O957P856Q183Q314Q411
$$ 352595 354132 356180 358899 362521 367015 371885 376650 381512 387215 394172 402028 410211 418525 426936
61346D26936Q057O933N381M051L257K915K871K991L071K982K798K646K478K152
$$ 426936 434993 441926 447307 451358 454615 457530 460401 463392 466463 469445 472243 474889 477367 479519
61332D79519J610Q42r4r36j389j674k436l763m737m560l790l613m030l779k276
$$ 479519 481129 481971 481877 480941 479552 477878 475442 471679 466942 462382 458592 454979 450949 447170 444894
61317D44894o00Mk23j30O60J559K237L056M252N448O289O994P977R281J0614J1620
$$ 444894 444294 444298 444075 443945 444605 446164 448401 451457 455709 461157 467446 474440 482417 491698 502312 513932
61301E13932J1886J1014Q978O324L729J537k04j465k253k796l344l840m022l895
$$ 513932 525818 536832 545810 552134 555863 557400 557196 555731 553478 550682 547338 543498 539476 535581
61287E35581l866m304n087n702n723n155m359l707l355l231l159k921k301j171
$$ 535581 531715 527411 522324 516622 510899 505744 501385 497678 494323 491092 487933 485012 482711 481540
61273D81540L39J877L096L800L915L414K499J683J425J705K196K870M111O006
$$ 481540 481879 483756 486852 490652 494567 497981 500480 502163 503588 505293 507489 510359 514470 520476
61259E20476P860Q785Q646Q113P772P544P003N984M718L548K606J709N34r13k126
$$ 520476 528336 537121 545767 553880 561652 569196 576199 582183 586901 590449 593055 594764 595298 594385 592259
61244E92259k640k728l160m165n031n039m429m088m480n207n577n308m670m132
$$ 592259 589619 586891 583731 579566 574535 569496 565067 560979 556499 551292 545715 540407 535737 531605
61230E31605l842l391k283o26R13J927K601L031K831J931J255J778L180M254M579
$$ 531605 527763 524372 522089 521463 522376 524303 526904 529935 532766 534697 535952 537730 540910 545164 549743
61215E49743M875N610O209O037N395M907M487L608K297J159O17O15J090K126L582
$$ 549743 554618 560228 566437 572474 577869 582776 587263 590871 593168 594327 594944 595559 596649 598775 602357
61200F02357M989O008O865Q106R991J2149J3872J4783J5139J5346J5261J4277
$$ 602357 607346 613354 620219 628325 638316 650465 664337 679120 694259 709605 724866 739143
61188G39143J2212R731P704O360N304M130K735J249p5r96j550k132l048m111m903
$$ 739143 751355 761086 768790 775150 780454 784584 787319 788568 788493 787497 785947 783815 780767 776656 771753
61173G71753n336n692o197o797p422q119q915r680j0254j0569j0664j0697j0929
$$ 771753 766417 760725 754528 747731 740309 732190 723275 713595 703341 692772 682108 671411 660482
61160F60482j1508j2177j2407j1893j0863r756q727p592o201m627k957j201M27
$$ 660482 648974 636797 624390 612497 601634 591878 583151 575559 569358 564731 561774 560573 561000
61147E61000J358J124q4j599k962m147n213o162p147q216q749p869n721l647k528
$$ 561000 562358 563482 563398 561799 558837 554690 549477 543315 536168 527952 519203 511334 505613 501966 499438
61132D99438j681j52J604K482K715L676N752P779Q854R488J0422J1539J2613J4098
$$ 499438 497757 497605 499209 501691 504406 508082 513834 521613 530467 539955 550377 561916 574529 588627
61118E88627J6237J8262J9399K0044K0959K1925K2255K2113K2262K2658K2483
$$ 588627 604864 623126 642525 662569 683528 705453 727708 749821 772083 794741 817224
61107H17224K1513K0380J9427J8210J6365J4122J1724R010N868K543p23l809o364
$$ 817224 838737 859117 878544 896754 913119 927241 938965 947975 953843 956386 955663 951854 945490
61094I45490p989r027j0520j2999j5800j7922j9161j9996k0678k0912k0261j8649
$$ 945490 937501 928474 917954 904955 889155 871233 852072 832076 811398 790486 770225 751576
61082G51576j6535j4692j3557j2758j1575r988q758q295p917o701m699k838j723
$$ 751576 735041 720349 706792 694034 682459 672471 663713 655418 647501 640800 636101 633263 631540
61069F31540j061k62Q08J902K914M032N335O493P114P336P816Q931J0277J1237
$$ 631540 630479 630217 631025 632927 635841 639873 645208 651701 658815 666151 673967 682898 693175 704412
61055G04412J1890J2857J4361J5930J7114J8026J8922J9794K0669K1930K3855
$$ 704412 716302 729159 743520 759450 776564 794590 813512 833306 853975 875905 899760
61044H99760K6110K8134K9882L1704L3614L5197L6231L6986L7796L8814M0305
$$ 899760 925870 954004 983886 1015590 1049204 1084401 1120632 1157618 1195414 1234228 1274533
61033A274533M2658M5721M8602N0560N1800N2904N3767N3841N3273N3051N3846
$$ 1274533 1317191 1362912 1411514 1462074 1513874 1566778 1620545 1674386 1727659 1780710 1834556
61022A834556N5576N8324O2755O9057P6192Q3049Q9850R7719J07476J19929J36758
$$ 1834556 1890132 1948456 2011211 2080268 2156460 2239509 2329359 2427078 2534554 2654483 2791241
61011B791241J59979J90837K30616K82211L49026M32258N31427O48235P87811
$$ 2791241 2951220 3142057 3372673 3654884 4003910 4436168 4967595 5615830 6403641
61002F403641R55202J152425J377443J616728J829426J942367J878340J607401
$$ 6403641 7358843 8511268 9888711 11505439 13334865 15277232 17155572 18762973
60994A8762973J177567O94404K68632k2744j43988r9256N8267K23936K74651J29503
$$ 18762973 19940540 20634944 20903576 20880832 20736844 20637588 20695855 20919791 21194442 21323945
60984B1323945k07845o58783j117271j494462j737951j832613j795344j664734
$$ 21323945 21116100 20457317 19340046 17845584 16107633 14275020 12479676 10814942
60976A0814942j484638j289373j099237r24625p70651o38830n28170m36727l62201
$$ 10814942 9330304 8040931 6941694 6017069 5246418 4607588 4079418 3642691 3280490
60967C280490l01767k52787k13742j83614j60540j42105j26842j14280j03663
$$ 3280490 2978723 2725936 2512194 2328580 2168040 2025935 1899093 1784813 1681150
60958A681150r3744q3881p4357o5430n7041m9602m4000m0504l8375l6817l5543
$$ 1681150 1587406 1503525 1429168 1363738 1306697 1257095 1213095 1172591 1134216 1097399 1061856
60947A061856l4268l2482l0138k7906k6339k5211k3919k2122j9959j8000j6977
$$ 1061856 1027588 995106 964968 937062 910723 885512 861593 839471 819512 801512 784535
60936G84535j7023j7298j6970j6332j6192j6394j5931j4579j3285j2699j2293
$$ 784535 767512 750214 733244 716912 700720 684326 668395 653816 640531 627832 615539
60925F15539j1338r947q733q071p996q191p928o715n134m283m216l913k877j768
$$ 615539 604201 594254 585521 577450 569454 561263 553335 546620 541486 537203 532987 529074 526197 524429
60911E24429j084m16M75Q87K98n73o93JQ73J527J814J518P73K24J81J07m85j220
$$ 524429 523345 522929 523404 524291 524589 524016 523323 523324 524197 525724 527538 529056 529829 530053 530234 530341 529856 528636
60893E28636j542j634k010k686l362l951m435m711n015n802o776o856n828n072
$$ 528636 527094 525460 523450 520764 517402 513451 509016 504305 499290 493488 486712 479856 474028 468956
60879D68956n827p447q365q129p406o597n580m497l689l071k396j861j648j302
$$ 468956 463129 455682 447317 439188 431782 425185 419605 415108 411419 408348 405952 404091 402443 401141
60865D01141m31M46P26R08J813L034L406K744J919J367Q23M40Q03J698K167K031
$$ 401141 400710 401156 401882 402790 404603 407637 411043 413787 415706 417073 417896 418336 419139 420837 423004 425035
60849D25035K138K787L111K496J528R74P48M88K35m2p91k024k875k762k428k953
$$ 425035 427173 429960 433071 435567 437095 438069 438817 439305 439540 439498 438707 436683 433808 431046 428618 425665
60833D25665m209n054m847l975l016k075j082k36J81J62n4l08p32j501k479l221
$$ 425665 421456 416402 411555 407580 404564 402489 401407 401171 401352 401514 401460 401152 400420 398919 396440 393219
60817C93219l514l660m036m528m653m131l116j984j172j025j539k362l203m002
$$ 393219 389705 386045 382009 377481 372828 368697 365581 363597 362425 361400 359861 357499 354296 350294
60803C50294m454l970k586j393j332j947k145j846j826k174k048j207n94r12j513
$$ 350294 345840 341870 339284 337891 336559 334612 332467 330621 328795 326621 324573 323366 322772 321860 320347
60788C20347j323k71P73J109P64K82K73R04J615J653J009M36M42P86J081J273
$$ 320347 319024 318753 319526 320635 321399 321681 321954 322858 324473 326126 327135 327571 328013 328799 329880 331153
60772C31153J313R88M99O20J710L018L479K985K259J772J297N76j23l19O9N66
$$ 331153 332466 333454 333953 334573 336283 339301 342780 345765 348024 349796 351093 351669 351546 351227 351296 351862
60756C51862O27J69m34q41j105j395j599j425q26n8O18J062J244J294J347J152
$$ 351862 352489 352658 352224 351383 350278 348883 347284 345859 345033 344975 345593 346655 347899 349193 350540 351692
60740C51692J83j469k772k923k498k718l798m785m957m555m065l669l518l760
$$ 351692 351875 350406 347634 344711 342213 339495 335697 330912 325955 321400 317335 313666 310148 306388
60726C06388m020l571k284q43J14N27M69r4q15j045o68k76k11j15K86O57P11P85
$$ 306388 302368 298797 296513 295670 295784 296311 296780 296686 295871 294826 294158 293882 293671 293556 293842 294499 295210 295995
60708B95995J281K062K799L314L317K421R21r3J04J004J625J584J084M29M9M33
$$ 295995 297276 299338 302137 305451 308768 311189 312110 312017 312121 313125 314750 316334 317418 317847 317896 318329
60692C18329J468K305K381K035J733J295M62l53n96l44P4P36J754K641K803K321
$$ 318329 319797 322102 324483 326518 328251 329546 330008 329655 329059 328715 328789 329525 331279 333920 336723 339044
60676C39044J632Q39k5n22l52K3L1q7J74M62n4j374k610l170l193k914k420k001
$$ 339044 340676 341515 341490 340968 340616 340639 340670 340583 340757 341219 341165 339791 337181 334011 330818 327904 325484 323483
60658C23483j963k050j716r70l04J47O28J106J321J473J978K597K672K287K170
$$ 323483 321520 319470 317754 316784 316480 316627 317255 318361 319682 321155 323133 325730 328402 330689 332859
60643C32859K294J680L1j513j887j569j714k473l069l094k863k597k109j310m54
$$ 332859 335153 336833 336864 335351 333464 331895 330181 327708 324639 321545 318682 316085 313976 312666 312212
60628C12212K30O37N71r3r19j075k42R38J602J557J231R02M81o8m80n70m83l55
$$ 312212 312442 313079 313650 313557 312638 311563 311321 312259 313861 315418 316649 317551 318032 317964 317484 316914 316431 316076
60610C16076nO02R36M96l16n71j20K16Kq2N95J404J242J66o41m17M10J037J191
$$ 316076 316071 316673 317609 318105 317789 317218 317098 317314 317316 317234 317829 319233 320475 320641 320000 319583 319993 321030 322221
60591C22221J087J037J259J663J769J196L00j41J09N52P43P48P49P19O67P20Q00
$$ 322221 323308 324345 325604 327267 329036 330232 330532 330391 330500 331052 331795 332543 333292 334011 334678 335398 336198
60574C36198P22P70J575L065M232M412M373N411P591R633J0447J0191R625R013
$$ 336198 336920 337690 339265 342330 346562 350974 355347 360758 368349 377982 388429 398620 408245 417258
60560D17258P990O230L912J537m75k019l219m222n007n353m988l824k133n00N35
$$ 417258 425248 431478 435390 436927 436452 434433 431214 426992 421985 416632 411644 407820 405687 405187 405722
60545D05722Q80J034J744L422N793Q080R694J0774J1940J3528J5172J6182J6150
$$ 405722 406602 407636 409380 412802 418595 426675 436369 447143 459083 472611 487783 503965 520115
60532E20115J5048J2984J0130O793L332Jk967n231o536p011p087p078p030o896
$$ 520115 535163 548147 558277 565070 568402 568403 565436 560205 553669 546658 539571 532493 525463 518567
60518E18567o627o101n175l922k647j604q31k40K56P21J219J803K581L758N504
$$ 518567 511940 505839 500664 496742 494095 492491 491660 491420 491676 492397 493616 495419 498000 501758 507262
60503E07262P755J0290J2926J5661J8672K2223K6391L0783L4667L7619L9865M1743
$$ 507262 515017 525307 538233 553894 572566 594789 621180 651963 686630 724249 764114 805857
60491H05857M2900M2420L9701L4946K8586K0619J0814m28j1752k1603k9318l5315
$$ 805857 848757 891177 930878 965824 994410 1015029 1025843 1025415 1013663 992060 962742 927427
60479I27427m0162m3707m5334m4834m2680l9570l6099l2829l0060k7411k4233
$$ 927427 887265 843558 798224 753390 710710 671140 635041 602212 572152 544741 520508
60468E20508k0698j7871j6293j5111j3179j0519q037o261n149m806n379o250o280
$$ 520508 499810 481939 465646 450535 437356 426837 418800 412539 407390 402584 397205 390955 384675
60455C84675n072l357k035j421j520k202k871k763j972j563k193l147l259k296
$$ 384675 379603 376246 374211 372790 371270 369068 366197 363434 361462 359899 357706 354559 351300 349004
60441C49004r96j32l5o72j571j943j405m43J90L41K82K2o46j513k051k072j778
$$ 349004 348008 347876 347841 347169 345598 343655 342250 341807 341997 342338 342620 342642 341996 340483 338432 336360 334582
60424C34582j162m4J201J706J213N67O64J292J601J398J312J724K179K107J617
$$ 334582 333420 333376 334577 336283 337496 338063 338727 340019 341620 343018 344330 346054 348233 350340 351957
60409C51957J188Q97M14l06p29l68O23J594K046K013J809J614J385J076Q28Q87
$$ 351957 353145 354042 354456 354150 353421 353053 353676 355270 357316 359329 361138 362752 364137 365213 366041 366928
60393C66928J312J895K356K532K419K186K214K820L727M087L403K242J621J740
$$ 366928 368240 370135 372491 375023 377442 379628 381842 384662 388389 392476 395879 398121 399742 401482
60379D01482J855J474J045J217J910K547K853K936K799K301J571J053J018J263
$$ 401482 403337 404811 405856 407073 408983 411530 414383 417319 420118 422419 423990 425043 426061 427324
60365D27324J347J040N73M58J009J932K663L107L752M839N912O480O820P603Q944
$$ 427324 428671 429711 430284 430742 431751 433683 436346 439453 443205 448044 453956 460436 467256 474859 483803
60350D83803J0236J0835J0523R403P713N786L782J550j018l603n723p263q429
$$ 483803 494039 504874 515397 524800 532513 538299 542081 543631 542613 539010 533287 526024 517595
60337E17595r280r683r582q964p672n748l805k691k642l159l696m071m261m181
$$ 517595 508315 498632 489050 480086 472414 466666 462861 460170 457528 454369 450673 446602 442341 438160
60323D38160l787l149k397j770j509j421q34O37K489L993N223O766Q606J0032
$$ 438160 434373 431224 428827 427057 425548 424127 423293 423930 426419 430412 435635 442401 451007 461039
60309D61039J0737J1225J1991J2864J3429J3551J3284J2739J2158J1587J0392
$$ 461039 471776 483001 494992 507856 521285 534836 548120 560859 573017 584604 594996
60298E94996P755L831k43l745p091j0819j4440j6866j7553j6758j5096j3234j1671
$$ 594996 602751 606582 606339 602594 595503 584684 570244 553378 535825 519067 503971 490737 479066
60285D79066j0365q855p024n393m367l682l048k756l086l550l420k745k161j897
$$ 479066 468701 459846 452822 447429 443062 439380 436332 433576 430490 426940 423520 420775 418614 416717
60271D16717j679j499j727k330k650k242j471j064j305j903k369k388j954j296
$$ 416717 415038 413539 411812 409482 406832 404590 403119 402055 400750 398847 396478 394090 392136 390840
60257C90840o24O5P64J171R26J70m03k45M49J018J130J084J287J634J623J090
$$ 390840 390216 390281 391045 392216 393142 393312 392909 392664 393113 394131 395261 396345 397632 399266 400889 401979
60241D01979N11L76N54N80M01L77N88O52L75J09K60P54J320J914K583L070L020
$$ 401979 402490 402866 403420 404000 404401 404778 405366 406018 406393 406502 406762 407516 408836 410750 413333 416403 419423
60224D19423K402J540P72L35L71Q24J361J711J983K519L433M485N326N724N681
$$ 419423 421825 423365 424137 424472 424843 425667 427028 428739 430722 433241 436674 441159 446485 452209 457890
60209D57890N439N359N610O013O219O024N556N190N220N468N369M667L862L589
$$ 457890 463329 468688 474298 480311 486530 492554 498110 503300 508520 513988 519357 524024 527886 531475
60195E31475L714L516K788K060J667J234M21m08p53p44q66j267j822k531l340
$$ 531475 535189 538705 541493 543553 545220 546454 546875 546467 545714 544970 544104 542837 541015 538484 535144
60180E35144l835l720l374l399l751l867l603l366l367l268k783k099j573j351
$$ 535144 531309 527589 524215 520816 517065 513198 509595 506229 502862 499594 496811 494712 493139 491788
60166D91788j421j693j830j442o22j6j00o68j213j526j628j392p01J05L97%n14
$$ 491788 490367 488674 486844 485402 484780 484764 484664 483996 482783 481257 479629 478237 477536 477641 478038 478038 477524
60149D77524m85R3O57Q24P55Q10J095J404J525J526J816K806M336N556N706N023
$$ 477524 477039 477132 477789 478613 479368 480178 481273 482677 484202 485728 487544 490350 494686 500242 505948 510971
60133E10971M445M382M369M048L853M171M474M023L030K326K042J574P21K7j00
$$ 510971 515416 519798 524167 528215 532068 536239 540713 544736 547766 550092 552134 553708 554429 554456 554356
60118E54356J92P33J444J844J346L24j16K50L12o33j701j754j125r90j596k156
$$ 554356 554548 555281 556725 558569 559915 560239 560123 560373 560685 560052 558351 556597 555472 554482 552886 550730
60102E50730k192j981j815j649j521j622j851j870j629j347j051n93n2L30N51
$$ 550730 548538 546557 544742 543093 541572 539950 538099 536229 534600 533253 532202 531609 531557 531887 532438
60087E32438P86R60Q96P37P50P88M34l08r99j447j905k499k932k985k983l484
$$ 532438 533224 534184 535080 535817 536567 537355 537789 537481 536482 535035 533130 530631 527699 524714 521731 518247
60071E18247m573n654n976n381m497m052m083m101l952l985m227m146l525l006
$$ 518247 513674 508020 502044 496663 492166 488114 484031 479930 475978 471993 467766 463620 460095 457089
60057D57089l200l785l992l660l144k577j853j095m97J03R25J776K389K906L482
$$ 457089 453889 450104 446112 442452 439308 436731 434878 433783 433286 433389 434314 436090 438479 441385 444867
60042D44867L786L557L265L397L508K970K260K368L087L161K249J453J506J663
$$ 444867 448653 452210 455475 458872 462380 465350 467610 469978 473065 476226 478475 479928 481434 483097
60028D83097R58l85j527k232k793l363m035n115o625p889q196p637o878o368o163
$$ 483097 484055 483670 482143 479911 477118 473755 469720 464605 457980 450091 441895 434258 427380 421012 414849
60013D14849o153o074n524m441l332k662k306j909j505j338j402j504j632j805
$$ 414849 408696 402622 397098 392657 389325 386663 384357 382448 380943 379605 378203 376699 375067 373262
59999C73262j696r56J69Q83P21L7l89j24P05J694K516K929K744K023J311J250
$$ 373262 371566 370610 370779 371662 372383 372420 372031 371907 372612 374306 376822 379751 382495 384518 385829 387079
59983C87079J793K137J742J058P92Q25M80l23r95j324j739k319k368j485l69L
$$ 387079 388872 391009 392751 393809 394601 395426 395906 395583 394588 393264 391525 389206 386838 385353 384984 384987
59967C84987m00q73r77p60k11P52J765K062J322J54n16l57J90N39N41L83J74j31
$$ 384987 384587 383714 382737 381977 381766 382518 384283 386345 387667 387821 387305 386948 387138 387677 388218 388601 388775 388644
59949C88644m32m63k02Ll9KM35R03P95P6o85j088j162r71n17k2J81J34J37J75
$$ 388644 388212 387749 387547 387550 387511 387513 387948 388851 389646 389722 389037 387949 386787 385816 385299 385277 385458 385592 385729 385904
59929C85904M0p5L34J278K242L013L822M518M440L490K547K297K272J626L83o71
$$ 385904 385944 385869 386203 387481 389723 392736 396558 401076 405516 409006 411553 413850 416122 417748 418131 417460
59913D17460r59n11K87Q32N77k99p98j91J088K061K354K277K038J586J061Q53
$$ 417460 416501 415990 416277 417109 417686 417387 416589 416398 417486 419547 421901 424178 426216 427802 428863 429716
59897D29716J082J445J595J469J315J509K162K823K934K723L136M465N721N873
$$ 429716 430798 432243 433838 435307 436622 438131 440293 443116 446050 448773 451909 456374 462095 467968
59883D67968N252M951N233N435N270N245N682O165O237N969N447M313K327L5j625
$$ 467968 473220 478171 483404 488839 494109 499354 505036 511201 517438 523407 528854 533167 535494 535529 533904
59868E33904k330k643l291m378n295n339m383l037k059j723j698j456o39P76K468
$$ 533904 531574 528931 525640 521262 515967 510628 506245 503208 501149 499426 497728 496272 495633 496409 498877
59853D98877L919M815N332N914O744P538P751P003N375L437J835P93R2l48k13
$$ 498877 502796 507611 512943 518857 525601 533139 540890 547893 553268 556705 558540 559333 559425 559077 558864
59838E58864N97J404J220j46j855l006l531l895m223m098l341k529k411k881l045
$$ 558864 559461 560865 562085 561939 560084 557078 553547 549652 545429 541331 537990 535461 533050 530169 527124
59823E27124k437j680j583k010k232k117k212k701l124l330l874m998n926n782
$$ 527124 524687 523007 521424 519414 517182 515065 512853 510152 507028 503698 499824 494826 488900 483118
59809D83118m755l724l107k666k299k304k901l881m674m580l229j209R4j73j376
$$ 483118 478363 474639 471532 468866 466567 464263 461362 457481 452807 448227 444998 443789 443883 443710 442334
59794D42334k219k229j894j563j101n55l98p55j046p32J5O37Q23O15K09n9K06
$$ 442334 440115 437886 435992 434429 433328 432773 432375 431620 430574 429842 429857 430494 431317 431932 432141 432082 432288
59777D32288R95J727J737R91J22j37M11J316J931K033J936J938J902J604J321
$$ 432288 433283 435010 436747 437738 437860 437723 438134 439450 441381 443414 445350 447288 449190 450794 452115
59762D52115J639K599L404L184J884L45l56L30K022L658M305L962L447L500M160
$$ 452115 453754 456353 459757 462941 464825 465170 464814 465144 467166 470824 475129 479091 482538 486038 490198
59747D90198M960N466N468M898L866K742J996J874K230K695K985L068L021K816
$$ 490198 495158 500624 506092 510990 514856 517598 519594 521468 523698 526393 529378 532446 535467 538283
59733E38283K388J912J812K255K760K572J459j5j073j437j389j266j091p15j49
$$ 538283 540671 542583 544395 546650 549410 551982 553441 553426 552353 550916 549527 548261 547170 546455 546306
59718E46306L41M97K74k09q51j533k050k191j934j453r84p40q26j025q33k1R42
$$ 546306 546647 547144 547418 547209 546358 544825 542775 540584 538650 537197 536213 535473 534647 533622 532789 532768 533710
59701E33710J388J258J098J188J244J025P82P92R05Q65P31O03K05q00k145l043
$$ 533710 535098 536356 537454 538642 539886 540911 541693 542485 543390 544255 544986 545589 545794 544994 542849 539806
59685E39806k975k187j392j039r35n95m2Lj013k578l618l863m007m455m644m081
$$ 539806 536831 534644 533252 532213 531278 530683 530641 530644 529631 527053 523435 519572 515565 511110 506466 502385
59669E02385l255k992l300l604l673l716l747l549l056k313j238N7J010J278J382
$$ 502385 499130 496138 492838 489234 485561 481845 478098 474549 471493 469180 467942 467999 469009 470287 471669
59654D71669K010K900L225K930K790L077L123K410J325L91m85j517k360k565k385
$$ 471669 473679 476579 479804 482734 485524 488601 491724 494134 495459 495850 495365 493848 491488 488923 486538
59639D86538k555l310m101m249l649k729j963j506j245j173j468k124k650k491
$$ 486538 483983 480673 476572 472323 468674 465945 463982 462476 461231 460058 458590 456466 453816 451325
59625D51325j682q40n20q51j688k729l489l585l186k886k927k937k551j930j455
$$ 451325 449643 448803 448283 447432 445744 443015 439526 435941 432755 429869 426942 424005 421454 419524 418069
59610D18069j157p96l10Q0K25K22K95O01J195J985K702K988K643J844J068P37
$$ 418069 416912 416116 415806 415886 416111 416333 416628 417229 418424 420409 423111 426099 428742 430586 431654 432391
59594D32391Q79J193J391J403J252J008Q34Q86J022Q99M62R0lj90r21j988k702
$$ 432391 433270 434463 435854 437257 438509 439517 440351 441237 442259 443158 443620 443710 443707 443517 442596 440608 437906
59577D37906k751k486k363k377k194j570o34J65L86l4p11j179j247r76m90N2M63
$$ 437906 435155 432669 430306 427929 425735 424165 423531 423696 424082 424048 423337 422158 420911 419935 419445 419497 419960
59560D19960O78P20M92j53j004j433j035j26O97J227J649K030K183K016J794K036
$$ 419960 420638 421358 421850 421697 420693 419260 418225 418099 418796 420023 421672 423702 425885 427901 429695 431731
59544D31731L075M637N905O425O891Q524J1584J5025J7722J9230J9093J6429J1044
$$ 431731 434806 439443 445348 451773 458664 467188 478772 493797 511519 530749 549842 566271 577315
59531E77315M353j670o058q766r600q304n492k528l73Q54J359J439J533J827J854
$$ 577315 581668 579998 573940 565174 555574 547270 541778 539250 538877 539731 541090 542529 544062 545889 547743
59516E47743J148K8r35j920l410n040n963o277o902p990q573q113p309o913o748
$$ 547743 548891 548919 547984 546064 542654 537614 531651 525374 518472 510482 501909 493796 486487 479574 472826
59501D72826o437o163o083n718m712l618l202l282k949j788l46N43N70J43m6L24
$$ 472826 466389 460226 454143 448425 443713 440095 436893 433611 430662 428874 428528 429071 429641 429784 429738 430062
59485D30062R28J247J192J048J042J332K162L454M443M443L895L847M393M558
$$ 430062 430990 432237 433429 434477 435519 436851 439013 442467 446910 451353 455248 459095 463488 468046
59471D68046L822K815K190J770J249R25J103J433J517J577J964K444K622K667
$$ 468046 471868 474683 476873 478643 479892 480817 481920 483353 484870 486447 488411 490855 493477 496144
59457D96144L009L623M175M624N202N948O641P091P269P252P225P200O717N259
$$ 496144 499153 502776 506951 511575 516777 522725 529366 536457 543726 550978 558203 565403 572120 577379
59443E77379L019P54j223l259n341o677o777o281o066o039n548m556l648l096
$$ 577379 580398 581152 579929 576670 571329 564652 557875 551594 545528 539489 533941 529385 525737 522641
59429E22641k620k030j510j146o03N41K358M540O699Q711J0753J3039J5573J8190
$$ 522641 520021 517991 516481 515335 514732 515273 517631 522171 528870 537581 548334 561373 576946 595136
59415E95136K0712K2935K4777K6586K8655K9890K7757K0650J0141k67q318j3904
$$ 595136 615848 638783 663560 690146 718801 748691 776448 797098 807239 806972 798654 784750
59403G84750j7165j7478j4692r753l559L321R084J0621O422j440r471j5918k0712
$$ 784750 767585 750107 735415 725662 722103 725424 734508 745129 751551 750111 740640 724722 704010
59390G04010k3564k3903k2177j9553j6518j3074r950q138p302o059l927j852o59
$$ 704010 680446 656543 634366 614813 598295 585221 575271 567133 559831 553772 549845 547993 547334
59377E47334j05L02O27R20J418K002K174J786J232Q02M39K32M35R34J227J078
$$ 547334 547229 547531 548158 549078 550496 552498 554672 556458 557690 558492 558931 559163 559598 560532 561759 562837
59361E62837P09M33O17J758L843N863O789O941P527Q806R839J0165J0653J2155
$$ 562837 563546 563979 564596 566354 570197 576060 582849 589790 597317 606123 615962 626127 636780 648935
59347F48935J4154J5386J5282J4309J3280J2778J2877J3045J2516J0949Q605N919
$$ 648935 663089 678475 693757 708066 721346 734124 747001 760046 772562 783511 792116 798035
59335G98035L200O96j534l794o338q767j0438j1420j2422j3647j4423j4227j3508
$$ 798035 801235 801931 800397 796603 790265 781498 771060 759640 747218 733571 719148 704921 691413
59322F91413j3094j3256j3592j3478j2409j0369q222p204p680q605q574p236n406
$$ 691413 678319 665063 651471 637993 625584 615215 606993 599789 592109 583504 574930 567694 562288
59309E62288m070l459k995j926p8K018L860N716Q158J0900J2517J1614Q054K869
$$ 562288 558218 554759 551764 549838 549760 551778 555638 561354 569512 580412 592929 604543 612597 615466
59295F15466k726p985j2470j5603j6692j5509j2805r912p674n990m502l312k635
$$ 615466 612740 604755 592285 576682 559990 544481 531676 521764 514090 508100 503598 500286 497651
59282D97651k148j259J25J561K707L550M232N053O413Q234R683J0108J0011J0358
$$ 497651 495503 494244 494369 495930 498637 502187 506419 511472 517885 526119 535802 545910 555921 566279
59268E66279J1141J1488J1145J0802J0748J0219Q552O227M131K336L00k077m185
$$ 566279 577420 588908 600053 610855 621603 631822 640374 646601 650732 653068 653368 651291 647106
59255F47106n427n845o003o431p111p520p243o484n679m807l546k044r72n85k90
$$ 647106 641679 635834 629831 623400 616289 608769 601526 595042 589363 584556 581010 578966 577994 577409 577119
59240E77119O90K492M599O290P020O759O084N657N514N193M448L461K330R31p13
$$ 577119 577809 580301 584900 591190 598210 604969 611053 616710 622224 627417 631865 635326 637656 638587 637874
59225F37874k443m299o306q016q893r274j0016j1075j1304j0096q354p238o665
$$ 637874 635431 631132 624826 616810 607917 598643 588627 577552 566248 556152 547798 540560 533895
59212E33895n830m656l832l678l768l628l198k601j957j497j433j658j829j731
$$ 533895 528065 523409 519577 515899 512131 508503 505305 502704 500747 499250 497817 496159 494330 492599
59198D92599j363p56L2Q37J521K125K665K913K684K242K110K370K486K014J341
$$ 492599 491236 490480 490512 491349 492870 494995 497660 500573 503257 505499 507609 509979 512465 514479 515820
59183E15820J406K529L837M203L661L327L809M390M173L377K829K641K391K264
$$ 515820 517226 519755 523592 527795 531456 534783 538592 542982 547155 550532 553361 556002 558393 560657
59169E60657K894M066M664M232L601L528L640L279K575J974J374M14q04j986l247
$$ 560657 563551 567617 572281 576513 580114 583642 587282 590561 593136 595110 596484 596898 596094 594108 590861
59154E90861m727o051o805p256p878q466q460p927p413o928n907m342l183l314
$$ 590861 586134 580083 573278 566022 558144 549678 541218 533291 525878 518950 513043 508701 505518 502204
59140E02204m532n789o128n328l996l119l183l664l638k902k084j689j546j293
$$ 502204 497672 491883 485755 480427 476431 473312 470129 466465 462827 459925 457841 456152 454606 453313
59126D53313r15m76K03J237K330L138L803M723N863O735P103P348P944Q889R775
$$ 453313 452398 451922 452125 453362 455692 458830 462633 467356 473219 479954 487057 494405 502349 511238 521013
59111E21013J0287J0426J0342J0135R803R235Q327P223O324N875N597M935L652
$$ 521013 531300 541726 552068 562203 572006 581241 589568 596791 603115 608990 614587 619522 623174
59098F23174K051O79o9j58K0q6o16j078j010o41m50l71n0K15k59j284j795j515
$$ 623174 625225 625904 625835 625677 625697 625611 624995 623917 622907 622266 621816 621445 621395 621610 621351 620067 618272 616757
59080F16757j593k992n068o538p114p277p195o884o832p292p368o109m248l499
$$ 616757 615164 612172 607104 600566 593452 586175 578980 572096 565264 557972 550604 544495 540247 536748
59066E36748m176m887m723m313m338m370l916l391l279l163k526j730j417j485
$$ 536748 532572 527685 522962 518649 514311 509941 506025 502634 499355 496192 493666 491936 490519 489034
59052D89034j480j523j993k655k839k345j525p25j43J8j80k27J67M85M1r09j362
$$ 489034 487554 486031 484038 481383 478544 476199 474674 473949 473806 473824 473644 473417 473584 474069 474110 473201 471839
59035D71839q26J60Q52J143J369J736K166K590L088L821M844O021P033P647P983
$$ 471839 471013 471173 472025 473168 474537 476273 478439 481029 484117 487938 492782 498803 505836 513483 521466
59020E21466Q505R528J0649J0899R740P860O465N791M895L185J419O06M63j17
$$ 521466 529971 539499 550148 561047 570787 578647 585112 590903 595798 598983 600402 601008 601471 601354
59006F01354j384k406k383j441m0J580L182M379M989N131M911M395L848L464L007
$$ 601354 599970 597564 595181 593740 593700 595280 598462 602841 607830 612961 617872 622267 626115 629579 632586
58991F32586K279J662J502J237J07j433k157j891j751k390l199l538l563l338
$$ 632586 634865 636527 638029 639266 639373 637940 635783 633892 632141 629751 626552 623014 619451 616113
58977F16113k338m40J546K983M149N306O068O379P047Q452R644R686R098Q964
$$ 616113 613775 613335 614881 617864 622013 627319 633387 639766 646813 655265 664909 674595 683693 692657
58963F92657R295R350Q994Q638Q260P499O389N115L366Q39j878l850n064o391
$$ 692657 701952 711302 720296 728934 737194 744693 751082 756197 759563 760402 758524 754674 749610 743219
58949G43219q411j0904j3326j5125j5808j5356j4385j3361j2015j0082q187p183
$$ 743219 734808 723904 710578 695453 679645 664289 649904 636543 624528 614446 606259 599076
58937E99076o935o555n680m752m123l599k879j937r59l50n64j534k434k452j662
$$ 599076 592141 585586 579906 575154 571031 567432 564553 562616 561657 561307 560743 559209 556775 554323 552661
58922E52661p65k91l12n74o08j18L96O3j022j650j136k76J08N61J956L801M898
$$ 552661 551896 551605 551293 550719 550111 549993 550389 550452 549430 547780 546644 546368 546476 547037 548993 552794 557692
58905E57692N181N655O771Q063R249J0529J1708J2139J1699J0973J0402R917R509
$$ 557692 562873 568528 575299 583362 592611 603140 614848 626987 638686 649659 660061 669978 679487
58892F79487R441R853J0748J2285J4453J6582J7850J8184J8112J7889J7297J6063
$$ 679487 688928 698781 709529 721814 736267 752849 770699 788883 806995 824884 842181 858244
58880H58244J3876J0461O247K559K72j316l435o129q532j0425j2234j3785j4275
$$ 858244 872120 882581 888828 891387 891659 890343 886908 880779 872247 861822 849588 835803 821528
58867H21528j3536j2244j0854r326p940p211o957o505n928o057p100q290r085
$$ 821528 807992 795748 784894 775568 767628 760417 753460 746955 741027 734970 727870 719580 710495
58854G10495r714j0355j0747j0810j0744j0363r310q033p476p626p476o692o116
$$ 710495 700781 690426 679679 668869 658125 647762 638452 630419 622943 615317 607841 601149 595033
58841E95033o221o303n842n499n928o569o492n726m920m251l570l144l334l733
$$ 595033 588812 582509 576667 571168 565240 558671 552179 546453 541533 537282 533712 530568 527234 523501
58827E23501l410k014j96J080J414J238J336K020K795L042K851K768K863K739
$$ 523501 520091 518077 517881 518961 520375 521613 522949 524969 527764 530806 533657 536425 539288 542027
58813E42027K434K501L027L264K598J378M09J22L73O89N05l65j420j996k166k586
$$ 542027 544461 546962 549989 553253 555851 557229 557638 557760 558133 558822 559327 558962 557542 555546 553380 550794
58797E50794l479m332m650m430l887l341l304l979m654m440l562k991k789j925
$$ 550794 547315 542983 538333 533903 530016 526675 523371 519392 514738 510298 506736 503745 500956 499031
58783D99031%J962L018L508M092M492M073L089K448K577L075L275K624R52j257
$$ 499031 499031 500993 504011 507519 511611 516103 520176 523265 525713 528290 531365 534640 537264 538216 536959
58768E36959l113m225m983n735o203o070n541m913m106l128k435k295k202j544
$$ 536959 533846 529621 524638 518903 512700 506630 501089 496176 492070 488942 486507 484212 482010 480466
58754D80466n09K77O41Q37Q90O70M93R24J894K640K691K501K766L466L975M050
$$ 480466 479957 480234 480875 481712 482602 483272 483765 484689 486583 489223 491914 494415 497181 500647 504622 508672
58738E08672M210M951N947O467O368O101N823N261M650M918O288P498P161N514
$$ 508672 512882 517833 523780 530247 536615 542716 548539 553800 558450 563368 569656 577154 584315 589829
58724E89829L944L252L178L305L494L595L634M187N643P263P838P252O566O548
$$ 589829 593773 597025 600203 603508 607002 610597 614231 618418 624061 631324 639162 646414 652980 659528
58710F59528O993P315O968N416K669k25k183l543n479q124j0454j2009j3371j4764
$$ 659528 666521 673836 680804 686220 688889 688664 686481 682938 677459 669335 658881 646872 633501 618737
58696F18737j5563j5543j5374j5374j4913j3663j2271j1223j0029q186o185m860
$$ 618737 603174 587631 572257 556883 541970 528307 516036 504813 494784 486598 480413 475553
58684D75553m411m536m868m940m395l565l109k936k297j082k3N42J068J722K132
$$ 475553 471142 466606 461738 456798 452403 448838 445729 442793 440496 439414 439391 439933 441001 442723 444855
58669D44855K428L325M773N856O464P643R639J1110J1128J0535J0250R578P446
$$ 444855 447283 450608 455381 461237 467701 475344 484983 496093 507221 517756 528006 537584 545030
58656E45030M244J123j586l994n517n518m648m238m636n186n390n221m589l498
$$ 545030 549274 550397 548811 544817 539300 533782 529134 524896 520260 515074 509684 504463 499874 496376
58642D96376k471k042k069k079j914j471m14J180K449K664K086J335N78j12k85
$$ 496376 493905 491863 489794 487715 485801 484330 483916 485096 487545 490209 492295 493630 494208 494096 493811
58627D93811J84N41J27n88o60O9J035J782K126K054J963K496L604M375M222L533
$$ 493811 493995 494536 494663 494075 493415 493484 494519 496301 498427 500481 502444 504940 508544 512919 517141 520674
58611E20674K795J961J169J045J582J750R95J13j44l04j041j867k049j897j953
$$ 520674 523469 525430 526599 527644 529226 530976 531971 532084 531940 531636 530595 528728 526679 524782 522829
58596E22829j874j329j146k132l445l583k471j206j79J108K710M055N055O170
$$ 522829 520955 519626 518480 516348 512903 509320 506849 505643 505464 506572 509282 513337 518392 524562
58582E24562P464Q551R351J0026J0353J0025R329Q693P847O357M671L735L803
$$ 524562 532026 540577 549928 559954 570307 580332 589661 598354 606201 612558 617229 620964 624767
58569F24767M386N180O282P745R594J2020J4957J7817K0124K1956K3365K4024
$$ 624767 629153 634333 640615 648360 657954 669974 684931 702748 722872 744828 768193 792217
58557G92217K3906K3425K2357J9625J4995J0000O147L220L12k377m086m926n454
$$ 792217 816123 839548 861905 881530 896525 906525 912672 915892 916204 913827 909741 904815 899361
58544H99361n513m902m551n665q055j0562j2744j4963j7238j9113k0347k0807
$$ 899361 893848 888946 884395 878730 870675 860113 847369 832406 815168 796055 775708 754901
58532G54901k0134j8364j6263j4241j1760q701o242n215m678l482k183j897k256
$$ 754901 734767 716403 700140 685899 674139 665438 659196 653981 649303 645821 643638 641741 639485
58519F39485k151j685j658j868j735j813k870m032l839k645k074k491k917l048
$$ 639485 637334 635649 633991 632123 630388 628575 625705 621673 617834 615189 613115 610624 607707 604659
58505F04659l387l636l010j967j701j975j450j23N41N1m97m59m53p72p04Q3R85
$$ 604659 601272 597636 594626 592659 590958 588983 587533 587410 587951 588002 587505 587046 586593 585821 585117 585200 586185
58488E86185J605K183K723L011L577N207P403Q776R067R351J0259J1358J2386
$$ 586185 587790 589973 592696 595707 599284 604491 611894 620670 629737 639088 649347 660705 673091
58475F73091J3538J4416J4142J2637J0484P634L659p58m194o344q037r460r869
$$ 673091 686629 701045 715187 727824 738308 745942 749601 748843 744649 738305 730268 720808 710939
58462G10939r062p641n805l413j090L18J255K882N106O859Q039R286J0132R411
$$ 710939 701877 694236 688431 685018 683928 684246 685501 688383 693489 700348 708387 717673 727805 737216
58448G37216P508O037N134L224k14l738o154p659q413p957o599n491m797l542
$$ 737216 744724 750761 755895 759119 758905 755167 749013 741354 732941 724984 718385 712894 708097 704555
58434G04555j676m37k61j26N06R89J171J911L367M548N111N866O988P489P017
$$ 704555 702879 702442 702181 702055 702561 703550 704721 706632 709999 714547 719658 725524 732512 740001 747018
58419G47018O321N580M039J813J41p12j973m181o318p634q525r061q533p053n790
$$ 747018 753339 758919 762958 764771 764912 764200 762227 758046 751728 744094 735569 726508 717975 710922 705132
58404G05132n070m123l037k900l520l171j320N07J274J762K624L300L674M610
$$ 705132 700062 695939 692902 690002 686482 683311 681991 682498 683772 685534 688158 691458 695132 699742
58390F99742N943O055M448K671J746Q42n38j193k64J300K466L459M404M606M207
$$ 699742 705685 711740 716188 718859 720605 721447 720909 719716 719452 720752 723218 726677 731081 735687 739894
58375G39894M567N999P034O913O759P305P605P127O913P558Q090Q029Q399R520
$$ 739894 744461 750460 757494 764407 771166 778471 786076 793203 800116 807674 815764 823793 832192 841712
58361H41712J0000R206Q586R132R717R370Q982R222Q930P261N451M720M287L128
$$ 841712 851712 860918 869504 878636 888353 897723 906705 915927 924857 932118 937569 942289 946576 949704
58347I49704K045K294L640N118O353P037O688N841N858O826P593Q288J0391J3635
$$ 949704 951749 954043 957683 962801 969154 976191 982879 988720 994578 1001404 1008997 1017285 1027676 1041311
58333A041311J5692J5831J6025J7227J7615J5983J3871J2611J1170Q752O708N930
$$ 1041311 1057003 1072834 1088859 1106086 1123701 1139684 1153555 1166166 1177336 1186088 1192796 1198726
58321A198726N067L291K128K651L588L984M886O516O904N490M882O686Q756R090
$$ 1198726 1203793 1207084 1209212 1211863 1215451 1219435 1224321 1230837 1237741 1243231 1248113 1254799 1263555 1272645
58307A272645R212J0834J2358J1917J1088J2196J4335J5281J5207J5447J5687
$$ 1272645 1281857 1292691 1305049 1316966 1328054 1340250 1354585 1369866 1385073 1400520 1416207
58296A416207J5241J5095J5980J6565J6012J6049J7983K0160K0833K1032K2063
$$ 1416207 1431448 1446543 1462523 1479088 1495100 1511149 1529132 1549292 1570125 1591157 1613220
58285A613220K2968K3023K3846K6255K8051K7623K6831K7473K8233K7965K8470
$$ 1613220 1636188 1659211 1683057 1709312 1737363 1764986 1791817 1819290 1847523 1875488 1903958
58274A903958L0855L2801L2738L3043L5554L7821L7712L7746M0591M4176M5752
$$ 1903958 1934813 1967614 2000352 2033395 2068949 2106770 2144482 2182228 2222819 2266995 2312747
58263B312747M7065N0594N4397N5671N6048N8253O0784O1067O0674O2219O4249
$$ 2312747 2359812 2410406 2464803 2520474 2576522 2634775 2695559 2756626 2817300 2879519 2943768
58252B943768O4430O4605O7503P1594P4408P7593Q3424Q9778R4011R8168J04885
$$ 2943768 3008198 3072803 3140306 3211900 3286308 3363901 3447325 3537103 3631114 3729282 3834167
58241C834167J11934J16485J20745J27563J34724J39735J45689J55859J67214
$$ 3834167 3946101 4062586 4183331 4310894 4445618 4585353 4731042 4886901 5054115
58232E054115J76053J85157J98203K12338K23887K36039K52921K71731K89144
$$ 5054115 5230168 5415325 5613528 5825866 6049753 6285792 6538713 6810444 7099588
58223G099588L09338L36515L66036L92977M22752M62340N07801N52327N99738
$$ 7099588 7408926 7745441 8111477 8504454 8927206 9389546 9897347 10449674 11049412
58214A1049412O57343P22517P90167Q66540R60910J070685J190300J327537J494758
$$ 11049412 11706755 12429272 13219439 14085979 15046889 16117574 17307874 18635411 20130169
58205B0130169J692494J920279K195338K540797K964847L474035M098122M879686
$$ 20130169 21822663 23742942 25938280 28479077 31443924 34917959 39016081 43895767
58197D3895767N853203P061976Q577527J0463941J2738333J5411104J8548697
$$ 43895767 49748970 56810946 65388473 75852414 88590747 104001851 122550548
58190A22550548K2237568K6484814L1173064L5993794M0196523M2352051M0654257
$$ 122550548 144788116 171272930 202445994 238439788 278636311 320988362 361642619
58183C61642619L3877440K2290857P703460p365557k0644766l0618504l6632963
$$ 361642619 395520059 417810916 425514376 418148819 397504053 366885549 330252586
58176C30252586l8849233l8059263l5319167l1570914k7477636k3461922j9776436
$$ 330252586 291403353 253344090 218024923 186454009 158976373 135514451 115738015
58169A15738015j6537102j3765739j1445634r540801p987522o710022n653351
$$ 115738015 99200913 85435174 73989540 64448739 56461217 49751195 44097844
58162D4097844m785379m073773l483460k993218k593483k268488j997105j768673
$$ 44097844 39312465 35238692 31755232 28762014 26168531 23900043 21902938 20134265
58154B0134265j581430j427054j291730j170371j065481r73515q85707q00867
$$ 20134265 18552835 17125781 15834051 14663680 13598199 12624684 11738977 10938110
58146A0938110p24675o57377n93763n33960m82957m40380m01317l66178l39531
$$ 10938110 10213435 9556058 8962295 8428335 7945378 7504998 7103681 6737503 6397972
58137F397972l20004l01101k81368k64564k50592k35205k18200k03366j90769
$$ 6397972 6077968 5776867 5495499 5230935 4980343 4745138 4526938 4323572 4132803
58128D132803j77113j63082j52426j44383j34682j23533j15084j09489j02952
$$ 4132803 3955690 3792608 3640182 3495799 3361117 3237584 3122500 3013011 2910059
58119B910059r5171q9424q5571q0193p3646o9845o8959o7008o3118o0531o0020
$$ 2910059 2814888 2725464 2639893 2559700 2486054 2416209 2347250 2280242 2217124 2156593 2096573
58108B096573n8578n5322n2707n1278m8868m5589m4178m4744m4395m2600m1761
$$ 2096573 2037995 1982673 1929966 1878688 1829820 1784231 1740053 1695309 1650914 1608314 1566553
58097A566553m2094m1066l8448l6873l6774l5610l2803l0731l0091k8739k5921
$$ 1566553 1524459 1483393 1444945 1408072 1371298 1335688 1302885 1272154 1242063 1213324 1187403
58086A187403k3365k1590j9311j6891j6317j7261j7309j6366j6731j8467j9070
$$ 1187403 1164038 1142448 1123137 1106246 1089929 1072668 1055359 1038993 1022262 1003795 984725
58075I84725j8083j7750j8478j8073j6156j5082j5512j5240j3439j2204j2606
$$ 984725 966642 948892 930414 912341 896185 881103 865591 850351 836912 824708 812102
58064H12102j2997j2362j1810j1641j0397p956o345o418o829p067q284j0341j1341
$$ 812102 799105 786743 774933 763292 752895 744939 738594 732176 725347 718280 709996 699655 688314
58051F88314j0945j0933j1592j1013q869p404p454o993n057l792m878o799p467
$$ 688314 677369 666436 654844 643831 634962 627558 620104 613111 608054 604262 599384 592585 585118
58038E85118p035o506n925n421n828o908p073n966n242n770o356o197o270p186
$$ 585118 578083 571577 565652 560231 554403 547495 540422 534456 529214 523444 517088 510891 504621 497435
58024D97435p903p693p320p224o624n413m828n168n002l647k435k425k800k573
$$ 497435 489532 481839 474519 467295 460671 455258 450430 445262 440260 436613 434178 431753 428953 426380
58010D26380k064j696j096k58O9p2L19J239J399N03j31J83O14P84J468K688L179
$$ 426380 424316 422620 421524 421266 421335 421263 421582 422821 424220 424723 424592 424775 425389 426173 427641 430329 433508
57993D33508K561J972J800R15r99k511k823k957l710m392m574n018n815n768m632
$$ 433508 436069 438041 439841 440756 439757 437246 434423 431466 427756 423364 418790 413772 407957 402189 397557
57978C97557l976m618n267m907m476m831n007m011k611j852j364n59j2k38n26
$$ 397557 393581 388963 383696 378789 374313 369482 364475 360464 357853 356001 354637 354078 354066 353828 353302
57963C53302l08k28o71o53M39J477J344P26P20R23L49p32j362j446j514j668j766
$$ 353302 352994 352766 352095 351442 351881 353358 354702 355428 356148 357071 357420 356688 355326 353880 352366 350698 348932
57946C48932j952k153j821q61N1O05J344K498L502M202N308P019Q481R196R619
$$ 348932 346980 344827 343006 342145 342196 342801 344145 346643 350145 354347 359655 366674 375155 384351 393970
57931C93970R818R008P122N244L770J740j160l621m820n850p794r839j0678j0479
$$ 393970 403788 412796 419918 425162 428932 430672 429512 425891 421071 415221 407427 397588 386910 376431
57917C76431j0133r658q750p833p332o724n487m177l465k917j733M1J775L043
$$ 376431 366298 356640 347890 340057 332725 326001 320514 316337 312872 309955 308222 308263 310038 313081
57903C13081L496K887J727R63N99j70j155j073K29J224J150J191K259L400L712
$$ 313081 316577 319464 321191 322154 322753 322583 321428 320355 320584 321808 322958 324149 326408 329808 333520
57888C33520L996M974N526M497K871K315K658K602J938J247K36j751m063n298
$$ 333520 337516 342490 348016 352513 355384 357699 360357 362959 364897 366144 366380 364629 360566 355268
57874C55268n218m753m385l880l314l175l620m374n072n161m123k390j136o00
$$ 355268 350050 345297 340912 337032 333718 330543 326923 322549 317477 312316 308193 305803 304667 304067
57860C04067L09J997L186L038K864M243O515P764P433O405N244L948K960K792
$$ 304067 304376 306373 309559 312597 315461 319704 326219 333983 341416 347821 353065 357013 359973 362765
57846C62765K963K571J632P45q0j083j798j655j102j011j356j545j593j854k079
$$ 362765 365728 368299 369931 370676 370596 369513 367715 366060 364958 363947 362591 361046 359453 357599 355520
57831C55520j860j519j514j449q41k33l55p19l89L26L00n31j108r38n57l21L9
$$ 355520 353660 352141 350627 349178 348337 348104 347749 347030 346641 346967 347267 346736 345628 344690 344133 343812 343851
57814C43851M49J74j264l519n993q334j0282j1431j1329r735p070m619l635m010
$$ 343851 344300 344474 343210 339691 333698 325364 315082 303651 292322 282587 275517 270898 267263 263253
57800B63253m483m385m299m652m776m082l134k696k532k008j141k85N00J069J042
$$ 263253 258770 254385 250086 245434 240658 236576 233442 230746 228214 226206 225065 224780 225280 226349 227391
57785B27391O89R97K163L121L340L780N131O350O341N788N931O507O454N756N059
$$ 227391 228080 229077 231240 234361 237701 241481 246612 252962 259303 265091 271022 277529 283983 289739 294798
57770B94798M241K939J795J621J851J339J47q60j555k345k993l105l240m061n009
$$ 294798 299039 301978 303773 305394 307245 308584 308731 307871 306316 303971 300978 297873 294633 290572 285563
57755B85563n166m776m486l820k129l01K88nJ98Q83R83O80J172K246K328J141
$$ 285563 280397 275621 271135 267315 265186 264885 265173 265168 265366 266249 267232 267912 269084 271330 273658 274799
57739B74799K40M42P32K70k26Q6P91J079Q93N72K94K91P52J255J117M27j45m43
$$ 274799 275039 275481 276213 276483 276257 276343 277134 278213 279106 279678 279972 280263 281015 282270 283387 283814 283669 283226
57721B83226p40p84q5R50J442J563K171L033K860J335l21j102j266j301j203j177
$$ 283226 282486 281702 281617 282567 284009 285572 287743 290776 293636 294971 294650 293548 292282 290981 289778 288601
57705B88601j793k994l868l885l482l191l049l020l069k804j975j255j473k207
$$ 288601 286808 283814 279946 276061 272579 269388 266339 263319 260250 257446 255471 254216 252743 250536
57691B50536k344j945k115l047l724l711l726m033l807k636j258k20R26K539M194
$$ 250536 248192 246247 244132 241085 237361 233650 229924 225891 222084 219448 218190 217970 218896 221435 225629
57676B25629N677P525J0045J2781J5579J9122K3866K9434L5465M2014M8469N2996
$$ 225629 231306 238831 248876 261657 277236 296358 320224 349658 385123 427137 475606 528602
57664E28602N3572M8744L7499J9944j062k0467l4434m2625m6672m7550m5415m0958
$$ 528602 582174 630918 668417 688361 687299 666832 632398 589773 543101 495551 450136 409178
57652D09178l5518l0134k5220k0887j7027j3497j0583q794p867o698m741k767
$$ 409178 373660 343526 318306 297419 280392 266895 256312 247518 239651 232953 228212 225445
57640B25445j736j569j554j372j118p99l62P3M20O81P29M33R5J21K21l53j617
$$ 225445 223709 222140 220586 219214 218096 217297 216935 217008 217428 218109 218838 219271 219366 219487 219708 219355 217738
57623B17738k708l059k935k655k178j752j990k844l287k559j100J20O05M09j82
$$ 217738 215030 211971 209036 206381 204203 202451 200461 197617 194330 191771 190671 190791 191396 191805 191623
57608A91623p03q17p41q77j023o79p0K7m63q21p76q75j383j859k098k440k959
$$ 191623 190920 190103 189362 188485 187462 186783 186713 186740 186277 185456 184680 183805 182422 180563 178465 176025 173066
57591A73066l279l392l676l860l256k150j744k313k731k322j814j865k023j885
$$ 173066 169787 166395 162719 158859 155603 153453 151709 149396 146665 144343 142529 140664 138641 136756
57577A36756j962k469k505j454j53L13N0l97j141k237k820k168r40k73k52k95
$$ 136756 134794 132325 129820 128366 128213 128526 128576 128179 127038 124801 121981 119813 118873 118600 118348 118053
57561A18053l62o92r13n59m3q2m74m13K15P24O51N7q74j841k260j813j020o35
$$ 118053 117691 116999 116086 115527 115484 115402 114928 114515 114730 115454 116105 116162 115288 113447 111187 109374 108354 107719
57543A07719o50m72J66R19J367J427J380J661K332K720K070O97j95n4M11M17M3
$$ 107719 107069 106597 106763 107682 109049 110476 111856 113517 115849 118569 120639 121336 121141 121087 121498 121915 121958
57526A21958k96n11n14q2N23N83M7k75j3K55L11R31K416L586L306K120J389J445
$$ 121958 121662 121151 120637 120555 121078 121661 121708 121433 121420 121675 121986 122917 125333 128919 132225 134345 135734 137179
57508A37179J700J864J988J807J083J89m61j123k064k785k743k358k358k613k523
$$ 137179 138879 140743 142731 144538 145621 145810 145349 144226 142162 139377 136634 134276 131918 129305 126782
57493A26782k147j987k025j834j431j208j240j316j371j390j164o55k11N1M85
$$ 126782 124635 122648 120623 118789 117358 116150 114910 113594 112223 110833 109669 109014 108803 108854 109339
57478A09339J117J319Q37L33K81J40n75j306j386j224j496j970k116k249k884
$$ 109339 110456 111775 112612 112945 113226 113366 112791 111485 110099 108875 107379 105409 103293 101044 98160
57463I8160l541l384k612k114k052j843j269n67K01R61J192O15m7N3O86J067J088
$$ 98160 94619 91235 88623 86509 84457 82614 81345 80778 80979 81940 83132 83747 83700 83753 84439 85506 86594
57446H6594J052P58j2o21l77K51L94L02Q03J603J569N46m83r54j162j145m99N73
$$ 86594 87646 88404 88392 87771 87394 87645 88039 88341 89144 90747 92316 92862 92379 91425 90263 89118 88619 89192
57428H9192J231J239J188J361J365J017O08J58n55j164r16L1N58J32n01m71P9
$$ 89192 90423 91662 92850 94211 95576 96593 97201 97359 96804 95640 94724 94755 95313 95445 94944 94473 94552
57411I4552M30K50j89l40Q9P10O61k79j222j313r30q41p86k4J023J011l38j716
$$ 94552 94982 95232 95043 94703 94792 95502 96163 95884 94662 93349 92419 91578 90792 90768 91791 92802 92464 90748
57393I0748j963j345p47m49j39N08J476K288K207J099r1l11K87O84M42J8j84j91
$$ 90748 88785 87440 86693 86244 86105 86613 88089 90377 92584 93683 93592 93281 93568 94252 94694 94712 94528 94337
57375I4337J6N05R26Q09L23K2jk7Q3O62J378J442P26j49o94q12m32L20P40K94
$$ 94337 94353 94858 95784 96593 96916 96938 96937 96910 96993 97655 99033 100475 101201 101052 100358 99546 99114 99434 100174 100468
57355A00468m95p74p08r89j379r41L01J241J235O77n3r47j604j332k82N76Q38
$$ 100468 99973 99199 98491 97502 96123 95182 95483 96724 97959 98636 98583 97636 96032 94700 94418 94994 95832
57338I5832J029J410J508J046L08n21j467k098j833j041p20r72r39l74L5P2K86
$$ 95832 96861 98271 99779 100825 101133 100612 99145 97047 95214 94173 93453 92481 91542 91168 91203 91275 91561
57321I1561O33K37r48j673j226m96m56q18r35q74p75k61O11Q74J00o48l65L37
$$ 91561 92194 92431 91483 89810 88584 88088 87632 86814 85879 85005 84230 83969 84580 85454 85554 84906 84541 84878
57303H4878L26j64J8J080K115K442K135J381K95p10j132r97o95l30K14O97O43
$$ 84878 85204 85040 85058 86138 88253 90695 92830 94211 94506 93796 92664 91667 90972 90642 90856 91553 92196
57286I2196M0n10m11L05J040J145N49j25k12K45O72Q06Q79J079J326J654K234
$$ 92196 92236 91726 91315 91620 92660 93805 94354 94229 94017 94262 94934 95740 96619 97698 99024 100678 102912
57269A02912K876L117K926K834L172L611L621L045K184J685K147L304L843K820
$$ 102912 105788 108905 111831 114665 117837 121448 125069 128114 130298 131983 134130 137434 141277 144097
57255A44097J099M98J517K893L356K877J970R69L55P57K065L285L739L748L811
$$ 144097 145196 145694 147211 150104 153460 156337 158307 159276 159631 160388 162453 165738 169477 173225 177036
57240A77036L864L750L607L395K804K057J959K684L263K870J952J570K222L757
$$ 177036 180900 184650 188257 191652 194456 196513 198472 201156 204419 207289 209241 210811 213033 216790
57226B16790N729P328P597O463N171N041O094P301P870P874P938Q649J0071J1602
$$ 216790 222519 229847 237444 243907 249078 254119 260213 267514 275384 283258 291196 299845 309916 321518
57212C21518J2505J2667J2601J2731J3059J3429J3654J3503J2998J2643J2818
$$ 321518 334023 346690 359291 372022 385081 398510 412164 425667 438665 451308 464126
57201D64126J3277J3754J4590J6018J7281J7565J7376J7836J8891J9535J9493
$$ 464126 477403 491157 505747 521765 539046 556611 573987 591823 610714 630249 649742
57190F49742J9208J8429J6552J4391J3688J4559J5258J4933J4748J5503J6118
$$ 649742 668950 687379 703931 718322 732010 746569 761827 776760 791508 807011 823129
57179H23129J5632J4985J5405J6396J6774J6663J7026J7986J8934J9679K0424
$$ 823129 838761 853746 869151 885547 902321 918984 936010 953996 972930 992609 1013033
57168A013033K1032K1321K1566K1923K1980K1492K1045K1194K1680K2085K2549
$$ 1013033 1034065 1055386 1076952 1098875 1120855 1142347 1163392 1184586 1206266 1228351 1250900
57157A250900K3134K3298K2788K2378K2867K3942K4776K5142K5324K5417K5324
$$ 1250900 1274034 1297332 1320120 1342498 1365365 1389307 1414083 1439225 1464549 1489966 1515290
57146A515290K4991K4279K3162K2289K2530K3630K4348K4231K4284K5328K6868
$$ 1515290 1540281 1564560 1587722 1610011 1632541 1656171 1680519 1704750 1729034 1754362 1781230
57135A781230K8126K9157L0176L0740L0355K9203K7714K6178K5086K4998K5717
$$ 1781230 1809356 1838513 1868689 1899429 1929784 1958987 1986701 2012879 2037965 2062963 2088680
57124B088680K6563K7653K9785L2862L5774L8076M0361M2718M4402M5350M6412
$$ 2088680 2115243 2142896 2172681 2205543 2241317 2279393 2319754 2362472 2406874 2452224 2498636
57113B498636M7731M8770N0384N4771O2687P2646Q3636R6522J12004J29430J48875
$$ 2498636 2546367 2595137 2645521 2700292 2762979 2835625 2919261 3015783 3127787 3257217 3406092
57102C406092J72360K01939K38522K83603L40149M10900M97833O03828P32467
$$ 3406092 3578452 3780391 4018913 4302516 4642665 5053565 5551398 6155226 6887693
57093F887693Q85751J064506J270367J502570J751603J999957K229331K422537
$$ 6887693 7773444 8837950 10108317 11610887 13362490 15362447 17591778 20014315
57085B0014315K560704K630226K635852K593774K501665K326343K036804J645612
$$ 20014315 22575019 25205245 27841097 30434871 32936536 35262879 37299683 38945295
57077C8945295J202265P46140K81226k00385o87281j150978j567798j925869k216121
$$ 38945295 40147560 40893700 41174926 40974541 40287260 39136282 37568484 35642615 33426494
57068C3426494k428573k557815k604878k574026k473349k318067k127604j918281
$$ 33426494 30997921 28440106 25835228 23261202 20787853 18469786 16342182 14423901
57060A4423901j701301j486314j282284j094694r25514p76218o48254n40881m51549
$$ 14423901 12722600 11236286 9954002 8859308 7933794 7157576 6509322 5968441 5516892
57051E516892l78583l21078k76336k40188k10393j87755j73487j66833j65197
$$ 5516892 5138309 4817231 4540895 4300707 4090314 3902559 3729072 3562239 3397042
57042C397042j64977j62440j55474j44732j32116j18546j04232r0136p7285o5088
$$ 3397042 3232065 3069625 2914151 2769419 2637303 2518757 2414525 2324389 2247104 2182016
57032B182016n2198l8807k6271j4608k610Q943J5839J3405M92j9760m2142o2019
$$ 2182016 2129818 2091011 2064740 2050132 2047522 2056465 2072304 2085709 2086201 2066441 2024299 1962280
57020A962280p6679q5333q8352q6755q2164p6384p0450o4338n7870n1324m4938
$$ 1962280 1885601 1800268 1711916 1625161 1542997 1466613 1396163 1331825 1273955 1222631 1177693
57009A177693l8560l2360k7160k3518k1012j8963j7288j6140j5406j4986j4923
$$ 1177693 1139133 1106773 1079613 1056095 1035083 1016120 998832 982692 967286 952300 937377
56998I37377j4896j4377j3660j3685j4388j4436j3290j2219j2295j2627j1813
$$ 937377 922481 908104 894444 880759 866371 851935 838645 826426 814131 801504 789691
56987G89691j0092q645p521n783l242q39M23j47l066p998j3321j7420k0220k2474
$$ 789691 779599 770954 763433 757650 754408 753569 753992 753845 750779 742781 729460 712040 691820 669346
56973F69346k4091k4292k3115k1524k0088j8550j6654j4515j2133r303o003k397
$$ 669346 645255 620963 597848 576324 556236 537686 521032 506517 494384 485081 479078 476681
56961D76681J374N009Q091J0805J3919J7350J9352J8024J3187O014k414j1168
$$ 476681 478055 483064 491155 501960 515879 533229 552581 570605 583792 589806 587392 576224
56949E76224j8752k3743k6066k6638k5950k3942k1065j8177j5436j2251q447m609
$$ 576224 557472 533729 507663 481025 455075 431133 410068 391891 376455 364204 355757 351148
56937C51148j111K394O375J0857J5506J9801K3160K5292K6106K4862K0081J1157
$$ 351148 350037 352431 358806 369663 385169 404970 428130 453422 479528 504390 524471 535628
56925E35628k20j1172j9944k6375l0514l2028l1012k8338k4913k1295j8112j5891
$$ 535628 535408 524236 504292 477917 447403 415375 384363 356025 331112 309817 291705 275814
56913B75814j4365j2671j0588q826p907p369o511n271m004k811j585m81J42J94
$$ 275814 261449 248778 238190 229364 221457 214088 207577 202306 198302 195491 193906 193425 193567 193761
56899A93761N8L29J424L335N702Q098J0266J2087J3489J4534J5534J7045J9547
$$ 193761 193819 194148 195572 198907 204609 212707 222973 235060 248549 263083 278617 295662 315209
56886C15209K2950K6164K7440K5542K0621J3765N983j949q999j4154j7270j8903
$$ 315209 338159 364323 391763 417305 437926 451691 457674 455725 446726 432572 415302 396399
56874C96399j9196j7680j4390j0411o838l761n86L183P726J2900J8197K3281K8733
$$ 396399 377203 359523 345133 334722 327884 324123 323537 326720 334446 347346 365543 388824 417557
56861D17557L5560M3622N1084N5539N5075M8426L5471J8189J42j5687k8092l6642
$$ 417557 453117 496739 547823 603362 658437 706863 742334 760523 760665 744978 716886 680244
56849F80244m0826m0800l7840l3121k6809j9087j1032l566L669J1432J9659K7962
$$ 680244 639418 598618 560778 527657 500848 481761 470729 467163 470832 482264 501923 529885
56837E29885L6683M6433N7141O8279P9117Q7628Q9913Q2258O3918L7430O899k3191
$$ 529885 566568 613001 670142 738421 817538 905166 995079 1077337 1141255 1178685 1185584 1162393
56825A162393m8503o6076p5458p8024p5347o8775n9944n0465m1000l1391k1556
$$ 1162393 1113890 1047814 972356 894332 818985 750210 690266 639801 598801 567410 545854
56814E45854j1755k265O678J4905K2760L1120M0418M9942N8145O2846O1003M9949
$$ 545854 534099 531834 538512 553417 576177 607297 647715 697657 755802 818648 879651 929600
56802I29600L0109N750j8001l8136n3363o2449o4837o2051n6704n0230m2915l5455
$$ 929600 959709 965459 947458 909322 855959 793510 728673 666622 609918 559688 516773 481318
56790D81318k8853k2984j6922j0584m745N95O409J3102J9910K5870L0327L2428
$$ 481318 452465 429481 412559 401975 397230 397825 404234 417336 437246 463116 493443 525871
56778E25871L1178K6116J7332N178q978k2206l1631l6656l8688l8861l7249l4082
$$ 525871 557049 583165 600497 605675 596697 574491 542860 506204 467516 428655 391406 357324
56766C57324l0237k6357k2579j9245j6765j4769j2499j0125q554p872p166o020
$$ 357324 327087 300730 278151 258906 242141 227372 214873 204748 196194 188322 181156 175136
56754A75136n006m443l815k850k149k235k741k952k597j879j234j125j610k105
$$ 175136 170130 165687 161872 159022 156873 154638 151897 148945 146348 144469 143235 142110 140500 138395
56740A38395k121j971k128k288j896j278j154j340j051l76k14p19j026o81l08
$$ 138395 136274 134303 132175 129887 127991 126713 125559 124219 123168 122792 122578 121859 120833 120152 119844
56725A19844n28j138j656j799j309r6J270J944J798J401J083P34M37M21M82K80
$$ 119844 119316 118178 116522 114723 113414 113318 114588 116532 118330 119731 120814 121548 121985 122406 122888 123168
56709A23168J84Q82K204L190L287K720J819Q15J18o4j69n49o89j06N08K55l40
$$ 123168 123352 124234 126438 129628 132915 135635 137454 138269 138387 138323 138154 137605 136916 136810 137318 137573 137233
56692A37233p8Q61J197P31N89J210J656J224L64l39p79p56L0J119J641J672J979
$$ 137233 137155 138016 139213 139944 140533 141743 143399 144623 144987 144648 143869 143113 143143 144262 145903 147575 149554
56675A49554K434K066Q69J8L1J65l8j03J21M1l03J7J097J646Q44n25j352j395
$$ 149554 151988 154054 154923 154941 154972 155137 155099 154996 155117 155158 154855 154872 155969 157615 158459 157934 156582 155187
56657A55187p04P75K333K651J541L59P4J42q2k14Po4o99r32q4J058J536J642J953
$$ 155187 154483 155258 157591 160242 161783 162142 162216 162358 162276 162062 162069 162005 161306 160374 160290 161348 162884 164526 166479
56638A66479K033J285J99l38l83n22p62p25l93M3N43Q19L72n58r25m35j61q61
$$ 166479 168512 169797 169996 169658 169275 168753 167991 167266 166873 166916 167459 168278 168650 168092 167167 166732 166571 165710
56620A65710j688j489n78j03m33j066j609j954j968j754j790k143k182j550p35
$$ 165710 164022 162533 161955 161852 161419 160353 158744 156790 154822 153068 151278 149135 146953 145403 144668
56605A44668j59M44J141J220L37o05o16J09Q30J414J970K126J566P62K99O3k36
$$ 144668 144509 144953 146094 147314 147651 147046 146430 146539 147369 148783 150753 152879 154445 155207 155506 155569 155333
56588A55333m07l29m51r27j081m83J48J03j00L83J270J660J460J253J190J030
$$ 155333 154926 154597 154146 153219 152138 151655 151803 151906 151806 152189 153459 155119 156579 157832 159022 160052
56572A60052Q47Q55P82L76J39P25J928K930L377L509L600L863M575N648O475O649
$$ 160052 160899 161754 162536 162912 163051 163776 165704 168634 172011 175520 179120 182983 187558 193206 199681 206330
56556B06330O423O025N102L537K128J746K252K866L090K746J676J84q58r93q34
$$ 206330 212753 218778 223880 227417 229545 231291 233543 236409 239499 242245 243921 244105 243247 242254 241420
56541B41420j070j451j377r90q99j294j996k886l637l564k493j322j033j547k053
$$ 241420 240350 238899 237522 236532 235633 234339 232343 229457 225820 222256 219763 218441 217408 215861 213808
56526B13808k066j626j000o50r70j605j666j043p24j347k192k260j534o42l2n0
$$ 213808 211742 210116 209116 208466 207496 205891 204225 203182 202458 201111 198919 196659 195125 194483 194451 194401
56510A94401r01j978k074j010q1j55m55kQ11J153J203J472J587J015K44O5J80
$$ 194401 193500 191522 189448 188438 188357 188202 187747 187745 188556 189709 190912 192384 193971 194986 195230 195295 195475
56493A95475j66p79q97n17k50k02J7M83R81J373J318L34j181j835r88K44O45N78
$$ 195475 195309 194530 193633 193116 192866 192664 192681 193164 194145 195518 196836 197170 195989 194154 193166 193410 194055 194633
56475A94633Q88J227Q45K00J95N28L27j08J84J023J301Q11L41J59k14q02j082
$$ 194633 195521 196748 197593 197793 197988 198516 198843 198735 198919 199942 201243 202054 202395 202554 202340 201538 200456
56458B00456j030j066j013l38N99P79O5n48l76K50P61R77Q61M56J17K23O53J052
$$ 200456 199426 198360 197347 197009 197608 198387 198452 197904 197528 197778 198539 199516 200377 200833 200950 201173 201826 202878
56440B02878J334J437J016K8q47j113j193j603j899j427n08l7k34o47r18q26j53
$$ 202878 204212 205649 206665 206693 205846 204733 203540 201937 200038 198611 198103 198066 197832 197185 196267 195441 195288
56423A95288P65J022M20%M22Q53N16K51J098K254K112P67j82J9O56J044J179R84
$$ 195288 196053 197075 197495 197495 197917 198770 199286 199537 200635 202889 205001 205768 205586 205605 206261 207305 208484 209468
56405B09468L45j96P7Q96J367J281J069Q50N50N84J340K244K484K287K410K823
$$ 209468 209813 209617 209694 210590 211957 213238 214307 215157 215707 216291 217631 219875 222359 224646 227056 229879
56389B29879K846K309J569Q72O13J456L147M077L259J888J617K169K238J823J841
$$ 229879 232725 235034 236603 237475 238088 239544 242691 246768 250027 251915 253532 255701 257939 259762 261603
56374B61603K103J653O97J63k04j357k772k889j705r27j277j529o54P17J478J403
$$ 261603 263706 265359 266056 266219 266015 264658 261886 258997 257292 256365 255088 253559 252905 253622 255100 256503
56358B56503Q77L32J55L54K69m60j020m87P10J509J781J977J873J166N86Q64J242
$$ 256503 257380 257712 257867 258221 258490 258030 257010 256523 257233 258742 260523 262500 264373 265539 266125 266989 268231
56341B68231O95m4L95J602K059J698J629J814J321N52P76J587J273j91j020o39
$$ 268231 268926 268882 269277 270879 272938 274636 276265 278079 279400 279952 280728 282315 283588 283397 282377 281738
56325B81738l31n06R4J802L073K980K546K644K577J769J058J203J671J776J699
$$ 281738 281407 280901 280995 282797 285870 288850 291396 294040 296617 298386 299444 300647 302318 304094 305793
56310C05793J612J196O19O64J364J838J886K253K994L198K761K792L750M752N186
$$ 305793 307405 308601 309220 309884 311248 313086 314972 317225 320219 323417 326178 328970 332720 337472 342658
56295C42658N438N546M819L387K460K517K742K747L213M277M983M966N060N641
$$ 342658 348096 353642 358461 361848 364308 366825 369567 372314 375527 379804 384787 389753 394813 400454
56281D00454N969N808O052P028P752P605P354P714Q320Q791R519J0669J1628J1999
$$ 400454 406423 412231 418283 425311 433063 440668 448022 455736 464056 472847 482366 493035 504663 516662
56267E16662J2116J2288J2639J3704J5849J8115J9271J9960K2067K5917K9969
$$ 516662 528778 541066 553705 567409 583258 601373 620644 640604 662671 688588 718557
56256G18557L3425L7182M1887M7107N2760N9470O7056P4562Q1965Q9942R7873
$$ 718557 751982 789164 831051 878158 930918 990388 1057444 1132006 1213971 1303913 1401786
56245A401786J04262J09192J14001J18346J20224J19138J16410J11841J03192
$$ 1401786 1506048 1615240 1729241 1847587 1967811 2086949 2203359 2315200 2418392
56236B418392Q9936P4469N8388M0495K0019r74k0214l7780n4255o8566p9598q7984
$$ 2418392 2508328 2582797 2641185 2681680 2701699 2700725 2680511 2642731 2588476 2519910 2440312 2352328
56224B352328r4589r9023j01169j02255j02810j01497r7488r2164q6978q1622
$$ 2352328 2257739 2158716 2057547 1955292 1852482 1750985 1653497 1561333 1474355 1392733
56214A392733p5754p0467o6339o2003n6470n1021m7052m3847m0236l6668l3853
$$ 1392733 1316979 1246512 1180173 1118170 1061700 1010679 963627 919780 879544 842876 809023
56203H09023l1036k7489k4136k1927k0145j7927j5894j4598j3074j0666q633q090
$$ 809023 777987 750498 726362 704435 684290 666363 650469 635871 622797 612131 603498 595408
56191E95408p980o906n443m735m296l213k181k355l162l111j978o73J83L94j20
$$ 595408 587428 580522 575079 570344 566048 562835 560654 558299 555137 552026 550048 549375 549558 549952 549832
56176E49832p53m94M26O63J48N04K194L439L083K365K593L181L441M038N192N743
$$ 549832 549079 548585 549011 549674 549822 550326 552520 555959 559042 561407 564000 567181 570622 574660 579852 585595
56160E85595N534O356Q812J0703J0485R849J0778J2376J3086J3729J5785J8562
$$ 585595 591129 597485 606297 617000 627485 637334 648112 660488 673574 687303 703088 721650
56148G21650K0666K2682K5969L0373L5318M1591M9841N8953O7864P7227Q7180
$$ 721650 742316 764998 790967 821340 856658 898249 948090 1007043 1074907 1152134 1239314
56137A239314R5306R9009R8133R3377Q4338P1607N8723M9302M3656M0236L8332
$$ 1239314 1334620 1433629 1531762 1625139 1709477 1781084 1839807 1889109 1932765 1973001 2011333
56126B011333L6955L3330K5577J5467O068j763q454j3481j6865k1059k8486l8607
$$ 2011333 2048288 2081618 2107195 2122662 2128730 2126967 2118513 2105032 2088167 2067108 2038622 2000015
56114B000015m9663o1422p3617q3759q9388r0972q9988q5988p8208o8290n8623
$$ 2000015 1950352 1888930 1815313 1731554 1642166 1551194 1461206 1375218 1297010 1228720 1170097
56103A170097m9572m0752l3159k7537k2599j7381j3307j1377r734o722l895l044
$$ 1170097 1120525 1079773 1046614 1019077 996478 979097 965790 954413 944679 937957 934062 931018
56091I31018k776j185N97Q95J005K639M352M197L633M983P143P703P220P529P939
$$ 931018 928242 927057 927654 928549 929554 932193 936545 940742 944375 949358 956501 964204 971424 978953 986892
56076I86892O996O082P198R152R811J0115J1884J3759J3520J2406J2886J4162
$$ 986892 993888 999970 1007168 1016320 1026131 1036246 1048130 1061889 1075409 1087815 1100701 1114863
56064A114863J4060J3449J4358J5794J5772J5497J6997J8707J8024J6265J6366
$$ 1114863 1128923 1142372 1156730 1172524 1188296 1203793 1220790 1239497 1257521 1273786 1290152
56053A290152J7590J7332J6200J6470J7428J7062J6474J7662J9054J8307J7330
$$ 1290152 1307742 1325074 1341274 1357744 1375172 1392234 1408708 1426370 1445424 1463731 1481061
56042A481061J9241K2534K3705K3488K4800K6708K6319K4743K5199K7000K7402
$$ 1481061 1500302 1522836 1546541 1570029 1594829 1621537 1647856 1672599 1697798 1724798 1752200
56031A752200K7380K9617L2683L3465L3299L5441L8545L9179L8579M0177M2673
$$ 1752200 1779580 1809197 1841880 1875345 1908644 1944085 1982630 2021809 2060388 2100565 2143238
56020B143238M2716M2118M5021M9939N2283N2744N5417N9558O1414O2308O6547
$$ 2143238 2185954 2228072 2273093 2323032 2375315 2428059 2483476 2543034 2604448 2666756 2733303
56009B733303P3006P7127P9601Q4533R0789R4100R5930J01134J08543J13197J16097
$$ 2733303 2806309 2883436 2963037 3047570 3138359 3232459 3328389 3429523 3538066 3651263 3767360
55998C767360J22143J30263J35611J39619J47519J57882J65315J71342J81460
$$ 3767360 3889503 4019766 4155377 4294996 4442515 4600397 4765712 4937054 5118514
55989E118514J93808K02769K11287K26780K47235K64848K81149L04123L32558
$$ 5118514 5312322 5515091 5726378 5953158 6200393 6465241 6746390 7050513 7383071
55980G383071L58648L84183M17999M58804M97569N35668N83004O39418O96810
$$ 7383071 7741719 8125902 8543901 9002705 9500274 10035942 10618946 11258364 11955174
55971A1955174P58587Q36981R32052J034678J149778J294093J471951J678052
$$ 11955174 12713761 13550742 14482794 15517472 16667250 17961343 19433294 21111346
55963B1111346J923610K232974K615052L067798L611681M288502N130417O167164
$$ 21111346 23034956 25267930 27882982 30950780 34562461 38850963 43981380 50148544
55955E0148544P459049R074761J1036285J3341016J6040839J9230536K2938606
$$ 50148544 57607593 66682354 77718639 91059655 107100494 126331030 149269636
55948A49269636K7071830L1393898L5324487L7646388L6663187L1082743K1002933
$$ 149269636 176341466 207735364 243059851 280706239 317369426 348452169 369455102
55941C69455102Q055385n417668j7351294k6415151l2018442l4241930l3737474
$$ 369455102 377510487 372092819 354741525 328326374 296307932 262066002 228328528
55934B28328528l1442691k8213523k4643908k1110387j7849860j4975740j2504750
$$ 228328528 196885837 168672314 144028406 122918019 105068159 90092419 77587669
55927G7587669j0420405q701018p299394o145576n186087m395724l749440l212365
$$ 77587669 67167264 58466246 51166852 45021276 39835189 35439465 31690025 28477660
55919B8477660k761745k391553k089933j834725j614502j432086j283653j154452
$$ 28477660 25715915 23324362 21234429 19399704 17785202 16353116 15069463 13915011
55911A3915011j037864r39128q57040p80382p05602o40610n87408n37368m87060
$$ 13915011 12877147 11938019 11080979 10300597 9594995 8954385 8366977 7829609 7342549
55902G342549m43233m08284l75266l41199l11775k89045k67057k43410k23386
$$ 7342549 6899316 6491032 6115766 5774567 5462792 5173747 4906690 4663280 4439894
55893D439894k09062j95365j79990j66815j56676j45011j31114j19931j12417
$$ 4439894 4230832 4035467 3855477 3688662 3531986 3386975 3255861 3135930 3023513
55884C023513j03886r4031q8598q8812q8756q5782q3998q4792q3336p7695p2625
$$ 3023513 2919627 2825596 2736998 2648186 2559430 2473648 2389650 2304858 2221522 2143827 2071202
55873B071202p0970o9404o5791o2979o2185o0098n5520n1827n0170m7167m1961
$$ 2071202 2000232 1930828 1865037 1802058 1739873 1679775 1624255 1572428 1522258 1475091 1433130
55862A433130l8537l8471l8193l6021l5047l6326l6060l2520k9323k8823k8363
$$ 1433130 1394593 1356122 1317929 1281908 1246861 1210535 1174475 1141955 1112632 1083809 1055446
55851A055446k6101k4534k5069k4911k2554k0956k2003k2968k1583j9816j9577
$$ 1055446 1029345 1004811 979742 954831 932277 911321 889318 866350 844767 824951 805374
55840H05374j9319j7797j6807j7358j7307j5398j3681j3619j3630j2570j1680
$$ 805374 786055 768258 751451 734093 716786 701388 687707 674088 660458 647888 636208
55829F36208j1359j0005p829p428q963r221p189n992p292q572q147q170j0120
$$ 636208 624849 614844 607015 599587 590624 581403 574214 568222 560930 552358 544211 536041 525921
55816E25921j1817j1551j0960j1177j0311p507n463n986o796n594l662k568r96
$$ 525921 514104 502553 491593 480416 470105 462598 457135 451149 444353 438759 435097 432529 431533
55803D31533K148M790N008M403N235O829P477P358P013N574K808N07m11j628m225
$$ 431533 433681 438471 443479 447882 453117 459946 467423 474781 481794 487368 490176 490683 490272 488644 484419
55788D84419o405o485n538m974m251l120l383o005q900r909r666r503q835o780
$$ 484419 478014 471529 465991 461017 456766 453646 450263 444258 435358 425449 415783 406280 397445 390665
55774C90665m070j285K575P774J2297J4415J4575J3064Q447M19q150j4137j7185
$$ 390665 386595 385310 387885 395659 407956 422371 436946 450010 458457 458876 450726 436589 419404
55761D19404j8187j7223j4815j2791j1862j0516q032o214o282o684n996n423o200
$$ 419404 401217 383994 369179 356388 344526 334010 325978 319764 313482 306798 300802 295379 289179
55748B89179o955o111m674m226m306m025m153n196n445l541j088k94p06p20n85
$$ 289179 282224 276113 271439 267213 262907 258882 254729 249533 244088 240547 239459 239165 238459 237739 237154
55733B37154j405k707l378l708m328m468l426k372k567l223l114k829l320l679
$$ 237154 235749 233042 229664 225956 221628 217160 213734 211362 208795 205572 202458 199629 196309 192630
55719A92630k623q56K10Q51K020L192L367L164L851N165N950O003N606M323J995
$$ 192630 190007 189151 189361 190212 192232 195424 198791 201955 205806 210971 216921 222924 228530 232853 234848
55704B34848j61j124j639k641l557l810m465o360q036p691o042n076n009m578
$$ 234848 234687 233563 231924 229283 225726 221916 217451 211091 203055 195364 189322 184246 179237 174659
55690A74659l529k665k108j415q80r97j238q15KO94J604K967L871L738L592M321
$$ 174659 171130 168465 166357 164942 164062 163065 161827 161012 161014 161708 163312 166279 170150 173888 177480 181801
55674A81801M896L991K183P74l58j803k755k203j070r70j640j609q07l89m65l0
$$ 181801 186697 190688 192871 193645 193287 191484 188729 186526 185456 184486 182846 181237 180430 180041 179576 179546
55658A79546J020J670J463R95Q49J232K262L522L907L002J922J711J780J123Q
$$ 179546 180566 182236 183699 184694 185543 186775 189037 192559 196466 199468 201390 203101 204881 206004 206012
55643B06012q39j723l142m426m734m573m836n239n186n138n608n798m914l902
$$ 206012 205173 203450 200308 195882 191148 186575 181739 176500 171314 166176 160568 154770 149856 145954
55629A45954m045m669m166k602j401r75n25J31L04j62p12j087j392j433j166j158
$$ 145954 141909 137240 133074 130472 129071 128096 127571 127702 128006 127844 127132 126045 124653 123220 122054 120896
55613A20896j682k000j630j272j454j395n91k29j393l004l321k474j671r85J53
$$ 120896 119214 117214 115584 114312 112858 111463 110872 110643 109250 106246 102925 100451 98780 97795 97948
55598I7948J146R65M6m14m20o29o72J8N52j64j243j060m6L9q18r38J55J131J231
$$ 97948 99094 100059 100105 99691 99271 98642 97970 97988 98540 98376 97133 96073 96027 96066 95248 94310 94465 95596 96827
55579I6827J119J307J526J814K497L120K977K607L084M081M347L868L740M114
$$ 96827 97946 99253 100779 102593 105090 108210 111187 113794 116878 120959 125306 129174 132914 137028
55565A37028M075L399K648J691p5k108l233l607m321n235n145m051l216l009k669
$$ 137028 141103 144502 147150 148841 148766 146658 143425 139818 135497 130262 125117 121066 117850 114841 112172
55550A12172k258k687l684l801k762j857j610j139k05J10n73j079o00K52Q82J615
$$ 112172 109914 107227 103543 99742 96980 95123 93513 92374 92169 92279 91706 90627 90027 90279 91161 92776
55534I2776K495K748K133J438J078O11l5k80k77r33k151k662k161j926k641l265
$$ 92776 95271 98019 100152 101590 102668 103279 103244 102964 102687 101754 99603 96941 94780 92854 90213 86948
55518H6948k877k088j771j808k022k860m239m949m299l152k446j826p07M18Q48
$$ 86948 84071 81983 80212 78404 76382 73522 69283 64334 60035 56883 54437 52611 51904 52322 53170
55503E3170Q63R97R20J83o36n60L44J115J171P66M28M63Q45J258J456J610J986
$$ 53170 54033 55030 55950 56133 55497 54937 55281 56396 57567 58333 58761 59224 60069 61327 62783 64393 66379
55486F6379K300J940Q24m78j416j671j004L25J167N87q03j489r88q4O08J171J476
$$ 66379 68679 70619 71443 70965 69549 67878 66874 67199 68366 68953 68150 66661 65673 65589 66197 67368 68844
55469F8844J076J90l59l37k34k01K7J51m02j186j087j58L50m6m62l40k36m46l72
$$ 68844 69920 70110 69751 69414 69180 68979 69006 69157 68755 67569 66482 66324 66674 66628 66166 65826 65590 65144 64772
55450F4772J71M42J59R7N96Q22K21m80n45l20k73m6O34J107P52m6n83p76p43l30
$$ 64772 64943 65385 65544 65641 66237 67059 67280 66800 66255 65935 65662 65616 66250 67357 68109 68063 67480 66704 65961 65631
55430F5631L45O95N86O10R41R09K70j48K73R80J259J240J198Q72K77K40J204K371
$$ 65631 65976 66671 67257 67867 68808 69717 69987 69839 70112 71092 72351 73591 74789 75661 75938 76178 77382 79753
55412G9753K807K656K382J740M17r78j643j748j995k430k556k218j643r40j89
$$ 79753 82560 85216 87598 89338 89755 88777 87134 85386 83391 80961 78405 76187 74544 73604 73415
55397G3415L25M27K82l5o13j144r50q2M58M8o64p99m34j47p2o4j77l81l35J1J99
$$ 73415 73740 74167 74449 74414 73801 72657 71707 71625 72083 72131 71467 70668 70234 70087 70015 69951 69774 69393 69058 69069 69268
55376F9268L0p4P9J7m38o35r9O68J049J143J126O29m19j119p34J47M80K67K00
$$ 69268 69298 69224 69303 69320 68882 68247 68148 68816 69865 71008 72134 72763 72344 71225 70491 70638 71118 71385 71585
55357G1585L31J15m51p00l24J74J84l15p95o89j7M68J40n27m35N91J483J406P64
$$ 71585 71916 72031 71580 70880 70556 70730 70914 70599 69804 69115 69098 69566 69706 69179 68744 69335 70818 72224 72988
55338G2988L68L76N11O21N74K32n0L10J039J028o1j180j404j143j085r41j05J102
$$ 72988 73356 73732 74243 74864 75438 75670 75620 75930 76969 77997 77936 76756 75352 74209 73124 72183 72078 73180
55320G3180J818J670P37q55k533l100j981j22J063J209P65k9j042j643j278l93
$$ 73180 74998 76668 77405 76550 74017 70917 68936 68814 69877 71086 71851 71822 70780 69137 67859 67466
55304F7466Q4j2r8J17L19K28m6k37j47K25N49M38L3j25Q4K87L80N95O74N5r16
$$ 67466 67550 67538 67440 67557 67876 68104 68058 67821 67674 67899 68448 68886 68919 68794 68878 69165 69545 70140 70814 70869 69953
55283F9953j072k38L25j13o36m25j83o91j143m72O57Q04N0l03J47O33Q11J082
$$ 69953 68881 68643 68968 68855 68219 67794 67611 66920 65777 65305 65962 66766 66816 66513 66660 67293 68104 69186
55265F9186J368J085M23L49J096J731J511P55Q1l46n90o26n34m85m31j55K93O08
$$ 69186 70554 71639 72062 72411 73507 75238 76749 77504 77585 77239 76649 76023 75489 75004 74573 74418 74711 75319
55247G5319N63J06o46j304j362q82m68l29M4Q03J179O58oJ20O73O06k35j046j237
$$ 75319 75882 75988 75342 74038 72676 71794 71326 70997 71041 71844 73023 73681 73675 73795 74468 75074 74839 73793 72556
55228G2556p64K56J387J737R38p3j81L64N16L7m36o36q22r44p11l36k65l18k9
$$ 72556 71792 72048 73435 75172 76110 76037 75856 76220 76736 76773 76337 75701 74879 73935 73224 72888 72623 72305 72276
55209G2276K99k5q65j353j150o82k55J62M07L55M59J114J686J248J29m07K0N34
$$ 72276 72575 72550 71685 70332 69182 68500 68245 68407 68814 69169 69628 70742 72428 73676 73805 73398 73418 73952
55191G3952M68J18j53m32p12o95m07k20j75OK53K80L18Q38J609J942J767J567
$$ 73952 74420 74538 74385 73953 73241 72546 72139 71919 71744 71750 72003 72283 72601 73439 75048 76990 78757 80324
55173H0324J350P63J21J25N62M89j41k96M07J030P89J11k73l26k74m3L52N71N28
$$ 80324 81674 82437 82558 82683 83245 83734 83593 83297 83704 84734 85523 85634 85361 85035 84761 84718 85070 85641 86169
55154H6169M92M01j45r54j233q22n23q47j288j309j134j072r11n03j84j16P2M98
$$ 86169 86661 87062 86917 85963 84730 83908 83385 82538 81250 79941 78807 77735 76824 76321 76137 76021 76093 76591
55136G6591O23J89k16r7J71J08o0L5J35j23m72m66k08KK40N95P09L53K0K41O19
$$ 76591 77214 77403 77187 77090 77261 77369 77309 77344 77479 77356 76884 76418 76210 76212 76452 77047 77756 78109 78129 78370 78989
55115G8989L98l10o03r2N88P17L27l8r4pJQL02Q95J385J386J033Q10R22J141J142
$$ 78989 79387 79077 78474 78382 78970 79687 80014 79976 79882 79875 79876 79884 80186 81081 82466 83852 84885 85695 86617 87758 88900
55094H8900Q17K56k28k62J24L79J58j31K6L81L94K57N78J187J174K86o59r19o58
$$ 88900 89717 89973 89745 89483 89607 89986 90144 90013 90039 90420 90814 91071 91649 92836 94010 94296 93637 92718 92060
55075I2060l17PK55J26m60j088j349j183o43J23O28M40j35m01l34n10r32r44m71
$$ 92060 91743 91750 92005 92131 91671 90583 89234 88051 87408 87531 88159 88599 88464 88063 87729 87219 86287 85343 84872
55056H4872k73o42q43l62L05O36Q84J230J174N31J67P06J356J020j1o42o80p91
$$ 84872 84599 83957 83114 82752 83057 83693 84577 85807 86981 87512 87679 88385 89741 90761 90750 90108 89428 88637
55038H8637j028p41J20P36O76M72O18P77M27k50o27m71j73j67m06m43j6N70P73
$$ 88637 87609 86868 86988 87724 88400 88872 89490 90267 90694 90444 89817 89346 89173 89006 88600 88157 88141 88711 89484
55019H9484M65M5j21n7M7Q5L8K0L10R32J294Q40j7k88J61M48J56l9L11M65k68
$$ 89484 89949 89994 89873 89816 89863 89948 89986 90006 90316 91248 92542 93382 93365 93077 93238 93686 93842 93803 94114 94579 94311
54998I4311j145r49J60Q33L87m76p75l28M17Q99Q14L32M3K82O77P88Q37J226J568
$$ 94311 93166 92217 92377 93210 93597 93121 92346 92018 92435 93334 94148 94480 94523 94805 95482 96270 97107 98333 99901
54979I9901J046k90j313j166j85P15J033Q50M91L28N82J029J160Q11L97L13L96
$$ 99901 100947 100657 99344 98178 97993 98708 99741 100591 101082 101410 101992 103021 104181 104992 105389 105702 106098
54962A06098K56p9k47k04l39q13j132p31J45O11K36m30p18p06q84j214j217p70
$$ 106098 106354 106275 106028 105824 105485 104672 103540 102809 102954 103565 103801 103371 102653 101947 101063 99849 98632 97862
54944I7862k75L2L34P10R11Q30O77N82M37K64K28J71k37p63o33L32J285J445J084
$$ 97862 97587 97619 97953 98663 99574 100404 101081 101663 102100 102364 102592 102763 102526 101763 101130 101462 102747 104192 105276
54925A05276R85J390J962K419K709K914L330M270N487O177N948N232M409L149
$$ 105276 106261 107651 109613 112032 114741 117655 120985 125255 130742 136919 142867 148099 152508 155657
54911A55657J195q00k012k575l219m104m721m791m488l990l412l068l090k948
$$ 155657 156852 156052 154040 151465 148246 144142 139421 134630 130142 126152 122740 119672 116582 113634
54897A13634k123j059p19j211j681j573j183q16k37O49J317J303Q71N23K69l2
$$ 113634 111511 110452 109733 108522 106841 105268 104085 103269 103032 103681 104998 106301 107172 107695 107964 107932
54881A07932L5J104K990M579N015M640M432M782N189N116M660M166L556K460Q09
$$ 107932 107967 109071 112061 116640 121655 126295 130727 135509 140698 145814 150474 154640 158196 160656 161465
54866A61465j054k718l833m097l685l450m054m938m935l933l027k806k547j635
$$ 161465 160411 157693 153860 149763 146078 142628 138574 133636 128701 124768 121741 118935 116388 114753
54852A14753p94r82j802k063j483q46o75p58q87j175j516j470q97k14J13n2n27
$$ 114753 113959 112977 111175 109112 107629 106783 106108 105350 104463 103288 101772 100302 99405 99191 99304 99252 98725
54835I8725q64n33M45J248J175N53J15j47o93j185p13N98J300M65j000j522p51
$$ 98725 97861 97328 97773 99021 100196 100749 100864 100717 100024 98839 98126 98724 100024 100489 99489 97967 97216
54818I7216L57Q73O94K18j47j28L14Q88J226J247J120R14M67k72r33r59k77M14
$$ 97216 97573 98446 99140 99358 99211 99083 99397 100285 101511 102758 103878 104792 105259 104987 104054 103095 102818 103232
54800A03232L41l87q95o61j12J43J64L35O20P64R00J341J826J709R30J32k05k27
$$ 103232 103573 103186 102291 101630 101518 101661 101825 102160 102780 103544 104444 105785 107611 109320 110250 110382 110177 109950
54782A09950k23k06j58j35K9N66J212J310P80M03P80J543K033K351L108M388N528
$$ 109950 109727 109521 109363 109228 109257 109823 111035 112345 113125 113528 114308 115851 117884 120235 123343 127731 133259
54765A33259N913N598N102M865M950N046M747L917K725J252o67k973m998o012
$$ 133259 139172 144770 149872 154737 159687 164733 169480 173397 176122 177374 176707 173734 168736 162724
54751A62724o055n845n778n463m484l231k542k647k932k769k190j609j211r12
$$ 162724 156669 150824 145046 139583 135099 131868 129326 126679 123747 120978 118788 117179 115968 115056
54737A15056o55m52k28M7K14J77J79N06R93J238J260J461J927K303K456K774L550
$$ 115056 114401 113949 113721 113768 113982 114159 114338 114844 115837 117075 118335 119796 121723 124026 126482 129256 132806
54720A32806M479N035M997M433L543K729K333J979P43j601l994n229n296n013
$$ 132806 137285 142320 147317 151750 155293 158022 160355 162334 163077 161476 157482 152253 146957 141944
54706A41944m749m232l387k642k309k268k330k459k536k306j692r02j73L57O28
$$ 141944 137195 132963 129576 126934 124625 122357 120027 117568 115032 112726 111034 110132 109959 110316 110944
54691A10944O54N77N12M48L76K82k9p78j651j935j435q08n85n00j92lk56m16J64
$$ 110944 111598 112175 112687 113135 113511 113793 113764 112986 111335 109400 107965 107157 106572 106072 105880 105877 105621 105205 105369
54672A05369R81J024L76J03N41Q50N18J12J74L45J69k9J74L67j92j422k402k408
$$ 105369 106350 107374 107750 107853 108394 109244 109762 109874 110048 110393 110562 110533 110707 111074 110882 109460 107058 104650
54654A04650j538m17L64O63Q21J174J505J217J78r45j405j091m11K13N06L32j27
$$ 104650 103112 102695 103059 103722 104543 105717 107222 108439 108617 107672 106267 105176 104765 104978 105484 105816 105689
54637A05689l94j49M13P86O23j7o57o86M4Q33P77j08q43p15j36M4k83m76p7O39
$$ 105689 105295 105146 105559 106345 106968 106951 106294 105608 105652 106485 107262 107154 106311 105596 105460 105504 105221 104745 104668 105307
54617A05307J092J041O92L70K32K62M61Q19J076P54k77j379j652q95J76P06M57
$$ 105307 106399 107440 108132 108502 108734 108996 109457 110276 111352 112106 111829 110450 108798 107903 108079 108785 109242
54600A09242k08q04j072j030q05m55K3M80O56N92P11J234J747J706J159N87J95
$$ 109242 109034 108230 107158 106128 105323 104868 104891 105371 106027 106619 107330 108564 110311 112017 113176 113763 113958
54583A13958j17l01j70J38K48O8j94m78q55j106r10m95m88r07r41q6R93J183L64
$$ 113958 113841 113540 113370 113508 113756 113824 113630 113152 112297 111191 110281 109786 109298 108391 107450 107364 108357 109540 109904
54564A09904l37K16J823L013K544P87o91r47n28l47l57n9L55K86r9n0N04Q61P55
$$ 109904 109567 109783 111606 114619 117163 117950 117259 116312 115784 115437 115080 115021 115376 115662 115563 115513 116017 116878 117633
54545A17633O65P72O00N8j34M68J351J846J965J859J237m8j390k064k059j765
$$ 117633 118298 119070 119670 119728 119594 120062 121413 123259 125224 127083 128320 128272 126882 124818 122759 120994
54529A20994j270n11K37N68M15o6p59j428j651j288p13k61J31M53L05m62j186
$$ 120994 119724 119213 119450 120018 120433 120367 119608 118180 116529 115241 114528 114267 114398 114851 115156 114694 113508
54512A13508j079j89P38J082P15j35r43j094m68L54P88Q89R86J011O42r0p78j093
$$ 113508 112429 112240 112978 114060 114775 114640 113697 112603 112135 112489 113277 114166 115152 116163 116805 116715 115937 114844
54494A14844j000o97m91n25m92P5J094J881J932J349M30n84j194q32K46R77Q50
$$ 114844 113844 113147 112656 112131 111639 111714 112808 114689 116621 117970 118400 117816 116622 115790 116036 117013 117863
54477A17863N92R57J542J511Q88L41J17L7J32N53J032J161J027R34Q04M71K76
$$ 117863 118455 119412 120954 122465 123353 123694 123811 123848 123980 124533 125565 126726 127753 128687 129491 129962 130238
54460A30238N89J023R12L54j0m9j86m48l83K8J74k98j063j635j750j192mJ029
$$ 130238 130827 131850 132762 133116 133106 133057 132871 132423 132040 132068 132242 131944 130881 129246 127496 126304 126300 127329
54442A27329R21k61j247j032RP70P21K26j40j97k15m88q60q20k30L05K05k09j49
$$ 127329 128250 127989 126742 125710 125719 126489 127210 127436 127296 127099 126884 126396 125536 124716 124486 124791 124996 124787 124638
54423A24638M93J048J086R16Q60P34K92k80o56p62o62l68NJ73K5j99j68J93P07
$$ 124638 125131 126179 127265 128181 129041 129775 130067 129787 129131 128369 127707 127339 127344 127517 127542 127343 127175 127368 128075
54404A28075J076J076P90O80J056J557J523Q96L78N59J211J659J534J031N31K04
$$ 128075 129151 130227 131017 131697 132753 134310 135833 136729 137107 137666 138877 140536 142070 143101 143632 143836
54388A43836q1n03r96j275j198q99n12l3L89M38J69J42O36J090Q95L58K56O88
$$ 143836 143755 143252 142256 140981 139783 138884 138372 138339 138728 139166 139335 139477 140113 141203 142098 142456 142712 143400
54370A43400J101J243J331J398J273J260J908K997L552L179K579K422K416J967
$$ 143400 144501 145744 147075 148473 149746 151006 152914 155911 159463 162642 165221 167643 170059 172026
54356A72026J139L71k26p54j099j213j484k286l308l891l869l603l279k719j919
$$ 172026 173165 173536 173310 172556 171457 170244 168760 166474 163166 159275 155406 151803 148524 145805 143886
54341A43886j245r19o71j98K35M1q25j586j461n68K83O08O11N65L87N0o2K49N30
$$ 143886 142641 141722 141051 140853 141088 141129 140304 138718 137257 136689 136972 137580 138191 138756 139143 139193 139131 139380 139910
54322A39910K93k20m63m56n32n32n1O08O74Q6l83l68l83p80j084q19k54J67M79
$$ 139910 140203 139983 139520 139064 138532 138000 137949 138557 139231 139317 138934 138566 138183 137403 136319 135500 135246 135413 135892
54303A35892P71P33K03k47j9N91O98o8j223j978j769n90P88J248M51o90j090o82
$$ 135892 136663 137396 137599 137352 137333 137924 138622 138554 137331 135353 133584 132994 133782 135030 135481 134791 133701 133019
54285A33019j33K43N96Q59P21K36j67l29m08k90L99J471K022J468L73k01Q1N81
$$ 133019 132886 133129 133725 134584 135305 135541 135374 135045 134637 134347 134746 136217 138239 139707 140080 139879 139960 140541
54267A40541N66l6p24j006p82k78K51P06J084J319J270Q43J89k43k5P18J281J150
$$ 140541 141107 141071 140347 139341 138559 138281 138532 139238 140322 141641 142911 143754 143943 143700 143675 144393 145674 146824
54249A46824P14P82J394J596O73r17k106k378j932j103j53N73Q79J035J343J431
$$ 146824 147538 148320 149714 151310 151983 151066 148960 146582 144650 143547 143394 143967 144846 145881 147224 148655
54233A48655O31q63j861j599p37m03o36m20P85K242K810K192R91j30r55j526j953
$$ 148655 149286 148423 146562 144963 144226 143823 143187 142767 143552 145794 148604 150796 151787 151657 150702 149176 147223
54216A47223k367k807l010k642j856j322j460j880j877j322o93l47q1N05J483
$$ 147223 144856 142049 139039 136397 134541 133219 131759 129879 128002 126680 125987 125640 125559 126064 127547
54201A27547K532L112K741J407k22j237j327r73p52o81m04J61O40O12P3n48p47
$$ 127547 130079 133191 135932 137339 137117 135880 134553 133580 132828 132147 131743 131904 132544 133156 133229 132681 131934
54184A31934l93K47Q81J446J895J964J453O24J1j69p6J41M68P54Q03P37Q24Q76
$$ 131934 131541 131788 132669 134115 136010 137974 139427 140051 140062 139893 139817 139958 140426 141180 141983 142720 143544 144420
54166A44420L92n57j192j053n78k58J42R54J686J522N69j92j86J70K45m3l84m94
$$ 144420 144812 144255 143063 142010 141432 141174 141316 142270 143956 145478 146047 145855 145669 145839 146084 146041 145657 145163
54148A45163k23L66P95N28k64o51K5J320K175K012J057j34j069j412j137o87n83
$$ 145163 144940 145306 146101 146629 146365 145714 145739 147059 149234 151246 152303 152169 151100 149688 148551 147864 147281
54131A47281q06p92k20M74O04J13l72l04J87N35M33R5JM13J133J641J545Q86P8
$$ 147281 146475 145683 145463 145937 146541 146654 146282 145978 146165 146700 147133 147228 147229 147642 148775 150416 151961 152847 152925
54112A52925m64n22r6N85J076J028O36M88Q50J309J349J021Q11R88J435K069L060
$$ 152925 152461 151939 151843 152428 153504 154532 155168 155656 156506 157815 159164 160185 160996 161984 163419 165488 168548
54095A68548M575O401P871Q149O819M414K123O60m57k134m395o216o677n835m457
$$ 168548 173123 179524 187395 195544 202363 206777 208900 209560 209103 206969 202574 196358 189681 183846 179389
54080A79389l260k537k184j873j415r06m23K69J322K271K436J914J573J928K527
$$ 179389 176129 173592 171408 169535 168120 167214 166791 167060 168382 170653 173089 175003 176576 178504 181031
54065A81031K678K373K092K070K111J955J515Q51J64l76q42j444k092k349j953
$$ 181031 183709 186082 188174 190244 192355 194310 195825 196676 196840 196464 195622 194178 192086 189737 187784
54050A87784j161m02J96P70J457K298L186L777L732L187K757K960L769M791N600
$$ 187784 186623 186221 186417 187187 188644 190942 194128 197905 201637 204824 207581 210541 214310 219101 224701
54035B24701N928N842N798O117O424O050N060M236L936L604K786J861J355J135
$$ 224701 230629 236471 242269 248386 254810 260860 265920 270156 274092 277696 280482 282343 283698 284833
54021B84833Q40O29P50P87J55q94j482j288r58j222k219l621n034o138o754o873
$$ 284833 285673 286302 287052 287839 287994 287100 285618 284330 283372 282150 279931 276310 271276 265138 258384 251511
54005B51511o526n735m806m287m346m428l950l114k582k555k666k593k323j972
$$ 251511 244985 239250 234444 230157 225811 221383 217433 214319 211737 209182 206516 203923 201600 199628
53991A99628j800k143k874l131k261q19Oj11l89j75L60Q16J071R68K38q76j515
$$ 199628 197828 195685 192811 189680 187419 186600 186606 186495 186106 185931 186291 187107 188178 189146 189384 188508 186993
53974A86993j175l62J21J56K02M70O82N92L58M52J224K512L681M279M602N315
$$ 186993 185818 185456 185577 185733 185935 186405 187087 187679 188037 188489 189713 192225 195906 200185 204787 210102
53958B10102O548P849R023J0443J2229J3648J3833J2684J0563P431K999k230o745
$$ 210102 216650 224499 233522 243965 256194 269842 283675 296359 306922 314353 317352 315122 308377
53945C08377r171r407q430p209o096n038l967k832j536r7J164J891K109K174K286
$$ 308377 299206 289799 281369 274160 268064 263026 259059 256227 254691 254594 255758 257649 259758 261932 264218
53930B64218K325K276K459L092L841M127L827L448L633M538N673O262O020N578
$$ 264218 266543 268819 271278 274370 278211 282338 286165 289613 293246 297784 303457 309719 315739 321317
53916C21317N797O621P140O955O807P394Q221Q294P489O318M823K734N79n85p00
$$ 321317 327114 333735 340875 347830 354637 362031 370252 378546 386035 392353 397176 399910 400489 399904 399204
53901C99204q63j710k640l043l256l732m133m103m191n107o542p562p914q092
$$ 399204 398341 396631 393991 390948 387692 383960 379827 375724 371533 366426 359884 352322 344408 336316
53887C36316q380q571q578q548q377p780o808n881n194m594m042l709l615l605
$$ 336316 327936 319365 310787 302239 293862 286082 279274 273393 268199 263605 259563 255854 252239 248634
53873B48634l709m053m439m442l967l293k573j830j410j814k809l433l159k579
$$ 248634 244925 240872 236433 231991 228024 224731 222158 220328 218918 217104 214295 210862 207703 205124
53859B05124k404k393j833p65oo8p29j617k592l326l157j869l06L48j10o88l71
$$ 205124 202720 200327 198494 197729 197723 197655 196926 195309 192717 189391 186234 184365 184059 184407 184297 183609 183238
53842A83238P15J475J061j97j119r24j0O26O18N20Q16J117P85K4k71K71R98J192
$$ 183238 183953 185428 186489 186292 185173 184249 184239 184865 185483 186003 186819 187936 188721 188745 188474 188745 189743 190935
53824A90935R37P40P03N67L00J93M21Q93J438J864J943J695J499J591J635J298
$$ 190935 191872 192612 193315 193882 194182 194375 194796 195689 197127 198991 200934 202629 204128 205719 207354 208652
53808B08652J052J701L100M109M068L661L854M620N285N641O016O438O475N921
$$ 208652 209704 211405 214505 218614 222682 226343 230197 234817 240102 245743 251759 258197 264672 270593
53794B70593N070M235L468K856K601K699K878K966K928K505J324l87j722k120
$$ 270593 275663 279898 283366 286222 288823 291522 294400 297366 300294 302799 304123 303736 302014 299894
53780B99894k072k395l180m001m811n841o776o936o385n980o039n795m797l870
$$ 299894 297822 295427 292247 288246 283435 277594 270818 263882 257497 251517 245478 239683 234886 231016
53766B31016l882m144l338j685r08j752k891k828j843j245j493j984k210k120
$$ 231016 227134 222990 219652 217967 217059 215307 212416 209588 207745 206500 205007 203023 200813 198693
53752A98693j587n07M89L42j135k785l273k335p73M42R16R11R28J065R34K55o46
$$ 198693 197106 196599 197088 197430 196295 193510 190237 187902 187129 187571 188487 189398 190326 191391 192325 192580 191934
53735A91934j238j391j220o61K60J008J071Q19J093J899K320J859J124Q80J121
$$ 191934 190696 189305 188085 187424 187684 188692 189763 190582 191675 193574 195894 197753 198877 199757 200878
53720B00878J455J767K009J900J417J132J537K271K538K092J374R18R32J326J727
$$ 200878 202333 204100 206109 208009 209426 210558 212095 214366 216904 218996 220370 221288 222220 223546 225273
53705B25273J744J435J285J527J821J947K278L075L801L801L336L172L395L395
$$ 225273 227017 228452 229737 231264 233085 235032 237310 240385 244186 247987 251323 254495 257890 261285
53691B61285K943K438K002J200n0j004r70k20L54K28m20r97r46j96O51Q45L69
$$ 261285 264228 266666 268668 269868 269818 268814 267844 267624 267978 268206 267786 266789 265843 265647 266298 267143 267512
53674B67512j22k92n51j129j460j036m02m57j028j048k06N07K05o84j188j168
$$ 267512 267390 267098 266547 265418 263958 262922 262520 262063 261035 259987 259781 260288 260493 259809 258621 257453
53658B57453j146j183p49K59J155J405J254J096P33j14r76r73oJ004J223P65L56
$$ 257453 256307 255124 254375 254634 255789 257194 258448 259544 260277 260163 259187 258214 258208 259212 260435 261200 261556
53641B61556M66J090J966K688K829K346J727J472J465J231P73O76J278K138K584
$$ 261556 262022 263112 265078 267766 270595 272941 274668 276140 277605 278836 279609 280285 281563 283701 286285
53626B86285K541K473K639K903L221L785M549M976M682M007L521L190K621J994
$$ 286285 288826 291299 293938 296841 300062 303847 308396 313372 318054 322061 325582 328772 331393 333387
53612C33387K057K905L520K993J811J298K013L287M186M333L791K826J926J602
$$ 333387 335444 338349 341869 344862 346673 347971 349984 353271 357457 361790 365581 368407 370333 371935
53598C71935J817J959J512N94k69o27l52K70N31j52j453k280j978j086n87o98
$$ 371935 373752 375711 377223 377817 377548 376921 376569 376839 377370 377218 375765 373485 371507 370421 369834 369136
53582C69136q67p44o53j050j842k491k575k153j639j373j326j238j042r86j317
$$ 369136 368269 367525 366872 365822 363980 361489 358914 356761 355122 353749 352423 351185 350143 349157 347840
53567C47840j893k254k033j287m58jKq8J24O31J023Q91J85o94j065m62Q18J804
$$ 347840 345947 343693 341660 340373 339915 339914 339916 339828 339952 340583 341606 342497 342682 341988 340923 340461 341279 343083
53549C43083J809J138N86M29L78L39O08J200J590J402J006J087J888L057M049
$$ 343083 344892 346030 346616 347045 347423 347762 348370 349570 351160 352562 353568 354655 356543 359600 363649
53534C63649M537M679N005N857O931P652P913Q076Q373Q753R280J0083J0911J1346
$$ 363649 368186 372865 377870 383727 390658 398310 406223 414299 422672 431425 440705 450788 461699 473045
53520D73045J1466J1697J1995J1978J1917J2648J4222J5736J6834J8351K0706
$$ 473045 484511 496208 508203 520181 532098 544746 558968 574704 591538 609889 630595
53509F30595K2797K3424K2986K2693K2753K2524K1962K1707K1933K2205K2295
$$ 630595 653392 676816 699802 722495 745248 767772 789734 811441 833374 855579 877874
53498H77874K2231K1720K0481J8948J7778J6917J6134J6006J7090J8401J8246
$$ 877874 900105 921825 942306 961254 979032 995949 1012083 1028089 1045179 1063580 1081826
53487A081826J6683J5597J6009J6853J6991J6887J7327J7798J7361J6332J5785
$$ 1081826 1098509 1114106 1130115 1146968 1163959 1180846 1198173 1215971 1233332 1249664 1265449
53476A265449J5871J5646J4344J1964Q916N845L544K326J544K54j870m667p964
$$ 1265449 1281320 1296966 1311310 1323274 1332190 1338035 1341579 1343905 1345449 1345703 1343833 1339166 1331202
53463A331202j1322j3768j4651j4463j4127j3784j3198j2911j3898j5976j7772
$$ 1331202 1319880 1306112 1291461 1276998 1262871 1249087 1235889 1222978 1209080 1193104 1175332
53452A175332j8482j8729j9222j9596j9235j8537j8385j8780j8803j7922j6559
$$ 1175332 1156850 1138121 1118899 1099303 1080068 1061531 1043146 1024366 1005563 987641 971082
53441I71082j5304j4106j2535j0490q353o617n558n096m835m317l370k163q64
$$ 971082 955778 941672 929137 918647 910294 903677 898119 893023 888188 883871 880501 878338 877474
53428H77474N39J950K960L265L262L844N468P735R937J1741J3193J4425J5618
$$ 877474 878013 879963 882923 886188 889450 893294 898762 906497 916434 928175 941368 955793 971411
53415I71411J6977J8428J9597K0395K1356K2959K4874K6392K7452K8613L0088
$$ 971411 988388 1006816 1026413 1046808 1068164 1091123 1115997 1142389 1169841 1198454 1228542
53404A228542L1463L2502L3539L4904L6502L8235M0360M3012M5765M7999M9448
$$ 1228542 1260005 1292507 1326046 1360950 1397452 1435687 1476047 1519059 1564824 1612823 1662271
53393A662271N0181N0390N0438N0743N1351N1909N2217N2375N2200N1126M9138
$$ 1662271 1712452 1762842 1813280 1864023 1915374 1967283 2019500 2071875 2124075 2175201 2224339
53382B224339M7126M5702M4226M1723L8398L5243L2455K9247K5250K1068J7166
$$ 2224339 2271465 2317167 2361393 2403116 2441514 2476757 2509212 2538459 2563709 2584777 2601943
53371B601943J3138Q544L707r41n766j1462j7948k4434l0375l5831m0873m5170
$$ 2601943 2615081 2623625 2627332 2626391 2620625 2609163 2591215 2566781 2536406 2500575 2459702 2414532
53359B414532m8333n0329n1408n1815n1691n1104n0072m8670m7102m5598m4206
$$ 2414532 2366199 2315870 2264462 2212647 2160956 2109852 2059780 2011110 1964008 1918410 1874204
53348A874204m2789m1297l9894l8810l8190l8076l8384l8735l8522l7332l5367
$$ 1874204 1831415 1790118 1750224 1711414 1673224 1635148 1596764 1558029 1519507 1482175 1446808
53337A446808l3190l1088k8874k6396k3980k2086k0672j9226j7541j6043j5174
$$ 1446808 1413618 1382530 1353656 1327260 1303280 1281194 1260522 1241296 1223755 1207712 1192538
53326A192538j4650j3774j2463j1581j1922j3121j3903j3538j2611j2071j1825
$$ 1192538 1177888 1164114 1151651 1140070 1128148 1115027 1101124 1087586 1074975 1062904 1051079
53315A051079j0844q711o370m954m375l682k471j222k39Q54K365L957N217O310
$$ 1051079 1040235 1031524 1025154 1020200 1015825 1012143 1009672 1008450 1008211 1009065 1011430 1015387 1020604 1026914
53301A026914P558Q813R869J1084J2928J5103J6895J8303K0085K2468K4608K5689
$$ 1026914 1034472 1043285 1053154 1064238 1077166 1092269 1109164 1127467 1147552 1170020 1194628 1220317
53289A220317K5901K5887K5730K5141K4261K3552K2935K1768J9789J7482J5284
$$ 1220317 1246218 1272105 1297835 1322976 1347237 1370789 1393724 1415492 1435281 1452763 1468047
53278A468047J2924R951O554L414R02j225l355n638q037j0429j2603j4406j5946
$$ 1468047 1480971 1490922 1497476 1500890 1501792 1500567 1497212 1491574 1483537 1473108 1460505 1446099 1430153
53265A430153j7470j9028k0518k1997k3653k5372k6693k7352k7556k7583k7434
$$ 1430153 1412683 1393655 1373137 1351140 1327487 1302115 1275422 1248070 1220514 1192931 1165497
53254A165497k7135k6987k7087k6984k6257k5257k4668k4472k4026k3084k2184
$$ 1165497 1138362 1111375 1084288 1057304 1031047 1005790 981122 956650 932624 909540 887356
53243H87356k1777k1683k1626k1719k2018k2045k1338k0083j8678j7077j5114
$$ 887356 865579 843896 822270 800551 778533 756488 735150 715067 696389 679312 664198
53232F64198j3279j2339j2209j1924j0944r768q999q432p679p162p688r145j0401
$$ 664198 650919 638580 626371 614447 603503 593735 584736 576304 568625 561463 553775 544630 534229
53219E34229j0649j0267j0061j0225j0482j0812j1392j1961j1862j0872r468q160
$$ 534229 523580 513313 503252 493027 482545 471733 460341 448380 436518 425646 416178 408018
53207D08018p004n992n442n641o298o756o674o242n842n741o005o463o844p039
$$ 408018 401014 395022 389580 383939 377641 370885 364211 357969 352127 346386 340381 333918 327074 320035
53193C20035p102o918o220n167m488m580m806m249k976j977j899k414k866k998
$$ 320035 312933 306015 299795 294628 290140 285560 280754 276505 273529 271552 269653 267239 264373 261375
53179B61375k932k865k919k990k775k226j844j997k220j814j022o98r07q26k34
$$ 261375 258443 255578 252659 249669 246894 244668 242824 240827 238607 236793 235771 235073 234166 233340 233106
53164B33106J7n13r94o74q9o4k98o6K87j35j145j647j378j251j708j936j148K07
$$ 233106 233123 232610 231616 230942 230853 230789 230491 230425 230712 230577 229432 227785 226407 225156 223448 221512 220364 220571
53146B20571J125J233P92N9p60j293j288r65o78l74K17R94J510J544J347J242
$$ 220571 221696 222929 223721 223780 223020 221727 220439 219474 218796 218422 218639 219633 221143 222687 224034 225276
53130B25276J180Q51K00l42k88K92Q63J116J271J442J230M27k12L19J793K736
$$ 225276 226456 227307 227507 227165 226877 227169 228032 229148 230419 231861 233091 233518 233306 233625 235418 238154
53114B38154K162O79m60q21p69n35o1M03K80n38j431j816j798j762j670j214n06
$$ 238154 240316 240995 240535 239714 238945 238410 238349 238752 239032 238494 237063 235247 233449 231687 230017 228803 228297
53097B28297j52m82j096j414j371j228r34k36N99Q34K17o07r70j019j209j380
$$ 228297 228145 227663 226567 225153 223782 222554 221620 221384 221983 222817 223034 222427 221457 220438 219229 217849
53081B17849j057m22j82m19m01K92J048J066L75m21j003j400j490j021j32N83
$$ 217849 216792 216370 216188 215769 215368 215660 216708 217774 218149 217728 216725 215325 213835 212814 212682 213265
53065B13265O60J68m77r30j062r19o58m38l56m16m85l12K18Q02R66O56L71M42
$$ 213265 213925 214093 213616 212686 211624 210705 210047 209609 209253 208837 208352 208040 208258 209060 210026 210682 211053 211495
53047B11495N35K32j57M2P78J163N98m65j185j280r52l54L88Q48O95K99L45P76
$$ 211495 212030 212262 212105 212147 212925 214088 214686 214221 213036 211756 210804 210450 210838 211686 212381 212680 213025 213801
53029B13801P77j5q78r49l02L79P70R69R58O49L58N28J027J275J098Q89Q62P69
$$ 213801 214578 214563 213685 212736 212434 212813 213583 214552 215510 216159 216517 217045 218072 219347 220445 221334 222196 222965
53011B22965M80K01k2m34r40j003n18j15k07l76k45k12o50r50l85N07N22l94j037
$$ 222965 223445 223646 223624 223190 222250 221247 220729 220614 220407 220031 219786 219574 218924 217974 217589 218096 218618 218224 217187
52992B17187p11p1J75L23Q90J534J504P98J27l5J71M28N68M52Nn41p67m97P3P32
$$ 217187 216476 216405 216580 216903 217793 219327 220831 221629 221756 221721 221892 222320 222888 223340 223345 222804 222037 221540 221613 222345
52972B22345J476K297K893K915K380J681J078M59k22n56j85M47M44l42j057j092
$$ 222345 223821 226118 229011 231926 234306 235987 237065 237524 237302 236746 236561 237008 237452 237110 236053 234961
52956B34961r30j226j670j525r33p09r58r25l56l7n91j441j593r02m2M37M71J41
$$ 234961 234031 232805 231135 229610 228677 227968 227010 226085 225729 225692 225101 223660 222067 221165 221123 221560 222031 222172
52938B22172m89j193j638j656j357r85p03m05J25P88J024N00k47m02o1j15q14
$$ 222172 221683 220490 218852 217196 215839 214854 214151 213746 213871 214659 215683 216183 215936 215534 215473 215358 214544
52921B14544j267p55J86O03M36L52N99Q32Q27O90M50L1l91n16l43j00J36K73q3
$$ 214544 213277 212522 212708 213311 213747 214099 214698 215530 216357 217047 217497 217528 217137 216621 216278 216178 216314 216587 216504
52902B16504j107k057j864n23Q19J288J149R95P94K67l47n41k69J39N95J247J946
$$ 216504 215397 213340 211476 210953 211772 213060 214209 215204 215998 216265 215918 215377 215108 215247 215842 217089 219035
52885B19035K206J782R08m9p77r19k48Q19J366R18M6l22M4N88Q13P88Q25J022
$$ 219035 221241 223023 223931 223882 223105 222186 221938 222757 224123 225041 225087 224765 224809 225397 226210 226998 227823 228845
52867B28845J237J320J226J005P41L83k19q87r55K5J384J793P94o64j520j837
$$ 228845 230082 231402 232628 233633 234374 234757 234538 233651 232696 232721 234105 235898 236692 236028 234508 232671
52851B32671k225k631k596k346k611l300l365k306j053p90j423j806j202j1P98
$$ 232671 230446 227815 225219 222873 220262 216962 213597 211291 210238 209448 208025 206219 205017 205006 205804
52836B05804O64j09o83n68j93l10q02o97M16J530J416J99q34q50k33K70L98L25
$$ 205804 206468 206359 205676 205108 204915 204605 203803 203106 203522 205052 206468 206667 205833 204983 204750 205020 205418 205743
52818B05743K06J33K05M21O11P01Q57J292K004K728L154L178K959K657K016M76
$$ 205743 205949 206082 206287 206708 207319 208020 208877 210169 212173 214901 218055 221233 224192 226849 228865 229341
52802B29341k011m464n589n075l827k873k390j990j489r93m93J02N58M57j02l99
$$ 229341 227330 222866 217277 212202 208375 205502 203112 201122 199633 198640 198147 198249 198807 199264 199162 198763
52786A98763M5P67R72N64J65J76L50L79L75M96N35K72j08l19m25n99o03o8P92
$$ 198763 198808 199575 200547 201111 201276 201452 201802 202181 202556 203052 203587 203859 203751 203432 203007 202408 201805 201737 202529
52767B02529J280J027L79j18k23k1K67L28l1o77j244j491j364q60p6P23J302J589
$$ 202529 203809 204836 205215 205097 204874 204853 205120 205448 205417 204740 203496 202005 200641 199781 199705 200428 201730 203319
52749B03319J443P58K3J79J269J931J158J7L30J983L059K661J961K042K343K051
$$ 203319 204762 205520 205543 205722 206991 208922 210080 210097 210427 212410 215469 218130 220091 222133 224476 226527
52733B26527J568J454J230M49J0Q37K010J772O1j496j958k021k462k959k813j976
$$ 226527 228095 229549 230779 231228 231238 232075 234085 235857 235918 234422 232464 230443 227981 225022 222209 220233
52717B20233r19j56m3m96q26m19M32R20Q37O20M39K7n89r87j026q91n17L34J334
$$ 220233 219314 219158 219115 218619 217793 217374 217806 218726 219563 220183 220622 220649 220060 219073 218047 217156 216639 216973 218307
52698B18307J763J503J166J060Q78M65J68J69J81J5j97n10j133j762j678p89J77
$$ 218307 220070 221573 222739 223799 224677 225142 225310 225479 225660 225675 225478 224968 223835 222073 220395 219606 219783
52681B19783O95R38J065P98J21m20n35o39j049j377j150m61L46J058J385J025
$$ 219783 220478 221416 222481 223279 223400 222980 222445 221806 220757 219380 218230 217769 218115 219173 220558 221583
52665B21583K85k8L26P99J092J511J971J738P27L2L43Q77P46M65R43J809K017
$$ 221583 221868 221840 222166 222965 224057 225568 227539 229277 230004 230036 230379 231256 232002 232467 233410 235219 237236
52648B37236J529J119Q61J39j022j873k128k214k306k105j575r95l93K54M72o1
$$ 237236 238765 239884 240745 240884 239862 237989 235861 233647 231341 229236 227661 226666 226273 226527 226999 226938
52632B26938n18K12J727K477K020J578J967K395J907Q21j26j029k205l133k994
$$ 226938 226420 226632 228359 230836 232856 234434 236401 238796 240703 241524 241398 240369 238164 235031 232037
52617B32037j842m51O21J095O21p59k128k509k048j600j399r22nP76R91Q80Q05
$$ 232037 230195 229744 230365 231460 232081 231322 229194 226685 224637 223037 221638 220716 220711 221487 222478 223358 224163
52600B24163P38O35P22J042J163P94M03O58J390J639R02j79o17k87J64L45M82
$$ 224163 224901 225536 226258 227300 228463 229257 229660 230318 231708 233347 234249 234070 233453 233166 233330 233675 234157
52583B34157P28P83N34M37P50R27M69p7J37P11L93r16j787j317m40m20j021j169
$$ 234157 234885 235668 236202 236639 237389 238316 238785 238708 238845 239556 239949 239033 237246 235929 235489 235069 234048 232879
52565B32879p43m61m22J4Q81J333R02J47l21n82q59r56p43o03q24j051q37l54
$$ 232879 232136 231675 231253 231267 232148 233481 234383 234530 234209 233627 232768 231812 231069 230466 229642 228591 227754 227400
52547B27400l6J72O11J213J567J555J388J086M85k38n74l46P8L79O59R74R77M17
$$ 227400 227364 227536 228147 229360 230927 232482 233870 234956 235441 235203 234629 234283 234361 234740 235399 236373 237350 237767
52529B37767k69l78J33N64M34J25L04R06J106L14j034j857j505k83R46J507J282
$$ 237767 237498 237120 237253 237817 238251 238376 238680 239586 240692 241006 239972 238115 236610 236327 237273 238780 240062
52512B40062O49J83L05R56J703K177K380K439K266J640N80o23j698k510k909k795
$$ 240062 240711 240894 241199 242155 243858 246035 248415 250854 253120 254760 255340 254717 253019 250509 247600 244805
52496B44805k365j971j691j289p74n78q93j099l94J126K423K647J908Q61l2o05
$$ 244805 242440 240469 238778 237489 236715 236137 235244 234145 233751 234877 237300 239947 241855 242716 242684 242079
52480B42079o91k39M11P19N41L16N54J218J707J392K91p67q17K22J337J463P35
$$ 242079 241388 241149 241560 242279 242820 243136 243690 244908 246615 248007 248298 247531 246714 246936 248273 249736 250471
52463B50471L02Q74J914K493K482K400K324J713L77j051j884k230k576k965l046
$$ 250471 250773 251647 253561 256054 258536 260936 263260 264973 265350 264299 262415 260185 257609 254644 251598
52448B51598k757k391j996j258j16Q91J173O81k16j174j945k276k064j572j235
$$ 251598 248841 246450 244454 243196 243080 243971 245144 245825 245609 244435 242490 240214 238150 236578 235343
52433B35343j204j156o05N98J973K646K082O67n91r50m15N38J383J683J360R12
$$ 235343 234139 232983 232378 232976 234949 237595 239677 240344 239753 238803 238388 238926 240309 241992 243352 244264
52417B44264R88J469J518Q26K64P79K159L552M780O261P908R083R643J0012J0039
$$ 244264 245252 246721 248239 249065 249329 250108 252267 255819 260599 266860 274768 283851 293494 303506 313545
52402C13545Q818O119K993L96k019m853p439q502q019p269o944o325m635k371
$$ 313545 322363 328482 331475 331871 329852 324999 317560 309058 301039 293770 286826 280501 275866 273495
52388B73495p46k79n17p74p07l52l3j21n66p64k20P68J445J512J406J624K177
$$ 273495 272749 272470 271953 271179 270472 270120 270087 269966 269400 268636 268416 269184 270629 272141 273547 275171 277348
52371B77348K791L330L757M007M097M189M293M100L420K539J875J359O36k43p54
$$ 277348 280139 283469 287226 291233 295330 299519 303812 307912 311332 313871 315746 317105 317741 317498 316744
52356C16744o95m68m38m15j23K47L38K52L87Q67J428J806J907J761J641J982K870
$$ 316744 316049 315581 315143 314728 314605 314852 315190 315442 315829 316696 318124 319930 321837 323598 325239 327221 330091
52339C30091L748M074M018M114M527N171O266P929R419R706Q920Q383Q935J0092
$$ 330091 333839 337913 341931 346045 350572 355743 362009 369938 379357 389063 397983 406366 415301 425393
52325D25393J1181J2423J4227J6113J7188J7317J7158J7249J7589J7859J7631
$$ 425393 436574 448997 463224 479337 496525 513842 531000 548249 565838 583697 601328
52314F01328J6657J5391J4842J5407J6231J6330J5932J5909J6194J5773J4225
$$ 601328 617985 633376 648218 663625 679856 696186 712118 728027 744221 759994 774219
52303G74219J2355J1112J0531J0085R444Q601P646O703N801M704L160J359k50
$$ 774219 786574 797686 808217 818302 827746 836347 843993 850696 856497 861201 864361 865720 865470
52290H65470j603l043m692o246p395q001p799o673n261m588m790m812l769j955
$$ 865470 863867 860824 856132 849886 842491 834490 826691 820018 814757 810169 805379 800567 796798 794843
52276G94843r9J701L611N250O108O600P725R661J1442J2195J2134J1964J1829
$$ 794843 794744 796445 800056 805306 811414 818014 825739 835400 846842 859037 871171 883135 894964
52263H94964J1327J0380R608R709J0647J1635J1953J1622J1185J0965J0768J0311
$$ 894964 906291 916671 926279 935988 946635 958270 970223 981845 993030 1003995 1014763 1025074
52251A025074R605Q764P766O578N260L724J694q27l313n227o560p537q132q316
$$ 1025074 1034679 1043443 1051209 1057787 1063047 1066771 1068465 1067638 1064325 1059098 1052538 1045001 1036869 1028553
52237A028553q463q915r239q705p445o515o522o925o911o455o001n600m924l900
$$ 1028553 1020090 1011175 1001936 993231 985786 979271 972749 965824 958913 952458 946457 940857 935933 932033
52223I32033k862k144j824j760j595r18K97J570K548L442M498N358N486N045M707
$$ 932033 929171 927027 925203 923443 921848 920930 921227 922797 925345 928787 933285 938643 944129 949174 953881
52208I53881M679M514L983L455L268L353L714M608N858O563O074M908M109M030
$$ 953881 958560 963074 967057 970512 973780 977133 980847 985455 991313 997876 1003950 1008858 1012967 1016997
52194A016997M284M600N028N458N581N418N267N055M290K774Q76j062l113n271
$$ 1016997 1021281 1025881 1030909 1036367 1041948 1047366 1052633 1057688 1061978 1064752 1065628 1064566 1061453 1056182
52180A056182p061q041q365q491q574q475q222q033p920p582o736n374l691j949
$$ 1056182 1049121 1041080 1032715 1024224 1015650 1007175 998953 990920 983000 975418 968682 963308 959617 957668
52166I57668m73L66L69j81n27j3J236K348K613K164J592J203J024J212J819K274
$$ 957668 957195 957561 957930 957749 957222 957209 958445 960793 963406 965570 967162 968365 969389 970601 972420 974694
52150I74694J761L58q78j148p02j82J74L48J58l70p50p01o38r43j172o66L76J216
$$ 974694 976455 976813 975935 974787 974085 973903 974077 974425 974583 974213 973463 972762 972124 971181 970009 969343 969719 970935
52132I70935J719K422L488M559N662P506J0450J3838J6725J8826K0428K1728K2733
$$ 970935 972654 975076 978564 983123 988785 996291 1006741 1020579 1037304 1056130 1076558 1098286 1121019
52119A121019K3467K3969K4143K3886K3244K2360K1365K0435J9776J9396J8984
$$ 1121019 1144486 1168455 1192598 1216484 1239728 1262088 1283453 1303888 1323664 1343060 1362044
52108A362044J8108J6444J3956J1039Q439O711N722M869L758K448J091k60j508
$$ 1362044 1380152 1396596 1410552 1421591 1430030 1436741 1442463 1447332 1451090 1453538 1454629 1454369 1452861
52095A452861k550l532m753o243p861r758j2245j4984j6892j7247j6465j5384
$$ 1452861 1450311 1446779 1442026 1435783 1427922 1418164 1405919 1390935 1374043 1356796 1340331 1324947
52083A324947j4212j2695j0950r314p516m845j410J479K746K910L387M698O111
$$ 1324947 1310735 1298040 1287090 1277776 1270260 1265415 1264005 1265484 1268230 1271140 1274527 1279225 1285336
52070A285336P114Q346J0571J3240J4862J4725J3528J2361J1656J1387J1509J1770
$$ 1285336 1292450 1300796 1311367 1324607 1339469 1354194 1367722 1380083 1391739 1403126 1414635 1426405
52058A426405J1569J0644R539Q819Q153O738M544K435J025m4j616m223p784j1628
$$ 1426405 1437974 1448618 1458157 1466976 1475129 1481867 1486411 1488846 1489871 1489827 1488211 1483988 1476204 1464576
52044A464576j4767j6546j7211j7555j8015j8470j8761j8898j8742j8051j6907
$$ 1464576 1449809 1433263 1416052 1398497 1380482 1362012 1343251 1324353 1305611 1287560 1270653
52033A270653j5612j4142j2290j0434r477r766j0654j1412j1917j2179j1905j1063
$$ 1270653 1255041 1240899 1228609 1218175 1208698 1198932 1188278 1176866 1164949 1152770 1140865 1129802
52021A129802j0346j0357j0763j0782j0295r821r694r831j0135j0506j0612j0252
$$ 1129802 1119456 1109099 1098336 1087554 1077259 1067438 1057744 1047913 1037778 1027272 1016660 1006408
52009A006408r895j0263j1346j2383j2889j3241j4016j5234j6474j7451j8107
$$ 1006408 996513 986250 974904 962521 949632 936391 922375 907141 890667 873216 855109
51998H55109j8329j7844j6508j4549j2527j0946r986r559r553r862j0223j0296
$$ 855109 836780 818936 802428 787879 775352 764406 754420 744861 735308 725446 715223 704927
51986G04927j0059r906j0220j0957j1811j2583j3272j3937j4604j5129j5067j4001
$$ 704927 694868 684962 674742 663785 651974 639391 626119 612182 597578 582449 567382 553381
51974E53381j2157j0387r271q469p281n533l624j805R5K203M237N692O277O161
$$ 553381 541224 530837 521566 513097 505816 500283 496659 494854 494949 497152 501389 507081 513358 519519
51960E19519N856N718N500M617K909Q92r67k778m734o402p047o554n563m685l919
$$ 519519 525375 531093 536593 541210 544119 545011 544044 541266 536532 530130 523083 516529 510966 506281 502362
51945E02362k878j215J137L936O698R007J0752J2063J3179J4471J6256J8286J9701
$$ 502362 499484 498269 499406 503342 510040 519047 529799 541862 555041 569512 585768 604054 623755
51932F23755J9887J9193J8421J7758J6690J4684J1485O886R14n708j1897j7186
$$ 623755 643642 662835 681256 699014 715704 730388 741873 748759 749673 743965 732068 714882
51920G14882k1841k5821k8285k8473k6787k4453k2343k0444j8376j6050j3715
$$ 714882 693041 667220 638935 610462 583675 559222 536879 516435 498059 482009 468294
51909D68294j1571r479p122m452j869J56J519K421K969L142L091L096L067K397
$$ 468294 456723 447244 440122 435670 433801 433957 435476 437897 440866 444008 447099 450195 453262 455659
51895D55659N60k261n253p554q782r065q766q134p188n933m517l107j680j92J180
$$ 455659 456219 453958 448705 441151 432369 423304 414538 406404 399216 393283 388766 385659 383979 383787 384967
51880C84967K201K988L979N356O726P483P428O927O574O606O601N748L612O08
$$ 384967 387168 390156 394135 399491 406217 413700 421128 428055 434629 441235 447836 453584 457196 457804
51866D57804k331m485n623n804n276m535m099m061l967l304j989m33P99J424J678
$$ 457804 455473 450988 445365 439561 434285 429750 425651 421590 417623 414319 412330 411897 412696 414120 415798
51851D15798K028K490K433J279o47k363l345l925m528m950m722m005l596l979
$$ 415798 417826 420316 422749 424028 423381 421018 417673 413748 409220 404270 399548 395543 391947 387968
51837C87968m622m480l196j554n88l90j09Q66K137K827K590J725O73k98j032j582
$$ 387968 383346 378866 375670 374116 373528 373138 373029 373895 376032 378859 381449 383174 383847 383549 382517 380935
51821C80935k199k909l177k467j111j50k06q55j187o87N31J962L014L287K807
$$ 380935 378736 375827 372650 370183 369072 368922 368716 367861 366674 365987 366518 368480 371494 374781 377588
51806C77588J937J054L49j49n58j055j579j761j424r41q40j090j269j304j534
$$ 377588 379525 380579 380928 380779 380221 379166 377587 375826 374402 373461 372621 371531 370262 368958 367424
51791C67424k053k469k436k008j386p78n33q92j438j326l63O33R10P27Q92J665
$$ 367424 365371 362902 360466 358458 357072 356294 355761 354869 353431 352105 351742 352375 353285 354012 354904 356569
51775C56569K633L387L852M090M181M311M612M953N165N408O040P047P795P491
$$ 356569 359202 362589 366441 370531 374712 379023 383635 388588 393753 399161 405201 412248 420043 427534
51761D27534N849L286N74j762l644n210o503p543q446r197r393q642p184n773
$$ 427534 433383 436669 437243 435481 431837 426627 420124 412581 404135 394938 385545 376903 369719 363946
51747C63946m844m125l223k135j073j07P39J347J734K211L049M146N212O018O304
$$ 363946 359102 354977 351754 349619 348546 348439 349178 350525 352259 354470 357519 361665 366877 372895 379199
51732C79199N755M368K720J472P61L47K56Q11J992L048L060J802k8j545k478l187
$$ 379199 384954 389322 392042 393514 394275 394622 394878 395689 397681 400729 403789 405591 405563 404018 401540 398353
51716C98353l887m161l485k093r30o13q70j062j021j031j136q91O7J354K010J501
$$ 398353 394466 390305 386820 384727 383797 383184 382314 381252 380231 379200 378064 377173 377240 378594 380604 382105
51700C82105L99j52K76J062J431J283Q48J64n87p01K69J580J947J022n00k130
$$ 382105 382504 382352 382628 383690 385121 386404 387252 387416 386829 386128 386397 387977 389924 390946 390446 388316
51684C88316l963n644o064m659k347o13p5l14n90l01P39K028K721K635K467K824
$$ 388316 384353 378709 372645 367986 365639 365026 364951 364637 364047 363746 364485 366513 369234 371869 374336 377160
51668C77160L538M318N396P010Q630R343Q664O643L547j5l081m931n548n227m177
$$ 377160 380698 385016 390412 397422 406052 415395 424059 430702 434249 434234 431153 426222 420674 415447 411270
51653D11270k764j467j77J760M213N755N204L028M34k204n010p407q559q684q677
$$ 411270 408506 407039 406862 408622 412835 418590 423794 426822 427256 425052 420042 412635 404076 395392 386715
51638C86715q568p639n936m370l238j888j28J262J765J815J793J431P21L46N42
$$ 386715 378147 370508 364572 360202 356964 355076 354948 356210 357975 359790 361583 363014 363735 364081 364623
51623C64623M45o04j871k265j931j909k568l251l368l068k846k990l391l573l068
$$ 364623 365068 364464 362593 360328 358397 356488 353920 350669 347301 344233 341387 338397 335006 331433 328365
51608C28365k053j347j423j713j286k2J387K375K991L586M437N678P202Q620R564
$$ 328365 326312 324965 323542 321829 320543 320521 321908 324283 327274 330860 335297 340975 348177 356797 366361
51593C66361R919R584Q246N698K322j074l810n559o247o063n341m125k077P60
$$ 366361 376280 385864 394110 399808 402130 401056 397246 391687 385440 379377 374036 369911 367834 368594
51579C68594L452N003N710O884R096J1340J2397J2425J2583J3360J4068J4016
$$ 368594 372046 377049 382759 389643 398739 410079 422476 434901 447484 460844 474912 488928
51567D88928J3430J2799J1922J0300Q391P651R107J2392J6491K0958K5810L0532
$$ 488928 502358 515157 527079 537379 545770 553421 562528 574920 591411 612369 638179 668711
51555F68711L3833L4558L2463K8101K2407J6348J0458M450k257r455j5984k0901
$$ 668711 702544 737102 769565 797666 820073 836421 846879 851329 849072 839617 823633 802732
51543H02732k4436k7367k9841l1276l1253k9971k7895k5359k2605j9778j6829
$$ 802732 778296 750929 721088 689812 658559 628588 600693 575334 552729 532951 516122
51532E16122j3700j0764q674p566o701n335l832l372m425n926o401n681n012n446
$$ 516122 502422 491658 482984 475418 468717 463382 459550 456178 451753 445827 439426 433745 428733 423287
51518D23287o570p139o519n172l978l482l741m403m913m894m515m219m179m140
$$ 423287 416717 409578 403059 397887 393909 390427 386686 382283 377370 372476 367961 363742 359563 355423
51504C55423l784l074k205j460j047q86o70l00q8k14k68J68P26O33j24o54l12
$$ 355423 351639 348565 346360 344900 343853 342967 342297 341997 341909 341695 341427 341595 342321 342954 342830 342176 341864
51487C41864O31J569K171K189J393P2r34j174j081j165j292j287j592k542l441
$$ 341864 342495 344064 346235 348424 349817 349889 348955 347781 346700 345535 344243 342956 341364 338822 335381
51472C35381l279k236j491j561j707j248n97n53j132j717j956j966j848j526j076
$$ 335381 332102 329866 328375 326814 325107 323859 323262 322709 321577 319860 317904 315938 314090 312564 311488
51457C11488p59o34m02J79R52J537J758J758J837K295L339M917O646Q127R408
$$ 311488 310729 310095 309693 309872 310824 312361 314119 315877 317714 320009 323348 328265 334911 343038 352446
51442C52446J0829J2275J2921J2017R746O960M299K045O08L78Q93Q99l63k343
$$ 352446 363275 375550 388471 400488 410234 417194 421493 423538 424146 424524 425417 426316 425953 423610
51428D23610m100n494o874q009q174p288o263n904o004n750m766l416k311j762
$$ 423610 419510 414016 407142 399133 390959 383671 377408 371504 365500 359750 354984 351568 349257 347495
51414C47495j671j720j628j357j080r18p34k07P92J938K603K423J664R57O85Q12
$$ 347495 345824 344104 342476 341119 340039 339121 338387 338180 338972 340910 343513 345936 347600 348557 349242 350054
51398C50054J188J759K325K473J992J308J192K074L697N437O888Q164R662J1511
$$ 350054 351242 353001 355326 357799 359791 361099 362291 364365 368062 373499 380387 388551 398213 409724
51384D09724J3319J4743J6219J8774K2880K7824L2403L6083L9227M2321M5189
$$ 409724 423043 437786 454005 472779 495659 523483 555886 591969 631196 673517 718706
51373G18706M6919M6391M3058L7307L0070K2057J3593N065l006j0502j7831k5123
$$ 718706 765625 812016 855074 892381 922451 944508 958101 963166 960160 949658 931827 906704
51361I06704l1726l6851m0371m2539m3325m2612m0840l8716l6301l3001k8609
$$ 906704 874978 838127 797756 755217 711892 669280 628440 589724 553423 520422 491813
51350D91813k3873j9858j7024j5046j3225j1096q818p044o175n865n533n084m680
$$ 491813 467940 448082 431058 416012 402787 391691 382873 375829 369654 363789 358256 353172 348492
51337C48492m099k946j483n28l85m97l81k27k67j61M90J469K194K322J742M78
$$ 348492 344393 341447 339964 339436 339051 338554 338173 337946 337679 337518 338008 339477 341671 343993 345735 346213
51321C46213r19j349l61Q92P82p99k257k343j535r91r11o41m2J80m43j393j854
$$ 346213 345294 343945 343584 344476 345258 344459 342202 339859 338324 337333 336422 335781 335739 335919 335476 334083 332229
51304C32229j708j444j360j284j039p94q22j110j439j670j869k136k423k467j981
$$ 332229 330521 329077 327717 326433 325394 324600 323778 322668 321229 319559 317690 315554 313131 310664 308683
51289C08683r41K51J117J599K115L021M156N023N302N103M772M533M242L536K330
$$ 308683 307742 307993 309110 310709 312824 315845 320001 325024 330326 335429 340201 344734 348976 352512 354842
51274C54842J077L64K46K81K25K28L48L16J55N41J945L713M522L762J988J17j393
$$ 354842 355919 356283 356529 356810 357035 357263 357611 357927 358082 358623 360568 364281 368803 372565 374553 374670 373277
51257C73277k544l413l981m154l915l554l495l755l808l351k884k999l380l138
$$ 373277 370733 367320 363339 359185 355270 351716 348221 344466 340658 337307 334423 331424 328044 324906
51243C24906k122j050m12L4M41M35j02m73PJ056J854K020J748J249O20Q2j86k34
$$ 324906 322784 321734 321322 321356 321797 322232 322130 321657 321664 322720 324574 326594 328342 329591 330211 330293 330107 329873
51225C29873j15L50J146J739J643J124P53N53J91k06j95Jm09j442j917r27Q43
$$ 329873 329758 330108 331254 332993 334636 335760 336513 337066 337257 337051 336856 336857 336448 335006 333089 332162 333005
51208C33005J982K103K046K489L184L625L760L716L311K297Q28o56j795k282j810
$$ 333005 334987 337090 339136 341625 344809 348434 352194 355910 359221 361518 362346 361690 359895 357613 355803
51193C55803n68M89M80k10k91P64K040K478K141J608Q29n42j987k428j719r24
$$ 355803 355235 355724 356204 355994 355703 356467 358507 360985 363126 364734 365563 365021 363034 360606 358887 357963
51177C57963q62j186j262j124j033p93j78M40O26O74J150J900K220J925J473J110
$$ 357963 357101 355915 354653 353529 352496 351703 351525 351965 352591 353265 354415 356315 358535 360460 361933 363043
51161C63043O13l8m53n19o75j204j743j893j803j840k002k130k321k678k879k511
$$ 363043 363656 363618 363165 362646 361971 360767 359024 357131 355328 353488 351486 349356 347035 344357 341478 338967
51145C38967j790j388j575j919j917j492q00O8R46J481J531J416J495J593J258
$$ 338967 337177 335789 334214 332295 330378 328886 328086 328154 329100 330581 332112 333528 335023 336616 337874
51130C37874N24R6M95J417K119K282K208K180K069J666J175J008J164J159P76
$$ 337874 338398 338494 338989 340406 342525 344807 347015 349195 351264 352930 354105 355113 356277 357436 358212
51115C58212N71J266K636L472K885J402L75M41R96J238J164J244J549J691J454
$$ 358212 358783 360049 362685 366157 369042 370444 370819 371260 372256 373494 374658 375902 377451 379142 380596
51100C80596J059P51N37L95M01N32N70L57j7l90o93q76q20m57J43Q05J281J337
$$ 380596 381655 382406 382943 383338 383739 384271 384841 385198 385181 384791 384098 383222 382402 381945 382088 382893 384174 385511
51082C85511R14L15o1o4K20P07J227J382R67N47R89K274L378L603L439L681M288
$$ 385511 386425 386740 386679 386615 386835 387542 388769 390151 391118 391665 392654 394928 398306 401909 405348 409029 413317
51065D13317M778N261O220P542Q711R937J2059J5000J7159J7002J4802J2237J0588
$$ 413317 418095 423356 429576 437118 445829 455766 467825 482825 499984 516986 531788 544025 554613
51052E54613R901R751J0046J0807J1593J1583J0209P616M462J377j360l823o232
$$ 554613 564514 574265 584311 595118 606711 618294 628503 636119 640581 641958 640598 636775 630543
51039F30543q725j1018j2239j1460q754n591l747l839n135o751q499j0447j2151
$$ 630543 621818 610800 598561 587101 578347 572756 569009 565170 560035 553284 544785 534338 522187
51026E22187j2795j1931r866p419n399m102l085j630L64K179L194L718M519N751
$$ 522187 509392 497461 487595 480176 474777 470675 467590 465960 466324 468503 471697 475415 479934 485685
51012D85685O884P631Q370R424J0454J0949J0994J1114J1472J1671J1268J0180
$$ 485685 492569 500200 508570 517994 528448 539397 550391 561505 572977 584648 595916 606096
51000F06096Q578O746N104M001L299K417J044m12j313j545j494j460j472j548
$$ 606096 614674 621420 626524 630525 633824 636241 637285 636873 635560 634015 632521 631061 629589 628041
50986F28041j648j279L15L250O597R189J0617J1255J1566J1770J2024J2424J2928
$$ 628041 626393 625114 625429 628679 635276 644465 655082 666337 677903 689673 701697 714121 727049
50973G27049J3556J4640J6535J9192K2365K6053L0260L4418L7826M0715M4185
$$ 727049 740605 755245 771780 790972 813337 839390 869650 904068 941894 982609 1026794
50962A026794M8705N3313N6759N8820N9905N9952N8586N6107N3341N0457M6774
$$ 1026794 1075499 1128812 1185571 1244391 1304296 1364248 1422834 1478941 1532282 1582739 1629513
50951A629513M1979L6800L2147K8169K4509K0982J7615J4469J1945J0795J1159
$$ 1629513 1671492 1708292 1740439 1768608 1793117 1814099 1831714 1846183 1858128 1868923 1880082
50940A880082J1889J1468R571P090M674K014j288m804p810j0302j2990j6472k0837
$$ 1880082 1891971 1903439 1913010 1920100 1924774 1926788 1925500 1920696 1912886 1902584 1889594 1873122 1852285
50927A852285k5901l1349l6613m1118m4906m8622n2596n6124n8031n7917n6573
$$ 1852285 1826384 1795035 1758422 1717304 1672398 1623776 1571180 1515056 1457025 1399108 1342535
50916A342535n5038n3529n1445m8307m4373m0318l6549l3029k9650k6548k3953
$$ 1342535 1287497 1233968 1182523 1134216 1089843 1049525 1012976 979947 950297 923749 899796
50905H99796k1857j9975j8027j6000j4079j2389j0941r724q737p858o862n727
$$ 899796 877939 857964 839937 823937 809858 797469 786528 776804 768067 760209 753347 747620
50893G47620m747m136l604k668j350k45K33L22M08M72L79L92Q80J671K286K796
$$ 747620 742873 738737 735133 732465 731115 730870 731103 731425 731833 732305 732684 733076 733956 735627 737913 740709
50877G40709L788N340O672P183P364Q124R506J0727J1319J1697J2483J3775J5349
$$ 740709 744497 749837 756509 763692 771056 779180 788686 799413 810732 822429 834912 848687 864036
50864H64036J7177J9405K1980K4598K7020K9281L1628L4392L7882M2222M7233
$$ 864036 881213 900618 922598 947196 974216 1003497 1035125 1069517 1107399 1149621 1196854
50853A196854N2663N8578O5360P3106Q1132Q8486R5010J01527J08714J16106J22609
$$ 1196854 1249517 1308095 1373455 1446561 1527693 1616179 1711189 1812716 1921430 2037536 2160145
50842B160145J27666J31308J33163J32277J28168J21382J12512J01354Q7683P2410
$$ 2160145 2287811 2419119 2552282 2684559 2812727 2934109 3046621 3147975 3235658 3308068
50832C308068N7088M2390K8019J4147K136o610j1884j4316j4256j1586o468K75
$$ 3308068 3365156 3407546 3435565 3449712 3451848 3445238 3433354 3419038 3404782 3393196 3386728 3387003
50820C387003P592J4575K0292K3505K2842J7522P966m423j8335l3392m9743o6924
$$ 3387003 3394595 3409170 3429462 3452967 3475809 3493331 3501297 3496874 3478539 3445147 3395404 3328480
50808C328480q3605r8619j11774j23221j32312j37722j38793j36298j31654j25567
$$ 3328480 3244875 3146256 3034482 2911261 2778949 2641227 2502434 2366136 2234482 2108915
50798B108915j17789j08129r7276q6397p6029o5796n5314m5069l6089k8851k2880
$$ 2108915 1991126 1882997 1785721 1699324 1623295 1557499 1502185 1457116 1421027 1392176 1369296
50787A369296j7411j2208p622m190k260j703j877k106k300k924m215n806p286
$$ 1369296 1351885 1339677 1332055 1327865 1325605 1323902 1322025 1319919 1317619 1314695 1310480 1304674 1297388
50774A297388q794j0619j2457j3542j3684j3712j4687j6775j9077k0559k1014
$$ 1297388 1288594 1277975 1265518 1251976 1238292 1224580 1209893 1193118 1174041 1153482 1132468
50763A132468k1050k1261k1565k1471k0761j9698j8530j7124j5227j2896j0473
$$ 1132468 1111418 1090157 1068592 1047121 1026360 1006662 988132 971008 955781 942885 932412
50752I32412q154n803l159k59K476M653O473Q703J1853J5595J9232K2636K6224
$$ 932412 924258 918455 915296 915037 917513 922166 928639 937342 949195 964790 984022 1006658 1032882
50739A032882L0111L3865L7295M0876M4962M9071N2423N4952N7203N9444O1355
$$ 1032882 1062993 1096858 1134153 1175029 1219991 1269062 1321485 1376437 1433640 1493084 1554439
50728A554439O2595O3266O3711O4177O4622O4598O3383O0477N6015N0389M3616
$$ 1554439 1617034 1680300 1744011 1808188 1872810 1937408 2000791 2061268 2117283 2167672 2211288
50717B211288L5350K5540J4709L625o961j6238k3366k7767k9296k8093k4494j9111
$$ 2211288 2246638 2272178 2286887 2290512 2283551 2267313 2243947 2216180 2186884 2158791 2134297 2115186
50705B115186j2736o001P61P236J2868J6834J8233J6408J1357L780n467j5939
$$ 2115186 2102450 2096449 2097210 2104446 2117314 2134148 2152381 2168789 2180146 2183926 2178459 2162520
50693B162520k7427l9368n0783o0802o8823p4232p6502p5815p3118o9178o3844
$$ 2162520 2135093 2095725 2044942 1984140 1915317 1841085 1764583 1688768 1615650 1546472 1482628
50682A482628n6731m8310l9842l2160k4988j7574r674j734N637J2111J7726K2769
$$ 1482628 1425897 1377587 1337745 1305585 1280597 1263023 1253349 1251615 1257252 1269363 1287089 1309858
50670A309858K7469L1584L4368L5233L4416L2697L0380K7069K2674J8175J4821
$$ 1309858 1337327 1368911 1403279 1438512 1472928 1505625 1536005 1563074 1585748 1603923 1618744
50659A618744J2832J1470J0291R536R218Q697P606O557O297O656O984P298Q232
$$ 1618744 1631576 1643046 1653337 1662873 1672091 1680788 1688394 1694951 1701248 1707904 1714888 1722186 1730418
50646A730418J0066J2571J5764J9930K4692K8872L1729L3732L5729L7705L8970
$$ 1730418 1740484 1753055 1768819 1788749 1813441 1842313 1874042 1907774 1943503 1981208 2020178
50635B020178L9190L8679L7769L6420L4633L2809L1469L0764L0277K9165K6253
$$ 2020178 2059368 2098047 2135816 2172236 2206869 2239678 2271147 2301911 2332188 2361353 2387606
50624B387606K0254J0351l061j8143l2340m3450n0222n2269m9885m4061l6292
$$ 2387606 2407860 2418211 2415150 2397007 2364667 2321217 2270995 2218726 2168841 2124780 2088488
50613B088488k7977j9911j2402n620K47M895P788Q365O643L334r69o504j3788
$$ 2088488 2060511 2040600 2028198 2022578 2022825 2027720 2035508 2043873 2050516 2053850 2052881 2046377 2032589
50600B032589k2592l1891m0701m8432n4550n8592o0704o1604o1720o0848n8867
$$ 2032589 2009997 1978106 1937405 1888973 1834423 1775831 1715127 1653523 1591803 1530955 1472088
50589A472088n6285n3681n1009m7983m4828m2059l9572l6609l2752k8533k4729
$$ 1472088 1415803 1362122 1311113 1263130 1218302 1176243 1136671 1100062 1067310 1038777 1014048
50578A014048k1368j7909j4235j0898q249n871l220m50J986M260O866R507J1178
$$ 1014048 992680 974771 960536 949638 941389 935518 932298 931848 933834 938094 944960 954467 965645
50565I65645J1683J2213J3847J6225J8359K0105K2008K4224K6506K8834L1050
$$ 965645 977328 989541 1003388 1019613 1037972 1058077 1080085 1104309 1130815 1159649 1190699
50554A190699L2269L1817L0623L0400L1363L2011L1390L0246K9492K8857K7823
$$ 1190699 1222968 1254785 1285408 1315808 1347171 1379182 1410572 1440818 1470310 1499167 1526990
50543A526990K6865K6741K7411K8563L0615L4088L8465M2717M6727N1227N6465
$$ 1526990 1553855 1580596 1608007 1636570 1667185 1701273 1739738 1782455 1829182 1880409 1936874
50532A936874O1803O6756P1638P6952Q2650Q8320R3745R9062J04350J09036J11936
$$ 1936874 1998677 2065433 2137071 2214023 2296673 2384993 2478738 2577800 2682150 2791186 2903122
50521B903122J12223J10309J07170J02689R5452Q4510P0543N4775L7573J8978
$$ 2903122 3015345 3125654 3232824 3335513 3430965 3515475 3586018 3640793 3678366 3697344
50511C697344j77j8786l6706n4271p0847q4954r5810j03601j08187j08577j04154
$$ 3697344 3697167 3678381 3641675 3587404 3516557 3431603 3335793 3232192 3124005 3015428 2911274
50500B911274r5573q4128p0789n6134m0571k4248p290R655K5379L8673M8472N3579
$$ 2911274 2815701 2731573 2660784 2604650 2564079 2539831 2532541 2542196 2567575 2606248 2654720 2708299
50488B708299N3079M7149L6778K2486M102j7839m1235o3484q2826r8325j09308
$$ 2708299 2761378 2808527 2845305 2867791 2871893 2854054 2812819 2749335 2666509 2568184 2458876
50477B458876j15591j17844j17023j13586j07776j00299r2122q3717p5092o6584
$$ 2458876 2343285 2225441 2108418 1994832 1887056 1786757 1694635 1610918 1535826 1469242
50467A469242n9051n3229m9123m6084m3285m0110l6346l2110k7594k3002j8703
$$ 1469242 1410191 1356962 1307839 1261755 1218470 1178360 1142014 1109904 1082310 1059308 1040605
50456A040605j5112j2205r430o313k968J67K886N190O939P953Q457R036J0151
$$ 1040605 1025493 1013288 1003858 997545 994577 994744 997630 1002820 1009759 1017712 1026169 1035205 1045356
50443A045356J1831J3857J5948J7622J8174J7103J4659J1790R310P213N052K959
$$ 1045356 1057187 1071044 1086992 1104614 1122788 1139891 1154550 1166340 1175650 1182863 1187915 1190874
50431A190874J801K047L016L750M279N287O762P870Q279Q675R720J1335J3470
$$ 1190874 1192675 1194722 1197738 1201488 1205767 1211054 1217816 1225686 1233965 1242640 1252360 1263695 1277165
50418A277165J6611K0805K4960K8118L1000L5156M0841M6742N1773N6028N9743
$$ 1277165 1293776 1314581 1339541 1367659 1398659 1433815 1474656 1521398 1573171 1629199 1688942
50407A688942O2369O3300O2789O1437N9290N6045N1693M6346L9657L1271K1711
$$ 1688942 1751311 1814611 1877400 1938837 1998127 2054172 2105865 2152211 2191868 2223139 2244850
50396B244850J2047K543p679j9272l1585m3315n3755o2645o9226p2422p2125o9504
$$ 2244850 2256897 2259440 2251761 2232489 2200904 2157589 2103834 2041189 1971963 1899541 1827416 1757912
50384A757912o5576o0148n2686m3724l4523k5590j6438o934J994R412J5392K0351
$$ 1757912 1692336 1632188 1579502 1535778 1501255 1475665 1459227 1452293 1454287 1463699 1479091 1499442
50372A499442K3778K4409K1594J5904Q343n36j0500k1035l1182l9845m6181m9833
$$ 1499442 1523220 1547629 1569223 1585127 1593470 1592934 1582434 1561399 1530217 1490372 1444191 1394358
50360A394358n1022n0355m8384m5375m1510l7248l3189k9588k6134k2426j8534
$$ 1394358 1343336 1292981 1244597 1199222 1157712 1120464 1087275 1057687 1031553 1009127 990593
50349I90593j4876j1619q708o608o467q938j2993j6567j8490j9238j9646j9551
$$ 990593 975717 964098 955390 948782 942315 933377 920384 903817 885327 866089 846443 826892
50337H26892j8210j5586j2522r715p135m601k388r15p2P30J858L079M002M651
$$ 826892 808682 793096 780574 770859 763724 759123 756735 755820 755748 756478 758336 761415 765417 770068
50323G70068N429O470P363P619P283O826O562O418O195N760M950L636K035P45
$$ 770068 775497 781967 789330 796949 804232 811058 817620 824038 830233 835993 840943 844579 846614 847359
50309H47359K32M30R28J433J921K462L000L359L426L431L850M834N810O048N581
$$ 847359 847591 848021 848949 850382 852303 854765 857765 861124 864550 867981 871831 876665 882475 888523 894104
50294H94104N157N262N652N971O216O416O246N529M704M355M408M256L488K205
$$ 894104 899261 904523 910175 916146 922362 928778 935024 940553 945257 949612 954020 958276 961764 963969
50280I63969P58m22r00n80J13O63J058J639K480L297L896M306M521M415L940L215
$$ 963969 964727 964305 963405 962825 962938 963601 964659 966298 968778 972075 975971 980277 984798 989213 993153 996368
50264I96368K479K127K663M226O391Q729J1415J4781J8404K1214K2565K2779K2583
$$ 996368 998847 1000974 1003637 1007863 1014254 1022983 1034398 1049179 1067583 1088797 1111362 1134141 1156724
50251A156724K2395K2199K1772K0948J9982J9620K0304K1384K1610K0433J8239
$$ 1156724 1179119 1201318 1223090 1244038 1264020 1283640 1303944 1325328 1346938 1367371 1385610
50240A385610J5191J0671M281l194j0378j6488k1357k4683k5950k5153k3071k0668
$$ 1385610 1400801 1411472 1415753 1412559 1402181 1385693 1364336 1339653 1313703 1288550 1265479 1244811
50228A244811j8496j6775j5778j6099j8428k2894k8507l3450l6322l7053l6512
$$ 1244811 1226315 1209540 1193762 1177663 1159235 1136341 1107834 1074384 1038062 1001009 964497
50217I64497l5430l3849l1464k8177k4338k0666j7788j5720j3933j2104j0532
$$ 964497 929067 895218 863754 835577 811239 790573 772785 757065 743132 731028 720496
50206G20496r512q673p426n924m887m450l883k744j693j613k314k769k508k128
$$ 720496 710984 702311 694885 688961 684074 679624 675741 672997 671304 669691 667377 664608 662100 659972
50192F59972k315k869l170l175l494m386n206n081l985k823k462k810l043k611
$$ 659972 657657 654788 651618 648443 644949 640563 635357 630276 626291 623468 621006 618196 615153 612542
50178F12542j858j523j744j877j334l46M18P87J184J796K200K118K020K481L207
$$ 612542 610684 609161 607417 605540 604206 603860 604278 605065 606249 608045 610245 612363 614383 616864 620071
50163F20071L417L037K890L539M603N543O559Q134J0047J1458J1943J1999J2443
$$ 620071 623488 626525 629415 632954 637557 643100 649659 657793 667840 679298 691241 703240 715683
50150G15683J3608J5132J6338J6812J6829J7219J8630K1041K4067K7545L1490
$$ 715683 729291 744423 760761 777573 794402 811621 830251 851292 875359 902904 934394
50139I34394L5617L9474M2940M6170M8887N0344N0276M9422M8656M7991M6983
$$ 934394 970011 1009485 1052425 1098595 1147482 1197826 1248102 1297524 1346180 1394171 1441154
50128A441154M5795M5029M4417M2352L7180K8664J7861N997o138j7945k8812l8288
$$ 1441154 1486949 1531978 1576395 1618747 1655927 1684591 1702452 1708449 1702311 1684366 1655554 1617266
50116A617266m6140n2084n5761n7067n6336n4090n0822m7042m3202l9450l5707
$$ 1617266 1571126 1519042 1463281 1406214 1349878 1295788 1244966 1197924 1154722 1115272 1079565
50105A079565l2139k9260k7350k6021k4719k3437k2536k1976k1188j9723j7594
$$ 1079565 1047426 1018166 990816 964795 940076 916639 894103 872127 850939 831216 813622
50094H13622j4976j1904q523n286k692r31J46R10J828L140M534N422N634N673
$$ 813622 798646 786742 778219 772933 770241 769310 769456 770366 772194 775334 779868 785290 790924 796597
50080G96597O043O685P159P075O226M705L148K478K900L500L282K323J372N97
$$ 796597 802640 809325 816484 823559 829785 834490 837638 840116 843016 846516 849798 852121 853493 854090
50066H54090m94k016l338m031m465n126n853o178o006n544m839l841k770j984
$$ 854090 853596 851580 848242 844211 839746 834620 828767 822589 816583 811039 806200 802359 799589 797605
50052G97605j582j384j219q99j22J186K567L463M072N256P435R917J1610J2180
$$ 797605 796023 794639 793420 792521 792399 793585 796152 799615 803687 808943 816378 826295 837905 850085
50038H50085J2231J2477J3068J3757J4362J4872J5199J5095J4376J3171J1888
$$ 850085 862316 874793 887861 901618 915980 930852 946051 961146 975522 988693 1000581
50027A000581J0972J0681J0955J1410J1616J1547J1763J2903J4982J7310J9120
$$ 1000581 1011553 1022234 1033189 1044599 1056215 1067762 1079525 1092428 1107410 1124720 1143840
50016A143840K0089K0188J9342J7579J5419J3742J3107J3256J3419J3059J2254
$$ 1143840 1163929 1184117 1203459 1221038 1236457 1250199 1263306 1276562 1289981 1303040 1315294
50005A315294J1243R664O440P92o783j4792k1994k8014l2762l5905l7340l7646
$$ 1315294 1326537 1336201 1342641 1343433 1336650 1321858 1299864 1271850 1239088 1203183 1165843 1128197
49993A128197l7431l6491l4215l0728k7026k4003k1909k0753k0467k0542k0207
$$ 1128197 1090766 1054275 1020060 989332 962306 938303 916394 895641 875174 854632 834425
49982H34425j9337j8664j8686j8914j8539j7424j5894j4120j2244j0716r828r110
$$ 834425 815088 796424 777738 758824 740285 722861 706967 692847 680603 669887 660059 650949
49970F50949p883o284n069m592m561m718n006n043m319l061k135j798j299n3J517
$$ 650949 643066 636782 631713 627121 622560 617842 612836 607793 603474 600413 598278 596480 595181 595128 596645
49955E96645K832M109N745P315Q158Q604R615J1216J2144J1391R339P078N135
$$ 596645 599477 603586 609331 616646 624804 633408 643023 654239 666383 677774 687113 694191 699326
49942F99326L404J911R62M49m16k356n085p461q739r460j0834j3234j5636j6668
$$ 699326 702730 704641 705603 706052 705636 703280 698195 690734 681995 672535 661701 648467 632831 616163
49928F16163j5949j4168j2170j0347q738p248n691l928k038k22J362K525K946
$$ 616163 600214 586046 573876 563529 554791 547543 541852 537924 535886 535664 537026 539551 542497
49915E42497K550J887J669J955K229K299K567L247L928M290M761N934P659R190
$$ 542497 545047 546934 548603 550558 552787 555086 557653 560900 564828 569118 573879 579813 587472 596662
49901E96662J0121J0623J0845J0653J0057R308Q431P062N042K793P84j130l357
$$ 596662 606783 617406 628251 638904 648961 658269 666700 673762 678804 681597 682381 681251 677894
49888F77894n740p546q364q616q982r632j0257j0640j0859j0992j0967j0673j0030
$$ 677894 672154 664608 656244 647628 638646 629014 618757 608117 597258 586266 575299 564626 554596
49875E54596q959p581o352n717n520n120m209l165k425j790o97J054L178N245
$$ 554596 545637 538056 531704 525987 520467 515347 511138 507973 505548 503758 503061 504115 507293 512538
49861E12538O823P495P234O721O846P851R275J0647J1818J2649J2814J2079J0471
$$ 512538 519361 526856 534090 540811 547657 555508 564783 575430 587248 599897 612711 624790 635261
49848F35261Q153N538L366K141J450M14j095k428l462n051p617j0113j1169j0813
$$ 635261 643414 648952 652318 654459 655909 656323 655228 652800 649338 644287 636670 626557 615388 604575
49834F04575j0163r768r154p885o197m499k975j773r26l2J359K951L964M319M826
$$ 604575 594412 584644 575490 567605 561408 556909 553934 552161 551235 551203 552562 555513 559477 563796 568622
49819E68622N920P060P758Q420R592J0860J1328J0788R723Q455O995N585M639
$$ 568622 574542 581602 589360 597780 607372 618232 629560 640348 650071 658526 665521 671106 675745
$$ [...]
##END NTUPLES=NMR SPECTRUM
##END=
