
##TITLE=AC1200_HiSAH12054_6666810_o7svrTITCg
##JCAMPDX= 6.0         $$ Bruker NMR JCAMP-DX V2.0
##DATA TYPE= NMR SPECTRUM
##DATA CLASS= NTUPLES
##ORIGIN= BRUKER
##OWNER= Administrator
$$ 1.72 TOPSPIN		Version 2.1
$$ 2012-08-14 10:01:55.187 -0500  Administrator@TOPSPIN
$$ Compression mode = diff/dup
##.OBSERVE FREQUENCY= 400.02188249412
##.OBSERVE NUCLEUS= ^1H
##.ACQUISITION MODE= SIMULTANEOUS (DQD)
##.ACQUISITION SCHEME= undefined
##.AVERAGES= 8
##.DIGITISER RES= 22
##SPECTROMETER/DATA SYSTEM= spect
##.PULSE SEQUENCE= zg30
##.SOLVENT NAME= COFFEE_meoh
##.SHIFT REFERENCE= INTERNAL, COFFEE_meoh, 1, 14.98509
##AUDIT TRAIL= $$ (NUMBER, WHEN, WHO, WHERE, PROCESS, VERSION, WHAT)
$$ ##TITLE= Audit trail, TOPSPIN		Version 2.1
$$ ##JCAMPDX= 5.01
$$ ##ORIGIN= Bruker BioSpin GmbH
$$ ##OWNER= Administrator
$$ $$ C:\Bruker\TOPSPIN/data/COFFEE/nmr/AC1200_HiSAH12054_6666810_o7svrTITCg/10/pdata/1/auditp.txt
$$ ##AUDIT TRAIL=  $$ (NUMBER, WHEN, WHO, WHERE, PROCESS, VERSION, WHAT)
(   1,<2012-08-14 10:01:47.140 -0500>,<Administrator>,<TOPSPIN>,<go>,<TOPSPIN 2.1>,
      <created by zg
	started at 2012-08-14 10:00:40.312 -0500,
	POWCHK enabled, PULCHK disabled,
       configuration hash MD5:
       6B 1B 68 BB D9 2E 58 E2 7F 35 AD 54 07 DF 0E 41
       data hash MD5: 64K
       1A A1 DD 7C 12 6E 8E F0 AE D4 11 0A 47 40 B2 1D>)
(   2,<2012-08-14 10:01:50.406 -0500>,<Administrator>,<TOPSPIN>,<proc1d>,<TOPSPIN 2.1>,
      <Start of raw data processing
       efp LB = 0 FT_mod = 6 PKNL = 1 PHC0 = 0 PHC1 = 0 SI = 32K 
       data hash MD5: 32K
       F4 F7 05 5B 61 34 80 81 47 71 3D 87 50 10 B6 CF>)
(   3,<2012-08-14 10:01:50.781 -0500>,<Administrator>,<TOPSPIN>,<proc1d>,<TOPSPIN 2.1>,
      <pk PHC0 = 183.576 PHC1 = 0 
       data hash MD5: 32K
       EA 28 FA 1C 18 78 99 FA 7E 9B 14 54 4C D5 A9 AA>)
(   4,<2012-08-14 10:01:50.890 -0500>,<Administrator>,<TOPSPIN>,<proc1d>,<TOPSPIN 2.1>,
      <abs ABSG = 1 
       data hash MD5: 32K
       35 40 3B 42 C8 13 FA A1 72 91 93 B0 10 15 44 94>)
(   5,<2012-08-14 10:01:50.921 -0500>,<Administrator>,<TOPSPIN>,<proc1d>,<TOPSPIN 2.1>,
      <abs ABSG = 2 
       data hash MD5: 32K
       0A 19 6A 7B 5A 9A 9A AB 9D FA DE 77 82 02 8D DA>)
(   6,<2012-08-14 10:01:51.093 -0500>,<Administrator>,<TOPSPIN>,<proc1d>,<TOPSPIN 2.1>,
      <abs ABSG = 3 
       data hash MD5: 32K
       89 86 0E 5A 10 55 B2 1C E6 7A 93 37 45 76 9B A4>)
(   7,<2012-08-14 10:01:51.328 -0500>,<Administrator>,<TOPSPIN>,<proc1d>,<TOPSPIN 2.1>,
      <abs ABSG = 4 
       data hash MD5: 32K
       39 9D 3C 21 B3 98 ED AD 4D CE 1D 21 41 5C AF 42>)
(   8,<2012-08-14 10:01:51.406 -0500>,<Administrator>,<TOPSPIN>,<proc1d>,<TOPSPIN 2.1>,
      <abs ABSG = 5 
       data hash MD5: 32K
       A5 41 7D B2 98 24 8E B5 92 7D 2C F8 AD A1 CB BF>)
$$ ##END=
$$ 
$$ $$ hash MD5
$$ $$ 4E FC B8 4F 77 D2 B1 64 8A D0 9A D6 A7 01 2E 63
##$RELAX= 
##$RELAX= 
##$RELAX= 
##$RELAX= 
##$RELAX= 
##$RELAX= 
##$RELAX= 
$$ Bruker specific parameters
$$ --------------------------
$$ [...]
##$TP= (0..7)
150 150 150 150 150 150 150 150
##$TP07= 0
##$TPNAME0= <>
##$TPNAME1= <>
##$TPNAME2= <>
##$TPNAME3= <>
##$TPNAME4= <>
##$TPNAME5= <>
##$TPNAME6= <>
##$TPNAME7= <>
##$TPOAL= (0..7)
0.5 0.5 0.5 0.5 0.5 0.5 0.5 0.5
##$TPOFFS= (0..7)
0 0 0 0 0 0 0 0
##$TUNHIN= 0
##$TUNHOUT= 0
##$TUNXOUT= 0
##$USERA1= <user>
##$USERA2= <user>
##$USERA3= <user>
##$USERA4= <user>
##$USERA5= <user>
##$V9= 5
##$VALIST= <valist>
##$VCLIST= <CCCCCCCCCCCCCCC>
##$VD= 0
##$VDLIST= <DDDDDDDDDDDDDDD>
##$VPLIST= <PPPPPPPPPPPPPPP>
##$VTLIST= <TTTTTTTTTTTTTTT>
##$WBST= 1024
##$WBSW= 4
##$XGAIN= (0..3)
0 0 0 0
##$XL= 0
##$YL= 0
##$YMAX_a= 479667
##$YMIN_a= -623499
##$ZGOPTNS= <>
##$ZL1= 120
##$ZL2= 120
##$ZL3= 120
##$ZL4= 120
##$ABSF1= 14.98509
##$ABSF2= -5.573092
##$ABSG= 5
##$ABSL= 3
##$ALPHA= 0
##$AQORDER= 0
##$ASSFAC= 0
##$ASSFACI= 0
##$ASSFACX= 0
##$ASSWID= 0
##$AUNMP= <proc_prof1d_extract_pilot.lims>
##$AXLEFT= 0
##$AXNAME= <>
##$AXNUC= <1H>
##$AXRIGHT= 0
##$AXTYPE= 0
##$AXUNIT= <>
##$AZFE= 0.1
##$AZFW= 0.1
##$BCFW= 0
##$BC_mod= 0
##$BYTORDP= 0
##$COROFFS= 0
##$CY= 15
##$DATMOD= 1
##$DC= 0
##$DFILT= <>
##$DTYPP= 0
##$F1P= 0
##$F2P= 0
##$FCOR= 0.5
##$FTSIZE= 32768
##$FT_mod= 6
##$GAMMA= 0
##$GB= 0
##$INTBC= 1
##$INTSCL= 1
##$ISEN= 128
##$LB= 0
##$LEV0= 0
##$LPBIN= 0
##$MAXI= 10000
##$MC2= 0
##$MEAN= 0
##$ME_mod= 0
##$MI= 0
##$NCOEF= 0
##$NC_proc= -8
##$NLEV= 6
##$NOISF1= 0
##$NOISF2= 0
##$NSP= 0
##$NTH_PI= 0
##$NZP= 0
##$OFFSET= 14.98509
##$PC= 1
##$PHC0= 183.576
##$PHC1= 0
##$PH_mod= 1
##$PKNL= yes
##$PPARMOD= 0
##$PPDIAG= 0
##$PPIPTYP= 0
##$PPMPNUM= 2147483647
##$PPRESOL= 1
##$PSCAL= 4
##$PSIGN= 0
##$PYNMP= <proc.py>
##$REVERSE= no
##$SF= 400.02
##$SI= 32768
##$SIGF1= 0
##$SIGF2= 0
##$SINO= 400
##$SIOLD= 32768
##$SPECTYP= <>
##$SREGLST= <1H.CDCl3>
##$SSB= 0
##$STSI= 32768
##$STSR= 0
##$SW_p= 8223.68421052631
##$SYMM= 0
##$S_DEV= 0
##$TDeff= 65536
##$TDoff= 0
##$TI= <>
##$TILT= no
##$TM1= 0
##$TM2= 0
##$TOPLEV= 0
##$USERP1= <user>
##$USERP2= <user>
##$USERP3= <user>
##$USERP4= <user>
##$USERP5= <user>
##$WDW= 1
##$XDIM= 32768
##$YMAX_p= 480541519
##$YMIN_p= -685424
##$CURPLOT= <Network HP LaserJet P1505>
##$CURPRIN= <$Network HP LaserJet P1505>
##$DFORMAT= <normdp>
##$LAYOUT= <+/1D_H.xwp>
##$LFORMAT= <normlp>
##$PFORMAT= <normpl>
##$SURQMSG= 1
$$ End of Bruker specific parameters
$$ ---------------------------------
##NTUPLES= NMR SPECTRUM
##VAR_NAME=  FREQUENCY,     SPECTRUM/REAL,   SPECTRUM/IMAG
##SYMBOL=    X,             R,               I
##VAR_TYPE=  INDEPENDENT,   DEPENDENT,       DEPENDENT
##VAR_FORM=  AFFN,          ASDF,            ASDF
##VAR_DIM=   32768,         32768,           32768
##UNITS=     HZ,            ARBITRARY UNITS, ARBITRARY UNITS
##FACTOR=    0.250966925370066, 1,           1
##FIRST=     8223.43324360094, -10128,       39510
##LAST=      0,             -29045,          61351
##MIN=       0,             -685424,         0
##MAX=       8223.43324360094, 480541519,    0
$$ Real data points
##PAGE= N=1
##DATA TABLE= (X++(R..R)), XYDATA
$$ [...]
19492a73433K63e5808a9568k15492j5860f4211A595a09582j84337o8975a05931
$$ -173433 -173170 -55808 -19568 -235060 -250920 -64211 1595 -109582 -293919 -362894 -105931
19480b19200O6627N4062E4496M3994a10127A89429c99957E0880i936C1520h6752
$$ -219200 -152573 -98511 54496 98490 -110127 189429 -399957 50880 -9936 31520 -86752
19468b8798A29180E5509b75007n5285a18795q5350A2443a68090d8229A04993g2385
$$ -28798 129180 55509 -275007 -330292 -118795 -204145 12443 -168090 -48229 104993 -72385
19456D3065P3150a04697K030j48065b7241l05918N8961h7576k86459a13915d0972
$$ 43065 116215 -104697 -102667 -250732 -27241 -333159 -274198 -87576 -374035 -113915 -40972
19444G0444h8749A00172b15718A82991b29942a00821k00254a40691B4866M7509
$$ 70444 -88749 100172 -215718 182991 -229942 -100821 -301075 -140691 24866 72375
19434G2375d6206j21117D4458k87J42782C9687c5155A12876B2805a15396B14057
$$ 72375 -46206 -167323 44458 44171 186953 39687 -35155 112876 22805 -115396 214057
19422b39708I7542b71980d1076j0133k02471A70389a23063b2852j82936c8849
$$ -239708 97542 -271980 -41076 -51209 -253680 170389 -123063 -22852 -205788 -38849
19411h8332D2005K809c9508l434r0723B12107a82795j5859C8471J05645a26368
$$ -88332 42005 44814 -39508 -42942 -133665 212107 -182795 -198654 38471 144116 -126368
19399A36655J22447b13089j51277M5269A33642A422d32283g9858C848h7128c1509
$$ 136655 259102 -213089 -364366 -319097 133642 1422 -432283 -79858 3848 -87128 -31509
19387a19789q6421R1146M1026l0596C4944j1882a55473D2159a68594C162a05408
$$ -119789 -206210 -115064 -74038 -104634 34944 23062 -155473 42159 -168594 3162 -105408
19375a50257k33218J19112P8999K8388A40626C5770b61185A75314P2415G142d7846
$$ -150257 -383475 -264363 -185364 -156976 140626 35770 -261185 175314 247729 7142 -47846
19363a04860K5730j89430H4556b71362q6272G2092b4557k4279A58667J90067j44216
$$ -104860 -79130 -268560 84556 -271362 -357634 72092 -24557 -48836 158667 348734 204518
19352B04518g8750m8662A31279a18979j93615f7350g269k9956l22621M4865A8947
$$ 204518 -78750 -127412 131279 -118979 -312594 -67350 -7269 -37225 -359846 -314981 18947
19340B24399b22567A80188J04930o1467d42792g5025l03774J78048N2653N8334
$$ 224399 -222567 180188 285118 223651 -442792 -75025 -378799 -200751 -148098 -89764
19330h9764p0106J5368C0570a16417A33693E5997f0354G9661b8780E4005I165
$$ -89764 -159870 -144502 30570 -116417 133693 55997 -60354 79661 -28780 54005 9165
19318a04829B28164g3277B69906b48191r9343A04275D2324o174R0098J9168a26296
$$ -104829 228164 -73277 269906 -248191 -347534 104275 42324 36150 126248 145416 -126296
19306d4336j56095b6294A3753b4459A2805J9802J48047A8625a94393A382N7645
$$ -44336 -200431 -26294 13753 -24459 12805 32607 180654 18625 -194393 1382 59027
19295E9027J21132a2710j56127K4280c4034A51281k8003E7815f8732A49034a22308
$$ 59027 180159 -12710 -168837 -144557 -34034 151281 123278 57815 -68732 149034 -122308
19283i4415C5830e4093F2192J83990a27575E1443a305k34157M6923A58737a98874
$$ -94415 35830 -54093 62192 246182 -127575 51443 -1305 -235462 -188539 158737 -198874
19271B92531b23058B68567c03578N7694n3685h2217b1513g503F0032b95284J22357
$$ 292531 -223058 268567 -303578 -245884 -299569 -82217 -21513 -7503 60032 -295284 -172927
19260a72927d276l57420b6245j42595B8549k21d4133A91209b17836k5376A22135
$$ -172927 -4276 -361696 -26245 -168840 28549 28328 -44133 191209 -217836 -243212 122135
19248a39301e9827j39300n5347L5125j1422j41542f6917o0632i47A84257b55999
$$ -139301 -59827 -199127 -254474 -219349 -230771 -372313 -66917 -127549 -947 184257 -255999
19236D2957b49896d7548q0152j31065A39531j929b1238B2717a96691k2882L0340
$$ 42957 -249896 -47548 -127700 -258765 139531 137602 -21238 22717 -196691 -219573 -189233
19225a89233f1036l4048A06550c53343N593J59115q2883K4714K5374b4007l6191
$$ -189233 -61036 -95084 106550 -353343 -347750 -188635 -271518 -246804 -221430 -24007 -60198
19214f0198m4753B56377a68815I7509a10854F7782b13695h7851A5768a57799j8026
$$ -60198 -104951 256377 -168815 97509 -110854 67782 -213695 -87851 15768 -157799 -175825
19203a75825p1583d4682A83452n3927r556b77852J06490A37329b9246J2387C22506
$$ -175825 -247408 -44682 183452 129525 119969 -277852 -171362 137329 -29246 -16859 322506
19191a04338A2271a49930j1410k00793J11258j36370C84099G4581a70450A50726
$$ -104338 12271 -149930 -161340 -362133 -250875 -387245 384099 74581 -170450 150726
19180C81371b01969L4006A33155J28957a39667l1878m1380i4355G3190d5033A39603
$$ 381371 -201969 -167963 133155 262112 -139667 -171545 -212925 -94355 73190 -45033 139603
19168F9667J40439c7197C53245E0157j935a55030L6619p9651A24651c17273A62836
$$ 69667 210106 -37197 353245 50157 48222 -155030 -118411 -198062 124651 -317273 162836
19156b39963C36458m4836h7723L6586k62182F3388b03756k97687K26732J19434
$$ -239963 336458 291622 -87723 -51137 -313319 63388 -203756 -501443 -274711 -155277
19146a55277M525e3647l00566A07203R170a70360r7348R1675E0200B4375J54556
$$ -155277 -150752 -53647 -354213 107203 116373 -170360 -267708 -176033 50200 24375 178931
19135A78931e2638k3352a0211B6118e29995H2594a43802A59115O3738j8579F4399
$$ 178931 -52638 -75990 -10211 26118 -529995 82594 -143802 159115 222853 204274 64399
19123b07311O2459j20034J19263A05923a87323K2636c877h77j73910O3117L7354
$$ -207311 -144852 -264886 -145623 105923 -187323 -164687 -3877 -877 -174787 -111670 -74316
19112g4316b3678B56250b27948a00421c1984a0981A12223a63993P1235r8407k8141
$$ -74316 -23678 256250 -227948 -100421 -31984 -10981 112223 -163993 -92758 -191165 -219306
19101b19306Q4143A29273a13705E7618a07531j29240a06187k70581A05805J27394
$$ -219306 -135163 129273 -113705 57618 -107531 -236771 -106187 -376768 105805 233199
19091B33199A05404b30896n8379A11332E0515A7448J09444c9283A81479D5779
$$ 233199 105404 -230896 -289275 111332 50515 17448 126892 -39283 181479 45779
19080d46178a87573d1208r696k58974a09479A23603a59474A54012N4746l9473
$$ -446178 -187573 -41208 -50904 -309878 -109479 123603 -159474 154012 208758 169285
19070A69285c17287B31597j07456f8592A09933K0938d7765j12748K0773L4220
$$ 169285 -317287 231597 124141 -68592 109933 130871 -47765 -160513 -139740 -105520
19060a05520k11822b9529B03662b3105o6975i180A80780d0666F2711J68537d6187
$$ -105520 -317342 -29529 203662 -23105 -90080 -9180 180780 -40666 62711 231248 -46187
19048B78484a64407k4684p3413q49h8300L0191j80992K0087D0629R2289c46496
$$ 278484 -164407 -189091 -262504 -263353 -88300 -58109 -239101 -219014 40629 132918 -346496
19036b14722P2564k2935c1455B6377b59716g0295l6160A42423e11013d396A391
$$ -214722 -142158 -165093 -31455 26377 -259716 -70295 -106455 142423 -511013 -4396 1391
19024B07648j0410a14782c8045k94166a45417A03841O3395a09082A24339L19580
$$ 207648 197238 -114782 -38045 -332211 -145417 103841 167236 -109082 124339 443919
19014D43919b24893A09718a37997r206K7793k62719B07333F9897A4205R6604b22969
$$ 443919 -224893 109718 -137997 -147203 -119410 -382129 207333 69897 14205 110809 -222969
19002B03178k5361b20176f7482J1638k73281P6454Q590R9595e9737b3207E8805
$$ 203178 177817 -220176 -67482 -55844 -329125 -252671 -244081 -144486 -59737 -23207 58805
18990A97186c86899B7690d56543B11548e1816k76452k0105Q405a29161N5181H135
$$ 197186 -386899 27690 -456543 211548 -51816 -328268 -348373 -339968 -129161 -73980 8135
18978c1045B70121A31529b8414A33173c3277B14711a6100G2780J43107O16499
$$ -31045 270121 131529 -28414 133173 -33277 214711 -16100 72780 215887 832386
18968H32386C27478i0767C3983P4317b12984A18737e0984j53206A04669a17334
$$ 832386 327478 -90767 33983 108300 -212984 118737 -50984 -204190 104669 -117334
18957i3039A93467i5518j86616k9471M3166a00477P850E6414c26517L3631h4240
$$ -93039 193467 -95518 -282134 -311605 -268439 -100477 -92627 56414 -326517 -292886 -84240
18945b89162a07967B42118e9685C7829L3120a92333D4810P7374B4507N8886d7780
$$ -289162 -107967 242118 -59685 37829 70949 -192333 44810 122184 24507 83393 -47780
18933D8639K85432d4641k72195O9766A59614b73337c4277m3425j5109b3082k96278
$$ 48639 334071 -44641 -316836 -247070 159614 -273337 -34277 -77702 -92811 -23082 -319360
18922c19360J21445a5991A78706F4155A8179P8308L6830b04805e418I8924g6318
$$ -319360 -197915 -15991 178706 64155 18179 96487 133317 -204805 -5418 98924 -76318
18910F2948a85702C48377P2682j06917P1950o7719c34960l0059D8560a02433a0449
$$ 62948 -185702 348377 421059 314142 386092 318373 -334960 -365019 48560 -102433 -10449
18898C539b05855p1436j46992g1617A12378C7998a39267k06812J7B88732F6072
$$ 3539 -205855 -277291 -424283 -71617 112378 37998 -139267 -346079 -346062 288732 66072
18886a88127k5206A39858c26937J27714A5124L3768e9670A42992K16444a34541
$$ -188127 -213333 139858 -326937 -199223 15124 48892 -59670 142992 359436 -134541
18875g1593j49187d5329j9388B47559M3932A3271Q9663a17691K6581K4756D4878
$$ -71593 -220780 -45329 -64717 247559 291491 13271 102934 -117691 -91110 -66354 44878
18863i9450k37369h0080n0281A7445b78551h8196k97622A83218D7868a27965A27008
$$ -99450 -336819 -80080 -130361 17445 -278551 -88196 -385818 183218 47868 -127965 127008
18851H5609b08248A41076i8828B51884a50623D5688b07718E6620J59221B3254
$$ 85609 -208248 141076 -98828 251884 -150623 45688 -207718 56620 215841 23254
18840I2281c59719A72878g7497l56177A26140b7642A19567a61340n864C0970c90523
$$ 92281 -359719 172878 -77497 -433674 126140 -27642 119567 -161340 -167204 30970 -390523
18828b66595E0350g470n9188k856A62127c38436d8086H3563l8522c49533E1342
$$ -266595 50350 -7470 -66658 -69514 162127 -338436 -48086 83563 45041 -349533 51342
18816C6902Q546K36901a6113A90756b20747G1021e5953B64996P5528j28925k7537
$$ 36902 45448 282349 -16113 190756 -220747 71021 -55953 264996 340524 211599 184062
18805A84062a52304C11596j35938b31058j70126i6148j3386A36298a03185j61396
$$ 184062 -152304 311596 175658 -231058 -401184 -96148 -109534 136298 -103185 -264581
18795b64581L9035F9919a4698k9769A45209d9502p110A50215i5687B4827O9370
$$ -264581 -225546 69919 -14698 -44467 145209 -49502 -56612 150215 -95687 24827 94197
18784I4197M68e9237A36432A1693L3031a01355q0776A58773b30144K8057j15742
$$ 94197 94665 -59237 136432 11693 44724 -101355 -182131 158773 -230144 -202087 -317829
18773c17829G9496P3504G0245A6989J92645a38208f6900B0410J11846M5970g0872
$$ -317829 79496 153000 70245 16989 209634 -138208 -66900 20410 132256 178226 -70872
18761a26741a9895j17107n2909n9060N3778B01289g3069o7838L7818H503a37199
$$ -126741 -19895 -137002 -189911 -248971 -195193 201289 -73069 -140907 -103089 8503 -137199
18749B16588F0960L270i3349G3222a96596G4131J31429c96136B6481b9009B37139
$$ 216588 60960 64230 -93349 73222 -196596 74131 205560 -396136 26481 -29009 237139
18737C48170d609k9899k38141j53963J91506A943O6490b19459j71675c4510k16737
$$ 348170 -4609 -34508 -272649 -426612 -235106 1943 68433 -219459 -391134 -34510 -251247
18726b51247N0801d9321D01177a03648E813K978e929A85297a18402E9941J20093
$$ -251247 -200446 -49321 401177 -103648 5813 8791 -5929 185297 -118402 59941 180034
18715A80034B1449K04654H6202m1285i766j24387j77783a04186b1374m39985A14534
$$ 180034 21449 226103 86202 44917 -9766 -134153 -311936 -104186 -21374 -461359 114534
18703g752l06060a2845k2811P292j99311B6620O3462e255A01064N837b71299a10556
$$ -7752 -313812 -12845 -35656 -28364 -227675 26620 90082 -5255 101064 106901 -271299 -110556
18690g1595o4088k31277a32700j54160b0417B54502o9249a80451F3363j9077J043
$$ -71595 -135683 -366960 -132700 -286860 -20417 254502 185253 -180451 63363 44286 45329
18679D5329K88895d3340B11160a07076e0461H8104a66597a4502k64938D4278b62669
$$ 45329 334224 -43340 211160 -107076 -50461 88104 -166597 -14502 -279440 44278 -262669
18667B5197K02597a36131A70913b47784e4204J8802l19880E37912A53161g0304
$$ 25197 227794 -136131 170913 -247784 -54204 -35402 -355282 537912 153161 -70304
18656B06697b60561f6416C59345B603b85616a08505o3491A6986c26990C19557
$$ 206697 -260561 -66416 359345 2603 -285616 -108505 -171996 16986 -326990 319557
18645E8645N3745R3692D1339M2577j2787i788n68313K15321B8574c09407N5939
$$ 58645 112390 206082 41339 83916 71129 -9788 -578101 -362780 28574 -309407 -253468
18634b53468B72087A11088a35031l36k35469O4502i2087M1277A6149b74136a21127
$$ -253468 272087 111088 -135031 -135367 -370836 -306334 -92087 -50810 16149 -274136 -121127
18622c90160A52469a97045o7g2931I6117D6869L69020a62008D55733b6264o9694
$$ -390160 152469 -197045 -197112 -72931 96117 46869 415889 -162008 455733 -26264 -95958
18611i5958m675B8592L2910M5924c57229I3110j6791a9666A8015R511a55952p2777
$$ -95958 -100633 28592 61502 107426 -357229 93110 76319 -19666 18015 27526 -155952 -228729
18599b28729A69564a39918K617k099d8704C12498d4532l4668k08172B7803J68733
$$ -228729 169564 -139918 -137301 -139400 -48704 312498 -44532 -79200 -287372 27803 196536
18588A96536c03013A40365a65653j63954j6193F6412J33176A8463D395K88604
$$ 196536 -303013 140365 -165653 -329607 -345800 66412 199588 18463 4395 292999
18578B92999a09448j7420k0029b4643k01225P3294p8787B21120c6309j76089H3846
$$ 292999 -109448 -126868 -146897 -24643 -225868 -152574 -231361 221120 -36309 -212398 83846
18566b2012j36819L4391k0795e8969p3395l2098N9146C8667d01148i1014l9438
$$ -22012 -158831 -124440 -145235 -58969 -132364 -164462 -105316 38667 -401148 -91014 -130452
18555a30452m8869O1077p408I9343a15434j01855A08418b83789I9228L09743f6749
$$ -130452 -179321 -118244 -125652 99343 -115434 -217289 108418 -283789 99228 408971 -66749
18543e3443A20096K29000B6860a77120H9736g5050c2223B17773b57875C8504A7093
$$ -53443 120096 349096 26860 -177120 89736 -75050 -32223 217773 -257875 38504 17093
18531C39341b38132j43668I2141b5177k16995B5171P180d09668D3834a96975F4925
$$ 339341 -238132 -381800 92141 -25177 -242172 25171 32351 -409668 43834 -196975 64925
18519a9309j88347D3842P1019N63895a12962I8979J5903P4529H6189c23765B3657
$$ -19309 -207656 43842 114861 678756 -112962 98979 114882 189411 86189 -323765 23657
18507C10150h9886l54636B4623P6328d1960j78401N9608k00053C398b10842C4227
$$ 310150 -89886 -444522 24623 100951 -41960 -220361 -160753 -360806 3398 -210842 34227
18495C5208J52363c29141d114j1631B60832b55827J25069m9769G5503b46065L2949
$$ 35208 187571 -329141 -4114 -15745 260832 -255827 -130758 -180527 75503 -246065 -213116
18484b13116g4808L6358H7772g4199A22131L7008e36468b37251i9706j68637a10372
$$ -213116 -74808 -38450 87772 -74199 122131 159139 -536468 -237251 -99706 -268343 -110372
18472A14524f722l0241B26056H3984a08496l33622a01710c709A70472H4450b10022
$$ 114524 -6722 -36963 226056 83984 -108496 -442118 -101710 -3709 170472 84450 -210022
18460A71877o2967N3654b05850c4162A55727b23115N9697A47394b556j46962G4428
$$ 171877 108910 162564 -205850 -34162 155727 -223115 -163418 147394 -2556 -149518 74428
18448D07312F3044c20347A68951a81447L8827A10669K8094a15449j34756R6094
$$ 407312 63044 -320347 168951 -181447 -142620 110669 138763 -115449 -250205 -154111
18438a54111L1402m0887A88309a74109m54245F7751a89832N9723c6320p1181a9693
$$ -154111 -122709 -163596 188309 -174109 -628354 67751 -189832 -130109 -36320 -107501 -19693
18426i0226j02434i3831l3364B1403a29536M8934j48695a4731j75427E8765j1471
$$ -90226 -192660 -93831 -127195 21403 -129536 -80602 -229297 -14731 -190158 58765 47294
18415D7294b78994G2455K26805A24920a46799N7906i742B64831F5581J28690h0569
$$ 47294 -278994 72455 299260 124920 -146799 -88893 -9742 264831 65581 194271 -80569
18403a15896r3170C5339R8084L1127J88469f4175a62k32074B2870g7572q1364
$$ -115896 -209066 35339 133423 164550 353019 -64175 -162 -232236 22870 -77572 -158936
18392a58936N855j8405p5735p574i6515A32731a88273k62426B41351b37584q6320
$$ -158936 -153081 -171486 -247221 -254795 -96515 132731 -188273 -450699 241351 -237584 -323904
18381c23904a5136C21937I9394f7434A29433n442F1745b85690i0369h735A18775
$$ -323904 -15136 321937 99394 -67434 129433 123991 61745 -285690 -90369 -8735 118775
18369A72613H3254a21868G013a11370A76940C3818Q7741a7784B2979O8257g2027
$$ 172613 83254 -121868 7013 -111370 176940 33818 121559 -17784 22979 91236 -72027
18357d0217p8084a7573k15460B91682i1006A83397g2826C8295a23320G4476e7373
$$ -40217 -118301 -17573 -233033 291682 -91006 183397 -72826 38295 -123320 74476 -57373
18345B38086c14683D32179A66546D7734P3919b02528F9710j5854j2629h5179E0048
$$ 238086 -314683 432179 166546 47734 121653 -202528 69710 53856 41227 -85179 50048
18333A7158K51604a6566j3066j96299B45305a01912A35043C7042j0926a57853
$$ 17158 268762 -16566 -29632 -225931 245305 -101912 135043 37042 26116 -157853
18322c6817A65171b38423B00515G7704f848G6125d2809A25285Q8145d3622I7005
$$ -36817 165171 -238423 200515 77704 -6848 76125 -42809 125285 213430 -43622 97005
18310C3078K2499g3847A2032a49094p5763O376A2533N6246J57045e4378B71460
$$ 33078 55577 -73847 12032 -149094 -224857 -218481 12533 68779 225824 -54378 271460
18298g9895G5762k1914A0736a1783G8138b53138h2635c3477n77265A09607d6732
$$ -79895 75762 53848 10736 -11783 78138 -253138 -82635 -33477 -610742 109607 -46732
18286I5884b5407j76628H1378J01992J50793A4177c67341d0045r9729g502B03683
$$ 95884 -25407 -202035 81378 183370 334163 14177 -367341 -40045 -139774 -7502 203683
18274A45558n5613e3044J7371C68300a56153L1201p6808A9665c73520R7985M9976
$$ 145558 89945 -53044 -35673 368300 -156153 -124952 -201760 19665 -373520 -275535 -225559
18263b25559B65609c28710e1928J033J9466J0311A55709f7471J5193k5493k11606
$$ -225559 265609 -328710 -51928 -50895 -31429 -21118 155709 -67471 -52278 -77771 -289377
18252b89377a42663A39212G685R1254c87053d3066C08794c2997D6805h8511B3110
$$ -289377 -142663 139212 7685 98939 -387053 -43066 308794 -32997 46805 -88511 23110
18240a68729A90560g1602B13282i3549D8139a07527A56013f1781j44294d7346
$$ -168729 190560 -71602 213282 -93549 48139 -107527 156013 -61781 -206075 -47346
18229c33467C66594B0873h951j29033n010j11512L2883e3636A2303e8507B28019
$$ -333467 366594 20873 -8951 -137984 -142994 -254506 -221623 -53636 12303 -58507 228019
18217a13443A82100h2011j32551a2973q1554k64031a58990n7078A85822K034A1577
$$ -113443 182100 -82011 -214562 -12973 -94527 -358558 -158990 -216068 185822 187856 11577
18205e05575a87688D4608d1123A83084A2277L6745a63804p5060q4270A6554R0073
$$ -505575 -187688 44608 -41123 183084 12277 49022 -163804 -238864 -323134 16554 106627
18194A06627a14864F7153e5273a464C17269H7833a81465h4520I7428I409i7395
$$ 106627 -114864 67153 -55273 -1464 317269 87833 -181465 -84520 97428 9409 -97395
18182a08260j70173J13948a3340D36042A58956F968a15424j00881Q3079b9327
$$ -108260 -278433 -164485 -13340 436042 158956 6968 -115424 -216305 -133226 -29327
18171b03739K8750C700j176f1321C97979c29573d556j80711O7569j07665o291
$$ -203739 -174989 3700 2524 -61321 397979 -329573 -4556 -185267 -117698 -225363 -231654
18160b31654C32280g7962j9228g890A16997k2642i8983j33213A14596D9812h4271
$$ -231654 332280 -77962 -97190 -7890 116997 94355 -98983 -232196 114596 49812 -84271
18148a43542j70954J37422E1029a27855I2213J40467b98859j8774A35803f1866
$$ -143542 -314496 -177074 51029 -127855 92213 232680 -298859 -317633 135803 -61866
18137a01938J8271B2338a42096B5259j2356h9874A0898J9194c86724F5137J02373
$$ -101938 -83667 22338 -142096 25259 12903 -89874 10898 30092 -386724 65137 167510
18126A67510M5879c19043B03040c43731a20240J95d492A74965a37101I3250O1859
$$ 167510 213389 -319043 203040 -343731 -120240 -120045 -4492 174965 -137101 93250 155109
18115A55109b45118D6797b95067i7790C22899b4522f791B05938K2411a51144k17699
$$ 155109 -245118 46797 -295067 -97790 322899 -24522 -6791 205938 228349 -151144 -368843
18104c68843a07206L9273B04346l7751f8007D4588c26482m8158J35351F4909J43948
$$ -368843 -107206 -67933 204346 166595 -68007 44588 -326482 -374640 -239289 64909 208857
18093B08857c72836A28633a51599C0675N3491C0232a06568E0445a85419K7996
$$ 208857 -372836 128633 -151599 30675 84166 30232 -106568 50445 -185419 -157423
18083a57423A37990l452a39996A91771g6880c6674H9229F640f827l52402c7793
$$ -157423 137990 134538 -139996 191771 -76880 -36674 89229 6640 -6827 -359229 -37793
18071c01567a31451k8020g5771j41186d3154J9926n2768r090j07272C14696a20057
$$ -301567 -131451 -159471 -75771 -216957 -43154 -23228 -75996 -85086 -192358 314696 -120057
18059B21342p3527a11008L7953j26690f6791K9252B78862c70257B74311a49918
$$ 221342 147815 -111008 -73055 -199745 -66791 -37539 278862 -370257 274311 -149918
18048A81694l5275a30367K2367b6382H1134J62427K2796n1943K6964a08799c6822
$$ 181694 146419 -130367 -108000 -26382 81134 243561 266357 214414 241378 -108799 -36822
18036B18570F2153N7916P4607C9550K8906b71583A04328c5631A62597n3436f2107
$$ 218570 62153 120069 194676 39550 68456 -271583 104328 -35631 162597 109161 -62107
18024A48430b2648F4533H599a85734p4584g9231K4878G9903N7994a41909F1761
$$ 148430 -22648 64533 8599 -185734 -260318 -79231 -54353 79903 137897 -141909 61761
18012E7375J28620o0628b7161A74474A9229Q0257N9150a19225C17793A22788D8156
$$ 57375 185995 125367 -27161 174474 19229 99486 158636 -119225 317793 122788 48156
18000A37060R9626J10413j58920q6859J7987P4308j4799O5284L0324G8051h0753
$$ 137060 236686 347099 188179 101320 119307 193615 178816 244100 274424 78051 -80753
17988D0213J39614C498b16517A78972K09026I4633b18891a751A5403b5934B3286
$$ 40213 179827 3498 -216517 178972 387998 94633 -218891 -1751 15403 -25934 23286
17976H2889a67110N9076A29253a15552B5480a39233D9524n175M262c29673B82220
$$ 82889 -167110 -108034 129253 -115552 25480 -139233 49524 44349 48611 -329673 282220
17964B90610l5032o9207b55798H4783a17282H4330L327a60669D4605a23468A35647
$$ 290610 255578 186371 -255798 84783 -117282 84330 87657 -160669 44605 -123468 135647
17952a2201l53752e7905k4656D4746e7424E3009a04954n5646P4229O570B36444
$$ -12201 -365953 -57905 -82561 44746 -57424 53009 -104954 -160600 -86371 -79801 236444
17940b10912A28480m5121L42678A11324J3611L8929f6199M18p4250A80398j7708
$$ -210912 128480 83359 426037 111324 124935 163864 -66199 -65781 -140031 180398 162690
17929A62690a87942e3614D0663a04654i471C07174j41521f421p643H7085f5076
$$ 162690 -187942 -53614 40663 -104654 -9471 307174 165653 -6421 -14064 87085 -65076
17917a09815j23654A42227i8253D3837L4674J82115l8692a66382g8825N313k41791
$$ -109815 -233469 142227 -98253 43837 78511 260626 221934 -166382 -78825 -73512 -315303
17906c15303I6495L68218A51786m6793a92409A23592m3707a95462D8171K49386
$$ -315303 96495 464713 151786 104993 -192409 123592 79885 -195462 48171 297557
17896B97557e9084B14678p3263D5345J40483E5937K8c19183B51450a15486L4336
$$ 297557 -59084 214678 141415 45345 185828 55937 55965 -319183 251450 -115486 -81150
17885h1150o5194A25518R6009R1257f5528A01240g5548j69808D492N8935c37404
$$ -81150 -146344 125518 221527 312784 -65528 101240 -75548 -245356 4492 63427 -337404
17873a81190A50627d33466I5703a11916A31126I314i8384B34657c9301k6258j88752
$$ -181190 150627 -433466 95703 -111916 131126 9314 -98384 234657 -39301 -65559 -254311
17862b54311E4132a44891d6724j9318j27198C9201L51112g9022A29922R5751A07199
$$ -254311 54132 -144891 -46724 -66042 -193240 39201 390313 -79022 129922 225673 107199
17850A9674J05268J2652B887L88365j80758G156R2841J37677A9368R7217e1888
$$ 19674 124942 137594 2887 391252 210494 7156 99997 237674 19368 116585 -51888
17838f2506m21130A266J71930K8920a14854F5675M2305Q1188p7368J59438L7349
$$ -62506 -483636 1266 173196 202116 -114854 65675 107980 189168 111800 271238 308587
17827C08587n8569A11066b2347B88935a58183A20956K0740b770B30840g9612j55208
$$ 308587 250018 111066 -22347 288935 -158183 120956 141696 -2770 230840 -79612 -234820
17816b34820A83346L1210r3449b14113B644a55803A73701Q2904a2485B26283a1634
$$ -234820 183346 214556 121107 -214113 2644 -155803 173701 256605 -12485 226283 -11634
17804c0089A61921G7886L17580b1313j52597G481a9655r3366G4592K10212F2063
$$ -30089 161921 77886 395466 -21313 -173910 7481 -19655 -113021 74592 284804 62063
17792a52074C5764f3856I9122f3379o551a784r3346c7311A2451a1856k22260e1558
$$ -152074 35764 -63856 99122 -63379 -69930 -1784 -95130 -37311 12451 -11856 -234116 -51558
17779D2762J15110J09175m5727J3288H8680a65478k1066H7529c11882R2362A6306
$$ 42762 157872 267047 221320 234608 88680 -165478 -186544 87529 -311882 -219520 16306
17767A11051b39011B5652K06979I008a59171A49942a33567A13844a1202k5613
$$ 111051 -239011 25652 232631 9008 -159171 149942 -133567 113844 -11202 -36815
17757c6815B04838H423b14911C1140i8889B08618G0194J13980P5600K71011i2112
$$ -36815 204838 8423 -214911 31140 -98889 208618 70194 184174 259774 530785 -92112
17745c9633B16893n0328L65731B31189L8867q7734q7276L83078A11235a75878
$$ -39633 216893 166565 532296 231189 270056 182322 95046 478124 111235 -175878
17734b85897A2502N4998b27396J01773A88717d6868D8685h8326h5n6664B32478
$$ -285897 12502 67500 -227396 -125623 188717 -46868 48685 -88326 -85 -56749 232478
17722A63274D9817L35340c6986k53621A16193i1890A46918e2701B09031L10986
$$ 163274 49817 385157 -36986 -290607 116193 -91890 146918 -52701 209031 520017
17712E20017b28682B26661b92435f6421A60786O7872p5553J30449H1436e2999
$$ 520017 -228682 226661 -292435 -66421 160786 228658 153105 283554 81436 -52999
17701A41675c69110B19960r9415N8829K56723j44690H6345J28740F7705K11456
$$ 141675 -369110 219960 120545 179374 436097 291407 86345 215085 67705 279161
17691B79161b3828o627G5054h3775D05838A48155b51623B25555K1149A09364c4712
$$ 279161 -23828 -30455 75054 -83775 405838 148155 -251623 225555 246704 109364 -34712
17679A62531l9054j3537a45870N4958k31416B6742j2606J48978j6983J37607a8577
$$ 162531 123477 109940 -145870 -90912 -322328 26742 14136 163114 146131 283738 -18577
17667B89655b5489l0171a4467j34453F32362H235K50772J29211A44427l2915b48731
$$ 289655 -25489 -55660 -14467 -148920 632362 8235 259007 388218 144427 111512 -248731
17655A22903R9957c0962q8920H9936P3722b8848p6401B05890J27111j24654L9343
$$ 122903 222860 -30962 -119882 89936 163658 -28848 -105249 205890 333001 208347 247690
17644B47690j7996b94346d7904B97494A33010m9179a76654O5991c1512k895A52715
$$ 247690 229694 -294346 -47904 297494 133010 83831 -176654 -110663 -31512 -34407 152715
17632D5360J0067C178L31929A4073M27320c06920G9671a1074B95282m0609H9878
$$ 45360 55427 3178 335107 14073 441393 -306920 79671 -11074 295282 254673 89878
17620c5851I9375b11146C12126J20310b10249d0640B06958e8525C8744L22369
$$ -35851 99375 -211146 312126 432436 -210249 -40640 206958 -58525 38744 361113
17610C61113A75210c68417E2505L6230b03438P2401B13033J65951j76739G6505
$$ 361113 175210 -368417 52505 88735 -203438 -131037 213033 378984 202245 76505
17599C36489a08000B24386n5899o4512j5338J04966c72222B58765J5434J5736
$$ 336489 -108000 224386 168487 103975 88637 193603 -372222 258765 274199 289935
17589B89935a25415k08632G8000Q1674K5214G9913C6442f0231C22160l8622q5394
$$ 289935 -125415 -334047 78000 159674 184888 79913 36442 -60231 322160 283538 198144
17578A98144o619a24263A86624o0836K51970A17569P6182a1611E19128H1946B955
$$ 198144 191525 -124263 186624 125788 377758 117569 193751 -11611 519128 81946 2955
17566C74262E3090K52540a0961E5761K62533o2130A1053a21356A08695M99422
$$ 374262 53090 305630 -10961 55761 318294 256164 11053 -121356 108695 608117
17556F08117G3794L97511j15987l0869A08058k70o883K61571a17673A08605R8025
$$ 608117 73794 471305 355318 324449 108058 107788 100905 362476 -117673 108605 206630
17545B06630K10535A53057K16260j34950n7903g8472J2871B12013K32059b04685
$$ 206630 417165 153057 369317 234367 176464 -78472 -65601 212013 444072 -204685
17534g2440o333A06759A9879L44640A237L56587m8307J37437l83J26063K13377
$$ -72440 -78773 106759 19879 364519 1237 357824 309517 446954 446571 572634 786011
17523G86011K22298k7768k09890k62602k29331F9478N24559B43357J33002j80955
$$ 786011 1008309 980541 770651 508049 278718 69478 594037 243357 376359 195404
17513A95404K11188M0972K17889J05095K18221L21958J489m43884k20568N1400
$$ 195404 406592 447564 665453 770548 988769 1310727 1312216 868332 647764 699164
17503F99164A67971L58940A83951p3048L72294o0546j70192A24124K6310J38452
$$ 699164 167971 526911 183951 110903 483197 422651 252459 124124 150434 288886
17493B88886j31146b2626A3201R1672j0908Q3823C770O8657K95936j26952K34538
$$ 288886 157740 -22626 13201 104873 93965 177788 3770 72427 368363 241411 475949
17482D75949B05698O26720l89707A16295L82025J59120o8344B78278j11793n4978
$$ 475949 205698 832418 442711 116295 498320 657440 589096 278278 166485 111507
17472A11507J23003K14821j48987j32327K22954d1589B1452K03661L1651a3869
$$ 111507 234510 449331 300344 168017 390971 -41589 21452 225113 256764 -13869
17461D39214r3549Q9650A76601g1207D38282A75333c34906D94017j3010A50205
$$ 439214 345665 435315 176601 -71207 438282 175333 -334906 494017 481007 150205
17450C09086q1057o144L46718k34133K28747j6784k50699M04834A03936K37504
$$ 309086 228029 221885 568603 334470 563217 546433 295734 700568 103936 341440
17440C41440J42971l4781J09227j49055K1435J4816A37274M30151j40861f8962
$$ 341440 484411 449630 558857 409802 431237 446053 137274 567425 426564 -68962
17429F69115B83453K43905A39129N5359D3350M17063k27510P5462E9579L12590
$$ 669115 283453 527358 139129 194488 43350 460413 232903 308365 59579 372169
17419C72169L0257h248C51951j05622j22909J62210M41740A02225M09968j05451
$$ 372169 402426 -8248 351951 246329 123420 285630 727370 102225 512193 406742
17409D06742A99355L2854K68283j57476A67938J13568I3628j6159m417a7573j19412
$$ 406742 199355 232209 500492 343016 167938 281506 93628 77469 73052 -17573 -136985
17398a36985A67778L82252G6844O7779L74602A05426J96227L3929A46720J87447
$$ -136985 167778 550030 76844 144623 519225 105426 301653 335582 146720 334167
17388C34167j03943J14517n0912A16771J43854m2897H9889M39643G0100L31574
$$ 334167 230224 344741 293829 116771 260625 217728 89889 529532 70100 401674
17378D01674R5135j75789K1564j9036O7272O6782n8142p5613j33637j6917J20492
$$ 401674 496809 321020 342584 323548 390820 457602 399460 323847 190210 173293 293785
17367B93785I876J03406K5953m3726b9328A2342a22851A48236K06450A73759l9732
$$ 293785 9876 113282 139235 95509 -29328 12342 -122851 148236 354686 173759 134027
17356A34027K96404F3822d6147A13855g2831B83878J83263F2405K76134j47180
$$ 134027 430431 63822 -46147 113855 -72831 283878 467141 62405 338539 191359
17346A91359J8823r0323b80540C83035i1162C42486M1181j09196N0666k5280K35246
$$ 191359 210182 119859 -280540 383035 -91162 342486 383667 274471 325137 299857 535103
17335E35103A37584D0890L02365A11750E1698N9534i0766D77382n2525j50282
$$ 535103 137584 40890 343255 111750 51698 111232 -90766 477382 424857 274575
17325B74575J01042Q4653E1159L21890A04758c6024B3173g4833B31065b2010B64628
$$ 274575 375617 460270 51159 373049 104758 -36024 23173 -74833 231065 -22010 264628
17313C75437r5273n0264A10799K40739A6129M13941G5018L41275l4555N0979j41942
$$ 375437 280164 229900 110799 351538 16129 430070 75018 416293 381738 432717 290775
17302B90775q4776N5839k6420n2262a1271A3946N16161A64711g163C74956a32666
$$ 290775 205999 261838 235418 183156 -11271 13946 530107 164711 -7163 374956 -132666
17290a57341E65678k00982m5829R7723A39118J86632j11094L9957N9304J65489
$$ -157341 565678 364696 318867 416590 139118 325750 214656 254613 313917 479406
17280D79406j19723j52733Q4633o1406L4706n2953J35052D5831Q997K37890O4512
$$ 479406 359683 206950 291583 230177 264883 211930 346982 45831 54828 292718 357230
17269C57230N2558l2404m0874C4119P15518a27164B61968J16341o7633F7709L7743
$$ 357230 409788 377384 336510 34119 749637 -127164 261968 378309 310676 67709 105452
17258A05452J74870J38616K22843k43005A17892J31332J79246A86952J56649n8214
$$ 105452 280322 418938 641781 398776 117892 249224 428470 186952 343601 285387
17248B85387m4566j5474J04534j3742J18108o0343j34920K03399j08370A40318
$$ 285387 240821 225347 329881 316139 434247 373904 238984 442383 334013 140318
17237E13441j49987M0685J80781o21B75193L9991K60598j46205J1975O4789j30822
$$ 513441 363454 404139 584920 584299 275193 315184 575782 429577 441552 506341 375519
17226C75519J88382k09885E8943L58587J4194H7791Q1505M33118A14593J73249
$$ 375519 563901 354016 58943 417530 431724 87791 169296 602414 114593 287842
17216B87842J41119L4615k02308J07958J56647j46424M07041k06786O3909A83280
$$ 287842 428961 463576 261268 369226 525873 379449 786490 579704 643613 183280
17205B59866J95507A18808M00315A92176K40295B3186O38423k35997L65209j36146
$$ 259866 455373 118808 519123 192176 432471 23186 661609 425612 790821 654675
17195F54675B90133J37398M3355j63858A34840K52037J04930B30576J06057A52231
$$ 654675 290133 427531 470886 307028 134840 386877 491807 230576 336633 152231
17184B54084L28309m8074n5798O7105A51322M70795k86812L06307C09450K58015
$$ 254084 582393 534319 478521 545626 151322 622117 335305 641612 309450 567465
17174E67465k05755A69877J39248L09840j63967J8785k19453K91916k30846J01499
$$ 567465 361710 169877 309125 618965 454998 473783 254330 546246 315400 416899
17164D16899K58347j84126B17047M14320l09458l8989m0151N69387B68457M2695
$$ 416899 675246 491120 217047 631367 321909 282920 242769 812156 268457 311152
17154C11152j0185j02802L71028j66684q9769J95203m9524l4821J93389j9628
$$ 311152 300967 198165 569193 402509 312740 507943 458419 423598 616987 597359
17144E97359j84713P1332j18951j48659L87324B75493K03805m2580p985L07869
$$ 597359 412646 483978 365027 216368 603692 275493 479298 436718 428733 736602
17134G36602l25673Q8636J00834R7862B45307L38573j76564J81619J50650l891
$$ 736602 410929 499565 600399 698261 245307 583880 407316 588935 739585 735694
17124G35694k52984j44560O05286l62620P259K8578J05436C07995L75286A87041
$$ 735694 482710 338150 943436 580816 588075 616653 722089 307995 683281 187041
17113E85284O4109O6572n0105k07901K60710k36973M1832J74703j263k10843O4593
$$ 585284 649393 715965 665860 457959 718669 481696 523528 698231 696968 486125 550718
17102E50718J22580J4504R2362p975J03523k60970k3494M2627N6291m5361j75595
$$ 550718 673298 687802 780164 772189 875712 614742 591248 633875 690166 644805 469210
17091D69210L01314j58437n9481J57754k88618J94548p0085J38706K48092j58593
$$ 469210 770524 612087 552606 710360 421742 616290 546205 684911 933003 774410
17081G74410k6133p0244K94471B81565M36872l16699L04034B65940L79953J20505
$$ 774410 748277 678033 972504 281565 718437 401738 705772 265940 645893 766398
17071G66398J35917l82293l1369J55067K44393l57343r436M12336k9983C92333
$$ 766398 902315 520022 488653 643720 888113 530770 521334 933670 903687 392333
17060F59102L05242D08800K38242j7538k1362L68176m43821j75262M42914J08429
$$ 659102 964344 408800 647042 629504 608142 976318 532497 357235 800149 908578
17050I08578N0876k09179k07709J54177J94746j66229N3617J82938J0844j99226
$$ 908578 959454 750275 542566 696743 891489 725260 778877 961815 972659 773433
17040G73433L03848l56516L42844m50352k7022K70031j2577M9683M1950J3334
$$ 773433 1077281 720765 1063609 613257 586235 856266 843689 893372 935322 948656
17030I48656D37076M78557J54901m40720K14367j46954K90442k49428K85235j03528
$$ 948656 437076 915633 1070534 629814 844181 697227 987669 738241 1023476 919948
17020I19948M7918J12647m43284J83410Q2314m952J27404j68814M27306j50376
$$ 919948 967866 1080513 637229 820639 902953 898001 1025405 856591 1283897 1133521
17010A133521O5105l18677j06767O3037M86651k28290J67163N1989m07647K72959
$$ 1133521 1198626 879949 773182 836219 1322870 1094580 1261743 1313732 906085 1179044
17000A179044l02757J44495J00915l09338O1159k6122K98614j55502J47445n6790
$$ 1179044 876287 1020782 1121697 812359 873518 847396 1146010 990508 1137953 1081163
16990A081163P4230J52612k8717K12034l26381j17375m95m2464K57844L40229
$$ 1081163 1155393 1308005 1279288 1491322 1164941 1047566 1047071 1004607 1262451 1602680
16980A602680l58280K2061p6693K5041P4248k9671J46917N5975k43759K46034
$$ 1602680 1244400 1266461 1189768 1214809 1289057 1259386 1406303 1462278 1218519 1464553
16970A464553j8787j13143J82447j83285J67583l60388K34751k7976k55138K02225
$$ 1464553 1445766 1332623 1515070 1331785 1499368 1138980 1373731 1345755 1090617 1292842
16960A292842J21694R1587k02390K34285J25073k82282J47093j07671N73100m33082
$$ 1292842 1414536 1506123 1303733 1538018 1663091 1380809 1527902 1420231 1993331 1560249
16950A560249K23565K25306m35611j79191L09507J09492K31468k67591k43300
$$ 1560249 1783814 2009120 1573509 1394318 1703825 1813317 2044785 1777194 1533894
16941A533894J3962K04899j34437P6422K88788j21638k8891m78070K18853J98146
$$ 1533894 1547856 1752755 1618318 1694740 1983528 1861890 1832999 1354929 1573782 1771928
16931A771928K25367o8122l44980M91424k98847J07295L2616j85713M50928O9275
$$ 1771928 1997295 1929173 1584193 2075617 1776770 1884065 1916681 1730968 2181896 2251171
16921B251171k60401l69291N72453l4123K97189j74652j97492l4205O0577J26198
$$ 2251171 1990770 1621479 2193932 2159809 2456998 2282346 2084854 2050649 2111226 2237424
16911B237424L5190J86700j05618j88408K56722J98929j75011K02995l01100l5198
$$ 2237424 2272614 2459314 2353696 2165288 2422010 2620939 2445928 2648923 2347823 2312625
16901B312625K03899l43695K95719J6078j3939J59529j19515L85385k14993O5263
$$ 2312625 2516524 2172829 2468548 2484626 2470687 2630216 2510701 2896086 2681093 2746356
16891B746356j02707K08164q4844J08552J09431l1342j51342L98968m02173R7950
$$ 2746356 2643649 2851813 2766969 2875521 2984952 2953610 2802268 3201236 2799063 2897013
16881B897013l8946L32666j22526K04842R6486M1713j06308M8407J25379l10336
$$ 2897013 2858067 3190733 3068207 3273049 3369535 3411248 3304940 3353347 3478726 3168390
16871C168390J87959N33911n30638L77602k37795K91258m4769j01819L90003k15335
$$ 3168390 3356349 3890260 3359622 3737224 3499429 3790687 3745918 3644099 4034102 3818767
16861C818767l576K21861N1951K52657r9799r477n4840J10695N35555m09391j67851
$$ 3818767 3815191 4037052 4089003 4341660 4241861 4232384 4177544 4288239 4823794 4414403 4246552
16850D246552O6813M2863L08286L97224j81617J22634K02615M4217L1312M7316
$$ 4246552 4313365 4356228 4664514 5061738 4880121 5002755 5205370 5249587 5280899 5328215
16840E328215L40768P1234k71552K68079J70009K31239k51544N88068j56849n9206
$$ 5328215 5668983 5740217 5468665 5736744 5906753 6137992 5886448 6474516 6317667 6258461
16830F258461K22376K65894R9771r1194R1978L50871J5935Q227M11835K23151
$$ 6258461 6480837 6746731 6846502 6755308 6847286 7198157 7214092 7222319 7634154 7857305
16820G857305J6854L18583L0640k0360J12295K6382L81475L83705j76592M23611
$$ 7857305 7874159 8192742 8223382 8203022 8315317 8341699 8723174 9106879 8930287 9353898
16810I353898K18840J6444M53658p0043M49479J87447K74043j26985J23017O37015
$$ 9353898 9572738 9589182 10042840 9972797 10422276 10609723 10883766 10756781 10879798 11516813
16800A1516813j27025N81319J19351N91913M00086K87274k157P06659J14682L08652
$$ 11516813 11389788 11971107 12090458 12682371 13082457 13369731 13367574 14074233 14188915 14497567
16790A4497567M19161k86106Q60146L51521L73879M14857M89831M64001K91276
$$ 14497567 14916728 14630622 15490768 15842289 16216168 16631025 17120856 17584857 17876133
16781A7876133P54098N67026R06700P0405Q01649N08494P67628P76685O80194
$$ 17876133 18630231 19197257 20103957 20174362 20976011 21484505 22252133 23028818 23709012
16772B3709012M75058Q57647N81034R74211P36415J034785O91487J236697R65455
$$ 23709012 24184070 25041717 25622751 26596962 27333377 28368162 29059649 30296346 31261801
16763C1261801J158710R92648J172333J330539J250407J168337J450270J713262
$$ 31261801 32420511 33413159 34585492 35916031 37166438 38334775 39785045 41498307
16755D1498307J605294J327818K010415J621354K031745J464803K007353K548048
$$ 41498307 43103601 44431419 46441834 48063188 50094933 51559736 53567089 56115137
16747E6115137J874866K556534K204683K648855K359181K515570L325615J911710
$$ 56115137 57990003 60546537 62751220 65400075 67759256 70274826 73600441 75512151
16739G5512151L491840L042807L230635K538432L255109L565329L032953K909362
$$ 75512151 79003991 82046798 85277433 87815865 91070974 94636303 97669256 100578618
16731A00578618K999177L239584K937072K360100K409430K285095K294649J791651
$$ 100578618 103577795 106817379 109754451 112114551 114523981 116809076 119103725 120895376
16723A20895376J481374R15775O35495Q52211M5755r09247k14012j275527j212230
$$ 120895376 122376750 123292525 123928020 124780231 124825986 123916739 123702727 122427200 121214970
16714A21214970j649718j843224k740652k671765k427061k577588l199669k991587
$$ 121214970 119565252 117722028 114981376 112309611 109882550 107304962 104105293 101113706
16706A01113706l113693l097682l098665l316745l395411k747479k990943k981768
$$ 101113706 98000013 94902331 91803666 88486921 85091510 82344031 79353088 76371320
16698G6371320l297476k803291k333012k635201k721843k339220k678478k085794
$$ 76371320 73073844 70270553 67937541 65302340 62580497 60241277 57562799 55477005
16690E5477005k001440k025050k019540j814840j788536j630279j795728j579781
$$ 55477005 53475565 51450515 49430975 47616135 45827599 44197320 42401592 40821811
16682D0821811j204435j610696j264131j492342j216832j370375q08876j005059
$$ 40821811 39617376 38006680 36742549 35250207 34033375 32663000 31854124 30849065
16674C0849065j095516j181187o42974r96314r16930p13991j002202p59607q72523
$$ 30849065 29753549 28572362 27929388 26933074 26016144 25302153 24299951 23540344 22667821
16665B2667821l82654p28352j006211l55926o63028j46239q01025n26648o17317
$$ 22667821 22285167 21556815 20550604 20194678 19531650 19385411 18584386 18057738 17440421
16656A7440421n19082l35745n99503L0336p04442j52137p52601l00635l53919
$$ 17440421 16921339 16585594 15986091 16016427 15311985 15159848 14407247 14106612 13752693
16647A3752693n3204l68536m88705j04900o03237m81839R0096j79037j89783q46971
$$ 13752693 13699489 13330953 12842248 12737348 12134111 11652272 11742368 11563331 11373548 10526577
16637A0526577L21335o18845r9180m00284R1606k59107k13100n03305J24438m34268
$$ 10526577 10847912 10229067 10129887 9729603 9821209 9562102 9349002 8845697 8970135 8535867
16627H535867q0904P6646M0356j42402l61603n84928K34954m12328K37381l33472
$$ 8535867 8454963 8531609 8571965 8429563 8067960 7483032 7717986 7305658 7543039 7209567
16617G209567n055l15586j57782M6923R5933l90756J74266l91817j17314K74286
$$ 7209567 7204512 6888926 6731144 6778067 6874000 6483244 6657510 6265693 6148379 6422665
16607F422665m60406m57151L27991k10805j2947m7833j16177J7190j40590k74962
$$ 6422665 5962259 5505108 5833099 5622294 5609347 5561514 5445337 5462527 5321937 5046975
16597E046975K15616q710l09940k37761p3113J79564J29661k48428l31131j72160
$$ 5046975 5262591 5253881 4943941 4706180 4633067 4812631 4942292 4693864 4362733 4190573
16587D190573J17672j22471q2910j99176K21642k79891r2905K56410k15550j39435
$$ 4190573 4308245 4185774 4102864 3903688 4125330 3845439 3752534 4008944 3793394 3653959
16577C653959M53082l63172K28409o02891K47760M04037r5605k39192M3862k45737
$$ 3653959 4107041 3743869 3972278 3369387 3617147 4021184 3925579 3686387 3730249 3484512
16567C484512k63001Q4826J23548j21957k49286N31345n48727N6477k58942L36508
$$ 3484512 3221511 3306337 3429885 3307928 3058642 3589987 3041260 3097737 2838795 3175303
16557C175303N3596n66673K22617k23899k4164K93092m53046J4560K44181J02831
$$ 3175303 3228899 2662226 2884843 2660944 2636780 2929872 2476826 2491386 2735567 2838398
16547B838398k77919Q808J00872l09658J246o3083j07499M42133l66324J6624
$$ 2838398 2560479 2569287 2670159 2360501 2361747 2298664 2191165 2633298 2266974 2283598
16537B283598r3291K30093l00314K80590k69021K48132J7562k53033J25702k2625
$$ 2283598 2190307 2420400 2120086 2400676 2131655 2379787 2397349 2144316 2270018 2247393
16527B247393J62287l50740o6102P7337q833J61420j9521l43471n2029J22871
$$ 2247393 2409680 2058940 1992838 2070175 2061342 2222762 2203241 1859770 1807741 1930612
16517A930612n0917L60315m94667K17239l2651m32670M36675m51875K10229J2946
$$ 1930612 1879695 2240010 1745343 1962582 1929931 1497261 1933936 1482061 1692290 1705236
16507A705236n716J18183l4515k35754P2432J92739o3114m32821K21218L7642
$$ 1705236 1699520 1817703 1783188 1547434 1619866 1812605 1749491 1316670 1537888 1575530
16497A575530J22418j53842J4245K6480k14486O6426J42624k01396L50684q0208
$$ 1575530 1697948 1544106 1558351 1584831 1370345 1436771 1579395 1377999 1728683 1648475
16487A648475j85713n664r0l07563k00820L78653K2636J46974J5444j25550Q064
$$ 1648475 1462762 1457098 1457008 1149445 948625 1327278 1349914 1496888 1512332 1386782 1394846
16476A394846k71734M05849m07411J68840K72417J27131k45384m1913j32223J91008
$$ 1394846 1123112 1528961 1121550 1290390 1562807 1689938 1444554 1402641 1270418 1461426
16466A461426n41304L12243j63503K8388J63596l9466J45649m3190J55359l69053
$$ 1461426 920122 1232365 1068862 1097250 1260846 1221380 1367029 1323839 1479198 1110145
16456A110145J09792k92273L48080F12502N60997m9070k53390K06977J55926J48231
$$ 1110145 1219937 927664 1275744 612502 1173499 1124429 871039 1078016 1233942 1382173
16446A382173m09330q6536p5802K24722j62211J00716l695J20754j53499K48683
$$ 1382173 972843 886307 810505 1035227 873016 973732 970037 1090791 937292 1185975
16436A185975l5328j35625R851J98494k54248l927m273J99968Q6714K27316F17375
$$ 1185975 1150647 1015022 1024873 1223367 969119 965192 960919 1160887 1247601 1474917 617375
16424H31638j74523M22514k45149L2156m3851Q3142P2064l57529J20255K06179
$$ 831638 657115 1079629 834480 866636 822785 905927 977991 620462 740717 946896
16414I46896j21036J80348j48742l09213K87263j0458j45793K03267j63151M12718
$$ 946896 825860 1006208 857466 548253 835516 825058 679265 882532 719381 1132099
16404A132099m41547j2017K30682j15608L42360j16588D95500J42952J15672J64201
$$ 1132099 690552 678535 909217 793609 1135969 1019381 495500 638452 754124 918325
16394I18325l56873M75524m61494M82312C71244R237K00063N58947m79903l2929
$$ 918325 561452 1036976 575482 1057794 371244 380481 580544 1139491 659588 626659
16384F26659K16209J76998j55365j21100R3179l10497J02968m7193J59921j63790
$$ 626659 842868 1019866 864501 743401 836580 526083 629051 581858 741779 577989
16374E77989j34381K57952j21199j93715p5388M22070j53950K04928C68014K67142
$$ 577989 443608 701560 580361 386646 311258 733328 579378 784306 368014 635156
16364F35156k75227N90453R5222D72253J9552P3819J1906L89117k71333k19900
$$ 635156 359929 950382 1045604 472253 491805 565624 577530 966647 695314 475414
16354D75414O3614B66206M68297k07691l081K98752C24790M53624l43612j16033
$$ 475414 539028 266206 734503 526812 523731 822483 324790 778414 434802 318769
16344C18769O70452D90437J45551k54091k908K52956p3128Q1650l8687K53012
$$ 318769 989221 490437 635988 381897 378989 631945 558817 640467 601780 854792
16334H54792C20654J9114j7025J94227K4018K34533l10343J22914r8819j28951
$$ 854792 320654 339768 322743 516970 540988 775521 465178 588092 489273 360322
16324C60322O9565L0332K83174j93426o7481L16069I1091K16488r953O8751A42656
$$ 360322 429887 460219 743393 549967 482486 798555 91091 307579 297626 366377 142656
16312A82581R7615K34510R4309j23379J58876j0407C10263L72986C17501k1432
$$ 182581 280196 514706 609015 485636 644512 634105 310263 683249 317501 296069
16302B96069K02106j98199L40115k41563l0696P0373K98782B6547M51011A63354
$$ 296069 498175 299976 640091 398528 367832 438205 736987 26547 477558 163354
16291D14664P600K42619k99733J49094k26763J69838R0612K7675m1705k37802
$$ 414664 422264 664883 365150 514244 287481 457319 547931 575606 533901 296099
16281B96099L36266B04713M9265o2661N57739k87022A65364J82450K005J52899
$$ 296099 632365 204713 253978 191317 749056 462034 165364 347814 349819 502718
16271E02718M4362I8036J49599J23112K09592B50110J50636m9813l5720m5319
$$ 502718 547080 98036 247635 370747 580339 250110 400746 350933 315213 269894
16261B69894j25960J68114M8371p2606j18822K61649j99322K72212A48732J22888
$$ 269894 143934 312048 360419 287813 168991 430640 231318 503530 148732 271620
16251B71620Q2840K50411J9125B91817b4585D04667B5861J55697J05673K5707
$$ 271620 354460 604871 623996 291817 -24585 404667 25861 181558 287231 312938
16241C12938L6345J44846j74953K14358A66904a3156E20663q5444k01336N7411
$$ 312938 349283 494129 319176 533534 166904 -13156 520663 435219 233883 291294
16231B91294R3741A33423P0527J82438p1935F5276d3381D93557B45872q3624J18103
$$ 291294 385035 133423 203950 386388 314453 65276 -43381 493557 245872 162248 280351
16220B80351A09014J48254K84134A18474J78593M7787C258L92518j06227N3696
$$ 280351 109014 257268 541402 118474 297067 344854 3258 395776 289549 343245
16210C43245A62247J93691K1899F6597l2147K20672J30549N350J1783k8146j51524
$$ 343245 162247 355938 377837 66597 34450 255122 385671 391021 402804 374658 223134
16199B23134b9008D9354L49745J99935k74454L4010r2308D9943K21482D9619K35204
$$ 223134 -29008 49354 399099 599034 324580 358590 266282 49943 271425 49619 284823
16188B84823A01416J99779O4783F3771J31204l267L68813B42449P210K9498d4676
$$ 284823 101416 301195 365978 63771 194975 191708 560521 242449 249659 279157 -44676
16176B81627q3904K84174I4951L00534F2795L25465A3244L2800J44678K2120G5811
$$ 281627 197723 481897 94951 395485 62795 388260 13244 46044 190722 212842 75811
16164A92589a89979E5892c146A22379I652e3230A93377J7162K3545k2466G034
$$ 192589 -189979 55892 -3146 122379 9652 -53230 193377 210539 234084 211618 7034
16152C308K87219I8704K96072b53194C59732J93313a8135j88980B74832a1445
$$ 3308 290527 98704 394776 -253194 359732 553045 -18135 -207115 274832 -11445
16141C95694j26963D2874j3878J80299m8061L0023K05937D5212R2564n49K54743
$$ 395694 268731 42874 28996 209295 161234 191257 397194 45212 137776 137227 391970
16130C91970a24741b213C21418H4886J35900H7413B1015Q8709b28020A63451J1861
$$ 391970 -124741 -2213 321418 84886 220786 87413 21015 109724 -228020 163451 175312
16119A75312l8198L3164l7558M936f2761l935B06878Q1622m8748r7079n8154O6786
$$ 175312 137114 170278 132720 137656 -62761 -66696 206878 288500 239752 142673 84519 151305
16107A51305B3642L18791C2557K35036J47215F3020J47600M6098a08558k42442
$$ 151305 23642 342433 32557 267593 414808 63020 210620 256718 -108558 -351000
16097c51000O8460K7841h1565B7027J50671P9010C8720J56406l7266B3426J73272
$$ -351000 -282540 -254699 -81565 27027 177698 256708 38720 195126 157860 23426 196698
16086A96698K1535o5584p4691C7572L22712f460C9432K4926b6774O374F6496K44459
$$ 196698 218233 152649 77958 37572 360284 -6460 39432 64358 -26774 -20400 66496 310955
16074C10955b6560j70806B62957A00046b65731b1079B82856b82608B9625N67027
$$ 310955 -26560 -197366 262957 100046 -265731 -21079 282856 -282608 29625 596652
16064E96652e6474p1299A60621Q9909a09988A0399b64198J05554B28517m194l3919
$$ 596652 -56474 -127773 160621 250530 -109988 10399 -264198 -158644 228517 224323 190404
16053A90404r1291b15609e3598B17701l6224F9632a42861B95255G0580a67286
$$ 190404 99113 -215609 -53598 217701 181477 69632 -142861 295255 70580 -167286
16042G422K36901e2717r0310A76710F651M20213F0276L96472p6127E4537J48497
$$ 7422 244323 -52717 -143027 176710 6651 426864 60276 456748 380621 54537 203034
16031B03034J22328D8769P8880k2358l8869J61073L9291j21734a40303B13550
$$ 203034 325362 48769 127649 105291 66422 227495 266786 145052 -140303 213550
16020F3335J03436N8050A6601K37696i4129L6474p0214f3237m9283L7352j33952
$$ 63335 166771 224821 16601 254297 -94129 -57655 -127869 -63237 -112520 -75168 -209120
16009b09120n148R976A8073c9674a486j56787I5656j7870a45614a372B53779P9136
$$ -209120 -214268 -204292 18073 -39674 -1486 -158273 95656 77786 -145614 -1372 253779 332915
15997C32915d16824d3445F1659a67807Q3088A00230b93107D7623b28963D31522
$$ 332915 -416824 -43445 61659 -167807 -84719 100230 -293107 47623 -228963 431522
15986E64748K77048N27267k95725M05568G08870l16817l535f8705j04645C17299
$$ 564748 841796 1369063 1073338 1478906 708870 392053 388518 -68705 -173350 317299
15975C02647A07928J87759E607Q5015L32701C697J22060i3160C3005b06137A6583
$$ 302647 107928 295687 5607 90622 423323 3697 125757 -93160 33005 -206137 16583
15963e329A37776a45147B45149d3869B15978J2099a04327j42415I4714a87456
$$ -5329 137776 -145147 245149 -43869 215978 228077 -104327 -246742 94714 -187456
15952h961I0990F801a78452M4754A03109J17767q7165o4801c36222a4416j74737
$$ -8961 90990 6801 -178452 -133698 103109 220876 133711 68910 -336222 -14416 -189153
15941a89153A49999a81724d8506H870h9185h784E413J82905A9968K01234b48329
$$ -189153 149999 -181724 -48506 8870 -89185 -8784 5413 188318 19968 221202 -248329
15929A11772J6014a96501j28771c5373n5675A73238J51449c71699i8628B7443
$$ 111772 127786 -196501 -325272 -35373 -91048 173238 324687 -371699 -98628 27443
15918b12943P0879I0915e4136q0380A3627b61731J22091E9763o958J71938Q833
$$ -212943 -142064 90915 -54136 -134516 13627 -261731 -139640 59763 52805 224743 233576
15907B33576b45212N5378D7551J30795a8079A71840J74875G360J71736a19035
$$ 233576 -245212 -189834 47551 178346 -18079 171840 346715 7360 179096 -119035
15896F0541a20830o6552K2750A38507A9081a37424j02894B86878e1789j29615
$$ 60541 -120830 -187382 -164632 138507 19081 -137424 -240318 286878 -51789 -181404
15886a81404A70254Q9619b20890d8675B02929P966E3166a14157m2068C7911J33447
$$ -181404 170254 259873 -220890 -48675 202929 210895 53166 -114157 -156225 37911 171358
15875A71358a47304B9898h6627b6957B3779L47275B7795a92537E8066Q9039a18751
$$ 171358 -147304 29898 -86627 -26957 23779 371054 27795 -192537 58066 147105 -118751
15863b13281J00388k62238a62683C80967a72608C3704F681O8450B9034p193J29523
$$ -213281 -112893 -375131 -162683 380967 -172608 33704 6681 75131 29034 21841 151364
15852A51364L9938m6015b10588g2853A6461f3638j72148B83394A03835c37572
$$ 151364 191302 145287 -210588 -72853 16461 -63638 -235786 283394 103835 -337572
15841a38679C2964d6799m44757b6649G3364c36900A11766d68632A32635L476i2881
$$ -138679 32964 -46799 -491556 -26649 73364 -336900 111766 -468632 132635 136111 -92881
15829a71861b2865A1254i8589B29547M5974m1635a95024f470B43897c2435k83643
$$ -171861 -22865 11254 -98589 229547 275521 233886 -195024 -6470 243897 -32435 -316078
15818c16078B7178G152a57152B08802C4282A7066J59554c31698B223a5303k9183
$$ -316078 27178 7152 -157152 208802 34282 17066 176620 -331698 2223 -15303 -44486
15807d4486n5470n3909A20938c60849B80474a07391q9807M1271p6557d1083B1022
$$ -44486 -99956 -153865 120938 -360849 280474 -107391 -197198 -155927 -232484 -41083 21022
15795C6808b9071M930B00236E4008a95552D24189A45939J12681a4850A12845e99635
$$ 36808 -29071 -24141 200236 54008 -195552 424189 145939 258620 -14850 112845 -599635
15783B57865c52121f4575I4539c7799k29493K9827a8733k30523D07803A6186d29321
$$ 257865 -352121 -64575 94539 -37799 -267292 -237465 -18733 -249256 407803 16186 -429321
15771I5158a43749f1020B42136a44380A00882Q733K41283c3493j990j04759k8800
$$ 95158 -143749 -61020 242136 -144380 100882 109615 350898 -33493 -35483 -140242 -169042
15760a69042g0501L2165G3303k0361J92a37782B00615n7986L6611a03817A38690
$$ -169042 -70501 -38336 73303 52942 53134 -137782 200615 142629 179240 -103817 138690
15748d7274p9553I9154K0245B5361c46304I794O0025a12364B5388b64379a09877
$$ -47274 -126827 99154 119399 25361 -346304 9794 69819 -112364 25388 -264379 -109877
15736b69956J25723k89079G680c32568E38779a78399j31822J1983B29429A915
$$ -269956 -144233 -433312 7680 -332568 538779 -178399 -310221 -298238 229429 1915
15725E435b29429J07478N2937a4565A02114c2655C69601j10379b99914A87884
$$ 5435 -229429 -121951 -69014 -14565 102114 -32655 369601 259222 -299914 187884
15714c48866J47445J9875i48n6464A47550I97K542c99701h2792B07887b19488
$$ -348866 -201421 -181546 -948 -57412 147550 997 3539 -399701 -82792 207887 -219488
15702b13510J6040g1897H0789l2751J03473F2726J86866G0380k3522g9554A31178
$$ -213510 -197470 -71897 80789 48038 151511 62726 249592 70380 46858 -79554 131178
15690B00949L171b39440B36827m8960J21184A4939b73805e3351G3956b9765H3131
$$ 200949 204120 -239440 236827 187867 309051 14939 -273805 -53351 73956 -29765 83131
15678a53070E9186b28676N5581m9383D5190a10498A96113L29629d3876A02853
$$ -153070 59186 -228676 -173095 -222478 45190 -110498 196113 525742 -43876 102853
15667c0943F1880b33525g4751a0464o1727b8616k93239g274j29343p1152L8753
$$ -30943 61880 -233525 -74751 -10464 -72191 -28616 -321855 -7274 -136617 -207769 -169016
15656a69016P305H2026c05674i4510O799A68840i6807j9331I8694J81466m1114
$$ -169016 -161711 82026 -305674 -94510 -87711 168840 -96807 -116138 98694 280160 239046
15645B39046b75901J20803C02548F1086f9269B50664E0880J81454F8135j0064
$$ 239046 -275901 -155098 302548 61086 -69269 250664 50880 232334 68135 58071
15635E8071e64086b09408N0568A95831e39590a26716I44N3799c8594A20189j6616
$$ 58071 -564086 -209408 -158840 195831 -539590 -126716 944 54743 -38594 120189 103573
15624A03573P9830p8392N7622a13900j6389I1797j3717c5890B4847a22708I4746
$$ 103573 183403 105011 162633 -113900 -130289 91797 78080 -35890 24847 -122708 94746
15612B09188E8298a04325k4973a8816A4084K8994N5088K42141f2338A33036A951
$$ 209188 58298 -104325 -129298 -18816 14084 43078 98166 340307 -62338 133036 1951
15600i2196o1840j32088A2003K37286B7772N2032a00556B28980B4122N9924K4856
$$ -92196 -154036 -286124 12003 249289 27772 79804 -100556 228980 24122 84046 108902
15589A08902b85338g8247A76056e6930K2756H2161b7106m54220H0985i6702k43682
$$ 108902 -285338 -78247 176056 -56930 -34174 82161 -27106 -481326 80985 -96702 -340384
15578c40384l4769B40473b56253A97240C1505A4669J20202D2764n025a03321B44734
$$ -340384 -375153 240473 -256253 197240 31505 14669 134871 42764 37739 -103321 244734
15566F1588J41170q2176D4692G041J93886b60014A33197g2592q343A65243a9768
$$ 61588 202758 120582 44692 7041 200927 -260014 133197 -72592 -80935 165243 -19768
15554D1062O2541l214B2232J07951D3223i7560I8219k5787B9628i2868a9885o7645
$$ 41062 103603 100389 22232 130183 43223 -97560 98219 72432 29628 -92868 -19885 -87530
15542h7530D2200M50124k42013k1688A0924a35168q5614f5114C6314a48187g0765
$$ -87530 42200 492324 250311 228623 10924 -135168 -220782 -65114 36314 -148187 -70765
15530A54235b61018b7689A00145j1501I962b62516j50229b3100F3449N7731n2574
$$ 154235 -261018 -27689 100145 88644 9962 -262516 -412745 -23100 63449 121180 68606
15519F8606J46483b60136h5002F9565g0808C76214r6944m2068B7520K67833n9299
$$ 68606 215089 -260136 -85002 69565 -70808 376214 279270 237202 27520 295353 236054
15508B36054j12339M6686J15361l8873G1L4340K60034H3673L95103M2753B30907
$$ 236054 123715 170401 285762 246889 71 34411 294445 83673 478776 521529 230907
15496A22087A7643g4143A07399d9085q6678B9306R7522O8493b10342b1084p3119
$$ 122087 17643 -74143 107399 -49085 -135763 29306 126828 195321 -210342 -21084 -94203
15485i4203g451A58610d02474F4273g8261r3911A81588a11918A36191N1351K92675
$$ -94203 -7451 158610 -402474 64273 -78261 -172172 181588 -111918 136191 187542 480217
15474D80217j79275L17877K43327l37413j05422A54470m6896O8022h560A76729
$$ 480217 300942 618819 862146 524733 419311 154470 107574 175596 -8560 176729
15463a71689D5888b26518A01834a29526E504d1903j72762B65921E1775J63776
$$ -171689 45888 -226518 101834 -129526 5504 -41903 -214665 265921 51775 215551
15453B15551a95670h8538g897k63584A54025a35070F0661J48794j04168M4742
$$ 215551 -195670 -88538 -7897 -271481 154025 -135070 60661 209455 105287 150029
15443A50029L08653j46575N88722L88447O4628C44921K94893k07376j09594j26792
$$ 150029 458682 312107 900829 1289276 1353904 344921 639814 432438 322844 196052
15433A96052J4003l1745J45060E9974O8186i6613B8461J56937e9825B49724p9394
$$ 196052 210055 178310 323370 59974 128160 -96613 28461 185398 -59825 249724 170330
15422A70330a85744A42538L6995b23058E4738a31648n4059E2120K24348A23645
$$ 170330 -185744 142538 179533 -223058 54738 -131648 -185707 52120 276468 123645
15411e75554I6963a68336A5529c5169B30828k3581j1517f9193B21276b23969I9819
$$ -575554 96963 -168336 15529 -35169 230828 207247 195730 -69193 221276 -223969 99819
15399a73710A20028Q3782b98542C82422A14773J38463K14259c41755A1976a39040
$$ -173710 120028 203810 -298542 382422 114773 253236 467495 -341755 11976 -139040
15388a9461B63224I7525b54729A29067E49h8660A23969b6780l4861j51371B15825
$$ -19461 263224 97525 -254729 129067 549 -88660 123969 -26780 -61641 -213012 215825
15376c9372A2550J12818l3380k8031L63402r5859a9784E01548F7655i7778B7393
$$ -39372 12550 125368 91988 63957 427359 331500 -19784 501548 67655 -97778 27393
15364C0657J42861P7804H7527R6746j8993a30906B20176J13657a42230J5723D51413
$$ 30657 173518 251322 87527 184273 165280 -130906 220176 333833 -142230 -126507 451413
15352B93561A25600K88288K5488A61797p563K0567B5687K88962j35605L24386
$$ 293561 125600 413888 439376 161797 154234 174801 25687 314649 179044 503430
15342E03430A07378J52452Q1198M4003hE2798K05752c9031a869r164k13267A85859
$$ 503430 107378 259830 341028 385031 -8 52798 258550 -39031 -1869 -11033 -224300 185859
15329B43040I1917J07103a650G1356A4144J89211F258J43484d1954A19047L1370
$$ 243040 91917 199020 -1650 71356 14144 203355 6258 149742 -41954 119047 150417
15318A50417a92192C25201a66469A93917b50625B16790a66389A87520J16581c6212
$$ 150417 -192192 325201 -166469 193917 -250625 216790 -166389 187520 304101 -36212
15307b16199A89459o7499A764L414a57849a7525B11977I0646J51223a01223A91995
$$ -216199 189459 121960 1764 5178 -157849 -17525 211977 90646 241869 -101223 191995
15295A07012i9241r3984G8602b84763A32280B2982K36499j11501h6703b0999n5519
$$ 107012 -99241 -193225 78602 -284763 132280 22982 259481 147980 -86703 -20999 -76518
15284g6518D5994g3372o3365m9789O8896B49427c3031B96042A36993a64861a9305
$$ -76518 45994 -73372 -136737 -186526 -117630 249427 -33031 296042 136993 -164861 -19305
15272D77307A43146j061g6060A4453e5569A27324O1713b0707A39132P1391a69422
$$ 477307 143146 142085 -76060 14453 -55569 127324 189037 -20707 139132 210523 -169422
15260b0356l10146a39256I4927M7358J75104A26441K5195f8902B49970n8249a25465
$$ -20356 -330502 -139256 94927 142285 317389 126441 151636 -68902 249970 191721 -125465
15248F3408A8846l021h4461E0565L61596L60539J287806k34972n79589J041503
$$ 63408 18846 15825 -84461 50565 412161 772700 2060506 1825534 1245945 2287448
15238B287448j043283A18998K03711j56112a75596C9055J44597a01178B01929
$$ 2287448 1244165 118998 322709 166597 -175596 39055 183652 -101178 201929
15228b672A394Q624J22994B3232g4146p4713E1825J01612c78389C26313g334A32092
$$ -2672 1394 10018 133012 23232 -74146 -148859 51825 153437 -378389 326313 -7334 132092
15215I107J6924A501K0839J37812g234I107a81906A49912a15263C32734a88351
$$ 9107 26031 1501 22340 160152 -7234 9107 -181906 149912 -115263 332734 -188351
15203h9412K8157A48856J16305K4389J11740a40265j52382g1047E7692c1545A97370
$$ -89412 -61255 148856 265161 289550 401290 -140265 -292647 -71047 57692 -31545 197370
15191a26260J4543C6236L3601O3206k3472b38788a00048j01235G6684P9960g8712
$$ -126260 -111717 36236 69837 133043 109571 -238788 -100048 -201283 76684 156644 -78712
15179A32528a386F7240K12451A038J33348n3511L74407B8551c1943A25548J98122
$$ 132528 -1386 67240 279691 1038 134386 80875 455282 28551 -31943 125548 323670
15168C23670I2370L9952b7611j27600b1792l52245I1556K86990d385k89887P6699
$$ 323670 92370 132322 -27611 -155211 -21792 -374037 91556 378546 -4385 -294272 -217573
15157b17573B54263I2692e7634A46595Q1329m3046J69991h3515A81336a96054
$$ -217573 254263 92692 -57634 146595 227924 184878 354869 -83515 181336 -196054
15146c9833j97872A68945D8197b8755A14845L0705J48456b67738C96673F7913
$$ -39833 -237705 168945 48197 -28755 114845 145550 294006 -267738 396673 67913
15135E04729j27019B1962P9540J68671H9567Q3321m8524m9024J26195R7109e7146
$$ 504729 377710 21962 101502 270173 89567 172888 124364 75340 201535 298644 -57146
15123B69537n4804r0571J38199H9809J52073M41550B00627J06371o6674F5893
$$ 269537 214733 124162 262361 89809 241882 683432 200627 306998 240324 65893
15112D80957j64874o3585c0303l1468J9467B70504r5588m1506K10869D8740d2445
$$ 480957 316083 252498 -30303 -61771 -42304 270504 174916 133410 344279 48740 -42445
15100b2496k7280A1930K98780H1590J21433M813E3891K43194a54784B44800b14263
$$ -22496 -49776 11930 310710 81590 203023 207836 53891 297085 -154784 244800 -214263
15088B7866K06622k2194i6195A00537N4585b13500E714g4947C72174n4199F3038
$$ 27866 234488 212294 -96195 100537 155122 -213500 5714 -74947 372174 317975 63038
15076B86441j38110N1619q5059n0123K44139A23405j1166i6404I4946b2158B90132
$$ 286441 148331 199950 114891 64768 308907 123405 112239 -96404 94946 -22158 290132
15064C83069e9832B90229h4103H3557J63981M0792K40789O2554k65329a990A76037
$$ 383069 -59832 290229 -84103 83557 247538 288330 529119 591673 326344 -1990 176037
15052B51067K14367d3388E7402L48094a59898D81898A43182K53766P7059k34618
$$ 251067 465434 -43388 57402 405496 -159898 481898 143182 396948 474007 239389
15042B39389K62744j81948j24674L46845E4491K38133E849J77018Q3053M80900
$$ 239389 502133 320185 195511 542356 54491 292624 5849 182867 265920 746820
15032G46820k96587N0079J91690J1117K76248k00944l68010R5068d2112F48208
$$ 746820 450233 500312 692002 703119 979367 778423 410413 505481 -42112 648208
15021C32177L18842O5525O5497l33527N2917N7338B78060J32622j88297J39495
$$ 332177 651019 716544 782041 448514 501431 558769 278060 410682 222385 361880
15011C61880K6559L21086l37329P2775J50534B71346K35224k34110J60191P4407
$$ 361880 388439 709525 372196 444971 595505 271346 506570 272460 432651 507058
15001E07058A69936N2587J40043K20217l7079A52261K45990q8767R6843j40974
$$ 507058 169936 222523 362566 582783 545704 152261 398251 309484 406327 265353
14991B65353J05391K6691K95820j57179A98364J32436j765J10270J27490j06286
$$ 265353 370744 397435 693255 536076 198364 330800 329035 439305 566795 460509
14981D60509L80992r9758K47547l69864k70422J05451j69949n9017M58723P5567
$$ 460509 841501 741743 989290 619426 349004 454455 284506 225489 684212 759779
14971G59779j06286B61954L47269j78029k8426O5491j23032L2491K08759B27021
$$ 759779 653493 261954 609223 431194 402768 468259 345227 377718 586477 227021
14960B11660q5918L67194G2668N50048B77516J89761p116A28360O3327J82634
$$ 211660 125742 492936 72668 622716 277516 467277 460161 128360 191687 374321
14950C74321m3257L9081j23795L72059k39282A14319E5041M61974q4690J25177
$$ 374321 331064 370145 246350 618409 379127 114319 55041 517015 432325 557502
14940E57502j57143J96039j49544j88563J17639M04842k42054j73515J56406q422
$$ 557502 400359 596398 446854 258291 375930 780772 538718 365203 521609 513187
14930E13187M91926K10333J14317k59101L12603P2275J98187K56216j99709J5977
$$ 513187 1005113 1215446 1329763 1070662 1383265 1455540 1653727 1909943 1710234 1726211
14920A726211l47389n6214K51586J83388M03912k08385J8461m21136n33861K95386
$$ 1726211 1378822 1322608 1574194 1757582 2161494 1953109 1971570 1550434 1016573 1311959
14910A311959r8050k25207D53892J91561j66125j7922Q9950M2178K15456B08616
$$ 1311959 1213909 988702 453892 645453 479328 461406 551356 593534 808990 208616
14899B9548L33175i6563C60145m6274J35938j33602R1801J81679B11012M14455
$$ 29548 362723 -96563 360145 313871 449809 316207 408008 589687 211012 625467
14889F25467A42083N43132A55375M63804L380K83812K18169m11225n8411J77054
$$ 625467 142083 685215 155375 619179 622559 906371 1124540 713315 654904 831958
14879H31958k30417Q8761K10383C19583L60904L8620C29252l438m9666K43238
$$ 831958 601541 690302 900685 319583 680487 719107 329252 325814 276148 519386
14869E19386k06303J78512J16611B60493N68591J384j04210L5868j62149j85950
$$ 519386 313083 491595 608206 260493 829084 830468 726258 762126 599977 414027
14859D14027K43453k31921K04276k9129j54844j6023J4412j17525L33936k30486
$$ 414027 657480 425559 629835 600706 445862 429839 444251 326726 660662 430176
14849D30176P8761J105Q700J72786j40423K7688N9418N68000o2372K06614k74229
$$ 430176 508937 510042 518742 691528 551105 578793 638211 1206211 1143839 1350453 1076224
14838A076224J51009k94967J7466k29299M1044j2773k42715J32051k239j3841
$$ 1076224 1227233 932266 949732 720433 761477 748704 505989 638040 635801 621960
14828F21960j78586K1404J12120m0252k09117K4332m9854L0076N62418j22288
$$ 621960 443374 464778 576898 536646 327529 351861 302007 332083 894501 772213
14818G72213K4214K12169m35529J55255j87620k3467P0827L1168k68297L29761
$$ 772213 796427 1008596 573067 728322 540702 517235 588062 619230 350933 680694
14808F80694L1841k54017k7119L3654N38607j67886M07532n13409k13672M82680
$$ 680694 712535 458518 431399 465053 1003660 835774 1243306 729897 516225 998905
14798I98905l38032k31300N9596J67827P3129B92033M19738j17402l850R3284
$$ 998905 660873 429573 489169 656996 730125 292033 711771 594369 590519 683803
14788F83803r5593l1391J05997k1982K06323k69909p9294J78259o3267J66411
$$ 683803 588210 556819 662816 640834 847157 577248 497954 676213 612946 779357
14778G79357B84111L18614L55041j39188o0336K2843L7739p4096K0811N6842k45952
$$ 779357 284111 602725 957766 818578 758242 781085 818824 744728 765539 822381 576429
14767E76429B80180M63713j31797q2809K64541r8686l22750Q5847K96735B80152
$$ 576429 280180 743893 612096 529287 793828 695142 372392 458239 754974 280152
14756C98654q2714L663M80141j25803k12826J93269j0061k74750L49331k62370
$$ 398654 315940 319603 799744 673941 461115 654384 644323 369573 718904 456534
14746D56534L22133K326n5833J49843j93523j82920J45293j61592L99729k28557
$$ 456534 778667 780993 725160 875003 681480 498560 643853 482261 881990 653433
14736F53433A50361O84539k73365J5380J40343M11482j2167l29017O49714k6747
$$ 653433 150361 834900 561535 576915 717258 1128740 1116573 787556 1437270 1410523
14726A410523K80063K34701o7464n53007Q3841j85867Q1896k02925k1067M6738
$$ 1410523 1690586 1925287 1857823 1304816 1388657 1202790 1284686 1081761 1060694 1107432
14716A107432k31783p4406j5098K8247k35160L28829l80058K87772k80167L13755
$$ 1107432 875649 801243 786145 814392 579232 908061 528003 815775 535608 849363
14706H49363L72663m33876M35555l38649N58388J09612K81843j64209m4247M7998
$$ 849363 1222026 788150 1223705 885056 1443444 1553056 1834899 1670690 1626443 1674441
14696A674441l14335o24959K4364p229J2602L76078m32777L35954m99174K32740
$$ 1674441 1360106 735147 759511 752282 764884 1140962 708185 1044139 544965 777705
14686G77705J17420r5376M01069D90993N02490l98599L22437L43207k97945R9099
$$ 777705 895125 799749 1200818 490993 993483 594884 917321 1260528 962583 1061682
14676A061682k08225q0759J80934j63444K38163k33772M8648J92604n4276k66415
$$ 1061682 853457 772698 953632 790188 1028351 794579 843227 1035831 981555 715140
14666G15140N2485K37009l44814P7887M35848l43458L4963O8439n1447K11547
$$ 715140 767625 1004634 659820 737707 1173555 830097 865060 933499 882052 1093599
14656A093599m70977J35675M72797k33481Q7172O8368J79629k91351K41054q5711
$$ 1093599 622622 758297 1231094 997613 1084785 1153153 1332782 1041431 1282485 1196774
14646A196774k59435J17982q9128k00567j26475L15566M61333l82504n0800J60005
$$ 1196774 937339 1055321 966193 765626 639151 954717 1416050 1033546 982746 1142751
14636A142751j45827O4335j03599L26489j82633J27557P9613j62833l3888p0621
$$ 1142751 996924 1061259 957660 1284149 1101516 1229073 1308686 1145853 1111965 1041344
14626A041344L73999l10269j57434K23817P6950l83837J48461L78784k20741N28057
$$ 1041344 1415343 1105074 947640 1171457 1248407 864570 1013031 1391815 1171074 1699131
14616A699131n96781K69758p8075k85891K57205J13850J47988m62734K58384m8230
$$ 1699131 1102350 1372108 1294033 1008142 1265347 1379197 1527185 1064451 1322835 1274605
14606A274605K68093l8582J57899l51098K39067p9929j2431P6699r1190j60288
$$ 1274605 1542698 1504116 1662015 1310917 1549984 1470055 1457624 1534323 1443133 1282845
14596A282845L61474o3264o44268R51862k25548J1345k92773K61358J39116k8187
$$ 1282845 1644319 1581055 936787 1888649 1663101 1674446 1381673 1643031 1782147 1753960
14586A753960r0685J94528k38168o2760R8096j94871K79421K53305l07295j03390
$$ 1753960 1663275 1857803 1619635 1556875 1654971 1460100 1739521 1992826 1685531 1582141
14576A582141K98199k43127K29243k7206L48127m73447J97710Q6632J0571J35003
$$ 1582141 1880340 1637213 1866456 1839250 2187377 1713930 1911640 1998272 2008843 2143846
14566B143846j31507L20383J21848j55076O2525m10792Q77503o74925L04484J20600
$$ 2143846 2012339 2332722 2454570 2299494 2362019 1951227 2828730 2153805 2458289 2578889
14556B578889J71007k24697P03227q6020M67514M92639R93311J998700K641961
$$ 2578889 2749896 2525199 3228426 3142406 3609920 4102559 5095870 7094570 9736531
14547I736531Q245201K1648139Q232301A8105004F501452l072952n91794n51399
$$ 9736531 17981732 39629871 47862172 18105004 6501452 3428500 2836706 2285307
14539B285307M18993J147565K591713C218156r80892k11023k48724j70669M87920
$$ 2285307 2704300 3851865 6443578 3218156 2237264 2026241 1777517 1606848 2094768
14530B094768o2560l64052J37498k0670K28245j20527P7489K41505o1814o6133
$$ 2094768 2032208 1668156 1805654 1784984 2013229 1892702 1970191 2211696 2149882 2083749
14520B083749M2781l5300p456K01121j00465M1675K43057p5876M6553j63549R4139
$$ 2083749 2126530 2091230 2083774 2284895 2184430 2226105 2469162 2393286 2439839 2276290 2370429
14509B370429J61795R0171j37809j9044j3949J99312M9734J3431m74184M90760
$$ 2370429 2532224 2622395 2484586 2465542 2451593 2650905 2700639 2714070 2239886 2730646
14499B730646J16875n2271L17757l59154L54277j51459L5733J7200j06261k4003
$$ 2730646 2847521 2795250 3113007 2753853 3108130 2956671 2992404 3009604 2903343 2879340
14489B879340K92467j30468K52737K33466l37353m7392L37072J09456j72504k54400
$$ 2879340 3171807 3041339 3294076 3527542 3190189 3142797 3479869 3589325 3416821 3162421
14479C162421J13844n6969M59091n1230k61630N46327k12436p5185K08347j8617
$$ 3162421 3276265 3219296 3678387 3627157 3365527 3911854 3699418 3624233 3832580 3813963
14469C813963n0799j63719J48956P00201m24264L92972k77784J02007j16421J05452
$$ 3813963 3763164 3599445 3748401 4448602 4024338 4417310 4139526 4241533 4125112 4230564
14459D230564j01368L01655L5507l38306M09198J24771o6540j55550K85365r6637
$$ 4230564 4129196 4430851 4466358 4128052 4537250 4662021 4595481 4439931 4725296 4628659
14449D628659M60674l16755j75570m3016P89001m17457J20796K9161j20840R5606
$$ 4628659 5089333 4772578 4597008 4553992 5342993 4925536 5046332 5075493 4954653 5050259
14439E050259J82710J54543M2635J99070j93885M30304k8700j58673L28690J99052
$$ 5050259 5232969 5387512 5430147 5629217 5435332 5865636 5836936 5678263 6006953 6206005
14429F206005L2787L5675j65990k2696L75671K56646k55286K78903K6746J34329
$$ 6206005 6238792 6274467 6108477 6085781 6461452 6718098 6462812 6741715 6768461 6902790
14419F902790N99883K31193Q0769j46895J24419l09361L03665m1876K19583Q9890
$$ 6902790 7502673 7733866 7814635 7667740 7792159 7482798 7786463 7744587 7964170 8054060
14409H054060K21790k09422M38204J5316L36672K86504K11301K07428m55895L47254
$$ 8054060 8275850 8066428 8504632 8519948 8856620 9143124 9354425 9561853 9105958 9453212
14399I453212k8900J93532K97162r0305r771N37048m4778L54355j72752L17443
$$ 9453212 9424312 9617844 9915006 9824701 9814930 10351978 10307200 10661555 10488803 10806246
14389A0806246N3194O32882j32982M34357p8229N07560L83395J13779K02604O78576
$$ 10806246 10859440 11492322 11359340 11793697 11715468 12223028 12606423 12720202 12922806 13601382
14379A3601382o9298j00830Q15249j27550M02320O3668L91237L25383N85498J78326
$$ 13601382 13532084 13431254 14246503 14118953 14521273 14584941 14976178 15301561 15887059 16065385
14369A6065385J8704N58680L43567M53383M54218K70156L82897L15340O22586
$$ 16065385 16084089 16642769 16986336 17439719 17893937 18164093 18546990 18862330 19484916
14360A9484916J22745L27454M61642N61003K00687O73497O72529M93154N38011
$$ 19484916 19607661 19935115 20396757 20957760 21158447 21831944 22504473 22997627 23535638
14351B3535638J63999O18920Q73373M27181N93264J074315M18654N20782R82251
$$ 23535638 23699637 24318557 25191930 25619111 26212375 27286690 27705344 28226126 29208377
14342B9208377O38033P20605J029927O48387J048674N30863J359789Q74793J427339
$$ 29208377 29846410 30567015 31596942 32245329 33294003 33824866 35184655 36059448 37486787
14333C7486787Q37241P77657J445955J470526J130305J538669J516379J532410
$$ 37486787 38324028 39101685 40547640 42018166 43148471 44687140 46203519 47735929
14325D7735929J537583J642124J752509J763865K158932J904937K133461K152518
$$ 47735929 49273512 50915636 52668145 54432010 56590942 58495879 60629340 62781858
14317F2781858K218457K419755K683272K446954K966082K989913L205124L573148
$$ 62781858 65000315 67420070 70103342 72550296 75516378 78506291 81711415 85284563
14309H5284563L662236L799202M202765M144045M971682M602483N218614N446872
$$ 85284563 88946799 92746001 96948766 101092811 106064493 110666976 115885590 121332462
14301A21332462N836568O353996O610890O983592P783515Q189062Q462050R368537
$$ 121332462 127169030 133523026 140133916 147117508 154901023 163090085 171552135 180920672
14293A80920672R782815J0612898J0986928J1746975J2601387J2823130J3934666
$$ 180920672 190703487 201316385 212303313 224050288 236651675 249474805 263409471
14286B63409471J4551264J5180172J5546197J6319140J6611767J7184996J7065151
$$ 263409471 277960735 293140907 308687104 325006244 341618011 358803007 375868158
14279C75868158J6747029J6470923J5747415J4820786J3228427J1042575O249604
$$ 375868158 392615187 409086110 424833525 439654311 452882738 463925313 470174917
14272D70174917M473799L623765J987614K81424j750547l265581p309089r921928
$$ 470174917 474648716 478272481 480260095 480541519 478790972 475525391 468216302 458294374
14264D58294374j1854028j3905654j5581582j6722362j7044625j7981334j7277164
$$ 458294374 446440346 432534692 416953110 400230748 383186123 365204789 347927625
14257C47927625j7171083j6771387j6457839j5374286j5170233j4471222j3706060
$$ 347927625 330756542 313985155 297527316 282153030 266982797 252511575 238805515
14250B38805515j2906116j2478151r398703j0249432j0187297r548418q671608
$$ 238805515 225899399 213421248 204022545 193773113 183585816 174037398 165365790
14243A65365790q596663p685924p107841p087479o535361n680374n221108n617265
$$ 165365790 156769127 149083203 141975362 134887883 128352522 122672148 117451040 111833775
14235A11833775n074933n090552m388909l784696l622916l566991l867130l636195
$$ 111833775 106758842 101668290 97279381 93494685 89871769 86304778 82437648 78801453
14227G8801453k887712k851472k872291k773115k770327k070514k162994j886888
$$ 78801453 75913741 73062269 70189978 67416863 64646536 62576022 60413028 58526140
14219E8526140k023141k021400j797057j980042j588037j156918j160227k128595
$$ 58526140 56502999 54481599 52684542 50704500 49116463 47959545 46799318 44670723
14211D4670723j248189j782680p59349j076014n64318j322131j028189j616089
$$ 44670723 43422534 41639854 40880505 39804491 39240173 37918042 36889853 35273764
14203C5273764q74439r10408r38797l43418r76826j078413r07053p56022o23331
$$ 35273764 34399325 33488917 32550120 32206702 31229876 30151463 29244410 28488388 27865057
14194B7865057p95727k33098j030814r76276l39913q06893n80298m58508o65606
$$ 27865057 27069330 26836232 25805418 24829142 24489229 23682336 23102038 22643530 21977924
14185B1977924j30442q71823m47381n23823P0863r33568l65123j83720k16568
$$ 21977924 21847482 20975659 20528278 20004455 20075318 19141750 18776627 18592907 18376339
14176A8376339m88315q5134q63400n23371n6460j36601k80766q08804m673k21194
$$ 18376339 17888024 17802890 16939490 16416119 16359659 16223058 15942292 15133488 15128815 14907621
14166A4907621l03756j22901m14782l21789l08347J65785n00939l63210K20120
$$ 14907621 14603865 14480964 14066182 13744393 13436046 13601831 13100892 12737682 12957802
14157A2957802l19807n70509Q2313j82123l20226k01655K19003r11495J0495m2146
$$ 12957802 12637995 12067486 12149799 11967676 11647450 11445795 11664798 10753303 10763798 10721652
14147A0721652r4826K4103l02413j46842j1093j24125o33302O5997j56783j80444
$$ 10721652 10626826 10650929 10348516 10201674 10190581 10066456 9433154 9499151 9342368 9161924
14137I161924J42438n66395K28718m05004J32454R4677o43604J78223J6803l82249
$$ 9161924 9304362 8737967 8966685 8561681 8694135 8788812 8145208 8323431 8340234 7957985
14127G957985j11795k32162K9414m65043K95463R2012l23403K0867j01867o24317
$$ 7957985 7846190 7614028 7643442 7178399 7473862 7565874 7242471 7263338 7161471 6537154
14117F537154M32318j70326l05682L32200l45293j62811n346l5080j29223Q467
$$ 6537154 6969472 6799146 6493464 6825664 6480371 6317560 6312214 6277134 6147911 6156378
14107F156378o6460m27072K64032j27064k54828P266o4051L3607J23378l85496
$$ 6156378 6089918 5662846 5926878 5799814 5544986 5552252 5488201 5521808 5645186 5259690
14097E259690J91305k22307j43456J50341j12398K00839l39760n7072M1827K2811
$$ 5259690 5450995 5228688 5085232 5235573 5123175 5324014 4984254 4927182 4969009 4991820
14087D991820j31857N4178l44025K45267m54484K18391o3676l86427K25485j27991
$$ 4991820 4859963 4914141 4570116 4815383 4360899 4579290 4515614 4129187 4354672 4226681
14077D226681j73352M87397m42356n9437J23974n9912J52205k24706k10842M4067
$$ 4226681 4053329 4540726 4098370 4038933 4162907 4102995 4255200 4030494 3819652 3863719
14067C863719O2282N7024l01650J88265k64628L26983R7981l81828L95457o2058
$$ 3863719 3926001 3983025 3681375 3869640 3605012 3931995 4029976 3648148 4043605 3981547
14057C981547m04214L60570l60700j04557K27790k39135j30079k76254K50268
$$ 3981547 3577333 3937903 3577203 3472646 3700436 3461301 3331222 3054968 3305236
14048C305236M1149j14391K0723l96959J33426L62339j58449l02088L31716k16358
$$ 3305236 3346385 3231994 3252717 2855758 2989184 3351523 3193074 2890986 3222702 3006344
14038C006344l48935J80490l5050J9540j73701K50097j8804P5575j03148j80595
$$ 3006344 2657409 2837899 2802849 2822389 2648688 2898785 2879981 2955556 2852408 2671813
14028B671813j62038M14071m32773K68436k05941k88563J17237N69849o12036
$$ 2671813 2509775 2923846 2491073 2759509 2553568 2265005 2382242 2952091 2340055
14019B340055R0649k1623O9872j04175j30305L85248j91100N8449N5794m94791
$$ 2340055 2430704 2409081 2478953 2374778 2244473 2629721 2438621 2497070 2552864 2058073
14009B058073K83457n36787N15737k63395j16674K58252l25827j22859O22854
$$ 2058073 2341530 1804743 2320480 2057085 1940411 2198663 1872836 1749977 2372831
14000B372831l02922J04305l48337j11975J78050k02354L1604K01934J35063k45391
$$ 2372831 2069909 2174214 1825877 1713902 1891952 1689598 1721202 1923136 2058199 1812808
13990A812808N57655J196594J845781O039207J9237225K1732983B6098296A1750741
$$ 1812808 2370463 3567057 5412838 11452045 30689270 52422253 26098296 11750741
13981G208557j818215j161261q74381k3550k57753n57209L10293l82058m4237
$$ 7208557 5390342 4229081 3354700 3331150 3073397 2516188 2826481 2444423 2400186
13972B400186Q6448l97314J89122L62107n88606L47527k91851K26138k80797k55982
$$ 2400186 2486634 2089320 2278442 2640549 2051943 2399470 2107619 2333757 2052960 1796978
13962A796978J51355l97J27433j59038k4987K14516k51167p7271n0415K78972
$$ 1796978 1948333 1947936 2075369 1916331 1891344 2105860 1854693 1777422 1727007 2005979
13952B005979R2K46715n63138j51375J69713R9261m7044k09655K54163j57636
$$ 2005979 2006071 2252786 1689648 1538273 1707986 1807247 1760203 1550548 1804711 1647075
13942A647075L26520l21912l07632K80566N5896j28673K50167j81186K69500l69675
$$ 1647075 1973595 1651683 1344051 1624617 1680513 1551840 1802007 1620821 1890321 1520646
13932A520646l93953L42877J1141J32847k67889M26409l75284J7413M86968n75398
$$ 1520646 1126693 1469570 1480711 1613558 1345669 1772078 1396794 1414207 1901175 1325777
13922A325777j22078J95577J38347j31570k6004j0941k91453K43931L18722k88568
$$ 1325777 1203699 1399276 1537623 1406053 1380049 1369108 1077655 1321586 1640308 1351740
13912A351740Q9223j91207j25456L79575m03084o3156J45915K25968N6162l5665
$$ 1351740 1440963 1249756 1124300 1503875 1100791 1037635 1183550 1409518 1465680 1430015
13902A430015J596l74998R4064q9330J90122n94599L50219l3510K10848j19494
$$ 1430015 1431611 1056613 1150677 1061347 1251469 656870 1007089 973579 1184427 1064933
13892A064933J20698R7036l7405j63810N63416k40875k35588k9383j31421k18830
$$ 1064933 1185631 1282667 1245262 1081452 1644868 1403993 1168405 1139022 1007601 788771
13882G88771L92431j05526k11042K60231l6155j87364R7797P8375k72290J07256
$$ 788771 1181202 1075676 864634 1124865 1088710 901346 999143 1077518 805228 912484
13872I12484N4260l4541p0538M96635o22058k01967M61093m9054l1735M2098k30489
$$ 912484 966744 932203 861665 1358300 736242 534275 995368 946314 914579 956677 726188
13861G26188K21527j3978M2663M1383M6702o824j6211k28630K77226j30345j82791
$$ 726188 947715 933737 976400 1017783 1064485 1057661 1041450 812820 1090046 959701 776910
13850G76910M87310m67866L3373n2891j96996L93774j20874m6229L82538k80960
$$ 776910 1264220 796354 829727 776836 579840 973614 852740 806511 1189049 908089
13840I08089j57699q8994L31326Q0954l94887K9302L540M3696J16336J86726r2906
$$ 908089 750390 661396 992722 1073676 678789 708091 711631 755327 871663 1058389 965483
13829I65483j77045J85168j93348K42127r9183j75474j05694K44056P5611j11735
$$ 965483 788438 973606 780258 1022385 923202 747728 642034 886090 961701 849966
13819H49966J35929j62696J09690j95849j80156M7026J61656j38919K53648r5547
$$ 849966 985895 823199 932889 737040 556884 603910 765566 626647 880295 784748
13809G84748k33751k38942L86743J28336j88229L52068l28266J59530l1119k9286
$$ 784748 550997 312055 698798 827134 638905 990973 662707 822237 791118 761832
13799G61832k89320P9305K99768l97424M84936j61597k95422L057N992K71803
$$ 761832 472512 551817 851585 454161 939097 777500 482078 485135 491127 762930
13789G62930k49627N0476J78934K54895D79048J93273C20644N96615j2251j97993
$$ 762930 513303 563779 742713 997608 479048 672321 320644 917259 905008 707015
13779G07015j48781M47859D24856L43000C48512L76050J902M4757p2123m9967
$$ 707015 558234 1006093 424856 767856 348512 724562 726464 771221 699098 649131
13769F49131k36090J51468M7115j98604K97845j53497j84702N32370l47290C1127
$$ 649131 413041 564509 611624 413020 710865 557368 372666 905036 557746 31127
13758A18057M19797k63651j3845L45622B61824J91402J27656J89826l57972l6601
$$ 118057 537854 274203 260358 605980 261824 453226 580882 770708 412736 376135
13748C76135J03334O6308k6140J46900J60615l87820Q7709r139P6901j77116m3958
$$ 376135 479469 545777 519637 666537 827152 439332 527041 517902 594803 417687 373729
13737C73729K7939K9222J283J11247J0433O2923N2715l34385L95672j57955j20255
$$ 373729 401668 430890 432173 543420 553853 616776 669491 335106 730778 572823 452568
13726D52568j5948j19116L11780k48402K15426k43562J04618j47876j00539K99938
$$ 452568 436620 317504 629284 380882 596308 352746 457364 309488 208949 508887
13716E08887R928B28145M10540R215B77644K39614B12053M32133l03549O9099
$$ 508887 518815 228145 638685 647900 277644 517258 212053 644186 340637 409736
13706D09736K06718k34452K35558j3548k43117J49849J89648C00294l7200j25521
$$ 409736 616454 382002 617560 604012 360895 510744 700392 300294 263094 137573
13696A37573L07200j13533J68132r30k23583N8196K06420p4884J91307B34580
$$ 137573 444773 331240 499372 498442 274859 333055 539475 464591 655898 234580
13685E76554j84727J00456A59332N42214j44623B67291K52231q2944R2206J05065
$$ 576554 391827 492283 159332 701546 556923 267291 519522 436578 528784 633849
13675F33849k42620Q5633P9225B58752J52062J32213k32864P0574J84902A68016
$$ 633849 391229 476862 556087 258752 410814 543027 310163 380737 565639 168016
13664F3550L49942A52640J59388j6540j02952N2948I8122M73196k22659r251F9011
$$ 63550 413492 152640 312028 295488 192536 245484 98122 571318 348659 339408 69011
13652A88619O5778Q7091j57801J76312n1701J43439P1878O4662k23679J92035
$$ 188619 254397 341488 183687 359999 308298 451737 523615 588277 364598 556633
13642E56633A18017P3006p098J69763m287Q4346g934D43351l3642O3495J05873
$$ 556633 118017 191023 183925 353688 349401 433747 -7934 443351 409709 473204 579077
13631E79077j23089A92483L6075J23011J93227B29129L43492k32409K9251J32147
$$ 579077 455988 192483 228558 351569 544796 229129 572621 340212 369463 501610
13621E01610k28621L50005B78557K19095A89746J25226j20904L92153A03114f3021
$$ 501610 272989 622994 278557 497652 189746 314972 194068 586221 103114 -63021
13610F75737b16619A82287P5107B5258L4683L48818A31506J14921K02209B03185
$$ 675737 -216619 182287 257394 25258 59941 408759 131506 246427 448636 203185
13599A48867K00716p5470J06284j36859J32158K4476q1355j16682L57033j03188
$$ 148867 349583 274113 380397 243538 375696 400172 318817 202135 559168 455980
13589D55980j76515J1321K84662A79974M9996Q7869J2973n2452K77567Q2196A43639
$$ 455980 279465 290786 575448 179974 229970 317839 330812 278360 555927 638123 143639
13577A79554J89703E1840L108a09716C84896j03957A02855L152C8495K14200J75304
$$ 179554 369257 51840 54948 -109716 384896 280939 102855 106007 38495 252695 427999
13566D27999K66884C02927n683J30810A5979M85236A95991K93527O2913C6912
$$ 427999 694883 302927 297244 428054 15979 501215 195991 489518 552431 36912
13555B8479M06126J13471k68251L71194G8312J18188K66383k7357L3763B08063
$$ 28479 434605 548076 279825 651019 78312 196500 462883 435526 469289 208063
13544F57535B81537J57822A21822f9885B09069F4901K47172J63519A18948O6212
$$ 657535 281537 439359 121822 -69885 209069 64901 312073 475592 118948 185160
13534A85160q0707D2893K32068A07629J24658M4970J65001B01703K38632j95964
$$ 185160 104453 42893 274961 107629 232287 277257 442258 201703 440335 244371
13524B44371a10266D00983j91085K43631k7987B1109g7887B47597J9483L0489
$$ 244371 -110266 400983 209898 453529 425542 21109 -77887 247597 267080 297569
13514B97569j04590a0441C50274a3850D14949A80013a62470A4240M9583N33888
$$ 297569 192979 -10441 350274 -13850 414949 180013 -162470 14240 63823 597711
13504E97711c4527B68798a32062B60597K22964A36617B2704J87193J02488K65922
$$ 597711 -34527 268798 -132062 260597 483561 136617 22704 209897 312385 578307
13494E78307h1384C30977J00487j97318M8926C4531J33818E3836K88031K6435
$$ 578307 -81384 330977 431464 234146 283072 34531 168349 53836 341867 368302
13484C68302j03559D0919L48142q3568J59136M8854A33679k8828o952I502J73920
$$ 368302 264743 40919 389061 305493 464629 513483 133679 104851 97899 9502 183422
13473A83422K9148J35551J03201j47008Q7529D8055J53730R1867J86510B29115
$$ 183422 212570 348121 451322 304314 391843 48055 201785 293652 480162 229115
13462A99058G9636P9801L0059P8849C8036b2789B54024m2312J05017D1080O6975
$$ 199058 79636 159437 189496 268345 38036 -22789 254024 211712 316729 41080 108055
13451A08055P1224f4299A75309K54925f9356q4328A01465P2148i7907C39361R5615
$$ 108055 179279 -64299 175309 430234 -69356 -153684 101465 173613 -97907 339361 434976
13440D34976A94252b46628a18964o0528A80246M348n2341J23394r5776m556O055
$$ 434976 194252 -246628 -118964 -179492 180246 184594 132253 255647 159871 155315 161370
13429A61370B5690J67282J90872C5855d6769B90185q8534p4638P46l0583o329
$$ 161370 25690 192972 383844 35855 -46769 290185 201651 127013 127759 97176 90847
13418I0847J43227J5559O1837j25669K7967g9624A68432D7335K55437a8652A06097
$$ 90847 234074 249633 311470 185801 213768 -79624 168432 47335 302772 -18652 106097
13406E5634J85860J37999B9911J36692a34141a4939C4534P9135b3902A01223j4375
$$ 55634 241494 379493 29911 166603 -134141 -14939 34534 113669 -23902 101223 86848
13395H6848k2194M07054G6157M6660J20355A00452q54J00874k4198R3974m1418
$$ 86848 64654 471708 76157 122817 243172 100452 99598 200472 176274 270248 228830
13384B28830J7217a81635B42208g0528B2275a3493F2479M2391a49799G4504P2161
$$ 228830 246047 -181635 242208 -70528 22275 -13493 62479 104870 -149799 74504 146665
13373A46665f3220C3739K9275A2735N98681b09481A68761R231j856F0076c9237
$$ 146665 -63220 33739 63014 12735 611416 -209481 168761 177992 176136 60076 -39237
13361E3717Q5153J60271o2964J41691B6400J0115d9297A38157m8653L69224B16969
$$ 53717 138870 299141 236177 377868 26400 36515 -49297 138157 89504 458728 216969
13349c42879B28892a36979N8064A21498J14546M6812E9185J01729J40150p8994
$$ -342879 228892 -136979 -78915 121498 236044 282856 59185 160914 301064 222070
13339B22070R0459g8824B49348M820E9153j319Q5665K36564N82j03393G1931K03546
$$ 222070 312529 -78824 249348 254168 59153 57834 143499 380063 380645 277252 71931 275477
13327B75477G5400P4867k5208g6574B60504n0928K1741H2355M3774J77929A00777
$$ 275477 75400 150267 125059 -76574 260504 209576 231317 82355 126129 304058 100777
13315C62931E3970e8747C9618K93917A31852B5538K05293G1971J95619D4325K13856
$$ 362931 53970 -58747 39618 333535 131852 25538 230831 71971 267590 44325 258181
13304B58181q0807p1698b115H444J33498L38451k3027A03287d49756A25239J13732
$$ 258181 177374 105676 -2115 8444 141942 480393 457366 103287 -449756 125239 238971
13293B38971r5223K27491b02099B28236A07930O1586c00650E66889a51607I8470
$$ 238971 143748 371239 -202099 228236 107930 169516 -300650 566889 -151607 98470
13282B79418n0734E0690L2759K96736a91769A48699R0160h096B16227r9092n6444
$$ 279418 228684 50690 83449 380185 -191769 148699 238859 -8096 216227 117135 60691
13271F0691c7612G8318b66502A61190L0958g3919B56755A8221a44756A56181F4692
$$ 60691 -37612 78318 -266502 161190 192148 -73919 256755 18221 -144756 156181 64692
13259A26670d2743A66459J97975A38709a0239D9725M6200R8555q3017L15677b1134
$$ 126670 -42743 166459 364434 138709 -10239 49725 95925 194480 111463 427140 -21134
13247c55139H6681N2321c09471B31557h548A65063E3672f7496A45982I763N1692
$$ -355139 86681 139002 -309471 231557 -8548 165063 53672 -67496 145982 9763 61455
13236F1455P8646K06304A42924j2364L5265J16222I7067M11509B43756a48046
$$ 61455 140101 346405 142924 130560 165825 282047 97067 508576 243756 -148046
13225G367J23546a05459B84774b85185J27669D4923Q4134M7037J45480b02428
$$ 7367 130913 -105459 284774 -285185 -157516 44923 129057 176094 321574 -202428
13214g3113p0167O427C21355a13524B29320I5165J84583c6071A34365J44620O9343
$$ -73113 -143280 -136853 321355 -113524 229320 95165 279748 -36071 134365 278985 348328
13203C48328A989J35545E5666J73619F5994L31963A14324n953J96356h3570j7847
$$ 348328 1989 137534 55666 229285 65994 397957 114324 108371 304727 -83570 -101417
13192a01417o6056B01391d2985A2250q60h5123H6793a30363d7812o830I6320c23828
$$ -101417 -167473 201391 -42985 12250 11390 -85123 86793 -130363 -47812 -54642 96320 -323828
13179C04170l9237d3814O066D2750J93338k4361b88559g4412A12933c58089J55178
$$ 304170 264933 -43814 -37748 42750 236088 211727 -288559 -74412 112933 -358089 -202911
13168b02911f0075K4760C3844b19978f0676E4744r339J13236f1576m1453K5005
$$ -202911 -60075 -35315 33844 -219978 -60676 54744 45405 158641 -61576 -103029 -78024
13157g8024A39441f1748C5873M13698a51208C59268A72397a31555j23138J12580
$$ -78024 139441 -61748 35873 449571 -151208 359268 172397 -131555 -254693 -142113
13147a42113a2368l01232B77315A29942N3216b40109f0522j07208N2656k15477
$$ -142113 -12368 -313600 277315 129942 183158 -240109 -60522 -167730 -115074 -330551
13137c30551A79237J32892F3486a74089E1500B4587K42382C7539J2823K30629
$$ -330551 179237 312129 63486 -174089 51500 24587 266969 37539 50362 280991
13127B80991n6231K04272A1240L4189b45150G2329j5038J42998r2843c02650I2395
$$ 280991 224760 429032 11240 45429 -245150 72329 57291 200289 107446 -302650 92395
13115B75373G9031q482G265K39151F3127K22034A14383j7644h3347A63279C6397
$$ 275373 79031 70549 7265 246416 63127 285161 114383 96739 -83347 163279 36397
13103A68609n4213r843a45558H6026K2276J22683M0526a72057B10545I9262b34132
$$ 168609 114396 104553 -145558 86026 108302 230985 271511 -172057 210545 99262 -234132
13091a2493A92618f7323D2342J82441i4469C4746K1123K05346g1264q6335A97697
$$ -12493 192618 -67323 42342 224783 -94469 34746 55869 261215 -71264 -157599 197697
13079A19054b78417A45033c64930H925K97348j39173l4343N7216e9267j80904
$$ 119054 -278417 145033 -364930 8925 306273 167100 132757 189973 -59267 -240171
13069b40171n0049P8089B85493A36101q359b10215B13105A7990J83735n6380K47935
$$ -240171 -290220 -212131 285493 136101 127742 -210215 213105 17990 201725 145345 393280
13058C93280a60169j48475H9571Q600l516c38534b0956o161G9865C6535Q3735
$$ 393280 -160169 -308644 89571 98171 94655 -338534 -20956 -27117 79865 36535 120270
13047A20270J13808r2150O5635m3750K89901j88970a46196I7282L07930j93125
$$ 120270 234078 141928 207563 163813 453714 264744 -146196 97282 405212 212087
13037B12087n3682a376A40317h4680F36978g3841B01447C3475a37676A15566N0534
$$ 212087 158405 -1376 140317 -84680 636978 -73841 201447 33475 -137676 115566 166100
13026A66100L4345e7232j8518G7158h7544r8999A15122J10550K305c39661i6714
$$ 166100 200445 -57232 -75750 77158 -87544 -186543 115122 225672 227977 -339661 -96714
13014a73126E6425K81946c6818A68036l805p4762a51261b4431C83256a92370G7785
$$ -173126 56425 338371 -36818 168036 164231 89469 -151261 -24431 383256 -192370 77785
13002A15610K16091h4121J3991B08542R6466F8780A4237a13277k07015B68382
$$ 115610 331701 -84121 -70130 208542 305008 68780 14237 -113277 -320292 268382
12991a31117b1751j21911A95005j4324h6936q4916d0133G8377b78015C50107h5724
$$ -131117 -21751 -143662 195005 180681 -86936 -171852 -40133 78377 -278015 350107 -85724
12979A28676f2685G4799J81917a02991A41416J5916a94597J1852Q1971B78534
$$ 128676 -62685 74799 256716 -102991 141416 157332 -194597 -182745 -100774 278534
12968c5157j58338A57482d6958k57186A10836K8131k8717L2339a41148B2295P7545
$$ -35157 -193495 157482 -46958 -304144 110836 138967 110250 142589 -141148 22295 99840
12957I9840F595e90m7162l8377h297j37346f7657k33580B07f9874L1195q4780
$$ 99840 6595 -590 -47752 -86129 -8297 -145643 -67657 -301237 207 -69874 -38679 -123459
12945a23459e5570B60514p8835F8006a16064n9409A70637d7514A98775F2444J04049
$$ -123459 -55570 260514 181679 68006 -116064 -175473 170637 -47514 198775 62444 166493
12934A66493a29751N6625A2270e4533J3041A34697A3920L26206I901c30028I9950
$$ 166493 -129751 -73126 12270 -54533 -41492 134697 13920 340126 9901 -330028 99950
12922H8018B3069a46077A67220a70594A075J41690J10046g107A70682a84365M4129
$$ 88018 23069 -146077 167220 -170594 1075 142765 252811 -7107 170682 -184365 -140236
12911a40236d4029D8867c60862A30747j6232M8748c00693a09995j59944h009j84945
$$ -140236 -44029 48867 -360862 130747 114515 163263 -300693 -109995 -269939 -8009 -192954
12900a92954A78627a2910j27043H3610M7939a10095A45236o1174h6561C9268q774
$$ -192954 178627 -12910 -139953 83610 131549 -110095 145236 84062 -86561 39268 30494
12889C0494J16562b86905D4782i0946D93342a26232B71155J3494A4859i9052A87147
$$ 30494 147056 -286905 44782 -90946 493342 -126232 271155 284649 14859 -99052 187147
12877A2514J1167a30970K7487j0892D7867a4359A48762P2607c98A21938c36027
$$ 12514 23681 -130970 -103483 -114375 47867 -14359 148762 221369 -398 121938 -336027
12865i011D1083C942J37973c01454h186C433c29356C46099j21807a265C4405J48207
$$ -9011 41083 3942 141915 -301454 -8186 3433 -329356 346099 224292 -1265 34405 182612
12853A82612D5053a06777M00e568l72938c9735j44953E51675F9215a68066F1182
$$ 182612 45053 -106777 -106377 -5568 -378506 -39735 -184688 551675 69215 -168066 61182
12841A80641J43050b01991I3549a28332B32076d72755A31216a66199j76470J42496
$$ 180641 323691 -201991 93549 -128332 232076 -472755 131216 -166199 -342669 -200173
12831b00173A89324J52217a66179I519a18511M8918b2012k35854A57165Q3364
$$ -200173 189324 341541 -166179 9519 -118511 -69593 -22012 -257866 157165 240529
12821B40529A15486L38645f3297A05190b40564c9123I0789N2409A4538J90372
$$ 240529 115486 454131 -63297 105190 -240564 -39123 90789 143198 14538 204910
12811B04910b80166J20824E8836j21a42333I6919d2162j55250B55774p7337h2805
$$ 204910 -280166 -159342 58836 58715 -142333 96919 -42162 -197412 255774 178437 -82805
12799a69478C46248A57457d1865k0462l1688B4614c09605a9932k12054C55876
$$ -169478 346248 157457 -41865 -62327 -94015 24614 -309605 -19932 -231986 355876
12788A4416b03730D8121N3544C4605N9403b41126G9912c62264a49856n9565B71657
$$ 14416 -203730 48121 101665 34605 94008 -241126 79912 -362264 -149856 -209421 271657
12776a42383A55360C6444L3107e09912a99479A4470c52264G6414f6563k07680
$$ -142383 155360 36444 69551 -509912 -199479 14470 -352264 76414 -66563 -274243
12766b74243C18313d494k5874a3825B13125C5539j3009p655J83062g1199k40636
$$ -274243 318313 -4494 -30368 -13825 213125 35539 22530 14875 197937 -71199 -311835
12755c11835a7172C313b31432a6218a1G7086a13053A41c45411E8601K5325b46518
$$ -311835 -17172 3313 -231432 -16218 -11 77086 -113053 141 -345411 58601 83926 -246518
12742A35196K60311e9275G2537L136h8605A62706R1562P1533A62627g2377I631
$$ 135196 395507 -59275 72537 75673 -88605 162706 254268 325801 162627 -72377 9631
12730g9657B3276i4635B43646L3342h2615r9087B62673i8969j78237A89356i0115
$$ -79657 23276 -94635 243646 276988 -82615 -181702 262673 -98969 -277206 189356 -90115
12718c93850g3601G8329d0212A49076B2073a12637j24772h4128E5886L05203o0698
$$ -393850 -73601 78329 -40212 149076 22073 -112637 -237409 -84128 55886 361089 300391
12707C00391a09731B55183o6153R8768H4631O3595a43077B70034A8921R2214a93457
$$ 300391 -109731 255183 189030 287798 84631 148226 -143077 270034 18921 111135 -193457
12695A3377b69792B28202a57515D2653O292J01759M4914K9735J71860b05962B41047
$$ 13377 -269792 228202 -157515 42653 48945 150704 195618 225353 397213 -205962 241047
12683e9967k03601A32753K13302l5041P0488A66260J95764H6392o587a33184A38781
$$ -59967 -263568 132753 346055 311014 381502 166260 362024 86392 79805 -133184 138781
12671g1784A61507F2944J35939B9663L34636a49535M7388J2037L7155B1605r72
$$ -71784 161507 62944 198883 29663 364299 -149535 -102147 -90110 -52955 21605 20633
12660B0633i9803H6804M7320b20412B08866b67543Q818C49086e6109k54274B30338
$$ 20633 -99803 86804 134124 -220412 208866 -267543 -258725 349086 -56109 -310383 230338
12648a42622C90177A72005a29631K5293A13741a85742H2056C7087p351K03127
$$ -142622 390177 172005 -129631 -104338 113741 -185742 82056 37087 29736 232863
12638B32863b20510B54135e78780A24878e1402A83241K26628j57611c01563C61696
$$ 232863 -220510 254135 -578780 124878 -51402 183241 409869 252258 -301563 361696
12627a9728B22833i0535b9869j34029D405K99829a93906M3080H4296h5075b4015
$$ -19728 222833 -90535 -29869 -163898 4405 304234 -193906 -150826 84296 -85075 -24015
12615B77603n5092B0899a70075A27150a37883A53713F5666J55230e6297A57998
$$ 277603 222511 20899 -170075 127150 -137883 153713 65666 220896 -56297 157998
12604a4761E9348b2798C73398j48074R4269G8817J13831K99957D6123g3273K3223
$$ -14761 59348 -22798 373398 225324 319593 78817 192648 492605 46123 -73273 -50050
12593e0050j61246L7722c2780C9355h5701c7261k39686D9052J46878m2223d13025
$$ -50050 -211296 -173574 -32780 39355 -85701 -37261 -276947 49052 195930 153707 -413025
12581h7962j4910C1565b16710H3607M6989g6929r6868A46044k3390A4741K88641
$$ -87962 -102872 31565 -216710 83607 130596 -76929 -173797 146044 122654 14741 303382
12570C03382a92058j12454g41A7281d03852a23701K0910B83689g3297q9334d5565
$$ 303382 -192058 -304512 -741 17281 -403852 -123701 -102791 283689 -73297 -162631 -45565
12558A14445d0088A83678E4640A3757a7306D2492C979c24687A3609b53350A62496
$$ 114445 -40088 183678 54640 13757 -17306 42492 3979 -324687 13609 -253350 162496
12546g5359k11961a19322A39790n2374J64414a50414M2472B48303a41898k38636
$$ -75359 -287320 -119322 139790 87416 251830 -150414 -107942 248303 -141898 -380534
12536c80534A72566b43497g9599C1561c66781H7735B5229i0666j30057A55489
$$ -380534 172566 -243497 -79599 31561 -366781 87735 25229 -90666 -220723 155489
12525a99673c2217H6244b75234h7512j08276J7181D1634F08a00687C54165d68025
$$ -199673 -32217 86244 -275234 -87512 -195788 -178607 41634 608 -100687 354165 -468025
12513E1377R3858n2642d10508p9091A57489c3878k30225J29071G2831B6141r734
$$ 51377 145235 92593 -410508 -489599 157489 -33878 -264103 -135032 72831 26141 16407
12502A6407N996f7743j23260A24569M697C626h214l0928D4144J75734b01398N9267
$$ 16407 22403 -67743 -191003 124569 129266 3626 -8214 -39142 44144 219878 -201398 -142131
12490a42131k3545k5322B53732C8969a60168H5730J35680I8730f9674d93m76045
$$ -142131 -165676 -190998 253732 38969 -160168 85730 221410 98730 -69674 -493 -476538
12479d76538e161j69634g3069r0859r362O6155j10146B35557c9506k39883a20776
$$ -476538 -5161 -174795 -73069 -163928 -173290 -107135 -217281 235557 -39506 -279389 -120776
12467A36492b04782d290k18132l0346e5831G565J45574a04612e1824J1638C56048
$$ 136492 -204782 -4290 -222422 -252768 -55831 7565 153139 -104612 -51824 -40186 356048
12455h3758A83801b62299Q2927C6892r226N163M4505e0837r9179N721L9181j91623
$$ -83758 183801 -262299 -179372 36892 27666 32829 77334 -50837 -150016 -144295 -105114 -296737
12443b96737A14477a90681A82239m8310f3188k60799g0858J7145F8603i441l085
$$ -296737 114477 -190681 182239 133929 -63188 -323987 -70858 -53713 68603 -9441 -12526
12432a2526n7264a6571A57059b64023g5617m8306r507A27312a343k11510M8281
$$ -12526 -69790 -16571 157059 -264023 -75617 -123923 -133430 127312 -1343 -212853 -164572
12421a64572A07863C5773J12422a11814A83671H2366J07268a48727F308i5018
$$ -164572 107863 35773 148195 -111814 183671 82366 189634 -148727 6308 -95018
12410a02650I0954J6824J21445p2500l2361B8791f8351A04365a40950A29680l1751
$$ -102650 90954 107778 229223 156723 124362 28791 -68351 104365 -140950 129680 97929
12399I7929a07260B18506l9133a14110B78597a28741k0090f3243l717j20604Q4048
$$ 97929 -107260 218506 179373 -114110 278597 -128741 -148831 -63243 -66960 -187564 -103516
12388a03516B84580H1481J60535a50763D9397K25583a96878O4405m5759A84230
$$ -103516 284580 81481 242016 -150763 49397 274980 -196878 -132473 -178232 184230
12377b16323M01A85135H6633K6101a34071A54939K07326a83892P8404F1791J36639
$$ -216323 -215922 185135 86633 112734 -134071 154939 362265 -183892 -105488 61791 198430
12366A98430c1385k87770D2041a77314m3028a06749j07472A66638F9033a7824
$$ 198430 -31385 -319155 42041 -177314 -220342 -106749 -214221 166638 69033 -17824
12355a8160j03783R977k93123a32948k21988J55344B75666k7127H9864b30871
$$ -18160 -121943 -111966 -405089 -132948 -354936 -199592 275666 248539 89864 -230871
12344a54658M3309A15837L8377G6900f2358E3166A2494K91342r1250c11049A85603
$$ -154658 -111349 115837 154214 76900 -62358 53166 12494 303836 212586 -311049 185603
12332I286e6396o582B71939K37982a06234B25621O4755L3355r9692J8114E1637
$$ 9286 -56396 -62978 271939 509921 -106234 225621 290376 323731 224039 242153 51637
12320B77748H6502J18042o5348C5905g8651B87794A15276h5019A9111f4409B64933
$$ 277748 86502 204544 139196 35905 -78651 287794 115276 -85019 19111 -64409 264933
12308D76350A6748M5472o220A4060e1036k8423G4409b88709A68092k2529m9268
$$ 476350 16748 62220 56000 14060 -51036 -79459 74409 -288709 168092 145563 96295
12297I6295l5743O5193a76915e6210B18470d3522D0490e1828C12064I6240e0401
$$ 96295 60552 125745 -176915 -56210 218470 -43522 40490 -51828 312064 96240 -50401
12285a17208F3445J01017e9810B98312B8067K24870j11972f919H5555A5659b78741
$$ -117208 63445 164462 -59810 298312 28067 252937 140965 -6919 85555 15659 -278741
12273A17603N515K02543j18094c8590E2877a85917D83105E1749B2228J26933L7584
$$ 117603 123118 325661 207567 -38590 52877 -185917 483105 51749 22228 149161 186745
12262A86745J79705i314B38397K3196H9936J75470B3210O8803a09214k9900A14890
$$ 186745 366450 -9314 238397 261593 89936 265406 23210 92013 -109214 -139114 114890
12250A8279J93174I4562M7572k5284i332p7076B32504n6705d5314r7935E4246
$$ 18279 211453 94562 142134 116850 -9332 -86408 232504 175799 -45314 -143249 54246
12238E7887O875O0457d2991B306J06246h6426r1102P8975a7847H2897J03838g9998
$$ 57887 64762 125219 -42991 2306 108552 -86426 -177528 -98553 -17847 82897 186735 -79998
12225B85430o4094K1169j1955K60548j90081L2239d9892A62102E8406A7832K39202
$$ 285430 221336 242505 230550 491098 301017 333256 -49892 162102 58406 17832 257034
12214B57034r5316J05904a06949d8568E20719D6978L50195f8172j8819A08584
$$ 257034 161718 267622 -106949 -48568 520719 46978 397173 -68172 -86991 108584
12203E1225A8319a84077f4126B94196h0117E20153j18221A53183p0426j5971h9254
$$ 51225 18319 -184077 -64126 294196 -80117 520153 401932 153183 82757 66786 -89254
12191B49975F6733K151R1320h3976I8580B7153d16964B682d02604G2260K13738
$$ 249975 66733 68884 160204 -83976 98580 27153 -416964 2682 -402604 72260 285998
12180B85998A6627a37319A31271M28884H416J67202D4541R0599m2246O635J89092
$$ 285998 16627 -137319 131271 560155 8416 175618 44541 135140 92894 99529 288621
12169B88621b5496E22865A62850N9618K72832a903B85652p0667P0046a7540F0822
$$ 288621 -25496 522865 162850 222468 495300 -1903 285652 214985 285031 -17540 60822
12157f9879m4795C62002C6810a59920B65838C6953D218c4962J1053k4219D8624
$$ -69879 -114674 362002 36810 -159920 265838 36953 4218 -34962 -23909 -48128 48624
12145A5746K03227C8263a27521A48106b94311e1847H8324O485a65664M7380L3732
$$ 15746 218973 38263 -127521 148106 -294311 -51847 88324 94809 -165664 -118284 -84552
12134h4552K9533b3854I3026j5694C4439J69015C0781r090J59494f3912A22199
$$ -84552 -55019 -23854 93026 77332 34439 203454 30781 21691 181185 -63912 122199
12122C10720j19159n2646M9320C2711J59938b18755D45428A61816Q8539f4977
$$ 310720 191561 138915 188235 32711 192649 -218755 445428 161816 250355 -64977
12111B09332N891E6139g8456A44440b09880A34773l9859M920K71191a34416C17286
$$ 209332 215223 56139 -78456 144440 -209880 134773 94914 99834 371025 -134416 317286
12099b94420E6793P4058l6033B1905f1922A69457J29945j34054F1798L2058Q7824
$$ -294420 56793 130851 94818 21905 -61922 169457 299402 165348 61798 93856 181680
12088A81680Q6767a91171F5413J2649f628A99438b1154r4191d6769A79847P6640
$$ 181680 268447 -191171 65413 78062 -6628 199438 -21154 -115345 -46769 179847 256487
12077B56487D0731d3531k1038A73137K48898j77154H527J59667L9754h0156G9802
$$ 256487 40731 -43531 -64569 173137 422035 244881 8527 168194 207948 -80156 79802
12065d0658B78274a60125A84642p6805O3462E240b3745C32946M6429A64790M9725
$$ -40658 278274 -160125 184642 107837 171299 5240 -23745 332946 379375 164790 214515
12054B14515g0626k40521a24811E1432J4237a10303l6288A09911K54346H4130
$$ 214515 -70626 -311147 -124811 51432 65669 -110303 -146591 109911 364257 84130
12043I4796i9031a6380B13977k9920l281a70070k1369l8122A66318a91933E0271
$$ 94796 -99031 -16380 213977 184057 180776 -170070 -191439 -229561 166318 -191933 50271
12031A3841L4150K9425f8933A57649A4770K663K12709P5126Q3054e6987H9191
$$ 13841 47991 77416 -68933 157649 14770 17433 230142 305268 388322 -56987 89191
12019E47652c065k18498M9040A67477H0262i0054A56679a88820j8924C44786a87786
$$ 547652 -3065 -221563 -172523 167477 80262 -90054 156679 -188820 -207744 344786 -187786
12007f3202j6276A69716p1131a13840H5711c1204G4487m213b306k00519F7972
$$ -63202 -79478 169716 98585 -113840 85711 -31204 74487 70274 -2306 -202825 67972
11995H6593K13850H9186k0958a25462A7459M2627d1216A42059a21112C27907h4169
$$ 86593 300443 89186 68228 -125462 17459 60086 -41216 142059 -121112 327907 -84169
11983A82848k5212J19312C1730a02208A12995D4698R654N4454i6567k89509A12174
$$ 182848 157636 276948 31730 -102208 112995 44698 54352 108806 -96567 -386076 112174
11971a01611C30200a57597g440o59k27208P7070i052A80130a82011A54015a08992
$$ -101611 330200 -157597 -7440 -8099 -235307 -158237 -9052 180130 -182011 154015 -108992
11959b38580N9273c8546h468D44a69718c8112j05097A31229d80021b053A62003
$$ -238580 -179307 -38546 -8468 444 -169718 -38112 -143209 131229 -480021 -2053 162003
11947A28845B1039g4001D70g0508j88517A46937n6519K75083f3201B38990i2286
$$ 128845 21039 -74001 470 -70508 -259025 146937 90418 365501 -63201 238990 -92286
11935E6337J63495p8816d26265c0758F9662a95264d5121j86583K2784g5641D73664
$$ 56337 219832 141016 -426265 -30758 69662 -195264 -45121 -231704 -208920 -75641 473664
11923A20265A0910B928d8609A47049A7366f5809j05524A08628D4127K8637d5390
$$ 120265 10910 2928 -48609 147049 17366 -65809 -171333 108628 44127 72764 -45390
11911b67295J15435P1275A96218c8946A23866b61371D6696e8930j26079M2718
$$ -267295 -151860 -80585 196218 -38946 123866 -261371 46696 -58930 -185009 -142291
11901a42291n0048P1143A23481K92255a6560Q235A67089o1830K29920k6424a95598
$$ -142291 -192339 -121196 123481 415736 -16560 -8325 167089 105259 335179 308755 -195598
11889a75640O8A85223K53865I0909e1115j14282O6993A16345i5358j73511F2537
$$ -175640 -175572 185223 439088 90909 -51115 -165397 -98404 116345 -95358 -268869 62537
11877b44194C7970b11284A86745e8611m1923K938K9243A26316R0489b67669A7142
$$ -244194 37970 -211284 186745 -58611 -100534 -97596 -68353 126316 216805 -267669 17142
11865i6551L6415j3788L2713l18546a39372K2281j45004N0721d6504j9279M916
$$ -96551 -60136 -73924 -41211 -359757 -139372 -117091 -262095 -211374 -46504 -65783 -60867
11854f0867a5422q7308C30215L7372a500b30q4213j06429A51555b25136j0714
$$ -60867 -15422 -102730 330215 367587 -1500 -230 -84443 -190872 151555 -225136 -235850
11843b35850m5114a18486D04525a91200c1401j97334b3770C22138a34314j66123
$$ -235850 -280964 -118486 404525 -191200 -31401 -228735 -23770 322138 -134314 -300437
11833c00437B61361a30732C68297j66410a75192n2926Q5565C3740L7312d30697
$$ -300437 261361 -130732 368297 201887 -175192 -228118 -142553 33740 71052 -430697
11822B07606d10659G3965J52269d88155a28092A36237b72160i0427j79753B4838
$$ 207606 -410659 73965 226234 -488155 -128092 136237 -272160 -90427 -270180 24838
11811E830b55409O3958O4818l7358d3953J5939C9648a35187E9889A0385J25699
$$ 5830 -255409 -191451 -126633 -163991 -43953 -28014 39648 -135187 59889 10385 136084
11800A36084m3949b12740K8350f7646G3905P9339E1308a51717A99612A9981J31316
$$ 136084 92135 -212740 -184390 -67646 73905 153244 51308 -151717 199612 19981 151297
11789A51297b16364f9826A94959p4648E4441a29590C5481J91766b55607d0222
$$ 151297 -216364 -69826 194959 120311 54441 -129590 35481 227247 -255607 -40222
11778a7393L526A17805c50473J39255i3382P448r6787M2692B5505F895e80771
$$ -17393 -13867 117805 -350473 -211218 -93382 -85934 -182721 -140029 25505 6895 -580771
11766B27891c20807A60855m3704A0667K6615J29459E835h213o9730K8049B05834
$$ 227891 -320807 160855 117151 10667 37282 166741 5835 -8213 -77943 -49894 205834
11754h4945q4323A56447d0065B44266a48211M1512p483B3017J85545h3073A30746
$$ -84945 -169268 156447 -40065 244266 -148211 -106699 -114182 23017 208562 -83073 130746
11742a49671r05d2317l8280K2074j20619j25171G911a57386j4394A88021p7857
$$ -149671 -150576 -42317 -80597 -58523 -179142 -304313 7911 -157386 -171780 188021 110164
11731A10164l9565J9548O4254F5515A900c63578Q5339G9245j1833l854L00599
$$ 110164 70599 90147 154401 65515 1900 -363578 -278239 79245 67412 63558 364157
11720C64157A2087R3514n2575N156a38683B38256c7424j06935j01239g9832j18644
$$ 364157 12087 105601 53026 58182 -138683 238256 -37424 -144359 -245598 -79832 -198476
11709a98476a6103A3028Q3853o551l5145J66530B4609J08277c64159K6973A5669
$$ -198476 -16103 13028 96881 90330 55185 221715 24609 132886 -364159 -337186 15669
11697A25987i7438A66058h3220o500A82721p2444l8071P4192k1134L448a79573
$$ 125987 -97438 166058 -83220 -89720 182721 110277 72206 146398 125264 128712 -179573
11685a09847H9133b16684B19547E9856a90808F9241L8807b86630g6494H3767J9173
$$ -109847 89133 -216684 219547 59856 -190808 69241 108048 -286630 -76494 83767 102940
11674A02940h7503c3501C11804F1659b52950A70026R046J00842f1214b57A04558
$$ 102940 -87503 -33501 311804 61659 -252950 170026 179072 279914 -61214 -257 104558
11662F068f3119B24454l8673r2571F975K16167a49739k0790A37361d5003G6118
$$ 6068 -63119 224454 185781 93210 6975 223142 -149739 -170529 137361 -45003 76118
11650H704K45646a91673B94817A04526m9185J50846d7413C5360b25249R9000K7240
$$ 8704 254350 -191673 294817 104526 55341 206187 -47413 35360 -225249 -126249 -99009
11639i9009B20378q8422c48706I1591J14007k6946o2413j7517f0717C1655J00315
$$ -99009 220378 131956 -348706 91591 205598 178652 116239 98722 -60717 31655 131970
11628A31970B4945a96047P6537A10881d0409A23538C0664a8237l10300k713D6067
$$ 131970 24945 -196047 -119510 110881 -40409 123538 30664 -18237 -328537 -331250 46067
11616B29278c39154c7128l16346c3713B721O1166K3511a95357e6299i28k04385
$$ 229278 -339154 -37128 -353474 -33713 2721 63887 87398 -195357 -56299 -928 -205313
11605b05313A81185A5981J94977F1741b89325A72336J05469H258R0101P1115b3613
$$ -205313 181185 15981 210958 61741 -289325 172336 277805 8258 98359 169474 -23613
11593a5251k0592H5931b38993D70398G4695g9111j53154c6968C29129A06902K42630
$$ -15251 -35843 85931 -238993 470398 74695 -79111 -232265 -36968 329129 106902 349532
11582C49532f1809B23630A9136M79730B7493R6979a05248H0370B9817P1526J94392
$$ 349532 -61809 223630 19136 498866 27493 124472 -105248 80370 29817 101343 295735
11571B95735q8585b73840C406g6472j32559D6658N0269L4057a79799j9978C95033
$$ 295735 207150 -273840 3406 -76472 -209031 46658 96927 130984 -179799 -199777 395033
11559A89687i1790g962j6283m93495a1168A34296J0413o1309J29472o8661e901
$$ 189687 -91790 -7962 -24245 -517740 -11168 134296 144709 83400 212872 144211 -5901
11547a56564K518H7728J51389a26156N3690L1191I2809d7361F5908J36446k2045
$$ -156564 -154046 87728 239117 -126156 -72466 -41275 92809 -47361 65908 202354 180309
11536A80309D6072K3616b05718B97373q8148a99585J8225C311K98119c02748G9260
$$ 180309 46072 69688 -205718 297373 209225 -199585 -181360 3311 301430 -302748 79260
11524A68402b72657A32976J5152J9564B8685a32838k7515A76234F4491J23869
$$ 168402 -272657 132976 148128 167692 28685 -132838 -160353 176234 64491 188360
11514A88360k7254b7610B17213G0652a37709A37775J60156b05924B4687L8520
$$ 188360 161106 -27610 217213 70652 -137709 137775 297931 -205924 24687 63207
11504F3207a98926G0011f0151B23088j8396b78252A72135m4012c8000B99016a44697
$$ 63207 -198926 70011 -60151 223088 204692 -278252 172135 128123 -38000 299016 -144697
11492B38709G4763a49950F4993J90829b47420L5749F6759J58402k2687r7586b10674
$$ 238709 74763 -149950 64993 255822 -247420 -211671 66759 225161 202474 104888 -210674
11480I7284R5326a53086a4311G6625J28667A8167k925J581Q4445m5998A5591P7267
$$ 97284 192610 -153086 -14311 76625 205292 18167 15242 16823 101268 55270 15591 92858
11468I2858m3305K00840A19872a26497B93690j03076F1119J43968m1591a11538
$$ 92858 49553 250393 119872 -126497 293690 190614 61119 205087 163496 -111538
11457B92520J19377A9159e5271G0365e3523B34025c80685J62669D2685Q6145A6292
$$ 292520 411897 19159 -55271 70365 -53523 234025 -380685 -218016 42685 128830 16292
11445a2007p001A73230b51054c3125G0436C1769j4057i4634b4081h375k29558
$$ -12007 -19008 173230 -251054 -33125 70436 31769 17712 -94634 -24081 -8375 -237933
11434b37933P205B27323k8001b54060C02555F2192a70390D7415d4438A80440R6252
$$ -237933 -230728 227323 199322 -254060 302555 62192 -170390 47415 -44438 180440 276692
11423B76692b44638B29660A11537B5855J01862b9870k06390A62091b79218B26992
$$ 276692 -244638 229660 111537 25855 127717 -29870 -236260 162091 -279218 226992
11412I4164d119l04436A16704b31353A35057K8074J41369h3231G1616j6230c0175
$$ 94164 -4119 -308555 116704 -231353 135057 163131 304500 -83231 71616 55386 -30175
11400a82960B66863A09182n3045g0295o5849d9875F7120K14561b20665E7704a4420
$$ -182960 266863 109182 56137 -70295 -136144 -49875 67120 281681 -220665 57704 -14420
11388A54202c10058d223k76892R6067g4167B70257E8235L1873J21176J52306e8494
$$ 154202 -310058 -4223 -281115 -185048 -74167 270257 58235 90108 211284 363590 -58494
11376D3590a5377D556a5674A80995b46374R2740M3820A86588E6084i1778C15219
$$ 43590 -15377 4556 -15674 180995 -246374 -153634 -109814 186588 56084 -91778 315219
11364b04417B42108c5200k07336j0180B7127d5670C27853b67973c3355k1732J066
$$ -204417 242108 -35200 -242536 -252716 27127 -45670 327853 -267973 -33355 -55087 -54021
11353e4021a6739B56861G6355L6039l4136b16187A55121f338k7517P370C4003
$$ -54021 -16739 256861 76355 112394 78258 -216187 155121 -6338 -33855 -26485 34003
11341A7197J91370c34537a6894k68527P9814N8151J9242b5006j78861D9800g2218
$$ 17197 208567 -334537 -16894 -285421 -205607 -147456 -128214 -25006 -203867 49800 -72218
11329i6407E1777b42885F6545a52218l196C02739H1528h1242p3799E3207i1739
$$ -96407 51777 -242885 66545 -152218 -155414 302739 81528 -81242 -155041 53207 -91739
11317b32269A25199a90317M0996B61123j08194b73657c047l98952J69291A07681
$$ -232269 125199 -190317 -149321 261123 152929 -273657 -3047 -401999 -232708 107681
11306b12353Q8541d3428l13132a70273j47966d6489B19425R9350e05524a45385
$$ -212353 -123812 -43428 -356560 -170273 -318239 -46489 219425 318775 -505524 -145385
11295a16138l02601B7592J23877a56547M3720A48876j5977A2111b19012I9741
$$ -116138 -418739 27592 151469 -156547 -112827 148876 132899 12111 -219012 99741
11284B10067q4760b39182o8127L4228D11753d38347F0710J08357a44932o1413
$$ 210067 125307 -239182 -307309 -273081 411753 -438347 60710 169067 -144932 -206345
11274b06345B27830i7848l62280c2368E7286e4796B03238d64764f4247N651I6698
$$ -206345 227830 -97848 -460128 -32368 57286 -54796 203238 -464764 -64247 -58596 96698
11262D7360K010b87671b4423G9160l3111L7287g9302k2939M024A74642A2160b74798
$$ 47360 49370 -287671 -24423 79160 46049 83336 -79302 -102241 -98217 174642 12160 -274798
11249a48754L2324A04576a73243j0476C6855L9232O955a91750P5296e0384D7267
$$ -148754 -116430 104576 -173243 -183719 36855 76087 83042 -191750 -116454 -50384 47267
11237a89604M1422P3198q1112l9948M2700k2759D9689a5045H9622J373k1474d2184
$$ -189604 -148182 -74984 -156096 -196044 -153344 -176103 49689 -15045 89622 90995 69521 -42184
11224B8904b19324E634K45649C0277b30924i7070p5924j51597B2146a43673A57371
$$ 28904 -219324 5634 251283 30277 -230924 -97070 -172994 -324591 22146 -143673 157371
11212a15j06172m1317C965N6494K67593a67382M8325B5636c74175C77391F4973
$$ -115 -106287 -147604 3965 60459 328052 -167382 -119057 25636 -374175 377391 64973
11200b0436A84677h9689k02364A84500J42470A48056l0586P8738K04469b10880
$$ -20436 184677 -89689 -292053 184500 326970 148056 117470 196208 400677 -210880
11189b50030E1938b40885H1642J99441i402k11417l0262H6257L8478Q1553b37331
$$ -250030 51938 -240885 81642 281083 -9402 -220819 -251081 86257 124735 206288 -237331
11177A61625g8105L0412A39070a833C47619a64154M8885C8034f7289l84526E9104
$$ 161625 -78105 -47693 139070 -1833 347619 -164154 -115269 38034 -67289 -451815 59104
11165c40832H4671B204a59951E5726b5577k01986O3537E2393K3238e4333m6019
$$ -340832 84671 2204 -159951 55726 -25577 -227563 -164026 52393 75631 -54333 -100352
11154a00352B58507b11101A19982b364I0380R7836b84396F1154G792L4715K8086
$$ -100352 258507 -211101 119982 -2364 90380 188216 -284396 61154 7792 42507 70593
11143G0593L6512H685c73151B1550J23034b10979k36076J46500f9809h075A55751
$$ 70593 107105 8685 -373151 21550 144584 -210979 -447055 -300555 -69809 -8075 155751
11131a05803f987n826m2950G2270C547b96384C70100c69137I494b1519H3901b1820
$$ -105803 -6987 -12813 -55763 72270 3547 -296384 370100 -369137 9494 -21519 83901 -21820
11118B43044H8628b05852E9180J02639b8634B69651q762J68523c21098A62771
$$ 243044 88628 -205852 59180 161819 -28634 269651 260889 429412 -321098 162771
11107B06030J5523D3694J22720g5905A64504D1267J78957k0778m6204b7285A87985
$$ 206030 221553 43694 166414 -75905 164504 41267 220224 199446 153242 -27285 187985
11095a55774E7691J45186j5949E0864K78061j53198q1287B6068K36277c1950B42998
$$ -155774 57691 202877 186928 50864 328925 175727 94440 26068 262345 -31950 242998
11083A82887F2931P1360K52684B3714H875K39717K7040C2120L16112m7511F1581
$$ 182887 62931 134291 386975 23714 8875 248592 275632 32120 348232 300721 61581
11071A99095c3552A99649J1438k5243J60018h5342C43786r5465r1190M556K600
$$ 199095 -33552 199649 211087 185844 345862 -85342 343786 248321 157131 161687 164287
11060A64287J37745r8970K79127B34737K26373j34380r9131m469M6730K65751
$$ 164287 302032 203062 482189 234737 461110 326730 227599 223130 269860 535611
11050E35611K77998o2079l64127J42552P3317Q164J44548J39965l97800J17908
$$ 535611 813609 751530 387403 529955 603272 611436 755984 895949 498149 616057
11040F16057J7621r2924K55671k73646J35940j03168J40737k20029M54493B92819
$$ 616057 633678 540754 796425 522779 658719 555551 696288 476259 930752 292819
11029C00642K11261K54133r3864m7253j84369R7229J29768C28716J60979J41512
$$ 300642 511903 766036 672172 624919 440550 537779 667547 328716 489695 631207
11019F31207k95595l7889L11937k21683L74471J03576l96307j10965q5860j9963
$$ 631207 335612 297723 609660 387977 762448 866024 469717 358752 272892 252929
11009B52929Q4718L11977B67411J62824J41323A14786L01772J33139p2361j72402
$$ 252929 337647 649624 267411 430235 571558 114786 416558 549697 477336 304934
10999C04934L06734j28406j95716N19417k63518n0042o026A76997L04926K56223
$$ 304934 611668 483262 287546 806963 543445 493403 487377 176997 481923 738146
10989G38146l7706J72512k91359K2786K38312k98893R0586L35796k57360k1809
$$ 738146 700440 872952 581593 604379 842691 543798 634384 970180 712820 691011
10979F91011O6222j56043L91203k10257K65110N74379o1552Q9416K16853K24724
$$ 691011 757233 601190 992393 782136 1047246 1621625 1560073 1649489 1866342 2091066
10969B091066n830K24708K13281j75640m2576l97641k02158Q7475k33995J72357
$$ 2091066 2085236 2309944 2523225 2347585 2305009 1907368 1705210 1792685 1558690 1731047
10959A731047l82174k09623M65761k60030L88670k32890J35758q7963j30664o2135
$$ 1731047 1348873 1139250 1605011 1344981 1733651 1500761 1636519 1548556 1417892 1355757
10949A355757j56814l67924J15529n2505l09613k06326m8184R0269A53861L1505
$$ 1355757 1198943 831019 946548 894043 584430 378104 329920 420189 153861 185366
10939A85366J24308J89255a04050A42179J12929H7571c2234C32783A51122E1165
$$ 185366 309674 498929 -104050 142179 255108 87571 -32234 332783 151122 51165
10928B04057b17000f0434F0713k5869J37899E7519g2015b8581H7904M1778l5550
$$ 204057 -217000 -60434 60713 34844 172743 57519 -72015 -28581 87904 129682 94132
10917I4132b73882G5841b6445C7196g6932q4284A2320d36778d5701C06154A35965
$$ 94132 -273882 75841 -26445 37196 -76932 -161216 12320 -436778 -45701 306154 135965
10905a8772h036r225A12359j8263E880b53072a12835K363m9297B96694e35643
$$ -18772 -8036 -17261 112359 94096 5880 -253072 -112835 -110472 -159769 296694 -535643
10893c5881B57942b05430a547l5960A9622R7608J07173b59900a09019N0269D7602
$$ -35881 257942 -205430 -1547 -37507 19622 117230 224403 -259900 -109019 -58750 47602
10881e2163a2819B72666a88941L9149B1549a71634n1117A62987a47196B39005
$$ -52163 -12819 272666 -188941 -149792 21549 -171634 -222751 162987 -147196 239005
10870c14720a6674A42038J98284C2591L1903a71190a6164r1806B50660a29238
$$ -314720 -16674 142038 340322 32591 64494 -171190 -16164 -107970 250660 -129238
10859A25750a97737m6096A37531m3356a00498D8065A8632J0776J07252a64265
$$ 125750 -197737 -243833 137531 94175 -100498 48065 18632 29408 136660 -164265
10848B58890d3169B12519I7997b00721A86559f6557m6570A00433f2242l00700
$$ 258890 -43169 212519 97997 -200721 186559 -66557 -113127 100433 -62242 -362942
10838c62942g897A07083f2910J5971B1701a16565F0854b20132Q5244p9098j74837
$$ -362942 -7897 107083 -62910 -46939 21701 -116565 60854 -220132 -134888 -213986 -388823
10827c88823b2557k00817q4593c9650A44336d81224i5252j29868A48709G3445
$$ -388823 -22557 -223374 -307967 -39650 144336 -481224 -95252 -225120 148709 73445
10816A42627a31712I4077a51301K6986F8995b1608k43114L5321e6047F0437K19558
$$ 142627 -131712 94077 -151301 -124315 68995 -21608 -264722 -229401 -56047 60437 279995
10805B79995c6946l6003H1540i5270k25241f2415F9234d6330k92582A81652C822
$$ 279995 -36946 -72949 81540 -95270 -320511 -62415 69234 -46330 -338912 181652 3822
10793C25193b36293N7067e023j77325j00317A2472e1674n84560c1833j9771r418
$$ 325193 -236293 -179226 -5023 -182348 -282665 12472 -51674 -636234 -31833 -51604 -61022
10782f1022A38169b04950A44958c74101I5549a18640e670j53644N2270C35179
$$ -61022 138169 -204950 144958 -374101 95549 -118640 -5670 -159314 -107044 335179
10771a58081q0499M214F1646K70522h5898g760E3197J1492c52773j38931C6677
$$ -158081 -238580 -234366 61646 332168 -85898 -7760 53197 64689 -352773 -491704 36677
10759a49825j09464r2167b3133C338c00532h5933q9053e5110K5285k72194J37371
$$ -149825 -259289 -351456 -23133 3338 -300532 -85933 -174986 -55110 -29825 -302019 -164648
10748a64648Q0036l6515B28803f5239B22334a92380A52831c25873J17059c0104
$$ -164648 -84612 -121127 228803 -65239 222334 -192380 152831 -325873 -208814 -30104
10737a42490A33812A292Q3921i1951r056N791A84489J05723e6789j36995c1224
$$ -142490 133812 1292 85213 -91951 -101007 -95216 184489 290212 -56789 -193784 -31224
10725a05764o3839q5528c5480A11642J61414b02896B3143a03633r4614D2502e5019
$$ -105764 -169603 -255131 -35480 111642 273056 -202896 23143 -103633 -198247 42502 -55019
10713F1414M0288l3318e87813e2086l2718j39374F770b16458A69346a47159L4198
$$ 61414 101702 68384 -587813 -52086 -84804 -224178 6770 -216458 169346 -147159 -112961
10702a12961q5544K7878P7648m3947j46193J13640i588A27001i2314j98713A9228
$$ -112961 -198505 -170627 -92979 -136926 -283119 -169479 -9588 127001 -92314 -291027 19228
10690D6480e2607B01201b48381A11316d13147B7095a1187j06562A87105o3824
$$ 46480 -52607 201201 -248381 111316 -413147 27095 -11187 -117749 187105 123281
10680A23281A7470b78762C51955a62116K9896A16861a13477A79434a37978e7505
$$ 123281 17470 -278762 351955 -162116 -132220 116861 -113477 179434 -137978 -57505
10669c41304i0795j1693r2505B28031m8017a47342r005n8840C10719A26983b31779
$$ -341304 -90795 -102488 -194993 228031 180014 -147342 -156347 -215187 310719 126983 -231779
10657A77019b7201o5498m8188A53214p2890l0698b66525A46849c57176C3787a86739
$$ 177019 -27201 -92699 -140887 153214 80324 49626 -266525 146849 -357176 33787 -186739
10645c45465A84758a02246q093j51695c2093o7556E5771a85449O4054C0291b34291
$$ -345465 184758 -102246 -110339 -262034 -32093 -99649 55771 -185449 -121395 30291 -234291
10633G6484a98433A66502b14681f9984n2146m6385F2875K34691D8535f5442J0375
$$ 76484 -198433 166502 -214681 -69984 -122130 -168515 62875 297566 48535 -65442 -55067
10622e5067p4535k64375H4465a16812k11176G3980R9708b4084j78527B0660d47047
$$ -55067 -129602 -393977 84465 -116812 -327988 73980 173688 -24084 -202611 20660 -447047
10610a26693C7998a3541l95874J81197I8643e2451E324c02231E0295J83796A06822
$$ -126693 37998 -13541 -409415 -228218 98643 -52451 5324 -302231 50295 234091 106822
10598g8559j2601g307j13408j11195O6179F1311A3908a27860A73323f7221j43827
$$ -78559 -91160 -7307 -120715 -231910 -165731 61311 13908 -127860 173323 -67221 -211048
10587b11048c8699C788a95670d9149P621A29824n5547a21381M4590H441k254c9213
$$ -211048 -38699 3788 -195670 -49149 -41528 129824 74277 -121381 -76791 8441 6187 -39213
10574a26357r8335A24437a30279K0766a8334k45830K1951k103F4170G240J15671
$$ -126357 -224692 124437 -130279 -109513 -18334 -264164 -242213 -244316 64170 7240 122911
10563A22911J7013J59156e8856k1031k59927c5337F7362j0688b68519i8658f583
$$ 122911 139924 299080 -58856 -79887 -339814 -35337 67362 56674 -268519 -98658 -6583
10551C42285g0098A78956e6010r6239O9878B6636a40794k24934B41784f0685A64366
$$ 342285 -70098 178956 -56010 -152249 -82371 26636 -140794 -365728 241784 -60685 164366
10539A39885a3812E980a82024P2795A20346J6808e27302a00706B5533Q5075a94130
$$ 139885 -13812 5980 -182024 -109229 120346 137154 -527302 -100706 25533 110608 -194130
10527a45078J2642K405B41485K08257b28864D0709a88642B38453j06776c2496
$$ -145078 -132436 -130031 241485 449742 -228864 40709 -188642 238453 131677 -32496
10516a81890D8680J27894a32833A9545b62576j15516C8169h0378k02568a04969
$$ -181890 48680 176574 -132833 19545 -262576 -378092 38169 -80378 -282946 -104969
10505a77909j21846D9984f7373i143A05489b56824B21762l7152b61826J08847
$$ -177909 -299755 49984 -67373 -9143 105489 -256824 221762 184610 -261826 -152979
10495a52979q0503h944k1340k82569B19972J9404r3061C6130h3292B65035a61571
$$ -152979 -233482 -8944 -30284 -312853 219972 239376 146315 36130 -83292 265035 -161571
10483A10751a4563k82112f4146b5235A52866p3905J4628J1468J92058J82142J99814
$$ 110751 -14563 -296675 -64146 -25235 152866 78961 93589 105057 297115 479257 679071
10472F79071A11263J83917A40836J3798d3135l8679p108j98551a24804E922a1913
$$ 679071 111263 295180 140836 154634 -43135 -81814 -88922 -287473 -124804 5922 -11913
10460B59431a14148A36342L9571a63251d4298j47230k59632f9998A33095b7459
$$ 259431 -114148 136342 175913 -163251 -44298 -191528 -451160 -69998 133095 -27459
10449A72103K30948c20749A53461c14696J40713N3674o3502o7783I2069h3488
$$ 172103 403051 -320749 153461 -314696 -173983 -120309 -183811 -251594 92069 -83488
10438f0944O893o8332A01150k7534a97773a246E6995J28869b42009h689B11942
$$ -60944 -54051 -122383 101150 73616 -197773 -1246 56995 185864 -242009 -8689 211942
10426g0135j87511h4439j88869h9172j05633k5474C3252K78443b11745k48277
$$ -70135 -257646 -84439 -273308 -89172 -194805 -220279 33252 311695 -211745 -460022
10416d60022b15565D8934b1252k71487a27785C59050H3460B6044J30322b33818
$$ -460022 -215565 48934 -21252 -292739 -127785 359050 83460 26044 156366 -233818
10405B01019g3482J010m5488B43849b38887A59486f7363k33119h6968m7950M0043
$$ 201019 -73482 -72472 -117960 243849 -238887 159486 -67363 -300482 -86968 -134918 -94875
10394i4875C06151p7116c2899I4479K3257a79504A23157g6916C43903j34929l32
$$ -94875 306151 229035 -32899 94479 117736 -179504 123157 -76916 343903 208974 208642
10383B08642g2104A63376b44431h4417A14849J59510d44915b4204J0117D72836
$$ 208642 -72104 163376 -244431 -84417 114849 274359 -444915 -24204 -14087 472836
10372A97337k9789M2674b01710F7396J56693R1511I407P5244N38761j53952A42728
$$ 197337 167548 210222 -201710 67396 224089 315600 9407 84651 623412 469460 142728
10360E29329j13276p9984A65612K33716j90271E4229P6769P3722a96103A5381
$$ 529329 416053 336069 165612 399328 209057 54229 130998 204720 -196103 15381
10349D55274B00681r1299a5966C15438P0285A72967M9143q195J4092K73428N8589
$$ 455274 200681 109382 -15966 315438 385723 172967 222110 213915 228007 501435 560024
10338E60024D2660c5858C45626O8713j73581O4269B5387M40666c38726h3047a7736
$$ 560024 42660 -35858 345626 414339 240758 305027 25387 466053 -338726 -83047 -17736
10326A08700K4148B3046P131J5959N1812K10104D6709a24355A36686l0893b09108
$$ 108700 132848 23046 30177 46136 97948 308052 46709 -124355 136686 105793 -209108
10314B13671b3370B27097L8629j16089b67530C94413h7489M1741k85503B5013
$$ 213671 -23370 227097 265726 149637 -267530 394413 -87489 -45748 -331251 25013
10303H01Q946g0686A72920b44060A22960a21718I0127J09893C9729L00025c97345
$$ 801 9747 -70686 172920 -244060 122960 -121718 90127 200020 39729 339754 -397345
10291A51701f7683a7943B89617A11998A4185c0041B4356D214b20607H0566B3855
$$ 151701 -67683 -17943 289617 111998 14185 -30041 24356 4214 -220607 80566 23855
10279h5634B71778b53911D0173b78015A28465a34A3105P6018a1179o6591K5318
$$ -85634 271778 -253911 40173 -278015 128465 -134 13105 89123 -11179 -77770 -52452
10268e2452F9237e7614q8468J7720G6617a60596A69177c45029h8474j642j4025
$$ -52452 69237 -57614 -146082 -128362 76617 -160596 169177 -345029 -88474 -90116 -104141
10257a04141A00576c20933A90451J50199C9215J99863F5732K33125G8194K03244
$$ -104141 100576 -320933 190451 340650 39215 239078 65732 298857 78194 281438
10247B81438J14993a05686C91444e9943j26990C6690j6443b5764k1572A57646
$$ 281438 396431 -105686 391444 -59943 -186933 36690 20247 -25764 -47336 157646
10236A09425c0856k193k75133C00322e198D7558K3046h2621j13259k90993B1739
$$ 109425 -30856 -33049 -308182 300322 -5198 47558 70604 -82621 -195880 -486873 21739
10224A51651b26012A80307g5746p2006m6402Q4901k27638J56346E4820b17977
$$ 151651 -226012 180307 -75746 -147752 -194154 -109253 -336891 -180545 54820 -217977
10213E7281k2573b01012j51730C755b73851A8167a88028n5068A26674c08007d0917
$$ 57281 34708 -201012 -352742 3755 -273851 18167 -188028 -243096 126674 -308007 -40917
10201I3867b71734J09116O0862A11825i0274j13308i2435B7085K4595b23608N3720
$$ 93867 -271734 -162618 -101756 111825 -90274 -203582 -92435 27085 51680 -223608 -169888
10190a69888B1429a54496A5657i3180j50576N7442o8541B91632d5178m39201d1083
$$ -169888 21429 -154496 15657 -93180 -243756 -186314 -254855 291632 -45178 -484379 -41083
10178F6392l715h9501G1413E840a01164j91289E1606c21595k7517J8235a59823
$$ 66392 62677 -89501 71413 5840 -101164 -292453 51606 -321595 -349112 -330877 -159823
10166A74992a87321A64178K47736b5669F606c15646c7142C50a7305j21206h966
$$ 174992 -187321 164178 411914 -25669 6606 -315646 -37142 350 -17305 -138511 -8966
10154C35637a05533e1175B40205c70331H6377b14303p3916a36197f5341D473J35541
$$ 335637 -105533 -51175 240205 -370331 86377 -214303 -288219 -136197 -65341 4473 140014
10143A40014a37563j14137A31473g0754j56975A67214d7823k33465g3713C0854
$$ 140014 -137563 -251700 131473 -70754 -227729 167214 -47823 -281288 -73713 30854
10132a16607N2005D216K23326b70049G1817j8277a82008g4778B35383b9843k05792
$$ -116607 -64602 4216 227542 -270049 71817 53540 -182008 -74778 235383 -29843 -235635
10121b35635C5162a61571c2115j30359j05099B95243a72057c4827j17185B71066
$$ -235635 35162 -161571 -32115 -162474 -267573 295243 -172057 -34827 -152012 271066
10110g2559F2005J3621a32538G9162o19e2088f809B42775H0235K82217d56082
$$ -72559 62005 75626 -132538 79162 78543 -52088 -6809 242775 80235 362452 -456082
10098a16726q5323A77053b09778N7467A91983f347l32203J8969J39345k1210q0420
$$ -116726 -202049 177053 -209778 -152311 191983 -6347 -338550 -319581 -180236 -201446 -281866
10087b81866C68187b31547K7997L1398D66118F9279b35660P5561C8215a57069
$$ -281866 368187 -231547 -203550 -172152 466118 69279 -235660 -160099 38215 -157069
10076a05750j83948o3244g781j39048A51843c21240g7601I1412b32870g5576j00452
$$ -105750 -289698 -352942 -7781 -146829 151843 -321240 -77601 91412 -232870 -75576 -176028
10065a76028B01888a12487B57495c50892J04875B09603a10000A47313K12848j45107
$$ -176028 201888 -112487 257495 -350892 -246017 209603 -110000 147313 360161 215054
10055B15054b57657A32162A1538i0080A84588c23835J08028G3299b8992q2030
$$ 215054 -257657 132162 11538 -90080 184588 -323835 -215807 73299 -28992 -111022
10045a11022B19661J1024b24875j21723J22852a3175r6651E379c59006E9332J10630
$$ -111022 219661 230685 -224875 -346598 -223746 -13175 -109826 5379 -359006 59332 169962
10034A69962O4807J65091B6673b9967k91997C62795H1692a16278F911K2491a10356
$$ 169962 234769 399860 26673 -29967 -321964 362795 81692 -116278 6911 29402 -110356
10022A57916n8500O8861A194a94117f6116j0818D42108a49577k33486F8793c61826
$$ 157916 99416 168277 1194 -194117 -66116 -76934 442108 -149577 -383063 68793 -361826
10010H4103m1319a38786k14638a75392j42076C37873a64880C458a30668G4263
$$ 84103 42784 -138786 -353424 -175392 -317468 337873 -164880 3458 -130668 74263
9999g2715A1106J0457K019b06714j00183f4041m0254n6909F9693K2610i8439K4920
$$ -72715 11106 21563 23582 -206714 -306897 -64041 -104295 -161204 69693 92303 -98439 -73519
9987g3519B953c34952c0096k77075B0497P0032d20581J5575A46513a01143l18513
$$ -73519 2953 -334952 -30096 -307171 20497 90529 -420581 -405006 146513 -101143 -419656
9976d19656N9615B69336c6883l42189a950D06436f5800k32102j3202q3640i6001
$$ -419656 -360041 269336 -36883 -379072 -1950 406436 -65800 -297902 -311104 -394744 -96001
9964A13363a9643j13334N7952b1581C9108c44779o3355A43303E2549a34182j57417
$$ 113363 -19643 -132977 -75025 -21581 39108 -344779 -408134 143303 52549 -134182 -291599
9953b91599G7016a52750O6314k24628J35529c4196B4011J22838R9020a23373G9763
$$ -291599 77016 -152750 -86436 -311064 -175535 -34196 24011 146849 245869 -123373 79763
9941b5834k2884C0132K77602A21650c32533a20939j7474A59083a54114B28171
$$ -25834 -48718 30132 307734 121650 -332533 -120939 -138413 159083 -154114 228171
9930g8333n0990A02691b52014k16986E3622b09382j21162J26414k61502G664e0172
$$ -78333 -129323 102691 -252014 -469000 53622 -209382 -330544 -204130 -465632 7664 -50172
9918A10293D3164c35495D9195a3055C79062a89561I7462K3302C9773a516j37363
$$ 110293 43164 -335495 49195 -13055 379062 -189561 97462 120764 39773 -1516 -138879
9907a38879k01222g7445H3599P7803c00F0987J02646a11199A2280b49811O5228
$$ -138879 -340101 -77445 83599 161402 -300 60987 163633 -111199 12280 -249811 -184583
9896a84583i1187L8336A51569a45644e8330j7067J8616a4988c305q3253I1891
$$ -184583 -91187 -52851 151569 -145644 -58330 -75397 -56781 -14988 -3305 -86558 91891
9884i1205L7676C7560a61940e69E4935A0198a53845q211j99608J1196a13239D26138
$$ -91205 -53529 37560 -161940 -569 54935 10198 -153845 -162056 -361664 -350468 -113239 426138
9871b48162i5593j37336M8822h883p8933L4362j93790R8284L1467j97046a24370
$$ -248162 -95593 -232929 -184107 -8883 -87816 -53454 -247244 -148960 -117493 -314539 -124370
9859H9214a3358j37500l6752k19098J26319a13930k02331B4501a765A98550M0252
$$ 89214 -13358 -150858 -187610 -406708 -280389 -113930 -316261 24501 -1765 198550 238802
9848B38802a35776q3772A18431b84401B91229a61188r738n1502B9341e20059a66718
$$ 238802 -135776 -219548 118431 -284401 291229 -161188 -170926 -222428 29341 -520059 -166718
9836F6434a84650h8075j10816I2080l2603P505e14928A04538K6462i5403I0817
$$ 66434 -184650 -88075 -198891 92080 59477 66982 -514928 104538 131000 -95403 90817
9824b14658B50470a32649A17839c1632a5570A24629a81081b974j79658A8884a63661
$$ -214658 250470 -132649 117839 -31632 -15570 124629 -181081 -2974 -182632 18884 -163661
9812A03250a43238L3733j31964B5057c01070F0157d73435C10753F5586b22541
$$ 103250 -143238 -109505 -241469 25057 -301070 60157 -473435 310753 65586 -222541
9801g3043j2239A08698d2039l9917E0625J06051C8346a08622b2516k92361A06754
$$ -73043 -85282 108698 -42039 -81956 50625 156676 38346 -108622 -22516 -314877 106754
9789A84250h9873B53007a64777A21576c26894c0843j65623F7580a34051k2139
$$ 184250 -89873 253007 -164777 121576 -326894 -30843 -196466 67580 -134051 -156190
9779a56190M1714o7364k82806a78383k28821B71229b16342O6744C5852J63393
$$ -156190 -114476 -181840 -464646 -178383 -407204 271229 -216342 -149598 35852 199245
9769A99245g1212o4941j0989A76587F2379a29417H5083c42024J47435M9773B6360
$$ 199245 -71212 -136153 -147142 176587 62379 -129417 85083 -342024 -194589 -144816 26360
9757a8322j39046j57269a13239l9361A2849f9083k86471a22834B76408a77709
$$ -18322 -157368 -314637 -113239 -152600 12849 -69083 -355554 -122834 276408 -177709
9746a0551C59648a61055g0915j82828a5535j49003L6363A05136a92147G5068a75365
$$ -10551 359648 -161055 -70915 -253743 -15535 -164538 -128175 105136 -192147 75068 -175365
9734a48919A17343K45144j29954D526P6774J43117b23244Q9791A19513b63936
$$ -148919 117343 362487 232533 4526 81300 224417 -223244 -133453 119513 -263936
9723g0364l89501b15559f6477j74539g3263B85513H0059a10712c918B8811L25912
$$ -70364 -459865 -215559 -66477 -241016 -73263 285513 80059 -110712 -3918 28811 354723
9712C54723g1022j62355F3542c22617d955j50313A63796i4401F8855K09642c40501
$$ 354723 -71022 -233377 63542 -322617 -4955 -155268 163796 -94401 68855 278497 -340501
9700A01461K8561R3561j11682a35078c7184a6965B79553d4253C2406M6416a57291
$$ 101461 130022 223583 111901 -135078 -37184 -16965 279553 -44253 32406 78822 -157291
9688a37829B87852b87446e1168q4814d0358k54402A28200k3304b37768H1734a9841
$$ -137829 287852 -287446 -51168 -135982 -40358 -294760 128200 104896 -237768 81734 -19841
9676B17696a99404e9425D2690e10460B08304j03413b50581N6095a4548m7956k19251
$$ 217696 -199404 -59425 42690 -510460 208304 104891 -250581 -194486 -14548 -62504 -281755
9665b81755c2322J0685l6379k44583B50685a77815j94645a48817K9515A09533
$$ -281755 -32322 -21637 -58016 -302599 250685 -177815 -372460 -148817 -119302 109533
9654b32382o6669g8682a1170l0826J811k7110l1199j43144b6518F3280A5570b32568
$$ -232382 -299051 -78682 -11170 -41996 -40185 -67295 -98494 -241638 -26518 63280 15570 -232568
9641I8810e2670J5585l14559J00335E0749d36806a10311j01660R5116p0184b9661
$$ 98810 -52670 -37085 -351644 -251309 50749 -436806 -110311 -211971 -116855 -187039 -29661
9629e3676K5227B6748h3131L3672A4632c6419k24980a22250e973q1483k84075
$$ -53676 -28449 26748 -83131 -49459 14632 -36419 -261399 -122250 -5973 -87456 -371531
9618c71531J41439A21470m4044a79364N3501l3549f6920a4049j34132D2008J42001
$$ -371531 -230092 121470 77426 -179364 -125863 -159412 -66920 -14049 -148181 42008 184009
9607A84009m605c08303a8833j87281P2385n8911a0504k5838C898i8610o3490n7672
$$ 184009 179404 -308303 -18833 -206114 -133729 -192640 -10504 -36342 3898 -98610 -162100 -219772
9595b19772B36037b84413a30967A43795l9973E731h1255B6601b53037B05189q9387
$$ -219772 236037 -284413 -130967 143795 103822 5731 -81255 26601 -253037 205189 115802
9584A15802c6794p4099O854m8697j50832g9921j57131A50871A5363g10I4866b31585
$$ 115802 -36794 -110893 -104039 -152736 -303568 -79921 -237052 150871 15363 -710 94866 -231585
9571a27395f3554C6828b98426i1501B9562J13625e453j0863l0465k138k286m0887
$$ -127395 -63554 36828 -298426 -91501 29562 143187 -5453 -16316 -46781 -48919 -51205 -92092
9559i2092j55072A63891p0503c7752l31959a53171A11797A7221K7242a86279F171
$$ -92092 -247164 163891 93388 -37752 -369711 -153171 111797 17221 44463 -186279 6171
9547a0630A45908b04828A2234a71863e3982F3897J10499a83511l8235B294c10255
$$ -10630 145908 -204828 12234 -171863 -53982 63897 174396 -183511 -221746 2294 -310255
9535a82085L3367d0011q4245k19252D4771B214K63089b31736Q7845A53120c40750
$$ -182085 -148718 -40011 -124256 -343508 44771 2214 265303 -231736 -143891 153120 -340750
9523f0200k4734E6463d6998k459k4832l91555a79940A93360a52527f0774A65376
$$ -60200 -84934 56463 -46998 -49457 -74289 -465844 -179940 193360 -152527 -60774 165376
9511C54323a39114F1763L01199g3657k49488g0032B2131J23385c5187m9119a7654
$$ 354323 -139114 61763 362962 -73657 -323145 -70032 22131 145516 -35187 -84306 -17654
9499b5809m13134b06253o0102j30574h1034A1268i5109o5051N3375l191c4334
$$ -25809 -438943 -206253 -266355 -396929 -81034 11268 -95109 -160160 -106785 -109976 -34334
9487a46609E765M00334c09825R5196j06386a02609A41082A4374P6737R5996h9626
$$ -146609 5765 406099 -309825 -214629 -321015 -102609 141082 14374 91111 187107 -89626
9475a12200A73410b15785g2037I1040q071R0683N23a39023o2569D86626F533f5365
$$ -112200 173410 -215785 -72037 91040 82969 173652 174175 -139023 -201592 486626 6533 -65365
9462A82863a00536j10266F287i124j36682p8212o1192E5149a78727a6582l21828
$$ 182863 -100536 -210802 6287 -9124 -145806 -224018 -285210 55149 -178727 -16582 -338410
9451c38410g6743q1993D23816a24495O1312B5296a76459B86383j26618b78270
$$ -338410 -76743 -158736 423816 -124495 -63183 25296 -176459 286383 159765 -278270
9440e5744A68066e7596j45840M2772n2716c5573l37441G3662b91391A20529a41261
$$ -55744 168066 -57596 -203436 -160664 -213380 -35573 -373014 73662 -291391 120529 -141261
9428e6964B29372E275K14604C6311g1923G0560A9525h8264j13312L3207A4702
$$ -56964 229372 5275 219879 36311 -71923 70560 19525 -88264 -201576 -168369 14702
9416A65155d26647K06307L5359F6726b25030q59g2834D3694b65444B19511d33879
$$ 165155 -426647 -220340 -184981 66726 -225030 -225889 -72834 43694 -265444 219511 -433879
9404B2709L05434a45657B46532c14669h7278E0509B5029h6540I7926c95185f5698
$$ 22709 328143 -145657 246532 -314669 -87278 50509 25029 -86540 97926 -395185 -65698
9392A93576C1290d2076g954D8680N602c96498E6895k404Q6732F8469a79762k1648
$$ 193576 31290 -42076 -7954 48680 54282 -396498 56895 54491 141223 68469 -179762 -201410
9380b01410e5941j72595O8938a8510l86340e2503H9312f3531I3523d5841o2988
$$ -201410 -55941 -228536 -159598 -18510 -404850 -52503 89312 -63531 93523 -45841 -108829
9369a08829j2095b2795I2185i7979l19784a19131l8799l15269J06917a57750N1296
$$ -108829 -120924 -22795 92185 -97979 -417763 -119131 -157930 -473199 -366282 -157750 -106454
9358a06454m8833o6924F4822b27222j44041a18040P865M3009B8089k487d85192
$$ -106454 -155287 -222211 64822 -227222 -371263 -118040 -110175 -67166 28089 25602 -485192
9346a66015B170J69640b85486A26904B6508h4287j33294E6527e3241j34432d4995
$$ -166015 2170 171810 -285486 126904 26508 -84287 -217581 56527 -53241 -187673 -44995
9334A84143K60340c16081B117J07867a29475j01799f7949p8450j2547k1058A53908
$$ 184143 444483 -316081 2117 109984 -129475 -231274 -67949 -146399 -158946 -180004 153908
9322c57279f279A56431b5144k11508A39799b94848d0111A09904i5216C3375L2861
$$ -357279 -6279 156431 -25144 -236652 139799 -294848 -40111 109904 -95216 33375 66236
9311F6236J58930b62136Q6054O5916j97263M6722I2716a73239n8171c8138J0757
$$ 66236 225166 -262136 -176082 -110166 -307429 -260707 92716 -173239 -231410 -38138 -27381
9300b7381I7650O8088d1367m6805H4459a36206k15165G9159a18232B72119i6659
$$ -27381 97650 165738 -41367 -88172 84459 -136206 -351371 79159 -118232 272119 -96659
9288c28591A45432c15907J52393j66707b8893A07900i0478q9283C6608c7394m0523
$$ -328591 145432 -315907 -163514 -330221 -28893 107900 -90478 -179761 36608 -37394 -77917
9277g7917I8190a98902b6476A41804d6337p5267i035j25996f4724h114C8421b2242
$$ -77917 98190 -198902 -26476 141804 -46337 -121604 -9035 -135031 -64724 -8114 38421 -22242
9264c58824J36752C2446J27336c4183A96483c30914a7226q8145d3045C9152b49404
$$ -358824 -222072 32446 159782 -34183 196483 -330914 -17226 -105371 -43045 39152 -249404
9252I2199c04469a14846B35092b2190j50930m5215F6232q227k7051J62616b09188
$$ 92199 -304469 -114846 235092 -22190 -173120 -218335 66232 58005 30954 193570 -209188
9240b14044a3799j58501o375A88354A3491J23312P078G067a99626A86388d47180
$$ -214044 -13799 -172300 -178675 188354 13491 136803 143881 7067 -199626 186388 -447180
9228f9226J9756E2011b03068F4082J06175a0734j51351K9988j74494O4845J01927
$$ -69226 -49470 52011 -203068 64082 170257 -10734 -162085 -132097 -306591 -241746 -139819
9217a39819k6527E725J4242b82503N3168k47566I9822j5009a31336C24845I805
$$ -139819 -166346 5725 19967 -282503 -229335 -476901 99822 84813 -131336 324845 9805
9205b08799h9042L6081I7282A6574M6206F816e30771e0326k43168a25431j15779
$$ -208799 -89042 -52961 97282 16574 62780 6816 -530771 -50326 -293494 -125431 -241210
9194b41210p646J2062J14229A69142f9016B29013H2590d6012B35434D8787K15615
$$ -241210 -248856 -236794 -122565 169142 -69016 229013 82590 -46012 235434 48787 264402
9183B64402E5423M547c1368B63485a18888B25302Q6985h2207c7522C7859g4733
$$ 264402 55423 59970 -31368 263485 -118888 225302 312287 -82207 -37522 37859 -74733
9171a87761K3587P3886k95297C7666a96247B90233e9296o9313j07627O2794a1167
$$ -187761 -164174 -90288 -385585 37666 -196247 290233 -59296 -128609 -236236 -173442 -11167
9159A25214C6008h5090A90898a27117a5821m7368A20674c9857C98543c18621J05943
$$ 125214 36008 -85090 190898 -127117 -15821 -63189 120674 -39857 398543 -318621 -212678
9148b12678A95308E0005b00765A19140a19298j00069R4225N5385I1856d3807o2725
$$ -212678 195308 50005 -200765 119140 -119298 -219367 -125142 -69757 91856 -43807 -106532
9137a06532k7299r1846e2928l1780k83597a39297B8351K11148a43984a6158k01222
$$ -106532 -133831 -225677 -52928 -84708 -368305 -139297 28351 239499 -143984 -16158 -217380
9126b17380A61752a39327B40807a4025n4274A05290d5625j18366r4339a27271
$$ -217380 161752 -139327 240807 -14025 -68299 105290 -45625 -163991 -258330 -127271
9115a72948C559d0779I04K32188b74583f9721j29028e997j26112A6500f5999j64767
$$ -172948 3559 -40779 904 233092 -274583 -69721 -198749 -5997 -132109 16500 -65999 -230766
9103b30766A41109a03638D4970h9361M1815j80430k5438H9292a17161j41603A7954
$$ -230766 141109 -103638 44970 -89361 -47546 -227976 -253414 89292 -117161 -258764 17954
9091C12011a04344H7636L1446a98540B44673b39554A04004b14100B3724a60876
$$ 312011 -104344 87636 119082 -198540 244673 -239554 104004 -214100 23724 -160876
9080a911B2463a81272b6728A9046b18203M3432O7081C16131a56803J3865B304
$$ -1911 22463 -181272 -26728 19046 -218203 -174771 -107690 316131 -156803 -142938 2304
9068I6369C0102Q4385a83728I1221K04659b57862a20199c466j45044j27076J33487
$$ 96369 30102 114487 -183728 91221 295880 -257862 -120199 -3466 -148510 -275586 -142099
9057a42099o563N004J9937L8991j13184j38313F2533J4113a45226K1023n5489
$$ -142099 -148662 -143658 -123721 -84730 -197914 -336227 62533 76646 -145226 -124203 -179692
9046a79692A99773E2146c28031a39832A1748g7289j40157A43403L2678e03051
$$ -179692 199773 52146 -328031 -139832 11748 -77289 -217446 143403 176081 -503051
9035a36753d196j67607B2297J66936F0275e2075r9628Q72A7817L3354d5294l8869
$$ -136753 -4196 -171803 22297 189233 60275 -52075 -151703 -150831 17817 51171 -45294 -84163
9023h4163m0370q7300n5127N3371j31113a40148B07089a60964e8028j66519O575
$$ -84163 -124533 -211833 -266960 -213589 -344702 -140148 207089 -160964 -58028 -224547 -217972
9012b17972l0775C6469c01029e3453B6682A1924b5110l41918a11970d0334j35978
$$ -217972 -248747 36469 -301029 -53453 26682 11924 -25110 -367028 -111970 -40334 -176312
9001a76312l541L0274J3205A89906L8924F0827b27010B1273M4787A9885b6233
$$ -176312 -179853 -149579 -136374 189906 228830 60827 -227010 21273 66060 19885 -26233
8989f9189A47374a65967B56083b04747h7071E2037P9929b45190f9722H566K42161
$$ -69189 147374 -165967 256083 -204747 -87071 52037 131966 -245190 -69722 8566 250727
8978B50727C1086a70829I4081a82234K5594B73759a72764B30825p6331d564q9292
$$ 250727 31086 -170829 94081 -182234 -156640 273759 -172764 230825 154494 -4564 -93856
8967i3856q0408J8160e7567b0999j58679A63499a12125o8332l3824A68718j3245
$$ -93856 -174264 -156104 -57567 -20999 -179678 163499 -112125 -180457 -214281 168718 155473
8956A55473b33991j09420P8722O2684C6894J67177d61660C83647c73995A72477
$$ 155473 -233991 -343411 -264689 -202005 36894 204071 -461660 383647 -373995 172477
8945a76537D0939K67916A3764a51790H2881N2104m3893J42223a09797r3211a2808
$$ -176537 40939 308855 13764 -151790 82881 134985 91092 233315 -109797 -203008 -12808
8933C019b69749D19432I2867b24450A41856o8793a22809A20195m2012g2443D27610
$$ 3019 -269749 419432 92867 -224450 141856 73063 -122809 120195 78183 -72443 427610
8921F64283O49618M458129J3816623D588475I86345m54205j06373A49666J1429
$$ 664283 1313901 5772030 19588653 4588475 986345 532140 425767 149666 161095
8912A61095a73057A83327b84740D1629N9285a0568E40016j76335A22945E3868
$$ 161095 -173057 183327 -284740 41629 100914 -10568 540016 363681 122945 53868
8901b6873k32460k56405a02630c4052D4220Q4466a07876M8870I3796b1677A30651
$$ -26873 -259333 -515738 -102630 -34052 44220 128686 -107876 -59006 93796 -21677 130651
8889D6327c4628j84328F7277b94333J01457I0749i0717j13668A01364b56334a03475
$$ 46327 -34628 -218956 67277 -294333 -192876 90749 -90717 -204385 101364 -256334 -103475
8877d49088I5958b43276j24164B55178j24133a73422P7898A19806a34275q9802
$$ -449088 95958 -243276 -367440 255178 131045 -173422 -95524 119806 -134275 -224077
8867b24077G4943b0582k7333j52292o0295A38723O1080E9684K61130d3953j15645
$$ -224077 74943 -20582 -47915 -200207 -260502 138723 199803 59684 320814 -43953 -159598
8856a59598B29049B9493a49908p6283P4686j3914r291M0636i962j59880B04315
$$ -159598 229049 29493 -149908 -226191 -151505 -165419 -174710 -134074 -9962 -169842 204315
$$ [...]
##END NTUPLES=NMR SPECTRUM
##END=
