
##TITLE=AC1200_HiSAH12054_6666883_yLKwQD6Ayq
##JCAMPDX= 6.0         $$ Bruker NMR JCAMP-DX V2.0
##DATA TYPE= NMR SPECTRUM
##DATA CLASS= NTUPLES
##ORIGIN= BRUKER
##OWNER= Administrator
$$ 1.72 TOPSPIN		Version 2.1
$$ 2012-08-14 10:38:57.343 -0500  Administrator@TOPSPIN
$$ Compression mode = diff/dup
##.OBSERVE FREQUENCY= 400.02188249412
##.OBSERVE NUCLEUS= ^1H
##.ACQUISITION MODE= SIMULTANEOUS (DQD)
##.ACQUISITION SCHEME= undefined
##.AVERAGES= 8
##.DIGITISER RES= 22
##SPECTROMETER/DATA SYSTEM= spect
##.PULSE SEQUENCE= zg30
##.SOLVENT NAME= COFFEE_meoh
##.SHIFT REFERENCE= INTERNAL, COFFEE_meoh, 1, 14.98509
##AUDIT TRAIL= $$ (NUMBER, WHEN, WHO, WHERE, PROCESS, VERSION, WHAT)
$$ ##TITLE= Audit trail, TOPSPIN		Version 2.1
$$ ##JCAMPDX= 5.01
$$ ##ORIGIN= Bruker BioSpin GmbH
$$ ##OWNER= Administrator
$$ $$ C:\Bruker\TOPSPIN/data/COFFEE/nmr/AC1200_HiSAH12054_6666883_yLKwQD6Ayq/10/pdata/1/auditp.txt
$$ ##AUDIT TRAIL=  $$ (NUMBER, WHEN, WHO, WHERE, PROCESS, VERSION, WHAT)
(   1,<2012-08-14 10:38:47.687 -0500>,<Administrator>,<TOPSPIN>,<go>,<TOPSPIN 2.1>,
      <created by zg
	started at 2012-08-14 10:37:40.640 -0500,
	POWCHK enabled, PULCHK disabled,
       configuration hash MD5:
       6B 1B 68 BB D9 2E 58 E2 7F 35 AD 54 07 DF 0E 41
       data hash MD5: 64K
       6D 46 0C 76 78 9D 80 E4 A2 8B 9E 5E 0D 2F C0 BA>)
(   2,<2012-08-14 10:38:52.250 -0500>,<Administrator>,<TOPSPIN>,<proc1d>,<TOPSPIN 2.1>,
      <Start of raw data processing
       efp LB = 0 FT_mod = 6 PKNL = 1 PHC0 = 0 PHC1 = 0 SI = 32K 
       data hash MD5: 32K
       02 7F DE 55 D9 7B 86 14 00 69 02 69 C9 92 A7 EE>)
(   3,<2012-08-14 10:38:52.687 -0500>,<Administrator>,<TOPSPIN>,<proc1d>,<TOPSPIN 2.1>,
      <pk PHC0 = 185.5756 PHC1 = 0 
       data hash MD5: 32K
       7F 38 E9 F7 82 DB 63 4A 94 7A 2C E9 20 AF 68 4F>)
(   4,<2012-08-14 10:38:52.750 -0500>,<Administrator>,<TOPSPIN>,<proc1d>,<TOPSPIN 2.1>,
      <abs ABSG = 1 
       data hash MD5: 32K
       D3 42 51 D4 30 17 38 E3 2E C8 13 AA 79 8D FB 30>)
(   5,<2012-08-14 10:38:52.781 -0500>,<Administrator>,<TOPSPIN>,<proc1d>,<TOPSPIN 2.1>,
      <abs ABSG = 2 
       data hash MD5: 32K
       81 93 E1 23 DA 3F D9 83 88 88 F7 B7 5D F8 7C 96>)
(   6,<2012-08-14 10:38:52.812 -0500>,<Administrator>,<TOPSPIN>,<proc1d>,<TOPSPIN 2.1>,
      <abs ABSG = 3 
       data hash MD5: 32K
       06 FA 95 36 31 99 51 72 55 FF 4A A7 E0 CD E0 71>)
(   7,<2012-08-14 10:38:52.890 -0500>,<Administrator>,<TOPSPIN>,<proc1d>,<TOPSPIN 2.1>,
      <abs ABSG = 4 
       data hash MD5: 32K
       A7 4F 55 CF CE 93 02 30 5C 77 CA 96 1B 82 E3 51>)
(   8,<2012-08-14 10:38:52.968 -0500>,<Administrator>,<TOPSPIN>,<proc1d>,<TOPSPIN 2.1>,
      <abs ABSG = 5 
       data hash MD5: 32K
       98 71 35 69 2E 7F 89 18 31 84 39 05 64 BE 9D 33>)
$$ ##END=
$$ 
$$ $$ hash MD5
$$ $$ 2F F2 70 EE D9 98 3F 26 1A 34 3E A4 3F AA 86 16
##$RELAX= 
##$RELAX= 
##$RELAX= 
##$RELAX= 
##$RELAX= 
##$RELAX= 
##$RELAX= 
$$ Bruker specific parameters
$$ --------------------------
$$ [...]
##$TP= (0..7)
150 150 150 150 150 150 150 150
##$TP07= 0
##$TPNAME0= <>
##$TPNAME1= <>
##$TPNAME2= <>
##$TPNAME3= <>
##$TPNAME4= <>
##$TPNAME5= <>
##$TPNAME6= <>
##$TPNAME7= <>
##$TPOAL= (0..7)
0.5 0.5 0.5 0.5 0.5 0.5 0.5 0.5
##$TPOFFS= (0..7)
0 0 0 0 0 0 0 0
##$TUNHIN= 0
##$TUNHOUT= 0
##$TUNXOUT= 0
##$USERA1= <user>
##$USERA2= <user>
##$USERA3= <user>
##$USERA4= <user>
##$USERA5= <user>
##$V9= 5
##$VALIST= <valist>
##$VCLIST= <CCCCCCCCCCCCCCC>
##$VD= 0
##$VDLIST= <DDDDDDDDDDDDDDD>
##$VPLIST= <PPPPPPPPPPPPPPP>
##$VTLIST= <TTTTTTTTTTTTTTT>
##$WBST= 1024
##$WBSW= 4
##$XGAIN= (0..3)
0 0 0 0
##$XL= 0
##$YL= 0
##$YMAX_a= 467056
##$YMIN_a= -595975
##$ZGOPTNS= <>
##$ZL1= 120
##$ZL2= 120
##$ZL3= 120
##$ZL4= 120
##$ABSF1= 14.98509
##$ABSF2= -5.573092
##$ABSG= 5
##$ABSL= 3
##$ALPHA= 0
##$AQORDER= 0
##$ASSFAC= 0
##$ASSFACI= 0
##$ASSFACX= 0
##$ASSWID= 0
##$AUNMP= <proc_prof1d_extract_pilot.lims>
##$AXLEFT= 0
##$AXNAME= <>
##$AXNUC= <1H>
##$AXRIGHT= 0
##$AXTYPE= 0
##$AXUNIT= <>
##$AZFE= 0.1
##$AZFW= 0.1
##$BCFW= 0
##$BC_mod= 0
##$BYTORDP= 0
##$COROFFS= 0
##$CY= 15
##$DATMOD= 1
##$DC= 0
##$DFILT= <>
##$DTYPP= 0
##$F1P= 0
##$F2P= 0
##$FCOR= 0.5
##$FTSIZE= 32768
##$FT_mod= 6
##$GAMMA= 0
##$GB= 0
##$INTBC= 1
##$INTSCL= 1
##$ISEN= 128
##$LB= 0
##$LEV0= 0
##$LPBIN= 0
##$MAXI= 10000
##$MC2= 0
##$MEAN= 0
##$ME_mod= 0
##$MI= 0
##$NCOEF= 0
##$NC_proc= -8
##$NLEV= 6
##$NOISF1= 0
##$NOISF2= 0
##$NSP= 0
##$NTH_PI= 0
##$NZP= 0
##$OFFSET= 14.98509
##$PC= 1
##$PHC0= 185.5756
##$PHC1= 0
##$PH_mod= 1
##$PKNL= yes
##$PPARMOD= 0
##$PPDIAG= 0
##$PPIPTYP= 0
##$PPMPNUM= 2147483647
##$PPRESOL= 1
##$PSCAL= 4
##$PSIGN= 0
##$PYNMP= <proc.py>
##$REVERSE= no
##$SF= 400.02
##$SI= 32768
##$SIGF1= 0
##$SIGF2= 0
##$SINO= 400
##$SIOLD= 32768
##$SPECTYP= <>
##$SREGLST= <1H.CDCl3>
##$SSB= 0
##$STSI= 32768
##$STSR= 0
##$SW_p= 8223.68421052631
##$SYMM= 0
##$S_DEV= 0
##$TDeff= 65536
##$TDoff= 0
##$TI= <>
##$TILT= no
##$TM1= 0
##$TM2= 0
##$TOPLEV= 0
##$USERP1= <user>
##$USERP2= <user>
##$USERP3= <user>
##$USERP4= <user>
##$USERP5= <user>
##$WDW= 1
##$XDIM= 32768
##$YMAX_p= 453076559
##$YMIN_p= -800589
##$CURPLOT= <Network HP LaserJet P1505>
##$CURPRIN= <$Network HP LaserJet P1505>
##$DFORMAT= <normdp>
##$LAYOUT= <+/1D_H.xwp>
##$LFORMAT= <normlp>
##$PFORMAT= <normpl>
##$SURQMSG= 1
$$ End of Bruker specific parameters
$$ ---------------------------------
##NTUPLES= NMR SPECTRUM
##VAR_NAME=  FREQUENCY,     SPECTRUM/REAL,   SPECTRUM/IMAG
##SYMBOL=    X,             R,               I
##VAR_TYPE=  INDEPENDENT,   DEPENDENT,       DEPENDENT
##VAR_FORM=  AFFN,          ASDF,            ASDF
##VAR_DIM=   32768,         32768,           32768
##UNITS=     HZ,            ARBITRARY UNITS, ARBITRARY UNITS
##FACTOR=    0.250966925370066, 1,           1
##FIRST=     8223.43324360094, -52335,       39567
##LAST=      0,             120278,          -167704
##MIN=       0,             -800589,         0
##MAX=       8223.43324360094, 453076559,    0
$$ Real data points
##PAGE= N=1
##DATA TABLE= (X++(R..R)), XYDATA
$$ [...]
23856 -273465 276950 -11477 -187130 157729 -95867 31845 -182601 -8778 23929 55428 -85458
23844 18911 -258953 71862 136331 -213514 3516 280124 26728 183162 54678 -203348 -282482
23833 -282482 -135621 -152462 -136738 -240179 -168922 -80250 240015 85884 -72422 94342 -53063
23821 -303616 -336526 -281367 -169935 -71637 -120679 -277541 -48340 124869 2448 -129452 58450
23809 77556 -272792 87741 51612 164851 104383 187955 148763 -144191 -33705 -8775 145356
23797 114483 -157683 187438 -188265 -77336 -11313 55169 -12943 353973 105414 9620 75246
23786 75246 214618 208969 68373 -177688 19646 279236 -382522 -99012 -109601 -135884 5556
23774 -36524 215061 34815 113416 117119 237069 142038 268335 -289194 -204180 359692 -259492
23762 -53717 192553 -104651 -100074 -104007 -115330 -69477 -48678 -57234 265509 -108004 102186
23750 200048 -16764 -40982 -159454 182310 -128639 -444828 -272653 -296973 -306921 579531
23739 -20515 -226145 -8132 241033 -203851 -197658 133558 14328 51412 46185 -20099 154415
23727 69670 -109711 65253 2300 71187 -132191 -377305 21638 -281915 -77662 24459 187312
23716 187312 195437 74384 30551 23109 181608 -123098 -16455 66427 60032 30118 -9056 298555
23703 196947 -284698 -107911 -4777 137485 -59821 -326202 269217 -88950 -90426 -406246 319707
23691 -71286 1651 223223 -359639 440606 43999 15486 -205055 101513 315841 77 -66575
23679 -137555 433883 -136205 -59012 174741 -41555 -273533 154701 -23600 -136027 -215352
23669 -215352 65747 -88968 -217408 -2636 161958 121751 -190086 79106 58878 32431 279127
23658 279127 -52925 12593 -181420 -214465 -74511 -46530 282611 -147534 202901 71990 -403808
23646 -379288 179790 226511 1533 269500 -26238 88096 308042 -5315 199991 161954 107375
23635 107375 187372 -348535 -171428 -119098 97616 -218798 47115 -49663 -97966 -177352 -157714
23624 -157714 -155990 156017 -66095 -238000 97086 171866 -77876 -69251 152321 -237504 -187669
23613 -187669 -166450 -152328 -65017 -27053 -111138 161323 375484 -77439 298994 -278834 -31336
23601 102420 -155586 269039 173293 28302 -264831 -106982 248046 -40677 -29490 83562
23590 181555 40046 -94489 -74034 -53635 157243 21766 333261 18134 96695 68339 116629
23579 116629 -9437 -214793 -10130 -253259 -153414 -496743 19190 65001 -14401 -234881 -304709
23568 -304709 -160921 -127902 189985 -69750 -55435 101119 160948 -181830 -125244 -3610 -93393
23557 -93393 277949 313237 -120001 -36045 15981 76220 203672 -358470 -52610 -502181 -131958
23545 260807 -150546 -295934 -33446 18514 -76422 78198 88065 226539 31234 -150249 58653
23533 8838 54205 -152967 -50126 128120 191803 -81546 -94239 -14856 118123 150220 94400
23522 94400 -252029 142132 12605 18456 236899 -7023 -152930 48343 64643 155659 241474
23511 241474 -268279 -224254 20021 257886 48266 113216 -194860 -328973 -219869 -100732
23500 -423750 54507 286271 -122064 234944 -405759 100941 130840 134182 131893 -69149 -67674
23489 -67674 -313157 -57331 -102994 -224438 -109085 339064 -29520 -362502 2444 102160 65325
23478 65325 -95337 -229969 -92090 -97832 17999 -68969 -184449 228216 -390239 -60961 -9754
23466 -281865 -251241 -33598 204941 -254835 -67706 -102561 190256 -146879 -442919 -71045
23455 81528 -25399 246474 212802 128096 -9841 -154426 214597 127671 214331 -59508 68352
23443 -253916 202949 -108173 223823 -35977 -264109 -70393 181918 -258494 268196 -63745
23432 -234784 -127341 400155 -25450 109386 -244621 -167539 32854 -59666 47890 -485218
23421 -229481 -125301 -208188 154305 130954 -146654 -141457 145424 -23231 162889 280053
23411 280053 49305 -217144 -245275 205419 232792 366944 -379415 -186623 -62442 -256036
23401 -256036 -17366 -112262 -26388 138292 156343 -4116 -75632 -76269 -152698 -222881 -301455 -218014
23389 -218014 227965 -177735 -47388 194265 -564831 -120751 -102709 185803 -50814 350159
23378 -198678 -147561 15908 96459 -353383 150261 -57817 -327113 -170388 -269650 152364
23367 -311924 231335 182050 -160387 7557 -199614 -87721 -184624 -63663 -9011 -130656 16193
23355 101610 -300722 -49007 -117277 -34167 73029 65018 120322 -282158 165719 -125976 -5108
23343 -158408 162584 114015 -283924 144133 -343392 -262027 -4555 -77664 -246064 -140153
23333 -140153 545807 -119727 -259668 -185903 -220039 -65328 255802 102829 -196246 9803
23322 153143 96804 -53106 531048 -110326 339362 -236 -37978 -289759 -250975 -11995 -69337
23311 -69337 54098 219792 -150022 -167380 308904 235567 47574 -363638 28019 -212012 -172176
23300 -172176 -457822 -55671 -241951 94656 104687 152721 175190 444979 127021 78786 148230
23289 148230 -482686 -300028 133148 -391480 44664 -126238 -116584 -485922 -104538 -129194
23279 -129194 -156326 -72629 227612 105050 -168670 -292400 -286099 -3626 147531 -371165 152128
23267 -217007 147750 2041 -222388 -131970 10488 111440 12396 66456 -118283 118363 44061
23255 172950 29037 199459 77825 -193614 -34884 45857 86944 57408 63514 4417 20216
23244 20216 260104 134877 202426 14032 294911 -271677 -277192 -75884 -224121 111702 108699
23233 108699 -244607 -274246 304125 2190 -145182 41760 94689 -145542 212063 54034 -68626
23221 -38197 44400 -124941 75333 -134420 -66727 -131769 -214642 -144777 -80914 -243958 -160282
23210 -160282 -173685 -240732 -150585 90026 118563 -41280 120672 -6864 -97847 41629 5384 142677
23198 142677 223569 127732 -111235 -227210 189144 -216541 -306481 -299182 -247843 -182053 88901
23186 -24591 3238 -37892 75671 -39762 328159 -102057 -82686 -234328 -105767 -278206 -172654
23175 -172654 7756 -147156 12532 209101 -102308 -86773 33984 23400 70933 123143 48930
23163 150752 -153084 -19496 -106647 278385 246332 -18607 -180638 62291 -217771 24849 -214040
23151 -42150 -25376 37374 -218977 131732 -359531 -217901 71374 -221341 74691 285761
23141 285761 110683 -77256 30082 -54845 -64455 -363895 -1821 -152660 -117144 -66096 116805
23129 -81312 -183731 -146594 -33484 -247438 61436 -80402 189752 -124715 -67903 -131913 60586
23117 -428814 -24650 18420 113355 19904 183525 157181 -294056 -209835 12673 -2603 -75355
23106 -75355 11044 110811 160988 113961 28007 228602 -42159 37074 297617 13533 385182
23095 385182 -155118 -64694 90645 -150215 -297844 19723 -185784 -56502 337725 60580
23084 77564 -110717 -127099 280548 -28152 -102138 -255609 -118202 -76550 -25761 -10193 -87151
23073 -87151 -49362 -186333 357427 -67950 -67571 -279578 70689 181682 -510868 -217074 14730
23061 50715 17715 250946 50226 216993 -84668 -305352 271975 -355683 57405 54995 225329
23050 225329 -231352 -199772 -25396 -98118 35449 212724 182365 110976 -263620 -73376 93294
23038 -50370 -154096 -297676 -92671 80089 92199 -90206 376234 70664 -183597 -28797 -147160
23027 -147160 72691 38340 107850 354382 66252 21992 444238 -113698 -110355 121380 69997
23016 69997 74059 -342938 38296 346570 -120600 -26544 179976 -98338 -85113 176841 42945
23004 -250982 193495 -28689 105374 112367 185051 -23493 62433 235479 -41516 -119602 -53617
22992 -193068 480 -93953 29865 -107833 -287356 -259506 -38003 193835 203393 -178570 6086
22980 -114647 -165953 -108713 265837 254427 -159804 -113350 176072 263181 -88402 -126493 -147635
22969 -147635 224139 -11883 16298 120893 -383419 -172306 54679 -64545 -101808 489385
22958 -163099 -28212 -5701 -51375 146836 -72369 -100238 306151 -184889 -145424 -98751 -286450
22947 -286450 -165427 -60876 -23053 86231 126611 -410098 260824 104783 -28537 168282
22936 -42198 335136 59309 -242840 -236539 249702 92914 130135 -133530 -76918 -141265 -86412
22925 -86412 164920 265693 56961 -227800 373700 -189542 -52524 -41241 38989 21588 151184
22914 151184 -145410 -449353 361092 -435021 225209 -128062 57701 99979 -202570 -56243
22903 12004 245908 280439 -149161 -115586 -263178 -188246 -150660 -204906 80238 323148 -21049
22891 51583 -474033 131729 -152800 -559230 -55766 -121735 122234 5738 -107658 -119710 225962
22879 -55475 183499 7677 45590 -76594 58489 47810 -23468 162985 -15494 -406388 -39456
22867 -247384 -185912 -283974 147516 -40897 141336 -170305 240258 21920 -195109 -63219
22856 431870 97688 -289245 45346 227677 180899 -59717 -32679 75695 4538 -39261 -67551
22845 -67551 -23857 38130 -40355 -221045 107030 163327 -14250 366050 174503 209673 -157667
22833 40386 -263629 123660 241524 -381299 -139313 -82676 -11728 -155364 -284209 40977
22822 468013 5129 114641 -146824 -38250 121879 -156352 -123624 5846 79715 127612 124326
22811 124326 -79516 371404 229674 -169054 -193340 -187403 -164633 86116 -36736 -99048 305725
22799 179108 17390 -90205 -25474 41401 197089 38863 -2304 247046 -95645 -6040 141097
22787 -199636 156918 -58071 -84469 -64793 -276120 160345 -302714 87647 130659 63258 49620
22776 49620 -177047 59800 -331840 112359 -15880 -168153 -154885 112436 226418 -219842
22765 -534410 -88383 -146590 44506 -189268 -397268 -76686 36029 -123332 -108597 -196268 95564
22753 -141908 -167558 -163176 -85718 19319 -68846 -2696 -143789 8741 -76819 71196 -150750 -59286
22740 -308480 -150348 -159932 245252 -334145 40011 -285371 -108258 20480 64578 -55529 -61993
22729 -61993 21436 -74697 -67653 114384 123273 -3361 242461 -1078 203907 -95556 -272134 122893
22716 -349995 -135334 289709 104443 -129304 -223049 -191645 174845 1546 -273890 94447
22705 -68291 13598 248189 -206941 -165818 32803 274162 209274 153231 94655 -147278 -5190
22693 158013 41648 56542 -109099 39862 -103234 -24346 -119261 27764 182297 75340 -273944
22681 -298560 61350 57445 -62073 44973 13697 104358 20968 1231 -154254 -533 -341640 85556
22668 -42187 -75552 -156612 -263405 234796 36047 -75798 -138464 345768 -183632 -27833 -54598
22657 -54598 136887 -236986 -248807 -69974 5388 -155733 -160118 -18462 -32447 -130724 58090
22645 93401 -50110 -57456 79160 192436 -301261 -230298 50001 -132679 68367 -142914 -130759
22634 -130759 -244009 -227483 -56173 94723 -158020 -81699 -37192 -254907 161539 373929
22624 373929 11338 -286845 238841 24441 -40949 -334630 -7940 93300 44949 84766 -67211
22612 86616 -301748 -135688 -50071 -53577 -355065 98039 75422 17132 -130388 -131691 -37085
22600 -149224 114416 -102730 -387561 -117094 -123070 68110 53750 179037 -181536 -146979
22590 -146979 -206379 -209886 47622 -139899 -150357 -385002 -94852 -201214 -209645 -78248 -163882
22579 -163882 405832 36917 185562 224368 166451 20697 -72073 130990 189126 -8910 -8606
22568 -8606 173273 96652 -147198 -229865 -375578 174690 195891 3256 -20088 265643 313101
22557 313101 220410 -378076 -138752 252059 -38578 -300549 180774 -23856 -223362 -223178 -54900
22545 -114385 396079 -36602 64361 -22848 124466 -203186 -337638 352857 -230600 -284619
22535 -284619 -108544 -53641 -31838 269535 -271395 68203 75201 139163 -175322 118448 141907
22524 141907 408335 -74458 -243483 -181694 -83579 28199 365387 -152881 -298969 -218363
22514 -218363 214627 330670 -55134 55040 -132795 125630 -122906 252470 247250 -182354
22503 98815 -305526 -117403 -17793 138670 83180 1396 151151 -242468 -283376 -45998 -20118
22491 -7627 -55691 -414303 54989 -475048 -125421 72669 -122801 78872 73772 159316 96352
22480 96352 46310 -174038 172363 59395 177308 -49818 69302 -77158 20336 -30216 25589
22468 76757 -41701 75987 -239607 -128939 130033 329410 62878 -94908 -62381 -61057 -76240
22457 -76240 -43335 185074 -182383 125945 -242357 187476 225138 -184384 -207123 115176
22446 88859 -103462 212941 45701 -106617 -36191 166784 -54478 -29729 -430096 -207714
22435 205797 54304 -252151 -129490 -119885 -76489 -229542 -302689 109007 42783 70822 -248049
22423 -83772 -226543 -10381 -123641 39149 57511 38453 113 316308 -306197 -40308 -157847
22412 -157847 -452318 3460 -129838 -102899 222331 61633 -379863 103854 41018 25170 -294837
22400 179414 -72521 -29310 53896 235042 -138312 110625 8019 75877 -123920 -293731 -110058
22388 -207645 -428662 -150944 392618 -82753 43437 126094 118692 -170223 -93530 -70899 64873
22376 -125230 -213031 87943 -464839 128827 -74740 -41149 -103317 224056 -146675 -301702
22366 -301702 -265796 -241613 325392 58175 32706 20399 246997 -192086 4296 -221014 -4687
22354 -185293 -27957 203501 -331529 -124293 -13464 -124998 -151965 -53861 184226 -289190
22343 -96128 -213925 123805 -114223 129693 -63117 -203427 -139743 -348060 182027 -79230
22332 -141978 252435 140713 200039 -548890 -50768 -86626 -16624 -43872 -276344 -157995
22322 -157995 -65 -436078 -115131 -437311 22927 -208657 -17323 360185 181630 217244 206962
22311 206962 187769 181160 157886 202048 -21136 -197239 -120314 59661 -99670 -100513 -266267 -5578
22298 103545 -362194 153946 -182006 37539 55487 195424 -400556 -194339 -217754 145415
22287 -216048 -119358 -297774 153360 -34236 -63443 -15083 34021 -244081 95718 -11931 204454
22275 -278010 82185 -69290 -171900 111262 -95938 -32977 -50930 175650 16511 49769 -183401
22263 -384088 -50020 22918 81437 -208180 -199824 110427 -81685 206107 -30869 256120 -22456
22251 201302 90938 260385 -238655 232496 -84571 -261372 -148248 4493 -303610 -167331
22241 -167331 1455 -117266 -23520 -80506 -160471 103318 202708 273534 -210602 -15377 149819
22229 74876 387414 -276281 -198267 -212216 -339060 -137750 -170697 67996 11714 77287 -315911
22217 -229683 -126778 378888 -92170 8235 174207 -15778 -284118 203569 -192713 -2860 -64134
22206 -64134 -144315 37227 382722 130867 -142228 -422155 18709 47129 50440 3079 -393449
22194 61918 22439 -104185 230731 -409646 -128574 -290860 -83607 7038 -139667 -173635 316539
22182 113398 -228930 225781 -37378 247992 -114223 321705 78115 129960 -16169 173739
22171 86028 -98622 -105973 -73594 161178 197680 13569 -4959 262654 328878 -64966 233927
22159 -160825 28742 112304 -10416 -12030 -56300 -188105 -204773 -96066 -552338 -178111 -47206
22147 -20974 -25978 123501 -122346 -84493 -47198 -76746 340519 -124467 45430 135936 -320168
22135 -299444 -64953 46286 -57545 -217948 -130393 -168102 -97878 60262 108661 -38562 -305915
22124 -305915 10392 -30774 -34752 -261131 -116893 -77587 226659 -193141 -40593 -6809 -75244
22113 -75244 112764 13249 -144685 60092 299266 165834 8574 -196288 -324690 76178 -330560
22101 -235246 150522 -184572 56090 -318573 -254844 -154844 -17374 -217633 -258575 162596
22090 68874 133006 40506 200260 80642 -371166 90389 -20583 -171741 -173655 54969 -220696
22078 238678 35335 258761 -232784 -266941 -337669 -529590 227057 -94848 10789 2884 275640
22067 275640 -33990 313216 149735 -213639 224161 383734 272670 270911 -331982 -46621
22056 22168 -92963 -93251 69043 92634 -167257 -209199 -110433 227542 -62356 131397 -150470
22044 126669 147269 -3208 17388 -314024 58221 217903 369105 -462898 -290482 -143811
22033 -70981 89132 -114551 -77637 -135355 363342 63378 45295 56154 153755 -297653 -159712
22022 -159712 157789 -75338 262628 64112 -414182 -40561 253570 -319589 -41147 -139706
22012 -139706 -136670 -207021 -217431 248 -58687 150756 -217695 -93979 243305 501 1553 -125456
21999 -9657 201733 -33832 -97764 -102931 -41494 -243267 55222 54382 -69995 203738 -23753 -66823
21987 -66823 295063 -113151 -159868 202043 108645 -329989 -137887 210154 347909 -357721
21976 -134780 165401 34737 -17392 146786 -119587 -338439 -247153 -186267 54634 -111743
21965 145638 14682 -71197 314659 -112372 107562 364287 16811 -29146 16040 -54898 101727
21953 68246 -158733 -242615 -185935 93556 109548 189923 83114 198200 -110199 -66601 -80005
21942 -80005 -179745 216926 147126 -185778 80042 10042 -139407 -111982 -14908 -60957 -284723
21931 -284723 -106350 -91955 -25493 -213839 -180449 -270478 80672 -36279 169315 -444348 -354412
21920 -354412 676547 -177949 185615 -65972 294976 121693 39647 -101785 -2569 54811
21909 -28164 16756 -396916 -297390 -72510 -143097 211733 -103762 -56532 165734 -45627 -208722
21898 -208722 -98947 -23840 154742 68474 -50483 -31479 -372688 -71076 -134765 -92969 346039
21886 -299433 -126297 -179614 -463243 83935 -130545 208347 -224986 -31126 54084 167913
21876 167913 -296586 319372 202757 -54811 35242 122487 -64179 -10429 -72453 139279 58867
21864 -38741 397816 -48370 179594 -93358 -255420 3090 -43958 -116329 214530 -15897 39861
21852 256047 47351 -22978 26375 -199787 145408 -226952 -80836 58783 73306 -232042 -126171
21841 -126171 -245589 -42725 139474 -416095 -99819 253402 -200460 85204 -109671 -82042
21831 -82042 -160891 -106395 47659 103156 -324073 15821 152627 -5869 -214396 -176363 -294607
21820 -294607 -265539 212602 -30932 -128991 -52769 -306107 -305950 139058 13188 -94739 310807
21808 185203 86474 -162795 -270611 -131149 128863 51595 179450 -103642 89979 -20487
21797 2292 -307302 89480 206910 246131 131648 -152331 113317 -163494 138637 -212144
21786 -203742 -158300 163207 -348472 60646 168935 -78815 -300755 -16493 202782 -159710
21775 22187 43101 209681 -462635 -14654 148147 207226 -74460 28957 -50503 -65921 152206
21763 -103870 2220 61494 118000 106368 31601 -11651 -218223 -109339 348160 -358138 -211679
21752 -211679 -73569 112256 -138415 -58381 208516 -137673 -174927 -149931 -350482 -253489
21742 -253489 133987 172753 -176656 -248181 -90483 81322 119047 264552 69140 -231238 133367
21730 -168204 116200 -161330 -64849 79831 36339 33325 139214 -73776 146954 178455 -109192
21718 -232383 -14247 -118109 205558 -8052 92317 181979 -140451 166985 -163889 -277779
21708 -277779 -217345 -271467 -16504 45963 -168338 65803 67213 148265 140773 149055 66151 -108843
21695 65664 -72009 -218582 103763 75353 -37045 285698 79443 -283609 116138 51436 -187504
21683 92718 185982 202213 150916 -23637 908 144759 137181 -63330 -271074 90394 75518 43303
21671 43303 76613 49609 90718 -218124 -41621 126460 -142096 -38181 -246386 237163 -338835
21659 15227 -275982 -93970 -108354 142266 -302255 -407340 -483524 302363 191790 146019
21649 146019 245359 -174169 85462 171722 -43421 -218092 -178987 -116221 -172823 -582907 101211
21637 -6467 -91610 -189342 3233 -52185 -150699 113568 245720 -123213 -225348 -115333 -203047
21626 -203047 -45018 24486 34043 129037 -126496 -154912 -113614 160101 -155284 179292 34616
21614 -366910 -155218 15931 -183972 243769 -260294 65510 108517 -145598 -200845 -176337
21604 -176337 -45531 -41613 -150963 17228 -85984 -205660 -286735 56694 -139652 -237934 -19583
21592 177134 12299 168367 27418 328811 -136325 -155519 -52332 259101 53521 -98000 83826
21580 -15834 -19476 184486 -118897 67536 -143277 -61081 215595 186516 66374 -119555 -103402
21569 -103402 -299907 33428 -75590 -74956 96319 67711 -16903 92503 -162797 -240500 -37099
21557 -46374 -89860 -68103 -67662 -38903 200610 -163606 470416 -351379 60011 -236387 -78685
21545 -66801 -79816 -113559 -422633 -317815 -287981 -75041 -99205 -271246 -118235 -202177 -46245
21533 -36335 -101405 -77952 -244254 -121190 -152572 97223 -179539 -287043 -1436 -114901 221070
21521 -197837 29745 195365 141495 210239 93267 -168552 -58688 31135 88148 127693 140460
21510 140460 -486955 -201855 -503963 78015 183387 370445 -204840 291708 385777 245693
21500 245693 118083 85331 -118513 30986 -19474 -53029 203986 -74381 49534 198704 16163
21488 46383 -175958 -79517 -248457 -405969 -303043 -147273 -357785 7748 -65469 -99847 -35559
21476 -149585 34307 -83879 -284819 23161 10254 -130585 -142911 -80569 -5884 74127 -198897
21464 -144949 16550 -138422 163560 -66809 -327117 122558 156131 -194654 -40668 -178432
21454 -178432 63258 32017 -410378 157331 -108547 -132013 40915 162863 -440227 -54783
21443 48804 -111299 -46290 299855 80730 86644 563751 279377 173416 382666 74058 288114
21432 288114 308444 308097 -280215 -113409 -271121 -126925 -71466 -180558 -206797 -102026 25582
21420 -67041 87928 -78244 -101431 -93313 -141483 202023 -334038 162380 -8264 -68407 -8276 21339
21407 -151144 -21447 -5559 -171917 39743 -28640 40499 -304127 89723 255192 -50248 -383571
21396 -383571 288111 -122654 -189286 -15678 -265743 -27242 32549 33164 -370565 -24059 61640
21384 -192749 61287 -130811 -255659 70096 -5987 -21995 69110 86300 -14620 528 50818 231286
21372 231286 303797 -343187 -72895 -74598 -267124 -230884 24247 -117174 -14996 -209386 -162857
21361 -162857 -171319 141063 -145540 119104 226454 22670 -282162 177939 15827 46516
21351 46516 -79201 225724 73744 -79951 -352733 -142689 -204918 -228807 56886 -334738 48491
21339 -469432 -2087 -295577 -23926 -357965 -265749 -39604 -201238 -183923 96123 52968 -86474
21327 -322646 267187 -183077 160520 180629 113409 158169 -65202 -194886 269161 -122654
21316 -4762 139042 -219430 92760 -419399 -115304 -254723 -33499 -179305 282716 -22163
21305 -167760 -200268 292220 -122019 119840 -94534 123259 61524 -32386 -118294 -61228 -200952
21294 -200952 -123081 -281133 158505 -125089 21416 -212251 10734 165748 198996 391814
21284 391814 -241904 59628 -204198 -139811 -151533 -169762 11704 163860 -92297 279926 208387
21273 208387 -316871 176416 8272 381445 -21006 -12191 -285940 -129349 -98226 -224087 131511
21261 336016 127914 180835 -101501 78611 7173 -125265 148252 -370234 -151660 -77109
21251 -77109 -55922 133981 374111 -58808 97141 -336890 191208 -308486 -178670 143404
21240 123219 -26970 42457 110184 -83708 81573 -61714 131731 -96692 -56533 -44715 -201359
21229 -201359 33491 306866 -159731 -161454 -148114 226029 -168212 230162 -71004 -363977
21219 -363977 -155576 -366689 188870 82197 -235272 221773 -233203 -210414 -97334 -40154
21208 -170275 141007 -239977 -185624 -316062 131580 -121425 258171 -135276 309613 147778
21197 -130078 -71906 -201721 -177546 165818 169690 90692 -94606 94835 -263277 -170435 -23690
21185 105645 316245 48775 -184713 -95441 -10729 102558 -383 -90454 267591 -154244 -79164
21174 -79164 111193 25789 55403 47395 -125080 -11446 117258 135159 279365 -181337 25862
21162 -404328 -218337 -239835 -162547 -201728 -95444 251167 -195720 -158689 103355 -98415 -233279
21151 -233279 4302 -249873 -191722 -169932 -604440 -174485 234954 203261 -98787 -47051 4683
21139 -331377 10648 90275 -15389 -115614 -168416 127231 -329518 164172 224744 -65820 -152959
21128 -152959 -314388 360593 -56673 -120834 203082 -255387 -299336 -54177 5320 -90027 -163539
21117 -163539 -29844 66901 78500 -123823 56878 291769 -7746 -169834 -79031 -34832 102021
21105 -46588 -71085 -102900 11110 -42008 -453634 -128502 -234264 24924 241404 11330 -71079
21093 -195657 -517128 -23807 -270094 -7313 -183141 182247 -304883 270605 -401535 -222253
21083 -222253 291085 92718 54642 22439 -267597 77301 -164096 -22664 -293951 -190047
21073 -190047 -359203 -192167 -75685 -194869 -230836 -213384 -94191 -180943 39918 70029 -359995
21061 -7056 96416 -74568 -114228 -235064 59510 -58593 45978 66532 -150096 -267998 -109536
21049 53379 -59033 -18057 1031 -47925 -17259 -7059 44732 172002 -47207 136043 135055 -245131
21036 -63054 8256 136611 -8341 81805 323510 114147 -245209 232413 -53827 -196422 -54771
21024 -249212 184929 37542 91150 -144170 -346878 47510 204020 -37488 43597 -64383 200238
21012 -266284 -238673 -130825 -125881 180100 -135385 -167982 -15293 235887 -505623 -112335
21001 -116868 -8959 -25864 -40935 11068 -127730 -92207 -231809 -163778 43248 -7088 169161
20989 -231974 -45781 -332215 -87054 -254802 28193 14058 -275369 -417242 127800 -248965
20978 239588 -115908 -112162 153329 123021 127006 21352 -221820 144214 31363 96166 95247
20967 95247 -86952 29418 -126626 45029 102401 -164995 -311879 -120541 -76110 -87331 81419
20955 -100166 -112045 -128557 -191970 -165213 -29509 262759 -291599 -102821 -169163 -314353 -156386
20943 286089 55621 7826 -128552 29350 368280 50422 -127694 -209547 -116369 -108493 -8266
20931 -109392 19247 48631 -210003 -271229 -42402 -203359 -146548 -31543 79037 -283746 -244370
20920 -244370 34367 79050 -129776 -68988 -157633 -79850 143066 -350045 -235652 183476
20909 160272 10071 508598 155388 90389 -471615 -184741 -271007 -135300 -196967 -100072
20899 -100072 -120855 -80288 136179 96469 -358582 21338 -94502 79318 -2651 -53913 -165613
20888 -165613 -152914 -101640 4421 43014 -54849 -238396 284506 -58894 -31951 143600 -71016
20876 -211407 61237 39370 -28159 54142 33620 182076 -198354 -158010 60574 -121382 82065
20864 82933 -340127 283531 -228622 -68931 -481722 -222425 115327 -76365 -343027 -173285
20854 -173285 75494 -257352 -180371 -342176 -155674 -32783 349016 377719 -343174 -292948
20844 -292948 71173 39046 59140 -61350 244283 -282665 -27581 200121 -68419 -213786 -262912
20833 -262912 -302374 -31945 104918 40047 -68813 273742 -25323 35354 131268 -322911 -93761
20821 330909 245102 -56441 -279278 -128127 42789 -276104 -93211 -176335 160393 6238 84352
20810 84352 52296 -95534 -160593 -24323 115571 -142784 -298545 76989 -298455 -192541 -208349
20799 -208349 -240593 116025 -69390 181815 -88999 -232039 14715 124056 -18154 -257478
20789 -257478 312197 -197281 55112 -278460 -61083 99813 104428 -206558 -172687 248762 -329528
20777 262043 39779 41160 22319 331882 245599 2084 60021 190226 172081 59364 163513
20766 163513 -77072 282795 246919 -116922 -28570 -44205 -6266 133816 -122204 -309316 -470532
20755 -470532 -250077 -333909 80045 -105450 -465770 -104800 -159495 -479768 -41945 -117361
20745 -117361 76126 -121020 -348894 -88442 137278 -343188 230391 -322067 69534 -9448
20734 97481 -64112 248824 -150366 -474880 -344983 -55642 -339801 -30350 -169574 -163522 36259
20722 379183 96452 -253721 -150130 -187185 -429910 -80526 -144314 -133051 51838 -415881 308422
20710 -114283 -143422 267596 115122 -204395 199758 -40349 -183855 -71001 -137201 54080
20699 -144232 17859 148065 51500 -81895 142722 -309582 -304950 -50607 -27001 -140463 -93765
20688 -93765 -32988 189705 72384 -197724 243713 229127 -62622 -96348 26898 -64701 -44505
20677 -44505 495596 38741 4234 192484 102336 -145276 -42438 155022 358895 20514 110073
20666 110073 -33023 -11590 -216354 -160097 -79920 -314642 -204048 164368 -365191 59210
20655 123468 -110395 159450 -352085 12010 85259 -117469 -296607 -7449 86723 162403 -135393
20643 418596 333512 -88758 43370 -36144 75325 3967 -346297 -432991 -302043 249647 33113
20631 -396430 -225474 -99512 -204592 215811 -384491 152049 -341267 -149418 180519 -272717
20620 116390 -266933 70371 116118 -152261 -248407 -218343 -23125 239862 195976 -205354 129849
20608 2671 -5004 116160 -336093 301494 117171 -37005 75544 -67579 -79718 -176538 -87001
20596 -522827 -465473 116946 100387 -135147 308625 -133160 -164008 -77316 -144857 -46075 158225
20584 43199 -155245 140503 -20283 -220321 69037 -259850 43685 195073 -138266 -199493
20574 -199493 17067 238331 -101991 -105705 -327054 -60993 147733 -33212 -237514 -181479 -72747
20562 208595 -33695 12886 -331607 -170349 78050 243233 98834 -49335 -135344 26381 -224717
20550 -118377 -332830 -76233 -34983 -306701 10083 96701 59470 137981 147109 -294072 -187439
20539 -187439 203907 49795 -430056 -84352 261552 -29809 184255 -210900 72337 -72750
20528 -123320 -142698 98264 323406 2653 -167433 55567 70422 13437 316172 -197966 -59974
20516 -137915 -261420 -99340 -2632 -64072 -287722 -230531 -30932 155417 -14155 189989 -97794
20504 140763 -15845 -204598 56097 -53449 -210786 23674 -74949 47947 -134440 -18536 -203274
20493 -203274 -280601 160297 273034 -92183 241655 130124 -30534 196189 -97609 -312185
20483 -312185 21986 281214 133758 122198 7033 -64336 251888 98877 38766 -112794 -144984
20472 -144984 -346863 -75739 417465 -149400 147903 -246066 -114257 -204541 -336686 -76772
20461 -150091 127846 -288581 -58092 75275 101026 -6482 116118 101250 16182 -77557 33886
20449 119697 -172304 49146 -79554 -155868 51379 301228 -13832 -188451 125455 -154784
20438 -245856 86736 38316 26158 -275429 -107941 126674 52530 -376530 36067 -257588
20427 29142 30421 88089 -207211 -83555 147531 -83167 200168 -37998 -379094 -121579 -110214
20416 -110214 -35085 -184226 -136023 -42155 165827 -88708 -269540 101864 -246893 -144134
20406 -144134 296275 36131 -166277 6682 -40953 89479 -208738 4653 -110922 -286001 -56023
20394 -169205 31323 328994 -242030 126976 9270 199270 -122805 185996 96136 -52201
20383 -3846 -125040 -96222 -347421 -50584 -173467 -117370 -127689 46586 -396027 33616 -339451
20371 -133702 32018 75345 -317205 -218836 -369662 21279 -191920 -21029 218400 -188494
20360 -97267 -201630 -150897 94493 -56816 29839 -325979 -53635 -116500 343972 238199 -228439
20348 -13633 75833 -333857 -169239 -222987 106761 -113608 -71387 -289583 -42468 -191047
20338 -191047 -154179 -28713 977 -81734 90275 90525 -43287 65597 75310 -22947 127925 -214927
20325 -84955 69861 -5057 26211 152479 170109 69886 229609 -325485 -295532 36706 -97042
20313 -139492 -90848 -233657 11768 -295841 -47978 -233067 -1440 -11646 106107 31552 -240930
20301 10854 82780 -131120 -165062 185943 97904 72424 -44262 -93952 -177240 469403 -30604
20289 142462 53086 108645 43379 -10029 67019 133296 -224988 -82273 42552 -275968 -97297
20277 -22898 215819 283862 -118816 96654 -74379 -46200 -401607 -96300 74625 -40446 17020
20265 23266 -223040 -8354 -197136 277080 -70725 -129440 -167319 -302993 -198179 -76233 93444
20253 -147125 -69836 40006 -139291 64974 12715 -77792 -104282 97279 118217 -158366 -96288
20242 -96288 -213058 -196314 -58890 -53454 -4133 -59881 -91835 178449 2373 92232 -231729 105335
20229 -62930 -135849 -387659 -155832 -91912 92942 176681 -11712 -115465 72934 -103165 -63279
20218 -63279 -190507 -363788 -68074 -62205 -72059 81355 -302641 -65113 -58831 57223 101020 -133376
20205 42772 -115793 -38600 -99835 -81041 -45656 206201 -31883 61993 230530 -116796 -167894
20194 -167894 259621 -278321 -87387 -155891 -15073 74524 90810 -73474 -101009 -71560 -401866
20183 -401866 -254681 5001 -144083 -53478 269194 205971 -192973 -83554 9203 -201312 -47127
20171 -102627 165987 39203 -24196 7422 -180863 19071 -52621 -240597 -253067 54302 -1804
20159 16181 -303502 -26995 -162480 104728 177311 1195 -91584 -178823 104600 129292 -266709
20147 113560 193557 23187 -192446 -13135 197177 -151848 -18053 46823 -391898 272182
20136 118332 -38273 -2954 -278454 157222 -178235 13354 -216682 40780 63420 -198392 -160491
20125 -160491 29392 205037 -280697 -96969 -483002 185317 -175729 270152 -146349 116477
20114 -10871 -32666 113312 -13466 -171251 -355956 -172409 327384 93505 53205 -245882
20103 42999 159309 131298 390548 -151324 -228075 173505 -186215 -4828 -116835 -96946 -114403
20092 -114403 146988 -397482 -117950 88967 260204 -267796 -93860 -375219 -188937 -32002
20081 -20093 -221433 13765 58558 -227892 7914 -179998 99386 63869 -310485 -124364 105964
20069 -220362 118989 55290 -22280 125804 -186255 32664 -187508 30031 -23609 -55476 -70280
20058 -70280 -126766 -452946 -26957 58819 -402625 426555 -287444 -42616 247522 -86785 117572
20046 201314 -150493 -188930 14333 -261875 -155023 -313309 46087 -7770 -50791 35367 -79049
20034 -57198 -80847 6531 -130736 -52516 -17828 191695 223096 19278 -134966 135985 -75992
20022 -185603 213060 -267391 -270378 -133834 194783 -157576 -224198 -132985 -185987 142708
20011 -297577 144058 142182 -229442 159376 -101576 -75247 22528 -298589 204005 -207227
20000 10841 -61643 -145043 -272434 178584 -10884 176997 -91325 -168424 -128907 118586 -342238
19988 -16598 -30696 -250902 138801 -186637 -153711 388665 -523087 -51120 -202526 -171942
19978 -171942 -40259 -217048 -46614 191978 -56017 -70470 126520 -4311 122442 81235 27598
19966 -547682 -60677 30601 -275263 -220977 313479 88257 20681 -85535 22486 -71620 -187890
19955 -187890 42402 171887 75872 256634 -276807 228984 1716 -120306 -214147 41940 -93073
19943 118788 -18680 66877 -24471 -69934 -393733 12250 23817 -40308 55916 2151 195404
19932 195404 -191812 -38093 84090 -340116 12359 -218898 99778 -465109 84411 -195110
19921 -221342 -160327 -267161 97114 -276800 88971 64472 120790 7365 -262357 -36282 37943
19909 395701 -78267 -18295 -129697 184807 327812 248550 327282 63929 39315 -36537 -80362
19898 -80362 -270114 -28113 -65724 102619 43601 -186806 78167 -86702 -20625 129214 -373061
19886 230223 -110698 -523736 -89258 -137249 -168654 83190 37761 -162865 -191600 193822 -37711
19874 -87864 -105129 -120601 -89115 -308312 -43176 -349741 190131 -227211 94445 -133685 -141253
19863 -141253 -263764 58247 33057 -129162 -545419 131379 -259398 -20502 -339644 169322
19852 373791 -198165 48145 -16867 318504 -479405 -89394 -113552 45481 -236234 63235 -56046
19840 -55447 -300987 44056 -108301 -125710 276257 19222 262213 -248088 -28460 -282505
19830 -282505 -88572 249078 -116032 -357637 136344 178274 15062 -42288 -133801 6543 -390041
19818 30256 -7771 -169977 57908 -26050 -611784 49689 65117 -174969 18944 -286844 311611
19806 -167166 -24078 84058 -141422 221762 279906 -113240 23873 -182803 106778 160574
19796 160574 192679 21653 141794 -156734 13124 -40063 29197 170367 68882 305489 145410
19784 -63348 -145996 76979 234992 -274765 54910 -251844 -396656 -179666 -255044 -214570 -115864
19773 -115864 -286775 383269 -317086 169471 -138996 -200547 -110162 87234 -140213 -94229
19763 -94229 -766296 -405184 -336801 -61674 57166 -166536 319028 211297 5608 -160089 68218
19751 88468 -125809 118510 60124 64323 -177589 -383842 -169384 13013 -130297 -107187 -97430
19740 -97430 -112505 -19621 290191 -35501 146177 -254524 -72477 -48891 -208296 -273157 -220133
19729 -220133 -291671 -38884 -55324 196011 116122 -68404 -193954 -12665 -200735 3024 -120432
19717 -350410 -188520 -87453 -161693 -323222 -30136 -14972 -6775 84389 74657 -157260 -50076
19705 -253112 56773 -29547 -176872 -131155 -120149 -54244 -149651 217 -69060 -144307 -275199
19694 -275199 -97998 -176808 35790 -74804 79207 -209750 -120895 185944 187648 267147 21198
19682 101634 106868 -72928 318525 -297636 -34884 -301986 734 152353 -87 63410 -77399 184539
19669 278351 -119824 -78708 49302 -174253 -278910 27315 -207749 -93863 -402 -35822 154779
19657 24412 -351216 227601 277418 20028 104301 -396687 70424 -85567 -34864 -512648 -173281
19645 132059 -182214 60799 -52816 105474 -35886 -25923 92289 -234449 -48693 27268 26371
19634 26371 352569 45821 -92571 132190 -146325 93066 -98386 -80847 4701 -319614 -190645
19623 -190645 -140333 -76146 -366745 -583113 42207 -64783 59011 28491 -225804 -170241 -61974
19611 298743 -98889 31809 -224190 -131893 -378181 75638 -176323 252388 271857 -299908
19600 -7358 78928 -303585 -1020 -270098 -96991 -267346 85678 -367150 -447618 -213272 146664
19588 -200545 117780 -83861 109727 -50912 70429 -20878 -149604 -130439 -283986 185226
19577 -221904 410755 -25387 -150470 117183 -26830 -364946 -20068 -194419 19161 -62885
19566 -158989 -483712 -130633 -346263 -54291 2448 -263448 -11316 -373404 -225155 -218268 115057
19554 39646 -177646 -207991 -215744 50662 -63372 -87129 170285 30777 58538 -91150 -125720
19543 -125720 -144103 -329334 -149412 10750 -103708 -345251 -177056 -44106 -128347 -259707
19533 -259707 -47296 197846 -141923 -131804 -355901 234483 -132644 -59286 94242 35805
19522 14020 -82804 196275 -203842 -154306 -282128 196370 -254107 -37519 159296 -130805
19511 -63862 -65146 -323255 67171 -112180 -325279 51717 -98215 -149115 -8370 133545 24976
19499 181547 262939 -69641 -4385 -315062 -19980 228149 -104089 -188177 6943 -116742 -296598
19488 -296598 191580 -415754 269256 -37135 59809 23477 -252999 346141 139893 126883
19478 126883 -174203 -25013 36764 -91774 59391 -162664 -137312 -64450 -45951 115316 190625
19467 190625 -315229 -136172 22317 406817 199801 2241 17764 -213319 -186696 -192107 -75723
19455 60940 38669 19913 -238904 -192485 36402 -27811 -236075 239565 108851 -170779 12692
19443 -216113 -113601 306482 -308042 24021 -88665 -10068 259475 -97283 -324162 -285000
19433 -285000 115384 -86372 -311913 -203919 -8378 -167982 -18529 -89224 95675 203938 237042
19422 237042 117128 -137961 222067 -97390 -211814 268450 -72288 131424 -337510 -8270
19411 3016 75591 50053 102615 -215709 -152040 -405354 -195936 -3547 -180978 120311 273006
19400 273006 208116 -3706 112726 -257488 -3914 -260625 -156183 -11863 214096 -299515 -49767
19388 -19097 -20965 62854 -231478 -26793 -293950 -67627 -401865 -37648 140654 33140 -13236
19376 89202 17255 -78801 -46352 -344128 166768 -27329 97843 -234609 125346 -119860 -5812
19364 -222294 -220262 316915 80842 65141 -294636 -284265 34139 -110914 16881 1653 -112471
19352 -43535 -254280 -282566 180088 -33661 216789 148657 110399 96282 46411 -224472 22039
19340 -176431 -89203 -449852 65408 -509400 29077 -75170 41906 179922 -49975 -724 -93771
19329 -93771 -296034 -52600 173174 -108314 160141 230074 -7763 -7544 -303095 168098 -215242
19317 -393083 167026 -277215 -178630 12295 -139343 -496027 235189 52217 -142755 154090
19306 134843 -146851 -115727 -48240 46451 -179571 -276562 58847 -250538 -280112 129839 -153154
19294 -83425 -91645 -270142 -13623 121236 248866 -203991 -231675 198681 215898 74217 -172585
19282 -513049 163135 37233 73282 -281441 -245374 -288422 61130 -111881 -51789 331541 29152
19270 -293361 -70607 -18827 -114517 -132294 31998 -272587 -46932 -11890 -86054 362561 -26551
19258 -140274 -474150 -135384 -345378 36122 -82689 -128953 -131542 48121 -343378 178662 -313
19246 -21110 85768 -44886 -250870 -275154 -346628 44617 -28916 -33209 -307292 179022 -51526
19234 -53575 -92394 -15042 -134720 -126740 -153813 -119586 11472 -171002 -79512 113428 -266472
19222 15534 -78048 159870 -214530 200245 160339 -81417 -261134 -8652 48259 -342627 83475
19210 -274631 156739 188848 -109774 -106356 -79621 154803 88970 209001 164823 132819 -236820
19198 -115993 176123 -73638 -99648 -54405 -168366 103857 -228129 49464 55025 -183303 -103542
19187 -103542 308134 -283892 320284 101885 -127203 -169651 171612 -228265 -88429 71493
19176 45755 -131482 -105679 -74875 -5819 -286795 10598 5703 69957 78220 -90631 32110 102441
19164 102441 -348431 45223 -215011 227606 -20977 105989 -379854 66777 -88316 210977
19153 -209652 -176642 -9225 164834 -9527 27840 78607 -102817 80008 -78317 -122704 -29616
19141 28413 -449587 12464 205209 32173 137527 -14034 -21629 86350 21981 -142633 10002
19129 160635 188698 76158 -139709 -194796 -420094 -48431 -62820 64410 245866 -73510 -24081
19117 -273010 50463 22703 90236 -54051 -92507 -131817 -18802 -44273 75439 473189 -78339
19105 40929 219238 -29538 -112965 -183683 99809 127302 293714 -232986 -216754 92082 -37060
19093 -249315 -27028 -121751 67376 -61015 68227 -56793 -337778 129305 -98619 112176 -122503
19081 278492 -234662 -213641 -291768 -204639 163079 119078 -137080 -13424 -98510 -50622 7816
19069 16869 -216340 -105244 139465 -130505 229953 -119600 124409 185333 -93337 -4037
19058 -90429 -373515 -86813 91403 82163 -87816 -157028 209087 -89142 96908 -6788 190464
19046 158507 -245979 163029 11952 385321 24677 6036 -319499 -240578 337347 -287 1008
19034 176989 -136268 37968 52981 159783 -148913 251048 125497 334909 204851 40987
19023 -143372 -16716 45572 -262524 270419 -142632 -50702 -13300 -377671 -29606 -76589 -95745
19012 -95745 -189835 -150607 -73298 69707 150210 -52594 -428268 -250178 17625 143683 -141495
19000 -236689 54368 -251028 395639 6012 -162350 159005 -288423 224770 -80871 86193
18989 -3928 -409219 -6506 44079 -17359 -355937 -157616 -360978 -31872 -243896 171755 148524
18978 148524 -151710 -65877 -74398 -190629 263273 -65827 -169095 -221803 -148178 233848 -151952
18966 274808 -111116 66393 89433 41993 -94522 -186653 79109 -81059 28790 70642 -254900
18954 31589 -223313 -221422 -202351 213297 24513 -161909 64479 -237749 51862 156559 -122642
18942 -102082 -30952 87343 4449 -193776 -130716 25594 55209 -145100 -224182 156343 13066
18930 -184824 280663 -23268 124238 235688 229522 -316169 -70275 205974 -53067 -53441 2783
18918 104179 7091 -136029 -333921 -223814 -37324 -166160 18858 -162339 -239212 125553
18907 254458 278829 203415 -123371 -208423 -200092 43720 149017 7193 -77822 28361 -231814
18895 176677 75288 240297 79945 -79904 -115653 -140874 120769 17920 -111938 86068 -44647
18883 -153257 -288360 -185487 69681 21263 -117263 -206119 -665 -168444 -33876 266498 6327
18871 149490 -22113 121598 -130203 -272018 -261248 -95161 -349077 127913 -215668 -62895
18860 53372 -110501 21144 -152390 -90535 137589 -66900 -309208 131602 -79598 219337
18849 198500 -136393 -343611 137413 60426 139765 53738 -26837 -147012 236449 -296387
18838 -36601 183361 -563036 100688 -178921 84629 201485 188103 -501249 41496 39264 -86867
18826 -258739 -127012 4510 26254 278664 -176562 97047 -237999 256554 -158910 -71811
18815 78009 270780 92984 10372 -126133 167449 -43419 193224 170791 146898 -69116 -206675
18804 -206675 183661 61960 218729 -143720 14946 -199869 -71742 17583 295867 -10619
18793 -266536 63891 -131470 -126369 -4042 -288790 -174367 55304 -126606 103237 32190 11994
18781 -151546 -218958 -120320 -299266 114984 -15119 165030 -165234 14847 -44947 -153372
18771 -153372 -112523 128468 215656 -199982 151749 -203434 139650 120868 -153294 -75281
18760 91078 185259 -138618 19178 -357470 -8377 14479 -423484 -252740 110925 112288 -10521
18748 125321 150084 -161770 134570 -34230 -123786 -11377 -151281 124308 -152773 -235510
18738 -235510 -182964 139452 160107 -145569 -214061 -72046 -279892 -85424 -43476 246417 -277647
18726 131549 -117842 37469 -397000 288509 -59247 -239117 15969 -179721 58500 191159
18716 191159 -66564 157467 93656 -161388 -58268 -124344 -27125 263806 -273795 -89587 173956
18704 -94545 -140089 -15812 128016 -408655 -14070 -80548 -180059 87221 -224691 29668 -171916
18692 265354 -51648 -157311 -47185 263986 -168157 155248 281471 34069 -154317 62294
18681 54279 38588 382069 -149067 95669 -145464 -289132 -38173 152962 102197 -322104
18670 -145931 58910 -168490 328515 -267782 -228180 -38655 -142244 299449 -273164 -294366
18660 -294366 -102009 -269374 -2093 -104186 -154015 -261544 346006 128485 -111250 -117653
18650 -117653 -5934 -382668 139666 -254697 -99033 -167946 257819 -189330 11215 86449 -118008
18638 -34611 -186215 -288670 74726 23505 -136965 206171 -161947 105171 -99094 -194875
18628 -194875 -144584 -192599 -128967 -261833 -283732 -93827 -386951 -80300 67652 -17078 106029
18616 -104367 152440 95815 -110357 -239037 -81723 87037 -9179 -432049 -338206 182624 -27426
18604 -86031 -83032 263815 53141 -213087 -130599 69529 -22642 -155622 -238749 -138276 77929
18592 49562 -122468 -45771 -80497 -572162 -4119 122475 -228789 -156759 -95614 -6526 9560
18580 -96554 -332093 47579 -337982 -120746 24864 -7452 107087 -69866 -80792 -224482 -123416
18569 -123416 144398 409352 -50290 -140928 -156782 -61162 73481 -234117 54581 -259749 -301589
18558 -301589 -241877 -136854 -51961 -282828 24557 -244331 -180963 -19937 135329 -24291 -11727
18546 154203 -47839 101012 -233794 -70164 -301437 -33508 3425 -26370 189555 -125505 56816
18534 -336904 -283896 -20106 172309 -4353 -395305 -193317 -114294 -236833 127176 109147 -19201
18522 -232795 -179232 -294417 -156835 -206853 85005 258715 -215328 48946 2194 -196606 244463
18510 -472404 -104097 79694 43702 39545 -348238 -112345 -188182 -111216 -264574 -248197 145588
18498 131533 -188294 -66749 34587 -66109 68633 15521 -63074 -181823 61727 122381 -81298
18486 -150579 -158095 -174886 201888 -226392 -8311 46328 -213941 -149456 210947 73897 101010
18475 101010 62779 49720 114678 12648 -342276 -233008 -132783 -208439 -36730 -40958 -216836
18464 -216836 50986 -227626 12668 58947 -187331 111579 -230110 -383680 -120267 39944
18453 40973 -10709 193778 -98036 -150117 -170921 -41745 31775 -324682 155335 -115803 -44196
18441 8547 -95285 164457 -131902 -42886 -95327 161879 166403 24000 -276821 49922 5024
18429 -360582 -115048 -43300 222077 -164045 -6784 12308 -147913 -334063 -201387 -507666
18419 -507666 -314712 -196147 -175276 -94533 -39012 -67169 123626 333480 -230200 -88822
18408 -168442 88952 -87450 -366852 104811 133187 -2347 -110270 88131 235585 -172997 66822
18396 -104172 112889 -72188 -800589 -117125 44776 273629 -184860 -33523 -161807 -137080
18386 -137080 -122508 -82724 338772 -208925 -47774 -181767 -247733 -134515 79674 106939 -57580
18374 53550 -9260 96741 -217604 -65535 -86142 -117438 -112625 -21039 59711 345347 -88290 162061
18361 210922 -304835 -144518 -44548 315 -28565 -297579 -55014 -77162 -28344 -318785 -89777
18349 -157828 -219617 -162426 -113238 -1412 4039 -45880 -81496 16885 -435936 -66474 103945
18337 -222078 -70948 -409569 -37960 -397400 -313352 48036 18249 -211303 -217868 -23741 -244820
18326 -244820 150754 -347188 -44995 -22687 -40828 819 -68987 -160393 222481 -364563 287651
18314 186692 53684 -459531 -471489 -84035 246671 200931 170281 77699 -152599 92499 224987
18303 224987 92588 74772 -62862 -36043 -138977 -151003 -163975 -11736 -163250 -83422 175365
18291 20346 -125468 -37490 318214 426603 19721 -136291 -133517 68256 -177851 -118694 223652
18279 435463 -70878 -150054 74181 29243 112246 -200172 -14846 172262 -332980 -103896 114251
18267 -98398 -13625 -10893 -163355 62592 212066 -166544 209048 635 122120 -50908 38505
18255 -47811 221039 9777 35665 -339602 -8039 -20539 -136511 -43641 31509 142559 48166
18243 141810 -113006 -201185 8579 -308226 -238273 -175260 -358354 -88141 -108959 -305313 -192341
18232 -192341 -282512 -228395 -175863 128150 40179 -309692 -30850 -221122 40328 -150302 209405
18220 -61956 -70419 149856 17214 -160620 -424569 -207067 -31885 -14155 -372247 -151088 125832
18208 -110503 -31019 -90846 225803 10701 144440 -54827 -128649 -18575 -75493 240072 -56182
18196 -227865 239953 86830 150006 13394 -385963 -121770 179904 -42915 188331 22385
18185 88426 -239066 352471 413459 -52256 -117953 -43293 -67011 -231238 56087 28445 75962
18174 75962 -18752 -306985 175157 -89033 -5036 -186400 -55121 4393 -23084 -89863 -80524 384868
18161 111627 72744 -40521 90195 -228045 -479242 -35144 -554 -44581 73712 -202098 -92986
18149 -134163 -93501 -205141 -49652 -249181 -396021 -248047 -396344 -29233 -355774 -28433
18138 -94292 8506 57569 1035 418560 -432551 199986 -54637 -230604 -12671 -48541 39936
18126 -158610 -202295 -330085 116368 -212307 299105 -246112 -32011 8469 -228875 19269
18115 -153655 -39225 -153494 56008 -85713 168313 -252333 302154 149792 133973 -265791
18104 -182072 -100424 -126887 -16140 120919 -81156 -192141 28055 156215 219196 148129 -65993
18092 -263790 -235573 72507 74589 -151066 97606 70170 -137238 -31395 -85893 86815 -1435
18080 161045 -56961 14182 96156 -40182 77131 -401469 -44199 -25897 -286410 -210055 64002
18068 -27921 -45977 -384505 -141588 -102219 -21680 220780 -189432 337792 -253515 -161871
18058 -161871 -36414 -91921 20943 -252318 150220 -263556 -258168 -158661 28277 -507565 -210241
18046 -180242 82549 -123113 290433 186545 16940 -261924 -266974 -16348 14716 11068 141804
18035 141804 -95561 -229251 -179549 -40650 -147371 8088 92761 255911 -11586 -111415 -119789
18024 -119789 87610 -106834 -269585 386304 -94534 249940 161730 -25470 -191367 -370548
18014 -370548 -252231 -38310 19412 -31317 -238816 -255308 -130988 117292 -77366 -47234 -222267
18003 -222267 -55562 -36094 -484223 2966 135847 132415 65750 192156 211988 80606 256284
17992 256284 -150256 -46837 105829 -159608 -216632 -121223 -187249 216925 -190631 414943
17981 333385 -157579 -144947 241599 86162 -177143 -139437 -210 133485 -315553 71635 247669
17970 247669 -29799 135641 -39294 -223955 147059 -209953 -104867 133853 -55794 59080
17959 -126755 -5028 -102803 -202444 -148776 88001 267656 -90343 -203171 223983 153830 -9547
17947 31060 -257220 387364 180145 -381133 -55871 92965 -225045 -151426 -161833 -35250 126750
17935 -178326 252993 104787 -108053 77830 3931 -314994 192433 43900 150330 -203887
17924 -180497 -90694 -10238 -186528 -150762 215148 58957 44597 -236122 -155302 -145396 -88051
17913 -88051 -164813 -24214 -354035 -217757 -80436 34736 159379 -19829 -180418 336276 95787
17901 64895 -61269 137555 26532 4621 185005 -137776 -184333 -84606 -44091 36586 118016
17890 118016 30517 -359962 31161 -130734 -88718 -140090 -96186 -71835 -139245 -159316 -288902
17879 -288902 -94838 40367 60761 -284970 -192771 56717 51103 -29654 -145979 -74153 17466
17867 38990 -25996 110832 136443 -164060 -138236 -24923 -345163 -49167 3052 -350157 470311
17855 21219 -9619 -112537 -220224 49042 -7451 -26208 17707 12434 106392 321134 -164728
17843 -123775 -168879 -189999 120320 16127 5565 12694 -120528 -424423 193917 -189796 29419
17831 36316 -159540 -56643 -169088 -322928 -11547 212517 -88103 35480 -114940 5079 248454
17820 248454 8058 -427557 -200919 129919 99295 293854 -75747 -111918 -35670 52946 82532
17809 82532 -194424 -123965 88750 180326 -128144 201953 104741 303935 -122211 291204
17798 -149687 -93925 74880 134155 -108494 -119706 -137666 -212795 142983 -5030 -207404 -56197
17786 -104737 110709 -117662 -74277 108975 -110112 -116963 -40029 324777 -80588 81611 114929
17775 114929 186972 -406855 -151040 41010 4449 -338578 11896 47588 32932 97700 -4647
17763 24974 314823 298395 67794 -138376 -164096 -28977 11300 -130408 125069 41935 -68949
17751 -207854 230389 37735 36495 -4946 -73589 380711 122057 -116532 -142116 190781 -279302
17739 73008 -64188 -276904 109102 -264104 -68557 141211 -70948 -284593 -268198 106203
17728 -304393 -161157 85780 53863 54978 27054 223723 -66441 24827 162001 -134233 -33876
17716 -152091 -3978 -31879 248316 347909 24168 -90392 -224408 -233121 98492 79705 -164837
17704 375892 81426 74727 22100 -16550 -58285 56583 49607 -259816 277428 -235792 72790
17692 -11078 252318 101872 153862 -102194 -92272 96118 -112073 -74757 -23333 -72024 39710
17680 -72617 -45769 -78272 127089 314939 -123590 -19963 -446528 81906 -26254 153349 -112455
17668 -47416 -166075 -23948 215538 122114 170799 -52733 -108214 137952 -8329 -115797 70475
17656 -9941 112327 7658 128845 -119565 130402 163164 -130156 -30381 -43458 -111107 135892
17644 113134 -55453 51535 -8284 64660 210889 -352713 -178796 -254379 -42021 -3020 320546
17632 40119 -120399 212531 -136838 -59284 67146 -129131 -95945 -168648 -200747 183498 -121987
17620 -30887 101538 -47355 -96957 -293251 296346 45125 129019 11224 306507 253607 -110781
17608 -11290 -335632 274443 -136607 -105690 241546 -105872 268524 175626 125997 166933
17598 166933 -3473 182948 -103349 -12516 103879 261363 -134154 81723 -49050 28875 126754
17587 126754 155519 135108 -185834 -11474 -40591 -130608 -57428 -89590 -165479 -107148 -111235
17576 -111235 260143 141260 -33983 -150648 200788 110296 182306 -85376 -187629 -229520
17566 -229520 -40 -4817 34521 215592 259745 -135336 123467 -152916 -342579 107059 180300
17555 180300 87597 -69918 -59172 45232 379989 -99190 -184472 172030 206412 353128 56347
17543 -324685 -53052 324581 -259939 -208293 68437 14200 287694 186326 175019 -167110
17532 50982 258489 127337 8610 470818 289870 -48642 157167 217669 191106 83768 249351
17521 249351 262704 116187 -96667 -338643 93856 -39671 -169455 319577 85180 113129 142590
17510 142590 314433 85757 -118921 -27062 -143283 -266280 146288 83034 -40801 128918
17499 72959 -114732 -119582 10169 152402 19520 66410 456562 83005 214563 -200603 -42956
17487 228062 379926 127835 13208 134187 284546 -10930 73553 377642 101578 -20884
17476 235012 -96410 -34859 391863 376336 168008 328139 102592 184291 73328 187171
17466 187171 -59555 507362 99253 -49050 -23109 188349 256481 151249 302125 462245
17456 462245 38106 379020 125005 68223 215508 12899 -58217 -100102 545891 177370
17445 427511 276485 139484 55580 261652 104659 435893 122272 161898 42474 222059
17435 222059 383044 361203 151716 279466 88404 282210 159973 137756 10776 120395
17425 120395 52146 346312 401023 -51354 -223951 -172839 -139229 306518 303428 453662 186310
17413 487569 338130 55345 544576 -119559 301648 91751 87021 301292 -184237 -11366
17402 107787 55794 29212 -19274 326100 54199 -136392 98908 71236 99646 -104250 -111611
17391 -111611 232855 264023 218514 111957 -6381 325132 -27416 -44343 300247 144850 -152708
17379 -108014 -17136 34969 -35939 143350 -33464 29309 -103270 26971 42279 148216 302975
17368 302975 193021 -134809 117989 185645 -37726 -240696 8896 172026 -224703 304991
17357 58853 127286 179862 297443 10048 382995 186408 450812 -102281 16980 -53553 285319
17345 -30101 -415176 232315 40333 202870 95878 272441 341296 13582 -218219 -64955 154058
17333 -179387 168467 143880 53049 114546 215314 88899 53884 91689 65525 -214502 384110
17321 -136670 153251 60535 229297 252911 221286 74834 -8021 252925 335023 51612 110485
17310 110485 91221 158134 84309 -165834 278428 -46485 -279997 -16896 20974 63305 326155
17299 326155 377799 181317 506555 268222 30199 264533 170415 90013 82278 91077 38776
17287 69970 -152112 172923 105394 420375 241049 91825 -17388 -253083 186111 97317
17277 97317 360424 245668 132318 -60884 50643 122592 38628 -257228 -3852 98680 99269
17266 99269 383740 401301 -57919 185065 195893 145700 -118815 16403 167042 202093 180186
17255 180186 474291 277516 180108 -240126 -83677 214462 88702 266698 416046 -37015
17244 323001 308557 143041 -222402 298966 158135 233106 241512 -36078 328557 21239 -46015
17232 247144 -13571 207434 369761 -61382 528224 -123611 42228 12325 -246780 211069
17221 520708 180968 -155586 430430 504450 310613 -71055 161138 -859 136622 -5167 -2212
17209 694197 148165 422812 -153591 -63831 246958 463866 86257 156261 56299 277001
17199 277001 405186 96145 75353 263879 137255 79284 534259 243655 381805 220605
17189 220605 15840 82471 -152719 153233 213640 -11654 285612 369965 219364 148605 37535
17177 9647 432923 89965 546932 -25681 683071 263991 601722 144638 144994 -26511 288897
17165 248636 90817 211881 497465 297147 138195 84711 -236288 192667 -31076 336004
17154 142683 117332 342460 517465 -47376 267888 110667 412578 145345 249828 117882
17143 317713 519001 355196 32100 -45929 207961 80414 -15453 54919 147494 598808 399521
17132 399521 284982 433404 806479 252591 154959 299487 511782 408353 234050 82784
17121 558786 259218 359812 -53451 -19236 467874 -32375 -184023 659756 -144693 160492
17110 503621 364463 145878 380485 165527 377422 211085 396964 296519 234478 25157
17099 542507 267749 551558 418613 359935 496949 482120 101159 410305 356115 555909
17089 555909 159801 315042 208831 438350 291973 243989 239921 438262 441716 440576 412490
17078 412490 385143 401532 527468 425035 47677 308842 639211 524326 134258 423743
17068 423743 73677 324528 231024 388090 347103 483415 491539 783433 544715 642188 489188
17057 489188 201201 449519 383637 474626 -78989 499535 556313 325185 524336 499037
17047 499037 543628 442006 225821 452360 664675 301109 366898 485426 238678 317901
17037 317901 721341 218318 780071 369521 419538 190889 622341 252425 869113 741406
17027 741406 308620 645351 497080 247025 375722 768894 591436 590116 420562 682288
17017 682288 498778 566090 454229 750727 666079 806204 383655 515476 759863 642074
17007 642074 763769 469736 887330 622147 578817 582319 388709 953031 668469 664776
16997 664776 675668 443529 557930 880665 532006 430472 1043398 742179 501259 728809
16987 728809 453536 786881 857234 506966 864368 447996 690016 583016 550757 738853
16977 738853 911565 742722 641327 923976 580141 894247 729601 806110 770991 376202
16966 364809 1068809 784073 829579 806556 612795 964100 825399 642422 883191 1259091
16956 1259091 853571 842347 923081 1122175 900948 796477 938683 1116008 862396 1232925
16946 1232925 1077081 934738 917107 1005430 1018456 980522 975495 1191915 1284008 957410 1114987
16935 1114987 714929 984077 947601 966218 1185269 1128871 1137341 857604 976122 714692
16925 714692 1073499 1529890 1164622 1240320 442910 1498277 1204166 1254403 1565576 1015840
16915 1015840 1406129 1301316 1301276 1310267 859724 1421469 1602185 1058392 1392358 1390402 1440308
16904 1440308 1426500 1191117 1319198 1407829 1451141 1542047 1263526 1195112 1954812 1483679
16894 1483679 1919837 1690056 1735735 1824980 1638673 1467655 1674820 1791929 1637591 1907328
16884 1907328 1763870 1818219 2058074 1736112 1878247 1911157 2017885 2039726 1960044 1688621
16874 1688621 2246009 1724238 2273757 1815347 2312699 1736595 2348621 2293437 2258802 2140271
16864 2140271 2525445 2401139 2465682 2151414 2219474 2498532 2781633 2216968 2310244 2354204
16854 2354204 2529190 2691752 2685805 2755658 2690679 2691770 2637075 3087569 2937755 2933754 3328201
16843 3328201 3087219 3072979 3202167 3242838 3188256 3153255 3493310 3539376 3510381 3636459
16833 3636459 3464514 3746258 3687446 4075581 4037497 4139144 4132531 3858955 4592924 4301034
16823 4301034 4748680 4159399 4513475 4436349 4607130 4696764 4791052 5070962 4978215 5266529
16813 5266529 5558397 5567093 5652014 5763446 5862366 5942250 5878358 6042748 6354576 6716825
16803 6716825 6612949 6752762 6837408 6970249 7011845 7049039 7473730 7698669 7597815 7798094
16793 7798094 8436960 8491597 8632326 8953420 9125973 9326387 9535205 10005377 10292126 10037786
16783 10037786 10383481 10778091 11232571 11839613 11756712 12292388 12511058 12970575 13227157
16774 13227157 13623675 14512326 14507311 15487836 15621521 16118115 16642527 17316019 18448680
16765 18448680 18494104 19056863 20172132 20843677 21466685 22556081 23141248 24320390 25243291
16756 25243291 26320143 27369386 28605248 29867789 31136610 32728039 34176670 35395213
16748 35395213 37800461 39288050 41280983 43051790 45599076 48249031 50153859 53124752
16740 53124752 55449659 59141919 62461227 65594294 69663232 73985579 78020567 83113975
16732 83113975 87808753 92945557 98599198 104456806 110352808 116967950 123051401 129724294
16724 129724294 136565216 143017921 149092981 155413899 160934676 166076405 170716036 173938313
16716 173938313 176440455 177342018 177499109 176620445 174370602 170919245 166561978 161762247
16708 161762247 156326068 150101503 143261605 136181613 129709507 122803788 115980479 109493806
16700 109493806 103412945 97590897 91962510 86401015 81625655 76824024 71903736 68242624
16692 68242624 64346877 61071467 57527050 54167129 51513867 48648748 46125266 43824052
16684 43824052 41749088 39586786 37608802 36124089 34271398 32175870 31020264 29771842
16676 29771842 28525909 27126835 26358995 24771187 23787769 22734239 21736952 21276531 20301699
16667 20301699 19385605 19143661 18078977 17902031 16789484 16450211 15680165 15077538 14462062
16658 14462062 14288743 13418065 13256046 12893714 12658533 12140403 11708089 11770957 10810054
16649 10810054 10855820 10519162 10044932 9830901 9619776 9228360 9006540 8666382 8592553 8248489
16639 8248489 7874370 7662731 7885969 7416319 7625750 6965189 7193246 6805203 6774262 6401569
16629 6401569 6127290 5945063 6396163 5884760 5251934 5501963 5442190 5379647 4821844 4893244
16619 4893244 5030963 4839423 4707156 4847186 4921770 4727574 4694651 4229636 4378231 4321543
16609 4321543 3711207 4051656 3773173 4066172 3737133 3903386 3570870 3342681 3712461
16600 3712461 3550534 3541557 3603202 3124352 3139810 2941881 3061416 2907609 2869928 3308132
16590 3308132 2953805 3148173 3211198 2804868 2636748 2536916 2676662 2817896 2499696 2985787
16580 2985787 2479621 2365941 2695558 2594087 2374674 2498080 2331517 2544627 2072217
16571 2072217 2051518 2076910 2018471 1993778 1923240 2014920 2028030 2000141 1802166 1781912 2091274
16560 2091274 1826355 1788146 1771514 2053995 1613649 1512424 1692763 1766543 1583332 1630713
16550 1630713 1562907 1542013 1521422 1368432 1641469 1404066 1705044 1524805 1659011 1320751
16540 1320751 1557475 1746857 1610300 1267937 1115439 1429254 1769037 1271465 1590832
16531 1590832 1286704 1385777 1424369 993806 1168696 1089699 1097048 1273763 1213114 1352809
16521 1352809 1119563 1269923 1014940 1158549 994294 1185070 986397 1423272 1005347
16512 1005347 989265 868070 959559 1085759 912717 813658 640080 842472 1052999 1275086
16502 1275086 755218 1220568 869553 1092181 957998 1027129 1183844 1339945 621124 708277
16492 708277 1070698 1046950 427862 850626 664263 827158 785476 725469 588631 673922
16482 673922 730821 813955 646111 544933 765509 949025 381962 784547 574718 925654
16472 925654 1031016 1081154 694813 907167 515052 812185 686811 501568 987727 728113
16462 728113 686765 670820 563993 831526 520368 696008 704111 334439 579062 -82507
16451 763820 502383 671846 1055997 671563 1025893 444268 418417 856707 623397 514125
16441 514125 375102 741549 652681 270974 236883 685889 734141 690635 375115 764106
16431 764106 680814 328797 168758 349910 639560 277419 425225 529475 425663 208749
16420 607758 761375 527372 564091 200218 307066 301733 287484 692246 468569 525399
16410 525399 537347 467150 193902 202188 -48576 525945 258830 212677 536153 629472 557883
16399 557883 437256 200193 453698 392567 216163 362982 285014 219961 555295 407392
16389 407392 751994 197873 476973 283120 234615 608454 244717 668245 444413 391722
16379 391722 320872 -38124 388724 -45683 194267 552224 504387 351505 460861 484945
16369 484945 48206 660198 536701 -2578 230611 342000 291250 385498 439148 171573 27305
16357 301559 116302 122916 312909 179876 -18266 239197 344159 171799 91766 249396
16347 249396 256207 220291 26371 276581 404288 120860 441759 226965 309094 13440 -40114
16335 296943 535462 510305 416494 235274 247115 281939 178422 422646 344783 166354
16324 356902 151749 80824 309602 211672 583248 112985 -94385 174718 176262 398255
16314 398255 20744 47187 338437 145625 119 168150 87352 359402 127060 -218478 459177
16302 212944 160280 538533 71128 58706 -158632 437250 294841 273551 277059 -90786 64363
16290 -13665 178756 84308 305170 342625 140624 50387 233467 -3442 373391 57541 363576
16279 363576 232791 -117079 146676 478379 -142594 202294 -90084 -107122 159725 297845
16269 297845 216224 56328 203886 188017 214175 187197 -5413 28056 271699 333848 9046
16257 141179 153398 545466 -258124 -118085 399771 219417 -63005 -6737 -184770 78614
16246 115880 50571 339819 81213 139619 -18043 -355098 156090 274890 231120 -197688
16235 323946 -2662 32336 262773 24769 36996 -131419 -138164 -9815 -104122 -31035 117120
16223 -8708 213651 -215449 -57468 218739 -29495 265443 247784 18367 -142151 -95552 174766
16211 275600 132864 235151 -17710 404724 172217 403679 -286904 -13279 -21582 133327
16200 -336489 -137395 232940 100896 -152200 71830 -56172 32144 320809 48198 305277
16190 305277 -11975 -121446 114258 205432 173085 92166 -151342 -94648 -203398 227886
16179 48451 -463826 -40675 260946 -163643 -81254 62392 2353 -354928 18549 301871 -118120
16167 50585 -89441 -74613 -36032 218963 303469 -364435 1250 231637 -78069 -144230 71207
16155 -229186 44457 122969 -96999 110085 98594 303634 104195 236601 -56030 -300216
16145 -300216 65222 31247 185446 100160 254137 35436 -68062 208141 -224937 159056
16134 56499 226042 523250 151805 523691 -117683 118740 79635 -173011 215867 74725
16123 121942 -290692 224460 -1269 71743 181175 -155374 196562 -96401 94143 89895 -306352
16111 201167 22264 -159517 48384 150132 147105 55463 -255485 159075 -183745 209568
16100 81437 -20934 335030 68696 503520 -32118 -93259 29683 76216 46563 -44255 219819
16088 -86693 30356 228668 -387287 -386428 97252 212669 58752 142690 11356 -37959 219725
16076 -200453 -95373 28474 -4768 56025 -26317 -201076 -339778 -172403 30635 107261 59901
16065 59901 320235 383965 -2558 56188 262792 41641 139173 90857 54836 -157216 -62416
16053 -207298 -218751 -134194 -51113 166602 -143258 -108161 6951 24133 34668 60972 -63483
16041 -13345 95056 -171882 18872 -132026 257833 -12561 151171 90091 -90826 4457 276502
16030 276502 -31773 -118442 -102908 399929 79614 150291 133089 279112 -108124 280291 7249
16018 47805 213582 -9741 156358 -195804 -164818 -92075 9507 -249964 -108351 -198269 -174278
16007 -174278 39989 -246252 127838 -89685 30351 -71080 -15529 -57542 16671 215912 -160430
15995 -223243 -126964 114648 -435515 -128540 35576 183324 -134673 230897 -203039 -190783
15985 -190783 354211 425990 178406 288423 185389 -95943 -41473 275190 222186 -352893
15974 -59575 -169436 -347106 91571 52352 253207 207521 10104 213126 -60001 -145459 -33269
15962 -260976 -62400 48816 110475 -282405 -214317 -271305 -290706 111149 -36435 298321 -122586
15950 -178206 -22308 -162498 -18460 135243 19813 -80730 80632 347388 -196397 118205
15939 76455 -63778 -120990 -224880 -169131 -100269 32976 72232 -218204 -88414 181390 293211
15928 293211 9781 -42561 -448502 -232922 -205245 -188205 -169881 -496098 -38322 174531 -183162
15916 44734 -131260 159995 -24182 40228 43664 -124590 -146630 106410 -57108 -244886 62525
15904 72254 -109564 -100617 -150761 -117395 -145910 -125403 248000 -436439 25151 -59047 194604
15892 -53935 -48696 -237969 -412209 -165787 -94330 213655 203692 -41760 177933 19823 -80264
15880 285725 43321 34798 -184219 265848 48894 -483480 -214455 112563 89457 -154027
15869 241468 -79897 -227051 36018 -100477 245210 -148549 349322 42647 -168996 -344193
15859 -344193 3312 289742 -216795 -66353 -2541 123609 226063 166152 141829 -137701 -111007
15848 -111007 -191944 -146401 -415736 -183555 32936 -188994 53605 406523 143796 -67284
15837 23197 -212934 -71926 -138522 85499 -2124 -220249 -279498 33750 134684 -141620 894
15825 -174320 322223 -212313 56436 -70086 -147222 -155208 5515 -166510 234031 -73253 24432
15813 80473 28381 -101678 -119471 -75091 71740 -239310 77526 -236873 -31158 -176033 5686
15801 -127331 474559 -135877 -50523 149967 -276976 -168005 121096 97882 211905 -176083
15790 137502 72358 234027 35463 -239057 -59545 -334958 -112912 -294171 -208174 78937
15779 -246392 9034 -188764 116303 -24974 35355 121248 -94366 -49910 -234750 231453 31547
15767 229245 3386 23640 -153294 -229099 537195 144670 43519 29771 257152 391915 -343114
15755 -87965 -121395 521981 -219111 -183085 79935 -77678 10043 129252 48808 180172 -168863
15743 203493 -20277 261017 67154 327436 75401 -102339 26698 -37575 212211 -71692 -328013
15732 -328013 -95333 11361 236930 68690 -330919 -125547 320046 238798 -119803 -29268
15721 105094 -246479 398325 -50127 -79967 162929 -115482 12006 19931 -122275 28142 212662
15710 212662 103252 94741 -167190 -207247 90776 -479873 64209 -80436 21474 15148 -68128
15698 184486 -109798 -8296 -158074 -42369 -7489 -171585 45201 275413 -150945 244104 51758
15686 143232 277793 -40128 -137575 -128820 -95939 -291681 71740 -247636 -268734 -259677 -94465
15674 22833 101537 -182117 75253 273937 -11032 -294346 -136749 266721 29334 -239472
15663 38144 -184258 -167779 -51847 396176 -35860 -227645 39944 251717 -187021 -413011
15653 -413011 -49078 -4878 -153555 127881 149755 317216 366330 -28649 -64280 -203558 -36942
15641 -106326 -192940 248188 381877 -45770 124801 149878 -76535 -217744 -40066 -274684
15631 -274684 -326744 -503671 386842 -190258 147734 217287 53812 -94246 -47553 91900 78015
15620 78015 8929 2752 -160842 33880 -76287 269302 266114 -265081 239493 44778 254645
15609 254645 -175996 212243 -84466 -194857 -193918 96636 -143957 -309714 -311725 -104669 102715
15597 -105212 -183377 -156496 -144246 413804 -96498 -6742 -107196 -40618 61651 209653 43322
15585 15114 -137464 354222 172707 -317260 92120 -179383 -64991 172786 223903 -151531
15574 56757 21916 -136262 131219 -209124 12134 -10921 -135212 -66389 18360 -261995 33894
15562 -252843 -11443 -38082 -44254 312757 -33371 5701 -5033 -206432 -275677 -283623 40639 153154
15550 153154 -175374 -170540 128203 -289156 105047 54621 -131019 177099 232601 -455855
15539 244143 -139604 -142679 -42507 -86376 4023 162905 55179 -77886 -3198 -326418 69729
15527 318992 87138 -165630 -25288 -61683 -1878 25753 112419 231675 28172 96496 -231261
15515 -223046 -148667 169683 72875 -35186 46239 -26923 -11165 -59346 139921 -212233 67109
15503 51533 105547 -82907 428829 -231313 -185766 219871 121792 119011 135842 40941 -73148
15491 -201535 263809 -314328 -109383 43360 -661 -30222 -347431 -512106 -132402 264461
15480 31135 18982 -259891 -42633 -211877 -64837 277747 95841 -218462 -469104 -142096
15469 -185477 -143098 -75359 -31404 -321134 -10078 278541 232547 287656 70104 -94285 40219
15457 52990 -150032 -39098 225379 -129853 71683 -168856 228196 91909 -503 123014 -96786
15445 183319 136259 160879 -219041 -21121 -99098 -177292 39917 -41956 127798 170645 83543
15433 3067 -147377 263753 -165326 36729 153146 10713 27123 -28495 -51290 -107681 92534
15421 3855 50278 -199868 -61570 -228012 -72096 -13053 -189878 -211164 -395004 359636 -143900
15409 215280 -34291 30599 7554 -22146 73873 -91797 269659 -306954 86032 127377 -6365
15397 182075 -568520 79938 140511 6515 453727 47474 176194 -10957 368124 -6076 221500
15385 -169297 102331 170644 -68564 -196815 42911 64020 -173978 403791 -116051 -85287
15375 -85287 383178 -24334 -243899 -119680 20230 -60224 213163 -94845 -222783 70219 233894
15364 233894 256919 -94503 -25345 -172129 -215939 -89416 -223833 -13674 -66310 31125 -126123
15352 53034 -214185 -244669 197130 162509 198639 189155 177631 279504 212119 69828 -50985
15340 279772 -37731 -46066 -275980 292616 117351 236743 397805 48264 79170 -53978 43463
15328 25089 -69149 -69202 82494 -140729 195966 181515 -239349 407026 -185588 234283 363828
15317 363828 109957 289175 24216 -3327 -137188 -67378 48007 183979 199648 313847 153539
15305 -111930 105492 44591 -256738 265363 -74530 -154377 152031 -122051 -199381 211436
15294 112719 -31363 213792 -260074 159097 15599 127023 196680 -33333 376258 -337800
15283 -31292 373233 -464761 -68118 273890 105145 -271143 37211 373459 114406 194234
15273 194234 118219 -203036 -177512 506220 58700 155723 -276105 113650 98156 -62299 146373
15261 -443830 101577 104672 39277 7348 264507 60045 -8562 -144722 250941 312037 100691
15249 604078 1098493 1374750 1206704 1110430 1156097 248124 292083 242292 -427637 -179031
15238 135854 369330 218724 -60914 -47731 -274990 112704 -146742 158109 -255891 -166196
15228 -166196 -235514 -112896 295625 310268 -65493 271217 -357950 38411 175844 -6818 -389466
15217 -389466 -52445 139828 30888 -4237 -85439 -219274 261169 -20362 -54958 -75271 355400
15205 -45089 -23514 -48373 66020 -142347 -341 -1787 -106588 -334779 28896 242177 -221154
15193 156489 33714 86911 77950 -5768 -262960 -51241 -51284 182066 -132151 105212 28529 -325861
15180 -37086 27394 251844 148072 302338 -136768 120329 50060 -199466 168585 166575
15170 166575 135062 376695 140192 -58513 -239698 -339543 -208140 -61568 19130 45628 102527
15159 102527 -76161 60720 29945 26280 183730 -305256 -16403 -78116 -36985 146221 365925
15148 365925 60020 156847 47516 111806 39061 104286 180203 161093 157692 -171895 -268426
15137 -268426 -17826 543797 -153979 159632 -118798 83430 319674 18501 -73340 204185
15126 12041 287672 209920 67174 169082 513687 -95951 511149 -76889 43406 158131 205829
15115 205829 214090 -3104 55081 156976 49982 196579 -44758 213880 133861 -147984 -49746
15103 -97802 166162 289520 20241 73111 83899 152039 203354 -48342 253281 53134 181349
15092 181349 10922 2511 115520 297416 379354 376705 54565 541219 107813 174801 141131
15081 141131 376815 257267 -83816 22771 202834 -46068 245577 306015 118294 -44462
15070 -10804 -334306 -70356 -27142 -12006 165021 -59925 486253 270073 404377 -55808 1386
15058 183859 130676 455926 211628 295904 14767 -44044 169201 39016 -162623 24385 -10786
15046 -174345 178284 -27066 432083 52354 375644 182822 -107128 353308 128824 332412
15036 332412 5194 -62083 285827 249327 245028 297003 167643 256964 260968 477837 -88420
15024 184643 41035 368709 483539 214928 76605 41812 -118166 287461 134982 219765
15014 219765 174538 -17968 496044 152075 -6099 -114682 17183 186738 301495 197821
15004 197821 475499 258988 175394 350844 281801 113819 -7404 775 270029 237239 222052
14993 222052 485217 162198 130188 226271 114187 61473 175598 18978 564125 45685
14982 194530 76030 56717 299185 15879 102007 -118468 346965 188781 184214 100295 293483
14971 293483 142572 300832 -65379 -51510 -30036 77882 216889 566891 68882 133502 -219286
14959 169483 75834 -67647 -51855 266394 96197 77052 167092 124955 196367 236540 -60650
14947 19291 -29488 309025 234550 465872 201505 238563 95240 -71701 419744 284192 369241
14936 369241 -154234 312081 67695 36135 -24232 272265 216189 263059 237921 -266351 90937
14924 -240161 275934 -157379 396804 548144 142598 -67366 139714 -6378 493866 101913
14913 202201 337585 647985 -25851 246777 -150456 291338 158231 193725 342844 328338
14903 328338 171094 606810 22088 225590 362463 76097 7756 239746 283358 238724 313208
14892 313208 472757 527002 280768 468003 284111 305511 264677 202874 -12427 193320
14881 380894 310015 391999 351598 283313 364635 158695 17159 151736 275796 224605 379202
14870 379202 444955 443174 350738 306290 312818 605306 154476 298168 427017 254610 302640
14859 302640 609033 154710 108566 50398 55483 281779 55437 341580 246189 353743 446355
14848 446355 261150 256510 439141 311211 430673 522405 482079 102923 329683 258129
14838 258129 530401 330150 263595 386209 637323 343995 735534 208628 364008 466373
14828 466373 268861 383856 477686 131542 329608 271931 244056 605134 492577 560048
14818 560048 189364 579641 312824 968959 464710 316097 304590 476517 481319 482999
14808 482999 298640 174985 396626 338423 539629 490627 190018 502445 255774 140492
14798 140492 187283 437354 569169 597321 423017 512915 647553 250238 130254 340699
14788 340699 210818 167365 144681 428334 296200 475801 280176 520649 450467 480871
14778 480871 223637 686164 428867 142853 436537 154931 815959 240426 355057 472987
14768 472987 613186 369457 590071 502827 264068 541622 518604 546437 91958 640111
14758 640111 641246 172771 730628 412115 735867 352581 573066 898782 644851 749968
14748 749968 361376 546563 576576 592247 409396 785734 366660 266411 358606 468341
14738 468341 593621 700961 395133 560074 838780 494022 765439 830197 828788 408885
14727 507049 602326 679975 370210 900996 740123 414681 616054 622248 677068 458984
14717 458984 362090 421074 648070 390357 715303 549063 662464 593180 596628 535477 654412
14706 654412 794640 477163 744091 1171663 781119 643041 406365 508167 1240126 552031
14695 922811 573398 870872 753550 949017 667806 759062 914233 976277 596609 377978
14685 377978 1046932 755805 813208 566604 389712 971425 725091 1096904 811259 925338
14675 925338 927380 949909 1064392 850444 1030006 560733 741846 647759 926601 1029779
14665 1029779 746624 724381 873306 877248 1250146 1057990 769558 1463548 1135410 794183
14655 794183 724352 781158 951528 1243923 1012802 1015890 1115676 1045146 1168569 1287553 1028206
14644 1028206 1175503 1015242 879217 968890 1074255 770059 888394 957417 1269644 1235765
14634 1235765 1084080 1130146 855932 1086444 1107693 1162091 827453 1361124 1221935 701426
14624 701426 1150582 1418448 1319705 1262658 950061 1044083 1001676 1302578 1534457 1135257
14614 1135257 706253 1375844 1252388 1311125 1345483 1427969 894603 1251376 1282825 1296278
14604 1296278 1311075 1333420 1239751 1713113 1292992 1353134 1603010 1294355 1692166 1455025
14594 1455025 1583746 1483183 1240312 1703966 891317 1363449 1749345 1386414 1195867
14585 1195867 1385538 1531441 1719759 1265167 1663180 1630405 1751707 1416353 1667126 1990456
14575 1990456 1766690 1748250 1688831 1796421 2152823 1817644 2086085 1998752 1959224 2334870
14565 2334870 2055381 1829454 2276537 2308306 1931579 2557519 2180057 2316562 3002135 2960452
14555 2960452 3156122 3161412 3399138 4074703 4393150 5632787 8161730 12789568 23156271
14546 23156271 37100129 36103543 20138380 6279291 3064553 2246406 1457000 1767578
14538 1767578 1479885 1496758 1692783 1853654 1708600 1598841 1723642 1760950 1893692 1881127
14528 1881127 1874696 2017359 1657533 2122398 2095416 1888876 2024430 1907913 2204524 2194314
14518 2194314 2036833 1939808 1943118 2259885 2121731 2388310 2282227 2254746 2327971 2186270
14508 2186270 2332179 2639999 2502092 2518423 2768587 2404168 2802966 2936619 2576498 2584493
14498 2584493 2639397 3049414 2532408 2619789 3017227 2757289 2592205 2625296 2906763 2850487
14488 2850487 2943015 2920124 2749182 2938506 3221335 3407753 3238300 3320088 3559476 3276576
14478 3276576 3254015 3426040 3726163 3499736 3371151 3437765 3795081 3663029 3739728 3371769
14468 3371769 3849742 3788618 3844054 3790408 3812516 3867974 3933644 4113167 3944921 4600549
14458 4600549 4166607 4176166 4028355 4277345 4476776 4447523 4031395 4832636 4468295 4955404
14448 4955404 4619355 4882443 5137816 4642783 5015355 4974589 5123913 5234546 5239060 5202595
14438 5202595 5464707 5438948 5385297 5444067 6018175 5933784 5660004 6090348 5601213 6104114
14428 6104114 6086797 6224610 6352495 6211193 6272517 6124497 6361406 6551056 6946250 6796980
14418 6796980 7106097 6929649 6840055 7113897 7104789 7654192 7633781 7680040 7685549 7786912 8170246
14407 8170246 7751881 7962159 8388371 8152718 8493111 8577587 8755616 9057754 9176919 9146006
14397 9146006 9519973 9402614 9450220 10047722 10225213 10309005 10441387 10484547 10736419 10792322
14387 10792322 11023457 11168225 11738240 11768669 11941206 12138146 12477914 12633928 12938905
14378 12938905 13152861 13155479 13517831 13723737 14475314 14442686 14798124 14940509 15142554 15455550
14368 15455550 15899331 16362714 16667497 16682704 17592650 17546526 18279257 18548497 18838870 19392891
14358 19392891 19759113 20099308 20654133 21298973 21898492 22179569 22629541 23312419 23816692
14349 23816692 24184657 24936815 25218440 25875228 27053595 27524244 28499921 29316020 29764908
14340 29764908 30576470 31477297 32249042 33516422 34477143 35176008 36182260 37277257 38606566
14331 38606566 39918799 40865518 42258007 43548464 44873438 46467725 48091293 49782706
14323 49782706 51487700 53275228 55321717 57065440 59368809 61405192 63790157 66125193
14315 66125193 68774723 71494858 74338984 77573502 80806061 83587509 87708875 91313275
14307 91313275 95500885 99426180 104058975 109190168 114156643 119401925 124953462 131180691
14299 131180691 137873217 144496613 152143975 159946522 168201835 177373271 186601010 196795707
14291 196795707 207260285 218501213 230389677 242859122 256063576 269655376 284009821
14284 284009821 299093945 314263258 329794671 345530157 360999254 376416408 391615127
14277 391615127 406248321 419363709 431277622 438981321 444251661 448407137 449303879 450309153
14269 450309153 447775920 452852126 453076559 446130623 436187314 423959260 409905189 394762911
14261 394762911 378819043 362396895 346024423 329213102 312919399 297386931 282360806
14254 282360806 268013587 254013651 240306761 227471002 215349549 204138644 193429014
14247 193429014 183518041 173593130 165285043 157100642 149054959 141729380 135009556 128231334
14239 128231334 122463725 116958010 111887543 106933711 102097546 97372747 92947896 89474104
14231 89474104 85894337 82280820 78729024 75613984 72715551 69970829 67413573 64740312
14223 64740312 62400679 60309790 57945670 56414808 54161867 52425066 50582472 48998937
14215 48998937 47553966 46323870 44838401 43010673 41716784 40360533 39101812 38531125
14207 38531125 37148164 36327922 35489015 33649536 32887391 32279942 31561078 31125144 29860338
14198 29860338 28903455 28254447 27470791 27271981 26229473 25651097 25196357 24482624 23545378
14189 23545378 22910130 22107581 22290553 21541306 21225000 20512593 20028780 19628651 19169699
14180 19169699 18619788 18156267 18167005 17720200 17344849 17011480 16507943 16208405 16059158
14171 16059158 15501435 15525375 14742963 14859928 14547824 14026188 13894212 13526143 13386557
14162 13386557 13017002 12967731 12669154 12361879 12261244 12046143 12154170 11865832 11528523
14153 11528523 11448243 11166731 10684596 10489553 10618652 10606456 9918652 10186983 10291534 10103361
14143 10103361 9623296 9732984 9403130 9238097 8907701 9160954 8625773 8863020 8607710
14134 8607710 8402722 8318926 7868186 7792143 8269360 7752803 7635059 7711746 7501686 7557682
14124 7557682 7077915 7259991 7191283 7137565 7260196 6833117 6997209 6715652 6125408 6521872
14114 6521872 6785473 6500365 6195540 6153348 5918857 5907377 6089508 5974791 5907986 5738139
14104 5738139 5603561 5504295 5440130 5358104 5526410 5224062 5564632 4961148 4940787 5166672
14094 5166672 4828075 5144494 4802724 5320078 4723638 4767151 4944724 4692989 4672207 4902434
14084 4902434 4315673 4381752 4461266 4155340 4433884 4293951 4036194 4171667 4068492 4176880
14074 4176880 3730727 4127856 4178337 3986421 3777258 3981083 3931813 3720066 3898698 3764242
14064 3764242 3713612 3475387 3399262 3407361 3773032 3442455 3738096 3657348 3529367 3797078
14054 3797078 3463810 3203261 3236253 3371121 3557658 3219884 3007618 2914662 3275498 3094293
14044 3094293 2732089 2884730 2735207 2807462 3087761 3163477 2625549 2852490 2822203 2672778
14034 2672778 2776145 2569489 2943909 2838508 2750395 2623462 2373931 2655678 2390303 2672827
14024 2672827 2219102 2500249 2592866 2534731 2343721 2111879 2165113 2374770 2076059 2153403
14014 2153403 2516100 2235580 2010062 2471009 2183694 2028131 2319430 2020334 2053632 2270572
14004 2270572 2314904 1996740 1926022 2302929 1481168 1491070 1964217 2041847 1719253 2022656
13994 2022656 1657767 2078993 1920658 2427021 3417419 4699875 8292498 17323871 33068600
13985 33068600 36380729 24612509 9955366 6130333 5021086 3657400 3533273 2927748
13977 2927748 3050103 2861205 2659959 2651130 2376054 2508880 2563932 2173947 2140980 2021473
13967 2021473 2376632 1903007 1886501 2182319 2070051 1941591 1847262 1649193 2127231 1972832
13957 1972832 1709271 1696100 1600930 1583697 1786835 1801199 1465553 1833362 1574040 1618698
13947 1618698 1541991 1774277 1636669 1728032 1887540 1612784 1742607 1802253 1697034 1690241
13937 1690241 1579255 1736514 1880359 1627667 1343728 1471105 1171565 1462029 1268503
13928 1268503 1576829 1503271 1260911 1189069 1509786 1699119 1426829 1242789 1584392 1500087
13918 1500087 1496955 1690539 1564248 1550947 1276015 1357333 1417585 826493 1677096 1428435
13908 1428435 1099108 1152736 1030161 1461275 1242473 1459662 1430917 1423172 1026814 1217856
13898 1217856 1262997 1157466 1144000 1173795 1248817 1161410 1254155 1267408 1245855 886005 1491116
13887 1491116 875199 764033 926025 886270 1440858 1157222 1260842 1173165 1171567 843417
13877 843417 1027184 1404230 1010846 531126 924945 1115277 1511486 1040643 1035100 1008462
13867 1008462 648892 1025374 1149331 885378 1275320 875252 812776 850261 776329 797939
13857 797939 958156 1082502 955215 412506 648773 687614 726109 632935 862775 949725
13847 949725 798257 947153 720438 925396 893794 676784 646449 1211027 744065 824838
13837 824838 817612 704090 511562 775104 808106 751846 691265 772027 980197 861096 758653
13826 758653 873876 730739 1074962 914705 923403 957537 538951 431813 475520 958731
13816 958731 182824 704503 854377 628968 846571 761151 739607 528951 732258 924498
13806 924498 824535 500912 697321 706031 984034 563976 343035 769777 857032 512618
13796 512618 988215 501573 821899 769928 287561 556899 756439 790722 802202 667524
13786 667524 598171 632433 758445 677781 603105 423158 827853 648402 663862 672746 668363
13775 668363 521031 549208 407824 658920 414615 387998 854134 497781 267722 647433
13765 647433 382047 854270 937570 438426 817995 728903 331400 959705 835919 402800
13754 223913 727736 517738 423850 397091 288337 672268 660419 446740 347758 356896 653257
13743 653257 709240 328505 728390 725258 698859 904480 943072 807579 518905 456078 1028799
13732 1028799 541625 603947 532934 738342 457539 637225 491814 591101 616730 568425
13722 568425 664904 413911 265053 614994 774771 500413 472856 472111 519716 485686 472449
13711 472449 507098 495842 526636 478787 141381 508682 572705 554230 534548 346249 343586
13700 343586 597156 498585 418080 373201 569866 404902 512509 412369 476343 600970
13690 600970 558304 675718 290338 154025 341087 256830 442818 79163 416350 545490
13680 545490 276566 484307 256378 320596 473467 252368 652723 255015 525724 551497
13670 551497 147513 415295 469949 604967 232042 327978 224173 932840 569903 593698
13660 593698 301443 259777 475038 173067 156054 608227 532236 321348 404677 549502
13650 549502 126181 98156 306673 774180 422682 154947 233903 722050 542077 306307
13640 306307 574547 316006 109019 335518 304480 269863 490683 118063 384260 338974
13630 338974 284691 169478 511684 235470 216123 249123 79115 381007 323755 105891
13619 611239 613357 117402 681629 534859 220541 373091 471816 292096 231197 333424
13609 333424 487326 550584 311755 578910 758519 630520 423037 339866 387421 184746
13598 339579 118595 337011 22111 169344 460391 284322 370725 320582 114311 428692
13588 428692 424700 269736 302333 134277 442013 231479 457619 336763 -29784 94726
13577 361149 74616 135721 522666 468329 402591 606540 511741 -28254 10422 88440 284837
13566 284837 393884 640133 368775 320411 496232 138649 -154389 662575 294407 74631
13555 637824 369119 478213 558394 149012 715237 110542 199836 105600 205971 498102
13545 498102 179640 401377 340987 661472 56461 196183 81270 287354 372782 159830
13534 60428 182280 182513 74942 131308 48575 125782 305868 94742 -139904 56959 533524
13523 533524 183547 104705 142691 284727 172600 408863 338360 334555 155434 88563 40201
13511 304637 -95600 332981 -69306 364796 -16518 596591 281354 94791 352592 141992
13500 537838 196830 -195468 334752 359179 417132 27407 333350 195921 323878 89423
13489 190902 64769 170512 239782 128844 -142278 252144 135710 178836 325747 322499
13479 322499 51937 41223 77616 17047 118884 76248 376413 166653 329217 413743 127071
13467 213816 336625 28418 200189 119633 141142 173035 401759 255711 200071 143561 347849
13456 347849 -232148 135757 420683 549907 -85886 632727 288574 42044 382576 259686
13446 259686 396957 207041 167130 276692 396044 64059 254631 239202 59944 538466
13436 538466 -3369 418087 228917 181150 43930 587075 243211 307789 -75894 175385 53899
13424 147949 -150773 264099 -230 331444 486911 341452 225093 252476 229520 397716
13414 397716 177749 108120 27664 22897 513040 293357 354118 359523 192025 189965 -2867
13402 135936 110714 9603 118295 46375 98249 -3778 264288 121338 -176347 140370 155127
13391 155127 202671 151006 48876 155754 328048 315282 47601 111660 72485 109598 28987
13379 24297 65724 728344 6787 420851 265772 281185 202148 263327 93388 -107496 313503
13367 135775 298470 213703 140632 142218 147910 179246 374130 88865 115228 345956 47435
13355 69352 221301 216494 157432 52587 322725 154697 463334 284566 388705 226603
13345 226603 16972 253319 240978 374595 215845 51335 358970 259092 556436 584056
13335 584056 171963 44502 156199 179755 328996 116902 219937 297337 111639 248785
13325 248785 -5223 383744 129223 347009 388727 185157 281987 236297 -15405 67568 453938
13314 453938 212275 281351 86208 185252 118793 305788 58034 -229308 360961 156938
13303 320780 311707 497777 -129149 336903 -300444 111459 161877 2446 -153507 -139045 156332
13291 -31732 3510 -77555 -537 -61225 17958 122723 47896 223746 48562 87868 51008 53400
13279 53400 -209162 123959 124812 85272 290910 -107096 193688 -58936 257106 82571 106034
13268 106034 14180 252252 132752 18058 130354 -86069 462539 -125446 -22494 35396
13257 286949 226499 71028 62812 94950 209180 166767 153561 33966 250563 189003 -547 282454
13244 181061 52382 88680 137687 4219 -138628 -357256 -75511 183305 445416 -180669 16742
13232 -89477 -13224 86113 382836 -8771 87635 -66315 135910 125911 10724 185862 -62540
13220 -153578 -107541 322168 177450 59216 -159187 135236 239796 -60298 -129396 242870
13209 71339 296097 254846 -29989 185901 292661 300652 -43293 172770 107042 301191 231547
13198 231547 164402 304350 224016 69922 -25852 -149425 41358 -89089 -169363 133425 205773
13187 205773 -10647 70560 162723 272318 295758 -219560 -5590 215578 -53228 325007 19246
13175 -125070 16827 -64999 267007 -151330 102664 205435 93505 -1153 -175778 -207277 143068
13163 437975 188501 202420 -25693 115551 303306 -47664 33258 -157909 109382 118593 288529
13152 288529 -86509 128708 90045 222773 570071 -113728 32556 17981 100643 249888
13142 249888 19918 140662 65025 -201623 132756 305244 -3788 242236 -74255 199285
13131 53407 -7901 35926 234394 -90210 -40704 453178 -96837 128781 40521 -65111 -39183
13120 -39183 33430 96944 -150192 -19206 -105208 -73916 -264090 233735 -188944 199901 447327
13109 447327 152311 -35857 -155723 193751 -45023 -57340 -81033 276332 200048 276164 -121253
13097 169218 230624 430524 195347 269528 47173 97533 389227 194262 125166 1571 165798
13086 165798 -119621 506603 339370 -223884 -2984 45541 357997 107868 5698 269790
13076 269790 51237 201826 -262388 -22032 72621 -208814 -138540 -218193 235074 82680 142752
13065 142752 -68792 285858 -28868 -98557 86342 -11040 -60501 194046 209108 231795 244809
13054 244809 146645 124625 283091 102865 -98693 -191114 -208324 123132 -54699 288399 202985
13043 202985 99753 -12025 -78029 -61150 160548 283171 3224 151758 -69002 -11837 427358
13031 8444 -131806 -184601 76573 20066 37078 138865 73711 -233241 -238310 68812 -9999 -1616
13018 3432 505092 189344 156985 231996 138151 234753 38831 2079 227244 63626 240519
13007 240519 186775 74917 -30966 255174 -147155 99370 153912 69867 282966 170519 -371527
12995 407 230292 88711 -112701 -147954 17108 95962 163185 -10572 277944 92467 154852
12984 154852 217422 -261457 172425 -135393 107553 -49258 22383 11897 -191089 30811
12973 22663 212022 97357 -39835 -8199 168519 -38332 145390 81317 81765 -39745 176307
12961 57135 -56247 -80964 -216677 -214505 187555 134422 386 -287116 60525 -82491 -33177 -216719
12949 -216719 21994 196694 202011 40678 61001 -315821 215695 12105 272017 -87957 329308
12937 205987 -134035 53217 -83125 13687 -38052 231421 -94422 -194803 -167786 47921 25792
12926 25792 -42140 284533 -7907 240839 -93841 -154800 -72067 130839 -171142 12465 -5238
12914 426307 176083 68737 -35505 212798 -284229 292868 255565 129346 -68404 2164 238926
12903 238926 -9741 289060 70490 128180 23372 73854 -337786 -23485 35849 -117864 192268
12891 7008 205181 153244 5262 -201579 -60386 175732 -328135 -6259 -17253 -41825 17729
12879 160554 203091 164605 -218119 -85673 -340208 2990 174275 106389 184935 19428 -279171
12867 102414 -67635 60219 92662 41632 -80372 -301395 217939 411410 165172 267391
12857 267391 -115792 -214031 -185642 259886 -23221 -100127 -6548 -8578 117618 348950 48567
12845 -198879 187525 -55656 101266 240191 95709 -118353 87459 -34023 -148328 176624
12834 227342 -317279 -97224 225591 127774 4935 -240147 -38592 38564 225377 -27349 -134377
12823 -134377 185664 37697 -214254 -101075 -230047 157167 -160046 161608 -50840 -29844
12813 -29844 -12846 103533 93988 -65410 175682 110978 21432 -153553 -431285 -72835 82920
12801 -257376 -97660 -51390 72231 -86784 -81380 -65402 -86309 -55861 136865 -210365 67094
12789 6103 -179776 126111 83390 91545 -208360 -103837 43752 -8419 332744 33825 -333447
12777 95866 123739 81735 -154749 20750 -209312 -362759 108569 -207616 10681 -193504
12766 273178 333935 98152 108095 52893 -34672 -90026 -70855 -228063 -228873 252572 58514 12241
12753 178356 54758 173713 50321 39036 181620 236720 -65063 -69943 207059 -197550 -21270
12741 163094 -43148 -101876 -103850 382788 17903 -23695 -241139 126170 136812 -136474 163743
12729 260831 -160969 -56754 -22918 57391 55898 92604 106226 -171660 -89116 52618 -147808
12717 299882 13208 25918 -145432 18014 139250 278281 167081 -64490 225849 609581
12707 609581 218504 87755 11719 250286 310191 295918 -24769 178056 122311 50697 -259226
12695 104817 -306248 228553 418453 -5382 -267461 300368 -20379 173023 38749 -36598
12684 91744 -151205 -118771 -63336 459205 204475 -88811 -108908 -34387 371103 -194789 36771
12672 -59250 142163 75309 327492 -436568 191486 338884 46417 -55844 -207147 -34578
12661 16298 44191 52763 -217870 147600 127620 -459180 -34701 287590 43421 263739 -93265
12649 290904 -104055 270020 220407 11513 -104889 155096 -293047 49219 -66433 445178
12638 -170159 349761 -17884 119729 184282 290103 -197168 57736 447647 3003 622022
12628 622022 3646 150096 279732 180397 -221903 40680 35855 243729 126138 34737 -186595
12616 215558 -264147 73282 355394 106207 -15704 301432 47801 66779 75394 -490 94001
12604 244728 -166166 67698 348253 117919 128069 173461 177523 433657 -45464 -20633 245499
12592 382945 -196860 -224885 60500 -176892 -28831 -75656 -3829 310517 -175593 191026 271485
12581 271485 -232302 45053 115234 108969 -179141 76682 -151841 160644 -34424 226039 -58602
12569 9528 190562 203063 -262017 183843 22233 -146470 51422 417406 -143549 130951
12558 88167 20188 94695 93046 277734 -11515 56652 -87357 252275 112684 126948 78453
12547 78453 34843 -111949 -258082 47402 49610 -191161 -125125 199237 64830 -63931 -65385
12536 -65385 -188373 -81447 174211 120273 155555 124510 174068 105902 161744 7510 151105
12525 151105 184481 -204229 177376 9245 -67721 -38245 29491 92052 92361 -43175 -287969
12514 -287969 16749 -28231 -56410 -164813 116165 81155 255235 218885 -375050 -204326
12504 -204326 -113664 -127279 188108 189219 48875 -53487 90528 244640 -251508 44396 -117281
12492 -177861 -227113 42562 53978 177022 101064 199199 -187515 -439060 -249 -143112 -84232
12481 -84232 -154435 -28534 -164028 -121324 90228 238685 -274895 -83138 289973 172245 296653
12470 296653 182584 -123785 -12969 111051 -16423 159188 -55620 -108193 122901 247747
12460 247747 77567 330945 -70320 -86622 45301 74826 46454 6572 311661 172465 355073
12449 355073 -61219 -142817 175756 723 27726 -147425 106647 -35674 7892 142711 -196409
12437 -56247 74369 396757 98332 60622 28154 190664 13584 88695 -136013 -29230 183936
12425 343491 18843 -166605 -125749 -133349 -182723 15330 177593 -353544 325188 -360552 -46935
12413 -236122 46344 -27656 413693 -237359 -38509 -120226 -35395 20041 -36725 -124110 -386779
12402 -386779 276013 -5393 216450 -124997 -50847 -168879 84010 -151620 -101780 115207
12391 11442 265533 -194689 22790 366171 192005 51484 125754 -179324 32003 212134
12381 212134 118937 -423215 23633 -276067 -7786 -290848 -165748 174564 -161465 169229
12370 202064 -704 -85582 73789 -233797 230891 159598 -64656 153204 -298972 346432 -77154
12358 -155738 -128382 23493 110276 181974 470463 -299792 255909 -141578 -297169 39929
12347 14374 -20869 276898 25834 42372 -439979 381897 324099 -8003 158001 73881 113010
12336 113010 -41054 104183 -175609 -195015 -102068 46967 8543 112306 -88141 -273772 -179453
12325 -179453 -200044 86192 185533 -252518 226101 -105958 -107470 -210265 -102442 40809 289694
12314 289694 153701 -73336 137354 180782 135644 7853 28469 -258451 72795 406228 -373193
12302 37628 94433 141730 48011 29851 -143538 -35588 -112492 -132260 -162149 -37616 -71853
12291 -71853 302147 262467 -2034 -51860 -225164 39303 21476 317091 154904 243102 8557
12279 7923 124627 100304 54140 198496 268104 265410 185762 147510 69820 -363143 -155450
12267 -209221 75905 179173 40321 18462 -97875 -33652 -126313 -147676 -5989 108086 337926
12256 337926 376596 -573689 378472 255202 -330854 131856 346736 179320 -58537 45956
12245 173304 -519 -28665 339311 57603 212919 -212045 131490 195146 15016 -52608 202600
12233 165614 19053 -38449 299570 420233 24732 69143 -11337 0 426388 305793 363561
12222 363561 318553 -293715 80382 199320 273474 23912 55514 -1353 -203074 407043 24475
12210 55962 -49126 285836 118293 389193 -7865 491544 53993 50415 84212 -224484 117018
12198 123726 430534 370387 101430 -20351 476559 218522 165668 193571 140217 -45855 92863
12186 256165 -19051 82281 48328 87795 192558 65551 -97210 -126277 -107817 -238386 300919
12174 -21154 426628 228280 41984 66633 -116458 275380 235776 149623 -119243 110450
12163 126467 -114195 285125 385180 141602 35555 -119788 402297 -76178 -74533 10635
12152 -45064 -242391 -94578 96228 117751 306387 193165 55944 -79635 39697 46898 302209
12141 302209 -76825 489630 -14584 264933 105405 158528 -109812 193853 -185590 340992
12130 248222 96714 -155817 98504 -100873 47619 15024 84724 203036 -186344 -327593
12120 -327593 84277 206672 -125370 77290 -72529 153205 120288 98622 216570 52244 -82918
12108 117390 187723 289648 -110341 31052 20249 -220316 204635 -85599 214201 -32986
12097 147834 175177 271667 -27427 163083 -128582 -10350 193215 224363 74073 60415 -349686
12085 69807 227296 46498 -101947 -168731 -136285 23035 32858 -50739 228926 277364 1025340
12074 1025340 1275891 848697 71958 29641 116682 26843 116915 29817 283719 -187193
12063 315196 184229 321220 -148041 23705 -19091 -396114 30 -77934 -272437 -215705 44053
12051 108528 -265121 -110243 115362 -157855 -192574 -119182 68223 -117251 216180 122797
12041 122797 -170805 -76264 117623 64224 -146028 30792 -364162 -164717 153748 -125974
12030 250251 -76840 -156561 100769 -137163 355810 -103131 63249 5290 -137806 -148986 -162132
12019 -162132 -139110 -13124 70406 157165 158569 -115635 -197530 189925 -108175 119254 -156025
12007 340681 -282593 -206618 33566 10523 -69529 34190 -98819 92874 -37733 116030 140763
11996 140763 -331887 -81575 203999 24071 -134344 18370 193075 79446 -85068 -72012 -258274
11985 -258274 -135132 -135663 -65864 -11851 97505 137483 17031 118860 -30175 -127450 -28719
11973 13238 29801 160474 -414116 -194101 -63686 36266 -314501 -92385 243965 -414560
11962 -27690 -26229 -77772 -318186 -174683 -117680 97967 5612 196079 -138256 -221538 -45664
11950 -41922 28439 -44757 -122260 78292 226864 -230558 -191108 -33000 128687 -12772 -64329
11939 -64329 23484 -33318 -53381 -26164 -13550 124945 170573 220603 -337376 149425 155799
11928 155799 -33101 -32486 61946 74291 -53841 -6114 -163665 331436 104843 -140916 205137
11916 -128590 -125177 -13033 -258586 -176302 169520 156299 52141 270155 -78391 -177138 201336
11904 19428 -167488 -74594 24868 401571 74395 175865 -253492 344748 -261907 -143320
11894 -143320 42209 -27872 64737 200312 110381 -212924 -271316 338486 -219044 -12274 -156771
11883 -156771 -5211 57087 -58020 -10195 -152234 -66005 -101549 340468 -67373 41460 220975
11872 220975 -12855 101347 -22421 -63429 -260281 -160364 169029 16839 28714 56025 387207
11861 387207 -42908 95648 -110258 29748 -80164 73084 8812 -175447 -51428 -193668 -114421
11850 -114421 -113115 98615 160326 47522 237341 -106675 -25981 -334147 93322 -30458 156007
11838 -327298 303228 -150767 -84944 54363 47532 -22130 -62657 80249 129254 -362813 -38595
11826 44815 30513 204116 -88167 -160047 -64894 -22423 -169960 98622 -118015 60626 -57980
11814 9821 48361 175739 168626 16565 71994 -318632 73448 201097 -45948 -26810 153617
11802 8300 162377 -43988 408899 -304321 -12698 78113 203727 41592 -201708 -220432 164106
11790 -36275 -67041 -194048 -62437 -421826 40539 -80559 -204933 -338678 -142402 124140
11779 -155359 -157923 177162 11810 -127615 -30417 -189086 -241607 -181896 26043 26892 -373955
11767 60448 -155666 70083 213259 127554 -219715 16529 -289963 -183896 -511779 10503
11756 -123321 -146776 -293253 25544 43797 -69998 29576 -145852 -123720 -39863 2088 128569
11745 128569 -216397 -383744 286176 -40126 -501836 369143 285769 -110284 224858 257486
11735 257486 42270 -86882 -194397 195893 101035 272531 427599 77664 183878 27101
11724 83387 -134569 198175 43734 -13780 27212 -34470 14278 97582 -161865 -42094 104193
11712 -44410 -132557 118333 237096 206008 472693 264667 56283 -209623 -260669 -1472 -77544
11701 -77544 62344 -52668 -242974 230886 166814 -15428 101348 394786 -255778 -132012
11691 -132012 -74986 63246 307148 182392 -92363 -114955 401837 211029 102433 -178713
11680 74128 39661 24779 424515 157563 -397242 261606 53727 -155282 218542 -51941
11669 -261782 132924 85519 145570 -359025 -245462 91057 332553 74279 -234827 -82663
11658 -384822 292775 -114964 28077 66773 27951 -26106 -55875 -153737 20782 311351 -127054
11646 210508 -96647 -323 242033 116740 -116047 23307 -190371 42319 -181270 57909 247009
11635 247009 85093 -130207 15823 253501 77662 -186497 -188234 -284510 294114 44229 -15809
11623 -128946 -249366 -101919 -369554 54980 143784 -25755 71359 -109690 -202856 11802 -189012
11611 110861 -223189 396596 371126 -119317 74161 3525 -180982 39305 -686 21899 200397
11600 200397 -343066 221911 438240 284473 104334 -106733 97997 17240 -106529 -165988
11590 -165988 68437 1102 -192514 52112 317546 -362006 21346 273668 225776 154416 319884
11579 319884 102631 -73929 -47964 -53391 12546 271363 -99607 -11943 136215 196759 -281509
11567 322361 -113859 102235 302806 9219 332440 84347 194746 -177363 -176374 237088 41370
11555 -111845 138915 15467 -83606 -2661 -250265 -402245 120230 -9088 274112 -377562 189917
11543 227278 11047 87725 238731 -93019 51883 -408 367049 -32546 436320 -35025 -287728
11532 -287728 204062 65401 1103 91851 -262714 264474 -176549 -5463 37901 262278 -38338
11520 -146468 294464 155878 338861 388718 -143646 -144352 448441 309842 169940 196726
11510 196726 301585 219145 238219 -47395 213366 -183269 479523 -190570 206041 -61995
11499 44547 -44119 113953 67760 620972 -287581 269242 -117041 156888 167427 -129568
11488 228227 179352 -192555 41520 35736 170491 -24127 -53230 -74758 43653 -60886 448596
11476 309936 -115775 -256531 20915 171355 53986 113016 230993 -279930 -381799 -84106
11465 -17931 262046 -232618 192493 -42546 394542 196249 266672 409451 -121995 92193
11454 68683 -143970 -62359 15432 -466211 13549 321895 -108896 210755 230813 320709 257888
11443 257888 219459 25708 76603 -180474 -306090 -75569 250281 120536 37727 53551 -83724
11431 1383 142755 -127496 -45642 -164162 425016 329459 26805 -211443 -76866 -75199 189133
11419 19120 -125979 -236555 122690 -317354 202277 -9586 -382874 -119115 -271429 413745
11408 -20165 196993 -16388 240629 20778 -255325 77635 -236221 279005 -198718 -262953
11398 -262953 442709 -43882 -19823 -225381 130877 -196399 -38909 353682 53149 -25630
11387 -32174 -198789 -347027 8586 -235324 -54168 -338571 -166389 -87657 191247 164299 -2964
11375 236333 125541 -253296 -184522 175029 -28553 -200680 -47214 -308121 -222132 187574
11364 201708 165555 97100 211326 -85121 92778 407967 -450163 -94483 349371 204509
11354 204509 -378093 -136621 -28880 9073 213655 -103543 -179004 93732 229559 352668
11344 352668 -361261 182938 -29799 47270 -149419 -83977 -179829 -197925 17841 -231230 -34136
11332 80468 170675 -106992 48374 71838 -142478 -109834 90092 -72941 161609 -97311 -234288
11321 -234288 29109 112131 18878 -131193 -94145 -131268 -164267 54789 -182313 276904 -105987
11309 -94443 -87906 210504 -237021 108522 -74519 126792 -79835 -56919 105044 -49620 -200548
11298 -200548 39601 43219 -290601 -227629 157413 18026 -171014 37510 -128325 -154897 306200
11286 -90198 182005 233292 20524 77393 96191 -256007 59394 31864 -72463 -321033 231657
11274 -204163 -509056 -290926 -59178 62011 -119778 59052 -194602 53505 -39289 10369 -99971
11262 -378507 -227120 -44673 -136822 -67245 -327295 276996 120473 278828 169524 -436728
11251 -108377 -151714 -114496 113642 -134283 59181 -72906 44784 -148841 98028 231 76373
11240 76373 -287583 128312 -185581 202163 -179872 -90644 -133182 -309959 334747 -150712
11229 84071 -79383 -139558 246665 229332 -165537 275111 -189887 -51499 -346969 61709 402424
11218 402424 -244654 -71810 296503 -211204 102507 133341 -22364 -142788 124845 -173064
11207 -9570 162985 -59707 -227072 148274 110700 -164974 12821 -94041 -145123 162489 38606
11195 -303281 -112609 35448 -188570 -39650 37957 -135157 120423 -453027 -262556 -83328
11184 65818 -115979 -254196 65326 243518 -72120 203317 97310 162389 -188931 -20721 -168223
11173 -168223 -237415 229546 -99430 -8798 -267271 -63608 260267 36806 420850 -121682 -7613
11161 -104614 134944 68605 -182626 -214802 100568 -217922 -355536 -135318 357217 28883
11150 32436 427001 -59433 -5112 -124495 -177889 -62313 167794 -13873 344186 -131487 -123469
11139 -123469 111952 -122971 -403492 -89688 303246 -133343 -267752 44813 -22995 -53501
11129 -53501 148568 -85618 451206 202223 63315 23684 152771 -238261 -47935 -18775 167579
11117 81380 -53915 119784 -34780 -30697 251324 -80948 -97845 71471 -51020 260271 -111469
11105 377031 311067 32389 5603 43756 190188 26028 1898 -1951 35600 174185 -179383
11093 52047 85002 140084 -123027 357443 55429 182452 399909 -46366 176347 100823 291618
11082 291618 437876 393411 279723 368166 60058 -32095 28314 535607 108489 476167
11072 476167 278249 329651 270506 18012 408106 377985 75724 134739 347974 349432 351058
11061 351058 268599 591246 331348 421633 570674 824175 748000 580993 770236 337222
11050 570433 506779 427189 340987 895107 469879 934834 539518 514198 685479 243460
11039 704563 661335 487864 467729 321115 381314 384464 414508 395361 640302 475333 340015
11028 340015 544268 424776 559091 442753 560897 304621 427737 332860 559312 709124
11018 709124 213982 581978 691605 665346 -64232 113665 327671 323054 531882 634629
11008 634629 146835 357777 618061 602959 528400 409979 1037008 313584 801267 842139
10998 842139 284771 712352 517579 645683 340370 386912 724503 536257 610013 453452
10988 453452 972689 295568 596552 774855 966301 666806 1105650 840363 1063545 974297
10978 974297 1132432 1610232 1858208 1822805 2110238 2080501 2277438 2463324 2549556 2201061
10968 2201061 1711853 2025187 2000956 1319319 1597961 1289834 1298886 1322757 1325343 1397079 1432932
10957 1432932 1503446 1567398 1204967 1012185 1129990 856538 705968 528334 506873 422520
10947 422520 409958 508051 407356 192604 355259 258809 268067 400523 104954 228114
10937 228114 172418 159196 101992 -31728 126016 120676 336536 -72065 140294 -159501 67097
10925 -213240 -151671 226672 139403 -33730 47898 -146313 134377 -58192 60051 -21706 302540
10913 240506 120327 -187762 6240 109585 245248 -103649 -200212 133508 -30485 -15692
10903 -15692 -111422 -100578 287519 -228030 188309 -239017 -435953 141337 -254096 10343
10892 205102 -312166 24779 119244 -195845 -130171 139423 -11572 82457 -26962 81410 126285
10881 126285 172124 97699 -190221 -73357 -178695 101287 -178718 -1403 6561 -71935 261365
10869 -129220 -332522 15726 77123 98354 2309 102309 -84532 269176 93449 -294593 356815
10857 -124907 -22659 12302 169911 123468 -23918 -16183 -223114 175642 -43698 -389256 3988
10845 -344796 -215772 66542 216139 -116766 -302585 -117199 162324 -56264 6792 147171
10835 147171 -157382 293254 -184510 228435 65500 200177 19356 -45903 281730 -165221
10824 256859 -85717 -10790 -26529 38380 138732 168127 126812 1665 26479 -261795 -187946
10813 -187946 -128207 -157121 187844 138857 39265 35693 -29502 68845 -161812 -34843 -302370
10802 -302370 -141542 131728 56134 -152199 78550 -73918 142331 150431 67594 -253610 -38766
10790 -77324 -111225 -24815 122314 7358 333987 50778 85491 127548 -265695 -23771 -107173
10779 -107173 -335926 47547 -25 152045 40431 -304666 -166017 -124960 23456 274486 -209743
10767 24130 -60627 -86377 19913 -130065 62449 -265126 -96721 20319 -376181 151272 164360
10756 164360 17520 -175549 206029 -4759 84408 67221 13987 86002 90280 -259714 -198204
10745 -198204 173258 99960 -116670 -97520 -1516 -260821 38341 142909 -109633 -159555 20193
10733 291968 -8889 32584 -346384 57601 -14064 16341 -61205 -54773 -152901 -485960 -163247
10721 22082 223103 111390 -187834 99348 35794 -111093 -6636 -166253 -159369 -120900 -274275
10710 -274275 60540 -13228 -123541 -113452 -212929 204720 265128 113374 -86053 -116649 222460
10698 229436 31981 -179920 -492125 134792 -235172 16689 -36593 -29628 -359580 114610
10687 84821 -180948 327800 -282423 -90112 -96406 -272018 -339846 -271900 165741 -77899 -254970
10676 -254970 182083 -69391 -217552 -109215 -43259 71957 99620 27101 22123 -63485 56118
10664 125983 60008 84735 -241906 -36437 89168 229105 -295652 -16381 -162206 -28124 309853
10652 -6849 96630 -9763 -92255 114263 -139258 353170 -59165 85931 99286 18371 -19637
10640 -190958 -100972 -238983 202495 -140673 -136140 37020 19327 -7117 -56576 287602 -264855
10628 -4792 -92881 111441 260617 -138370 -116896 277657 -90046 -148103 25878 -92714 -32905
10616 -61793 -209167 -23368 -218005 -101523 -182670 -56850 -186241 -17423 -256917 -83479 -5618
10604 -97790 142902 55717 -11363 -247802 166715 -2063 207681 -34358 384405 28086 245581
10593 245581 407551 -91235 -11215 110681 81036 7226 -163423 -42451 -133691 -30299 216410
10581 -120484 106664 -353186 -123419 -388857 -94070 -38260 48193 -205197 36900 2935 -49614
10569 -22574 -228185 -114624 203845 -278420 -77802 -132285 170586 -206826 -238323 -517182
10559 -517182 -132151 68845 -198355 -210239 84088 155366 -225909 -133217 -20641 43855 56072
10548 56072 -66322 -170263 177219 -149110 268923 -457628 -23160 -155536 -123465 68361
10537 38118 102878 17673 280682 -388065 -135455 117117 -105304 80227 42500 -110810
10526 -314683 128134 -384665 73437 -30742 -74919 115386 -206322 178377 -89556 -135762
10516 -135762 -190536 217990 156028 -27303 59583 -106979 -212734 327041 -32811 50952 -69044
10504 23841 -223702 -42449 105998 246981 77503 -157701 213285 -217993 -30125 -234204
10494 -234204 -188951 193884 -261508 41031 170731 92448 -209890 -137654 -271147 -249167
10484 -249167 -73346 491703 187792 379515 306261 384315 14752 330623 45052 -128343
10473 -108796 93673 278227 53185 -202656 37126 193181 -7986 98440 1120 66126 -263019
10461 -171631 -67491 44093 144528 17157 -199124 -5262 -184993 -91865 -171767 -126864 -33111
10449 -210405 18488 149035 114165 126307 -194142 -393240 20405 305365 -538482 58686
10438 146063 -109738 -174287 264461 20676 22832 -289326 -86650 -182016 -204639 -107442 158601
10426 -635646 383200 -143988 -196097 -31942 14281 147625 250643 -239652 -89488 -321776
10416 -321776 54052 -105432 23151 -166667 61123 -225913 -48737 148681 -92332 74017 76638
10405 76638 -208617 -115164 391750 -13329 -63329 -76835 -325416 -61654 238667 105613 41577
10393 66937 264027 17165 449067 335706 -216477 204842 82118 141339 246871 -145872
10382 132906 -243641 160492 94979 96521 97686 -32800 247838 140984 -3197 228221 -78643
10370 218661 406478 274032 624443 425535 332673 390958 537288 306401 -10231 -81531
10360 -81531 313610 425050 217357 256509 148434 -33250 428815 330073 300908 17103 235950
10349 235950 228839 505043 177246 372896 417262 -12370 346279 218719 93159 3185 280381
10338 280381 132307 283012 -27647 294980 -22422 -76373 342570 253673 67979 -59443 154541
10326 18532 241639 124726 -23182 147540 228893 319961 73730 234549 161669 -360587 -47825
10314 -323171 -6088 -280520 380 62343 272150 -138605 -31860 129990 -86515 175015 -4091
10302 97190 -36576 28373 -292422 -158743 -320184 99315 177599 78012 -349770 -121473 -104187
10291 -104187 73373 -323905 -93294 -12932 -281909 -267049 -38471 7731 -40434 227623 -154007
10279 -97154 165228 -42312 -24478 74358 -6780 16333 190518 90790 58800 33992 69546
10268 69546 -163790 36032 -182768 8767 10275 292841 179962 590416 416073 472917 16295
10256 286688 263008 217979 280074 -259949 97810 -112111 -284505 275328 75857 -92029 -308698
10245 -308698 -188022 95273 -212532 156456 -155547 -67107 -157719 -59502 190507 -31635
10234 -25481 -65922 -311639 224887 208314 -174621 45999 -51636 -245186 -264593 -191646 -104811
10223 -104811 167346 -12613 289559 -111823 -48497 165659 -184270 171017 309721 25804
10212 160823 -70933 -243938 376132 231063 -96042 78652 15547 -205579 -8299 -452479 -159563
10200 -102220 -47175 -35901 -200945 100268 -153287 212301 90546 -193175 15857 36480
10190 36480 74799 462735 -154567 -8352 -204909 125983 146763 139302 -432333 191110 -190853
10178 -129370 -416294 -31483 -22646 -252484 -214454 47654 -104772 -55075 -504114 85735 -61043
10166 85382 260628 -130221 -277451 445385 89099 -213856 -374597 115851 -127226 440969
10155 -262807 -27848 261946 -81013 97529 -55835 257465 -114965 -174855 215864 -120153
10144 48197 43796 -178238 134813 -294681 -65423 -322533 -444256 -157361 -15679 -53704 179711
10132 102504 -421864 188203 162214 393392 -150151 -146026 163770 -37141 -96356 73660 -133473
10120 306445 32756 -329429 -170035 -96631 -92900 -73821 -239296 30643 193667 208883 -312021
10108 -212291 -322687 -5890 152284 -57439 87414 -216441 55273 3004 -165627 -65297 23179
10096 20303 -64982 -145847 -82692 -178890 -107909 -106064 -108268 35893 -147300 -123719 92776 -247434
10083 279307 203260 -413677 93627 -128952 45392 -265008 -146733 -340391 -96315 -88733 214095
10071 -180974 -208661 -100042 -7800 105675 -65587 37234 -399752 136767 40298 -40243 -9407
10059 -32496 -61533 182114 -155788 704 240740 -29578 -146909 -117041 -236912 -199322 -140288
10048 -140288 -102797 6658 -127285 -27505 231201 -104939 17645 -273600 174090 91557 203891
10037 203891 -102005 -45598 -167787 -237194 16494 -414271 -256256 -56781 -158724 119091
10026 19263 -128514 35372 -272049 -229804 -109763 -180105 -72159 -115172 -197946 -84630 -320488
10015 -320488 -20499 -27187 77902 2344 425902 29536 87347 52922 -105794 -98062 -31010 32607
10002 28904 -56654 61088 -217802 -195494 -346054 -266 -182792 -333933 -2558 -137627 -201283
9991 -201283 -309285 46103 431527 130678 -79863 49197 -226206 -162618 -208617 -146654 22412
9979 -255121 -246432 -270800 -52643 -220899 -162588 37023 -191675 -5894 -51390 -14665 -3615 37775
9966 -187538 -97950 -287321 -178496 35101 8281 -183946 289531 -425454 99475 284193 -292610
9954 -389575 -247843 558786 -49748 -22474 27305 -68605 138422 -131586 -77151 -80920 -305187
9943 -305187 357012 7564 -26985 285054 -359403 278336 -259653 248630 -203275 -469754
9933 -469754 -110632 -307520 -15872 -129077 -89459 -157909 132401 -220993 -121656 -178454 -135265
9922 -135265 66633 134541 93 -379405 -84408 -281636 -134588 -57405 -17161 -99054 70957 -61760
9909 -71119 -67532 -187505 191455 -6559 -16230 -344902 -43457 -128104 -146772 -142247 -83482 162447
9896 16339 -106877 -18471 -73225 -185220 -30225 -89299 -438209 -165613 211651 257861 -100958
9884 80160 284182 220277 -211950 -188728 -126850 -417509 -34897 -73581 -233095 101342 25650
9872 -473508 -145424 95216 -254690 189393 -39638 -110541 183972 45803 -184222 132834
9861 24446 187652 69116 -187153 147184 -201557 -108628 -100227 327463 75985 -83019 -43157
9850 -43157 6602 -53195 243262 -108151 -76532 -13098 64198 194451 173801 76067 -103660
9838 131407 -186016 19192 -442 -77 -18292 -160608 -31137 -117778 -114993 -276554 -48575 127841
9825 -56776 135938 174991 38227 -143017 105567 -39322 239229 125478 -92665 94274 92398
9814 92398 7417 -258771 -81388 -133117 -80370 -453341 -14033 177521 -83970 -59378 -189288
9803 -189288 101188 -209612 74247 11144 -188284 -191954 -76406 290529 -144485 -385543 135224
9791 -92042 22090 35003 -124911 468853 -227106 -91045 -25955 -366085 -384879 -273413 -14538
9779 113066 112329 -263791 -104074 -45790 334815 33859 2502 -146501 44507 -18916 -265789
9768 -265789 -46270 -100852 -190909 -92234 -303121 -200679 -191811 -14954 -46810 80289 -182160
9756 -72715 -190602 64670 -155682 57858 -24553 160549 -213031 -332451 71252 -217728 -63546
9744 -368375 -285798 -499114 135465 -191528 12499 54452 -204401 -509647 150237 -141781
9733 -7559 -53116 -178004 17900 -53933 130121 101849 -42426 -175429 -71235 46935 -214213
9721 -108139 -251187 73572 -243814 -225568 -45919 70975 -339382 -183126 5248 1662 -68307
9709 175372 -213957 -182237 -164396 22072 -204222 -199904 188162 -603839 -109863 -209916 -57308
9697 121505 -179762 194852 266109 141865 176200 -230841 -24816 -36214 -109598 127270 -409549
9685 -116602 -16325 -213567 -268066 -118951 -175136 108122 32007 -273701 33785 -145715 -73104
9674 -73104 -349991 -342115 -274470 33402 -128253 -156866 133313 -196022 159637 -60666 -167
9662 220157 -120317 97822 -121260 15076 119661 -262455 -17761 -56799 -391332 58404 -64664
9650 -190775 -42599 258945 -10030 -143913 111170 25612 -183685 -97261 -190258 -167390 -64822
9638 40677 -219781 -12478 -195220 49235 195257 188417 -228096 159715 -239170 -254650 16382
9626 98995 57668 87067 -258824 71615 -6896 -119941 -70933 80919 55374 122046 79351 -399182
9613 -33887 28172 -136325 293989 -316902 79104 -177583 236320 60848 -242111 -29136 -324300
9602 -324300 -101880 98559 -140361 -99984 -201990 -84636 78931 381076 -63106 -72254 80866
9590 -199150 33870 -247141 -247089 -202012 -181674 -179628 -152200 -71174 -78096 29088 -299998 -167190
9578 -167190 40490 -189074 -294214 188150 135317 26808 -103331 -193 -228792 -32804 -273346
9567 -273346 279852 -134844 5742 -382225 175905 -408127 -86310 73325 104586 -24964 15837
9555 2051 139310 -47553 189599 -35463 -50049 -232297 -145683 42317 -89133 -78077 38646
9543 5894 -179710 227043 89982 -76321 111991 -399893 44298 174649 -89054 -326631 -321473
9532 -321473 217981 -16184 105894 -140401 -78657 -104293 -295493 159580 122283 8249 -284656
9520 -332304 -57419 253107 -208696 -467693 -59404 -101601 -451274 -331090 108408 105077 20117
9508 -392074 186425 58843 19487 -209206 22072 -76890 63760 52634 -43843 -4842 -199909
9497 -199909 -100403 -748 441525 3008 -124388 -99421 -148003 -101990 -240728 241212 -128496
9485 -171542 3491 73832 11017 -4728 -139515 231719 -70963 4192 223048 9150 78880 -119730
9472 -229171 -209561 262011 -69817 -201129 5553 -51635 131642 -308175 -140785 392809 -338972
9460 -316662 -102922 -485553 188858 155780 -146111 -62506 -31352 149310 312989 -50364
9449 -27855 -164800 -65195 174837 340788 64946 -149493 -327689 215137 -22249 222396
9438 239336 84056 -394611 190746 49558 23426 55649 -146214 -277024 -166558 -335279
9428 -335279 557122 89460 -16565 -275189 -117337 -150544 128383 -26994 133853 149212 -171678
9416 -250359 -101938 -25100 -83371 -49766 -23739 -57204 -22093 13319 -222171 86081 78134
9405 78134 -98234 56825 73435 -41911 -371527 147876 -319663 -197043 -122097 -173802 -186188
9394 -186188 18938 -56724 20004 90455 57015 -127080 -173194 -155514 -138944 238527 -31702
9382 -167850 -189478 -86443 -110985 -177967 -260504 91490 106048 39668 -73447 177785 -4082 151973
9369 -162841 -152451 -162562 -230547 -511815 79904 -114925 -259433 -63135 -16385 -57826 -308880
9358 -308880 -168389 127922 186931 -25580 -9002 -490896 -476607 -263470 -206410 -113659 -39262
9346 264528 259324 282216 -358213 -29233 139757 -5215 -106728 -80392 -103167 -101916 -39880 -197107
9334 -197107 -154126 13037 -249890 -83503 -7856 -48743 -311528 -379474 32855 -238082 -367156
9323 -367156 44160 237789 -400915 -181438 399388 -171875 -106213 84790 -110261 137633
9312 120547 -7228 -57501 -138917 99236 -442890 104937 -46080 -273429 2173 -147802 -307837
9301 -307837 104251 18286 -90177 -99096 -146670 -69468 348456 238423 -148984 -252050 -124432
9289 -64662 40158 -44558 232227 64224 -173024 -118879 88871 -74927 -91123 -511 95418 -170398
9276 -163775 -72333 260781 -173405 -102960 -251154 69060 -110592 24962 -224957 113937
9265 -61036 -118363 189094 -280692 -319539 375 -75710 -29264 -203758 2042 36203 -10410 -207135
9253 -207135 -73719 -435486 164496 46878 31222 -136420 -145145 -59806 57494 -6794 -231843
9242 -231843 -50282 142264 -375954 -384380 -306055 -24550 175617 128192 -242023 -281818 -58465
9230 -228802 -63813 -25246 -149477 109497 36802 -2711 -54710 -95846 -258857 -58956 175716
9218 -65628 63439 -391191 -46938 -58319 -262041 215280 -109080 -44147 -21710 64891 -256731
9206 -127573 39546 -279613 -37498 -319814 -280698 -227124 -132686 -53863 -191520 202013 37489
9194 -98043 -39762 81523 -66422 176030 194450 -55035 -131059 -116862 -137403 233417 351730
9183 351730 -225544 -226683 250313 -88534 64752 228224 446806 86068 293434 -263009 86654
9171 -80936 -62801 -34045 80619 -312697 -144047 -32 -12906 250233 33629 -4614 12629 98699
9159 98699 -81902 -127606 202942 76851 351367 -308927 91902 -14621 -33552 210916 -18204
9147 -119038 -376915 -156710 240020 -209637 117383 53144 -88459 204017 -34625 -79801
9137 -79801 82388 -165905 116860 -173724 -4913 57525 28515 168648 29734 421645 53418
9125 16227 -102536 -81567 11667 -118669 -133455 -119901 114431 -45524 15057 -21922 33287
9113 -225104 -123891 280257 -377738 33635 -89788 169165 135847 67713 -118668 122986
9102 -147133 168986 25197 -113715 -322272 47752 27383 -245462 -240225 -176209 16227 -22732
9090 -125158 169124 -306389 42852 -484221 228206 -95820 -156512 -365367 72949 25378 -105062
9078 -37937 -182378 140909 -76905 56333 -370445 -253292 230504 -738 36970 -149764 -226966
9067 -226966 -108320 -386641 -131032 259 -91678 -253825 -11786 -21728 -297882 -3011 -219255
9056 -219255 -267266 -51695 -48189 -138307 3850 -369658 -148 -63648 -312791 113784 152433 171548
9044 171548 145426 -10629 -160283 7494 -158373 -135145 22249 -482022 25112 18178 -193661
9032 84665 -70531 -464093 -60234 113472 -31076 160191 -377018 -35781 -23881 -32480 -240540
9021 -240540 -15379 -1206 -131292 -248742 -237156 278270 61432 -35352 -96136 -66807 -112639
9010 -112639 -172395 103217 -60639 104654 119190 12170 -178496 422766 161147 28561 -207583
8998 -245249 49781 -12021 -89294 188290 -429376 -73528 -348136 -27416 -81530 167408 -137088
8986 69845 -14744 -15166 -124349 86349 85320 -14792 -225688 -242606 -159510 -221677 -179998 75223
8973 -94587 108135 185546 -255195 50166 -191463 186576 -195412 -183582 110754 -123628
8962 -140361 -64099 4550 -89566 262367 181543 -275911 -106954 -178966 -10152 40713 -38788
8950 -217201 -380494 -98671 62003 -96406 -19092 -28309 76803 233629 119487 -17543 -284481
8939 -284481 -391099 -38669 31494 351513 -188545 -228598 -45140 86071 -6596 40413 247789
8928 247789 -42940 262792 820465 1235962 1576183 5419393 11925198 11317778 2114216
8918 389455 266581 318363 322550 73864 -392962 -73023 -125755 42903 96191 149612 144197 184951
8906 184951 -151042 -27160 -18582 -59900 344112 104750 43723 -258166 30404 172604 226124
8895 226124 -158753 110914 118520 -198844 -51521 122959 -37358 28463 -28679 -175734 -59043
8883 174399 -9176 -61960 -63970 138617 -183839 -195123 -31101 -114220 -7814 -73072 -182611 -97778
8871 -97778 -18044 134589 -100815 46777 -27599 -247173 14400 -131350 -103449 -173693 -82244
8859 -189245 -36042 -176697 -9348 -109585 119262 178943 10985 22690 201473 94632 135730
8848 135730 119858 -181119 -155521 192200 -212071 -11811 287977 -193454 147045 -155466
8837 -35472 120886 45351 -267092 -116617 235341 -85186 -311695 29738 -488488 -126952
8826 -16651 -39500 159285 88543 173990 -179883 8524 -290495 -346860 -76334 19748 226333
8815 226333 128751 -25145 -157416 126927 -143928 97333 -20199 -101101 54309 79605 -181456
8803 247831 120495 42478 547720 -107812 -25223 -292879 74424 4734 -303755 -303632 206742
8791 10299 -56633 102360 215985 -37930 -130079 3884 -150733 -1553 -263808 213027 61995
8779 -129475 -235364 -106682 -129842 -12246 -67050 215113 -314373 -120977 -181431 93563 220643
8768 220643 -85226 -155774 198351 118477 -117050 118881 101584 -113576 -148574 90702 76265
8757 76265 -174952 -138451 56958 119391 -71825 -75612 -252836 -41163 -274478 32946 222237
8746 222237 -167153 -69379 -2273 226058 69665 -37785 74012 15565 -226696 -367210 24968
8734 80501 -151075 105833 -84970 -178061 -86103 74620 85005 -85961 -188590 -230198 178319
8722 -330648 74191 -207359 -375052 -252576 -296072 101290 268245 -425867 60486 117390
8712 117390 -66708 74270 289146 -68549 -80933 -81554 -99073 38568 -343149 331140 -30345
8700 -120885 -198041 18721 35849 -55609 -474832 269081 -44273 87670 -86035 -163359 -28711
8688 -107957 -170075 124973 339773 -33525 20315 -70379 196184 39872 21398 57884 -110562
8676 3619 25619 -592134 51301 61218 -176682 -218112 -590 -75191 119207 8058 -11822 -106044
8664 -106044 -78328 135336 -382328 -296362 -178670 -34013 102305 160456 -193576 -373127
8654 -373127 -17138 -226226 -186423 -59839 -239507 -174940 123882 162498 -40545 63461 -38129
8642 -125258 -150030 -19318 -109854 -238889 103672 -95579 -120419 253564 -193569 -316413 -366202
8631 -366202 122212 -221896 -144869 33258 -6208 34372 126065 66200 -551916 -119866 -2840
8619 -87412 8293 -327159 -305472 -212650 -222525 -40190 590368 -133553 93890 73095 4455 2352
8607 2352 -83689 161740 220346 -425566 -70562 59179 140497 239167 -6764 231941 -161842
8595 117520 -135735 -189007 -217156 273418 364015 39659 -198404 -451653 -123825 -31813 -119421
8584 -119421 105568 -75752 -99803 89043 -77484 -153078 -422285 -214137 -365218 267851 222974
8573 222974 -122815 303179 -1590 133880 78543 59700 -322252 -137869 -304520 -190117
8563 -190117 -94407 86428 -293598 117768 364650 -210234 -53664 -245539 -143099 -331240
8553 -331240 -83323 41783 -53726 -29086 -195055 -18258 -60844 -247628 -173901 -355518 -194863
8542 -194863 119901 -130703 454481 -154041 147090 -29235 83140 99803 55350 -167234
8531 -49828 106739 -32831 103101 -107731 -112731 130038 151102 265125 386322 -75061 25259
8519 12385 55193 -311211 134760 -133468 -154002 38028 5329 269941 -94692 39155 -373674
8507 91497 -91792 43329 -71580 196472 266763 -164913 -33178 -7266 -83439 -155157 318506
8495 -201842 318613 14382 -246846 -40538 -279396 240173 119856 131492 -55663 -118857 98201
8483 -43385 217886 49695 4012 -351294 359697 222776 55570 -21134 -393998 196678 57701
8471 6976 -111096 -262119 35572 -145875 -230596 -187898 -156209 78183 -135340 -330764 66080
8459 11582 -184890 588 -87034 178142 -69306 396462 359036 -25013 113463 137307 -96872
8447 102148 -235152 9483 -68354 -490149 -301192 59868 -83985 55736 -203437 -9858 244459
8435 55256 -63968 -225433 -161950 44166 -186267 -36702 170739 -235195 222481 52960 -196829
8423 -57226 92105 190199 -25634 -426227 202544 21076 85603 -285878 -211480 -15957 -81434
8412 -81434 42696 67648 -46525 -7247 21401 13624 -89361 -207816 -77214 -230478 142222 -11368
8399 -23393 200004 -201607 44790 -175753 -237819 -99277 -58676 -299071 -190768 254922 94151
8387 143053 -184836 -99448 -190740 93438 -48182 -227244 253461 -259981 -108900 -119354 156527
8375 -244580 -118936 -282133 216972 -262978 49080 -274100 100880 -422201 -53790 215261
8364 280206 -204581 -122033 -25964 -448836 -294337 173000 91244 1271 279023 -32279 18050
8352 -155904 -7593 71890 -203604 -77158 64225 127144 225434 -309245 -59977 252138 -316773
8340 274041 -66190 22508 203623 -96797 -256382 -90984 -196798 11885 -227359 96835 -209668
8328 -321583 49230 -457175 41422 164741 68997 -44817 -77825 47212 -184104 -293565 -191005
8317 -191005 187908 103496 -109782 -114472 -166356 111414 -223981 15851 157187 -150145 106562
8305 -136927 -248574 -131118 -258503 -138766 -123863 1244 -302346 257194 8680 -216823 -33891
8293 -83949 15865 -343825 -227698 31938 -115494 355790 129894 403581 245431 -92411
8282 238092 141770 46696 65485 178994 78571 255664 -29811 -233723 187272 -550588 -181240
8270 -104741 259944 201067 -208809 -159542 95754 -8147 -75946 -46273 -311827 296773 -37039
8258 -354472 -181428 -230707 -262005 -16030 30863 75224 52337 51893 -43202 -314574 -894 -112959
8246 -112959 -145219 59731 -294940 -20008 241180 -88177 97856 -152266 -63187 24230 -100943
8234 312170 -313560 50623 -65864 -157358 214483 360904 164482 44682 83684 -411053 33263
8222 -162993 66731 -278231 -324099 -16511 239661 142336 -235645 128747 -110068 187426
8211 -39564 71620 -74000 154258 -193142 -382061 -169452 -153700 -263959 7409 11381 5399
8199 -264466 60653 -39218 46306 -190220 86071 -54170 67296 147117 -70638 204077 -175985
8187 128258 -216089 -36830 117605 -64630 41776 21880 -86764 -50548 -228950 -90388 -134152
8176 -134152 110658 182077 -63231 -230267 -2315 -481338 -311604 125916 -62520 132690 163563
8165 163563 45045 -43564 -109402 -778 -140836 73733 -29176 45798 25468 -224700 102728
8153 -152007 -253792 -160022 94450 230079 -162105 -48371 37030 -437035 -154849 -293343
8143 -293343 171991 -173142 -78967 -290200 103532 -93622 -275741 -7227 -138673 -309434
8133 -309434 121914 232089 -131524 -277620 64280 194367 -367394 -118129 313153 112772
8122 280139 133089 -8680 -116368 -293190 -381594 34761 71580 10267 118519 137864 23358
8110 39874 177829 -15058 -274022 -240291 492636 -96597 -242357 -52569 89376 -430208 6373
8098 136552 33824 -248017 -134304 -165547 -24593 -199058 -274958 -59250 85135 -118421 -171741
8087 -171741 -22844 -32332 -148706 74928 -223514 -307177 -70796 -210508 -144800 -204543 -301081
8076 -301081 -64087 -122939 -51454 181174 383462 -82707 78871 85925 129456 -276783 -284255
8065 -284255 -172816 -80094 14075 86395 -170211 -123722 -56361 -104304 139075 122070 60160
8053 -118935 148890 28030 -94802 120083 -100809 28763 -122026 -288952 148397 180120
8043 180120 -58051 -150844 105003 318440 -151249 -89699 -284596 9480 328069 -277148 -20362
8031 -133300 -213419 233223 -91238 -358506 99109 12528 -206320 93957 152579 239769 -123607
8019 70087 -31574 -169886 -218662 217064 -143985 -486689 -55128 165804 65397 -102261 23111
8007 -116684 88864 309908 -170255 198196 26222 -57817 59685 -84022 188145 96217 -269857
7995 5639 153411 -279160 -6725 258267 338950 -218355 -196226 39655 301843 74680 2236
7983 46836 -216433 -294524 -133951 -188811 1863 -173918 -88418 143252 69328 -27646 -134272
7972 -134272 -167577 67971 34827 -264186 159478 -188259 -25542 139263 114791 -114730 26857
7960 -186156 80076 148841 270616 -272845 986 289545 -257012 -20502 -269680 27252 -231825
7948 -339930 -122907 104318 266824 -278980 -197779 -56026 -369291 -123685 3113 122684
7938 122684 128124 128566 10775 144030 -17813 -120143 107003 -66428 241068 241758 -90749 24327
7925 168619 -192828 -253821 -154811 99736 7829 259046 -22703 -110366 -310229 -402367 4966
7913 84759 -113596 50767 -244768 83749 -451412 -97977 217144 -238795 -57070 25668 194747
7902 194747 39428 -62302 103208 -39065 -43945 122718 -56751 -126673 -209998 51937 -208291
7890 139300 53153 -270294 -60750 -309576 -53811 -24833 157602 72712 130550 -13378 34830
7878 -318826 -264114 -155788 -410471 -91668 103247 -158083 -366015 -256994 -275822 -67658
7867 77090 146282 -115677 -133862 -63227 168961 -225279 -125422 -204399 147682 45962 -166476
7855 -546365 73482 -55440 -54800 78782 -271882 -359664 231703 44147 132708 -253817 -64610
7843 32176 -70281 -16293 -221845 -146975 -169407 -387100 -152153 59569 -94987 -12522 152789
7831 -83006 294063 -374603 292045 298247 -46708 85427 90012 -180920 -387954 2528 -302892
7819 272691 -50344 -202715 -109122 -242940 283423 -362417 90060 57652 -187528 -49731 -80002
7808 -80002 78047 128503 234984 248893 -168259 -16614 -105556 143529 -945 -113016 257679
7796 109634 -191564 247635 -33458 -80525 136060 -11374 147956 -111944 -136250 -58001 116782
7784 69834 338013 182901 135349 -403878 -39532 -61398 -315031 -129122 -18846 -145179 -264201
7773 -264201 49612 -110445 -153115 146465 92933 -152143 -82779 -5035 -192856 -119502 -15248
7761 -403542 270421 -100248 201430 -66497 -5703 -47942 -68993 146188 147167 336493 85731
7749 -72388 -40780 -69199 -336256 -115670 -95166 225133 220331 -81609 276170 80884 -62555
7737 175172 -86294 6026 116505 254769 -102521 27808 -111358 -391283 204770 153068 138454
7726 138454 18196 -167499 -65713 -179127 -373308 207242 -177724 386489 -226009 23181
7715 81436 81952 174422 -35153 -166054 -192751 205344 -172248 -25948 -106849 1616 195142 -7230
7702 -116023 -324592 -280510 -173661 -63082 -109591 269392 -196436 208778 -251494 65429
7691 -345244 -63722 -108305 52298 -223831 196839 125500 -186844 42125 -161301 -69546 77061
7679 -311354 15481 -155617 -68069 108131 -20993 205794 -74240 -167284 267971 34797 -18987
7667 -256983 -217229 -288520 -118517 -235361 124619 -200835 -64425 -1645 -119514 313030 112065
7655 -258708 -205721 112841 -103903 111980 -135849 -25490 60087 -313783 205569 218319
7645 218319 -11205 340970 138243 -10405 -5314 -93355 -105614 26943 -282537 -71955 250065
7633 210048 -91060 265066 35180 -210807 226752 -267837 -53926 -16388 274445 337077 -277851
7621 -164066 -358413 -156613 63943 -138649 219853 312178 -400522 -190691 -2309 -197782
7611 -197782 -192869 -105699 190871 -79584 275234 193412 110388 218012 -201789 -3366 -168626
7600 -168626 161797 -456398 -119948 -180902 -41865 213429 -129275 -22715 192490 -504270
7589 132233 17842 -352348 -6478 -282182 278470 -161071 150954 -21525 418264 -229182
7578 -67081 -195782 111310 -64881 -229598 -194096 15824 -170477 -9058 217500 255315 -339950
7566 -92306 -411388 67492 55568 104227 -235651 237332 -92789 -229841 146040 104977 -156196
7554 -234037 95060 -199711 -156027 -33319 127287 79639 -136574 47680 301759 -190352 -360592
7543 -360592 202140 294719 -181114 -52914 -297045 15127 -120183 -234902 -36342 42527 207656
7532 207656 -62624 -37427 -304467 48131 210308 17334 -188610 -92000 -156730 31592 308283
7521 308283 23489 -161642 -148170 56149 94626 -56269 -427650 -205054 408959 -12553 -116299
7510 -116299 178914 -123757 54286 39233 -44216 70936 -173140 238625 227103 24049 133765
7499 133765 372151 -214139 -131944 296194 -95116 109022 -490091 -28839 54099 -16554 63002
7487 -157834 -85599 12032 111821 -301390 126556 3042 50819 -124919 -147948 241671 -215656
7475 -197217 -218875 -9021 -4506 -271938 -231946 -76624 56155 -158876 -183601 52176 12754 -118987
7462 -115109 -69718 174892 24117 -140982 145967 119340 75735 91894 136781 -238955 111546
7450 -93586 351916 -223431 -373542 50170 24098 146460 -78017 282355 450726 -210393
7439 108165 -92811 -124881 -190979 -25034 206796 47799 406638 -75465 105698 -169345 -196389
7428 -196389 -90565 -63509 -318662 38108 30164 48319 -518339 -230630 1149 45210 58514
7417 58514 248897 -80937 -432748 -276847 -191258 -174746 -320470 -139402 60814 -378668 -228890
7406 -228890 226329 -277135 162427 -220062 212102 62961 163285 311916 7500 -79778
7395 47624 -129490 153126 -106585 142781 22043 -12282 156141 164212 266207 -158758 -86980
7384 -86980 113609 203084 74128 122806 -2211 90046 -26962 -186890 -83592 144303 45033
7372 -70424 -138140 97502 -178937 -114705 162351 -174635 18223 47861 -284310 -39180 -75110
7361 -75110 36752 89785 96469 205614 81634 118554 -280562 -350610 5543 -104506 84793 -268808
7348 -6066 -170182 -19880 -19936 -36627 -127761 149593 -155871 104975 -32188 -186528 -258266 -56220
7335 -9052 -581588 310608 258333 -341639 98050 -138982 41052 -167131 -74050 -347978 76923
7323 71855 194679 98653 -403402 31715 65578 -155231 -320801 -221749 272435 -14264 -9357
7312 -9357 -10783 -401674 -266942 26001 -295856 183088 283507 199295 160453 -234790 -348365
7301 -348365 225113 -104896 -4984 132219 1818 181291 -128427 -11758 244842 -499917 -248013
7289 38900 197333 255870 249685 -124897 194047 232171 -131607 -39616 232138 -18024 35085
7277 -230647 -118804 34499 177515 199591 -84208 -147769 90347 -175444 12893 28996 83211
7266 83211 -130502 -111372 147369 -115087 127779 -22093 196576 -173076 -124304 -153912 -39357
7254 -49547 -479975 -38365 -158484 -293315 -138503 215021 34634 38465 92789 -414270 -166046
7242 -122952 196667 -46317 68147 199599 -108587 49289 -21609 -516966 -232762 251740
7231 -35449 -58848 -180431 -36057 -24821 98871 326768 -78967 -255328 208114 321758 -121796
7219 -341996 33397 -329 68671 -4905 -87874 -45356 148004 -9808 -276177 -284202 -458808 195207
7206 -73215 -356680 221099 108823 -315849 -343176 -44866 36520 71342 63596 -161408 -192341
7195 -192341 204756 -140268 -120267 -60746 -196203 111807 76073 230951 236845 -90907 36380
7183 -196290 -83100 -112923 -508668 -171769 43778 8809 -185917 136594 67925 -114218 -29825
7171 213590 -358420 157862 -13989 3812 -509241 153145 -314042 -78654 -23899 -185231 229235
7159 146731 148419 -20249 -180472 -13232 -6990 -142632 -102383 -44057 301034 -147711 170015
7147 -52660 -39404 -211908 312123 240593 -351366 60249 -329303 -40742 287754 181662 -25285
7135 -89830 -214985 -314423 -4709 160313 56084 -152108 -158207 139784 1154 308772 -250914
7123 8259 -162996 -99974 -229839 337696 286483 -60211 -268081 -234908 38753 335782 -191350
7111 200796 -275210 169769 1824 60570 -2123 -20725 -172290 -27533 268112 -175007 -119571
7100 -119571 11865 -143709 -218658 -142948 -43795 -192692 158525 74137 -157425 -414271 252915
7088 -22309 -310957 -217323 -230365 -47690 -129035 46738 83555 -145495 -103608 23019 136750
7077 136750 94515 -184146 77967 12190 -160095 322243 118178 -23744 -152760 10343 80809
7066 80809 -40421 -243992 -21660 -59662 -409188 60063 -197816 10550 -1377 80516 147587
7055 147587 -72061 333094 8594 156176 148319 -227290 488 -387850 33880 -256473 -39073
7043 84219 -33613 -115180 34530 -345027 56352 69490 95644 -178243 -13131 -136168 -21511
7031 248289 228454 104832 -110999 -105344 23500 75348 -194660 -116898 139770 -78278 -423272
7020 -423272 -133907 194998 -127336 298582 157630 -221484 47724 245397 -73976 482195
7009 76570 -366198 -262096 -106156 -149911 -40008 -205549 -248350 393251 -106249 -42245 -154063
6998 -154063 122279 -91204 153583 88254 -385470 -303962 154622 96066 29766 17469 -422562
6986 203397 -84876 -219672 -10887 -16146 121756 -26231 17401 -216444 -128904 -412824 147791
6974 -49175 19908 290147 -264109 88339 -104955 -199316 -106096 162034 372082 71822 -251262
6962 -96397 -306193 -14253 125456 -227621 83739 -135985 -319890 121313 -195998 160472
6951 99139 -297423 106352 59647 -122674 49604 133291 -28901 -131352 36183 -139424 -114877
6940 -114877 71909 -172328 -118157 177017 534807 168407 -105768 136202 19526 -56863
6929 4885 60500 -234774 -246563 60345 122803 218161 53623 -115018 -160719 13068 22651 12144
6917 12144 -37618 -285617 -355123 -260996 48112 70787 -25864 244151 -7752 -148365 -170711
6906 -170711 -251798 42741 -156184 329473 -389053 -95447 20183 178565 98463 1219 163920
6895 163920 -247666 -273793 144950 275377 86926 -23542 217243 70545 -212085 -325810
6885 -325810 92067 -212883 48407 -156038 -205307 -75595 -37165 -400052 -171234 -285739 384424
6873 -289639 72709 -123584 -116523 100359 9698 -83122 384994 -126188 -291278 -191920 -243652
6862 -243652 -87387 164712 -10763 -62878 237597 116535 75115 110140 -279061 160484 -71660
6850 175402 -69123 -118174 -167204 -152666 59621 -103973 -127388 130180 273512 180794 360240
6839 360240 -65371 -144042 10105 -97404 -6699 -6754 108070 -83044 83993 -109886 192312 184210
6827 184210 -36172 127974 -631 31033 -125000 -207825 14910 242700 111227 344736 79970
6815 -63145 -44632 58241 -23135 198917 15592 242472 -331695 90171 84546 -209450 -456685
6804 -456685 -58064 -228609 146184 152043 -137409 -70252 -35027 -32979 -63646 110581 351554
6793 351554 -94841 105593 -4487 -140964 107941 22970 -22507 -73600 40947 -152922 220611
6781 -461918 123733 -99693 144734 -198641 -87525 -58557 91139 -108181 -167432 52883 14166
6769 -92014 -129088 -99597 92952 -26418 305134 -25074 155575 118141 67233 -51247 327035
6757 -35855 174524 83847 -39634 289559 -106285 258285 -50444 83288 -317150 101464 26834
6745 -159536 27191 -344390 33355 153753 -10735 -51966 252350 -69868 13555 116082 -103116
6733 -35589 -78243 -187383 60078 -261044 -109931 89861 -308308 -88556 5638 -81414 49224
6721 -134055 18231 225240 77032 -69754 -10174 -165357 47826 -269065 -85191 -102515 -42254
6709 236635 -152397 -37466 -153387 -22336 365400 121474 -189280 -12524 78358 -159339
6698 -291402 201662 -1596 26064 -197058 -113720 -246627 110261 83088 -43618 -153621 190155
6686 -276320 365486 -38597 116965 -103092 -204704 23620 -222424 -273093 379190 -105664
6675 122796 73294 -102010 45133 -63950 -213555 -115503 69868 62808 485665 110020 -57631
6663 -156219 148079 -189540 395310 402742 -367527 -121855 -54945 3125 -357590 300450 1131
6651 441017 -405162 -118278 -54129 -110300 -86159 -280379 299032 -57457 16683 -128998 102864
6639 -90521 -283465 -175790 -58335 -81715 -131949 510992 -223177 -252586 -181547 -74474 88606
6627 150128 85901 148220 79019 -24876 -38531 41011 -28777 -107737 -159349 77263 124368 -54958
6614 50841 114832 292742 216870 86034 203047 -108067 81947 215439 -287138 -11181 12012
6602 -176660 49168 310597 217424 -267643 -351383 128039 30317 71344 -268395 -258937 262244
6590 -60525 -33554 174906 -118917 -259713 103173 218256 -296764 281681 -136436 101049
6579 -297815 142432 -113245 107366 220659 159136 -67670 14664 229877 -15803 21898 -43750
6567 -34256 184134 -5584 -143866 -209508 80346 16611 14920 -99927 71770 370187 -195879
6555 -104400 -51844 72483 5981 112187 -446468 -226121 51764 6577 -300381 -103293 -192992
6544 -192992 -398391 -124769 -138245 -69630 -125716 140363 -50527 71902 160013 222774 50789
6532 261728 17738 -73380 -157263 81204 26414 576424 255871 -265740 147967 37712 357997
6521 357997 61797 -94500 29217 -149133 -53228 -250129 -169258 595285 -113356 5269 52322
6510 52322 27336 -10425 202342 -339494 106948 115298 -161457 -141127 -199130 -167576 -175438
6499 -175438 114118 -107913 377715 -310504 80650 -171537 -196041 -139195 -6752 105755 -83807
6487 -112378 133044 -124859 -218951 106437 74449 167609 -234354 -438211 3127 -126899 -140734
6476 -140734 -163680 7394 -242171 15143 -170967 -17824 35991 -253683 -312257 -9736 139860
6464 -278690 4168 120941 58662 -118699 -13094 -94345 66451 -320917 208072 18494 10175
6453 10175 217950 -238260 32708 392152 -64527 -135360 -337223 20910 82927 32178 32027
6442 32027 -35752 -299325 169163 53018 -72881 158331 151700 -50849 78922 -149033 158975
6430 104473 -379571 18552 36415 40969 -37740 -123800 -49177 -224913 50109 -48103 -372408
6419 -372408 -37346 47764 -85025 259548 -183572 146541 84490 -193607 339295 77910 -188828
6407 -300867 -32746 12807 -74757 3839 112415 -136635 -60947 97795 228971 -93626 109098
6395 51722 366946 -212704 -8971 205447 67447 217190 -256418 333827 -101246 -69846 36660
6383 269782 -38179 -265211 261195 -272009 -194243 202579 121582 -182374 142671 172061
6373 172061 -210730 -47952 -166454 -231821 477391 -237818 182257 -207522 355339 -202782
6362 71002 -53193 35044 162921 -208151 74153 65696 115351 60462 189577 124715 -337461
6350 -197380 -321495 2783 -121939 -83897 -104414 69544 -302352 17813 -13532 -46566 7687
6338 -312186 -129999 -2647 392654 168593 -153055 -93967 304788 -434822 63544 -47675 -354937
6327 -354937 -209438 -26946 -117320 19682 -103599 4560 -85663 201863 -40119 219398 107905
6315 5287 5946 190597 -150988 170651 40550 45631 2289 -51793 116091 342192 23186 -33992
6302 10287 -188471 255446 -67264 -152464 -6541 -103449 -155360 -45406 14926 -180308 -19426
6290 298331 -193549 -85097 14650 -216350 -163302 -242527 -76549 110937 62349 335720 58953
6278 -148330 82101 68733 -47681 -140730 82739 48692 -213852 351697 -140877 -160405 -110650
6267 -110650 -6235 54262 -130830 92023 -91590 5922 209293 19886 158573 -172641 62284
6255 -8286 9881 71149 28884 -275377 13731 -235030 -143174 -36347 61570 -114690 45064 285738
6243 285738 -142490 -112418 -36348 -140235 103451 -191352 113901 166425 235586 46389 -61251
6231 -76511 102211 -135759 -23853 32929 2753 142090 -287833 -36341 172353 20221 -272693
6219 -207738 -230306 -193865 129732 -7682 87320 268434 -43679 121954 -228732 119163 62844
6208 62844 249257 -110167 -50447 84085 304376 -274081 78237 -31923 -194606 -49190 -146146
6197 -146146 -282960 -112248 -117265 -89964 -54034 -425156 339455 -21717 -96416 14532 -2426
6185 4220 -65628 -29234 145139 45532 -3369 -7362 14775 65282 -269993 -61498 -24350 -134311
6173 -134311 -261108 214347 -363800 -204946 -111963 -142492 -127301 -22852 212105 35404 27205
6162 27205 47113 356552 -109379 116548 -308054 -88034 257712 121944 63354 129575 211346
6151 211346 -41985 7745 -16778 -298085 -354361 136920 48014 -349619 68285 -30408 55967
6139 183587 30532 150370 -177912 -56288 85988 -223628 383451 -163599 98810 -84691 92857
6127 41500 -237319 233590 -335952 -249121 146134 91502 -102125 -100140 -231730 -217632 39218
6115 99699 25546 32984 -162597 -86593 -239839 278080 -43499 -285909 51673 112977 -184792
6103 -354411 -169638 -130150 -13543 55412 59345 122822 380358 137392 -95011 -121219 -35795
6091 128846 25492 99627 -96775 220097 86971 -25918 99927 119862 -27913 -109356 -440178
6080 -440178 255725 -43553 -173993 -67829 4879 217069 -40667 9003 -1655 -68245 83751 201638
6068 201638 46998 -264613 204755 36999 54940 -24894 -106629 165605 -124888 39415 -105032
6056 -244207 -188955 150789 245314 166319 27103 45015 -74715 127549 -6790 7082 82835 -141247
6043 144064 79662 291276 266712 -303687 -70098 57542 198502 -37329 -35833 137556 54709
6031 -400449 264769 -243446 6872 73714 -72699 -81466 -63162 -232109 -225958 50358 -18832 97054
6018 2391 -8155 -69485 6577 67463 -286996 226091 -183823 -241910 -135358 -63630 15061 -76281
6005 157026 383526 -290749 -360225 -158876 202016 -61707 -289514 -102796 22481 35898
5995 35898 -19281 2756 95778 -224426 -294826 -120068 -228567 -286381 119195 -18505 -110348
5984 -110348 -236419 -106542 -150292 95618 67573 -8956 2853 28205 124512 124859 -72750 -5561
5971 -219193 -269003 59698 152093 -334790 347453 17272 85003 41798 -4944 -202211 91493
5959 -32212 28646 42132 -44826 81498 140343 -247243 70194 -134576 110110 -95749 120298
5947 -50847 -61901 -155976 -260613 297677 -177818 -76007 -396988 58803 -39577 -93123 -199935
5936 -199935 900 354474 -78703 -315130 105370 345380 134614 72407 -70256 339819 181701
5925 181701 -16038 106655 26500 -164651 -374834 -40940 -61986 -332178 152531 -56181 95548
5913 16013 -286271 251946 328873 344870 22983 117176 -118881 139985 -12090 -203126 -231139
5902 -231139 160885 157396 58127 -239832 81936 -118010 139446 225075 -12569 204848 49249
5890 -88625 -67728 -101592 110293 -77953 94662 291119 -8310 133782 -49697 -123359 47606
5878 11872 -309580 -321217 -170671 84943 -146063 -345455 280412 -167957 319756 263741
5868 263741 252092 22595 -25570 -17500 4170 1568 96274 42895 -65046 -8963 -129485 -70009
5856 -70009 -186223 68900 51366 -116364 -102851 419666 -38624 92876 -22228 -102985 -3632
5844 41411 85325 -138788 9384 55325 -69669 167222 -253963 134224 49914 -205925 -61251
5832 97029 -41788 -162389 -31322 394803 104408 -76819 226701 -107004 -330214 -255132 58645
5820 14378 194245 128992 39363 56373 69957 -186129 -110054 -20706 -347387 -201120 -131104
5809 -131104 83789 157777 112948 30676 99701 -163863 -79826 -233011 25905 -175286 -11440
5797 88117 -191857 377598 305924 77617 -131140 -139511 -42547 77359 -254971 9279 -62751
5785 332116 -121531 -313491 -248794 -199510 -73292 124336 -38511 -27563 78050 5756 -108647
5773 -28604 209109 76832 -32035 88095 190251 -282527 135564 44880 -16285 235811 -279056
5761 -210647 -75079 31213 -44900 -131630 -126385 -27730 22069 -68624 -279789 -102458 30402
5749 -73875 -81285 -164796 35754 300026 120645 -159131 -196681 -141528 139272 -181083 106034
5737 330502 -255177 132297 313240 15817 52482 -159990 -278585 -53291 -62124 237895 150815
5726 150815 124476 180296 278616 104645 158586 -205126 19839 -11086 115962 10419 421235
5715 421235 -133533 -280225 150289 -242648 -228120 -9925 53527 -252685 105898 110855 205430
5704 205430 288626 -81579 -56278 125528 143047 209550 69241 18276 171656 -282670 -29315
5692 -269793 140287 -139731 117461 159246 -397552 -325437 -98695 255823 -225438 -283533
5682 -283533 -82905 -45639 -151870 26880 308513 81847 -14442 44699 308106 133423 -396096
5670 -248918 93054 -69854 258890 -245575 172239 12506 214411 160700 -225372 180351
5659 -143693 -248771 -80250 362918 -81352 -144937 230679 470278 -145815 166416 -152302
5648 -242634 -181994 92438 -116590 150603 13870 189687 209401 67798 -92643 26816 134634
5637 134634 -138961 127064 558684 107745 -229587 128878 288153 -122150 70597 -165151
5626 221976 268667 -31555 -103673 -30353 7422 -109068 -255449 -208341 374809 216684 218389
5615 218389 -161818 -122459 -85785 376396 -104009 -238995 -103547 -302187 -47408 -57314 183334
5603 -217072 276062 107748 -7505 -230390 -240049 -154254 169272 -67176 68246 91061 130205
5592 130205 -20423 -197987 -183956 298149 -103496 165674 264968 108126 -187904 118144
5581 -226386 -246417 -128490 89471 64555 -14095 110739 303252 29698 185157 -16133 -55304
5570 -55304 74511 305924 90916 -91052 49171 -259449 43360 -100641 110353 1731 91862
5559 91862 -104713 -306319 -4866 -125758 272424 -271568 267212 24259 -240602 328505
5548 -132164 126525 -219655 -19315 -131867 -26001 -188437 -105411 -139722 -385090 -47231 -266978
5537 -266978 -205802 184375 -90139 -313029 -207459 121384 33947 201861 1689 -346010 -204688
5526 -204688 93572 52216 246687 103188 -227332 126006 7273 23699 167525 -116492 67477
5514 -346575 191199 -48098 -114731 -7081 117479 -85714 81132 -111802 -151731 138400 4905
5502 67896 -151691 73474 576957 12314 4656 49626 335093 -242597 -116349 50536 -135270
5490 9229 -198179 44247 177912 257257 39335 2789 -94767 -144957 38009 284284 286379 -186848
5477 27819 -327704 12713 108245 29935 -7218 -56928 176039 91512 -136159 347361 -241909
5465 -184676 -38249 126213 152535 326508 142091 169055 231988 -70659 265616 -216867 -131886
5454 -131886 -102757 -44688 95534 56623 31243 268 -36281 70909 -166134 -332317 92026 -118575
5441 289662 181153 102967 59479 -6785 -14809 10312 95862 -176058 -134697 41031 90545 -222331
5428 241941 -70761 5634 -30825 -276034 -234445 -264341 216678 -153516 112310 107210 83293
5417 83293 112839 -342269 221906 28598 -67967 10763 31302 58829 -41282 -17011 -104217
5406 -104217 105891 41029 -42879 -201861 185561 -334283 -19507 -104942 33729 -168392 -159830
5395 -159830 -36067 -284595 63043 81281 49595 -405003 84335 182417 45000 84422 183148
5384 183148 202382 120431 -14300 -423016 -184676 -186321 -228290 -19833 -129005 -283725 -344781
5373 -344781 249957 -142567 177401 234601 143747 -188046 284808 309547 -275515 -30377
5362 57013 104355 108590 -335886 7691 -152273 160620 29792 -11363 -50778 173180 5567 76385
5350 76385 -163416 -154610 -147018 245073 7223 110484 -69703 -287945 -91909 119571 -115101
5338 -258576 229152 98706 -122475 -437605 276030 89645 -37873 -804 -268896 -136227 -34975
5326 -31989 82220 -32621 32776 -66323 149258 -242234 36780 99501 226439 86517 287928
5315 287928 -75088 -135516 63852 399824 -322301 -134291 -202117 -385606 63238 -182069 17877
5303 71092 77775 105841 -199111 54131 -18032 -12841 -47485 -20888 207687 -231105 251903
5291 116422 25613 22601 21758 328250 34505 3030 115366 -1408 204539 -51379 -50688 -128687
5279 -128687 162791 -153135 228139 47303 239208 124795 -320390 135569 -14326 -160894
5269 -160894 168385 -263665 -216328 267900 54409 38012 -61029 419317 40599 210455 -195636
5257 65525 -270842 -210150 -82750 109146 -88998 -82177 -212574 -293346 -102620 43524 79795
5246 79795 -30402 160523 184413 227924 97555 209335 -182249 -84069 -140987 -323810 -181179
5235 -181179 11340 -75572 1561 -147782 21388 37557 53042 288525 -191162 -249980 373977
5223 -118914 -389139 -337173 329365 386374 230587 125785 -182279 73405 147146 244945 73227
5211 -82787 -15617 -197595 -86407 -131063 102708 33363 -170503 -3615 -4916 -24617 -112104 -18663
5198 -31320 -64640 5365 -21817 139271 190590 133433 -73176 148465 270734 -26061 145656
5186 -249976 1766 -321132 -204588 -101832 295164 -106213 21075 41349 8596 -30062 257171
5174 22512 198471 -29791 -248392 169219 275834 -235008 329592 139339 -201663 153777
5163 27955 131719 113086 -271965 -146168 21069 -54056 -187072 134563 58813 -695 -355169
5152 -355169 -5112 -101182 119629 -84031 189618 -19197 121570 50720 -34342 -114497 203156
5140 -167301 36487 -123857 158649 -24788 -144639 -233793 -160222 -171074 -338795 44637 -256229
5128 -152616 -260997 49258 3700 -175186 2423 -82750 54014 -141569 -459274 -144904 -92929
5117 -92929 54009 145450 -2721 -144387 509308 -193833 150252 -95656 18472 103535 -99923
5105 12451 287251 289445 -129971 -18170 -95226 56886 -153776 26800 172531 -319390 93613
5093 41937 194081 159830 17536 -7930 -54483 41219 78373 -15126 27874 205753 335446
5082 335446 -518249 22633 353348 -151376 107418 121521 39249 -120325 53588 19368 -183148
5070 10464 -140704 9393 124127 154604 35688 18433 241227 55778 120014 98396 -193168
5058 25922 -6649 -271036 -115189 149875 -81601 81778 -63808 24752 209153 144765 67180
5046 -329152 -143136 -61207 241628 -28112 -108916 -125292 -313982 64448 180376 -236459 87726
5034 -29646 126982 141742 252951 67694 -27673 45408 -96515 -109338 131531 -147374 -196916
5023 -196916 -224780 34319 129175 322718 20502 -52762 249874 68003 22423 57335 -59527
5011 -55589 7357 164030 204825 -276583 276137 139751 399131 -39853 -189830 -53165 130738
4999 -155402 -254123 36745 68526 156959 194334 59719 33106 437798 154359 -250627 124527
4987 44559 -280113 -258026 -262116 2578 11524 -222416 331076 -48797 441228 -13003 -101054 -15668
4974 35381 -339150 -100196 73387 90031 23021 -122219 -239081 -244162 -219929 1897 44855
4963 44855 -26704 175140 152585 30573 48667 -150195 65987 -66325 85525 190064 -141088
4951 65210 -101802 388147 114667 182004 -155249 -140968 -224518 31344 -136637 -132315 27180
4939 -25330 244907 -296009 29040 87784 -389519 160068 -79996 48955 -40504 -98630 221340
4927 -20707 -64406 -38429 135424 251838 -18556 -78481 -144808 144394 -31528 -25040 304419
4915 -249280 318022 -1461 -19966 165540 -83682 38010 -88032 22889 -302039 258662 -82631
4903 -384342 -198508 -165330 -61514 -121813 295138 -82599 22495 -83330 92285 -59969 286304
4891 82675 36824 -68423 -37124 29044 -112774 -22953 271765 -222999 94440 96712 172611
4880 172611 -46279 274737 -178391 -339966 -99782 -52246 174348 -120592 343660 57057
4869 205498 -50013 -202277 -150334 273607 -151345 20941 -191749 -20546 -94502 100360 -28128
4857 10138 -30897 54690 -220479 -199768 402503 296581 -108074 -10231 185535 60946 -159765
4845 -31902 69368 156307 -72364 177433 192323 220040 -5412 -40172 16623 -619696 121621
4833 -68581 77003 70142 -4689 -168903 -15370 -111234 -210350 -46998 327376 -405117 242515
4821 31034 -109854 129577 124373 107119 -161491 -88141 173909 -44795 46150 203373 -339821
4809 168613 -135265 -310289 59946 104969 17562 204579 31529 258098 298301 -153066 -78091
4798 -78091 -386035 -125672 156187 125030 -125140 -246453 289763 -7443 -112531 -24550 189731
4786 -190079 -269234 -74583 164138 233231 -109850 224941 36046 369925 -205767 113071
4775 -203255 -62722 307961 -146732 -4579 -73429 72570 -120441 -280333 -119276 -338579 -65708
4763 -140234 160026 57083 26439 84233 -153175 -243931 69238 265272 18225 37702 132955
4752 132955 -15106 23138 223775 223286 -135140 -306354 -239 -376498 -87021 21074 69030 -84328
4739 21540 -80666 38579 283311 149128 -162262 285174 22256 51044 -100114 -298184 146225
4727 56877 76653 38044 -258682 91600 -27178 -77114 16976 66698 224008 -9209 -44295 166763
4714 201155 88735 168191 -90415 49143 -173877 -79420 -86166 209404 47754 -230456 40069
4702 -167447 184746 342537 -324197 -132854 57211 -117717 -33972 102271 -1291 -60161 -179198
4691 -179198 -132946 -174777 243642 -63135 151361 248297 -85587 -23371 134209 -96748 235191
4679 -205917 255745 -26376 163136 -64513 -157129 -69446 -38152 -228796 -221062 104723 233931
4668 233931 106970 -236308 -254953 -255994 56672 -171553 30381 37155 39692 -92983 292875
4656 4103 46129 236473 71188 -383196 150624 87843 44587 103083 233191 -268682 220602
4644 -39786 -89981 -74602 -142781 276598 34489 476929 172262 -116745 178738 -128996 -140925
4633 -140925 -116405 -80678 -25037 105814 -53535 63698 -7675 193288 203506 -100978 -112359
4622 -112359 -324263 -293387 -356260 83464 93124 56564 215491 -180641 27519 208660 -11392
4610 -232704 -145466 -207110 6741 29680 335826 130178 78250 -39682 315330 28147 -98582
4598 -10043 -66382 215600 -257256 -34111 -242944 11393 7379 94998 -97871 111469 218595
4587 218595 117346 84842 26859 -124551 64075 66131 -159000 138304 365119 252780 -18050
4575 -251682 -35224 -9618 349505 179885 -290229 149241 -78703 -166507 182354 -77631 171712
4563 179844 172256 120591 -103887 -129085 32019 -11664 116974 137765 152248 -155943 -82609
4552 -82609 212694 62863 -44100 -212139 -165698 -295778 32481 104545 287963 -160705 -339380
4541 -339380 26248 174385 168436 -158607 -196322 -113954 156539 151421 -98258 6931 -33925 -73752
4529 -73752 155882 -334102 -175768 -182818 -11968 -283575 -59876 52928 -202189 -223400 248160
4517 -223909 -40708 298007 93585 76338 -60309 -34269 -117365 -43713 -291092 102395 -207693
4505 227101 167033 344878 26015 324488 -49550 -133292 363689 24138 192356 175354 28293
4493 387426 -75955 -83892 36037 217591 -180585 -207138 113232 -342099 -309782 -40248 209316
4481 -116889 -111581 12310 281297 48227 -40340 -94825 -294922 -37260 123408 -180773 -57796
$$ [...]
##END NTUPLES=NMR SPECTRUM
##END=
