
##TITLE=AC1200_HiSAH12054_6666883_yLKwQD6Ayq
##JCAMPDX= 6.0         $$ Bruker NMR JCAMP-DX V2.0
##DATA TYPE= NMR SPECTRUM
##DATA CLASS= NTUPLES
##ORIGIN= BRUKER
##OWNER= Administrator
$$ 1.72 TOPSPIN		Version 2.1
$$ 2012-08-14 10:52:04.375 -0500  Administrator@TOPSPIN
$$ Compression mode = diff/dup
##.OBSERVE FREQUENCY= 400.02188249412
##.OBSERVE NUCLEUS= ^1H
##.ACQUISITION MODE= SIMULTANEOUS (DQD)
##.ACQUISITION SCHEME= undefined
##.AVERAGES= 64
##.DIGITISER RES= 22
##SPECTROMETER/DATA SYSTEM= spect
##.PULSE SEQUENCE= noesygpps1d.comp
##.SOLVENT NAME= COFFEE_meoh
##.SHIFT REFERENCE= INTERNAL, COFFEE_meoh, 1, 14.96086
##AUDIT TRAIL= $$ (NUMBER, WHEN, WHO, WHERE, PROCESS, VERSION, WHAT)
$$ ##TITLE= Audit trail, TOPSPIN		Version 2.1
$$ ##JCAMPDX= 5.01
$$ ##ORIGIN= Bruker BioSpin GmbH
$$ ##OWNER= Administrator
$$ $$ C:\Bruker\TOPSPIN/data/COFFEE/nmr/AC1200_HiSAH12054_6666883_yLKwQD6Ayq/12/pdata/1/auditp.txt
$$ ##AUDIT TRAIL=  $$ (NUMBER, WHEN, WHO, WHERE, PROCESS, VERSION, WHAT)
(   1,<2012-08-14 10:51:57.656 -0500>,<Administrator>,<TOPSPIN>,<go>,<TOPSPIN 2.1>,
      <created by zg
	started at 2012-08-14 10:40:27.250 -0500,
	POWCHK enabled, PULCHK disabled,
       configuration hash MD5:
       6B 1B 68 BB D9 2E 58 E2 7F 35 AD 54 07 DF 0E 41
       data hash MD5: 64K
       85 81 E1 8A 03 C9 B5 DB FE 1F A5 68 B8 F9 10 35>)
(   2,<2012-08-14 10:52:02.218 -0500>,<Administrator>,<TOPSPIN>,<proc1d>,<TOPSPIN 2.1>,
      <Start of raw data processing
       efp LB = 0.3 FT_mod = 6 PKNL = 1 PHC0 = 0 PHC1 = 0 SI = 128K 
       data hash MD5: 128K
       E6 A6 0F 4C 8D DE 2D 6C 0C 26 E0 92 B7 C0 B0 D9>)
(   3,<2012-08-14 10:52:03.343 -0500>,<Administrator>,<TOPSPIN>,<proc1d>,<TOPSPIN 2.1>,
      <pk PHC0 = 6.608276 PHC1 = 0 
       data hash MD5: 128K
       7D 3D 64 22 0E 0B 8A 0F 2D 88 79 C5 D2 97 43 3F>)
(   4,<2012-08-14 10:52:03.968 -0500>,<Administrator>,<TOPSPIN>,<proc1d>,<TOPSPIN 2.1>,
      <abs ABSG = 1 
       data hash MD5: 128K
       20 0F 0A 66 F0 E3 3B 40 29 15 F4 89 D1 7F 18 2B>)
(   5,<2012-08-14 10:52:04.078 -0500>,<Administrator>,<TOPSPIN>,<proc1d>,<TOPSPIN 2.1>,
      <abs ABSG = 2 
       data hash MD5: 128K
       6B 24 61 E0 D7 BA 2E 59 28 A9 9F 9B E6 DB D7 24>)
(   6,<2012-08-14 10:52:04.171 -0500>,<Administrator>,<TOPSPIN>,<proc1d>,<TOPSPIN 2.1>,
      <abs ABSG = 3 
       data hash MD5: 128K
       78 4A 79 DB 9F D4 D2 A8 1E 95 82 FD A9 B0 99 D1>)
(   7,<2012-08-14 10:52:04.218 -0500>,<Administrator>,<TOPSPIN>,<proc1d>,<TOPSPIN 2.1>,
      <abs ABSG = 4 
       data hash MD5: 128K
       ED 35 43 6E 9F 34 46 4E D0 02 CB D6 FA 64 DA 4B>)
(   8,<2012-08-14 10:52:04.281 -0500>,<Administrator>,<TOPSPIN>,<proc1d>,<TOPSPIN 2.1>,
      <abs ABSG = 5 
       data hash MD5: 128K
       50 77 CD 24 F0 9E 29 49 15 BF 97 6A A8 00 A2 76>)
$$ ##END=
$$ 
$$ $$ hash MD5
$$ $$ E4 F3 F3 B9 51 78 F2 3C 5B BE 1C B1 41 60 E4 24
##$RELAX= 
##$RELAX= 
##$RELAX= 
##$RELAX= 
##$RELAX= 
##$RELAX= 
##$RELAX= 
##$RELAX= 
$$ Bruker specific parameters
$$ [...]
##$TP07= 0
##$TPNAME0= <>
##$TPNAME1= <>
##$TPNAME2= <>
##$TPNAME3= <>
##$TPNAME4= <>
##$TPNAME5= <>
##$TPNAME6= <>
##$TPNAME7= <>
##$TPOAL= (0..7)
0.5 0.5 0.5 0.5 0.5 0.5 0.5 0.5
##$TPOFFS= (0..7)
0 0 0 0 0 0 0 0
##$TUNHIN= 0
##$TUNHOUT= 0
##$TUNXOUT= 0
##$USERA1= <user>
##$USERA2= <user>
##$USERA3= <user>
##$USERA4= <user>
##$USERA5= <user>
##$V9= 5
##$VALIST= <valist>
##$VCLIST= <CCCCCCCCCCCCCCC>
##$VD= 0
##$VDLIST= <DDDDDDDDDDDDDDD>
##$VPLIST= <PPPPPPPPPPPPPPP>
##$VTLIST= <TTTTTTTTTTTTTTT>
##$WBST= 1024
##$WBSW= 4
##$XGAIN= (0..3)
0 0 0 0
##$XL= 0
##$YL= 0
##$YMAX_a= 10811916
##$YMIN_a= -7736966
##$ZGOPTNS= <>
##$ZL1= 120
##$ZL2= 120
##$ZL3= 120
##$ZL4= 120
##$ABSF1= 14.96086
##$ABSF2= -5.597322
##$ABSG= 5
##$ABSL= 3
##$ALPHA= 0
##$AQORDER= 0
##$ASSFAC= 0
##$ASSFACI= 0
##$ASSFACX= 0
##$ASSWID= 0
##$AUNMP= <proc_prof1d_extract.lims>
##$AXLEFT= 0
##$AXNAME= <>
##$AXNUC= <1H>
##$AXRIGHT= 0
##$AXTYPE= 0
##$AXUNIT= <>
##$AZFE= 0.1
##$AZFW= 0.1
##$BCFW= 0
##$BC_mod= 0
##$BYTORDP= 0
##$COROFFS= 0
##$CY= 15
##$DATMOD= 1
##$DC= 0
##$DFILT= <>
##$DTYPP= 0
##$F1P= 0
##$F2P= 0
##$FCOR= 0.5
##$FTSIZE= 131072
##$FT_mod= 6
##$GAMMA= 0
##$GB= 0
##$INTBC= 1
##$INTSCL= 1
##$ISEN= 128
##$LB= 0.3
##$LEV0= 0
##$LPBIN= 0
##$MAXI= 10000
##$MC2= 0
##$MEAN= 0
##$ME_mod= 0
##$MI= 0
##$NCOEF= 0
##$NC_proc= -2
##$NLEV= 6
##$NOISF1= 0
##$NOISF2= 0
##$NSP= 0
##$NTH_PI= 0
##$NZP= 0
##$OFFSET= 14.96086
##$PC= 1
##$PHC0= 6.608276
##$PHC1= 0
##$PH_mod= 1
##$PKNL= yes
##$PPARMOD= 0
##$PPDIAG= 0
##$PPIPTYP= 0
##$PPMPNUM= 2147483647
##$PPRESOL= 1
##$PSCAL= 4
##$PSIGN= 0
##$PYNMP= <proc.py>
##$REVERSE= no
##$SF= 400.020009693594
##$SI= 131072
##$SIGF1= 0
##$SIGF2= 0
##$SINO= 400
##$SIOLD= 131072
##$SPECTYP= <>
##$SREGLST= <1H.CDCl3>
##$SSB= 0
##$STSI= 131072
##$STSR= 0
##$SW_p= 8223.68421052631
##$SYMM= 0
##$S_DEV= 0
##$TDeff= 65536
##$TDoff= 0
##$TI= <>
##$TILT= no
##$TM1= 0
##$TM2= 0
##$TOPLEV= 0
##$USERP1= <user>
##$USERP2= <user>
##$USERP3= <user>
##$USERP4= <user>
##$USERP5= <user>
##$WDW= 1
##$XDIM= 131072
##$YMAX_p= 383763134
##$YMIN_p= -33880770
##$CURPLOT= <Network HP LaserJet P1505>
##$CURPRIN= <$Network HP LaserJet P1505>
##$DFORMAT= <normdp>
##$LAYOUT= <+/1D_H.xwp>
##$LFORMAT= <normlp>
##$PFORMAT= <normpl>
##$SURQMSG= 1
$$ End of Bruker specific parameters
$$ ---------------------------------
##NTUPLES= NMR SPECTRUM
##VAR_NAME=  FREQUENCY,     SPECTRUM/REAL,   SPECTRUM/IMAG
##SYMBOL=    X,             R,               I
##VAR_TYPE=  INDEPENDENT,   DEPENDENT,       DEPENDENT
##VAR_FORM=  AFFN,          ASDF,            ASDF
##VAR_DIM=   131072,        131072,          131072
##UNITS=     HZ,            ARBITRARY UNITS, ARBITRARY UNITS
##FACTOR=    0.0627417313425164, 1,          1
##FIRST=     8223.62146879497, -637,         -57481
##LAST=      0,             1289,            -57870
##MIN=       0,             -33880770,       0
##MAX=       8223.62146879497, 383763134,    0
$$ Real data points
##PAGE= N=1
##DATA TABLE= (X++(R..R)), XYDATA
$$ [...]
63940B679974K36722K45179K49787K50729K47689K39769K26281K07124J82602
$$ 2679974 2916696 3161875 3411662 3662391 3910080 4149849 4376130 4583254 4765856
63931D765856J53270J19977Q3595M4800M455l5894p4357j09748j41996j71408
$$ 4765856 4919126 5039103 5122698 5167498 5171953 5136059 5061702 4951954 4809958 4638550
63921D638550j97646k19559k35880k46092k50653k50464k46180k38087k26579
$$ 4638550 4440904 4221345 3985465 3739373 3488720 3238256 2992076 2753989 2527410
63912B527410k12487j96823j80342j63461j46547j30137j14928j01387q9286p7865
$$ 2527410 2314923 2118100 1937758 1774297 1627750 1497613 1382685 1281298 1192012 1114147
63902A114147o6836n7046m9560m4100l9116l3606k8176k3909k0926j8676j7034
$$ 1114147 1047311 990265 940705 896605 857489 823883 795707 771798 750872 732196 715162
63891G15162j6254j6137j6072j5794j5391j4712j3475j1894j0443q989o910m161
$$ 715162 698908 682771 666699 650905 635514 620802 607327 595433 584990 576001 569091 564930
63879E64930j443Q51L039N301P238Q784J0675J3319J5837J7120J7479J8292K0121
$$ 564930 563487 564338 567377 572678 579916 588700 599375 612694 628531 645651 663130 681422 701543
63866G01543K2032K2974K3040K2978K2942K2327K0739J8625J6745J5185J3265
$$ 701543 723575 746549 769589 792567 815509 837836 858575 877200 893945 909130 922395
63855I22395J0438P039L817R65j910m962p895j0711j3967j7793k1269k3417k4458
$$ 922395 932833 939872 943689 944654 942744 937782 929887 919176 905209 887416 866147 842730 818272
63842H18272k5394k6606k7638k8226k8683k9126k9148k8477k7414k6283k4985
$$ 818272 792878 766272 738634 710408 681725 652599 623451 594974 567560 541277 516292
63831E16292k3359k1537j9707j8019j6866j6633j6808j6116j4044j1660j0253
$$ 516292 492933 471396 451689 433670 416804 400171 383363 367247 353203 341543 331290
63820C31290r704q958p644o326n395m630l914l523l562l715l692l432k836j888
$$ 331290 321586 312628 304984 298658 293263 288633 284719 281196 277634 273919 270227 266795 263959 262071
63806B62071r91o40p31q48j110j923k879k929j947j144j410k161k426k222k105
$$ 262071 261080 260440 259709 258861 257751 255828 252949 250020 248073 246929 245519 243358 240932 238710 236605
63791B36605k128k153k580l668m579m120k369n94L52O72P37N14J4m36o70q07q27
$$ 236605 234477 232324 229744 226076 221497 217377 215008 214414 214766 215438 216175 216689 216703 216267 215597 214790 213963
63774B13963n56j85j31l08j78L27O53N39L75L48K1q04j487j398q65o76r60j177
$$ 213963 213407 213222 213091 212783 212605 212932 213585 214124 214499 214847 214868 214064 212577 211179 210314 209638 208678 207501
63756B07501r97n95k06J83O00R33J053R49P60P08R08J238J501J677J773J606J129
$$ 207501 206504 205909 205703 205886 206486 207419 208472 209421 210181 210889 211797 213035 214536 216213 217986 219592 220721
63739B20721Q56J333K237K636K293J965K144K346K118J942K375K976L034K818
$$ 220721 221577 222910 225147 227783 230076 232041 234185 236531 238649 240591 242966 245942 248976 251794
63725B51794L130L843M034L527L249L823M680M965M584L906K984J618j13j787
$$ 251794 254924 258767 262801 266328 269577 273400 278080 283045 287629 291535 294519 296137 296024 294237
63711B94237k995l488l224k484j799j504j512j565j535j358r78m87r7K01P01J539
$$ 294237 291242 287754 284530 282046 280247 278743 277231 275666 274131 272773 271795 271308 271211 271412 272113 273652
63695B73652K419L006L378L758M027L846L238K660K426K308J926J361J026J004
$$ 273652 276071 279077 282455 286213 290240 294086 297324 299984 302410 304718 306644 308005 309031 310035
63681C10035P98L8q70j143o79k43m43r22r25l24L86R70J675K552L066K722J736
$$ 310035 310833 310871 310001 308858 308179 307936 307493 306571 305646 305322 305708 306678 308353 310905 313971 316693 318429
63664C18429P94K97J44j5n06j562l152m823n913o058n478m682l998l355k588j802
$$ 318429 319223 319520 319664 319649 319143 317581 314429 309606 303693 297635 292157 287475 283477 280122 277534 275732
63648B75732j327j319j560j758j912k161k370k110j121L63J782K710L104L269
$$ 275732 274405 273086 271526 269768 267856 265695 263325 261215 260094 260457 262239 264949 268053 271322
63634B71322L591M189M766M946M707M483M756N617O714P571Q036Q486R493J1153
$$ 271322 274913 279102 283868 288814 293521 298004 302760 308377 315091 322662 330698 339184 348677 359830
63620C59830J2835J3796J3972J4002J4523J5674J7218J8905K0665K2615K4839
$$ 359830 372665 386461 400433 414435 428958 444632 461850 480755 501420 524035 548874
63609E48874K7028K8398K8416K7467K6418K5383K3452J9891J5127J0209N639J330
$$ 548874 575902 604300 632716 660183 686601 711984 735436 755327 770454 780663 786302 787632
63597G87632k557n406o917p518p852q141q406q957j0262j2408j4983j7524j9833
$$ 787632 785075 779669 772752 765234 757382 749241 740835 731878 721616 709208 694225 676701 656868
63584F56868k1785k3090k3487k3100k2356k1466k0091j7742j4511j1189q538o572
$$ 656868 635083 611993 588506 565406 543050 521584 501493 483751 469240 458051 449513 442941
63572D42941m727k655n63J247K831M353N680O636P486Q631R776J0044R248Q540
$$ 442941 438214 435559 434996 436243 439074 443427 449107 455743 463229 471860 481636 491680 500928 509468
63558E09468R168J0875J2279J2788J3303J4873J7409K0157K2799K5489K8213L0831
$$ 509468 518636 529511 541790 554578 567881 582754 600163 620320 643119 668608 696821 727652
63546G27652L3354L5476L6017L3758K8883K2789J6336R178J243o081j1038j3273
$$ 727652 761006 796482 832499 866257 895140 917929 934265 943443 944686 938605 927567 914294
63534I14294j3710j3071j1440r219p558p461r117j2238j6513k1303k5560k8518
$$ 914294 900584 887513 876073 866854 859296 851835 842718 830480 813967 792664 767104 738586
63522G38586l0226l1002l0818k9725k8491k7990k7944k7054k4554k1134j8052
$$ 738586 708360 677358 646540 616815 588324 560334 532390 505336 480782 459648 441596
63511D41596j5842j4211j2727j1148r351p496o109n585n594n303m279k884j805
$$ 441596 425754 411543 398816 387668 378317 370821 364712 359127 353533 348230 343951 341067 339262
63498C39262j419j653k129k407k255j822j385r47k42Q05J825K304J998J135L00
$$ 339262 337843 336190 334061 331654 329399 327577 326192 325245 325003 325808 327633 329937 331935 333070 333370
63483C33370J15P80J953L124M053M624M567L740K622K004K003J837P30j233l305
$$ 333370 333485 334265 336218 339342 343395 348019 352586 356326 358948 360952 362955 364792 365522 364289 360984
63468C60984m773n254m767l841l290l486m020m290m181l888l296k116n37O75R20
$$ 360984 356211 350957 346190 342349 339059 335573 331553 327263 323082 319194 315898 313782 313245 313920 314840
63453C14840M25J0L08J236K224K912L551M642O261Q002R480J0687J1794J2947
$$ 314840 315265 315275 315583 316819 319043 321955 325506 330148 336409 344411 353891 364578 376372 389319
63439C89319J4267J5814J7519J9459K2035K5252K7883K8241K6081K2939K0111
$$ 389319 403586 419400 436919 456378 478413 503665 531548 559789 585870 608809 628920
63428F28920J7165J3231Q931N920M910N342O849R785J4111J8867K3231K7244L0978
$$ 628920 646085 659316 668247 674167 679077 684419 691268 701053 715164 734031 757262 784506 815484
63415H15484L3682L4385L2901K9706K5136J9292J2553N761j95m752p831r791j1133
$$ 815484 849166 883551 916452 946158 971294 990586 1003139 1008900 1008705 1003953 996122 986331 975198
63402I75198j2158j2938j3580j4279j5201j6629j9107k2942k7449l1145l2983
$$ 975198 963040 950102 936522 922243 907042 890413 871306 848364 820915 789770 756787
63391G56787l3095l2268l1088k9775k8326k6471k3862k0644j7559j5156j3154
$$ 756787 723692 691424 660336 630561 602235 575764 551902 531258 513699 498543 485389
63380D85389j0931q312n528k708N3K284L460L844M502O220Q689J0871J2138J2785
$$ 485389 474458 466146 460618 457910 457963 460247 463707 467551 472053 478273 486962 497833 509971 522756
63366E22756J3627J5191J7318J9414K1052K2331K3758K5799K8457L1184L3175
$$ 522756 536383 551574 568892 588306 609358 631689 655447 681246 709703 740887 774062
63355G74062L3933L3561L2447L0729K8109K4202J8914J2582N951l4m645p738r694
$$ 774062 807995 841556 874003 904732 932841 957043 975957 988539 994490 994456 989811 982073 972379
63342I72379j1040j2115j3013j3720j4437j5792j8371k1911k5272k7607k9159
$$ 972379 961339 949224 936211 922491 908054 892262 873891 851980 826708 799101 769942
63331G69942l0474l1228l0619k8734k6579k4682k2400j8954j4536j0064o392m016
$$ 769942 739468 708240 677621 648887 622308 597626 575226 556272 541736 531672 525280 521264
63319E21264l097l375m442o216q730j1451j3486j4649j5498j6021j5252j2837
$$ 521264 518167 514792 510350 504134 495404 483953 470467 455818 440320 424299 409047 396210
63307C96210j0092q486p726o449m444k977k919l638m029l770l195k621k173j891
$$ 396210 386118 377632 369906 363457 359013 356036 353117 349479 345450 341680 338485 335864 333691 331800
63293C31800j668j413j356j818k569k924k617k203k295k799l141k959k263j246
$$ 331800 330132 328719 327363 325545 322976 320052 317435 315232 312937 310138 306997 304038 301775 300529
63279C00529k56K55J08l04l45K67J223J925J912J149J14n05l80R8J62n09j349
$$ 300529 300273 300528 300636 300332 299987 300254 301477 303402 305314 306463 306577 306072 305692 305790 305952 305443 304094
63262C04094j407l58J085J938J964J720J724J932K144K431K932L561M201M924
$$ 304094 302687 302329 303414 305352 307316 309036 310760 312692 314836 317267 320199 323760 327961 332885
63248C32885N671O100O139O351P219Q336Q921Q978R233R929J0527J0805J1488
$$ 332885 338556 344656 350795 357146 364365 372701 381622 390600 399833 409762 420289 431094 442582
63235D42582J3244J5612J7476J8336J8561J8610J8573J8488J8523J8681J8675
$$ 442582 455826 471438 488914 507250 525811 544421 562994 581482 600005 618686 637361
63224F37361J8292J7723J7326J7193J7146J7055J6932J6716J6196J5297J4231
$$ 637361 655653 673376 690702 707895 725041 742096 759028 775744 791940 807237 821468
63213H21468J3142J1724R483O390K913o58m571r012j3500j7202j9688k1068k1544
$$ 821468 834610 846334 855817 862207 865120 864462 859891 850879 837379 820177 800489 779421 757877
63200G57877k1262k0567j9882j9180j7858j5342j1757p870m520k026m6K052M535
$$ 757877 736615 716048 696166 676986 659128 643786 632029 624159 619639 617613 617567 619619 624154
63187F24154P063R158J0750J2135J3503J4834J6102J7256J8042J8278J8271J8550
$$ 624154 631217 640375 651125 663260 676763 691597 707699 724955 742997 761275 779546 798096
63175G98096J9064J9072J8062J6411J4884J3839J3082J2233J0845Q476N034R89
$$ 798096 817160 836232 854294 870705 885589 899428 912510 924743 935588 944064 949098 950087
63163I50087l115p253j1702j6377k0754k4436k7370k9496l0596l0697l0215k9457
$$ 950087 946972 939719 928017 911640 890886 866450 839080 809584 778988 748291 718076 688619
63151F88619k8258k6436k4344k2498k0867j8966j6649j4309j2230j0274q380o894
$$ 688619 660361 633925 609581 587083 566216 547250 530601 516292 504062 493788 485408 478514
63139D78514o041n541n064m705m480l817k256m20N54M99M46J173K356L332L959
$$ 478514 472473 466932 461868 457163 452683 448866 446610 446190 446744 447243 447689 448862 451218 454550 458509
63124D58509M322M266L768L282L161L203L222L557M400N087M845L948L337L213
$$ 458509 462831 467097 470865 474147 477308 480511 483733 487290 491690 496777 501622 505570 508907 512120
63110E12120K834J728M49j11L48J335J970J606M83k82J32J241J835J464O78l3
$$ 512120 514954 516682 517131 517020 517368 518703 520673 522279 522762 522480 522612 523853 525688 527152 527830 527797
63094E27797p69j564k035j981j730j532j186o27k91m96q36o31L04J627K880L724
$$ 527797 527028 525464 523429 521448 519718 518186 517000 516373 516082 515586 514750 514119 514423 516050 518930 522654
63078E22654M009L983M067M365M639M867N335O047O635P125Q139R910J1708J2790
$$ 522654 526663 530646 534713 539078 543717 548584 553919 559966 566601 573726 581865 591775 603483 616273
63064F16273J3373J4101J5052J6038J7363J9414K1765K3682K5408K7949L1484
$$ 616273 629646 643747 658799 674837 692200 711614 733379 757061 782469 810418 841902
63053H41902L4974L7607L9742M1922M3733M4396M4039M3667M3966M4648M4906
$$ 841902 876876 914483 954225 996147 1039880 1084276 1128315 1171982 1215948 1260596 1305502
63042A305502M4209M2698M1164M0481M0736M1057M0554L9286L7925L6608L4648
$$ 1305502 1349711 1392409 1433573 1474054 1514790 1555847 1596401 1635687 1673612 1710220 1744868
63031A744868L1408K6990K1779J5725Q418k25r649j8929k7258l4322m0420m6055
$$ 1744868 1776276 1803266 1825045 1840770 1849188 1848963 1839314 1820385 1793127 1758805 1718385 1672330
63019A672330n1148n4831n6303n5709n3796n0798m6234l9969l2848k5960j9587
$$ 1672330 1621182 1566351 1510048 1454339 1400543 1349745 1303511 1263542 1230694 1204734 1185147
63008A185147j3387p253j495L742Q718J3658J8391K2547K5890K8436L0448L2249
$$ 1185147 1171760 1164507 1163012 1166754 1175472 1189130 1207521 1230068 1255958 1284394 1314842 1347091
62996A347091L3804L4611L4307L3307L2400L1779L0949K9712K8604K7902K6745
$$ 1347091 1380895 1415506 1449813 1483120 1515520 1547299 1578248 1607960 1636564 1664466 1691211
62985A691211K3852J8963J3000O776J35p347j5336k2971k9961l6817m3842n0332
$$ 1691211 1715063 1734026 1747026 1753802 1753937 1746590 1731254 1708283 1678322 1641505 1597663 1547331
62973A547331n5215n8187n9751o0277n9660n7933n5603n3003m9815m5674m0884
$$ 1547331 1492116 1433929 1374178 1313901 1254241 1196308 1140705 1087702 1037887 992213 951329
62962I51329l6167l1973k8501k5923k4083k2294k0125j8152j7233j7210j7125
$$ 951329 915162 883189 854688 828765 804682 782388 762263 744111 726878 709668 692543
62951F92543j6576j5985j5561j4963j4181j3764j3759j3370j2235j1175j0981
$$ 692543 675967 659982 644421 629458 615277 601513 587754 574384 562149 550974 539993
62940E39993j1117j0437q695o579m727l478l201l934m853m938m142l191k430j666
$$ 539993 528876 518439 509744 503165 498438 494960 491759 487825 482972 478034 473892 470701 468271 466605
62926D66605j007r39j367j515j063o86r80j541j602j133p32p39r31j000r18q94
$$ 466605 465598 464659 463292 461777 460714 460028 459048 457507 455905 454772 454040 453301 452370 451370 450452 449558
62910D49558j228j986k708k684j862j177j537k613l177k631j663j167j106p93
$$ 449558 448330 446344 443636 440952 439090 437913 436376 433763 430586 427955 426292 425125 424019 423226
62896D23226j9O84Q67P46P72R77J030O92K7p10j152r89l51J57J26j12L1M92O93
$$ 423226 423207 423891 424758 425504 426276 427253 428283 428975 429002 428292 427140 426151 425800 425957 426083 425971 426002 426494 427187
62877D27187M95M03O34P02K70k04j95l0m01j218j605j087j73K14l53j500k299
$$ 427187 427682 428085 428719 429421 429691 429487 429292 429262 428861 427643 426038 424951 424778 424992 424639 423139 420840
62860D20840j967o66N50Q87P56J042J757K096J766J428J648K112K243J961J428
$$ 420840 418873 418207 418757 419644 420400 421442 423199 425295 427061 428489 430137 432249 434492 436453 437881
62845D37881O37k44o08j61M48L79j91l76N9L58l7p32j054r43p01l72P7L14K8l22
$$ 437881 438518 438274 437666 437505 437953 438332 438141 437765 437824 438182 438145 437413 436359 435416 434715 434343 434420 434734 434762 434440
62825D34440R0J228J971J507M58Q6P62J738K289K412K361K154J865J864K343K909
$$ 434440 434530 435758 437729 439236 439694 439780 440542 442280 444569 446981 449342 451496 453361 455225 457568 460477
62809D60477L112L189L744M745N447N400N116N350O108O730O873O928P437Q423
$$ 460477 463589 466778 470522 475267 480714 486114 491230 496580 502688 509418 516291 523219 530656 539079
62795E39079R533J0660J2019J3714J5490J7126J8840K1127K4263K8094L2187L6088
$$ 539079 548612 559272 571291 585005 600495 617621 636461 657588 681851 709945 742132 778220
62783G78220L9584M2954M6739N1066N5365N9075O2359O5567O8268O9472O8854
$$ 778220 817804 860758 907497 958563 1013928 1073003 1135362 1200929 1269197 1338669 1407523
62772A407523O6933O3862N8910N1608M2631L2862K2222J0301k338j4464k5569
$$ 1407523 1474456 1538318 1597228 1648836 1691467 1724329 1746551 1756852 1754514 1740050 1714481
62761A714481l5976m5612n3656n9565o3577o6070o7191o7358o7157o6364o4009
$$ 1714481 1678505 1632893 1579237 1519672 1456095 1390025 1322834 1255476 1188319 1121955 1057946
62750A057946n9947n5506n1827m8409m4233l9643l5861l2974k9856k6119k2781
$$ 1057946 997999 942493 890666 842257 798024 758381 722520 689546 659690 633571 610790
62739F10790k0556j8636j6009j3084j1046j0010q902p028n002l853l794m059l694
$$ 610790 590234 571598 555589 542505 531459 521449 512547 505519 500517 496664 492870 488811 485117
62726D85117k347m83J140K253L227M297M998M811M180M285N736Q043J0378J2373
$$ 485117 482770 482287 483427 485680 488907 493204 498202 503013 507193 511478 517214 525257 535635 548008
62712E48008J4026J5440J6921J8917K1502K4320K7207L0460L4178L7878M1221
$$ 548008 562034 577474 594395 613312 634814 659134 686341 716801 750979 788857 830078
62701H30078M4565M8327N2169N5522N8547O1816O5172O7647O8486O7675O5509
$$ 830078 874643 922970 975139 1030661 1089208 1151024 1216196 1283843 1352329 1420004 1485513
62690A485513O2230N7981N2422M4544L3699K0825P808m525j6868k9656m1842n1974
$$ 1485513 1547743 1605724 1658146 1702690 1736389 1757214 1765022 1760497 1743629 1713973 1672131 1620157
62678A620157n9691o5407o9276p1235p1661p1172o9885o7505o3929n9402n4323
$$ 1620157 1560466 1495059 1425783 1354548 1282887 1211715 1141830 1074325 1010396 950994 896671
62667H96671m9314m5093m1708l8311l4215k9912k6398k3839k1561j9175j6903
$$ 896671 847357 802264 760556 722245 688030 658118 631720 607881 586320 567145 550242
62656E50242j4855j2797j0785r332q739q631q402p836p173o816o975p295p006
$$ 550242 535387 522590 511805 502473 493734 485103 476701 468865 461692 454876 447901 440606 433600
62643D33600n756m159l088k549j769l85J017J665J450Q92N32M83L55l52j543k366
$$ 433600 427844 423685 420597 418048 416279 415894 416911 418576 420026 420918 421450 421933 422288 421936 420393 418027
62627D18027k101j106m12n19r89j184q52m4R80J709J811J656J960K839L742M377
$$ 418027 415926 414820 414408 413889 412900 411716 410864 410820 411800 413509 415320 416976 418936 421775 425517 429894
62611D29894N058N920O486O352N888N813O440P647R273J1100J2744J4003J5210
$$ 429894 434952 440872 447358 453710 459598 465411 471851 479498 488771 499871 512615 526618 541828
62598E41828J6950J9412K2204K4807K7066K9207L1410L3370L4462L4383L3396
$$ 541828 558778 578190 600394 625201 652267 681474 712884 746254 780716 815099 848495
62587H48495L1702K8890K4436J8581J2213O023K14n172j0197j5243k0575k5694
$$ 848495 880197 909087 933523 952104 964317 970340 970554 965382 955185 939942 919367 893673
62575H93673k9685l2230l3611l3857l2741l0689k8732k7257k5719k3878k2370
$$ 893673 863988 831758 798147 764290 731549 700860 672128 644871 619152 595274 572904
62564E72904k1460k0265j8023j5316j3178j1637j0142q807q089p612o491m761
$$ 572904 551444 531179 513156 497840 484662 473025 462883 454076 445987 438375 431884 427123
62552D27123l413k898k604k029j560j678k050j917j025J47R12R28N31N16J311
$$ 427123 423710 420812 418208 416179 414619 412941 410891 408974 407949 408096 409008 409936 410467 410983 412294
62537D12294K322K502J564K69m79m03L03J396K645L920N380P233R221J0779J1841
$$ 412294 414616 417118 418682 418951 418472 418069 418372 419768 422413 426333 431713 438946 448167 458946 470787
62522D70787J3032J4781J6680J8161J9477K1564K5001K9349L3485L6408L7870
$$ 470787 483819 498600 515280 533441 552918 574482 599483 628832 662317 698725 736595
62511G36595L8462L8990L9648L9910L9218L7493L4809L0991K5904J9923J3669
$$ 736595 775057 814047 853695 893605 932823 970316 1005125 1036116 1062020 1081943 1095612
62500A095612P348P96n826j1766j6277j9173k0675k0993k0266j8750j6697j4085
$$ 1095612 1102960 1103756 1097930 1086164 1069887 1050714 1030039 1009046 988780 970030 953333 939248
62488I39248j0663o355j510L336P893J2270J6721K1299K5745K9506L1855L2146
$$ 939248 928585 922230 920720 924056 931949 944219 960940 982239 1007984 1037490 1069345 1101491
62476A101491L0238K6677K2257J7281J1450M538l063j0695j8042k5031l1330l6485
$$ 1101491 1131729 1158406 1180663 1197944 1209394 1213932 1210869 1200174 1182132 1157101 1125771 1089286
62464A089286m0578m4102m7072m8767m8725m7465m5713m3310l9598l4713k9727
$$ 1089286 1048708 1004606 957534 908767 860042 812577 766864 723554 683956 649243 619516
62453F19516k5464k1814j8358j5100j2302j0015q100o427m863l340k064j237n68
$$ 619516 594052 572238 553880 538780 526478 516463 508363 501936 497073 493733 491669 490432 489864
62440D89864N57K193L682M578N116N477N205L900K046M54p70k165m019o086p944
$$ 489864 490421 492614 496296 500874 505990 511467 516672 520572 522618 523072 522302 520137 516118 510032 502088
62425E02088r206r620r427r291r416r117p819o090m913m407m075l922m234m533
$$ 502088 492882 483262 473835 464544 455128 446011 438192 432102 427189 422782 418707 414785 410551 406018
62411D06018l965k789k263k788l323k954k033j217m68L60Q12N68K31N58J394K071
$$ 406018 402053 399264 397001 394213 390890 387936 385903 384686 384218 384578 385390 385958 386189 386747 388141 390212
62395C90212K464K863L176L037K587K429K781L196L212K881K627K800L366L990
$$ 390212 392676 395539 398715 401752 404339 406768 409549 412745 415957 418838 421465 424265 427631 431621
62381D31621M453M967N821O846P684Q479R661J0976J1544J1156J0720J1008J1746
$$ 431621 436074 441041 446862 453708 461392 469871 479532 490508 502052 513208 523928 534936 546682
62368E46682J2470J3511J5339J7614J9781K2110K5191K8706L1781L4366L7334
$$ 546682 559152 572663 588002 605616 625397 647507 672698 701404 733185 767551 804885
62357H04885M1090M4980M8203N0566N2044N2207N0537M6932M1632L4895K6965
$$ 804885 845975 890955 939158 989724 1041768 1093975 1144512 1191444 1233076 1267971 1294936
62346A294936J8284R576J647n118j1080j6915k2706k7789l1695l4719l7270l9106
$$ 1294936 1313220 1322796 1324443 1319325 1308245 1291330 1268624 1240835 1209140 1174421 1137151 1098045
62334A098045l9764l9316l8098l6118l3354l0374k7867k5743k3389k0749j8412
$$ 1098045 1058281 1018965 980867 944749 911395 881021 853154 827411 804022 783273 764861
62323G64861j6729j5553j4895j5066j6016j7159j8035j8599j8792j8366j7361
$$ 764861 748132 732579 717684 702618 686602 669443 651408 632809 614017 595651 578290
62312E78290j6192j5096j3990j2930j2172j1525j0273q119n799m368m080m276
$$ 578290 562098 547002 533012 520082 507910 496385 486112 477993 472194 467826 463746 459470
62300D59470m150l363k146j022l87j75P9P48J791K834L513L766L882M163M499
$$ 459470 455320 451957 449811 448789 448402 448227 448306 449054 450845 453679 457192 460958 464840 469003 473502
62285D73502M465L977L503L454L655L793L991M527N314O078O777P405P779Q009
$$ 473502 477967 481944 485447 488901 492556 496349 500340 504867 510181 516259 523036 530441 538220 546229
62271E46229Q792J0483J2309J3388J4208J5987J8827K1677K4203K7309L1418L5528
$$ 546229 555021 565504 577813 591201 605409 621396 640223 661900 686103 713412 744830 780358
62259G80358L8751M1682M5374M9674N3580N6600N8767N9666N8531N5259N0432
$$ 780358 819109 860791 906165 955839 1009419 1066019 1124786 1184452 1242983 1298242 1348674
62248A348674M4283L6452K6977J6824P032k261j1538k0867k9551l6812m2599m7536
$$ 1348674 1392957 1429409 1456386 1473210 1480242 1477981 1466443 1445576 1416025 1379213 1336614 1289078
62236A289078n2093n6052n8783n9924n9496n7598n4299m9929m5062m0128l5293
$$ 1289078 1236985 1180933 1122150 1062226 1002730 945132 890833 840904 795842 755714 720421
62225G20421l0773k6906k3743k0855j7861j4938j2546j0757r174p563o275n814
$$ 720421 689648 662742 638999 618144 600283 585345 572799 562042 552868 545305 539030 533216
62213E33216n991n892m927l699l279l631l524k253o80L7O3L48J059J607K014K961
$$ 533216 527225 521333 516406 512707 509428 505797 502273 500020 499340 499377 499440 499788 500847 502454 504468 507429
62197E07429M440N567O067O725P936Q835Q673Q090Q195Q994R735J0236J0983J2086
$$ 507429 511869 517436 523503 530228 538164 546999 555672 563762 571957 580951 590686 600922 611905 623991
62183F23991J3029J3376J3052J2060J0542R052Q142P654O967O052N767O979R637
$$ 623991 637020 650396 663448 675508 686050 695102 703244 710898 717865 723917 729684 736663 746300
62170G46300J2897J5959J8768K1914K5824L0063L3687L6220L7798L8318L7190
$$ 746300 759197 775156 793924 815838 841662 871725 905412 941632 979430 1017748 1054938
62159A054938L4296L0493K6409K1427J4772P208M82m827r766j5109k0127k3794
$$ 1054938 1089234 1119727 1146136 1167563 1182335 1189543 1190025 1185198 1175432 1160323 1140196 1116402
62147A116402k6272k8484l0731l2597l3836l4484l4173l2181k8443k4033k0200
$$ 1116402 1090130 1061646 1030915 998318 964482 929998 895825 863644 835201 811168 790968
62136G90968j7193j4354j1211q173n979m780m017l217k501k155j876r74O61K300
$$ 790968 773775 759421 748210 740037 734058 729278 725261 722044 719543 717388 715512 714538 715199 717499
62122G17499L348M209N727P879R601R846Q490O121L503J384K11m29j628l884o257
$$ 717499 720847 725056 730783 738662 748263 758109 766599 772720 776223 777607 777818 777389 775761 771877 765620
62107G65620p429p340p120p494q140q674r359j0401j1250j1184j0098q285n959
$$ 765620 758191 750851 743731 736237 728097 719423 710064 699663 688413 677229 667131 658846 652887
62094F52887l491j551l43R24L016N414O815O712N878N365N714P024R043J1114
$$ 652887 649396 647845 647502 648426 651442 656856 663671 670383 676261 681626 687340 694364 703407 714521
62080G14521J2617J3566J4362J5147J5913J7053J8938K1073K2441K2880K3251
$$ 714521 727138 740704 755066 770213 786126 803179 822117 843190 865631 888511 911762
62069I11762K4129K5020K5257K4947K4656K4702K5003K5266K5012K3854K1892
$$ 911762 935891 960911 986168 1011115 1035771 1060473 1085476 1110742 1135754 1159608 1181500
62058A181500J9429J6344J2322P650L067j221n589r934j3563j6429j9543k3591
$$ 1181500 1200929 1217273 1229595 1237245 1240312 1239091 1233502 1223568 1210005 1193576 1174033 1150442
62046A150442k8013l1863l4851l6931l7809l7632l7347l7479l7112l5113l1863
$$ 1150442 1122429 1090566 1055715 1018784 980975 943343 905996 868517 831405 796292 764429
62035G64429k8808k6619k4780k2797k0753j8748j6655j4617j3074j2126j1513
$$ 764429 735621 709002 684222 661425 640672 621924 605269 590652 577578 565452 553939
62024E53939j1221j1414j1669j1071r395p614o777o771o641n931n182n061n395
$$ 553939 542718 531304 519635 508564 499169 491555 484778 478007 471366 465435 460253 455192 449797
62011D49797n359m495l194k063j202l51N43J391K338L482M404M653M632N171O149
$$ 449797 444438 439943 436749 434686 433484 433133 433676 435067 437405 440887 445291 449944 454576 459747 465896
61996D65896O421N468M182L521L225K524J417M16m70j589k908m116n241o407p299
$$ 465896 472317 477785 481967 485488 488713 491237 492654 493070 492600 491011 488103 483987 478746 472339 465040
61981D65040p512p220o908o660o335o070n942n495m409l364l352m195m607l809
$$ 465040 457528 450308 443400 436740 430405 424335 418393 412898 408489 405125 401773 397578 392971 389162
61967C89162k317j120o98r89j616j986j637o70M87J624K616K972K246R55L36R86
$$ 389162 386845 385725 385027 384038 382422 380436 378799 378129 378616 380240 382856 385828 388074 389029 389365 390351
61951C90351K228L022L113L073L568M798O365P670Q586R604J1062J2479J3178
$$ 390351 392579 395601 398714 401787 405355 410153 416518 424188 432774 442378 453440 465919 479097
61938D79097J3401J4105J5573J6869J6878J5519J3640J2069J1000J0119R109P972
$$ 479097 492498 506603 522176 539045 555923 571442 585082 597151 608151 618270 627379 635351
61926F35351O838N527L632J226r31k249l027l923m978n675n737n321m501l077
$$ 635351 642189 647716 651348 652574 651643 649394 646367 642444 637466 631791 626054 620733 616232 613155
61912F13155r14J822M752P369R299J0676J1989J3255J3792J3152J1775J0150P969
$$ 613155 612241 614063 618815 626184 635483 646159 658148 671403 685195 698347 710122 720272 728241
61899G28241M805J178j950m381o537q385r470r881j0231j0684j0872j0720j0536
$$ 728241 733046 734224 732274 727893 721356 712971 703501 693620 683389 672705 661833 651113 640577
61886F40577j0319r800r161q855q718q259p788q268r808j1256j1619j1041j0138
$$ 640577 630258 620458 611297 602442 593724 585465 577677 569409 559601 548345 536726 525685 515547
61873E15547r168q202p359o507n320l923k771j816m69J365L071M285N286O231
$$ 515547 506379 498177 490818 484311 478991 475068 472297 470481 470012 471377 474448 478733 484019 490250
61859D90250O933P689R292J1760J4051J5572J7086J9377K1917K3688K4577K5108
$$ 490250 497183 504872 514164 525924 539975 555547 572633 592010 613927 637615 662192 687300
61847F87300K5318K4919K4099K3267K2136J9884J6204J1669P124L193J23k303
$$ 687300 712618 737537 761636 784903 807039 826923 843127 854796 861920 865113 865236 862933
61835H62933m618p054r208j0521j0719r657p239l887n95K058M496P220R703J0873
$$ 862933 858315 851261 842053 831532 820813 811156 803917 800030 799435 801493 805989 813209 822912 833785
61821H33785J0418Q944O971M451J246k481o402j0234j3746j6903j9859k2575k4537
$$ 833785 844203 853147 860118 864569 865815 863334 856932 846698 832952 816049 796190 773615 749078
61808G49078k5218k4711k3575k2147k0389j8375j6521j5208j4365j3570j2444
$$ 749078 723860 699149 675574 653427 633038 614663 598142 582934 568569 554999 542555
61797E42555j0910r145p388n868m831m389m251l877l131k526k494k692k504j986
$$ 542555 531645 522500 515112 509244 504413 500024 495773 491896 488765 486239 483745 481053 478549 476563
61783D76563j779k105k517k611k400j928j197m85j87k14j82j27l76o64l48L72
$$ 476563 474784 472679 470162 467551 465151 463223 462026 461541 461354 461140 460958 460831 460455 459791 459443 459815
61767D59815M96j37k79J002K796L401K391R60N11J444L032M059L908L224L066
$$ 459815 460311 460174 459895 460897 463693 467094 469485 470445 470956 472400 475432 479491 483399 486623 489689
61752D89689L306K683P69j108j557r72p98j651l037m419n537o034n662m861m319
$$ 489689 492995 495678 496447 495339 493782 492810 492012 490361 487324 482905 477368 471334 465672 460811 456492
61737D56492m063l549k578j528p65l04M1M78J047J400J172P46J008K001K589K108
$$ 456492 452429 448880 446302 444774 444009 443705 443746 444224 445271 446671 447843 448589 449597 451598 454187 456295
61721D56295J477J809K650K710J862J192J301J682J740J404P16k71j121j394j414
$$ 456295 457772 459581 462231 464941 466803 467995 469296 470978 472718 474122 474838 474567 473446 472052 470638
61706D70638j913k896l664l910l976l997l714l268l279l870m337m096l354k677
$$ 470638 468725 465829 462165 458255 454279 450282 446568 443300 440021 436151 431814 427718 424364 421687
61692D21687k440k807l528l746k791j330r10k044l580m310m349m355m228l423
$$ 421687 419247 416440 412912 409166 406375 405045 404135 402091 398511 394201 389852 385497 381269 377846
61678C77846k074r56m62l15j94j66l89q20j227j337j043o07n08q69j167q52r0
$$ 377846 375772 374816 374354 374039 373845 373679 373290 372470 371243 369906 368863 368256 367748 366879 365712 364860 364770
61661C64770M36M88O30J442K612L195K708J706J099J168J517J742J799J729J509
$$ 364770 365206 365694 366324 367766 370378 373573 376281 377987 379086 380254 381771 383513 385312 387041 388550
61646C88550J235J110J115R99P53P06J004J359J486J366J016L92k55n63p61j481
$$ 388550 389785 390895 392010 393009 393762 394468 395472 396831 398317 399683 400699 401091 400836 400273 399512 398031
61630C98031k566k905k058j238j799l344m310l998k973j819o56J79J70m91r65
$$ 398031 395465 392560 390502 389264 387465 384121 379811 375813 372840 371021 370365 370544 370714 370223 369258
61615C69258r47r74j357j683j704j909k774l982m825m977m519l739l107l073l532
$$ 369258 368311 367337 365980 364297 362593 360684 357910 353928 349103 344126 339607 335868 332761 329688 326156
61600C26156l807l443k689k081j816j800j926k089k126j973j683j338j080j167
$$ 326156 322349 318906 316217 314136 312320 310520 308594 306505 304379 302406 300723 299385 298305 297138
61586B97138j659k071j743o54M73R01N26k19p62p66m07k46n69r44p54oO82P39
$$ 297138 295479 293408 291665 291011 291484 292385 292911 292692 291930 291164 290757 290511 289942 288998 288244 288238 288920 289659
61568B89659J7j178k033j635j8J479J606O74n5k1M18J118K230L200L004J710O96
$$ 289659 289676 288498 286465 284830 284812 286291 287897 288571 288516 288495 288913 290031 292261 295461 298465 300175 300871
61551C00871P67J145Q83L25L12P15P29K34r8J60P71J446K156K770K892K367J697
$$ 300871 301638 302783 303666 303991 304303 305018 305747 305981 305883 306043 306814 308260 310416 313186 316078 318445 320142
61534C20142J611K172K474J541l38j623j204K29R90M32n73j014q92p94j040j514
$$ 320142 321753 323925 326399 327940 327602 325979 324775 325004 325994 326426 325853 324839 323947 323153 322113 320599
61518C20599j891j841j404j147j442j687j018K40P75J46n29k55L85K39o75j272
$$ 320599 318708 316867 315463 314316 312874 311187 310169 310409 311184 311330 310801 310546 310931 311170 310495 309223
61502C09223r30j18M03M11K85N01J038J273O96k32m64K57J000R22L08r3j74l16
$$ 309223 308293 308175 308578 308989 309274 309775 310813 312086 312782 312550 312086 312343 313343 314265 314573 314480 314306 313990
61484C13990n66n36J6R52J900K335J886Q75K50O15J525K048J730Q01j74o04k62
$$ 313990 313424 312888 312904 313856 315756 318091 319977 320852 321102 321717 323242 325290 327020 327821 327647 327043 326781
61467C26781L02J72p61j507j169n9Q21R17L46n11j125r47mQ71J002P35Q92J606
$$ 326781 327083 327255 326494 324987 323818 323759 324580 325497 325843 325332 324207 323260 323256 324127 325129 325864 326756 328362
61449C28362K230K220J646R46O11R02J589K149K419K710L044K902K119J389J293
$$ 328362 330592 332812 334458 335404 336015 336917 338506 340655 343074 345784 348828 351730 353849 355238 356531
61434C56531J405J058M92L46M63K38j34J96J231J840J283J78l62K0R33J883K564
$$ 356531 357936 358994 359486 359832 360295 360533 360399 360595 361826 363666 364949 365127 364765 364785 365718 367601 370165
61417C70165K748K325J423M01k52k24J73J16q02j933k383k236k306k786k961k424
$$ 370165 372913 375238 376661 377062 376810 376586 376759 376875 376073 374140 371757 369521 367215 364429 361468 359044
61401C59044j844k060k879l304k646j132M34J272J109L72j43j9M12N77L76K40
$$ 359044 357200 355140 352261 348957 346311 345179 345613 346885 347994 348366 348223 348204 348616 349193 349569 349809
61385C49809N23J038J332J292J290J637K084K129J809J737K206K624K222J080
$$ 349809 350332 351370 352702 353994 355284 356921 359005 361134 362943 364680 366886 369510 371732 372812
61371C72812J21P8Q22J671K067J939J672J738K207K623K525K013J627J753K359
$$ 372812 372933 373011 373833 375504 377571 379510 381182 382920 385127 387750 390275 392288 393915 395668 398027
61356C98027L196L951M258L979L586L956N431P279Q309Q094P301O792O607O154
$$ 398027 401223 405174 409432 413411 416997 420953 426384 433663 441972 450066 457367 464159 470766 476920
61342D76920N217M332L974L879L440K564J661R54K78n09j337k094k648k785k546
$$ 476920 482137 486469 490443 494322 497762 500326 501987 502941 503219 502710 501373 499279 496631 493846 491300
61327D91300k465k963l646l774l281k712k224j488n54J78R59K492M473N455M852
$$ 491300 488835 485872 482226 478452 475171 472459 470235 468747 468193 468371 469330 471822 476295 481750 486602
61312D86602L972M273N472O424O968P796R003J0011J0598J0942J0846R957Q551
$$ 486602 490574 494847 500319 506743 513711 521507 530510 540521 551119 562061 572907 582864 591415
61299E91415P164N560L106N6k526m151n283o296p003p351p653p963q026p976q244
$$ 591415 598579 604139 607245 607301 604775 600624 595341 589045 582042 574691 567038 559075 551049 543073 534829
61284E34829q603q185o759n122l888k728j227L28J567K647L740M522M770M875
$$ 534829 526226 518041 511282 506160 502272 499544 498317 498645 500212 502859 506599 511121 515891 520766
61270E20766N111N005M156L171K998L616M185M302M304M501M834N359O256P223
$$ 520766 525877 530882 535038 538209 541207 544823 549008 553310 557614 562115 566949 572308 578564 585787
61256E85787P530O876N721M521L286K149J622J786J710M87j409k647k822k846
$$ 585787 593317 600193 605914 610435 613721 615870 617492 619278 620988 621475 620066 617419 614597 611751
61242F11751l417l994l841l342l467m264m759m258l026j729p93m41o54r58p84
$$ 611751 608334 604340 600499 597157 593690 589426 584667 580409 577383 575654 574861 574420 573766 572808 572024
61227E72024j41N89J506L077M938N836N278M424M587N446N641M689L416K659K495
$$ 572024 571883 572472 573978 577055 581993 587829 593107 597531 602118 607564 613205 617894 621310 623969 626464
61212F26464K771L528M560N146M672L293J843J089J137J383J223Q69J288L121
$$ 626464 629235 632763 637323 642469 647141 650434 652277 653366 654503 655886 657109 657978 659266 662387
61198F62387N953Q827J1211J3124J4637J5669J6135J5944J5057J3737J2423J1101
$$ 662387 668340 677167 688378 701502 716139 731808 747943 763887 778944 792681 805104 816205
61186H16205R210O554L839J848N37n13j231j435j611k457l789m802n328n969o941
$$ 816205 825415 831969 835808 837656 838193 837680 836449 835014 833403 830946 827157 822355 817027 811058 804117
61171H04117p660p730p647q137r306j0660j1703j2196j2206j2018j1870j1745
$$ 804117 796457 788727 781080 772943 763637 752977 741274 729078 716872 704854 692984 681239
61159F81239j1541j1314j1094j0667r845q793p726o479m763k723q30N43J164Q69
$$ 681239 669698 658384 647290 636623 626778 617985 610259 603780 599017 596294 595464 596007 597171 598040
61145E98040j45j271k202l305m871o430p382p753p697o799m828k621j188k65J146
$$ 598040 597895 596624 594422 591117 586246 579816 572434 564681 556984 550185 545357 542736 541548 541283 542429
61130E42429L058M573N466O434P663Q520Q932R840J1802J4207J6299J8053J9568
$$ 542429 545487 550060 555526 561960 569623 578143 587075 596915 608717 622924 639223 657276 676844
61117F76844K0542K0954K1501K2714K4191K5177K5382K4922K3965K2814K1790
$$ 676844 697386 718340 739841 762555 786746 811923 837305 862227 886192 909006 930796
61106I30796K0749J9217J7127J4888J2661J0184P371M354R54l062p161j0458j3090
$$ 930796 951545 970762 987889 1002777 1015438 1025622 1032993 1037347 1038301 1035239 1028078 1017620 1004530
61093A004530j5998j9193k1455k2165k2168k2276k2167k1573k1203k1460k1305
$$ 1004530 988532 969339 947884 925719 903551 881275 859108 837535 816332 794872 773567
61082G73567j9620j6960j4750j3386j2290j1306j0660r945q413o251m434l310
$$ 773567 753947 736987 722237 708851 696561 685255 674595 664650 656237 649986 645552 642242
61070F42242k261r01L29R70J215J504J978K600L386M297N184O049P138Q669J0501
$$ 642242 639981 639080 639409 640379 641594 643098 645076 647676 651062 655359 660543 666592 673730 682399 692900
61055F92900J2190J3416J4381J5645J7339J8849J9615K0021K0902K2381K3885
$$ 692900 705090 718506 732887 748532 765871 784720 804335 824356 845258 867639 891524
61044H91524K5262K6928K8862L0399L1302L2212L3636L5312L6915L8583M0278
$$ 891524 916786 943714 972576 1002975 1034277 1066489 1100125 1135437 1172352 1210935 1251213
61033A251213M1499M2178M3111M5012M7683N0552N3288N5615N7334N8871O0973
$$ 1251213 1292712 1334890 1378001 1423013 1470696 1521248 1574536 1630151 1687485 1746356 1807329
61022A807329O3712O6810P1086P8197Q8586J01228J15808J33263J53482J74658
$$ 1807329 1871041 1937851 2008937 2087134 2175720 2276948 2392756 2526019 2679501 2854159
61012B854159J96256K20635K50422K86657L31201L88406M61924N52729O63082
$$ 2854159 3050415 3271050 3521472 3808129 4139330 4527736 4989660 5542389 6205471
61003F205471P98648R61429J143908J336717J537229J735870J890911J934869
$$ 6205471 7004119 7965548 9109456 10446173 11983402 13719272 15610183 17545052
60995A7545052J824564J581867J270232R32616N72760K05566r8432k52101k41644
$$ 17545052 19369616 20951483 22221715 23154331 23727091 23932657 23834225 23582124 23340480
60986B3340480j57817j24295k04282l86132o41677r64786j342520j712828j979390
$$ 23340480 23182663 23058368 22854086 22467954 21826277 20861491 19518971 17806143 15826753
60977A5826753k073720j995674j797421j541867j277644j035896q32251o68492
$$ 15826753 13753033 11757359 9959938 8418071 7140427 6104531 5272280 4603788
60969D603788n38537m36001l56143k93816k43949k04082j73621j50818j32724
$$ 4603788 4065251 3629250 3273107 2979291 2735342 2531260 2357639 2206821 2074097
60960B074097j17783j06044r6805q8179p9170p0331o2133n4387m7529m2714m0004
$$ 2074097 1956314 1850270 1753465 1665286 1586116 1515785 1453652 1399265 1351736 1309022 1269018
60949A269018l7953l5597l3641l3012l3306l3442l2969l1966l0414k8393k6437
$$ 1269018 1231065 1195468 1161827 1128815 1095509 1062067 1029098 997132 966718 938325 911888
60938I11888k5029k4050k3156k2312k1520k0571j9447j8546j7967j7043j5275
$$ 911888 886859 862809 839653 817341 795821 775250 755803 737257 719290 702247 686972
60927F86972j3386j2610j3024j3289j2308j0447q811p810o973n871m685l785l239
$$ 686972 673586 660976 647952 634663 622355 611908 603097 595287 588314 582443 577758 573973 570734
60914E70734k873k503j958j060J18J137J581J498J319J411J818K348K684K532
$$ 570734 567861 565358 563400 562340 562458 563595 565176 566674 567993 569404 571222 573570 576254 578786
60900E78786J845R11R9m15o74q49j242k077l072l551l305l027l406m080m158l623
$$ 578786 580631 581542 581641 581226 580552 579703 578461 576384 573312 569761 566456 563429 560023 555943 551785 548162
60884E48162l517m553o225p511p942p734p325p144p432p940q014p288o040m742
$$ 548162 544645 540092 533867 526356 518414 510680 503355 496211 488779 480839 472825 465537 459497 454755
60870D54755l591k643k032j740j448r55m76k30QN92J459K188K510K487K267J920
$$ 454755 451164 448521 446489 444749 443301 442346 441870 441640 441648 442240 443699 445887 448397 450884 453151 455071
60854D55071J418P00j42o67l99N39J361J471J131R75J105J037M55l66q64q02n05
$$ 455071 456489 457189 457047 456380 455981 456520 457881 459352 460483 461458 462563 463600 464055 463689 462825 462023 461518
60837D61518o34j543k819l625l607l234l093l187l157k884k476j923j137k87L27
$$ 461518 460884 459341 456522 452897 449290 446056 442963 439776 436619 433735 431259 429336 428199 427912 428239
60822D28239O46P57N51p7q05j153j234j688k666l389l198k580k579l362l959l673
$$ 428239 428885 429642 430193 430116 429311 428158 426924 425236 422570 419181 415983 413403 410824 407462 403503 399830
60806C99830l052l123l911m388l876k957k658l106l450l066k339k099k511k912
$$ 399830 396778 393655 389744 385356 381480 378523 375865 372759 369309 366243 363904 361805 359294 356382
60792C56382k636j795j074r02j033j010p74n92n12k53K76P17P19L89M1k20l91
$$ 356382 353746 351951 350877 349975 348942 347932 347158 346566 346054 345801 346077 346794 347513 347902 347943 347723 347332
60775C47332k57L79J250J816J914J938K296K948L498L562L107K538K356K525K387
$$ 347332 347075 347454 348704 350520 352434 354372 356668 359616 363114 366676 369783 372321 374677 377202 379589
60760C79589J518M44O8N03R67Q04J12o71j304j664j673j517j531j692j563r46
$$ 379589 381107 381551 381619 382122 383089 383893 384005 383334 382030 380366 378693 377176 375645 373953 372390 371444
60744C71444k15K22L97M27P1r64k535m130n297n748n344m314l279k760k685k622
$$ 371444 371229 371451 371848 372275 372346 371382 368847 364717 359420 353672 348328 344014 340735 337975 335290 332668
60728C32668k338j955j672j576j636j699j585j294j029r53r78q84m62M00J497
$$ 332668 330330 328375 326703 325127 323491 321792 320207 318913 317884 316931 315953 315069 314607 315007 316504
60713C16504K183J893R52L57N36Q41O08K18M88J387K095K243K308K681L017K834
$$ 316504 318687 320580 321532 321889 322425 323266 323874 324092 324580 325967 328062 330305 332613 335294 338311 341145
60697C41145K297K005K144K303K062J525J177J305J637J638J199Q73J232K130
$$ 341145 343442 345447 347591 349894 351956 353481 354658 355963 357600 359238 360437 361310 362542 364672
60683C64672K791K640J808Q46K28J66O11J175J345J008O38O89R18O64k70j415
$$ 364672 367463 370103 371911 372757 372985 373151 373762 374937 376282 377290 377928 378617 379535 380199 379929 378514
60667C78514k302k893l183k966k355k110k753l618l535k412j327r43o51L23J670
$$ 378514 376212 373319 370136 367170 364815 362705 359952 356334 352799 350387 349060 348117 347466 347789 349459
60652C49459K571K887K994K850K077R30L23O92J423J550O33j060k752l528l022
$$ 349459 352030 354917 357911 360761 362838 363768 364091 364783 366206 367756 368389 367329 364577 361049 358027
60637C58027j903j277j490j920j963j688j455j341j216r29l08N92J191Q56j45
$$ 358027 356124 354847 353357 351437 349474 347786 346331 344990 343774 342845 342537 343129 344320 345176 345031
60622C45031p48l55N23J112J288J240Q94K21k74n4O92J258J225O95p2p57j025
$$ 345031 344283 343928 344451 345563 346851 348091 348985 349206 348932 348878 349570 350828 352053 352748 352676 351919 350894
60605C50894p99m24j49K42R27J478J313N77m1j88m3K76Q55J535J829J530R69N42
$$ 350894 350095 349671 349522 349764 350691 352169 353482 354059 354018 353830 353787 354063 354918 356453 358282 359812 360781 361323
60587C61323L48L65N55P01N50L09N42J352K081K168J927K063K681L346L945M847
$$ 361323 361671 362036 362591 363292 363842 364151 364693 366045 368126 370294 372221 374284 376965 380311 384256 389103
60571C89103O167P429Q201Q682R314J0143J0908J1445J1647J1179R789P732N456
$$ 389103 395270 402699 410900 419582 428896 439039 449947 461392 473039 484218 494007 501739 507195
60558E07195K954J1k929m891n647o030o603o690n452l332j518l28Q98K388L486
$$ 507195 510149 510160 507231 502340 496693 490663 484060 477370 471918 468586 467068 466740 467638 470026 473512
60543D73512L883M358N814Q155J0609J2700J4454J5987J7336J8429J8917J8211
$$ 473512 477395 481753 487567 495722 506331 519031 533485 549472 566808 585237 604154 622365
60531F22365J6027J2756R081N335J467k544o325r156j0394j0105r277q959r185
$$ 622365 638392 651148 660229 665564 667031 664487 658162 649006 638612 628507 619230 610271 601086
60518F01086r099q189o917n914n167m347l435k485j159Q71L207N009O083P258
$$ 601086 591987 583798 576881 570967 565800 561453 558018 555533 554374 555245 558452 563461 569544 576802
60504E76802R486J2834J6540J9925K3043K6398L0252L4377L8415M2060M4795M5938
$$ 576802 586288 599122 615662 635587 658630 685028 715280 749657 788072 830132 874927 920865
60492I20865M5383M3856M1926L9036L4190K7393J9597J1401K668o468j5246k3217
$$ 920865 966248 1010104 1052030 1091066 1125256 1152649 1172246 1183647 1186315 1179847 1164601 1141384
60480A141384l0653l7612m3397m7454n0033n1406n1166m8988m5450m1455l7334
$$ 1141384 1110731 1073119 1029722 982268 932235 880829 829663 780675 735225 693770 656436
60469F56436l3189k9456k6303k3046j9146j5347j2853j1669j0768r669q755q098
$$ 656436 623247 593791 567488 544442 525296 509949 497096 485427 474659 464990 456235 448137
60457D48137p148n785m645m078l659l130k887l017k757j675p71j315k974m018
$$ 448137 440989 435204 430559 426481 422822 419692 416805 413788 411031 409356 408585 407270 404296 400278
60443D00278l436j986r18m82j70J76K20j11m19m58m20m78n03m79o65j016r73l52
$$ 400278 396842 394856 393938 393456 393286 393462 393682 393571 393152 392694 392274 391796 391293 390814 390149 389133 388160 387808
60425C87808N7n24j548j696o53N52J038J012R53P98M59M15J140K327L202L362
$$ 387808 387865 387341 385793 384097 383444 383996 385034 386046 386999 387797 388256 388671 389811 392138 395340 398702
60409C98702K901K105J363J056J143J200J077J057J202J135Q07P57J199J543J416
$$ 398702 401603 403708 405071 406127 407270 408470 409547 410604 411806 412941 413748 414505 415704 417247 418663
60394D18663J412K096K893K910K387K324K962L607L786L677L409K847K093J495
$$ 418663 420075 422171 425064 427974 430361 432685 435647 439254 443040 446717 450126 452973 455066 456561
60380D56561J111Q17R14J843L284M217M084L260K385J831J870K615L572L922L544
$$ 456561 457672 458489 459403 461246 464530 468747 472831 476091 478476 480307 482177 484792 488364 492286 495830
60365D95830L150L185L164K488J446Q79J149J831K390K814L590N114P124Q774
$$ 495830 498980 502165 505329 507817 509263 510142 511291 513122 515512 518326 521916 527030 534154 542928
60351E42928R412R206Q791Q420P777O557M853K843M19k459n216o801o754n916
$$ 542928 552340 561546 570337 578757 586534 593091 597944 600787 601206 598747 593531 586730 579976 574060
60337E74060n730o621p514p265o162n322m984m340l072j958j672j947k431l392
$$ 574060 568330 561709 554195 546930 540768 535446 530462 526122 523050 521092 519420 517473 515042 511650
60323E11650m883o021n917m802l465k204r61J04J074K599M947P207Q472R302J0895
$$ 511650 506767 500746 494829 490027 486562 484358 483397 483501 484575 487174 492121 499328 507800 517102 527997
60308E27997J3202J5016J5750J6051J6609J7337J7705J7161J5241J1966P907L372
$$ 527997 541199 556215 571965 588016 604625 621962 639667 656828 672069 684035 691942 695314
60296F95314j967p929j3043j6057j7620j9106k0326j9990j8077j5982j4230j1893
$$ 695314 693347 685418 672375 656318 638698 619592 599266 579276 561199 545217 530987 519094
60284E19094q650n697m009l144k425k014k060k049j755j781k410k915k715k288
$$ 519094 510444 504747 500738 497594 495169 493155 491095 489046 487291 485510 483100 480185 477470 475182
60270D75182k210k187j802j381j376j634j904k315k748k662k101j954k472k565
$$ 475182 472972 470785 468983 467602 466226 464592 462688 460373 457625 454963 452862 450908 448436 445871
60256D45871j481j65J68q5K69J203J640J282R82J329J971K302K055J274L49n1
$$ 445871 444390 444225 444393 444308 444577 445780 447420 448702 449684 451013 452984 455286 457341 458615 458964 458913
60240D58913K34M38j28r46j037n00k63n25m72L23J220J574J651K056K804L405
$$ 458913 459147 459585 459457 458511 457474 456974 456711 456186 455714 456037 457257 458831 460482 462538 465342 468747
60224D68747L536L296L074L268L957M657M731M138L605L846M799N736O077N910
$$ 468747 472283 475579 478653 481921 485878 490535 495266 499404 503009 506855 511654 517390 523467 529377
60210E29377N782O057O613P102P360P425P320P078O855O721O427N704M773M117
$$ 529377 535159 541216 547829 554931 562291 569716 577036 584114 590969 597690 604117 609821 614594 618711
60196F18711L816L480K881K154J408O07j09n77j133k326l986n142n227m707m289
$$ 618711 622527 626007 628888 631042 632450 633057 632948 632371 631238 628912 624926 619784 614557 609850 605561
60181F05561m066l929m154n010o060o453n775m394l060k378k393k542k293j760
$$ 605561 601495 597566 593412 588402 582342 575889 570114 565720 562660 560282 557889 555347 553054 551294
60167E51294j415j238p76j01R4m57j141j323j125r19p03l50K4L32P32J229J587
$$ 551294 549879 548641 547865 547764 547858 547401 546260 544937 543812 542893 542190 541840 541864 542196 542928 544157 545744
60150E45744J783K114K578K724K389J938J623J314J106J367J981K351K480L104
$$ 545744 547527 549641 552219 554943 557332 559270 560893 562207 563313 564680 566661 569012 571492 574596
60136E74596M391N491N878O098O536O524N512M154L280K675J881J331J561J995
$$ 574596 578987 584478 590356 596454 602990 609514 615026 619180 622460 625135 627016 628347 629908 631903
60122F31903J770J252J511K699M004M828N037M485L387K668K838K911J700k17
$$ 631903 633673 634925 636436 639135 643139 647967 653004 657489 660876 663544 666382 669293 670993 670776
60108F70776j188q90o01j156k085k932l941n036n461m933m161l722l366k874k660
$$ 670776 669588 668698 668097 666941 664856 661924 657983 652947 647486 642553 638392 634670 631304 628430 625770
60093F25770k916l002k370j483j091j115r05l17R1j20p21j172j255j318j834k763
$$ 625770 622854 619852 617482 615999 614908 613793 612888 612571 612662 612542 611821 610649 609394 608076 606242 603479
60077F03479l476l470k941k454k311k549l203m163n003n433n691o074o314n998
$$ 603479 600003 596533 593592 591138 588827 586278 583075 578912 573909 568476 562785 556711 550397 544399
60063E44399n340m953n012n181n217n079m639l873l211l013k863k089q42Q6N21
$$ 544399 539059 534106 529094 523913 518696 513617 508978 505105 501894 498881 496018 493929 493087 493173 493694
60048D93694J175K447L747M295M078L733L772M226M741M959M803M455M024L466
$$ 493694 494869 497316 501063 505358 509436 513169 516941 521167 525908 530867 535670 540125 544149 547615
60034E47615K922K661K470J631p7j925l199m009m609m696m237m221n428o981p402
$$ 547615 550537 553198 555668 557299 557222 555297 552098 548089 543480 538784 534547 530326 524898 517917 510515
60019E10515o729o287o540o689o358o183o408o320n604n069n231n274m246k485
$$ 510515 503786 497499 490959 484270 477912 471729 465321 459001 453397 448328 443097 437823 433577 431092
60005D31092j071m28k94m97r75j305j010k51L09M10N30J231K339L009K709K032
$$ 431092 430021 429593 429299 428802 427827 426522 425512 425261 425570 425980 426510 427741 430080 433089 435798 437830
59989D37830K137L229M152L900L014K720L077K949J740J61q77j268j366j374j446
$$ 437830 439967 443196 447348 451248 454262 456982 460059 463008 464748 464909 464032 462764 461398 460024 458578
59974D58578j864k665l472l832l548k668j561q22o45m39L79J402J738J350J073
$$ 458578 456714 454049 450577 446745 443197 440529 438968 438146 437501 437062 437441 438843 440581 441931 443004
59959D43004J324J627J511J109O81K87M9J37L23K12l6R4N19O34L63K96O01O56
$$ 443004 444328 445955 447466 448575 449256 449543 449592 449729 450052 450264 450228 450322 450841 451475 451838 452134 452735 453391
59941D53391M7q18j389j579j470j095o84n07l16L32J188J501J231J167J719K531
$$ 453391 453438 452620 451231 449652 448182 447087 446403 445896 445580 445912 447100 448601 449832 450999 452718 455249
59925D55249L485M945O661P476O744N250M136L710L750M083M290L645K054M60
$$ 455249 458734 463679 470340 477816 484560 489810 493946 497656 501406 505489 509779 513424 515478 515938
59911E15938k87l53k15K04J066J964K409K480K384J976J268R00J313J914J752
$$ 515938 515651 515298 515083 515287 516353 518317 520726 523206 525590 527566 528834 529734 531047 532961 534713
59896E34713Q25J16M47J770L381M555N120N469N875N917N151M096L686L765L279
$$ 534713 535538 535654 536101 537871 541252 545807 550927 556396 562271 568188 573339 577435 581121 584886 588165
59881E88165K124J590K377L344L090J909J180J471K098K181J362k13j982l288
$$ 588165 590289 591879 594256 597600 600690 602599 603779 605250 607348 609529 610891 610678 608696 605408
59867F05408l995m462m726m379l444k601k120j548q25o80j199j168K49K082L012
$$ 605408 601413 596951 592225 587846 584402 581801 579681 578133 577308 576628 575429 574261 574510 576592 579604
59852E79604L377M519O647Q630R629R748R282Q313P042N639L850J482q52k180
$$ 579604 582981 587500 594147 602777 612406 622154 631436 639749 646791 652430 656280 657762 656910 654730
59838F54730k289j808j399j376j836k619l341m007n125o757p983p995p167o371
$$ 654730 652441 650633 649234 647858 646022 643403 640062 636055 630930 624173 616190 608195 601028 594657
59824E94657n779n100m479m204m013l564l228l469l802l417k478j835j645j383
$$ 594657 588878 583778 579299 575095 571082 567518 564290 560821 557019 553602 551124 549289 547644 546261
59810E46261j083j391k394l357l833m144m546m616l805k110j56J146J230N30K00
$$ 546261 545178 543787 541393 538036 534203 530059 525513 520897 517092 514982 514826 515972 517202 517732 517932
59795E17932O80R72lj818l073l111k343j272j65N66O28L78K19k21j329k367k220
$$ 517932 518612 519584 519581 517763 514690 511579 509236 507964 507799 508365 508993 509371 509590 509369 508040 505673 503453
59778E03453j185o79j204j840j882j698j677j478q05M6Q40J730K581K810K369
$$ 503453 502268 501589 500385 498545 496663 494965 493288 491810 491005 491051 491891 493621 496202 499012 501381
59763E01381K044K393L065L522L776M008M200M448N011N728O134O382P186Q498
$$ 501381 503425 505818 508883 512405 516181 520189 524389 528837 533848 539576 545710 552092 559278 567776
59749E67776R142Q389P058O352O264N960N153M201L239K091R96N78R69J511J508
$$ 567776 576918 585307 592365 598717 604981 610941 616094 620295 623534 625625 626621 627199 628168 629679 631187
59734F31187R54L12j57o34j334k082k419k228j890j731j584j304j299j963k754
$$ 631187 632141 632453 632296 631662 630328 628246 625827 623599 621709 619978 618394 617090 615791 613828 611074
59719F11074k679j705q85r16j317j439j506k005k651k677j895q25J15R34J623
$$ 611074 608395 606690 605805 604889 603572 602133 600627 598622 595971 593294 591399 590574 590689 591623 593246
59704E93246J921J762J527J605J908K114K192K460L099L905M620N224N617N351
$$ 593246 595167 596929 598456 600061 601969 604083 606275 608735 611834 615739 620359 625583 631200 636551
59690F36551M134K471J195L61o90k074k901k557j705j441j928k558l033l535m152
$$ 636551 640685 643156 644351 644712 644022 641948 639047 636490 634785 633344 631416 628858 625825 622290 618138
59675F18138m874n923p322q335q121o874n584m666l676k387j323r69j076j126
$$ 618138 613264 607341 600019 591684 583563 576689 571105 566439 562763 560376 559053 558084 557008 555882
59661E55882r79p80n44p5Q50K251L709M538M493M135M094M240M002L282K395J369
$$ 555882 554903 554123 553579 553504 554354 556605 560314 564852 569345 573480 577574 581814 585816 589098 591493 592862
59645E92862n5j707l010l716m147m600n046n342n355m998m491m366m675m579l409
$$ 592862 592807 591100 588090 584374 580227 575627 570581 565239 559884 554886 550395 546029 541354 536775 533366
59630E33366j781q57q20r32q95j094j670k376l293m608n663n508m484l984m377
$$ 533366 531585 530728 529908 528976 528081 526987 525317 522941 519648 515040 509377 503869 499385 495401 491024
59615D91024m447l412k166j774j860j485o65k6M11J044J731J969J819J873K349
$$ 491024 486577 483165 480999 479225 477365 475880 475215 475189 475600 476644 478375 480344 482163 484036 486385
59600D86385K840K907K507J905J423J195J061Q65Q04J067J292R53K90M5K67J75
$$ 486385 489225 492132 494639 496544 497967 499162 500223 501088 501892 502959 504251 505204 505494 505539 505806 505981
59584E05981n73j459k182l102m127m258l030j501r12j090j165j117j555k333k608
$$ 505981 505408 503949 501767 498665 494538 490280 487250 485749 484837 483747 482582 481465 479910 477577 474969
59569D74969k102j321o32K7N05M25j31n67n69l65j27K73P88J010O90J43p6K89
$$ 474969 472867 471546 470914 470941 471446 471871 471740 471173 470604 470239 470112 470385 471173 472183 472873 473016 472940 473229
59551D73229J007J588J759J837K446L681M863N434N743O506P796R181J0668J2773
$$ 473229 474236 475824 477583 479420 481866 485547 490410 495844 501587 508093 515889 525070 535738 548511
59537E48511J5452J7550J7686J5529J1889P738L383j270n873r319j0507r324o644
$$ 548511 563963 581513 599199 614728 626617 634355 637738 636468 630595 621276 610769 601445 594801
59524E94801l518o02J725L203L825L788L134J786%j654k970m319n940p428q247
$$ 594801 591283 590681 592406 595609 599434 603222 606356 608142 608142 606488 603518 599199 593259 585831 577584
59509E77584q438q409q297p888p063o046n259m980m992m682l786k921k799l012
$$ 577584 569146 560737 552440 544552 537489 531443 526184 521204 516212 511530 507744 504823 502024 499012
59495D99012k413q84K49R0m87k10O99J084Q88J363L150N236O215N854N044M668
$$ 499012 496599 495715 495964 496054 495567 495357 496056 497140 498028 499391 502541 507777 513992 519846 524890 529558
59479E29558M904N370N665N801O185O997P614P116N362L302J984J481J004k6j248
$$ 529558 534462 539832 545497 551298 557483 564480 572094 579210 584572 587874 589858 591339 592343 592317 591069
59464E91069j758j137Q0J017J450J909K882M264N715P105Q363R170R312R189R407
$$ 591069 589311 588174 588254 589271 590721 592630 595512 599776 605491 612596 620959 630129 639441 648630 658037
59449F58037R888R815Q673O875N156L596J742n29k760m633o429q355r833r991
$$ 658037 667925 677740 686413 693288 698444 702040 703782 703253 700493 695860 689431 681076 671243 661252
59435F61252q843p418o579o196n664m809l973l518l544l741l294j314K176N973
$$ 661252 652409 644991 638412 632216 626552 621743 617770 614252 610708 606967 603673 602359 604535 610508
59421F10508Q802J0549J2129J4406J7540K0991K3905K5791K7042K8152K8284K5565
$$ 610508 619310 629859 641988 656394 673934 694925 718830 744621 771663 799815 828099 853664
59409H53664J9535J2206N721r8o521j3035j7400j8157j5487r952k470M417P500
$$ 853664 873199 885405 891126 891028 884507 871472 854072 835915 820428 810476 808006 812423 819923
59396H19923O011K108k410q124j5668k3113k7388k7433k4589k0569j6372j2638
$$ 819923 825934 828042 825632 817508 801840 778727 751339 723906 699317 678748 662376 649738
59384F49738r702p314n150l352k013o92Q37J922J972J585J785K541K950K632K040
$$ 649738 640036 632722 627572 624220 622207 621515 622352 624274 626246 627831 629616 632157 635107 637739 639779
59369F39779J548J046M97J52K35P18J367J788J763J808K827M872O772P570P681
$$ 639779 641327 642373 642870 643022 643257 643975 645342 647130 648893 650701 653528 658400 665172 672742 680423
59354F80423Q031Q772R593J0689J2400J4277J5465J5838J5957J6070J5923J5390
$$ 680423 688454 697226 706819 717508 729908 744185 759650 775488 791445 807515 823438 838828
59342H38828J4623J3695J2674J1765J0809Q940N487J015l199o475q983j1012j2713
$$ 838828 853451 867146 879820 891585 902394 911334 916821 917836 914637 908162 899179 888167 875454
59329H75454j4326j5848j6715j6507j5792j5471j5418j4648j2860j1044j0285
$$ 875454 861128 845280 828565 812058 796266 780795 765377 750729 737869 726825 716540
59318G16540j0503j0635r786q147o849o776p428p391o120m575l784l504k891j742
$$ 716540 706037 695402 685616 677469 670620 663844 656416 649025 642905 638330 634546 631042 628151 626409
59304F26409k76J639M110O595Q544J0127J1371J1177Q477L980n19m406q471j2880
$$ 626409 626133 627772 631882 638477 647021 657148 668519 679696 688173 692153 691634 687228 678757 665877
59290F65877j6278j7348j6181j3726j0768p797n158k842p13R88J859K200K858
$$ 665877 649599 632251 616070 602344 591576 583779 578621 575779 575066 576054 577913 580113 582971
59277E82971M190N739P078Q264R358J0271J1217J2541J3915J4383J3492J1765
$$ 582971 587161 592900 599978 608242 617600 627871 639088 651629 665544 679927 693419 705184
59265G05184R947Q356P126O308N439L736J052j840m203n987p354q147q302q254
$$ 705184 715131 723487 730613 736921 742360 746096 747148 745308 741105 735118 727764 719617 711315 703061
59251G03061q478q842q774p899o290m315k412q84K27J039J680K349L309M544N664
$$ 703061 694583 685741 676967 669068 662778 658463 656051 655167 655394 656433 658113 660462 663771 668315 673979
59236F73979O371O739O767O116M767L501L004K863K145O63j076k835m646o138
$$ 673979 680350 687089 693856 699972 704739 708240 711244 714107 716252 716915 715839 713004 708358 702220
59222G02220o862p293q381j0003j0901j0400r274q571q367q100p391o169m625
$$ 702220 695358 688065 679684 669681 658780 648380 639106 630535 622168 614068 606677 600508 595883
59209E95883l427l344m271n091m892l879k820k085j577j110n22K65J025J390J402
$$ 595883 592456 589112 584841 579750 574858 570979 568159 566074 564497 563387 562865 563130 564155 565545 566947
59194E66947J482J789K005J969J979K334K963L745M659N487N806N588N356N462
$$ 566947 568429 570218 572223 574192 576171 578505 581468 585213 589872 595359 601165 606753 612109 617571
59180F17571N556N149M349L721L558L568L299K701K253K460L145L482K967K154
$$ 617571 623127 628276 632625 636346 639904 643472 646771 649472 651725 654185 657330 660812 663779 665933
59166F65933K033K817L735L983L470K595J654N81q38k522l935m646n044n954p420
$$ 665933 667966 670783 674518 678501 681971 684566 686220 686801 685963 683441 679506 674860 669816 663862 656442
59151F56442q469q508q204q444r070r326r015q399p505o417n749n934o358o213
$$ 656442 647973 639465 631261 622817 613747 604421 595406 587007 579502 573085 567336 561402 555044 548831
59137E48831n712n499n284m338k990k270k174j678n01M96Q75J236K020K855L511
$$ 548831 543119 537620 532336 527998 525008 522738 520564 518886 518385 518881 519756 520992 523012 525867 529378
59122E29378M352N486O451P126P941Q863R288R234R530J0368J0877J0617J0310
$$ 529378 533730 539216 545667 552793 560734 569597 578885 588119 597649 608017 618894 629511 639821
59109F39821J0437J0278R191P773O839O094M855L367K340J742J039K38k83p11
$$ 639821 650258 660536 669727 677500 684339 690433 695288 698655 700995 702737 703776 704014 703731 703020
59095G03020j636k996l963l951l211k337j622j055o96q37j689k900l676l663l446
$$ 703020 701384 698388 694425 690474 687263 684926 683304 682249 681553 680716 679027 676127 672451 668788 665342
59080F65342l789m643n447o127p010p916q159p528o491n510m850m904n786o607
$$ 665342 661553 656910 651463 645336 638326 630410 622251 614723 608232 602722 597872 592968 587182 580575
59066E80575o217m750l454k902k525k046k018k608l033k794k346k026j416m09
$$ 580575 574358 569608 566154 563252 560727 558681 556663 554055 551022 548228 545882 543856 542440 542031
59052E42031J56k60j016j350j471j783j942j527r08n77k86L10Q23P67M51M34O28
$$ 542031 542187 541927 540911 539561 538090 536307 534365 532838 531930 531353 531067 531377 532200 532967 533418 533852 534480
59035E34480O93P34R24R91Q70J270K793M868O355O923P129P515Q216R130R949
$$ 534480 535173 535907 536831 537822 538692 539962 542755 547623 553978 560901 568030 575545 583761 592891 602840
59020F02840J0292J0230J0264J0442J0126Q994P525O031M054J384j135k660l512
$$ 602840 613132 623362 633626 644068 654194 663188 670713 676744 680798 682182 681047 678387 674875
59007F74875m344m852m334k998j684m89J229L605N811O915O663N511M357L942
$$ 674875 670531 665679 661345 658347 656663 656174 657403 661008 666819 673734 680397 685908 690265 694207
58993F94207M107L925K956J791R79P7j463l018l407k520j474j199j596k071k235
$$ 694207 698314 702239 705195 706986 707965 708042 706579 703561 700154 697634 696160 694961 693365 691294 689059
58978F89059j956j148K76K227M234N627O308P101Q675J0311J0771J0288J0424
$$ 689059 687103 685955 686231 688458 692692 698319 704627 711728 720403 730714 741485 751773 762197
58965G62197J1619J2378J1566J0051R057Q177O408M096K287P71j530m592p195
$$ 762197 773816 786194 797760 807811 816868 825045 831453 835549 837836 838607 837077 832485 825290
58952H25290q775j0019j1533j3111j4408j5367j5773j5334j4341j3447j2679j1413
$$ 825290 816515 806496 794963 781852 767444 752077 736304 720970 706629 693182 680503 669090
58940F69090r542p869p071o838o326n114l450j867p50j19K02K32j62q97j586j964
$$ 669090 659548 651679 644608 637770 631444 626330 622880 621013 620263 620144 620346 620578 620416 619519 617933 615969
58924F15969k093j985j510q06l23k61l80n05o07l81N10J585J859J298J028J716
$$ 615969 613876 611891 610381 609575 609252 608991 608611 608106 607499 607118 607628 609213 611072 612370 613398 615114
58908F15114K761L575M611O326Q193R614J0849J2122J2768J2332J1704J1985J2873
$$ 615114 617875 621450 626061 632387 640580 650194 661043 673165 685933 698265 709969 721954 734827
58895G34827J3322J3196J3041J2871J2435J2291J3282J5160J6866J7977J8759
$$ 734827 748149 761345 774386 787257 799692 811983 825265 840425 857291 875268 894027
58884H94027J9047J8288J6577J4542J2253R248N673K365k84k690n226p799j0295
$$ 894027 913074 931362 947939 962481 974734 983982 989655 992020 991736 989046 983820 976021 965726
58871I65726j2666j4541j5417j5318j4678j3685j2335j0994j0193r839r356q642
$$ 965726 953060 938519 923102 907784 893106 879421 867086 856092 845899 836060 826704 818062
58859H18062q309q816r814j0525j0529j0114r928j0208j0485j0264r792r559r274
$$ 818062 809753 800937 791123 780598 770069 759955 750027 739819 729334 719070 709278 699719 690445
58846F90445q296p012o566p028p165o529o300p277q399q363p515o954o749o336
$$ 690445 682149 675137 668571 661543 654378 647849 641549 634272 625873 617510 609995 603041 596292 589956
58832E89956n802n417m722l320j959j513j544j050n2P62J350K043K541K441K259
$$ 589956 584154 578737 574015 570695 568736 567223 565679 564629 564577 565339 566689 568732 571273 573714 575973
58817E75973K714L548M094M398M672M478L641L042L139K728P86j357j672n18p3
$$ 575973 578687 582235 586329 590727 595399 599877 603518 606560 609699 612427 613213 611856 610184 609666 609593
58802F09593j124k468l254l834m374m506m499n057n798n605m532l708l358k601
$$ 609593 608469 606001 602747 598913 594539 590033 585534 580477 574679 569074 564542 560834 557476 554875
58788E54875j354n90m46J69J606K769K875K560K597K847L005L222L473L313K659
$$ 554875 553521 552931 552485 552654 554260 557029 559904 562464 565061 567908 570913 574135 577608 580921 583580
58773E83580J913J086k67k020l424m136m447m486m194m003m383m827m427l389
$$ 583580 585493 586579 586312 584292 580868 576732 572285 567799 563605 559602 555219 550392 545965 542576
58759E42576k778k775k467j387o9R62J618J705J169Q25J602L142M300M781N069
$$ 542576 539798 537023 534556 533169 533100 534062 535680 537385 538554 539379 540981 544123 548423 553204 558273
58744E58273N045M278L429L741N074O014N979N676N503N091M510M347M480M264
$$ 558273 563318 567596 571025 574766 579840 585854 591833 597509 603012 608103 612613 616960 621440 625704
58730F25704L948M343N121N163M566M479M956M826L918L390L543L396K855L240
$$ 625704 629652 633995 639116 644279 648845 653324 658280 663106 667024 670414 673957 677353 680208 683448
58716F83448M922O401O573O191O172O085N221L797K264O54p75j622k488m681q248
$$ 683448 688370 694771 701344 707535 713707 719792 725013 728810 731074 731728 730953 729331 726843 722162 713914
58701G13914j1715j4164j6062j7672j8345j7942j7283j6628j5333j3503j2247
$$ 713914 702199 688035 671973 654301 635956 618014 600731 584103 568770 555267 543020
58690E43020j1704j0592q488o676n955n456m510l907m181m401l814l180l215l202
$$ 543020 531316 520724 512236 505560 499605 494149 489639 485732 481551 477150 473336 470156 466941 463739
58676D63739k316j065k69K36Q56J402J866K892M599O139P165Q408J0108J1174
$$ 463739 461423 460358 460089 460325 461181 462583 464449 467341 471940 478079 485244 493652 503760 514934
58662E14934J0805R560Q234O879N610M758L706J229k238m541m809m614n213n614
$$ 514934 525739 535299 543533 550412 556022 560780 564486 565715 563477 558936 554127 549513 544300 538686
58648E38686m661l088k074j480j058j638l524n193n359m909n161n499m462k142
$$ 538686 534025 530937 528863 527383 526325 524687 521163 515970 510611 505702 500541 495042 490580 488438
58634D88438K19J992L041K877J529L14K34L94n22k055k715k168j318p37l35p4
$$ 488438 488657 490649 493690 496567 498096 498410 498644 499038 498516 496461 493746 491578 490260 489523 489188 489114
58618D89114J13O13J555K429K992L723M819N636N779N700N603M910L473K062J069
$$ 489114 489227 489840 491395 493824 496816 500539 505358 510994 516773 522473 528076 532986 536459 538521 539590
58603E39590M7q80p24M80J172N62j53K6L04k84j187j533j453j064K88K577M458
$$ 539590 539637 538757 538033 538513 539685 540247 540094 540120 540424 540140 538953 537420 535967 534903 535191 537768 542226
58586E42226N251N982P338Q395Q585Q940J0011J0487R517Q437Q449Q481P296N868
$$ 542226 547477 553459 560797 569192 577777 586717 596728 607215 616732 625169 633618 642099 649395 655263
58572F55263N601N938N871O233Q157J0816J2940J5206J8729K2448K4471K4952
$$ 655263 660864 666802 672673 678906 687063 697879 710819 726025 744754 767202 791673 816625
58560H16625K5331K5642K4913K3270K1323J8382J3576Q038L684M76k912o321q254
$$ 816625 841956 867598 892511 915781 937104 955486 969062 977100 980784 981260 978348 972027 963773
58547I63773q413q015p856p847q184r274j0845j2484j4522j7068j9071j9794k0135
$$ 963773 955360 947345 939489 931642 923458 914184 903339 890855 876333 859265 840194 820400 800265
58534H00265k1006k1473k0275j8031j6029j3999j1099q146o616o132n105l352
$$ 800265 779259 757786 737511 719480 703451 689452 678353 670207 663591 657459 652354 649002
58522F49002k074j690j512j220j111j247j630k591l871m320l626l066l377l450
$$ 649002 646928 645238 643726 642506 641395 640148 638518 635927 632056 627736 624110 621044 617667 614217
58508F14217k551j990k748l315k089k17K70l80p31r10j667k107r96P20J279R59
$$ 614217 611666 609676 606928 603613 601524 601307 601577 601197 600466 599556 597889 595782 594786 595506 596785 597744
58492E97744J134J616J428J112J806L033L842M894P015R019R642J0142J2164J4434
$$ 597744 598878 600494 601922 603034 604840 607873 611715 616609 623624 632643 642285 652427 664591 679025
58478F79025J4718J3712J3673J4327J3605J1502R625P673L977r40m827p376j0053
$$ 679025 693743 707455 721128 735455 749060 760562 770187 777860 781837 780897 776070 768694 758641
58465G58641j2567j2955j1057q631o155k689J183L554M430N667P655R018R574
$$ 758641 746074 733119 722062 713431 707276 704587 705770 709324 713754 719421 727076 736094 745668
58452G45668J0537J1728J1603J0030Q228O104K596j547m410o170q559j1290j2239
$$ 745668 756205 767933 779536 789566 797794 803898 806494 804947 800537 794367 785808 774518 762279
58439G62279j1148r849q850o952m379k869k374r64J664L744M706N713O733O430
$$ 762279 751131 741282 732432 725480 721101 718232 715858 714894 716558 720302 725008 730721 737454 743884
58425G43884N313N556P190P776O423M903M119K754J91k275m030o031q379r694
$$ 743884 749197 754753 761943 769719 776142 781045 785164 787918 788109 785834 781804 775773 767394 757700
58411G57700r615r274q934p760o222n930o737o811n730m723l820j896M24J166
$$ 757700 748085 738811 729877 722117 715895 709965 703228 696417 690687 685964 682144 680248 680672 681838
58397F81838N33P64K274L193L015L265M211M335L540L446M056L519J736P76J166
$$ 681838 682371 683135 685409 688602 691617 694882 699093 703428 706968 710414 714470 717989 719725 720501 721667
58382G21667J193L38P4O88P92M47J344L393M557M479M829N780N815N270O207Q373
$$ 721667 722860 723198 723272 723960 724752 725199 726543 729936 734493 738972 743801 749581 755396 760666 766873 775246
58366G75246R283Q709R069J0845J1812J1467J1905J3476J3884J2520J1519J1515
$$ 775246 784529 793238 802307 813152 824964 836431 848336 861812 875696 888216 899735 911250
58354I11250J0546Q192O495N788L932Q32o90K52J137O99P34K033K870K932M383
$$ 911250 921796 929988 936483 942271 946203 947035 946345 946597 947734 948433 949167 951200 954070 957002 961385
58339I61385P565R845J0144J0530J2093J3376J3999J5454J7288J7040J4962J4087
$$ 961385 968950 978795 988939 999469 1011562 1024938 1038937 1054391 1071679 1088719 1103681 1117768
58327A117768J4675J3617J0336Q004P590O251L140J300J929K332J398J572L430
$$ 1117768 1132443 1146060 1156396 1164400 1171990 1178241 1181381 1182681 1184610 1186942 1188340 1189912 1193342
58314A193342M013K708L042O237Q706Q471Q431J0553J2454J2493J2736J4077J3961
$$ 1193342 1197355 1200063 1203105 1209342 1218048 1226519 1234950 1245503 1257957 1270450 1283186 1297263 1311224
58301A311224J1737J0815J2634J4047J3310J3100J4798J5685J4701J5062J8130
$$ 1311224 1322961 1333776 1346410 1360457 1373767 1386867 1401665 1417350 1432051 1447113 1465243
58290A465243K0560K0558K1028K3564K5406K5440K6869L0793L3524L3413L3881
$$ 1465243 1485803 1506361 1527389 1550953 1576359 1601799 1628668 1659461 1692985 1726398 1760279
58279A760279L6466L7772L6593L6991M0688M3571M3432M3897M6801M8267M6371
$$ 1760279 1796745 1834517 1871110 1908101 1948789 1992360 2035792 2079689 2126490 2174757 2221128
58268B221128M5121M6625M7110M5008M4942M9103N2804N3311N4724N9275O2514
$$ 2221128 2266249 2312874 2359984 2404992 2449934 2499037 2551841 2605152 2659876 2719151 2781665
58257B781665O2244O3285O7982P1133P0002O9970P4304P7943P7719P8864Q4733
$$ 2781665 2843909 2907194 2975176 3046309 3116311 3186281 3260585 3338528 3416247 3495111 3579844
58246C579844R0147R1927R5730J05042J13917J18249J23611J33970J43670J48952
$$ 3579844 3669991 3761918 3857648 3962690 4076607 4194856 4318467 4452437 4596107 4745059
58236D745059J56106J69421J82586J91156K01633K18727K35930K48618K63737
$$ 4745059 4901165 5070586 5253172 5444328 5645961 5864688 6100618 6349236 6612973
58227F612973K86250L09205L28003L50608L82336M15047M43423M76685N21576
$$ 6612973 6899223 7208428 7536431 7887039 8269375 8684422 9127845 9604530 10126106
58218A0126106N69704O15187O68095P36253Q11554Q89372R82786J101605J237483
$$ 10126106 10695810 11310997 11979092 12715345 13526899 14416271 15399057 16500662 17738145
58209A7738145J387161J569531J801864K081685K409327K800938L258746L759587
$$ 17738145 19125306 20694837 22496701 24578386 26987713 29788651 33047397 36806984
58201C6806984M298179M911845N640681O503616P541602Q837536J0459576J2436142
$$ 36806984 41105163 46017008 51657689 58161305 65702907 74540443 85000019 97436161
58193I7436161J4813671J7648322K0871957K4252918K7555017L0568711L2791318
$$ 97436161 112249832 129898154 150770111 175023029 202578046 233146757 265938075
58186B65938075L3228835L0902167K5669337J8306051R666437N2232j0345576
$$ 265938075 299166910 330069077 355738414 374044465 383710902 383763134 373417558
58179C73417558k0617200k9168896l4668757l6787854l6059062l3316173k9379669
$$ 373417558 352800358 323631462 288962705 252174851 216115789 182799616 153419947
58172A53419947k5000309k0768486j7004215j3802692j1171530r079587p436709
$$ 153419947 128419638 107651152 90646937 76844245 65672715 56593128 49156419
58165D9156419o129047n083661m261035l608184l067615k616388k253303j959161
$$ 49156419 43027372 37943711 33682676 30074492 27006877 24390489 22137186 20178025
58157B0178025j704892j485222j309534j169453j045384r34939q46780p75104
$$ 20178025 18473133 16987911 15678377 14508924 13463540 12528601 11681821 10906717
58149A0906717p05681o39058n84340n37723m88739m40090m01055l68568l33950
$$ 10906717 10201036 9561978 8977638 8439915 7951176 7511086 7110031 6741463 6407513
58140F407513l01026k79087k64713k48110k30954k21064k15591k05892j93420
$$ 6407513 6106487 5827400 5562687 5314577 5083623 4862559 4646968 4441076 4247656
58131D247656j85207j78890j67267j52752j42948j36525j27097j16523j10970
$$ 4247656 4062449 3883559 3716292 3563540 3420592 3284067 3156970 3040447 2929477
58122B929477j08161j01431r2393q7246q4460p8247p0410o6916o6146o2082n5939
$$ 2929477 2821316 2719885 2627492 2540246 2455786 2377539 2307129 2240213 2174067 2111985 2056046
58111B056046n3497n3832n1486m7121m5675m6444m4818m1433m0280m0297l7859
$$ 2056046 2002549 1948717 1897231 1850110 1804435 1757991 1713173 1671740 1631460 1591163 1553304
58100A553304l4890l5539l7542l5730l1369k9282k8509k4632j8882j6040j5492
$$ 1553304 1518414 1482875 1445333 1409603 1378234 1348952 1320443 1295811 1276929 1260889 1245397
58089A245397j2939r016p874r054q815p784r463j2906j4473j5024j7892k1588
$$ 1245397 1232458 1223442 1215568 1206514 1197699 1189915 1180452 1167546 1153073 1138049 1120157 1098569
58077A098569k2056k0351k0611k2195k1236j8454j7941j9453j9177j6991j5999
$$ 1098569 1076513 1056162 1035551 1013356 992120 973666 955725 936272 917095 900104 884105
58066H84105j6015j4272j1598j1239j2561j2230j0482j0108j0550r198p162p477
$$ 884105 868090 853818 842220 830981 818420 806190 795708 785600 775050 765852 758690 751213
58054G51213r049q577p008p695r680r338p304p156q420p606n175m764o246o240
$$ 751213 742164 733587 726579 718884 709204 699866 692562 685406 676986 669380 664205 659441 653195 646955
58040F46955m802n077o810o766n251n689p919q350o758o585q333q878p657p449
$$ 646955 642153 637076 630266 623500 618249 612560 604641 596291 589533 582948 574615 565737 558080 550631
58026E50631q637q633p410p782r644r640p252n695o003n665l912k986l338k729
$$ 550631 541994 533361 525951 518169 508525 498885 491633 485938 479935 474270 470358 467372 464034 461305
58012D61305j000p27k211k687j390o89j322j234lK49p07m83J322K179J301Q64
$$ 461305 460305 459578 457367 454680 453290 452601 451279 450045 450042 450291 449584 449101 450423 452602 453903 454767
57996D54767J641J660K32p99p88j300k598k994k375k507l340k979j737k018l693
$$ 454767 456408 458068 458300 457501 456713 455413 452815 449821 447446 444939 441599 438620 436883 434865 431172
57981D31172l992k618k402m046m777l456k540l447m159l173j993j867j566j48
$$ 431172 427180 424562 422160 418114 413337 409881 407341 403894 399735 396562 394569 392702 391136 390988
57967C90988J127J275J139J282J008L58L91Q45L37q07q89j37l96j547j727j201
$$ 390988 392115 393390 394529 395811 396819 397177 397568 398413 398750 397943 397054 396917 396521 394974 393247 392046
57951C92046k093m016m144k173r87j680k051j019k79m29L93K595M001M018M993
$$ 392046 389953 385937 381793 379620 378633 376953 374902 373883 373604 373175 373568 376163 380164 384182 389175
57936C89175P776R860R745R289R862R796P830N558M335K874N7k816m611o250q207
$$ 389175 396951 406811 416556 425845 435707 445503 453333 458891 463226 466100 466157 463341 458730 452480 444273
57921D44273q984p967p060p596q267p829p206p183o665m973l283k283r37R18J610
$$ 444273 435289 427322 420262 412666 404399 396570 389364 382181 375516 370543 367260 364977 364040 364958 366568
57906C66568P67N43K064L480L278K663K835K723J449L46N00P35Q9k07Q04J745
$$ 366568 367335 367878 369942 373422 376700 379363 382198 384921 386370 386716 387216 387951 388040 387833 388637 390382
57890C90382J298M75N20P69L83O1K20k38j701k598k173k057l324m425m045l461
$$ 390382 391680 392155 392675 393444 393827 393888 394108 393870 392169 389571 387398 385341 382017 377592 373547 370086
57874C70086m006m559l876l094l537m145l529k624k784l019j707M79J849K496
$$ 370086 366080 361521 357645 354551 351014 346869 343340 340716 337932 334913 333206 333685 335534 338030
57860C38030L540M775N343N635O495P420P433O849O514O270N666N063M704L879
$$ 338030 341570 346345 351688 357323 363818 371238 378671 385520 392034 398304 403970 409033 413737 417616
57846D17616K335J249J416J778J058m05j726k948m238m998m954m841m974m650
$$ 417616 419951 421200 422616 424394 425452 425047 423321 420373 416135 411137 406183 401342 396368 391718
57832C91718l775l410l762l617k663k299l019l343k522j922k252k028m82N80j03
$$ 391718 387943 384533 380771 377154 374491 372192 369173 365830 363308 361386 359134 357106 356624 357204 357101
57817C57101q54m2Q37l19k654m008m408n256o502p206p642q415q620p254n294
$$ 357101 356247 356205 357042 356723 354069 350061 345653 340397 333895 326689 319047 310632 302012 294758 289464
57802B89464m236l693k567j396j250j421m99J143K041J974J655J101J79k50L50
$$ 289464 285228 281535 278968 277572 276322 274901 274402 275545 277586 279560 281215 282316 282495 282245 282595
57787B82595Q95M78K75J702L848M903M969N384O250O751O987P472P703P202O866
$$ 282595 283490 283968 284243 285945 289793 294696 299665 305049 311299 318050 325037 332509 340212 347414 354280
57772C54280P432P662O137L719K197J579Q41J41O3k27j686l274l537l243l984
$$ 354280 361712 369374 375511 379230 381427 383006 383847 383988 384051 383824 382138 378864 375327 372084 368100
57757C68100n153m984l799l448m060m167l565l367l469k683j307r22j471j150
$$ 368100 362947 357963 354164 350716 346656 342489 338924 335557 332088 329405 328098 327176 325705 324555
57743C24555M71J612J067k25j002j249j459j701j964k219k067j321o52o06n52
$$ 324555 325026 326638 327705 327480 326478 325229 323770 322069 320105 317886 315819 314498 313846 313240 312688
57728C12688J33O09j35j321j540j078j166j487o06J447L114L604L396K701J350
$$ 312688 312821 313430 313295 311974 310434 309356 308190 306703 306097 307544 310658 314262 317658 320359 321709
57713C21709k8n89q55j849l154l616l523l954m401l520j877j494k552l094k198
$$ 321709 321681 321092 320237 318388 315234 311618 308095 304141 299740 296220 294343 292849 290297 287203 285005
57698B85005j039m00M46J694K129J182r1r49k018l562m434l824k602j936j695
$$ 285005 283966 283566 284012 285706 287835 289017 288926 287977 285959 282397 277963 274139 271537 269601 267906
57683B67906j095N2J496L146M966O897R163J2042J5331J8749K2659K7506L2898
$$ 267906 266811 266863 268359 271505 276471 283368 292531 304573 319904 338653 361312 388818 421716
57670D21716L8235M3729M9445N3792N4400N0321M2109L0181J4750k964k1047l8122
$$ 421716 459951 503680 553125 606917 661317 711638 753747 783928 798678 795714 774667 736545
57658G36545n2658o1815o3240n8109n0319m2578l5139k8118k2557j8660j5228
$$ 736545 683887 622072 558832 500723 450404 407826 372687 344569 322012 303352 288124
57647B88124j1669q740o708m644k272p07n75r43r29p94p93m48K84O01L21K85O51
$$ 288124 276455 267715 261007 256363 254091 253384 252809 251866 250937 250143 249350 248902 249186 249787 250108 250393 251044
57630B51044K90j239k623k621j717j033p67o27p71j332j870k017j968j864j508
$$ 251044 251334 250095 247472 244851 243134 242101 241334 240707 239936 238604 236734 234717 232749 230885 229377
57615B29377j061j040j338j285r63j145j679j311K88J742J869J147M72k05j154
$$ 229377 228316 227276 225938 224653 223690 222545 220866 219555 219843 221585 223454 224601 225073 224868 223714
57600B23714j916k064k056k411k789k654k246k124k322k518k547k349j910j527
$$ 223714 221798 219734 217678 215267 212478 209824 207578 205454 203132 200614 198067 195718 193808 192281
57586A92281j545j785j833j875k350k911k767k002j445j243q43m13p84j793k197
$$ 192281 190736 188951 187118 185243 182893 179982 177215 175213 173768 172525 171682 171269 170485 168692 166495
57571A66495j590r68r85j138j153j622k579k917k025p05K42J003J659J528N67
$$ 166495 164905 163937 162952 161814 160661 159039 156460 153543 151518 150813 151055 152058 153717 155245 155812
57556A55812J7O47J505J510J084J106J288Q99K72K56P87J106R93Q14P03N10K88
$$ 155812 155829 156476 157981 159491 160575 161681 162969 163868 164140 164396 165183 166289 167282 168096 168799 169309 169597
57539A69597K39M26R17J737K458K414J592O52j20r88j801j876j149m06oM64R77
$$ 169597 169836 170262 171179 172916 175374 177788 179380 180032 179912 178924 177123 175247 174098 173692 173686 174150 175127
57522A75127Q06Ok59M95J225J122Q52J140J424J074P79J416K432K579J636L80
$$ 175127 175933 175939 175680 176175 177400 178522 179374 180514 181938 183012 183791 185207 187639 190218 191854 192234
57506A92234n17o77J00J233J464M78l62P8R78Q80j33q86j037j176j393j154m77
$$ 192234 191717 191040 191140 192373 193837 194315 193953 194031 195009 195889 195756 194870 193833 192657 191264 190110 189633
57489A89633q8l78j073j794k243k045j198m78n83j119j067j78P75R91L57o63j444
$$ 189633 189545 189167 188094 186300 184057 182012 180814 180336 179753 178634 177567 177389 178164 179155 179512 178849 177405
57472A77405j667j629j872k326k352j797j336j435j746j872j993k210k084j354
$$ 177405 175738 174109 172237 169911 167559 165762 164426 162991 161245 159373 157380 155170 153086 151732
57458A51732m53K49R54J686J873J282N33Q6l67q68o22O28J679J385L50m7L74P74
$$ 151732 151279 151528 152482 154168 156041 157323 157856 157942 157575 156707 156085 156713 158392 159777 160127 160080 160454 161228
57440A61228Q23Q16P12K37k79k88l0j99p60j006o02J88J073J733J612N77m40l81
$$ 161228 162051 162867 163579 163816 163537 163249 163219 163020 162260 161254 160652 160840 161913 163646 165258 165835 165395 165014
57422A65014N58J279J320J113R07M00m95j313j679j696j537j123l25P77J839K363
$$ 165014 165572 166851 168171 169284 170191 170591 170096 168783 167104 165408 163871 162748 162423 163200 165039 167402
57406A67402K011J057J65m27j027j604j454k57J121J525Q17k10q37q25k24O38
$$ 167402 169413 170470 170635 170208 169181 167577 166123 165866 166987 168512 169329 169119 168282 167457 167233 167871
57390A67871J297J603J786J795J214J34n63k90M65R16J006J061J124J107J099
$$ 167871 169168 170771 172557 174352 175566 175700 175137 174847 175312 176228 177234 178295 179419 180526 181625
57375A81625R77L69n43r42n88l63q97j564j567j188j040q27Q1J368K161K230K039
$$ 181625 182602 182971 182428 181486 180898 180535 179638 178074 176507 175319 174279 173452 173533 174901 177062 179292 181331
57358A81331J881J829K068K578K850K578K145J867J453Q34O70J168J283J83j229
$$ 181331 183212 185041 187109 189687 192537 195115 197260 199127 200580 201414 202084 203252 204535 204718 203489
57343B03489j443m33N84J004J191J351J217Q04M57K61J37K62P13J101J139J090
$$ 203489 202046 201613 202197 203201 204392 205743 206960 207764 208221 208482 208619 208881 209594 210695 211834 212924
57327B12924J048N41l92p32q6L25n01j522j190M2N73K25R3L20J15k39M92K172
$$ 212924 213972 214513 214121 213389 213303 213628 213127 211605 210415 210457 211030 211255 211348 211668 211783 211544 212036 214208
57309B14208L146K768K254K485K687K086J329J383K142K977L677M174M180L761
$$ 214208 217354 220122 222376 224861 227548 229634 230963 232346 234488 237465 241142 245316 249496 253257
57295B53257L542L836M249M556N109O073O967P385P531P761Q233R179J0726J2291
$$ 253257 256799 260635 264884 269440 274549 280622 287589 294974 302505 310266 318499 327678 338404 350695
57281C50695J2926J2585J2206J2370J2708J2771J2660J2524J2326J2384J3230
$$ 350695 363621 376206 388412 400782 413490 426261 438921 451445 463771 476155 489385
57270D89385J4622J5553J5705J5929J6881J7924J8072J7285J6344J5941J6288
$$ 489385 504007 519560 535265 551194 568075 585999 604071 621356 637700 653641 669929
57259F69929J7104J7614J7112J5827J4779J4502J4513J4249J3788J3368J2904
$$ 669929 687033 704647 721759 737586 752365 766867 781380 795629 809417 822785 835689
57248H35689J2367J2016J1845J1410J0527R536Q573P342N966N292N700O334O222
$$ 835689 848056 860072 871917 883327 893854 903390 911963 919305 925271 930563 936263 942597 948819
57235I48819N725O015P489R433J1218J2982J5024J7027J8303J8579J8221J7662
$$ 948819 954544 960559 968048 977481 988699 1001681 1016705 1033732 1052035 1070614 1088835 1106497
57223A106497J6906J5742J4313J3054J2069J1066J0080R730J0423J1784J3333
$$ 1106497 1123403 1139145 1153458 1166512 1178581 1189647 1199727 1209457 1219880 1231664 1244997
57212A244997J5132J7262J9241K0738K2252K4245K6039K6699K6553K6615K6743
$$ 1244997 1260129 1277391 1296632 1317370 1339622 1363867 1389906 1416605 1443158 1469773 1496516
57201A496516K5829K3875K2389K2285K2640K2223K1245K0907K1906K4055K6715
$$ 1496516 1522345 1546220 1568609 1590894 1613534 1635757 1657002 1677909 1699815 1723870 1750585
57190A750585K9078L0548L1323L2128L3118L3617L3245L2557L2217L2155L2054
$$ 1750585 1779663 1810211 1841534 1873662 1906780 1940397 1973642 2006199 2038416 2070571 2102625
57179B102625L1913L1632L0715K9033K7474K7067K7743K8511K8661K8283K7828
$$ 2102625 2134538 2166170 2196885 2225918 2253392 2280459 2308202 2336713 2365374 2393657 2421485
57168B421485K7627K7793K8189K8488K8413K7924K7170K6366K5707K5102K4070
$$ 2421485 2449112 2476905 2505094 2533582 2561995 2589919 2617089 2643455 2669162 2694264 2718334
57157B718334K2326K0418J9358J9464K0030K0222J9888J9374J9010J9047J9705
$$ 2718334 2740660 2761078 2780436 2799900 2819930 2840152 2860040 2879414 2898424 2917471 2937176
57146B937176K0949K2383K3599K4561K5575K6924K8428K9368K9106K7936K6870
$$ 2937176 2958125 2980508 3004107 3028668 3054243 3081167 3109595 3138963 3168069 3196005 3222875
57135C222875K6342K5783K4886K4483K5237K6150K5652K3774K1865K0325J8240
$$ 3222875 3249217 3275000 3299886 3324369 3349606 3375756 3401408 3425182 3447047 3467372 3485612
57124C485612J5395J2972J1573R944O609J639m099j0358j7010k2950k6857k8781
$$ 3485612 3501007 3513979 3525552 3535496 3542105 3543744 3539645 3529287 3512277 3489327 3462470 3433689
57112C433689k9993l1591l4137l8187m3970n0706n7284o3569o9992p6043q0714
$$ 3433689 3403696 3372105 3337968 3299781 3255811 3205105 3147821 3084252 3014260 2938217 2857503
57101B857503q4866r1830j05017j26651j60807k17415l11543m57589F38524b88339
$$ 2857503 2772637 2680807 2575790 2449139 2288332 2070917 1759374 1301785 638524 -288339
57090a526032j578142j925466k249559k508552k654948k663088k562731k439757
$$ -1526032 -3104174 -5029640 -7279199 -9787751 -12442699 -15105787 -17668518 -20108275
57082b0108275k383374k412885k447801k352329k021334j444569p10203M5661
$$ -20108275 -22491649 -24904534 -27352335 -29704664 -31725998 -33170567 -33880770 -33835109
57074c3835109P06801J221253J600203J881828K094126K243085K323102K329735
$$ -33835109 -33128308 -31907055 -30306852 -28425024 -26330898 -24087813 -21764711 -19434976
57066a9434976K264752K137104J962918J761940J551553J344098J148631R71983
$$ -19434976 -17170224 -15033120 -13070202 -11308262 -9756709 -8412611 -7263980 -6291997
57058f291997Q17303O84116N71064M77323M01085L38964K87889K46198K12346
$$ -6291997 -5474694 -4790578 -4219514 -3742191 -3341106 -3002142 -2714253 -2468055 -2255709
57049b255709J84266J60671J41432J25886J12332R9822Q8921Q0078P2661O6203
$$ -2255709 -2071443 -1910772 -1769340 -1643454 -1531122 -1431300 -1342379 -1262301 -1189640 -1123437
57039a123437O0992N6723N2131M6833M2056L8684L5997L3225L0866K9409K8028
$$ -1123437 -1062445 -1005722 -953591 -906758 -864702 -826018 -790021 -756796 -725930 -696521 -668493
57028f68493K5714K2809K0541J9825K0991K3561K5771K5691K3423K0994J9479
$$ -668493 -642779 -619970 -599429 -579604 -558613 -535052 -509281 -483590 -460167 -439173 -419694
57017d19694J7804J5114J2538J1447J1418J1252J0748J0243R521Q469P779P871
$$ -419694 -401890 -386776 -374238 -362791 -351373 -340121 -329373 -319130 -309609 -301140 -293361 -285490
57005b85490Q025P557O890O490N865M625L404K696K022J207J208K420L614L852
$$ -285490 -277465 -269908 -263018 -256528 -250663 -246038 -242634 -239938 -237916 -236709 -235501 -233081 -229467 -225615
56991b25615M097N374O701O654N868O012P123P965Q365R177J0213J0229Q865O969
$$ -225615 -221518 -216144 -209443 -202789 -196921 -190909 -183786 -175821 -167456 -158279 -148066 -137837 -128972 -122003
56977a22003N022K741L75j016q15M97K082L395M261N033O342Q120R387R667R883
$$ -122003 -116981 -114240 -113865 -114881 -115696 -115199 -113117 -109722 -105461 -100428 -94086 -85966 -76579 -66912 -57029
56962e7029J0988J2534J3575e841H602J4262J3119J1585J0142P917L937r51m925
$$ -57029 -46041 -33507 -19932 -5841 8602 22864 35983 47568 57710 65627 69564 68613 63688
56949F3688p433r120j0065r797q638p462D968H47d70H41L543N739P640Q621R069
$$ 63688 56255 47135 37070 27273 18635 11173 4968 847 -470 841 4384 10123 17763 26384 35453
56934C5453J0072J1814J3579J5042J6168J5985J3190Q088K480k525p228j1824
$$ 35453 45525 57339 70918 85960 102128 118113 131303 139391 141871 139346 132118 120294
56922A20294j5578j7858j8742j8366j6740j4412F414c667p638n203l819l622l539
$$ 120294 104716 86858 68116 49750 33010 18598 6414 -3667 -11305 -16508 -20327 -23949 -27488
56909b7488k824j797r69m23k23m10n07j3O64P95P30J459K828L597L442L532M713
$$ -27488 -30312 -32109 -33078 -33501 -33724 -34134 -34641 -34654 -33990 -33195 -32465 -31006 -28178 -24581 -21139 -17607 -12894
56892a2894f418A796J0276J3070J6193J8956K1065K2259K2095K0612J8606J6716
$$ -12894 -6418 1796 12072 25142 41335 60291 81356 103615 125710 146322 164928 181644
56880A81644J4675J1777P740L056j067l286l202j857n68N01K022M156O506R097
$$ 181644 196319 208096 215836 218892 217825 214539 211337 209480 208912 209413 211435 215591 222097 231194
56866B31194J2363J6130J9622K2605K5607K8925L1992L3734L2990K8900K1681
$$ 231194 243557 259687 279309 301914 327521 356446 388438 422172 455162 484062 505743
56855E05743J2743L333o428j6408k5036l0306l1706l0005k5706j9175j1805n267
$$ 505743 518486 521819 515391 498983 473947 443641 411935 381930 356224 337049 325244 319977
56843C19977L16N993J2049J7975K4077L1267L9213M6499N2582N7727O0767N9138
$$ 319977 320293 326286 338335 356310 380387 411654 450867 497366 549948 607675 668442 727580
56831G27580N1752M0013K5369P845j1986l1350m6997n7441o2619o2567n7740m9684
$$ 727580 779332 819345 844714 852559 840573 809223 762226 704785 642166 579599 521859 472175
56819D72175m0262l0600k1321j3016n826P96P334J3803K0297K6984L3333L8183
$$ 472175 431913 401313 379992 366976 361150 361946 369280 383083 403380 430364 463697 501880
56807E01880M0856M1232L8655L2061K1520Q470n875k0988l5510m6826n2953n3903
$$ 501880 542736 583968 622623 654684 676204 684674 678799 657811 622301 575475 522522 468619
56795D68619n0757m4599l6877k9265k2363j5595q945l467N06M126Q199J2020J4965
$$ 468619 417862 373263 336386 307121 284758 269163 260218 256751 257257 261383 269582 281602 296567
56782B96567J7754K0918K3164K2682J9147J3388O003k515j1127j8854k5379l0277
$$ 296567 314321 335239 358403 381085 400232 413620 419623 417108 405981 387127 361748 331471
56770C31471l2549l2014l0119k8220k5901k2116j7250j2765r431p129n843n601
$$ 331471 298922 266908 236789 208569 182668 160552 143302 130537 121106 113977 108134 102533
56758A02533n697n227m191l319k944k799k640k380j918j309q27m59J32P98Q83
$$ 102533 96836 91609 87418 84099 81155 78356 75716 73336 71418 70109 69282 68823 68955 69753 70636
56743G0636L48N1L54M45k37r60r84q39j241j672j239k99O0l46p89q75o68mJ298
$$ 70636 70984 71035 71389 71834 71597 70637 69653 68814 67573 65901 64662 64363 64423 64077 63288 62413 61745 61741 63039
56724F3039K662L204K801K016J197M12K3M53J548K646L234L103K236R65p3n58
$$ 63039 65701 68905 71706 73722 74919 75331 75354 75807 77355 80001 83235 86338 88574 89539 89466 88908
56708H8908o84n34J23J127J782J765J549J413R50J5p46r29j057j564j947j698
$$ 88908 88224 87690 87813 88940 90722 92487 94036 95449 96399 96414 95668 94739 93682 92118 90171 88473
56692H8473j232j126j178j003q30r47j040p85m00k6N60J128R63K91N52K293M042
$$ 88473 87241 86115 84937 83934 83104 82157 81117 80332 79932 79906 80466 81594 82557 82848 83400 85693 89735
56675H9735M287L460K792K403J867J534J871K284K145K112K948L865L610K516
$$ 89735 94022 97482 100274 102677 104544 106078 107949 110233 112378 114490 117438 121303 124913 127429
56661A27429J773J319K32j216j714j066m40n28q48r12p65l37M24Q76L68m32k40
$$ 127429 129202 130521 130753 129537 127823 126757 126317 125789 124941 124029 123264 122927 123351 124227 124595 124163 123923
56644A23923R17J751J698J543J856K160J954J559J479J754K216K682K801K377
$$ 123923 124840 126591 128289 129832 131688 133848 135802 137361 138840 140594 142810 145492 148293 150670
56630A50670J843J739J824J407M53l78o92p19p86j021j462j993k419k990m207
$$ 150670 152513 154252 156076 157483 157936 157558 156866 156147 155361 154340 152878 150885 148466 145476 141269
56615A41269n688o032m642k803k041k179k177k001k279k733k491j670j176j199
$$ 141269 135581 129549 124907 122104 120063 117884 115707 113706 111427 108694 106203 104533 103357 102158
56601A02158j172r78r14o73L12J658K380K313K041J710J130P93J353K251K244
$$ 102158 100986 100008 99094 98421 98733 100391 102771 105084 107125 108835 109965 110758 112111 114362 116606
56586A16606J275N40O71J151J503J793J887J503J008J007J155O08m12p74k41K29
$$ 116606 117881 118421 119092 120243 121746 123539 125426 126929 127937 128944 130099 130707 130295 129521 129280 129509
56570A29509J20M9N46J363K193L112L954M326M325M494M961N399N615N354L939
$$ 129509 129629 129678 130224 131587 133780 136892 140846 145172 149497 153991 158952 164351 169966 175320 179259
56555A79259J303j053j540o56k56q68j357j198j256j917k222j538o99p31j498
$$ 179259 180562 179509 177969 177313 177057 176189 174832 173634 172378 170461 168239 166701 166002 165271 163773
56540A63773k182k304j768p56J05K15k09n06o40r74j230p87N6L60O5O0O39J105
$$ 163773 161591 159287 157519 156763 156868 157083 156874 156368 155728 154754 153524 152737 152793 153153 153218 153278 153917 155022
56522A55022R97N63L4m45k85Q26J784J176n26j400p78O0Q0k53k93j83rN70J295
$$ 155022 156019 156582 156616 156171 155886 156712 158496 159672 159146 157746 156968 157028 157108 156855 156562 156379 156370 156940 158235
56503A58235J182o9j605k662l127k868j793p04n88j011p58o0l31j529j904q65
$$ 158235 159417 159348 157743 155081 151954 149086 147293 146589 146001 144990 144232 144172 143841 142312 140408 139543
56487A39543L5k21m92L35J478J770J465J245Q51ko20m59j57k53j05Q10J592J263
$$ 139543 139578 139357 138865 139200 140678 142448 143913 145158 146009 146007 145387 144928 144771 144518 144413 145223 146815 148078
56469A48078M26K92Q55J189R96O65L53l1k20J62R90J741J939J351K53m48j40N30
$$ 148078 148504 148796 149651 150840 151836 152501 152854 152823 152603 152765 153755 155496 157435 158786 159039 158591 158451 158981
56451A58981N34J16L46J132J305P53O87J409J658Q42J20M23J097J375J593J987
$$ 158981 159515 159631 159977 161109 162414 163167 163854 165263 166921 167763 167883 168306 169403 170778 172371 174358
56435A74358J872J088O83J091J157J18r06o88K56Q02R04R21O00k7k3Q44J249L57
$$ 174358 176230 177318 178001 179092 180249 180367 179461 178773 179029 179831 180735 181656 182256 182229 182206 183050 184299 184656
56417A84656o40m06M60P79Q40J449K112J953J444J447J465N77p26j413j797k777
$$ 184656 184016 183610 184070 184849 185689 187138 189250 191203 192647 194094 195559 196136 195410 193997 192200 189423
56401A89423l847l747k632j789j545j169o28o81j273j373o90j78n81j423j712
$$ 189423 185576 181829 179197 177408 175863 174694 174066 173385 172112 170739 170049 169871 169290 167867 166155
56386A66155r98K91J236J235P09N67Q35P13J66K04J023J355N25k36K40J137J119
$$ 166155 165157 165448 166684 167919 168628 169195 170030 170743 170909 171113 172136 173491 174016 173780 174020 175157 176276
56369A76276N18M79R29J000P39P92R88P49L88O24J322J892K365K912K970K059
$$ 176276 176794 177273 178202 179202 179941 180733 181721 182470 182858 183482 184804 186696 189061 191973 194943 197002
56353A97002Q50K24J9j90L5R90J754J447P91P95R02J31p93l45J276K476K696K720
$$ 197002 197852 198076 198095 197905 197940 198930 200684 202131 202922 203717 204619 204750 203957 203612 204888 207364 210060 212780
56335B12780K810K412J576J094J128J190J331J989K826L033K744K830L407L741
$$ 212780 215590 218002 219578 220672 221800 222990 224321 226310 229136 232169 234913 237743 241150 244891
56321B44891L492K955K263J470J046J259J388O59m90j075r60n28L20J601K471
$$ 244891 248383 251338 253601 255071 256117 257376 258764 259423 258933 257858 256898 256370 256690 258291 260762
56306B60762K383K349L553N412O474O563O428N966M625L052K438K542K119J152
$$ 260762 263145 265494 269047 274459 280933 287496 293924 299890 304515 307567 310005 312547 314666 315818
56292C15818Q67J631K532L014L384L714L746L824M541N535O002O142O733P556
$$ 315818 316685 318316 320848 323862 327246 330960 334706 338530 343071 348606 354608 360750 367483 375039
56278C75039P760P590Q114R343J0164J0140J0041J0470J1277J2269J3407J4399
$$ 375039 382799 390389 398503 407846 418010 428150 438191 448661 459938 472207 485614 500013
56266E00013J5192J6475J8689K1006K2525K3822K6079K9338L3004L7296M2598
$$ 500013 515205 531680 550369 571375 593900 617722 643801 673139 706143 743439 786037
56255G86037M8079N2749N7250O2890O9505P6103Q2863R0561R8450J04947J09894
$$ 786037 834116 886865 944115 1007005 1076510 1152613 1235476 1326037 1424487 1529434 1639328
56244A639328J14102J17035J17209J14642J10565J04864R6048Q3839O9508N3502
$$ 1639328 1753430 1870465 1987674 2102316 2212881 2317745 2413793 2497632 2567140 2620642
56234B620642L5079J4627n783k4704m2325n8802p3302q5125r4254j00537j03833
$$ 2620642 2655721 2670348 2664565 2639861 2597536 2538734 2465432 2380307 2286053 2185516 2081683
56223B081683j04996j05173j04205j01239r6688r1784q6547q0266p3682o8394
$$ 2081683 1976687 1871514 1767309 1666070 1569382 1477598 1391051 1310785 1237103 1168709
56213A168709o4165n9188n3331m8623m5979m3635l9770l4876l0676k8100k6906
$$ 1168709 1104544 1045356 992025 943402 897423 853788 814018 779142 748466 720366 693460
56202F93460k6030k4048k0463j6633j4227j3105j2053j0935j0342r728q118o208
$$ 693460 667430 643382 622919 606286 592059 578954 566901 555966 545624 535896 527778 521570
56190E21570n467n500m657l049k389k952l263k864k806l184k805j620r16p71J47
$$ 521570 516103 510603 505946 502897 500508 497556 494293 491429 488623 485439 482634 481014 480098 479327 479474
56175D79474J866K786K507K458L157L374K741K568L390M016L866L986M968O031
$$ 479474 481340 484126 486633 489091 492248 495622 498363 500931 504321 508337 512203 516189 521157 527188
56161E27188O828Q003R429J0059J0078J0906J2683J4014J4652J5986J8385K0593
$$ 527188 534016 542019 551448 561507 571585 582491 595174 609188 623840 639826 658211 678804
56149F78804K2270K4728K8473L2545L6789M2324M9215N6184O3150P1379Q0533
$$ 678804 701074 725802 754275 786820 823609 865933 915148 971332 1034482 1105861 1186394
56138A186394Q8211R2976R5276R4994R0982Q3684P5270O6597N6842M6667L8473
$$ 1186394 1274605 1367581 1462857 1557851 1648833 1732517 1807787 1874384 1931226 1977893 2016366
56127B016366L2786K7536K1659J6154J0831L593n851j4934k2169k8901l6069m2659
$$ 2016366 2049152 2076688 2098347 2114501 2125332 2128925 2123074 2108140 2085971 2057070 2021001 1978342
56115A978342m8756n6538o6557p6228q3518q8953r2611r2596q8227q1399p3253
$$ 1978342 1929586 1873048 1806491 1730263 1646745 1557792 1465181 1372585 1284358 1202959 1129706
56104A129706o2808n0528l9656l2073k6167k0613j6718j5039j3341j0154p101
$$ 1129706 1066898 1016370 976714 944641 918474 897861 881143 866104 852763 842609 835508
56093H35508n506l982j592J2j58k45J123K558K975L693N335O199N736O144Q218
$$ 835508 830002 826020 824428 824440 824282 824037 825160 827718 830693 834386 839721 845920 851656 857800 866018
56078H66018R443Q555Q144J0085J2221J2389J1982J2598J2887J1774J1186J2473
$$ 866018 875461 884016 892160 902245 914466 926855 938837 951435 964322 976096 987282 999755
56066I99755J3614J3012J2522J3672J4512J3385J2216J2876J3861J3681J3847
$$ 999755 1013369 1026381 1038903 1052575 1067087 1080472 1092688 1105564 1119425 1133106 1146953
56055A146953J5264J5552J3314J1299J1897J3323J3638J4531J7427J9947K0088
$$ 1146953 1162217 1177769 1191083 1202382 1214279 1227602 1241240 1255771 1273198 1293145 1313233
56044A313233K0040K2009K4164K4476K4645K6452K8316K9141L1147L5096L7417
$$ 1313233 1333273 1355282 1379446 1403922 1428567 1455019 1483335 1512476 1543623 1578719 1616136
56033A616136L6219L5225L7416L9823L9303L8263L9522M0701L9179L7656L9042
$$ 1616136 1652355 1687580 1724996 1764819 1804122 1842385 1881907 1922608 1961787 1999443 2038485
56022B038485M0806M0169M0072M3937M9318N2723N5986O1663O7131O9551P1801
$$ 2038485 2079291 2119460 2159532 2203469 2252787 2305510 2361496 2423159 2490290 2559841 2631642
56011B631642P7006Q2211Q3970Q5024Q8823R2907R4544R7183J04098J11533J15623
$$ 2631642 2708648 2790859 2874829 2959853 3048676 3141583 3236127 3333310 3437408 3548941 3664564
56000C664564J19958J28447J37224J41954J46599J56023J66667J73860J81446
$$ 3664564 3784522 3912969 4050193 4192147 4338746 4494769 4661436 4835296 5016742
55991E016742J94377K08757K19615K31364K49790K70920K89127L08746L35780
$$ 5016742 5211119 5419876 5639491 5870855 6120645 6391565 6680692 6989438 7325218
55982G325218L65987L93594M23717M62880N05835N45823N89244O45351P10592
$$ 7325218 7691205 8084799 8508516 8971396 9477231 10023054 10612298 11257649 11968241
55973A1968241P78769Q57032R55178J069630J196016J347136J539931J776463
$$ 11968241 12747010 13604042 14559220 15628850 16824866 18172002 19711933 21488396
55965B1488396K056719K394920K800297L258032L756090M316331M974535N751927
$$ 21488396 23545115 25940035 28740332 31998364 35754454 40070785 45045320 50797247
55957E0797247O677552P812840R216576J0913955J2936675J5338530J8097416
$$ 50797247 57474799 65287639 74504215 85418170 98354845 113693375 131790791
55950A31790791K1046692K3979556K6719323K8885368K9626528K7913801K3326229
$$ 131790791 152837483 176817039 203536362 232421730 262048258 289962059 313288288
55943C13288288J6432809Q234796o33324r911497j9018953k6725713l1728900
$$ 313288288 329721097 337955893 337322569 327411072 308392119 281666406 249937506
55936B49937506l3475104l2366663k9335368k5354061k1202360j7389902j4139662
$$ 249937506 216462402 184095739 154760371 129406310 108203950 90814048 76674386
55929G6674386j1465674r307280p597870o255206n186587m326781l641873l095982
$$ 76674386 65208712 55901432 48303562 42048356 36861769 32534988 28893115 25797133
55921B5797133k645972k268033j958369j705705j488377j297906j140196j012412
$$ 25797133 23151161 20883128 18924759 17219054 15730677 14432771 13292575 12280163
55913A2280163r00521p99692p16342o49463n88864n32137m85654m48501m12026
$$ 12280163 11379642 10579950 9863608 9214145 8625281 8093144 7607490 7158989 6746963
55904F746963l75344l45582l22622k98602k72620k51662k36589k20832k03323
$$ 6746963 6371619 6026037 5703415 5404813 5132193 4880531 4643942 4423110 4219787
55895D219787j89788j80631j69791j56280j45280j37330j27515j15790j07313
$$ 4219787 4029999 3849368 3679577 3523297 3378017 3240687 3113172 2997382 2890069
55886B890069j02096r4716q4862p8142p5724p2852o8315o6233o7591o8677o8547
$$ 2890069 2787973 2693257 2608395 2530253 2454529 2381677 2313362 2247129 2179538 2110861 2042314
55875B042314o9731p1192o8876o3549o0080n8756n5358m9903m6965m6877m4929
$$ 2042314 1972583 1901391 1832515 1768966 1708886 1650130 1594772 1544869 1497904 1451027 1406098
55864A406098m0114l6757l6359l5540l3176l2271l3258l2507k8918k5556k3533
$$ 1406098 1365984 1329227 1292868 1257328 1224152 1191881 1158623 1126116 1097198 1071642 1048109
55853A048109k0506j6322j3868j3329j1705q929q399j0528j1894j1698j2935j6120
$$ 1048109 1027603 1011281 997413 984084 972379 963450 955051 944523 932629 920931 907996 891876
55841H91876j7988j7653j8061j9933k0130j7593j5340j4942j4335j2682j2122
$$ 891876 873888 856235 838174 818241 798111 780518 765178 750236 735901 723219 711097
55830G11097j3090j2961j0993r756j0195j0112q901q875j0409j0668q789p635
$$ 711097 698007 685046 674053 664297 654102 643990 635089 626214 615805 605137 596348 588713
55818E88713q669r704r322r002r302q440o341n602o719o787m659k875k656j583
$$ 588713 580044 570340 561018 552016 542714 534274 527933 522331 515612 508825 504166 501291 498635 497052
55804D97052J571M191M397M140N239O245N793N390O191O409M495J842q1k166n029
$$ 497052 498623 502814 507211 511351 516590 522835 528628 534018 540209 546618 551113 552955 552874 550708 545679
55789E45679o942o806o277o778p127o306n781o700p478o506m843l985l230j365
$$ 545679 538737 531931 525654 518876 511749 505443 499662 492962 485484 478978 474135 470150 466920 465555
55775D65555J246M254Q705J4681J9646K1166J9520J5978J0588L425m052j0760
$$ 465555 466801 471055 479760 494441 514087 535253 554773 570751 581339 584764 580712 569952
55763E69952j7226k3408k7243k7161k4316k0741j7046j3383j0717r464q536p296
$$ 569952 552726 529318 502075 474914 450598 429857 412811 399428 388711 379247 370711 363415
55751C63415o736p382p917p338o641o798o906n919m549l788l159k045j225j536
$$ 363415 356679 349297 341380 334042 327401 320603 313697 307778 303229 299441 296282 294237 293012 291476
55737B91476k381k892l249l655l502k814k940m441n722n179l387j968j490j696
$$ 291476 289095 286203 282954 279299 275797 272983 270043 265602 259880 254701 251314 249346 247856 246160
55723B46160k429l231l230k434j908j918j301M85K309L264M016N321O657P314
$$ 246160 243731 240500 237270 234836 232928 231010 229709 230194 232503 235767 239783 245104 251761 259075
55709B59075P376O798M986K146n15k661n161p920r338q808p786p384o929n970
$$ 259075 266451 273249 278235 280381 279866 277205 272044 264124 254786 245978 238192 230808 223879 217909
55695B17909n549o093o132m724l263l142l388k416p00K20J92K24P33J452K255
$$ 217909 212360 206267 200135 195411 192148 189006 185618 183202 182502 182722 182914 183138 183871 185323 187578
55680A87578K956L173L184L804M759M631L172J947J769J390j33j662j964j696
$$ 187578 190534 193707 196891 200695 205454 210085 213257 215204 216973 218363 218230 216568 214604 212908
55666B12908j804j691n92O41Q89O00P45J128J193J312J829K027J385P00P08Q32
$$ 212908 211104 209413 208821 209462 210351 210951 211696 212824 214017 215329 217158 219185 220570 221270 221978 222810
55650B22810N04L37P25Q27K29M7Q28J077m82k752m176n112o423p251o458n034
$$ 222810 223314 223651 224376 225203 225432 225479 226307 227384 226902 224150 219974 214862 208439 201188 194730 189696
55634A89696m769n497n739n257m787m108k540q31l91j047j425j182j063j170r40
$$ 189696 184927 179430 173691 168434 163647 159539 156999 156168 155777 154730 153305 152123 151060 149890 148950
55619A48950n25n48p95o29l87q10j557j734j523j786k487k842k683k274j353K48
$$ 148950 148425 147877 147082 146453 146066 145256 143699 141965 140442 138656 136169 133327 130644 128370 127017 127265
55603A27265J491J203r2q44o65m50p26j200j574j609p97P51J704J082q3j49P13
$$ 127265 128756 129959 129867 129023 128358 127908 127182 125982 124408 122799 122002 122753 124457 125539 125456 125307 126020
55586A26020J048N33J99M68P49Q61J357K237K763K689K597K922L622M636N795
$$ 126020 127068 127601 127800 128268 129017 129878 131235 133472 136235 138924 141521 144443 148065 152701 158496
55571A58496O495O404O171O462O751O140M807L516K199L51j618k784l212l753
$$ 158496 164991 171395 177566 184028 190779 196919 201726 205242 207441 207792 206174 203390 200178 196425
55557A96425m578n190n631o370p177p365o991o675o377n569m393l535l108k719
$$ 196425 191847 186657 181026 174656 167479 160114 153123 146448 140071 134502 130109 126574 123466 120747
55543A20747k408k352j958n53J292K276K101J591J282J135J283J873K231J562
$$ 120747 118339 115987 114029 113476 114768 117044 119145 120736 122018 123153 124436 126309 128540 130102
55529A30102L17l23j92k07p34j206j319j451j772k038k304k772l024k446j410
$$ 130102 130419 130096 129904 129697 128963 127757 126438 124987 123215 121177 118873 116101 113077 110631 109221
55514A09221r63j337j768j748j496j235j024j284k365l605l836k875j588n93J58
$$ 109221 108258 106921 105153 103405 101909 100674 99650 98366 96001 92396 88560 85685 84097 83504 83662
55499H3662N79L05n03j197j544j822k067k073k004k143k134j416k97K57j52j069
$$ 83662 84241 84546 84043 82846 81302 79480 77413 75340 73336 71193 69059 67643 67346 67603 67451 66382
55483F6382j981k559k354j182L45J435K032K430K448J944J528J739J947J268R6
$$ 66382 64401 61842 59488 58306 58651 60086 62118 64548 66996 68940 70468 72207 74154 75422 75518
55468G5518n28o51j071j656j523p40l31n29m91J54P95J027J040P98Q2n41j26J120
$$ 75518 74990 74339 73268 71612 70089 69349 69018 68489 67998 68152 68947 69974 71014 71812 71894 71353 71227 72347
55450G2347J927J775J343J062N71j88o02n64p21j216j245l79P25J325J398J171
$$ 72347 74274 76049 77392 78454 79025 78837 78235 77671 76950 75734 74489 74110 74835 76160 77558 78729
55434G8729P69N99J110J940K204J797J473J482J233M99n5Q6O48J239J719J821
$$ 78729 79498 80097 81207 83147 85351 87148 88621 90103 91336 91835 91780 91866 92514 93753 95472 97293
55418I7293J339Q76J337K473L012K484J815J765J864J362K64j055k426l610m169
$$ 97293 98632 99508 100845 103318 106330 108814 110629 112394 114258 115620 115884 114829 112403 108793 104624
55403A04624l963l224k123r27m66j344k721l000j919p81m63m39q1K80K03J8J66
$$ 104624 100661 97437 95314 94387 93921 92577 89856 86856 84937 84156 83693 83254 83173 83453 83656 83674 83840
55386H3840M90O72O45L02m64j228j306q00n06o04n19j57k25q69j199o33J81L69
$$ 83840 84330 85002 85647 85949 85485 84257 82951 82151 81645 81041 80522 80365 80140 79271 78072 77439 77620 77989
55368G7989l4m49n43l01Q7J78k35n51r5O86P41J46M6Q18J547J575J273R38K84
$$ 77989 77955 77506 76963 76662 76749 76927 76692 76141 76046 76732 77473 77619 77665 78483 80030 81605 82878 83816 84100
55349H4100n45p19j48J09n45j324j403j021o38j31M72N41j0k41L73R43N28m06
$$ 84100 83555 82836 82688 82797 82252 80928 79525 78504 77866 77735 78207 78748 78738 78497 78870 79813 80341 79935
55331G9935q05n49k31j15j33m19j028j543j558j184o88j51K42K00o3O4O02R17
$$ 79935 79130 78581 78350 78235 78102 77683 76655 75112 73554 72370 71682 71531 71773 71973 71910 71974 72576 73493
55313G3493Q34Q91J171R92J87l83j44L73N68N79N53J62n04o78j62K08j8j57K39
$$ 73493 74327 75218 76389 77381 77568 77185 77041 77414 77982 78561 79114 79276 78772 78094 77932 78140 78122 77965 78204
55294G8204M65jm33j37L36K96K23Q00J496J318L46n88j155j506j549j179o83k18
$$ 78204 78669 78668 78235 78098 78434 78730 78953 79753 81249 82567 82913 82325 81170 79664 78115 76936 76253 76035
55276G6035M44J049P70l21q37p5P29L32n20m74O0k51j316j802j275m87J93J004
$$ 76035 76479 77528 78298 77977 77140 77065 77794 78126 77606 77132 77192 76941 75625 73823 72548 72061 72254 73258
55258G3258J631J393N95K91O11P04L49K99Q27J239J189J270J819K136J498K91
$$ 73258 74889 76282 76877 77168 77779 78483 78832 79131 79958 81197 82386 83656 85475 87611 89109 89400
55242H9400m92m57q2m6n24j008q61j04N68O37K93r3m88q75j029j021j312j824
$$ 89400 88908 88451 88369 88323 87799 86791 85930 85826 86394 87031 87324 87231 86743 85868 84839 83818 82506 80682
55224H0682j666n29N16M13k36j30P50J252Q91L46J79J24j62m78m86j54K59M07
$$ 80682 79016 78487 79003 79416 79180 79050 79800 81052 81943 82289 82468 82592 82430 81952 81466 81312 81571 81978
55206H1978J58o9L40J163J344N39j04M32J415J349Q0j273k010k274k064j189p9
$$ 81978 82136 82067 82407 83570 84914 85453 85349 85781 87196 88545 88625 87352 85342 83068 81004 79815 79736
55189G9736M67M96P28J191J092K54m31l21J34K89K69N31J024J247R32L53P5L89
$$ 79736 80203 80699 81427 82618 83710 83964 83533 83212 83346 83635 83904 84435 85459 86706 87638 87991 88066 88455
55171H8455Q57O42m48j524j591o72M44J177J398J091L89k48n07o32q93j048p55
$$ 88455 89312 89954 89506 87982 86391 85719 86163 87340 88738 89829 90218 89970 89463 88831 87938 86890 86135
55154H6135k04K91Q14J392J567J104N82M66J98q08j881j843p61J68K92ml15o09
$$ 86135 85931 86222 87036 88428 89995 91099 91681 92147 92345 91537 89656 87813 87052 87220 87512 87508 87193 86584
55136H6584p14m17p1k39p58j005q68o70l45L16Q09M34m50q01m24j01j66n6O13
$$ 86584 85870 85453 85382 85143 84385 83380 82512 81842 81497 81813 82622 83056 82606 81805 81381 81280 81114 81058 81671
55117H1671J505K200K503K117J010Jm8M70M68m4k5P48J294J058N95L01k10r28
$$ 81671 83176 85376 87879 89996 91006 91007 90959 91429 91897 91853 91828 92576 93870 94928 95523 95824 95614 94686
55099I4686r99n7J052J511J485J244N18o15j234q14j02L4j73j07R8N5K9M27Q94
$$ 94686 93687 93630 94682 96193 97678 98922 99440 98825 97591 96777 96675 96709 96536 96429 96527 96582 96611 97038 97932
55080I7932Q38M03J14m5l80o53l63L23P19N99L22J04j92m91m04J37N60K59o79
$$ 97932 98770 99173 99287 99242 98862 98209 97846 98169 98888 99487 99809 99913 99721 99230 98826 98963 99523 99782 99103
55061I9103j481j477p89j68k2J42R40J948J946M81j371k141j388K19J746K465
$$ 99103 97622 96145 95356 95188 95166 95308 96248 98196 100142 100623 99252 97111 95723 95942 97688 100153
55045A00153K012O68n93r28m85j26k67m37j16M07L93k77q78q66o40q61j339j266
$$ 100153 102165 102833 102240 101312 100827 100701 100434 99997 99881 100288 100681 100404 99526 98660 98020 97159 95820 94554
55027I4554m99J89L05L07O83J113J081P23M17R2l30m09J15N63J63p16j136j010
$$ 94554 94055 94244 94549 94856 95539 96652 97733 98456 98873 98965 98635 98226 98341 98904 99067 98351 97215 96205
55009I6205j013j222j036l53K34M74P39J078R81K49o37j234j490j286l74R78K010
$$ 96205 95192 93970 92934 92581 92815 93289 94028 95106 96087 96336 95699 94465 92975 91689 91315 92293 94303
54992I4303K237J726O62n89j185n13P80J357R14L84M14O02M86K70K45L59O37J207
$$ 94303 96540 98266 98928 98339 97154 96641 97421 98778 99692 100076 100490 101092 101578 101848 102093 102452 103089 104296
54974A04296J717J578R93P75R55O18n04j392j233n92m28p92j137j175q43p2Q52
$$ 104296 106013 107591 108584 109359 110314 110932 110428 109036 107803 107211 106783 105991 104854 103679 102836 102764 103616
54957A03616J258R53N67O44R40R69O51N4p66j429j435r70p67r03p01j01J8n83
$$ 103616 104874 105827 106394 107038 107978 108947 109598 109652 108886 107457 106022 105052 104285 103382 102681 102580 102598 102015
54939A02015p91K04J557K027J681J416J475J450J267J127R64P16Q08J579K628
$$ 102015 101224 101428 102985 105012 106693 108109 109584 111034 112301 113428 114392 115108 115916 117495 120123
54924A20123L411M018M696N109M865M436M667N608O466O506N474L488J035j173
$$ 120123 123534 127552 132248 137357 142222 146658 151325 156933 163399 169905 175379 178867 179902 178729
54910A78729k814m156n333n975n970n870o011n836m793l329k294j856j734j888
$$ 178729 175915 171759 166426 160451 154481 148611 142600 136764 131971 128642 126348 124492 122758 120870
54896A20870k257k256j456l67K10K30J72K04L35Q42J782K433K206J638J711K467
$$ 120870 118613 116357 114901 114534 114744 114974 115146 115350 115685 116527 118309 120742 122948 124586 126297 128764
54880A28764L285M041M961N620N329M433M059M454M589L659K046M82r10k297l472
$$ 128764 132049 136090 141051 146671 152000 156433 160492 164946 169535 173194 175240 175722 174812 172515 169043
54865A69043m083m200m304m765n453n845n603n017m561m000k633o33O20K29r44
$$ 169043 164960 160760 156456 151691 146238 140393 134790 129773 125212 121212 118579 117946 118566 118795 117851
54850A17851j543j561j895k506k399j326k81p5m39p93r53q08j56O83Q93K46m85
$$ 117851 116308 114747 112852 110346 107947 106621 106340 106265 105826 105033 104080 103272 103116 103799 104692 104938 104453
54833A04453o24m72o22r32q11j63N11Q47R14Q39N21j14q38j238j094o18k53j82
$$ 104453 103829 103357 102735 101803 100992 100829 101340 102187 103101 103940 104461 104347 103509 102271 101177 100559 100306 100124
54815A00124j14L52J137J645J368N15j04J26R21J414J206P99P65R12P32L66L21
$$ 100124 100010 100362 101499 103144 104512 105027 104923 105049 105970 107384 108590 109389 110154 111066 111798 112164 112485
54798A12485M37J22l60K8J392K318J706K64o10p24p91q76l00R79J985J853P53
$$ 112485 112922 113044 112684 112712 114104 116422 118128 118392 117782 117058 116267 115391 115091 116070 118055 119908 120661
54781A20661m24q64l27O70J271J185R61J143J553J872K411L581N013N973O389
$$ 120661 120237 119373 119046 119716 120987 122172 123133 124276 125829 127701 130112 133693 138706 144679 151068
54766A51068O699O918O681O124N867O022N913M944L208J113j075l174m975o353
$$ 151068 157767 164685 171366 177490 183357 189379 195292 200236 203444 204557 203482 200308 195333 188980
54752A88980p273p667p556p201o875o572o053n063l416j332K80M35p01j813j985
$$ 188980 181707 174040 166484 159283 152408 145836 139783 134720 131304 129972 130252 130687 129986 128173 126188
54737A26188j615j343r88k38M06M09K64P36J528J847J853K355L293L804L717L816
$$ 126188 124573 123230 122242 122004 122410 122819 123083 123819 125347 127194 129047 131402 134695 138499 142216 146032
54721A46032M525N387N922O014N377L670J377m59j558k586l851m813n159n301
$$ 146032 150557 155944 161866 167880 173257 176927 178304 177845 176287 173701 169850 165037 159878 154577
54707A54577n440n076m064l230l315l849l837l046k072j410j018o47k25P7J3l64
$$ 154577 149137 144061 139997 136767 133452 129603 125766 122720 120648 119238 118220 117573 117348 117425 117438 117074
54691A17074n63j97M19N41j26j123j782j657o74P01J555J310L19o79j418j932
$$ 117074 116511 116314 116733 117274 117148 116025 114243 112586 111912 112613 114168 115478 115797 115118 113700 111768
54675A11768j968j365o90n79o90k97K82M9r26j356o64J58M9p26j244j106m32N58
$$ 111768 109800 108435 107745 107166 106476 106179 106461 106510 105584 104228 103564 103722 103771 103045 101801 100695 100263 100821
54657A00821J397J456P39O3M1M24P22Q49Q23M97pk05qR1l4K24J141J957J874J131
$$ 100821 102218 103674 104413 104476 104517 104941 105663 106512 107335 107832 107825 107620 107612 107703 107669 107893 109034 110991 112865 113996
54637A13996M31j18q33j624k075k030j595q20Q2N79M03M1J02M81O33M26K18K52
$$ 113996 114427 114309 113476 111852 109777 107747 106152 105332 105414 105993 106396 106437 106539 107020 107653 108079 108297 108549
54619A08549M38N93N28L3p45j164p01L52J156J202O74R1j81j09L7p6m79q31p42
$$ 108549 108987 109580 110108 110141 109396 108232 107531 107883 109039 110241 110915 111006 110825 110716 110753 110677 110198 109367 108625
54600A08625j80M63O34O5q14j084l06Q64J415J218R76J067J073N88j61o94q21
$$ 108625 108445 108908 109542 109607 108793 107709 107403 108267 109682 110900 111876 112943 114016 114604 114443 113749 112928
54583A12928n92k19j23n83j188j188m67K98N93N53L93P0k89l14o6q9m21k69Q01
$$ 112928 112336 112117 111994 111411 110223 109035 108568 108866 109459 110012 110405 110475 110186 109872 109806 109717 109296 109027 109828
54564A09828J981K163J275J57n26o83m45K3M52O18M69%o97j153p52M49J559J829
$$ 109828 111809 113972 115247 115404 114878 114195 113750 113773 114225 114843 115312 115312 114615 113462 112710 113159 114718 116547
54546A16547J459J137J157J246J032M18k84n06m3N31M84l5k23J43M57L22L1j91
$$ 116547 118006 119143 120300 121546 122578 122996 122712 122206 122163 122694 123178 123143 122920 123063 123520 123842 123873 123682
54528A23682n34q51n60K91P91N52L57P33R43K77n93o58k74m84j197j328o20J5
$$ 123682 123148 122297 121737 122028 122819 123371 123728 124461 125404 125681 125088 124430 124156 123672 122475 121147 120527 120542
54510A20542qk69l53m67p34o87j4P77R37L92l23p41q05o62l76Q6O46R69P26pp54
$$ 120542 120534 120265 119912 119445 118711 118024 118010 118787 119724 120116 119793 119052 118247 117585 117209 117295 117941 118910 119636 119629 118875
54489A18875j098r59m04M39J242J637J634J520J316P99J58n6K32M97N47Q37J415
$$ 118875 117777 116818 116414 116853 118095 119732 121366 122886 124202 125001 125159 125103 125335 125832 126379 127216 128631
54472A28631J479O73JN58J864K437J741O28J1p2q8l71r61j549j643j095m10j27
$$ 128631 130110 130783 130784 131342 133206 135643 137384 138012 138023 137951 137863 137492 136531 134982 133339 132244 131834 131707
54454A31707k22l88n67p32o18k11m5l83n68J4P45N15m87q28K09J659K173J548
$$ 131707 131485 131097 130530 129798 129180 128969 128924 128541 127973 127987 128732 129247 128760 127932 128141 129800 131973 133521
54436A33521N94l0l69p64j261j472j011p6O64Q33P00O14M52M1l08j64L96R13J102
$$ 133521 134115 134085 133716 132952 131691 130219 129208 129132 129796 130629 131329 131943 132395 132436 132128 131964 132360 133273 134375
54417A34375R18M19m0P4P22J058N08m11q84r09q53m82O09J930K524K300J949J674
$$ 134375 135293 135712 135672 135746 136468 137526 138034 137623 136739 135830 134977 134495 135104 137034 139558 141858 143807 145481
54399A45481J017k5q28j187j533j871j479j21J288J761J376Q33M93L19K65K21
$$ 145481 146498 146473 145645 144458 142925 141054 139575 139454 140742 142503 143879 144712 145205 145524 145789 146010
54383A46010j44r21j579j490o88J30L55j5n00o04k38L36Q63J319J738K003K057
$$ 146010 145866 144945 143366 141876 141188 141318 141673 141658 141158 140554 140316 140652 141515 142834 144572 146575 148632
54366A48632K006J857J490J118J378K413L351L284K495J961J863J477N03m13p29
$$ 148632 150638 152495 153985 155103 156481 158894 162245 165529 168024 169985 171848 173325 173828 173415 172686
54351A72686p87j172j886k544k917k906k434j726j365j659k146k115j558j214
$$ 172686 171899 170727 168841 166297 163380 160474 158040 156314 154949 153290 151144 149029 147471 146257
54337A46257j562k050j688m23M55k25j892k746j969n77J70L69P69J269J119K59
$$ 146257 144695 142645 140957 140534 140989 140764 138872 136126 134157 133580 133750 134119 134888 136157 137276 137535
54321A37535n91r68r50n10M11J243J134J27p98j020q24o25l87j17q6k46o6O73
$$ 137535 136944 135976 135026 134516 134927 136170 137304 137431 136633 135613 134789 134164 133777 133660 133574 133328 133262 133935
54303A33935J499J844J577P20o71k079k612k007r82k92J28O52J153J216Q63N50
$$ 133935 135434 137278 138855 139575 138904 136825 134213 132206 131224 130932 131060 131712 132865 134081 134944 135494
54287A35494N71P84Q08L66m36j016q17MO89P51M35J55r5n09r48r98m47M13R83
$$ 135494 136065 136849 137657 138023 137587 136571 135754 135758 136447 137198 137633 137788 137693 137184 136236 135238 134791 135204 136187
54268A36187R02M94N48J340K107J921R29J57J54M51M82L61M54P12P81N10O5k91
$$ 136187 137089 137583 138131 139471 141578 143499 144428 144585 144739 145190 145672 146033 146487 147199 147980 148490 148555 148264
54250A48264l56j61j8j78m57n39n09o92r95r59n42k27k25q9N72J432J832J510
$$ 148264 147908 147747 147729 147551 147094 146555 146046 145354 144359 143400 142858 142631 142406 142317 142889 144321 146153 147663
54232A47663P33q7o08o74l99o9J17Q7j69n20o46m18j98l85p86q68n65k94k75l14
$$ 147663 148396 148309 147701 147027 146628 146559 146676 146763 146594 146074 145428 145010 144812 144427 143641 142773 142208 141914 141639 141325
54212A41325l63o35j119j413j246p73k34K72N85M95P5k47j34L49Q61J004N97l7
$$ 141325 140962 140327 139208 137795 136549 135776 135542 135814 136399 136894 136969 136722 136588 136937 137798 138802 139399 139362
54194A39362k72O7N07P34J102J738J867Q09p34j416r93l23J20O21J226J439J096
$$ 139362 139090 139157 139664 140398 141500 143238 145105 145914 145180 143764 142771 142448 142568 143189 144415 145854 146950
54177A46950N53Nn11n19L05J124O99o96j504j143o29o90p49l51nKK77R59J098
$$ 146950 147503 147508 146997 146478 146783 147907 148606 147910 146406 145263 144634 143944 143195 142844 142839 142841 143118 144077 145175
54158A45175L01l23J1L75k75j253j361q87q49j007l84P84J233P02K08L08M16N5
$$ 145175 145476 145153 145164 145539 145264 144011 142650 141763 140914 139907 139523 140307 141540 142242 142450 142758 143174 143229
54140A43229l98m71k48j3Q7o7l60k71N09J421J650J180O04J87j36r0O40J594J918
$$ 143229 142831 142360 142112 142099 142186 142119 141759 141488 141997 143418 145068 146248 146852 147039 146903 146813 147453 149047 150965
54121A50965J525J051P55L11k67m04J53R91J646J977J823J066J27k33J66P64J122
$$ 150965 152490 153541 154296 154607 154340 153936 154089 155080 156726 158703 160526 161592 161719 161486 161652 162416 163538
54104A63538J241J058L24p51j384j029J07J495K712L320K967J933J142J274K179
$$ 163538 164779 165837 166161 165410 164026 162997 163104 164599 167311 170631 173598 175531 176673 177947 180126
54089A80126L270M150M623M509L764K627J428L39o63j772l154m577n308m817l479
$$ 180126 183396 187546 192169 196678 200442 203069 204497 204836 204173 202401 199247 194670 189362 184545 181066
54074A81066k219j479j009o01m44n81n79q9N96Q76N35j20o08n61J07J039J579
$$ 181066 178847 177368 176359 175758 175314 174733 174154 174065 174661 175537 176072 175952 175344 174783 174890 175929 177508
54057A77508J360P66O15J320K499L462L936M133M238M167L961M005M424M596L865
$$ 177508 178868 179634 180249 181569 184068 187530 191466 195599 199837 204004 207965 211970 216394 220990 224855
54042B24855K671K302L262M540M815M013L184L167L829M448M481L994L512L458
$$ 224855 227526 229828 233090 237630 242445 246458 249642 252809 256638 261086 265567 269561 273073 276531
54028B76531L674L713L430K978K371J594J055J190J539J036m47j765k034j765
$$ 276531 280205 283918 287348 290326 292697 294291 295346 296536 298075 299111 298664 296899 294865 293100
54014B93100j858k351k846l437m332n114n281n103n108n165m920m706n033n474
$$ 293100 291242 288891 286045 282608 278276 273162 267881 262778 257670 252505 247585 242879 237846 232372
54000B32372n111l953k941k580k514k383k222j932j324p57r09j656k090j845j591
$$ 232372 227261 223308 220367 217787 215273 212890 210668 208736 207412 206655 205746 204090 202000 200155 198564
53985A98564j871k199j876j055m25k42k24k55n95j280j708j088N83K223K653J850
$$ 198564 196693 194494 192618 191563 191138 190896 190672 190417 189822 188542 186834 185746 186329 188552 191205 193055
53969A93055Q43L26%m11l03R27K574L183K327J107P73J439K296K619K450K514
$$ 193055 193898 194224 194224 193813 193510 194437 197011 200194 202521 203628 204401 205840 208136 210755 213205 215719
53953B15719L511N310O990P829P990Q031Q181Q368Q447Q028O600M274J902j6j805
$$ 215719 219230 224540 231530 239359 247349 255380 263561 271929 280376 288404 295004 299278 301180 301164 299359
53938B99359l471m023k907j211l08L2P87J581J167k05o48Q12L028M444M800M697
$$ 299359 295888 291865 288958 287747 287439 287471 288258 289839 291006 290801 290153 290965 293993 298437 303237 307934
53922C07934M565M626M948N209N107N162O173P800Q814Q870Q880R295R343Q396
$$ 307934 312499 317125 322073 327282 332389 337551 343724 351524 360338 369208 378088 387383 396726 405122
53908D05122O890N324L491J384k86j222k127l402m253m041l538l827m723n350
$$ 405122 412012 417336 420827 422211 421925 420703 418576 415174 410921 406880 403342 399515 394792 389442
53894C89442n628o046o526o627o563o936p634p986p946q181q939r550r266q112
$$ 389442 383814 377768 371242 364615 358052 351116 343482 335496 327550 319369 310430 300880 291614 283502
53880B83502o747n770n184m440l181j908j482j875k087j617j303k143l839n192
$$ 283502 276755 270985 265801 261361 258180 256272 254790 252915 250828 249211 247908 245765 241926 236734
53866B36734n456m737l479k225j531j446j288n69J79Q2q35j731k025j765j156
$$ 236734 231278 226541 223062 220837 219306 217860 216572 216003 216182 216264 215429 213698 211673 209908 208752
53851B08752m18rl40j191j898k137k066j844j413q08k35J28J86p6l86k60L67Q55
$$ 208752 208334 208325 207985 206794 204896 202759 200693 198849 197436 196628 196393 196521 196707 196631 196245 195985 196352 197207
53833A97207O14l4k56J97Q22J147J152R93P63O05O26P26P13O37O49O70M89J80
$$ 197207 197821 197787 197531 197728 198550 199697 200849 201842 202605 203210 203836 204562 205275 205912 206561 207231 207720 207900
53815B07900J11N31J349K216K712K642K318K339K912L607M037M368M867N347N499
$$ 207900 208011 208542 209891 212107 214819 217461 219779 222118 225030 228637 232674 237042 241909 247256 252755
53800B52755N440N400N200M640M145M247M592M279L293K712L124L677L271K157
$$ 252755 258195 263595 268795 273435 277580 281827 286419 290698 293991 296703 299827 303504 306775 308932
53786C08932J503J617J459J38j842l257l712l817m065m232m090l981m300m815
$$ 308932 310435 312052 313511 313649 311807 308550 304838 301021 296956 292724 288634 284653 280353 275538
53772B75538n117n361n939o573o488n449m064k990k461k524l088l556l224k242
$$ 275538 270421 265060 259121 252548 246060 240611 236547 233557 231096 228572 225484 221928 218704 216462
53758B16462j537j525j564j074m30l03o94j161j501j690j609j316j151j126p27
$$ 216462 214925 213400 211836 210762 210332 210029 209335 208174 206673 204983 203374 202058 200907 199781 199054
53743A99054J63P29K58p18j026k95Q21J605J766J254K86n73r00r08r25p19O8J070
$$ 199054 199217 199946 200204 199486 198460 198165 198986 200591 202357 203611 203897 203324 202424 201516 200591 199872 199940 201010
53725B01010J521J355J188J270J190P85O23J236K265K793K385J570J245J632J961
$$ 201010 202531 203886 205074 206344 207534 208319 208942 210178 212443 215236 217621 219191 220436 222068 224029
53710B24029J443M47J76J042K108K439K327K440K556K050J278J331K402L487L779
$$ 224029 225472 225919 226095 227137 229245 231684 234011 236451 239007 241057 242335 243666 246068 249555 253334
53695B53334L586L466L345K900K319K111K370K573K115R32l27q71o96o49j311
$$ 253334 256920 260386 263731 266631 268950 271061 273431 276004 278119 279051 278724 277853 277157 276508 275197
53680B75197k110k066j181m54n62j136j504j559j633j876k073j924j357o77l10
$$ 275197 273087 271021 269840 269386 268824 267688 266184 264625 262992 261116 259043 257119 255762 255085 254775
53665B54775l06k25K37P82R93R70J017R57M15l63o33j65M50O18L91J33L3Q8K11
$$ 254775 254469 254244 254481 255263 256256 257226 258243 259200 259615 259252 258619 258454 258904 259522 259913 260046 260079 260167 260378
53646B60378K37J21J49N82J093J030L12l95m91m2O16J349K115K688K863K715K489
$$ 260378 260615 260736 260885 261467 262560 263590 263902 263507 263016 262974 263590 264939 267054 269742 272605 275320 277809
53629B77809K348K341K448K575K706L023L720M639N331N544N394N079M635M066
$$ 277809 280157 282498 284946 287521 290227 293250 296970 301609 306940 312484 317878 322957 327592 331658
53615C31658L528L211L146L196L229L348L785M448M677L862K356J235R73R52O00
$$ 331658 335186 338397 341543 344739 347968 351316 355101 359549 364226 368088 370444 371679 372652 373604 374204
53600C74204L56Q56J698J799Q01o03j640k042j850j288q77r66j146p09K81R43
$$ 374204 374560 375416 377114 378913 379714 379111 377471 375429 373579 372291 371414 370448 369302 368593 368874 369817
53584C69817O77k56j250j940k162j901j455j219j264j418j687k090k294j997j528
$$ 369817 370494 370238 368988 367048 364886 362985 361530 360311 359047 357629 355942 353852 351558 349561 348033
53569C48033j453j589j274n52k03m39m99O7O37N35J37K39Q41J214R61L92Lk3K24
$$ 348033 346580 344991 343717 343165 342962 342523 342024 342091 342728 343263 343400 343639 344480 345694 346655 347047 347050 347027 347251
53550C47251N71R09J250J577J761J766J889K432L197L666L680L566L605L795M097
$$ 347251 347822 348731 349981 351558 353319 355085 356974 359406 362603 366269 369949 373515 377120 380915 385012
53535C85012M446M623M591M900O035P465Q103P852P835Q839J0334J1434J2048
$$ 385012 389458 394081 398672 403572 409607 417072 425175 433027 440862 449701 460035 471469 483517
53522D83517J2579J3115J3497J3780J4065J4288J4565J5313J6619J7919J8757
$$ 483517 496096 509211 522708 536488 550553 564841 579406 594719 611338 629257 648014
53511F48014J9437K0479K1773K2792K3322K3495K3394K3077K2717K2348K1672
$$ 648014 667451 687930 709703 732495 755817 779312 802706 825783 848500 870848 892520
53500H92520K0578J9510J8920J8600J8031J7180J6492J6230J6240J6308J6354
$$ 892520 913098 932608 951528 970128 988159 1005339 1021831 1038061 1054301 1070609 1086963
53489A086963J6328J6155J5837J5484J5258J5321J5639J5806J5411J4582J3815
$$ 1086963 1103291 1119446 1135283 1150767 1166025 1181346 1196985 1212791 1228202 1242784 1256599
53478A256599J3220J2431J1347J0332R452Q126N919L200N48j948m414o703q664
$$ 1256599 1269819 1282250 1293597 1303929 1313381 1321507 1327426 1330626 1331174 1329226 1324812 1318109 1309445
53465A309445j0468j2148j3326j3857j4312j5192j6175j6741j7086j7600j7954
$$ 1309445 1298977 1286829 1273503 1259646 1245334 1230142 1213967 1197226 1180140 1162540 1144586
53454A144586j7649j7189j7628j8961j9934j9659j8581j7635j7201j7124j7119
$$ 1144586 1126937 1109748 1092120 1073159 1053225 1033566 1014985 997350 980149 963025 945906
53443I45906j6715j5335j2948j0264q042o407n054l766k474j201j82L06M53R53
$$ 945906 929191 913856 900908 890644 882602 876195 871141 867375 864901 863700 863518 863824 864277 865230
53429H65230K215L786M954N643O348P324Q450R781J1652J3922J5721J6437J6720
$$ 865230 867445 871231 876185 881828 888176 895500 903950 913731 925383 939305 955026 971463 988183
53416I88183J7796J9860K1820K2843K3465K4675K6463K8022K9063L0129L1633
$$ 988183 1005979 1025839 1047659 1070502 1093967 1118642 1145105 1173127 1202190 1232319 1263952
53405A263952L3384L5195L7184L9230M0791M1630M2206M3079M4354M5964M7883
$$ 1263952 1297336 1332531 1369715 1408945 1449736 1491366 1533572 1576651 1621005 1666969 1714852
53394A714852M9780N0985N1310N1340N1493N1364N0463M9070M7732M6382M4699
$$ 1714852 1764632 1815617 1866927 1918267 1969760 2021124 2071587 2120657 2168389 2214771 2259470
53383B259470M2829M1003L8765L5485L1463K7659K4351K0887J6850J2759R259
$$ 2259470 2302299 2343302 2382067 2417552 2449015 2476674 2501025 2521912 2538762 2551521 2560780
53372B560780O181K629k211q419j5174k1354k6536l1297l6260m1178m5401m8745
$$ 2560780 2566961 2569590 2567379 2558960 2543786 2522432 2495896 2464599 2428339 2387161 2341760 2293015
53360B293015n1281n2667n2641n1915n1556n1416n0333m8000m5567m3953m2610
$$ 2293015 2241734 2189067 2136426 2084511 2032955 1981539 1931206 1883206 1837639 1793686 1751076
53349A751076m0677l8531l7280l7157l7276l6826l5865l4947l4419l4067l3229
$$ 1751076 1710399 1671868 1634588 1597431 1560155 1523329 1487464 1452517 1418098 1384031 1350802
53338A350802l1372k8691k5950k3607k1525j9560j7933j6637j5113j3104j1410
$$ 1350802 1319430 1290739 1264789 1241182 1219657 1200097 1182164 1165527 1150414 1137310 1125900
53327A125900j0986j1515j1675j0829r771r515j0002j0356j0080r463q883q139
$$ 1125900 1114914 1103399 1091724 1080895 1071124 1061609 1051607 1041251 1031171 1021708 1012825 1004686
53315A004686o734m628k459q82J00R63J963K951L889N042O499P821Q568R001R876
$$ 1004686 997952 993324 990865 989983 990083 991046 993009 995960 999849 1004891 1011390 1019211 1027779 1036780 1046656
53300A046656J1613J3879J5946J7330J8148J9068K0697K2883K4681K5316K4987
$$ 1046656 1058269 1072148 1088094 1105424 1123572 1142640 1163337 1186220 1210901 1236217 1261204
53289A261204K4518K4362K4241K3658K2355K0339J7852J5394J3378J1677R734
$$ 1261204 1285722 1310084 1334325 1357983 1380338 1400677 1418529 1433923 1447301 1458978 1468712
53278A468712P223M420J812m31k578n125q398j2063j5123j6783j7417j8185j9665
$$ 1468712 1475935 1480355 1482167 1481736 1479158 1474033 1465635 1453572 1438449 1421666 1404249 1386064 1366399
53265A366399k1330k2562k3525k4609k5627k6159k6397k6916k7756k8363k8359
$$ 1366399 1345069 1322507 1298982 1274373 1248746 1222587 1196190 1169274 1141518 1113155 1084796
53254A084796k7844k7008k6063k5494k5676k6158k5949k4744k3314k2455k2118
$$ 1084796 1056952 1029944 1003881 978387 952711 926553 900604 875860 852546 830091 807973
53243H07973k1855k1552k1243k0727j9816j8773j7976j7369j6563j5305j3610
$$ 807973 786118 764566 743323 722596 702780 684007 666031 648662 632099 616794 603184
53232F03184j1680r898q626p838p202o717o741p274p781q071q571r348r669r253
$$ 603184 591504 581606 572980 565142 557940 551223 544482 537208 529427 521356 512785 503437 493768 484515
53218D84515r111j0092j1316j1290j0169r441r588r603q898q121p659o835n370
$$ 484515 475404 465312 453996 442706 432537 423096 413508 403905 395007 386886 379227 372392 367022
53205C67022m326m541n157m939m275m607o122p385p230o050m959m464m353m294
$$ 367022 362696 358155 352998 348059 343784 339177 333055 325670 318440 312390 307431 302967 298614 294320
53191B94320m162l954l707l516l457l486l393l033k605k552k930l115k555j608
$$ 294320 290158 286204 282497 278981 275524 272038 268645 265612 263007 260455 257525 254410 251855 250247
53177B50247j139j357j671j657j473j254q73n54r05j935k744k607j803r66l40
$$ 250247 249108 247751 246080 244423 242950 241696 240823 240269 239364 237429 234685 232078 230275 229309 228969
53162B28969o9m80j423k017j741j165q91m98N70J694J768Q19j15n46r19j460j714
$$ 228969 228900 228420 226997 224980 223239 222074 221183 220685 221255 222949 224717 225536 225421 224875 223956 222496 220782
53145B20782j407r38p39p69p73o22k61K09N12N91Q59J530K050J868J475J757K497
$$ 220782 219375 218437 217698 216929 216156 215534 215273 215482 215994 216585 217444 218974 221024 222892 224367 226124 228621
53128B28621K498J342N0k87K51R24J340J573J712J798J827J656J205P96Q78J309
$$ 228621 231119 232461 232511 232224 232475 233399 234739 236312 238024 239822 241649 243305 244510 245306 246184 247493
53112B47493J381P13l49j265j767j770j417j270j820k649k749j900j026q45r45
$$ 247493 248874 249587 249238 247973 246206 244436 243019 241749 239929 237280 234531 232631 231605 230760 229815
53097B29815p17m74q44j512j499o10K13J56m52p70o29n95r18j062o10j19m24j209
$$ 229815 229098 228624 227780 226268 224769 224159 224372 224528 224076 223306 222677 222082 221164 220102 219492 219373 218949 217740
53079B17740j199l3J022Q07k7j27M45M41m39j085q08l58n59j052j094p47n54n74
$$ 217740 216541 216508 217530 218337 218310 218183 218628 219069 218630 217545 216737 216379 215820 214768 213674 212927 212373 211799
53061B11799o00p62j218j589j382p18q2L61P55J087J271J435J637J563J005L76
$$ 211799 211199 210437 209219 207630 206248 205530 205448 205809 206564 207651 208922 210357 211994 213557 214562 214938
53045B14938J92K24j72r56j361r60l06k22q65j691k012j551o31J20M14O68J426
$$ 214938 215130 215354 215182 214226 212865 211905 211599 211377 210512 208821 206809 205258 204627 204747 205161 205829 207255
53028B07255K462K835J968L69r27j361j123o51k40o4j99n12o64m27P9N64Q67R85
$$ 207255 209717 212552 214520 214889 213962 212601 211478 210827 210587 210523 210324 209812 209148 208721 208800 209364 210231 211216
53010B11216R33P77P31R06R93N49l35r32o99N9N21K07o47j308j076J16J460J951
$$ 211216 212149 212926 213657 214563 215556 216105 215770 214838 214139 214198 214719 214926 214279 212971 211895 212011 213471 215422
52992B15422J500R97J053J220Q57K09j3L21P78J145J469J587J344J131J394J767
$$ 215422 216922 217919 218972 220192 221049 221258 221245 221566 222344 223489 224958 226545 227889 229020 230414 232181
52976B32181J508P18K43L66N06L26K18M18N25K44q2n6K68P15J185J322P93M8l3
$$ 232181 233689 234407 234650 235016 235522 235848 236066 236484 237009 237253 237171 237115 237383 238098 239283 240605 241398 241446 241413
52957B41413M91N61k20r24r09r48j868k993l072k131j231q65p21p62j316k136
$$ 241413 241904 242465 242245 241321 240412 239464 237596 234603 231531 229400 228169 227304 226583 225821 224505 222369
52941B22369k438k012j471j199q69k01M72P21N81L24M5k60m36k79K10P04P40J35
$$ 222369 219931 217919 216448 215249 214380 214179 214651 215372 215953 216277 216322 216062 215626 215347 215557 216261 217001 217136
52923B17136p00j063p93m77o09r16p98j51O09J056Q96K5j133j668j146j90L97
$$ 217136 216436 215373 214580 214103 213494 212578 211780 211629 212238 213294 214190 214215 213082 211414 210268 210078 210475
52906B10475P23J328J968J811P51l19o56l28K78R19J248R18J89j53J93O95Q61
$$ 210475 211198 212526 214494 216305 217056 216737 216081 215753 216031 216950 218198 219116 219305 219152 219345 220040 220901
52889B20901Q44Q69P00J76k98l79m02p88j160q58m0M89N24O95J283J594J022J08
$$ 220901 221745 222614 223314 223490 223192 222813 222411 221623 220463 219605 219565 220054 220578 221273 222556 224150 225172 225280
52871B25280j32L62P39N95N07R95J679J904J684J402R55rj132j446p12L0l28j627
$$ 225280 225148 225510 226249 226844 227351 228346 230025 231929 233613 235015 235970 235961 234829 233383 232671 232701 232373 230746
52853B30746k777l154l126l244l417l113k190j262j102j746k388k321j668r42
$$ 230746 227969 224815 221689 218445 215028 211915 209725 208463 207361 205615 203227 200906 199238 198296
52839A98296k64N09J052Q05Jk93M55J410J448N83j77j37M54R46R51N31J4k73k51
$$ 198296 198032 198541 199593 200398 200399 200106 200561 201971 203419 204002 203825 203688 204142 205088 206039 206570 206584 206311 206060
52820B06060j25j43m21r07j288j020J22J563K456K708K893L112K763J683O75L36
$$ 206060 205935 205792 205371 204464 203176 202156 202278 203841 206297 209005 211898 215010 217773 219456 220131 220467
52804B20467Q8q72k207k812k262j183l93k47o82j319j630j427j076r28q90q39
$$ 220467 220555 219683 217476 214664 212402 211219 210826 210579 209897 208578 206948 205521 204445 203517 202627 201788
52788B01788r46j140p71M38J623J740R82M55O48J038J061O88J26l85n20k45p9
$$ 201788 200842 199702 198931 199369 200992 202732 203714 204169 204817 205855 206916 207604 207730 207345 206825 206580 206501
52771B06501l74n88m2Q46R19j41j404j898j508o76OM5m49n48L71J512J546N12
$$ 206501 206127 205539 205497 206343 207262 207121 205717 203819 202311 201635 201641 201686 201237 200689 201060 202572 204118 204630
52753B04630k47l5M95P60J058J573J766J406J193J659K313K556K603K730K414
$$ 204630 204383 204348 204843 205603 206661 208234 210000 211406 212599 214258 216571 219127 221730 224460 226874
52738B26874J226r8m27K24Q26P71L59P9J19M78R82J192P80n3q72j533k010k056
$$ 226874 228100 228002 227575 227799 228625 229396 229755 229834 229953 230431 231413 232605 233385 233332 232460 230927 228917 226861
52720B26861j456n21J44K16k71j091j710j446k52R20J138O24K41J76j08p07r23
$$ 226861 225405 224884 225028 225244 224973 223882 222172 220726 220474 221394 222532 223156 223397 223573 223465 222758 221835
52703B21835l12O70J291J410J314J151Q61M39j4m02o28o15m56m36p04j082j297
$$ 221835 221523 222193 223484 224894 226208 227359 228220 228659 228645 228243 227615 227000 226544 226108 225404 224322 223025
52686B23025j340j421j556j363m75Q33J692J509O56Qj67l95j055j716j724j074
$$ 223025 221685 220264 218708 217345 216870 217703 219395 220904 221560 221568 221401 221006 219951 218235 216511 215437
52670B15437l08K53P15J167J452J418J108O43J66q4R6O12J109J327J344J413J705
$$ 215437 215129 215382 216097 217264 218716 220134 221242 221885 222051 221967 222063 222675 223784 225111 226455 227868 229573
52653B29573K163K539K581K307K012J819J394L45j064j959j775r37l89n48r89
$$ 229573 231736 234275 236856 239163 241175 242994 244388 244733 243669 241710 239935 238998 238609 238061 237072
52638B37072j108q22n01m20n48o95o30r4R58K052K489K057J244O03J83j83m64
$$ 237072 235964 235142 234641 234221 233673 232978 232348 232254 233212 235264 237753 239810 241054 241657 241840 241657 241193
52621B41193o33j047k033l193l664l125k118j221m24N21J462J923J640Q01j21
$$ 241193 240560 239513 237480 234287 230623 227498 225380 224159 223735 224256 225718 227641 229281 230082 229961
52606B29961o89p98p57q62r34n26L21R52R07N20L78M88M30J88L41J203K157K260
$$ 229961 229272 228474 227717 226855 225921 225395 225716 226668 227575 228095 228473 228961 229391 229579 229920 231123 233280 235540
52588B35540J421N69N21R93J074N03r8k36j41j26kL16K32p27j843j899q06K95
$$ 235540 236961 237530 238051 239044 240118 240621 240523 240287 240146 240020 240018 240334 240566 239839 237996 236097 235291 235586
52570B35586O53O59P56O09j06q80j092r89j139j311p93K92Q64K88q00j366j242
$$ 235586 236239 236898 237654 238263 238157 237277 236185 235196 234057 232746 231953 232245 233109 233397 232597 231231 229989
52553B29989j065j203j278q17LN93P23P48R25R90O50K17K79Q68J361J276P17R6
$$ 229989 228924 227721 226443 225626 225629 226222 226945 227693 228618 229608 230258 230475 230754 231622 232983 234259 234976 235072
52535B35072k34l7O67J365J391O56j99n34k79K60P93J124J126Q70N65K99R1O0
$$ 235072 234838 234801 235468 236833 238224 238880 238681 238147 237868 238128 238921 240045 241171 242041 242606 242905 242996 243056
52517B43056K02J36l80p06J66K166M002M713M633M328L481J633n10j576j230n70
$$ 243056 243258 243394 243014 242308 242474 244640 248642 253355 257988 262316 265797 267430 266920 265344 264114 263544
52501B63544p10j592k386k580k432k488k856k992k304r82Q4L42J25K3Q3K6j45
$$ 263544 262834 261242 258856 256276 253844 251356 248500 245508 243204 242222 242306 242648 242773 242796 242879 242905 242760
52484B42760k01j48j81k76k63j13J53O96J553K249K156J277L10r8J20N29O15K30
$$ 242760 242559 242411 242230 241954 241691 241578 241731 242427 243980 246229 248385 249662 249972 249874 249994 250523 251138 251368
52466B51368j02M33J937L376L646K888K279K494K938K554J000j160l043m030m051
$$ 251368 251266 251699 253636 257012 260658 263546 265825 268319 271257 273811 274811 273651 270608 266578 262527
52451B62527l574l212l174l128k665j789r47n75p09r55r31o49m06l36k75r3J4
$$ 262527 258953 255741 252567 249439 246774 244985 244038 243463 242754 241799 240868 240219 239813 239477 239202 239109 239123
52434B39123k15o96r93p21Q9R49J288R71M05K4j79l80m40r6N28J075J568K257
$$ 239123 238908 238212 237219 236498 236587 237536 238824 239795 240200 240224 240045 239665 239225 239129 239657 240732 242300 244557
52416B44557K890K829K068J425J490K004K594L411M611N863O907P989R131R501
$$ 244557 247447 250276 252344 253769 255259 257263 259857 263268 267879 273742 280649 288638 297769 307270
52402C07270Q244N659K863N59j344l152m958o563p345o644m737k997k429k448
$$ 307270 315514 321173 324036 324595 323251 320099 315141 308578 301233 294589 289852 286855 284426 281978
52388B81978j881p01N7j36p77j272j470j243l69R17J938K289K144J806J570J859
$$ 281978 280097 279396 279453 279317 278540 277268 275798 274555 274186 275103 277041 279330 281474 283280 284850 286709
52372B86709K889M139M757M519L900L252K625K260K403K543J676l43k324k991
$$ 286709 289598 293737 298494 303013 306913 310165 312790 315050 317453 319996 321672 321329 319005 316014
52358C16014k220q69J48M31K00N6L37O90O51M49O73J234J498J409J565K104K387
$$ 316014 313794 312925 313073 313504 313704 313760 314097 314787 315438 315887 316560 317794 319292 320701 322266 324370 326757
52341C26757K148K083K822M015M957N459N669N634N572O023P200Q601R769J0905
$$ 326757 328905 330988 333810 337825 342782 348241 353910 359544 365116 371139 378339 386940 396709 407614
52327D07614J2270J3473J3972J3910J3871J4074J4354J4668J5045J5261J5073
$$ 407614 419884 433357 447329 461239 475110 489184 503538 518206 533251 548512 563585
52316E63585J4630J4248J3946J3585J3236J3054J2976J2953J3177J3674J3886
$$ 563585 578215 592463 606409 619994 633230 646284 659260 672213 685390 699064 712950
52305G12950J3221J1892J0751J0425J0885J1637J1920J0997Q838O339M408K996
$$ 712950 726171 738063 748814 759239 770124 781761 793681 804678 813516 819855 824263 827259
52293H27259J520j7j152k035l440n472p151p679p443p233p025o251m916l653k743
$$ 827259 828779 828762 827610 825575 822135 816663 809512 801833 794390 787157 780132 773881 768965 765312 762569
52278G62569j802n02R60K310L585M827N808O395O867P537Q340R101R888J0624
$$ 762569 760767 760265 761225 763535 767120 771947 777755 784150 791017 798554 806894 815995 825883 836507
52264H36507J0722R845Q824Q989J0476J1960J2384J2095J1849J1527J0669R602
$$ 836507 847229 857074 865898 874887 885363 897323 909707 921802 933651 945178 955847 965449
52252I65449R104R201R189Q652P592N774K926l18k709l915m888o415q059q997
$$ 965449 974553 983754 992943 1001595 1009187 1014961 1017887 1017569 1014860 1010945 1006057 999642 991583 982586
52238I82586r138q875q368p772p595q131q768q594p571o518n969n621m984m183
$$ 982586 973448 964573 956205 948433 940838 932707 923939 915345 907774 901256 895287 889666 884682 880499
52224H80499l771l914m027l371j985p52l04j63N81J954L095L571L908M565N137
$$ 880499 876728 872814 868787 865416 863431 862679 862375 862212 862793 864747 867842 871413 875321 879886 885023
52209H85023N038M422L871L610L516L623L971M295M298M102L984L931L855L974
$$ 885023 890061 894483 898354 901964 905480 909103 913074 917369 921667 925769 929753 933684 937539 941513
52195I41513M501N221N829O409P026P185O332M802L499K670J646j34k388m489
$$ 941513 946014 951235 957064 963473 970499 977684 984016 988818 992317 994987 996633 996499 994111 989622
52181I89622o142p367q225q755q961q743q078p258o562n830m775l705l260l345
$$ 989622 983480 976113 967888 959133 950172 941429 933351 926093 919531 913701 908926 905221 901961 898616
52167H98616k977j574K06J345J703J854K074K172K130K201K291J915J057N41J024
$$ 898616 895639 894065 894271 895616 897319 899173 901247 903419 905549 907750 910041 911956 913013 913554 914578
52152I14578J902J852M93r90j135J80J750K477K331J908J536J128O22J22k93o50
$$ 914578 916480 918332 918825 917835 916700 916880 918630 921107 923438 925346 926882 928010 928632 928754 928461 927811
52136I27811r44j097j030n98M53K274M674P316J0054J2804J5224J6929J8096J9354
$$ 927811 926867 925770 924740 924142 924595 926869 931543 938859 948913 961717 976941 993870 1011966 1031320
52122A031320K0948K2357K3056K3282K3601K4007K3969K3247K2110K0769J9167
$$ 1031320 1052268 1074625 1097681 1120963 1144564 1168571 1192540 1215787 1237897 1258666 1277833
52111A277833J7393J5727J3993J1534Q296N483M369M704N044M506L542K858K444
$$ 1277833 1295226 1310953 1324946 1336480 1344776 1350259 1354628 1359332 1364376 1368882 1372424 1375282 1377726
52098A377726J955J369P10l85k217m461o597q728j1376j4484j7134j8375j8071
$$ 1377726 1379681 1381050 1381760 1381375 1379158 1374697 1368100 1359372 1347996 1333512 1316378 1298003 1279932
52085A279932j6861j5537j4477j3493j2145j0200p691m761j710P70K067K511L242
$$ 1279932 1263071 1247534 1233057 1219564 1207419 1197219 1189528 1184767 1183057 1183827 1185894 1188405 1191647
52072A191647M795O469P529Q370R662J0959J1301J0889J0887J1526J1686J0728
$$ 1191647 1196442 1202911 1210440 1218810 1228472 1239431 1250732 1261621 1272508 1284034 1295720 1306448
52060A306448R612R468R958R862Q774P378O292N371M119K363M11j347k998n131
$$ 1306448 1316060 1325528 1335486 1345348 1354122 1361500 1367792 1373163 1377282 1379645 1380056 1378709 1375711 1370580
52046A370580q068j1164j3350j4380j5017j5903j6884j7496j7537j6905j5563
$$ 1370580 1362512 1351348 1337998 1323618 1308601 1292698 1275814 1258318 1240781 1223876 1208313
52035A208313j3947j2834j2400j1971j1070j0087r595r596r869j0448j1186j1494
$$ 1208313 1194366 1181532 1169132 1157161 1146091 1136004 1126409 1116813 1106944 1096496 1085310 1073816
$$ [...]
##END NTUPLES=NMR SPECTRUM
##END=
