
##TITLE=AC1200_HiSAH12054_6666883_yLKwQD6Ayq
##JCAMPDX= 6.0         $$ Bruker NMR JCAMP-DX V2.0
##DATA TYPE= NMR SPECTRUM
##DATA CLASS= NTUPLES
##ORIGIN= BRUKER
##OWNER= Administrator
$$ 1.72 TOPSPIN		Version 2.1
$$ 2012-12-11 23:59:13.896 -0500  Administrator@X
$$ Compression mode = diff/dup
##.OBSERVE FREQUENCY= 400.02188249412
##.OBSERVE NUCLEUS= ^1H
##.ACQUISITION MODE= SIMULTANEOUS (DQD)
##.ACQUISITION SCHEME= undefined
##.AVERAGES= 8
##.DIGITISER RES= 22
##SPECTROMETER/DATA SYSTEM= spect
##.PULSE SEQUENCE= zg30
##.SOLVENT NAME= COFFEE_meoh
##.SHIFT REFERENCE= INTERNAL, COFFEE_meoh, 1, 14.98509
##AUDIT TRAIL= $$ (NUMBER, WHEN, WHO, WHERE, PROCESS, VERSION, WHAT)
$$ ##TITLE= Audit trail, TOPSPIN		Version 2.1
$$ ##JCAMPDX= 5.01
$$ ##ORIGIN= Bruker BioSpin GmbH
$$ ##OWNER= Administrator
$$ $$ E:\/data/COFFEE/nmr/AC1200_HiSAH12054_6666883_yLKwQD6Ayq/20/pdata/1/auditp.txt
$$ ##AUDIT TRAIL=  $$ (NUMBER, WHEN, WHO, WHERE, PROCESS, VERSION, WHAT)
(   1,<2012-12-11 23:59:05.474 -0500>,<Administrator>,<X>,<go>,<TOPSPIN 2.1>,
      <created by zg
	started at 2012-12-11 23:57:58.271 -0500,
	POWCHK enabled, PULCHK disabled,
       configuration hash MD5:
       86 BA 57 50 F2 9D 5C 9B 26 00 A9 28 5F 66 2E 89
       data hash MD5: 64K
       8A DD AB D1 A3 CD 79 5C 32 96 E4 B2 96 19 39 2B>)
(   2,<2012-12-11 23:59:08.677 -0500>,<Administrator>,<X>,<proc1d>,<TOPSPIN 2.1>,
      <Start of raw data processing
       efp LB = 0 FT_mod = 6 PKNL = 1 PHC0 = 0 PHC1 = 0 SI = 32K 
       data hash MD5: 32K
       CA 7F A6 A8 B2 8C E2 E4 B9 14 77 45 F7 D0 DE 23>)
(   3,<2012-12-11 23:59:09.161 -0500>,<Administrator>,<X>,<proc1d>,<TOPSPIN 2.1>,
      <pk PHC0 = 96.31165 PHC1 = 0 
       data hash MD5: 32K
       73 30 B8 5B 0B BD DC CF 78 E3 ED F2 6D 2F 1D 4C>)
(   4,<2012-12-11 23:59:09.443 -0500>,<Administrator>,<X>,<proc1d>,<TOPSPIN 2.1>,
      <abs ABSG = 1 
       data hash MD5: 32K
       F4 DD B3 6F DB 12 F5 F7 AB 38 9B 4A 06 3E A9 14>)
(   5,<2012-12-11 23:59:09.599 -0500>,<Administrator>,<X>,<proc1d>,<TOPSPIN 2.1>,
      <abs ABSG = 2 
       data hash MD5: 32K
       74 4E 85 49 85 A2 0F 54 3F 12 0D 11 6A F0 2E A1>)
(   6,<2012-12-11 23:59:09.771 -0500>,<Administrator>,<X>,<proc1d>,<TOPSPIN 2.1>,
      <abs ABSG = 3 
       data hash MD5: 32K
       5C BC A3 D1 30 89 EA 79 1A 5C 0A 15 E1 84 DF 51>)
(   7,<2012-12-11 23:59:09.927 -0500>,<Administrator>,<X>,<proc1d>,<TOPSPIN 2.1>,
      <abs ABSG = 4 
       data hash MD5: 32K
       BC 71 13 8E 03 6B 0F 5F 81 9B 8F 33 5B 84 52 8D>)
(   8,<2012-12-11 23:59:10.099 -0500>,<Administrator>,<X>,<proc1d>,<TOPSPIN 2.1>,
      <abs ABSG = 5 
       data hash MD5: 32K
       3D 37 54 DD 9C 99 1F 67 16 97 2F 42 73 1D 2F D7>)
$$ ##END=
$$ 
$$ $$ hash MD5
$$ $$ 50 9D 88 A8 CE FD C7 C1 F4 F3 5D 7F C6 C6 96 BE
##$RELAX= 
##$RELAX= 
##$RELAX= 
##$RELAX= 
##$RELAX= 
##$RELAX= 
##$RELAX= 
##$RELAX= 
$$ Bruker specific parameters
$$ --------------------------
##$DU= <E:\>
##$EXPNO= 20
$$ [...]
150 150 150 150 150 150 150 150
##$TP07= 0
##$TPNAME0= <>
##$TPNAME1= <>
##$TPNAME2= <>
##$TPNAME3= <>
##$TPNAME4= <>
##$TPNAME5= <>
##$TPNAME6= <>
##$TPNAME7= <>
##$TPOAL= (0..7)
0.5 0.5 0.5 0.5 0.5 0.5 0.5 0.5
##$TPOFFS= (0..7)
0 0 0 0 0 0 0 0
##$TUNHIN= 0
##$TUNHOUT= 0
##$TUNXOUT= 0
##$USERA1= <user>
##$USERA2= <user>
##$USERA3= <user>
##$USERA4= <user>
##$USERA5= <user>
##$V9= 5
##$VALIST= <valist>
##$VCLIST= <CCCCCCCCCCCCCCC>
##$VD= 0
##$VDLIST= <DDDDDDDDDDDDDDD>
##$VPLIST= <PPPPPPPPPPPPPPP>
##$VTLIST= <TTTTTTTTTTTTTTT>
##$WBST= 2048
##$WBSW= 25
##$XGAIN= (0..3)
0 0 0 0
##$XL= 0
##$YL= 0
##$YMAX_a= 628929
##$YMIN_a= -534753
##$ZGOPTNS= <>
##$ZL1= 120
##$ZL2= 120
##$ZL3= 120
##$ZL4= 120
##$ABSF1= 14.98509
##$ABSF2= -5.573092
##$ABSG= 5
##$ABSL= 3
##$ALPHA= 0
##$AQORDER= 0
##$ASSFAC= 0
##$ASSFACI= 0
##$ASSFACX= 0
##$ASSWID= 0
##$AUNMP= <proc_prof1d_extract_pilot.lims>
##$AXLEFT= 0
##$AXNAME= <>
##$AXNUC= <1H>
##$AXRIGHT= 0
##$AXTYPE= 0
##$AXUNIT= <>
##$AZFE= 0.1
##$AZFW= 0.1
##$BCFW= 0
##$BC_mod= 0
##$BYTORDP= 0
##$COROFFS= 0
##$CY= 15
##$DATMOD= 1
##$DC= 0
##$DFILT= <>
##$DTYPP= 0
##$F1P= 0
##$F2P= 0
##$FCOR= 0.5
##$FTSIZE= 32768
##$FT_mod= 6
##$GAMMA= 0
##$GB= 0
##$INTBC= 1
##$INTSCL= 1
##$ISEN= 128
##$LB= 0
##$LEV0= 0
##$LPBIN= 0
##$MAXI= 10000
##$MC2= 0
##$MEAN= 0
##$ME_mod= 0
##$MI= 0
##$NCOEF= 0
##$NC_proc= -8
##$NLEV= 6
##$NOISF1= 0
##$NOISF2= 0
##$NSP= 0
##$NTH_PI= 0
##$NZP= 0
##$OFFSET= 14.98509
##$PC= 1
##$PHC0= 96.31165
##$PHC1= 0
##$PH_mod= 1
##$PKNL= yes
##$PPARMOD= 0
##$PPDIAG= 0
##$PPIPTYP= 0
##$PPMPNUM= 2147483647
##$PPRESOL= 1
##$PSCAL= 4
##$PSIGN= 0
##$PYNMP= <proc.py>
##$REVERSE= no
##$SF= 400.02
##$SI= 32768
##$SIGF1= 0
##$SIGF2= 0
##$SINO= 400
##$SIOLD= 32768
##$SPECTYP= <>
##$SREGLST= <1H.CDCl3>
##$SSB= 0
##$STSI= 32768
##$STSR= 0
##$SW_p= 8223.68421052631
##$SYMM= 0
##$S_DEV= 0
##$TDeff= 65536
##$TDoff= 0
##$TI= <>
##$TILT= no
##$TM1= 0
##$TM2= 0
##$TOPLEV= 0
##$USERP1= <user>
##$USERP2= <user>
##$USERP3= <user>
##$USERP4= <user>
##$USERP5= <user>
##$WDW= 1
##$XDIM= 32768
##$YMAX_p= 476646116
##$YMIN_p= -1372942
##$CURPLOT= <Network HP LaserJet P1505>
##$CURPRIN= <$Network HP LaserJet P1505>
##$DFORMAT= <normdp>
##$LAYOUT= <+/1D_H.xwp>
##$LFORMAT= <normlp>
##$PFORMAT= <normpl>
##$SURQMSG= 1
$$ End of Bruker specific parameters
$$ ---------------------------------
##NTUPLES= NMR SPECTRUM
##VAR_NAME=  FREQUENCY,     SPECTRUM/REAL,   SPECTRUM/IMAG
##SYMBOL=    X,             R,               I
##VAR_TYPE=  INDEPENDENT,   DEPENDENT,       DEPENDENT
##VAR_FORM=  AFFN,          ASDF,            ASDF
##VAR_DIM=   32768,         32768,           32768
##UNITS=     HZ,            ARBITRARY UNITS, ARBITRARY UNITS
##FACTOR=    0.250966925370066, 1,           1
##FIRST=     8223.43324360094, 43540,        136052
##LAST=      0,             8928,            73470
##MIN=       0,             -1372942,        0
##MAX=       8223.43324360094, 476646116,    0
$$ Real data points
##PAGE= N=1
##DATA TABLE= (X++(R..R)), XYDATA
$$ [...]
19558B23479a34577l1767k22118J87803A10334A343J280L48760E7712e2407h360
19546A50779Q9016c1981j07014c2138A82720H7576k6385b66189A2920a72127D7177
19534f3626j59754B96548A24006n9854d7355a6460A9515a18954c7518C167c2303
19522d05494a91845A21512a15469k47455J19307C7322O8839i2021A42953d20752
19511D4406i6913n5500A32096q951c43405a22326J7053D7277a09323F3387J76218
19500B39605B5989a85871O3502k3327c6692k54778J38938a1587D6124a87491g2084
19488H2584a17022E8191b32501d2402E9159K6610M0372O4348c0380k81540A08056
19476a50792C08072f0992B48689a1963k7328n97605b03336k9656A24916e3092
$$ plain form
19558 223479 -134577 -166344 -388462 -200659 110334 1343 2623 351383 57712 -52407 -8360
19546 150779 239795 -31981 -138995 -32138 182720 87576 61191 -266189 12920 -172127 47177
19534 -63626 -223380 296548 124006 64152 -47355 -16460 19515 -118954 -37518 3167 -32303
19522 -405494 -191845 121512 -115469 -362924 -243617 37322 106161 -92021 142953 -420752
19511 44406 -96913 -152413 132096 123145 -343405 -122326 -105273 47277 -109323 63387 239605
19500 239605 25989 -185871 -122369 -145696 -36692 -291470 -152532 -11587 46124 -187491 -72084
19488 82584 -117022 58191 -232501 -42402 59159 85769 126141 190489 -30380 -311920 108056
19476 -150792 308072 -60992 248689 -11963 -39291 -636896 -203336 -232992 124916 -53092
19465b37559L0000e6435l2438j19440l017A80389b07982M7626c3021o3226q1785
19454a78032K9442j12504C24725b60966A09176j7684a27351A50882g9861k79089
19444c58950A30981o0103d32608a49758d4574n9839r8797j27992A99104l7100
19434A62004Q9561j11205b7217E6828g6007d345F0718K63684a65516g861J00A92238
19421d02675C6663c80470J50569A47481a0256j165j55999g776k3402m116l6148
19410g1442A90599J06103a84442A2049h7111j9307C5164J04484a19773J6510c9501
19398a41759N1208b9376G0183j5385a53193d1885j66280i3855j0460B76385c15017
19386A17373a97896k01065K6004c9342k23153R5874p6956R1621H220i0380G748
$$ plain form
19465 -237559 -207559 -56435 -88873 -208313 -211330 180389 -207982 -160356 -33021 -96247 -178032
19454 -178032 -148590 -261094 324725 -260966 109176 91492 -127351 150882 -79861 -358950
19444 -358950 130981 70878 -432608 -149758 -44574 -104413 -203210 -331202 199104 162004
19434 162004 251565 140360 -27217 56828 -76007 -4345 60718 324402 -165516 -7861 -7761 192238
19421 -402675 36663 -380470 -229901 147481 -10256 -11421 -167420 -7776 -31178 -35294 -71442
19410 -71442 190599 296702 -184442 12049 -87111 -106418 35164 139648 -119773 -103263 -39501
19398 -141759 -90551 -29376 70183 54798 -153193 -41885 -208165 -93855 -104315 276385 -315017
19386 117373 -197896 -398961 -372957 -39342 -262495 -166621 -243577 -151956 8220 -90380 7748
19374f7284A52439d44746B36416a26837A28650f9534n7830J4484l2952G567J8551
19363B6118b56831g1507A5247i2997j78218A24839k22k9474a04655A97823f1511
19351c33037A16703k241a50228j61098G8003a12071o6142j56018c9767B72534
19340a6049l51334n0426J61971A02625a12049k2382q9754j48497B6015d19888
19329A72941d2936o7928d5269A44974a85007B9950M5238b12683B46232b37640
19318A19388a63431A41447l3719b04104B85080c00296i9890A79702A7457i0789
19307c8100j32725g3666E1577M801c21282C0598d13924a67139L5359q8244A09340
19295a76677j39207R2601P4512e0365B84785E1466H900c38559e4683R598k29055
$$ plain form
19374 -67284 152439 -444746 236416 -126837 128650 -69534 -127364 -112880 -145832 7567 26118
19363 26118 -256831 -71507 15247 -92997 -271215 124839 124617 95143 -104655 197823 -61511
19351 -333037 116703 114462 -150228 -311326 78003 -112071 -178213 -334231 -39767 272534
19340 -16049 -367383 -417809 -255838 102625 -112049 -134431 -224185 -372682 26015 -419888
19329 172941 -42936 -110864 -45269 144974 -185007 29950 75188 -212683 246232 -237640
19318 119388 -163431 141447 107728 -204104 285080 -300296 -99890 179702 17457 -90789
19307 -38100 -170825 -73666 51577 56378 -321282 30598 -413924 -167139 -131780 -220024 109340
19295 -176677 -315884 -223283 -148771 -50365 284785 51466 8900 -338559 -54683 -45085 -274140
19284b74140D21661c7758D9114i7673H4975c42453P5553i8017m8306m9802j04673
19273c00798C3482J79196c7613j128D3431a55290E9191L1918h7580A2583c3222
19261A11002K92173I985J26831A5819R2453M6238b4045A3043d8452D757R6701
19250A01458a00263E33821A37078m6778e061j5384j382r1653K289B00030c37455
19238b58477A80040b98920h1237H9975N3368e2529A17558a90395K8283Q0039l24804
19227d06877a03138r3348a0926A99831a39284B34289r7292b4929l97730a9876
19216A62573F0655d1332j07262q0788c2855j39748j32055c9909A21173e3283j31499
19205a84782A28268b1329p2570B14523N542r9531m8698h9455A7239J23239a90648
$$ plain form
19284 -274140 421661 -37758 49114 -97673 84975 -342453 -266900 -98017 -146323 -196125 -300798
19273 -300798 33482 212678 -37613 -38741 43431 -155290 59191 91109 -87580 12583 -33222
19261 111002 403175 9985 136816 15819 108272 154510 -24045 13043 -48452 4757 101458
19250 101458 -100263 533821 137078 90300 -5061 -20445 -21827 -113480 -111191 200030 -337455
19238 -258477 180040 -298920 -81237 89975 143343 -52529 117558 -190395 -162112 -82073 -406877
19227 -406877 -103138 -196486 -10926 199831 -139284 234289 136997 -24929 -422659 -19876
19216 162573 60655 -41332 -148594 -229382 -32855 -172603 -304658 -39909 121173 -53283 -184782
19205 -184782 128268 -21329 -93899 214523 220065 120534 71836 -89455 17239 140478 -190648
19193A05094f21069A5901Q3046e09360J29111J37959e2724D9028a52k95020A6572
19181B24141a59528O9347P363A30219e1847A16533i0441r6878B30604l7795G1158
19169G5309e05979a91621M9323I4b77043a23618C4310c08011N2529k10095b06964
19157b44182l8804C4483R1157i9703q6117j25523f4053l3101D2776a2876p5160
19146h8036K0042j12280j16382A9844b06329d4942j16407b5369A19206B6279c86322
19134C39820a99230D878b43809j24046i8188k41768a54685C4322a262A27442a70647
19122A96775I6840J32882a28788a6509D6837J40913F1648L42886a23808e580j55706
19111a61286I5222f8950j9024E5795k1749K7769g4316r438c9439E7226R8146E5312
$$ plain form
19193 105094 -621069 15901 98947 -509360 -380249 -242290 -52724 49028 -152 -295172 16572
19181 224141 -159528 -90181 -82818 130219 -51847 116533 -90441 -187319 230604 192809 71158
19169 75309 -505979 -191621 -142298 94 -277043 -123618 34310 -308011 -255482 -465577 -206964
19157 -244182 -282986 34483 125640 -99703 -185820 -311343 -64053 -97154 42776 -12876 -88036
19146 -88036 -67994 -180274 -296656 19844 -206329 -44942 -161349 -25369 119206 26279 -386322
19134 339820 -199230 4878 -243809 -367855 -98188 -339956 -154685 34322 -1262 127442 -170647
19122 196775 96840 229722 -128788 -16509 46837 187750 61648 404534 -123808 -5580 -161286
19111 -161286 95222 -68950 -87974 55795 34046 61815 -74316 -83754 -39439 57226 155372 55312
19098B78775b08825g7638J3004l35361A66138b20293Q6082G1570g6168c6928B24783
19086E012b02850q2813h1830p0139D4120a77754A66106j2113K60536a71348g9280
19074E2213J25055P0857f6313k10383a08827I8987b69711f3114m0944A24830A6917
19062a41596B33641d23663a63259j87406J17426k09431A18896a68470G4721f8966
19051C6827a73746I637O1898a25776A21736l8159b38473j44948H4455a45947C1173
19039G1721K83552a97906A29693a8776F689J54318a68032C63708l6876L546g3850
19027e2913A86352d6854j82666A87035a61123D0087O1268J64434J9944a27185
19016b62556j96870G0256d03568B58446a28328A9616a86715e9261l4458B0171
$$ plain form
19098 278775 -208825 -77638 -64634 -399995 166138 -220293 -134211 71570 -76168 -36928 224783
19086 5012 -202850 -285663 -81830 -151969 44120 -177754 166106 153993 414529 -171348 -79280
19074 52213 177268 248125 -66313 -276696 -108827 98987 -269711 -63114 -104058 124830 16917
19062 -141596 233641 -423663 -163259 -350665 -233239 -442670 118896 -168470 74721 -68966
19051 36827 -173746 9637 71535 -125776 121736 83577 -238473 -383421 84455 -145947 31173
19039 71721 355273 -197906 129693 -18776 6689 161007 -168032 363708 326832 330378 -73850
19027 -52913 186352 -46854 -229520 187035 -161123 40087 101355 265789 285733 -127185
19016 -262556 -459426 70256 -403568 258446 -128328 19616 -186715 -59261 -93719 20171
19005A66546g9536L2525r2029n1563M947m1362H1641g761B20806E3996b83260
18993c63368i3892j05132c3383I1114b34933g0430q6264g1193j66658g8553P65
18982g7788A57507b84490G3514g5264o9070A97500b28009a01782r3381i2978k12626
18971c05604c1871l73436J77963Q5647B27336F5942a72682j84308H9847C7904
18960b34036I8845b91345J41628G27J73838q2508a15080K6241B60679e3211j68162
18949b21373L8428H7375a61196M5306E12749E6911j1501d762j28533p8309o9813
18938b81417a27321B02155E3300a03694L6281k35204A61314D1410b70370J1319
18928b59051B137a09305D2409b15971j15211J49293A46145b85509e807A23744
$$ plain form
19005 166546 -79536 -47011 -139040 -190603 -185656 -227018 81641 -7761 220806 53996 -283260
18993 -363368 -93892 -199024 -33383 91114 -234933 -70430 -156694 -71193 -237851 -78553 -77788
18982 -77788 157507 -284490 73514 -75264 -144334 197500 -228009 -101782 -195163 -92978 -305604
18971 -305604 -31871 -405307 -227344 -141697 227336 65942 -172682 -356990 89847 37904
18960 -234036 98845 -291345 -149717 727 174565 92057 -115080 -88839 260679 -53211 -221373
18949 -221373 -182945 87375 -161196 -115890 512749 56911 45410 -4762 -133295 -211604 -281417
18938 -281417 -127321 202155 53300 -103694 -67413 -302617 161314 41410 -270370 -259051
18928 -259051 2137 -109305 42409 -215971 -331182 -181889 146145 -285509 -5807 123744
18917i3606j87108f1621a5692D10144a25218p8764O3204A93463b52919l7365E1468
18905b2050m879A4441a1276j13962m4687M8800L5834B77161h7498M3016A20615
18893B446c44300d2034j56241A12613i7054C74588B612L05362b41070a16929r6474
18882b13403A48781a75878j68632A77740G1949B6695b77786B62265A18805g901
18871D361b83969j71059a56506A65964J656B7806a73592o325m3667Q8856B26334
18859B2798c78339A23692a47251I3419a57410b0306C38302A54521i9767o9442
18849a69209A46220b17555R3980H3942c5499j22582K170E9809a5693k04113A00723
18837H6840a23507d2315k10985d6099q3770l2906C571c0086A56147F8092O4431
$$ plain form
18917 -93606 -280714 -61621 -15692 410144 -125218 -203982 -140778 193463 -252919 -290284 51468
18905 -22050 -26929 14441 -11276 -125238 -169925 -121125 -85291 277161 -87498 -44482 120615
18893 2446 -344300 -42034 -198275 112613 -97054 374588 2612 307974 -241070 -116929 -213403
18882 -213403 148781 -175878 -344510 177740 71949 26695 -277786 262265 118805 -7901
18871 4361 -283969 -455028 -156506 165964 167620 27806 -173592 -179917 -223584 -134728 226334
18859 22798 -378339 123692 -147251 93419 -157410 -20306 338302 154521 -99767 -169209
18849 -169209 146220 -217555 -123575 83942 -35499 -158081 -155911 59809 -15693 -219806 100723
18837 86840 -123507 -42315 -253300 -46099 -129869 -162775 3571 -30086 156147 68092 132523
18826A32523b41224A36742b42654A10555a44348j65954a3550A03427a41827H9636
18815B66334E3194a15402A09775B4720J3681J7537a27138C59215G7135j1451K225
18804F7909g9012k96093E2380a41420N274A57259J48894a20673I5653b83157a20728
18792G6965J1787J11991a59185M5428I3947C2126b0349F5324e536B89105I3607
18780G8490b30475k03560a79145M1267L9293F6460c22516K7777J5048m8220Q7492
18769b40419O4855A24146k6206b21436M7308a6166k04225R8061j8534j92489N5773
18758b77580E2384f6244D7883b49115c2805r8137n4599e7628b0082h531F6688
18746E4565g2647k4247A8749g1154r2279k277I587b53210N9722b3920n5124c277
$$ plain form
18826 132523 -241224 136742 -242654 110555 -144348 -310302 -13550 103427 -141827 89636
18815 266334 53194 -115402 109775 24720 38401 55938 -127138 359215 77135 65684 67909
18804 67909 -79012 -375105 52380 -141420 -136146 157259 306153 -120673 95653 -283157 -120728
18792 76965 88752 200743 -159185 -113757 93947 32126 -20349 65324 -5536 289105 93607
18780 78490 -230475 -434035 -179145 -137878 -98585 66460 -322516 -294739 -279691 -327911 -240419
18769 -240419 -175564 124146 97940 -221436 -174128 -16166 -220391 -122330 -140864 -333353 -277580
18758 -277580 52384 -66244 47883 -249115 -32805 -130942 -185541 -57628 -20082 -8531 66688
18746 54565 -72647 -96894 18749 -71154 -163433 -165710 9587 -253210 -193488 -23920 -79044 -3277
18733c674D1087a63979A8216a6499j30642H8778Q4098G3381a12834D7740a21704
18721c8737A8563g867m4177j57675A36722a48891A26031J2041e3420l55587B36678
18709a73386A36398d42694a16224k32261e4497B7535a04260M7825D8236A8379
18698c18956I2799a22700A9851h5254c5845C26292a4439A50890a83514R000D2867
18686A7578a41016N3394d0519k21284B13734d4717j0390B14854c9912j95645D42926
18674a26163F5310N7389d1323d055A44644a20798B32487J08909i9763c6669D8661
18662b20841b3411j40068j35156C20341b32670P9895H8170C6532e2796l89872
18652d42668a10666K4089j74795d6505j9926F3749a25835B13259a75478j68993
$$ plain form
18733 -3674 41087 -163979 18216 -16499 -147141 88778 172876 73381 -112834 47740 -121704
18721 -38737 18563 -7867 -52044 -209719 136722 -148891 126031 138072 -53420 -409007 236678
18709 -173386 136398 -442694 -116224 -348485 -54497 27535 -104260 -56435 48236 18379
18698 -318956 92799 -122700 19851 -85254 -35845 326292 -14439 150890 -183514 -174514 42867
18686 17578 -141016 -87622 -40519 -261803 213734 -44717 -55107 214854 -39912 -235557 442926
18674 -126163 65310 122699 -41323 -4055 144644 -120798 232487 341396 -99763 -36669 48661
18662 -220841 -23411 -163479 -298635 320341 -232670 -152775 88170 36532 -52796 -442668
18652 -442668 -110666 -86577 -261372 -46505 -66431 63749 -125835 213259 -175478 -344471
18642c44471a8350o8062E0624M7434b483m9273j24562j4872g8493k20062B82473
18630B28559J69505a5560l7612A77779j2896b17884A07883m6333b72624A11031
18619b7209C6204M7791a50144p4408C86860A74866a71750K8610j84623C4032L42315
18608C76347d04799A49446c02458G2289A8073e8786k65167F7889P7067K4908b25150
18596b34997A2449a84385n819Q6474G7093a84712A80864e3371A3671L39534A4953
18584a18787B40494H3191J13834B2150a28786K9284j06285H1780N1212a27811
18573b16134M7794k90891b08396Q1255B4741J51610a28803N575K9349j26662f6831
18561b61097p07C20912i4667A71545a08050l01744J67027r0216J37637P2186A56180
$$ plain form
18642 -344471 -18350 -86412 50624 98058 -2483 -51756 -176318 -191190 -78493 -298555 282473
18630 228559 398064 -15560 -53172 177779 164883 -217884 107883 61550 -272624 111031
18619 -27209 36204 83995 -150144 -224552 386860 174866 -171750 -143140 -327763 34032 376347
18608 376347 -404799 149446 -302458 72289 18073 -58786 -323953 67889 144956 169864 -225150
18596 -234997 12449 -184385 -190204 -103730 77093 -184712 180864 -53371 13671 353205 14953
18584 -118787 240494 83191 197025 22150 -128786 -99502 -205787 81780 132992 -127811
18573 -216134 -168340 -459231 -208396 -127141 24741 176351 -128803 -123228 -93879 -220541 -66831
18561 -261097 -261804 320912 -94667 171545 -108050 -409794 -242767 -332983 -195346 -123160 156180
18549b41126C1884d49078f5917E1110b33081K3148k3139B03489d7498I4316c63484
18537b10872o1454b3972j34635B08867i2109c5430j41363j45289B7381a90219
18526c39004i5298g303l26944A49101b33031a13731k17051a10026j06817i1122
18515A88995I0491J7442A8474a03098A18519D4070b22044B0249b4058A30965e53872
18503b86915R9562B04729a60045a196j52991A8599b49687B45964a5719B34491
18492c6829k7092k68939Q5982E1759b5163k80824i8405J2527C6172P3200e8901
18480H4526A0865c01166A36986a61630Q0434n9495G7951b62337A0065a63986B08798
18468a2469d676A05873J69270b22367k99197J49728d3904J5134j53260E0507K5597
$$ plain form
18549 -241126 31884 -449078 -65917 51110 -233081 -209933 -233072 203489 -47498 94316 -363484
18537 -210872 -272326 -23972 -158607 208867 -92109 -35430 -176793 -322082 27381 -190219
18526 -339004 -95298 -7303 -334247 149101 -233031 -113731 -330782 -110026 -216843 -91122
18515 188995 90491 107933 18474 -103098 118519 44070 -222044 20249 -24058 130965 -553872
18503 -286915 -187353 204729 -160045 -1196 -154187 18599 -249687 245964 -15719 234491
18492 -36829 -63921 -332860 -246878 51759 -25163 -305987 -98405 -85878 36172 109372 -58901
18480 84526 10865 -301166 136986 -161630 -81196 -140691 77951 -262337 10065 -163986 208798
18468 -12469 -4676 105873 275143 -222367 -521564 -371836 -43904 -28770 -182030 50507 76104
18457G6104c329A74264J59402G2013a4246j67445O5553A2029a81814e4443D4582
18445E5427d9501k47676f2211m7375A39612c37367j3097c5623F6825J05702k8751
18434A43776p0389d03457i8628L0640a0768k27873H021J93108a73788l8963R4716
18423a18035l749j19744P881a03611A42017a47500f1139k5814m5405A04790L4104
18412A38894b00372L6866M7658k26396b5822A58245m4316J00269A5798b09325
18401E6796L05376a11428H5836c34945i8611p8949A1057J45797c4321A11866B6528
18389c05240B527K06350a44860E7290P7018C3409i5226B39380f4029D0619b0299
18377a24865f181k6196l35286B88656a87509g0102c0129H2747b47764L3720e0098
$$ plain form
18457 76104 -3329 174264 333666 72013 -14246 -181691 -116138 12029 -181814 -54443 44582
18445 55427 -49501 -297177 -62211 -109586 139612 -337367 -350464 -35623 66825 172527 143776
18434 143776 73387 -403457 -98628 -67988 -10768 -238641 8021 201129 -173788 -212751 -118035
18423 -118035 -121784 -241528 -233647 -103611 142017 -147500 -61139 -86953 -132358 104790 138894
18412 138894 -200372 -163506 -115848 -342244 -25822 158245 113929 214198 15798 -209325
18401 56796 362172 -111428 85836 -334945 -98611 -177560 11057 156854 -34321 111866 26528
18389 -305240 2527 208877 -144860 57290 134308 33409 -95226 239380 -64029 40619 -20299
18377 -124865 -6181 -32377 -367663 288656 -187509 -70102 -30129 82747 -247764 -214044 -50098
18365e1558C57974I789f8023C3517J97723C3514J00247D5682d11576K04768j00533
18354c07341C2102O2544a30224O4080B322N755b21214A6864b85684A98035a24663
18342e0999n4795l0104C2349J20803e0098R855p8707j12833B91218A9517K36564
18331B56081F4516a37333A3024Q9884B9990b2493p2258G7311a3709j24197C4123
18319H0030a57384K4136G1468J1726h0481B75200c070j38389a1398j12919C7931
18307B2704a23774L037b3002q491A07632L7790K651a25486A14824a61613p1144
18296b32757j63416B89339g3747m4172M3432A68384G90b61767a2218B9933O9756
18285I9689j4773b73646F7640B3538d8888k5659C16860a61067a6160A87451p3906
$$ plain form
18365 -51558 357974 9789 -68023 33517 231240 33514 133761 45682 -411576 -206808 -307341
18354 -307341 32102 94646 -130224 -66144 2322 8077 -221214 16864 -285684 198035 -124663
18342 -50999 -105794 -135898 32349 153152 -50098 -40243 -118950 -231783 291218 19517 256081
18331 256081 64516 -137333 13024 102908 29990 -22493 -94751 77311 -13709 -137906 34123
18319 80030 -157384 -133248 71468 83194 -80481 275200 -3070 -141459 -11398 -124317 37931
18307 22704 -123774 -120737 -23002 -31493 107632 145422 148073 -125486 114824 -161613 -232757
18296 -232757 -396173 289339 -73747 -117919 -74487 168384 790 -261767 -12218 29933 99689
18285 99689 84916 -273646 67640 23538 -48888 -74547 316860 -161067 -16160 187451 113545
18274A13545l533d73007I7723c59650D1484J14950b61157h9117B5668a39501B72525
18262b23580i2982b1386r299B3446K39081b84557a37302d2027j18667A75952f4405
18250B31868c42298A72255m9269r493C3797a19146B35332a62443A37554a44336
18239B3871K7507a99364a5764o5438k11780J3931a33802L5601A09177a72645p8652
18228b51297p5306B06581a8757m0631j77509f1551F4387A1312g3815q8198j50498
18217c12511J31137A74198K10254c71491B22334a03421g455o4725m24606A06979
18206b54562e6721B26780a89080H4112a02116j40804A05989b33560c6545j5587
18196e2132m15627K01828M0042A08617J97960a88353B29998a8670l03422E1544
$$ plain form
18274 113545 110012 -473007 97723 -359650 41484 156434 -261157 -89117 25668 -139501 272525
18262 -223580 -92982 -21386 -30685 23446 262527 -284557 -137302 -42027 -160694 175952 -64405
18250 231868 -342298 172255 122986 113493 33797 -119146 235332 -162443 137554 -144336
18239 23871 51378 -199364 -15764 -81202 -292982 -279051 -133802 -98201 109177 -172645 -251297
18228 -251297 -326603 206581 -18757 -59388 -236897 -61551 64387 11312 -73815 -162013 -312511
18217 -312511 -181374 174198 384452 -371491 222334 -103421 -7455 -72180 -496786 106979
18206 -254562 -56721 226780 -189080 84112 -102116 -242920 105989 -233560 -36545 -52132
18196 -52132 -467759 -265931 -225889 108617 306577 -188353 229998 -18670 -322092 51544
18185B2069a39984C9736A2626M0135K03136d6844D5049a89833K0388f9465k1352
18174i0817r9054h6725k00040C7937J42219H2497J45256c25028A77877c19896
18163c36559a43964c4767C5788a92418A70830N8217a90312i1377b4097A01560
18152d2477n1911j6300j26295Q777i2486A22573D9871a46670n242k91900I8252
18140a32109b6096n756B94681G9642K20584b02848a9126q599H0532J36770a96498
18128I3850b9072l60703A06612O2819a29013j44726E5063M1375J2866M7005E7298
18116b24717a01207q291B6898c616l43209A49201M9670o2075f9220A02968L1340
18105A34308b13859C3021M5457r739C4367b81241D9252R4462K4776g5137B36280
$$ plain form
18185 22069 -139984 39736 12626 52761 255897 -46844 45049 -189833 -169445 -69465 -90817
18174 -90817 -189871 -86725 -286765 37937 180156 82497 227753 -325028 177877 -319896
18163 -336559 -143964 -34767 35788 -192418 170830 229047 -190312 -91377 -24097 101560
18152 -42477 -94388 -110688 -236983 -228206 -92486 122573 49871 -146670 -151912 -443812 98252
18140 -132109 -26096 -31852 294681 79642 300226 -202848 -19126 -27725 80532 217302 -196498
18128 93850 -29072 -389775 106612 169431 -129013 -273739 55063 96438 109304 156309 57298
18116 -224717 -101207 -109498 26898 -3616 -346825 149201 198871 136796 -69220 102968 134308
18105 134308 -213859 33021 78478 68739 34367 -281241 49252 143714 168490 -75137 236280
18093a59471H6203b07020j58884a75504O8267A14168g7196n3611A4584a73909
18082a5934D8528a4514A7207K15600b3620G3312k7241O290R5560f1720A10581
18070A0267d03472h3929C35182j08712K6918J08366j10136B0979b58043g3626
18059i2533G9561a50728C7599J1437Q6843D0868Q5005d28910B26727G1345a7939
18047B28552E788h5675I5223P9716b60302n5783a13869j5833A32421a54599d6287
18035e0726p5358l46470e417m2232p449A15725k6568a64424g8689j70219H6104
18023B77251a49100A79191b02338R125i4016j71649A68069l3731a83058f7733
18012a21808k2884D1581b0802l26776g0822B38444a56952l5312Q6047D8419b4918
$$ plain form
18093 -159471 86203 -207020 -365904 -175504 -107237 114168 -77196 -130807 14584 -173909
18082 -15934 48528 -14514 17207 232807 -23620 73312 46071 52361 147921 -61720 110581
18070 10267 -403472 -83929 335182 226470 253388 361754 251618 20979 -258043 -73626
18059 -92533 79561 -150728 37599 49036 135879 40868 125873 -428910 226727 71345 -17939
18047 228552 5788 -85675 95223 174939 -260302 -316085 -113869 -129702 132421 -154599 -46287
18035 -50726 -126084 -472554 -5417 -47649 -55098 115725 89157 -164424 -78689 -248908 86104
18023 277251 -149100 179191 -202338 -193213 -94016 -265665 168069 134338 -183058 -67733
18012 -121808 -144692 41581 -20802 -347578 -70822 238444 -156952 -192264 -106217 48419 -24918
18000e6172p3859F5974b27301o7812A41520i1099B43972I5253B9427a78538g2658
17988D4289J58376A7361c15946d2674A01503B8974h2379c2110A85012b92927c286
17976A5261J95276D5793a55429B62516a58122c0226A13773J26631a88432A47346
17965f1533A65983B0535n449c39815f347k27538P8196C42639c21190c2020K394
17954b9626k3253G7449c39860I6642a13219n8314j04555a05750A58332b5230q2146
17943a07376j2792b5328j29081N3395j95243c6904l29615C92400C6584i7592A459
17931A05700K6874a96733f9351b9887p994r6714B01902r9225b86957a25532b2386
17919B9716N6735b88185R5738A34751B4539f279j71384j10002A84505a97774B70542
$$ plain form
18000 -56172 -130031 65974 -227301 -295113 141520 -91099 243972 95253 29427 -178538 -72658
17988 44289 202665 17361 -315946 -42674 101503 28974 -82379 -32110 185012 -292927 -3286
17976 15261 210537 45793 -155429 262516 -158122 -30226 113773 240404 -188432 147346
17965 -61533 165983 20535 15086 -339815 -6347 -233885 -155689 342639 -321190 -32020 -29626
17954 -29626 -52879 77449 -339860 96642 -113219 -171533 -276088 -105750 158332 -25230 -107376
17943 -107376 -120168 -25328 -154409 -101014 -296257 -36904 -366519 392400 36584 -97592 1459
17931 105700 132574 -196733 -69351 -29887 -37881 -134595 201902 102677 -286957 -125532 -22386
17919 29716 86451 -288185 -192447 134751 24539 -6279 -177663 -287665 184505 -197774 270542
17907A01924a0787F7166f5156l0298A76338a12396B51139j05143Q8363f7785p3391
17896a41176B04515a71760J7448D428a44045P1790j92807L2544i616r3349E5459
17884A91567a57807J9838E2651b80910a25980h710B92407A12011a71882G8716
17873A20992b5092k71282a04262K8082l6302j14016A48618P0239A03637j909D6357
17861h9606l4206J2037A66313c1510A58954R6132O5817d50726h4454A59002G6094
17849a18110n7220c3741o1267k54427k8531R7765A92089B4532b05960b6096k03226
17838b29322f9890F7159l2146a15293A35629m6866a35642F3643b757A39262a33956
17826a44955G9994d0273B87195A40689B8768L695K50882a36641k7229K8042A15128
$$ plain form
17907 101924 -10787 67166 -65156 -95454 176338 -112396 251139 145996 234359 -67785 -141176
17896 -141176 204515 -171760 -154312 4428 -144045 -72255 -265062 -232518 -9616 -102965 55459
17884 191567 -157807 -137969 52651 -280910 -125980 -8710 292407 112011 -171882 78716
17873 120992 -25092 -296374 -104262 -76180 -112482 -226498 148618 218857 103637 101728 46357
17861 -89606 -123812 -111775 166313 -31510 158954 255086 320903 -450726 -84454 159002 76094
17849 -118110 -175330 -33741 -95008 -349435 -377966 -280201 192089 24532 -205960 -26096 -229322
17838 -229322 -69890 67159 35013 -115293 135629 88763 -135642 63643 -2757 139262 -133956
17826 -144955 79994 -40273 287195 140689 28768 32463 283345 -136641 -163870 -135828 115128
17814A45779a91734j09515A35886l8790J67267c42301b8008j01114L198j6141
17804a42065A02001j1642M7695n425J5363E1771b42808c7582G7097j4018a56654
17792B37799A06732f521A9269J02580f9685k87798G2656f2519A19688b2099j43759
17781a65858q2665D5119b09892c897p0975A43049a20873l8092g0022A1652L14770
17770C26422b50255D3189j1036j2257c51329A38871D2092g9370A09218C2268a53195
17758A76108a0277k03645d9997A03285b75327B48084i5318A9016m378a40627g472
17746A00379K68197b40822l5161C97267d4881k06714d4920A22601E9459b36759
17735a88444H5518E801J95199a74553a3697G4909b76838L573J13951A79540b59424
$$ plain form
17814 145779 -191734 -301249 135886 97096 264363 -342301 -28008 -129122 -125924 -142065
17804 -142065 102001 90359 138054 132629 147992 51771 -242808 -37582 77097 63079 -156654
17792 237799 106732 -6521 19269 121849 -69685 -357483 72656 -62519 119688 -22099 -165858
17781 -165858 -248523 45119 -209892 -3897 -74872 143049 -120873 -158965 -70022 11652 326422
17770 326422 -250255 43189 32153 19896 -351329 138871 42092 -79370 109218 32268 -153195
17758 176108 -10277 -213922 -49997 103285 -275327 248084 -95318 19016 14638 -140627 -7472
17746 100379 368576 -240822 -275983 397267 -44881 -251595 -44920 122601 59459 -236759
17735 -188444 85518 5801 201000 -174553 -13697 74909 -276838 -273265 -159314 179540 -259424
17723H5122O349c1228l731j92441a00274A68674b22147a06646B00210b23352C3286
17711D4465O2403f5520m71836C8463J76414k2100a05754B9941L10813I0788J41574
17700B32362a38138B37663a56798l5466H2709a36933j30183B27251c3307A11418
17689A27009B8437J06352J20834A04445J23953c32294C21328a1623A94704A8683
17678b3282B91947A6885J36416j0273A0112J65617m0708i8154j04427D5372J63525
17667B08897r3191L44584a32170e1697j36903b3571B33853i8395c8438b61k56251
17656b56512A28875J03091k8600h0955H7307j3840J82777I7809b84282K9851I4444
17644a11929M1434c3113k16683e241C01010r8769b18594F5491N7638n7850B8817
$$ plain form
17723 85122 91471 -31228 -34959 -227400 -100274 168674 -222147 -106646 200210 -223352 33286
17711 44465 106868 -65520 -537356 38463 214877 192777 -105754 29941 340754 90788 232362
17700 232362 -138138 237663 -156798 -192264 82709 -136933 -267116 227251 -33307 111418
17689 127009 28437 134789 255623 104445 228398 -332294 321328 -11623 194704 18683
17678 -23282 291947 16885 153301 143028 10112 175729 135021 -98154 -202581 45372 208897
17667 208897 115706 460290 -132170 -51697 -188600 -23571 233853 -98395 -38438 -261 -256512
17656 -256512 128875 231966 203366 -80955 87307 73467 256244 97809 -284282 -254431 94444
17644 -111929 -70495 -33113 -249796 -5241 301010 202241 -218594 65491 123129 65279 28817
17632D41819a94601A69137b09775p9333B7932r036a40564r5045R7622J4602m1617
17621a65002D68123a5290I7512b61746a30537N3892H3728a16929A57243b34560
17610f3010B14361m1083L8406A03309b46865A36981c2088j01204k05071E8139
17599C12319j38185F6280a56200F2108B3318A568O8385c9632o2659B46021o4600
17588A81421e2260l41963H3291g3200c5767B75970a6968k44767J26266j27601
17578b63070D44874b7061k25865B83968d9530Q467E1647J7200K2332B6382M77514
17567E03896b610A4010g4984A17922K04375b7240j56104A10166d7775j50509H9249
17555g1937k13760f7842o8954L4762k14743D4077J79340g5935C29489o3382p0022
$$ plain form
17632 441819 -194601 169137 -209775 -289108 27932 18896 -140564 -235609 -137987 -123385 -165002
17621 -165002 468123 -15290 97512 -261746 -130537 -76645 83728 -116929 157243 -234560
17610 -63010 214361 173278 211684 103309 -246865 136981 -32088 -133292 -338363 58139
17599 312319 174134 66280 -156200 62108 23318 1568 69953 -39632 -102291 246021 181421
17588 181421 -52260 -394223 83291 -73200 -35767 275970 -16968 -261735 -135469 -263070
17578 -263070 444874 -27061 -252926 283968 -49530 -41063 51647 68847 91179 26382 503896
17567 503896 -2610 14010 -74984 117922 322297 -27240 -183344 110166 -47775 -198284 89249
17555 -71937 -285697 -67842 -136796 -102034 -316777 44077 223417 -75935 329489 266107 196085
17544A96085b25700A2416J41156b26321e1388A86605J75393j76833J74805a8988
17533a74429l6041F0479j985J7120f6013B43937B3872a1263m5527r2878j54510
17522c04178B10714J73339j45819a5539p9386c9649B59379K4801L7941j53318
17512A68803b22589E2526d6370r6214A57214K5509B6240e5092j10989B83797g3724
17500a5000B80720A6570c5456a7215A80895i4153q4067f886B82474C5299J93990
17489B29289Q3558a60542D47197k13137f7603B47591K09110j89942j28419B4040
17478B4056P4059J83170H8486K31452f6619C35433j02512M8366G0013J21895I0210
17466d3268j48101C07983Q2770A9203J97645r7823j5129l4075k5744R8495J28053
$$ plain form
17544 196085 -225700 12416 153572 -226321 -51388 186605 361998 185165 359970 -18988
17533 -174429 -210470 60479 58494 75614 -66013 243937 23872 -11263 -56790 -149668 -304178
17522 -304178 210714 384053 238234 -15539 -94925 -39649 259379 284180 322121 168803
17512 168803 -222589 52526 -46370 -142584 157214 182723 26240 -55092 -166081 283797 -73724
17500 -15000 280720 16570 -35456 -17215 180895 -94153 -178220 -6886 282474 35299 229289
17489 229289 312847 -160542 447197 234060 -67603 247591 456701 266759 138340 24040
17478 24056 98115 281285 88486 319938 -66619 335433 232921 281287 70013 191908 90210
17466 -43268 -191369 307983 390753 19203 216848 119025 103896 69821 44077 142572 270625
17455B70625B8799L47303A53490K3092e0616A92416N5208D1163L02457a03346
17444G1114J11937H0345J57364p5984N76459C24022p0879c5182A97515n6914B7601
17432A54915P5485J87222B03233H5052B9262K29914I0585K15586j19343K30768
17422D17596j42687i5028A62415c00116e1573F22489B35492J8423K48521o9618
17412D32818B0588a54745F5188c328F4828M8215K72093A12417L1444o2729h0489
17400b0608A73634b6040k044A23746k56J15737q0971J06421A790a9605B73670
17388b2928B85258n3996a34888E8919k396k919i7205D64011D1114J69253J69165
17377C79532A80208e886A76222a8244B88215o9482H6152a94599B03714c8639B18248
$$ plain form
17455 270625 28799 376102 153490 176582 -50616 192416 247624 41163 343620 -103346
17444 71114 183051 80345 237709 161725 738184 324022 253143 -35182 197515 140601 27601
17432 154915 230400 417622 203233 85052 29262 259176 90585 306171 186828 417596
17422 417596 274909 -95028 162415 -300116 -51573 622489 235492 253915 502436 432818
17412 432818 20588 -154745 65188 -3328 64828 113043 385136 112417 143861 81132 -80489
17400 -20608 173634 -26040 -28084 123746 123490 239227 158256 264677 1790 -19605 273670
17388 -22928 285258 231262 -134888 58919 56523 53604 -97205 464011 41114 210367 379532
17377 379532 180208 -5886 176222 -18244 288215 218733 86152 -194599 203714 -38639 218248
17365f6347b7964A78114b30525C96322D3580b83201F7840A6987K53537A8151m753
17354A3398L37044n3788c280A00989K5504O7618J59477d8613D7145L8049Q9968
17343A75162n3168a4065A27755N4328E9755P1867f3330A90074P1943j8909I9912
17331C5867a09203j25019C02369A28145J58366A09826k5832C9314J37619q0792
17321I6141a56702A49256a85477B92090q4773c2289j5900G3087M5737n5949M1403
17310A04278R0494K07267E4614h8422D6494b50285e5533C69534j60277a9391B71613
17298C41047e11o3014A94237o3542K06939j55914d4894A14691K09397n3970a08685
17286A48418o5581K83502A60648R2064a10564A59660J71414o8942E0821P0364
$$ plain form
17365 -66347 -27964 178114 -230525 396322 43580 -283201 67840 16987 270524 18151 13398
17354 13398 350442 296654 -3280 100989 126493 194111 353588 -48613 47145 85194 175162
17343 175162 121994 -14065 127755 182083 59755 131622 -63330 190074 262017 243108 99912
17331 35867 -109203 -234222 302369 128145 286511 109826 83994 39314 176933 96141
17321 96141 -156702 149256 -185477 292090 207317 -32289 -48189 73087 118824 62875 104278
17310 104278 194772 402039 54614 -88422 46494 -250285 -55533 369534 209257 -19391 271613
17298 341047 -511 -63525 194237 130695 337634 181720 -44894 114691 324088 270118 -108685
17286 148418 82837 366339 160648 252712 -110564 159660 331074 262132 50821 121185
17276A21185N54256A78635G5569J62525m3846l0773K39406I7569J42243O5340
17266C05152J18864A56536A4523N06828A38968N0944a5070B91127A39510L6889
17256A76399J97415J57367A59920J00367O6450a8338C07133c4336k90052B26015
17245G4895K4463i2560j84935h8099A7556Q9316J56501A16791J79383M6180p2062
17234B70292J13323j81305H6581M90128f5181B07769J7980C7972N7330D5627Q3041
17223A28668g258A11918m9933K70857A01156L36227h407A54857M10989g9181b728
17211B26169q1789L75865g4918B07062c1724A67849M65021k64779K61421j86340
17201D43172n3723j15513J07440A12026J99134F7873a00935A76383i0148B91627
$$ plain form
17276 121185 675441 178635 75569 238094 194248 163475 402881 97569 239812 305152
17266 305152 424016 156536 14523 521351 138968 189912 -15070 291127 139510 176399
17256 176399 373814 531181 159920 260287 326737 -18338 307133 -34336 -324388 226015
17245 74895 99358 -92560 -277495 -88099 17556 106872 263373 116791 296174 342354 270292
17234 270292 383615 202310 86581 576709 -65181 207769 225749 37972 95302 45627 128668
17223 128668 -7258 111918 61985 332842 101156 437383 -8407 154857 565846 -79181 -2728
17211 226169 144380 520245 -74918 207062 -31724 167849 632870 368091 629512 443172
17201 443172 389449 273936 381376 112026 311160 67873 -100935 176383 -90148 291627
17190B63934R3785J9313i6911E1310J61595q800F5323J32146l8922R0459l723
17179B45283H1103K97729b29274D21960D3364K41718L20769m4021k45011j4773
17169C02046p5923K1639J31164J01112C8076M82324A91364q1830k5903O01261
17159F84892l20516J6061K58807G1860J74170L09778A96853I7814j376b8746c92
17147B69142L41875B5219L38752A00774L57449j64350p9987L99375k03115A96815
17136E70019K9057E4226O85652k71807B1074L11032n9877A27307M95267A86157
17125C49430O4710B4906B930N59263A14058J25755K8531M70740A56412L7312r425
17114A84299L6333N6556K33582A05265N76835G7407K44125K35683A43730K02919
$$ plain form
17190 263934 357719 377032 -96911 51310 212905 204105 65323 197469 158547 249006 245283
17179 245283 81103 378832 -229274 421960 43364 285082 605851 561830 316819 302046
17169 302046 226123 247762 378926 480038 38076 520400 191364 109534 83631 684892
17159 684892 364376 380437 639244 71860 246030 555808 196853 97814 96438 -28746 -392
17147 269142 611017 25219 363971 100774 458223 293873 213886 613261 410146 196815
17136 570019 599076 54226 739878 468071 21074 332106 272229 127307 622574 186157
17125 349430 414140 24906 2930 562193 114058 239813 268344 739084 156412 193724 184299
17114 184299 220632 277188 510770 105265 682100 77407 321532 557215 143730 346649
17104C46649j38371J78508J8685J07718B10882K41274B15334Q0067L3636K65225
17094E94262j59872K12271B11285K06131p1965p2533K39509A40993M15688K55090
17084H11771k90146k18231J88768k10864J31077M74955A73521L40752r5914j23751
17074B94608L10569k34999K91097k57539j35742O3915j855K46936k56884A22892
17063H31264C13626K5859p833L4503J62320j27852L8407q9177K34519j16284K8081
17052D96169j4959L6369j49642K59298B64415K28577k39121K89976q477K55483
17042G90853N8995A95158M18744o1909k36993l866K28517m1625O8043m9240L1276
17031E48105q1313J52170M3044C02375A41194M68186P1026R2958l2913j56280
$$ plain form
17104 346649 208278 386786 405471 513189 210882 452156 215334 295401 329037 594262
17094 594262 434390 646661 211285 417416 345451 272918 512427 140993 556681 811771
17084 811771 521625 303394 492162 281298 412375 887330 173521 514273 418359 294608
17074 294608 605177 370178 661275 403736 267994 331909 330054 576990 320106 122892
17063 831264 313626 339485 331652 366155 528475 400623 439030 349853 584372 468088 496169
17052 496169 481210 517579 367937 627235 264415 492992 253871 543847 535370 790853
17042 790853 849848 195158 613902 551993 315000 311134 539651 498026 566069 516829 548105
17031 548105 466792 618962 662006 302375 141194 609380 680406 773364 740451 584171
17021E84171m9737J1484J73250J50697k13529k74840n2238J37773J78791J13499
17011G59321k46949L28461l68972M31931l42438J33482j68086j40339M09381k15512
17001E80280J04268j55041J28796m5662k0839M08349l41348L39512k96862n1282
16991F50171K09941k83946K54262l22548K55054J62889j86357L9613K33904j52726
16981H60257k60521K06699k78411J85034L86426k37324J22553l21365O4138Q3937
16971H11423J27834J32409k58591L10133l60539M1702J59896J02098p4614n2915
16961I38836L46455l46854K5832j98476N7050j08465M44683j16419l6168M8097
16951A054571J8889l56856M23908j01846k47953k70212N87033K1495J57560q9144
$$ plain form
17021 584171 534434 545918 719168 869865 656336 381496 329258 467031 645822 759321
17011 759321 512372 840833 471861 903792 561354 694836 526750 386411 795792 580280
17001 580280 684548 529507 658303 612641 591802 1000151 658803 998315 701453 650171
16991 650171 860112 576166 830428 507880 762934 925823 739466 779079 1012983 860257
16981 860257 599736 806435 528024 713058 1099484 862160 984713 663348 727486 811423
16971 811423 939257 1071666 813075 1123208 762669 804371 964267 1066365 991751 938836
16961 938836 1285291 938437 964269 765793 822843 714378 1159061 1042642 1006474 1054571
16951 1054571 1073460 716604 1140512 1038666 790713 520501 1107534 1129029 1286589 1197445
16941A197445l3810o9161j6279N77605n67999m3300J83797j17540j20926J12435
16931A102267K64315k80301J63175q0913j76339N14084j01079M2401l08580J67235
16921A306265l62K36356k27582P0552j1102j67132L99323j89300p8169J76193
16911A515042J21323j8633j12392k486K60835M3941j20927j78178J90784k4939
16901A674370j28447o7944N8882J97304J42734J43015l56940J63932N24069n03078
16891A847897J12347J31392j40641l46820M54539k26913N4307K14980Q1545j05721
16881B076912j09284M62024j62224k55574J08906M43553n10963L38075j52302
16872B239123J36332n4699K8215K19294J94013m93774K88357k29649L56086j01820
$$ plain form
16941 1197445 1163635 1094474 1078195 1655800 1087801 1044501 1228298 1110758 989832 1102267
16931 1102267 1366582 1086281 1249456 1168543 992204 1506288 1405209 1447610 1139030 1306265
16921 1306265 1305903 1542259 1314677 1385229 1374127 1206995 1606318 1417018 1338849 1515042
16911 1515042 1636365 1617732 1505340 1502854 1763689 1807630 1686703 1508525 1699309 1674370
16901 1674370 1545923 1477979 1536861 1734165 1876899 2019914 1662974 1826906 2350975 1847897
16891 1847897 1960244 2091636 1950995 1604175 2058714 1831801 1886108 2101088 2182633 2076912
16881 2076912 1967628 2429652 2267428 2011854 2120760 2564313 2053350 2391425 2239123
16872 2239123 2375455 2320756 2348971 2568265 2762278 2268504 2556861 2327212 2683298 2581478
16862B581478N1190K53066j4206k65319M35928j72563l46363O25935P886M4243
16852C201275k25249Q3589j72184K29596K77870J06489j06323k08561K51568N1862
16842C489932K39113j38981M38574l32631J82656J46148l2721J63192j26704J24540
16832D153118j74372n2061J66672m7512K14783q8018L55345J5576R7911J43721
16822D785163N56243l36894J13398o5215J1456L36318M21029j62902r0059M96667
16812F065204n9562K31170k66410j58794O58022K117K1562L01465Q8770K21518
16802G105062L84659K12156l3269K21409K57613j95227P61524j24646M83706p0849
16792I002138O15946k55028L58325P44283k35566L02226J34870O05752L8666K90578
$$ plain form
16862 2581478 2632668 2885734 2871528 2606209 3042137 2869574 2523211 3149146 3157032 3201275
16852 3201275 2976026 3059615 2887431 3117027 3394897 3501386 3395063 3186502 3438070 3489932
16842 3489932 3729045 3590064 4028638 3696007 3878663 4024811 3992090 4155282 4028578 4153118
16832 4153118 3978746 3926685 4093357 4045845 4260628 4172610 4527955 4543531 4641442 4785163
16822 4785163 5341406 5004512 5117910 5052695 5064151 5400469 5821498 5658596 5568537 6065204
16812 6065204 6005642 6236812 5970402 5811608 6469630 6471747 6493309 6794774 6883544 7105062
16802 7105062 7489721 7701877 7668608 7890017 8147630 7952403 8713927 8589281 9072987 9002138
16792 9002138 9618084 9363056 9721381 10465664 10230098 10532324 10667194 11272946 11311612 11602190
16782A1602190O08234K19123K44336N36983O97655L11627J07244J83528O15109
16773A5126029P67212O31252L32029P42793K53968R46053N87569P63011M49502
16764B0599418R17132Q88974N81051Q96068J509917Q23218J054403Q63552Q99585
16755B9033318J884891J170716J207228J585679J784209J671357J799641J615727
16747D1752766J931780L050849J797183K463875K855083K962555K591677L746372
16739F3152140L430718L794322L998643M517771M258044N267423M923627N755466
16731I9098154N437740O261913O171237O787563O580593O838404O824059O333038
16723A50332701O806954O014681N674337M924366L971458K813967K556277R35234
$$ plain form
16782 11602190 12210424 12429547 12673883 13210866 13908521 14220148 14327392 14510920 15126029
16773 15126029 15893241 16524493 16856522 17599315 17853283 18799336 19386905 20149916 20599418
16764 20599418 21516550 22405524 22986575 23882643 25392560 26215778 27270181 28133733 29033318
16755 29033318 30918209 32088925 33296153 34881832 36666041 38337398 40137039 41752766
16747 41752766 43684546 46735395 48532578 50996453 53851536 56814091 59405768 63152140
16739 63152140 66582858 70377180 74375823 78893594 83151638 88419061 93342688 99098154
16731 99098154 104535894 110797807 116969044 123756607 130337200 137175604 143999663 150332701
16723 150332701 157139655 163154336 168828673 173753039 177724497 180538464 183094741 184029975
16715A84029975m40269j071101k870319l391565m471431m974605n720324o455088
16707A54635273o678413o597109p091245o834799o925496o366423o358736o070446
16699A01712606o134589n404732n157140m663181m436465m323018l790993l646295
16691F4156193l406421l330101k850753k893348k853834k372295k340212k404375
16683D1704854j615811k024579j833544j542960j667840j481694j447882r52616
16675B9137928j358776j057510q19199j551282q82499n71587r66878q65468q23900
16666B0240829o01041r82131j090096l68738n97587l64037n40152n36467n49439
16657A4611141l05564p71712j91211o89557j8854o06501r9072p1864n30091o10108
$$ plain form
16715 184029975 183589706 182518605 179648286 176256721 171785290 166810685 161090361 154635273
16707 154635273 147956860 141359751 134268506 127433707 120508211 114141788 107783052 101712606
16699 101712606 95578017 90173285 85016145 80352964 75916499 71593481 67802488 64156193
16691 64156193 60749772 57419671 54568918 51675570 48821736 46449441 44109229 41704854
16683 41704854 40089043 38064464 36230920 34687960 33020120 31538426 30090544 29137928
16675 29137928 27779152 26721642 25902443 24351161 23468662 22897075 21930197 21064729 20240829
16666 20240829 19639788 18657657 17567561 17198823 16601236 16237199 15697047 15160580 14611141
16657 14611141 14305577 13533865 13342654 12653097 12634243 12027742 11928670 11856806 11326715 10716607
16647A0716607m19449k62739M023l78327j42042p52911K11375m07092l1888m59913
16637H077644Q1703m94320m31114K63405l8989l71580K5215n48894J05232J58283
16627F826585p90666J27428L7323k53248k11686J77205k25061j79422J74932o70138
16617E013252K1309J99252k85109k52447K95711m86838M3733r1846M79758p97246
16607D139529L79557m38716k1861j73886O43394l20211k90244J13900k32366l24965
16597C474131K2251j74551l72355K76260m9101J2023o6686j23986J70320n27823
16587B640483N30365k74340L90529m13594l11012l7069M74486l79093m08607M40936
16577B653084Q0220k19407L8138m34080J35513j55859K08063k5069J2418l3987
$$ plain form
16647 10716607 10297158 10034419 10038442 9660115 9518073 8765162 8976537 8569445 8537557 8077644
16637 8077644 8159347 7665027 7233913 7497318 7458329 7086749 7111964 6563070 6668302 6826585
16627 6826585 6035919 6163347 6200670 5947422 5735736 5912941 5687880 5508458 5683390 5013252
16617 5013252 5034561 5233813 4948704 4696257 4991968 4505130 4548863 4457017 4936775 4139529
16607 4139529 4519086 4080370 4058509 3884623 4528017 4207806 3917562 4031462 3799096 3474131
16597 3474131 3496382 3321831 2949476 3225736 3176635 3188658 3121972 2997986 3168306 2640483
16587 2640483 3170848 2896508 3287037 2873443 2562431 2525362 2999848 2620755 2212148 2653084
16577 2653084 2733304 2513897 2552035 2117955 2253468 2097609 2305672 2280603 2293021 2259034
16567B259034L59094k95936j77936k72559J10783r6338J61099l20173P5803N09073
16557B311944m99406L01943l10136J38442J51901m25017J30719j67981p3008L41699
16547A901100j04227n7718l62684J28799N41484o06017J76159j76423p6626J68328
16537A532175k18017K7020P1291j23452p9708Q0253j08724j76722N66285k8287
16527A542114m86941L73359k66080j29887L08691k6182m30612J55230Q6983M00419
16517A527094n28327L16427j75071j35402Q0321L14156k01154p8821m12313K32360
16507I39270J17810j67354L36806j03439J01373k35159l33550o185j3165m668
16497F31739K63398j12925K25039j5447J2388D40918O29290k45204j59779M49600
$$ plain form
16567 2259034 2618128 2322192 2144256 1871697 1982480 1886142 2047241 1727068 1802871 2311944
16557 2311944 1812538 2114481 1804345 1942787 2094688 1669671 1800390 1632409 1559401 1901100
16547 1901100 1796873 1739155 1376471 1505270 2046754 1440737 1616896 1440473 1363847 1532175
16537 1532175 1314158 1341178 1412469 1289017 1209309 1289562 1180838 1004116 1570401 1542114
16527 1542114 1055173 1428532 1162452 1032565 1341256 1315074 884462 1039692 1126675 1527094
16517 1527094 998767 1315194 1140123 1004721 1085042 1399198 1198044 1119223 706910 939270
16507 939270 1057080 889726 1226532 1123093 1224466 989307 655757 649572 636407 631739
16497 631739 895137 782212 1007251 991804 1004192 440918 1070208 825004 665225 1114825
16487A114825n7134r6383Q8427j56575k32231J12308n3327K04329l97891J93867
16477G20215l922O0543J8968k5379K41686q4248D32241N08405j90966k20669J99341
16466G28352j92596J33683l7047j67O2508J02154J2583l42387K72050j10451R2471
16455G21153J07007l50505l4525L22499J08595J20393j56413q0275p8896k24736
16445D54297K95307k48312R423K08397k41506Q8958r1780K63025j34916j65749
16435D37144M24543l97479m500j27292K41399p2345o7331Q3589k40619L28165
16425F05274j50589n0046J77489R031j68004j4708A74800L71783r0849K44912
16415G00646L31396l52450B83066L67666k80029A40679M95628j87671K8558J89619
$$ plain form
16487 1114825 1057691 961308 1049735 893160 660929 773237 719910 924239 526348 720215
16477 720215 716293 776836 795804 770425 1012111 927863 432241 940646 749680 529011 728352
16466 728352 535756 669439 632392 632225 694733 796887 809470 467083 739133 628682 721153
16455 721153 828160 477655 443130 765629 874224 994617 838204 757929 679033 454297
16445 454297 749604 501292 510715 719112 477606 566564 474784 737809 602893 437144
16435 437144 861687 464208 459708 332416 573815 501470 434139 517728 277109 605274
16425 605274 454685 404639 582128 591159 423155 408447 174800 546583 455734 700646
16415 700646 1032042 679592 283066 650732 370703 140679 636307 448636 477194 666813
16405F66813k47649J68843B81270N50192B52276o2091o6291L08487j38012K12811
16395E07180l2784o4459J45140A87464K19915A85346L28409p5042K06856B94816
16384D32545j54805K88995k24890L9351r7443q7396J74927j27986L42820B14803
16373A62239J62572A45182K29505j04757j22910L7381n4155a66095B5881K43148
16363B69029J97643F0390J48292K18137j49421O7417j2717K26676B72086A16581
16352A52322K06577A18394K09203N1668A09136P7771M55337A76299J312N7110
16342B34721J02892A59761p3769K44397M7701B3098R000P1084L35205A7110Q9165
16331A06275M43277k52144A10244L10455o0635j49640J0154o3691K31558F4800
$$ plain form
16405 666813 419164 588007 281270 831462 252276 190185 123894 432381 294369 507180
16395 507180 474396 409937 555077 187464 407379 185346 513755 438713 645569 294816
16384 432545 277740 566735 341845 381196 283753 196357 371284 243298 586118 214803
16373 162239 324811 145182 374687 269930 147020 184401 130246 -166095 25881 269029
16363 269029 466672 60390 208682 426819 277398 344815 332098 558774 272086 116581
16352 152322 358899 118394 327597 379265 109136 186907 642244 176299 177611 234721
16342 234721 337613 159761 85992 330389 378090 23098 32098 103182 438387 17110 106275
16331 106275 549552 297408 110244 420699 360064 210424 220578 156887 388445 64800
16320I5697J07888m1208Q4866c3132C2528J49174j0954B2619L82099j73932L10146
16309E40932g1452k4215B11356j5812r4020r130C8602L05920k3655A43409K17139
16298C60548Q2198k04077J08688o1220g5605C08920A39395K0938F5167A1769K13620
16287B25389m9414k1536J54422J9574A31991K87453I3524J04968a78349e1166
16276b35748C15073A51446P7981P0788A00893K42208M0586a24539C70992b55250
16265A25447M05461A96930c12659B23764j05208a55043A26629l3538c19846a57931
16254H1926a26877B49554G0003L8861K11471a26417I4848D5028b35601B15695
16243A63326a39538A9439J30864M7745b3544A03122R9858j7552L55597k28398
$$ plain form
16320 95697 203585 162377 247243 -33132 32528 181702 170748 22619 404718 230786 540932
16309 540932 -71452 -95667 211356 195544 101524 92394 38602 344522 320867 143409 360548
16298 360548 442746 238669 347357 286137 -75605 308920 139395 160333 65167 11769 225389
16287 225389 175975 154439 308861 328435 131991 419444 93524 198492 -178349 -51166
16276 -235748 315073 151446 229427 300215 100893 343101 383687 -124539 370992 -255250
16265 125447 530908 196930 -312659 223764 118556 -155043 126629 93091 -319846 -157931
16254 81926 -126877 249554 70003 108864 320335 -126417 94848 45028 -235601 215695
16243 163326 -139538 19439 150303 198048 -23544 103122 202980 185428 541025 312627
16233C12627A35778L266C7960K27289g3506j51300i5792A60972L3446a41112K4903
16222a16209j56659A49538N6987p1113a77430C59102A41696j9392J55661r3186
16212A84779D0881J20681e20451A48518J14964F4296g5464R414I816b04521I7780
16200D4864m576Q5608R09R721E673N4323a58410B65545p754b5621A07299J45151
16188B52450Q2692b04721R8726I5787b2884q8406F1876f8664j30474A1542a52412
16176a23027F6945K3739b75231C84717j22703d0926B38251p4369c4144E6615L81127
16165D37742G2344L3681c2962n761B21919j01944l5585h3444J5060n0182G0351
16153H4814a94686C25043A7435J29304L67436E0725K58696l9377B7933M4734P3818
$$ plain form
16233 312627 135778 139044 37960 265249 -73506 -224806 -95792 160972 194418 -141112 -116209
16222 -116209 -272868 149538 206525 135412 -177430 359102 141696 122304 277965 184779
16212 184779 40881 161562 -520451 148518 263482 64296 -75464 -66050 9816 -204521 97780
16200 44864 40288 125896 126805 136526 5673 59996 -158410 265545 257791 -25621 107299 252450
16188 252450 335142 -204721 -105995 95787 -22884 -111290 61876 -68664 -199138 11542 -152412
16176 -123027 66945 90684 -275231 384717 262014 -40926 238251 163882 -34144 56615 437742
16165 437742 72344 106025 -32962 -38723 221919 119975 84390 -83444 -68384 -118566 70351
16153 84814 -194686 325043 17435 146739 514175 50725 309421 270044 27933 72667 146485
16142A46485F4785H551J36092m496A7138K45358D206K06466n2217h1484A9047
16130A37779E2679b81510R2326g5278A59427g2856j85423A70674C9634J79644
16120B19278L49494k34265a2979C80998D2102J28539a424A00240J94552C3678
16109B80523L4377c5517A87324a93223D52544A56597A1598L24056b8841a32j65540
16098a65672C7720f0887k01041g8743A60528j3124K50769a38308A81676i5658
16087c6580G6662a51865n2342g2420j95668I9210a99742g6814j07267B25405i1778
16075G873K8328J03214c25691C9052b21126H5107a41968J4766A97863B1823a07472
16063d2251q5891c5086k75748G2833b43060k22276H9813c3549j17974c7130B69511
$$ plain form
16142 146485 64785 8551 144643 140147 17138 262496 4206 210672 158455 -81484 19047
16130 137779 52679 -281510 -189184 -75278 159427 -72856 -258279 170674 39634 219278
16120 219278 568772 334507 -12979 380998 42102 170641 -1424 100240 294792 33678
16109 280523 314900 -35517 187324 -193223 452544 156597 11598 335654 -28841 -132 -165672
16098 -165672 37720 -60887 -261928 -78743 160528 147404 398173 -138308 181676 -95658
16087 -36580 76662 -151865 -204207 -72420 -268088 99210 -199742 -76814 -184081 225405 -91778
16075 7873 36201 139415 -325691 39052 -221126 85107 -141968 -127202 197863 21823 -107472
16063 -42251 -128142 -35086 -310834 72833 -243060 -465336 89813 -33549 -151523 -37130 269511
16051a76347E9532a81033q3602A20968Q7331g0919j65549B83536r9936a38377
16040B18091A07959J16492a83771D19886a13650r3946A46951a19456k11831A01239
16029a21076M4765j14352k47799A14656a45878K9994B49946a26395J2633b046
16018G3304h8212B26387D6771b02523B20057a65072K6812C2854b44353D4932R1243
16007A36175b98014p5365A76383h7654b0103o3838A84939l8184a959G1835h9465
15995G1288d4740F0122J95616a03556E11676a69968p4980D2277a74015L6626B6369
15983a24415D3641L232J03747E7911J86322A08729e8528K7945C52223j14919A12346
15971g975E5492J59735p1004g7336B98238a44518A41901b9032C611h7285C4334
$$ plain form
16051 -176347 59532 -181033 -264635 120968 208299 -70919 -236468 283536 183600 -138377
16040 218091 107959 224451 -183771 419886 -113650 -207596 146951 -119456 -331287 101239
16029 -121076 -76311 -190663 -438462 114656 -145878 -115884 249946 -126395 -113762 -2046
16018 73304 -88212 226387 46771 -202523 220057 -165072 -138260 32854 -244353 44932 136175
16007 136175 -298014 -373379 176383 -87654 -20103 -83941 184939 146755 -1959 71835 -89465
15995 71288 -44740 60122 255738 -103556 511676 -169968 -244948 42277 -174015 -137389 26369
15983 -124415 43641 46873 150620 57911 244233 108729 -58528 -30583 352223 237304 112346
15971 -7975 55492 215227 144223 -77336 298238 -144518 141901 -29032 3611 -87285 34334
15959C3179M526O0427B9385a91037B14889f9577j5184k28755a219E4160m949l638
15947D5573J26163A4497L718a07667e1644k5148b3126j10275d7399A04532j1476
15936I3056l8290h7758k01760c5129A79702c36945E3448a16903J7501B73260a26517
15924a28924b8235o9419a8351f042j15198k0951B38585J15530b03056J5707O1505
15913a25844A99789b7217j66982j03596A77958b5535j04738m8519Q4847K2859
15903g1086j16761D525R2081b16746C09488j02377b92825J33182A48136k4081
15893A24055e503A36546b2549D66014c62839C27469a49903j984A06721R5668g6850
15881B55453a28878D7417J55631n5875a60535o6996f550A86582J47524h4606l6710
$$ plain form
15959 33179 37705 98132 29385 -191037 214889 -69577 -84761 -313516 -1219 54160 49211 45573
15947 45573 171736 14497 18215 -107667 -51644 -76792 -23126 -133401 -47399 104532 93056
15936 93056 54766 -87758 -289518 -35129 179702 -336945 53448 -116903 -99402 273260 -126517
15924 -128924 -28235 -97654 -18351 -6042 -121240 -142191 238585 354115 -203056 -187349 -125844
15913 -125844 199789 -27217 -194199 -297795 177958 -25535 -130273 -178792 -93945 -71086
15903 -71086 -187847 4525 96606 -216746 309488 207111 -292825 -159643 148136 124055
15893 124055 -5503 136546 -22549 466014 -362839 327469 -149903 -151887 106721 202389 -76850
15881 255453 -128878 47417 203048 147173 -160535 -227531 -6550 186582 334106 -84606 -121316
15870a21316f850l32217B60100E8089N271g2314c4706j03742n9218B05108a45192
15858b95891a18888B56769A18960d42717D526a98468c113j58805I6879a99023
15847h4521B07762a48320e5129B15270B0982i3177j03874J7952A46757b14201
15836A99786b48557R6141k532m4030R3652a9251h287j75904D6968c07645J34654
15825a72991k1127e6362m5939H2654c68867I3709c020G2491a76934A81948d091
15813D3473b37134b9271l4807j64842n5493h8163j18729i415C30120m0937a18497
15801E9568K87811c11785B02426j1559c34755A87037O2067q7506B8758P9847d0652
15789B2546a64810C85801j69394L5177f3756A4615b67912D9014o136a4335A18546
$$ plain form
15870 -121316 -6850 -339067 260100 58089 63360 -72314 -34706 -138448 -197666 205108 -145192
15858 -295891 -118888 256769 118960 -442717 4526 -198468 -3113 -161918 96879 -199023
15847 -84521 207762 -148320 -55129 215270 20982 -93177 -197051 -179099 146757 -214201
15836 199786 -248557 -152416 -154948 -198978 -105326 -19251 -8287 -184191 46968 -307645 -172991
15825 -172991 -194118 -56362 -102301 82654 -368867 93709 -3020 72491 -176934 181948 -4091
15813 43473 -237134 -29271 -64078 -228920 -284413 -88163 -206892 -9415 330120 289183 -118497
15801 59568 347379 -311785 202426 190867 -334755 187037 249104 161598 28758 108605 -40652
15789 22546 -164810 385801 216407 251584 -63756 14615 -267912 49014 42878 -14335 118546
15777a95159C0082c89431B69419i4360M5471H081K85879a19778q2458O0887m2822
15766a84171K3611A43711a82904A51453k5506J10609Q1261A30459J09717M5676
15756B85852A03405j2297K7128h1751m7706k04344J40795g6365d092j75075k9851
15745b09018A05312B9092P50J66448O8586E2560a76959A62029b17464j8469R8030
15734a37903j71010C86094a53510O7756o8313G7044e4972j10770A72597a35094
15723A83424b50650H270a03662m5332m1671N7059A02991a0639E7825a92409D2327
15711f32933c3158k06596G0606k6981J65146d61259a9896e130A16671a27309A86142
15699e423k0033A8109c03541B64058B6084J66882F3844a01041E53863d7609f077
$$ plain form
15777 -195159 30082 -389431 269419 -94360 -48889 8081 293960 -119778 -202236 -141349 -184171
15766 -184171 -160560 143711 -182904 151453 125947 236556 317817 130459 240176 285852
15756 285852 103405 91108 118236 -81751 -129457 -333801 -193006 -76365 -4092 -179167 -209018
15745 -209018 105312 29092 29842 196290 264876 52560 -176959 162029 -217464 -235933 -137903
15734 -137903 -308913 386094 -153510 -85754 -154067 77044 -54972 -165742 172597 -135094
15723 183424 -250650 8270 -103662 -148994 -190665 -133606 102991 -10639 57825 -192409 42327
15711 -632933 -33158 -239754 70606 43625 208771 -461259 -19896 -5130 116671 -127309 186142
15699 -5423 -25456 18109 -303541 264058 26084 192966 63844 -101041 553863 -47609 -6077
15687B04357b47492B48134I4103h6856j96760h9718A32139J54307F1005a57690
15676A43274J9060J54995A22025K43251j60671N4711h0384C66190c12014A0320
15665a1138k78301C10868f1448n3936E4040J15300Q5079o5614m8356m1357a09833
15653a921j23937J6040j41085A3378b26062k25066C1083a89648j0209M2530F1989
15641C41232p7056c25530h0573k7454E8259f6164a3535k89866A25616Q5499C798
15629D6337a22106A37664i5924K2654j9622I6813d1174n4279A31856a11839b0212
15617A45448K65803O299a73979H5033Q0554b9614A7820a53599j9105a6340k90658
15606c06998a3395j54167l77870C8025a44515j57052B57c368q748j42419j62664
$$ plain form
15687 204357 -247492 248134 94103 -86856 -283616 -89718 132139 286446 61005 -157690
15676 143274 162334 317329 122025 365276 204605 259316 -80384 366190 -312014 10320
15665 -11138 -289439 310868 -61448 -115384 54040 169340 254419 188805 140449 99092 -109833
15653 -1921 -125858 -109818 -250903 13378 -226062 -451128 31083 -189648 -199857 -157327 61989
15641 341232 264176 -325530 -80573 -108027 58259 -66164 -13535 -303401 125616 211115 3798
15629 46337 -122106 137664 -95924 -73270 -92892 96813 -41174 -95453 131856 -111839 -20212
15617 145448 411251 417550 -173979 85033 165587 -29614 17820 -153599 -172704 -16340 -306998
15606 -306998 -13395 -167562 -545432 38025 -144515 -301567 257 -3368 -12116 -154535 -317199
15595c17199b8611F9972b99248J45570N2565c0518E1923a43950B71949r6157l4939
15584A40853M0984a01539l9486A25048b53273i9503B71177m4062a46184e5505
15573C02452b99487A20030e7935j00279A59442m7749f7517j59271C6777a15369
15562A30745a58011A45820b1368A32499g1904m3780J3495I8535c23162C4373J23712
15551A58085J04303f4808p303j79067J09907A57582a84299g3691c4493A00326
15540a31533B25183F3597a39905A19327a48929A22961d0075l53379A5332K18366
15530B33698c06729f464A1586b46925B70863q8669a61686i720l27538J30464j70148
15519c76942a36779H0431c82876G1249g028A18552p724k768a89791B51749q7548
$$ plain form
15595 -317199 -28611 69972 -299248 -153678 -101113 -30518 51923 -143950 271949 175792 140853
15584 140853 181837 -101539 -141025 125048 -253273 -99503 271177 227115 -146184 -55505
15573 302452 -299487 120030 -57935 -158214 159442 111693 -67517 -226788 36777 -115369
15562 130745 -158011 145820 -21368 132499 -71904 -115684 -102189 98535 -323162 34373 158085
15551 158085 262388 -64808 -72111 -251178 -141271 157582 -184299 -73691 -34493 100326
15540 -131533 225183 63597 -139905 119327 -148929 122961 -40075 -393454 15332 233698
15530 233698 -306729 -6464 11586 -246925 270863 182194 -161686 -9720 -337258 -206794 -376942
15519 -376942 -136779 80431 -382876 71249 -7028 118552 110828 108060 -189791 251749 164201
15508A64201a74308b884k56080B14687a1091j87065r9641I8930l4190L5265M9949
15497A49954a1941A79101a19711C0012e2500R996C32438a09563F1126a02974b4393
15485b29430A33847g8846L4378A0574d5989m3961F0427a2786F2885b79955h1763
15473H5294a84485n9010g8130I6282b95489A21719b94457P2773g7078A45215l4430
15462A10785m9908K25180b6969B10331G1966a02841B61202J8680a52095E6885
15451a89365H7527c02941c2267C0394b09795B7911a45515G5754g578j3930B90631
15439d6044C7658O6058h091j05137C25639E5620K3801a22669e6453A38776h3457
15427a88226H7904J21524b87868B60393b3538j64818F0981P7611K0402G1877b65325
$$ plain form
15508 164201 -174308 -2884 -258964 214687 -11091 -198156 -297797 98930 64740 100005 149954
15497 149954 -11941 179101 -119711 30012 -52500 -42504 332438 -109563 61126 -102974 -24393
15485 -229430 133847 -78846 -44468 10574 -45989 -89950 60427 -12786 62885 -279955 -81763
15473 85294 -184485 -243495 -78130 96282 -295489 121719 -294457 -221684 -77078 145215 110785
15462 110785 60877 286057 -26969 210331 71966 -102841 261202 279882 -152095 56885
15451 -189365 87527 -302941 -32267 30394 -209795 27911 -145515 75754 -7578 -21508 290631
15439 -46044 37658 103716 -8091 -113228 325639 55620 79421 -122669 -56453 138776 -83457
15427 -188226 87904 209428 -287868 260393 -23538 -188356 60981 138592 158994 71877 -265325
15415A55037A2133a18978j66705H277a7836C06069F6899Q324h4636k7274H876
15403A15001a85685M8633H4659c7053E0679a07692A43187a40482A42553C8675
15392a18163A58628d25j36672A08960a29101C45546a26519B4979b83149Q7905
15382a95244C0448f0302D07945a68643a5930B29125a25362c0482B16465B8054
15371a16501A2367a31186N5485m6142B89699d7542A99858c2132B48142b28455
15360E8131a91140q1108a26248M9522C51099A53069h7756c4187E2929K32236a63073
15348H2376a6302A25089J7096h4158B09373D1854i2751j13253k16327A15448a78925
15336C9124b39839H0749a70788f8428m4240i684j54049j31942a03394A32946a11538
$$ plain form
15415 155037 12133 -118978 -285683 8277 -17836 306069 66899 75223 -84636 -111910 8876
15403 115001 -185685 -137052 84659 -37053 50679 -107692 143187 -140482 142553 38675
15392 -118163 158628 -425 -137097 108960 -129101 345546 -126519 24979 -283149 -195244
15382 -195244 30448 -60302 407945 -168643 -15930 229125 -125362 -30482 216465 28054
15371 -116501 12367 -131186 -75701 -121843 289699 -47542 199858 -32132 248142 -228455
15360 58131 -191140 -272248 -126248 -76726 351099 153069 -87756 -34187 52929 285165 -163073
15348 82376 -16302 125089 142185 -84158 209373 41854 -92751 -206004 -422331 115448 -178925
15336 39124 -239839 80749 -170788 -68428 -112668 -9684 -163733 -295675 -103394 132946 -111538
15324F7317a18493A6843M50594a53650B2465J70551b47190Q2187C9377h5279j27677
15313b12956K63A5984L22016c42421c2992A65600a386A69547j4206a57926N930
15302a51996E0749L28935p4756A7043J05270h2233A62370R3899a80145N5548j27079
15291b51676A20623a66553d9580I8591K85312j81744f7948b4197l8262A07471
15280C31655B4175Q9700J8807J42971f2123A8783a64254c3659B73951I8150c16726
15268A43632n349h4968A53823g4395k36383C75503A82406D0216L3749a40032B8785
15256b12741A89481d9271o1165I6023B084N1844M01670K0123M43435O77966k89227
15245A307895J28223l65866l17984B48952J83403a33021B58098p296a16839j42265
$$ plain form
15324 67317 -118493 16843 467437 -153650 22465 193016 -247190 -165003 39377 -85279 -212956
15313 -212956 -212693 15984 338000 -342421 -32992 165600 -1386 169547 155341 -157926 -151996
15302 -151996 50749 379684 304928 17043 122313 -82233 162370 256269 -180145 -124597 -251676
15291 -251676 120623 -166553 -49580 98591 383903 202159 -67948 -24197 -62459 107471
15280 331655 24175 113875 132682 275653 -62123 18783 -164254 -33659 273951 98150 -316726
15268 143632 138283 -84968 153823 -74395 -310778 375503 182406 40216 73965 -140032 28785
15256 -212741 189481 -49271 -110436 96023 2084 53928 455598 475721 919156 1597122 1307895
15245 1307895 1436118 1070252 752268 248952 432355 -133021 258098 250802 -116839 -259104
15235b59104a28486B6359K74249d1612B62974n659d9849D5438J78545A08055k3700
15224H4355a26897C6858K12498D6754c21924C1489a21484D8636J30209o4358i1165
15212B20962k7694J26460I1377J62382q4545b88782a18836A18904n8587e2299
15201B54650b14185I8269K70221a18477B37482j10604h2657A03559d19080H1948
15190A99201f7124A65286B3058d08836A54605a60497A09396b3115N479l17043
15180c34679B37067b41353G5638Q6622C1743J76931a32315C65913c3265j25498
15170a58763g6717A98168d8721J8093B54940a36396A07419a42911D99909b31101
15159b09853G3147o669c586l0468B85916K9679h7787o1609B02667I7034a78603
$$ plain form
15235 -259104 -128486 26359 300608 -41612 262974 257315 -49849 45438 223983 108055 84355
15224 84355 -126897 36858 249356 46754 -321924 31489 -121484 48636 178845 114487 -91165
15212 220962 193268 319728 91377 253759 169214 -288782 -118836 118904 60317 -52299
15201 254650 -214185 98269 368490 -118477 237482 126878 -82657 103559 -419080 81948
15190 199201 -67124 165286 23058 -408836 154605 -160497 109396 -23115 -17636 -334679
15180 -334679 237067 -241353 75638 162260 31743 208674 -132315 365913 -33265 -158763
15170 -158763 -76717 198168 -48721 -30628 254940 -136396 107419 -142911 499909 -231101
15159 -209853 73147 66478 -3586 -34054 285916 315595 -87787 -149396 202667 97034 -178603
15147A01045b7571A1173a15575A54149Q04a72296A00838a41326c8955A66469Q186
15136A74655N0125b19458A33195J62090J74435e2122a3528A29143J6738a12713
15125d0501A7009J87063n2667J6513Q4473a13135H754L4448J61730F7211a9922
15113c58959B9792K63881k3014b04660F6666K19283a79749B62828D8000a62398
15102c2796A99523F6463K79004A53036b05363E2588b5386j91750C9263P9969d89617
15090I6087c47651A65523K24017C360O1765P9165D2765O4979E0367a22923C16551
15078A38318N4262E4839D35b4830C58199A07076e548A61885R4469B5784K41719
15067B67503N497p6504O191b03934A91016f2535D10748A5472Q6030K65519q5528
$$ plain form
15147 101045 -27571 11173 -115575 154149 154953 -172296 100838 -141326 -38955 166469 174655
15136 174655 224780 -219458 133195 295285 469720 -52122 -13528 129143 145881 -112713
15125 -40501 17009 204072 151405 167918 252391 -113135 8754 43202 204932 67211 -19922
15113 -358959 29792 293673 270659 -204660 66666 285949 -179749 262828 48000 -162398
15102 -32796 199523 66463 345467 153036 -205363 52588 -25386 -217136 39263 119232 -489617
15090 96087 -347651 165523 389540 3360 65125 144290 42765 107744 50367 -122923 316551
15078 138318 192580 54839 435 -24830 358199 107076 -5548 161885 256354 25784 267503
15067 267503 273000 196496 202687 -203934 191016 -62535 410748 15472 101502 367021 281493
15056B81493A25463J00605d4012j87308B59671H5742r448J60592c9480C79351
15045B27846a23423B52258A24483c39691i9111B54584I8753J49011g563p4068
15035h1631D46134A26353K6240O9515J1309J87409j94467J70157Q7657A50410
15024a61440C3958J56013l4607b81307B69325a61113C15860f0396H4243Q2947
15014A67190J67737i9757H113L44859j58996b24395B04259J25261c6891A34533
15003B92129J13771j7510a15578E0586L11420B218M13391j57628q5121a4830D08379
14991F7562b5443B78786j31139e0432C06933R409j06834G9913M5905K32538o4229
14980B94127L30213A57372L0466K5371H8503b1824A3096K84821q8258j7828O7191
$$ plain form
15056 281493 125463 226068 -44012 -231320 259671 85742 76294 236886 -39480 379351
15045 227846 -123423 252258 124483 -339691 -99111 254584 98753 247764 -7563 -81631
15035 -81631 446134 126353 152593 222108 233417 420826 226359 396516 484173 150410
15024 -161440 33958 189971 155364 -281307 269325 -161113 315860 -60396 84243 167190
15014 167190 334927 -99757 8113 352972 193976 -224395 204259 329520 -36891 134533
15003 292129 405900 388390 -115578 50586 362006 2218 415609 257981 172860 -14830 408379
14991 67562 -25443 278786 147647 -50432 306933 316342 209508 79913 125818 358356 294127
14980 294127 624340 157372 187838 213209 88503 -21824 13096 297917 209659 191831 259022
14969B59022K35065b052D53686E3688J78490I2309c2028C70828A01836K17668
14959C19504I6862J28664K85959D9837J8855k655L76540A25649K04094A9613Q5053
14948A04666L7384J08069h370A18178J70883K37657B50526q4995K51867A26049
14937A90651K66468Q4751H7443K11348k0319j2402o7597K90558k06675C4652K10075
14926B44727K02102j2159j42701A20820J96927m3783J84206A12495a65217D66320
14915B11404J7329K0346e153A82126m4216M4353K00907J10839A43607e9173k620
14904f1793B92635J79194J8562B24505Q122R2602a23552D12565k208A62484f122
14892G14464D9107J60052K21320A42063J9181J52734M1300L2799K52774j85695
$$ plain form
14969 259022 494087 -2052 453686 53688 232178 92309 -32028 370828 101836 319504
14959 319504 96862 225526 511485 49837 68692 66037 442577 125649 329743 19613 104666
14948 104666 142050 250119 -8370 118178 289061 526718 250526 165531 417398 126049
14937 190651 457119 541870 87443 298791 278472 266070 198473 489031 282356 34652 244727
14926 244727 446829 434670 291969 120820 317747 273964 458170 112495 -165217 466320
14915 211404 228733 249079 -5153 182126 137910 182263 383170 494009 143607 -59173 -61793
14904 -61793 292635 471829 490391 224505 232627 325229 -123552 412565 410357 162484 -6122
14892 714464 49107 209159 430479 142063 161244 313978 355278 388077 640851 455156
14882D55156M2279E3951B4074R6459J94428l85Q436C0379K48971j17032d0889
14870A51929P1945r9997J62270m7843J04915K33337E5015O33412A63095G4124
14859D74978A95071K72257L5000j53412A43078R2691N8852L71884B01518O5866
14849B67384j21695K75227A99307M62036k61177A26192K31696O9205n9164A51368
14838C67398H3052L00520j21383K54307p6878J17878j67356l8795Q4415B04123
14827D64123A56767h5336F33894j00611J81080l05417L18173l01931B09737J17393
14817C27130J01165n2997C6512O92582o5176H9486K57879A73464M37723k08378
14807D02809J93649B55663M41673B38021N29667C10700J64161A92002O0593N3480
$$ plain form
14882 455156 497435 53951 24074 120533 314961 314576 323012 30379 279350 162318 -40889
14870 151929 223874 123877 286147 238304 343219 576556 55015 688427 163095 74124
14859 474978 195071 467328 502328 348916 143078 235769 294621 666505 201518 267384
14849 267384 145689 420916 199307 661343 400166 126192 357888 427093 367929 151368
14838 367398 83052 383572 262189 516496 439618 557496 390140 351345 435760 204123
14827 464123 156767 -85336 633894 533283 714363 408946 727119 425188 209737 327130
14817 327130 428295 375298 36512 729094 663918 89486 347365 173464 611187 402809
14807 402809 596458 255663 697336 238021 767688 310700 474861 192002 252595 306075
14797C06075K28259M6986j04994q0974m318J81082p9075J60058j21670k62753
14787B68676J37804K05850p2442l0496p0722r7029O4491l8528K48594k68129L70561
14776G18630C52301O6204K39710n8367j36200o8682K40288k66588L65681l37204
14766C97143j07577Q5266K211K19247R3895n4446k25121L24240k61292j30051
14756C43515R6843J49525j47774M47266l64511K5439K74663B61013L96723J10814
14746G68550k96846R2329B46291K76478K30989J87231m21097j491R6814J46598
14736G61813j39135L86335l87979J49516j89929m1757k5135M14531o7982q5622
14726G74656k64785j18615N72771k51841o7823n5734r309N400L1175L66691k28067
$$ plain form
14797 306075 534334 581320 476326 395352 391034 572116 493041 653099 531429 268676
14787 268676 406480 612330 539888 509392 438670 341641 406132 367604 616198 348069 718630
14776 718630 352301 418505 658215 599848 463648 394966 635254 368666 734347 397143
14766 397143 289566 374832 377043 596290 690185 635739 410618 734858 473566 343515
14756 343515 440358 589883 442109 889375 524864 550303 824966 261013 657736 768550
14746 768550 471704 564033 246291 522769 753758 940989 519892 518401 615215 761813
14736 761813 622678 1009013 621034 770550 580621 538864 513729 928260 860278 774656
14726 774656 509871 391256 964027 712186 644363 588629 579320 584720 615895 982586 754519
14715G54519k59371K74104j05041M1058O8805R9099J26484l35245l6751Q3668
14705G11329j5811j77856K14840J53304l8681P1058k74475K34016k3351k6066
14695H28307R2870j17450L74385l59457J687J6616o4343J3269m2912q8866N4991
14684G09097L9687R2715O8223K21047l15702j17150J92400j06349J95675m1903
14674I37740j49306r398n271J70983J71586j67955J26535j09903m08272P26730
14664A283469p1373m06874J39401k97729L58391M5357k37396L76468m49268K07989
14654I48435K05004k80943N8650L61833E85183J18096j80110N10978L12540n18263
14644H28424O37847m30979N52371p50540M69651n02497N95478p7526p0590M9658
$$ plain form
14715 754519 495148 769252 664211 705269 774074 873173 999657 664412 627661 711329
14705 711329 695518 517662 732502 885806 847125 918183 643708 877724 854373 828307
14695 828307 921177 803727 1178112 818655 820342 836958 772615 785884 742972 654106 709097
14684 709097 748784 841499 909722 1130769 815067 697917 890317 783968 979643 937740
14674 937740 788434 779036 773765 944748 1116334 948379 1074914 965011 556739 1283469
14664 1283469 1212096 805222 944623 646894 1005285 1050642 813246 1189714 740446 948435
14654 948435 1153439 872496 931146 1292979 585183 703279 523169 1034147 1346687 828424
14644 828424 1466271 1035292 1587663 837123 1306774 804277 1399755 1322229 1251639 1301297
14634A301297o50203L66193K51671n25763M48775L0711p2207l73911P69337l91065
14624A154835o0474N73637k07343m16685J00376J99601j48878L51652l32386R504
14614A223839J03547K89414o7459k52265j8285L05311k28939k30667K48566j92273
14604A180789L50227m7178J23665k95633r9541K24084K42039q0972K12744j35808
14594A674416l24052O73852o60119K45771R3376J16144J92044l12982j1042k21878
14584A465530L95274n2346P4973p8621k05697K25673m01871K59847J19220k40706
14574A561276N15316J49901n91543N12937m48626K43144J94807p0608j59963L03534
14564B210175L7958j17561K45633j08210M1016M14454p9776L89970j00976m383
$$ plain form
14634 1301297 651094 1017287 1268958 743195 1191970 1222681 1150474 776563 1545900 1154835
14624 1154835 1094361 1667998 1460655 1043970 1144346 1343947 1195069 1546721 1214335 1223839
14614 1223839 1327386 1616800 1549341 1297076 1278791 1584102 1355163 1124496 1373062 1180789
14604 1180789 1531016 1483838 1607503 1311870 1212329 1436413 1678452 1597480 1810224 1674416
14594 1674416 1350364 2024216 1364097 1609868 1703244 1819388 2011432 1698450 1687408 1465530
14584 1465530 1860804 1808458 1883431 1804810 1599113 1824786 1422915 1682762 1801982 1561276
14574 1561276 2076592 2226493 1634950 2147887 1699261 1942405 2137212 2066604 1906641 2210175
14564 2210175 2248133 2130572 2376205 2267995 2309011 2723465 2643689 3033659 2932683 2928300
14554B928300K09625J1491R96498k5141J232718J876791M100395Q321447J8325166
14545C7977290P423983B1837384I652664D606335j948991j66449n21770n0189
14537A918936r2580J81496l51586R8921J47270j60844L35958k2826l37963J91471
14527A908253M6116q0995M6466o4380L26462k85730K17550L1449K81891j76902
14517B250180P2555k73158K83861J37313j07807j8983J74058k00451J36028L270
14507B456866K39176J35217k00633O1027k11342O7240J38388M07401n08023L89553
14497B974870j23054J13819J69091J7117k80743m3341M91816l30763L79567l00479
14487C067900K5574J89348j55658L61745K52057m81722M3220J85316k17797M9699
$$ plain form
14554 2928300 3137925 3149416 4145914 4120773 5353491 7230282 11330677 19652124 37977290
14545 37977290 45401273 21837384 9652664 4606335 2657344 2490895 1969125 1918936
14537 1918936 1826356 2007852 1656266 1755187 1902457 1741613 2077571 2054745 1716782 1908253
14527 1908253 1954369 1873374 1919840 1855460 2181922 1896192 2113742 2145191 2427082 2250180
14517 2250180 2322735 2049577 2333438 2470751 2362944 2343961 2518019 2317568 2453596 2456866
14507 2456866 2696042 2831259 2630626 2691653 2480311 2547551 2685939 3093340 2585317 2974870
14497 2974870 2851816 2965635 3134726 3151843 2871100 2827759 3319575 2988812 3368379 3067900
14487 3067900 3093474 3282822 3127164 3488909 3740966 3259244 3302464 3487780 3269983 3319682
14477C319682L31642k01115J18293L67597l67297J99257J93359k28254p6536L126
14467C659754L12180L41308j93503k99099N45740j67745L58152n49561P56244
14458D763470m68113L71840J04054l71769M27673r8030K58143n13590L33318J98076
14448E005072o9452N6580j78285M53091j75357L3496N22258r8j69958j07276K8478
14437E398549M41408o6155q2184L12248j253K90933m70650L42649K81519l04951
14427F142113L32561K04643j57959K28145K87782l32439L00091j0170M47777l16903
14417G125641L25057L7734J93344M69748k85675O6244K73164K28488k69104L26079
14407H490720L41203q8944L24703j40528K11359J42883M53610k74472O74662j75426
$$ plain form
14477 3319682 3651324 3450209 3568502 3936099 3568802 3768059 3961418 3733164 3656628 3659754
14467 3659754 3971934 4313242 4119739 3820640 4366380 4198635 4556787 4007226 4763470
14458 4763470 4295357 4667197 4771251 4399482 4827155 4729125 4987268 4473678 4806996 5005072
14448 5005072 4935620 4992200 4813915 5267006 5091649 5125145 5647403 5647305 5477347 5370071 5398549
14437 5398549 5839957 5773802 5691618 6003866 6002613 6293546 5822896 6165545 6447064 6142113
14427 6142113 6474674 6679317 6521358 6749503 7037285 6704846 7004937 6994767 7442544 7125641
14417 7125641 7450698 7488432 7681776 8151524 7865849 7932093 8205257 8433745 8164641 8490720
14407 8490720 8831923 8742979 9067682 8927154 9138513 9281396 9735006 9460534 10135196 9959770
14397I959770J9917K38003j34057M67422K20090J81878J41830K21586o6502K29132
14387A1479069M84783k24620P94492j67561J67904L69484J91786K98595K63365
14378A3657297M5021L11674N33985j33824P92572o2007P99920r1054J15212P53368
14368A6722164m27248N21795P91751M70629J58044K53295P45678J66823J77969
14359A9580900P89095P49744M5425P55839N20943K20784P11493M48133Q62615
14350B4684971O57581M63473J110589L35251J004001j88079R40823J021570Q92280
14341C0922460P59644J101379M87155J126291J291763O20248J133195J337203
14333C8779338Q83625J670807J392258Q56750J318285J467545J800935J343254
$$ plain form
14397 9959770 9979687 10217690 10083633 10551055 10771145 10953023 11094853 11316439 11249937 11479069
14387 11479069 11963852 11739232 12533724 12366163 12534067 12903551 13095337 13393932 13657297
14378 13657297 13702318 14013992 14547977 14414153 15206725 15144718 15944638 15853584 15968796 16722164
14368 16722164 16294916 16816711 17608462 18079091 18237135 18490430 19236108 19402931 19580900
14359 19580900 20369995 21119739 21165164 21921003 22441946 22662730 23374223 23822356 24684971
14350 24684971 25342552 25806025 26916614 27251865 28255866 28067787 29008610 30030180 30922460
14341 30922460 31682104 32783483 33270638 34396929 35688692 36308940 37442135 38779338
14333 38779338 39662963 41333770 42726028 43582778 44901063 46368608 48169543 49512797
14325D9512797J628252K013345J618244J982516K325228J621775K543729K216073
14317F5461959K499910K578573K951920K812724L086323L339321L140078M052845
14309H9923653L593977M359709M244117M876722M517995N424575N481344O053598
14301A28475690O431527O664274P053401P438549Q244912Q509060R739667R501795
14293A92058875J0489295J0645952J2024937J2421901J3248490J3537084J4459027
14286B78885561J4957819J5853049J6080496J6320168J6726657J6773240J6898935
14279C92495925J6254302J5492370J4222750J2664755J0546047Q241502N859909
14272D75777560Q68556j036629q91677j153473r39115o152978r997630j1849626
$$ plain form
14325 49512797 51141049 53154394 54772638 56755154 59080382 60702157 63245886 65461959
14317 65461959 67961869 70540442 73492362 76305086 79391409 82730730 85870808 89923653
14309 89923653 93517630 97877339 102121456 106998178 111516173 116940748 122422092 128475690
14301 128475690 134907217 141571491 148624892 156063441 164308353 172817413 182557080 192058875
14293 192058875 202548170 213194122 225219059 237640960 250889450 264426534 278885561
14286 278885561 293843380 309696429 325776925 342097093 358823750 375596990 392495925
14279 392495925 408750227 424242597 438465347 451130102 461676149 469917651 475777560
14272 475777560 476646116 475609487 474717810 473564337 472625222 466472244 456474614 444624988
14264D44624988j3806348j3911490j5638896j6749442j7064075j7168943j6995047
14257C33290747j6901129j6108550j5528647j3785814j3870072j3529954j2734881
14250B30831700j2381073j1524971j0695514r946582r564736q706515q232935
14243A59779374p431005p831634o997398o268264o072010n744060n058477m809878
14235A09566648n142107m385266m181437l920185l519185l603882l569307l117891
14227G8127388l026898l069193k484317k623512k303769k363204k128851j507003
14219E8620641k453674k135029j478663j985633j789914q61104j708696j607679
14211D4600249j368560j378921j185365r76083o03246p69335j681405j161012
$$ plain form
14264 444624988 430818640 416907150 401268254 384518812 367454737 350285794 333290747
14257 333290747 316389618 300281068 284752421 270966607 257096535 243566581 230831700
14250 230831700 218450627 206925656 196230142 186283560 176718824 168012309 159779374
14243 159779374 152348369 144516735 137519337 131251073 125179063 119435003 114376526 109566648
14235 109566648 104424541 100039275 95857838 91937653 88418468 84814586 81245279 78127388
14227 78127388 75100490 72031297 69546980 66923468 64619699 62256495 60127644 58620641
14219 58620641 56166967 54031938 52553275 50567642 48777728 47916624 46207928 44600249
14211 44600249 43231689 41852768 40667403 39691320 39088074 38318739 36637334 35476322
14203C5476322p06434j337350m28339p87592p90524q77465r70909o66455o27984
14194B8283270q98943m26085p05804r59378o84796o15873m37599m28458o84572
14185B2441762m29221l21660q17374j35255m18677l37501n94591k78730n57676
14176A8551077j66870p93444k17965l28081j3664l87070n15859j85143r487m80302
14166A5453192m30101j85149k72077k05303m1452r42448o8808N7987m49677k73755
14156A2642409m20081O9571l36564l20766J2140n09550L06571p4893j02409m98791
14146A0767637J161l73217j00890k86224K18649m01931m42138R8817L721m85604
14136H999981j48037L872j34023m9172n2402m02378J15071P9562k03027l14183
$$ plain form
14203 35476322 34769888 33432538 33004199 32216607 31426083 30548618 29577709 28911254 28283270
14194 28283270 27384327 26958242 26252438 25293060 24608264 23992391 23554792 23126334 22441762
14185 22441762 22012541 21690881 20873507 20738252 20319575 19982074 19387483 19108753 18551077
14176 18551077 18384207 17590763 17372798 17044717 17031053 16643983 16128124 15942981 15933494 15453192
14166 15453192 15023091 14837942 14565865 14360562 14319110 13376662 13307854 13365841 12916164 12642409
14156 12642409 12222328 12291899 11955335 11634569 11646709 11137159 11443730 11368837 11266428 10767637
14146 10767637 10768798 10395581 10294691 10008467 10227116 9825185 9383047 9481864 9485585 8999981
14136 8999981 8851944 8855816 8721793 8672621 8620219 8217841 8332912 8412474 8209447 7895264
14126G895264k04755L2070j93718L67220l28476J71552n47767K21061L5334k69779
14116G178006k68880J02689j69113j45210j2164m93369K20131l22937J68798m7780
14106F210171j03612j86940J36928o3216l6601j30333j74261k04122j8931J77968
14096E607051j86303k4893j18106K60572j02435m0984K01714m17245k89186J06299
14086D996484j43372l39058j26885J68910q921P6732k53076K86809j81779j74867
14076D300977L7023m4798j00567K55199n65438J31147l02200J35754N51801l02921
14066D095977L9141Q851k68908J54843m3093n04745M37152p424l17834L90680
14056C984640J5520l44468m1488L57167n49423k4163l16545R4453L32798j42805
$$ plain form
14126 7895264 7690509 7722579 7528861 7896081 7567605 7739157 7191390 7412451 7447785 7178006
14116 7178006 6909126 7011815 6842702 6697492 6685328 6191959 6412090 6089153 6257951 6210171
14106 6210171 6106559 5919619 6056547 5993331 5956730 5826397 5652136 5448014 5429083 5607051
14096 5607051 5420748 5395855 5277749 5538321 5435886 5394902 5596616 5179371 4890185 4996484
14086 4996484 4853112 4514054 4387169 4556079 4547158 4623890 4370814 4657623 4475844 4300977
14076 4300977 4338000 4293202 4192635 4447834 3882396 4013543 3711343 3847097 4398898 4095977
14066 4095977 4135118 4143969 3875061 4029904 3986811 3482066 3919218 3911794 3593960 3984640
14056 3984640 4000160 3655692 3614204 3971371 3421948 3397785 3081240 3175693 3508491 3365686
14046C365686k98057K63812k68666j27958J51695j05816o2917K75793m9447j3557
14036C130568k5048r9948O1166O1230k91615M9928K04354p7608j36587r5349k25719
14025B555372P8471K5712n27645L58503l3456k07496L55623j53208j38289o18
14015B312969Q1965l1869R7055j60315n39920K62477L31406l19533J17360k68064
14005A883531M54143m23740O20469p47834M16364k75758N1499m09543J70342O48775
13995B388248p53727O13133J2459m40276J15359O13246J231722K647987O942834
13986A3370985J7207075J6064637j9377878A1940071m763394j446907j418004
13979D311766m74604k82363m20459Q4824j79625l96355L23350o99904L65335m6221
$$ plain form
14046 3365686 3067629 3331441 3062775 2934817 3086512 2980696 2917779 3193572 3144125 3130568
14036 3130568 3105520 3005572 3066738 3127968 2836353 2886281 3090635 3013027 2876440 2781091 2555372
14025 2555372 2633843 2659555 2131910 2490413 2456957 2249461 2605084 2451876 2313587 2312969
14015 2312969 2394934 2363065 2460120 2299805 1759885 2022362 2353768 2034235 2151595 1883531
14005 1883531 2337674 1913934 2534403 1786569 2202933 1927175 1978674 1569131 1739473 2388248
13995 2388248 1634521 2247654 2260113 1819837 1935196 2548442 3780164 6428151 13370985
13986 13370985 30578060 46642697 27264819 11940071 7176677 5729770 4311766
13979 4311766 3837162 3554799 3134340 3219164 3039539 2643184 2966534 2266630 2631965 2585744
13969B585744n52592L07745K59464k97491j22130k46544N7329m0504K21364j46804
13959B025581m0876J45177J66713m60137j92021L41950n9401r5717m5332J27046
13949A912983k23011N06237r23337M87277J2244j29777J84740l45059o3946K03447
13939A621798j6628l3528J50113L17799l00680k39558K11379k65848L13731r0450
13929A668128j60714J11984K48569m71941N57707m89647r6159J7391R0263m8997
13919A426584j299J35973n35066M12398n32437O54977J53804k58544J61863k84253
13909A334000k46971N96761l04161R2032j28266l189J4587o5696J074l1877K31034
13898A489328j69303J09155k16936m0714J00742m64391P14977j01368k6311N8759
$$ plain form
13969 2585744 2033152 2340897 2600361 2302870 2180740 1934196 1991525 1951021 2172385 2025581
13959 2025581 1984705 2129882 2296595 1836458 1644437 1986387 1926986 1831269 1785937 1912983
13949 1912983 1689972 2196209 1272872 1760149 1772393 1642616 1827356 1482297 1418351 1621798
13939 1621798 1605170 1571642 1721755 2039554 1738874 1499316 1710695 1444847 1758578 1668128
13929 1668128 1507414 1619398 1867967 1396026 1953733 1464086 1367927 1385318 1475581 1426584
13919 1426584 1425285 1561258 1026192 1438590 906153 1561130 1714934 1456390 1618253 1334000
13909 1334000 1087029 1683790 1379629 1471661 1343395 1340206 1354793 1289097 1290171 1258294 1489328
13898 1489328 1320025 1429180 1212244 1171530 1272272 807881 1522858 1421490 1395179 1453938
13888A453938j60798j90283j82074K76391n2120M9118K22137l81904j24355M87829
13878A397879k72387J29822k23680j31236J75666n8942K69987j26802k85727j27367
13868G47213K26803K83388m6125j15348j1712J22778k92505J08039K21587k38948
13858A005170l99848N03805L1234r4375j28349N9508J09928m5464k58119N5105
13848H38595J91110k99530l5285J73564j9260p3951P5670k34163O71044k34008
13838A053786m23110m7754P8264M651j16482N26911J59736k77697C85507N86433
13828I71940K43098l21571j6600J06815p667j40836k73311L71289k26305l0047
13818F76805J74537L7467j20260j22915K19847r2112J1478K8500J07072N0904
$$ plain form
13888 1453938 1293140 1102857 920783 1197174 1145054 1194172 1416309 1034405 910050 1397879
13878 1397879 1125492 1255314 1031634 900398 1076064 1017122 1287109 1160307 874580 747213
13868 747213 974016 1257404 1211279 1095931 1084219 1206997 914492 1022531 1244118 1005170
13858 1005170 605322 1109127 1140361 1045986 917637 977145 1087073 1041609 783490 838595
13848 838595 1029705 730175 694890 868454 849194 775243 850913 616750 1287794 1053786
13838 1053786 630676 582922 661186 665837 549355 1076266 1236002 958305 385507 971940
13828 971940 1215038 893467 876867 983682 976015 835179 561868 933157 706852 676805
13818 676805 851342 888809 768549 645634 865481 773369 784847 813347 920419 971323
13808I71323l38881L66539j57727N4169j46770N2672j40478J47835j0819j01114
13798F96749k25071K14097k91707J71281M68311J7328l03449k44070R2732J90885
13788G87086l38604J02867L34005k8146K0047m19166L21659k67531k3738J57764
13778F46243j70278Q2549M26226C53400M25288J16002C60611L57436r9590l00499
13768C17958N80833B12487L31043J84416K2901C74195K76123Q586K51955j10545
13758H00314k87957R612J47739J7085K99556C82167K50560R854J70371r025j50824
13747F53103L14359J07718D48539P0026j5558j51622J44473j08418J65391j4491
13737E38340k2300M7073k39916L12900M1761k09417J37083J23098B18100M09068
$$ plain form
13808 971323 632442 998981 841254 895423 748653 801325 660847 808682 797863 696749
13798 696749 471678 685775 394068 565349 1033660 1050988 747539 503469 596201 787086
13788 787086 448482 551349 885354 857208 877255 458089 779748 512217 488479 646243
13778 646243 475965 558514 984740 353400 778688 894690 360611 718047 618457 317958
13768 317958 898791 212487 543530 727946 750847 374195 650318 658904 910859 800314
13758 800314 512357 521969 669708 686793 986349 382167 632727 642581 812952 803927 653103
13747 653103 967462 1075180 448539 518565 503007 351385 495858 387440 552831 538340
13737 538340 516040 563113 323197 636097 677858 468441 605524 728622 218100 627168
13727F27168J75280l19713N2172L86194k36143j27109R2833l11818j17939O0662
13717B81587K35169J98065m9269L4141B93043J11622K9625Q5314B35191K70935
13707E06126o2100j20174O2623Q9426O5443R8616k47376J6975J10332K70721B58366
13695A89724o826K43233J44284k34121J56311N2093n7180K35344j93064J54329
13685F84127J608j86868n7983p3203j42047M09987j96385j994n4336n7006J79968
13674E05868A66993M31986r1135Q3544A70537J34459K24668j05523M9995N2264
13664E26400G6980b3458C29387L70718B46054K54592k11351K66673q7270K74431
13654G43129O9513l50238n8779L5794l2780J98387k56662L4458A67692L04217
$$ plain form
13727 627168 802448 482735 534907 921101 684958 557849 650682 338864 220925 281587
13717 281587 516756 714821 665552 699693 293043 404665 434290 519604 235191 506126
13707 506126 444026 323852 386475 475901 541344 639960 392584 409559 519891 790612 258366
13695 189724 182898 426131 570415 336294 492605 544698 487518 722862 529798 684127
13685 684127 685735 498867 440884 367681 225634 635621 439236 437242 382906 325900 505868
13674 505868 166993 598979 507844 591388 170537 304996 529664 424141 474136 526400
13664 526400 76980 -23458 329387 700105 246054 500646 289295 555968 468698 743129
13654 743129 812642 462404 403625 439419 406639 605026 348364 382822 167692 471909
13644D71909A40354L13431j04860p9954a17678E24619r8801E2851O20206Q8504
13634G61561A13714L76329l9832j66241O9560A28520C4972M91088k01375K18738
13624E43423B04522J88731K15403j40938L4030m8168j48512j44993K81590n8770
13614C82895J38080m4294A29441J1014L7875L62712j87195j0774j60409K81676
13604D64340J02309a7460A50618K77745j4825K4440p9401J73717J25520l09478
13594C48336R510D9823K19579Q3632K66360k91132J64544o445j73704A14035J94155
13583C08190L70435B89658j05837J94966J91400J20191A63987J97061j15651n0608
13573A94789L53641k57136L2178j29950J91671J24005A03345L18359A25276L24527
$$ plain form
13644 471909 140354 453785 348925 268971 -117678 524619 425818 52851 673057 761561
13634 761561 113714 490043 450211 283970 353530 128520 34972 526060 324685 543423
13624 543423 204522 393253 608656 467718 501748 453580 305068 160075 441665 382895
13614 382895 520975 476681 129441 140455 178330 541042 353847 343073 182664 464340
13604 464340 566649 -17460 150618 428363 413538 437978 358577 532294 657814 348336
13594 348336 357846 49823 269402 353034 619394 328262 492806 486361 312657 114035 308190
13583 308190 678625 289658 183821 378787 570187 690378 163987 361048 245397 194789
13573 194789 548430 291294 323472 193522 385193 509198 103345 421704 125276 449803
13563D49803K48014A31083L18920j76311c735A92981L27783k41409Q0422L14139
13553F73916B26748J93816j22383R8192j06549p7353j7368J97957a0691B57912
13542A06251L35502A57379K41432A45593B2434K41239E4319J20550K16783a4544
13531B92254q2147K13026k01129j0421O6421n5488J96964m2785K60891k21013
13521D16573D3777A826K48995l3634M8349M5882A43130L99389A14627K58374j56723
13510B16278R24K84169G778J53930n7884K00320j00258K38164R8889j99024F0836
13498C33118p5714J67504a7623B66076j01172J95129j43029L0710l008j11442
13488A33264N0333q7028J78282D672L68018H8774k3862O852L60877j93353M27038
$$ plain form
13563 449803 697817 131083 450003 273692 -3735 192981 520764 279355 359777 673916
13553 673916 226748 420564 298181 396373 289824 212471 195103 393060 -10691 257912
13542 106251 441753 157379 398811 145593 22434 263673 54319 174869 391652 -14544
13531 292254 210107 423133 222004 211583 278004 222516 419480 376695 637586 416573
13521 416573 43777 1826 250821 217187 265536 311418 143130 542519 114627 373001 216278
13510 216278 217202 501371 7778 161708 103824 304144 203886 442050 540939 341915 60836
13498 333118 257404 424908 -17623 266076 164904 360033 217004 247714 244706 133264
13488 133264 183597 96569 274851 4672 372690 88774 64912 71764 432641 239288 666326
13477F66326B37220C4865J43254p902J64101N9022O4623B4925J57416Q5019A0795
13465D09878o4790M8715a1101C4451L07466J23343B13072L60337A01276l2503
13455F8773M32031M4248J39878l32998J6540K2394A86721J48302A58364A3491
13444F9428R3631d352E46426f7924D39729A72839O2824j7102F7864a97441G7441
13432I7247a06447B79131A6287R8712R8268M60557h9993A15264L09567A99564
13421C51029j52577B0188J38743m7332A9311K07745b48676A24956E7092M46703
13411E03795j76947F7440K05747A18700C8668d2946A22382K9074K75634q1649
13401C45441A303L35040e4929F7071L16879j2542b7973A86509N0219r7267K12432
$$ plain form
13477 666326 237220 34865 178119 170217 334318 393340 457963 24925 182341 267360 10795
13465 409878 345088 393803 -11101 34451 341917 465260 213072 573409 101276 68773
13455 68773 500804 545052 684930 351932 368472 390866 186721 335023 158364 13491
13444 69428 163059 -4352 546426 -67924 439729 172839 235663 218561 67864 -197441 77441
13432 97247 -106447 279131 16287 114999 213267 673824 -89993 115264 424831 199564
13421 351029 198452 20188 158931 111599 19311 227056 -248676 124956 57092 503795
13411 503795 326848 67440 273187 118700 38668 -42946 122382 151456 427090 345441
13401 345441 1303 336343 -54929 67071 383950 371408 -27973 186509 236728 139461 351893
13390C51893c4188C77266b9630A57604L17905A83112k8426F9680K04163B3383
13379C6043J07541o4104J27345i6911C39555F0475K10044A10662M4595n5887c0055
13367D5381a01294A64890H2349J72353J07680M7898A46016p2104f8870H3351K04386
13356B87737q4408l9116Q4502o8010b26892B11529J21947j22489q4190R4354A04734
13344A85323p4814c106B75622J44842A4476M89677j06788J12805M333A25299K78973
13333D04272j40761e1858B56428r5961l6154D4090K88528b61180d0438C7292J44852
13322A82144J75762r9646K33503C2215K47671g6725C76981H4428h9064A95134
13311A81547J1312J52675R4962k16182E8107K11514J07782a4691o2599A04828
$$ plain form
13390 351893 -34188 377266 -29630 157604 475509 183112 154686 69680 273843 23383
13379 36043 143584 79480 206825 -96911 339555 60475 270519 110662 155257 99370 -30055
13367 45381 -101294 164890 82349 254702 362382 410280 146016 73912 -68870 83351 287737
13356 287737 203329 164213 248715 180705 -226892 211529 333476 210987 126797 221151 104734
13344 185323 110509 -3106 275622 420464 14476 504153 397365 510170 514503 125299 404272
13333 404272 263511 -51858 256428 160467 124313 44090 332618 -261180 -40438 37292 182144
13322 182144 357906 258260 491763 32215 279886 -76725 376981 84428 -89064 195134
13311 181547 192859 345534 440496 224314 58107 269621 377403 -14691 -77290 104828
13300E75279G2653a3235j9465E7598M81069g8608H934g8547B48298M476D347J25056
13288A29403K2050J30859H591J18101h9545B29362J53587A57056q204n7810k7716
13277F3326N3573j5746J71600m4117a28658B71342L1058i6083D60743i2102H6297
13265C9518J25954J36005J42762A20719O013L86770k41777e9439k02287J10340
13255a51386D6241A1260j615M5991J60881J01372K4183j17561L6353A26308c5370
13243b14324D694b20698A87919e016n4092j22916b2320C36969H4465a52930C73268
13231F4444a62956B01845m757f3570a3818B7872J02899b05850A19448n0042L9398
13220A08804J07042H0343a41852G2341L6256k399K2787M1374e243E9191K64078
$$ plain form
13300 575279 72653 -13235 -32700 57598 538667 -78608 8934 -78547 248298 252774 4347 129403
13288 129403 151453 282312 8591 126692 -89545 229362 382949 157056 148852 91042 63326
13277 63326 116899 101153 272753 228636 -128658 271342 302400 -96083 460743 -92102 86297
13265 39518 165472 301477 444239 120719 126732 513502 271725 -59439 -261726 -151386
13255 -151386 46241 11260 9645 55636 216517 317889 342072 224511 260864 126308 -35370
13243 -214324 4694 -220698 187919 -5016 -59108 -182024 -22320 336969 84465 -152930 373268
13231 64444 -162956 201845 197088 -63570 -13818 27872 130771 -205850 119448 69406 108804
13220 108804 215846 80343 -141852 72341 108597 106198 128985 170359 -5243 59191 323269
13209C23269a2351C8392a77499B76333G8168K40045j16077k8717a39808B94699
13198C97814j50751a34893A4817g1087C78890A33472p248b90802f8267k47435
13188c15702E510b39733I4359J35791i7000H4158h8268E5901B0345K68479j22615
13177A66209J8227q8664a53298E06649A36370a96864C45200j8596A7553L5208
13167E2761i4994A47980c18906B48754A3017i5747E17095A24072n4053J60468
13157B30487h050A98158P9560a0969A36514A7905L8502M9627R3996K96258k26692
13146B69596I5776J23803L9033A8613J54840b1467h96A71465f9048B78484j06807
13135A71677J3142a43293H0325a14296K2160A8302J25619J55218a12467E7058
$$ plain form
13209 323269 -12351 38392 -177499 276333 78168 318213 202136 173419 -139808 294699
13198 397814 247063 -134893 14817 -71087 378890 133472 126224 -290802 -68267 -315702
13188 -315702 5510 -239733 94359 230150 -97000 84158 -88268 55901 20345 288824 166209
13177 166209 184436 95772 -153298 506649 136370 -196864 345200 326604 17553 52761
13167 52761 -94994 147980 -318906 248754 13017 -95747 517095 124072 70019 230487
13157 230487 -8050 198158 277718 -10969 136514 17905 56407 106034 200030 496288 269596
13146 269596 95776 219579 258612 18613 173453 -21467 -896 171465 -69048 278484 171677
13135 171677 184819 -143293 80325 -114296 -92136 18302 143921 299139 -112467 57058
13124b58110B42203M7857m5462j18359p542B070K71782a4991A31950R92K25818
13113C58760F9385O0127a34160G3645e4384I2623M11775B22385I8859A5157K15874
13102B31031a50061A96587c1417C9004c9830A87459L11662A42238J40003o8800
13092B13441F8369Q1457K14773M9808A0075L84844A56014b64732C50440b3608
13081C07932C3008c18420A12463J01390A02467R7569H5197h6398m3299F6677Q3275
13070A49952B7784J1372a40565p9501C11547F9188J42351j984a5239C47061A00720
13058a5865l9668A20077K15366j47240E9762c66923h3296A17787d4749k04845
13048b49594B04213H11J610b08407I083h2341C60762c84418B02793h8427B15349
$$ plain form
13124 -258110 242203 290060 244598 126239 118697 2070 273852 -14991 131950 132942 358760
13113 358760 69385 129512 -134160 73645 -54384 92623 504398 222385 98859 15157 231031
13102 231031 -150061 196587 -31417 39004 -39830 187459 499121 142238 282241 213441
13092 213441 68369 149826 364599 414407 10075 394919 156014 -264732 350440 -23608
13081 307932 33008 -318420 112463 213853 102467 200036 85197 -86398 -129697 66677 149952
13070 149952 27784 39156 -140565 -220066 311547 69188 211539 209555 -15239 347061 100720
13058 -15865 -55533 120077 335443 188203 59762 -366923 -83296 117787 -44749 -249594
13048 -249594 204213 811 2421 -208407 9083 -82341 360762 -384418 202793 -88427 215349
13036B3879K6832a61634A39285F3851a63943N3454n136C77503j41278r338A00876
13024a43847B67913j16206J80332J59619B26028b1627C45738j43996d7086C48217
13013C0583b1799H341M8634J98494e6334A13782D3617K89051a97678B51178N380
13002B56558J84004A0245L54418E481P3476L3948B5688L06768D2695K88472H0904
12990D62596B867b32455I2048P0728J16842C5684b96726a07271A32487L76989
12980E09476c536A82559b4350A52354o6067J98252a02536A72403P88b2996H5988
12968F6734a39055B15309I7613R4695c8274H637M2323a0991m06275i974m1396
12957e1370m7383B04690J06101b83466e6014A16871d1089j21937A04824K63715
$$ plain form
13036 23879 50711 -161634 139285 63851 -163943 -110489 -115625 377503 236225 226887 100876
13024 -143847 267913 151707 332039 491658 226028 -21627 345738 201742 -47086 348217
13013 30583 -21799 8341 56975 255469 -56334 113782 43617 332668 -197678 251178 256558
13002 256558 440562 10245 364663 5481 78957 112905 25688 332456 42695 331167 80904
12990 462596 2867 -232455 92048 162776 279618 35684 -296726 -107271 132487 509476
12980 509476 -3536 182559 -24350 152354 86287 284539 -102536 172403 173191 -22996 85988
12968 66734 -139055 215309 97613 192308 -38274 8637 50960 -10991 -417266 -9974 -51370
12957 -51370 -98753 204690 310791 -283466 -56014 116871 -41089 -163026 104824 368539
12947C68539H9024i2777j83894k5429i8356A78072a7760A73856a09708b7777E9111
12935a32338G8004a39171D2281c5055k03116A48910K07934A36142B6325K06370
12925B32695e4771F3273K40130a9802A7161b19181A69501q2554a32622n9756j59233
12914c51611A74229a12646C61864j51167D471g0566k15673N7328A76161i5597
12903a02555a3742C64989a52960A37771C474M8820R5261p2141a48377n2132H9268
12891B54480A06021a32892A89605p358D0465O2244K11086j03539a35262b0325
12880B07193k845c5116p6680A55094a22224d1606A26089b1464C4738L23555f3546
12868H9513B3437M4726N1097L1973C3041N4315j3913b86803D4474J87458D8594
$$ plain form
12947 368539 89024 -92777 -276671 -302100 -98356 178072 -17760 173856 -109708 -27777 59111
12935 -132338 78004 -139171 42281 -35055 -238171 148910 356844 136142 26325 232695
12925 232695 -54771 63273 303403 -19802 17161 -219181 169501 86947 -132622 -192378 -351611
12914 -351611 174229 -112646 361864 210697 4471 -70566 -286239 -228911 176161 -95597
12903 -102555 -13742 364989 -152960 137771 3474 52294 147555 75414 -148377 -200509 89268
12891 254480 106021 -132892 189605 182247 40465 102709 313795 210256 -135262 -20325
12880 207193 204348 -35116 -111796 155094 -122224 -41606 126089 -21464 34738 358293 -63546
12868 89513 23437 68163 119260 151233 33041 87356 73443 -286803 44474 231932 48594
12856A36828R4708M5353a6197C35227c4645F9964Q0766e9144n3182b6880j20698
12845a47578B18236b3884A41068j8809b14339F4601R894j5819b27427f4954B48450
12833B05573L9372a16901E0329f7289E9674f6397l8233E24028b589m7601A47134
12821B22537c18624A3198L94585j67338i6257A09248j0977a1196A19795h2364
12810A85749a2954r3459k2686A46378K2261l1644a24111c8430C19770b5730B70919
12798g0504j33332A84086a21029b7688A24436g1392o8652m613B14102b20660d0591
12786B04148m0206b42783D070O13274i9507c5723A52763a3972l5007j68348g4640
12774C0702b62015a2838l29168D3304J77361B9060b07681E6838b7620j67239C66573
$$ plain form
12856 136828 231536 276889 -16197 335227 -34645 69964 150730 -59144 -112326 -26880 -147578
12845 -147578 218236 -23884 141068 122259 -214339 64601 74495 58676 -227427 -64954 248450
12833 205573 244945 -116901 50329 -67289 59674 -66397 -104630 524028 -2589 -50190 147134
12821 222537 -318624 13198 407783 240445 -96257 109248 98271 -11196 119795 -82364
12810 185749 -12954 -106413 -129099 146378 168639 136995 -124111 -38430 319770 -25730 270919
12798 -70504 -203836 184086 -121029 -27688 124436 -71392 -140044 -144657 214102 -220660 -40591
12786 204148 163942 -242783 4070 617344 -99507 -35723 152763 -13972 -48979 -217327 -74640
12774 30702 -262015 -12838 -342006 43304 220665 29060 -207681 56838 -27620 -194859 366573
12762B6416M5791f9271p8465q274A81866L1192c91243A83135c68318a79458B21068
12750E25017d67891B78511G1266K28807b3960l4853A03721C5210J34474g9519
12739D0294a78475A91321d9848G9388G397a64385D45999A68922R9701E2514a53334
12727b6704j16437j74727F25637B11384D8873b10736I528c12190a45209b3351
12716F6019c05397A61061c8765j78579C96739A75402K84566I0102I579M07436
12706D17015A52579P8482F2887K4965c6186B11722o1694J83728D5034K06486b46297
12694d2576A24973K17931E9907R7717a20160e5968o1606A61772p053J5993M3049
12683B13761a02192I4548Q3222c2995B38227I1295J58624m8726b650C48506b58631
$$ plain form
12762 26416 72207 -69271 -147736 -156010 181866 213058 -391243 183135 -368318 -179458 221068
12750 525017 -467891 278511 71266 300073 -23960 -58813 103721 35210 169684 -79519
12739 40294 -178475 191321 -49848 79388 7397 -164385 445999 168922 268623 52514 -153334
12727 -26704 -143141 -317868 625637 211384 48873 -210736 9528 -312190 -145209 -23351
12716 66019 -305397 161061 -38765 -217344 396739 175402 459968 90102 9579 417015
12706 417015 152579 231061 62887 87852 -36186 211722 150028 333756 45034 251520 -246297
12694 -42576 124973 342904 59907 157624 -120160 -55968 -117574 161772 154719 170712 213761
12683 213761 -102192 94548 177770 -32995 238227 91295 249919 201193 -2650 348506 -258631
12671C8223J60816J30114A13726m7777J24891b17187C99066j62674a4049D1202
12660A67313f9017C79454A78535J64798L5038p1605q1109n5116b69732d3595j1016
12649e4611D3589e5974A50642i5466A6415a37036f2030B09514a83117H0428J92565
12638B72993b52596E1045P7831J11981G6125K06875o082d9767b129o3908G6670
12626C82165A30580d0656A79621Q508d27027B20646q2189e029p2589B07555a61511
12614A85307H7571K13079c27734B02578I3238m0302g0207F053L49808A65715c8049
12602C11531j4811n8828K16032r4781A70373H3396L3734H456L4667f6855A08985
12590E5295J50885C6312J7776e3684G9532Q5407P0501a38342C29462b27918H8715
$$ plain form
12671 38223 199039 329153 113726 65949 190840 -217187 399066 236392 -14049 41202
12660 167313 -69017 379454 178535 343333 378371 306766 225657 170541 -269732 -43595 -54611
12649 -54611 43589 -55974 150642 -95466 16415 -137036 -62030 209514 -183117 80428 272993
12638 272993 -252596 51045 128876 240857 76125 283000 276918 -49767 -2129 -66037 76670
12626 382165 130580 -40656 179621 188129 -427027 220646 138457 -5029 -77618 207555 -161511
12614 185307 87571 300650 -327734 202578 93238 52936 -70207 6053 355861 165715 -38049
12602 311531 296720 237892 453924 359143 170373 83396 117130 8456 43123 -66855 108985
12590 55295 206180 36312 54088 -53684 79532 164939 235440 -138342 329462 -227918 88715
12578C73996c2949o2833B75349b94501A13147K6048b25187F9076a4224A97175
12567a33681k73136a44566c7030E417J6455i1254B09647A03862m4990a34994o4016
12556a99010a4209f010p2685A47516n0642f8834n3242J4871K9494J3605n05506
12545e69612c5782k5051o5330k19354C54252j16870J32564h4120m532G7980a37409
12533D16159A09236N9942c9412A21824B0266N16951F819J70493q4281i1443k670
12522i4113A36752j8789a2796l53632a23191I3086a9698c426q7267M3860A61265
12510b14754D4120J01708a48134B07102G4356a02573c6269O795h450A90970L6183
12499B27153g526B18325O1166F9412L50273i5535d268r7458D7824P2917b54501
$$ plain form
12578 373996 -32949 -95782 275349 -294501 113147 139195 -225187 69076 -14224 197175
12567 -133681 -406817 -144566 -37030 5417 21872 -91254 209647 103862 58872 -134994 -199010
12556 -199010 -14209 -6010 -78695 147516 96874 -68834 -122076 -107205 -77711 -64106 -569612
12545 -569612 -35782 -60833 -126163 -345517 354252 237382 369946 -84120 -88652 77980 -137409
12533 416159 109236 169178 -39412 121824 20266 537217 6819 177312 93031 -91443 -94113
12522 -94113 136752 117963 -12796 -366428 -123191 93086 -19698 -3426 -90693 -46833 161265
12510 -214754 44120 145828 -148134 207102 74356 -102573 -36269 -29474 -8450 190970 227153
12499 227153 -7526 218325 279491 69412 419685 -95535 -4268 -101726 47824 120741 -254501
12487I210M78199A54367J49709A9697K4589a19362B46533a35197j37819A4901
12476i1732A53236a43436G0550c02100h6554E7600G596a05638J0741A12150C620
12464a7318H0832j2821K1129a46051P1840A8337b51512A22078c55490i2550H6045
12452h6652k58506C45448j49274c24355n4366c8630l52240B1149j475c4123I7899
12440B86159b22135B50125R4073B4307Q2939l0929a79647M2499A81464a26848
12429C4299b71661k2333J03807A81307c8599A07755K72945j45641a36378B985
12418A36519a65906j0067A41754b17402j25282A14640a6962A60828B0913N762
12408B6675G280d1987C71181b92152A93952A8782J09896a91678N7165B94555a07795
$$ plain form
12487 9210 487409 154367 304076 19697 44286 -119362 246533 -135197 -273016 14901
12476 -91732 153236 -143436 70550 -302100 -86554 57600 7596 -105638 -94897 112150 3620
12464 -17318 80832 68011 89140 -146051 -74211 18337 -251512 122078 -355490 -92550 86045
12452 -86652 -345158 345448 196174 -324355 -378721 -38630 -390870 21149 19674 -34123 97899
12440 286159 -222135 250125 344198 24307 107246 76317 -179647 -137148 181464 -126848
12429 34299 -271661 -293994 -190187 181307 -38599 107755 380700 235059 -136378 2985
12418 136519 -165906 -175973 141754 -217402 -342684 114640 -16962 160828 20913 26675
12408 26675 7280 -41987 371181 -292152 193952 18782 128678 -191678 -134513 294555 -107795
12396A04880M9649a25920D1175b294A52879a06154A17105r099h6579o8379d0766
12384F4367p593K4539e8036B12418f9378j95346g5768E9298b66938d0052k28162
12373b68214A91914a81207j44768A62790o0002R5950b61346A83913a81092a3895
12362B4243K54038j07185J475a89578E0224O4220d3586H4786a41397O4712r1346
12351a68031G775h1297m093A59283f5231q4863J3946j97202H3656L2751J02148
12340B18555d05681h1351k69103B60360c416B53277n8048a40201G2485O989M7824
12329A27298f2624l4012A03427c6915n4437I979a6912j82614q3336b4819B47844
12317b52176J25893j21372A43365l7499a66484A8708b36456G1690A2437N0389
$$ plain form
12396 104880 154529 -125920 41175 -2294 152879 -106154 117105 108006 -86579 -154958 -40766
12384 64367 56774 81313 -58036 212418 -69378 -264724 -75768 59298 -266938 -40052 -268214
12373 -268214 191914 -181207 -325975 162790 102788 198738 -261346 183913 -181092 -13895
12362 24243 278281 171096 172571 -189578 50224 114444 -43586 84786 -141397 -76685 -168031
12351 -168031 7775 -81297 -85390 159283 -65231 -150094 -136148 -333350 83656 116407 218555
12340 218555 -405681 -81351 -350454 260360 -3416 253277 195229 -140201 72485 79474 127298
12329 127298 -62624 -96636 103427 -36915 -91352 9979 -16912 -199526 -282862 -24819 247844
12317 -252176 -126283 -247655 143365 105866 -166484 18708 -236456 71690 12437 62826
12307F2826j9338h4874M0727D72a27987J2261I9568b78927A06023f2154l50799
12296d12953A85086g044o9057B06096J72083E7186A1105O6548J12556b04464N3712
12285a50752j60814c8557A30310k6303h8206B94149A32340l7861B6406K7564L93535
12274D47505A81585d3563A10472M07409i2642a0093F7900R9735E2542a46874A71604
12262b28355G3496N4392b10598B01894p9431J3895L19021d5754B72253a4549A05479
12250B66539D4875K98374r2778F1949b96372i1471B80735g8158A16602J25481
12240B42083h5136H5099C2490K29021O1428j15945A0999L00249B8606R7538J07718
12229B33862o8643Q6686q3371b07459D29687A16828R3120n7699j5468J14746J28590
$$ plain form
12307 62826 43488 -84874 -44147 472 -127987 -115726 99568 -278927 106023 -62154 -412953
12296 -412953 185086 -7044 -76101 206096 378179 57186 11105 77653 190209 -204464 -150752
12285 -150752 -311566 -38557 130310 104007 -88206 294149 132340 94479 26406 53970 447505
12274 447505 181585 -43563 110472 517881 -92642 -10093 67900 167635 52542 -146874 171604
12262 -228355 73496 127888 -210598 201894 122463 136358 455379 -45754 272253 -14549 105479
12250 266539 44875 343249 250471 61949 -296372 -91471 280735 -78158 116602 242083
12240 242083 -85136 85099 32490 261511 322939 206994 10999 311248 28606 126144 233862
12229 233862 165219 251905 168534 -207459 429687 116828 209948 152249 136781 251527 380117
12218C80117R178A65386R0525F7393K09789J87598h2487A01591K12619a48069
12207A69852G3481J18208d9120A74286J22386k5518I1107M2532a42939J1723C39665
12195A37163e8684A55858M35015a70772A14993k9817b10119B20481H4046J64138
12185B48184n2075r2527M0495J10006a64546A05739D4812J14011J16397A13304
12174B07707F086J28416k4060L4968n8407C4499Q9419J533L8493R1519C1216K8996
12162F0212L5595d8737J0673k23651C4488J52533N4526A01225i7975E0216N8558
12151A08774J92992j32794a59j97009A88717n4533D6086a22728B53132a13761
12140a2816k34476e3945k18931B53240f485B5562d3648r0703e1259B59939I5715
$$ plain form
12218 380117 389295 165386 255911 67393 277182 464780 -82487 101591 314210 -148069
12207 169852 73481 191689 -49120 174286 296672 271154 91107 133639 -142939 -131216 339665
12195 137163 -58684 155858 590873 -170772 114993 85176 -210119 220481 84046 248184
12185 248184 196109 103582 144077 254083 -164546 105739 44812 158823 275220 113304
12174 207707 6086 134502 110442 145410 87003 34499 123918 125451 163944 255463 31216 60212
12162 60212 95807 -48737 -38064 -261715 34488 187021 241547 101225 -97975 50216 108774
12151 108774 301766 168972 -159 -197168 188717 134184 46086 -122728 253132 -113761
12140 -12816 -247292 -53945 -272876 253240 -6485 25562 -43648 -134351 -51259 259939 95715
12128B99661I3775b53519A12830m645M943b19907A4742J9864J24280D1013g273
12116i3698b2860j7775j61820i881m6275A9171J14990i24A2160K63371A08557
12104A29489b95637d2703m5545j57274C6459J78174m8855C498a88150C86349a45421
12092E9252J93734b8154B00878o5850a12529J2524B48056a01539b9336A00023
12081B20606H1682B9144R1186J589J63630R28702Q52805H80830B84955a62640
12070A92892D9887b58452D0194d6405C54911A72526a41764C28693a24326k04400
12060c28726a05886r3158E09596I7900f0761o3773h629E5865a68984D73638B04233
12048A4664b0773B9442h5073j40821g9675A04129a14386d5970n0167l1062g341
$$ plain form
12128 299661 93775 -253519 112830 108185 113128 -219907 14742 34606 158886 41013 -7273
12116 -93698 -22860 -40635 -202455 -9881 -56156 19171 134161 -924 12160 275531 108557
12104 129489 -295637 -42703 -88248 -245522 36459 214633 165778 3498 -188150 386349 -145421
12092 59252 252986 -28154 200878 135028 -112529 -100005 248056 -101539 -29336 100023
12081 220606 81682 29144 120330 121919 285549 1214251 2067056 880830 284955 -162640
12070 192892 49887 -258452 40194 -46405 354911 172526 -141764 328693 -124326 -328726
12060 -328726 -105886 -199044 509596 97900 -60761 -124534 -8629 55865 -168984 473638 204233
12048 14664 -20773 29442 -85073 -225894 -79675 104129 -114386 -45970 -96137 -127199 -7341
12036B9513f1838r7400C62590a44751p4792h8192H2503f5840A00449J2051d9612
12024a51098A20260a23767j92674a20461H7388J54401D49h0682C65392A1023a32657
12012G6167c0993J2117j80628P597J0296c0348B37127e23606g9651A36770O5953
12001B02723a46343B85203q9506a44955A1719G5g2754E8361K79169b60587c2510
11989d8156j36616E9586N2598Q862c2751j16151k33715H4066K18217c7887k64430
11978c02317A48027a07494j0315L7508j39960l2205c9764I7345a91075J2533D6446
11966b49453J2389C68155l2413A14648Q7385a09354F8938a05163A43188a88980
11955c36158J19658R0714B00013a12929G8379i7104H8218J95785A0396i4702c4002
$$ plain form
12036 29513 -61838 -159238 362590 -144751 -219543 -88192 82503 -65840 100449 112500 -49612
12024 -151098 120260 -123767 -316441 -120461 87388 241789 449 -80682 365392 11023 -132657
12012 76167 -30993 -18876 -199504 -191907 -181611 -30348 237127 -523606 -79651 136770 202723
12001 202723 -146343 285203 195697 -144955 11719 75 -72754 58361 337530 -260587 -32510
11989 -48156 -184772 59586 112184 121046 -32751 -148902 -382617 84066 302283 -37887 -302317
11978 -302317 148027 -107494 -117809 -80301 -220261 -252466 -39764 97345 -191075 -178542 46446
11966 -249453 -237064 368155 335742 114648 202033 -109354 68938 -105163 143188 -188980
11955 -336158 -216500 -125786 200013 -112929 78379 -97104 88218 284003 10396 -94702 -34002
11943a3491j92126g6953K672F8205i406k9249C9559b2360C18061b35581k17748
11932d53329a85902a5524I3057J13570h2261L5453A1750b7186D13289b51195N8837
11921a92358m1092m2202A13110d3733n9205B12603b87983p8848F8589N6231b44628
11909e0940j95068i9722M4425C64870c17137H6224l6660a16784D8457L98184A5470
11897I5997j8647c8230f396B58813C2462O7508c6563B5177O6283k2545Q4398f99
11884a41057A61665J17078r019c8850A90092b2488B74765o9763O4229B4498J58912
11873A83410J20339d522A943a48799L9662c1995A37492a76012B11712A04245d6682
11861b13847P2659B2051h1508A61597a59059j517A68237J03705F3612i6616A79338
$$ plain form
11943 -13491 -205617 -76953 -74281 68205 -9406 -38655 39559 -22360 318061 -235581 -453329
11932 -453329 -185902 -15524 93057 206627 -82261 -46808 11750 -27186 413289 -251195 -192358
11921 -192358 -233450 -275652 113110 -43733 -102938 212603 -287983 -366831 68589 124820 -244628
11909 -50940 -246008 -99722 -55297 364870 -317137 86224 49564 -116784 48457 446641 15470
11897 95997 77350 -38230 -6396 258813 32462 99970 -36563 25177 91460 68915 153313 -699
11884 -141057 161665 278743 269724 -38850 190092 -22488 274765 205002 269231 24498 183410
11873 183410 303749 -4522 1943 -148799 -109137 -31995 137492 -176012 211712 104245 -46682
11861 -213847 -141188 22051 -81508 161597 -159059 -160576 168237 271942 63612 -96616 179338
11849f5829k2731A56945b37554M9853o2675n0852k0779M7919F9113a23488C1931
11837c30507A20707C1729b4978k38821i966j17764d7202k57189A17281c93778
11826B4357c28708a02695L1782B39719g1800D4656N7371a03496B29337c31733
11815f7186A01078F940a49183f7408A64499h5092q8253C34256A07014C4080J53899
11804A87979i3367e423A08277B0175K0889F061J54502a91126n1789A10475h2086
11792b02654PD0945d814A07697n0574K36228I9597o319L6802l8579h1696F6328
11779b20677f0383J0075F1902R8873D7215k006b4736l62827J35076M4359B15599
11767h7198K1547j57783f9988L286j26903m6566B15358g4467A09322L26902k09843
$$ plain form
11849 -65829 -88560 156945 -237554 -187701 -250376 -301228 -322007 -274088 69113 -123488 31931
11837 -330507 120707 31729 -24978 -263799 -9966 -127730 -47202 -304391 117281 -393778
11826 24357 -328708 -102695 -70913 239719 -71800 44656 102027 -103496 229337 -331733
11815 -67186 101078 6940 -149183 -67408 164499 -85092 -173345 334256 107014 34080 187979
11804 187979 -93367 -5423 108277 20175 41064 6061 160563 -191126 -242915 110475 -82086
11792 -202654 -202647 40945 -4814 107697 57123 293351 99597 93278 130080 91501 -81696 66328
11779 -220677 -60383 -50308 61902 160775 47215 45209 -24736 -387563 -252487 -208128 215599
11767 -87198 -65651 -223434 -69988 -66702 -193605 -240171 215358 -74467 109322 436224 226381
11756B26381d9306C4104J22258A2122c0823j11063j62387B28815f0933B09186
11745c6619j65007d6613I1412a25995e5618D33500A64478e4273A84432F5905K85222
11734C51127A70005a11461m6362f1908q1176B6199M2871e9112A2441i2316G0694
11722a08844C51207c32073A41020L6732q4191b72712A15537D8979K12609o1555
11712B00033a62061B58156b16492A23867f71224B28216c24350b9788F7649h3200
11701b221A2795g1765n6346D29411b14114o8999M8894C0249J13778f8397K1296
11690d7101h36E0874K78801c75594A18002E4491J22715K4694n4447Q1942d0120
11678A23829K50481C9810A3320K85385a63412B11363K2947c00153M4879A00119
$$ plain form
11756 226381 -49306 34104 156362 12122 -30823 -141886 -304273 228815 -60933 209186
11745 -36619 -201626 -46613 91412 -125995 -55618 433500 164478 -54273 184432 65905 351127
11734 351127 170005 -111461 -157823 -61908 -143084 26199 69070 -59112 12441 -92316 70694
11722 -108844 351207 -332073 141020 177752 93561 -272712 115537 48979 261588 200033
11712 200033 -162061 258156 -216492 123867 -671224 228216 -324350 -29788 67649 -83200
11701 -2221 12795 -71765 -128111 429411 -214114 -283113 -234219 30249 144027 -68397 -47101
11690 -47101 -836 50874 329675 -375594 118002 54491 177206 201900 147453 229395 -40120
11678 123829 374310 39810 13320 298705 -163412 211363 234310 -300153 -255274 100119
11667g370C51540G0378C344a86667B8791a24809E1624L48602A08656b9997k0029
11656e0026A50927C8823a02123A10567J56699f2414H0191a36832B97917G7678
11645h2311m5584G0930J49766a76061e9099m0543A30104J54333A07190J67315
11635B74505a42682B98899B3985J33349E9061B4908a66678A2864a16302A35938
11624b31875A32167a63424e0202B27376C1634a22864O447A25191L3368a22932
11613H5198N9941B7011c03266L9227B28411b7355A57398c8150H8521J7862J78641
11602B85024A27135k4997b22049A41417J13485a38207B77218d7399J7677p4156
11592a03878O520C0720c10869c2984A76193P2207b79027B65248r3227k3959b1991
$$ plain form
11667 -7370 351540 70378 3344 -186667 28791 -124809 51624 400226 108656 -29997 -50026
11656 -50026 150927 38823 -102123 110567 267266 -62414 80191 -136832 297917 77678
11645 -82311 -127895 70930 220696 -176061 -59099 -99642 130104 284437 107190 274505
11635 274505 -142682 298899 23985 157334 59061 24908 -166678 12864 -116302 135938
11624 -231875 132167 -163424 -50202 227376 31634 -122864 -116417 125191 158559 -122932
11613 85198 145139 27011 -303266 -264039 228411 -27355 157398 -38150 88521 106383 285024
11602 285024 127135 102138 -222049 141417 254902 -138207 277218 -47399 -29722 -103878
11592 -103878 -97358 30720 -310869 -32984 176193 248400 -279027 265248 172021 148062 -21991
11580B1121f3506A5741e605D13684A20205f6402A65726n2847m7973J63915i0191
11568b9165j16219q5163C27707h2153a4822A57530A8887a98811B44681r8558L55121
11557E01244b2437o4192b2325C0304b14199o8323c2070j11956D39791E2996b6899
11545c6057j42104B9138d8355A61171b97361C44102n6595p930a26882L1602A38440
11533G5826B8608h7351I2231a30920A35500o5700k7473a41792h084B92255H7459
11521D0243g1793K214j2597B54833H0355k8818R0556a58614B50124j20772K1072
11510A50424K70800h761k5155p3126B10977c2813I2430a51471D0176d1888k63782
11499c05670B57559J76581j93857b58208A82798p8060k9763c0950A23904K95295
$$ plain form
11580 21121 -63506 15741 -5605 413684 120205 -66402 165726 112879 64906 228821 -90191
11568 -29165 -145384 -230547 327707 -82153 -14822 157530 18887 -198811 244681 146123 501244
11557 501244 -22437 -86629 -22325 30304 -214199 -282522 -32070 -144026 439791 52996 -26899
11545 -36057 -178161 29138 -48355 161171 -297361 344102 287507 279577 -126882 -95280 138440
11533 75826 28608 -87351 92231 -130920 135500 69800 42327 -141792 -8084 292255 87459
11521 40243 -71793 -69579 -82176 254833 80355 51537 142093 -158614 250124 129352 150424
11510 150424 421224 -8761 -33916 -107042 210977 -32813 92430 -151471 40176 -41888 -305670
11499 -305670 257559 434140 240283 -258208 182798 104738 74975 -30950 123904 419199
11489D19199A85596L919M0498C0315O1644l4422L4908G258c3462A18162f9195
11477C74490A86895b166G3996K9956M37887f1258A45613F1468N1479R6856N5991
11466B65794l998q6619n944p0078C635f7815C27036b22243C50262B6429a53621
11454A61737Q6677k3220j02604a8872k1866h818A93613L9638A0793Q8950d6092
11442B65146c6199j21719C00210I788d4839B49322I4740J56627b65672D9139A4982
11430D4956J23424f6835p6740B56543I2531c2515l7254c4461l7208C2823d4497
11418d6082J6328A07291b71031B4972J99780a19591G4753a26469e8449A02544
11407A44821B5553a13778k6594D6684a37289A59264A6728b21559D3757a51834
$$ plain form
11489 419199 185596 189515 230013 30315 91959 57537 92445 7258 -33462 118162 -69195
11477 374490 186895 -2166 73996 103952 541839 -61258 145613 61468 112947 209803 265794
11466 265794 261796 175177 169233 99155 3635 -67815 327036 -222243 350262 26429 -153621
11454 161737 248414 225194 122590 -18872 -40738 -8818 193613 233251 10793 99743 -46092
11442 265146 -36199 -157918 300210 9788 -44839 249322 94740 251367 -265672 49139 14982
11430 44956 168380 -66835 -143575 256543 92531 -32515 -69769 -34461 -71669 32823 -44497
11418 -46082 -29754 107291 -271031 24972 224752 -119591 74753 -126469 -58449 102544
11407 144821 25553 -113778 -140372 46684 -137289 159264 16728 -221559 43757 -151834
11396B91305a32099B25437e4563C00377A9739K00173a34620l3189G4555J4598
11386H9153d17902c5015A27457J42183a84234m1897A04388B8128L06857j45476
11376A89509j8197k2398J5682h2553B73716j13060g1605m4603A10259b50749f0776
11364B02372b91567B33165b6056l51149a07047A13004K23344B66h2727O281A8023
11352A19103K06234j62197O1352J0986a98781f9930E8537a14783A98859A2762
11341a57520M757f6049j72132A52606B3459f7388A97366B4064J0190L4664j8850
11330E0068A3303L6884i7592K3694k37563a15628e578A78354m3084D2140a3349
11318a94854d0872A64711a63491A9344J77280k1418b79695L5759J2122P4842A30861
$$ plain form
11396 291305 -132099 225437 -54563 300377 19739 219912 -134620 -167809 74555 89153
11386 89153 -417902 -35015 127457 269640 -184234 -226131 104388 28128 334985 189509
11376 189509 171312 148914 164596 -82553 273716 160656 -71605 -116208 110259 -250749 -60776
11364 202372 -291567 233165 -26056 -377205 -107047 113004 336348 266 -82727 -76446 18023
11352 119103 325337 163140 224492 235478 -198781 -69930 58537 -114783 198859 12762
11341 -157520 -152763 -66049 -238181 152606 23459 -67388 197366 24064 34254 68918 50068
11330 50068 13303 50187 -97592 -73898 -311461 -115628 -5578 178354 135270 42140 -13349
11318 -194854 -40872 164711 -163491 19344 196624 175206 -279695 -243936 -231814 -156972 130861
11306b2317m723A20074a63106A86223l916a25208K6051k03978C4732b90312A93187
11294E4968a43478F6919e37519b25304I9955c28111J8107A00315C9009P0225l3471
11283G5763M7106A7524b7328B17733a64606m2990J01253c6425F0523d50430B671
11271b88218a41918c9515D6076c99739B9097a41579E958J71273K31844d7291C07307
11259a30168E1413i8666A89766c37584O862g0189A2297a90081J3871j04224A17049
11247G8461c5106A38438J35760A8929f338j00029B7842a29196p3791D10473d8618
11235a19305a9277m4284B7438b5760A29463E8477a63711j07735A71493A5661d5352
11223C15298c94637e2475C06604a51243F0396a72789c4606j53870E1966J23362
$$ plain form
11306 -22317 -27040 120074 -163106 186223 182307 -125208 -99157 -303135 34732 -290312 193187
11294 54968 -143478 66919 -537519 -225304 99955 -328111 -310004 100315 39009 109234 75763
11283 75763 122869 17524 -27328 217733 -164606 -207596 -106343 -36425 60523 -450430 2671
11271 -288218 -141918 -39515 46076 -399739 29097 -141579 5958 177231 409075 -47291 307307
11259 -130168 51413 -98666 189766 -337584 -330722 -70189 12297 -190081 -176210 -280434 117049
11247 78461 -35106 138438 274198 18929 -6338 -106367 27842 -129196 -202987 410473 -48618
11235 -119305 -19277 -63561 27438 -25760 129463 58477 -163711 -271446 171493 15661 -45352
11223 315298 -394637 -52475 306604 -151243 60396 -172789 -34606 -188476 51966 175328
11213A75328b73914K7506P549P7556K6486b2099k89172H39K53553J56196a36831
11201a23328A61909a1761j63611B21867A10332b69787B3732a91937d6916q5471
11191a32387e227n6715l884K2088j09638P2321L0791B31051e49812e169j2110
11180a7279A21926g3516D1347g3083B40699a85776a6054m1512H8199c37999B2185
11168b69901C6017K76028d20462b5350j366I0383b97625J14961B12359G9393A7719
11156B07196K83979I0706D3160L3700b96674e6304m4436A57731a74318A30195
11145d82383A5693i1679D9930M00682a51237k0915M9986j73859A97778L49948
11135E47726a53250e9777B99379f0342j73446A39810f1633j22756A99697A9178
$$ plain form
11213 175328 -273914 -246408 -238859 -161303 -134817 -22099 -311271 839 254392 410588 -136831
11201 -123328 161909 -11761 -175372 221867 110332 -269787 23732 -191937 -46916 -132387
11191 -132387 -5227 -61942 -65826 -43738 -153376 -81055 -50264 231051 -549812 -5169 -17279
11180 -17279 121926 -73516 41347 -73083 240699 -185776 -16054 -57566 88199 -337999 22185
11168 -269901 36017 312045 -420462 -25350 -26716 90383 -297625 -182664 212359 79393 17719
11156 207196 491175 90706 43160 76860 -296674 -56304 -100740 157731 -174318 130195
11145 -482383 15693 -91679 49930 450612 -151237 -172152 -122166 -296025 197778 547726
11135 547726 -153250 -59777 299379 -60342 -233788 139810 -61633 -184389 199697 19178
11124B66610G990d210A65979b57012A82757f6108h985B85922A30313N5170J37571
11113C23054j57117l7031c05825D57014I7714J85430m8579A7295K04598N9972
11103B81865a20886D1119N7241f2884A35880c6148B61163p9320k351c89543b2058
11091B59230A6296a76176B57543d4616D02882A57352K21759G7519p737K24040
11081B93822L12407k72161m9993K0253J63951A42325R5286j17152J73461H6110
11070B99063J03504J3580I1959J90554p03L61624j80862d2002D89513B06588M01088
11059F07676j23657O6458M3297J88022C01129M48057C73515J30580p714J42307
11049F38688L6384j14036j1194J58772j53575K58263j95159J37150j74941K52792
$$ plain form
11124 266610 7990 -4210 165979 -257012 182757 -66108 -8985 285922 130313 185483 323054
11113 323054 165937 128906 -305825 457014 97714 283144 234565 17295 221893 281865
11103 281865 -120886 41119 98360 -62884 135880 -36148 261163 181843 179492 -389543 -22058
11091 259230 16296 -176176 257543 -44616 402882 157352 379111 77519 69782 293822
11081 293822 606229 334068 284075 304328 468279 142325 237611 120459 293920 86110
11070 299063 402567 416147 91959 282513 281810 643434 462572 -42002 489513 206588 607676
11059 607676 484019 550477 593774 781796 301129 749186 373515 504095 496381 638688
11049 638688 675072 561036 549842 708614 555039 813302 618143 755293 580352 833144
11039H33144M3661l69164K62380o7723p1310l787J69822j19220r7252o1857K84165
11028H02859k50516N15273l88049J9477j62765J40289j88677N119L18029k30828
11018E80211R2582p9046J5302P0843B85570L0383M91460k32180k6946K24493k29321
11007E43459J1671K19767q0818p4361k66211L02166J22886q8965j12038j34870
10997D42686J80522l679k7293q6040k1830M65670j56670R5040l37628m7926M23047
10986I25899p9721k27112M70438j95266j39027M30090o3797L13846k45078J90485
10976A380757Q2461L63444L29253K26756J61827J4024j03140k3384P6487k28886
10966B279599k93212j16543n6066n32657M90864j57038k6337j28616K69613Q6495
$$ plain form
11039 833144 876805 507641 770021 702298 630988 627201 797023 677803 580551 518694 802859
11028 802859 552343 1067616 679567 699044 536279 676568 487891 493010 811039 580211
11018 580211 672793 593747 609049 679892 285570 315953 807413 575233 548287 772780 543459
11007 543459 555130 774897 694079 619718 353507 655673 778559 689594 577556 442686
10997 442686 623208 619529 592236 506196 484366 950036 793366 888406 550778 502852 925899
10986 925899 846178 619066 1089504 894238 755211 1185301 1121504 1435350 1190272 1380757
10976 1380757 1463218 1826662 2155915 2382671 2544498 2558522 2455382 2431998 2508485 2279599
10966 2279599 1986387 1869844 1813778 1281121 1771985 1614947 1588610 1459994 1729607 1816102
10956A816102R8173k38242m30764j51198j47549J24499n17594j05853J06361j43905
10946D10030N867C1673K87337F474K58074E8169L51439q9563I953a96513A51086
10934a46071E1293J40807K93415b58412p7558h8116B48090J07246j24242b04168
10923B4321L01202a83223B5535f6850A92284o6685C4396Q7982a39998f6025j70717
10912b36742C94813C9817K02754a66941c6603C06934a06569A80520g7496B7814
10901a21585C45735H3343a3908A04360b15124B40739i110j69113h2217o3382f9118
10889e617B07317F9187J72090j06631N8379l3119a48798B41811g6379A6043J31571
10878A47614i2132A17127d00514A66141C0733b52728a12090c2127B23156c19389
$$ plain form
10956 1816102 1914275 1676033 1245269 1094071 946522 1071021 553427 447574 553935 410030
10946 410030 415897 31673 319010 6474 264548 58169 409608 320045 9953 -196513 151086
10934 -146071 51293 192100 485515 -258412 -335970 -88116 248090 355336 231094 -204168
10923 24321 325523 -183223 25535 -66850 192284 125599 34396 122378 -139998 -66025 -236742
10912 -236742 394813 39817 242571 -166941 -36603 306934 -106569 180520 -77496 27814
10901 -121585 345735 83343 -13908 104360 -215124 240739 -9110 -178223 -82217 -145599 -69118
10889 -5617 207317 69187 241277 134646 193025 159906 -148798 241811 -76379 16043 147614
10878 147614 -92132 117127 -400514 166141 30733 -252728 -112090 -32127 223156 -319389
10867C20798a83954G0862l5391a95304e4484j6602A75188a70803a2973C09005
10856A03009J17626a93683g3590A44299c23685A04081b71140P4461o3089A618
10845A46456Q3461a96809e1556a1420A69569a20563H3078L1757P6798k5485a72464
10833b76833A63947p1949b76216F8054a1656j59279P9645j72362J05278C5733
10822B57459A22736a09775J5887A61225J86933c07753C28646a59671D8291j8787
10812B9504b36227a00986q3163Q2773j2745c3027D2791d8709j38930g5939A62930
10800c3311j80337A08648N678e9569E3599g2623K0457F6939I825b43523A48387
10788A46928a27383c7277k25989b5735H3909C054J19275J48694a48061j5083O8973
$$ plain form
10867 320798 -183954 70862 35471 -195304 -54484 -71086 175188 -170803 -12973 309005
10856 103009 220635 -193683 -73590 144299 -323685 104081 -271140 -196679 -259768 1618
10845 146456 229917 -196809 -51556 -11420 169569 -120563 83078 114835 191633 166148 -172464
10833 -276833 163947 91998 -276216 68054 -11656 -170935 -91290 -263652 -158374 35733
10822 257459 122736 -109775 -93888 161225 348158 -307753 328646 -159671 48291 29504
10812 29504 -236227 -100986 -184149 -101376 -114121 -33027 42791 -48709 -187639 -75939 162930
10800 -33311 -213648 108648 114326 -59569 53599 -72623 -52166 66939 9825 -243523 148387
10788 146928 -127383 -37277 -263266 -25735 83909 3054 122329 271023 -148061 -163144 -94171
10777i4171A25904D4102O6623J2774E1006j1824c49670G1263b21529i3674d5684
10765B70886i4407j6315m62603a40223b3619j07195d3790A65132g8603D9761c274
10753F0496c40633j93883F1654K65844a56903e6173m2467B75181b76450J12898
10743a63552C02909A3925k073b48651c6001k04892A86647a59148g8519B51898
10732a48045f3207o1075b0831l37722D9979a94924K3334f4504A11004a91682j7404
10721b09086B64881a67737D0535Q8231l539p579c95421i1519D3810K67047a14620
10709D1418R4690d8487J4803G7304K00113m5273Q0991J18738A7966a54824B6879
10697A52657N5056d8663F9581N11288c18743A71254a17213J6088J2898k64903
$$ plain form
10777 -94171 125904 44102 110725 123499 51006 39182 -349670 71263 -221529 -93674 -45684
10765 270886 -94407 -110722 -573325 -140223 -23619 -130814 -43790 165132 -78603 49761 -3274
10753 60496 -340633 -534516 61654 327498 -156903 -56173 -98640 275181 -276450 -163552
10743 -163552 302909 13925 11852 -248651 -36001 -240893 186647 -159148 -78519 251898
10732 -148045 -63207 -124282 -20831 -358553 49979 -194924 -171590 -64504 111004 -191682 -209086
10721 -209086 264881 -167737 40535 128766 125227 117648 -395421 -91519 43810 310857 -114620
10709 41418 136108 -48487 -33684 77304 277417 232144 313135 431873 17966 -154824 26879
10697 152657 207713 -48663 69581 580869 -318743 171254 -117213 -101125 -88227 -353130
10687c53130f4831G9122c85262E3231b00653G9759b46197B0201Q526H517d30951
10675i4622j48699B6346j1154R2589b00055A93408q0071J09555q7314M6408a78401
10663b11236h0122A00880a0666B70771G7018M7056m9248b81521B44162j11777
10653A32385a27494j4656I755J66920a14257k9670I0940J4234a32929c5812l17801
10642c53613J28509L2274M5787j5654C8647E179P7985a95805C99617a34373D2476
10630b2283A98195A80N6497b37448F8719C021L1404M9869k2803a50840k0377A04779
10617A8680K21750G5030B6906a59297d3118o1830k15917D3719b40660A93739e5567
10605H6056J7902B9848b68881B25184f0309m1121B53862b07383I5108K15733c06600
$$ plain form
10687 -353130 -64831 79122 -385262 53231 -200653 79759 -246197 20201 28727 8517 -430951
10675 -94622 -243321 26346 15192 107781 -200055 193408 113337 222892 135578 181986 -178401
10663 -211236 -80122 100880 -10666 270771 77018 124074 74826 -281521 244162 132385
10653 132385 -127494 -142150 9755 176675 -114257 -143927 90940 105174 -132929 -35812 -353613
10642 -353613 -225104 -192830 -147043 -162697 38647 5179 83164 -195805 399617 -134373 42476
10630 -22283 198195 180 56677 -237448 68719 3021 34425 84294 61491 -150840 -171217 104779
10617 18680 240430 75030 26906 -159297 -43118 -104948 -320865 43719 -240660 193739 -55567
10605 86056 103958 29848 -268881 225184 -60309 -101430 253862 -207383 95108 310841 -306600
10593a62354j07150j13418J03925B48439b6572B52818b45348A13180K38913a74291
10582a25420D3309b19795M6742P0549j0763l1891A02350a90625A06402j3792f7943
10570b12518A01613c65804a40232m1406d972l40410A50239d25621a30031R929
10560a20102E2542B2964a20184b5767j94663B05440a46968C5339a75164e9991
10549b81650J6456D3257h6744A00085O5364d879A91190p3474a58722m2369a7303
10537a46131D7172J90957a67815A02292d53141i9068b4346A97527p1184a71904
10526B77189a7260B09667b05166M1879B82522l9618j12763C6922J79694J42603
10516C59219B0069K7617g1077j84562g747n8115B7099d9614j53775e9053k1847
$$ plain form
10593 -162354 -269504 -382922 -278997 248439 -26572 252818 -245348 113180 352093 -174291
10582 -125420 43309 -219795 -173053 -102504 -113267 -145158 102350 -190625 106402 92610 -67943
10570 -212518 101613 -365804 -140232 -181638 -4972 -345382 150239 -425621 -130031 -120102
10560 -120102 52542 22964 -120184 -25767 -220430 205440 -146968 35339 -175164 -59991
10549 -281650 -265194 43257 -86744 100085 165449 -4879 191190 117716 -158722 -201091 -17303
10537 -146131 47172 238129 -167815 102292 -453141 -99068 -24346 197527 126343 -171904
10526 277189 -17260 209667 -205166 -163287 282522 242904 130141 36922 216616 359219
10516 359219 20069 47686 -71077 -255639 -7747 -65862 27099 -49614 -203389 -59053 -80900
10505h0900f958A78353J14429a88185D1178b67671O9973a463o7351B11915e63339
10493b7859B1144O1965h9941k58798e6541k462j86712C283P4528e6185C12999
10481g3620j6518B10288K41268j19959j7508p8783H5760a87867h9769D15716j23297
10470B92419j0385c47887a01355B98755E5998a53282k09754G6846f0260A49J74158
10459A74307b0619p4492k1435c1715a4047l0708n6753L6945k29066a34711A62145
10447a50809B99999D1469P9933c559A54023J2333G9167B0773b46142H2531f2548
10435b50496A8106h3599B05767a9660k14311F5386Q4720b76546I6012J45316a71597
10423a09248B55723B2123d5331E3214f6378k09500A00988l9224b90047a43510
$$ plain form
10505 -80900 -6958 178353 292782 -188185 41178 -267671 -197698 -1463 -68814 211915 -563339
10493 -27859 21144 83109 -89941 -348739 -56541 -59003 -245715 3283 77811 -56185 312999
10481 -73620 -90138 210288 451556 331597 314089 235306 85760 -187867 -89769 415716 292419
10470 292419 282034 -347887 -101355 298755 55998 -153282 -363036 76846 -60260 149 174307
10459 174307 -20619 -95111 -116546 -31715 -14047 -44755 -101508 -64563 -293629 -134711 162145
10447 -150809 299999 41469 121402 -3559 154023 166356 79167 20773 -246142 82531 -62548
10435 -250496 18106 -83599 205767 -19660 -233971 65386 150106 -276546 96012 241328 -171597
10423 -109248 255723 22123 -45331 53214 -66378 -275878 100988 61764 -290047 -143510
10412A66394a67249C08707a00027C74299j58333g5669A56223k8557B7695b03707
10401B75273e6378H7936a81122A94291J49621B21e3706B5249J59001k1461d4431
10389a38464L3961K0917O255A32633J46449g217B62474g3850A50880J11808j27616
10378A35072b8868j5004B93724P9837A44358N3349L60700k71664J25449n9469
10368C52723L55140B18978L33267B62446J79024k4957A15447J70633k6815q4404
10358A74861o5163J76749M528j11524M7838n8219J90926J47142L2100A51482L44835
10347D96317K2758F2520J63358K61422j04677A53579m8230R0476b4784C82039
10336A96579c0437q6126B08823O1396A11191J1137J69172I5823B0718a9054q6534
$$ plain form
10412 166394 -167249 308707 -100027 374299 215966 -75669 156223 127666 27695 -203707
10401 275273 -56378 87936 -181122 194291 343912 221 -53706 25249 184250 162789 -44431
10389 -138464 -104503 -83586 -77331 132633 279082 -7217 262474 -73850 150880 262688 135072
10378 135072 -28868 -43872 293724 373561 144358 197707 558407 286743 412192 352723
10368 352723 707863 218978 552245 262446 441470 416513 115447 286080 259265 174861
10358 174861 109698 286447 290975 179451 227289 169070 359996 507138 539238 151482 496317
10347 496317 519075 62520 225878 487300 382623 153579 105349 195825 -24784 382039
10336 196579 -30437 -116563 208823 270219 111191 122328 291500 95823 20718 -19054 -105588
10325a05588E265b41903I1484L33991A60292J65587M31510C51178q8133d9305
10314A26171L6247J52838j1860a95244B2943K11494p0636e1629o3871l7167n9914
10303b12581e4076j05881n6178b4278k32616N5374D1003J44997J1472G684J04699
10292A12383e8860j00560O0493D2397a7259H8767b48327N1641j83484B65813r790
10281B56023A05561i1581b8410k4540j76127j80955a86710O0925G2253b90561
10270C24916E0505Q2992a90838A16238R6493a78628f1661A15216a25969L1775
10260i4194D81989B07889l5346j0781L64415d6240C560h4305B33354N6748H3194
10248a05817C24586a39406j49002e5190B27988b62691J03740I605Q8511i0241
$$ plain form
10325 -105588 5265 -241903 91484 425475 160292 325879 757389 351178 263045 -49305
10314 126171 162418 315256 303396 -195244 22943 234437 163801 -51629 -115500 -152667 -212581
10303 -212581 -54076 -159957 -216135 -24278 -256894 -201520 41003 186000 197472 7684 112383
10292 112383 -58860 -159420 -98927 42397 -17259 88767 -248327 -196686 -380170 265813 256023
10281 256023 105561 -91581 -28410 -52950 -229077 -410032 -186710 -125785 72253 -290561
10270 324916 50505 133497 -190838 116238 212731 -178628 -61661 115216 -125969 -94194
10260 -94194 481989 207889 172543 161762 526177 -46240 3560 -84305 233354 290102 83194
10248 -105817 324586 -139406 -288408 -55190 227988 -262691 -158951 9605 98116 -90241
10237B25042b53093B70189B2255L37096c21252i9713A62285D381b34112h9591
10226g134j87153f6804g159k22383H1651c6323D4271b438H9347b70971A46946
10214a24341A09205b15877A34552D0453p099J04414D8995a99952B8194a03514
10203a07241A52932c1003j49752j4619A37415e6232j77703n4468P7127F6369o563
10192E9806a8649j24777A6581c75748C6025b14208c7538E1295q611b52559j43744
10181c96303N5361J08827B15063a08857j56373r2491A61561n8631O0892c4420
10170A84088b10624P1210j24282m7346H2153A0302a43144l65962i0816j9378j1176
10159a21370C1012R0744a20030E8470b89864f1081G2604h0933C55676A24589k807
$$ plain form
10237 225042 -253093 270189 22255 359351 -321252 -99713 162285 4381 -234112 -89591
10226 -7134 -194287 -66804 -7159 -229542 81651 -36323 44271 -2438 89347 -270971 146946
10214 -124341 109205 -215877 134552 40453 33354 137768 48995 -199952 28194 -103514
10203 -107241 152932 -31003 -180755 -195374 137415 -56232 -233935 -288403 -211276 66369 59806
10192 59806 -18649 -143426 16581 -375748 36025 -214208 -37538 51295 42684 -252559 -396303
10181 -396303 -340942 -232115 215063 -108857 -265230 -357721 161561 102930 163822 -34420
10170 184088 -210624 -139414 -263696 -311042 82153 10302 -143144 -509106 -90816 -110194 -121370
10159 -121370 31012 121756 -120030 58470 -289864 -61081 72604 -80933 355676 124589 121782
10148A21782b24729B35614K9735J4859d93541A02943c69084D4996a15440F3688
10137b0531p2547j13656a9346j65235C7036f5816B15325a28156j20663j05823
10127c54642h8720K4673q5310A8205J83534A2130N4387b36270A24452G80b8005
10115b82329a01303n6434j0071B45979H2225d47125d1788j26273b8521q3767F0683
10103a19563A6302c33886A30851a04615k69684c6560r1634C15872a70811j24198
10093b95009H6481c59303B6369L953a32802A40518c28923A22958a75046B48157
10082B26942o0843F3657c78991J68132A27993a5402j21900A88282a13436M2987
10072g0449A24274b40848B01428d2816k38120A55765n342J3931J84883a60139
$$ plain form
10148 121782 -224729 235614 265349 280208 -493541 102943 -369084 44996 -115440 63688
10137 -20531 -93078 -206734 -19346 -184581 37036 -65816 215325 -128156 -248819 -354642
10127 -354642 -88720 -64047 -149357 18205 201739 12130 66517 -236270 124452 780 -28005
10115 -282329 -101303 -157737 -167808 245979 82225 -447125 -41788 -168061 -28521 -112288 60683
10103 -119563 16302 -333886 130851 -104615 -374299 -36560 -128194 315872 -170811 -295009
10093 -295009 86481 -359303 26369 30322 -132802 140518 -328923 122958 -175046 248157
10082 226942 166099 63657 -378991 -210859 127993 -15402 -137302 188282 -113436 -70449
10072 -70449 124274 -240848 201428 -42816 -280936 155765 150423 164354 349237 -160139
10061e0658B01573h7206K0320k14138J11639k89175E9403a02893a3174k23488
10051b36662l8111g7921G3817b44719N2671l4998I6570c70697E0809a4657C0307
10039d00709e5234k66882O5061k14558e1318C5014f7895j78864P0321H9944O1664
10028A51608a04229A67480O1934F435J38581B9397J84299I0915b26678e4338q430
10017f2768r2856n8006B36632p6821b38399J06567O3503j54130k9308B12724p7171
10006A35553m6825a59454g0529H0316a21492k24158A73773R0991a53903A28682
9995A3055a33587A87319d15844B63532a83979d2547O68J6505k99320A16876a08668
9983A88837a07302p8162A22621a40105o9448N0061A12221a21723A81589Q1951
$$ plain form
10061 -50658 201573 -87206 -66886 -281024 -169385 -458560 59403 -102893 -13174 -236662
10051 -236662 -274773 -77921 73817 -244719 -192048 -227046 96570 -370697 50809 -14657 30307
10039 -400709 -55234 -322116 -257055 -471613 -51318 35014 -67895 -246759 -176438 89944 151608
10028 151608 -104229 167480 229414 6435 145016 29397 213696 90915 -226678 -54338 -62768
10017 -62768 -155624 -213630 236632 159811 -238399 -131832 -68329 -222459 -251767 212724 135553
10006 135553 88728 -159454 -70529 80316 -121492 -345650 173773 264764 -153903 128682
9995 13055 -133587 187319 -415844 263532 -183979 -42547 -41879 -25374 -324694 116876 -108668
9983 188837 -107302 -185464 122621 -140105 -209553 -159492 112221 -121723 181589 263540
9973B63540N6804I4086h9179j7389E0875J527B5386J1859j423a52365c6382A20428
9960a34132A5398P2789a4368o1373j41343f7121A04404a22344k4272A88301D7805
9948a24664k08778J13281D5024b31571f3416E2768c49023e5477A2739b8908G438
9936a88781j75833e4418j59604p7570D2491N0284L7855a84030f1726K6364B0543
9924a59489L6507Q011J2122d8075B77081e7514J3902j5476E0693a68468c1178
9912b28233M148L8939A04603c48054J22751g0159K3386k506k02868J8191B44520
9900B67861F9082d6722n5917l709B40697E7783g0716R772j07881N0990J7206K0223
9888h0406A69144F4544a00028E3096K95547d7006o7563b0226B12632b31299p3754
$$ plain form
9973 263540 320344 94086 -89179 -106568 50875 52402 25386 37245 35822 -152365 -36382 120428
9960 -134132 15398 88187 -14368 -75741 -217084 -67121 104404 -122344 -146616 188301 47805
9948 -124664 -333442 -220161 45024 -231571 -63416 52768 -349023 -55477 12739 -28908 7438
9936 -188781 -364614 -54418 -214022 -291592 42491 92775 130630 -184030 -61726 -35362 20543
9924 -159489 -122982 -114971 -102849 -48075 277081 -57514 -43612 -59088 50693 -168468 -31178
9912 -228233 -224085 -185146 104603 -348054 -225303 -70159 -46773 -49279 -252147 -233956 244520
9900 267861 69082 -46722 -102639 -106348 240697 57783 -70716 -60944 -168825 -117835 -100629 -80406
9888 -80406 169144 64544 -100028 53096 348643 -47006 -114569 -20226 212632 -231299 -305053
9877c05053e2932D4260a94999d9498H9902c30248D46081C8202h2020J2653B46543
9865A23376b93123B55393e17654a0010j95545r7959e1245a8100k40220B50466
9854B84236e1818C474K94302d45588B26972A0705a84542h4212k0131j26214a13853
9842a81881H8973b41504h2623q4111A36497m4268N5375a91691r2308c7684A24859
9830g8288j60280R2549A93152a57246b3864k19238J15158B13680a0896A35783
9819A9437f2145o0274l2310D730J51590d01626A2916i4707k65341A90605a26279
9807H8077b45647a01404o095M6657j20920E194c61374R5395Q4967L3825A215K29374
9795B30589c7037j06982A40543J2852C2866d23056A40415a38232B12518K7571
$$ plain form
9877 -305053 -52932 44260 -194999 -49498 89902 -330248 446081 38202 -82020 -69367 246543
9865 123376 -293123 255393 -517654 -10010 -205555 -303514 -51245 -18100 -258320 250466
9854 284236 -51818 3474 297776 -445588 226972 10705 -184542 -84212 -104343 -230557 -113853
9842 -181881 88973 -241504 -82623 -166734 136497 92229 147604 -191691 -283999 -37684 124859
9830 -78288 -238568 -146019 193152 -157246 -23864 -243102 -127944 213680 -10896 135783
9819 19437 -62145 -122419 -154729 4730 156320 -401626 12916 -94707 -360048 190605 -126279
9807 88077 -245647 -101404 -107499 -60842 -181762 5194 -361374 -265979 -181012 -147187 1215 230589
9795 230589 -37037 -144019 140543 153395 32866 -423056 140415 -138232 212518 240089
9785B40089i7715b093n4288q1118A64582a35369E8982b15646I8458A3054a77537
9773a1653B1003a38196n857c2693A3742b29280E2433K33114I2223A7703G428c49820
9760B0688f3242k94424D8650K587N1288b31406C91912b18034A81282E1462O0713
9749A12175M2667a11592j5615B4417a83797h0682j8516j12678i6122j22189j63428
9738c81739I2703b8138k69231a45178A1065a12042h656j53628j1869A42680a07656
9726a83802A8887b76010c4891j00436A74130d67561a51248c5315F3534b74133
9715C2693a82916j49463I5139c98564c767j71992c9434o8622B8697B5a66094P3881
9703i2213A07177a02967A09148a24964A1188a36263A23397a42352C80972j50826
$$ plain form
9785 240089 -97715 -2093 -56381 -137499 164582 -135369 58982 -215646 98458 13054 -177537
9773 -11653 21003 -138196 -144053 -32693 13742 -229280 52433 285547 92223 17703 7428 -349820
9760 20688 -63242 -357666 48650 51237 102525 -231406 391912 -218034 181282 51462 112175
9749 112175 154842 -111592 -127207 24417 -183797 -80682 -99198 -211876 -96122 -218311 -381739
9738 -381739 92703 -28138 -297369 -145178 11065 -112042 -8656 -162284 -174153 142680 -107656
9726 -183802 18887 -276010 -34891 -135327 174130 -467561 -151248 -35315 63534 -274133
9715 32693 -182916 -332379 95139 -398564 -3767 -175759 -39434 -108056 28697 25 -166094 -92213
9703 -92213 107177 -102967 109148 -124964 11188 -136263 123397 -142352 380972 230146
9693B30146b6200A80247c484k45532a14871A44955B6884B915K24363b8722A56118
9681C41604c24052e6088l3558A12046a85736m9664l5755J08406E774a33579B76246
9669b05545B84547c87485a2850L626D8474Q8218h3750k74038e3082I7082b82524
9657B7074a58423M7945C17590e3803j0079A15622C2480J73103D6249I906J62700
9646A72606j1663O049C1328b38068L9534i04A16018a66000A75995a87317n1336
9635b38653k29441a1759j07014F308a81095h0895K3063f089A01388b20577f9736
9623f8364A25981f9398A50961E3783a00034m8413I7781d642B291b12099E5190
9611c30521B09745a04613C94117A83184a98968j66484a78795A07197b36647a2897
$$ plain form
9693 230146 -26200 180247 -3484 -249016 -114871 144955 26884 2915 227278 -28722 156118
9681 341604 -324052 -56088 -89646 112046 -185736 -235400 -271155 -162749 5774 -133579 276246
9669 -205545 284547 -387485 -12850 -9224 48474 136692 -83750 -357788 -53082 97082 -282524
9657 27074 -158423 -110478 317590 -53803 -63882 115622 32480 205583 46249 9906 172606
9646 172606 160943 166992 31328 -238068 -198534 -904 116018 -166000 175995 -187317 -238653
9635 -238653 -468094 -11759 -118773 6308 -181095 -80895 -57832 -6089 101388 -220577 -69736
9623 -68364 125981 -69398 150961 53783 -100034 -148447 97781 -4642 2291 -212099 55190
9611 -330521 209745 -104613 394117 183184 -198968 -365452 -178795 107197 -236647 -12897
9600e2756p6104M5923B9951J60012a86482g1231D3916b57760a17006I7077K0683
9589A17760c65774J73464l83860K15992l3610A3341L1688a21749I1648m718d21859
9577a6231l90246J26089A4137Q5643C722J29901e7721A18742a29258L4705A772
9565b20620A78469g0082j39394J212J9025H5950J75868f5018D67629G5722J68381
9554B44103b57280N165e7213B4505M5370a35627j64712h1415j62204o1487g0194
9542h6533p3122G8944C9453K03741b49216j0022D210a23952j685m56364A19351
9530e5558A47581b45800b1299k11307k72534A72857m3948j8619b61052C1584b8997
9518D2569K03855a72389p57E9351J85543b62498m1197A16696d92889D8678j3085
$$ plain form
9600 -52756 -128860 -82937 29951 189963 -186482 -71231 43916 -257760 -117006 97077 117760
9589 117760 -365774 -192310 -576170 -360178 -393788 13341 45029 -121749 91648 86930 -421859
9577 -16231 -406477 -280388 14137 99780 3722 133623 -57721 118742 -129258 -94553 1772
9565 -220620 178469 -70082 -209476 -208264 -189239 85950 261818 -65018 467629 75722 244103
9554 244103 -257280 -252115 -57213 24505 69875 -135627 -300339 -81415 -243619 -305106 -70194
9542 -86533 -159655 78944 39453 243194 -249216 -259238 4210 -123952 -125637 -582001 119351
9530 -55558 147581 -245800 -21299 -232606 -505140 172857 128909 110290 -261052 31584 -28997
9518 42569 246424 -172389 -173146 59351 244894 -262498 -303695 116696 -492889 48678 35593
9507C5593a4694j63705A50821d92891a77874Q1610n2499F4102a11485m1911n5232
9496b08628o2869C10726E4208d41259G5532a23622j88178i4457B413a66879I6568
9484A12879a3757A22629g0614H4155c20296a2911j66343j50460C78108b26839
9473A57234Q2421a26957e8201B28546a56384j65263J50719L8127A96760h6421
9462a52029B05466b10043B33696c03680J40478L5182r0221G8513b7663A09792
9451b21414O5471G155M8100J93793b35907B5426a50446q8072j09779I133O5771
9440G4904a23489C25449a85876A86115h8660n9562A18628J09982b99366B43624
9429b7134j00548n5789f6730A05701b69365B05608E3986R1643h4304L3037j44282
$$ plain form
9507 35593 -14694 -178399 150821 -492891 -177874 -96264 -148763 64102 -111485 -153396 -208628
9496 -208628 -271497 310726 54208 -441259 75532 -123622 -311800 -94457 2413 -166879 96568
9484 112879 -13757 122629 -70614 84155 -320296 -12911 -179254 -329714 378108 -226839
9473 157234 239655 -126957 -58201 228546 -156384 -321647 -170928 -132801 196760 -86421
9462 -152029 205466 -210043 233696 -303680 -163202 -128020 -218241 78513 -27663 109792
9451 -221414 -155943 7155 55255 249048 -235907 25426 -150446 -238518 -348297 9133 74904
9440 74904 -123489 325449 -185876 186115 -88660 -148222 118628 228610 -299366 243624
9429 -27134 -127682 -183471 -66730 105701 -269365 205608 53986 145629 -84304 -51267 -195549
9418a95549d9181B58153b16360o397A13909n6228A1743K4945J78143a93321F8127
9406b27905A50332J37874j11561o3090a83204k78440b2648A81662a82617p5650
9396b58267Q0292k40856d8411F6435b69885A43439j2785e3085a2327k87166R4666
9385b04827C94969A80520q9184a560D4708R6132E5464a85167A09906c26027J07961
9374b18066f1205J2062C98142a87672K8016M872j65364A92812G3993b44129D28735
9362A5069a56838B19653i2883B31535b13313A26118a18283A4593d11261J17608
9352b93653A85528a95802A57386a11848A493f737E0787i737F272a94179C4294
9340d8002k640j32623n8346m557B25453a05434R386c6914j16022d9110k16422
$$ plain form
9418 -195549 -49181 258153 -216360 -222757 113909 57681 11743 36688 214831 -193321 68127
9406 -227905 150332 288206 176645 113555 -183204 -461644 -22648 181662 -182617 -258267
9396 -258267 -177975 -418831 -48411 66435 -269885 143439 130654 -53085 -12327 -299493 -204827
9385 -204827 394969 180520 91336 -1560 44708 140840 55464 -185167 109906 -326027 -218066
9374 -218066 -61205 -49143 398142 -187672 -159656 -154784 -320148 192812 73993 -244129 428735
9362 15069 -156838 219653 -92883 231535 -213313 126118 -118283 14593 -411261 -293653
9352 -293653 185528 -195802 157386 -111848 1493 -6737 50787 -9737 6272 -194179 34294
9340 -48002 -50642 -183265 -241611 -246168 225453 -105434 -96048 -36914 -152936 -49110 -265532
9329b65532G5175J59898c01591a32279A23968b65989G7367a21378B466a45360
9318d5110I2914a76616a3992j9124K874A30946B1692J58570b10196A82943a98927
9306b41394J8124B7839e482j04325p179o0508O7439k45212B50477e9991j85672
9295b45663o3854G8232J96827a73063b8676E1365b68607B95011a2485l17835a01757
9283C5912J69304j00518B758K11812a32611j37608G7511o124a81692A39362l4458
9272A04904a19730N7369E6772a8536B78921H1745D430K22130b85184o9776D4484
9260a55967K0680P862N2115C7648j489d02129h990H0906c43816a35503E0932b15763
9247D7903a79088A30236a4672m2893k1144A39495c88941E0544J47014n3031e4411
$$ plain form
9329 -265532 75175 235073 -301591 -132279 123968 -265989 77367 -121378 2466 -145360
9318 -45110 92914 -176616 -13992 -33116 -30242 130946 21692 180262 -210196 182943 -198927
9306 -241394 -223270 27839 -5482 -109807 -116986 -177494 -110055 -355267 250477 -59991 -245663
9295 -245663 -309517 78232 275059 -173063 -28676 51365 -268607 295011 -12485 -330320 -101757
9283 35912 205216 104698 2758 214570 -132611 -270219 77511 71387 -181692 139362 104904
9272 104904 -119730 -62361 56772 -18536 278921 81745 4430 226560 -285184 -354960 44484
9260 -155967 -135287 -127425 -75310 37648 36159 -402129 -8990 80906 -343816 -135503 50932 -215763
9247 47903 -179088 130236 -14672 -57565 -78709 139495 -388941 50544 197558 144527 -54411
9235I4782a4407j91429P4781A93858a69705G4754b48701H0772I156J75223d0011
9223b1481m5379o56466A24871c33043B59372D3361a16440q5504A81189f0630k64225
9212c24855D9313b43070J06585J5620j41755I2879b55364C06235c0450l78228
9202d08678H1215l3525K17684i2098A69578c29905f6916j74261O5372B7601n931
9191B1670J97958g1416k81919a02771F0578J26039E8577c67805i010o0205j7859
9180h7074A4022e61722K02404A59024a56555q4177G5615g0851l392A29036K6827
9169A55863j3339f2404K556B08535a80686B08862K9112a01872D9782c9028A01986
9157A79228a12748B4691J82784b18427c3369k27373B66400b55262i5488A92947
$$ plain form
9235 94782 -14407 -205836 -131055 193858 -169705 74754 -248701 80772 9156 184379 -40011
9223 -21481 -66860 -723326 124871 -333043 259372 43361 -116440 -201944 181189 -60630 -324855
9212 -324855 49313 -243070 -136485 -120865 -262620 92879 -255364 306235 -30450 -408678
9202 -408678 81215 47690 265374 -92098 169578 -329905 -66916 -241177 -175805 27601 21670
9191 21670 219628 -71416 -353335 -102771 60578 186617 58577 -367805 -9010 -69215 -87074
9180 -87074 14022 -561722 -359318 159024 -156555 -240732 75615 -70851 -74243 129036 155863
9169 155863 142524 -62404 -59848 208535 -180686 208862 237974 -101872 49782 -39028 101986
9157 179228 -112748 24691 207475 -218427 -33369 -260742 266400 -255262 -95488 192947
9146E7520k3744A4527J83310G4519N254a35228B81537k0347A982c66242N6103
9135c10139J34071r66B1371g5147I6208D5589J3744J60539d7847j30632p2283
9124b50762F2214d83419C5502N9508b02290D2021i7646K0460K1041k43066A30773
9112a37278J694D02743a16271l80213J27996a61955C24891A02044a51201k2362
9102a73563d2075n0514J9772k72329F5410j4001I642a55479C6187f864n28618
9091e35482h8931j04746A22246a2774B08757n4260c0924j07020d9863a2640E0804
9079A90204b86561Q1429i0753A10323a93205C12980j49933c53028a31966C7770
9068C44401F5130j4309c51905j702B22471a35418A28148g2750A21085m1380b9591
$$ plain form
9146 57520 33776 14527 197837 74519 79773 -135228 281537 261190 1982 -366242 -310139
9135 -310139 -176068 -177034 21371 -75147 96208 45589 59333 219872 -47847 -178479 -250762
9124 -250762 62214 -483419 35502 95010 -202290 42021 -97646 -77186 -56145 -299211 130773
9112 -137278 -135584 402743 -116271 -496484 -368488 -161955 324891 102044 -151201 -173563
9102 -173563 -42075 -92589 -72817 -345146 65410 51409 9642 -155479 36187 -6864 -535482
9091 -535482 -88931 -193677 122246 -12774 208757 154497 -30924 -137944 -49863 -12640 50804
9079 190204 -286561 -205132 -90753 110323 -193205 312980 163047 -353028 -131966 37770
9068 344401 65130 50821 -351905 -353607 222471 -135418 128148 -72750 121085 79705 -29591
9056g3976A39297d35362A25987c79429A03594h7682j36715j9811A36914c58669
9045i5246l8154j08221g5013j79663g5782A27078A4819C645b0494G9945A3405
9033a64847C7710b35760P2300L3330c6582C36250F2824d9231j22499D9819d3801
9021A3365a25278k4922l47451H1428c17433H2946J73872A9224c0279D4140a37428
9009I3764h0718b9280C0155a77098K4585B9967a09794a4836k30255f0930A84560
8997e8396j18271k0174G2146c379I616a24456D2542A9549a91632k3901h1137l587
8985h4724A68730H903R4067c90652G6012B6044M2887c21861a127A0506K2634a54875
8972A17035p397b7402A65107a34455A48197c07380J31089I3250J13579a14504
$$ plain form
9056 -73976 139297 -435362 125987 -379429 103594 -87682 -224397 -244208 136914 -358669
9045 -95246 -133400 -241621 -75013 -254676 -75782 127078 14819 3645 -20494 79945 13405
9033 -164847 37710 -235760 -163460 -130130 -36582 336250 62824 -49231 -171730 49819 -43801
9021 13365 -125278 -150200 -497651 81428 -317433 82946 256818 19224 -30279 44140 -137428
9009 93764 -80718 -29280 30155 -177098 -152513 29967 -109794 -14836 -245091 -60930 184560
8997 -58396 -176667 -196841 72146 -3379 9616 -124456 42542 19549 -191632 -215533 -81137 -84724
8985 -84724 168730 8903 102970 -390652 76012 26044 68931 -321861 -1127 10506 33140 -154875
8972 117035 109638 -27402 165107 -134455 148197 -307380 -176291 93250 206829 -114504
8961B30643b45269A69241C8603a11626dI1669f1613m4315B04021b50369d4893
8949c08982B38422H1847J63053a67892g7121A8199a12013k40283g1888m6251b7042
8937a79030b0657C6427J65508q1167f8868l34699J66994A6616c56854E9019Q1315
8926A40334c7005A01917L57643J150823L568385K792670B787573D41747A18894
8916B61130k5327k5023C7459K91590A51683K12910a36088k65150B13256j0641
8906B02615g9879L5938C32982b6358m09582h0273j62669j92128J60752A27947
8895a49226A35758n6140b24260A48739a05948q312B41857B8304b29195A98147
$$ plain form
8961 230643 -245269 169241 38603 -111626 -4 91669 -61613 -105928 204021 -250369 -44893
8949 -308982 238422 81847 244900 -167892 -77121 18199 -112013 -352296 -71888 -118139 -27042
8937 -179030 -20657 36427 201935 120768 -68868 -403567 -236573 16616 -356854 59019 140334
8926 140334 -37005 101917 459560 1610383 5178768 7971438 2787573 441747 118894
8916 261130 235803 210780 37459 329049 151683 364593 -136088 -401238 213256 202615
8906 202615 -79879 -43941 332982 -26358 -435940 -80273 -242942 -435070 -274318 127947
8895 -149226 135758 79618 -224260 148739 -105948 -114260 241857 28304 -229195 198147
$$ [...]
##END NTUPLES=NMR SPECTRUM
##END=
