
##TITLE=AC1201_HPAAH12051_7164041_BXMSYcsEkW
##JCAMPDX= 6.0         $$ Bruker NMR JCAMP-DX V2.0
##DATA TYPE= NMR SPECTRUM
##DATA CLASS= NTUPLES
##ORIGIN= BRUKER
##OWNER= Administrator
$$ 1.72 TOPSPIN		Version 2.1
$$ 2012-12-01 14:05:00.436 -0500  Administrator@X
$$ Compression mode = diff/dup
##.OBSERVE FREQUENCY= 400.02188249412
##.OBSERVE NUCLEUS= ^1H
##.ACQUISITION MODE= SIMULTANEOUS (DQD)
##.ACQUISITION SCHEME= undefined
##.AVERAGES= 8
##.DIGITISER RES= 22
##SPECTROMETER/DATA SYSTEM= spect
##.PULSE SEQUENCE= zg30
##.SOLVENT NAME= COFFEE_meoh
##.SHIFT REFERENCE= INTERNAL, COFFEE_meoh, 1, 14.98509
##AUDIT TRAIL= $$ (NUMBER, WHEN, WHO, WHERE, PROCESS, VERSION, WHAT)
$$ ##TITLE= Audit trail, TOPSPIN		Version 2.1
$$ ##JCAMPDX= 5.01
$$ ##ORIGIN= Bruker BioSpin GmbH
$$ ##OWNER= Administrator
$$ $$ E:\/data/COFFEE/nmr/AC1201_HPAAH12051_7164041_BXMSYcsEkW/10/pdata/1/auditp.txt
$$ ##AUDIT TRAIL=  $$ (NUMBER, WHEN, WHO, WHERE, PROCESS, VERSION, WHAT)
(   1,<2012-12-01 14:04:51.272 -0500>,<Administrator>,<X>,<go>,<TOPSPIN 2.1>,
      <created by zg
	started at 2012-12-01 14:03:44.615 -0500,
	POWCHK enabled, PULCHK disabled,
       configuration hash MD5:
       86 BA 57 50 F2 9D 5C 9B 26 00 A9 28 5F 66 2E 89
       data hash MD5: 64K
       AA 1F 95 2E AE 9E D5 93 BC FE 2B 55 53 9B 54 83>)
(   2,<2012-12-01 14:04:54.639 -0500>,<Administrator>,<X>,<proc1d>,<TOPSPIN 2.1>,
      <Start of raw data processing
       efp LB = 0 FT_mod = 6 PKNL = 1 PHC0 = 0 PHC1 = 0 SI = 32K 
       data hash MD5: 32K
       3C 4F 5D 50 F2 1F C2 B2 73 57 59 04 8E 6C FE 81>)
(   3,<2012-12-01 14:04:55.139 -0500>,<Administrator>,<X>,<proc1d>,<TOPSPIN 2.1>,
      <pk PHC0 = 97.37183 PHC1 = 0 
       data hash MD5: 32K
       F6 A4 95 73 B3 F5 F0 64 10 B8 B2 96 B4 CD C2 9E>)
(   4,<2012-12-01 14:04:55.358 -0500>,<Administrator>,<X>,<proc1d>,<TOPSPIN 2.1>,
      <abs ABSG = 1 
       data hash MD5: 32K
       F6 CD 91 BD EB DC E6 34 C3 7E CA 79 28 A9 DC 9B>)
(   5,<2012-12-01 14:04:55.514 -0500>,<Administrator>,<X>,<proc1d>,<TOPSPIN 2.1>,
      <abs ABSG = 2 
       data hash MD5: 32K
       BB 95 B9 87 41 F4 27 D4 F3 E2 83 DC 56 16 E3 76>)
(   6,<2012-12-01 14:04:55.670 -0500>,<Administrator>,<X>,<proc1d>,<TOPSPIN 2.1>,
      <abs ABSG = 3 
       data hash MD5: 32K
       0B 03 B5 02 8C D3 07 A2 8C EC F3 D4 19 FF 6F 1B>)
(   7,<2012-12-01 14:04:55.811 -0500>,<Administrator>,<X>,<proc1d>,<TOPSPIN 2.1>,
      <abs ABSG = 4 
       data hash MD5: 32K
       4C EB D3 0D 83 9D A3 F4 5C 84 90 72 BC 60 47 BF>)
(   8,<2012-12-01 14:04:55.998 -0500>,<Administrator>,<X>,<proc1d>,<TOPSPIN 2.1>,
      <abs ABSG = 5 
       data hash MD5: 32K
       74 24 A0 30 6A A2 02 B6 6D 64 FF C6 14 88 6F 7A>)
$$ ##END=
$$ 
$$ $$ hash MD5
$$ $$ F6 24 A5 6D 35 2A FF CA 36 7E 0E 25 08 67 93 6D
##$RELAX= 
##$RELAX= 
##$RELAX= 
##$RELAX= 
##$RELAX= 
##$RELAX= 
##$RELAX= 
$$ Bruker specific parameters
$$ --------------------------
##$DU= <E:\>
##$EXPNO= 10
##$NAME= <AC1201_HPAAH12051_7164041_BXMSYcsEkW>
$$ [...]
##$TP= (0..7)
150 150 150 150 150 150 150 150
##$TP07= 0
##$TPNAME0= <>
##$TPNAME1= <>
##$TPNAME2= <>
##$TPNAME3= <>
##$TPNAME4= <>
##$TPNAME5= <>
##$TPNAME6= <>
##$TPNAME7= <>
##$TPOAL= (0..7)
0.5 0.5 0.5 0.5 0.5 0.5 0.5 0.5
##$TPOFFS= (0..7)
0 0 0 0 0 0 0 0
##$TUNHIN= 0
##$TUNHOUT= 0
##$TUNXOUT= 0
##$USERA1= <user>
##$USERA2= <user>
##$USERA3= <user>
##$USERA4= <user>
##$USERA5= <user>
##$V9= 5
##$VALIST= <valist>
##$VCLIST= <CCCCCCCCCCCCCCC>
##$VD= 0
##$VDLIST= <DDDDDDDDDDDDDDD>
##$VPLIST= <PPPPPPPPPPPPPPP>
##$VTLIST= <TTTTTTTTTTTTTTT>
##$WBST= 1024
##$WBSW= 4
##$XGAIN= (0..3)
0 0 0 0
##$XL= 0
##$YL= 0
##$YMAX_a= 663431
##$YMIN_a= -559423
##$ZGOPTNS= <>
##$ZL1= 120
##$ZL2= 120
##$ZL3= 120
##$ZL4= 120
##$ABSF1= 14.98509
##$ABSF2= -5.573092
##$ABSG= 5
##$ABSL= 3
##$ALPHA= 0
##$AQORDER= 0
##$ASSFAC= 0
##$ASSFACI= 0
##$ASSFACX= 0
##$ASSWID= 0
##$AUNMP= <proc_prof1d_extract_pilot.lims>
##$AXLEFT= 0
##$AXNAME= <>
##$AXNUC= <1H>
##$AXRIGHT= 0
##$AXTYPE= 0
##$AXUNIT= <>
##$AZFE= 0.1
##$AZFW= 0.1
##$BCFW= 0
##$BC_mod= 0
##$BYTORDP= 0
##$COROFFS= 0
##$CY= 15
##$DATMOD= 1
##$DC= 0
##$DFILT= <>
##$DTYPP= 0
##$F1P= 0
##$F2P= 0
##$FCOR= 0.5
##$FTSIZE= 32768
##$FT_mod= 6
##$GAMMA= 0
##$GB= 0
##$INTBC= 1
##$INTSCL= 1
##$ISEN= 128
##$LB= 0
##$LEV0= 0
##$LPBIN= 0
##$MAXI= 10000
##$MC2= 0
##$MEAN= 0
##$ME_mod= 0
##$MI= 0
##$NCOEF= 0
##$NC_proc= -8
##$NLEV= 6
##$NOISF1= 0
##$NOISF2= 0
##$NSP= 0
##$NTH_PI= 0
##$NZP= 0
##$OFFSET= 14.98509
##$PC= 1
##$PHC0= 97.37183
##$PHC1= 0
##$PH_mod= 1
##$PKNL= yes
##$PPARMOD= 0
##$PPDIAG= 0
##$PPIPTYP= 0
##$PPMPNUM= 2147483647
##$PPRESOL= 1
##$PSCAL= 4
##$PSIGN= 0
##$PYNMP= <proc.py>
##$REVERSE= no
##$SF= 400.02
##$SI= 32768
##$SIGF1= 0
##$SIGF2= 0
##$SINO= 400
##$SIOLD= 32768
##$SPECTYP= <>
##$SREGLST= <1H.CDCl3>
##$SSB= 0
##$STSI= 32768
##$STSR= 0
##$SW_p= 8223.68421052631
##$SYMM= 0
##$S_DEV= 0
##$TDeff= 65536
##$TDoff= 0
##$TI= <>
##$TILT= no
##$TM1= 0
##$TM2= 0
##$TOPLEV= 0
##$USERP1= <user>
##$USERP2= <user>
##$USERP3= <user>
##$USERP4= <user>
##$USERP5= <user>
##$WDW= 1
##$XDIM= 32768
##$YMAX_p= 472163093
##$YMIN_p= -666072
##$CURPLOT= <Network HP LaserJet P1505>
##$CURPRIN= <$Network HP LaserJet P1505>
##$DFORMAT= <normdp>
##$LAYOUT= <+/1D_H.xwp>
##$LFORMAT= <normlp>
##$PFORMAT= <normpl>
##$SURQMSG= 1
$$ End of Bruker specific parameters
$$ ---------------------------------
##NTUPLES= NMR SPECTRUM
##VAR_NAME=  FREQUENCY,     SPECTRUM/REAL,   SPECTRUM/IMAG
##SYMBOL=    X,             R,               I
##VAR_TYPE=  INDEPENDENT,   DEPENDENT,       DEPENDENT
##VAR_FORM=  AFFN,          ASDF,            ASDF
##VAR_DIM=   32768,         32768,           32768
##UNITS=     HZ,            ARBITRARY UNITS, ARBITRARY UNITS
##FACTOR=    0.250966925370066, 1,           1
##FIRST=     8223.43324360094, 86704,        -1958
##LAST=      0,             27598,           127033
##MIN=       0,             -666072,         0
##MAX=       8223.43324360094, 472163093,    0
$$ Real data points
##PAGE= N=1
##DATA TABLE= (X++(R..R)), XYDATA
32767H6704F084a70117L7972e4439p1455d6285G8556K0405a10137k05298A9171
$$ 86704 6084 -170117 -132145 -54439 -125894 -46285 78556 98961 -110137 -315435 19171
32755A44501b55708f5000D8298e5780k3056B62102g150p5616A7145b86635J30712
$$ 144501 -255708 -65000 48298 -55780 -78836 262102 -7150 -82766 17145 -286635 -155923
32744a55923m8120H0826i3677d3580k43122j7718J20998d1908j52043c9397I4412
$$ -155923 -204043 80826 -93677 -43580 -286702 -304420 -183422 -41908 -193951 -39397 94412
32732D0213f0047A55413b38678a10162M9157j24811K8887e2067A11216D4087b80857
$$ 40213 -60047 155413 -238678 -110162 -61005 -185816 -156929 -52067 111216 44087 -280857
32720a86218L6263m9420B6467K9558a05979f812B2145a22215K5300j7680L9516
$$ -186218 -149955 -199375 26467 56025 -105979 -6812 22145 -122215 -96915 -114595 -75079
32709g5079p6339L3116M3595H0002h4256n7408r1118m6067a10093p6025d1102
$$ -75079 -151418 -118302 -74707 80002 -84256 -141664 -232782 -278849 -110093 -186118 -41102
32697F5676k7473A8011a1727A1098J06P1847A7632N4431A2838a52616b8919k60066
$$ 65676 38203 18011 -11727 11098 11204 83051 17632 72063 12838 -152616 -28919 -288985
32685b88985h1633m171q5558A03289l1967a24536M950e0883D5344o268K0588J38863
$$ -288985 -81633 -85804 -171362 103289 71322 -124536 -119586 -50883 45344 39076 59664 198527
32673A98527A303i0688m2960c3362l5374p5030j36361A20730i4594B0947a21582
$$ 198527 1303 -90688 -133648 -33362 -68736 -143766 -280127 120730 -94594 20947 -121582
32661c54698A9336e672E7570a7065D9132h051B4846c4613E5530a21620b850p5909
$$ -354698 19336 -5672 57570 -17065 49132 -8051 24846 -34613 55530 -121620 -2850 -78759
32649g8759A8946R3514D3375h0474l7306k0031J5424E0746f5244E4451M6312a34836
$$ -78759 18946 112460 43375 -80474 -117780 -137811 -122387 50746 -65244 54451 100763 -134836
32636E0580J7298g7002j63970Q9713b1610p1833C4375K0456b9715m4411o8600
$$ 50580 67878 -77002 -240972 -151259 -21610 -93443 34375 54831 -29715 -74126 -142726
32625a42726L5963n5620d9522H9827a88140d4483E9489a82981e9152j7554A05953
$$ -142726 -106763 -162383 -49522 89827 -188140 -44483 59489 -182981 -59152 -76706 105953
32613b54405o684P4944g8482m3525k229B23a56849A01428r622O9064a26579D7534
$$ -254405 -261089 -186145 -78482 -122007 -124236 223 -156849 101428 91806 160870 -126579 47534
32600b96822A98957c35316a28826o810L5913j01502C234K2467b00879A4443a33108
$$ -296822 198957 -335316 -128826 -135636 -99723 -201225 3234 25701 -200879 14443 -133108
32588g1152b0072A0620Q8294P219A4398c13469J9254a44369j03712h0316F9230
$$ -71152 -20072 10620 98914 106133 14398 -313469 -294215 -144369 -248081 -80316 69230
32576b10749A78031a15297n8359Q1288H8748J39202A03456Q1143a61123k7987
$$ -210749 178031 -115297 -173656 -92368 88748 227950 103456 184599 -161123 -189110
32566a89110l3320M5216p3798A73536E6148h5508m6911A16468J82284C1085a21348
$$ -189110 -222430 -177214 -251012 173536 56148 -85508 -132419 116468 298752 31085 -121348
32554b2495j42543A31727E1160a32210O3744p4356A12868a64513n6793g5951I0228
$$ -22495 -165038 131727 51160 -132210 -68466 -142822 112868 -164513 -221306 -75951 90228
32542a02268j67064J14761L8688f643q8673j1171B62158a37773B64477B3912g5684
$$ -102268 -269332 -154571 -115883 -6643 -95316 -106487 262158 -137773 264477 23912 -75684
32530b97836a22614B46927a64581B90286b01867O52L1801m5656A56737C5695O7566
$$ -297836 -122614 246927 -164581 290286 -201867 -201215 -169414 -215070 156737 35695 103261
32519A03261i5306A08129c2994j19962c8394j38826D2187k0029d2767o7603k38573
$$ 103261 -95306 108129 -32994 -152956 -38394 -177220 42187 22158 -42767 -110370 -348943
32508c48943A61419k7743c33001A56765F1344i1458m9819d0229o2448j30300k4946
$$ -348943 161419 133676 -333001 156765 61344 -91458 -141277 -40229 -102677 -232977 -257923
32497b57923C1343c60051G760d8496A29145F392b85294m0615b2095p2049D838
$$ -257923 31343 -360051 7760 -48496 129145 6392 -285294 -325909 -22095 -94144 4838
32485D37581a59467A55757C329K07718b12335B7285O0560Q6138b88063H3598b00050
$$ 437581 -159467 155757 3329 211047 -212335 27285 87845 173983 -288063 83598 -200050
32473b7804j07283c4984J4428m7838B16454b40710d9074o8923L0028A7540J24395
$$ -27804 -135087 -34984 -20556 -68394 216454 -240710 -49074 -117997 -87969 17540 141935
32462A41935o3558h0142l5140A01586J2775D1594g7360r8839G1131J80935a45327
$$ 141935 78377 -80142 -115282 101586 114361 41594 -77360 -176199 71131 252066 -145327
32450B1619b91945Q0325E6170J21727c0979Q587k63967A13052a2346r4796n635
$$ 21619 -291945 -211620 56170 177897 -30979 -22392 -286359 113052 -12346 -107142 -112777
32439a12777A24684k8715b42916A54280i3816M0459B02531b62554a00997A46626
$$ -112777 124684 95969 -242916 154280 -93816 -53357 202531 -262554 -100997 146626
32428b88697Q5904B13878d22824a94401P9447a9363q9339A82054B910L59053a68934
$$ -288697 -202793 213878 -422824 -194401 -114954 -19363 -108702 182054 2910 361963 -168934
32416a6387A26428m2979d14162B36787B7335c9535n9254K6178k36801J54472p316
$$ -16387 126428 83449 -414162 236787 27335 -39535 -98789 -72611 -309412 -154940 -162256
32405a62256K806o8330e6635A37050b02178G1054a93494i1074F8259c57442b4244
$$ -162256 -159450 -227780 -56635 137050 -202178 71054 -193494 -91074 68259 -357442 -24244
32393A6372b14772i5068j74420o2648J44810p1353h5749A98807J2847d174A37788
$$ 16372 -214772 -95068 -269488 -332136 -187326 -258679 -85749 198807 211654 -4174 137788
32381b52021h1080K1629a036E380c8117D5737e5448A37262J06874g7654k6921
$$ -252021 -81080 -59451 -1036 5380 -38117 45737 -55448 137262 244136 -77654 -104575
32370a04575B62737f9873B18545e0500B40350g1686D1931M5807C8326a1865k38316
$$ -104575 262737 -69873 218545 -50500 240350 -71686 41931 87738 38326 -11865 -250181
32359b50181F3728i5081F3187H023a71000A31154L744b97488A91957D3689k0311
$$ -250181 63728 -95081 63187 8023 -171000 131154 134898 -297488 191957 43689 23378
32348B3378J61287A7994C227f8840j72794f8126B2983P1617a79993C84042A00989
$$ 23378 184665 17994 3227 -68840 -241634 -68126 22983 94600 -179993 384042 100989
32336i1398A61008a11638m35k28483A18827D5175a27714k41354J72244e5580J6580
$$ -91398 161008 -111638 -112073 -340556 118827 45175 -127714 -369068 -196824 -55580 -39000
32325c9000k6543P972e77B50218g0464C55270c4756j85242H6463K05945b29203
$$ -39000 -65543 -57571 -577 250218 -70464 355270 -34756 -219998 86463 292408 -229203
32313d09264D8335d5204B48891i2033j44028f120j81640b227A56289a73056j33346
$$ -409264 48335 -45204 248891 -92033 -236061 -6120 -187760 -2227 156289 -173056 -306402
32302c06402A06870d51618a93304A48420a51973I5062e9853B16307a32004M7789
$$ -306402 106870 -451618 -193304 148420 -151973 95062 -59853 216307 -132004 -84215
32292h4215J4794B2744o282a70447N6267B47638a86612j41285a44830q1300a08706
$$ -84215 -69421 22744 16462 -170447 -114180 247638 -186612 -327897 -144830 -226130 -108706
32280B02617a50403l03482C27169F4996M9051I592K35085c69527N4224A930f1414
$$ 202617 -150403 -453885 327169 64996 114047 9592 244677 -369527 -315303 1930 -61414
32268a14946A0470c41522B43634f9604H6904b85036j09479a85394A01735J1729
$$ -114946 10470 -341522 243634 -69604 86904 -285036 -394515 -185394 101735 113464
32258A13464K131l6146b10209o4651A05144l4557J40404c4301l839B20499h0825
$$ 113464 115595 79449 -210209 -274860 105144 70587 210991 -34301 -38140 220499 -80825
32246C60321C7631a75825r477C03385j03584J89271b24098A38248b6416k16212
$$ 360321 37631 -175825 -185302 303385 199801 389072 -224098 138248 -26416 -242628
32236b42628D5258a94479J7974B40500A07901M8732c03415a13846n7943n8598
$$ -242628 45258 -194479 -176505 240500 107901 156633 -303415 -113846 -171789 -230387
32226b30387d534k84483J16137A15785K3670o0640l8024c5051D1650a39025M0441
$$ -230387 -4534 -289017 -172880 115785 139455 78815 40791 -35051 41650 -139025 -98584
32215i8584j10217B3032K27483b73620A7421K170e7496j14275J0200J7328A81572
$$ -98584 -208801 23032 250515 -273620 17421 19591 -57496 -171771 -161571 -144243 181572
32203A13656q760b62979I1231h7431L2746A10560Q51a00546r1117D0677i3042
$$ 113656 104896 -262979 91231 -87431 -54685 110560 111411 -100546 -191663 40677 -93042
32191f2686A23352a73983A11508K1625J53036b8545C3908a70568A00897g7641
$$ -62686 123352 -173983 111508 133133 286169 -28545 33908 -170568 100897 -77641
32180b39352h0024c1702A34343A9664J61847d3556j70538B33614A1671K97180
$$ -239352 -80024 -31702 134343 19664 181511 -43556 -214094 233614 11671 308851
32170C08851j33182m9011d85262A99676I6298b29323A5415b31941C11827A45139
$$ 308851 175669 126658 -485262 199676 96298 -229323 15415 -231941 311827 145139
32159a61083g3917r2309q984A41355a93068l012A7249K961b44998a17048A8050
$$ -161083 -73917 -166226 -175210 141355 -193068 -196080 17249 20210 -244998 -117048 18050
32147A14450k8226a65470B40161j16028a12293B38345l1897a10170a2848G3416
$$ 114450 86224 -165470 240161 124133 -112293 238345 206448 -110170 -12848 73416
32136C79931b27409D6186b65065N5680L7757g730D5653a8376o8049j31644c0230
$$ 379931 -227409 46186 -265065 -209385 -171628 -7730 45653 -18376 -86425 -218069 -30230
32124b59918a12385J3414A57029n6961c53336C2085K9437k1196a92484C05627
$$ -259918 -112385 -98971 157029 100068 -353336 32085 61522 40326 -192484 305627
32113A74768b25884k37749a52968G106b78557J09665C9738O255i3720k45302a17600
$$ 174768 -225884 -463633 -152968 7106 -278557 -168892 39738 45993 -93720 -339022 -117600
32101A0192J36032e6023n1532l59677C19973d00493J26073J36846B72777a07596
$$ 10192 146224 -56023 -107555 -467232 319973 -400493 -274420 -137574 272777 -107596
32090B19443e6656E2235a8895m8916j16929M2632F2197a9991j61518A81997B365
$$ 219443 -56656 52235 -18895 -67811 -184740 -142108 62197 -19991 -181509 181997 2365
32078A60113h3584j00504A08689D3199f0150K1310B5506A0175d36238I0362Q4839
$$ 160113 -83584 -184088 108689 43199 -60150 -38840 25506 10175 -436238 90362 175201
32067A75201n7349L0808f678A76363F927a80353A24435a21662D823K8939N6605
$$ 175201 117852 148660 -6678 176363 6927 -180353 124435 -121662 4823 33762 90367
32056I0367J1124a69678K5888J6059D5227J21741a35944A7526a6598m187m07929
$$ 90367 101491 -169678 -143790 -127731 45227 166968 -135944 17526 -16598 -20785 -428714
32045d28714o1106a45963D6813f9130I3833L40978A65825a59844l8433q1133B13571
$$ -428714 -489820 -145963 46813 -69130 93833 434811 165825 -159844 -198277 -279410 213571
32033B90331d8601I8883B7404b15305G6275b12851i318A41875o3211c28407B1419
$$ 290331 -48601 98883 27404 -215305 76275 -212851 -9318 141875 78664 -328407 21419
32021C6915J21318c7520j53726M7472c9314A95502b4069k23840R4961O0532G9876
$$ 36915 158233 -37520 -191246 -143774 -39314 195502 -24069 -247909 -152948 -92416 79876
32009c09714G7100J36083b4994k4789E4852d046C95807H2750g6929B90549b52229
$$ -309714 77100 213183 -24994 -49783 54852 -4046 395807 82750 -76929 290549 -252229
31997G6126Q4188a63774a4378E7736a98633e1265p3442A4025a32672C5535a08888
$$ 76126 160314 -163774 -14378 57736 -198633 -51265 -124707 14025 -132672 35535 -108888
31985a47415A3048a22560c8917k82760A66318c21961B41694c43945N4751O9851
$$ -147415 13048 -122560 -38917 -321677 166318 -321961 241694 -343945 -289194 -219343
31975b19343A74484d6332j09773B17815e8647A3972a341D0719a82594A25563E0079
$$ -219343 174484 -46332 -156105 217815 -58647 13972 -1341 40719 -182594 125563 50079
31963D6069J29601a63261A88820a33566I6707m110N2088b50945B8705a26074d1321
$$ 46069 175670 -163261 188820 -133566 96707 92597 144685 -250945 28705 -126074 -41321
31951B190J50964f6802H8466N9218a40442C9043i4401j02906l3975G9583c65654
$$ 2190 153154 -66802 88466 147684 -140442 39043 -94401 -197307 -231282 79583 -365654
31939D6477a44551C89170d09574a2420k79001a20284B84923o4494g9668K0038
$$ 46477 -144551 389170 -409574 -12420 -291421 -120284 284923 220429 -79668 -59630
31929e9630A33199Q8637J4775D4257L7307L4610j0565b85345D9231N4783d4644
$$ -59630 133199 221836 236611 44257 81564 116174 105609 -285345 49231 104014 -44644
31917H692d1754I7437b1531B26615D6352e6164j17286C9196b8903p5754A5181
$$ 8692 -41754 97437 -21531 226615 46352 -56164 -173450 39196 -28903 -104657 15181
31905E066b98445A62659b05245F4945b35166a7854j54974H1277d1978l1700j02936
$$ 5066 -298445 162659 -205245 64945 -235166 -17854 -172828 81277 -41978 -73678 -176614
31894a76614B71866b9226a4094j51046D6502b94901C8312l550i1544p9290J2594
$$ -176614 271866 -29226 -14094 -165140 46502 -294901 38312 34762 -91544 -170834 -158240
31883a58240A07754J2251b20572d7443B97644b79786a10065c3144r9726J6810
$$ -158240 107754 120005 -220572 -47443 297644 -279786 -110065 -33144 -132870 -116060
31873a16060A63295n0643J38229g1755D70849D1018b3559B15688A3869a90752
$$ -116060 163295 112652 250881 -71755 470849 41018 -23559 215688 13869 -190752
31862A74548P8544a5558E1310M840g3580j53041b2088j11403p5113j74062B53692
$$ 174548 253092 -15558 51310 56150 -73580 -226621 -22088 -133491 -208604 -382666 253692
31850a62699O8746A5807K20556C4534b71867k19721A71360m3712a68365o8400
$$ -162699 -93953 15807 236363 34534 -271867 -491588 171360 127648 -168365 -236765
31840b36765B5552f7294H7948J08098K08826h2265k73466A96313c2049B12180
$$ -236765 25552 -67294 87948 196046 404872 -82265 -355731 196313 -32049 212180
31829A69705d3140o9959j933A15846a75820N2595E48b95751a15666k75636A01913
$$ 169705 -43140 -113099 -115032 115846 -175820 -123225 548 -295751 -115666 -391302 101913
31817c2509F2810g2703L5077j61779N7445j48399O9836a8930A65834E8832O3323
$$ -32509 62810 -72703 -37626 -199405 -141960 -290359 -220523 -18930 165834 58832 122155
31806A22155f3515C25406D7814Q3273n9688c9666k15551I2888L7753d60002a0601
$$ 122155 -63515 325406 47814 131087 71399 -39666 -255217 92888 130641 -460002 -10601
31794a29842c9091B08623a01819a3263A20171d320D5599K57877c08979A19057
$$ -129842 -39091 208623 -101819 -13263 120171 -4320 45599 303476 -308979 119057
31783C7930L30023A63046Q43b25094J01648B91317e2070B5085J47518q2255B1597
$$ 37930 367953 163046 163889 -225094 -123446 291317 -52070 25085 172603 90348 21597
31771b77217B94687e0678A08222a68790n1982a06298b0860j33370A214a0910A56166
$$ -277217 294687 -50678 108222 -168790 -220772 -106298 -20860 -154230 1214 -10910 156166
31759A14017J37628f0171I1380b88076B20715H3956c5311A75181H3198j1291o26
$$ 114017 251645 -60171 91380 -288076 220715 83956 -35311 175181 83198 71907 71281
31748G1281b41647B82b20278B73020c82719b1190k90138A58616L8527E0633c40716
$$ 71281 -241647 282 -220278 273020 -382719 -21190 -311328 158616 197143 50633 -340716
31736A8070K10892A6763J21383b89994Q0687b0280A51637L0215i3685L6199A27874
$$ 18070 228962 16763 138146 -289994 -209307 -20280 151637 181852 -93685 -57486 127874
31724b10655g0708j91688B14224K3743a32827b1074j96397B46736h8137A81952
$$ -210655 -70708 -262396 214224 237967 -132827 -21074 -217471 246736 -88137 181952
31713A05740K67155j39872b79831a6593B1890b42896b050q8318b0707A9431J22565
$$ 105740 372895 233023 -279831 -16593 21890 -242896 -2050 -90368 -20707 19431 141996
31702A41996a23628H0258b85664C10167A0959e3181A11429J20336b10077A72635
$$ 141996 -123628 80258 -285664 310167 10959 -53181 111429 231765 -210077 172635
31691g1887k59654g2232n1293L4079E3145a21679B10648a44344d4426I4721D4886
$$ -71887 -331541 -72232 -123525 -89446 53145 -121679 210648 -144344 -44426 94721 44886
31679C87203b4810A87614F7078k4675K12659A1732a68570A7664J2425i281A65613
$$ 387203 -24810 187614 67078 42403 255062 11732 -168570 17664 30089 -9281 165613
31667c88867a4903k08253n4893B07860g6039p4014a7489H6179b7166j37341J6064
$$ -388867 -14903 -223156 -278049 207860 -76039 -150053 -17489 86179 -27166 -164507 -148443
31656a48443f571E0717a5000A45919A9066g2832G4782B6718f7895j5433o9404
$$ -148443 -6571 50717 -15000 145919 19066 -72832 74782 26718 -67895 -83328 -152732
31645a52732B4080j207N8060f540A33917b24850G7104J97761j08304d1907r6198
$$ -152732 24080 22873 80933 -6540 133917 -224850 77104 274865 166561 -41907 -138105
31634a38105H1471b49803a22434B67221b06607D4770a31321j15861h3482k01070
$$ -138105 81471 -249803 -122434 267221 -206607 44770 -131321 -247182 -83482 -284552
31624b84552B6438b1503l0576j35173p0661I3139b2364B8398a3674D3529a45899
$$ -284552 26438 -21503 -52079 -187252 -257913 93139 -22364 28398 -13674 43529 -145899
31612a85253K7339I5589K22834b582o1210A5825b6479k98372a53381F9852J57442
$$ -185253 -157914 95589 318423 -2582 -63792 15825 -26479 -324851 -153381 69852 227294
31601B27294F8963A4839a97153B25568D434J96405g6740c2057o2700L0842C8396
$$ 227294 68963 14839 -197153 225568 4434 200839 -76740 -32057 -94757 -63915 38396
31589d7150a1350k56608F658J74846b24454e8707E2187H188J20609n5188a21668
$$ -47150 -11350 -267958 6658 181504 -224454 -58707 52187 8188 128797 73609 -121668
31577B07611I547f5467k65412F3480B1763J90689a83713R0361A81873a60307J1530
$$ 207611 9547 -65467 -330879 63480 21763 212452 -183713 -93352 181873 -160307 -148777
31566a48777M7050d9470A6581J45993c0984E5853N5991b68663E4933c90532J04450
$$ -148777 -101727 -49470 16581 162574 -30984 55853 111844 -268663 54933 -390532 -286082
31555b86082i4344p816A96474R0111E7522a7820j4085k16729A79622J42738b07095
$$ -286082 -94344 -102160 196474 286585 57522 -17820 -31905 -248634 179622 322360 -207095
31543a55021c5797B46018i5543H9184d4279j58202A56012c08464A26764J74561
$$ -155021 -35797 246018 -95543 89184 -44279 -202481 156012 -308464 126764 301325
31533C01325a26852A01130c95665A65671E2846c58544a08811a883k58752A32045
$$ 301325 -126852 101130 -395665 165671 52846 -358544 -108811 -1883 -260635 132045
31522a46466o1546B18490R6069F6086J85348I3111h2136p8726f9330j10502K6631
$$ -146466 -208012 218490 314559 66086 251434 93111 -82136 -160862 -69330 -179832 -153201
31511a53201C2686i6871o6910A4775Q4397L71452A25047a72499b5889H5114h7233
$$ -153201 32686 -96871 -163781 14775 99172 470624 125047 -172499 -25889 85114 -87233
31499a37778B46404H1816d5581H6233B2388f390H5708N4896a61982A84345d1781
$$ -137778 246404 81816 -45581 86233 22388 -6390 85708 140604 -161982 184345 -41781
31487A38155e1283F8130g8039A25026k0155J54157m8521k5575F8483e3177A25777
$$ 138155 -51283 68130 -78039 125026 104871 259028 210507 184932 68483 -53177 125777
31475I4891f2232j02264J6471J3702l8402A63212c8085G3843a05156C19250a03753
$$ 94891 -62232 -164496 -148025 -134323 -172725 163212 -38085 73843 -105156 319250 -103753
31463a3490B46224J2565b8571j79901a5181A81411J8480p1014e862j24827j36597
$$ -13490 246224 258789 -28571 -208472 -15181 181411 199891 128877 -5862 -130689 -267286
31452b67286I1291R0391n2411c3409B8181J58088a70436j84117A65689b1679k28448
$$ -267286 91291 181682 129271 -33409 28181 186269 -170436 -354553 165689 -21679 -250127
31441b50127J13304M7980q3016J6938k1546d6548H8079d3850D1059a74548A75144
$$ -250127 -136823 -88843 -171859 -154921 -176467 -46548 88079 -43850 41059 -174548 175144
31429F4449J81706g5245G4600K8183a27387B18998P6455j07765b04330H3848C3364
$$ 64449 246155 -75245 74600 102783 -127387 218998 295453 187688 -204330 83848 33364
31417D9271a44950F0692b4374p9164f453B51609p6008F3852a65292j92578A41495
$$ 49271 -144950 60692 -24374 -103538 -6453 251609 175601 63852 -165292 -357870 141495
31405A4579a83578A25630a38763A7409J22743g1205j27321E1809J57269a71284
$$ 14579 -183578 125630 -138763 17409 140152 -71205 -198526 51809 209078 -171284
31394F0524a37912i850j53581D7277J60147K89981B9484a75777k18831a37084
$$ 60524 -137912 -9850 -163431 47277 207424 497405 29484 -175777 -394608 -137084
31383a24589B0319J07550a50485B43856B4531a00685k17212O6786C20939c0703
$$ -124589 20319 127869 -150485 243856 24531 -100685 -317897 -251111 320939 -30703
31372c4585A43849c5267A81521c9629q8722M9430J8491q1356e9569B03555c2534
$$ -34585 143849 -35267 181521 -39629 -128351 -78921 -60430 -141786 -59569 203555 -32534
31360C15278b04917k58135g6616E4495e3264j8896B61611a08209A48315a0488
$$ 315278 -204917 -463052 -76616 54495 -53264 -72160 261611 -108209 148315 -10488
31349I6886N8407P7021H494b801q3213C8736a29027c3761j26856k6009L9760O2297
$$ 96886 155293 232314 8494 -2801 -86014 38736 -129027 -33761 -160617 -186626 -146866 -84569
31337h4569j6380d6611l20768N5876e0232A93979a7543o1038A67876j0710f5353
$$ -84569 -100949 -46611 -367379 -311503 -50232 193979 -17543 -78581 167876 157166 -65353
31325E5499R7535a72131P5975G4372J4672J21753J54862H0971a82488N2166A53349
$$ 55499 153034 -172131 -96156 74372 89044 210797 365659 80971 -182488 -130322 153349
31313c54529J73489q3750B4300J3975J6120J56709g449A28885B2847a00528a0829
$$ -354529 -181040 -264790 24300 38275 54395 211104 -7449 128885 22847 -100528 -10829
31301E995c15769B98087J1687p2015b10256I3464b01275d2012d790k0320G8381
$$ 5995 -315769 298087 309774 237759 -210256 93464 -201275 -42012 -4790 -25110 78381
31289e7041l24262a90452K6704P3843A45465n8301K2493D5134e8570R325B36995
$$ -57041 -381303 -190452 -163748 -89905 145465 87164 109657 45134 -58570 -49245 236995
31277G8383g1637R344l69500B28321c8925B9662c13874A56865n9139J51090a17410
$$ 78383 -71637 -62293 -431793 228321 -38925 29662 -313874 156865 97726 248816 -117410
31265C59764a1174A10089A7539M7939i1887H4659b01736f5557k1075D8802Q2083
$$ 359764 -11174 110089 17539 65478 -91887 84659 -201736 -65557 -86632 48802 130885
31254A30885i1353n0408b1712E2712a38191K2626A47433n7840k1095E374c88432
$$ 130885 -91353 -141761 -21712 52712 -138191 -115565 147433 89593 68498 5374 -388432
31242A60511a971r4015J3061k3664c8766h966F1104J20889e8231B31438a10387
$$ 160511 -1971 -95986 -82925 -106589 -38766 -8966 61104 181993 -58231 231438 -110387
31230A16057j3528b38583K8690A76639a12671I0558h4290A10081k1320a7712j46897
$$ 116057 102529 -238583 -209893 176639 -112671 90558 -84290 110081 88761 -17712 -164609
31219a64609B27265A7665a78163d4658A14235a58289A244J67452p3372b3296a0866
$$ -164609 227265 17665 -178163 -44658 114235 -158289 1244 168696 95324 -23296 -10866
31207b19733B76727a90047C44569h1196a181j99212B59550g819n5462K8574e972
$$ -219733 276727 -190047 344569 -81196 -1181 -200393 259550 -7819 -63281 -34707 -5972
31195c3439j70686i4834k20545J15345A74839e9274A21970f2169C50127b34823
$$ -33439 -204125 -94834 -315379 -200034 174839 -59274 121970 -62169 350127 -234823
31184B11433c51718a35824A18170K73666G2731a8718j8003j26816f7565F3672
$$ 211433 -351718 -135824 118170 391836 72731 -18718 -36721 -163537 -67565 63672
31173A18550k211a67748D7802N8451g3975F9486J8927F082a23052N1667o8085
$$ 118550 116339 -167748 47802 106253 -73975 69486 88413 6082 -123052 -71385 -139470
31162a39470M139M4620o1017I9528r514L71435A04002C7934P431a27092A73974
$$ -139470 -135331 -90711 -151728 99528 90014 461449 104002 37934 45365 -127092 173974
31150a268A13716a44406D8362a064n5312j47474J9252E9931a07996I6224i0358
$$ -1268 113716 -144406 48362 -1064 -56376 -203850 -184598 59931 -107996 96224 -90358
31138a46645D8890j8745K98581A6421a189C8846q977a37990M8059B97950I4040
$$ -146645 48890 30145 328726 16421 -1189 38846 29869 -137990 -89931 297950 94040
31126F3146g0537n027q8803r8411h7645B92774j39546b48984e2134p0511B833
$$ 63146 -70537 -75564 -164367 -262778 -87645 292774 153228 -248984 -52134 -122645 2833
31114a66925m3967M4881B29689G5980P9240Q631m0292e4526I9978C0856a5967
$$ -166925 -210892 -166011 229689 75980 155220 163851 123559 -54526 99978 30856 -15967
31102a18916K2410a5472A4122h3009q065O847A66874K39663j83821G4310N1081
$$ -118916 -96506 -15472 14122 -83009 -91074 -84227 166874 406537 222716 74310 125391
31091A25391A205f6001A07095h3535A57801p6275K15932A31287b88687J14354
$$ 125391 1205 -66001 107095 -83535 157801 81526 297458 131287 -288687 -174333
31081a74333E9590b41728R7874F9089R7596o1602c90129a17546I2637J54265q0974
$$ -174333 59590 -241728 -143854 69089 166685 105083 -390129 -117546 92637 246902 165928
31070A65928G7910f6493n3378H5544c1456k28897h9987g721j45611M3482A40687
$$ 165928 77910 -66493 -119871 85544 -31456 -260353 -89987 -7721 -153332 -109850 140687
31058c78590I682a7672j58897A08205m5358a99515D08120A55780h3109M190E5916
$$ -378590 9682 -17672 -176569 108205 62847 -199515 408120 155780 -83109 -78919 55916
31046b86791D2001h1813k64843A86271B9515c08769C4263J68560D5363N8969g5711
$$ -286791 42001 -81813 -346656 186271 29515 -308769 34263 202823 45363 104332 -75711
31034a19517a364k56507C97195a7888k90886J27812A0092O4718M1811b85583D287
$$ -119517 -1364 -257871 397195 -17888 -308774 -180962 10092 74810 116621 -285583 4287
31022A66328i1869r9874O0644d3173j14630a33A59893h6166f180k84488B77801
$$ 166328 -91869 -191743 -131099 -43173 -157803 -133 159893 -86166 -6180 -290668 277801
31010a03848A97046J02104a07478A94293J77644r8439I711f1449P58B51783d17849
$$ -103848 197046 299150 -107478 194293 371937 273498 9711 -61449 -60691 251783 -417849
30998a95865k3908d5643j49604Q7424M531A38268E8905a20725N9354A2024J04652
$$ -195865 -219773 -45643 -195247 -107823 -103292 138268 58905 -120725 -61371 12024 116676
30987A16676A1541a85838b2928j31873o3458p3718a27562f2095j57535K6227h9115
$$ 116676 11541 -185838 -22928 -154801 -218259 -291977 -127562 -62095 -219630 -193403 -89115
30975e0294A94458N1598d4690n7894A63203f3091c0313k97157e7286p6905L9559
$$ -50294 194458 246056 -44690 -102584 163203 -63091 -30313 -327470 -57286 -134191 -94632
30964i4632k11586D4310b21743E87172B3250N16030a09160A76527F9677J13226
$$ -94632 -306218 44310 -221743 587172 23250 539280 -109160 176527 69677 182903
30954A82903g758D496J49664i518k8194B59021f9454a6751C2667d6990k90757
$$ 182903 -7758 4496 154160 -9518 -37712 259021 -69454 -16751 32667 -46990 -337747
30943c37747B25828n1530J0336b85097f9327A59390a68085P6724A26660Q325j5305
$$ -337747 225828 174298 184634 -285097 -69327 159390 -168085 -91361 126660 134985 119680
30932A19680J22288b21835O2610C17929b29796B23260e6257A57722e0630l10576
$$ 119680 241968 -221835 -159225 317929 -229796 223260 -56257 157722 -50630 -361206
30922c61206A40204k7956J66005m5505A11505G953h6817r851C35454r6605A2885
$$ -361206 140204 112248 278253 232748 111505 7953 -86817 -96668 335454 238849 12885
30910A50895A5890a27375q1402q7138J22268B06980a09147p1830C6136g5606H1260
$$ 150895 15890 -127375 -208777 -295915 -173647 206980 -109147 -180977 36136 -75606 81260
30898A23871a71495b2708B1310a83464l6977E177J39614c762A28262K86216h8536
$$ 123871 -171495 -22708 21310 -183464 -220441 5177 144791 -3762 128262 414478 -88536
30886H2105J33313E0521a10083A67481N4971o888g3810K5987A28083Q988a31913
$$ 82105 215418 50521 -110083 167481 222452 215564 -73810 -47823 128083 137071 -131913
30874C7069J09964m8308d4853B01315d6292B74106G9986k9244g4558B40156B6666
$$ 37069 147033 98725 -44853 201315 -46292 274106 79986 50742 -74558 240156 26666
30862b09082A42099h2183b8583k52895A49765O8959q4201k7269a22577E4302N2383
$$ -209082 142099 -82183 -28583 -281478 149765 218724 134523 107254 -122577 54302 106685
30851A06685c33401a51425c0118R478A42867A3269a07990e2637n1778q638I0561
$$ 106685 -333401 -151425 -30118 -20640 142867 13269 -107990 -52637 -104415 -113053 90561
30839C33191F3881d5248B01177a07353k88717B9702N5766K195J52369n3559b09302
$$ 333191 63881 -45248 201177 -107353 -396070 29702 85468 87663 240032 186473 -209302
30827A15294a22972o0666F42206b5619H6788l6699a18736A89770a82487l7787
$$ 115294 -122972 -183638 642206 -25619 86788 50089 -118736 189770 -182487 -220274
30817b20274J1794B07123a1316B40810a45510p9276a11944B55561l3766a6515
$$ -220274 -208480 207123 -11316 240810 -145510 -224786 -111944 255561 221795 -16515
30806g8877G5638j7063b28670B78874e7602D3181a79079A5342K0110J34652H2546
$$ -78877 75638 58575 -228670 278874 -57602 43181 -179079 15342 35452 170104 82546
30794F2105J44086q7141q009J02787c35071J0696a29893A7640K85562A31400j6316
$$ 62105 206191 119050 111041 213828 -335071 -324375 -129893 17640 303202 131400 115084
30783A15084K2783E2929k822a75285G1093a42768G4206r034J1530D711a26000
$$ 115084 137867 52929 50107 -175285 71093 -142768 74206 65172 76702 4711 -126000
30771A35683b43935g8321A18049a54474A60544Q1900b303j1445j12338C63606
$$ 135683 -243935 -78321 118049 -154474 160544 242444 -2303 -13748 -126086 363606
30760g9042e784l0054B27616b14812D4781a38972A1547a42175A05507i5273F2245
$$ -79042 -5784 -35838 227616 -214812 44781 -138972 11547 -142175 105507 -95273 62245
30748c49951i3058D2236b0698E9338b7800m7012j36310L6716H1225B4499a8262
$$ -349951 -93058 42236 -20698 59338 -27800 -74812 -211122 -174406 81225 24499 -18262
30736a00252j3089o902e1771I0615k9186j7929h7458A4137J40520a03825D0202
$$ -100252 -113341 -120243 -51771 90615 61429 43500 -87458 14137 154657 -103825 40202
30724B28488C7157O6491D2211b65102e7918A80266m9393c3084B92642i4651j9046
$$ 228488 37157 103648 42211 -265102 -57918 180266 130873 -33084 292642 -94651 -113697
30713a13697D63351A5821K21168g9305D13125B042J08803g7421k28470H5561f1322
$$ -113697 463351 15821 236989 -79305 413125 2042 110845 -77421 -305891 85561 -61322
30701b20839J1404M7892A143i5456A11960J51918B6804J86629a66754Q3062K4679
$$ -220839 -209435 -161543 1143 -95456 111960 263878 26804 213433 -166754 -83692 -59013
30690e9013A29388h2931q9382B11500a90341A22682g3937Q120L1579A87496J62933
$$ -59013 129388 -82931 -172313 211500 -190341 122682 -73937 -65817 -34238 187496 350429
30679C50429m091i6357D30101C2623a38590M4085c0363A22588D7184J30638a96357
$$ 350429 346338 -96357 430101 32623 -138590 -94505 -30363 122588 47184 177822 -196357
30667c55219d6482G754b89449A30114e5342A28285D0507b76295A3941N0808M2441
$$ -355219 -46482 7754 -289449 130114 -55342 128285 40507 -276295 13941 64749 107190
30656A07190k4814K26813A26082a39029A2084J60782b51232M3591D1908b47827
$$ 107190 82376 309189 126082 -139029 12084 172866 -251232 -207641 41908 -247827
30645a4547A06128J47111A6328J13859m9825k6238a52259O9053M910A80767h4980
$$ -14547 106128 253239 16328 130187 80362 54124 -152259 -83206 -78296 180767 -84980
30633B9860b71613f0126A11287e4506j74588d8277A66477F2511b1818I3799K14673
$$ 29860 -271613 -60126 111287 -54506 -229094 -48277 166477 62511 -21818 93799 308472
30622C08472j48492g4646C02643A10596J2301c09732a0806j07112n9892A11740
$$ 308472 159980 -74646 302643 110596 122897 -309732 -10806 -117918 -177810 111740
30611e2202B59497i0749A57364E1155a08771B69960b19127d2701k34473A72828
$$ -52202 259497 -90749 157364 51155 -108771 269960 -219127 -42701 -277174 172828
30600a07012H4075c98772D5754B1727j0342b19523k6919j2150b3891A0271R5060
$$ -107012 84075 -398772 45754 21727 11385 -219523 -246442 -258592 -23891 10271 105331
30589A05331g4296e478A07491H629J73214J3984a50626A36370a98808B92624A16246
$$ 105331 -74296 -5478 107491 8629 181843 195827 -150626 136370 -198808 292624 116246
30577F5433b263A14725J37982A19305j4874h7134B10926b65709A81144l686B2405
$$ 65433 -2263 114725 252707 119305 104431 -87134 210926 -265709 181144 177458 22405
30565A94531n464B724a71881e4998B17871a08765b3326j57954A43302m4516b68832
$$ 194531 189067 2724 -171881 -54998 217871 -108765 -23326 -181280 143302 98786 -268832
30553h9994j76367C9471a26546C5114a97289A21311O1764k8251K53688A42320
$$ -89994 -266361 39471 -126546 35114 -197289 121311 183075 154824 408512 142320
30542A09525a75962g2346F4884J35778l433b87763B54725i5282I0712c81622H8895
$$ 109525 -175962 -72346 64884 200662 197229 -287763 254725 -95282 90712 -381622 88895
30530H5263l706a60533D6095J38117O6112q875a43165j78215b8074j37778A91876
$$ 85263 81557 -160533 46095 184212 250324 241449 -143165 -321380 -28074 -165852 191876
30518h8869A16468a18694b5156H9152D1503J70509a71024j47764J01603f3472
$$ -88869 116468 -118694 -25156 89152 41503 212012 -171024 -318788 -217185 -63472
30507C7001J02318k0167J22327E83a2657F0342b062D7179J82264p2487e8271l081
$$ 37001 139319 119152 241479 583 -12657 60342 -2062 47179 229443 156956 -58271 -61352
30495f1352H5140K6153m268e6818C21965l1270p9088q1215a11855j99369g1259
$$ -61352 85140 111293 107025 -56818 321965 290695 211607 130392 -111855 -311224 -71259
30483B2258f4710B6837K1355N7203C8653O6143b8976k9298j00111d7687D30650
$$ 22258 -64710 26837 48192 105395 38653 104796 -28976 -58274 -158385 -47687 430650
30471A07775a18729j44703A99718m3980b38411h8528C1354e4999c010j31279c372
$$ 107775 -118729 -263432 199718 155738 -238411 -88528 31354 -54999 -3010 -134289 -3372
30459A26727B2845J14691c714j2049J270A0406J16674a15560E18543A57277g1241
$$ 126727 22845 137536 -3714 -15763 -14493 10406 127080 -115560 518543 157277 -71241
30447F9097P5457l4818A436L4639g8982L4803C62273a15606j34475r0314D01480
$$ 69097 144554 109736 1436 36075 -78982 -44179 362273 -115606 -250081 -340395 401480
30435B39616B3128J11745a67183j7654C2145O8914A6860M5450a66755l776A48282
$$ 239616 23128 134873 -167183 -184837 32145 101059 16860 62310 -166755 -170531 148282
30423E318h8765C22728f4723A0658a80795B3249J20458c48727A89428O8757C4445
$$ 5318 -88765 322728 -64723 10658 -180795 23249 143707 -348727 189428 258185 34445
30411c33212f9641G0327a39695B65478d4600G1779J51340f0268k4863K1169k7890
$$ -333212 -69641 70327 -139695 265478 -44600 71779 223119 -60268 -85131 -63962 -91852
30400i1852A24601a10318D85K10510c8592m0464a6285A6190J51715b06188D25322
$$ -91852 124601 -110318 485 210995 -38592 -79056 -16285 16190 167905 -206188 425322
30388c12426L3160k5584g9667J647c5393I808a60630J7514a3210k97430A95406
$$ -312426 -279266 -304850 -79667 -78020 -35393 9808 -160630 -143116 -13210 -310640 195406
30376D9233b43574E374M7027b46098A31777e1512C1825J58935c0293B15022A06581
$$ 49233 -243574 5374 52401 -246098 131777 -51512 31825 190760 -30293 215022 106581
30364C6568b32310J12541j44995J5775J17606L1955d5953n5244A64769b92252
$$ 36568 -232310 -119769 -264764 -248989 -131383 -99428 -45953 -101197 164769 -292252
30353B15540J00717b15292O9593I3218j1731K72452A06249Q8541g7237E5142R9940
$$ 215540 316257 -215292 -145699 93218 81487 353939 106249 194790 -77237 55142 155082
30342A55082A6720i1097A9394D035a57773A02309f5648P311j14798k7942A34126
$$ 155082 16720 -91097 19394 4035 -157773 102309 -65648 -58337 -173135 -201077 134126
30330a53142a7354D2411c04706a31788j96994A44519l7033M0446f8678C68665
$$ -153142 -17354 42411 -304706 -131788 -328782 144519 107486 147932 -68678 368665
30319i0313b3864r787b379q8611b8772M931p7958r6382A00551d5804B48548G094
$$ -90313 -23864 -33651 -2379 -90990 -28772 -23841 -101799 -198181 100551 -45804 248548 7094
30306b21868C01702p4622b302A11941E0483M1949M2986F0910c03215H5376J79121
$$ -221868 301702 227080 -2302 111941 50483 92432 135418 60910 -303215 85376 264497
30295B64497a10446A78578q1887Q2406a61737A41325c1562N701A17094c775k62852
$$ 264497 -110446 178578 96691 179097 -161737 141325 -31562 -25861 117094 -3775 -266627
30284b66627f0247j00412a3057o5026o5183C5844J3350J38562c2733C7013A1615
$$ -266627 -60247 -160659 -13057 -78083 -143266 35844 49194 187756 -32733 37013 11615
30272B21756b0253B55600c03100A6086J15380L00641a07559D6740Q3083l5830
$$ 221756 -20253 255600 -303100 16086 131466 432107 -107559 46740 129823 93993
30262I3993g9105e937G1664j8503b5719r5309I2175L11147j99943J09249j39497
$$ 93993 -79105 -5937 71664 53161 -25719 -121028 92175 403322 203379 312628 173131
30251A73131J66034a17161q168C10771A51827a27042A27177E0188A6224K87065
$$ 173131 339165 -117161 -125329 310771 151827 -127042 127177 50188 16224 303289
30241C03289A49989d40455h6980a3106p7016l3695B01313c29227A04949Q3789
$$ 303289 149989 -440455 -86980 -13106 -90122 -123817 201313 -329227 104949 188738
30231A88738g1642E6788H563a18322r7369A83425c22191A79289a67342c4104B27164
$$ 188738 -71642 56788 8563 -118322 -215691 183425 -322191 179289 -167342 -34104 227164
30219b0146A48785p0565d6789A87617b44354K0338I8264a79365A32359F4430H029
$$ -20146 148785 78220 -46789 187617 -244354 -224016 98264 -179365 132359 64430 8029
30207c12164a5219A31181R6762a80794M6582k21617A16501L33249A42709e839
$$ -312164 -15219 131181 227943 -180794 -134212 -355829 116501 449750 142709 -5839
30196A73884G7280b75101N8658r4794H3411J71456G641K0357K17875a16433D39154
$$ 173884 77280 -275101 -216443 -311237 83411 254867 7641 27998 245873 -116433 439154
30184I8265J25335o8561J99131A4634b1974j45654a1577C9465Q5005b49675d4932
$$ 98265 223600 155039 354170 14634 -21974 -167628 -11577 39465 124470 -249675 -44932
30172A96488B258a87119i791r955q7251B98837b6294C43712G844d21308f2905
$$ 196488 2258 -187119 -9791 -19746 -106997 298837 -26294 343712 7844 -421308 -62905
30160d0502B802b05730h8426B69532a08110L0773b8510B44356d0217j74942A53159
$$ -40502 2802 -205730 -88426 269532 -108110 -77337 -28510 244356 -40217 -215159 153159
30148a51226A49586a81097A45896j5058C8083f5772k38825B15319A734b27906
$$ -151226 149586 -181097 145896 130838 38083 -65772 -304597 215319 1734 -227906
30137D2017g7835I4505c472m19371B33981r8881L26753A72481a35693C89342C26
$$ 42017 -77835 94505 -3472 -422843 233981 135100 461853 172481 -135693 389342 326
30125a79600C20942b92304C20814A43395h1594p2037A74373E8862a49822B0688
$$ -179600 320942 -292304 320814 143395 -81594 -153631 174373 58862 -149822 20688
30114I8266a04761B07819c9086B04468g4030j97734D6480J45750g8893I6922c263
$$ 98266 -104761 207819 -39086 204468 -74030 -271764 46480 192230 -78893 96922 -3263
30102B21754a50266O8215j0826H4470M8727O4051J34763b03201B6905O292b8399
$$ 221754 -150266 -82051 -92877 84470 133197 197248 332011 -203201 26905 33197 -28399
30090a63506R589E40712D9287a36331C07764a09430c8593l280j50250B07646g3131
$$ -163506 -153917 540712 49287 -136331 307764 -109430 -38593 -41873 -192123 207646 -73131
30078B1152a5225j31177A05670C6795K5908a93736I1899A9585K70134A09896E4404
$$ 21152 -15225 -146402 105670 36795 62703 -193736 91899 19585 289719 109896 54404
30066b4010A91517b37755C3437j4407J6077i9387n135A66022l380n2135a17458
$$ -24010 191517 -237755 33437 19030 35107 -99387 -104522 166022 162642 110507 -117458
30054a27551b3046l9607k35146g8463p265j57172c5370n5700j89941l1533J47204
$$ -127551 -23046 -62653 -297799 -78463 -85728 -242900 -35370 -91070 -281011 -312544 -165340
30043a65340L195c5469E9548N8068J90153a57039G516J92215a10309j28628A12701
$$ -165340 -162145 -35469 59548 117616 307769 -157039 7516 199731 -110309 -238937 112701
30031A55950b17742i1415G2942R8857J03809a16747j03760G9137m878f0245q1772
$$ 155950 -217742 -91415 72942 171799 275608 -116747 -220507 79137 74259 -60245 -142017
30020a42017m1022j37727b2012B82902A14841O9108M4338a81760C56672a00955
$$ -142017 -183039 -320766 -22012 282902 114841 183949 228287 -181760 356672 -100955
30009A40617a32178H0894J81313H007P9029D1928a54250r8903h4495L1590p7341
$$ 140617 -132178 80894 262207 8007 87036 41928 -154250 -253153 -84495 -52905 -130246
29998a30246C02277j09888J9157A8122L63198a99019C1939K16310A1590c7934
$$ -130246 302277 192389 211546 18122 381320 -199019 31939 248249 11590 -37934
29987h4763F8492J46255p8526K62011D2751M62074A42911c7173C83077B4724f4715
$$ -84763 68492 214747 136221 398232 42751 504825 142911 -37173 383077 24724 -64715
29975a0012B4368O1277J0733B5688K17820b5033A10383d3597D5858J34849a46144
$$ -10012 24368 85645 96378 25688 243508 -25033 110383 -43597 45858 180707 -146144
29963b1546o0787F046a67687f4062C33974A21478b3162p8948b0708B58764O2020
$$ -21546 -82333 6046 -167687 -64062 333974 121478 -23162 -102110 -20708 258764 320784
29952C20784C5988J84830J80931h3992D1436K62649q4519N3515I3103M1293A8490
$$ 320784 35988 220818 401749 -83992 41436 304085 219566 273081 93103 134396 18490
29940a17155e4910C8737a33327A39168n8705c47543a9235j95246A53561M7021
$$ -117155 -54910 38737 -133327 139168 80463 -347543 -19235 -214481 153561 200582
29930B00582d9159j65933A42369J38473H2283M45326F8516a67578B90909j38891
$$ 200582 -49159 -215092 142369 280842 82283 527609 68516 -167578 290909 152018
29920A52018a6675A1230a13530A73040J02494a32965e2892B04861B9545L43821
$$ 152018 -16675 11230 -113530 173040 275534 -132965 -52892 204861 29545 373366
29910C73366j25117a6511B28301g4591j30I0644b48106J03982o6922B27157l5379
$$ 373366 248249 -16511 228301 -74591 -74721 90644 -248106 -144124 -211046 227157 191778
29899A91778A0869M6559A9274j621a96051n2236A11846a19899D487f2942j668
$$ 191778 10869 57428 19274 17653 -196051 -248287 111846 -119899 4487 -62942 -64610
29888f4610C00917F3306L87582e8817K6745B07405m4968m897k7703m4042c12452
$$ -64610 300917 63306 450888 -58817 -32072 207405 162437 157540 129837 85795 -312452
29876c4129A96434B6410R7527g714j50868c75n7021A85859N8709C0136Q0553c2446
$$ -34129 196434 26410 123937 -7714 -158582 -375 -57396 185859 244568 30136 110689 -32446
29863d30437A43085J37780C4289L2898b18420f4023n5145B2924J62617G9631j4546
$$ -430437 143085 280865 34289 67187 -218420 -64023 -119168 22924 185541 79631 65085
29852F5085i6499K6164q4171d836B24778f0810J3973r1681B80718b54573A26607
$$ 65085 -96499 -70335 -154506 -4836 224778 -60810 -46837 -138518 280718 -254573 126607
29840d94373C1378M2066a07157c0162E3917B4633b19974R6542b6218q751B47568
$$ -494373 31378 73444 -107157 -30162 53917 24633 -219974 -123432 -26218 -34969 247568
29828A98773B0159h5708m544B26054p6274J40957r1907n7225E9153N2068C8592
$$ 198773 20159 -85708 -90252 226054 149780 290737 198830 141605 59153 111221 38592
29816B52550j20032D9533b54043A26695a36699G9236f9859j03485P0677m0534
$$ 252550 132518 49533 -254043 126695 -136699 79236 -69859 -173344 -102667 -143201
29806a43201A7480a82341E9821K38672j01015b5337A50499b85197n820D50666
$$ -143201 17480 -182341 59821 298493 197478 -25337 150499 -285197 -291017 450666
29795i6112A48146J69141C437a70751C07782C9199J08760b24358e8464C20089
$$ -96112 148146 317287 3437 -170751 307782 39199 147959 -224358 -58464 320089
29784B40958C075K42903j0895d5937j89577K7240c4322G1818J39014b14604e5791
$$ 240958 3075 245978 235083 -45937 -235514 -208274 -34322 71818 210832 -214604 -55791
29772A90225H7035M3976M3540d4657j59436d7989K3065I1768a02514A09732c03559
$$ 190225 87035 131011 174551 -44657 -204093 -47989 -24924 91768 -102514 109732 -303559
29760c6593q37j09078B57890b51467J18117C03852D8611M3774J4896R6292N1120
$$ -36593 -37430 -146508 257890 -251467 -133350 303852 48611 92385 107281 203573 254693
29749B54693N3105G0039h0440A69105M9876D8904j1560P7387O2822D0407Q0348
$$ 254693 307798 70039 -80440 169105 218981 48904 37344 114731 177553 40407 120755
29738A20755D6052O7663H269K31183b39363A43196R9566g818A86266q3051m4714
$$ 120755 46052 113715 8269 239452 -239363 143196 242762 -7818 186266 103215 58501
29727E8501c1532A68698l9692c4543A70491K157D1842g2841C50774j59830c82636
$$ 58501 -31532 168698 129006 -34543 170491 172648 41842 -72841 350774 190944 -382636
29715i2093B18280c0759C0638a9990D9680k2687M9262K34650A03138k0850d2660
$$ -92093 218280 -30759 30638 -19990 49680 26993 76255 310905 103138 82288 -42660
29703i0586o5196L6417m6177E7105a31962A11819R7906q0577g2892m4311A10485
$$ -90586 -155782 -119365 -165542 57105 -131962 111819 209725 129148 -72892 -117203 110485
29691i670A73365M5139b1346m0396j392a316C33383a78173A59816a5155A9743
$$ -9670 173365 218504 -21346 -61742 -63134 -1316 333383 -178173 159816 -15155 19743
29679b17930C7842F242a14318D8302f5371A43054e2535B51713d6589A26831a95876
$$ -217930 37842 6242 -114318 48302 -65371 143054 -52535 251713 -46589 126831 -195876
29667A51309a2122B57858H1211J7176k5064a49743B27355a29802k02301Q4469
$$ 151309 -12122 257858 81211 98387 73323 -149743 227355 -129802 -332103 -247634
29657b47634E8182b66071C466b4542C94563h0861j27880N7391j54941b2504j03306
$$ -247634 58182 -266071 3466 -24542 394563 -80861 -208741 -151350 -306291 -22504 -125810
29646a25810I6178J01417a86110C42952i6487A5933h1767j4995p649d175I9833
$$ -125810 96178 197595 -186110 342952 -96487 15933 -81767 -96762 -104411 -4175 99833
29634E8231N5062b3933q0722G5041a77138p2968E9366L25029A2514b75457J27423
$$ 58231 113293 -23933 -104655 75041 -177138 -250106 59366 384395 12514 -275457 -148034
29623a48034k4005E5997K18575B3837c85762B4433J25550d9664p77A22311a38960
$$ -148034 -172039 55997 274572 23837 -385762 24433 149983 -49664 -50441 122311 -138960
29611c11136A00067b57785J00963n396A52377b41502b8165A62902O9762c69324
$$ -311136 100067 -257785 -156822 -162218 152377 -241502 -28165 162902 232664 -369324
29600G5605j7471a33520E6502B1520b45407A01978J75091L8113a6382P761B62557
$$ 75605 58134 -133520 56502 21520 -245407 101978 277069 315182 -16382 -8621 262557
29588D6783R1837J64901A42271D6111N5127C0290b9607A91360a32116B11220d1954
$$ 46783 138620 303521 142271 46111 101238 30290 -29607 191360 -132116 211220 -41954
29576c4770B24376B8301i190k6420k6457G7687c92k7183j53954K6243G354K2133
$$ -34770 224376 28301 -9190 -35610 -62067 77687 -392 -27575 -181529 -155286 7354 29487
29564B9487b89367A71679E4656i2139G7803f3671A96324L08122c0098C77643a35176
$$ 29487 -289367 171679 54656 -92139 77803 -63671 196324 504446 -30098 377643 -135176
29552a67493A08682c0698j3343I1459a12917L9466B18938b01827E1853K88280
$$ -167493 108682 -30698 -44041 91459 -112917 -73451 218938 -201827 51853 340133
29542C40133C2657M39281b01117k00207i4426G9023a10084l5544B06994F0468
$$ 340133 32657 471938 -201117 -401324 -94426 79023 -110084 -145628 206994 60468
29531A40650J02637g5245A12294K3744c6763D05380j44998G6425c831A6125d266
$$ 140650 243287 -75245 112294 136038 -36763 405380 260382 76425 -3831 16125 -4266
29519A94216k49a96813A22176A8165a01410j48512D3995a23436i203H6050J08150
$$ 194216 193967 -196813 122176 18165 -101410 -249922 43995 -123436 -9203 86050 194200
29508A94200r145d4406j5165B86814a20394B1212b42510A14415D7747J0750c02504
$$ 194200 185055 -44406 -59571 286814 -120394 21212 -242510 114415 47747 58497 -302504
29496A26719m4364R1368J2144Q1082C8195a91337C37421g299k99161d5953B06516
$$ 126719 82355 173723 185867 266949 38195 -191337 337421 -7299 -306460 -45953 206516
29484A72318h017B30473b28841N5043Q6661j20051B4589K84716G8934K49032A21043
$$ 172318 -8017 230473 -228841 -173798 -87137 -207188 24589 309305 78934 327966 121043
29472A58302a11997j11904B55326b5205A11076i8128c7297C39137D8376R782a16350
$$ 158302 -111997 -223901 255326 -25205 111076 -98128 -37297 339137 48376 58158 -116350
29460C15934d22796B744K02534b14370O5368f9649k59548a87q4834B6453l316
$$ 315934 -422796 2744 205278 -214370 -149002 -69649 -329197 -187 -85021 26453 23137
29449B3137J30127a187A36984a86489I0823K09678Q1708e6162A21216O1980d62663
$$ 23137 153264 -1187 136984 -186489 90823 300501 382209 -56162 121216 183196 -462663
29437E7912g2453I0154a82458E3413Q9543a6881A61444b44084A01275K14457j33248
$$ 57912 -72453 90154 -182458 53413 142956 -16881 161444 -244084 101275 315732 182484
29426A82484p6166G468K4201d9123C15566i6676n0447B21528h9077L4460A01427
$$ 182484 106318 7468 31669 -49123 315566 -96676 -147123 221528 -89077 -54617 101427
29414B3373L76309G8023N5774J2451k7888a4683B02848b93721h8432r0725F7981
$$ 23373 399682 78023 133797 146248 118360 -14683 202848 -293721 -88432 -179157 67981
29402c9578a4294m5381A05389d4679k4761B93146a95122A00682C265J39396K29226
$$ -39578 -14294 -59675 105389 -44679 -69440 293146 -195122 100682 3265 142661 371887
29391C71887A11501a03928A9162g5742A91089a96025l00518B80085C9215A977
$$ 371887 111501 -103928 19162 -75742 191089 -196025 -496543 280085 39215 1977
29380a3105H5988j7633E486a82378q7230B21602I8445a42944I0450g6043m4730
$$ -13105 85988 68355 5486 -182378 -269608 221602 98445 -142944 90450 -76043 -120773
29369a20773q0216R6711C25806E9000J7982b83149C19910a74142A67053F3430
$$ -120773 -200989 -104278 325806 59000 76982 -283149 319910 -174142 167053 63430
29358a02853H7234J23815a02389C8284b54069A46652B9585N6481a15947l073j18898
$$ -102853 87234 211049 -102389 38284 -254069 146652 29585 86066 -115947 -119020 -237918
29347b37918A64686B6223K67336i4169j08690f4614j48015A76894b4066m59858
$$ -237918 164686 26223 293559 -94169 -202859 -64614 -212629 176894 -24066 -483924
29337d83924A45254G1623P3733B3638l833J41070B5959c69298f3544A97837g7430
$$ -483924 145254 71623 145356 23638 19805 160875 25959 -369298 -63544 197837 -77430
29325B3971R5878R8024a52519j8554b3291p3261a790A20785c00822g8321A35260
$$ 23971 119849 217873 -152519 -171073 -23291 -96552 -1790 120785 -300822 -78321 135260
29313a80847c2646A84246a95067A15427d3940B1606K80950c72293J65701C13916
$$ -180847 -32646 184246 -195067 115427 -43940 21606 302556 -372293 -206592 313916
29302c4650I7856d9566A83459b01700B3194R7373L27543b30867A01116C6983L2989
$$ -34650 97856 -49566 183459 -201700 23194 120567 448110 -230867 101116 36983 69972
29291F9972K32022j5405E844K80563a22223F4370a3383j79050N9355A41270n115
$$ 69972 301994 286589 5844 286407 -122223 64370 -13383 -192433 -133078 141270 136155
29280A36155k4660B6487b4702A37725F3141b0247A23323a14827K359J5298j0431
$$ 136155 111495 26487 -24702 137725 63141 -20247 123323 -114827 -112468 -97170 -107601
29269a07601p3905m3781B23701d029D63173A92833m8272P7000a37950N9872D07779
$$ -107601 -181506 -225287 223701 -4029 463173 192833 144561 221561 -137950 -78078 407779
29257a26944C2432b44058B0025K05970I8274K01602b5908P686p8222B39794a15629
$$ -126944 32432 -244058 20025 225995 98274 299876 -25908 -18222 -96444 239794 -115629
29245a73924A3862a29016j39021B84416J7922r5816i2168Q734K9736k17613C62344
$$ -173924 13862 -129016 -268037 284416 302338 206522 -92168 -83434 -53698 -271311 362344
29233i9901A05532a11651O486B56901E5483J50693q665H384L4311j8293a4121
$$ -99901 105532 -111651 -105165 256901 55483 206176 197511 8384 42695 24402 -14121
29221a97414E0671b61820B84720H3557f703B42010A20926k6188a05867j98485
$$ -197414 50671 -261820 284720 83557 -6703 242010 120926 94738 -105867 -304352
29211c04352h7300m2470B177a79797d0060A35675b00915A47854j9351M49971A91942
$$ -304352 -87300 -129770 2177 -179797 -40060 135675 -200915 147854 128503 578474 191942
29199A07745a34986A58923D1182K42361j16518a53351r0034K6000b7721r2657
$$ 107745 -134986 158923 41182 283543 167025 -153351 -243385 -217385 -27721 -120378
29189a20378A28346E3929N8948b22620H821P8977l0916h8656F8191L37927i3920
$$ -120378 128346 53929 112877 -222620 8821 87798 56882 -88656 68191 406118 -93920
29177E9299O1679L4214G5458c0986l35443J19329d0258B32365I050c09961a09235
$$ 59299 120978 155192 75458 -30986 -366429 -247100 -40258 232365 9050 -309961 -109235
29165i7548A01368C1909L6681e2775C33239g5875E5843a22954D08849g8391C37483
$$ -97548 101368 31909 68590 -52775 333239 -75875 55843 -122954 408849 -78391 337483
29153B8956i7639j6861A21533A0570b14064B09476B6197c23443F1980a2274F4777
$$ 28956 -97639 -114500 121533 10570 -214064 209476 26197 -323443 61980 -12274 64777
29141C47229b49378H3059a58552A69441O8382a70211C06917o3936E4037N2928
$$ 347229 -249378 83059 -158552 169441 237823 -170211 306917 242981 54037 106965
29131A06965J88407H1444K49861b1616B55438b88161A46207G0869K82957H4966
$$ 106965 295372 81444 331305 -21616 255438 -288161 146207 70869 353826 84966
29120A72277O4230a23926j33850r1423C9531f1458A78979b13567D70428C3504
$$ 172277 236507 -123926 -257776 -349199 39531 -61458 178979 -213567 470428 33504
29109C50788a62999H5641K12973Q4668b37686A21146a23275D0295M3355O318J2448
$$ 350788 -162999 85641 298614 383282 -237686 121146 -123275 40295 83650 89968 102416
29098A02416L52486f6194L1967A4598g3864A21819a55072A20606c1600C25167
$$ 102416 454902 -66194 -34227 14598 -73864 121819 -155072 120606 -31600 325167
29087A63834J17976j33689c51850d4060I9005b39267g7632k06901B68642a44379
$$ 163834 281810 148121 -351850 -44060 99005 -239267 -77632 -284533 268642 -144379
29076A69243a25214M87j09618r7616a1913B30027H4761a63146E37074b17396k0861
$$ 169243 -125214 -124727 -234345 -331961 -11913 230027 84761 -163146 537074 -217396 -238257
29065b38257M9762q2652D9496b79347A7076L64164G9032a86244A67119Q2519c659
$$ -238257 -188495 -271147 49496 -279347 17076 381240 79032 -186244 167119 249638 -3659
29053A21239a26426A80896a08616A00016K99136n8354B8568a21848A02838a64786
$$ 121239 -126426 180896 -108616 100016 399152 340798 28568 -121848 102838 -164786
29042b44986H4646J63660h9805j478I0414J37446m0112E2980i7122B69873A00536
$$ -244986 84646 248306 -89805 -91283 90414 227860 187748 52980 -97122 269873 100536
29030f7812d517r9122E4202J07933a727j92871B05575h9366A30088O3455e8323
$$ -67812 -4517 -103639 54202 162135 -1727 -194598 205575 -89366 130088 193543 -58323
29018B99379b55188M7226O5412B55286L3407c42559B38241a5090j40521B75218
$$ 299379 -255188 -207962 -142550 255286 288693 -342559 238241 -15090 -155611 275218
29007b64974A91529M0678P9898j26382G8341h912A23057c40426a11574A17368
$$ -264974 191529 232207 312105 185723 78341 -8912 123057 -340426 -111574 117368
28996a98558o8635g639B74632h7068F37K989J6144C2K51466a90423B70324D8983
$$ -198558 -267193 -7639 274632 -87068 637 3626 19770 32 251498 -190423 270324 48983
28983b41942B1548a77870C28724p477H2405b60q6577A54580K70670F5227c8648
$$ -241942 21548 -177870 328724 321247 82405 -260 -86837 154580 425250 65227 -38648
28971b99125j8080B5801a47593A82151P8124A20198N3937K10589A24659f4875
$$ -299125 -317205 25801 -147593 182151 260275 120198 174135 384724 124659 -64875
28960c5364j60643B32242b45901d8950j58213g636A11310n3186d404H2148R2982
$$ -35364 -196007 232242 -245901 -48950 -207163 -7636 111310 58124 -4404 82148 175130
28949A75130a6962k02001C12179H2755d4951C46427j68997p5324N3248d9971j16407
$$ 175130 -16962 -218963 312179 82755 -44951 346427 177430 102106 155354 -49971 -166378
28938a66378C3071c1911A278h5182c1481k28595C1411a1340o668A94285k3235
$$ -166378 33071 -31911 1278 -85182 -31481 -260076 31411 -11340 -18008 194285 171050
28927A71050i7131D2767a01875b332j16075C42621e8020B13959a41091I6556f720
$$ 171050 -97131 42767 -101875 -2332 -118407 342621 -58020 213959 -141091 96556 -6720
28915a30276B03657Q8953A11550b25200B58838q8664N1675a26535N0377c302B56701
$$ -130276 203657 292610 111550 -225200 258838 170174 221849 -126535 -76158 -3302 256701
28903A49662C9283a64609J3322l9597A86695q7487L2750a56083B30722A09545
$$ 149662 39283 -164609 -151287 -190884 186695 99208 131958 -156083 230722 109545
28892A25812M5298m5114J38830a78628B03406a78661L0641j7473O4899A98674
$$ 125812 171110 125996 264826 -178628 203406 -178661 -148020 -165493 -100594 198674
28881a31216c4737A71801L3002J07302A00875d20688B69504a79361j06818A79516
$$ -131216 -34737 171801 204803 312105 100875 -420688 269504 -179361 -286179 179516
28870A91062j2806J93727c1852H4123l1732N3018J79339A23257J3190H97J87942
$$ 191062 178256 371983 -31852 84123 52391 105409 284748 123257 136447 897 188839
28859A88839b76198E2058R7845f0765B83098b6644E0896a1542A17183p258J42472
$$ 188839 -276198 52058 149903 -60765 283098 -26644 50896 -11542 117183 109925 252397
28848B52397I3637b39686a8134A51136f2390p7134C70466A18862a04136j79478
$$ 252397 93637 -239686 -18134 151136 -62390 -139524 370466 118862 -104136 -283614
28838b83614B7677n813L8778r991J7005a30888M7958q3275E303a06370C33764
$$ -283614 27677 21864 60642 50651 67656 -130888 -82930 -166205 5303 -106370 333764
28826a34063B31607b10285A69637k8922M3475h6460r679q9529A84542K47866G4310
$$ -134063 231607 -210285 169637 140715 184190 -86460 -96139 -185668 184542 432408 74310
28814a50188e1739i096A78146f497C9222A1715K25912c7931A15837k5088q340
$$ -150188 -51739 -9096 178146 -6497 39222 11715 237627 -37931 115837 90749 82409
28803H2409K68871a78299c946H3954J2888Q1909a63952q541B10877r1112a38612
$$ 82409 351280 -178299 -3946 83954 96842 178751 -163952 -172493 210877 119765 -138612
28791A02100D9332d4420k06303C7962j118J38823l1347A150h2929k1969A43759
$$ 102100 49332 -44420 -250723 37962 36844 175667 144320 1150 -82929 -104898 143759
28779A24789d66958h969I0595J79829I5811f5321A56027i7185q7601c5793n5900
$$ 124789 -466958 -8969 90595 270424 95811 -65321 156027 -97185 -184786 -35793 -91693
28768i1693k76943B04151a08975j52463E9395J01002a5625k52780E4851b71960
$$ -91693 -368636 204151 -108975 -261438 59395 160397 -15625 -268405 54851 -271960
28757a6015B46060a2177A47040n9637J0887h3271B912J19950A1513M3735q617
$$ -16015 246060 -12177 147040 87403 98290 -83271 2912 122862 11513 55248 46631
28746D6631J0079K11622p5784l4690p8894k0635a34774A34957C7887J1713R047
$$ 46631 56710 268332 192548 157858 78964 58329 -134774 134957 37887 49600 58647
28735E8647j7734J81711e0382B02564A00402C8094r758a49264c2356p7048K9964
$$ 58647 40913 222624 -50382 202564 100402 38094 28336 -149264 -32356 -109404 -79440
28724g9440A66242n2122b4018G9954i8300B0529f9030A55686a81363B1912a83946
$$ -79440 166242 114120 -24018 79954 -98300 20529 -69030 155686 -181363 21912 -183946
28712A4665c9244l36970J34592C60649D7328A8685L64292A46532a8460j59614
$$ 14665 -39244 -376214 -241622 360649 47328 18685 382977 146532 -18460 -178074
28702a78074P8959I4901N6916m6110l271b95533a38568j44683A90880F484a75406
$$ -178074 -99115 94901 151817 105707 102436 -295533 -138568 -283251 190880 6484 -175406
28690I8728J8741J10780n5104b3340l9053B5519K29283a86370A76573J86029c6724
$$ 98728 117469 228249 173145 -23340 -62393 25519 254802 -186370 176573 362602 -36724
28678b30485F5991b14361g5860D3786J87040A1556K70011a08434C1074N8180J57807
$$ -230485 65991 -214361 -75860 43786 230826 11556 281567 -108434 31074 89254 247061
28667B47061g1257I8650J8500e4958A52959R9961b72954b0662C1337M00808j64648
$$ 247061 -71257 98650 117150 -54958 152959 252920 -272954 -20662 31337 432145 267497
28656B67497j1423D1018a74277P3095M9629j00947j54889a06161B4289e7538o392
$$ 267497 256074 41018 -174277 -101182 -51553 -152500 -307389 -106161 24289 -57538 -63930
28645f3930E694M8428R9040D9900J11952J4059h4303j04001e5005C10668A0177
$$ -63930 5694 54122 153162 49900 161852 175911 -84303 -188304 -55005 310668 10177
28633c4212l6872k637C7594R086J24815N8938r7479L02839b52141f8838A9760
$$ -34212 -71084 -73721 37594 46680 171495 230433 132954 435793 -252141 -68838 19760
28621g6728D7783J2634K38634d7983A09680J09194c5484j05155b0806j71424i83
$$ -76728 47783 60417 299051 -47983 109680 218874 -35484 -140639 -20806 -192230 -983
28609A35899M06594A86301M1343F4266Q6811a34919B29827C6096L2337Q7712c1686
$$ 135899 542493 186301 227644 64266 151077 -134919 229827 36096 68433 156145 -31686
28597b19722c723B63104b65509A29564e5342B31120Q7813I2929b89438A67824
$$ -219722 -3723 263104 -265509 129564 -55342 231120 318933 92929 -289438 167824
28586H3886J13875E9011L1572c5006j6261j32865G3139Q8441f1811B63278D268
$$ 83886 197761 59011 90583 -35006 -51267 -184132 73139 161580 -61811 263278 4268
28574e4256j68161B00487b4401A8914P6873J45355K08414a39350D5538g7920r309
$$ -54256 -222417 200487 -24401 18914 95787 241142 449556 -139350 45538 -77920 -87229
28563h7229I6366f5417C77314A03463J53445b52270A6027a77766A49763a09498
$$ -87229 96366 -65417 377314 103463 256908 -252270 16027 -177766 149763 -109498
28552A44590J02538f785F7726M0554a18841d1044C25597l6135e8200B07761a97043
$$ 144590 247128 -6785 67726 108280 -118841 -41044 325597 289462 -58200 207761 -197043
28540A57716f0906A20486J92221a50788J3567A40020a57568d6203B90753A593
$$ 157716 -60906 120486 312707 -150788 -137221 140020 -157568 -46203 290753 1593
28529B6611a04125a5231m7286j3148l0234B7318b62631B8272K2766O0364J5279
$$ 26611 -104125 -15231 -62517 -75665 -105899 27318 -262631 28272 51038 111402 126681
28518A26681a44909H5648D2156J55421q1351L83400i7009K2963D78181c31554
$$ 126681 -144909 85648 42156 197577 116226 499626 -97009 -74046 478181 -331554
28507A337K10117J0726m6746J61302j35840g4703B49484D8799O9357R1175b37546
$$ 1337 211454 222180 175434 336736 200896 -74703 249484 48799 118156 209331 -237546
28495d8444J9005p9109I2432a58438k27586A28766C4600J25226C4718a35356A0741
$$ -48444 -29439 -108548 92432 -158438 -386024 128766 34600 159826 34718 -135356 10741
28483C98535A2592J10231K01488f3474m2606A86564b49865Q4762H7419b71639
$$ 398535 12592 122823 324311 -63474 -106080 186564 -249865 -165103 87419 -271639
28472f1829k54370a13988A4242K68867b59116J23385K9373C71844A77488l9872
$$ -61829 -316199 -113988 14242 283109 -259116 -135731 -106358 371844 177488 137616
28462A37616a59965c1148B53475A2264a26179A83337d0525C14878a53478E6591
$$ 137616 -159965 -31148 253475 12264 -126179 183337 -40525 314878 -153478 56591
28451f2073j42666I8589k4405d2205B75652n2902l3417I2422l1074K15302q510
$$ -62073 -204739 98589 74184 -42205 275652 222750 189333 92422 61348 276650 268140
28440B68140r6707K777J78304b25362o977A42033l7563b8834p3581C36099b6555
$$ 268140 171433 174210 352514 -225362 -232339 142033 104470 -28834 -102415 336099 -26555
28428a27B45142a57335L6733d3447n463B01104E1663j7494h2127a1710k0265r8130
$$ -127 245142 -157335 -120602 -43447 -48910 201104 51663 34169 -82127 -11710 -31975 -130105
28416a30105E7738O4867a70358A3022J74830a7686A59598p6039a90775l6428F6509
$$ -130105 57738 122605 -170358 13022 187852 -17686 159598 83559 -190775 -227203 66509
28404E341L83273c5705j27425A90719J07344d1157B31017a36525C5486J75461
$$ 5341 388614 -35705 -163130 190719 298063 -41157 231017 -136525 35486 210947
28394B10947o8867N2608J1135H7671l7946J34309a96371j77046b5225C286M4489
$$ 210947 142080 194688 205823 87671 49725 184034 -196371 -373417 -25225 3286 47775
28383D7775b48075a7988j24944C8797J4543K9604b85542A7116J78237l5179f4350
$$ 47775 -248075 -17988 -142932 38797 53340 82944 -285542 17116 195353 160174 -64350
28371E4551L8376O5144R0936a79334B14205n4378a39018A1131J09766b8237j81159
$$ 54551 92927 158071 249007 -179334 214205 159827 -139018 11131 120897 -28237 -209396
28360b09396F2585K1493a44335n3662B41455G7666P472L00697a09646J0984B89659
$$ -209396 62585 84078 -144335 -197997 241455 77666 85138 385835 -109646 -98662 289659
28348I080B207e8972O066G8511d3027j48863I7044f9168B637K52836a21516j50256
$$ 9080 2207 -58972 -52906 78511 -43027 -191890 97044 -69168 2637 255473 -121516 -271772
28336b71772o8196J25317a6024A20559n3761g4752A88688b87137a34111B2178
$$ -271772 -339968 -214651 -16024 120559 66798 -74752 188688 -287137 -134111 22178
28325D8630r873a42090B61979c15945i4825B43559a61995Q0058j30409F5251b39934
$$ 48630 38757 -142090 261979 -315945 -94825 243559 -161995 -81937 -212346 65251 -239934
28313C6259f5012A24374J71884d2334k99616a3731A81130E8879a07014B74907
$$ 36259 -65012 124374 296258 -42334 -341950 -13731 181130 58879 -107014 274907
28302C22564m7280b0554B51144C1719b36968h011G9855N9641b45943C19580j25424
$$ 322564 275284 -20554 251144 31719 -236968 -8011 79855 139496 -245943 319580 194156
28291A94156i7630q5505e2649A34237k5900b86848e5548a5495G5321j244J95210
$$ 194156 -97630 -183135 -52649 134237 108337 -286848 -55548 -15495 75321 74077 269287
28280B69287e6990A11595b6491l18073A1599L5545a17781B9001J46109O9865N9192
$$ 269287 -56990 111595 -26491 -344564 11599 47144 -117781 29001 175110 244975 304167
28269C04167j5315G06e7537C90013J10235a12111I7591A759d2361B33984a75675
$$ 304167 288852 706 -57537 390013 500248 -112111 97591 1759 -42361 233984 -175675
28257F20979c8383B38516n6791i8080j21002A50749D4503J852a41281C71713b11663
$$ 620979 -38383 238516 181725 -98080 -219082 150749 44503 46355 -141281 371713 -211663
28245e5285p640C20943A0787E360J26523n6648b86021A04672J08469m6978d55599
$$ -55285 -62925 320943 10787 5360 131883 75235 -286021 104672 213141 166163 -455599
28233B76817L3073c18427A06139J58371F1750c81838B85974I6211h1871A98873
$$ 276817 309890 -318427 106139 264510 61750 -381838 285974 96211 -81871 198873
28222A14166K41330b29899i7051A38952b4148G4204i8043B41380F0636h1943E31015
$$ 114166 355496 -229899 -97051 138952 -24148 74204 -98043 241380 60636 -81943 531015
28210A94559q6139a33961q2764B70471j25228m1584C3766K6841L3217C9040K79974
$$ 194559 108420 -133961 -216725 270471 145243 103659 33766 60607 93824 39040 319014
28199C19014C0417J8132b5896E663L5863J36186J2961k2551J37910E5306L09173
$$ 319014 30417 48549 -25896 5663 41526 177712 190673 168122 306032 55306 364479
28188C64479i2195l7176A56624l1211l3893g836C17371j13308f1091B63824D3784
$$ 364479 -92195 -129371 156624 125413 91520 -7836 317371 204063 -61091 263824 43784
28176A69724i5086A2652J60253B3895e5414k68578e876B6557p006J34851E6248
$$ 169724 -95086 12652 172905 23895 -55414 -323992 -5876 26557 19551 154402 56248
28164A12870c4349A41181F1993e1211m2384K4113j8619k8266H8381L270h5957
$$ 112870 -34349 141181 61993 -51211 -93595 -69482 -88101 -116367 88381 91651 -85957
28152A766O0203L16279G2460J18492b62076O1409R2232F963K31842c03464J45896
$$ 1766 61969 378248 72460 190952 -262076 -200667 -108435 6963 238805 -303464 -157568
28141a57568D6183J16784I586a04204A13490J12288q2425b02065g2341B54073
$$ -157568 46183 162967 9586 -104204 113490 225778 143353 -202065 -72341 254073
28130D4499J47888E1490g0410I3928J10150C2677R4603J72867A07782k9722a00501
$$ 44499 192387 51490 -70410 93928 204078 32677 127280 300147 107782 78060 -100501
28118C3587P0806d201C20722g6014F1035J47936C3613K14933n849a80221K5029
$$ 33587 104393 -4201 320722 -76014 61035 208971 33613 248546 242697 -180221 -155192
28107a55192E5363b77291f3711j5542A02754K5516a44425O0673A5960J46709b3007
$$ -155192 55363 -277291 -63711 -79253 102754 128270 -144425 -83752 15960 162669 -23007
28095C8462c57211B74313J718G0697A5813P3969b66099A30386l1898c3588J2819
$$ 38462 -357211 274313 276031 70697 15813 89782 -266099 130386 98488 -33588 -20769
28084b0769B83135h3353b4291A20832J12675l8465a17066l265A35559k4625C0845
$$ -20769 283135 -83353 -24291 120832 233507 195042 -117066 -120331 135559 110934 30845
28072a51110a6571j40225A77775d0612E9662a01496F3061J40003d6610A38555
$$ -151110 -16571 -156796 177775 -40612 59662 -101496 63061 203064 -46610 138555
28061B7263J19027J294F7079a7109D1491i1061A04727L4791A7043a17104k11582
$$ 27263 146290 147584 67079 -17109 41491 -91061 104727 139518 17043 -117104 -328686
28050c28686R5647g6498G5527g1822B61558B7084O3558l7132K12862j9936F2068
$$ -328686 -233039 -76498 75527 -71822 261558 27084 90642 53510 266372 246436 62068
28038a08408A0772J83291a20755J711J7371c186B47261a04091a1013A36578j6764
$$ -108408 10772 194063 -120755 -119044 -101673 -3186 247261 -104091 -11013 136578 119814
28027A19814a63778B8433b75296R0305A65241M0025h9240C48667f3169l5732A24869
$$ 119814 -163778 28433 -275296 -184991 165241 205266 -89240 348667 -63169 -98901 124869
28015B47810a4407j04070B81960l5847j22598o0690A7468b01955D661g9896A27760
$$ 247810 -14407 -118477 281960 246113 123515 62825 17468 -201955 4661 -79896 127760
28003C92380a12885A57975h9883j17665R0047E6223c35298C80999f3347q5269
$$ 392380 -112885 157975 -89883 -207548 -117501 56223 -335298 380999 -63347 -148616
27993a48616c2339B8260L33102c55509H7941d20282A62052m5869j6554b09187
$$ -148616 -32339 28260 361362 -355509 87941 -420282 162052 116183 99629 -209187
27982A90098a01120a2811k3041E17999i51A78145a67995f2602B77828b3050a525
$$ 190098 -101120 -12811 -35852 517999 -951 178145 -167995 -62602 277828 -23050 -1525
27970a86992A10911p987c5982A96735i7047B25273H4039a48125B72930E8486A53
$$ -186992 110911 102924 -35982 196735 -97047 225273 84039 -148125 272930 58486 153
27958B6723d3678p8736c0656l86943H8641O1385C0985o156J63509p0156K47444
$$ 26723 -43678 -122414 -30656 -417599 88641 150026 30985 24829 188338 118182 365626
27947C65626a07578D21370g0436B42965a38893A67499b01550c6665A59957I847
$$ 365626 -107578 421370 -70436 242965 -138893 167499 -201550 -36665 159957 9847
27936a7319l5620o8964D8885g5771k7889A6623d30721a0853p9684j39190A70791
$$ -17319 -52939 -121903 48885 -75771 -103660 16623 -430721 -10853 -90537 -229727 170791
27924b48817F6228a03733l9866C50555B8791d6745j88497A21532K0706B1910J32590
$$ -248817 66228 -103733 -143599 350555 28791 -46745 -235242 121532 142238 21910 154500
27913A54500h9865C74058j05790a43003A24496h4469A41765K43193C5146a48896
$$ 154500 -89865 374058 268268 -143003 124496 -84469 141765 384958 35146 -148896
27902B12506a48217A50343c4380A90517J37280J4008c49478B05408I657N6600
$$ 212506 -148217 150343 -34380 190517 327797 341805 -349478 205408 9657 66257
27892F6257i7126b0142A00679J61287E6777A4135N3775a9867A8959K79395J74093
$$ 66257 -97126 -20142 100679 261966 56777 14135 67910 -19867 18959 298354 472447
27881D72447a63744e8855A42835M3389a58870K8961F6119J26811g9498D20874
$$ 472447 -163744 -58855 142835 186224 -158870 -129909 66119 192930 -79498 420874
27870A10655a20992o4719C50624b6128B62170o1580B9850a57372l6418B17360
$$ 110655 -120992 -185711 350624 -26128 262170 200590 29850 -157372 -193790 217360
27859A49081Q8332L7364G8798a48899A63716f8289q6416K3297C6911a0436A30466
$$ 149081 237413 274777 78798 -148899 163716 -68289 -154705 -131408 36911 -10436 130466
27847B5581a15480A48760a25062i96B34222A04314J30129C0763b83889a28945
$$ 25581 -115480 148760 -125062 -996 234222 104314 234443 30763 -283889 -128945
27836F4673L5408a56761d2249D88460C3390b65607B4439f0638j64631F3872k4255
$$ 64673 100081 -156761 -42249 488460 33390 -265607 24439 -60638 -225269 63872 39617
27825C9617a56822d8808j4133b4903F6315A3977b20824E5610O5731a07142B4031
$$ 39617 -156822 -48808 -62941 -24903 66315 13977 -220824 55610 121341 -107142 24031
27813A80099b73058a15678A34663G334c01959A48576g2411B5395b6330q3520A20358
$$ 180099 -273058 -115678 134663 7334 -301959 148576 -72411 25395 -26330 -109850 120358
27801A70657J80658A38106a47929f2927j73059g0328A45803c2286k69885A10378
$$ 170657 351315 138106 -147929 -62927 -235986 -70328 145803 -32286 -302171 110378
27790F243P3132Q599A9268J63961L6823h4072B13490c3974A05283g8938A64009
$$ 6243 79375 87974 19268 183229 220052 -84072 213490 -33974 105283 -78938 164009
27778B24185J26932E6771J44624a01687D45805A16826b24524A69010a1433o417
$$ 224185 351117 56771 201395 -101687 445805 116826 -224524 169010 -11433 -17850
27768a7850B16831c91287A20269g831B84910K7588J6897A63888P6062a41702a5189
$$ -17850 216831 -391287 120269 -7831 284910 312498 329395 163888 239950 -141702 -15189
27756d7684q375E1784J29613a09515G6061d4297A22542a0582k50829a684A89914
$$ -47684 -56059 51784 181397 -109515 76061 -44297 122542 -10582 -261411 -1684 189914
27744G4500a22162A31715g4576A10868h3737I2920J9084a424r5685l05697G8196
$$ 74500 -122162 131715 -74576 110868 -83737 92920 112004 -1424 -97109 -402806 78196
27732a07145A2188J65012b75949h0483B31119j10910M9918J5720g192j65915A3587
$$ -107145 12188 177200 -275949 -80483 231119 120209 170127 185847 -7192 -173107 13587
27720B6317J10258e428F0220f9319j04565a7635D8327P4752b43853C09094r5745
$$ 26317 136575 -5428 60220 -69319 -173884 -17635 48327 123079 -243853 309094 213349
27709B13349A6801g0329L1783E3817O999B7235b35606A21501K1776a11068K4648
$$ 213349 16801 -70329 -38546 53817 60816 27235 -235606 121501 143277 -111068 -86420
27698h6420e895k1144A58159o3828Q0809N3027j965b06027G7678K11130H8652
$$ -86420 -5895 -27039 158159 94331 175140 228167 226202 -206027 77678 288808 88652
27686A83301b57209B2737R9288e9991D16082b3212n2282B28933E3194a586r5073
$$ 183301 -257209 22737 122025 -59991 416082 -23212 -75494 228933 53194 -1586 -96659
27675i6659k62932A375b96187a338A08140J10128h167D5938L6109a64605F4509
$$ -96659 -359591 1375 -296187 -1338 108140 218268 -8167 45938 82047 -164605 64509
27663A14926J36555f4995k61893A80579H3082N2247b05564C9142a0230k1435J0684
$$ 114926 251481 -64995 -326888 180579 83082 135329 -205564 39142 -10230 -31665 -20981
27652b0981k3443B62185d4570C1997a32905A16757r284J2502l9046b26711C9383
$$ -20981 -44424 262185 -44570 31997 -132905 116757 107473 119975 80929 -226711 39383
27640b589k20089f9844K6189E13948B54872o4786O3382b73664I2139M6674a19550
$$ -2589 -222678 -69844 -43655 513948 254872 190086 253468 -273664 92139 138813 -119550
27628A87124G9633a0654A76105b02408O9581K0817C21473A32629k0398b4844m8021
$$ 187124 79633 -10654 176105 -202408 -132827 -112010 321473 132629 112231 -24844 -72865
27617g2865a5141B33232b57602A16242J7925E6988N2388b4861q1533P098M6954
$$ -72865 -15141 233232 -257602 116242 134167 56988 109376 -24861 -106394 -99296 -52342
27606e2342F7988J68681E2475L06074r1383r3766k6032F8998e1393C0080a77597
$$ -52342 67988 236669 52475 358549 267166 173400 147368 68998 -51393 30080 -177597
27594C43488A27158c8142H5208a14247M9416B03176a74637a9966B18534b08666
$$ 343488 127158 -38142 85208 -114247 -64831 203176 -174637 -19966 218534 -208666
27583a7605B43831D6469c05181a18457c5130k48010A3972c47325J44271I9437
$$ -17605 243831 46469 -305181 -118457 -35130 -283140 13972 -347325 -203054 99437
27572B9789a68089Q2565C41520h5325K621p5884P6789c8064G9619K52383a23995
$$ 29789 -168089 -85524 341520 -85325 -82704 -158588 -81799 -38064 79619 332002 -123995
27560a24458b6157C79818A59155L10986B02764b3858k17060J14523B05224b15437
$$ -124458 -26157 379818 159155 470141 202764 -23858 -240918 -126395 205224 -215437
27549B90325G0290K9492m5952b71491A52359d9392C49170j34985a4303n1491j58784
$$ 290325 70290 99782 53830 -271491 152359 -49392 349170 214185 -14303 -65794 -224578
27538b24578A5809K61462f6690A1460J3446c8793A00769b23818Q2778C54392C4753
$$ -224578 15809 277271 -66690 11460 24906 -38793 100769 -223818 -141040 354392 34753
27526d04393B28043a13835E8382L8474m0113R0680c07694C2046f7262j9998E4150
$$ -404393 228043 -113835 58382 96856 56743 147423 -307694 32046 -67262 -87260 54150
27514b15024A65704L6297C1779c21145E4681f6384j9656A30631f6233j633B97474
$$ -215024 165704 202001 31779 -321145 54681 -66384 -86040 130631 -66233 -67866 297474
27502E6108K0649O5686g0120m3399A91173o4018P8647a05678d6206C2313J27117
$$ 56108 76757 142443 -70120 -113519 191173 127155 205802 -105678 -46206 32313 159430
27491A59430L19908C2073J69856o1458b06331C0382J5879K02344j1106c42015
$$ 159430 479338 32073 201929 140471 -206331 30382 46261 248605 237499 -342015
27480b7683A34327H384J62935G8155K18989p2336J7257a33012j28677F6075j243
$$ -27683 134327 8384 171319 78155 297144 224808 242065 -133012 -261689 66075 64832
27469F4832g1685K4922k34314c3064A43739l0103a1373p4316C65892B8887b44335
$$ 64832 -71685 -46763 -281077 -33064 143739 113636 -11373 -85689 365892 28887 -244335
27457c6828C483a83392f7790A36964b5390l2830G1548h3831n0733f842j48115
$$ -36828 3483 -183392 -67790 136964 -25390 -58220 71548 -83831 -134564 -6842 -154957
27446a54957B743J56862p5485F0b66783A4762a63109I8185Q9744H290J57585K61270
$$ -154957 2743 159605 84120 60 -266783 14762 -163109 98185 187929 8290 165875 427145
27434D27145b1448A07918N9575B2383K02300n760n960j01016K83499a09372b1812
$$ 427145 -21448 107918 167493 22383 224683 218923 212963 111947 395446 -109372 -21812
27422c65085B0372J2614J20787b1951F8743Q9330Q7443B4709h1596C73217A20108
$$ -365085 20372 32986 153773 -21951 68743 158073 245516 24709 -81596 373217 120108
27410b9429C39753b48259A39058G858J63585d804A26755K575b46793a9541j64886
$$ -29429 339753 -248259 139058 7858 171443 -4804 126755 129330 -246793 -19541 -184427
27399a84427B57699l2706n2476g1014n5131A86691A4883c01362B27994a43150
$$ -184427 257699 224993 172517 -71014 -126145 186691 14883 -301362 227994 -143150
27388E5506a06090F9921A3685K85359j24310g9194E1023L5673J45185b57514P1004
$$ 55506 -106090 69921 13685 299044 174734 -79194 51023 86696 231881 -257514 -186510
27377a86510M3450d1926j09891k14131a36979B81466a54541A37845g2370p514
$$ -186510 -143060 -41926 -151817 -365948 -136979 281466 -154541 137845 -72370 -79884
27367g9884k75212i4693A98825g6665j50806E7638B1382P1001J48829r8510L47152
$$ -79884 -355096 -94693 198825 -76665 -227471 57638 21382 92383 241212 142702 489854
27356D89854b76703I8653l1227q106J83364A03958c88439H4433C045M68476B18114
$$ 489854 -276703 98653 67426 59320 242684 103958 -388439 84433 3045 471521 218114
27344a99110B65780b4209k01687B38534P5310l2927a59528N0635E6495L31560
$$ -199110 265780 -24209 -225896 238534 313844 280917 -159528 -108893 56495 388055
27334C88055a37674A61923a1146A96650b51316A41511J91011b14115c1686C77535
$$ 388055 -137674 161923 -11146 196650 -251316 141511 332522 -214115 -31686 377535
27323b37854B80166r3525n4000n4118d9045D0313b3724D5433K26001j16404o3011
$$ -237854 280166 186641 132641 78523 -49045 40313 -23724 45433 271434 155030 92019
27312I2019B5964J58115b79477F657b26657A25655D0735b08475A4133r15a19428
$$ 92019 25964 184079 -279477 6657 -226657 125655 40735 -208475 14133 13218 -119428
27300b05705B42724h6108D0319K79529e1833A09676J29633J20553G5292H482J57701
$$ -205705 242724 -86108 40319 319848 -51833 109676 239309 359862 75292 8482 166183
27289A66183D7820J15920c096j99743b9762A15076K35159j03003M238c9512B13019
$$ 166183 47820 163740 -3096 -202839 -29762 115076 350235 247232 251470 -39512 213019
27277B44335f9016k5771A56066D2678j2741P5737d5791A1828J38208E006e9712
$$ 244335 -69016 -94787 156066 42678 29937 105674 -45791 11828 150036 5006 -59712
27265D7970J09640a95197C11096E0002j7435a46703o0902e6287A46754G1825J08288
$$ 47970 157610 -195197 311096 50002 32567 -146703 -207605 -56287 146754 71825 180113
27254A80113b98154B09780a13347B7465a9929I1318K53560c73807B78372e2836
$$ 180113 -298154 209780 -113347 27465 -19929 91318 344878 -373807 278372 -52836
27243b2757p3813R051A52056C975K3841P206a72353B72728C9688c13367B1420
$$ -22757 -96570 -87519 152056 3975 27816 35022 -172353 272728 39688 -313367 21420
27231I3322c08628C03162H1805B8707a44362C6008b13470b6771A74737b18112
$$ 93322 -308628 303162 81805 28707 -144362 36008 -213470 -26771 174737 -218112
27220C27168g4631j68568I8573J95055r2228p9659a12370j77726a3533A92606
$$ 327168 -74631 -243199 98573 293628 201400 121741 -112370 -290096 -13533 192606
27209F5715P3623D8676a61135A50081a25602E0086H717P2953b3588A73160R646
$$ 65715 139338 48676 -161135 150081 -125602 50086 8717 81670 -23588 173160 182806
27198A82806c66686b5724j67106A38756J69210d14934H3146b29713D67250d7299
$$ 182806 -366686 -25724 -192830 138756 307966 -414934 83146 -229713 467250 -47299
27187f1150H25P6470h9615j46494G008K33452M8769J7514b69921B42783a86607
$$ -61150 825 77295 -89615 -236109 7008 240460 289229 306743 -269921 242783 -186607
27175B62696r1686L3043b37112G9985K76641a7919j28028I8096a26628M9639J0876
$$ 262696 171010 204053 -237112 79985 356626 -17919 -145947 98096 -126628 -76989 -66113
27164f6113D2424j5533a52649J4599o2524f0606D5326b97762a06020k52345a16945
$$ -66113 42424 26891 -152649 -138050 -200574 -60606 45326 -297762 -106020 -358365 -116945
27152a33532D43084a05803L3582b8208B47302I1537K02498A0035a25797e1380
$$ -133532 443084 -105803 -72221 -28208 247302 91537 294035 10035 -125797 -51380
27141g1495A08273C5232a9357M810C98310a73637B22983o4722b9979q9535j05296
$$ -71495 108273 35232 -19357 -14547 398310 -173637 222983 158261 -29979 -119514 -224810
27130b24810H344O6848J7324K46336a930G5859a58512c8888j36767M8240A27015
$$ -224810 8344 75192 92516 338852 -1930 75859 -158512 -38888 -175655 -127415 127015
27118c62692B34900d6268a7705H6772l2031K77892m3471r6327c7910A26230h0351
$$ -362692 234900 -46268 -17705 86772 54741 332633 289162 192835 -37910 126230 -80351
27106C53213A21483a06037c2522H0318d5352D42339a7212B1907K33208H1636P4007
$$ 353213 121483 -106037 -32522 80318 -45352 442339 -17212 21907 255115 81636 155643
27095A55643L34409i9138H4072L128b47529J08481b4144A37469C2675J01169F1656
$$ 155643 490052 -99138 84072 87200 -247529 -139048 -24144 137469 32675 133844 61656
27083g087m01658N9024a06388l310F1572L7749J21375J57270A2789J03444l004
$$ -7087 -408745 -349721 -106388 -109698 61572 99321 220696 377966 12789 116233 113229
27072A13229i1075n5012c1106D8688N60250B10161c6379C31825p6220A26074i7879
$$ 113229 -91075 -146087 -31106 48688 608938 210161 -36379 331825 255605 126074 -97879
27060e2821A76582J03233a13051B80820c8309A47741d6836l28912B59723J8902
$$ -52821 176582 279815 -113051 280820 -38309 147741 -46836 -375748 259723 278625
27050B78625a51405B51646h8068A03665f9587A80546c8899A42181m2416B0483
$$ 278625 -151405 251646 -88068 103665 -69587 180546 -38899 142181 99765 20483
27039i6439A0982b34774i4959a437A27367F0645a11426D88464A1275N6750a36928
$$ -96439 10982 -234774 -94959 -1437 127367 60645 -111426 488464 11275 68025 -136928
27027g7607A97936a38182c0897E9706J26149F9720J6424J90830Q8562a02234A72463
$$ -77607 197936 -138182 -30897 59706 185855 69720 86144 276974 365536 -102234 172463
27015B3549A1291a39808E5661P8094q592J16338F4416B1338N4844a9805B29268
$$ 23549 11291 -139808 55661 133755 125163 241501 64416 21338 76182 -19805 229268
27003e8471E7465a1286k71996H311d6109B17373b59090c0953j20840A2827L7634
$$ -58471 57465 -11286 -283282 8311 -46109 217373 -259090 -30953 -151793 12827 50461
26992E0461K21327c38169i0108J5277A22157a21231r403D9041J8001K13259a35128
$$ 50461 271788 -338169 -90108 -74831 122157 -121231 -130634 49041 67042 280301 -135128
26980F2361B272N9098g6212A28843f6606A04888N0144D5431j3077b52036F9518
$$ 62361 2272 61370 -76212 128843 -66606 104888 155032 45431 32354 -252036 69518
26968e4736J4912n3157F0629K9757R5491M9109K2543j02994f6523b7990I1585
$$ -54736 -39824 -92981 60629 90386 185877 234986 257529 154535 -66523 -27990 91585
26956h5547F7998b15752Q7006C5130c03739a01960A58218J46458a09530L9180
$$ -85547 67998 -215752 -128746 35130 -303739 -101960 158218 304676 -109530 -70350
26946g0350A45145m4652a39258E0922J80745J52749A14467j2184c0571o8459A28327
$$ -70350 145145 100493 -139258 50922 231667 384416 114467 102283 -30571 -99030 128327
26934A37611b05901C85603j51546j13718d3734j8223A26427a72328G8280j4844
$$ 137611 -205901 385603 234057 120339 -43734 -61957 126427 -172328 78280 63436
26924F3436a68060b6070F3230J73534K2269c2472A23268e1205D1033J731a35613
$$ 63436 -168060 -26070 63230 236764 259033 -32472 123268 -51205 41033 42764 -135613
26912A12358l8285O4508b55636C8437o321A2845J47277D8001Q275g2325C595i726
$$ 112358 74073 138581 -255636 38437 32116 12845 160122 48001 56276 -72325 3595 -9726
26899a2209n4978H0922J36001b14178F532J02146d4990l6898q2996C7586b27479
$$ -12209 -67187 80922 216923 -214178 6532 108678 -44990 -81888 -164884 37586 -227479
26887B6609K03166b56352C778N918J83033a84858P82C76028A9141K49482d1526
$$ 26609 229775 -256352 3778 9696 192729 -184858 -184076 376028 19141 268623 -41526
26875D55025c4842p3800R38B616b12626A96215D6925J05614a55978B93461a18372
$$ 455025 -34842 -108642 -107704 2616 -212626 196215 46925 152539 -155978 293461 -118372
26863a7131A66452e9777A24906E2960J86700A08993b1498B56401j07554R2205
$$ -17131 166452 -59777 124906 52960 239660 108993 -21498 256401 148847 241052
26853B41052H8424q276k1647J39539a36898N2532H3105N1014d2279a033A14531
$$ 241052 88424 80148 58501 198040 -136898 -84366 83105 134119 -42279 -1033 114531
26841d6625D8097O2397b44694A46020c3062J5652k02046B46082e7007H7771A3743
$$ -46625 48097 110494 -244694 146020 -33062 -17410 -219456 246082 -57007 87771 13743
26829A17447D2288K09192A1662g2338G3949L0819E1412A1335i0948j80715F1034
$$ 117447 42288 251480 11662 -72338 73949 104768 51412 11335 -90948 -271663 61034
26817a28537k31125D40756A87434b13480c3012o364B34091j01324P6412j1533
$$ -128537 -359662 440756 187434 -213480 -33012 -39376 234091 132767 209179 197646
26807A97646C2709f3087B9622K12162b22056E6330c1409C0689J51634a21200B7967
$$ 197646 32709 -63087 29622 241784 -222056 56330 -31409 30689 182323 -121200 27967
26795c8024C18768A27644g6006A65578a08664B94615A30506a39839A43797K16887
$$ -38024 318768 127644 -76006 165578 -108664 294615 130506 -139839 143797 360684
26785C60684d08854A38783J08830I0504J2005J28322c7558A258a79603I933J18328
$$ 360684 -408854 138783 247613 90504 102509 230831 -37558 1258 -179603 9933 128261
26774A28261A8495K81656C5272a76593B3599M5293A7973K8243b4718k1849A15499
$$ 128261 18495 300151 35272 -176593 23599 68892 17973 46216 -24718 -46567 115499
26762B07650B5669J29676C6676a11684B15249D4819N4460b9380B50748g6599C9147
$$ 207650 25669 155345 36676 -111684 215249 44819 99279 -29380 250748 -76599 39147
26750D4347K93163F9309Q0627b1845B3695b48136i4094C2392J7667b00386B14041
$$ 44347 337510 69309 149936 -21845 23695 -248136 -94094 32392 50059 -200386 214041
26738A79992o843b9699m20668f2627G6012b39690B50083K7632J42012a52778A07768
$$ 179992 173149 -29699 -450367 -62627 76012 -239690 250083 277715 419727 -152778 107768
26726A03665N5708R0416j20008J59789e219j76022B505O0523B2949b50843e5277
$$ 103665 159373 249789 129781 289570 -5219 -181241 2505 63028 22949 -250843 -55277
26714c7369A19612m5618h7856J4928I8642b24751R5724M770C05256a44190g1126
$$ -37369 119612 73994 -87856 -72928 98642 -224751 -129027 -124257 305256 -144190 -71126
26702D73343a99030R3597j83742a4158C57008D4106b97782B53817G5471k9764
$$ 473343 -199030 -105433 -289175 -14158 357008 44106 -297782 253817 75471 45707
26692D5707A3311b79755O7451h0505a5659A69625E0802P7659l4062J01191J8789
$$ 45707 13311 -279755 -212304 -80505 -15659 169625 50802 128461 94399 195590 214379
26681B14379c5822B47544j12466l1925b32455o9538B55057j13263i5689B15032
$$ 214379 -35822 247544 135078 103153 -232455 -301993 255057 141794 -95689 215032
26670f2635H2801c20370J49151b2043k3370C86823h0690A09798a57853C70118
$$ -62635 82801 -320370 -171219 -22043 -45413 386823 -80690 109798 -157853 370118
26659d5235a0663j07165I65a48330e3228l1719c1581j23856A71130a60259D0513
$$ -45235 -10663 -117828 965 -148330 -53228 -84947 -31581 -155437 171130 -160259 40513
26647D734b01910e6915J0896C7096P3653L4620g2676p0284l4980A03446K3593
$$ 4734 -201910 -56915 -46019 37096 110749 145369 -72676 -142960 -177940 103446 127039
26636A27039L8899b2146j34710k4762C608J5232i4080A28389b380B21064a84076
$$ 127039 165938 -22146 -156856 -181618 3608 18840 -94080 128389 -2380 221064 -184076
26624A06016M6416a56954H8079J33709C3269K78203a10166j28372d7576A13140
$$ 106016 152432 -156954 88079 221788 33269 311472 -110166 -238538 -47576 113140
26613C20758a41360p8340c4490o7535o2023j00448k386a5772B4597J49823L3779
$$ 320758 -141360 -219700 -34490 -102025 -164048 -264496 -266882 -15772 24597 174420 208199
26602B08199e7166o8625C10934A24756b11411k19439f6821A62230a01872j86205
$$ 208199 -57166 -125791 310934 124756 -211411 -430850 -66821 162230 -101872 -288077
26592b88077A17780b11449Q308C29018a08057o3604D517J59112G6006M05251d7799
$$ -288077 117780 -211449 -203141 329018 -108057 -171661 4517 163629 76006 481257 -47799
26580B85099A26413A4367a82882r257A68948J4596E6796a43745b2695A09206C3848
$$ 285099 126413 14367 -182882 -192139 168948 183544 56796 -143745 -22695 109206 33848
26568f8371r3381A33666g443A94152a93774m0603h8345H8687f679E30409g5580
$$ -68371 -161752 133666 -7443 194152 -193774 -234377 -88345 88687 -6679 530409 -75580
26556f1136C65033a74588A49156n0632e0461B87515a15051j7464B07219H9531
$$ -61136 365033 -174588 149156 98524 -50461 287515 -115051 -132515 207219 89531
26545b37536B38110n5223a93666J4721A37376b488I6383b05886B64790J09774
$$ -237536 238110 182887 -193666 -178945 137376 -2488 96383 -205886 264790 374564
26535C74564c7402F6345D584c9163E1965J84397o7610a27424C16375j5481A49266
$$ 374564 -37402 66345 4584 -39163 51965 236362 168752 -127424 316375 300894 149266
26523a9380j02314B28635D9200L60913a50602I0092j3916N6178d6858j02845B05670
$$ -19380 -121694 228635 49200 410113 -150602 90092 76176 132354 -46858 -149703 205670
26511a8987C78747i3413l8868b5851D8591L5129a87457A10097B8949a89223A29540
$$ -18987 378747 -93413 -132281 -25851 48591 83720 -187457 110097 28949 -189223 129540
26499A83590J7470h3933l1335A36769k1202r106d1360l08805B34389a68325e5750
$$ 183590 201060 -83933 -115268 136769 115567 106461 -41360 -350165 234389 -168325 -55750
26487A80782d6430B42557c00131M3747A0495a68674F8332k9065f4477k53348B74656
$$ 180782 -46430 242557 -300131 -256384 10495 -168674 68332 39267 -64477 -317825 274656
26475g4092H3049f2444m9467j44078A46456K8410k9464a62611l1567e091k82265
$$ -74092 83049 -62444 -111911 -255989 146456 174866 145402 -162611 -194178 -5091 -287356
26464b87356A54416i3494C671i5825P707D5977a43510H6406g0932A10274R4633
$$ -287356 154416 -93494 3671 -95825 -88118 45977 -143510 86406 -70932 110274 204907
26453B04907a21519A20872a78034f1071B10051n9233A9036a26101A01190k3906
$$ 204907 -121519 120872 -178034 -61071 210051 150818 19036 -126101 101190 77284
26443G7284a04424D30655j65190b07205e2373j31590B06553a51175C69993F7845
$$ 77284 -104424 430655 265465 -207205 -52373 -183963 206553 -151175 369993 67845
26432A79153a6986B55757a97550k572A7300c952m4824n5641a722m2315n8383b2824
$$ 179153 -16986 255757 -197550 -200122 17300 -3952 -48776 -104417 -1722 -44037 -102420 -22824
26419d68D8526J201L51319b5894I0623K04383n464j02537j7448o1264e6748k81150
$$ -468 48526 49727 401046 -25894 90623 295006 289542 187005 169557 108293 -56748 -337898
26407c37898a52415A30807d8725j47788F8814c06329A41733B5809i8679p8123
$$ -337898 -152415 130807 -48725 -196513 68814 -306329 141733 25809 -98679 -176802
26397a76802F8073a63621l4690Q1939o3517O311d315C80319m8856C1639a84931
$$ -176802 68073 -163621 -198311 -116372 -179889 -173578 -4315 380319 331463 31639 -184931
26385B04261e6257j4982A67416b5013A2438b8982B07210r703F1262a88647C5577
$$ 204261 -56257 -71239 167416 -25013 12438 -28982 207210 197507 61262 -188647 35577
26373F6892J37498J58642I2462b06957A47028E8267J21352i5690B00123d1231
$$ 66892 204390 363032 92462 -206957 147028 58267 179619 -95690 200123 -41231
26362B43449E5468Q9335M3891a27259e7060k29494C5953b50807A71730b57554
$$ 243449 55468 144803 188694 -127259 -57060 -286554 35953 -250807 171730 -257554
26351b40641L1951H0084K10871F73i3729K366c9816A48671c36744A52081l8264
$$ -240641 -208690 80084 290955 673 -93729 -91363 -39816 148671 -336744 152081 113817
26340A13817a55576g3085k99942a00224A2710a40078C080K177g2664A86773M9247
$$ 113817 -155576 -73085 -373027 -100224 12710 -140078 3080 5257 -72664 186773 236020
26329B36020r4059B5916K21538b6252R986I85h5575K141k78818A58496j2186K11480
$$ 236020 141961 25916 247454 -26252 -16266 985 -85575 -83434 -362252 158496 146310 357790
26317C57790H7329a54695f7057j66145O7417H7982k1543c2445r4806c0338o1413
$$ 357790 87329 -154695 -67057 -233202 -165785 87982 66439 -32445 -127251 -30338 -91751
26306i1751j60911I8029a22330A13536J64536b09767A44525a53546C34260O6664
$$ -91751 -252662 98029 -122330 113536 278072 -209767 144525 -153546 334260 400924
26296D00924A3731K81460P3828j80876e6867l2587I8288R0985a82066J6196g1931
$$ 400924 13731 295191 369019 188143 -56867 -89454 98288 189273 -182066 -165870 -71931
26284a50131n140p8427P8093j38829I3805J36799n3655m5849L7209a17422M7869
$$ -150131 -155271 -233698 -155605 -294434 93805 230604 176949 131100 168309 -117422 -69553
26273f9553G1743J04786m7999a95354h3597A10137c0676j31701A48445h3767k3542
$$ -69553 71743 176529 128530 -195354 -83597 110137 -30676 -162377 148445 -83767 -107309
26262a07309B60104m7673H3157K03770a45746C20995j3033b7472A18729a64200
$$ -107309 260104 212431 83157 286927 -145746 320995 307962 -27472 118729 -164200
26251d35280b08072c3986p3960A913d7839A50503b86419G9509a84843A72104q1790
$$ -435280 -208072 -33986 -107946 1913 -47839 150503 -286419 79509 -184843 172104 90314
26240I0314R8331a87022O9017B82996b2048I1786h8989r6296I9662K92814b65323
$$ 90314 188645 -187022 -118005 282996 -22048 91786 -88989 -185285 99662 392476 -265323
26228A21424E7426a1630B03743M5179a89003B57555E6940a23963k21513a3124
$$ 121424 57426 -11630 203743 248922 -189003 257555 56940 -123963 -345476 -13124
26217i2594H0500a38498b0912r1559j04628A49642D3196J96898g435n661e071
$$ -92594 80500 -138498 -20912 -112471 -217099 149642 43196 240094 -7435 -13096 -5071
26205I6575K93d3604k67131d4937a0421C0759J10216a12986I6022C5236J9258
$$ 96575 96868 -43604 -310735 -44937 -10421 30759 140975 -112986 96022 35236 54494
26194E4494e3175j53175l1225A67535A1033J07947K07841j45091g5907C06747
$$ 54494 -53175 -206350 -237575 167535 11033 118980 326821 181730 -75907 306747
26183d8506A46802a05003l41815i0387A94273n0720a48648E7577K946K76713H7615
$$ -48506 146802 -105003 -446818 -90387 194273 143553 -148648 57577 60523 337236 87615
26171A64152i8897j93424d8900A83354a07883j41506G0736B5004P8392R9037p4112
$$ 164152 -98897 -292321 -48900 183354 -107883 -249389 70736 25004 103396 202433 128321
26160A28321m0761O6118a269k27783h6153G2410K35284A43806a70184C69681a46864
$$ 128321 87560 153678 -1269 -229052 -86153 72410 307694 143806 -170184 369681 -146864
26148C451K8333g409G5627L6233c0999B2016O1988P8919e6275I6054J35094b97254
$$ 3451 31784 -7409 75627 111860 -30999 22016 84004 162923 -56275 96054 231148 -297254
26135b84296h9140B47007I4638h3846l03540a42053A13320k2299l659K3864a7188
$$ -284296 -89140 247007 94638 -83846 -387386 -142053 113320 91021 87362 111226 -17188
26123i7968k22743a43226B3377a33231B29648q8289A9120N772J37292a02495r9776
$$ -97968 -320711 -143226 23377 -133231 229648 141359 19120 24892 162184 -102495 -202271
26112b02271c01E6463a37930C90938d36674a15386i125A54768b25189e5472A9357
$$ -202271 -301 56463 -137930 390938 -436674 -115386 -9125 154768 -225189 -55472 19357
26100F684a30637C3569L63940A91454K03915a40368A09905a99835i475D8592L2363
$$ 6684 -130637 33569 397509 191454 395369 -140368 109905 -199835 -9475 48592 80955
26089H0955h122E4867h7541G3068b32831b910H6042a66404C2955o534R0512a41546
$$ 80955 -8122 54867 -87541 73068 -232831 -2910 86042 -166404 32955 26421 116933 -141546
26076B58475m9251A6252a43847f8630C68084e3635H1629a00331G9163a52097g810
$$ 258475 209224 16252 -143847 -68630 368084 -53635 81629 -100331 79163 -152097 -7810
26064A3363f8757k00787I3184a12839C39164b47874F9670b5602B19013a75484
$$ 13363 -68757 -269544 93184 -112839 339164 -247874 69670 -25602 219013 -175484
26053I4221a04164J4188M4650j14610H8407b33496B1185a87509N2628A50273a78100
$$ 94221 -104164 -89976 -45326 -159936 88407 -233496 21185 -187509 -134881 150273 -178100
26041B13133C5249J14232a57231G4987a65680g3158B11918b23732I0109c7555
$$ 213133 35249 149481 -157231 74987 -165680 -73158 211918 -223732 90109 -37555
26030c19802A55564J8952m0994E3675K25132r7893q9398J3552K6598a55408N0797
$$ -319802 155564 174516 133522 53675 278807 180914 91516 105068 131666 -155408 -104611
26019a04611l6068m34G5445J18675b61299A53084A7673K59037b4457l4294A67149
$$ -104611 -140679 -141113 75445 194120 -261299 153084 17673 276710 -24457 -58751 167149
26007i3310D2757P8202j2756K16715D0031P9947k7073a59804K7674j47644C5661
$$ -93310 42757 120959 108203 324918 40031 119978 92905 -159804 -132130 -279774 35661
25995c31296g4417n1389N9214p2050D2398L22850r6974P2499A35000F0777P639
$$ -331296 -74417 -125806 -66592 -138642 42398 365248 268274 340773 135000 60777 68416
25984F8416b16087B29260c2114H6723a00169A61872a74185I0632a96442Q9049
$$ 68416 -216087 229260 -32114 86723 -100169 161872 -174185 90632 -196442 -107393
25974a07393A73276b99677i8716A16494K9395m3729b55617B33791H0967b51092
$$ -107393 173276 -299677 -98716 116494 145889 102160 -255617 233791 80967 -251092
25963A09182N4323b987j1542A99431h5175r7659j37443A77381a03960m8039A95574
$$ 109182 163505 -2987 -14529 199431 -85175 -182834 -320277 177381 -103960 -151999 195574
25951A35609a84086R0620b7902r5618A34873J06282m5457k9523c22047g2670F0374
$$ 135609 -184086 -93466 -27902 -123520 134873 241155 195698 166175 -322047 -72670 60374
25939a8083j57554B42285p7289K04247e3799A58971o3269J12424L70677i1608
$$ -18083 -175637 242285 164996 369243 -53799 158971 95702 208126 578803 -91608
25928G9236a84605A9866b0634B9095b66470J25484E25610E3698O7438c8475J5480
$$ 79236 -184605 19866 -20634 29095 -266470 -140986 525610 53698 121136 -38475 -22995
25917b2995j02240L8481c8252B32437c480j25986c4570j2039k349H3653k3349
$$ -22995 -125235 -86754 -38252 232437 -3480 -129466 -34570 -46609 -48958 83653 60304
25906F0304J0914G231K91101a70374B3023a4036C2769b09757f3023D93829C2487
$$ 60304 71218 7231 298332 -170374 23023 -14036 32769 -209757 -63023 493829 32487
25894D0317Q0187n3379f319n0813E4721h1021A4410b67369A01039b91046D7669
$$ 40317 120504 67125 -6319 -57132 54721 -81021 14410 -267369 101039 -291046 47669
25882a14017a5342A745J67574c5120D7555J32078o4357b5131C05615r4253j11
$$ -114017 -15342 1745 169319 -35120 47555 179633 115276 -25131 305615 211362 211251
25871B11251M1432O5945I4265j1644q254J81953c31489A83066J63022f7387C22733
$$ 211251 252683 318628 94265 82621 74367 256320 -331489 183066 346088 -67387 322733
25859a52550c2911D0174K3709P3791c11419c1849E2312J01837e5232G4054e7674
$$ -152550 -32911 40174 63883 137674 -311419 -31849 52312 154149 -55232 74054 -57674
25847I2324e9386J6098A94495j5097n2655f3941j07705B76534f9695r5951j10996
$$ 92324 -59386 -43288 194495 179398 126743 -63941 -171646 276534 -69695 -165646 -276642
25836b76642a37722C35895p4540c15254B84073D8909b2795j67742f4230k05541
$$ -276642 -137722 335895 261355 -315254 284073 48909 -22795 -190537 -64230 -269771
25826b69771F7262J26456b97461d1247k63350a47744A11886K34559i4831j32457
$$ -269771 67262 193718 -297461 -41247 -304597 -147744 111886 346445 -94831 -227288
25816b27288B03406H0219c2438F56724E7743g3430j6815L1844B28507q1912L74548
$$ -227288 203406 80219 -32438 656724 57743 -73430 -90245 -58401 228507 146595 521143
25805E21143A43965a07156B33487B5106a40452o3533Q8280J077r9737A8434K49773
$$ 521143 143965 -107156 233487 25106 -140452 -203985 -115705 -114628 -214365 18434 268207
25794B68207k5429G4146L8091b06862p6131a01949A12180K1785J44187j4574A03391
$$ 268207 242778 74146 112237 -206862 -282993 -101949 112180 133965 278152 263578 103391
25782H7575J25375J2089r0702b17427D4302a20394K9604B65450h7606j95561O3623
$$ 87575 212950 225039 134337 -217427 44302 -120394 -90790 265450 -87606 -283167 -219544
25771b19544N4521p3215J9057I8359P3483i5749A85294O2912b66001A68429a7145
$$ -219544 -165023 -238238 -219181 98359 171842 -95749 185294 248206 -266001 168429 -17145
25759i4901C91978a4320k13031C0409J61302j1565J6645p9335J0843a70543a0153
$$ -94901 391978 -14320 -227351 30409 191711 180146 196791 117456 128299 -170543 -10153
25747d8139k597A78331a24221I9808C5452a59621m937A87294H2424B5284b83234
$$ -48139 -50736 178331 -124221 99808 35452 -159621 -164558 187294 82424 25284 -283234
25735b47643N8435c2630A16336B4387l66J68837g3582c6687j11453F959a2800
$$ -247643 -189208 -32630 116336 24387 24021 192858 -73582 -36687 -148140 6959 -12800
25723G363a84309B34059b23741J3655I5693b3309C00607i2938D07094A2821b05324
$$ 7363 -184309 234059 -223741 -210086 95693 -23309 300607 -92938 407094 12821 -205324
25711C4683J15579b04699B83490r7485d68168A74062d562A9213i2761B06230C2948
$$ 34683 150262 -204699 283490 186005 -468168 174062 -4562 19213 -92761 206230 32948
25699a37322c1297k6936F1413a65303e0947E4952g7042A75460b79807A92125K08676
$$ -137322 -31297 -58233 61413 -165303 -50947 54952 -77042 175460 -279807 192125 400801
25688D00801d8229p8380A66862a77650B21465h9711o6535k05828A3297J6398J96299
$$ 400801 -48229 -126609 166862 -177650 221465 -89711 -156246 -362074 13297 29695 225994
25677B25994a4369p4624A5670j653J96733J94189j97060b21024B17530c203p1428
$$ 225994 -14369 -88993 15670 14017 210750 404939 207879 -221024 217530 -3203 -74631
25666g4631E3423L71568a27375B27785q0194e3875B42399a32592A27536a88693
$$ -74631 53423 424991 -127375 227785 147591 -53875 242399 -132592 127536 -188693
25655b6456A29118L21044c88893i8363B04799I0337f8481D1063b37862A48754
$$ -26456 129118 450162 -388893 -98363 204799 90337 -68481 41063 -237862 148754
25644d57340B00653F778e1847j69846D1827L09284B8926a75405q760N2983j1091
$$ -457340 200653 6778 -51847 -221693 41827 351111 28926 -175405 -184165 -131182 -142273
25633a42273E1381a49932e0143j82179i1864B99886A43968a40039j9475N9285
$$ -142273 51381 -149932 -50143 -232322 -91864 299886 143968 -140039 -159514 -100229
25623a00229B43757A00590a70672J1495c1488J0337l80963C07287n6613o8120
$$ -100229 243757 100590 -170672 -159177 -31488 -21151 -402114 307287 250674 182554
25613A82554D8086b82002h477j41065D7931a82943A31587a33896B05270C7173
$$ 182554 48086 -282002 -8477 -149542 47931 -182943 131587 -133896 205270 37173
25602A802J9632R7485a007B55165p9369B7871K68294A47407i9574l9914M8560
$$ 1802 21434 118919 -1007 255165 175796 27871 296165 147407 -99574 -139488 -90928
25591i0928j08156c9365B11173c25326R5046A03987k9850K34744H6083c37528
$$ -90928 -199084 -39365 211173 -325326 -230280 103987 74137 308881 86083 -337528
25580B4276b23648p3665a48132D6365J19187L9655i6942D1929i4739j69066c6738
$$ 24276 -223648 -297313 -148132 46365 165552 205207 -96942 41929 -94739 -263805 -36738
25568D6612a6695k3885C66054k6285j61887b56861G990J87119j2887a61375a4112
$$ 46612 -16695 -40580 366054 339769 177882 -256861 7990 195109 182222 -161375 -14112
25556C04030a61693a20F6131K45859a07553B30678a98245f9522j33978C497L15956
$$ 304030 -161693 -120 66131 311990 -107553 230678 -198245 -69522 -203500 3497 319453
25545C19453h540D8586b30106g0857A52053b26576M9460Q0h7396B79464a16365
$$ 319453 -8540 48586 -230106 -70857 152053 -226576 -177116 -177036 -87396 279464 -116365
25533E224a64841b3723J644k61135C40851H0963C8834O8286c04970a44648B5580
$$ 5224 -164841 -23723 -22079 -283214 340851 80963 38834 107120 -304970 -144648 25580
25521a3180j61287j17092f1172D5274L2436g295D9794B2743d7752B30570b25202
$$ -13180 -174467 -291559 -61172 45274 77710 -7295 49794 22743 -47752 230570 -225202
25509B48937A18270c06520A23997D2333J11852a99235C0785J05812N3853h6463
$$ 248937 118270 -306520 123997 42333 154185 -199235 30785 136597 190450 -86463
25498A70992F6557L99380b51305d1526B81278c45142g2958J5378A15439J64373
$$ 170992 66557 465937 -251305 -41526 281278 -345142 -72958 -57580 115439 279812
25488B79812c05501K2729A25698B3107g5448J5205B71117d8595k79438A40184
$$ 279812 -305501 -282772 125698 23107 -75448 -60243 271117 -48595 -328033 140184
25477a15480A17044j9732b64063B83259r8698a09043K1153K2705E45819a46945
$$ -115480 117044 97312 -264063 283259 184561 -109043 -87890 -65185 545819 -146945
25466a31613e1879B59966F1032a73989P9766A13003R4224G878K90989j24727K88889
$$ -131613 -51879 259966 61032 -173989 -94223 113003 207227 7878 298867 174140 463029
25455D63029a65323M8373o3473B96324J09245C1241e9787D928a23476G1149j6556
$$ 463029 -165323 -116950 -180423 296324 405569 31241 -59787 4928 -123476 71149 54593
25444E4593h4370H6445b20540N6701D6018o261A1576b16905A77980J7450f7368
$$ 54593 -84370 86445 -220540 -163839 46018 39757 11576 -216905 177980 195430 -67368
25432A83116d5994k8980A17022a4122m0291A17018a50579C4181a53929n21A09229
$$ 183116 -45994 -74974 117022 -14122 -54413 117018 -150579 34181 -153929 -154450 109229
25420B935A299f4257A29492a9506j03923G6804M5762b63004A40737B4120g2592
$$ 2935 1299 -64257 129492 -19506 -123429 76804 122566 -263004 140737 24120 -72592
25408A84112G1268k8318a62960d7175A77165e1840B22626b98589g8862H4005J63847
$$ 184112 71268 42950 -162960 -47175 177165 -51840 222626 -298589 -78862 84005 247852
25397B47852A00473c2799o6603I6910J65455a12740b7573A70084J32864I1314
$$ 247852 100473 -32799 -99402 96910 262365 -112740 -27573 170084 302948 91314
25386h861l04407R1024I2872d6368o6701j00225D36807j77935d4152a6587l41082
$$ -8861 -313268 -222244 92872 -46368 -113069 -213294 436807 258872 -44152 -16587 -357669
25375c57669E3555J24121e4972o7232j01015e6413a9176k50074j66315B08542
$$ -357669 53555 177676 -54972 -122204 -223219 -56413 -19176 -269250 -435565 208542
25364A01495D1541j264M4987J33617q9067a16348B34121e4827j39249E2083a69892
$$ 101495 41541 40277 85264 218881 129814 -116348 234121 -54827 -194076 52083 -169892
25352a68969D7461b10545O7086m71239B24046c98587C3450b7453j05572K0046
$$ -168969 47461 -210545 -143459 -614698 224046 -398587 33450 -27453 -133025 -112979
25342a12979I6007C4021a07623A11578E37a56131L6312B83941a9847j27564N5042
$$ -112979 96007 34021 -107623 111578 537 -156131 -119819 283941 -19847 -147411 -92369
25331i2369B10200B5887K17548k1802b58519J24636a95k09265D5367b33126n459
$$ -92369 210200 25887 243435 221633 -258519 -133883 -195 -209460 45367 -233126 -238585
25320b38585B60635b34382B24753q8190E2989R5617p2783c4963k86092A65019
$$ -238585 260635 -234382 224753 136563 52989 148606 75823 -34963 -321055 165019
25309g7255k40181h2247A4771a4279o2270K4897k38252A02512f0153C7121a00759
$$ -77255 -317436 -82247 14771 -14279 -76549 -51652 -289904 102512 -60153 37121 -100759
25297c18218a44001N5340D0752j0430a24982L27I0022i5252B41789f3145l79577
$$ -318218 -144001 -88661 40752 30322 -124982 -124655 90022 -95252 241789 -63145 -442722
25286d42722A16320k6235h5899p8886e9043j68444D5914a61422N7137j70067B60812
$$ -442722 116320 90085 -85899 -164785 -59043 -227487 45914 -161422 -104285 -274352 260812
25274F5737a90200B35349b1522r65k47533a09121A11590Q0724i3453l74123B01550
$$ 65737 -190200 235349 -21522 -22487 -270020 -109121 111590 192314 -93453 -467576 201550
25262b03909B4731a27381C07683A03844a01588p6651A30033a95114D3856b0445
$$ -203909 24731 -127381 307683 103844 -101588 -178239 130033 -195114 43856 -20445
25251a94196j7963A40801k1020a88612b0318j29231R054B47986Q3758A06862B5092
$$ -194196 -212159 140801 119781 -188612 -20318 -149549 -140495 247986 331744 106862 25092
25239b08337R9788A31718a10147M8657F3980e4688A68898e1249j91149B23391
$$ -208337 -108549 131718 -110147 -61490 63980 -54688 168898 -51249 -242398 223391
25228a27890B69503e049j01648A6346R4311b21582b7657m9527D0398M3692J33723
$$ -127890 269503 -5049 -106697 16346 110657 -221582 -27657 -77184 40398 84090 217813
25217B17813G2057e1816B81779p4082k656b54557A65117b39192F4337j4603D823
$$ 217813 72057 -51816 281779 207697 205041 -254557 165117 -239192 64337 49734 4823
25205a27349A14232a10055I813a48934A57216k2587a24375e7717A87808F0745
$$ -127349 114232 -110055 9813 -148934 157216 134629 -124375 -57717 187808 60745
25194B34134J67580e0541I5511A7478e551k63531B78604j32190d1127k87085A42146
$$ 234134 401714 -50541 95511 17478 -5551 -269082 278604 146414 -41127 -328212 142146
25182b2311A31408O7699B9272i515H1962i3957A8398a1058j56537A37304a01676
$$ -22311 131408 199107 29272 -9515 81962 -93957 18398 -11058 -167595 137304 -101676
25170e1185A89203D8075a06389A0077a1374B02223b25241C25402a97102e7499
$$ -51185 189203 48075 -106389 10077 -11374 202223 -225241 325402 -197102 -57499
25159b816D80145A44164b24699B73913A01028F790K80886c8456k0997m4064L6485
$$ -2816 480145 144164 -224699 273913 101028 6790 287676 -38456 -59453 -103517 -67032
25148f7032A88969H9644b27535H4352a52708B17797a95565K8762B7859r357d456
$$ -67032 188969 89644 -227535 84352 -152708 217797 -195565 -166803 27859 18502 -4456
25136E06695A40228a6068j42152B59720b59152A58475b5857I1986c33222D7857
$$ 506695 140228 -16068 -158220 259720 -259152 158475 -25857 91986 -333222 47857
25125a50659A14875J79606f6899D1637a1746k3644A34249h9547c6558A00961b8689
$$ -150659 114875 294481 -66899 41637 -11746 -35390 134249 -89547 -36558 100961 -28689
25113a1420k17746C0637c5246A63447c5674B27867b12768d6762k18252c8935J749
$$ -11420 -229166 30637 -35246 163447 -35674 227867 -212768 -46762 -265014 -38935 -37186
25102c7186j32778d8419A34653b52459j000D1369a10587M0968k30756J24434N728
$$ -37186 -169964 -48419 134653 -252459 -253459 41369 -110587 -69619 -300375 -175941 -170213
25091a70213B86812D6354Q0440N1717k4713c015G1593a23374j28366O6353G2753
$$ -170213 286812 46354 126794 178511 153798 -3015 71593 -123374 -251740 -185387 72753
25079b63735h6456B27005C5366L6768a17016k8124e2143l82659J31252B5115a83717
$$ -263735 -86456 227005 35366 72134 -117016 -145140 -52143 -434802 -303550 25115 -183717
25067a98779k3908A85395e5009B22466a84430A73238i0213B49396r1123A9911
$$ -198779 -222687 185395 -55009 222466 -184430 173238 -90213 249396 158273 19911
25056B19006G835i96n1279B33679D3479b38655B91688h9426n9899J5548k1426
$$ 219006 7835 -996 -52275 233679 43479 -238655 291688 -89426 -149325 -133777 -155203
25045a55203c695C6263G904M2531a75979b8296l61791B9005M00412C0805a00204
$$ -155203 -3695 36263 7904 50435 -175979 -28296 -390087 29005 429417 30805 -100204
25033i3039L062j58905C40031i5168j21552A79629a96606C71743A09452P4971
$$ -93039 -89977 -248882 340031 -95168 -216720 179629 -196606 371743 109452 184423
25023A84423a73604A54764a18144A15708i6214k48134A03045P7803h6230A28665
$$ 184423 -173604 154764 -118144 115708 -96214 -344348 103045 180848 -86230 128665
25012c48042J5938A65509b58736e3429k4860B9078K45672E4566g3386G4749B1917
$$ -348042 -332104 165509 -258736 -53429 -78289 29078 274750 54566 -73386 74749 21917
25000B63654i114j71489B79661j25325j6323G403b28197C3955c8636k14612A63524
$$ 263654 -9114 -180603 279661 154336 138013 7403 -228197 33955 -38636 -253248 163524
24988C6781a88904c9093A46419F534J54514O0964H5356L84675c3196A90003k7381
$$ 36781 -188904 -39093 146419 6534 161048 222012 85356 470031 -33196 190003 162622
24977A62622e6164k08191E80427G6483l6213e1337F2387a22560N8076H1973b78051
$$ 162622 -56164 -264355 580427 76483 40270 -51337 62387 -122560 -64484 81973 -278051
24965e5906k28049g6300H9322J0981c4234l20343a3308l3725A13004J15675i1482
$$ -55906 -283955 -76300 89322 100303 -34234 -354577 -13308 -47033 113004 228679 -91482
24953b07380G4983a33620L631D0339I701J77870N460l7129J32205b86730E0085
$$ -207380 74983 -133620 -129989 40339 9701 187571 193031 155902 288107 -286730 50085
24941h6134A44721a2997B25052I1983a71305A68741c54477a16752B5742b26159
$$ -86134 144721 -12997 225052 91983 -171305 168741 -354477 -116752 25742 -226159
24930A44903b24573A08209c6762A51323B3749b2008k91506A46007a22769k09550
$$ 144903 -224573 108209 -36762 151323 23749 -22008 -313514 146007 -122769 -332319
24920c32319A03433a48529B89466c0362j35698E1030N2112Q8203p0210b95334
$$ -332319 103433 -148529 289466 -30362 -166060 51030 103142 191345 121135 -295334
24909a95266G3050c1477r4997A43456a60457A91034c6783A03722a34925k396B7317
$$ -195266 73050 -31477 -126474 143456 -160457 191034 -36783 103722 -134925 -137321 27317
24897A66170a38516H8459P3744b74903F7421b91175G5301J29428q2156J5441f2320
$$ 166170 -138516 88459 162203 -274903 67421 -291175 75301 204729 122573 138014 -62320
24885A8780K1727O1371q844d66453a73987A68172c5486D6794b15033A6447a74472
$$ 18780 40507 101878 93034 -466453 -173987 168172 -35486 46794 -215033 16447 -174472
24873i8866B8092J54927c987k20966L9752d2793A85980M9843m372G4882g6675
$$ -98866 28092 183019 -3987 -224953 -185201 -42793 185980 235823 231451 74882 -76675
24861A21028C680d7861A08382k9935C8324a36414F6154L77046A13597k1832N6647
$$ 121028 3680 -47861 108382 78447 38324 -136414 66154 443200 113597 91765 148412
24850A48412b54130A6398c08817G6803K41709b22298R4696B23941I4761k68b97677
$$ 148412 -254130 16398 -308817 76803 318512 -222298 -127602 223941 94761 94493 -297677
24838G7290k0847L15234b17242B85503f2550K3621j27509H1823K4518d6106F383
$$ 77290 56443 371677 -217242 285503 -62550 -38929 -166438 81823 106341 -46106 6383
24826c9294l10834C4684O7583a11744B8718a25966A4800J3857K58912b17013J08360
$$ -39294 -350128 34684 102267 -111744 28718 -125966 14800 28657 287569 -217013 -108653
24815a08653B07461b87668A10942O8720m3675O1309g5235A45737a76597B05299
$$ -108653 207461 -287668 110942 179662 135987 197296 -75235 145737 -176597 205299
24804A81437q7726R7527e0973B7946J41629c4754H91a65656A38585f5571A43810
$$ 181437 93711 191238 -50973 27946 169575 -34754 891 -165656 138585 -65571 143810
24792A9494d85963b42854A13354Q9991A5589f0096p7184l451E7045O1501m0901
$$ 19494 -485963 -242854 113354 203345 15589 -60096 -137280 -140731 57045 118546 77645
24781G7645J20014K5278b14811J0606B13247J2725i1829j56626H81L53017f8155
$$ 77645 197659 222937 -214811 -204205 213247 225972 -91829 -248455 881 353898 -68155
24769a42973B96310a16748j43057a28993q3174P1169M137A59496B8815J08511
$$ -142973 296310 -116748 -259805 -128993 -212167 -140998 -136861 159496 28815 137326
24759A37326K2500m9575i3592G552b41250d1816A28149a26019D17487a64394n2123
$$ 137326 159826 110251 -93592 7552 -241250 -41816 128149 -126019 417487 -164394 -216517
24748b16517h7430b3586C96157a6090C9180d17013C2841i7537C27991b60828j55614
$$ -216517 -87430 -23586 396157 -16090 39180 -417013 32841 -97537 327991 -260828 -416442
24737d16442B16546g7776j09489A16606l3039N2174b04606N8677d9352j0621D1343
$$ -416442 216546 -77776 -187265 116606 83567 135741 -204606 -145929 -49352 -59973 41343
24725e3262F660a94171C57787A02991a64208D1516L49140A36322b04222d3984
$$ -53262 6660 -194171 357787 102991 -164208 41516 390656 136322 -204222 -43984
24714a0807j48188A36750f4444J2605k33644E0895k3247a03332c1494k48196a31850
$$ -10807 -158995 136750 -64444 -51839 -285483 50895 27648 -103332 -31494 -279690 -131850
24702B17077J61262b09046D1786K68514d88548K28804E6928M2967e4191j75484
$$ 217077 378339 -209046 41786 310300 -488548 -259744 56928 99895 -54191 -229675
24692b29675n2168g297E3452a91925L9546e238p2120G0321a0628B56610A04921
$$ -229675 -281843 -7297 53452 -191925 -152379 -5238 -77358 70321 -10628 256610 104921
24680g7521A84255k7582a81333A03123a74384a8535o9003A15119h5939m8172N6711
$$ -77521 184255 156673 -181333 103123 -174384 -18535 -87538 115119 -85939 -134111 -77400
24669g7400k340k8494j17688f8411B8026a39147p5529h6477d1997j45225c153
$$ -77400 -79740 -108234 -225922 -68411 28026 -139147 -214676 -86477 -41997 -187222 -3153
24657B50442A23391k7820O9358b45506B43663c0887j53470c7883D4364A340P3185
$$ 250442 123391 95571 164929 -245506 243663 -30887 -184357 -37883 44364 1340 74525
24646G4525a32558A41776F2733n387J38226b09679B90145b1580B6590J99818b0126
$$ 74525 -132558 141776 62733 57346 195572 -209679 290145 -21580 26590 226408 -20126
24634A17401m2756J05030a07664p5787A05259b35104h3856m5523f0349A96144
$$ 117401 74645 179675 -107664 -183451 105259 -235104 -83856 -129379 -60349 196144
24623B9313O5265N585D8744K24056D8901c04863B37897d31352a16273M5489j101
$$ 29313 94578 100163 48744 272800 48901 -304863 237897 -431352 -116273 -70784 -71885
24612g1885o9445K3044C43955E6271J75602c54320J54122b4704n9433A64299K1723
$$ -71885 -141330 -118286 343955 56271 231873 -354320 -200198 -24704 -84137 164299 186022
24601A86022b28926C8232a79172P8705H813J09386d00484a3013c245k79014A20847
$$ 186022 -228926 38232 -179172 -100467 8813 118199 -400484 -13013 -3245 -282259 120847
24589a37842A55091k7436J68051Q8742c77528A94419G8215B8110j006L23972A01825
$$ -137842 155091 127655 295706 384448 -377528 194419 78215 28110 27104 351076 101825
24577b2077A19946a75862B69730a82682G5902a80252B91677q7227a0847B1066
$$ -22077 119946 -175862 269730 -182682 75902 -180252 291677 204450 -10847 21066
24566d0915B03488b25803G6264e8650H5022L38061A39403a39358A56251a33352
$$ -40915 203488 -225803 76264 -58650 85022 423083 139403 -139358 156251 -133352
24555f6655m7919J0171A09223A9625J51666A9741J05814A5725M7301d28928D16115
$$ -66655 -114574 -104403 109223 19625 171291 19741 125555 15725 63026 -428928 416115
24543g5214B77127h6742j08161j64085A230a3868A71088H1575a46847f9813D2522
$$ -75214 277127 -86742 -194903 -358988 1230 -13868 171088 81575 -146847 -69813 42522
24531D1189d50806A13549a60678L5677A46299A5170O7459b1890G2902a0897A41786
$$ 41189 -450806 113549 -160678 -125001 146299 15170 82629 -21890 72902 -10897 141786
24519I1330M7381o4987L32597P1913B1018K94148a88532C72818a66040h2098A63572
$$ 91330 138711 73724 406321 478234 21018 315166 -188532 372818 -166040 -82098 163572
24507A7958E270a38499j09381q3330Q6656M6009k0311C58077D8884Q149a51411
$$ 17958 5270 -138499 -247880 -331210 -244554 -198545 -218856 358077 48884 57033 -151411
24495b50013K2099J9841C11074e2083q2937C88396a36632C15J71694J02460b89102
$$ -250013 -227914 -208073 311074 -52083 -135020 388396 -136632 315 172009 274469 -289102
24483e0661B17497N7154a64007L1101d6021A0923J9113J94897r4254J55481c29113
$$ -50661 217497 274651 -164007 -132906 -46021 10923 30036 224933 130679 286160 -329113
24471b49234c8965A3341a7370j29750o0840E0491J34158G9561J13699b88408a23781
$$ -249234 -38965 13341 -17370 -147120 -207960 50491 184649 79561 193260 -288408 -123781
24459h2038j6414b9321A04535J03366B4847d8302k208m3256A30549L0756J13641
$$ -82038 -98452 -29321 104535 207901 24847 -48302 -50510 -93766 130549 161305 274946
24448B74946a81943O4226L8252I5482N1646A4282e1701j16268I5706K72376A18403
$$ 274946 -181943 -117717 -79465 95482 147128 14282 -51701 -167969 95706 368082 118403
24436A2366b39005B6474J12753b4234m1562B08619b40523C0494g4628k14102q6748
$$ 12366 -239005 26474 139227 -24234 -65796 208619 -240523 30494 -74628 -288730 -375478
24425c75478A95497d6325m5069k06471D31942B5059J32382b4359q3955l05073
$$ -375478 195497 -46325 -91394 -297865 431942 25059 157441 -24359 -108314 -413387
24415d13387a59791b7915j15982q0453A96657b3285A8705J55611C1842c35235
$$ -413387 -159791 -27915 -143897 -224350 196657 -23285 18705 174316 31842 -335235
24404c98508B30526B2846g5288B78554b2553k26116d7994F1448J86554E1848a19791
$$ -398508 230526 22846 -75288 278554 -22553 -248669 -47994 61448 248002 51848 -119791
24392H3980e0132B5371R769O6829c141j82886l24708a34313C40767b23094A30470
$$ 83980 -50132 25371 35140 101969 -3141 -186027 -510735 -134313 340767 -223094 130470
24380A2996h406C1028a89631k7103g2176B87185b6729a0929A74403o1531L7855
$$ 12996 -8406 31028 -189631 -216734 -72176 287185 -26729 -10929 174403 112872 150727
24369A50727l201F1209b54102Q9426D4929N361K368P4645b51297A89686B4229
$$ 150727 147526 61209 -254102 -164676 44929 50290 52658 127303 -251297 189686 24229
24357b28908A19379a1330A89149m4842a78571B06234E1855J2746O8249Q6627O6840
$$ -228908 119379 -11330 189149 144307 -178571 206234 51855 64601 132850 219477 286317
24346B86317A10392c14396Q4037A39863H469J61606K02420c44464h7112L2052
$$ 286317 110392 -314396 -230359 139863 8469 170075 372495 -344464 -87112 -55060
24336e5060j88190H2701g702j75343C40253A53117h2540b4721I4237C1489a47451
$$ -55060 -243250 82701 -7702 -183045 340253 153117 -82540 -24721 94237 31489 -147451
24324e3459r0629l2856C51752b08564E3025B0165K1623A4550J7077O0152O2046
$$ -53459 -144088 -176944 351752 -208564 53025 20165 41788 14550 31627 91779 153825
24313A53825B6968J51235j6707Q0849b24948e4872j47566L7680O6312o93c1127
$$ 153825 26968 178203 161496 242345 -224948 -54872 -202438 -164758 -98446 -99139 -31127
24301a61001B6511a83664A59531a32068j63714J05628j91445I6588C5014i0329
$$ -161001 26511 -183664 159531 -132068 -295782 -190154 -381599 96588 35014 -90329
24290C83634h6459B90679a70382A03388c79337B35542a47238j63075f8615k946
$$ 383634 -86459 290679 -170382 103388 -379337 235542 -147238 -310313 -68615 -71561
24280g1561j50409a7587l93490A00205d7332C46808j61738j1037i7875B2882J92759
$$ -71561 -221970 -17587 -411077 100205 -47332 346808 185070 174033 -97875 22882 215641
24269B15641f0672A48909L3127a42548b148n8599A35890R5996i593j20986F2245
$$ 215641 -60672 148909 182036 -142548 -2148 -60747 135890 231886 -9593 -130579 62245
24257E6128k7122h4332B11998M4464a843j74193d1396E995f4896j74341L9491
$$ 56128 29006 -84332 211998 256462 -1843 -176036 -41396 5995 -64896 -239237 -199746
24246a99746O8551B14458j0933a28644r9836E0270K65531j56834i5602K0909k00719
$$ -199746 -131195 214458 203525 -128644 -228480 50270 315801 158967 -95602 -74693 -275412
24235b75412a864j34393K8464K3189H8997e5418l72314a54829A82770A3499a70435
$$ -275412 -1864 -136257 -107793 -84604 88997 -55418 -427732 -154829 182770 13499 -170435
24223B05504i5937k68852f3148k36630a47319k06673B24663c32448l0889g8792
$$ 205504 -95937 -364789 -63148 -299778 -147319 -353992 224663 -332448 -363337 -78792
24212A32182j2825a74218A96215a53000q4475J05264k44651g9859j05881Q4135
$$ 132182 119357 -174218 196215 -153000 -237475 -132211 -376862 -79859 -185740 -101605
24202a01605D0168J53958a6596n2690k9883n6732f7647k13169J24129A8057L03834
$$ -101605 40168 194126 -16596 -69286 -99169 -155901 -67647 -280816 -156687 18057 321891
24191C21891A10582J7461i6862A8044Q3037J9769c45001i9446A10468a29259k3105
$$ 321891 110582 128043 -96862 18044 101081 120850 -345001 -99446 110468 -129259 -152364
24180a52364O1300p5222A40142b88270J33693H081b2908m09738A1582K00284C9179
$$ -152364 -91064 -166286 140142 -288270 -154577 8081 -22908 -432646 11582 211866 39179
24168B12476a16874o7400B75718d740B91172a77644d4618A96045a62457a0271
$$ 212476 -116874 -184274 275718 -4740 291172 -177644 -44618 196045 -162457 -10271
24157a1718I3709J60997b7734F6081b20757J08488j57693A17990c73865J41744
$$ -11718 93709 254706 -27734 66081 -220757 -112269 -269962 117990 -373865 -232121
24147b32121O7842M2432o6171k8042B29749a30810A48798e6919j02323c3229A7145
$$ -232121 -164279 -121847 -188018 -216060 229749 -130810 148798 -56919 -159242 -33229 17145
24135a89094d546B77388M2188c88494J65737g4400e844k6485A13920M7783j7367
$$ -189094 -4546 277388 319576 -388494 -222757 -74400 -5844 -32329 113920 161703 144336
24124A44336o9124a01217A45451o4370J28454B7141a97573B3518P1082e3309j33140
$$ 144336 75212 -101217 145451 81081 209535 27141 -197573 23518 94600 -53309 -186449
24113a86449Q2083C1636a26955A25299b36636q0589I0073J58770b1833j04189
$$ -186449 -104366 31636 -126955 125299 -236636 -317225 90073 248843 -21833 -126022
24103a26022j34994A93998A3898J37654f0234F3732M2273A6025H14J38591k9274
$$ -126022 -261016 193998 13898 151552 -60234 63732 106005 16025 814 139405 110131
24092A10131f8341J8577A24437L96311D2285c19749J23604B02268b4534g859B57411
$$ 110131 -68341 -49764 124437 520748 42285 -319749 -196145 202268 -24534 -7859 257411
24080D04233A9186a43460f358B13515a45433j84194D36604c45413G8355K4171
$$ 404233 19186 -143460 -6358 213515 -145433 -329627 436604 -345413 78355 102526
24070A02526a08913k3256f1215n6539A42988b1759l95485d8816D26916c8234o6086
$$ 102526 -108913 -132169 -61215 -117754 142988 -21759 -417244 -48816 426916 -38234 -104320
24059a04320G8381b73526F073a59682j5045Q7026A35166b42761C28523i8390B67728
$$ -104320 78381 -273526 6073 -159682 -174727 -87701 135166 -242761 328523 -98390 267728
24047B23784f3945l8012J2179L574j33427n2756B70221g084H906h0956G4262a39327
$$ 223784 -63945 -101957 -89778 -86204 -219631 -272387 270221 -7084 8906 -80956 74262 -139327
24034a41104j10139H2113L29272K0592A0870a60327B15911j01902N7665F6764
$$ -141104 -251243 82113 411385 431977 10870 -160327 215911 114009 171674 66764
24023D5898K8736a60480j02222B30607n1723h307E0077L36025c3916F052a63056
$$ 45898 74634 -160480 -262702 230607 178884 -8307 50077 386102 -33916 6052 -163056
24011A2122b08352J03685j65567b7767q0167L372L3863j43485K4457g8420F4553
$$ 12122 -208352 -104667 -270234 -27767 -107934 -104562 -70699 -214184 -189727 -78420 64553
23999a72253a4830p360p2002b8936m32158h4439B08878I7117i4611A17973K66753
$$ -172253 -14830 -22190 -94192 -28936 -461094 -84439 208878 97117 -94611 117973 384726
23988C84726A46440b1187A929b20329G1680L70971h2170D12582A66478a96434
$$ 384726 146440 -21187 1929 -220329 71680 442651 -82170 412582 166478 -196434
23977A16578A496e7216A45384c0575m030n6292o7363b7420A60592f9376E5690
$$ 116578 1496 -57216 145384 -30575 -34605 -90897 -158260 -27420 160592 -69376 55690
23965c25876a27090K4992A61012P8797A3746a9826k99747d1414j45102j36580
$$ -325876 -127090 -102098 161012 239809 13746 -19826 -319573 -41414 -186516 -323096
23955c23096A10448B8676Q9723a08848K6777F8110J98761a675l00509c6038n3620
$$ -323096 110448 28676 118399 -108848 -82071 68110 266871 -1675 -302184 -36038 -89658
23944h9658A89677Q0402h5310j49070B01899c2712j04325E6077J36696a17781
$$ -89658 189677 270079 -85310 -234380 201899 -32712 -137037 56077 192773 -117781
23933d734m1739A0795g0121A31493b519k5094F3454k3198a32060A51589Q8328
$$ -4734 -46473 10795 -70121 131493 -2519 -27613 63454 40256 -132060 151589 239917
23922B39917b00765e5775j2350n6058A41734i6643I5090c01579f6877o284L94
$$ 239917 -200765 -55775 -68125 -124183 141734 -96643 95090 -301579 -66877 -73161 -72767
23911g2767j60287E8918A6331J37497b3678j37714D0713a74588B6655K01563g9659
$$ -72767 -233054 58918 16331 153828 -23678 -161392 40713 -174588 26655 228218 -79659
23899c0914q2079K8485o2639A97784M9112N1764a68889p1569C8533e3054m3525
$$ -30914 -112993 -84508 -147147 197784 246896 298660 -168889 -240458 38533 -53054 -96579
23888i6579A1604i1585b956r02G2806C5190K26815D4645A2320m123a17900k37713
$$ -96579 11604 -91585 -2956 -3858 72806 35190 262005 44645 12320 8197 -117900 -355613
23876c55613A69322e6007a016F6164l549A6536c43808b9197A03704A85K3710f9741
$$ -355613 169322 -56007 -1016 66164 62615 16536 -343808 -29197 103704 185 23895 -69741
23863A1259O0021d9021b3731A34481O5399a54093q6184a6110C6286L3066i2903
$$ 11259 71280 -49021 -23731 134481 199880 -154093 -240277 -16110 36286 69352 -92903
23851c054B6191g8328p3962c0957k55939B49394m5868a46355D50331e2065o4864
$$ -3054 26191 -78328 -152290 -30957 -286896 249394 203526 -146355 450331 -52065 -116929
23840a16929B72278C5035a36119A5355a22012J3505M91j68020a11747M7877C76157
$$ -116929 272278 35035 -136119 15355 -122012 -108507 -108016 -276036 -111747 -63870 376157
23828b68411q1093i8336A8099K61464a61794H8034P24b7506I4608J45486a50061
$$ -268411 -349504 -98336 18099 279563 -161794 88034 88758 -27506 94608 240094 -150061
23816A10546c0758C2568c9098E2734h1801A4363b27672Q3261q7885B76599b20479
$$ 110546 -30758 32568 -39098 52734 -81801 14363 -227672 -144411 -232296 276599 -220479
23804a64620f354j02006E5851b12043h7654j35344f5866j02276j19188J34380
$$ -164620 -6354 -108360 55851 -212043 -87654 -222998 -65866 -168142 -287330 -152950
23794a52950M0054A35029b25375A3204g733k15816b5473A49833o0447Q8069g5082
$$ -152950 -112896 135029 -225375 13204 -7733 -223549 -25473 149833 89386 177455 -75082
23782f5757B39275a06067B30902k7229a7858k02116I8103P1283o8529k2181a92924
$$ -65757 239275 -106067 230902 203673 -17858 -219974 98103 169386 100857 78676 -192924
23770F7278d5540D8729a4606m9517B01131q6917m3182k691L57719a5302r7265
$$ 67278 -45540 48729 -14606 -64123 201131 114214 71032 68341 426060 -15302 -112567
23759a12567l3052p933e087q9118Q703F2258M0028m707c5861J7234A20613f3400
$$ -112567 -145619 -153552 -5087 -94205 -85502 62258 102286 97579 -35861 -18627 120613 -63400
23746A68393G9142L22346a3127p894A60621a84393d3493A19673R6728a96769h6719
$$ 168393 79142 401488 -13127 -21021 160621 -184393 -43493 119673 216401 -196769 -86719
23734a11723j23408D2010a07819A84691J08737f9474J6677j63286Q4707c9696
$$ -111723 -235131 42010 -107819 184691 293428 -69474 -52797 -216083 -131376 -39696
23723D6635b14091F3144j2580h857C3808i1340C12785i2440A01104l7533b05107
$$ 46635 -214091 63144 50564 -8857 33808 -91340 312785 -92440 101104 63571 -205107
23711D6157o567b4262l41289d1095o7038C1950a2571A11350b7800I6476D0122
$$ 46157 39590 -24262 -365551 -41095 -108133 31950 -12571 111350 -27800 96476 40122
23699b86170i6749A47956a64941H0560L0168K47113c52870e9167h336j18712d2739
$$ -286170 -96749 147956 -164941 80560 110728 357841 -352870 -59167 -8336 -127048 -42739
23687F9057d3149j78478l0805F917a3192A75517a25968C6307c31947J51570j57310
$$ 69057 -43149 -221627 -252432 6917 -13192 175517 -125968 36307 -331947 -180377 -337687
23676c37687A40549h5486B6140J9476a44146B26825H4773f8520c2583q804A47507
$$ -337687 140549 -85486 26140 45616 -144146 226825 84773 -68520 -32583 -41387 147507
23664a96131K3375f5963B56016c9187D3794a74106B09912C2255J41337L6325p7481
$$ -196131 -172756 -65963 256016 -39187 43794 -174106 209912 32255 173592 209917 132436
23653A32436a60303C63135b55848f6839D3910P9669c05290B99861B3522J68222
$$ 132436 -160303 363135 -255848 -66839 43910 123579 -305290 299861 23522 191744
23643A91744o3256a39062k49019A09918c91817h7390j17364A17984O3482J0085
$$ 191744 128488 -139062 -388081 109918 -391817 -87390 -204754 117984 181466 191551
23633A91551k2938b28263D0298b00493c2090G6144R5020b04232R729A76730Q0576
$$ 191551 168613 -228263 40298 -200493 -32090 76144 171164 -204232 -194503 176730 257306
23622B57306c54267a9403A04784i2227b8000r8474B03171c78378c2458G2357g9285
$$ 257306 -354267 -19403 104784 -92227 -28000 -126474 203171 -378378 -32458 72357 -79285
23610B38309a97774f2559C52643h6714E0576f9660A73003a08227B54649b76138
$$ 238309 -197774 -62559 352643 -86714 50576 -69660 173003 -108227 254649 -276138
23599g5004m216k8557B64800j28771l2164L5939B5021K12965D4117M23707l2963
$$ -75004 -79220 -107777 264800 136029 103865 139804 25021 237986 44117 467824 434861
23588D34861h7660C10409j49553L07703B29048h2657k05916A61050K30121I8705
$$ 434861 -87660 310409 160856 468559 229048 -82657 -288573 161050 391171 98705
23577A21376D8474a18551C15429b92116g0065q2681B05833K9789J6935d84033
$$ 121376 48474 -118551 315429 -292116 -70065 -152746 205833 235622 252557 -484033
23566a97130A46769e5829a6993k33396B99333B7229J3856K03716c27018A71990
$$ -197130 146769 -55829 -16993 -250389 299333 27229 41085 244801 -327018 171990
23555c93010h2331C22191E7632P0432J63732H7815d01412I1300P5535b75518j71799
$$ -393010 -82331 322191 57632 128064 291796 87815 -401412 91300 166835 -275518 -447317
23544d47317a77490e6489D8161b398D4051g5347L3725A17334D4722g1353A04739
$$ -447317 -177490 -56489 48161 -2398 44051 -75347 -41622 117334 44722 -71353 104739
23532G199b56526d3097A3440K3366b47894b1635l04719i8165a9464j4558H3631
$$ 7199 -256526 -43097 13440 36806 -247894 -21635 -326354 -98165 -19464 -34022 83631
23520B10776o3993J78278d0882F9692m947b65186O1329D6201a29641A44925E0756
$$ 210776 146783 325061 -40882 69692 64745 -265186 -203857 46201 -129641 144925 50756
23508d78761C76597b27096A71864M2075a96942A22834a72931j09687L1748C00369
$$ -478761 376597 -227096 171864 213939 -196942 122834 -172931 -282618 -250870 300369
23497e09030F7896a75739B26772E4984d12298d7515A46658J65010E5746d00556
$$ -509030 67896 -175739 226772 54984 -412298 -47515 146658 311668 55746 -400556
23486i3003j93617b9608q6160B82970H0923b14569A70401o5728B5295d9751k01181
$$ -93003 -286620 -29608 -115768 282970 80923 -214569 170401 104673 25295 -49751 -250932
23475b50932G3680b39491R8738K3122A11525R7757l2348b72024B19789a87340
$$ -250932 73680 -239491 -140753 -117631 111525 209282 176934 -272024 219789 -187340
23464c22602N3675J32266D34256a38017B83383d743j54163G9963a26130k1980
$$ -322602 -268927 -136661 434256 -138017 283383 -4743 -158906 79963 -126130 -148110
23454a48110A19913l9176P0969A4163K40224h585j82162B00161a18068l4126e1914
$$ -148110 119913 80737 151706 14163 254387 -8585 -190747 200161 -118068 -152194 -51914
23442A64100G46N8213B827K42624a07814B73924j34095D7499b17293P3132B21398
$$ 164100 746 58959 2827 245451 -107814 273924 139829 47499 -217293 -144161 221398
23430b27627h8360j1054n5093k2602l940d7334A32320J7556j8886b11895P9865
$$ -227627 -88360 -99414 -154507 -177109 -181049 -47334 132320 149876 130990 -211895 -132030
23419a32030A28830b62363e9329B42435o9580b141j22007e1147m13114a70710
$$ -132030 128830 -262363 -59329 242435 172855 -2141 -124148 -51147 -464261 -170710
23408a18152B71854R155b7921j6459p2783B51535b41613h8746C9539A5898L97883
$$ -118152 271854 281009 -27921 -44380 -117163 251535 -241613 -88746 39539 15898 413781
23397D13781c07185B17360a79934l3114h544j04524k45076J58746J7228L5107
$$ 413781 -307185 217360 -179934 -213048 -8544 -113068 -358144 -199398 -182170 -147063
23387a47063A42063c1369m66091b48590G4416a1234B9215J32858J51727b31551
$$ -147063 142063 -31369 -497460 -248590 74416 -11234 29215 162073 313800 -231551
23376C3237b37165e6070k32378e278E21531a27989d2145o734l3446A36970a39024
$$ 33237 -237165 -56070 -288448 -5278 521531 -127989 -42145 -48879 -82325 136970 -139024
23364A86991b19143J4649N2099b8917b203B17148a74451N9579o2756d3190A77909
$$ 186991 -219143 -204494 -152395 -28917 -2203 217148 -174451 -114872 -177628 -43190 177909
23352c25469A27919J38338g4741A77139d21139b9745k4842K4383j23230C61008
$$ -325469 127919 266257 -74741 177139 -421139 -29745 -54587 -30204 -153434 361008
23341a2447j64705A89060G0270Q2129b9150F2269b7402F919i4183j93106J25579
$$ -12447 -177152 189060 70270 152399 -29150 62269 -27402 6919 -94183 -287289 -161710
23330a61710h0355G657g4599B71635c27162J10804A29568d68462e4074j0305l98753
$$ -161710 -80355 7657 -74599 271635 -327162 -216358 129568 -468462 -54074 -64379 -463132
23319d63132A70195F3253d5157J184A8567e1465q1860j69388a37235B42947f0354
$$ -463132 170195 63253 -45157 -43973 18567 -51465 -133325 -302713 -137235 242947 -60354
23307B05555r5675a27484B34965n2655a79383A09488c6796D7808i9019j9166B74851
$$ 205555 109880 -127484 234965 182310 -179383 109488 -36796 47808 -99019 -118185 274851
23295E5889a60627A38156m5846P2153h9254A67807E8506J29047b084j28466N7647
$$ 55889 -160627 138156 92310 164463 -89254 167807 58506 187553 -2084 -130550 -72903
23284g2903c0335A5079J16997b05912k7788b3848C7717e1875l99753F5118i0388
$$ -72903 -30335 15079 132076 -205912 -233700 -23848 37717 -51875 -451628 65118 -90388
23272B72304b88117A69249a31181M0359C04662m9294b51353B42866I9485j4410
$$ 272304 -288117 169249 -131181 -90822 304662 255368 -251353 242866 99485 85075
23262H5075b6913j85413q2858J25165B04316i3914j55708F9709Q6030m1417O7709
$$ 85075 -26913 -212326 -295184 -170019 204316 -93914 -249622 69709 155739 114322 182031
23251A82031P0528f3519B80718a55560j25328F5114B2693a10962E4515a50888
$$ 182031 252559 -63519 280718 -155560 -280888 65114 22693 -110962 54515 -150888
23240b11819f1000k60198C1492a08784j63196E2363a81974k05914A66388a11924
$$ -211819 -61000 -321198 31492 -108784 -271980 52363 -181974 -387888 166388 -111924
23229D0738f9212j47839A44403a59509e6219p3864H7078b99343C3688M75865a50500
$$ 40738 -69212 -217051 144403 -159509 -56219 -130083 87078 -299343 33688 509553 -150500
23217G6150f5768A03431b76541A94160a41487A37084c94164a15369A86631c1371
$$ 76150 -65768 103431 -276541 194160 -141487 137084 -394164 -115369 186631 -31371
23206b1104o3198o1823e8794r7549c74j12487A32916E3498d640l7562A23685a57475
$$ -21104 -84302 -146125 -58794 -156343 -374 -112861 132916 53498 -4640 -42202 123685 -157475
23193b34268e8087k1108l6609j22024G1923K31375d7258k59176F5510j4574c08396
$$ -234268 -58087 -79195 -115804 -237828 71923 303298 -47258 -306434 65510 50936 -308396
23181b94999C46279h6981m3913G1577b16052f6721a1466m208r5432J535L9750
$$ -294999 346279 -86981 -130894 71577 -216052 -66721 -11466 -15674 -111106 -109571 -69821
23170f9821l44885A72413a55211j47236g1198j6039G4039A6686L12340a42921
$$ -69821 -414706 172413 -155211 -302447 -71198 -87237 74039 16686 329026 -142921
23159D8738B4069K3807b09285B66934I4673f5539j28412D4893e0084j61501k2202
$$ 48738 24069 47876 -209285 266934 94673 -65539 -193951 44893 -50084 -211585 -233787
23148b33787j2986i2949J8196D460b33481g7314A0663c2078k6188C66895a57609
$$ -233787 -246773 -92949 -74753 4460 -233481 -77314 10663 -32078 -58266 366895 -157609
23136C17850j50549f320j42904G3770K11493a28214b4713A37740b1826j27654
$$ 317850 167301 -6320 -149224 73770 285263 -128214 -24713 137740 -21826 -149480
23126a49480j8367A84925c4876J7418j30991c9808B09169b41253A4866a66002
$$ -149480 -167847 184925 -34876 -17458 -148449 -39808 209169 -241253 14866 -166002
23115a01629B2126M7774b34467A8959e8582m5363D5923b19672j59526a53081r1700
$$ -101629 22126 69900 -234467 18959 -58582 -103945 45923 -219672 -379198 -153081 -244781
23104b44781o5715C23582e1051k16216O6405B23814n7657c196H7400K9275K7786
$$ -244781 -310496 323582 -51051 -267267 -200862 223814 166157 -3196 87400 116675 144461
23093A44461J96997A26442a66916C4621b98888E3214a18360p2276o2226G3960
$$ 144461 341458 126442 -166916 34621 -298888 53214 -118360 -190636 -252862 73960
23082A74922J10617A8156g2220N62p1570A81342b18635P889A38380B7536a75619
$$ 174922 285539 18156 -72220 -71658 -143228 181342 -218635 -210746 138380 27536 -175619
23070B73624D5712f3113k27030Q9908A44931B3574c3935k7287D4770a73291O3017
$$ 273624 45712 -63113 -290143 -200235 144931 23574 -33935 -61222 44770 -173291 -110274
23059a10274D18679a23811M5866g92C04847m4548q2277J56736e8547a7382A58706
$$ -110274 418679 -123811 -77945 -792 304847 260299 178022 334758 -58547 -17382 158706
23047A86812o3202e663A8775K44032b14084K6421A20641J07813i7437j87330J3470
$$ 186812 123610 -5663 18775 262807 -214084 -187663 120641 228454 -97437 -284767 -271297
23036b71297N7272A12409b02344C63330j55273k4465K26576A26525D7806A9393
$$ -271297 -214025 112409 -202344 363330 208057 183592 410168 126525 47806 19393
23025g5276B64736A4699e633j567j98662K484P7462A00173b26350A21780J98027
$$ -75276 264736 14699 -5633 -7200 -205862 -203378 -125916 100173 -226350 121780 319807
23014C19807c34667D6016L2079b39507A19533C0188J31609J48187h6702D8750
$$ 319807 -334667 46016 78095 -239507 119533 30188 161797 309984 -86702 48750
23003b93098k04874C07130c81719H7658d3859b0971C44706b29293A2037e3172
$$ -293098 -497972 307130 -381719 87658 -43859 -20971 344706 -229293 12037 -53172
22992h7664q9224c7702k5086k2686A7421M7066c5550F4521Q7791h1250J0078d171
$$ -87664 -176888 -37702 -62788 -85474 17421 64487 -35550 64521 152312 -81250 -71172 -4171
22979a37619k06170b0346j45004j67832A18800a29992D1359K71547b65694a00644
$$ -137619 -343789 -20346 -165350 -333182 118800 -129992 41359 312906 -265694 -100644
22968c41913o0656C08950A38372J452L3914E1757K311a34031A75400c5605D7726
$$ -341913 -402569 308950 138372 139824 173738 51757 54068 -134031 175400 -35605 47726
22956b6442D3801H795f222j54565k69243B15384I8315K26027b54578A00295h084
$$ -26442 43801 8795 -6222 -160787 -430030 215384 98315 324342 -254578 100295 -8084
22944a23754I6210a7977n2580o470c0019A21269g900C4598J68816a80340g3824
$$ -123754 96210 -17977 -70557 -77027 -30019 121269 -7900 34598 203414 -180340 -73824
22932d9075A52363o8141a03386e0321D2641a81750A06936a45514A03580K03019
$$ -49075 152363 84222 -103386 -50321 42641 -181750 106936 -145514 103580 306599
22922C06599G9595J01017g8127C28582a28930B15450D892J33595d4979H05R4082
$$ 306599 79595 180612 -78127 328582 -128930 215450 4892 138487 -44979 805 94887
22911I4887a86208F8083c93910h4629b1021A12150n4740i9281E4940J30165d01919
$$ 94887 -186208 68083 -393910 -84629 -21021 112150 57410 -99281 54940 185105 -401919
22899b80627e4672A46753F6980O3741H635a42504A37396b95470A93868i2403b7873
$$ -280627 -54672 146753 66980 130721 8635 -142504 137396 -295470 193868 -92403 -27873
22887b23918E3648b4097B8298b73788e5567j37246Q1011m1273A59042b39705I709
$$ -223918 53648 -24097 28298 -273788 -55567 -192813 -111802 -153075 159042 -239705 9709
22875d28154j13348A16953K45050j73153p0759A2570l643d3926k52828F030f6384
$$ -428154 -541502 116953 362003 188850 118091 12570 8927 -43926 -296754 6030 -66384
22863e4285B1091L7906a27039G87b5894o8747G0744i1835c4913H0006J89815A29727
$$ -54285 21091 58997 -127039 787 -25894 -94641 70744 -91835 -34913 80006 269821 129727
22850b74137B2997b36653P1659H7359j3015e1329A6633e5054e002j77175p557
$$ -274137 22997 -236653 -164994 87359 74344 -51329 16633 -55054 -5002 -182177 -189734
22839a89734k83637J58038a6842A44080J54302a80714C5221J0996a96088p1109
$$ -189734 -473371 -315333 -16842 144080 298382 -180714 35221 46217 -196088 -267197
22829b67197A49501O2802a81306L2862r040k626o0871D5500l810b81965B25834
$$ -267197 149501 212303 -181306 -148444 -157484 -160110 -220981 45500 41690 -281965 225834
22817D3026b31002a1627B9867b42236J4594G9285d4788B2975h2481c1905A88070
$$ 43026 -231002 -11627 29867 -242236 -227642 79285 -44788 22975 -82481 -31905 188070
22805e2375A2506b3565j24517k2212N2843a1444A09433A3213K26618D966J6240
$$ -52375 12506 -23565 -148082 -170294 -117451 -11444 109433 13213 239831 4966 21206
22794B1206a26656A38704b00465J4107A31065k5163L60319k09951H6194R5123
$$ 21206 -126656 138704 -200465 -186358 131065 105902 466221 256270 86194 181317
22784A81317J0753l5571b20761O060B37134a45883k8956A90724g8658n0900J3771
$$ 181317 192070 156499 -220761 -214701 237134 -145883 -174839 190724 -78658 -129558 -115787
22773a15787D2355b72118A19412f5005E6355c6546J3747H8533a38048j55927e5234
$$ -115787 42355 -272118 119412 -65005 56355 -36546 -22799 88533 -138048 -293975 -55234
22761a29420d5380B27P3069B9587b58493a26032M3769p7012O9917I9259a59978
$$ -129420 -45380 227 73296 29587 -258493 -126032 -82263 -159275 -89358 99259 -159978
22749a27980j22259f9088F2997Q0487B3236K94563d7747j32551e9521a6372l9522
$$ -127980 -250239 -69088 62997 143484 23236 317799 -47747 -180298 -59521 -16372 -55894
22738e5894B1912K56092G1568l3474a10216D4806a23631j60482a26369r7766a06261
$$ -55894 21912 278004 71568 38094 -110216 44806 -123631 -284113 -126369 -224135 -106261
22726a4933D8126B3109a52005A07586b80403J18382n8946f4130o0314O247C52357
$$ -14933 48126 23109 -152005 107586 -280403 -162021 -220967 -64130 -124444 -118197 352357
22714a53662k08064J67694p8792e6604I6988J8741a19789b6087p9924N1554B38866
$$ -153662 -361726 -194032 -272824 -56604 96988 115729 -119789 -26087 -106011 -54457 238866
22702A27731c6040B8940a75179a1136p9321r3555H1029j7801a7724k78314b8069
$$ 127731 -36040 28940 -175179 -11136 -90457 -184012 81029 63228 -17724 -296038 -28069
22690b02272B31925f6486k93959M3642c2644B8505a3795j983I6b254k99364B6909
$$ -202272 231925 -66486 -360445 -316803 -32644 28505 -13795 -15778 96 -2254 -301618 26909
22677d4233a3811d359H7270C1233f4836G0323J01592b8511k44678E2562J02668
$$ -44233 -13811 -4359 87270 31233 -64836 70323 171915 -28511 -273189 52562 155230
22666A55230D6735a86080f0740E1536b11914A40717c0162A40073e0943A58402
$$ 155230 46735 -186080 -60740 51536 -211914 140717 -30162 140073 -50943 158402
22655I5221J83571j03313l3801a30308l177B42691f9538A10813b56344K6905A23898
$$ 95221 278792 175479 141678 -130308 -133485 242691 -69538 110813 -256344 -229439 123898
22643a90898C51647A33828K44695h9007j54654b2642r6946j29564k93947A63305
$$ -190898 351647 133828 378523 -89007 -243661 -22642 -119588 -249152 -543099 163305
22632c8161l03813B21694G4446c20641C5427b57165P6440O4509l9400b6127o9591
$$ -38161 -341974 221694 74446 -320641 35427 -257165 -180725 -116216 -155616 -26127 -95718
22621i5718F6901J4522a40758d6576j07786p4138F4773Q2621b29388e7132k6843
$$ -95718 66901 81423 -140758 -46576 -154362 -228500 64773 147394 -229388 -57132 -83975
22610h3975A32514a76481a4381j97908L4851J9463A45252d44672f7672B75597
$$ -83975 132514 -176481 -14381 -212289 -177438 -157975 145252 -444672 -67672 275597
22599a64209K3332i314B33109J43300a64176h1005d0242j68814K8314A01823a33337
$$ -164209 -140877 -9314 233109 376409 -164176 -81005 -40242 -209056 -180742 101823 -133337
22587a85302h3873l24832J9993a55669d2413j86077i4178A42901d4443j71117
$$ -185302 -83873 -408705 -388712 -155669 -42413 -228490 -94178 142901 -44443 -215560
22577b15560R1463k04747a24241C4159d1777n3894A18038b23979a7595l1872B2810
$$ -215560 -124097 -328844 -124241 34159 -41777 -95671 118038 -223979 -17595 -49467 22810
22565b47307O9792A52090C4981d18063a05665I4769G02e8503C3011J34123l3828
$$ -247307 -177515 152090 34981 -418063 -105665 94769 702 -58503 33011 167134 133306
22554A33306a22725k7646A0065a68929r0344K2122F3935h2688A60946B6463c69154
$$ 133306 -122725 -150371 10065 -168929 -259273 -237151 63935 -82688 160946 26463 -369154
22542c5431A4439k994a35387d935D3122g2530k22205P1964f3907r7763e8948A12336
$$ -35431 14439 11445 -135387 -4935 43122 -72530 -294735 -222771 -63907 -161670 -58948 112336
22529B41609F362M5487a80215c877k35469c0270C06645b14917A28620h0378n35546
$$ 241609 6362 51849 -180215 -3877 -239346 -30270 306645 -214917 128620 -80378 -615924
22518f15924b20338B26058F627b16242E6257O7835l6922J84720j2748j25857a95214
$$ -615924 -220338 226058 6627 -216242 56257 124092 87170 271890 259142 133285 -195214
22506e7138B51549a38385N9148K7132j14946q5880F4151J65610D682O3332g1378
$$ -57138 251549 -138385 -79237 -52105 -167051 -252931 64151 229761 4682 68014 -71378
22494A22711a07908B21633N0697a14832A11487n4236a48174N3740A23285b37751
$$ 122711 -107908 221633 272330 -114832 111487 57251 -148174 -94434 123285 -237751
22483a38137f3338m26477b42992i181k8273B33330a26825l4622A33890o919f3006
$$ -138137 -63338 -489815 -242992 -9181 -37454 233330 -126825 -161447 133890 126971 -63006
22471h3012G2047B9670i5461B35386a37118K1556A71667K0937n3750a15504R383
$$ -83012 72047 29670 -95461 235386 -137118 -115562 171667 192604 138854 -115504 -106121
22460a06121i308j93487B2024J15398b21140D7072Q2838C9062f7568l55359a12308
$$ -106121 -9308 -202795 22024 137422 -221140 47072 129910 39062 -67568 -422927 -112308
22448b22406a6985p3264m5314I5272a0835m2910D7245d0397r1149o7894O5433
$$ -222406 -16985 -90249 -135563 95272 -10835 -53745 47245 -40397 -131546 -199440 -134007
22437a34007a8055j33529D616c066B39721b4692n9954A16032a08505B20414k7509
$$ -134007 -18055 -151584 4616 -3066 239721 -24692 -84646 116032 -108505 220414 192905
22426A92905J78257a29577D2447a35588A09991n0696b42197B35222b97349h731
$$ 192905 371162 -129577 42447 -135588 109991 59295 -242197 235222 -297349 -8731
22415A49681d8164n0689A79068b37924c7700A52471A4954b18255J02097B05072
$$ 149681 -48164 -98853 179068 -237924 -37700 152471 14954 -218255 -116158 205072
22404H0266a67399j68793C03243a34681p3620d223k20523h4041F1910c16017J06223
$$ 80266 -167399 -336192 303243 -134681 -208301 -4223 -224746 -84041 61910 -316017 -209794
22393b09794j28663a00152D978a71985G8060J23810d23321a08409j2212A95310
$$ -209794 -338457 -100152 4978 -171985 78060 201870 -423321 -108409 -120621 195310
22382b13628A02302J27635i7080B920J0706a44947R633D2124b33713k71801c4883
$$ -213628 102302 229937 -97080 2920 13626 -144947 -135314 42124 -233713 -505514 -34883
22370a28240j73881a46380P1155l415A56665c3411B07633i149l2013p3941G0488
$$ -128240 -302121 -146380 -75225 -78640 156665 -33411 207633 -9149 -41162 -115103 70488
22358b00666D6584l86a14605j23368H0388i5499B27346H2923a4438G8447a9961
$$ -200666 46584 46198 -114605 -237973 80388 -95499 227346 82923 -14438 78447 -19961
22346e23664B02449h3496j15560h6929j27998h3458b4256G0000a51703C4291K6420
$$ -523664 202449 -83496 -199056 -86929 -214927 -83458 -24256 70000 -151703 34291 60711
22335F0711a05628j34822D1196a97376J4891B69714r2366m290a37259o055O8310
$$ 60711 -105628 -240450 41196 -197376 -182485 269714 177348 173058 -137259 -143314 -75004
22324g5004j3465o7095C0637J56148m7052b14577b2939k58997B6919A63N1858
$$ -75004 -88469 -155564 30637 186785 139733 -214577 -22939 -281936 26919 163 52021
22313E2021j7091a28113B79125b7303H9557a24070A23282c50432M5487h8180C0469
$$ 52021 34930 -128113 279125 -27303 89557 -124070 123282 -350432 -304945 -88180 30469
22301a24595e7713B21535O5464a07247k6479j50035d0169Q582o9236M1636j86323
$$ -124595 -57713 221535 286999 -107247 -133726 -283761 -40169 -31587 -100823 -59187 -245510
22290b45510r1251E2320b17002N9162e9573G1749a16144a3496r1150A56611J55217
$$ -245510 -336761 52320 -217002 -157840 -59573 71749 -116144 -13496 -104646 156611 311828
22279C11828a07833j25643a9875q2360A06957J26009F0298B3642J2477a75971
$$ 311828 -107833 -233476 -19875 -102235 106957 232966 60298 23642 36119 -175971
22268a0264j62259F8230p706J28399p505a42190j24209A13050c34330a2287I0443
$$ -10264 -172523 68230 60524 188923 181418 -142190 -266399 113050 -334330 -12287 90443
22256a13434r4568N5150K9947A53045K1886H252b97412C922b07681i860A35281
$$ -113434 -208002 -152852 -122905 153045 174931 8252 -297412 3922 -207681 -9860 135281
22244b05154A4353J51083n8509b31903A3761K41604I9416a29570j98269A76000
$$ -205154 14353 165436 106927 -231903 13761 255365 99416 -129570 -327839 176000
22233G6056J57135m8390L737a40831e2868j38991J5341O6504q9848b2545j56948
$$ 76056 233191 184801 188538 -140831 -52868 -191859 -176518 -110014 -199862 -22545 -179493
22222a79493P6334C30178A2982a43409M4605E34606A66090a85849r3324A15732
$$ -179493 -103159 330178 12982 -143409 -98804 534606 166090 -185849 -279173 115732
22211b30313J13544D8997a29991N713E4171J02631c6221j71841J3215m54314b11829
$$ -230313 -116769 48997 -129991 -124278 54171 156802 -36221 -208062 -194847 -649161 -211829
22199A74338a88029o8804m6274f5111G9476a0936A3196b46037D0871a70837D797
$$ 174338 -188029 -256833 -303107 -65111 79476 -10936 13196 -246037 40871 -170837 4797
22187b10548B21163a18071A76293a09812A85293c29848L1654j6538A30946a52899
$$ -210548 221163 -118071 176293 -109812 185293 -329848 -298194 -314732 130946 -152899
22176c56050a68893C2476a13638I2023b2809A10896a76086p8482B544K637f4944
$$ -356050 -168893 32476 -113638 92023 -22809 110896 -176086 -254568 2544 5181 -64944
22164A17474b60858f9563A3712M0596M1324a98719m4379J08809H0796K0400N7280
$$ 117474 -260858 -69563 13712 54308 95632 -198719 -243098 -134289 80796 101196 158476
22153A58476A1642a13007B23408E9956a7144j04722B7903b546j62358N2499c8327
$$ 158476 11642 -113007 223408 59956 -17144 -121866 27903 -2546 -164904 -112405 -38327
22141f0893A97515I765L6828a20628M7831A9728J32380J08050I5771J64012b74800
$$ -60893 197515 9765 46593 -120628 -72797 19728 152108 260158 95771 259783 -274800
22129a42994N8392k55938a4914A18741a56298L0056n0357j2782O8521K7274B0318
$$ -142994 -84602 -340540 -14914 118741 -156298 -126242 -176599 -189381 -120860 -93586 20318
22117a97105G7260h9153k6970A4367J2918f5726K6134m845B18694e7410I4920
$$ -197105 77260 -89153 -116123 14367 27285 -65726 -39592 -44437 218694 -57410 94920
22105A12017d39852h1226j23541d9831k79921J43253B38798a2951j19019I5268
$$ 112017 -439852 -81226 -204767 -49831 -329752 -186499 238798 -12951 -131970 95268
22094a52506c4750j39537Q4338M0639n7553B2670K8203a56802B18164a70887A79927
$$ -152506 -34750 -174287 -89949 -49310 -106863 22670 50873 -156802 218164 -170887 179927
22082a09451A02909c79603B30625b74392D0269a12777M4295k29564A51464c20476
$$ -109451 102909 -379603 230625 -274392 40269 -112777 -68482 -298046 151464 -320476
22071A9580b9137A87310q182E5030b94955h1149A56470c7861k51217e2843A42778
$$ 19580 -29137 187310 179128 55030 -294955 -81149 156470 -37861 -289078 -52843 142778
22059B59899j4614a47833d502j79602h7603n0611B5712c45348g4287B0430O5863
$$ 259899 245285 -147833 -4502 -184104 -87603 -138214 25712 -345348 -74287 20430 86293
22048H6293b57507A56730J20049D0895f4831m4392K7542j21794C88747b2858C29105
$$ 86293 -257507 156730 276779 40895 -64831 -109223 -81681 -203475 388747 -22858 329105
22036h0768l351m4760M1775m8970k13677a12594j5188j1458A7815J10367a03380
$$ -80768 -84119 -128879 -87104 -136074 -349751 -112594 -127782 -139240 17815 128182 -103380
22024A5084o44a24427l2018F786M1151j2300b00724A00983K9467b13547l6761
$$ 15084 14440 -124427 -156445 6786 47937 35637 -200724 100983 130450 -213547 -250308
22013b50308f9259j10952A74847b63128f4599A00233f4987G9468h5710j6637k98837
$$ -250308 -69259 -180211 174847 -263128 -64599 100233 -64987 79468 -85710 -102347 -401184
22002d01184B06985c8326B13169D1648F658a56684j8431j40991A68406o581E2328
$$ -401184 206985 -38326 213169 41648 6658 -156684 -175115 -316106 168406 161825 52328
21990c07482a40284M7657A84909a78722M2401B3542a54282g1528j7466k22882
$$ -307482 -140284 -92627 184909 -178722 -136321 23542 -154282 -71528 -88994 -311876
21980c11876f6760A16063J31968J2448c592H1280a24032B55061e7296A18555d8944
$$ -311876 -66760 116063 248031 260479 -3592 81280 -124032 255061 -57296 118555 -48944
21968d29230a34683A92187B5953b37714J3040m3937E0881h7410A4037m212K895
$$ -429230 -134683 192187 25953 -237714 -224674 -268611 50881 -87410 14037 9825 12720
21957A2720e2698h575m02620a51037l6970A82012c9315l16694h6342m40435f0157
$$ 12720 -52698 -8575 -411195 -151037 -188007 182012 -39315 -356009 -86342 -526777 -60157
21945B0085L4060g3836J9341k9113a8738n62626O318a3454O180j87893g0056A39248
$$ 20085 54145 -73836 -54495 -83608 -18738 -581364 -575046 -13454 -7274 -195167 -70056 139248
21932B3506J86742N3992K17055E0893d3223n3081F0517b13463P1985A25362J06938
$$ 23506 210248 264240 481295 50893 -43223 -96304 60517 -213463 -141478 125362 232300
21921B32300H5094i9239L7756j65930F3725a15543m7663K2094m1298e4694o4106
$$ 232300 85094 -99239 -61483 -227413 63725 -115543 -163206 -141112 -182410 -54694 -118800
21910a18800M4772j37934i0104p8521F1801K4769A8405K06385K5952Q4347a31276
$$ -118800 -74028 -211962 -90104 -168625 61801 86570 18405 224790 250742 335089 -131276
21898b09457Q5262n8044k89533J95753A57058b29068I447c9841k29034d8079F4699
$$ -209457 -124195 -182239 -471772 -276019 157058 -229068 9447 -39841 -268875 -48079 64699
21886H2649a09415j8269r6445M6837c2788j3809p2278D6262a70355h0714A3600
$$ 82649 -109415 -127684 -224129 -177292 -32788 -46597 -118875 46262 -170355 -80714 13600
21874D9675a4504C31098c12952g2141j85726b4457j1323j74890b1292A69928b15758
$$ 49675 -14504 331098 -312952 -72141 -257867 -24457 -35780 -210670 -21292 169928 -215758
21862d2065j71509J9399J121L6016A24022g0014I6737H762a6029o409r0935d4576
$$ -42065 -213574 -194175 -193054 -157038 124022 -70014 96737 8762 -16029 -22438 -113373 -44576
21849i8057C0186g939m8935C18164a28269j12070g4298j54944m5369J340j4975
$$ -98057 30186 -7939 -56874 318164 -128269 -240339 -74298 -229242 -274611 -273271 -288246
21838b88246k2390B93101I7499K9260a3281I6223a62668C5586R8880a84416r5158
$$ -288246 -310636 293101 97499 126759 -13281 96223 -162668 35586 134466 -184416 -279574
21827b79574O2710A52444J1454j312R7924A7475J43577a40479A71581a49028A35004
$$ -279574 -216864 152444 163898 162586 260510 17475 161052 -140479 171581 -149028 135004
21815a70947E7693b37880q9136l9018a57615g027J236l31409g6922j6124m8027
$$ -170947 57693 -237880 -327016 -366034 -157615 -7027 -5791 -337200 -76922 -93046 -141073
21804a41073A31254J21519h9554j08490j34170f2027D4074b9640n48377a51351
$$ -141073 131254 252773 -89554 -198044 -332214 -62027 44074 -29640 -578017 -151351
21793B42585b19775A04029A5183e3113p3612H1634j8099a48325B66521r4539K44851
$$ 242585 -219775 104029 15183 -53113 -126725 81634 63535 -148325 266521 171982 416833
21782D16833d73881a78119C8743b68328a24224k00669J13911H949K54938C024
$$ 416833 -473881 -178119 38743 -268328 -124224 -324893 -210982 8949 263887 3024
21771a30634M0958C4531O0777f6926A80671a9708I4836J67358q6491d6598B1736
$$ -130634 -89676 34531 95308 -66926 180671 -19708 94836 262194 175703 -46598 21736
21759f2332K2095j88195d897p6577B68105d9920j46458A38957b02553k113A5299
$$ -62332 -40237 -228432 -4897 -81474 268105 -49920 -196378 138957 -202553 -204666 15299
21747b06438a01677D51069f1582j45070B67271a31288K6874r8395C7645J80075
$$ -206438 -101677 451069 -61582 -206652 267271 -131288 -104414 -202809 37645 217720
21737B17720d0679q1588K0881A24069F0817F712R3375a39950o3356B449c42339
$$ 217720 -40679 -122267 -101386 124069 60817 6712 100087 -139950 -203306 2449 -342339
21725A55452a39260L895l01506n5529K15592F8273J79149D633Q5880l7862J09734
$$ 155452 -139260 -135365 -436871 -492400 -276808 68273 247422 4633 90513 52651 162385
21714A62385p0799a99876p2528J04807n5348N7332o4313R6899m6050F4247c05426
$$ 162385 91586 -199876 -272404 -167597 -222945 -165613 -229926 -133027 -179077 64247 -305426
21702a55258d8910q9317O6938H5879L7362l0022a36706B02317d09989A1143i2056
$$ -155258 -48910 -138227 -71289 85879 123241 93219 -136706 202317 -409989 11143 -92056
21690B55841E9141n872a11364p5788n4617o8820a30247C0302j3433a65168O7532
$$ 255841 59141 53269 -111364 -187152 -241769 -310589 -130247 30302 16869 -165168 -97636
21679i7636q0544k710A29802c24764a4284j59731e0280j73368O5436d5808r1825
$$ -97636 -178180 -180890 129802 -324764 -14284 -174015 -50280 -223648 -158212 -45808 -137633
21668a37633A41720d7335A81630k8424b76055b9915J1970k40101C5737R8517F1294
$$ -137633 141720 -47335 181630 153206 -276055 -29915 -17945 -258046 35737 134254 61294
21656g3005A35342J8912b92195A98924H3256B0897O2677c22024J05036d9710E2520
$$ -73005 135342 154254 -292195 198924 83256 20897 83574 -322024 -216988 -49710 52520
$$ [...]