
##TITLE=AC1202_CTOAH12044_5973427_Be0SclTc9N
##JCAMPDX= 6.0         $$ Bruker NMR JCAMP-DX V2.0
##DATA TYPE= NMR SPECTRUM
##DATA CLASS= NTUPLES
##ORIGIN= BRUKER
##OWNER= Administrator
$$ 1.72 TOPSPIN		Version 2.1
$$ 2012-04-14 20:33:58.390 -0500  Administrator@TOPSPIN
$$ Compression mode = diff/dup
##.OBSERVE FREQUENCY= 400.13188235
##.OBSERVE NUCLEUS= ^1H
##.ACQUISITION MODE= SIMULTANEOUS (DQD)
##.ACQUISITION SCHEME= undefined
##.AVERAGES= 8
##.DIGITISER RES= 22
##SPECTROMETER/DATA SYSTEM= spect
##.PULSE SEQUENCE= zg30
##.SOLVENT NAME= COFFEE_meoh
##.SHIFT REFERENCE= INTERNAL, COFFEE_meoh, 1, 14.98061
##AUDIT TRAIL= $$ (NUMBER, WHEN, WHO, WHERE, PROCESS, VERSION, WHAT)
$$ ##TITLE= Audit trail, TOPSPIN		Version 2.1
$$ ##JCAMPDX= 5.01
$$ ##ORIGIN= Bruker BioSpin GmbH
$$ ##OWNER= Administrator
$$ $$ C:\Bruker\TOPSPIN/data/COFFEE/nmr/AC1202_CTOAH12044_5973427_Be0SclTc9N/10/pdata/1/auditp.txt
$$ ##AUDIT TRAIL=  $$ (NUMBER, WHEN, WHO, WHERE, PROCESS, VERSION, WHAT)
(   1,<2012-04-14 20:33:48.468 -0500>,<Administrator>,<TOPSPIN>,<go>,<TOPSPIN 2.1>,
      <created by zg
	started at 2012-04-14 20:32:40.406 -0500,
	POWCHK enabled, PULCHK disabled,
       configuration hash MD5:
       1A 1E CE 29 27 FD 77 03 67 4E F0 E3 C4 B2 CB 90
       data hash MD5: 64K
       5C 61 54 00 52 CB 97 98 54 92 C0 7D 83 98 2D 71>)
(   2,<2012-04-14 20:33:51.796 -0500>,<Administrator>,<TOPSPIN>,<proc1d>,<TOPSPIN 2.1>,
      <Start of raw data processing
       efp LB = 0 FT_mod = 6 PKNL = 1 PHC0 = 0 PHC1 = 0 SI = 32K 
       data hash MD5: 32K
       DF 5B EE BF 31 BD D1 ED CA 45 C0 F8 A2 64 04 1B>)
(   3,<2012-04-14 20:33:52.312 -0500>,<Administrator>,<TOPSPIN>,<proc1d>,<TOPSPIN 2.1>,
      <pk PHC0 = 211.8658 PHC1 = 0 
       data hash MD5: 32K
       EB 2C 86 5C C9 17 F6 72 4E 03 4D 3C BF E8 37 83>)
(   4,<2012-04-14 20:33:52.500 -0500>,<Administrator>,<TOPSPIN>,<proc1d>,<TOPSPIN 2.1>,
      <abs ABSG = 1 
       data hash MD5: 32K
       CB E9 E4 3A BE 4F 00 38 E4 19 3F A0 B8 1E C8 AC>)
(   5,<2012-04-14 20:33:52.546 -0500>,<Administrator>,<TOPSPIN>,<proc1d>,<TOPSPIN 2.1>,
      <abs ABSG = 2 
       data hash MD5: 32K
       24 9C 6E 41 10 35 4A 66 27 76 15 5E 43 A3 28 BA>)
(   6,<2012-04-14 20:33:52.578 -0500>,<Administrator>,<TOPSPIN>,<proc1d>,<TOPSPIN 2.1>,
      <abs ABSG = 3 
       data hash MD5: 32K
       8C 61 51 BB 6D 20 7A 50 A6 21 02 B7 DD C6 12 B7>)
(   7,<2012-04-14 20:33:52.625 -0500>,<Administrator>,<TOPSPIN>,<proc1d>,<TOPSPIN 2.1>,
      <abs ABSG = 4 
       data hash MD5: 32K
       61 BE 8D A9 B7 EE B2 4E 92 5D 4D C3 D1 5E 5F 93>)
(   8,<2012-04-14 20:33:52.671 -0500>,<Administrator>,<TOPSPIN>,<proc1d>,<TOPSPIN 2.1>,
      <abs ABSG = 5 
       data hash MD5: 32K
       71 34 65 F1 DB E3 48 4F 20 42 57 67 8A 43 09 07>)
$$ ##END=
$$ 
$$ $$ hash MD5
$$ $$ EE 84 A1 C4 A7 23 29 32 9E AE BA F4 CA 25 A6 22
##$RELAX= 
##$RELAX= 
##$RELAX= 
##$RELAX= 
##$RELAX= 
##$RELAX= 
##$RELAX= 
$$ Bruker specific parameters
$$ --------------------------
$$ [...]
##$TP= (0..7)
150 150 150 150 150 150 150 150
##$TP07= 0
##$TPNAME0= <>
##$TPNAME1= <>
##$TPNAME2= <>
##$TPNAME3= <>
##$TPNAME4= <>
##$TPNAME5= <>
##$TPNAME6= <>
##$TPNAME7= <>
##$TPOAL= (0..7)
0.5 0.5 0.5 0.5 0.5 0.5 0.5 0.5
##$TPOFFS= (0..7)
0 0 0 0 0 0 0 0
##$TUNHIN= 0
##$TUNHOUT= 0
##$TUNXOUT= 0
##$USERA1= <user>
##$USERA2= <user>
##$USERA3= <user>
##$USERA4= <user>
##$USERA5= <user>
##$V9= 5
##$VALIST= <valist>
##$VCLIST= <CCCCCCCCCCCCCCC>
##$VD= 0
##$VDLIST= <DDDDDDDDDDDDDDD>
##$VPLIST= <PPPPPPPPPPPPPPP>
##$VTLIST= <TTTTTTTTTTTTTTT>
##$WBST= 1024
##$WBSW= 4
##$XGAIN= (0..3)
0 0 0 0
##$XL= 0
##$YL= 0
##$YMAX_a= 491396
##$YMIN_a= -600750
##$ZGOPTNS= <>
##$ZL1= 120
##$ZL2= 120
##$ZL3= 120
##$ZL4= 120
##$ABSF1= 14.98061
##$ABSF2= -5.57192
##$ABSG= 5
##$ABSL= 3
##$ALPHA= 0
##$AQORDER= 0
##$ASSFAC= 0
##$ASSFACI= 0
##$ASSFACX= 0
##$ASSWID= 0
##$AUNMP= <proc_prof1d_extract_pilot.lims>
##$AXLEFT= 0
##$AXNAME= <>
##$AXNUC= <1H>
##$AXRIGHT= 0
##$AXTYPE= 0
##$AXUNIT= <>
##$AZFE= 0.1
##$AZFW= 0.1
##$BCFW= 0
##$BC_mod= 0
##$BYTORDP= 0
##$COROFFS= 0
##$CY= 15
##$DATMOD= 1
##$DC= 0
##$DFILT= <>
##$DTYPP= 0
##$F1P= 0
##$F2P= 0
##$FCOR= 0.5
##$FTSIZE= 32768
##$FT_mod= 6
##$GAMMA= 0
##$GB= 0
##$INTBC= 1
##$INTSCL= 1
##$ISEN= 128
##$LB= 0
##$LEV0= 0
##$LPBIN= 0
##$MAXI= 10000
##$MC2= 0
##$MEAN= 0
##$ME_mod= 0
##$MI= 0
##$NCOEF= 0
##$NC_proc= -8
##$NLEV= 6
##$NOISF1= 0
##$NOISF2= 0
##$NSP= 0
##$NTH_PI= 0
##$NZP= 0
##$OFFSET= 14.98061
##$PC= 1
##$PHC0= 211.8658
##$PHC1= 0
##$PH_mod= 1
##$PKNL= yes
##$PPARMOD= 0
##$PPDIAG= 0
##$PPIPTYP= 0
##$PPMPNUM= 2147483647
##$PPRESOL= 1
##$PSCAL= 4
##$PSIGN= 0
##$PYNMP= <proc.py>
##$REVERSE= no
##$SF= 400.13
##$SI= 32768
##$SIGF1= 0
##$SIGF2= 0
##$SINO= 400
##$SIOLD= 32768
##$SPECTYP= <>
##$SREGLST= <1H.CDCl3>
##$SSB= 0
##$STSI= 32768
##$STSR= 0
##$SW_p= 8223.68421052632
##$SYMM= 0
##$S_DEV= 0
##$TDeff= 65536
##$TDoff= 0
##$TI= <>
##$TILT= no
##$TM1= 0
##$TM2= 0
##$TOPLEV= 0
##$USERP1= <user>
##$USERP2= <user>
##$USERP3= <user>
##$USERP4= <user>
##$USERP5= <user>
##$WDW= 1
##$XDIM= 32768
##$YMAX_p= 460749742
##$YMIN_p= -808588
##$CURPLOT= <Network HP LaserJet P1505>
##$CURPRIN= <$Network HP LaserJet P1505>
##$DFORMAT= <normdp>
##$LAYOUT= <+/1D_H.xwp>
##$LFORMAT= <normlp>
##$PFORMAT= <normpl>
##$SURQMSG= 1
$$ End of Bruker specific parameters
$$ ---------------------------------
##NTUPLES= NMR SPECTRUM
##VAR_NAME=  FREQUENCY,     SPECTRUM/REAL,   SPECTRUM/IMAG
##SYMBOL=    X,             R,               I
##VAR_TYPE=  INDEPENDENT,   DEPENDENT,       DEPENDENT
##VAR_FORM=  AFFN,          ASDF,            ASDF
##VAR_DIM=   32768,         32768,           32768
##UNITS=     HZ,            ARBITRARY UNITS, ARBITRARY UNITS
##FACTOR=    0.250966925370066, 1,           1
##FIRST=     8223.43324360095, 73910,        -64555
##LAST=      0,             192879,          119301
##MIN=       0,             -808588,         0
##MAX=       8223.43324360095, 460749742,    0
$$ Real data points
##PAGE= N=1
##DATA TABLE= (X++(R..R)), XYDATA
$$ [...]
19466f5136K2589j2733q921k8734E1519e11903J27942D4035R1840d5206a9608
19454g0027B04406b47875l9059N8068a4264j46945J8966C7243K11297c53389F9107
19442a97922I6509b64653B02121e6763j11272c24B23736A08479b07924A23614
19431a40909H1227J02454F3358K97813h6295L4419m0795b9858k5942j09872O981
19420a58691C6768i5899B12387a79849O8728j39930P4521a9119l670I2346b68578
19408b45219D2019A1444a23540A61833b72219J13355B15317d4340A97106b80077
19397d23617d4235A03517B7291b59046D0686c156A51920a34066D7753a48433A23135
19385b12267N5340F5393L5634a00751B13008c5705m25265a62868n5508e6093A11646
$$ plain form
19466 -65136 -42547 -55280 -64201 -92935 51519 -511903 -383961 44035 135875 -45206 -19608
19454 -70027 204406 -247875 -286934 -228866 -14264 -161209 -142243 37243 248540 -353389 69107
19442 -197922 96509 -264653 202121 -56763 -168035 -324 223736 108479 -207924 123614
19431 -140909 81227 183681 63358 361171 -86295 -51876 -92671 -29858 -55800 -165672 -158691
19420 -158691 36768 -95899 212387 -179849 -111121 -251051 -176530 -19119 -22789 92346 -268578
19408 -245219 42019 11444 -123540 161833 -272219 -158864 215317 -44340 197106 -280077
19397 -423617 -44235 103517 27291 -259046 40686 -3156 151920 -134066 47753 -148433 123135
19385 -212267 -156927 65393 101027 -100751 213008 -35705 -460970 -162868 -218376 -56093 111646
19373c19834J39677Q0056j16659a07519A12714g4720k69112P0140a7198j7101
19363c4299F816a44862M1758l25804i9545M5746C4759c77591h6087B894K28666
19352B31560c06349f6034a6615B35999H2857c67499P2900D4482a38524A04222
19341C35989b56244A13849b32363J03185J7714c1159k12637a02394D645J0836
19331A5481a35416b0564k28232G040a58307K2937f1801j0153C1003j19c0633A31016
19318c44983k229A9687B707c7203k47643C03688c44340G5967d10596g2540D9763
19306b80662J6580d2373k56178P1178o6906i5367L3565l64722a44767d2023A5274
19294c8488Q012d829E8786B8854c26382c6754p0558a2262A31329a42499j90670
$$ plain form
19373 -319834 -180157 -100101 -216760 -107519 112714 -74720 -343832 -273692 -17198 -34299
19363 -34299 6816 -144862 -103104 -428908 -99545 -53799 34759 -377591 -86087 2894 231560
19352 231560 -306349 -66034 -16615 235999 82857 -367499 -294599 44482 -138524 104222
19341 335989 -256244 113849 -232363 -129178 -111464 -31159 -243796 -102394 4645 15481
19331 15481 -135416 -20564 -248796 7040 -158307 -135370 -61801 -71954 31003 30884 -30633 131016
19318 -344983 -347212 19687 2707 -37203 -284846 303688 -344340 75967 -410596 -72540 49763
19306 -280662 -264082 -42373 -298551 -227373 -294279 -95367 -61802 -426524 -144767 -42023 15274
19294 -38488 -30476 -4829 58786 28854 -326382 -36754 -107312 -12262 131329 -142499 -333169
19283c33169B03766a29330k29316d3818E5049b23648j58690g2288A4088a16019
19272H7917h9105j45169L6150K1768c3184k67724C6879a15909A321a1545q6493
19261i8038H6132a89503H5289B8106k617a40950a7048k40440c3495C7238c3860
19249f8135j543o9443r0971Q5223b7498p5537k81607a90711A70214b34181C3992
19237A46592a20855A78834D934L2160a80517B40831a39170B06388b02766J8489
19227a84277o5793J17264M1222l07542B81329b29891B49130c1024p1404C8846
19216f7615J760j34732P2394I441A569R3245a90835Q4568I7232g353j57265B55395
19203C1673e752l73623a43897A01157l135c05577a40302F1554a1926A52372b36553
$$ plain form
19283 -333169 203766 -129330 -358646 -43818 55049 -223648 -382338 -72288 14088 -116019
19272 87917 -89105 -234274 -198124 -176356 -33184 -300908 36879 -115909 1321 -11545 -98038
19261 -98038 86132 -189503 85289 28106 25489 -140950 -17048 -257488 -33495 37238 -33860
19249 -68135 -69678 -139121 -230092 -144869 -27498 -103035 -384642 -190711 170214 -234181 33992
19237 146592 -120855 178834 4934 37094 -180517 240831 -139170 206388 -202766 -184277
19227 -184277 -250070 -132806 -91584 -399126 281329 -229891 249130 -31024 -102428 38846
19216 -67615 -65855 -200587 -128193 9441 1569 94814 -190835 -106267 97232 -7353 -164618 255395
19203 31673 -5752 -379375 -143897 101157 98022 -305577 -140302 61554 -11926 152372 -236553
19191D7985a85217b4776k11369D17798c13128C02632h5643j97478b754k81717
19181b84471j9010J39003c0747F7900a27150M7794l93686b21439j23444a12292
19170A76189k3998g9883n4913F0180a64807d6524j02278A5288a07931A40690N8121
19159A98811a19790j12675B6871L878J3860K16608b60431A29677c17431A8337
19148A70683o3773R1946k8314e6333B00754c52056E5358a03420A5100L1945e8329
19136a88014P2487g372m44765J05839b9581j58727A46093g7493k80177d2818K969
19125c9849D6154c11506J20738p2468A60461a97694j28919J06010A02477j1640
19115I0837d20138b01310B8319a12591A23922C6462a89202A15167D71a85980b7060
$$ plain form
19191 47985 -185217 -24776 -236145 417798 -313128 302632 -85643 -283121 -2754 -284471
19181 -284471 -303481 -164478 -30747 67900 -127150 -79356 -473042 -221439 -344883 -112292
19170 176189 152191 -79883 -134796 60180 -164807 -46524 -148802 15288 -107931 140690 198811
19159 198811 -119790 -232465 26871 30749 44609 261217 -260431 129677 -317431 18337
19148 170683 106910 198856 170542 -56333 200754 -352056 55358 -103420 15100 47045 -58329
19136 -188014 -115527 -7372 -452137 -346298 -29581 -188308 146093 -77493 -357670 -42818 -39849
19125 -39849 46154 -311506 -190768 -263236 160461 -197694 -326613 -220603 102477 90837
19115 90837 -420138 -201310 28319 -112591 123922 36462 -189202 115167 471 -185980 -27060
19103A67070B5075b54497f3490j09259H525h0320C05938b76481a02870j26924
19093b29794K3999r6277h5612A52492a27310E06354c768j40210M0078D5043J53246
19082A98289a42146B13435J7832H6949a91751Q6510c9653A2061a65795B46488
19071A86300b96117n1908D6956c02436B39682A08087c33748D2632J52464A2111
19060h8680i806k03879O2285D2801J13162e865j60397P2837l8088B7905a93819
19048a15903D8022K89775C1933a34159L8217m0917B4429K746P766J82234b4251
19036c83534A36581D4213A796g0998J4697D3283J50365A4162e5312m665J6359
19025d3618B68283a00270F2708L23026i0995A19062a75862P9948A03768D8798
$$ plain form
19103 167070 25075 -254497 -63490 -172749 8525 -80320 305938 -276481 -102870 -229794
19093 -229794 -205795 -302072 -85612 152492 -127310 506354 -3768 -143978 -103900 45043 198289
19082 198289 -142146 213435 231267 86949 -191751 -105241 -39653 12061 -165795 246488
19071 186300 -296117 -348025 46956 -302436 239682 108087 -333748 42632 195096 12111
19060 -88680 -9806 -213685 -151400 42801 155963 -5865 -166262 -93425 -131513 27905 -193819
19048 -115903 48022 337797 31933 -134159 -95942 -136859 24429 27175 34941 217175 -24251
19036 -383534 136581 44213 1796 -70998 -56301 43283 193648 14162 -55312 -59977 -43618
19025 -43618 268283 -100270 62708 385734 -90995 119062 -175862 -95914 103768 48798
19014B29160a71510O9503a8183k68791B50617e2177B87207a20235A69386b0325
19003a10101A21659e148q4312l505A8656a88081b5062m4927J3249j10213A40308
18991C2101O3995K33784a40851B34182c2696m23819J57978h0938A43950b62374
18980b14172K9880A28340j5369d62076G7325A6990b27479B94413a74627c0009
18969a65533I6337P9872C7563j2609L74526a09996e3909B91464A42594J67375
18959C09969j06671K4078J58201j60199O9274H8542k7188B1175J67909L7079a84215
18947f590B66772b85760i2467C54353d22708d101q0230c4370k30271J01431r0537
18936b53747g8262J3172k88340C16186a73837o5283j00094J40290D6244b30457
$$ plain form
19014 229160 -171510 -102007 -18183 -286974 250617 -52177 287207 -120235 169386 -20325
19003 -110101 121659 -5148 -89460 -92965 18656 -188081 -25062 -69989 -56740 -166953 140308
18991 32101 96096 329880 -140851 234182 -32696 -456515 -298537 -80938 143950 -262374
18980 -214172 -184292 128340 112971 -462076 77325 16990 -227479 294413 -174627 -30009
18969 -165533 96337 176209 37563 24954 399480 -109996 -53909 291464 142594 309969
18959 309969 203298 227376 385577 225378 294652 88542 61354 21175 189084 226163 -184215
18947 -6590 266772 -285760 -92467 354353 -422708 -4101 -84331 -34370 -264641 -163210 -253747
18936 -253747 -78262 -65090 -353430 316186 -173837 -239120 -339214 -198924 46244 -230457
18925d079j56509O9066k9827j77814g123m11231a48733q1065B11909I6384a45283
18913c19415J34002c4924l9744L0289j15429D35279B5560i1144H248a95775N9235
18902a36540G6703B1588a35643I9059a00226B35646o2810Q3132R5098M1598e9885
18890a3798B34814l0701c3261E7651a8106o7565q111D9258M4413a00282K7118
18879g3164k11716h9044j41293G7438K04106G1967a90862R3264j87541a27846
18868c26359J51236B31501n0612a84928D8665P1591a46166b5062j43594L6744
18858a31912o1749B7395b11841P4743b7097H4137L7662B0194a29722k32574D3809
18846D97209A63679a43955J2564C5016b38622O1342A66045A7247b3404B40459
$$ plain form
18925 -4079 -160588 -91522 -121349 -299163 -7123 -418354 -148733 -229798 211909 96384 -145283
18913 -319415 -185413 -34924 -74668 -44379 -159808 435279 25560 -91144 8248 -195775 -136540
18902 -136540 76703 21588 -135643 99059 -100226 235646 172836 255968 351066 392664 -59885
18890 -13798 234814 204113 -33261 57651 -18106 -85671 -93782 49258 93671 -100282 -73164
18879 -73164 -284880 -89044 -230337 77438 281544 71967 -190862 -97598 -285139 -127846
18868 -326359 -175123 231501 180889 -184928 48665 120256 -146166 -25062 -168656 -131912
18858 -131912 -193661 27395 -211841 -137098 -27097 84137 121799 20194 -129722 -362296 43809
18846 497209 163679 -143955 -131391 35016 -238622 -177280 166045 17247 -23404 240459
18835a38401O0163E1660A8926a32074D21348r9968A20935c1673j6986C8663c0733
18823c46255A40476j1907K8172F6597K56638A7981d850k90672l5978d3364m2087
18812h5451l36981P3317L0133D9583M1353b9812B4008J76288b09763R6238j33304
18801b46829D5991N9728e807I7156c9033a6053A00948L7843e2614A63542e2436
18789B7312a50774A48690b28783G7157d9189p2855A39640Q6941b42508m50290
18779f92798A45685g4088c6755A17791D5355i7883k29080A11988a03139M2218
18769f0921A35552m8112b46682l4800B22074A07512b76721I6495a18644A17727
18758a05252A27023a0169j71168Q0241k7334C2795a57322g0925c153A00277K1767
$$ plain form
18835 -138401 -78238 51660 18926 -132074 421348 321380 120935 -31673 -48659 38663 -30733
18823 -346255 140476 128569 156741 66597 323235 17981 -4850 -295522 -331500 -43364 -85451
18812 -85451 -422432 -349115 -318982 49583 90936 -29812 24008 200296 -209763 -113525 -246829
18801 -246829 45991 105719 -5807 97156 -39033 -16053 100948 138791 -52614 163542 -52436
18789 27312 -150774 148690 -228783 77157 -49189 -122044 139640 226581 -242508 -692798
18779 -692798 145685 -74088 -36755 117791 45355 -97883 -326963 111988 -103139 -60921
18769 -60921 135552 87440 -246682 -281482 222074 107512 -276721 96495 -118644 117727
18758 -105252 127023 -10169 -181337 -101096 -128430 32795 -157322 -70925 -3153 100277 122044
18747A22044j4131b55516c1369a2010r6697B56672b58061o3866N1688H7521C3662
18735B8765L7646J4184a71075A60322a54146L0895q1541r4113e7945j23126a9756
18723a831l3598n8613j96502n3332B17978c0478j39348j70603J14071R7055p5770
18712b05073B53330a39982G9885d1281l01882C7202c97951a939j4810I8389K8920
18701A27309o0613d65960a34092m036A39202a98251I8941a3583A84257o550a98235
18689d8950k36395O0777A15219c02556c5883m99427b00602A41361o6309a34070
18678D1139b15059A09920b18700F1311i6129K1888j48477Q6472j94956F5799R7589
18667A63388a20600A7653J22962b93302J23737O622e1393B2793M2214k5858a91415
$$ plain form
18747 122044 107913 -255516 -31369 -12010 -108707 256672 -258061 -321927 -270239 87521 33662
18735 28765 66411 80595 -171075 160322 -154146 -123251 -204792 -298905 -57945 -181071 -19756
18723 -1831 -35429 -94042 -290544 -343876 217978 -30478 -169826 -340429 -226358 -129303 -205073
18712 -205073 253330 -139982 79885 -41281 -343163 37202 -397951 -1939 -16749 98389 127309
18701 127309 66696 -465960 -134092 -138128 139202 -198251 98941 -13583 184257 177707 -198235
18689 -48950 -285345 -224568 115219 -302556 -35883 -535310 -200602 141361 75052 -134070
18678 41139 -215059 109920 -218700 61311 -96129 -74241 -222718 -136246 -331202 65799 163388
18667 163388 -120600 17653 140615 -293302 -169565 -162943 -51393 22793 65007 39149 -191415
18655A35923k1284j7937a76316O1471A80966a42164j28725F0261b68167G7972
18644h4760j71296A68625C0173c64277a73716d2694a17k23439i5746o471q152
18633a10369p314J835F6267a57463A20789n360c23855C3838K9171e6G5667h5639
18620a70298b0296m30420B0348e29184K26477M3663a18828A22358c11232a27616
18609a4723k3316A0795Q6390J38957n7796a27817A2457e5688b1132k03689r3188
18598c18009B02390J0167d78700g6458j04416d5547B4761D474J33237M1986b34912
18586a10638B48176g4356K135D2544h1336C29368K7615a36964B9399a67937f970
18574A45833p2565b47237a3344B9108B079P5828J85946b6715k09423A49001b84690
$$ plain form
18655 135923 114639 96702 -176316 -114845 180966 -142164 -270889 60261 -268167 77972
18644 -84760 -256056 168625 30173 -364277 -173716 -42694 -117 -223556 -95746 -102217 -110369
18633 -110369 -117683 -115848 66267 -157463 120789 115429 -323855 33838 63009 -56 75667 -85639
18620 -170298 -20296 -450716 20348 -529184 -302707 -259044 -118828 122358 -311232 -127616
18609 -14723 -38039 10795 97185 236142 178346 -127817 12457 -55688 -21132 -224821 -318009
18598 -318009 202390 212557 -478700 -76458 -180874 -45547 24761 4474 137711 179697 -234912
18586 -110638 248176 -74356 -72221 42544 -81336 329368 356983 -136964 29399 -167937 -6970
18574 145833 73268 -247237 -13344 29108 2079 77907 263853 -26715 -236138 149001 -284690
18562a14424l27751D1061K6110a92035A66146f0567G634a51505j1671P3926j97194
18551b86444q4715i2612B16916e7605I0757G045b42581i1340r5657F3256N9470
18540A22726h1263j22333G363a71448B6910a5732C5299L9225C6568b61569g2597
18528b07726f2272a9825B15542a20943o3891j52929a31336B7494L567c4577g282
18516d3521J5498l94426A13924J10985j0342g4217q4056d6081m9230D0991c79861
18504c8906m5389k3964j96581B39384i5784n0945I0977J13800D7985C05a29826
18492a51718N7687A86183f6214J3070B10893a00788D7764b07881a9268j55352
18482a74620j07835A19755J2018J41244a58556d4163j15616G4872a95957A78124
$$ plain form
18562 -114424 -442175 41061 67171 -192035 166146 -60567 7634 -151505 -163176 -89250 -286444
18551 -286444 -371159 -92612 216916 -57605 90757 7045 -242581 -91340 -186997 63256 122726
18540 122726 -81263 -203596 7363 -171448 26910 -15732 35299 74524 36568 -261569 -72597
18528 -207726 -62272 -19825 215542 -120943 -184834 -337763 -131336 27494 31061 -34577 -7282
18516 -43521 -28023 -422449 113924 224909 214567 -74217 -158273 -46081 -95311 40991 -379861
18504 -38906 -84295 -108259 -304840 239384 -95784 -146729 90977 204777 47985 305 -129826
18492 -151718 -94031 186183 -66214 -53144 210893 -100788 47764 -207881 -19268 -174620
18482 -174620 -282455 119755 131773 273017 -158556 -44163 -159779 74872 -195957 178124
18471b08915C23070A43899f3438J4001I2954P6900o1412b0010k0976r5205B68611
18459A23490b3456m07681D47720c25843g9211j05262A8949Q4365d10864b3435
18448G321b25310B57123E5437A6474M49110b04160Q6553I4856k9770L26947d0254
18436a79271C38720C1524a65127D72888j19473a41694L9058B67836b0333k02842
18426b23175A08361b46752K0715k611A38393J09818o1162b61256A44280b06613
18415A12138c7058j4375j49419M2391r4355a1587B10418a47132e2453A59741a49756
18403g1183k64851C5242i8892q4312A4749b64655b3912A26017c86638l1519f0139
18391B44736b75167b2629j10766I8918d4303E3011L75721A25177K59063b79612
$$ plain form
18471 -208915 323070 143899 -63438 -49437 92954 169854 108442 -20010 -40986 -136191 268611
18459 123490 -23456 -431137 447720 -325843 -79211 -184473 18949 103314 -410864 -23435
18448 7321 -225310 257123 55437 16474 465584 -204160 -117607 94856 65086 392033 -40254
18436 -179271 338720 31524 -165127 472888 353415 -141694 -102636 267836 -20333 -223175
18426 -223175 108361 -246752 -226037 -228648 138393 248211 187049 -261256 144280 -206613
18415 112138 -37058 -51433 -200852 -158461 -252816 -11587 210418 -147132 -52453 159741 -149756
18403 -71183 -336034 35242 -98892 -183204 14749 -264655 -23912 126017 -386638 -418157 -60139
18391 244736 -275167 -22629 -133395 98918 -44303 53011 428732 125177 384240 -279612
18380b72978A12873a94132B08268m3892n5061D4387J92945a06235p02353h3667
18369a36714B10446b26142h5372k1422j7287b2208A54395G105d1723l4151k21815
18358b97689C3586b85528a6471A17751a03862d1231B94252a71390k45279a08675
18347a41976P0047k18206G9920J63505A13807n4121Q3837B3032c58750F218a47619
18335c2990o2413E9973g0765E9258c9664m6657n902G7881R4104k0657b65967J04363
18323a61604D3883b26270J01258m1225D9167b76370d2004A96134o2274a22746
18312a694F4921O9114b17961E5018O571a7567D5492a11959j6205j2845c485j71746
18300a75231N2626c5449A10308k817b4209A02177b78256G6818a15785D57574j88444
$$ plain form
18380 -272978 112873 -194132 208268 164376 109315 44387 237332 -106235 -808588 -83667
18369 -136714 210446 -226142 -85372 -106794 -124081 -22208 154395 7105 -41723 -75874 -297689
18358 -297689 33586 -285528 -16471 117751 -103862 -41231 294252 -171390 -416669 -108675
18347 -141976 -71929 -290135 79920 243425 113807 59686 143523 23032 -358750 6218 -147619
18335 -32990 -95403 59973 -70765 59258 -39664 -86321 -92223 77881 171985 151328 -265967 -161604
18323 -161604 43883 -226270 -125012 -166237 49167 -276370 -42004 196134 133860 -122746
18312 -1694 64921 134035 -217961 55018 61589 -17567 45492 -111959 -128164 -141009 -3485 -175231
18300 -175231 -122605 -35449 110308 107491 -24209 102177 -278256 76818 -115785 457574 269130
18289B69130a35710D4738J02805D1207a17889A62814a93277d9677a7992C56599
18278A36917c83490a23369i701r5474K9979D430a86235A17317a19026C96103g0617
18266B31160b58053J14484j40611A53266K0187F4551J89675p1293d49810a01104
18255C3409a0553l3929p7128d2486k15460c8792j0957G7185j1610d6655A1925
18243B5598H454b36848o9142E2916b43664j32485r5770J33301J56253f5353B216
18231i4538j33429o1544i1758c8523j5966B21587H2807b5113A62053a05017F9134
18219f0197j01120D4664K47847b01055Q0953K8919C42925h1146E1084K10153j13653
18208A47584o2136K75850i8427k66116G7600c8893C4847J01129b22375B49179
$$ plain form
18289 269130 -135710 44738 147543 41207 -117889 162814 -193277 -49677 -17992 356599
18278 136917 -383490 -123369 -9701 -105175 -75196 4430 -186235 117317 -119026 396103 -70617
18266 231160 -258053 -143569 -284180 153266 173453 64551 254226 182933 -449810 -101104
18255 33409 -10553 -44482 -121610 -42486 -257946 -38792 -49749 77185 65575 -46655 11925
18243 25598 8454 -236848 -305990 52916 -243664 -376149 -471919 -338618 -182365 -65353 2216
18231 -94538 -227967 -289511 -91758 -38523 -54489 221587 82807 -25113 162053 -105017 69134
18219 -60197 -161317 44664 292511 -201055 -120102 -91183 342925 -81146 51084 261237 147584
18208 147584 85448 361298 -98427 -364543 77600 -38893 34847 135976 -222375 249179
18197B13566o8275a75935A45525A2338M3570O7438a49616G2171J55495L3738K4195
18186B85599i1972D0828L14177d15008a21895A56988B8901O193J22297c33390
18175b06747R3087B73052j19025g9225j3063b9417I9841b15580A88373g4310I7508
18163c71942A2118n720b95800B54136M5185e9257B6036l505b29351C5557a91369
18151B91145p9947A04578i1178L7224B02687g667k92453c2060A96541a65107M3742
18140a21365l7102n1107k591B9517b55778G4052a74378g780b975I449a20048C49876
18127b16680C9687N2817m2188J00655b50859B52656f9979I4549b72533b0231A7933
18115F2381e1168j25559A14355a57953J1228B30535c23677o20C01796f3281F7937
$$ plain form
18197 213566 145291 -175935 145525 12338 55908 123346 -149616 72171 227666 261404 285599
18186 285599 -91972 40828 355005 -415008 -121895 156988 28901 35094 157391 -333390
18175 -206747 -113660 273052 154027 -79225 -92288 -29417 99841 -215580 188373 -74310 97508
18163 -371942 12118 6398 -295800 254136 299321 -59257 26036 22531 -229351 35557 -191369
18151 291145 211198 104578 -91178 -53954 202687 -7667 -300120 -32060 196541 -165107 -121365
18140 -121365 -158467 -209574 -212165 29517 -255778 74052 -174378 -7780 -2975 9449 -120048 349876
18127 -216680 39687 92504 50316 150971 -250859 252656 -69979 94549 -272533 -20231 17933
18115 62381 -51168 -176727 114355 -157953 -146725 230535 -323677 -324297 301796 -63281 67937
18103G1759K48906a8343Q457l09727B93671j30373J63464j38974A1985J65444
18093A77429B0656h4887I7948l1997K9824C1874J04734a39272j1328D836O7741
18082G2577K59991K04542B25256a79473E751J08251J72016f01k2907I0766K44557
18071C35323j45392E8939k4548g551j14255A01894m44b665D0726b44395B3716
18059b14965A86168m2343l6224e3043j8263j45057f0530C77902a11970c2159E979
18047a66925B96504a51595F1331f4204H734c87835c0561H8630H275b61506a8708
18035a6225A57477c0983l41700a69915C877c0835k6662A99416R5466d2583A78289
18023D32022b4699A32649d66849g0730A0346J80287I2441K22302H5635b2975k7100
$$ plain form
18103 71759 320665 -18343 -9886 -319613 293671 163298 326762 187788 11985 177429
18093 177429 20656 -84887 97948 65951 95775 31874 136608 -139272 -150600 4836 72577
18082 72577 332568 537110 225256 -179473 5751 114002 286018 -601 -23508 90766 335323
18071 335323 189931 58939 34391 -7551 -121806 101894 101450 -2665 40726 -244395 23716
18059 -214965 186168 143825 107601 -53043 -71306 -216363 -60530 377902 -111970 -32159 5979
18047 -166925 296504 -151595 61331 -64204 8734 -387835 -30561 88630 8275 -261506 -18708
18035 -16225 157477 -30983 -372683 -169915 3877 -30835 -57497 199416 294882 -42583 178289
18023 432022 -24699 132649 -466849 -70730 10346 190633 92441 314743 85635 -22975 -50075
18012e0075A08183B9591a01247A31000l6559O1462D9114a51541B31847g5339a0458
18000h1527j3376j16812A60379b61702R2381B27503a2726B8123M29873f5372k43328
17989c08700F7163B5107c95041A21523f2499B8488K80231A09050B5206a64673
17978a24935L9112n4548K4057J6229A13795M6547n7501a92277p0440N2611j85540
17967c95646b1729B72395b32803N2792A68536e5100l5511c5330B60617I7811J35653
17956B33464a62917N8055I0360g6159A47655a74722k5048A38820i2604l0516j94904
17945c18024A41912D8392K29410i5886B02553b13117F5570b14197b9504j77723
17935b07227N5676A87963B8554a29527D8405a56067e5663A97418a45636C33457
$$ plain form
18012 -50075 108183 29591 -101247 131000 94441 155903 49114 -151541 231847 -75339 -10458
18000 -81527 -94903 -211715 160379 -261702 -169321 227503 -12726 28123 457996 -65372 -308700
17989 -308700 67163 25107 -395041 121523 -62499 28488 308719 109050 25206 -164673
17978 -124935 -85823 -140371 -116314 -100085 113795 160342 102841 -192277 -262717 -210106 -395646
17967 -395646 -21729 272395 -232803 -180011 168536 -55100 -90611 -35330 260617 97811 233464
17956 233464 -162917 -104862 90360 -76159 147655 -174722 -199770 138820 -92604 -123120 -318024
17945 -318024 141912 48392 277802 -95886 202553 -213117 65570 -214197 -29504 -207227
17935 -207227 -151551 187963 28554 -129527 48405 -156067 -55663 197418 -145636 333457
17924A80795J01285G4250J80065c1977j23298B3249a19971d9484a1518m6423j7370
17913g5311C1474J18227L43319c8944B0875J02874K3879f3553B53507b7225E2117
17901B97746F0607b29950H7165l9908K949J28900A4359a62393g4677n6619d4013
17889A77336R950M2829f784k72968H0177J17046b7676B04005C9125J05875N3049
17878A98049A6598c3641l7557I0332J20404k5940O3415p434j8695g0364b418A56210
17865a54402B50510e1048j54p9925C7357M7519b75133N9647n3837A75872C5599
17853B47380a3075A39783c91031c4028B54996b60569D7843j5543J19179k774J16944
17842B65649A02781O5832h2906A37452I923L53205A64790A3326d8203l659j01560
$$ plain form
17924 180795 282080 74250 254315 -31977 -155275 23249 -119971 -49484 -11518 -57941 -75311
17913 -75311 31474 149701 493020 -38944 20875 123749 147628 -63553 253507 -27225 52117
17901 297746 60607 -229950 87165 47257 50206 179106 14359 -162393 -74677 -131296 -44013
17889 177336 187286 230115 -6784 -279752 80177 197223 -27676 204005 39125 145000 198049
17878 198049 16598 -33641 -71198 90332 210736 184796 248211 240777 222082 -70364 -2418 156210
17865 -154402 250510 -51048 -51202 -131127 37357 84876 -275133 -215486 -269323 175872 35599
17853 247380 -13075 139783 -391031 -34028 254996 -260569 47843 32300 151479 148705 265649
17842 265649 102781 168613 -82906 137452 9923 363128 164790 13326 -48203 -51862 -153422
17831a53422A42271a09172l2906P0393A75641G2188L14839g0525k5770B87988
17820A38357J96587E5870a26621L7528F9433C3423O4413A428L3090J17651d4229
17808B1917a82440B34882j2714l8422J04244E2646a35571B4067c6776k29516g9843
17796a13215d0341j7600A66222G9803j9687J9258J99547q1854Q8564A12897b7801
17784A16117l7960J2800d5760k3333A61063L39304o2037D7442j1824J98561j6723
17773B17456K7036b00406k82937a22181I7072M966o608K7170b5735B60172b69809
17761a88789A73930E8352d2482j08988n0630D007P9048K5818a63134B18745a6387
17749a44963K8326A85065a27366D32796a96559P7939A70215N1355H9873P8560
$$ plain form
17831 -153422 142271 -109172 -142078 -71685 175641 72188 387027 -70525 -96295 287988
17820 138357 334944 55870 -126621 -89093 69433 33423 97836 1428 34518 152169 -44229
17808 21917 -182440 234882 222168 183746 287990 52646 -135571 24067 -36776 -266292 -79843
17796 -113215 -40341 -57941 166222 79803 60116 79374 278921 197067 285631 112897 -27801
17784 116117 78157 90957 -45760 -69093 161063 500367 438330 47442 35618 234179 217456
17773 217456 244492 -200406 -483343 -122181 97072 102038 95430 122600 -25735 260172 -269809
17761 -188789 173930 58352 -42482 -151470 -202100 4007 83055 108873 -163134 218745 -16387
17749 -144963 -116637 185065 -127366 432796 -196559 -118620 170215 221570 89873 168433
17739A68433J22222q4520B3974J29643k4197i8098A88171M5533n3219a60626D66033
17727B78403A4954L9783a55657D1666c0120A84917R5377G548a49071C06463q6084
17716B20379m002p8164b7614j59364G8526e3475A26392M3250K39494b02517C13171
17704d4715j60146B6533K3437a0610r4909D0288J15458L80269a08341d70k24503
17693b24973B45179J62246H2189R2853H1757b3264A60254J82611a0857E6426B1424
17681f2442E1096b512l66258B6602L5429L00840G8101J80421a24302e7034C5607
17669B44034o9731e835k49484F6651K17516j04777n9636J00764J5991e3167b5104
17657e605A03941N6888b02007f9907L2341B5322O1453R3913B9521b7494F18625
$$ plain form
17739 168433 290655 206135 23974 153617 129420 -98098 188171 233704 180485 -160626 466033
17727 278403 14954 54737 -155657 41666 -30120 184917 280294 7548 -149071 306463 220379
17716 220379 216377 138213 -27614 -186978 78526 -53475 126392 169642 409136 -202517 313171
17704 -44715 -204861 26533 49970 -10610 -105519 40288 155746 536015 -108341 -470 -224973
17693 -224973 245179 407425 82189 175042 81757 -23264 160254 342865 -10857 56426 21424
17681 -62442 51096 -2512 -368770 26602 62031 362871 78101 258522 -124302 -57034 35607
17669 244034 174303 -5835 -255319 66651 284167 179390 119754 220518 236509 -53167 -25104
17657 -5605 103941 160829 -202007 -69907 -37566 25322 86775 180688 29521 -27494 618625
17645E2057K13462A30642j7135R4840a5695j27090M5K9138A73647O5087a43383
17633B6283f313r5040d391m1532D342L70981A04102J56061M3684j44557R7074
17622B56364o4141C8954G508J78703g5643A58288D7268M28055G3684J32053A4844
17610A3213e3495A92824C6310J80655R6822A56229M5015H6528d1503F8535J3865
17599H2400J99212j26069K1699P376K03477j86338A068J3477N6237K48650c05570
17587B2166K06777g3295A14758b9857n702C7434J39306D6756P1088L0543N8488
17576B06875M178b35721B71081I6587R0881l1021a82248D19113K23339A10027
17565B0634e6056F9347J69102n8419K76804o7066I7025K83013b47368F9308K11052
$$ plain form
17645 52057 265519 130642 113507 208347 -15695 -142785 -142740 -113602 173647 238734 -143383
17633 26283 -6313 -101353 -4391 -45923 4342 375323 104102 260163 303847 159290 256364
17622 256364 192223 38954 7508 186211 -75643 158288 47268 475323 73684 205737 14844
17610 13213 -53495 192824 36310 216965 313787 156229 201244 86528 -41503 68535 82400
17599 82400 281612 155543 177242 184618 388095 201757 1068 14545 70782 319432 -305570
17587 22166 228943 -73295 114758 -29857 -35559 37434 176740 46756 117844 148387 206875
17576 206875 211053 -235721 271081 96587 187468 156447 -182248 419113 642452 110027
17565 20634 -56056 69347 238449 180030 456834 389768 97025 380038 -247368 69308 280360
17554B80360k6993E8131M8885c9685C6138J53316k1811K8437a52734C2310K68045
17543C00355c2837n5220D3617N6245l9435K79412q4006H3003N2986L17785A02559
17531C73807j39000J02595k2758Q449N7240q2360k1872L3575F7251K59457A17706
17519D7655B2851K56028j5090L10992Q1271B59573K74461k8481K35509m0814J84717
17508H84965j72384J82834k3117j11411k68749j38983k6671j30339L48726B28664
17497D21698M19942J08764k8696L00259l08233k0840l17176P9775j88937A31516
17486F87908l3487C02514J3924j25112K17055M9015B07488J21819j3630M01889
17476G17566A90924K28786j89540l7698K44137l1410A87914K44243J0802F5296
$$ plain form
17554 280360 253367 58131 107016 -39685 36138 189454 167643 196080 -152734 32310 300355
17543 300355 -32837 -88057 43617 99862 60427 339839 255833 83003 135989 453774 102559
17531 373807 234807 337402 314644 323093 380333 297973 276101 309676 67251 326708 117706
17519 47655 22851 278879 263789 574781 656052 259573 534034 505553 741062 700248 884965
17508 884965 712581 895415 872298 760887 492138 353155 326484 196145 544871 228664
17497 421698 841640 950404 921708 1221967 913734 892894 575718 655493 466556 131516
17486 687908 654421 302514 316438 191326 408381 457396 207488 329307 315677 717566
17476 717566 190924 419710 230170 192472 436609 405199 187914 432157 442959 65296
17465D58947j04062j59477P8838K161I2261J73995K08178A61913K29166j28962
17455B62117J1601J43177j57143K14592A3862L00162N577p7192j00846Q4509K52525
17444D78597C9605J19952B8657L75454J28335k50364J10553j01512O6781j26781
17434B31123R2944K13737a4218B36011m9627M30814A90817L91323E5988L80720
17424D36708j9715B5161N63270B10086P1437J72181j32386K21750j05839i6309
17413D54615B21461J37436A19048L04595A26928L79441j84485L23083D8288K35701
17403B83989H6914K69948A39810J07557j7179K41232j30728L7889k3942d9071
17392A68477J70761q1954A07050b369G7626M37282B45251R9870j2885b94058B13145
$$ plain form
17465 458947 354885 195408 274246 276407 92261 266256 474434 161913 391079 262117
17455 262117 273718 416895 259752 474344 13862 314024 319601 242409 141563 226072 478597
17444 478597 39605 159557 28657 404111 532446 282082 392635 291123 357904 231123
17434 231123 324067 537804 -14218 236011 186384 617198 190817 582140 55988 436708
17424 436708 416993 25161 588431 210086 281523 453704 321318 543068 437229 -96309
17413 454615 221461 358897 119048 423643 126928 506369 321884 644967 48288 283989
17403 283989 86914 356862 139810 247367 230188 471420 340692 378581 354639 -49071
17392 168477 339238 257284 107050 -2369 77626 514908 245251 345121 332236 -294058 213145
17380A34288M6088Q5865L20653q3904J17721k39158p1293J49484A88118n5780
17370A32338K21982J28926A73562K86755A91823p2371K02978I6357L81625B14626
17359a95321A05911E763N59798A68695B3725L02495m7984j33676k0003L01661
17349D26218k08862K52345j26731J21782B02976L5692N1434j22122Q7951n3961
17339B01970N0266D5788L08386j39235E5758J87600L3765P9263K445J09899j20751
17328C47979L0163J39375k3400j06745a27631A21390J96817A37160B2440R4097
17318A16537J79935M3541i6056G4876K13408J83197C1388J15838l7647J99252
17308C08831A35230Q2838M5981J75943j16542J00503A58876L80760A71695k0520
$$ plain form
17380 134288 180376 266241 586894 502990 620711 381553 310260 459744 188118 132338
17370 132338 354320 483246 173562 460317 191823 119452 322430 96357 477982 214626
17359 -195321 105911 5763 565561 168695 23725 326220 278236 144560 124557 426218
17349 426218 217356 469701 342970 464752 202976 238668 290102 167980 255931 201970
17339 201970 252236 45788 354174 214939 55758 243358 277123 356386 358831 468730 347979
17328 347979 378142 517517 494117 387372 -127631 121390 318207 137160 22440 116537
17318 116537 296472 340013 -96056 74876 288284 471481 31388 147226 109579 308831
17308 308831 135230 218068 264049 439992 323450 423953 158876 539636 171695 151175
17298A51175J84079M6537j55515l1612K8331O304K93039B03260I7900C4662L66175
17287D00837j0988Q4292m5701A32773d4455B21095p1225m9147K81000o6422o8703
17276B46598J56386b7310C80851A20149L56804j04135L294a45694B01802K15427
17266D17229j80737K65036k28667q8628B8168L06699m3850n8066L7818K40515
17256E11284B43652F8974K31637M3722q5235I2684L17052A92285K30525q5531
17246C37279A52839L11655j98462L49489B58744m5922H906L30845p2388L2097
17236B99460K83142j33911B8471M24920M4383o4482L2200J04462k22942J7533
17226C64545A75275N27388a941C24263B6344O2543Q4826D0822L73891J09682j64836
$$ plain form
17298 151175 335254 381791 226276 194664 222995 229299 522338 203260 97900 34662 400837
17287 400837 389849 474141 428440 132773 -44455 221095 149870 100723 381723 315301 246598
17276 246598 402984 -27310 380851 120149 476953 372818 376112 -145694 201802 417229
17266 417229 236492 501528 272861 184233 28168 334867 291017 232951 270769 511284
17256 511284 243652 68974 300611 344333 259098 92684 409736 192285 422810 337279
17246 337279 152839 464494 266032 615521 258744 212822 8906 339751 267363 299460
17236 299460 582602 448691 28471 453391 497774 433292 465492 569954 347012 364545
17226 364545 175275 702663 -1941 324263 26344 88887 173713 40822 414713 524395 359559
17215C59559q1640Q1735A42214L51922K30397C29537L51571C18925M7373J48921
17205E15219J33554C12096N5119K15270k09071j05241k2781M6751p4147N47658
17195G65654B63546P6674A37093K06868Q5819j19253G5884M76025j82135L0486
17185D00260A73756L03305A91719L63076j72122J26670j16295J44901l1156N9231
17175E66024j13242j93587o7608J27130M35783k37422k3065J44810k06288K03449
17165F35984B48807M12821B60154k5887L6054M74785j61275j67717A0199L54234
17155C64433A48239L15992O9378O6100j11448N424j65988K04259L5686k36777
17145C30865J59473L4947k60162K95250l2469O6620k53066K89381J78269l47644
$$ plain form
17215 359559 277919 359654 142214 494136 724533 329537 681108 318925 366298 515219
17205 515219 648773 312096 367215 582485 373414 268173 245392 292143 217996 765654
17195 765654 263546 340220 137093 343961 429780 310527 75884 551909 369774 400260
17185 400260 173756 477061 191719 554795 382673 509343 393048 537949 506793 566024
17175 566024 452782 259195 191587 318717 754500 517078 494013 638823 432535 635984
17165 635984 248807 661628 260154 234267 270321 745106 583831 416114 10199 364433
17155 364433 148239 464231 533609 599709 488261 493685 327697 531956 567642 330865
17145 330865 490338 525285 265123 560373 527904 594524 341458 630839 809108 461464
17135D61464l2369R7585j61930K79137l0993k0470j73527l1212K06918J43404
17125G38007l09641j55079J31747A89394P8842K48345O1684k01138m9534L55862
17115F83455k94463K45247J53613k22473j23341n0786L3403L93283j2259l67061
17105D38618K8035K07247j80643K935j65107J70960K24097j17349j31016k8647
17095D49130p4092K33981j08766N784r0160K65615N925r5380K77266l26653L16238
17084H58888k52338k54590L88980C42206P5525L35627l66909L25259K3146B36413
17073F19412R5946P8899k15172M5018K54225p3499j01768P1576M3464l57743j6435
17062D43923K61802n880K11235k59588j91372M24430k6048M4333k32411o8643
$$ plain form
17135 461464 429095 526680 364750 643887 612894 592424 418897 387685 594603 738007
17125 738007 428366 273287 405034 189394 268236 516581 578265 377127 327593 683455
17115 683455 388992 634239 787852 565379 442038 391252 424655 817938 805679 438618
17105 438618 466653 673900 493257 496192 331085 502045 726142 608793 477777 449130
17095 449130 375038 609019 500253 506037 415877 681492 687417 592037 869303 542650 858888
17084 858888 606550 351960 740940 342206 417731 753358 386449 711708 734854 236413
17073 619412 715358 794257 579085 624103 878328 804829 703061 774637 818101 460358 443923
17062 443923 705725 699845 911080 651492 460120 884550 858502 902835 670424 601781
17052F01781N3422j60241L15093m3362J18453j87336R7275K45057m3586j0646
17042I85910l46349J97880J34388k6961k33619K44944k12098Q361N7018k06852
17032F02622M34539p9642k95432M68031m70356K00339R5691l83249K04906j81533
17022E95916L99101J94069l03254J02829j11975P5851J60781k35520K52325k04129
17012I25994k30171M32446K01128E77884J05834J28070L9124K28764k4004J92652
17002A248324l44223K02605n6105K176N0798q9895L33018k06706j63941J09450
16992A085501K22943r7287l41076N28770k76873k11663J13992O6755Q3804Q4508
16982A259374k27624K99315J1444j08388J49897l94016L04307j7491K15360l03999
$$ plain form
17052 601781 655203 494962 810055 766693 885146 697810 795085 1040142 996556 985910
17042 985910 639561 837441 971829 944868 711249 956193 744095 752456 809474 602622
17032 602622 1037161 957519 662087 1130118 659762 860101 955792 572543 777449 595916
17022 595916 995017 1189086 885832 988661 876686 952537 1113318 877798 1130123 925994
17012 925994 695823 1128269 1329397 577884 683718 811788 850912 1079676 1055672 1248324
17002 1248324 904101 1106706 1050601 1052777 1103575 1013680 1346698 1139992 976051 1085501
16992 1085501 1308444 1211157 870081 1398851 1121978 910315 1024307 1091062 1174866 1259374
16982 1259374 1031750 1331065 1342509 1234121 1384018 990002 1294309 1276818 1492178 1188179
16972A188179K80797o30105M89333J96509m31778L94094p4444m01330K27248l4704
16962A203799K21359m63233L30908Q5984N5814R1987k5059j12223J08127j2869
16952A484594J70636k55694K8172K4183o6523N3944J78224k23007M30597k99728
16942A525398j26879J99384k54390J38706K16177j48982N5003J56358P1949j94284
16932A638440J2989j15778L21530k3587l03354K24970k80549M57938l15288J50474
16922A767785J46383M7869k80651J14042J02018K12763q4133L15042m06663J90996
16912B125451k44328K07560R7602j78292Q5334R2768J56375j38658J08321k48760
16902B063373L13429k18100K13371l76737M23141l0439l20681M81080l74403N89181
$$ plain form
16972 1188179 1468976 838871 1328204 1524713 1092935 1487029 1412585 1011255 1238503 1203799
16962 1203799 1425158 961925 1292833 1378817 1434631 1526618 1501559 1389336 1497463 1484594
16952 1484594 1655230 1399536 1427708 1451891 1385368 1439312 1617536 1394529 1825126 1525398
16942 1525398 1398519 1597903 1343513 1482219 1698396 1549414 1604417 1760775 1832724 1638440
16932 1638440 1651429 1535651 1857181 1833594 1530240 1755210 1474661 1932599 1617311 1767785
16922 1767785 1914168 1962037 1681386 1795428 1897446 2110209 2026076 2341118 1934455 2125451
16912 2125451 1881123 2088683 2186285 2007993 2093327 2186095 2342470 2203812 2312133 2063373
16902 2063373 2376802 2158702 2372073 1995336 2418477 2388038 2067357 2548437 2174034 2763215
16892B763215j54290k50028O5457J55297p2330n4988O1626J08265J56082l13036
16882B465270L19230n8313J58817l26513M53438l59044L37349j45616l2400N7231
16872B869449L47279j14570m9970n8436R6421M44906r6115r1364N79P1832j1265
16861C408746N8565J19160p2198K99336J8476j00886L59472j41570J7953J00082
16851D067136j24438J26266o2667K04044K7185K16894j3663J22129j52409J7999
16841D428476m8931M55530l17208K5836J91201J89646J35087M56312m72054L29432
16831E373327j36329Q7881L60832l98107M12796K40235l23823M06512P7L6372
16821F059773J17041L33973K77746k1322l50003L82566K76033k01564J35655L08590
$$ plain form
16892 2763215 2608925 2358897 2424354 2579651 2507321 2452333 2513959 2622224 2778306 2465270
16882 2465270 2784500 2726187 2885004 2558491 3011929 2652885 2990234 2844618 2812218 2869449
16872 2869449 3216728 3102158 3052188 2993752 3090173 3535079 3438964 3347600 3348179 3420011 3408746
16861 3408746 3467311 3586471 3514273 3813609 3832085 3731199 4090671 3949101 3967054 4067136
16851 4067136 3942698 4068964 4006297 4210341 4237526 4454420 4440757 4562886 4410477 4428476
16841 4428476 4379545 4835075 4517867 4543703 4734904 4924550 5059637 5515949 5043895 5373327
16831 5373327 5236998 5324879 5685711 5287604 5700400 5940635 5616812 6023324 6023401 6059773
16821 6059773 6176814 6510787 6788533 6767211 6417208 6799774 7075807 6874243 7009898 7318488
16811G318488K43840m4930K23951J47456J05963L43002m05701N91992Q8008K18407
16801H830476K93096q2032K35382J68821N32848M7042K32609J33869K09175n4632
16791A0546654O76316m8088N32543j01003O76256P7669J86979L35216K90767M15145
16781A3588454K08279M9765N58703L12696M42749K46881O49730K92064O30949
16772A6980270L022M50536O95303L74139M84732P10069L68654O53068O59596Q07257
16762B2186646O19017L47648R97006Q38287O63480Q66635N92130J270159P75726
16753B9156734R08010J063689J109417Q40154J358113J179815J086781J275698
16745C7978411J530298J417953J485949J379666J890762J765911J312258J876760
$$ plain form
16811 7318488 7562328 7517398 7741349 7888805 7994768 8337770 7932069 8524061 8612069 8830476
16801 8830476 9123572 9041540 9276922 9445743 9978591 10025633 10258242 10392111 10601286 10546654
16791 10546654 11222970 11174882 11707425 11606422 12282678 12360347 12547326 12882542 13173309 13588454
16781 13588454 13796733 13846498 14405201 14717897 15160646 15407527 16057257 16349321 16980270
16772 16980270 16983292 17433828 18129131 18503270 18988002 19698071 20066725 20719793 21379389 22186646
16762 22186646 22805663 23153311 24150317 24988604 25652084 26518719 27110849 28381008 29156734
16753 29156734 30064744 31128433 32237850 33078004 34436117 35615932 36702713 37978411
16745 37978411 39508709 40926662 42412611 43792277 45683039 47448950 48761208 50637968
16737E0637968K299421J704749K047678K450174K194591J904280K707553K705006
16729F8651420K266832K732982K756412K337709K789178L027301K714392K709277
16721H9985503K671623L066559K515084K903710K496998K685476J846916K398144
16713A10570013J713984J695743J215224Q47813J290847N29750j33001J64388
16705A17894761q14138n88969p69541j406852j705106j509929k149588k158034
16697A06792604k546381k420975k533814k758311k738102k957888l291944k584878
16689H4960311k721209l095147k635695k497902k445476k865465k847080k361436
16681F3490901k565954j843533k419864j807672k392421j779105j895613j543094
$$ plain form
16737 50637968 52937389 54642138 56689816 59139990 61334581 63238861 65946414 68651420
16729 68651420 70918252 73651234 76407646 78745355 81534533 84561834 87276226 89985503
16721 89985503 92657126 95723685 98238769 101142479 103639477 106324953 108171869 110570013
16713 110570013 112283997 113979740 115194964 116042777 117333624 117863374 117730373 117894761
16705 117894761 117080623 116491654 115722113 114315261 112610155 111100226 108950638 106792604
16697 106792604 104246223 101825248 99291434 96533123 93795021 90837133 87545189 84960311
16689 84960311 82239102 79143955 76508260 74010358 71564882 68699417 65852337 63490901
16681 63490901 60924947 59081414 56661550 54853878 52461457 50682352 48786739 47243645
16673D7243645j765061k025985j323393j610221j367449j828664r33911j298444
16665C5090517r82629j480407j087576j117294o90011r10693j142535q79233j296910
16656B5503229o2450j170759o51468r00861n95198p05997o20462n42086m27653
16647A9826295n18019r22573m61023l70331m54631m07637p12039n6314m86088
16638A5437640l75960o85773r2489j01691p58877j65502n01197l4097m86156o98345
16628A1537553M33732p08647k37135R072p07637J40104k78576j81124l51289N5750
16618I711803k98737k26938m11334J36837k86858p1697j55703l17615j86612q4706
16608G808440j52038m93732J01596m4590j10803l3453j03163m77197Q3757r0191
$$ plain form
16673 47243645 45478584 43452599 42129206 40518985 39151536 37322872 36388961 35090517
16665 35090517 34107888 32627481 31539905 30422611 29732600 28821907 27679372 26800139 25503229
16656 25503229 25440779 24270020 23618552 22717691 22122493 21416496 20796034 20253948 19826295
16647 19826295 19308276 18385703 17924680 17554349 17099718 16692081 15980042 15923728 15437640
16638 15437640 15061680 14375907 14283418 14181727 13422850 13257348 12756151 12722054 12235898 11537553
16628 11537553 11971285 11262638 11025503 11034575 10326938 10467042 10188466 10007342 9656053 9711803
16618 9711803 9413066 9186128 8774794 8911631 8624773 8553076 8397373 8079758 7893146 7808440
16608 7808440 7656402 7162670 7264266 7219676 7108873 7075420 6972257 6495060 6578817 6488626
16598F488626K18927r4722j09625n09494q7132J26271q2318l6593n89814K04814
16588E528940J16651p44438N45575j81009k14897r6968k48085J42968P2165n2525
16578D868377k60070q3523m3937p5204j61532j36518Q9591J56326l71398J85755
16568D167867m68358K20517Q0821l67828J61793J37723n86843J62096J05514k32196
16558C381106J04445j4490M7809l32686J85465l66100L2964K48679M1528k40139
16548C088581o120k45994j80433K79980P026K34935k91082l56483M14343j07754
16538B836999k88707K55882m29532M75750l23421o1099K7647j78653K0458K99128
16528B634452m42275K17238m8625K21187l30341m949L2631j25511Q0554J41033
$$ plain form
16598 6488626 6707553 6612831 6503206 5993712 5906580 6032851 5950533 5913940 5324126 5528940
16588 5528940 5645591 4901153 5446728 5265719 5050822 4953854 4705769 4848737 4920902 4868377
16578 4868377 4608307 4524784 4480847 4405643 4244111 4107593 4197184 4353510 3982112 4167867
16568 4167867 3699509 3920026 4000847 3633019 3794812 3932535 3345692 3507788 3613302 3381106
16558 3381106 3485551 3471061 3518870 3186184 3371649 3005549 3038513 3287192 3328720 3088581
16548 3088581 3082461 2836467 2656034 2936014 2943040 3177975 2886893 2530410 2944753 2836999
16538 2836999 2548292 2804174 2374642 2850392 2526971 2465872 2493519 2314866 2335324 2634452
16528 2634452 2192177 2409415 2360790 2581977 2251636 2246687 2279318 2153807 2234361 2375394
16518B375394J53821j83819k36469r5598M18812m11499K41541j70961k87258O5127
16508A869091K49784J70729m50991M15591o01702p9486L23633K9934o8412J90567
16498B048738k95561P1756j61322L4887L6212j04565m021j22888J60878R615L5345
16487A709074j78558K85167j77579j8192j98065J28156J17780k4234j49051m8228
16477A446270o6557n7095K84941J26003p11146M73633j65542K38241k0825j23666
16467A424257J19279K95189n39841J45745n21018J54234j4509R8585K84011m03723
16457A042209K20860k03163J52913N7435j04215K02277q0379m13200L88698j99312
16447A064123K84841k02263p5223K0275L9248J94039j21983n07661L97427J33666
$$ plain form
16518 2375394 2529215 2345396 2108927 2013329 2432141 2020642 2262183 2091222 1803964 1869091
16508 1869091 2118875 2289604 1838613 2254204 1652502 1573016 1896649 1926583 1858171 2048738
16498 2048738 1753177 1824933 1663611 1698498 1734710 1630145 1626124 1503236 1664114 1673729 1709074
16487 1709074 1530516 1815683 1638104 1619912 1421847 1550003 1667783 1643549 1494498 1446270
16477 1446270 1379713 1322618 1607559 1733562 1022416 1496049 1330507 1568748 1547923 1424257
16467 1424257 1543536 1838725 1298884 1444629 923611 1077845 1063336 1161921 1445932 1042209
16457 1042209 1263069 1059906 1212819 1270254 1166039 1368316 1287937 874737 1263435 1064123
16447 1064123 1348964 1146701 1071478 1091753 1131001 1325040 1203057 695396 1092823 1226489
16437A226489k23054p828l18005N47477j73984K40924j04518O4199J7685k91294
16427I78091n7729O9722K0136M5521j27922j9814N807J22941L182J84035j89519
16416A034451l23957R1625K0825K10656j11001J21264E21676N38795J13351k78233
16406H95589M4723j79409j82533L08146m1371j99560R2636L55138k25554l75796
16396D92009M18786j69003j89211L57883m7328j63305P2272J33164r4088j29699
16386F81480K61934l92141L72069l75430K50206o5745K688K92915j94826k74518
16376E58632L8655M90483j67532j54821M6400B70350L96536J23712j93392O4845
16366F62051m2059J15987B06222M68865K8420j2164k70690M05027k23128J72622
$$ plain form
16437 1226489 1003435 995607 677602 1225079 1051095 1292019 1187501 1251700 1269385 978091
16427 978091 920362 990084 1010220 1055741 927819 908005 913812 1036753 1039935 1223970 1034451
16416 1034451 710494 802119 822944 1033600 922599 1043863 521676 1060471 1173822 895589
16406 895589 940312 760903 578370 886516 845145 645585 738221 1093359 867805 492009
16396 492009 910795 741792 552581 910464 863136 699831 772103 905267 811179 681480
16386 681480 943414 551273 923342 547912 798118 732373 735061 1027976 833150 558632
16376 558632 597287 1087770 920238 765417 811817 270350 666886 790598 597206 662051
16366 662051 619992 735979 206222 675087 703507 691343 420653 825680 602552 775174
16356G75174Q6528k93265K5530R8341R702j06134l733o1438J80320C07311j38665
16345A68646K69171J93806O4722l04621K41506j15505j01011J08514r416R1029
16335F06841J94472O2767k73485q0954L92771k22481q6546O2067N2182j60333
16325E47301k52920L74343j56616A35361N28154k4545k23590M51164l87885j0095
16315D68564K24583k67762N7068J9807J70498J57267C78581K8354H5393L86612
16305D72005G9765K50949J43878K91070l26154L81443C97594K0685O2265K91407
16295G71951k69971J43823p5393q6290J5256K40337k23674k53592N45620A79827
16284E84570j57896j7992j32163J59874J10302r8866k10264K62783r4037n2740
$$ plain form
16356 775174 861702 568437 593967 692308 702010 595876 592143 530705 711025 307311 168646
16345 168646 437817 631623 696345 391724 633230 517725 416714 525228 515812 606841
16335 606841 801313 864080 590595 509641 902412 679931 593385 655452 707634 547301
16325 547301 294381 668724 512108 135361 663515 638970 415380 866544 478659 468564
16315 468564 693147 425385 482453 502260 672758 830025 378581 406935 85393 472005
16305 472005 79765 330714 474592 765662 439508 820951 397594 418279 480544 771951
16295 771951 501980 645803 570410 484120 499376 739713 516039 262447 808067 179827
16284 584570 426674 408682 276519 436393 546695 447829 237565 500348 406311 353571
16274C53571M0601O488m5158A55287J40157K43368B59342Q9247j21635L48690
16264E75644j08436M4154k06424Q7654K9344j67330J42898j37995J52381N1650
16254D63540j42341L13990C11981l8783q9821L20791D3142M16068L539j21551
16244C41198M4921j89062J37745A60449m477j3679J25333J29816R1211K66297
16234G54950k61440j80929A26330M32780B20502K8130I2948J88906p8350J03846
16224C07350P0577J01548j78407k8514J09310I8816J70300J7515J16263A92820
16213D65031P5574A43097J23665P5687j22543K0749o8416j7804J33633K5865n6386
16202B57547A09061C9896K91009j59743d163C45564j34981K0329p5885K77473
$$ plain form
16274 353571 394172 400660 355502 155287 295444 538812 259342 348589 226954 575644
16264 575644 467208 511362 304938 392592 421936 254606 397504 259509 411890 463540
16254 463540 321199 635189 311981 273198 183377 504168 43142 459210 462749 341198
16244 341198 386119 197057 334802 160449 155972 142293 267626 397442 488653 754950
16234 754950 493510 312581 126330 559110 220502 248632 92948 281854 203504 307350
16224 307350 377927 479475 301068 272554 381864 98816 269116 286631 402894 192820
16213 465031 540605 143097 266762 342449 219906 240655 172239 154435 288068 313933 257547
16202 257547 109061 39896 330905 171162 -4163 345564 210583 230912 155027 432500
16192D32500I6606K52803q5066j29688N414A2832K86426Q0693J4326K16489B71827
16180A24660J20012A13757K32324j49552R677l5883J86585j05515p1893q7853
16170I1647K12813P3886a52190A11317K40715q0262n093j28428i3519A40373M66008
16159F06381A11440K57007j26961B5553c23116i053B96465C8250K27015j17837
16149A47428j8334n5027J3975L52747I4825l2618L45438B605L16294r0011J87325
16138D16213j14293A29674L10368A63599E5217L97790j21623A34083n5512M9910
16128A28481a61260A06308N2071R033K35433a34823C31862A30995J19429J03358
16118C53782q4192q3118b3339C20519a54922B02268H5281a35430A78727b94163
$$ plain form
16192 432500 96606 349409 264343 134655 140069 12832 299258 379951 394277 610766 271827
16180 124660 244672 113757 346081 196529 206206 170323 356908 251393 179500 91647
16170 91647 304460 378346 -152190 111317 352032 271770 266677 138249 -93519 140373 606381
16159 606381 111440 368447 241486 25553 -323116 -9053 296465 38250 265265 147428
16149 147428 129094 74067 88042 440789 94825 62207 407645 2605 318899 228888 416213
16138 416213 301920 129674 440042 163599 55217 453007 331384 134083 78571 128481
16128 128481 -161260 106308 158379 167412 402845 -134823 331862 130995 250424 353782
16118 353782 269590 186472 -23339 320519 -154922 202268 85281 -135430 178727 -294163
16107E3419J74246j01469J76570j49303F1017M3425j2842h4278A13191E4136b5486
16095A20978M3750J61740j48087K07021A13687m59J59733a29577B12026k8690
16085A83336p2790e578A76384n1196b8548A1761a76485d9445J6506D44000h303
16073b3985C33015a53063A79070b39983A50876f628B5177J68991R1541k4891j09981
16062A50837M8185b82128a05147k7984B42764c2564A95027q4729b55295A69494
16051B13488a47169K3813I9801m6313J0701a15324L1458k42573g1684p3040B52035
16039b37920F5025K34883A18120b14399D7533e3097B12738A8978a20896J3455
16029a07441A10246C517J994H49J42859b1660C9731K450J75229d8843B13304a0885
$$ plain form
16107 53419 227665 126196 302766 153463 61017 104442 91600 -84278 113191 54136 -25486
16095 120978 164728 326468 178381 385402 113687 113228 272961 -129577 212026 183336
16085 183336 110546 -5578 176384 125188 -28548 11761 -176485 -49445 -32939 444000 -8303
16073 -23985 333015 -153063 179070 -239983 150876 -6628 25177 194168 285709 260818 150837
16062 150837 199022 -282128 -105147 -133131 242764 -32564 195027 110298 -255295 169494
16051 213488 -147169 -123356 99801 53488 64189 -115324 -83866 -326439 -71684 -144724 252035
16039 -237920 65025 299908 118120 -214399 47533 -53097 212738 18978 -120896 -107441
16029 -107441 110246 3517 5511 849 143708 -21660 39731 42181 217410 -48843 213304 -10885
16016A97030H6180k7622j8746e4826R544E6733L235L79571A67502N518i537k3867
16004c3404A79312J68776A61536h7835E4927J4481J67683O8776h1776B94601A10874
15992G1340l2609K8514J14734a14655A57020i3357P254E9586J04513m3962f297
15980b95926E8890L1719J35916e1737A00928J73669J00885O2167J28911L27191
15970H93751J58731M2059m00621L42897E12761k15196A39041g7007A79392q7197
15960I2195K23582i3573A80702a68835B093a43350A87009c1514p3146B64605j02578
15949A62027E4937g5219A23302n4671c09092J09313A31860a03373j34179A18316
15938f2781B80686C270b47436J23560B07827D0805K45117g4014C7455c6524q5673
$$ plain form
16016 197030 86180 58558 39812 -54826 -45282 56733 59968 439539 167502 173020 -9537 -33404
16004 -33404 179312 348088 161536 -87835 54927 69408 237091 305867 -81776 294601 110874
15992 71340 38731 67245 181979 -114655 157020 -93357 -86103 59586 164099 120137 -6297
15980 -295926 58890 90609 226525 -51737 100928 274597 375482 437649 566560 893751
15970 893751 1052482 1094541 693920 1036817 512761 297565 139041 -77007 179392 92195
15960 92195 315777 -93573 180702 -168835 2093 -143350 187009 -31514 -104660 264605 162027
15949 162027 54937 -75219 123302 68631 -309092 -199779 131860 -103373 -237552 118316
15938 -62781 280686 3270 -247436 -123876 207827 40805 285922 -74014 37455 -36524 -122197
15927a22197h364p2846A83977r657R795A6497O4909p052a29549O4010c1763F4449
15914e8034K4012A94881i1237p5682C2461d99366B21254n06C9221J87673d0080
15902a62678B41153e4921j88959j550A10880d5854j07053p910P6866L8267C9811
15890C64317a79716j53239A12515a48294A26203b5152j55165h2195m6077b4959
15879a58940H9997c40958C8557N1165a41073I5375A0326R219a18237A08796m3404
15868F5392C1548N2020m1206J12050b453l6712k36824c5252m4579k8635A2408
15856a63140L4253j12195a09931B40053b23067i2014j1571o61A65879J33415C601
15844A42975i9173A44778k2134Q6684e3291q027K8148D8049a36739m2808m9736
$$ plain form
15927 -122197 -8364 -81210 183977 174320 184115 16497 81406 74354 -129549 -65539 -31763 64449
15914 -58034 -34022 194881 -91237 -166919 32461 -499366 221254 220748 39221 226894 -40080
15902 -162678 241153 -54921 -243880 -245430 110880 -45854 -152907 -160817 -83951 -45684 39811
15890 364317 -179716 -332955 112515 -148294 126203 -25152 -180317 -82195 -128272 -24959
15879 -158940 89997 -340958 38557 89722 -141073 95375 10326 19545 -118237 108796 65392
15868 65392 31548 83568 42362 154412 -2453 -39165 -275989 -35252 -79831 -108466 12408
15856 -163140 -128887 -241082 -109931 240053 -223067 -92014 -103585 -104246 165879 299294 3601
15844 142975 -99173 144778 122644 209328 -53291 -61318 -33170 48049 -136739 -179547 -229283
15833b29283B90185d3182p7175d8741k4044i59q575m53481K7647H51d0185j12461
15821a52646j83089A46222a77165N5199A02309d4127l4516B39687j1885a44808
15810C50147b68328f3547p2116m5878c5367o4424F8775K63563c10829C1126a3446
15798B41457c05159B51129D4383J17311q433B9993b64095a05424B0283J9281K1767
15787F1331O3678b01172A63284B201a20825j58169A16642a67095L726j45501e5142
15775D9999b9350j99320P847d3472k26753C20943a92857j6800A70223j4204f7806
15763a59660C7575P1618a47039l1372e1603n0069j80092I2081K49755i7575l10975
15752d08550N2657B63915A15698J8470e8283A1078a07907A41397d50209b9598
$$ plain form
15833 -229283 290185 -43182 -120357 -48741 -72785 -959 -9534 -463015 -435368 851 -40185 -152646
15821 -152646 -335735 146222 -177165 -121966 102309 -44127 -78643 239687 227802 -144808
15810 350147 -268328 -63547 -135663 -181541 -35367 -99791 68775 332338 -310829 31126 -13446
15798 241457 -305159 251129 44383 161694 153261 29993 -264095 -105424 20283 39564 61331
15787 61331 125009 -201172 163284 2201 -120825 -278994 116642 -167095 -163369 -308870 -55142
15775 49999 -29350 -228670 -220823 -43472 -270225 320943 -192857 -209657 170223 156019 -67806
15763 -159660 37575 109193 -147039 -178411 -51603 -101672 -281764 92081 341836 -97575 -408550
15752 -408550 -355893 263915 115698 134168 -58283 11078 -107907 141397 -450209 -29598
15741A09799b485k36230A86552L1377C4640r284O7221N8002k3824G567d0869C66
15728D03030A20845a56182F3932L4506E109N2645J6010J46856m7601Q5107A2598
15716a14680B3584d7699b1562m01595B0960K22349a8548l46062J63992k25455
15706d26073D5112J60031b6114H0433b24800i0546E7939b0131F306K39538F4060
15694D9768J53135m8039a32120E0037A7462b03397r553a682A37408Q9540e9703
15682E1076a52460D3365a73400K9859B79835g6941B86460j6096A11409b42310
15671a73023m973A28988b27737A18415Q151J89461i1962d97k33487p6714C670
15659a97481Q8214k43200J48882L2679B3634J99752g5858C2742b00023l23367
$$ plain form
15741 109799 -2485 -238715 186552 217929 34640 25356 92577 150579 126755 7567 -40869 366
15728 403030 120845 -156182 63932 98438 5109 57754 73764 220620 173019 258126 12598
15716 -114680 23584 -47699 -21562 -423157 20960 243309 -18548 -364610 -200618 -426073
15706 -426073 45112 205143 -26114 80433 -224800 -90546 57939 -20131 6306 245844 64060
15694 49768 202903 154864 -132120 50037 17462 -203397 -212950 -1682 137408 226948 -59703
15682 51076 -152460 43365 -173400 -143541 279835 -76941 286460 270364 111409 -242310
15671 -173023 -177996 128988 -227737 118415 126566 316027 -91962 -497 -233984 -310698 3670
15659 -197481 -109267 -352467 -203585 -170906 23634 223386 -75858 32742 -200023 -523390
15649e23390B53794d8016k2940k58688h9110o0948C5007J17031h2145j42945j13048
15638c38138A35972a94198j6615D1757d9429N275q3478A39059C1700P5366b73196
15626c53499F5280J58278b16093A22071J00379A04429k5503a86451H632J94152
15616B02784h0840k38954A37091a19867n4765a9301A19499m783j6391f1420j416
15605f2836A07432E0827K8848O1152f579j42403B13456g3095K0646j27663C878
15593c72901k1673h2417l41683A47455K00705b9535l28539G8076P3239F708J78436
15582A85144C0841J83294b19143B3116J18381J2952a04891M1985B60830H7517
15571F892J44332b0965A44433D67K7923c11793a05203j97626b0805j58145B8795
$$ plain form
15649 -523390 253794 -48016 -70956 -329644 -89110 -150058 35007 152038 -82145 -225090 -338138
15638 -338138 135972 -194198 -210813 41757 -49429 -44154 -127632 139059 31700 107066 -273196
15626 -353499 65280 223558 -216093 122071 222450 104429 78926 -186451 8632 202784
15616 202784 -80840 -319794 137091 -119867 -174632 -19301 119499 114716 98325 -61420 -62836
15605 -62836 107432 50827 79675 140827 -6579 -148982 213456 -73095 -52449 -180112 3878
15593 -372901 -394574 -82417 -424100 147455 348160 -29535 -358074 78076 151315 6708 185144
15582 185144 30841 214135 -219143 23116 141497 154449 -104891 -62906 260830 87517
15571 6892 151224 -20965 144433 467 28390 -311793 -105203 -302829 -20805 -178950 28795
15559c3000C05279b73536j76585a25517B19086i200o6026j61335b5782H9073J26224
15548B15297e5431j22778L7503A08770a75279j8051g8198H6446N8457o6722c06464
15536B4837M2320h7633j19366A05127M8388G6457a51114b2280f531j90055I6625
15524A99307I8241c00942E39423e8371B8945M9427B477j195K31284j06391a86404
15512A64328d72j65123c4805J4235A18274C3358e8014B14388E7679J04553J03021
15501B65253r0895o3064a42151C58127j56697o358p9067M0197M4705e9766E4959
15489g651E6201Q1571m2809K3605n4596N7173K47305q0674b62713B39578o3028
15478A76550l6181a4578A79952L3053b98313j1433C06673C2745J11303O4716L679
$$ plain form
15559 -33000 305279 -273536 -450121 -125517 219086 -9200 -75226 -236561 -25782 89073 215297
15548 215297 -55431 -178209 -140706 108770 -175279 -193330 -78198 86446 144903 78181 -306464
15536 24837 67157 -87633 -206999 105127 153515 76457 -151114 -22280 -6531 -196586 96625
15524 199307 98241 -300942 539423 -58371 28945 78372 2477 1282 232566 126175 -186404
15512 164328 -472 -165595 -34805 -20570 118274 33358 -58014 214388 57679 162232 265253
15501 265253 174358 111294 -142151 358127 201430 195072 116005 156202 200907 -59766 54959
15489 -7651 56201 137772 94963 118568 63972 121145 368450 287776 -262713 239578 176550
15478 176550 140369 -14578 179952 213005 -298313 -309746 306673 32745 144048 208764 212443
15467B12443k7399i4797B65757n3187J42618E3204M69860L4030k63247L28124
15457F21971p1675j62564M1647C215J46516a68438B07750c88583A55656a52781
15446a29126A1469f7309j81535a6983A79321o6493k9124J05988F7736h5599H6676
15434B2896h4644A42550K68166j07151j36808F6432M03810L85461K11149K2171
15424A089023k16727k913k85796k30373n2282J80943B2960L19037b7250C06235
15413d6227E8020J78399F0172r928b8652H9093g4863A68710m5866a23766e9017
15401h7986B32621j12738N1257J9330a92260A69614b33070R5105A16914d76879
15390I8300J38662k7501r2076a72236B08441F1886J96620d3945B43081a48037
$$ plain form
15467 212443 185044 -94797 265757 212570 355188 53204 523064 557094 293847 621971
15457 621971 550296 387732 429379 3215 149731 -168438 207750 -388583 155656 -152781
15446 -129126 11469 -67309 -248844 -16983 179321 112828 83704 189692 67736 -85599 86676
15434 22896 -84644 142550 410716 303565 166757 66432 470242 855703 1066852 1089023
15424 1089023 872296 869383 583587 353214 300932 481875 22960 341997 -27250 306235
15413 -46227 58020 236419 60172 50244 -28652 89093 -74863 168710 122844 -123766 -59017
15401 -87986 232621 119883 171140 190470 -192260 169614 -233070 -137965 116914 -476879
15390 98300 236962 209461 117385 -172236 208441 61886 258506 -43945 243081 -148037
15379a37269B9106c433j09696j9337m8777A227K50086k6135J54101E0983A9467
15367C02520e6733B87149B2331c46414D6J59293Q8294B5356N9610J17086R7350
15356B99402K368j42278L1534B7477B45K45869m5943L2315m7661N8844k1611K88667
15344E10725A48522J7969J30650G7872J8603Q9196m1617J65279L9255F6735K25739
15333B92474a32745A75259d2697G6453J39873o9423M12616k20094k7371I3581
15322B27363P4567G1037a25378N507B51315K3379A22946J16094J43103h748B51134
15310b4849A404d767A47034j0737h1218A59002n1605J76237E77N9735i0607C91669
15297A78226J658Q6497j02436j4083J33881J67240A45447O0275l7726o0211d26192
$$ plain form
15379 -137269 29106 -3433 -113129 -132466 -181243 1227 251313 225178 379279 50983 19467
15367 302520 -56733 287149 22331 -346414 46 159339 247633 25356 84966 202052 299402
15356 299402 301770 159492 191026 27477 245 246114 200171 232486 184825 243669 222058 510725
15344 510725 148522 166491 297141 77872 96475 185671 144054 309333 348588 66735 292474
15333 292474 -132745 175259 -42697 76453 216326 146903 559519 339425 312054 93581
15322 227363 301930 71037 -125378 -119871 251315 274694 122946 239040 382143 -8748 251134
15310 -24849 1404 -4767 147034 136297 -81218 159002 107397 283634 577 60312 -90607 391669
15297 178226 179884 266381 163945 149862 283743 450983 145447 205722 167996 107785 -426192
15285B97241B0730b39149l9767B4015b02812G1286j275P636h7937E8498J75003
15274B33501c5146O138o5647A2076E124J78038a18863H9247L71729B23375i6597
15262f3818j37435E3895M1111J13590a27131A41059b06592m7017D8457d9515B65079
15250B86148f9634j45388C03615C77d2789E9928K06637j11845o7171Q0213O3478
15239B31240i2526q8587B34211H8665K94304d5893J6805B88865J2840A09253N51383
15228F60636L82942J73355k06796L76612l35856l48612C16257m5524J51610B0212
15217B80818j02433g4629A30941n6844C6886i8984k02134J40163A6566J28103
15207A44669k0699k9950M7254a97300c1791o7424k5419b4314B09788l5183i4928
$$ plain form
15285 297241 20730 -239149 -278916 24015 -202812 71286 70011 77647 -87937 58498 233501
15274 233501 -35146 -29008 -94655 12076 5124 183162 -118863 89247 460976 223375 -96597
15262 -63818 -201253 53895 95006 208596 -127131 141059 -206592 -253609 48457 -49515 265079
15250 286148 -69634 -215022 303615 377 -42789 59928 266565 154720 87549 167762 231240
15239 231240 -92526 -181113 234211 88665 382969 -45893 -29088 288865 301705 109253 660636
15228 660636 1043578 1216933 1010137 1386749 1050893 702281 316257 270733 422343 20212
15217 280818 178385 -74629 130941 74097 36886 -98984 -301118 -160955 16566 144669
15207 144669 123970 94020 141274 -197300 -31791 -99215 -124634 -24314 209788 174605 -94928
15195G1843J38327H3815a39085B16694j01716Q0474a11243m6415F8714J58452
15185B27166K8420b14627J01862d844j6634F2491K48139j925I5693K12130f5367
15173E3609J64364A9861K93922K9396A10267K35835B2922L1257P9877i8276I019
15161A61508a05819c8387A01457K02618A3152b20115D9842b3414C4647j6900P1599
15150H9346L09251A12312c0544A92964L8159p7002J3765B1144h4324F8740P5048
15139A43788A6167K40799m8418N340a4819B46747G4531O0750P0074q0305g0824
15127G5341J56181A9867N37614A98758b26772A80534e0621A81081a36592H1580
15116A55228J34716b30A45566J55404f1100G0429B7918J13205K95382B08970L9893
$$ plain form
15195 71843 210170 83815 -139085 216694 114978 195452 -111243 -157658 68714 227166
15185 227166 255586 -214627 -112765 -4844 -21478 62491 310630 308705 95693 307823 -65367
15173 53609 217973 19861 313783 343179 110267 346102 22922 54179 134056 -98276 9019
15161 161508 -105819 -38387 101457 304075 13152 -220115 49842 -23414 34647 17747 89346
15150 89346 398597 112312 -30544 192964 231123 154121 167886 21144 -84324 68740 143788
15139 143788 16167 256966 208548 213888 -14819 246747 74531 135281 205355 125050 -70824
15127 75341 231522 19867 557481 198758 -226772 180534 -50621 181081 -136592 81580
15116 155228 289944 -230 145566 300970 -61100 70429 27918 141123 436505 208970 248863
15105B48863b0426D88889A11062K09359l7765k9178J20507e2232A18228P912N9787
15094A85927K05286A504K27611a73722B21162L16728b32104B16994N2167a33100
15083B29152H2978J41873L7685J60831A95874f3127B21354j00552K8798J8750
15073A68350J86197h6942B67767H8766i3144c5246C1134h4905B12342A5516J16378
15062A31894a17415B67736C3408K01340I6598h592B48083P6561p0204K65360f7113
15050C57356o804A57511M0540M30583B90816K0193A23921P9196F5180K96621q7229
15039B74572a56509A08985L68020q9041o1663J88005J7717A61705J09356C9918
15028C01904J16091A93167K33040j85174K30699n1135N5134o2503J23463q7278
$$ plain form
15105 248863 -20426 488889 111062 320421 282656 253478 373985 -52232 118228 126140 185927
15094 185927 391213 1504 229115 -173722 221162 537890 -232104 216994 269161 -133100
15083 229152 82978 224851 262536 423367 195874 -63127 221354 120802 149600 168350
15073 168350 354547 -86942 267767 88766 -93144 -35246 31134 -84905 212342 15516 131894
15062 131894 -117415 267736 33408 234748 96598 -8592 248083 324644 254440 519800 -67113
15050 357356 350552 157511 198051 628634 290816 311009 123921 203117 65180 361801 274572
15039 274572 -156509 108985 477005 387964 326301 514306 532023 161705 271061 39918
15028 301904 417995 193167 426207 241033 471732 420597 475731 413228 536691 449413
15018D49413Q9819n8572J30444j5613j91721K97355q2677K14564k80362j7523
15008E35127L02959j02494J8686B26327L78546J71870k01980O8845F9417J00640
14998A70057J78236a9349A92770O598N109K91596j47903m9241J55288J1340k23351
14987B42206K43446j62390K44794q0767J26531k96046J84218J1230J77809j58391
14977E32640j65032K7462K58189L9313j64822J38041q4028J48477l14165J57517
14967E73592N59537k23399n087k30090J70027l45911O4593k1691j09798j11061
14957C20712L50560k75631O3194l2978L44400l48600J08720q8272j18060Q2992
14947D07037j38499q3765J23886K15173K13307C32500R480o7160L3091M3939K6263
$$ plain form
15018 449413 539232 480660 611104 595491 403770 701125 618448 833012 552650 535127
15008 535127 838086 735592 754278 226327 604873 776743 574763 643608 69417 170057
14998 170057 348293 -19349 192770 199368 204477 496073 348170 298929 454217 465557 242206
14987 242206 485652 323262 568056 487289 613820 317774 501992 513222 691031 532640
14977 532640 367608 395070 653259 692572 527750 665791 581763 730240 416075 573592
14967 573592 1133129 909730 904643 674553 844580 498669 563262 541571 431773 320712
14957 320712 671272 395641 458835 425857 770257 421657 530377 442105 324045 407037
14947 407037 268538 184773 308659 523832 737139 332500 341980 274820 307911 351850 378113
14936C78113J26537j15865J30870k11592L95938C20092K63539q2463l4001L18686
14926G85853j61100J89680l03761j14362K00955j26031L63171k30161m0734L3001
14916E96511K29662K67468J53367j32470J49034K91896j96252K61485j79031M27402
14906A869072j44804Q3218q3443m8603M14817J39638k7983l12737K5957l49403
14896A565729l04896j03399k73711l01451K98960l72165r1618j76758J63669n5532
14886C48828j22206K94271k28996K29638j35793L9636j80547J77365Q7830L2669
14876E42695J30327n5847K14205N77m02721M97313k69405q8580K86652n1515N0216
14865H53917J43778l68417j4934M04300l84670j57688K36332B78356P1843R1736
$$ plain form
14936 378113 504650 388785 519655 308063 704001 320092 583631 501168 467167 785853
14926 785853 624753 814433 510672 396310 597265 471234 834405 604244 563510 596511
14916 596511 826173 1093641 1247008 1114538 1263572 1555468 1359216 1620701 1441670 1869072
14906 1869072 1724268 1807486 1724043 1675440 2090257 2229895 2201912 1889175 1915132 1565729
14896 1565729 1260833 1157434 883723 582272 881232 509067 417449 240691 404360 348828
14886 348828 226622 520893 291897 521535 385742 425378 244831 422196 510026 542695
14876 542695 673022 617175 831380 831957 429236 926549 657144 568564 855216 803701 853917
14865 853917 997695 629278 614344 1018644 633974 476286 712618 278356 350199 441935
14855D41935J90800j73966J56041j25841K25152j27519J0015K25227C64849J79208
14845E44057j38001M03487j39172a64594D22548B06386M66445J44849j40033N4286
14835G31933k23988j97684K9517J77343K52088J75587j28697J0988K45151K80396
14825A352634k95068J28304q4707p8397k9385K14965n44093J46623k8562k79632
14815E02682k10747k1932M07760j26650K16996j63295L8368L024q3269O8721J38717
14804G70375k13656L10440k92063K55700j94156J27946k86923J98194P2145j8064
14794G29938j83332M11968k24242J67563M8395q0868k64310J01423K25277j2002
14784I19810n1701C16784J66543m3165r5940K51482o7942N4397l4202j3469k20356
$$ plain form
14855 441935 632735 458769 614810 488969 714121 586602 596617 821844 364849 544057
14845 544057 406056 809543 670371 -164594 422548 206386 672831 817680 677647 731933
14835 731933 507945 310261 339778 517121 769209 944796 816099 827087 1072238 1352634
14825 1352634 1057566 1185870 1101163 1022766 993381 1208346 664253 810876 782314 502682
14815 502682 291935 270003 677763 551113 768109 604814 643182 646206 562937 631658 770375
14804 770375 556719 867159 575096 830796 636640 764586 477663 675857 748002 729938
14794 729938 546606 958574 734332 901895 950290 869422 605112 706535 931812 919810
14784 919810 868109 316784 483327 440162 344222 595704 527762 582159 547957 534488 314132
14773C14132L16088J29269l2971K08003l69751l3377K08042k38599L90048C90498
14762D57623O9493K53560O8994j70048M65822k21253J23801m55282q7461j0972
14752D94277R8828J3629j24274K42095q0890k11074k09336L26976o9643J79493
14742F60081N2681J5749R9658C92255j62251J61142K95517j27015N462J46315
14732G11425j95070L22066B45385R7870J77313J24188k97273J36476o6431N06847
14722I24375k41412K70368j36569j54423J90681L28660j78417k23994M35290L29856
14712A544415j20679J93781J06889L15294m47363j62493m69863J92110l24167
14703H27924J80626l2059o1900k00805L61536O5238q6826m12177J38843J57514
$$ plain form
14773 314132 630220 759489 726518 934521 564770 531393 739435 500836 890884 390498
14762 457623 527116 780676 849670 679622 1145444 924191 1047992 592710 505249 494277
14752 494277 593105 606734 482460 724555 643665 432591 223255 550231 480588 660081
14742 660081 712762 728511 828169 392255 230004 391146 686663 559648 565110 711425
14732 711425 516355 838421 245385 343255 520568 644756 347483 483959 417528 924375
14722 924375 682963 953331 816762 662339 853020 1181680 1003263 779269 1214559 1544415
14712 1544415 1423736 1617517 1724406 2039700 1592337 1429844 959981 1152091 827924
14703 827924 1008550 976491 914591 713786 1075322 1140560 1053734 641557 780400 937914
14693I37914o0802J63013P7623L69591k16703L20332j54901J30373J54035k0953
14683A699522j91801J4669q1891j55810l70032k4576K4887O8891D60797K73247
14673G34044n3841M11221j6193J32153k05796j94822J1729j4314j16645m8349
14663F39187j65384K63543k1473K96370k36942M2868K62463j89040q5957N5752
14653H61387K87426l03398P465J34014J70410m70012O0194L46026j37066l10976
14643F45470L85955O8059j63890j05198L26661o3601K54710j51270q4870j394
14633A110632K2726L1898k181j4084J843k03380J30259j52181L58083N004k32140
14622A056479r5529N21744o02440K24563p2058K23959l5786R9338k48901l13857
$$ plain form
14693 937914 877112 1040125 1117748 1487339 1270636 1590968 1436067 1566440 1720475 1699522
14683 1699522 1507721 1522390 1440499 1284689 914657 890081 914968 983859 460797 734044
14673 734044 680203 1091424 1075231 1207384 1001588 806766 818495 804181 687536 639187
14663 639187 473803 737346 715873 1012243 775301 818169 1080632 891592 805635 861387
14653 861387 1148813 845415 852880 986894 1157304 687292 747486 1093512 956446 645470
14643 645470 1031425 1099484 935594 830396 1157057 1093456 1348166 1196896 1112026 1110632
14633 1110632 1133358 1165256 1163075 1148991 1150834 947454 1077713 925532 1283615 1288619 1056479
14622 1056479 960950 1482694 880254 1104817 1032759 1256718 1220932 1320270 1071369 757512
14612G57512P80608m08235J32277k76648M09825J59913j88950j10567J62219k98054
14602A119900m7367L48290l32353M40479p3766j39541k38871M40242j57305N5912
14592A415620N9703K1738k16706L04408j80393j50220K17349K65821K3207n68466
14582A192061K66328r5600L23220P8464l28338L8706N6850k07756J20356K5289
14572A469580K59140k31899L70183P8799m62340J19918j82739L98777k87883q6414
14562A445122N16075k58279k5955L98910k75819m0340K33133k3802j8829j27763
14552A822453K11984j53748J09471o410K22322M4344l2412K66953K22375j08362
14542B598970L07946M3113M04823J43681K28949L93922J038683J005282K355654
$$ plain form
14612 757512 1538120 1129885 1262162 985514 1395339 1555252 1366302 1255735 1417954 1119900
14602 1119900 1072533 1420823 1088470 1528949 1455183 1315642 1076771 1517013 1359708 1415620
14592 1415620 1475323 1497061 1280355 1584763 1404370 1254150 1471499 1737320 1760527 1192061
14582 1192061 1458389 1362789 1686009 1764473 1436135 1474841 1531691 1323935 1444291 1469580
14572 1469580 1728720 1496821 1867004 1945803 1483463 1603381 1420642 1819419 1531536 1445122
14562 1445122 1961197 1702918 1676963 2075873 1800054 1759714 1992847 1969045 1950216 1822453
14552 1822453 2034437 1880689 1990160 1983750 2206072 2250416 2218004 2484957 2707332 2598970
14542 2598970 2906916 2950029 3354852 3498533 3727482 4121404 5160087 6165369 8521023
14533H521023L828018O239352Q175143N05746p981675o494820m193879k230227
14525F368681k162494k61208k3945K35204p66868p05012n04429R7852k4299l26591
14515A926891L43873k11170L1521m5474R9368k56891J17571M03307l6810k7446
14505B344740O6470k41578p6983K11363k3518k1172J76511K3725l4175R0543k23746
14494B292180L42934j10169j4027N5168R5934J46075K0737j55126j22855K30501
14484B781352m9273J00955J7198k5236J60199l69780L02080j07283J74635j57805
14474B827042M15275L13638k20520j90975M5575J52019Q1279k73027J80351Q8475
14464C419132q5799K37496j76999K64946l12838L70265j74610M51073O967k08318
$$ plain form
14533 8521023 12349041 18588393 26763536 27269282 19287607 12792787 8598908 6368681
14525 6368681 4206187 3944979 3921034 4156238 3389370 2684358 2179929 2277781 2253482 1926891
14515 1926891 2270764 2059594 2091115 2045641 2145009 1888118 2005689 2408996 2372186 2344740
14505 2344740 2411210 2169632 2092649 2304012 2280494 2259322 2435833 2459558 2425383 2515926 2292180
14494 2292180 2635114 2524945 2510918 2566086 2662020 2808095 2828832 2673706 2550851 2781352
14484 2781352 2732079 2833034 2850232 2824996 2985195 2615415 2917495 2810212 2984847 2827042
14474 2827042 3242317 3555955 3335435 3144460 3190035 3342054 3423333 3150306 3330657 3419132
14464 3419132 3333333 3570829 3393830 3658776 3345938 3716203 3541593 3992666 3999633 3791315
14454C791315Q6619k51377M09277l14768M03925l19325J23643L12285j55838P4255
14444D160011L07939k72371K73880p9434L04999k13899J46909L9922k01073J90129
14434D657012n4627L45544o5326k63807K43104L03112M8279O0161K55619j95986
14424E333085J88138J43486m54196L16518N03651K5621k65700J91176L69508j18519
14414F232768L8090O9309J70807J01150m4570J04361L55766N3570j53129M13381
14404G341503Q3848j11002K57798p8953K92579n9457M56032k97810J26582r4020
14394G917100L62116R0184N78027k40214L4757M37923K16731q0309j00399m678
14384I211238L84269m7111M17869k5246j54379O97936j18137K40410L21785Q0370
$$ plain form
14454 3791315 3877934 3626557 4035834 3721066 4124991 3805666 3929309 4241594 4085756 4160011
14444 4160011 4467950 4195579 4469459 4390025 4695024 4481125 4628034 4667956 4466883 4657012
14434 4657012 4602385 4947929 4882603 4618796 4861900 5165012 5213291 5273452 5529071 5333085
14424 5333085 5521223 5664709 5210513 5527031 6030682 6056303 5790603 5981779 6351287 6232768
14414 6232768 6270858 6340167 6510974 6612124 6567554 6671915 7027681 7081251 6928122 7341503
14404 7341503 7425351 7314349 7572147 7493194 7785773 7726316 8182348 7884538 8011120 7917100
14394 7917100 8279216 8369400 8947427 8707213 8741970 9179893 9396624 9316315 9215916 9211238
14384 9211238 9595507 9548396 9966265 9941019 9786640 10484576 10366439 10606849 10928634 11009004
14374A1009004j4624J76696M36479J59885K94471J78853L68139R4024N35530J81200
14364A3419657J18513J49771J80840L22158L36826J21653K84070N03644N05667
14355A5942799j28459O58759J11808M10023O81441K08464M46838j8370M42480
14346A8755783O25722K4581J65331Q96081L71885J61599J111115K33323O09924
14337B2955344K44914P33254M56596R55724P10103L92398O63757M17898J174578
14328B8704566O27672P85216R34304P66188P74559J065594J030065O26000J339975
14319C6654139J150525J125362J104859J195517J595622J077713J551209J885640
14311D7340586J517571J525315J886562J685218J797646K349434J988451K300540
$$ plain form
14374 11009004 10994380 11171076 11607555 11767440 12061911 12240764 12608903 12702927 13238457 13419657
14364 13419657 13538170 13687941 13868781 14190939 14527765 14649418 14933488 15437132 15942799
14355 15942799 15814340 16473099 16584907 16994930 17676371 17884835 18331673 18313303 18755783
14346 18755783 19381505 19406086 19571417 20467498 20839383 21000982 22112097 22345420 22955344
14337 22955344 23200258 23933512 24390108 25345832 26055935 26448333 27112090 27529988 28704566
14328 28704566 29332238 30117454 31051758 31817946 32592505 33658099 34688164 35314164 36654139
14319 36654139 37804664 38930026 40034885 41230402 42826024 43903737 45454946 47340586
14311 47340586 48858157 50383472 52270034 53955252 55752898 58102332 60090783 62391323
14303F2391323K335433K502138K477626K598103K884566L179559L460495L080241
14295H4909484L814177L789787M219529M298064N023671N312077N270292N500601
14287A22137682O024970O565516P038988P757105P940794Q295613R031050R460650
14279A84252368J0238786J0535439J1307876J2311452J2590963J3733154J3638292
14272B68608330J4721625J4591009J5048710J5370155J5379743J5385787J5173962
14265C74279321J4837147J3881322J2792639J1945252J0955558R862465Q674421
14258D57228125L521617o31846p19012j884900o351409n703927n563545n491744
14250D34403359n519212q021866j4126888j5981261j5729672j5898635j5538538
$$ plain form
14303 62391323 64726756 67228894 69706520 72304623 75189189 78368748 81829243 84909484
14295 84909484 88723661 92513448 96732977 101031041 106054712 111366789 116637081 122137682
14287 122137682 128162652 134728168 141767156 149524261 157465055 165760668 174791718 184252368
14279 184252368 194491154 205026593 216334469 228645921 241236884 254970038 268608330
14272 268608330 283329955 297920964 312969674 328339829 343719572 359105359 374279321
14265 374279321 389116468 402997790 415790429 427735681 438691239 448553704 457228125
14258 457228125 460749742 460117896 459398884 457513984 451162575 445458648 439895103 434403359
14250 434403359 428884147 420862281 406735393 390754132 375024460 359125825 343587287
14243C43587287j5544334j5386428j5036986j4359460j3869417j3373573j2557885
14236B43459204j2142868j3233223j1936157j0422721j0290839r915222r364821
14229A66153353q263033p690593p795529p139281o267077o347287n343037n528764
14221A11778752n162199m684129m607467m196393l741556l798684l604888l080517
14213G8902919l735731k539592k953016k683639k351510k548761k065506k213808
14205E7811356k071180j856784j522866k149596j964076j086485j670653j564419
14197D3925297r05580j506486j087871j343498j297379n99555j341883j053987
14189C4789058j032332q25124p78269j036150o81113m46286j137065o92386j096284
$$ plain form
14243 343587287 328042953 312656525 297619539 283260079 269390662 256017089 243459204
14236 243459204 231316336 218083113 206146956 195724235 185433396 175518174 166153353
14229 166153353 157890320 150199727 142404198 135264917 128997840 122650553 117307516 111778752
14221 111778752 106616553 101932424 97324957 93128564 89387008 85588324 81983436 78902919
14213 78902919 75167188 72627596 69674580 66990941 64639431 62090670 60025164 57811356
14205 57811356 55740176 53883392 52360526 50210930 48246854 47160369 45489716 43925297
14197 43925297 43019717 41513231 40425360 39081862 37784483 37184928 35843045 34789058
14189 34789058 33756726 32931602 32153333 31117183 30436070 29989784 28852719 28160333 27064049
14180B7064049n25271q04952o37928l49958p57805o17959k34860o73655o03436
14171B1858225m72118o33716m22735l09205n70134l48873n42424j97362m31415
14162A7930243o57244O7472p80200k1872m69424k69614j31574n30831j97064l49839
14152A4590053R531n69895m88309q3611k13675J06680m44079n6470l91439n20271
14142A1938515j76711J62155o03061Q2589k11165k34181k72292j71678j52605
14133A0361566k4182k39617l4722k50379j08557k14472j63617o5920j66082k08784
14123H885234j34274k69728L42001k18622p0477j98549p4424J47967n37992J91456
14113H062592n51689q3453j63663J65705k60720j00287k28496M8389k61850j9527
$$ plain form
14180 27064049 26538778 25733826 25095898 24745940 23988135 23370176 23135316 22461661 21858225
14171 21858225 21386107 20752391 20329656 20020451 19450317 19101444 18559020 18361658 17930243
14162 17930243 17272999 17340471 16560271 16538399 16068975 15799361 15667787 15136956 14939892 14590053
14152 14590053 14599584 14029689 13541380 13457769 13244094 13350774 12906695 12850225 12458786 11938515
14142 11938515 11761804 11923959 11320898 11403487 11192322 10958141 10685849 10514171 10361566
14133 10361566 10337384 10097767 10063045 9812666 9704109 9489637 9326020 9260100 9094018 8885234
14123 8885234 8750960 8481232 8823233 8604611 8534134 8335585 8261161 8409128 7871136 8062592
14113 8062592 7510903 7427450 7263787 7429492 7168772 7068485 6839989 6888378 6626528 6607001
14103F607001j07336j87193L23570J4997n08521m15378L23587K8295n0401k59691
14093E768930j0950J15479l44005l398r3826K74604m29097n1278K5849J70365
14083E422673o6319k20761J32367j27234k110k02428l57340M18986j59708j29859
14073D708267j20629j87104J60316j44289J74163n7939n4510M610j63699l14412
14063D004774J92245k7991J06047m75676J50835k16681J91316k25472K20252n7497
14053C862152l01658K69936J11128o93171J51651J56904J69268J74845l76437
14044C524618k1821k94815L84277k54827L0307j50877J0793l8344K34166k96453
14034C127024J26594j49517r4688K24628l62603J16407Q7111r9467l00505j01054
$$ plain form
14103 6607001 6499665 6312472 6636042 6651039 6142518 5727140 6050727 6079022 6028621 5768930
14093 5768930 5757980 5873459 5529454 5526056 5432230 5706834 5277737 5226459 5252308 5422673
14083 5422673 5356354 5135593 5267960 5140726 5138616 4936188 4578848 4997834 4838126 4708267
14073 4708267 4587638 4400534 4560850 4416561 4590724 4532785 4478275 4482885 4319186 4004774
14063 4004774 4197019 4169028 4275075 3799399 3950234 3733553 3924869 3699397 3919649 3862152
14053 3862152 3560494 3830430 3941558 3248387 3400038 3556942 3726210 3901055 3524618
14044 3524618 3502797 3207982 3592259 3337432 3367739 3216862 3227655 3189311 3423477 3127024
14034 3127024 3253618 3104101 3009413 3234041 2871438 2987845 3074956 2975489 2674984 2573930
14024B573930L32089m01411K96085j14205q6390K78544n40557K5286K70750R1689
14014B725810J3782k07298K49304p2849m98558Q2375K0944J39716K4457k25153
14004B252530n914r6211M40137m12136J06369q5106Q1759k23668j59138L64505
13994B263127k09809J42452k4935k23089J66125k14316k36252K22239q8009J091
13984A798624Q7335P4714j17055K43809n9479M69795m12423Q03887K94189L79672
13974C563068J438897L488619N154769R298369M701935n954101n939774m130531
13966A1621251l014788k319975j488988j134417k30719l5056p85426O7149n4335
13957B624696J51930l34254R3862j86154O5654l36272L9373L06217l87008p4452
$$ plain form
14024 2573930 2906019 2504608 2800693 2686488 2600098 2878642 2338085 2363371 2634121 2725810
14014 2725810 2739592 2532294 2781598 2708749 2210191 2292566 2313510 2453226 2477683 2252530
14004 2252530 2246616 2150405 2590542 2178406 2284775 2199669 2281428 2057760 1898622 2263127
13994 2263127 2053318 2195770 2170835 1947746 2113871 1899555 1663303 1885542 1797533 1798624
13984 1798624 1885959 1960673 1843618 2087427 2027948 2497743 2085320 2889207 3183396 3563068
13974 3563068 5001965 8490584 13645353 22943722 27645657 21691556 15751782 11621251
13966 11621251 8606463 6286488 4797500 3663083 3432364 3397308 2611882 2679031 2624696
13957 2624696 2776626 2442372 2536234 2350080 2415734 2079462 2118835 2425052 2038044 1963592
13947A963592l4688j6669j18342L20074l65528L00045j43213L34644j02661n65417
13937A571837q6103O50457n11863J13555J95229k67218j37692j70790J72990L8763
13927A569165M12298m65277j47063k07396J25186r9163N42019l62962L56915l84205
13917A339517L49652l26843j31647K20560k47271Q5131J56801j9433j4945O055
13907A417577k85426J72591M0513n2920J38987k44426J20114m564J66987q1944
13897A387489l05155R7505K90944k70452j23165K39187j33124N1338P4926n58019
13887G51474O27621m63731O72648m58438m21302L14026K6809J16809o9956l61914
13877G34046K28269K35474l85131K38003J57216k64410j98921P2199Q5880K70372
$$ plain form
13947 1963592 1928904 1912235 1793893 2113967 1748439 2048484 1905271 2239915 2137254 1571837
13937 1571837 1485734 2136191 1624328 1737883 1933112 1665894 1528202 1357412 1530402 1569165
13927 1569165 1981463 1516186 1369123 1161727 1286913 1187750 1729769 1366807 1723722 1339517
13917 1339517 1689169 1362326 1230679 1451239 1203968 1289099 1445900 1426467 1411522 1417577
13907 1417577 1132151 1304742 1345255 1292335 1431322 1186896 1307010 1302446 1469433 1387489
13897 1387489 1082334 1179839 1470783 1200331 1077166 1316353 1183229 1234567 1309493 751474
13887 751474 1379095 915364 1588012 1129574 708272 1022298 1049107 1165916 1095960 734046
13877 734046 962315 1197789 812658 1050661 1207877 943467 744546 816745 902625 1172997
13867A172997j50498j10616j48170R9779L00391j35150O5148K92737m19106l0796
13857I36716N1986k29482J5597J85861r5626m8417J06615K15140j7221l60115
13847G61054O20661m81192J07567j4122o1751J49986m29557K03408R0428k39626
13837G06856J90255k32287J04983P1985J39675o48k48725M5388m00j3843K6035
13826G89274J97874m15094L40529p2994j08703l07202N59528N0645l26070j43021
13816E64766J44137J94186j78725J15593J41786J29257m17331j67969J59806j52825
13806E32681K79072r6704k19316N7409L49214j32141k72602M79374m78917K24248
13796G22318m3640K4618k20882J16523L90128k43889n4560J3877j93596K5471
$$ plain form
13867 1172997 1022499 911883 763713 863492 1163883 1028733 1093881 1386618 967512 936716
13857 936716 988702 759220 774817 960678 865052 816635 923250 1138390 1121169 761054
13847 761054 1381715 900523 1008090 993968 932217 1082203 652646 856054 946482 706856
13837 706856 897111 664824 769807 841792 981467 980819 732094 777482 777082 763239 789274
13826 789274 987148 572054 912583 839589 730886 423684 983212 1033857 707787 564766
13816 564766 708903 903089 724364 839957 981743 1111000 693669 525700 685506 532681
13806 532681 811753 715049 495733 553142 902356 770215 497613 976987 498070 722318
13796 722318 678678 703296 482414 598937 989065 745176 690616 704493 510897 536368
13786E36368M12917m67432K53931J06561k35775K02685l65732L7011J65787K97788
13776I44109k73307K22149l96050l5494L13702C78452P0833M75444j72577k95084
13766D57068K21973j2050M4572n2315J55044l69021J91416B75637L49826q6274
13756E39189j90389N5420J66880L77478k62537j09146B72255J88672K80532B66549
13745E52918q016j19455J30040j60566J83750M4609P5333l26136J28697j83133
13735C18041K88935j61847O2603L24974C96787L67342j66876H1986N35451j92964
13725D24473K19312j73510J36461K09769j43673j95658O919N1540Q1075n727j48021
13714D62960J39973j38766A87497N24647j61295j49290O8953O9013j56576L44839
$$ plain form
13786 536368 949285 481853 735784 842345 606570 809255 443523 480534 646321 944109
13776 944109 670802 892951 496901 461407 775109 378452 449285 924729 752152 457068
13766 457068 679041 666991 711563 659248 814292 445271 636687 275637 625463 539189
13756 539189 348800 404220 571100 948578 686041 576895 272255 460927 741459 266549
13745 552918 544902 425447 555487 394921 578671 623280 698613 372477 501174 318041
13735 318041 606976 445129 507732 832706 396787 764129 597253 81986 617437 424473
13725 424473 643785 470275 606736 816505 672832 477174 484093 535633 616708 610981 462960
13714 462960 602933 464167 187497 712144 550849 401559 470512 539525 382949 727788
13704G27788B03640M41762J31763A59251L84694l5294j88274J02953o2917O4526
13694D24939J05985j11000j72661K92241j58082L7086J34662n6519m2366J55574
13684F09859j33771A49716L51476m1335J4522j60503R60K19250J03372B58034
13673C04032Q3110J51709J58267l33318L4075M608n606n8268K83618j55709B8318
13661A26082K94533p5554r246A12020K42051l4917R2350j23773R8734M2958k09712
13650B19711K10506K62623A97250J08028R6286J62489k14823J7784j40448J8371
13640B44937O6261M79909C63698J55620j16877j52524A24182O3100L09461j9398
13630D77345j93291o0747K0857L268K81020k07294P9188J1702j92873K84614B19178
$$ plain form
13704 727788 203640 645402 777165 159251 543945 508651 320377 423330 360413 424939
13694 424939 530924 419924 247263 539504 381422 418508 553170 496651 454285 609859
13684 609859 476088 149716 501192 459857 474379 313876 314836 534086 637458 258034
13673 304032 387142 538851 697118 363800 397875 402483 396877 338609 622227 466518 28318
13661 126082 420615 345061 335815 112020 354071 319154 411504 287731 386465 429423 219711
13650 219711 430217 692840 197250 305278 401564 564053 349230 367014 226566 244937
13640 244937 311198 791107 363698 519318 402441 249917 124182 187282 496743 477345
13630 477345 284054 223307 244164 247432 528452 321158 400346 412048 219175 503789 219178
13618F83161B39192p9737J11807J60652J10453p1178L26102A17863L62289k09671
13608B70481J32566j34158L85126B25722R8370J20402L8560j39894O1842j01871
13598C03131N9763H3383K60199e4035A05346J42144L26850A67522K36716j65791
13588B38447L18397Q3029B15779l135J68372K764j84292p1154M19321B47497q0094
13577A67403J55410N0110E4434J64636J44721j49075L09431k25287h3501C23029
13566B64119K50651B42397j13356l2778P1325j6572l7787J03892K07234A02482
13555A10215k9445J01451L90699P479K4457B12778j8023J68427J51209a6682A85657
13543A03155K61394j23481O1955H3998L03358q1753j33562K77434A89905L80114
$$ plain form
13618 683161 239192 159455 271262 431914 542367 471189 797291 117863 480152 270481
13608 270481 403047 268889 654015 225722 324092 444494 483054 343160 405002 303131
13598 303131 362894 83383 343582 -54035 105346 247490 574340 167522 404238 238447
13588 238447 556844 639873 215779 212644 381016 383780 199488 128334 547655 247497 167403
13577 167403 322813 372923 54434 219070 363791 214716 524147 298860 -83501 323029
13566 264119 514770 242397 129041 96263 167588 151016 113229 217121 424355 102482
13555 110215 80770 182221 572920 580399 604856 212778 194755 363182 514391 -16682 185657
13543 103155 364549 241068 303023 83998 387356 305603 172041 449475 189905 570019
13533E70019B19667K33102a54880C56509r2939D3072L56785j10142F2774L03318
13523C66092A01231b3190D4683K86587j26277R4432o5369J92524H2036P0492K37412
13512C89940a53034B69979F2301J62629b75525A11674q926m4808J99139J82134
13502D39213F4155J78985I6599j7263B5151L56768R6506k21129J6677L6718j14891
13491A95800A0192J55252f4235B02779J92313G2358K1902N10989D0250K35324
13481B75574m5340m2928C4448K39798a25918C2581O7325O8906F3851L17392j15931
13470B65312N2509F9467k1824M19216I5084J38454f2808F2105P2833m5604K12277
13459C01611n2881p7096q189L68665D8936K76872e9340D0199j1744J52438g347
$$ plain form
13533 570019 219667 452769 -154880 356509 263570 43072 399857 289715 62774 366092
13523 366092 101231 -23190 44683 331270 204993 299425 234056 426580 82036 152528 389940
13512 389940 -153034 269979 62301 224930 -275525 111674 102748 57940 257079 439213
13502 439213 64155 243140 96599 79336 25151 381919 478425 257296 273973 310691 195800
13491 195800 10192 165444 -64235 202779 395092 72358 94260 605249 40250 275574
13481 275574 230234 187306 34448 274246 -125918 32581 99906 168812 63851 381243 265312
13470 265312 317821 69467 47643 466859 95084 233538 -62808 62105 134938 89334 301611
13459 301611 248730 171634 163445 532110 48936 325808 -59340 40199 28455 180893 -7347
13447B20480K50200n0758a21299a0967B2941J46849E5560A3145i9808A20488D5955
13435I7661K28131f4002B37887b5327G4375K15187p0090D4455J47345H0978j5811
13424F5167K3258J22909G1621J94677H8980a48219B62440q5052o3691N9678m7402
13413A25973a5963I0268J18842p8259E369J75977K6380I0246A7424L01154E5540
13401B80053R027G1638M8037B5037K9643N8856J05245C6534K67850N0828J7376
13390C72588I4578K22185j15343o3105n9505L14715A46940R9986q1951K2267J0478
13379A97720D0912a13215B12356b4927m1744C7240L5904a8066G3182J13826F7426
13367I5045J99785A09849K11963C8625J49471B9596J28798J11101F3815L09416
$$ plain form
13447 220480 470680 419922 -121299 -10967 22941 169790 55560 13145 -99808 120488 45955
13435 97661 325792 -64002 237887 -25327 74375 289562 219472 44455 191800 80978 65167
13424 65167 88425 211334 71621 266298 88980 -148219 262440 177388 113697 173375 125973
13413 125973 -15963 90268 209110 130851 5369 181346 207726 90246 17424 318578 55540
13401 280053 289080 71638 119675 25037 54680 113536 218781 36534 304384 355212 372588
13390 372588 94578 316763 201420 138315 78810 393525 146940 246926 164975 187242 197720
13379 197720 40912 -113215 212356 -24927 -66671 37240 73144 -18066 73182 187008 67426
13367 95045 294830 109849 321812 38625 188096 29596 158394 269495 63815 373231
13357C73231A56617J84007j30607C767N8463J9309h5931B46410H0643N37172A43274
13345B6763L45236J1548D3234K89781r276b68496A64572j456a56B45422j15323
13334A30099N8944K67525B04357L78389e9788D15991j38473C3949L29011j72815
13324A90145F9776O8418c245B88977E5172i5368C51456a79049F38751a07518F3923
13312a35564A78543q533J63853M5594A30676K1989R6542Q4022C6799J88732D5355
13300B26658A06592M53119j00960n9100A27067J02814I4828B9735J04682P2369
13290B06786E6623O3303c2933B74354j13066j8014i3809E6744a01985E6184k1758
13279C4426K09707o8971l1213h6198J2076B9360K58566n6292a8790D1989L149
$$ plain form
13357 373231 156617 340624 210017 3767 62230 81539 -85931 246410 80643 617815 143274
13345 26763 371999 383547 43234 333015 323739 -268496 164572 163116 -156 245422 130099
13334 130099 189043 456568 204357 582746 -59788 415991 277518 33949 362960 190145
13324 190145 69776 138194 -3245 288977 55172 -95368 351456 -179049 638751 -107518 63923
13312 -135564 178543 170010 333863 379457 130676 152665 249207 333229 36799 225531 45355
13300 226658 106592 559711 458751 399651 127067 229881 94828 29735 134417 206786
13290 206786 56623 119926 -32933 274354 161288 143274 -93809 56744 -101985 56184 34426
13279 34426 244133 175162 143949 -86198 -74122 29360 287926 231634 -18790 41989 45138
13268D5138K37072B1426a56894c3176j84080B1123b3787A92927K8178h0619A38537
13256a11230D5904L03912A04878J12911M1071D3527j5008K4491L3083R6643r0279
13245I2457J06149a7797m7217C3514d29771a12958A73664L2768D698P8099O3848
13234A46645d4840C84732E2741c5467D51809A85795e9021C5034i9610l0815G8217
13222e3279D2591R7816l5J39504D0896L11543j24627o6008p3764J86714R2670
13211C67424j10232i765G5578k4918M1483b82869e3240i976F7390g8456B1240
13199B717f2132G1584B124h3017j16294b44E3998A9182K89283k1122a12579G0453
13186A02349L013a23034D08427a78475C1532L60057D9529J97272E1068K56863
$$ plain form
13268 45138 282210 21426 -156894 -33176 -217256 21123 -23787 192927 221105 -80619 138537
13256 -111230 45904 349816 104878 217789 258860 43527 28519 53010 86093 182736 92457
13245 92457 198606 -17797 -65014 33514 -429771 -112958 173664 206432 4698 82797 146645
13234 146645 -44840 384732 52741 -35467 451809 185795 -59021 35034 -99610 -130425 78217
13222 -53279 42591 140407 140372 279876 40896 352439 227812 161804 88040 274754 367424
13211 367424 257192 -9765 75578 50660 92143 -282869 -53240 -9976 67390 -78456 21240
13199 2717 -62132 71584 2124 -83017 -199311 -244 53998 19182 308465 287343 -112579 70453
13186 102349 105362 -123034 408427 -178475 31532 391589 49529 246801 51068 307931
13176C07931G2869h187o0201H7964J28090j0424j954N9666f9661A37947a093B04013
13163A22767b50262A20466g4227j33898e0402A69545J69022A59392n4785a25867
13152D9529i7260A14301a05977D93649g7000A01387L69065a68433K930A02033
13141a29676Q626B04807q6351l6914b80472A37202K4992h0702j152E5909R1188
13130A47097e1451B38711c1624k44949j70466a96297n1833B72808A11429O494
13120A17923L1299g4975a9656E8919K8090P7923F5869a58623A06150b387F928
13108B20441Q4771a06219j87076r866E0987b09840C80952a14231j12304A46059
13097C6060O4518K83169q4666D8069R4524J30589i3520A85593a54141B6317d8491
$$ plain form
13176 307931 72869 -8187 -68388 87964 216054 205630 203676 263342 -69661 137947 -1093 204013
13163 122767 -250262 120466 -74227 -208125 -50402 169545 338567 159392 104607 -125867
13152 49529 -97260 114301 -105977 493649 -77000 101387 470452 -168433 -165503 102033
13141 -129676 -121050 204807 118456 81542 -280472 137202 162194 -80702 -81854 55909 147097
13130 147097 -51451 238711 -31624 -276573 -447039 -196297 -248130 272808 111429 117923
13120 117923 149222 -74975 -19656 58919 87009 164932 65869 -158623 106150 -2387 6928
13108 220441 305212 -106219 -293295 -303161 50987 -209840 380952 -114231 -226535 146059
13097 36060 100578 383747 299081 48069 142593 273182 -93520 185593 -154141 26317 -48491
13085d1412J4781J707D2804b1877B02713M719n9895d8600A25904B7864b82195
13073C03759m2208j22730I060O6678a91822O0929O3805A89069P7784A05100b53605
13061h3845A48346g8864j11448A04322b9121B8210R7323L00204h0577C56242A03273
13049g2218a9436j72585B69682G6942M21631F8894L73373a33158j11974C22530
13038a13506p4817h4026B31168a4186j1203j07989H7066A5826a53080l8773p434
13027a99287D8551A1271N3556K7856a7525G5521d2689C3099P2836N0813a40062
13015D145L13200m9858B1835J77213b0563m7897B00879G3292b23329B65430a12687
13003C49892E0086J99482h2376A03932Q199J66788F7311g9176D4454J43741b81441
$$ plain form
13085 -41412 -26631 -24924 42804 -21877 202713 207432 147537 -48600 125904 27864 -282195
13073 303759 261551 138821 9060 75738 -191822 -130893 -67088 189069 266853 105100 -253605
13061 -83845 148346 -78864 -190312 104322 -29121 28210 125533 425737 -80577 356242 103273
13049 -72218 -19436 -192021 269682 76942 498573 68894 442267 -133158 -245132 322530
13038 -113506 -188323 -84026 231168 -14186 -25389 -133378 87066 15826 -153080 -191853 -199287
13027 -199287 48551 11271 64827 92683 -17525 75521 -42689 33099 105935 156748 -140062
13015 4145 317345 267487 21835 199048 -20563 -68460 200879 73292 -223329 265430 -112687
13003 349892 50086 249568 -82376 103932 112131 278919 67311 -79176 44454 188195 -281441
12991I0743l9278a16871H6400b9256A87351C90K4009b36008L3943B02349p3976
12980A28373C3646L7856a53270c7895b858p5775H4522a81183O5212K6383A49004
12968F8514a07049B47127c2873q1432A24800a48155j8562A25818J930a81003A09913
12956A71696o7183b34808C24187b506H3411C732K5265K34287r8507c12129b5865
12944e570B7583n6K17973A0220e2233B61839j20888a39487B68708a40719k8620
12933a69339C90640c07073f3725j64096B40727a55709k4285Q8991r8911H1640
12922A53425n4322P7806J07189A16539a6521N636k30658c7365B86906A25445n3409
12911G2036g5204A04078J30442b02562L3771N8474M7308A0280b84648G1873J12690
$$ plain form
12991 90743 51465 -116871 86400 -29256 187351 390 24399 -236008 -202065 202349 128373
12980 128373 33646 71502 -153270 -37895 -2858 -78633 84522 -181183 -115971 -89588 149004
12968 68514 -107049 247127 -32873 -114305 124800 -148155 -166717 125818 127748 -181003 109913
12956 171696 104513 -234808 324187 -2506 83411 3732 28997 263284 164777 -312129 -25865
12944 -5570 27583 27527 245500 10220 -52233 261839 140951 -139487 268708 -140719 -169339
12933 -169339 390640 -307073 -63725 -227821 240727 -155709 -179994 -91003 -189914 81640
12922 153425 99103 176909 284098 116539 -16521 -10885 -241543 -37365 286906 125445 72036
12911 72036 -75204 104078 234520 -202562 -168791 -110317 -63009 10280 -284648 71873 184563
12900A84563J58270j17280Q9644b31079J01388B3203J9536J60134L4748C2797
12889A10017b75023a9823k22059h4863a6378o5035A35881d0544j11712K751g1201
12877h1317o6154M7086E6568g9112j73232M6326A09693a70893a0912B0047L48219
12866C68266j82097p515d1058l0974A07802a9847l31502A45531c7654B17809d1467
12854e8160f727m4798j0918K4725A49313g8819E8166K39770B8734K04862J7500
12843B51096F0457c26281A67076o7683a25466a1237j18574N1891j59562J8080
12833b19402c5147a4130H1066a64404g0228R551A7491J96519a78225a6106I7013
12821b93918E6753J91945a6600A07690C4614R343P2708c8178j98113A69092b13013
$$ plain form
12900 184563 342833 225553 315197 -231079 -129691 23203 42739 202873 237621 32797
12889 110017 -275023 -19823 -241882 -84863 -16378 -81413 135881 -40544 -152256 -149505 -71201
12877 -81317 -147471 -100385 56568 -79112 -252344 -206018 109693 -170893 -10912 20047 368266
12866 368266 186169 178654 -41058 -72032 107802 -19847 -351349 145531 -37654 217809 -41467
12854 -58160 -6727 -51525 -62443 -37718 149313 -78819 58166 297936 28734 233596 251096
12843 251096 60457 -326281 167076 99393 -125466 -11237 -129811 -77920 -237482 -219402
12833 -219402 -35147 -14130 81066 -164404 -70228 -60677 17491 214010 -178225 -16106 97013
12821 -293918 56753 248698 -16600 107690 34614 43957 116665 -38178 -236291 169092 -213013
12809b01422C09964a27807n3847B65836a62365l7227h2366k63460g4276B08956
12798a88497A219a97588f6340q5746P5958q4746k1620B77317n5409R433b2277
12786A66843o1969L577A005c7809l48254B76462a27040B17648a99234A02826A9315
12774f9569m780A78021f5301I9665J17532e4120B28606b68302A52500M2893b17066
12762A93590f2454n0289G2989J30441b85663A01767a98821k14880A45126a63736
12751B20148a06251o775k67936I481a40487B35826e44291H2120J44659b13687
12740d3271p0555J3478B04887o0298a47114F0571i4708j16888c4275H1042a08213
12728a79287A01889r270J62158b53132B75982B0845J62056H5544J66911I633a9197
$$ plain form
12809 -201422 309964 -127807 -181654 265836 -162365 -199592 -82366 -345826 -74276 208956
12798 -188497 1219 -197588 -66340 -152086 -76128 -160874 -182494 277317 221908 231341 -22277
12786 166843 104874 108451 1005 -37809 -386063 276462 -127040 217648 -199234 102826 19315
12774 -69569 -74349 178021 -65301 99665 217197 -54120 228606 -268302 152500 195393 -217066
12762 193590 -62454 -112743 72989 203430 -285663 101767 -198821 -413701 145126 -163736
12751 220148 -106251 -113026 -380962 9481 -140487 235826 -544291 82120 226779 -213687
12740 -43271 -113826 -100348 204887 144589 -147114 60571 -94708 -211596 -34275 81042 -108213
12728 -179287 101889 92619 254777 -253132 275982 20845 182901 85544 252455 9633 -19197
12716a47570A76304e0848I9765b43960J02560k89449a47941A90971h9653B18823
12705c0830A93078f1533D69204b19110E211J06589H902K47661e1458B99371g7978
12693b27402g3981D9874J04574l2177c0061C72570b3803A63765G7177j306M5759
12682A21630b73468d6877A39954a4227n2812c95j30280B46580C8028R7875b04000
12670a58934M374L9276J5569A31789A7287J05323g6076A01765J54451j00099a96512
12658A30295F1100R5067P4987a92592B32331a6586l51527B6240R1993K38741i9691
12646A90875c46595J06163G9552R5843N5517c80571A05439a26640I7303N5542
12636A52845J74194D789P9516J94315P7861b43063j5553M9470F0249b10749a0751
$$ plain form
12716 -147570 176304 -50848 99765 -243960 -141400 -430849 -147941 190971 -89653 218823
12705 -30830 193078 -61533 469204 -219110 5211 111800 8902 256563 -51458 299371 -77978
12693 -227402 -73981 49874 154448 122271 -30061 372570 -23803 163765 77177 75871 121630
12682 121630 -273468 -46877 139954 -14227 -67039 -395 -130675 246580 38028 135903 -204000
12670 -158934 -154560 -115284 -99715 131789 17287 122610 -76076 101765 256216 156117 -196512
12658 130295 61100 156167 231154 -192592 232331 -16586 -368113 26240 118233 356974 -99691
12646 190875 -346595 -240432 79552 175395 230912 -380571 105439 -126640 97303 152845
12636 152845 327039 4789 84305 278620 356481 -243063 -258616 -209146 60249 -210749 -10751
12624i7348I6325a30511e544q680j75975D31127j91881e0463C05429a92689B0335
12612C6102M65471I5714K48518a13732B6250J07779J01665a76204C84466G2606
12601A16960b11717G9910a28517j30778J10099B01477a57906m3413G3748b9430
12590I7346J26302E7398a05726j12141A73488b59256B17997p7442c2231l12588
12580c44819R9709A641b1467m77406e894j01374H7509r480b15198B84817D4599
12568a0373k5743B6458c3090D3623a75968D7758h4034A57772F8113I24Q8e7071
12555A42795E0299a51642k71244h8100l91798D8591a57032m705O9137h988j18438
12544a27426F0815O75a62810a6130q2521F3261a24600j54927j75512g9107b3804
$$ plain form
12624 -97348 96325 -130511 -5544 -14224 -190199 431127 239246 -50463 305429 -192689 20335
12612 36102 501573 95714 344232 -113732 26250 134029 235694 -176204 384466 72606
12601 116960 -211717 79910 -128517 -259295 -149196 201477 -157906 -201319 73748 -29430
12590 97346 223648 57398 -105726 -217867 173488 -259256 217997 140555 -32231 -344819
12580 -344819 -245110 1641 -21467 -498873 -5894 -107268 87509 78029 -215198 284817 44599
12568 -10373 -36116 26458 -33090 43623 -175968 47758 -84034 157772 68113 924 1012 -57071
12555 142795 50299 -151642 -422886 -88100 -479898 48591 -157032 -161737 -92600 -8988 -127426
12544 -127426 60815 61490 -162810 -16130 -98651 63261 -124600 -279527 -455039 -79107 -23804
12532a73278K3177d260A21353b62350d4986A39099a57752E910i7500B0573a94316
12520a1942j04341B8308K75892i6542B10683f2764A10853c6612A7406K25495h9040
12508F2135N522J2442b88395E8213a82217A40508i7299A56375l2037E5756a58471
12496c0320g926A44765h0358n891B14588i2559B40378d8892k9876j13348A44283
12484b09693R4589d313j57822A46646d406j69852j8302f6476j034a0366m3331
12473e3697A62531a11410m0222e147k23701C9726j9264r321c29741A65185g3415
12461b20488D7001N4337a58792G3744J6208K0259P7150M9188c3242l5045k93571
12450c61858f9478j98082j0471i0604A44454h6375k8581B46514l9724B9909L5273
$$ plain form
12532 -173278 -150101 -4260 121353 -262350 -44986 139099 -157752 5910 -97500 20573 -194316
12520 -11942 -116283 28308 304200 -96542 210683 -62764 110853 -36612 17406 242901 -89040
12508 62135 67657 80099 -288395 58213 -182217 140508 -97299 156375 124338 55756 -158471
12496 -30320 -7926 144765 -80358 -86249 214588 -92559 240378 -48892 -78768 -192116 144283
12484 -209693 -115104 -4313 -162135 146646 -4406 -174258 -192560 -66476 -67510 -10366 -53697
12473 -53697 162531 -111410 -151632 -5147 -228848 39726 20462 11141 -329741 165185 -73415
12461 -220488 47001 101338 -158792 73744 89952 110211 187361 236549 -33242 -68287 -361858
12450 -361858 -69478 -267560 -278031 -90604 144454 -86375 -114956 246514 206790 29909 65182
12439F5182b25358A1954c35230D0241J25750o0958K2830k3159b05652R9929P863
12428i7860j00793j10525A15399a47088J3583j50042g4868G9660J4770J86693
12418B81123d9289D1475b69223A54821b36879A68151F3160o940R3698d13330I1635
12406c01568A09558b10784a3357j35826a2069j57320j7140G3672d8807k21109
12396b69916d8184j41571B09597c35510d7050C56299j29986F4209b51953B30366
12385a42831f3438J8726q8645A30980J60788j31143o5214J26272j06700a57092
12374B88937a59324e8205p9393A7819K08416b64293B8194b81590A34116l1937
12364A02179m4905b05200B0025b12131B39917a41700A14639h7852a2970j19940
$$ plain form
12439 65182 -225358 11954 -335230 40241 165991 105033 127863 104704 -205652 -105723 -97860
12428 -97860 -198653 -309178 115399 -147088 -133505 -283547 -74868 79660 94430 281123
12418 281123 -49289 41475 -269223 154821 -236879 168151 63160 56220 149918 -413330 91635
12406 -301568 109558 -210784 -13357 -149183 -12069 -169389 -186529 73672 -48807 -269916
12396 -269916 -48184 -189755 209597 -335510 -47050 356299 226313 64209 -251953 230366
12385 -142831 -63438 -44712 -133357 130980 291768 160625 95411 221683 114983 -157092
12374 288937 -159324 -58205 -137598 17819 226235 -264293 28194 -281590 134116 102179
12364 102179 57274 -205200 20025 -212131 239917 -141700 114639 -87852 -12970 -132910
12354a32910A4227J12026m8227a33029G8157a46839I8751D1819R3056f4736C44215
12342I0534i1959B4944K41126j06661b98902n4254E1869b3937o2732J7319C2373
12330b27002E1795h3216B78764j2422d0201j49747A99766a42431C32650a27372
12319A82865C7727K00162b9021A88504q5926D5677J1826J1512L2022J17429h1930
12307a4947A5037L6770g0463B31590q8316L97975k13834p3899H5635L1763a2944
12295A42726j7919k7849e0380B36462a14973C58516m1477f1573j76493E26J06981
12284A07507c33289A47482c83738p727P6072F9328h7350G0419P6187K67402G8355
12272E6086J47058F8548L94379C3990J86709b26370R5115d2077I0000b01146A91110
$$ plain form
12354 -132910 14227 126253 78026 -133029 78157 -146839 98751 41819 134875 -64736 344215
12342 90534 -91959 24944 266070 159409 -298902 -353156 51869 -23937 -86669 -69350 32373
12330 -227002 51795 -83216 278764 266342 -40201 -189948 199766 -142431 332650 -127372
12319 182865 37727 237889 -29021 188504 102578 45677 57503 69015 101037 218466 -81930
12307 -14947 15037 51807 -70463 231590 143274 541249 327415 253516 85635 117398 -12944
12295 142726 124807 96958 -50380 236462 -114973 358516 317039 -61573 -238066 526 107507
12284 107507 -333289 147482 -383738 -391465 -315393 69328 -87350 70419 146606 414008 78355
12272 56086 203144 68548 462927 33990 220699 -226370 -131255 -42077 90000 -201146 191110
12260d0925F7634K23139A27018l189L9773A861M6014O5343C6354J79150m3739
12249A71765p3364Q1849K10043N8303C3845a06599M7589I8977e5004b2939A37950
12237E648a29183L8872B11505A02790M3143D9357J84727o4853m6695k8373J95540
12226B89703c613C4049a76858K6621D6851P1111c335G4067M6194O9349a60741
12214A6579J73287C4549e376G3613J4350J96980c2718B72805F6181b3971A96897
12202B19207n6390J26711A1320L2914J95338h5077i659j50024d4554H3893O2405
12191A46298E7206p598L20626b13883b4862D2932d66291J15708A57553o8636A3842
12179C3318Q7330a65856G8931c1015D41978G4597Q5471l0842J1704a09287E431
$$ plain form
12260 -40925 67634 290773 127018 123829 163602 1861 47875 113218 36354 215504 171765
12249 171765 98401 180250 390293 448596 33845 -106599 -59010 98977 -55004 -22939 137950
12237 5648 -129183 -90311 211505 102790 145933 49357 234084 169231 122536 94163 289703
12226 289703 -3613 34049 -176858 -150237 46851 117962 -3335 74067 120261 189610 -160741
12214 16579 189866 34549 -5376 73613 87963 284943 -32718 272805 66181 -23971 196897
12202 219207 162817 289528 11320 44234 239572 -85077 -9659 -159683 -44554 83893 146298
12191 146298 57206 49608 370234 -213883 -24862 42932 -466291 -350583 157553 88917 13842
12179 33318 120648 -165856 78931 -31015 441978 74597 160068 129226 140930 -109287 5431
12167B73567B466L26230a10941l3322m2372A94352J28300K34275F0885J01657
12157A62542l410J35773r4007M657a4840A62084E9636L07654A78813k4473k9683
12146A24657a15259I3171J06542D4945M79572a5055A14251R6243L11127E4861
12135D3127J73083a11851B74661C3031A452d8419b172B6450d8834j85033a13070
12123a66862B00126b06002R537D26937b54444B42389m9182d2257C64420E4502
12112A89309c47438h8750A4291R9842a80628e6624A25957l4041M2393p349n937
12101A21023b10924R1961G0683b56443B0560J91584J76085c7726B70930j26147
12091A44783j9202B0370N712J03738L40530H6456a30648l7627I8781A9595L06333
$$ plain form
12167 273567 2466 328696 -110941 -144263 -186635 194352 322652 556927 60885 162542
12157 162542 159132 294905 200898 205555 -14840 162084 59636 367290 178813 154340 124657
12146 124657 -115259 93171 199713 44945 524517 -15055 114251 210494 521621 54861
12135 43127 216210 -111851 274661 33031 1452 -48419 -2172 26450 -48834 -233867 -113070
12123 -166862 200126 -206002 -196465 426937 -254444 242389 193207 -42257 364420 54502
12112 189309 -347438 -88750 14291 114133 -180628 -56624 125957 91916 134309 126960 121023
12101 121023 -210924 -118963 70683 -256443 20560 212144 388229 -37726 270930 144783
12091 144783 125581 20370 26082 129820 470350 86456 -130648 -168275 98781 19595 325928
12080C25928A52230a20245j69786i9571C42539J7004j27947l7002d0048B36550
12069A42659n1747J46897M4288n4281h9803j52643B03860J47055d1230j04713
12059a45943a6211B73413b5679M634C5369b54796B1322a34903B6697J94102a59487
12047B23787a00648E15116A79826p4481a68713I7513L33733e4218o7045B29039
12036A10076b03687A11365a44892p3097Q0043j74742a9623m5416E2196a44454
12025g897H466J13927E5671P9336F533L94154a37816A55727C6508i459D1211h2999
12012A11523B1805a93871A04676r405a21910b9053q169I8804a48553G8123c1659
12000e020A47659D2851b03048d1690B09247a88242f1506E7198J979M2277b44376
$$ plain form
12080 325928 152230 -120245 -290031 -99571 342539 359543 231596 194594 -40048 236550
12069 142659 90912 237809 282097 227816 -89803 -242446 203860 350915 -41230 -145943
12059 -145943 -16211 273413 -25679 -21045 35369 -254796 21322 -134903 26697 220799 -159487
12047 223787 -100648 515116 179826 105345 -168713 97513 431246 -54218 -121263 229039
12036 110076 -203687 111365 -144892 -217989 -137946 -312688 -19623 -65039 52196 -144454
12025 -7897 8466 122393 55671 135007 6533 400687 -137816 155727 36508 -9459 41211 -82999
12012 111523 21805 -193871 104676 95271 -121910 -29053 -37222 98804 -148553 78123 -31659
12000 -5020 147659 42851 -203048 -41690 209247 -188242 -61506 57198 59177 101454 -244376
11988D9849C503a23103K201D2339j6741P5049c0448m401j53490I6225a23600e5016
11975G2465e1114j96382a06629D6995b7239p8062j21633E0056b89562P2365E1789
11963E6276b51342D13891A27619A5292d31546A59135c37817a12487A01858i9529
11952a24227r9141i2146B5003P910b63926g4486k3258C11751I6671d6810A44519
11940g3640B80754O024q1248I8388R5333a67287f0904j867A44186c67767A75352
11928A2652e85696f1315n5765J4402k81427B7867O2590d2208C24981A13422h8409
11916a20655j39967g5520j02387d7087K716B09890a53876B22810b78510B54595
11905A62902J5868a61324B1517K86128p8225a7448E4607c14366e1782A64056L0986
$$ plain form
11988 49849 3503 -123103 -120902 42339 25598 100647 -30448 -34849 -188339 96225 -123600 -55016
11975 72465 -51114 -247496 -106629 46995 -27239 -105301 -226934 50056 -289562 -217197 51789
11963 56276 -251342 413891 127619 15292 -431546 159135 -337817 -112487 101858 -99529
11952 -124227 -223368 -92146 25003 32913 -263926 -74486 -97744 311751 96671 -46810 144519
11940 -73640 280754 286778 205530 98388 193721 -167287 -60904 -62771 144186 -367767 175352
11928 12652 -585696 -61315 -117080 -102678 -384105 27867 90457 -42208 324981 113422 -88409
11916 -120655 -260622 -75520 -177907 -47087 -44371 209890 -153876 222810 -278510 254595
11905 162902 178770 -161324 21517 307645 229420 -17448 54607 -314366 -51782 164056 195042
11894A95042g5012l6142I6048d11861F5832J08200a565B7614g2431D7436K33854
11883B81290b2668C989b7208k71966I6879a86695j79007E0585L7958J7159a23588
11871A2952c1221A03014a48071D4716a19965j8835K6227l9871A9741a67659I2172
11859c62606C91185c89870e8527A16670N7605a19641c5891j02411f1083C2696
11848a37489E9752J32675i0920D4843f0384k22624G5591C3550K9651b52679e2097
11836G3368a71769A71485F4392J73744g5678k38316a08808A6525e2929a7291j56194
11825a73485A47969a38566H4508b78465J31911q2342O1188a0000H8452P3051i8622
11813b62992i2545H1420c54266A3175a7929j94748l0379C80139a86365j8266p8927
$$ plain form
11894 195042 -75012 -111154 96048 -411861 65832 174032 -1565 27614 -72431 47436 281290
11883 281290 -22668 3989 -27208 -299174 96879 -186695 -365702 50585 88543 105702 -123588
11871 12952 -31221 103014 -148071 44716 -119965 -138800 -112573 -152444 19741 -167659 92172
11859 -362606 391185 -389870 -58527 116670 174275 -119641 -35891 -138302 -61083 32696
11848 -137489 59752 192427 -90920 44843 -60384 -283008 75591 33550 63201 -252679 -52097
11836 73368 -171769 171485 64392 238136 -75678 -313994 -108808 16525 -52929 -17291 -173485
11825 -173485 147969 -138566 84508 -278465 -146554 -228896 -167708 -10000 88452 161503 -98622
11813 -262992 -92545 81420 -354266 13175 -17929 -212677 -243056 380139 -186365 -204631 -283558
11802b83558a36706l1235q4767i00n07875J65889f5791q3937B16397a50674j05708
11791b56382N3798A81022a90898a1125A33010b63109H9799J14127a56193e6591
11780a08186q0587p4508a17234B27769c9026k56049A89591m2865B3349b3926C25978
11768b1883F0605h0791A85237i2949A33260c6044k5408j71496h6812B29674I4434
11756B30264J62636E3483f3287A37515D8551a21056m6530A26767A9914f3774A47938
11744c1122k28536a24873j66963O2099H8182a82087j27772F3526b89269G067J30466
11733A37533A2480K3431J56650b62055i4864C9397a19333A40897h442r5596e749
11721i2045C6642a02681C30526a29439d696m8781A88051c27826J14506A71326
$$ plain form
11802 -283558 -136706 -167941 -252708 -900 -508775 -342886 -65791 -149728 216397 -150674 -256382
11791 -256382 -202584 181022 -190898 -11125 133010 -263109 89799 203926 -156193 -56591
11780 -108186 -188773 -263281 -117234 227769 -39026 -295075 189591 146726 23349 -23926 325978
11768 -21883 60605 -80791 185237 -92949 133260 -36044 -61452 -232948 -86812 229674 94434
11756 230264 392900 53483 -63287 137515 48551 -121056 -167586 126767 19914 -63774 147938
11744 -31122 -259658 -124873 -291836 -229737 88182 -182087 -309859 63526 -289269 7067 137533
11733 137533 12480 35911 192561 -262055 -94864 39397 -119333 140897 -8442 -104038 -5749
11721 -92045 36642 -102681 330526 -129439 -4696 -53477 188051 -327826 -213320 171326
11710E3246J82101e631l5349C1220b5583A00312b83724h6120L4505F6364j2018
11699E4346K7870a58931C3834a55982A38578A1291d8582I2815N4061a59403A25388
11687d0729q0815E8597a84893M2973F219i4002q3163d1981B28891B4609L3460
11676E8069e4723A48135G713a14893D45026A5720d8709K1816A14809J00637I9603
11664B74462h3142A0603b90246A5326a92946B15267c45635J47917A15771B4591
11653a7181e930A5881a23C8413a33998A28831k8915R1728a98849A74313a60146
11641E9938d1948j30756b3590A15394e639k578B52015A17768J2226B9557K27531
11630B57088d3524m1289H9604a69758H9511B1234c4569j42028Q8142A62801J96457
$$ plain form
11710 53246 235347 -5631 -40980 31220 -25583 100312 -283724 -86120 -51615 66364 54346
11699 54346 82216 -158931 33834 -155982 138578 11291 -48582 92815 146876 -159403 125388
11687 -40729 -121544 58597 -184893 -141920 6219 -94002 -177165 -41981 228891 24609 58069
11676 58069 -54723 148135 7713 -114893 445026 15720 -48709 -26893 114809 215446 99603
11664 274462 -83142 10603 -290246 15326 -192946 215267 -345635 -197718 115771 24591
11653 -17181 -5930 15881 -123 38413 -133998 128831 99916 191644 -198849 174313 -160146
11641 59938 -41948 -172704 -23590 115394 -5639 -8217 252015 117768 129994 29557 257088
11630 257088 -43524 -84813 89604 -169758 89511 21234 -34569 -176597 -88455 162801 359258
11619C59258p3095b76527H8724b44027h7090k51903L9135J34826F0230a44414
11608D7978b73384B51967j8857A14221a69150A21671k3546l6284d7572k7190K377
11597g2385A0225a55090A92321n2797a49762A12626n4155b3662j2240D2607f9289
11585a91673C85274j83590b43570B11956a09546E8574M6064m8308M59551c0114
11574E5221L0282k9365J95331j11264J28577O7702j34627b1858I9209a64463a8250
11562C41104A53953b15829M5102A09985l6815j3650d5050j03747D4499K64050
11552C08549G7377f0922j3215N821A11407J9988c92706J18124R7598g9485o818
11541h6303A28628b8783A31634J17710B243f025I8655E072J05224l1744a14666
$$ plain form
11619 359258 286163 -276527 88724 -244027 -87090 -338993 -299858 -165032 60230 -144414
11608 47978 -273384 251967 233110 114221 -169150 121671 98125 61841 -47572 -74762 -72385
11597 -72385 10225 -155090 192321 139524 -149762 112626 58471 -23662 -35902 42607 -69289
11585 -191673 385274 201684 -243570 211956 -109546 58574 104638 56330 515881 -30114
11574 55221 85503 56138 251469 140205 268782 336484 201857 -21858 99209 -164463 -18250
11562 341104 153953 -215829 -170727 109985 73170 59520 -45050 -148797 44499 308549
11552 308549 77377 -60922 -74137 -68316 111407 131395 -392706 -274582 -176984 -79485 -86303
11541 -86303 128628 -28783 131634 249344 2243 -6025 98655 5072 110296 78552 -114666
11529a16455d8763k42500D7332c2673B66753A26963n5704f5893m1693j30575A12640
11517a3529j06616A17089b9291j2323A04572b17818E5353J74216e18874c9714
11506a85364g2146q0883a4261k12824f2951A76809k2234b7157j31559A97466B481
11494B81406A03397J13377A2059N51J70447o3245a00694A04670K17802F8378J45753
11483B14131j02538n0510H333L0372J46950e9658j6713R824A3997J75000g2717
11471c5720F0010L7094Q4295f7689A91293F4014a94686I8067B0280L71412A26894
11459G9909l1866P5644a80611A50862a03126E9758J52162p903b8891j6467P255
11448c8103A06055l8347B1505d4412B79108i060G4572a76042F113a58365B33063
$$ plain form
11529 -116455 -48763 -291263 47332 -32673 266753 126963 71259 -65893 -107586 -238161 112640
11517 -13529 -120145 117089 -29291 -41614 104572 -217818 55353 229569 -518874 -39714
11506 -185364 -72146 -153029 -14261 -227085 -62951 176809 154575 -27157 -158716 197466 2481
11494 281406 103397 216774 12059 12610 183057 119812 -100694 104670 322472 68378 214131
11483 214131 111593 61083 8333 38705 185655 -59658 -76371 -66547 13997 188997 -72717
11471 -35720 60010 97104 181399 -67689 191293 64014 -194686 98067 20280 391692 126894
11459 79909 48043 123687 -180611 150862 -103126 59758 211920 204017 -28891 -45358 -38103
11448 -38103 106055 67708 21505 -44412 279108 -9060 74572 -176042 6113 -158365 233063
11436A51770a17905A71554d8415k168r5900F5887J67853D5428i5358I7983g0769
11424f741r3260q7190g0730j4223M1724A37458m6211C2074a21251B7954L01671
11413C29625E7466h7339J1453m0546A76235a07438D3676J23632J38149j42474
11403A62983J04635a83780B32701i1923n2119F7615J6522L68087k07105b42296
11392A26545i4230P957o0254L007k15857G4671d8988k93906J35089L6709j11111
11381b82207G8383L7989E1044J2324J91844a98593C60892R922a76341M5620E4894
11369a61163j57034D7790i5262k98740D357K7427O2861c5784R238r7804B42688
11357c3724A87579N3796l2857g2991k25283d2910j1554A30286q106f5694G941
$$ plain form
11436 151770 -117905 171554 -48415 -50583 -146483 65887 233740 45428 -95358 97983 -70769
11424 -6741 -100001 -187191 -70730 -84953 -43229 137458 91247 32074 -121251 27954 329625
11413 329625 57466 -87339 -75886 -116432 176235 -107438 43676 167308 305457 162983
11403 162983 267618 -183780 232701 -91923 -144042 67615 84137 452224 245119 -242296
11392 126545 -94230 -86273 -146527 -143520 -359377 74671 -48988 -342894 -207805 -171096 -282207
11381 -282207 78383 116372 51044 63368 255212 -198593 360892 370814 -176341 -130721 54894
11369 -161163 -318197 47790 -95262 -394002 4357 31784 94645 -35784 -26546 -124350 242688
11357 -33724 187579 241375 208518 -72991 -298274 -42910 -54464 130286 122180 -65694 7941
11345I9054c2610j9122E5074J63666k3333B3748Q3425j5568d21252A70777c68487
11333A36271c39154B7816b45696a15217q6524F2086a01029d4034B32612e8387
11322D85630e8724A61694b8436j62473K4390C1204a81693M3095d2575r743k28004
11311b80322a25372e269C4012J28961c99647F6767j6817M2120j1879C6270a7501
11299b86470b4039j42456H6751J31550c26024P4784B6264J62087F1758d2991m400
11288d7391j29371A89631E8464a75962F3423i0366n3002b9046r6671A80366b85917
11276c93632J60460G2040b35861A87821E660c8963Q87j02536C18097d35765B27779
11264e5629B8070c7973k04088a05820k3370k18151J29101A68093e3295A9884a00936
$$ plain form
11345 99054 -32610 -51732 55074 218740 195407 23748 107173 91605 -421252 170777 -368487
11333 136271 -339154 27816 -245696 -115217 -201741 62086 -101029 -44034 232612 -58387
11322 485630 -58724 161694 -28436 -190909 -166519 31204 -181693 -138598 -42575 -52318 -280322
11311 -280322 -125372 -5269 34012 162973 -399647 66767 49950 92070 80191 36270 -17501
11299 -286470 -24039 -166495 86751 218301 -326024 -251240 26264 188351 61758 -42991 -47391
11288 -47391 -176762 189631 58464 -175962 63423 -90366 -143368 -29046 -125717 180366 -285917
11276 -393632 -233172 72040 -235861 187821 5660 -38963 -38076 -140612 318097 -435765 227779
11264 -55629 28070 -37973 -242061 -105820 -129190 -347341 -218240 168093 -53295 19884 -100936
11252b63430A6626c35874G9831R9668a16107q1224j89b3452A37306i723k09672
11241b19395L8153A47827d9306g466j37885A2798O7763J36965F2948N7116e9387
11229a00175H2270c07968B85671b69300a27631L92K2114n3676K3640g625A82574
11217c68713a75564f4491G0412a15309A33374K04759b230l74500J25420Q7043
11207a64267Q0726d1675p066p5217m5253k4729Q5968D7168J65c8365j72599A76417
11194a06596C4471b5400j68490c2074p5841B62193c8457k70603m2075a00033o8869
11183a68902A42376e8276A40439d475A65088a21133d9313A31681a31932k4281
11173a56213J5090p4367C8072a11410j22463A2659c0974k51727P9005j05453A55595
$$ plain form
11252 -263430 16626 -335874 79831 179499 -116107 -197331 -197520 -23452 137306 -9723 -219395
11241 -219395 -181242 147827 -49306 -7466 -145351 12798 80561 217526 62948 120064 -59387
11229 -100175 82270 -307968 285671 -269300 -127631 -127239 -105125 -158801 -135161 -7625 182574
11217 -368713 -175564 -64491 70412 -115309 133374 338133 -2230 -376730 -251310 -164267
11207 -164267 -83541 -41675 -48741 -123958 -169211 -193940 -107972 47168 47333 -38365 -210964 176417
11194 -106596 34471 -25400 -193890 -32074 -107915 262193 -38457 -309060 -351135 -100033 -168902
11183 -168902 142376 -58276 140439 -4475 165088 -121133 -49313 131681 -131932 -156213
11173 -156213 -141123 -215490 38072 -111410 -233873 12659 -30974 -282701 -203696 -309149 155595
11161h4869j09422M9176A16009a6784j09127q907A86214A1638e0870p3586d4429
11149a18901m9934I234L1100c99650a29896j46168B51107f8294m834H4939c4717
11137d7019G3746b93311a10206A26900j1912h057A27235d52149e3172B4340j1773
11126A2567a20501A55586i638B86516a01145E3125K0965b33064c8899k37887O6777
11115b10009e3924k8526c8960J8754F26187C3788J6817K9139a04645o4929C08343
11103B16040D7883e3169A76537b63522C3909R5510O858d48969E1199c65152I7265
11091C2602O9607d343j21666m0648B90804E7087J08733O982C5292N583a21649
11079C10811f7151j98828c9968A22133b8867Q939j09933H7456L349J17561D6578
$$ plain form
11161 -84869 -194291 -145115 116009 -16784 -125911 -134818 186214 11638 -50870 -124456 -44429
11149 -118901 -168835 9234 40334 -399650 -129896 -276064 251107 -68294 -73128 84939 -34717
11137 -47019 73746 -293311 -110206 126900 114988 -8057 127235 -452149 -53172 24340 12567
11126 12567 -120501 155586 -9638 286516 -101145 53125 74090 -233064 -38899 -276786 -210009
11115 -210009 -53924 -82450 -38960 -20206 626187 33788 50605 79744 -104645 -169574 308343
11103 216040 47883 -53169 176537 -263522 33909 129419 136277 -448969 51199 -365152 97265
11091 32602 102209 -4343 -126009 -166657 290804 57087 165820 172802 35292 40875 -121649
11079 310811 -67151 -265979 -39968 122133 -28867 -19928 -129861 87456 90805 208366 46578
11067a09226B31601K89C2246J12067d494j020j0697B81064j40499b28008C18257
11055C28660l2312b142j55395A23510K81721h798A23550L79781E4940M03562o7276
11044C91226n4509A30588L44833j78408B1646M61349O7274J81073k48831j37471
11034C45040L6978q0291e730F75134j27417j8004A34607M33865J36710k11032
11024D94150J11107k25316A34696M25707k1538J23163k78238K48688B17934J36644
11014C54578A59967K38825M7585L1686k00333K90568k29786K63975o2343j80733
11004C59411J05701J10156B76454M4367K97128j35331j27331q2934J71047k916
10994D40484A79422K09395A81268L88123k37549K82965k19916M1077L7986o381
$$ plain form
11067 -109226 231601 231890 32246 144313 -4494 -5514 -16211 281064 140565 -228008 318257
11055 328660 296348 -2142 -157537 123510 405231 -8798 123550 503331 54940 458502 391226
11044 391226 336717 130588 475421 297013 21646 482995 550269 731342 482511 345040
11034 345040 382018 301727 -5730 675134 547717 529713 134607 568472 705182 494150
11024 494150 605257 379941 134696 560403 538865 662028 383790 632478 217934 354578
11014 354578 159967 398792 446377 478063 277730 568298 338512 602487 540144 359411
11004 359411 465112 575268 276454 320821 617949 482618 355287 272353 443400 440484
10994 440484 179422 388817 181268 569391 331842 614807 394891 435968 473954 467573
10984D67573k18683R4451K6437M9426M7999o6197K56998B00392I7175N02169F387
10972C77660K66682j92494J6175J27689L8894k1454N184p5266j09527L39091J93634
10961I66268k63208R3049J12478K63871j05362K23285L20214l02970K69719p1534
10951A505810q6331o5159R7567m8792l3172r8419j13124j13458M13137m52778
10941A005281R2313J18192j73114K7969K04869J34937k51705J63974o4535l09905
10931I48276q2118j91305L1374j84443P3510j46083j39894r0878M59683B04329
10920A19515b36070h3774B10308j177j3756h839k19075e2053j28103C271b1875
10908E3089b73457A29640B141a66581q6188J18196A90559q7512K23976j61940
$$ plain form
10984 467573 248890 343341 369778 419204 467203 401006 658004 200392 97175 599344 6387
10972 377660 644342 451848 468023 595712 634606 613152 618336 543070 433543 772634 966268
10961 966268 703060 796109 908587 1172458 1067096 1290381 1610595 1307625 1577344 1505810
10951 1505810 1419479 1354320 1451887 1403095 1369923 1271504 1158380 1044922 1458059 1005281
10941 1005281 1097594 1215786 1042672 1070641 1275510 1410447 1158742 1322716 1258181 948276
10931 948276 866158 674853 706227 521784 595294 449211 309317 218439 678122 204329
10920 119515 -236070 -83774 210308 209131 195375 -8839 -227914 -52053 -180156 3271 -21875
10908 53089 -273457 129640 2141 -166581 -252769 -134573 190559 103047 327023 165083
10898A65083a14578I7086I132b7048j4108B34189n5987j8158Q6372c9586k95122
10887c34708J61327b3378A61888B81b76776g5592C86524c50563J64230f8580O098
10876f2482A6284c89562J22472A67827b16813G2190i8673A10888l6707f4771n9191
10865a23962j0852F1852O647b02927l3016g1537j51776p7504R3714I8044f7406
10853g3542n6950A76337B3718L6511b35984g0747J1081k14146c2026G2474b6444
10841E3778K01015F131K663h4132j02087A54041e7085B17062m8458q1371J48592
10830B35825A7894J04507b51335j75707a47493l2849O2834e6340B71902b75229
10819B7352d0878p8035b106k04386P6171A36633o2321a51988E8314g3834B71407
$$ plain form
10898 165083 -114578 97086 9132 -27048 -41156 234189 178202 160044 246416 -39586 -334708
10887 -334708 -173381 -23378 161888 281 -276776 -75592 386524 -350563 -186333 -68580 -62482
10876 -62482 16284 -389562 -267090 167827 -216813 72190 -98673 110888 74181 -64771 -123962
10865 -123962 -134814 61852 68499 -202927 -235943 -71537 -223313 -300817 -207103 98044 -67406
10853 -73542 -130492 176337 23718 60229 -235984 -70747 -59666 -273812 -32026 72474 -26444
10841 53778 254793 6131 8794 -84132 -186219 154041 -57085 217062 168604 87233 235825
10830 235825 17894 122401 -251335 -427042 -147493 -180342 -117508 -56340 271902 -275229
10819 27352 -40878 -118913 -2106 -206492 -130321 136633 74312 -151988 58314 -73834 271407
10807I3259f7701k04413f2840G6252b92554I105a88889j03974j19710K6971c2911
10795A64926a60597g7946E7346b50250A9507i8121n380B20645a948k60388B52389
10783a20319B19825a40436e9418j7680j34237F0546o591P7232b43460N4514B51146
10771c0415A17343c06357J00811E4003a65685q080c3402j0119h650A75836b30893
10759F3401a56082P6627c4653k1536b484j83963O7829D4933b04586A24951G13
10747d09668F3316c8852A50803b87073g7063k15022A76436C3613J07423b1972
10736b0401A0580J82339b33746A04839C3746c0878A55635a47407i660k25937i9959
10724C22248A41951e5873C4888d9730h51l21331j08107a15230K3916o8384m8239
$$ plain form
10807 93259 -67701 -272114 -62840 76252 -292554 9105 -188889 -292863 -412573 -385602 -32911
10795 164926 -160597 -77946 57346 -250250 19507 -98121 -103501 220645 -1948 -262336 252389
10783 -120319 219825 -140436 -59418 -77098 -211335 60546 53955 131187 -243460 -188946 251146
10771 -30415 117343 -306357 -205546 54003 -165685 -173765 -33402 -43521 -8650 175836 -230893
10759 63401 -156082 -79455 -34653 -56189 -2484 -186447 -118618 44933 -204586 124951 713
10747 -409668 63316 -38852 150803 -287073 -77063 -292085 176436 33613 141036 -21972
10736 -20401 10580 192919 -233746 104839 33746 -30878 155635 -147407 -9660 -235597 -99959
10724 322248 141951 -55873 34888 -49730 -851 -322182 -430289 -115230 -91314 -159698 -207937
10713b07937A71019d8847j39381j7601f2216A5878a93472L1325a6977E5528f6676
10701i9683b3971A25306a36896n2700C33567A17003d46828a99300O6568k69735
10691d02467A43764c53510b0840C57166A77232a27750E2563M2253l7113a08954
10680d3159l20398a17689A22042b362F3119a56119f6633k89645a08665c0460p154
10669c7614q6787A20638N8436c68341a12216A46603a22442b4240j30579j43958
10659b98777J20834r4882J01890B76221I0167h7494k8283H0179B2421N6714C8422
10647A25332C3638P011J4568j8265b48401d4236J9686m39339K10823c1429l6917
10636f8346C7065J58474c8668I0421a96301j13961E6960c6933D7785N1165a25776
$$ plain form
10713 -207937 171019 -48847 -188228 -205829 -62216 15878 -193472 -162147 -16977 55528 -66676
10701 -99683 -23971 125306 -136896 -189596 333567 117003 -446828 -199300 -132732 -402467
10691 -402467 143764 -353510 -20840 357166 177232 -127750 52563 94816 57703 -108954
10680 -43159 -363557 -117689 122042 -2362 63119 -156119 -66633 -356278 -108665 -30460 -37614
10669 -37614 -124401 120638 179074 -368341 -112216 146603 -122442 -24240 -154819 -298777
10659 -298777 -177943 -272825 -170935 276221 90167 -87494 -115777 80179 22421 79135 38422
10647 125332 33638 40649 55217 36952 -248401 -44236 -24550 -463889 -253066 -31429 -68346
10636 -68346 37065 195539 -38668 90421 -196301 -310262 56960 -36933 47785 98950 -125776
10624a56383A01515c69507a0560D1801a03734B32136b09285E2656D206g072C2276
10612c56190b2114l19600a30149D1858K16513C368d40069J98948D8693a84237
10601g1909L3715K962A97395b04812k1742F8101c9923j29169G3439a12535A30012
10589b42581b6600j82971C3987d59240e4867F4378b12390g6585c023l2393l25560
10578c60976B44762q9633g4544k73073B86438b82540A15611b44341E7568b0191
10567b29825e421A36398c27564A74604a92785P6628A29463m3923J38181C7246
10556a18795N3238A37370b01146f140j33202j39699f1644A70449a02577k27191
10546c29768o3923q8439h4405A93918a82025k9104n1702F3446K2173M0525m7065
$$ plain form
10624 -156383 101515 -369507 -10560 41801 -103734 232136 -209285 52656 4206 -7072 32276
10612 -356190 -22114 -341714 -130149 41858 258371 3368 -440069 -241121 48693 -184237
10601 -71909 -38194 -35232 197395 -204812 -226554 68101 -39923 -169092 73439 -112535 130012
10589 -242581 -26600 -209571 33987 -459240 -54867 64378 -212390 -76585 -3023 -35416 -360976
10578 -360976 244762 155129 -74544 -347617 286438 -282540 115611 -244341 57568 -20191
10567 -229825 -5421 136398 -327564 174604 -192785 -116157 129463 85540 223721 37246
10556 -118795 -65557 137370 -201146 -6140 -139342 -279041 -61644 170449 -102577 -329768
10546 -329768 -393691 -482130 -84405 193918 -182025 -211129 -262831 63446 85619 126144 79079
10535G9079a93315B27492R5786a11836o1B27224a91977j5911A3105h5752l2460
10524a18212c0075A01148b44082h5433a9501j15019a3095l22331g6329K4778o925
10513e8476j59132A11003a70897I1866a94263N1411c3512F1477a82890I7873h0123
10501B73314c157j88943f9305r6517K50l7399B90902g6762E4675b96391i9843
10489a3492r0226n2781k466k2614m0476f1418A29168J87863h2541c5053F9187
10477G0053e2412I8143O8764b2045q5125N0447A31168k532a76957A95329i2289
10465f0519C5755J91384I7534k4011M1585K61462j57036m5850J61837A03842k3392
10454H0450L61812A79066K319o4764J22500r6529a23284A18554c1743C7721a98699
$$ plain form
10535 79079 -193315 227492 323278 -111836 -111897 227224 -191977 -207888 13105 -85752 -118212
10524 -118212 -30075 101148 -244082 -85433 -19501 -134520 -13095 -335426 -76329 -51551 -58476
10513 -58476 -217608 111003 -170897 91866 -194263 -142852 -33512 61477 -182890 97873 -80123
10501 273314 -3157 -192100 -69305 -165822 -165572 -202971 290902 -76762 54675 -296391 -99843
10489 -13492 -103718 -156499 -158965 -181579 -222055 -61418 129168 317031 -82541 -35053 69187
10477 70053 -52412 98143 166907 -22045 -107170 -56723 131168 128636 -176957 195329 -92289
10465 -60519 35755 227139 97534 73523 115108 376570 219534 173684 335521 103842 80450
10454 80450 442262 179066 181385 116621 239121 142592 -123284 118554 -31743 37721 -198699
10442b30005f9717F5486e6398j56785G0333g6871A2890b79291E7564g4665b8484
10430A43325a73236B443K12887K5207a89135B94056a16111F4024k9881a13284
10419i0700j12228a1738k3957l70655A10346m1016b16988h4548l58025A839h1325
10407b63953J11823j20545o1504c4470B18663d26486J12975J01008G6900j2735
10397F4165K09052A27985J55058H7976g6305j77290d4315I2736a51656j53862
10387c05518d1597B8043a62121d5458B54377b41920A14966C638P3948a58022A77934
10375i7172d5911A37919e7933n6450j49043a30335H2124f022H3796J28485J62291
10364C74572A36491b5818B04595a21788A25558Q5005r1040J55350b35775a4819
$$ plain form
10442 -230005 -69717 65486 -56398 -213183 70333 -76871 12890 -279291 57564 -74665 -28484
10430 143325 -173236 2443 215330 240537 -189135 294056 -116111 64024 34143 -113284
10419 -90700 -202928 -11738 -35695 -406350 110346 69330 -216988 -84548 -442573 1839 -81325
10407 -263953 -152130 -272675 -334179 -34470 218663 -426486 -313511 -212503 76900 64165
10397 64165 273217 127985 283043 87976 -76305 -253595 -44315 92736 -151656 -305518
10387 -305518 -41597 28043 -162121 -45458 254377 -241920 114966 3638 77586 -158022 177934
10375 -97172 -45911 137919 -57933 -114383 -263426 -130335 82124 -6022 83796 212281 374572
10364 374572 136491 -25818 204595 -121788 125558 210563 119523 274873 -235775 -14819
10353B00216a45350B43185G1559J91864J0660j17744R1483j05595K19902B9388
10342C07214B5573L36931I4117J50799b533B3222L09030K67247r8214B06602e9510
10330a55942B8022D347a71578B97163A28134n7813b54399C84134A88321b2436
10319C5871c2656B68805F4185J76414f5158l5703k1237a002D85171j05739r3764
10308B85668C3025n119K76600L439A8584N08121c6794H9501A204L00181o675a58945
10295B50045q3261J50478C9026h1798j3564O902m2540I5472e6337A13373a64052
10283A60668c09679P0585c2296r6103j24609f1685k36251Q0950O0678A30370d4809
10271B71963c9307A18975a01344B5423b41556Q1542m773r465A99220o7488i7529
$$ plain form
10353 200216 -145350 243185 71559 263423 274083 156339 247822 142227 362129 29388
10342 307214 25573 362504 94117 244916 -2533 23222 332252 599499 501285 206602 -59510
10330 -155942 28022 4347 -171578 297163 128134 70321 -254399 384134 188321 -22436
10319 35871 -32656 268805 64185 240599 -65158 -100861 -122098 -1002 485171 379432 285668
10308 285668 33025 27906 304506 307945 18584 526705 -36794 89501 1204 301385 294710 -158945
10295 250045 166784 317262 39026 -81798 -95362 -88460 -131000 95472 -56337 113373 -164052
10283 160668 -309679 -239094 -32296 -128399 -253008 -61685 -297936 -216986 -156308 130370 -44809
10271 271963 -39307 118975 -101344 25423 -241556 -160014 -164787 -174252 199220 131732 -97529
10259a50296O3815m8206A96407h3352H9254a79113k18860h79l03068d1737l49556
10248c91293d6107F8475b31468B26354G0440b52397a8941B96077h502D2423J42182
10237A84605J65117h0844I8062b2327M433I8051k4763b70062A5398h7288a7084
10225a12210j28241B77891A09308C2487Q3172a4144k04492h956B7898c23387A36962
10213b62948k7246P6902B20879a72606C07877j09156a32553E9872f6964a6920
10202B35412a28404J4207j89353A9706a41968A73113J9655c7567r7360A06349
10191c43502B0962K8220P368C045K22627B6578R5322P504a35439N4691j45144
10180b25892a08953D3635c75373B38653m6513d69083a55360O3961j2120D6119
$$ plain form
10259 -150296 -86481 -134687 196407 -83352 89254 -179113 -397973 -879 -303947 -41737 -391293
10248 -391293 -46107 68475 -231468 226354 70440 -252397 -18941 296077 -8502 42423 184605
10237 184605 349722 -80844 98062 -22327 -17894 98051 73288 -270062 15398 -87288 -17084
10225 -112210 -240451 277891 109308 32487 115659 -14144 -218636 -8956 27898 -323387 136962
10213 -262948 -290194 -213292 220879 -172606 307877 198721 -132553 59872 -66964 -16920
10202 235412 -128404 -114197 -303550 19706 -141968 173113 192768 -37567 -134927 106349
10191 -343502 20962 49182 56550 3045 225672 26578 121900 129404 -135439 -80748 -225892
10180 -225892 -108953 43635 -375373 238653 192140 -469083 -155360 -91399 -103519 46119
10169a63298B91975d231q1167l1187B314b8867B0174K43673c246C2718b00180
10157d2939a218G9918c48766o0740i4590c2618A05974a99406P2024G8489j6880
10146F1609c10087J54444A88675N1357a35430j89072A36169J68885d4300l0197
10136g4497j78509l364L9735P1013r3087j01897A47738D0912i9868m8214l1364
10125a79446j39173M7095F2115a23365H0040a1771A71837G9892b58622J22487
10115a36135j04853J18621q7045a6109A27598a6230A91714b40798h132j13754
10105a21886j26476B8535J45270i7019o789p6280k43939b0700B0595h4381J3362
10094g1019j33826o2703c7147A34875a69618A14966a28414q6266J2432j41289
$$ plain form
10169 -163298 291975 -4231 -85398 -116585 2314 -28867 20174 263847 -3246 32718 -200180
10157 -42939 -1218 79918 -348766 -409506 -94590 -32618 105974 -199406 -127382 78489 61609
10146 61609 -310087 -155643 188675 240032 -135430 -324502 136169 305054 -44300 -74497
10136 -74497 -253006 -256370 -216635 -145622 -238709 -340606 147738 40912 -99868 -148082 -179446
10125 -179446 -318619 -271524 62115 -123365 80040 -11771 171837 79892 -258622 -136135
10115 -136135 -240988 -122367 -209412 -16109 127598 -16230 191714 -240798 -8132 -121886
10105 -121886 -248362 28535 173805 -97019 -103808 -180088 -424027 -20700 20595 -84381 -71019
10094 -71019 -204845 -267548 -37147 134875 -169618 114966 -128414 -214680 -202248 -343537
10084c43537E6362i9754B0173a07409k59302M6742m7702D4337c73003D74927G2304
10072I938f7121m31456E1335b11154A2550a95562j0950n9461B86294b6298C19735
10060B11069d4948k74229d1337j62036c6223B64554e0830q7643B0965c6007j28924
10049a64931a8487j4846C9063O1996b17532B4869g455j08576b4584E9555h3428
10037D0796a26862L451N8445A11202b63791g6576k06385j17413a7264F5937d40026
10025c00651D707i5371j61213d9917D8988a55890A71455C2865b31017Q5245n8338
10014b04110J7111A3492e42442a50882b9455B85574c74550n8292F0017c3723k9464
10003f3187a0331k6670H7772A4044b40114n6124b0150A17823O8025c25738A71628
$$ plain form
10084 -343537 56362 -99754 20173 -107409 -366711 -319969 -367671 44337 -373003 474927 72304
10072 9938 -67121 -498577 51335 -211154 12550 -195562 -206512 -265973 286294 -26298 319735
10060 211069 -44948 -319177 -41337 -203373 -36223 264554 -50830 -138473 20965 -36007 -164931
10049 -164931 -18487 -33333 39063 101059 -217532 24869 -7455 -116031 -24584 59555 -83428
10037 40796 -126862 -123411 -64966 111202 -263791 -76576 -282961 -400374 -17264 65937 -440026
10025 -300651 4707 -95371 -256584 -49917 48988 -155890 171455 32865 -231017 -145772 -204110
10014 -204110 -186999 13492 -542442 -150882 -29455 285574 -374550 -432842 60017 -33723 -63187
10003 -63187 -10331 -37001 87772 14044 -240114 -296238 -20150 117823 185848 -325738 171628
9991b14804m2219j2059d1559j04243j38760G9427j2716b40317Q3109A12403b25242
9979b7228H8216b03392j04576C84267a19305D213d3964q7633A8107d4342l7354
9968h1696q1937C0576b333D1949J4850b77935c8723j13717A15033M9048a82505
9956A52039j1918a64450E8614a32858G2941a32651D1837a84526K7588B05669M623
9945B10292a8295B39149g8485l51609a22905B43469F6409c09796B57896f2544
9934A21856a51430C3007Q5761R2358O790h1059r410A00451B4380c15402A81214
9922a42233J6795L7924B364c35134d2331j13898A08438D4335c05305B65474G2099
9910a49677f4594D13903b62502L9801A28722a4626O04B18375a36238G7711J17674
$$ plain form
9991 -214804 -257023 -269082 -41559 -145802 -284562 79427 66711 -240317 -157208 112403 -225242
9979 -27228 88216 -203392 -307968 384267 -119305 4213 -43964 -131597 18107 -44342 -81696
9968 -81696 -163633 30576 -2333 41949 56799 -277935 -38723 -152440 115033 164081 -182505
9956 152039 140121 -164450 58614 -132858 72941 -132651 41837 -184526 -156938 205669 210292
9945 210292 -18295 239149 -78485 -430094 -122905 243469 66409 -309796 257896 -62544
9934 121856 -151430 33007 118768 211126 217916 -81059 -90469 100451 24380 -315402 181214
9922 -142233 -125438 -87514 2364 -335134 -42331 -156229 108438 44335 -305305 265474 72099
9910 -149677 -64594 413903 -262502 -222701 128722 -14626 -14022 218375 -136238 77711 195385
9899A95385q5264a77093B74084j19443d8573j20722j8067r7290a12310k06387
9889c18697r6806I025a79878j74093a49272A1837h9559j25063j56132B1909a78236
9877b00358M9615J3615G4453f8814A41548e8620n27532F2350b65517j79557i8914
9865b38859A49981d39015a12166p4260h8095J0101k37128A60664a48672j92074
9855c40746a20970l49182J07918h7818b2178G2757d7125j02473A97530i9833n1258
9844a51091l8886f9122A83698o7085N2020e39476a71759B62014A4256a16607c9943
9832a90996E8422o471c7161k52559a10058j94676P5043P7470A18988b26471g9550
9820b2629j71210j24279J19713N51q7320m2161D3266J4581a21092D54931b46400
$$ plain form
9899 195385 110121 -177093 274084 154641 -48573 -169295 -187362 -284652 -112310 -318697
9889 -318697 -415503 9025 -179878 -353971 -149272 11837 -89559 -214622 -370754 21909 -178236
9877 -200358 -150743 -137128 74453 -68814 141548 -58620 -586152 62350 -265517 -445074 -98914
9865 -238859 149981 -439015 -112166 -186426 -88095 -77994 -315122 160664 -148672 -340746
9855 -340746 -120970 -470152 -362234 -87818 -22178 72757 -47125 -149598 197530 -99833 -151091
9844 -151091 -189977 -69122 183698 116613 168633 -539476 -171759 262014 14256 -116607 -39943
9832 -190996 58422 51951 -37161 -289720 -110058 -304734 -229691 -152221 118988 -226471 -79550
9820 -22629 -193839 -318118 -198405 -197854 -285174 -327335 43266 57847 -121092 454931 -246400
9808H0386a54271e9309j0801k60084C818P3612c58842A35752d88l30088B6748
9796d06286j81383c1290G5798a48085k65841H6124g6291A35651b60212a25241
9785d0957I5593a19520A01345b34655d7045j10395A40021b15553A30869m7381
9775H3488G75d31950c7340q0941K9123K1678j0202c4891j8593j30444p0665K4116
9763b30477d9309h595r3128j06352C5215N6945C5267b13266B93489c81175J54763
9752b26412D5437a84861c1025J4120k00398i5487e634j4457A62564k3842i8887
9740c8812j46393B26716b09135e0009A80417b21913A35304f5351B18773c97190
9729e1651h880A86922i8614h805j948B4903a9640A63985b0412A06876e063E7148
$$ plain form
9808 80386 -154271 -59309 -70110 -330194 3818 77430 -358842 135752 -488 -330576 26748
9796 -406286 -587669 -31290 75798 -148085 -413926 86124 -76291 135651 -260212 -125241
9785 -40957 95593 -119520 101345 -234655 -47045 -157440 140021 -215553 130869 83488
9775 83488 775 -431950 -37340 -118281 -89158 -67480 -77682 -34891 -53484 -183928 -254593 -230477
9763 -230477 -49309 -8595 -101723 -208075 35215 92160 35267 -213266 293489 -381175 -226412
9752 -226412 45437 -184861 -31025 -16905 -217303 -95487 -5634 -20091 162564 138722 -98887
9740 -38812 -185205 226716 -209135 -50009 180417 -221913 135304 -65351 218773 -397190
9729 -51651 -8880 186922 -98614 -8805 -10753 24903 -19640 163985 -20412 106876 -5063 57148
9716a35524L1660I4665b76709d3748A59547c8837P729a0267o686A65792L6094
9705B01886h9971l28275I5457B5024c20406O1423A09733c08212h8959B60674b95484
9693A07699a41137C0890c00185a0856A14170a61729A44008D9950Q3568a48838
9682c17803A24490a35405A2806a64065C27326a11663a2353A12721f1941j07721
9672a69662N5222a626k05901A7200J7774J8469a4252j95705f1632A03149a82388
9660b94015e7356k094l3957A0150a28458p1080j25024a10955F3266b87848h5445
9648C9794A1490E508J60328B2663c04422c7859A06388a54214N7084l056D21918
9636b87821J15901k05278a65791A50194o9339b17817P7525j41050h2512C17990
$$ plain form
9716 -135524 -103864 94665 -276709 -43748 159547 -38837 -31108 -10267 -16953 165792 201886
9705 201886 -89971 -418246 95457 25024 -320406 -258983 109733 -308212 -88959 260674 -295484
9693 107699 -141137 30890 -300185 -10856 114170 -161729 144008 49950 133518 -148838
9682 -317803 124490 -135405 12806 -164065 327326 -111663 -12353 112721 -61941 -169662
9672 -169662 -114440 -1626 -207527 17200 34974 53443 -14252 -209957 -61632 103149 -182388
9660 -294015 -57356 -59450 -93407 10150 -128458 -199538 -324562 -110955 63266 -287848 -85445
9648 39794 11490 5508 165836 22663 -304422 -37859 106388 -154214 -97130 -100186 421918
9636 -287821 -171920 -377198 -165791 150194 80855 -217817 -140292 -281342 -82512 317990
9625F1322j3346b51671C4442A1649c0266j32519M9948a6706m3439j36710h1815
9613a20255j9668F8088c1495k6469J7124i971C909J26194b34732A22447b57218
9601a80048A03277G04b09860A53948h7440L3297k2767j8179G2617a77717C49M219
9589D568g6730A72501b06728L5439k08338c2091j2438p3051D5258a49072H1540
9577a87325A94197c29498o725A10187K36977a77942A55428j3308O5688k3129p5156
9566A09523i3377q9592m701h9055j92039f1938k11054a26168o9377k7007B49734
9554b33437b6633j62358G034i6157j02414G0321b85216E7226j0363k1594K96076
9543C21345a03313n008B42822h8887j14230o2325C378c29290K1761A82256a93531
$$ plain form
9625 61322 47976 -251671 34442 11649 -30266 -162785 -112837 -16706 -60145 -196855 -81815
9613 -120255 -139923 68088 -31495 -57964 -40840 -9971 3909 130103 -234732 122447 -257218
9601 -180048 103277 704 -209860 153948 -87440 -54143 -76910 -95089 72617 -177717 349 4568
9589 4568 -76730 172501 -206728 -171289 -379627 -32091 -44529 -117580 45258 -149072 81540
9577 -187325 194197 -329498 -336223 110187 347164 -177942 155428 142120 207808 184679 109523
9566 109523 -93377 -182969 -187670 -89055 -281094 -61938 -272992 -126168 -195545 -222552 249734
9554 -233437 -26633 -188991 7034 -96157 -198571 70321 -285216 57226 46863 25269 321345
9543 321345 -103313 -108321 242822 -88887 -203117 -265442 3378 -329290 -307529 182256 -193531
9531b80799F7101a48172P2452C10242a75087k46927a07665c2433n94952c227B38
9519e3765A74048a77892c3267p1548j78815F467b27431f0704B63552h5663m4235
9508a29898j01227J12824j95281E048c45022A66586c21477J28478k20737a32074
9497a90336h2871A28843m8214J2457i3280j3063r8145b8152j75834H0696a61747
9485a99706H3349i2090D042P2140a88814K8267A23113Q0016B4040a10811B3636
9473H3789a67891A41704b79250D8322O7431h2661A16326c27211J04463m1299a25849
9461e0412B05662h0100B69522q8962C5085b84012J31455k60090b7465k74034B20165
9449a20618o063A8929e141B62061j24335k7442a08655A68051a86222m520G5930
$$ plain form
9531 -280799 67101 -148172 -75720 310242 -175087 -422014 -107665 -32433 -627385 -3227 238
9519 -53765 174048 -177892 -33267 -104815 -283630 6467 -227431 -60704 263552 -85663 -129898
9508 -129898 -231125 -118301 -313582 5048 -345022 166586 -321477 -192999 -413736 -132074
9497 -190336 -82871 128843 80629 93086 -93280 -106343 -204488 -28152 -203986 80696 -161747
9485 -199706 83349 -92090 4042 76182 -188814 -160547 123113 203129 24040 -110811 23636
9473 83789 -167891 141704 -279250 48322 115753 -82661 116326 -327211 -222748 -264047 -125849
9461 -50412 205662 -80100 269522 180560 35085 -284012 -152557 -412647 -27465 -301499 220165
9449 -120618 -126681 18929 -5141 262061 137726 110284 -108655 168051 -186222 -190742 75930
9437c70414B4864K33163i528l4171l45609H4310g4689k76107a64438F2734a36478
9425D4780L18304A63625A9305b45451A18508f2174F4991a47044n1131j5957A05757
9413b60484j586A36496k4001M6396a38169d0831j78604i1j53830f0446I8109b686
9400A39641b58316H4527c13662i9431d1844m4448A40217b25155N5016q0923j3101
9389b64163a30504k68701B8808J85388H9631C7367a72682k81303C1747J56928
9379A88675c88333b838p2233B5696d7396A44771F0565Q9236a43808K9761c62A7952
9366A14355j2047b27427P8099d7613l27698a83997B74418b35741A54008b86782
9355A18066B1347J69833g6834l0704k45917G6699Q3036g9556o8002L267k3132
$$ plain form
9437 -370414 24864 258027 -9528 -43699 -389308 84310 -74689 -350796 -164438 62734 -136478
9425 44780 363084 163625 19305 -245451 118508 -62174 64991 -147044 -198175 -214132 105757
9413 -260484 -262070 136496 112495 158891 -138169 -40831 -219435 -91 -153921 -60446 98109 -2686
9400 139641 -258316 84527 -313662 -99431 -41844 -86292 140217 -225155 -170139 -251062 -264163
9389 -264163 -130504 -399205 28808 214196 89631 37367 -172682 -453985 31747 188675
9379 188675 -388333 -2838 -75071 25696 -47396 144771 60565 149801 -143808 -114047 -362 17952
9366 114355 102308 -227427 -149328 -47613 -375311 -183997 274418 -235741 154008 -286782
9355 118066 21347 191180 -76834 -107538 -353455 76699 159735 -79556 -147558 -144291 -167423
9344a67423A50043d49B6098a45012j14778a04515C5507a8358k46168D08047a53493
9332c8540B3026J79209o4910c05205l065A08782b12081D1701M0609J5550b74523
9320c9212p4760k80349A5473K02915b24336E9346a7055o4520n3212k7009b4903
9308h7519q42A47532B6963J64331M4826a85278O9700A29190c97811i6968A4572
9296i5106b6569k5625q8942H3406c31271A65484J29969c35817a14519A13555b10071
9284d6633b0591N279A09751g4232o9326i952n7662n2257e9554p2914A26135g9673
9271c18170c6964e970l85085B72597E7639a61826B04014B0047K706b88043J09101
9260a78942B8005b60254d8609A46160J1199n5317a95593A42260L8210G3200k4617
$$ plain form
9344 -167423 150043 -449 26098 -145012 -259790 -104515 35507 -18358 -264526 408047 -153493
9332 -38540 23026 202235 137325 -305205 -308270 108782 -212081 41701 82310 97860 -274523
9320 -39212 -113972 -394321 15473 218388 -224336 59346 -17055 -81575 -134787 -161796 -24903
9308 -87519 -88361 147532 26963 191294 236120 -185278 -115578 129190 -397811 -96968 14572
9296 -95106 -26569 -52194 -141136 83406 -331271 165484 295453 -335817 -114519 113555 -210071
9284 -46633 -20591 -15312 109751 -74232 -143558 -9952 -67614 -119871 -59554 -132468 126135 -79673
9271 -318170 -36964 -5970 -391055 272597 57639 -161826 204014 20047 22753 -288043 -178942
9260 -178942 28005 -260254 -48609 146160 157359 102042 -195593 142260 180470 73200 48583
9249D8583b11951G8942b04393j28259e7103a9749j32801B27284a37223A6640c02595
9237b33349J05834N4703e02j58749l9184a5312k19496a03998k17848A78269a63989
9225a62858F1423J7740F976K23788a22962H7490D136f4735J1553B48964a72682
9213F761e0976l6925B22666a55146A98598p2176a58812a2883j95245d2462j52136
9202a94598j33256d6591J0001j23778l2989I0534l8707a28310d9271k5237H3526
9190A52916b26496j5082L8132A74676a51495P4075i339l48833D6146b80945B62395
9178C5460d929I5324l6815a27539j72792a07416A48908C6424L743h2684e055j13082
9166a18137b2072D281K91946a36088b2105j24839c7555D9291a43854B5616c34944
$$ plain form
9249 48583 -211951 78942 -204393 -332652 -57103 -19749 -152550 227284 -137223 16640 -302595
9237 -233349 -127515 -72812 -502 -159251 -198435 -15312 -234808 -103998 -321846 178269 -163989
9225 -162858 61423 79163 6976 230764 -122962 87490 4136 -64735 -53182 248964 -172682
9213 6761 -50976 -87901 222666 -155146 198598 126422 -158812 -12883 -208128 -42462 -194598
9202 -194598 -327854 -46591 -36590 -160368 -193357 90534 51827 -128310 -49271 -74508 83526
9190 152916 -226496 -241578 -203446 174676 -151495 -77420 -9339 -358172 46146 -280945 262395
9178 35460 -4929 95324 58509 -127539 -300331 -107416 148908 36424 40167 -82684 -5055 -118137
9166 -118137 -22072 4281 296227 -136088 -22105 -146944 -37555 49291 -143854 25616 -334944
9154e6324j22584h043n9408J6254A71495A0162b20511e7064A80644a21694j27397
9143b49091A12316a36369J0698m5874A07426e6773D8077Q1535i2990b0660A5341
9131i3330A83313A8871c3872j25563H9056A4099b48824Q3567A92283O1635h7315
9119b55244A13718b5880A90536b12419A19882D6150b36275Q3463A34005l8833
9109I5172b23436E6343a6891B15276p8636g1473A44346b03057I7113a33606j01689
9098b35295a191l6645F211e4684C0797a41177J7769A45890n8942j1196a65650
9086c03026a2235m1141A71143b77590B67143f352k99451p45a04493b7353d853
9074f0554l16766a1165E7583i094J422j35864N0071k15184C8959b1379j43883
$$ plain form
9154 -56324 -178908 -8043 -67451 -51197 171495 10162 -220511 -57064 180644 -121694 -249091
9143 -249091 112316 -136369 -125671 -171545 107426 -56773 48077 129612 -92990 -20660 15341
9131 -93330 183313 18871 -33872 -159435 89056 14099 -248824 -165257 192283 253918 -87315
9119 -255244 113718 -25880 190536 -212419 119882 46150 -236275 -152812 134005 95172
9109 95172 -223436 56343 -16891 215276 136640 -71473 144346 -203057 97113 -133606 -235295
9098 -235295 -1191 -37836 6211 -54684 30797 -141177 -123408 145890 86948 75752 -165650
9086 -303026 -12235 -53376 171143 -277590 267143 -6352 -305803 -306548 -104493 -27353 -4853
9074 -60554 -377320 -11165 57583 -9094 -7672 -143536 -93465 -308649 38959 -21379 -165262
9063a65262C42225a35000A6092a80716j8097l9468j49696f8004a2279k31643A25585
9051c7844j45003a6403j41210L7721F8032r812d985A00266c3398j91026e8500
9039A06689R4220K224d7715j92785A55861c27798A44546f3199A00840C5804a19938
9027a01501k89681n6566K19669K5160A51579a79756e4448e913l4081k01101a03846
9015f6423a8691k4619J1405C06498D8653c05047J05332B01142D443J98890a06814
9003b25259A80476b28013j96409B20044a36607N2193a215p0553C28346A38731
8992b31608D4863c5658k15865m3451e2603b097j71971G2413J9191J29906Q8949
8981C10459i4843A49664A406c48459A88577a01898B7596N4627b52450P2409H5169
$$ plain form
9063 -165262 342225 -135000 16092 -180716 -198813 -238281 -387977 -68004 -12279 -243922 125585
9051 -37844 -182847 -16403 -157613 -119892 68032 58220 -4985 100266 -33398 -224424 -58500
9039 106689 200909 203133 -47715 -240500 155861 -327798 144546 -63199 100840 35804 -119938
9027 -101501 -391182 -447748 -228079 -202919 151579 -179756 -54448 -5913 -39994 -241095 -103846
9015 -66423 -18691 -43310 -31905 306498 48653 -305047 -199715 201142 4443 203333 -106814
9003 -225259 180476 -228013 -424422 220044 -136607 -84414 -1215 -71768 328346 138731
8992 -231608 44863 -35658 -251523 -294974 -52603 -2097 -174068 72413 91604 221510 310459
8981 310459 -94843 149664 1406 -348459 188577 -101898 27596 82223 -252450 -180041 85169
8969A71595b14998j37310J71090d8023n4751j90881B7536d9281k11794D9124a9574
8957G0682R5182b16549F1019a94185B3479g2036H2775g3622j36228j38164E3164
8945D26279j00697a72404j67660A29936b25576a8603G7344k1645J36732h41j60765
8934a61606B9422d12869E5007a13623C7981J51021b441j94443A14814h5536c4396
8922D096K31939d6437j14110l5323C0026i9474k75108B58884D2571a97871g4727
8910A43219a62625C61977K7160J05355L34702K90787J255815J889989L2828k148477
8900B150136o78825m14330m26536k42412A70732o0014J00405K7799D1467J36173
8890A77640L0429a447m5650j2820B11404G1001a47745l52461F5923e2848k5266
$$ plain form
8969 171595 -214998 -352308 -181218 -48023 -102774 -293655 27536 -49281 -261075 49124 -19574
8957 70682 165864 -216549 61019 -194185 23479 -72036 82775 -73622 -209850 -348014 53164
8945 426279 325582 -172404 -340064 129936 -225576 -18603 77344 55699 192431 -841 -161606
8934 -161606 29422 -412869 55007 -113623 37981 189002 -2441 -196884 114814 -85536 -34396
8922 4096 236035 -46437 -160547 -195870 30026 -99474 -374582 258884 42571 -197871 -74727
8910 143219 -162625 361977 389137 494492 829194 1119981 2375796 4265785 4298613 2150136
8900 2150136 1471311 1056981 630445 388033 170732 110718 211123 238922 41467 177640
8890 177640 208069 -1447 -47097 -59917 211404 71001 -147745 -500206 65923 -52848 -78114
8879g8114j69634H2431J3314k8263O6979o3179h6982C9887b76747h2143A7484
8867c9038j79395B65855A10388c2608J0030k04111A53665B0906a79791F8312a10522
8855a01625B95506b96112k3313K9234A61015B2296R6123b44399A79571a58538
8844C3771b71304A98972b53661j8768C3840K87955A4127J68480D0860i0786H6184
8832A86813i5052F3289e734l07574a56555a7784k4221k37710a33798g047j79902
8821a86949j28189B6458d80550a74970n8238D7001N6771P2211D3197a57036A73053
$$ plain form
8879 -78114 -247748 82431 95745 67482 134461 71282 -86982 39887 -276747 -82143 17484
8867 -39038 -218433 265855 110388 -32608 -22578 -226689 153665 20906 -179791 68312 -110522
8855 -101625 295506 -296112 -319425 -290191 161015 22296 118419 -244399 179571 -158538
8844 33771 -271304 198972 -253661 -272429 33840 321795 14127 182607 40860 -90786 86184
8832 186813 -95052 63289 -5734 -313308 -156555 -17784 -42005 -279715 -133798 -7047 -186949
8821 -186949 -315138 26458 -480550 -174970 -233208 47001 103772 175983 43197 -157036 173053
$$ [...]
##END NTUPLES=NMR SPECTRUM
##END=
