
##TITLE=AC1202_CTOAH12044_5973427_Be0SclTc9N
##JCAMPDX= 6.0         $$ Bruker NMR JCAMP-DX V2.0
##DATA TYPE= NMR SPECTRUM
##DATA CLASS= NTUPLES
##ORIGIN= BRUKER
##OWNER= Administrator
$$ 1.72 TOPSPIN		Version 2.1
$$ 2012-04-14 20:47:45.921 -0500  Administrator@TOPSPIN
$$ Compression mode = diff/dup
##.OBSERVE FREQUENCY= 400.13188235
##.OBSERVE NUCLEUS= ^1H
##.ACQUISITION MODE= SIMULTANEOUS (DQD)
##.ACQUISITION SCHEME= undefined
##.AVERAGES= 64
##.DIGITISER RES= 22
##SPECTROMETER/DATA SYSTEM= spect
##.PULSE SEQUENCE= noesygpps1d.comp
##.SOLVENT NAME= COFFEE_meoh
##.SHIFT REFERENCE= INTERNAL, COFFEE_meoh, 1, 14.96869
##AUDIT TRAIL= $$ (NUMBER, WHEN, WHO, WHERE, PROCESS, VERSION, WHAT)
$$ ##TITLE= Audit trail, TOPSPIN		Version 2.1
$$ ##JCAMPDX= 5.01
$$ ##ORIGIN= Bruker BioSpin GmbH
$$ ##OWNER= Administrator
$$ $$ C:\Bruker\TOPSPIN/data/COFFEE/nmr/AC1202_CTOAH12044_5973427_Be0SclTc9N/12/pdata/1/auditp.txt
$$ ##AUDIT TRAIL=  $$ (NUMBER, WHEN, WHO, WHERE, PROCESS, VERSION, WHAT)
(   1,<2012-04-14 20:47:39.562 -0500>,<Administrator>,<TOPSPIN>,<go>,<TOPSPIN 2.1>,
      <created by zg
	started at 2012-04-14 20:36:06.421 -0500,
	POWCHK enabled, PULCHK disabled,
       configuration hash MD5:
       1A 1E CE 29 27 FD 77 03 67 4E F0 E3 C4 B2 CB 90
       data hash MD5: 64K
       25 58 CB B1 19 D7 9F 09 9A E8 58 07 63 D6 CD E6>)
(   2,<2012-04-14 20:47:42.921 -0500>,<Administrator>,<TOPSPIN>,<proc1d>,<TOPSPIN 2.1>,
      <Start of raw data processing
       efp LB = 0.3 FT_mod = 6 PKNL = 1 PHC0 = 0 PHC1 = 0 SI = 128K 
       data hash MD5: 128K
       4D AC A2 CC 18 A2 91 25 78 53 0A 9E 70 A9 B7 03>)
(   3,<2012-04-14 20:47:44.734 -0500>,<Administrator>,<TOPSPIN>,<proc1d>,<TOPSPIN 2.1>,
      <pk PHC0 = 33.77747 PHC1 = 0 
       data hash MD5: 128K
       53 94 F5 05 EC 16 1C AD E1 16 42 B6 25 FE 47 EB>)
(   4,<2012-04-14 20:47:45.046 -0500>,<Administrator>,<TOPSPIN>,<proc1d>,<TOPSPIN 2.1>,
      <abs ABSG = 1 
       data hash MD5: 128K
       63 D9 1E 91 47 E3 D4 40 34 65 DC 8C E9 3D 3C 67>)
(   5,<2012-04-14 20:47:45.281 -0500>,<Administrator>,<TOPSPIN>,<proc1d>,<TOPSPIN 2.1>,
      <abs ABSG = 2 
       data hash MD5: 128K
       B1 24 D9 4D D9 E9 78 2A 68 4F 02 83 FD 68 E0 45>)
(   6,<2012-04-14 20:47:45.625 -0500>,<Administrator>,<TOPSPIN>,<proc1d>,<TOPSPIN 2.1>,
      <abs ABSG = 3 
       data hash MD5: 128K
       21 47 18 5C 9D 0D 67 64 09 24 A5 46 13 52 F6 D0>)
(   7,<2012-04-14 20:47:45.703 -0500>,<Administrator>,<TOPSPIN>,<proc1d>,<TOPSPIN 2.1>,
      <abs ABSG = 4 
       data hash MD5: 128K
       23 48 73 F1 CB 17 77 24 62 78 37 7C 38 DD C1 B0>)
(   8,<2012-04-14 20:47:45.781 -0500>,<Administrator>,<TOPSPIN>,<proc1d>,<TOPSPIN 2.1>,
      <abs ABSG = 5 
       data hash MD5: 128K
       1C B4 DE 2B AF 33 AC 5B 19 D0 27 31 70 E0 49 9B>)
$$ ##END=
$$ 
$$ $$ hash MD5
$$ $$ 30 A3 57 14 F9 E8 D5 FB F6 90 92 15 65 39 CA 87
##$RELAX= 
##$RELAX= 
##$RELAX= 
##$RELAX= 
##$RELAX= 
##$RELAX= 
##$RELAX= 
##$RELAX= 
$$ Bruker specific parameters
$$ [...]
##$TP07= 0
##$TPNAME0= <>
##$TPNAME1= <>
##$TPNAME2= <>
##$TPNAME3= <>
##$TPNAME4= <>
##$TPNAME5= <>
##$TPNAME6= <>
##$TPNAME7= <>
##$TPOAL= (0..7)
0.5 0.5 0.5 0.5 0.5 0.5 0.5 0.5
##$TPOFFS= (0..7)
0 0 0 0 0 0 0 0
##$TUNHIN= 0
##$TUNHOUT= 0
##$TUNXOUT= 0
##$USERA1= <user>
##$USERA2= <user>
##$USERA3= <user>
##$USERA4= <user>
##$USERA5= <user>
##$V9= 5
##$VALIST= <valist>
##$VCLIST= <CCCCCCCCCCCCCCC>
##$VD= 0
##$VDLIST= <DDDDDDDDDDDDDDD>
##$VPLIST= <PPPPPPPPPPPPPPP>
##$VTLIST= <TTTTTTTTTTTTTTT>
##$WBST= 1024
##$WBSW= 4
##$XGAIN= (0..3)
0 0 0 0
##$XL= 0
##$YL= 0
##$YMAX_a= 11797281
##$YMIN_a= -6671834
##$ZGOPTNS= <>
##$ZL1= 120
##$ZL2= 120
##$ZL3= 120
##$ZL4= 120
##$ABSF1= 14.96869
##$ABSF2= -5.58384
##$ABSG= 5
##$ABSL= 3
##$ALPHA= 0
##$AQORDER= 0
##$ASSFAC= 0
##$ASSFACI= 0
##$ASSFACX= 0
##$ASSWID= 0
##$AUNMP= <proc_prof1d_extract.lims>
##$AXLEFT= 0
##$AXNAME= <>
##$AXNUC= <1H>
##$AXRIGHT= 0
##$AXTYPE= 0
##$AXUNIT= <>
##$AZFE= 0.1
##$AZFW= 0.1
##$BCFW= 0
##$BC_mod= 0
##$BYTORDP= 0
##$COROFFS= 0
##$CY= 15
##$DATMOD= 1
##$DC= 0
##$DFILT= <>
##$DTYPP= 0
##$F1P= 0
##$F2P= 0
##$FCOR= 0.5
##$FTSIZE= 131072
##$FT_mod= 6
##$GAMMA= 0
##$GB= 0
##$INTBC= 1
##$INTSCL= 1
##$ISEN= 128
##$LB= 0.3
##$LEV0= 0
##$LPBIN= 0
##$MAXI= 10000
##$MC2= 0
##$MEAN= 0
##$ME_mod= 0
##$MI= 0
##$NCOEF= 0
##$NC_proc= -2
##$NLEV= 6
##$NOISF1= 0
##$NOISF2= 0
##$NSP= 0
##$NTH_PI= 0
##$NZP= 0
##$OFFSET= 14.96869
##$PC= 1
##$PHC0= 33.77747
##$PHC1= 0
##$PH_mod= 1
##$PKNL= yes
##$PPARMOD= 0
##$PPDIAG= 0
##$PPIPTYP= 0
##$PPMPNUM= 2147483647
##$PPRESOL= 1
##$PSCAL= 4
##$PSIGN= 0
##$PYNMP= <proc.py>
##$REVERSE= no
##$SF= 400.130004771923
##$SI= 131072
##$SIGF1= 0
##$SIGF2= 0
##$SINO= 400
##$SIOLD= 131072
##$SPECTYP= <>
##$SREGLST= <1H.CDCl3>
##$SSB= 0
##$STSI= 131072
##$STSR= 0
##$SW_p= 8223.68421052632
##$SYMM= 0
##$S_DEV= 0
##$TDeff= 65536
##$TDoff= 0
##$TI= <>
##$TILT= no
##$TM1= 0
##$TM2= 0
##$TOPLEV= 0
##$USERP1= <user>
##$USERP2= <user>
##$USERP3= <user>
##$USERP4= <user>
##$USERP5= <user>
##$WDW= 1
##$XDIM= 131072
##$YMAX_p= 208126481
##$YMIN_p= -301218575
##$CURPLOT= <Network HP LaserJet P1505>
##$CURPRIN= <$Network HP LaserJet P1505>
##$DFORMAT= <normdp>
##$LAYOUT= <+/1D_H.xwp>
##$LFORMAT= <normlp>
##$PFORMAT= <normpl>
##$SURQMSG= 1
$$ End of Bruker specific parameters
$$ ---------------------------------
##NTUPLES= NMR SPECTRUM
##VAR_NAME=  FREQUENCY,     SPECTRUM/REAL,   SPECTRUM/IMAG
##SYMBOL=    X,             R,               I
##VAR_TYPE=  INDEPENDENT,   DEPENDENT,       DEPENDENT
##VAR_FORM=  AFFN,          ASDF,            ASDF
##VAR_DIM=   131072,        131072,          131072
##UNITS=     HZ,            ARBITRARY UNITS, ARBITRARY UNITS
##FACTOR=    0.0627417313425165, 1,          1
##FIRST=     8223.62146879498, -1287,        -40026
##LAST=      0,             273,             -40029
##MIN=       0,             -301218575,      0
##MAX=       8223.62146879498, 208126481,    0
$$ Real data points
##PAGE= N=1
##DATA TABLE= (X++(R..R)), XYDATA
$$ [...]
61981C345980j3281j4181j4305j3786j3118j2674j2408j2051j1582j1336j1511
61970C205747j1727j1362j0325r221q616q412q090p380o465n656n178n124n418
61957C102773n715n641n200m892n237o221p326q096q580r064r521r647r534r863
61943B998236j1083j2700j3835j4412j5137j6334j7394j7762j7864j8597k0160
61932B822958k1886k3142k3937k4702k5728k6858k7568k7408k6525k5613k5228
61921B544363k5310k5552k5877k6234k6230k5479k4247k3237k2758k2457k1919
61910B275063k1154k0383j9693j9011j8165j6969j5486j4234j3796j4109j4451
61899B087612j4209j3433j2523j1699j0967j0301r605q738p780p116o995p086
$$ y = [3345980, 3332699, 3318518, 3304213, 3290427, 3277309, 3264635, 3252227, 3240176, 3228594, 3217258, 3205747, 3194020, 3182658, 3172333, 3163112, 3154496, 3146084, 3137994, 3130614, 3124149, 3118493, 3113315, 3108191, 3102773, 3097058, 3091417, 3086217, 3081325, 3076088, 3069867, 3062541, 3054445, 3045865, 3036801, 3027280, 3017633, 3008099, 2998236, 2987153, 2974453, 2960618, 2946206, 2931069, 2914735, 2897341, 2879579, 2861715, 2843118, 2822958, 2801072, 2777930, 2753993, 2729291, 2703563, 2676705, 2649137, 2621729, 2595204, 2569591, 2544363, 2519053, 2493501, 2467624, 2441390, 2415160, 2389681, 2365434, 2342197, 2319439, 2296982, 2275063, 2253909, 2233526, 2213833, 2194822, 2176657, 2159688, 2144202, 2129968, 2116172, 2102063, 2087612, 2073403, 2059970, 2047447, 2035748, 2024781, 2014480, 2004875, 1996137, 1988357, 1981241, 1974246, 1967160]
61887A967160o724n595l988k382r66M12J946L633N355P078Q967J1245J3985J7018
61873B017144K0024K2726K5180K7851L1291L5551M0115M4538M9031N4220O0409
61862B428080O7409P4937Q2938R1427J00358J09904J20691J33574J49077J67035
61852C525430J86762K07677K29855K53913K80246L08502L37830L67442L96629
61843F094286M24463M49786M71388M87822M96899M95630M80718M49252L99430
61834A0249674L31468K48073J53864N4159m5690j40388k25143k96606l53302l95227
61824I580882m23417m39856m46997m46834m40572m29303m14540l97707l79407
61815E762249l59677l38788l17515k96731k76894k57781k38677k19140j99725
$$ y = [1967160, 1960436, 1954841, 1950853, 1948471, 1947505, 1947917, 1949863, 1953496, 1958851, 1965929, 1974896, 1986141, 2000126, 2017144, 2037168, 2059894, 2085074, 2112925, 2144216, 2179767, 2219882, 2264420, 2313451, 2367671, 2428080, 2495489, 2570426, 2653364, 2744791, 2845149, 2955053, 3075744, 3209318, 3358395, 3525430, 3712192, 3919869, 4149724, 4403637, 4683883, 4992385, 5330215, 5697657, 6094286, 6518749, 6968535, 7439923, 7927745, 8424644, 8920274, 9400992, 9850244, 10249674, 10581142, 10829215, 10983079, 11037238, 10991548, 10851160, 10626017, 10329411, 9976109, 9580882, 9157465, 8717609, 8270612, 7823778, 7383206, 6953903, 6539363, 6141656, 5762249, 5402572, 5063784, 4746269, 4449538, 4172644, 3914863, 3676186, 3457046, 3257321]
61806C257321j81639j65489j50860j37287j25027j14353j04684r5165q5822p7374
61796B019621p0079o3580n7756n2835m8591m4260l9545l5000l1106k7628k4331
61785A524910k1572j9626j7876j5469j2443r604p442n805m536l671l004j975l44
61772A401543J443K808L707M465N213N829O392P323Q960J1034J2845J4048J5158
61759A500768J6994J9621K2119K3667K4543K5797K8129L1415L5161L8950M2481
61748A809645M5738M9118N2961N6894O0283O3491O7932P4313Q1489Q7772R3085
61737B542721R8887J06157J14450J23045J32118J42239J53400J65333J78388J93357
61727C950095K10568K29721K50731K74194L00834L30864L64152M00665M40455
$$ y = [3257321, 3075682, 2910193, 2759333, 2622046, 2497019, 2382666, 2277982, 2182817, 2096995, 2019621, 1949542, 1885962, 1828206, 1775371, 1726780, 1682520, 1642975, 1607975, 1576869, 1549241, 1524910, 1503338, 1483712, 1465836, 1450367, 1437924, 1428320, 1420878, 1415073, 1410537, 1406866, 1403862, 1401887, 1401543, 1402986, 1405794, 1409501, 1413966, 1419179, 1425008, 1431400, 1438723, 1447683, 1458717, 1471562, 1485610, 1500768, 1517762, 1537383, 1559502, 1583169, 1607712, 1633509, 1661638, 1693053, 1728214, 1767164, 1809645, 1855383, 1904501, 1957462, 2014356, 2074639, 2138130, 2206062, 2280375, 2361864, 2449636, 2542721, 2641608, 2747765, 2862215, 2985260, 3117378, 3259617, 3413017, 3578350, 3756738, 3950095, 4160663, 4390384, 4641115, 4915309, 5216143, 5547007, 5911159, 6311824, 6752279]
61718F752279M83317N28751N76288O25576O76003P26300P74597Q18656Q55873
61709A2817640Q82977Q95910Q89990Q60197Q01658P11023N88431M38603K69772
61700A9156201R1434q7025k56446m08359n36563o38456p14582p67038p98418q11661
61690A4229087q10097p97148p75993p49248p18681o85253o49698o12959n75849
61681G854161n38526n00825m63148m26630l92215l59962l29425l00520k73654
61672D269256k49207k27112k07058j88953j72938j58888j46110j33875j22237
61663B662878j11913j03176r5327q7638q0370p4237o9172o4372n9535n5214n1793
61652A810131m8889m6047m3329m0827l8199l5286l2700l1120l0324k9520k8382
$$ y = [6752279, 7235596, 7764347, 8340635, 8966211, 9642214, 10368514, 11143111, 11961767, 12817640, 13700617, 14596527, 15486517, 16346714, 17148372, 17859395, 18447826, 18886429, 19156201, 19247635, 19160610, 18904164, 18495805, 17959242, 17320786, 16606204, 15839166, 15040748, 14229087, 13418990, 12621842, 11845849, 11096601, 10377920, 9692667, 9042969, 8430010, 7854161, 7315635, 6814810, 6351662, 5925032, 5532817, 5172855, 4843430, 4542910, 4269256, 4020049, 3792937, 3585879, 3396926, 3223988, 3065100, 2918990, 2785115, 2662878, 2550965, 2447789, 2352462, 2264824, 2184454, 2110217, 2041045, 1976673, 1917138, 1861924, 1810131, 1761242, 1715195, 1671866, 1631039, 1592840, 1557554, 1524854, 1493734, 1463410, 1433890, 1405508]
61641A405508k7125k5822k4388k3120k2437k2026k0990j9137j7442j6883j7266
61630A168872j7587j7202j6208j5059j4185j3843j3882j3796j3235j2417j1816
61619A009642j1589j1591j1666j1636j1201j0238r098q164p317o268n313n167
61607I00394n935o886p368p467p515p488p298p137p070o605n322l647k398j815
61593H16443j523j371j548j957k172k151k270k463k108j054j08M4k14k04j4j14
61577G97216l16q9L62K95l17o71m71l92q68j284r97m54n10j100j443j350j446
61560G86165k049k601k531k071j839j967k084j965j815k004k697l707m504m520
61546G49811l691k632k036j954j946j838j908k235k322j687n32N26J233J766K236
$$ y = [1405508, 1378383, 1352561, 1328173, 1305053, 1282616, 1260590, 1239600, 1220463, 1203021, 1186138, 1168872, 1151285, 1134083, 1117875, 1102816, 1088631, 1074788, 1060906, 1047110, 1033875, 1021458, 1009642, 998053, 986462, 974796, 963160, 951959, 941721, 932623, 924459, 917142, 910874, 905561, 900394, 894459, 887573, 880205, 872738, 865223, 857735, 850437, 843300, 836230, 829625, 824303, 820656, 818258, 816443, 814920, 813549, 812001, 810044, 807872, 805721, 803451, 800988, 798880, 797826, 797718, 797762, 797548, 797344, 797330, 797216, 796900, 796811, 797173, 797468, 797151, 796480, 796009, 795617, 794749, 793465, 792468, 792014, 791504, 790404, 788961, 787611, 786165, 784116, 781515, 778984, 776913, 775074, 773107, 771023, 769058, 767243, 765239, 762542, 758835, 754331, 749811, 746120, 743488, 741452, 739498, 737552, 735714, 733806, 731571, 729249, 727562, 727030, 727556, 728789, 730555, 732791]
61531G32791K607L033L724M428M616M441M855O396Q334R611J0247J1074J2353
61518H18510J3471J4081J4687J5795J7157J8350J9536K1067K2659K3622K3903
61507A022838K4223K5072K6100K6735K6976K7230K7587K7678K7227K6355K5281
61496A313302K4036K2663K1411K0462J9542J8214J6475J4794J3404J1911R857
61485A506071P420N262L692K359P75j070k772m004m758n105n014m538m046l935
61471A490337m033l620k260k73J894M449P789J1476J4522J6817J9431K3147K7515
61458A607191L1903L6725M2696M9473N6041O2228O8803P6217Q4281R3157J03470
61447B312185J15021J26369J36371J45490J54849J64530J73538J80992J86563
$$ y = [732791, 735398, 738431, 742155, 746583, 751199, 755640, 760495, 766891, 775225, 784836, 795083, 806157, 818510, 831981, 846062, 860749, 876544, 893701, 912051, 931587, 952654, 975313, 998935, 1022838, 1047061, 1072133, 1098233, 1124968, 1151944, 1179174, 1206761, 1234439, 1261666, 1288021, 1313302, 1337338, 1360001, 1381412, 1401874, 1421416, 1439630, 1456105, 1470899, 1484303, 1496214, 1506071, 1513491, 1518753, 1522445, 1524804, 1525579, 1524509, 1521737, 1517733, 1512975, 1507870, 1502856, 1498318, 1494272, 1490337, 1486304, 1482684, 1480424, 1480151, 1482045, 1486494, 1494283, 1505759, 1520281, 1537098, 1556529, 1579676, 1607191, 1639094, 1675819, 1718515, 1767988, 1824029, 1886257, 1955060, 2031277, 2115558, 2208715, 2312185, 2427206, 2553575, 2689946, 2835436, 2990285, 3154815, 3328353, 3509345, 3695908]
61438C695908J89831J89938J85989J77291J63277J43785J19651R2653O4558L6403
61428E059284Q806j7305m0706o0579p6864q9805r9440j05936j10110j12964j14479
61417D239902j13502j09334j02924r5927q8881q1116p2275o2975n3773m4431l4655
61406C380109k4957j6184q526j435N658J2917K0037K6372L1283L4679L7055L8883
61394C535891M0256M1249M2115M2926M3349M3175M2727M2454M2458M2636M2911
61383D002147M3024M2606M1715M0887M0258L9112L6850L3869L0965K8204K5137
61372D404774K1655J7899J3554Q165K124l425p792j1218j4115j6579j8770k1068
61360D375204k3426k5138k5600k4957k3750k2251k0481j8533j6451j4026j1104
$$ y = [3695908, 3885739, 4075677, 4261666, 4438957, 4602234, 4746019, 4865670, 4958323, 5022881, 5059284, 5068090, 5050785, 5010079, 4949500, 4872636, 4782831, 4683391, 4577455, 4467345, 4354381, 4239902, 4126400, 4017066, 3914142, 3818215, 3729334, 3648218, 3575943, 3512968, 3459195, 3414764, 3380109, 3355152, 3338968, 3330442, 3329007, 3334665, 3347582, 3367619, 3393991, 3425274, 3459953, 3497008, 3535891, 3576147, 3617396, 3659511, 3702437, 3745786, 3788961, 3831688, 3874142, 3916600, 3959236, 4002147, 4045171, 4087777, 4129492, 4170379, 4210637, 4249749, 4286599, 4320468, 4351433, 4379637, 4404774, 4426429, 4444328, 4457882, 4466047, 4468171, 4464746, 4456954, 4445736, 4431621, 4415042, 4396272, 4375204, 4351778, 4326640, 4301040, 4276083, 4252333, 4230082, 4209601, 4191068, 4174617, 4160591, 4149487]
61349D149487q143o069n418n742o083o056o184o986q012q325p780p129o610n238
61335D055712k035K694Q051J4027K1378L0282M0152N0773O2641P5874Q9651J03190
61323D552390J16585J30216J43788J56552J68123J78535J87578J94385J97697
61314F025849J96370J89838J78230J61940J41161J16091Q7644N7476K7086k827
61304G178858l1953n9686q5243j08274j29028j47749j64059j77057j86134j91715
61294E897960j94980j96670j96507j93986j89426j83621j76769j68506j59011
61285D238484j49221j39628j29619j18494j06521r4541q2969p1753o0964n0741
61275C234033m0882l1088k1571j2938n451J178P276J2903J8088K2949K7402L1067
$$ y = [4149487, 4141344, 4135275, 4129857, 4124115, 4118032, 4111976, 4105792, 4098806, 4090794, 4082469, 4074689, 4067560, 4060950, 4055712, 4053677, 4056371, 4064422, 4078449, 4099827, 4130109, 4170261, 4221034, 4283675, 4359549, 4449200, 4552390, 4668975, 4799191, 4942979, 5099531, 5267654, 5446189, 5633767, 5828152, 6025849, 6222219, 6412057, 6590287, 6752227, 6893388, 7009479, 7097123, 7154599, 7181685, 7178858, 7146905, 7087219, 7001976, 6893702, 6764674, 6616925, 6452866, 6275809, 6089675, 5897960, 5702980, 5506310, 5309803, 5115817, 4926391, 4742770, 4566001, 4397495, 4238484, 4089263, 3949635, 3820016, 3701522, 3595001, 3500460, 3417491, 3345738, 3284774, 3234033, 3193151, 3162063, 3140492, 3127554, 3122103, 3123281, 3130557, 3143460, 3161548, 3184497, 3211899, 3242966]
61263C242966L3642L5141L5714L5447L4476L3114L1634L0021K8188K6316K4706
61252C591365K3291K1513J8916J5612J2006Q253M328M66l032o448j0483j5202
61240C660585j9714k3313k6439k9927l3742l7100l9638m1617m3213m4365m5277
61229C276240m6211m6698m5860m3656m1039l8617l6032l2998l0044k7627k5427
61218B862031k3158k1350k0424j9706j8408j7065j6803j7486j7755j6979j5890
61207B657007j5028j3767j1539q980o959n051j993K566P691J2575J7478K3026
61195B657026K9215L5642M2313M9570N7299O4732P1146P6405Q0593Q3433Q4351
61184C331725Q2907P8880P2091O2430M9957L4809J7132k479k2668m1808n8879
$$ y = [3242966, 3276608, 3311749, 3347463, 3382910, 3417386, 3450500, 3482134, 3512155, 3540343, 3566659, 3591365, 3614656, 3636169, 3655085, 3670697, 3682703, 3690956, 3695284, 3695750, 3692718, 3686270, 3675787, 3660585, 3640871, 3617558, 3591119, 3561192, 3527450, 3490350, 3450712, 3409095, 3365882, 3321517, 3276240, 3230029, 3183331, 3137471, 3093815, 3052776, 3014159, 2978127, 2945129, 2915085, 2887458, 2862031, 2838873, 2817523, 2797099, 2777393, 2758985, 2741920, 2725117, 2707631, 2689876, 2672897, 2657007, 2641979, 2628212, 2616673, 2607693, 2600734, 2595683, 2593690, 2596256, 2603947, 2616522, 2634000, 2657026, 2686241, 2721883, 2764196, 2813766, 2871065, 2935797, 3006943, 3083348, 3163941, 3247374, 3331725, 3414632, 3493512, 3565603, 3628033, 3677990, 3712799, 3729931, 3727452, 3704784, 3662976, 3604097]
61173C604097p3532q5506r4476j00552j04328j06287j06579j05453j03402j00647
61163B623335r6968r2312q7102q1756p6376p1169o6534o2322n7700n2263m6752
61152A832081m2005l7724l3094k8205k3841k0126j6420j2620r464p272n276k728
61140A593306k7J887K848L500M209M481L561J361j328l461m638n342o286p618
61126A586453r029j0432j2105j4092j5896j7044j7643j8140j8714j9194j9435
61115A414729j9550j9754k0121k0507k0693k0654k0659k0986k1571k2103k2457
61104A185674k2814k3309k3773k3921k3705k3277k2778k2270k1791k1374k0942
61093I35720k0360j9599j8854j8401j8252j8038j7386j6417j5657j5348j5134
$$ y = [3604097, 3530565, 3445059, 3350583, 3250031, 3145703, 3039416, 2932837, 2827384, 2723982, 2623335, 2526367, 2434055, 2346953, 2265197, 2188821, 2117652, 2051118, 1988796, 1931096, 1878833, 1832081, 1790076, 1752352, 1719258, 1691053, 1667212, 1647086, 1630666, 1618046, 1608582, 1601310, 1596034, 1593306, 1593279, 1595166, 1598014, 1601514, 1605723, 1610204, 1613765, 1615126, 1613798, 1610337, 1605699, 1600357, 1594071, 1586453, 1577424, 1566992, 1554887, 1540795, 1524899, 1507855, 1490212, 1472072, 1453358, 1434164, 1414729, 1395179, 1375425, 1355304, 1334797, 1314104, 1293450, 1272791, 1251805, 1230234, 1208131, 1185674, 1162860, 1139551, 1115778, 1091857, 1068152, 1044875, 1022097, 999827, 978036, 956662, 935720, 915360, 895761, 876907, 858506, 840254, 822216, 804830, 788413, 772756, 757408, 742274]
61082G42274j4590j3819j3153j2463j1236r377p489o156n242m170k696j196j46
61069F40541M44J050K089L400M415M828M950N228N608N694N503N682O674P952
61055G04058Q424P638O348N735O215P131P570P218O356N271M034K766J739J092
61041G81595O64K14l99j286k500l777m706n275n962p005p934q256q288q808r861
61026G08416j0562j0196r099q138p583o848n423l750k929l486m625m997m112k713
61012F23955j790j618j863k132k079j409k39P31Q43J83o09j069j175j141j228
60997F09360j585j989j975j510j133j145j058l98M39P67P54J152K093K930L294
60982F09996L543M121N110O461Q013R290R893J0192J0879J1900J2523J2562J2689
$$ y = [742274, 727684, 713865, 700712, 688249, 677013, 667636, 660147, 653991, 648749, 644579, 641883, 640687, 640541, 640985, 642035, 644124, 647524, 651939, 656767, 661717, 666945, 672553, 678247, 683750, 689432, 696106, 704058, 712482, 720120, 726468, 732203, 738418, 745549, 753119, 760337, 766693, 771964, 775998, 778764, 780503, 781595, 782259, 782473, 782074, 780788, 778288, 774511, 769805, 764530, 758568, 751563, 743629, 735373, 727085, 718277, 708416, 697854, 687658, 678559, 670421, 662838, 655990, 650567, 646817, 643888, 640402, 635777, 630780, 626668, 623955, 622165, 620547, 618684, 616552, 614473, 613064, 612825, 613556, 614399, 614582, 613973, 612904, 611729, 610588, 609360, 607775, 605786, 603811, 602301, 601168, 600023, 598965, 598567, 599006, 599773, 600527, 601679, 603772, 606702, 609996, 613539, 617660, 622770, 629231, 637244, 646534, 656427, 666619, 677498, 689398, 701921, 714483, 727172]
60969G27172J3324J4026J4319J4430J4790J5447J6261J7088J7546J7276J6743
60958H98422J7078J8706K0874K2927K5197K8099L1100L3425L5192L7140L9602
60947A207762M2506M5934M9976N4321N8590O2867O7355P1910P6470Q1583Q7870
60936A907144R5344J03792J13452J24611J36982J50224J64935J82512K04388K31849
60926C415233K65907L06381L51595L99894M51213N06479N66532O33041P09284
60917G605559P97439Q94909R95389J092724J178830J235159J231465J142424R70694
60908A7144592P52402N37268L62421K42696J77669J57246J57101J36643N4149
60899A9722187j08033l31247n72757p89616r54320j056652j099580j095162j059469
$$ y = [727172, 740496, 754522, 768841, 783271, 798061, 813508, 829769, 846857, 864403, 881679, 898422, 915500, 934206, 955080, 978007, 1003204, 1031303, 1062403, 1095828, 1131020, 1168160, 1207762, 1250268, 1296202, 1346178, 1400499, 1459089, 1521956, 1589311, 1661221, 1737691, 1819274, 1907144, 2002488, 2106280, 2219732, 2344343, 2481325, 2631549, 2796484, 2978996, 3183384, 3415233, 3681140, 3987521, 4339116, 4739010, 5190223, 5696702, 6263234, 6896275, 7605559, 8402998, 9297907, 10293296, 11386020, 12564850, 13800009, 15031474, 16173898, 17144592, 17896994, 18434262, 18796683, 19039379, 19217048, 19374294, 19531395, 19668038, 19722187, 19614154, 19282907, 18710150, 17920534, 16966214, 15909562, 14809982, 13714820, 12655351]
60890A2655351j006328r44050q77076q08774p41827o77485o16209n59005n07411
60881E917186m62477m24207l91407l61717l32520l02675k73131k45431k20131
60872B903490j97035j76240j58062j42303j28397j16154j05732r6982q9460q2926
60862A610199p7388p2680o8366o4096n9801n5646n1873m8492m5103m1385l7717
60851I87652l4730l2190k9207k5855k3573k3191k3487k2626k0369j7876j5842
60840G18706j4068j2500j1398j0505r205p621o611o446o424n957n149m093k589
60827F16140q41L76O97O22O29N38J46k52m54q17j562k183k165j825j920k659l693
60810F00777m634n218n156m481l783l675m023m097l394k128j047q91j720k580
$$ y = [12655351, 11649023, 10704973, 9827897, 9019123, 8277296, 7599811, 6983602, 6424597, 5917186, 5454709, 5030502, 4639095, 4277378, 3944858, 3642183, 3369052, 3123621, 2903490, 2706455, 2530215, 2372153, 2229850, 2101453, 1985299, 1879567, 1782585, 1693125, 1610199, 1532811, 1460131, 1391765, 1327669, 1267868, 1212222, 1160349, 1111857, 1066754, 1025369, 987652, 952922, 920732, 891525, 865670, 842097, 818906, 795419, 772793, 752424, 734548, 718706, 704638, 692138, 680740, 670235, 661030, 653409, 646798, 640352, 633928, 627971, 622822, 618729, 616140, 615299, 615675, 616372, 616994, 617623, 618161, 618307, 618055, 617601, 616784, 615222, 613039, 610874, 609049, 607129, 604470, 600777, 596143, 590925, 585769, 581288, 577505, 573830, 569807, 565710, 562316, 560188, 559141, 558250, 556530, 553950]
60796E53950k178k08K248L920M630N055N607O029N945N433N061N580P234R283
60782F17589J0446J0134Q978P977P490P367P453P541P245O448N625N215M994M530
60768G19032L885L347K896K440K214K240J878P16m89o95j73j07p95j395j546j923
60752G31525k875l685l820l873m499n302n591n533n633n657n068m228m139n012
60738F66610n940o040n272m083k888j991j516j130l09R50K032K507K672L120M062
60723F52784N247O370P252P842Q258Q758R458J0097J0304J0169J0277J1040J2039
60710G69895J2421J1872J0989J0492J0431J0363J0078R651R034Q095P039O284
60698H86644N756M839L209J312k23j254j986k483k723k827l011l352l790m198
$$ y = [553950, 551772, 551564, 553812, 557732, 562362, 567417, 573024, 579053, 584998, 590431, 595492, 601072, 608306, 617589, 628035, 638169, 647147, 655124, 662614, 669981, 677434, 684975, 692220, 698668, 704293, 709508, 714502, 719032, 722917, 726264, 729160, 731600, 733814, 736054, 737932, 738648, 738159, 737464, 737291, 737184, 736389, 734994, 733448, 731525, 728650, 724965, 721145, 717272, 712773, 707471, 701880, 696347, 690714, 685057, 679989, 675761, 671622, 666610, 660670, 654630, 649358, 645275, 642387, 640396, 638880, 637750, 637441, 638391, 640423, 642930, 645602, 648722, 652784, 658031, 664401, 671653, 679495, 687753, 696511, 705969, 716066, 726370, 736539, 746816, 757856, 769895, 782316, 794188, 805177, 815669, 826100, 836463, 846541, 856192, 865226, 873321, 880360, 886644, 892400, 897239, 900448, 901760, 901537, 900283, 898297, 895814, 893091, 890264, 887253, 883901, 880111, 875913]
60684H75913m371m276m297m826n538n623m962m456m785n518n894n924o052o220
60670H03171o044n572n108m501l458k350j816j651r61M37J639J947J740J754K115
60655G81342K519K912L436L991M173L556J997m4j616k094j955k174k942l545l641
60640G85915l771m359m934m928m570m375m306m120m088m591n330n728n957o700
60626G18158p854q309p404n986n526o474p892q584q251p491o966o770o604o322
60612F17725o004n586m791l592k444j744j290n79M61J395J841J890J848J851J742
60597F02723J298O09K40P64J993K873K571J510R46J532K613L084K635J922J645
60582F28958J804J925J857K030K788L702L957L405K854L063L839M438M577M659
$$ y = [875913, 871542, 867266, 862969, 858143, 852605, 846982, 842020, 837564, 832779, 827261, 821367, 815443, 809391, 803171, 797127, 791555, 786447, 781946, 778488, 776138, 774322, 772671, 771710, 772147, 773786, 775733, 777473, 779227, 781342, 783861, 786773, 790209, 794200, 798373, 801929, 803926, 803882, 802266, 800172, 798217, 796043, 793101, 789556, 785915, 782144, 777785, 772851, 767923, 763353, 758978, 754672, 750552, 746464, 741873, 736543, 730815, 724858, 718158, 710304, 701995, 694591, 688605, 683079, 676605, 668713, 660129, 651878, 644387, 637421, 630651, 624047, 617725, 611721, 606135, 601344, 597752, 595308, 593564, 592274, 591695, 592156, 593551, 595392, 597282, 599130, 600981, 602723, 604021, 604630, 604870, 605634, 607627, 610500, 613071, 614581, 615527, 617059, 619672, 622756, 625391, 627313, 628958, 630762, 632687, 634544, 636574, 639362, 643064, 647021, 650426, 653280, 656343, 660182, 664620, 669197, 673856]
60568F73856N129O032P168Q309R179R543R484R430R794J0589J1423J1789J1480
60555G93205J0785J0255J0170J0314J0281R800Q740P137N439M362M103L937L007
60542H91535J325m09j849l346n236p330r183j0465j0951j0532r407q070o930o154
60528H02998n740n503n055m223l435l236l479l492l124k918l138l288l002k691
60514G50674k814l049k807k134j409n40P93K207K823K496K136K560L539M280M461
60499G63216M390M445M664M878M996N140N466N881O051N826N541N675O330P275
60485H39774Q347R509J0641J1677J2864J4409J5982J7088J7986J9525K1837K3819
60473A023458K4298K3211K1162J8360J4629J0214N794J757j941n135p328q407
$$ y = [673856, 678985, 685017, 692185, 700494, 709673, 719216, 728700, 738130, 747924, 758513, 769936, 781725, 793205, 803990, 814245, 824415, 834729, 845010, 854810, 863550, 870687, 876126, 880488, 884591, 888528, 891535, 892860, 892451, 890602, 887256, 882020, 874690, 865507, 855042, 844091, 833559, 824152, 816082, 809152, 802998, 797258, 791755, 786700, 782477, 779042, 775806, 772327, 768835, 765711, 762793, 759655, 756367, 753365, 750674, 747860, 744811, 742004, 739870, 738461, 737921, 738714, 740921, 743744, 746240, 748376, 750936, 754475, 758755, 763216, 767606, 772051, 776715, 781593, 786589, 791729, 797195, 803076, 809127, 814953, 820494, 826169, 832499, 839774, 848121, 857630, 868271, 879948, 892812, 907221, 923203, 940291, 958277, 977802, 999639, 1023458, 1047756, 1070967, 1092129, 1110489, 1125118, 1135332, 1141126, 1142883, 1140942, 1135807, 1128479, 1120072]
60461A120072q933r359r329q211o089l762j751K84K841N586P540Q293Q652R670
60447A115504J1327J2739J3624J4876J7368K0826K4412K7944L1863L6317M1087
60436A367887M6350N2683O0109O7916P5642Q3700R2635J02355J12437J22776J33502
60425B317992J44643J56293J68741J81959J95116K06886K15755K19594K15495
60416D022474K00966J75406J39986R6415M6622o318n8004j04198j42341j71633
60406D199375j92158k04420k09424k08656k03800j96420j87691j78163j67986
60397B450657j57379j46815j36661j26936j17583j08704j00350r2258q4097p5891
60387A303983o8030o0926n4742m9419m4783m0650l6875l3329k9916k6761k4275
$$ y = [1120072, 1111139, 1101780, 1092451, 1084240, 1078151, 1074389, 1072638, 1072922, 1075763, 1081349, 1088889, 1097182, 1105834, 1115504, 1126831, 1139570, 1153194, 1168070, 1185438, 1206264, 1230676, 1258620, 1290483, 1326800, 1367887, 1414237, 1466920, 1527029, 1594945, 1670587, 1754287, 1846922, 1949277, 2061714, 2184490, 2317992, 2462635, 2618928, 2787669, 2969628, 3164744, 3371630, 3587385, 3806979, 4022474, 4223440, 4398846, 4538832, 4635247, 4681869, 4675551, 4617547, 4513349, 4371008, 4199375, 4007217, 3802797, 3593373, 3384717, 3180917, 2984497, 2796806, 2618643, 2450657, 2293278, 2146463, 2009802, 1882866, 1765283, 1656579, 1556229, 1463971, 1379874, 1303983, 1235953, 1175027, 1120285, 1070866, 1026083, 985433, 948558, 915229, 885313, 858552, 834277]
60376H34277k2709k1624k0206j8228j6352j5151j4227j2790j0878r377q804q693
60364F55238q381p881p482o912n619l810k569k609l378l756l382k764k337j955
60350E92403j382p96m89m31l61j13L98J252K296L071L261L086L016L224L587L978
60334F16000M228L979L030J754P94M04M02O92J296J951K152J741J015J98o98j415
60318F37523j466q71l44m16p84r63j091j525j935j544k31J158J769J622J305J108
60302F33315P81J15n96q23m57J09O00J199K061K826L007K750K644K926L368L903
60286F57728M648N299N241M562M197M632N144M906M168L683L448K966K356K227
60272G15205K505K350J457O38P79J747K706L118L078K876K540J820O06o57j179
$$ y = [834277, 811568, 789944, 769738, 751510, 735158, 720007, 705780, 692990, 682112, 672735, 663931, 655238, 646857, 638976, 631494, 624582, 618963, 615153, 612584, 609975, 606597, 602841, 599459, 596695, 594358, 592403, 591021, 590225, 589736, 589305, 588944, 588831, 589229, 590481, 592777, 595848, 599109, 602195, 605211, 608435, 612022, 616000, 620228, 624207, 627237, 628991, 629785, 630189, 630591, 631283, 632579, 634530, 636682, 638423, 639438, 639636, 638938, 637523, 636057, 635186, 634842, 634426, 633642, 632679, 631588, 630063, 628128, 626584, 626353, 627511, 629280, 630902, 632207, 633315, 634096, 634211, 633615, 632792, 632335, 632444, 633044, 634243, 636304, 639130, 642137, 644887, 647531, 650457, 653825, 657728, 662376, 667675, 672916, 677478, 681675, 686307, 691451, 696357, 700525, 704208, 707656, 710622, 712978, 715205, 717710, 720060, 721517, 722155, 722934, 724681, 727387, 730505, 733583, 736459, 738999, 740819, 741425, 740768, 739589]
60257G39589p44j59l77j315k049k085j774j473r98k78J82m9n44n17J66R43J405
60240G29923J663J912K109K214K394K707K890K712K466K693L425L968L712K938
60226G67726K556L049M027M849N347N738O116O384O522O644O801P014P411Q079
60212H48263Q799R199R310R719J0969J2850J4460J5068J4948J5164J6498J8733
60200A003980K1171K3526K5930K8287L0321L2274L4844L8139M1464M4532M8100
60189A372568N2761N7863O2420O6590P1188P6149Q0683Q4839Q9559R4933R9584
60178B209137J02390J03817J04884J05465J04475J01228R5974Q9407Q2202P4765
60168C173744O6944N8141M8213L7902K8085J8876J0021J822n005j0177j3912j6240
$$ y = [739589, 738845, 738686, 738309, 736994, 734945, 732860, 731086, 729613, 728615, 728337, 728519, 728470, 727926, 727409, 727575, 728518, 729923, 731586, 733498, 735607, 737821, 740215, 742922, 745812, 748524, 750990, 753683, 757108, 761076, 764788, 767726, 770282, 773331, 777358, 782207, 787554, 793292, 799408, 805792, 812314, 818958, 825759, 832773, 840184, 848263, 857062, 866261, 875571, 885290, 896259, 909109, 923569, 938637, 953585, 968749, 985247, 1003980, 1025151, 1048677, 1074607, 1102894, 1133215, 1165489, 1200333, 1238472, 1279936, 1324468, 1372568, 1425329, 1483192, 1545612, 1612202, 1683390, 1759539, 1840222, 1925061, 2014620, 2109553, 2209137, 2311527, 2415344, 2520228, 2625693, 2730168, 2831396, 2927370, 3016777, 3098979, 3173744, 3240688, 3298829, 3347042, 3384944, 3413029, 3431905, 3441926, 3443748, 3438743, 3428566, 3414654, 3398414]
60156C398414j6913j5983j3856j0640o043j00O526J3270K0304K8088L6606M5405
60144C485078N4113O2603P0727P8178Q4520Q9188R1601R1614Q9710Q6474Q1861
60133D365667P5363O6829N6771M5749L3881K1296Q616l398j4555k5109l4976m3506
60121D552628n0098n4653n7280n7938n6596n3474m8836m2761l5339k6933j8022
60110D050698q878M58R923J9315K8240L6111M2355M6819M9737N1188N0856M8590
60098D425412M4875M0419L5471K9924K3928J7971J2473P736M217K508K887N217
60086D653038R254J4889K2117L1004M1602N3626O6351P9232R2512J06880J22560
60075E293065J39149J56296J74030J92338K10872K29261K47366K64887K80971
$$ y = [3398414, 3381501, 3365518, 3351662, 3341022, 3334979, 3334879, 3341405, 3354675, 3374979, 3403067, 3439673, 3485078, 3539191, 3601794, 3672521, 3750699, 3835219, 3924407, 4016008, 4107622, 4197332, 4283806, 4365667, 4441030, 4507859, 4564630, 4610379, 4644260, 4665556, 4674172, 4670774, 4656219, 4631110, 4596134, 4552628, 4502530, 4447877, 4390597, 4332659, 4276063, 4222589, 4173753, 4130992, 4095653, 4068720, 4050698, 4041820, 4042278, 4052201, 4071516, 4099756, 4135867, 4178222, 4225041, 4274778, 4325966, 4376822, 4425412, 4470287, 4510706, 4546177, 4576101, 4600029, 4618000, 4630473, 4638209, 4642426, 4644934, 4647821, 4653038, 4662292, 4677181, 4699298, 4730302, 4771904, 4825530, 4891881, 4971113, 5063625, 5170505, 5293065, 5432214, 5588510, 5762540, 5954878, 6165750, 6395011, 6642377, 6907264, 7188235]
60066G188235K94387L04145L09861L11616L09494L03224K92371K76856K57055
60057I847244K33290K05621J74344J40327J04415O6873K7903j1552n0101q6775
60047A0651589j20916j51498j77357j98165k14368k26031k32439k33072k28330
60038H869413k19072k05963j89604j70809j50405j28967j06882q4403o1696l9302
60028G512310j8457l35J4919K7722L7681M3600M5054M2928L8079L0374J9683O883
60016G800441o938k1625l7438n3864o9773q4523r8133j10589j21661j31276j39444
60005F925177j45801j49765j51132j50170j47185j42342j35813j27707j17971
59996E657291j06661r4202q1051o7233n2456l6666k0312m115J1311K5768L9421
$$ y = [7188235, 7482622, 7786767, 8096628, 8408244, 8717738, 9020962, 9313333, 9590189, 9847244, 10080534, 10286155, 10460499, 10600826, 10705241, 10772114, 10800017, 10788465, 10738364, 10651589, 10530673, 10379175, 10201818, 10003653, 9789285, 9563254, 9330815, 9097743, 8869413, 8650341, 8444378, 8254774, 8083965, 7933560, 7804593, 7697711, 7613308, 7551612, 7512310, 7493853, 7493518, 7508437, 7536159, 7573840, 7617440, 7662494, 7705422, 7743501, 7773875, 7793558, 7800441, 7793503, 7771878, 7734440, 7680576, 7610803, 7526280, 7428147, 7317558, 7195897, 7064621, 6925177, 6779376, 6629611, 6478479, 6328309, 6181124, 6038782, 5902969, 5775262, 5657291, 5550630, 5456428, 5375377, 5308144, 5255688, 5219022, 5198710, 5194595, 5205906, 5231674, 5271095]
59985E271095N2160O3093P1202P6423P9497Q0637P9087P4307O6736N6953M4905
59974F016095L0618J4928j250j7783l4504n0281o3930p5676q6475r6023j02701
59963E533018j05646j05749j04205j01078r5869q8744q0433p1198o0614m8339
59953D671143l4757k0647o383Q372K4037M0289N6223P1290Q5657R9457J12097
59942E106778J22725J30848J36089J37857J35872J30732J23300J13639J01180
59933F239020Q5768O7999M8638K8370P993j1732l0433m7827o3178p5623q5030
59922F163965r1900r6402r8057r6373r1416q3706p4008o3145n1578l9183k5853
59911E352344j2110J302J4236K6912L9098N0163N9863O8312P5233Q0021Q2624
$$ y = [5271095, 5323255, 5386348, 5457550, 5533973, 5613470, 5694107, 5773194, 5847501, 5914237, 5971190, 6016095, 6046713, 6061641, 6060391, 6042608, 6008104, 5957823, 5893893, 5818217, 5731742, 5635719, 5533018, 5427372, 5321623, 5217418, 5116340, 5020471, 4931727, 4851294, 4780096, 4719482, 4671143, 4636386, 4615739, 4609356, 4617728, 4641765, 4682054, 4738277, 4809567, 4895224, 4994681, 5106778, 5229503, 5360351, 5496440, 5634297, 5770169, 5900901, 6024201, 6137840, 6239020, 6324788, 6392787, 6441425, 6469795, 6477788, 6466056, 6435623, 6387796, 6324618, 6248995, 6163965, 6072065, 5975663, 5877606, 5781233, 5689817, 5606111, 5532103, 5468958, 5417380, 5378197, 5352344, 5340234, 5341536, 5355772, 5382684, 5421782, 5471945, 5531808, 5600120, 5675353, 5755374, 5837998]
59900E837998Q3618Q3273Q1272P7547P2754O7546O2014N6127N0227M4846M0384
59889F557606L7210L5721L6170L8769M3963N2138O3057P6161R1364J08989J28807
59878G269955J49922J71755J94433K17949K41489K63883K84109L01111L13704
59869I408310L20980L22292L16652L02804K80236K49518K11397J66260J15023
59860A1693472N9919L821n0790j01874j47542j86512k18507k43692k61933k73141
59850A0273221k77837k76773k70281k58689k43052k24796k04587j82297j58013
59841H176896j32498j06493q0174n3599k7304k198K0986M1902O0317P5812Q7753
59830H061400R5347R7704R3916Q3460O6729M5033J9791q238l8706p0787j02938
$$ y = [5837998, 5921616, 6004889, 6086161, 6163708, 6236462, 6304008, 6366022, 6422149, 6472376, 6517222, 6557606, 6594816, 6630537, 6666707, 6705476, 6749439, 6801577, 6864634, 6940795, 7032159, 7141148, 7269955, 7419877, 7591632, 7786065, 8004014, 8245503, 8509386, 8793495, 9094606, 9408310, 9729290, 10051582, 10368234, 10671038, 10951274, 11200792, 11412189, 11578449, 11693472, 11753391, 11757212, 11706422, 11604548, 11457006, 11270494, 11051987, 10808295, 10546362, 10273221, 9995384, 9718611, 9448330, 9189641, 8946589, 8721793, 8517206, 8334909, 8176896, 8044398, 7937905, 7857731, 7804132, 7776828, 7774630, 7795616, 7837518, 7897835, 7973647, 8061400, 8156747, 8254451, 8348367, 8431827, 8498556, 8543589, 8563380, 8555142, 8516436, 8445649, 8342711]
59819H342711j33453j60989j84612k03818k18665k29495k36530k39912k39976
59810F495261k37000k30831k21484k10050j98275j87013j75781j64008j51827
59801D718992j39416j26521j13371j01312r1632q4221p8085p2761o8317o4384
59791C778972o0118n5253n0325m5840m1739l7787l3920l0217k7024k5086k4957
59780C346706k6204k7762k9192l1013l3583l6257l8053l8758l8851l8607l7762
59769B970664l6038l3530l0441k6794k2590j8073j3542q980m159R14N879J0495
59757B793805J4987J9772K4994L0480L5894M0730M4397M6692M8048M8978M9354
59746C198131M8636M6688M3983M0993L7823L4409L0696K6692K2874K0397K0306
$$ y = [8342711, 8209258, 8048269, 7863657, 7659839, 7441174, 7211679, 6975149, 6735237, 6495261, 6258261, 6027430, 5805946, 5595896, 5397621, 5210608, 5034827, 4870819, 4718992, 4579576, 4453055, 4339684, 4238372, 4146740, 4062519, 3984434, 3911673, 3843356, 3778972, 3718854, 3663601, 3613276, 3567436, 3525697, 3487910, 3453990, 3423773, 3396749, 3371663, 3346706, 3320502, 3292740, 3263548, 3232535, 3198952, 3162695, 3124642, 3085884, 3047033, 3008426, 2970664, 2934626, 2901096, 2870655, 2843861, 2821271, 2803198, 2789656, 2780676, 2776517, 2777431, 2783310, 2793805, 2808792, 2828564, 2853558, 2884038, 2919932, 2960662, 3005059, 3051751, 3099799, 3148777, 3198131, 3246767, 3293455, 3337438, 3378431, 3416254, 3450663, 3481359, 3508051, 3530925, 3551322, 3571628]
59735C571628K2355K5250K8230L1897L7242M4502N3271O3286P4685Q7743J02676
59724D142765J19376J37216J55458J73908J92801K11962K30670K48371K64715
59715E877242K78517K87372K88756K80902K62377K31906J89713J38729Q3664K9005
59705G948183k1804o6047j01815j28474j46401j56344j59397j57178j51296j42646
59695F716781j31726j19341j06248r2316p6850n9883m2406k5235q226R165K7073
59684F090788M5279O3772Q2897J02992J23933J45144J66234J87650K10346K34659
59674G453694K59953K85646L12091L39952L69102L98751M28426M58141M87746
59665A0793502N16633N44018N68994N90436O07318O19125O25621O26495O21849
$$ y = [3571628, 3593983, 3619233, 3647463, 3679360, 3716602, 3761104, 3814375, 3877661, 3952346, 4040089, 4142765, 4262141, 4399357, 4554815, 4728723, 4921524, 5133486, 5364156, 5612527, 5877242, 6155759, 6443131, 6731887, 7012789, 7275166, 7507072, 7696785, 7835514, 7919178, 7948183, 7926379, 7860332, 7758517, 7630043, 7483642, 7327298, 7167901, 7010723, 6859427, 6716781, 6585055, 6465714, 6359466, 6267150, 6190300, 6130417, 6088011, 6062776, 6054550, 6063715, 6090788, 6136067, 6199839, 6282736, 6385728, 6509661, 6654805, 6821039, 7008689, 7219035, 7453694, 7713647, 7999293, 8311384, 8651336, 9020438, 9419189, 9847615, 10305756, 10793502, 11310135, 11854153, 12423147, 13013583, 13620901, 14240026, 14865647, 15492142, 16113991]
59656A6113991O12813O01090N87980N74517N62272N53128N48022N46560N47958
59647B1248331N51609N56409N60116N59988N53860N40483N19098M89105M50074
59638B6029073M02169L46709K86252K23788J61825J02436M8023J436l4890n9717
59628B7507104p2925p4895o6057m6847j7974J9397O4015J15142J72351K34499
59618B7833810K99399L64958M30026M93409N52430O03365O42956O68500O76432
59609C2565285O62171O22069N55137M62686L47100K11670O1317r7131k55567m05948
59599C4728789n41734o58696p54455q27633q78006r07336r19245r17853r06925
59590B7416906q90334q72531q57717q48675q46451q50678q59721q70677q79916
$$ y = [16113991, 16726804, 17327894, 17915874, 18490391, 19052663, 19605791, 20153813, 20700373, 21248331, 21799940, 22356349, 22916465, 23476453, 24030313, 24570796, 25089894, 25578999, 26029073, 26431242, 26777951, 27064203, 27287991, 27449816, 27552252, 27600275, 27601711, 27566821, 27507104, 27434179, 27359284, 27293227, 27246380, 27228406, 27247803, 27311818, 27426960, 27599311, 27833810, 28133209, 28498167, 28928193, 29421602, 29974032, 30577397, 31220353, 31888853, 32565285, 33227456, 33849525, 34404662, 34867348, 35214448, 35426118, 35487435, 35390304, 35134737, 34728789, 34187055, 33528359, 32773904, 31946271, 31068265, 30160929, 29241684, 28323831, 27416906, 26526572, 25654041, 24796324, 23947649, 23101198, 22250520, 21390799, 20520122, 19640206]
59581A9640206q84029q80625q68645q48313q20787p87715p50858p11709o71163
59572A2416362o29764n88447n48662n11304m75861m41306m07592l75623l45819
59563H091984l17592k90377k64353k39919k17177j96286j77640j61229j46403
59554F081008j32754j20814j11420j04675r9997r6848r5000r4260r4347r4954
59544E035939r5723r6269r6432r6226r5537r4110r1887q9039q5574q1340p6435
59533D037367p1154o5437n8986n2062m5487l9541l3542k7010k0556j4957r980
59522C598655m852M82N472J0057J4705J9390K3382K6302K8765L1639L5139L8951
59510C828087M2884M7077N1720N6963O2996P0022P8049Q6746R5704J04814J14389
$$ y = [19640206, 18756177, 17875552, 17006907, 16158594, 15337807, 14550092, 13799234, 13087525, 12416362, 11786598, 11198151, 10649489, 10138185, 9662324, 9221018, 8813426, 8437803, 8091984, 7774392, 7484015, 7219662, 6979743, 6762566, 6566280, 6388640, 6227411, 6081008, 5948254, 5827440, 5716020, 5611345, 5511348, 5414500, 5319500, 5225240, 5130893, 5035939, 4940216, 4843947, 4747515, 4651289, 4555752, 4461642, 4369755, 4280716, 4195142, 4113802, 4037367, 3966213, 3900776, 3841790, 3789728, 3744241, 3704700, 3671158, 3644148, 3623592, 3608635, 3598655, 3593803, 3594285, 3599757, 3609814, 3624519, 3643909, 3667291, 3693593, 3722358, 3753997, 3789136, 3828087, 3870971, 3918048, 3969768, 4026731, 4089727, 4159749, 4237798, 4324544, 4420248, 4525062, 4639451]
59499D639451J24737J35695J46794J57884J69388J81772J94909K08073K20437
59490F179140K31580K41686K51166K59882K66744K70503K70953K68882K64850
59481H505386K58557K49720K38932K27150K14725K01426J87077J71752J55719
59472A0410444J39822J25521J13919J04799R7316R1368Q7501Q5444Q3695Q0908
59462A1420737P6899P1694O4175N2465L5537J3865j1439l9715p0877j04774j40595
59451A1367972j76671k10870k41446k67686k89715l07624l21004l29394l32970
59442H890592l32515l28690l21578l11036k97404k81583k64508k46683k28287
59433F278308k09513j90612j71686j52707j33838j15464r7726q0159o2104m3576
$$ y = [4639451, 4764188, 4899883, 5046677, 5204561, 5373949, 5555721, 5750630, 5958703, 6179140, 6410720, 6652406, 6903572, 7163454, 7430198, 7700701, 7971654, 8240536, 8505386, 8763943, 9013663, 9252595, 9479745, 9694470, 9895896, 10082973, 10254725, 10410444, 10550266, 10675787, 10789706, 10894505, 10991821, 11083189, 11170690, 11256134, 11339829, 11420737, 11497636, 11569330, 11633505, 11685970, 11721507, 11735372, 11723933, 11684218, 11613341, 11508567, 11367972, 11191301, 10980431, 10738985, 10471299, 10181584, 9873960, 9552956, 9223562, 8890592, 8558077, 8229387, 7907809, 7596773, 7299369, 7017786, 6753278, 6506595, 6278308, 6068795, 5878183, 5706497, 5553790, 5419952, 5304488, 5206762, 5126603, 5064499, 5020923]
59423E020923k5394q315P815K3766L9992N6279P2269Q7951J03477J18780J33555
59412E631098J47444J60125J71208J80129J86143J88575J87181J82115J73269
59403G207287J59853J41102J17264Q9399N8319K4460j1119m6442p9792j10486
59393G549845j38161j62030j81533j97129k09601k18914k24563k26627k25761
59384E765526k22357k16581k09047k00579j91318j80903j69555j58224j47524
59375D069438j37170j26592j15557j04190r2950q2597p3460o4840n5774m6432
59365C169876l7881l0548k3769j7000j0564m876J49M668Q641J2398J6614K1350
59353C109058K5956L0218L4656L9190M2619M4222M4996M6448M8879N1909N5942
$$ y = [5020923, 4995529, 4987214, 4995029, 5018795, 5058787, 5115066, 5187335, 5275286, 5378763, 5497543, 5631098, 5778542, 5938667, 6109875, 6290004, 6476147, 6664722, 6851903, 7034018, 7207287, 7367140, 7508242, 7625506, 7714905, 7773224, 7797684, 7786565, 7740123, 7660331, 7549845, 7411684, 7249654, 7068121, 6870992, 6661391, 6442477, 6217914, 5991287, 5765526, 5543169, 5326588, 5117541, 4916962, 4725644, 4544741, 4375186, 4216962, 4069438, 3932268, 3805676, 3690119, 3585929, 3492979, 3410382, 3336922, 3272082, 3216308, 3169876, 3131995, 3101447, 3077678, 3060678, 3050114, 3045238, 3045387, 3050055, 3058696, 3071094, 3087708, 3109058, 3135014, 3165232, 3199888, 3239078, 3281697, 3325919, 3370915, 3417363, 3466242, 3518151, 3574093]
59342C574093O1898O9796P8795Q8490R9149J10617J22057J33000J43957J55748
59332D637600J68858J83705K00989K21297K44478K69554K95248L20711L45936
59323F888376L71283L96507M20429M41751M59714M73679M82511M85056M81005
59314A0900311M70804M54890M33638M07915L79067L48281L16310K83663K50555
59305A4245434K16707J81776J46002J09958P3638L6434j873m0622p8940j16347
59295A4772167j52297j85626k15026k39962k60695k77492k90397k99946l07619
59286A2543107l15050l22847l30511l37483l43751l49268l53377l55314l55014
59277I480492l52822l48615l41790l32124l20107l06426k91631k76298k60844
$$ y = [3574093, 3635991, 3705787, 3784582, 3873072, 3972221, 4082838, 4204895, 4337895, 4481852, 4637600, 4806458, 4990163, 5191152, 5412449, 5656927, 5926481, 6221729, 6542440, 6888376, 7259659, 7656166, 8076595, 8518346, 8978060, 9451739, 9934250, 10419306, 10900311, 11371115, 11826005, 12259643, 12667558, 13046625, 13394906, 13711216, 13994879, 14245434, 14462141, 14643917, 14789919, 14899877, 14973515, 15009949, 15008076, 14967454, 14888514, 14772167, 14619870, 14434244, 14219218, 13979256, 13718561, 13441069, 13150672, 12850726, 12543107, 12228057, 11905210, 11574699, 11237216, 10893465, 10544197, 10190820, 9835506, 9480492, 9127670, 8779055, 8437265, 8105141, 7785034, 7478608, 7186977, 6910679, 6649835]
59268F649835k45061k28421k11080j93950j77560j61560j45638j30351j16490
59259E039724j04056r2331q0628o8672n6674m5408l5756k7728k0315j2667n030
59248D490459J821P533J2153J5580J7697J8769J9237J9290J8974J8416J7652J6598
59236D674179J5470J4797J4793J5292J6482J8964K2563K6076K8968L2571L8536
59225D918691M6626N5089O2836P0259P8043Q6206R4269J01628J07733J12468J16106
59214E849954J18345J17854J13510J05732R5617Q3314O8318N1120L3242J5638
59204F652644j608j7938l1984m3065n1905n9318o5066o8665p0464p1204p1020
59193F100407o9538o6743o3195n9565n6120n2570m8307m3068l7237l1207k4674
$$ y = [6649835, 6404774, 6176353, 5965273, 5771323, 5593763, 5432203, 5286565, 5156214, 5039724, 4935668, 4843337, 4762709, 4694037, 4637363, 4591955, 4556199, 4528471, 4508156, 4495489, 4490459, 4492280, 4499813, 4511966, 4527546, 4545243, 4564012, 4583249, 4602539, 4621513, 4639929, 4657581, 4674179, 4689649, 4704446, 4719239, 4734531, 4751013, 4769977, 4792540, 4818616, 4847584, 4880155, 4918691, 4965317, 5020406, 5083242, 5153501, 5231544, 5317750, 5412019, 5513647, 5621380, 5733848, 5849954, 5968299, 6086153, 6199663, 6305395, 6401012, 6484326, 6552644, 6603764, 6637006, 6652644, 6651036, 6633098, 6601114, 6558049, 6506144, 6446826, 6381760, 6313095, 6242631, 6171427, 6100407, 6030869, 5964126, 5900931, 5841366, 5785246, 5732676, 5684369, 5641301, 5604064, 5572857, 5548183]
59182E548183j7088q556N06J0485K2355L6198N1000O6237Q2757J01455J21853
59171F015385J42685J63285J83682K03592K22093K38232K51376K60858K65572
59162G946760K63990K54743K37344K12403J80876J43158R9300N0164k097n4831
59152I331810j05849j53594j96986k35300k67859k93638l11640l21939l25942
59143G119063l25357l21177l13762l03466k90855k76644k61676k46718k31955
59134D547453k16926k01245j85252j69797j55557j42640j30681j19203j08022
59125C118130r7367q7528p8496p0081o2332n5499m9713m4849m0562l6219l1121
59114B464363k5288j9739j5440j2092q558m278L29M730Q771J2303J5234J8040
$$ y = [5548183, 5531095, 5522539, 5523045, 5533530, 5555885, 5592083, 5643083, 5709320, 5792077, 5893532, 6015385, 6158070, 6321355, 6505037, 6708629, 6930722, 7168954, 7420330, 7681188, 7946760, 8210750, 8465493, 8702837, 8915240, 9096116, 9239274, 9338574, 9388738, 9386641, 9331810, 9225961, 9072367, 8875381, 8640081, 8372222, 8078584, 7766944, 7445005, 7119063, 6793706, 6472529, 6158767, 5855301, 5564446, 5287802, 5026126, 4779408, 4547453, 4330527, 4129282, 3944030, 3774233, 3618676, 3476036, 3345355, 3226152, 3118130, 3020763, 2933235, 2854739, 2784658, 2722326, 2666827, 2617114, 2572265, 2531703, 2495484, 2464363, 2439075, 2419336, 2403896, 2391804, 2383246, 2378968, 2379297, 2384027, 2392798, 2405101, 2420335, 2438375]
59102B438375K1524K5773L0009L3663L6989M0348M3583M6398M8809N0839N2309
59091B868619N3267N4109N4913N5088N4065N1962M9344M6475M3132L8861L3406
59080C403241K7181K1269J6526J2716R043N412K486N68o92j300n90J732N018Q618
59066C511228J2737J7890K4110L1167L8994M7484N6366O5695P5851Q6700R7391
59055D065613J07482J17656J28687J40247J51286J61105J69411J75818J79974
59046E397279J81877J81423J77857J70207J58068J41522J20673R5771O7632L7450
59036F729759O304k4879n5128q3525j09276j31597j49960j64634j76429j85737
59026E654898j92338j96308j98299j98582j96764j93022j88615j84328j79204
$$ y = [2438375, 2459899, 2485672, 2515681, 2549344, 2586333, 2626681, 2670264, 2716662, 2765471, 2816310, 2868619, 2921886, 2975995, 3030908, 3085996, 3140061, 3192023, 3241367, 3287842, 3330974, 3369835, 3403241, 3430422, 3451691, 3468217, 3480933, 3489976, 3495388, 3497874, 3498442, 3497750, 3496450, 3495860, 3497592, 3502610, 3511228, 3523965, 3541855, 3565965, 3597132, 3636126, 3683610, 3739976, 3805671, 3881522, 3968222, 4065613, 4173095, 4290751, 4419438, 4559685, 4710971, 4872076, 5041487, 5217305, 5397279, 5579156, 5760579, 5938436, 6108643, 6266711, 6408233, 6528906, 6624677, 6692309, 6729759, 6736063, 6711184, 6656056, 6572531, 6463255, 6331658, 6181698, 6017064, 5840635, 5654898, 5462560, 5266252, 5067953, 4869371, 4672607, 4479585, 4290970, 4106642, 3927438]
59017C927438j71934j62899j53748j45390j37562j30036j23016j16317j09299
59008B677237j01844r4525q7637q0817p3859o7167o1170n5813n0840m6151m1743
58997A915671l7676l4206l1533k9450k7566k5789k4231k2854k1749k1512k2631
58986A616474k4589k6233k7092k7632k8191k8375k7794k6726k5670k4661k3435
58975A326076k1936k0387j8994j7754j6385j4541j2254j0111q588p368n742l702
58963A168314k014j127o10Q7P91R32L69m32r68j056p63j84O51J801L287M922O227
58946A180227O721O370N772N788O734Q023Q786Q861Q886R387J0262J1257J2387
58933A289461J3487J3917J3360J2636J2915J4222J5395J5588J5173J4992J5315
$$ y = [3927438, 3755504, 3592605, 3438857, 3293467, 3155905, 3025869, 2902853, 2786536, 2677237, 2575393, 2480868, 2393231, 2312414, 2238555, 2171388, 2110218, 2054405, 2003565, 1957414, 1915671, 1877995, 1843789, 1812256, 1782806, 1755240, 1729451, 1705220, 1682366, 1660617, 1639105, 1616474, 1591885, 1565652, 1538560, 1510928, 1482737, 1454362, 1426568, 1399842, 1374172, 1349511, 1326076, 1304140, 1283753, 1264759, 1247005, 1230620, 1216079, 1203825, 1193714, 1185126, 1177758, 1172016, 1168314, 1166300, 1165173, 1164563, 1164650, 1165441, 1166373, 1166742, 1166310, 1165342, 1164286, 1163523, 1163339, 1163990, 1165791, 1169078, 1174000, 1180227, 1186948, 1193318, 1199090, 1204878, 1211612, 1219635, 1228421, 1237282, 1246168, 1255555, 1265817, 1277074, 1289461, 1302948, 1316865, 1330225, 1342861, 1355776, 1369998, 1385393, 1400981, 1416154, 1431146, 1446461]
58922A446461J5837J6309J6770J7339J8108J9134K0350K1561K2640K3662K4788
58911A662959K6125K7761K9813L2282L4885L7150L8791L9983M1138M2407M3552
58900B056846M4422M5319M6597M8104M9360N0253N1114N2188N3530N5424N8297
58889B611454O1992O5752O9204P2857P7268Q2301Q7679R3689J00707J08445J16333
58878C547681J24377J33070J42618J52866J63852J75831J88858K02847K17963
58869E049963K34493K52419K71614K92284L14689L38570L63360L88988M15868
58860G922248M44044M72847N01464N29402N56184N80914O02319O18920O29170
58851A2857512O31613O25061O08447N80586N40395M87387M21894L44983K58542
$$ y = [1446461, 1462298, 1478607, 1495377, 1512716, 1530824, 1549958, 1570308, 1591869, 1614509, 1638171, 1662959, 1689084, 1716845, 1746658, 1778940, 1813825, 1850975, 1889766, 1929749, 1970887, 2013294, 2056846, 2101268, 2146587, 2193184, 2241288, 2290648, 2340901, 2392015, 2444203, 2497733, 2553157, 2611454, 2673446, 2739198, 2808402, 2881259, 2958527, 3040828, 3128507, 3222196, 3322903, 3431348, 3547681, 3672058, 3805128, 3947746, 4100612, 4264464, 4440295, 4629153, 4832000, 5049963, 5284456, 5536875, 5808489, 6100773, 6415462, 6754032, 7117392, 7506380, 7922248, 8366292, 8839139, 9340603, 9870005, 10426189, 11007103, 11609422, 12228342, 12857512, 13489125, 14114186, 14722633, 15303219, 15843614, 16331001, 16752895, 17097878, 17356420]
58842A7356420J65385O8942k7357j20564k08341k88877l60570m21854m71678n10215
58832A5181291n38618n57786n67921n69590n64540n54752n41108n23678n02978
58823A0260320m80240m56523m32276m07828l83653l60164l37656l16433k96593
58814F788954k77857k60026k43366k28063k13561j99194j85201j72337j60533
58805D848816j48841j36810j25101j14462j04797r5542q6452p7651o9297o1495
58795C828368n4247m7276m0153l2772k5414j8288j1276m193L006J0336J7835K5431
58783C651357L2986M0442M7729N4692O1388O8315P5977Q4329R3009J01936J11258
58772D423418J20937J30881J41401J53067J66116J80481J96167K13101K30807
$$ y = [17356420, 17521805, 17590747, 17563390, 17442826, 17234485, 16945608, 16585038, 16163184, 15691506, 15181291, 14642673, 14084887, 13516966, 12947376, 12382836, 11828084, 11286976, 10763298, 10260320, 9780080, 9323557, 8891281, 8483453, 8099800, 7739636, 7401980, 7085547, 6788954, 6511097, 6251071, 6007705, 5779642, 5566081, 5366887, 5181686, 5009349, 4848816, 4699975, 4563165, 4438064, 4323602, 4218805, 4123263, 4036811, 3959160, 3889863, 3828368, 3774121, 3726845, 3686692, 3653920, 3628506, 3610218, 3598942, 3594749, 3597755, 3608091, 3625926, 3651357, 3684343, 3724785, 3772514, 3827206, 3888594, 3956909, 4032886, 4117215, 4210224, 4312160, 4423418, 4544355, 4675236, 4816637, 4969704, 5135820, 5316301, 5512468, 5725569, 5956376]
58763E956376K48902K67866K88691L11771L36646L62832L90154M18252M46441
58754I027931M74274N01664N28141N52430N72970N88443N97680N99346N91915
58745A4034794N73731N43221M99494M42793L74216K95254K07998J15441K0816
58736A7107758p3257j64494k50208l27709l95340m52349m97989n31836n54984
58727A3859592n69749n77727n79118n74177n64261n50893n34719n16037m95548
58718H897363m73817m50658m25926m00582l76185l53549l32389l12101k92423
58709E479733k73471k55546k38820k23056k07928j93667j80892j69610j58981
58700C577762j48335j37923j28218j19098j10261j01976r4709q8314q2158p5923
$$ y = [5956376, 6205278, 6473144, 6761835, 7073606, 7410252, 7773084, 8163238, 8581490, 9027931, 9502205, 10003869, 10532010, 11084440, 11657410, 12245853, 12843533, 13442879, 14034794, 14608525, 15151746, 15651240, 16094033, 16468249, 16763503, 16971501, 17086942, 17107758, 17034501, 16870007, 16619799, 16292090, 15896750, 15444401, 14946412, 14414576, 13859592, 13289843, 12712116, 12132998, 11558821, 10994560, 10443667, 9908948, 9392911, 8897363, 8423546, 7972888, 7546962, 7146380, 6770195, 6416646, 6084257, 5772156, 5479733, 5206262, 4950716, 4711896, 4488840, 4280912, 4087245, 3906353, 3736743, 3577762, 3429427, 3291504, 3163286, 3044188, 2933927, 2831951, 2737242, 2648928, 2566770, 2490847]
58690B490847o9824o4216n9362n5407n2139m8987m5609m2239l9214l6480l3967
58679A943403l2079l1108l0454k9052k6678k4262k2746k2169k2008k2033k2445
58668A658369k3297k4170k4582k4584k4716k5251k5784k5830k5671k6020k6877
58657A381587k7330k6858k6237k6526k7475k7641k6090k3457k1113j9794j9206
58646A109860j8672j7739j6363j4870j3770j3353j3355j3135j2266j0881r472
58635I55984q483q101q105p843o730m990l596l117l029k683k524l474n309o684
58621H81316o933o768o844o737o049n525o035p034p101n794m018k814k540l039
58607H04085l779l929l047j679o54m2N93J181J349J402K137L551M656M858M769
$$ y = [2490847, 2421023, 2356807, 2297445, 2242038, 2189899, 2140912, 2095303, 2053064, 2013850, 1977370, 1943403, 1911324, 1880216, 1849762, 1820710, 1794032, 1769770, 1747024, 1724855, 1702847, 1680814, 1658369, 1635072, 1610902, 1586320, 1561736, 1537020, 1511769, 1485985, 1460155, 1434484, 1408464, 1381587, 1354257, 1327399, 1301162, 1274636, 1247161, 1219520, 1193430, 1169973, 1148860, 1129066, 1109860, 1091188, 1073449, 1057086, 1042216, 1028446, 1015093, 1001738, 988603, 976337, 965456, 955984, 947501, 939400, 931295, 923452, 916722, 911732, 908136, 905019, 901990, 899307, 896783, 893309, 888000, 881316, 874383, 867615, 860771, 854034, 847985, 842460, 836425, 829391, 822290, 816496, 812478, 809664, 807124, 804085, 800306, 796377, 793330, 791651, 790997, 790955, 791548, 792729, 794078, 795480, 797617, 801168, 805824, 810682, 815451]
58592H15451N348O729Q219R124R419R777J0947J2900J4829J6179J7320J8854K0785
58579I75881K2841K5094K7518K9526L0797L2117L4557L8097M1918M5708M9771
58568A353825N4206N8941O4262P0424P7058Q3829R1271R9892J09043J17816J26566
58557B307133J36127J46061J55165J63307J70971J77297J80433J79770J75888
58548C792152J68226J55043J36039J12993Q7216N8551K7653k910l1132n7306q1923
58537D364602j03517j20172j31891j39932j44812j46496j45702j43536j40334
58528C148210j35984j30806j25131j18621j11037j03101r5706q8836q2032p5286
58518B081670o8738o2237n5954n0715m7020m4441m2544m1472m0978m0032l8294
$$ y = [815451, 820799, 827528, 835747, 844871, 854290, 864067, 875014, 887914, 902743, 918922, 936242, 955096, 975881, 998722, 1023816, 1051334, 1080860, 1111657, 1143774, 1178331, 1216428, 1258346, 1304054, 1353825, 1408031, 1466972, 1531234, 1601658, 1678716, 1762545, 1853816, 1953708, 2062751, 2180567, 2307133, 2443260, 2589321, 2744486, 2907793, 3078764, 3256061, 3436494, 3616264, 3792152, 3960378, 4115421, 4251460, 4364453, 4451669, 4510220, 4537873, 4534963, 4503831, 4446525, 4364602, 4261085, 4140913, 4009022, 3869090, 3724278, 3577782, 3432080, 3288544, 3148210, 3012226, 2881420, 2756289, 2637668, 2526631, 2423530, 2327824, 2238988, 2156956, 2081670, 2012932, 1950695, 1894741, 1844026, 1797006, 1752565, 1710021, 1668549, 1627571, 1587539, 1549245]
58507A549245l6847l6493l6383l5448l4136l3447l3151l2357l1127l0150k9388
58496A180318k8340k7139k6138k4908k2880k0609j9177j8565j7723j6094j4097
58485I44648j2343j1192j0708j0348r190p245n929o316p524p937p378o930p057
58472H34551p127o631n778m965m550m902n972p030p509p756q352r160r721r995
58458G35103j0032r613q929q830r494r730q632p122o660p159p420p005o333n463
58444F22681m207l109k957l480l689l237k471j532n32j97j087k405k879k562k581
58429E85756l282l822l554k683j655p25j61jJ90O87J113J245J597K372K644J726
58413E81447O33P86J898K552K420K420K961L501L738L849L643K767J721J469J983
$$ y = [1549245, 1512398, 1475905, 1439522, 1404074, 1369938, 1336491, 1303340, 1270983, 1239856, 1209706, 1180318, 1151978, 1124839, 1098701, 1073793, 1050913, 1030304, 1011127, 992562, 974839, 958745, 944648, 932305, 921113, 910405, 900057, 890867, 883622, 877693, 871377, 863853, 855916, 848538, 841608, 834551, 827424, 820793, 815015, 810050, 805500, 800598, 794626, 787596, 780087, 772331, 763979, 754819, 745098, 735103, 725071, 715458, 706529, 697699, 688205, 678475, 669843, 662721, 656061, 648902, 641482, 634477, 628144, 622681, 618474, 615365, 612408, 608928, 605239, 602002, 599531, 597999, 597467, 597270, 596183, 593778, 590899, 588337, 585756, 582474, 578652, 575098, 572415, 570760, 570035, 569874, 569873, 570063, 570750, 571863, 573108, 574705, 577077, 579721, 581447, 582080, 582866, 584764, 587316, 589736, 592156, 595117, 598618, 602356, 606205, 609848, 612615, 614336, 615805, 617788]
58398F17788K207J458r8k059l989n201n358n070n082n320n554o211p464q283p732
58383E54032o546o036o092n756n133n031n261m937m160l674l194j910l55L6q04
58368D95179j470j234o42k7Q45J636J626J216J605K835L710L770L766M011L922
58353E20748L539L880N282O709P182O817O187N640N444N604N543M779L715K881
58339E93950J957P19J73J154K495K333Q24l54p35j282k126k300j725j394j460
58324E92229j130n52p43j445j166K65J273J122R58J645K463K691K842L528M450
58309F08430N097N329N022M270L939M600N220M429K832K208K687K799K119J718
58295F60699J886J770J418J900L030L246K212J400J609K057K323L004L935L949
$$ y = [617788, 619995, 621453, 621355, 619296, 615307, 610106, 604748, 599678, 594596, 589276, 583722, 577511, 570047, 561764, 554032, 547486, 541450, 535358, 529602, 524469, 519438, 514177, 509240, 505080, 501406, 498212, 496302, 495947, 495983, 495179, 493709, 492475, 491833, 491806, 492651, 494287, 495913, 497129, 498734, 501569, 505279, 509049, 512815, 516826, 520748, 524287, 528167, 533449, 540158, 547340, 554157, 560344, 565984, 571428, 577032, 582575, 587354, 591069, 593950, 595907, 596626, 596799, 597953, 600448, 602781, 603605, 603251, 602516, 601234, 599108, 596808, 595083, 593689, 592229, 591099, 590547, 589804, 588359, 587193, 587458, 588731, 589853, 590811, 592456, 594919, 597610, 600452, 603980, 608430, 613527, 618856, 623878, 628148, 632087, 636687, 641907, 646336, 649168, 651376, 654063, 656862, 658981, 660699, 662585, 664355, 665773, 667673, 670703, 673949, 676161, 677561, 679170, 681227, 683550, 686554, 690489, 694438]
58281F94438L030K626L266L853L767L606L514K992K663L917O290P606P249O887
58267G55704P434P858P655P947R144R979R744R332R223Q833Q472R439J1362J2011
58253H84137J0682R242Q932Q780Q106P962Q891R821J0260J1133J2425J2623J1593
58240A014587J1303J2613J3969J4431J5213J6985J8383J8557J8566J9034J9097
58229A192738J8772J9547K1403K2223K1397K1106K2656K4597K5782K7159K9097
58218A446477L0090K9688K9610L0553L1013L0673L1462L3898L5920L6907L9007
58207A805298M2895M6109M7543M9531N3421N7163N9498O2379O6831P0568P2363
58196B433599P4645P9076Q3669Q6923R0677R6019J00749J03765J07636J13814
$$ y = [694438, 697468, 700094, 703360, 707213, 710980, 714586, 718100, 721092, 723755, 727672, 733962, 741568, 748817, 755704, 763138, 770996, 778651, 786598, 795742, 805721, 815465, 824797, 834020, 842853, 851325, 860764, 872126, 884137, 894819, 904061, 912993, 921773, 929879, 937841, 946732, 956553, 966813, 977946, 990371, 1002994, 1014587, 1025890, 1038503, 1052472, 1066903, 1082116, 1099101, 1117484, 1136041, 1154607, 1173641, 1192738, 1211510, 1231057, 1252460, 1274683, 1296080, 1317186, 1339842, 1364439, 1390221, 1417380, 1446477, 1476567, 1506255, 1535865, 1566418, 1597431, 1628104, 1659566, 1693464, 1729384, 1766291, 1805298, 1848193, 1894302, 1941845, 1991376, 2044797, 2101960, 2161458, 2223837, 2290668, 2361236, 2433599, 2508244, 2587320, 2670989, 2757912, 2848589, 2944608, 3045357, 3149122, 3256758, 3370572]
58186C370572J19799J24113J29383J37274J45168J51324J58296J67604J76249
58177D679782J82512J89949K01373K14065K25451K38175K54868K73196K90946
58168F750317L10689L34449L59237L82895M08606M38509M68951M97426N27859
58159A0478938N63380O00841O38414O81211P32701P88480Q45796R11110R90252
58150A7231123J079665J176037J285835J416053J565096J733407J934224K183320
58142B9604760K487015K849161L277541L773856M333801M968656N703604O533311
58134F3531705P401310Q252807R095184R988360J1003852J2207500J3593278J4910969
58126A49984965J5574062J4902624J2591197Q940013M607215J89154l933379p471242
$$ y = [3370572, 3490371, 3614484, 3743867, 3881141, 4026309, 4177633, 4335929, 4503533, 4679782, 4862294, 5052243, 5253616, 5467681, 5693132, 5931307, 6186175, 6459371, 6750317, 7061006, 7395455, 7754692, 8137587, 8546193, 8984702, 9453653, 9951079, 10478938, 11042318, 11643159, 12281573, 12962784, 13695485, 14483965, 15329761, 16240871, 17231123, 18310788, 19486825, 20772660, 22188713, 23753809, 25487216, 27421440, 29604760, 32091775, 34940936, 38218477, 41992333, 46326134, 51294790, 56998394, 63531705, 70933015, 79185822, 88281006, 98269366, 109273218, 121480718, 135073996, 149984965, 165559027, 180461651, 193052848, 201992861, 206600076, 206789230, 202855851, 195384609]
58118A95384609j0146553j1795258j2470802j2390675j1808504j0949714j0004445
58111A15818658r108910q324023p653510p082216o590096o147217n718595n275342
58103E9918749m796417m269873l702829l124029k566776k050037j576580j143955
58095C6688253p59737m57775k98174l31841n52306q87579j242951j546468j759891
58086B8851531j871233j892167j850720j770623j659435j520994j369936j225215
58078A5691208j096782r87006q98439q31130p77737p30107o87176o49915o13420
58069H419496n71421n24800m78863m35548l94404l57498l26891l00182k74280
58060D755609k50732k32172k16757k01316j86795j75394j65510j54830j45319
$$ y = [195384609, 185238056, 173442798, 160971996, 148581321, 136772817, 125823103, 115818658, 106709748, 98385725, 90732215, 83649999, 77059903, 70912686, 65194091, 59918749, 55122332, 50852459, 47149630, 44025601, 41458825, 39408788, 37832208, 36688253, 35928516, 35470741, 35172567, 34840726, 34288420, 33400841, 32157890, 30611422, 28851531, 26980298, 25088131, 23237411, 21466788, 19807353, 18286359, 16916423, 15691208, 14594426, 13607420, 12708981, 11877851, 11100114, 10370007, 9682831, 9032916, 8419496, 7848075, 7323275, 6844412, 6408864, 6014460, 5656962, 5330071, 5029889, 4755609, 4504877, 4272705, 4055948, 3854632, 3667837, 3492443, 3326933, 3172103, 3026784]
58051C026784j39708j35840j29903j22675j17116j12191j04685r5398q8057q3268
58041A897943p8425p2599o7161o2431n7744n3877n1813n0204m7287m3983m1974
58030A270445m0441l7878l5206l3798l2428k9626k6964k6419k6455k4626k2061
58019I34543k1366k1831k0897j8882j8030j8122j7169j5440j4710j4391j2513
58008G41192r882r203j0431j0862r682q770q954q942q201p740p825p599p132p262
57994F18707p524o697n250m788n328n480n016m918n188m965m424m374m402l618
57980E46735k675k817l523l404k686k524k551j626l36j86q42p43Lq5j110j790
57964E19840j845k036k286k056k015k921l595k588j141j598l471m209l426l129
$$ y = [3026784, 2887076, 2751236, 2621333, 2498658, 2381542, 2269351, 2164666, 2069268, 1981211, 1897943, 1819518, 1746919, 1679758, 1617327, 1559583, 1505706, 1453893, 1403689, 1356402, 1312419, 1270445, 1230004, 1192126, 1156920, 1123122, 1090694, 1061068, 1034104, 1007685, 981230, 956604, 934543, 913177, 891346, 870449, 851567, 833537, 815415, 798246, 782806, 768096, 753705, 741192, 731310, 722107, 711676, 700814, 691132, 682362, 673408, 664466, 656265, 648525, 640700, 633101, 625969, 618707, 611183, 604486, 599236, 594448, 589120, 583640, 578624, 573706, 568518, 563553, 559129, 554755, 550353, 546735, 544060, 541243, 537720, 534316, 531630, 529106, 526555, 524929, 524593, 524407, 523565, 522822, 522825, 522740, 521630, 519840, 517995, 515959, 513673, 511617, 509602, 506681, 503086, 500498, 499357, 497759, 494288, 490079, 486653, 483524]
57950D83524l848l931k997k851m209n478n598n467n658n249l901k819k628k370
57936D26520j497r47j330j829j798j733j972j976j611j566j957j980j442j148
57922D03734j263r64r9L59J06J96J326K720L377L178K368J144P7j89Nk82j069
57905D14724j504j448j671k389k939k957k642j942q73l75j306k799l270k826k788
57890C82995l117k471r62l96j330k101j534n38k24k80j98l12o49l39Q00J553J142
57873C72039M18K75K52l82j339k113k871l671l891l302k677k562k436j858j338
57858C44544j308j206m76L47N06J84J17N58J262J907K141J829J469J690K220K211
57842C57995J629J278J337J090L43j98k53m70j117j612j762k232l230l989m070
$$ y = [483524, 479676, 475745, 472748, 469897, 465688, 460210, 454612, 449145, 443487, 438238, 434337, 431518, 428890, 426520, 425023, 424076, 422746, 420917, 419119, 417386, 415414, 413438, 411827, 410261, 408304, 406324, 404882, 403734, 402471, 401507, 401408, 401767, 401873, 402069, 403395, 406115, 409492, 412670, 415038, 416182, 416259, 416070, 416075, 415793, 414724, 413220, 411772, 410101, 407712, 404773, 401816, 399174, 397232, 396359, 395984, 394678, 391879, 388609, 385783, 382995, 379878, 377407, 376445, 376049, 374719, 372618, 371084, 370546, 370322, 370042, 369844, 369532, 368883, 368544, 369344, 370897, 372039, 372457, 372732, 372984, 372602, 371263, 369150, 366279, 362608, 358717, 355415, 352738, 350176, 347740, 345882, 344544, 343236, 342030, 341554, 341901, 342407, 342591, 342708, 343266, 344528, 346435, 348576, 350405, 351874, 353564, 355784, 357995, 359624, 360902, 362239, 363329, 363672, 363474, 363221, 362751, 361634, 360022, 358260, 356028, 352798, 348809, 344739]
57827C44739l964l867l224k182k082l562n344n878n205m236l273k241j464j232
57813B96985j174r10n72j11R90K604L529L141K513K919M000M469L915K882J762
57798C26942P38L01P13J229Q57k57j053j021p01q29j634k899m172m898m753l961
57782C04602l080k623k845l552m064l802l067k745l178l788l982l833l685l639
57768B56719l669l770l814l703l712m139m638m546l870l340l424l964m676n292
57754B00162n342m645l910l874m025l259j741p71p74q88p12q70j408j282j27R16
57738A67450J082J314K595M204M817M409L846L402K883K613L026L696L812L406
57724B12555L153L216L126K679K169J817J485R71K81l34n41l40k56p22j334j436
$$ y = [344739, 340775, 336908, 333684, 331502, 329420, 325858, 320514, 314636, 309431, 305195, 301922, 299681, 298217, 296985, 295811, 294901, 294329, 294218, 295208, 297812, 301341, 304482, 306995, 309914, 313914, 318383, 322298, 325180, 326942, 327680, 327981, 328694, 329923, 330780, 330523, 329470, 328449, 327748, 326919, 325285, 322386, 318214, 313316, 308563, 304602, 301522, 298899, 296054, 292502, 288438, 284636, 281569, 278824, 275646, 271858, 267876, 264043, 260358, 256719, 253050, 249280, 245466, 241763, 238051, 233912, 229274, 224728, 220858, 217518, 214094, 210130, 205454, 200162, 194820, 190175, 186265, 182391, 178366, 175107, 173366, 172595, 171821, 170933, 170221, 169351, 167943, 166661, 166534, 167450, 168532, 169846, 172441, 176645, 181462, 185871, 189717, 193119, 196002, 198615, 201641, 205337, 209149, 212555, 215708, 218924, 222050, 224729, 226898, 228715, 230200, 231171, 231452, 231118, 230577, 230237, 229981, 229259, 227925, 226489]
57708B26489j280j628k253j946l63J314K028K033J920J573Q41L30N81J260J865
57693B32764K562L567M364M412M046L969M248M420M183L521K574J762J570J978
57679B79940K563L207M022M656M647M401M653M995M410L378L656N466O833O569
57665C43396O048O839Q332R242R866J1101J2435J2798J2611J3160J4548J5825
57653D76201J6665J7490J8388J9235K0425K2237K4018K5166K6302K8278L0727
57642G25132L2966L5516L9172M3201M6246M8656N2145N7348O3336O9464P6062
57631A289244Q3245R0497R7712J05345J13396J21296J28843J36181J42841J47942
57621B456542J51186J52534J50954J44911J34173J19949J03215Q4207O3686M3328
$$ y = [226489, 225209, 223581, 221328, 219382, 219019, 220333, 222361, 224394, 226314, 227887, 228728, 229058, 229639, 230899, 232764, 235326, 238893, 243257, 247669, 251715, 255684, 259932, 264352, 268535, 272056, 274630, 276392, 277962, 279940, 282503, 285710, 289732, 294388, 299035, 303436, 308089, 313084, 317494, 320872, 324528, 329994, 336827, 343396, 349444, 356283, 364615, 373857, 383723, 394824, 407259, 420057, 432668, 445828, 460376, 476201, 492866, 510356, 528744, 547979, 568404, 590641, 614659, 639825, 666127, 694405, 725132, 758098, 793614, 832786, 875987, 922233, 970889, 1023034, 1080382, 1143718, 1213182, 1289244, 1372489, 1462986, 1560698, 1666043, 1779439, 1900735, 2029578, 2165759, 2308600, 2456542, 2607728, 2760262, 2911216, 3056127, 3190300, 3310249, 3413464, 3497671, 3561357, 3604685]
57611C604685K4387P041q649k2284l4209m6018n9302p4277q9928j04692j16847
57600C079907j24957j28628j28603j25926j21363j15490j08845j01784r4526q7253
57590A942532p9841p1851o3251n4787m7147m0126l3226k6598k0600j4882q789
57579A481434k364L950J0238J6909K3820L0559L7268M4312N1496N8517O5755P3574
57567A895468Q1304Q8033R4054J00208J06117J10425J12582J12880J10880J05335
57557B917286R5873Q3287O7942M9435K8187O004j5513l5933n4976p1721q5513
57546B984358r6580j05170j11009j14128j15380j15493j14431j12158j09209j05996
57536A884804j02243r7687r2671q7552q2111p6073o9758o3826n8693n4382n0531
$$ y = [3604685, 3629072, 3636113, 3627464, 3605180, 3570971, 3524953, 3465651, 3391374, 3301446, 3196754, 3079907, 2954950, 2826322, 2697719, 2571793, 2450430, 2334940, 2226095, 2124311, 2029785, 1942532, 1862691, 1790840, 1727589, 1672802, 1625655, 1585529, 1552303, 1525705, 1505105, 1490223, 1481434, 1479070, 1483020, 1493258, 1510167, 1533987, 1564546, 1601814, 1646126, 1697622, 1756139, 1821894, 1895468, 1976772, 2064805, 2158859, 2259067, 2365184, 2475609, 2588191, 2701071, 2811951, 2917286, 3013159, 3096446, 3164388, 3213823, 3242010, 3248014, 3232501, 3196568, 3141592, 3069871, 2984358, 2887778, 2782608, 2671599, 2557471, 2442091, 2326598, 2212167, 2100009, 1990800, 1884804, 1782561, 1684874, 1592203, 1504651, 1422540, 1346467, 1276709, 1212883, 1154190, 1099808, 1049277]
57525A049277m6562m2295l8305l5135l2382k9342k6302k4138k2689k0733j7776
57514G13618j4824j2976j2221j1872j1376j0362q744p063n916m952l347j325q3
57501F08557R6M23J911M143O186P725Q711R052R208J0237J2403J4663J6135J7328
57487G26778J9154K1530K3770K5804K8132L0948L4028L7260M0798M4801M9333
57476A082336N4227N9084O3732O8570P3868P8937Q2839Q5758Q8572R1074R1920
57465A920917R0499Q7490Q3038P5860O4975N1078L5434J8523Q34j6050l0533m2573
57453B339492n3162o2685p0659p6648q0526q2241q2125q1086p9768p7848p4739
57442A518005p0644o6275o1980n7694n3342m8759m3614l8011l2702k8224k4240
$$ y = [1049277, 1002715, 960420, 922115, 886980, 854598, 825256, 798954, 774816, 752127, 731394, 713618, 698794, 685818, 673597, 661725, 650349, 639987, 631243, 624180, 618264, 613312, 609965, 608640, 608557, 608653, 609076, 610987, 615130, 621316, 629041, 637752, 646804, 656012, 666249, 678652, 693315, 709450, 726778, 745932, 767462, 791232, 817036, 845168, 876116, 910144, 947404, 988202, 1033003, 1082336, 1136563, 1195647, 1259379, 1327949, 1401817, 1480754, 1563593, 1649351, 1737923, 1828997, 1920917, 2011416, 2098906, 2181944, 2257804, 2322779, 2373857, 2409291, 2427814, 2428648, 2412598, 2382065, 2339492, 2286330, 2223645, 2152986, 2076338, 1995812, 1913571, 1831446, 1750360, 1670592, 1592744, 1518005, 1447361, 1381086, 1319106, 1261412, 1208070, 1159311, 1115697, 1077686, 1044984, 1016760, 992520]
57431I92520k0202j6155j2356q615m629n54L245O670R720J2306J4704J7674K1656
57418A015984K6271L0979L5705M0517M5259M9908N4698N9537O3959O7982P2151
57407A562950P6336P9323Q0090P8660P5217O9368O0924N0380L7922K2962N613
57396B199745j2321k8755m3075n5596o6245p4831q1792q7467r1271r2619r2046
57385A473727r0421q7800q4244q0796p8246p5620p1506o6367o1833n8096n3847
57374F64951m8789m4256m1025l8199l4946l1866k9785k8276k6389k4075k2030
57363B95315k0582j9413j8172j6805j5452j4258j3221j2158j1022j0176j0050
57352A34006j0492j0787j0333r181p918p201p186p253o619n358m376m209m375
$$ y = [992520, 972318, 956163, 943807, 935192, 930563, 930009, 933254, 939924, 949644, 961950, 976654, 994328, 1015984, 1042255, 1073234, 1108939, 1149456, 1194715, 1244623, 1299321, 1358858, 1422817, 1490799, 1562950, 1639286, 1718609, 1798699, 1877359, 1952576, 2021944, 2082868, 2133248, 2171170, 2194132, 2199745, 2187424, 2158669, 2115594, 2059998, 1993753, 1918922, 1837130, 1749663, 1658392, 1565773, 1473727, 1383306, 1295506, 1211262, 1130466, 1052220, 976600, 905094, 838727, 776894, 718798, 664951, 616162, 571906, 530881, 492682, 457736, 425870, 396085, 367809, 341420, 317345, 295315, 274733, 255320, 237148, 220343, 204891, 190633, 177412, 165254, 154232, 144056, 134006, 123514, 112727, 102394, 93213, 85295, 78094, 70908, 63655, 57036, 51678, 47302, 43093, 38718]
57339C8718m255m002m050m298m394m317m164l881A701b301m818n059m177l077
57325a9432k832l163l218l131l525m028l704k736k272k646l016k839k483k284
57311f1309k110j993k204k509k343j857j883k638l374l498l234k917k439j731
57297i6039j138r79j231j707k127k071j390n96k11KM93R06N37l84q66o52n15r37
57279a08905j396j229m79K83M60l47j886l126l202k468j951j966k051k001k009
57264a32273j916j344n10K8L31Q31J299J193R37J552K948L881L746L212K892K675
57248a10518K638L272M363M905M589M254M411M580M573N145O688Q408R539J0355
57234c2798J1197i926A643J1617J2473J3849J5292J6893J8463J9106J8596J8187
$$ y = [38718, 34463, 30461, 26411, 22113, 17719, 13402, 9238, 5357, 1701, -2301, -7119, -12178, -16355, -19432, -22264, -25427, -28645, -31776, -35301, -39329, -43033, -45769, -48041, -50687, -53703, -56542, -59025, -61309, -63419, -65412, -67616, -70125, -72468, -74325, -76208, -78846, -82220, -85718, -88952, -91869, -94308, -96039, -97177, -98156, -99387, -101094, -103221, -105292, -106682, -107278, -107489, -107487, -106994, -106088, -105551, -105935, -106801, -107453, -107968, -108905, -110301, -111530, -112009, -111726, -111266, -111613, -113499, -116625, -119827, -122295, -124246, -126212, -128263, -130264, -132273, -134189, -135533, -136043, -136015, -135684, -134853, -133554, -132361, -131424, -129872, -126924, -123043, -119297, -116085, -113193, -110518, -107880, -104608, -100245, -95340, -90751, -86497, -82086, -77506, -72933, -67788, -61100, -52692, -43153, -32798, -21601, -9926, 1643, 13260, 25733, 39582, 54874, 71767, 90230, 109336, 127932, 146119]
57222A46119J8929K0012J9912J8487J6702J4912J2644R752O573L191m26l785o393
57209B76629q711j1557j4680j6901j7745j8009j8502j9068j9154j8752j8377j8349
57197G6824j8441j8094j7028G644f857j3778j2879j1534j0271r705r692r653r371
57184i3740r044q758q409q004p652p314o920o585o432o291n818m910l853l090
57170a86820k843k825k521j921j719k381l229l193k277j508j409j362p06L74J387
57155b12953K260L202M450O395R247J2298J4284J4911J5286J6404J7881J8693
57143g7642J8522J7797J7008g875H352J6164J5843J5319J5045J5057J4863J4416
57131A15059J4423J5281J6380J6912J6692J5924J4842J3990J4071J5021J5926
$$ y = [146119, 165048, 185060, 204972, 223459, 240161, 255073, 267717, 277469, 284042, 287233, 286807, 283022, 276629, 267918, 256361, 241681, 224780, 207035, 189026, 170524, 151456, 132302, 113550, 95173, 76824, 58383, 40289, 23261, 7644, -6857, -20635, -33514, -45048, -55319, -65024, -74716, -84369, -93740, -102784, -111542, -119951, -127955, -135607, -142921, -149841, -156426, -162858, -169149, -174967, -179877, -183730, -186820, -189663, -192488, -195009, -196930, -198649, -201030, -204259, -207452, -209729, -211237, -212646, -214008, -214714, -214340, -212953, -210693, -207491, -203041, -196646, -187399, -175101, -160817, -145906, -130620, -114216, -96335, -77642, -59120, -41323, -24315, -7875, 8352, 24516, 40359, 55678, 70723, 85780, 100643, 115059, 129482, 144763, 161143, 178055, 194747, 210671, 225513, 239503, 253574, 268595, 284521]
57120B84521J6209J6113J5758J4766J3378J2805J3614J4692J4700J3834J3200
57109D43590J3133J3067J2491J1245R315P107N381M273K904N79k292n054p798
57096E07941j0763j3538j5761j7977k0991k4863k9206l3886l8779m3559m8403
57085B10215n4101o0875B7271d7785q3060r2584j02787j12723j22801j33791j45417
57074h40948j57166j69532j83086j97253k11464k26651k44034k63173k82876l03404
57064c079587l26118l51396l78579m07769m40176m76880n18386n65107o17199
57055g161197o74514p37808q09269q90661r82029j083674j198333j329653j479751
57046a6346889j650576j846668k074205k338358k644590l002049l422746l918837
$$ y = [284521, 300730, 316843, 332601, 347367, 360745, 373550, 387164, 401856, 416556, 430390, 443590, 456723, 469790, 482281, 493526, 502841, 509948, 515329, 519602, 522506, 523085, 520793, 515739, 507941, 497178, 483640, 467879, 449902, 428911, 404048, 374842, 340956, 302177, 258618, 210215, 156114, 95239, 27271, -47785, -130845, -223429, -326216, -438939, -561740, -695531, -840948, -998114, -1167646, -1350732, -1547985, -1759449, -1986100, -2230134, -2493307, -2776183, -3079587, -3405705, -3757101, -4135680, -4543449, -4983625, -5460505, -5978891, -6543998, -7161197, -7835711, -8573519, -9382788, -10273449, -11255478, -12339152, -13537485, -14867138, -16346889, -17997465, -19844133, -21918338, -24256696, -26901286, -29903335, -33326081, -37244918]
57038c7244918m506166n210231o058303p053795q157300r303726j0450240j1608485
57030i9593164j2817317j4068499j5255742j6208251j6790070j6976608j6839411
57023b08549062j6459089j5845435j4921293j3568266j1700525r328547o575164
57016b96947381l625820o45374K270509N074389P713189J0103188J2150537J3784509
57008b50122254J4972134J5713539J6031311J5961179J5546948J4843261J3924378
57001a43129504J2889326J1853137J0921576J0157464R557375R058195Q574057
56994g0118374Q038909P427181O748989O035725N327069M658842M052780L515068
56986b4313811L043853K635998K287195J990256J736864J520250J335053J176142
$$ y = [-37244918, -41751084, -46961315, -53019618, -60073413, -68230713, -77534439, -87984679, -99593164, -112410481, -126478980, -141734722, -157942973, -174733043, -191709651, -208549062, -225008151, -240853586, -255774879, -269343145, -281043670, -290372217, -296947381, -300573201, -301218575, -298948066, -293873677, -286160488, -276057300, -263906763, -250122254, -235150120, -219436581, -203405270, -187444091, -171897143, -157053882, -143129504, -130240178, -118387041, -107465465, -97308001, -87750626, -78692431, -70118374, -62079465, -54652284, -47903295, -41867570, -36540501, -31881659, -27828879, -24313811, -21269958, -18633960, -16346765, -14356509, -12619645, -11099395, -9764342, -8588200]
56978h588200J039067R20621Q18015P28407O49870N81625N22618M71030M25638
56969b431309L86234L52040L21055K91835K64754K40714K19690a53863C0708J69228
56959A99936J53899J38408J23891J11035R9087Q7276P5945O5352N4608M2999L1258
56948A183694K0239R225k852j5026k4622k9765l0288k6430j8282p183L395R384
56936A071489Q613J740q813k0497l1362l9911m5137m7235m7717m8058m8234m7253
56924F97625m4955m2292l9787l6945l3644l0964k9817k9529k8728k7052k5145
56913C28767k3391k1546j9431j7148j4732j2177r661p245m607j641Q77K002J862
56900B01929J615K197L578N191O456O812N878L839J383r32l059n147p069q438
$$ y = [-8588200, -7549133, -6628512, -5810497, -5082090, -4432220, -3850595, -3327977, -2856947, -2431309, -2045075, -1693035, -1371980, -1080145, -815391, -574677, -354987, -153863, 30708, 199936, 353835, 492243, 616134, 727169, 826256, 913532, 989477, 1054829, 1109437, 1152436, 1183694, 1203933, 1213158, 1210306, 1195280, 1170658, 1140893, 1110605, 1084175, 1065893, 1058710, 1062105, 1071489, 1080102, 1081842, 1073029, 1052532, 1021170, 981259, 936122, 888887, 841170, 793112, 744878, 697625, 652670, 610378, 570591, 533646, 500002, 469038, 439221, 409692, 380964, 353912, 328767, 305376, 283830, 264399, 247251, 232519, 220342, 210681, 203436, 198829, 197188, 198065, 200067, 201929, 203544, 205741, 209319, 214510, 220966, 227778, 233656, 237495, 238878, 237946, 234887, 229740, 222671, 214233]
56886B14233q992q846q418p972p326o142m526l049k055j318n06L78J256K330L728
56871A62775N067N740N491M398K516m4k840n276p104q417r291r731r890r929r753
56856A13712r093p947o576n229m063l266k926k844k723k505k310k139j918j686
56842E8487j415q37J33R50J017O20O81J567K729L735M835O174P161P277P046P346
56826A07506Q042Q123P181N876M778L541J706k72j466j616j269r05n38j34J90
56811A40743N61J426K929M536N631O346P389R194J1491J3778J5859J7699J8961
56798B56543J8960J7177J3801R663N653K185q19l536n953p823q798q588p235n265
56784B75965l327j541N89L441O600R250J1206J3284J6418K0524K4381K6558K6384
$$ y = [214233, 205241, 196395, 187977, 180005, 172679, 166537, 162011, 158962, 156907, 155589, 155083, 155461, 156717, 159047, 162775, 167842, 173582, 179073, 183471, 185987, 185943, 183103, 177827, 170723, 162306, 153015, 143284, 133394, 123465, 113712, 104619, 96672, 90096, 84867, 80804, 77538, 74612, 71768, 69045, 66540, 64230, 62091, 60173, 58487, 57072, 56235, 56368, 57318, 58335, 58955, 59636, 61203, 63932, 67667, 72502, 78676, 85837, 93114, 100160, 107506, 115548, 123671, 130852, 136728, 141506, 145047, 146753, 146481, 145015, 143399, 142130, 141225, 140687, 140553, 140743, 141304, 142730, 145659, 150195, 155826, 162172, 169561, 178755, 190246, 204024, 219883, 237582, 256543, 275503, 292680, 306481, 316144, 321797, 323982, 323163, 319627, 313674, 305851, 297053, 288465, 281230, 275965, 272638, 271097, 271686, 275127, 281727, 290977, 302183, 315467, 331885, 352409, 376790, 403348, 429732]
56771D29732K4095K0292J5488J0008M076k141q320j3673j7087j7953j6857j5102
56759D12558j3505j1916r875p343m624j934O28K910M882O843R117J1563J3583
56746D12887J4509J3826J1223O851J552l610q159j2300j6099j8923j9968j9225
56734C62564j7516j5649j3782j1762r784q373p646o938n459l229j022O78K227
56721B64309M075N701N897M164J362j272l393n455p568r106r589r390r221r205
56707B21309q977q453p997p779p522p026o494o141n893n683n646n723n504m780
56693A27691l882l089k264j502j535k727m059m060k595r17jK17O4l97q23n70L23
56676I9874Q90N20k07l86M4N02O63N82L59J24M4K5k59p68r66n41J66O54P20K34
$$ y = [429732, 453827, 474119, 489607, 499615, 503691, 501550, 493230, 479557, 462470, 444517, 427660, 412558, 399053, 387137, 377262, 369919, 365295, 363361, 363989, 366899, 371781, 378624, 387741, 399304, 412887, 427396, 441222, 452445, 459296, 460848, 457238, 449079, 436779, 420680, 401757, 381789, 362564, 345048, 329399, 315617, 303855, 294071, 285698, 278052, 271114, 265655, 262426, 261404, 262082, 264309, 268384, 274085, 279982, 284146, 285508, 284236, 280843, 275388, 267820, 258714, 249125, 239735, 230514, 221309, 212332, 203879, 195882, 188103, 180581, 173555, 167061, 160920, 155027, 149344, 143698, 137975, 132471, 127691, 123809, 120720, 118456, 116954, 115419, 112692, 108633, 104573, 101978, 101061, 101060, 101277, 101341, 100944, 100121, 99551, 99874, 100764, 101284, 101077, 100691, 100735, 101237, 101900, 102482, 102841, 102965, 103009, 103034, 102775, 102007, 101041, 100500, 100666, 101320, 102040, 102274]
56656A02274q15j831j908r84jN06J087K083K743K407J728J612J731J238L98K10
56640A12478P46J133J031R15Q96M70l84r70r44p33o16l42O5Pp86j724k125j939
56622A07178j431p11NK60j18o48q00o76q17j449k126k169j462p78r94j949k539
56605H8776k257j939k434l213l160k331j777j924k190k165k039j768r90JK59m50
56589F0399j203j198o61j05M48J035J350J316J372J690J755J263P23O23O54M52
56573F9913M38J148K118K340J670J001J120J888K592K670K110J441J305J787K291
56558I5832K243J768J403J414J592J593J263P69N71J042J923K412K000J079M87
56543A17391O23J212J751J990J945J705J321R36Q78J362K094K442K183J693J254
$$ y = [102274, 101459, 99628, 97720, 96736, 96735, 97241, 98328, 100411, 103154, 105561, 107289, 108901, 110632, 111870, 112268, 112478, 113224, 114357, 115388, 116303, 117199, 117669, 117285, 116315, 115371, 114638, 114022, 113680, 113745, 113752, 112966, 111242, 109117, 107178, 105747, 105036, 105041, 105301, 105183, 104535, 103735, 103059, 102242, 100793, 98667, 96498, 95036, 94258, 93264, 91315, 88776, 86519, 84580, 82146, 78933, 75773, 73442, 71665, 69741, 67551, 65386, 63347, 61579, 60589, 60590, 60849, 60399, 59196, 57998, 57337, 57232, 57680, 58715, 60065, 61381, 62753, 64443, 66198, 67461, 68184, 68807, 69461, 69913, 70351, 71499, 73617, 75957, 77627, 78628, 79748, 81636, 84228, 86898, 89008, 90449, 91754, 93541, 95832, 98075, 99843, 101246, 102660, 104252, 105845, 107108, 107877, 108448, 109490, 111413, 113825, 115825, 116904, 117391, 118014, 119226, 120977, 122967, 124912, 126617, 127938, 128874, 129752, 131114, 133208, 135650, 137833, 139526, 140780]
56528A40780N84n30j563j832j411q80m04K36Q83J040O53K31J47L61P19R50O45
56511A40609j19l42P40K294K710J794J033J501K564L035K715K298K438L304M458
56496A71032N009M447L398K848K761K371J764J865K683K932J890L86n83j080j416
56481B00307j319p29l08l77l14J45J30r12k009k118j812k242l108l148k168j188
56465A78830q06p17p78j338k317k947k742k054j480j220j106r06n50l19o20j328
56449A57602j722j397q46p39j047j259j110o90k29r3n21j088j047m48j28l21j92
56432A44725O21J124M70n71p56k02O5j73k46J21N20O72O90P57J180K321L776M257
56414A59351L145J588J096J658K238K491K789L056K933K790L223L816L643K898
$$ y = [140780, 141364, 140834, 139271, 137439, 136028, 135148, 134744, 134980, 135863, 136903, 137556, 137787, 137934, 138295, 139014, 139964, 140609, 140490, 140148, 140888, 143182, 145892, 147686, 148719, 150220, 152784, 155819, 158534, 160832, 163270, 166574, 171032, 176041, 180488, 183886, 186734, 189495, 191866, 193630, 195495, 198178, 201110, 203000, 203386, 202803, 201723, 200307, 198988, 198259, 197951, 197574, 197260, 197405, 197535, 196623, 194614, 192496, 190684, 188442, 185334, 182186, 180018, 178830, 178024, 177307, 176529, 175191, 172874, 169927, 167185, 165131, 163651, 162431, 161325, 160419, 159869, 159550, 158930, 157602, 155880, 154483, 153637, 152898, 151851, 150592, 149482, 148792, 148563, 148470, 147949, 146861, 145814, 145366, 145238, 144917, 144725, 145346, 146470, 146940, 146369, 145613, 145411, 145476, 145303, 145057, 145178, 145698, 146370, 147060, 147817, 148997, 151318, 155094, 159351, 162496, 164084, 165180, 166838, 169076, 171567, 174356, 177412, 180345, 183135, 186358, 190174, 193817, 196715]
56400A96715K717L387L957L755L134K639K400K508K998L348K888J799R16N95N99
56385B34355R25J712K400K124J040K44K38L97J29l63o98r01j122j434j930k482
56369B34634k543j946j549k180l233l361k449j675j739k214k729l435m140m178
56355A97263l524k925k656k177j338p87q14q49n58l98o06o26q7N13O42M39J53
56338A81665l36r16r57j93P11J038Q39N45L30K55M76R17J191J152J055J018R15
56321A89705Q38J077J486J586J334J128J060Q94Q12J214J825J961J760J978K510
56306B11168K331J279N36Q63J528J624J287R34L81m44q65m31L02P11J074J801
56290B24079K465K479K057J708J343P89N53J236K484L354L426L025K653K720L412
$$ y = [196715, 199432, 202819, 206776, 210531, 213665, 216304, 218704, 221212, 224210, 227558, 230446, 232245, 233161, 233756, 234355, 235280, 236992, 239392, 241516, 242556, 242800, 243038, 243435, 243564, 243201, 242503, 241602, 240480, 239046, 237116, 234634, 232091, 230145, 228596, 226416, 223183, 219822, 217373, 215698, 213959, 211745, 209016, 205581, 201441, 197263, 193739, 190814, 188158, 185981, 184643, 183856, 183042, 182193, 181635, 181237, 180631, 180005, 179918, 180431, 181073, 181512, 181665, 181329, 180413, 179456, 179263, 179974, 181012, 181851, 182396, 182726, 182981, 183457, 184374, 185565, 186717, 187772, 188790, 189705, 190543, 191620, 193106, 194692, 196026, 197154, 198214, 199108, 199920, 201134, 202959, 204920, 206680, 208658, 211168, 213499, 214778, 215314, 216177, 217705, 219329, 220616, 221550, 221931, 221487, 220622, 220191, 220493, 221204, 222278, 224079, 226544, 229023, 231080, 232788, 234131, 234920, 235473, 236709, 239193, 242547, 245973, 248998, 251651, 254371, 257783]
56275B57783M300M578M173M090N008O183O372N497M596M487N177O359P700Q715
56261C35018Q916Q254P204O439O415O952P205O551N527N281N920O183N076L198
56247D24139J966K010K800L402L167K133J107R73J728K608L183L719M358M823
56233D62116N125N724O598P121P240P799R203J0668J1515J2239J3497J4925J5907
56220E89677J6801J8325K0256K1836K3127K4904K7425L0169L2736L5237L7829
56209H78322M0580M3832M8084N3365N9149O4929P0648P6557Q2846Q9414R5940
56198A603666J02271J08683J15488J22472J29056J34808J39306J41825J41892
56189B739467J40026J36973J32284J24677J13897J01086Q7068P1443N3965L5656
$$ y = [257783, 262083, 266661, 270834, 274924, 279932, 286115, 292487, 297984, 302580, 307067, 312244, 318603, 326303, 335018, 343934, 352188, 359392, 365831, 372246, 379198, 386403, 392954, 398481, 403762, 409682, 415865, 420941, 424139, 426105, 428115, 430915, 434317, 437484, 439617, 440724, 441697, 443425, 446033, 449216, 452935, 457293, 462116, 467241, 472965, 479563, 486684, 493924, 501723, 510926, 521594, 533109, 545348, 558845, 573770, 589677, 606478, 624803, 645059, 666895, 690022, 714926, 742351, 772520, 805256, 840493, 878322, 918902, 962734, 1010818, 1064183, 1123332, 1188261, 1258909, 1335466, 1418312, 1507726, 1603666, 1705937, 1814620, 1930108, 2052580, 2181636, 2316444, 2455750, 2597575, 2739467, 2879493, 3016466, 3148750, 3273427, 3387324, 3488410, 3575478, 3646921, 3700886, 3736542]
56179C736542J7862J048j4776k9256m1992n3020o2397o9961p5877q0800q5002
56168C242371q8158r0294r2138r4048r5589r6555r7415r8215r8170r7042r5745
56157B199002r4769r3221r0406q7228q4874q2968q0325p6773p2969o9121o5053
56146A301295o1053n7426n3652m9135m4373m0391l7341l4737l2564l1041k9531
56135H30051k6979k3499k0456j8823j8102j7098j5208j2875j1005r970r165p807
56123F39064o081m845m221l368j891m49M54J209K163K916L271L787M740N483N632
56108F47864N849O563P006O494N725N685O078N932N120M233L581L203L226L440
56094G19999L223K627K669L824N223O130P058Q505R875J0846J2537J5859J9833
$$ y = [3736542, 3754404, 3755452, 3740676, 3711420, 3669428, 3616408, 3554011, 3484050, 3408173, 3327373, 3242371, 3154213, 3063919, 2971781, 2877733, 2782144, 2685589, 2588174, 2489959, 2391789, 2294747, 2199002, 2104233, 2011012, 1920606, 1833378, 1748504, 1665536, 1585211, 1508438, 1435469, 1366348, 1301295, 1240242, 1182816, 1129164, 1080029, 1035656, 995265, 957924, 923187, 890623, 859582, 830051, 803072, 779573, 759117, 740294, 722192, 705094, 689886, 677011, 666006, 656036, 646871, 639064, 632983, 628138, 623917, 620549, 618658, 618209, 618663, 619872, 622035, 624951, 628222, 632009, 636749, 642232, 647864, 653713, 660276, 667282, 673776, 679501, 685186, 691264, 697196, 702316, 706549, 710130, 713333, 716559, 719999, 723222, 725849, 728518, 732342, 737565, 743695, 750753, 759258, 769133, 779979, 792516, 808375, 828208]
56081H28208K3043K5832K9483L4053L8677M3297M8420N3695N8334O2472O6604
56070A312118P0036P1361P0271O7622O4070N9805N5265N0965M6871M2749L8524
56059A949657L3558K6634J7849R434L305j354o575j2632j8290k3252k8520l4563
56047A915251m0745m6425n1350n5172n7595n8687n8337n6209n2984n0415m9056
56036A338276m7276m3788l9746l6724l4198l0952k7598k5450k4010k1843j9118
56025I87573j6994j5348j3288j1237j0139r358p574n210l678k851j592k29Q2p1
56011H90086J096L567N537O296O854P732Q356Q606R015R470R520R702J0746J2023
55997I98606J2606J3149J4546J5701J5082J3753J4143J6280J8005J8558J9148
$$ y = [828208, 851251, 877083, 906566, 940619, 979296, 1022593, 1071013, 1124708, 1183042, 1245514, 1312118, 1382154, 1453515, 1523786, 1591408, 1655478, 1715283, 1770548, 1821513, 1868384, 1911133, 1949657, 1983215, 2009849, 2027698, 2037132, 2040437, 2039083, 2032508, 2019876, 2001586, 1978334, 1949814, 1915251, 1874506, 1828081, 1776731, 1721559, 1663964, 1605277, 1546940, 1490731, 1437747, 1387332, 1338276, 1291000, 1247212, 1207466, 1170742, 1136544, 1105592, 1077994, 1052544, 1028534, 1006691, 987573, 970579, 955231, 941943, 930706, 920567, 911209, 903635, 898425, 894747, 891896, 890304, 890075, 890157, 890086, 891182, 894749, 900286, 906582, 913436, 921168, 929524, 938130, 947145, 956615, 966135, 975837, 986583, 998606, 1011212, 1024361, 1038907, 1054608, 1069690, 1083443, 1097586, 1113866, 1131871, 1150429, 1169577]
55986A169577K0204K0857K1119K1935K3097K3538K3664K4878K6975K8428K9034
55975A433306K9804L0614L0572L0440L1924L4857L7613M0002M3031M6387M8954
55964A837504N1340N4906N8859O1367O2974O5709O9336P1978P3930P7259Q1877
55953B567039Q5683Q8403R1772R6008R9669J02897J07311J12930J18499J24412
55943C594623J31798J39507J45704J51487J59062J67525J74836J82507J93475
55934E040524K06613K18748K30833K46356K64661K82148K99273L19784L43580
55925G452520L67123L90572M17517M47787M77772N07810N41768N79509O17632
55916A1800010O57583P04741P59451Q17857Q81621R57375J046388J144870J254798
$$ y = [1169577, 1189781, 1210638, 1231757, 1253692, 1276789, 1300327, 1323991, 1348869, 1375844, 1404272, 1433306, 1463110, 1493724, 1524296, 1554736, 1586660, 1621517, 1659130, 1699132, 1742163, 1788550, 1837504, 1888844, 1943750, 2002609, 2063976, 2126950, 2192659, 2261995, 2333973, 2407903, 2485162, 2567039, 2652722, 2741125, 2832897, 2928905, 3028574, 3131471, 3238782, 3351712, 3470211, 3594623, 3726421, 3865928, 4011632, 4163119, 4322181, 4489706, 4664542, 4847049, 5040524, 5247137, 5465885, 5696718, 5943074, 6207735, 6489883, 6789156, 7108940, 7452520, 7819643, 8210215, 8627732, 9075519, 9553291, 10061101, 10602869, 11182378, 11800010, 12457593, 13162334, 13921785, 14739642, 15621263, 16578638, 17625026, 18769896, 20024694]
55907B0024694J383785J534173J704529J903306K149052K456019K831541L286298
55899C7273397L830673M459381N155006N906168O705331P534937Q383375R271640
55891H8519908J0229014J1242114J2268723J3287397J4230156J4803711J4468594
55884A79049617J2749431R619577N545086J162770l023668o671435r506049j1348626
55876A77576703j2220893j2335936j1960924j1307843j0525025r718646q950725
55869A00556711q243127p604047p042270o556913o133854n757676n412571n070921
55861D8735332m700134m288362l852620l419230l007375k631597k303891k025893
55853B2506230j788384j583332j409163j262856j136633j025719r31018q51136
$$ y = [20024694, 21408479, 22942652, 24647181, 26550487, 28699539, 31155558, 33987099, 37273397, 41104070, 45563451, 50718457, 56624625, 63329956, 70864893, 79248268, 88519908, 98748922, 109991036, 122259759, 135547156, 149777312, 164581023, 179049617, 191799048, 201418625, 206963711, 208126481, 205102813, 198431378, 188925329, 177576703, 165355810, 153019874, 141058950, 129751107, 119226082, 109507436, 100556711, 92313584, 84709537, 77667267, 71110354, 64976500, 59218824, 53806253, 48735332, 44035198, 39746836, 35894216, 32474986, 29467611, 26836014, 24532123, 22506230, 20717846, 19134514, 17725351, 16462495, 15325862, 14300143, 13369125, 12517989]
55845A2517989p79630p12965o53764o03303n57696n14310m75331m42093m11746
55836G367151l82327l55737l33140l12392k92262k74447k59401k44679k29210
55827D683556k14911k02559j90420j78279j68374j60935j53141j44001j35985
55818C134951j30438j25462j19807j14827j11192j07503j03547j01043r9693r6295
55808B025144q9315q1014p3699o7257o1462n7137n3749m9247m3597l9189l6707
55797A372771l4067l0600k8570k9074k9916k9333k8484k8448k7983k6110k4166
55786A056020k3309k2552k0960j9452j8736j7835j6106j4565j3849j3047j1769
55775H63840j1150j1637j2045j1846j2089j3054j3477j3189j3850j5804j6875
$$ y = [12517989, 11738359, 11025394, 10371630, 9768327, 9210631, 8696321, 8220990, 7778897, 7367151, 6984824, 6629087, 6295947, 5983555, 5691293, 5416846, 5157445, 4912766, 4683556, 4468645, 4266086, 4075666, 3897387, 3729013, 3568078, 3414937, 3270936, 3134951, 3004513, 2879051, 2759244, 2644417, 2533225, 2425722, 2322175, 2221132, 2121439, 2025144, 1935829, 1854815, 1781116, 1713859, 1652397, 1595260, 1541511, 1492264, 1448667, 1409478, 1372771, 1338704, 1308104, 1279534, 1250460, 1220544, 1191211, 1162727, 1134279, 1106296, 1080186, 1056020, 1032711, 1010159, 989199, 969747, 951011, 933176, 917070, 902505, 888656, 875609, 863840, 852690, 841053, 829008, 817162, 805073, 792019, 778542, 765353, 751503, 735699, 718824]
55764G18824j5789j4254j3991j4120j3304j2273j2207j2538j2241j1719j1619
55753E74769j1268r947q381p489o858n755m447l383k325j302j099j821k314j983
55739E06397j784k552l656m290m788n728o923q023q951r271q478p258o963p494
55725D20238p371o290n629n942o007n128m335m342m293l610l186l721m536n138
55711C50710o197p897r002q679p774p235o832o337o317o766o628n587m702m404
55697B56353l733k504k242l679n270n498m944m675m377l590l082l450l800l342
55683B02167k835l006l069k266j451j548j850j494j148j616k022j258m0K17l34
55668A78447o03n20p37j071q96m61n05j067j809k777l811m080l270k302j920j604
$$ y = [718824, 703035, 688781, 674790, 660670, 647366, 635093, 622886, 610348, 598107, 586388, 574769, 563501, 553554, 545173, 537684, 530826, 525071, 520624, 517241, 514916, 513614, 512515, 510694, 508380, 506397, 504613, 502061, 498405, 494115, 489327, 483599, 476676, 468653, 459702, 450431, 441953, 434695, 427732, 420238, 412867, 406577, 400948, 395006, 388999, 383871, 379536, 375194, 370901, 367291, 364105, 360384, 355848, 350710, 344513, 336616, 327614, 318935, 311161, 303926, 297094, 290757, 284440, 277674, 271046, 265459, 260757, 256353, 252620, 250116, 247874, 244195, 238925, 233427, 228483, 223808, 219431, 215841, 212759, 209309, 205509, 202167, 199332, 196326, 193257, 190991, 189540, 187992, 186142, 184648, 183500, 181884, 179862, 178604, 178564, 178781, 178447, 177844, 177324, 176587, 175516, 174620, 174159, 173654, 172587, 170778, 168001, 164190, 160110, 156840, 154538, 152618, 151014]
55652A51014q67m35q65j292q17L8N26J064K032K530J956J481K265L319L033J835
55636A66817J348J709J762J308J168J391J251Q05Q33J368J660J451J013L05p17
55621A83472j397j267j081j690k491k364j607j407j859k070j924k174k921l403
55607A55817l246k738k009j015r7M25R20J722K278K013J482J467J601J147N17
55592A60284N86J018P79j06p23q70j071j352j414j726k872m106m113l078k429
55577A38807k666k940k812k832l256l584l621l687l650l008k093j913k615l166
55563I6964k897k232j787j699j988k563k742j860m30K89nl90k23J81M59O82P40
55546H0499K25p11j311j303j210j447j790j955j948j668r70j30L08L27L67N03
$$ y = [151014, 150147, 149712, 148847, 147555, 146738, 146776, 147302, 148366, 150398, 152928, 154884, 156365, 158630, 161949, 164982, 166817, 168165, 169874, 171636, 172944, 174112, 175503, 176754, 177559, 178392, 179760, 181420, 182871, 183884, 184189, 183472, 182075, 180808, 179727, 178037, 175546, 173182, 171575, 170168, 168309, 166239, 164315, 162141, 159220, 155817, 152571, 149833, 147824, 146809, 146712, 147137, 148057, 149779, 152057, 154070, 155552, 157019, 158620, 159767, 160284, 160870, 161888, 162667, 162561, 161838, 160968, 159897, 158545, 157131, 155405, 152533, 148427, 144314, 141236, 138807, 136141, 133201, 130389, 127557, 124301, 120717, 117096, 113409, 109759, 106751, 104658, 102745, 100130, 96964, 94067, 91835, 90048, 88349, 86361, 83798, 81056, 79196, 78766, 79055, 79050, 78660, 78437, 78618, 79077, 79759, 80499, 80724, 80013, 78702, 77399, 76189, 74742, 72952, 70997, 69049, 67381, 66411, 66281, 66589, 66916, 67283, 67786]
55530F7786L74o6m03m08k59j35j11l27p35r63q90r34j273j355r15o83j166j506
55512E6031p81K56J83q45j431j181j001j231j145m77N4J8j90l73q08j256r23K24
55494D5124J219J476J376J303J112Q23P62Q13M99k1o3L33L50k33p00o42m20k68
55476E2843K1L16K28R8O80J674J901J242R16J443J758J017q7n78o29q13j008q29
55458F0193l76J72R06J552J443O25M1M2j74j040j686j415r60j235j848j973j876
55441E2391k233k682k346j436j000j242j328q19k99l27o48p10m47j99j91k90k09
55424C5985O6J52k41p36o44M0N31L43j10k38j18j99n60r18j107j229j461j826
55406B7730j982j373jJ145J075J06o04p27j012j719j983j207j76M8m27p04l91
$$ y = [67786, 68160, 68094, 67691, 67283, 67024, 66889, 66778, 66451, 65716, 64753, 63863, 62929, 61656, 60301, 59386, 58703, 57537, 56031, 55250, 55506, 55689, 54844, 53413, 52232, 51231, 50000, 48855, 48378, 48432, 48450, 48260, 47887, 47079, 45823, 44900, 45124, 46343, 47819, 49195, 50498, 51610, 52433, 53195, 54008, 54507, 54486, 54423, 54756, 55106, 54873, 54173, 53531, 53111, 52843, 52864, 53180, 53408, 53506, 54186, 55860, 57761, 59003, 59919, 61362, 63120, 64137, 64050, 63472, 62843, 62030, 61022, 60193, 59817, 59989, 60895, 62447, 63890, 64515, 64556, 64598, 64424, 63384, 61698, 60283, 59323, 58088, 56240, 54267, 52391, 50158, 47476, 45130, 43694, 42694, 41452, 40124, 39305, 39006, 38679, 38031, 37321, 36874, 36675, 36484, 36194, 35985, 36051, 36203, 35962, 35226, 34582, 34622, 35153, 35496, 35386, 35148, 35030, 34831, 34271, 33353, 32246, 31017, 29556, 27730, 25748, 24375, 24374, 25519, 26594, 26700, 26096, 25369, 24357, 22638, 20655, 19448, 19272, 19320, 18893, 18189, 17798]
55389A7798J53N27O03M18K05L17P96J264J386J119N18k36n82j03O55O95K6l34
55371B5225o3p0q86j631j411p26n52p98p06j73L36P02J039J030L35n74q77n26
55353A9674j49n4k4K0n8j51kK69L34K40L04N37O58O09N61N47M92M76N46N14L11
55332B5654K84O84J131J117P80O51P46N70j01r33j487j555j129m63r8l92j027
55315B4432j288q32K9O49N16l31j121r59R9R11N71m77j121r84n50j76K83Q62J152
55296B1665P96j6p26q90n07j4P0k96n75k75M51R72Q47J57o60j147j135q32n40
55277A7345k71J48O27Q15N50lo44j213j399r82l21nJ5K92Q72J191J059Q85O95
55258A9656p3j317j901j245l33k54n51j23R14J426J004L65J35K35M07N34L58k54
$$ y = [17798, 17951, 18478, 19081, 19499, 19704, 20021, 20817, 22081, 23467, 24586, 25104, 24868, 24286, 24183, 24838, 25533, 25559, 25225, 25162, 25092, 24206, 22575, 21164, 20438, 19886, 19088, 18382, 18209, 18545, 19247, 20286, 21316, 21651, 21077, 20200, 19674, 19525, 19471, 19447, 19467, 19409, 19258, 19256, 19525, 19859, 20099, 20403, 20940, 21598, 22207, 22768, 23315, 23807, 24283, 24829, 25343, 25654, 25938, 26622, 27753, 28870, 29650, 30301, 31047, 31617, 31516, 30583, 29096, 27541, 26412, 25949, 25851, 25459, 24432, 23144, 22312, 22341, 22990, 23506, 23175, 22054, 21095, 21194, 22105, 22676, 22199, 21078, 20094, 19544, 19368, 19651, 20513, 21665, 22461, 22445, 21719, 20829, 20322, 20308, 20378, 20082, 19507, 19232, 19683, 20655, 21502, 21659, 20999, 19852, 18717, 17885, 17345, 17074, 17222, 17849, 18664, 19214, 19211, 18567, 17354, 15955, 14973, 14652, 14647, 14662, 14954, 15826, 17017, 18076, 18961, 19656, 19583, 18266, 16365, 15120, 14787, 14533, 13982, 13859, 14773, 16199, 17203, 17568, 17703, 17938, 18345, 18879, 19237, 18983]
55240A8983q11o30J90Q84J041R18P61N05J83K3Q0K40N75J179J704J581P20m08
55222B7718j267j507r39J71R95R23K90j56k67m07n87n02k25j27j31J27N07N45
55204B5161L81O45J282J464Q70J40k62o96j333j466n66N76P10j91r25o44K17O45
55186B6008K30n37q21k31Q08J455J242M35m00r76j271j227p58l4M96M95P6l03
55168B4687k99oK15J95J49K90M88M61K40J94N75J123J299Q63J72j95j38j38n18
55149B9657q33m67L72Q10N54L16O83J194J116N63K43L26L63J49MJ03J54p1l01
55130C4935j47L81R27J213J215J040P33K94j47l26k19k86r44j811j973j143j33
55113C3609J72k55q78j346j456q93K86J211R60k81j334j306l75N96Q66L27m47
$$ y = [18983, 18172, 17542, 17732, 18616, 19657, 20575, 21336, 21841, 22024, 22047, 22127, 22367, 22942, 24121, 25825, 27406, 28126, 27718, 26451, 24944, 24005, 24176, 25171, 26094, 26384, 26228, 25961, 25554, 24967, 24465, 24240, 24113, 23982, 24109, 24616, 25161, 25542, 26187, 27469, 28933, 29803, 29943, 29681, 28985, 27652, 26186, 25620, 26196, 26906, 26715, 25790, 25146, 25363, 26008, 26238, 25701, 24880, 24649, 25457, 26912, 28154, 28589, 28189, 27213, 25942, 24715, 23957, 23923, 24419, 24914, 24990, 24687, 24388, 24382, 24597, 24792, 24941, 25231, 25719, 26180, 26420, 26614, 27189, 28312, 29611, 30474, 30646, 30451, 30313, 30175, 29657, 28824, 28357, 28729, 29539, 30093, 30409, 31092, 32286, 33402, 33965, 34208, 34534, 34897, 35046, 35050, 35153, 35307, 35236, 34935, 34788, 35169, 36096, 37309, 38524, 39564, 40297, 40591, 40444, 40118, 39899, 39613, 38669, 36858, 34885, 33742, 33609, 33781, 33526, 32648, 31302, 29846, 28953, 29239, 30450, 31410, 31129, 29795, 28489, 28114, 28710, 29576, 29903, 29456]
55096B9456p58n92n99j117j641j628j251q63k68P21J490J233J80o90r45q99o84
55079B1145p1P45J068O52j0m38n70l02N11J396J414L40q62j186o61K8M84P49R22
55060B5354J033J072R37N60K17L05P23Q94N58J62J92N09O53M87L12M37Q62J234
55042C6501J174P41N12R35J663J951J563R04L73Q4J76P58J474J714J376R09N69
55025E3377K35K5L33J019J272P32R2J10N33O02J71k47l33k20n4J78M15M84L83
55006E9107L32M54O22O00K74l04r59j504j766j574q73K4N57N11L04L89N73L46
54988E7113k94q80j217j473j516q96K91J124Q54j95j067j292j203j317j682j853
54972D4497j390m52L36O42Q17J216J442Q72k46r17o74k1M36P06J012J313J514
$$ y = [29456, 28698, 28106, 27507, 26390, 24749, 23121, 21870, 21007, 20739, 21460, 22950, 24183, 24363, 23673, 22728, 21829, 21145, 21074, 21819, 22887, 23539, 23529, 23091, 22521, 22219, 22730, 24126, 25540, 25880, 25018, 23832, 23171, 23199, 23683, 24432, 25354, 26387, 27459, 28396, 28956, 29173, 29478, 30201, 31095, 31653, 31815, 32007, 32516, 33169, 33656, 33968, 34405, 35267, 36501, 37675, 38416, 38928, 39863, 41526, 43477, 45040, 45944, 46317, 46401, 46577, 47335, 48809, 50523, 51899, 52808, 53377, 53612, 53637, 53970, 54989, 56261, 56993, 57085, 57195, 57728, 58330, 58501, 58254, 57921, 57701, 57647, 57825, 58240, 58724, 59107, 59439, 59893, 60515, 61115, 61389, 61085, 60126, 58622, 56856, 55282, 54409, 54433, 54990, 55501, 55805, 56194, 56767, 57113, 56819, 55939, 54722, 53249, 51733, 50837, 51128, 52252, 53106, 52911, 51844, 50552, 49349, 48032, 46350, 44497, 43107, 42655, 42991, 43633, 44450, 45666, 47108, 47980, 47734, 46817, 46143, 46122, 46558, 47264, 48276, 49589, 51103]
54955E1103J648J624J230O26L72P59J496K116K280J667K21j335j990j629j096
54940E9092q25l33N69J006K54r71j349o01M30J020J060O48n5o36p14m17j37O5
54922E8106L13M68L64K59M75O89L03n99j198r78k69L64P60J056J324J546J698
54905F4681J703J491J173J023J200J631K126K515K757L035L587M278M588M250
54891A00038L738L775M449N180N532N699O103O729P097O741N617M032K297N27
54877A67554j278l001m459n483n906n620m911m495m826n486n674n249m729m380
54863A02057l935l322k947k881k578j779j116j124j253n45R79K361K945K977K991
54848I2830L292L969M913N750O106O049N928N890N794N531N018M004K285J60j746
$$ y = [51103, 52751, 54375, 55605, 56231, 56603, 57362, 58858, 60974, 63254, 64921, 65142, 63807, 61817, 60188, 59092, 58267, 57934, 58503, 59509, 59763, 58792, 57443, 56842, 57272, 58292, 59352, 60000, 59945, 59309, 58595, 58178, 58041, 58106, 58419, 58887, 59251, 59510, 59985, 60674, 60977, 60378, 59180, 58202, 57933, 58297, 59057, 60113, 61437, 62983, 64681, 66384, 67875, 69048, 70071, 71271, 72902, 75028, 77543, 80300, 83335, 86922, 91200, 95788, 100038, 103776, 107551, 112000, 117180, 122712, 128411, 134514, 141243, 148340, 155081, 160698, 164730, 167027, 167554, 166276, 163275, 158816, 153333, 147427, 141807, 136896, 132401, 127575, 122089, 116415, 111166, 106437, 102057, 98122, 94800, 91853, 88972, 86394, 84615, 83499, 82375, 81122, 80577, 81556, 83917, 86862, 89839, 92830, 96122, 100091, 105004, 110754, 116860, 122909, 128837, 134727, 140521, 146052, 151070, 155074, 157359, 157519, 155773]
54833A55773l091m005m646n030n231n445n663n618n220m804m762n014n091m666
54819H7487l880l064k350j705j286j423k042k463k107j221n40m03o45j162j856
54804F1340k187j586m61P9k72n49l5P05Q27M49J02l72j338k268k186j128j94j25
54786E0801n85r34j005r45r01j017j304j452j134m96L7L80P36J032R83O88O03
54769D5487Q16Q99N73R4j51j2N02J259J884J962J515R51O00N55Q99J592K179K157
54751F3761J691J458J671J728J091R1m29L2J304K823M028M684M966N147N264N309
54735A04619N545O253P156P587P347O947O825O722O065M730L164J907J131N10
54721A76508m58j840l042l446l181k953l145l521l847m236m699m828m251l134
$$ y = [155773, 152682, 148677, 144031, 139001, 133770, 128325, 122662, 117044, 111824, 107020, 102258, 97244, 92153, 87487, 83607, 80543, 78193, 76488, 75202, 73779, 71737, 69274, 67167, 65946, 65406, 65003, 64358, 63196, 61340, 59153, 57567, 57106, 57185, 56913, 56364, 56329, 57034, 57861, 58310, 58412, 58040, 56702, 54434, 52248, 51120, 50926, 50801, 50216, 49282, 48277, 47332, 46431, 45414, 44110, 42658, 41524, 41028, 41065, 41445, 42181, 43213, 44196, 44884, 45487, 46303, 47202, 47775, 47869, 47718, 47706, 48208, 49467, 51351, 53313, 54828, 55779, 56379, 56934, 57833, 59425, 61604, 63761, 65452, 66910, 68581, 70309, 71400, 71491, 71062, 71094, 72398, 75221, 79249, 83933, 88899, 94046, 99310, 104619, 110164, 116417, 123573, 131160, 138507, 145454, 152279, 159001, 165066, 169796, 172960, 174867, 175998, 176508, 176050, 174210, 171168, 167722, 164541, 161588, 158443, 154922, 151075, 146839, 142140, 137312, 133061, 129927]
54707A29927j936r53l42k62n92p74l36M96J119J437K034L213M329M497L865L690
54691A49412M904O943Q417Q742Q615Q810R149Q901P784O133M336K547Q26p60k168
54676B32591l323m122m655n197n858o506p083p592p676o854n533n040n935p017
54662A50200o836n703n042n158m952l897k921k915l456l640l335k937k517j885
54648I5006j155n94k41k4Lj43l14n88j215j925j863o65Q04J424J071M75J33k6
54630I0163j15j07j15l32o59p67n13PP64J715K508K662K132J410R47P20M85K42
54612A01147K68P17J356J786J934K134K559K808K445J846J971L083M219M304L453
54597A36030K666K498K572K391K092K169K730L327L470L149K766K632K595K313
$$ y = [129927, 127991, 127038, 126696, 126434, 125842, 125068, 124732, 125228, 126347, 127784, 129818, 133031, 137360, 141857, 145722, 149412, 154316, 161259, 169676, 178418, 187033, 195843, 204992, 213893, 221677, 227810, 232146, 234693, 235519, 234759, 232591, 229268, 225146, 220491, 215294, 209436, 202930, 195847, 188255, 180579, 173725, 168192, 163152, 157217, 150200, 143364, 137661, 132619, 127461, 122509, 118612, 115691, 112776, 109320, 105680, 102345, 99408, 96891, 95006, 93851, 93257, 93016, 92992, 92995, 92852, 92538, 91950, 90735, 88810, 86947, 86282, 87086, 88510, 89581, 90056, 90189, 90163, 90048, 89941, 89826, 89494, 88835, 88068, 87555, 87562, 88326, 90041, 92549, 95211, 97343, 98753, 99700, 100420, 100905, 101147, 101415, 102132, 103488, 105274, 107208, 109342, 111901, 114709, 117154, 119000, 120971, 124054, 128273, 132577, 136030, 138696, 141194, 143766, 146157, 148249, 150418, 153148, 156475, 159945, 163094, 165860, 168492, 171087, 173400]
54583A73400J824J658K283L617N164O465P280P478P010O067N138M770N161N863
54569B43178N992M943K951Q41p70j956l175m691o270p374p609p101o384n872n560
54554B01143n318n249n424n568n319m728m109l513k809k178j950j988j784j290
54540A49916j054j338j720j860k086k773l559l750l229k547k251k445k899l236
54526A15169l186k922k935l436m017m127l628k698j567o34m47j064j678j474p13
54511H0643m16r45j504j246m07P1k27p58q36m41p5Nl8j09l82p65o74J68J041J013
54491G4118K69r7L60Q57O59Q2j76o6J09M10R73J449J460J332J632K188K336J994
54473H9889J706J654J466J213J662L074M428M477L281K059J712K010K281K314
$$ y = [173400, 175224, 176882, 179165, 182782, 187946, 194411, 201691, 209169, 216179, 222246, 227384, 232154, 237315, 243178, 249170, 254113, 257064, 257905, 257135, 255179, 252004, 247313, 241043, 233669, 226060, 218959, 212575, 206703, 201143, 195825, 190576, 185152, 179584, 174265, 169537, 165428, 161915, 159106, 156928, 154978, 152990, 151206, 149916, 148862, 147524, 145804, 143944, 141858, 139085, 135526, 131776, 128547, 126000, 123749, 121304, 118405, 115169, 111983, 109061, 106126, 102690, 98673, 94546, 90918, 88220, 86653, 86019, 85572, 84508, 82830, 81356, 80643, 80227, 79282, 77778, 76532, 76125, 76196, 75969, 75211, 74375, 73934, 73859, 73864, 73826, 73717, 73335, 72570, 71896, 72064, 73105, 74118, 74387, 74290, 74650, 75507, 76166, 76248, 76072, 76006, 76115, 76525, 77498, 78947, 80407, 81739, 83371, 85559, 87895, 89889, 91595, 93249, 94715, 95928, 97590, 100664, 105092, 109569, 112850, 114909, 116621, 118631, 120912, 123226]
54459A23226K344K334J791L59j524k861l050k427j810j697k017k507k950l148
54445A06063k945k455k076k162k662l136l139k585j826j302j114r64n56QL63K78
54429G9790j75q21j559k238k546k145j086O6O30M92J94K75O33P62M43o7m35n12
54411G1701k78J64N09N13L16K23K17Q4q1qR8k83j019j208m18O12R94Q31P46P42
54391G4455L72l32q26r32r87j128j060o91m14n35q61j033r68q02o20m36k85j98
54373F2719j78j68NM44Q63P13om62L7R66J142K78o80q39l53J17L25M06L91K89
54353F6009L74Q94J589J928J772J530J542J735J893J981K028J909J574J287J367
54338H9412J714J918J904K059K532K754K145J090O33J216K141K491K115J510J104
$$ y = [123226, 125570, 127904, 129695, 130054, 128530, 125669, 122619, 120192, 118382, 116685, 114668, 112161, 109211, 106063, 103118, 100663, 98587, 96425, 93763, 90627, 87488, 84903, 83077, 81775, 80661, 79697, 79141, 79149, 79512, 79790, 79615, 78794, 77235, 74997, 72451, 70306, 69220, 69286, 69916, 70408, 70602, 70877, 71510, 72272, 72715, 72648, 72213, 71701, 71423, 71587, 72096, 72609, 72925, 73148, 73365, 73449, 73368, 73360, 73458, 73175, 72156, 70948, 70530, 71142, 72136, 72967, 73713, 74455, 74827, 74495, 73669, 72737, 71750, 70622, 69562, 68871, 68457, 67922, 67061, 66028, 65060, 64258, 63638, 63202, 62917, 62719, 62541, 62373, 62378, 62822, 63685, 64398, 64392, 63930, 63967, 64933, 66075, 66353, 65673, 64834, 64481, 64598, 64923, 65329, 65720, 66009, 66383, 67277, 68866, 70794, 72566, 74096, 75638, 77373, 79266, 81247, 83275, 85184, 86758, 88045, 89412, 91126, 93044, 94948, 97007, 99539, 102293, 104438, 105528, 106161, 107377, 109518, 112009, 114124, 115634, 116738]
54323A16738R41Q77P56N43L99M72N76L35k89r91j679k540l386l563k848j928j513
54306A02900j412j088o63p21j371k103k479k353j668n95K43L91K80O62J385J519
54290I2927P53m7PP83J531J855J871J832J921K231K683L076L307L328K940J992
54274A22990Q29J01L7K52L87N20Q08J088J107Q24K96m57j285j934k375k810l206
54257A17172l190k677k212k345k861l012k441j613j295j785k638l107k878k327
54243H2791j982j920j887j842j980k286k463k410k271k028j455p00l57p03j226
54228E7281j265p44k0O40J029Q27k5r82j373j154p46k82M71J397J820J261J02
54211E8237q05j016p42l58j4K70M23M22M11N08N61L29o3j38L73J117J436R50k05
$$ y = [116738, 117679, 118556, 119312, 119855, 120254, 120726, 121302, 121637, 121348, 120357, 118678, 116138, 112752, 109189, 106341, 104413, 102900, 101488, 100400, 99737, 99016, 97645, 95542, 93063, 90710, 89042, 88447, 88690, 89081, 89361, 90023, 91408, 92927, 93680, 93633, 93640, 94423, 95954, 97809, 99680, 101512, 103433, 105664, 108347, 111423, 114730, 118058, 120998, 122990, 123819, 123920, 123957, 124209, 124596, 125116, 125924, 127012, 128119, 128943, 129239, 128782, 127497, 125563, 123188, 120378, 117172, 113982, 111305, 109093, 106748, 103887, 100875, 98434, 96821, 95526, 93741, 91103, 87996, 85118, 82791, 80809, 78889, 77002, 75160, 73180, 70894, 68431, 66021, 63750, 61722, 60267, 59567, 59210, 58507, 57281, 56016, 55272, 55252, 55892, 56921, 57748, 57723, 56741, 55368, 54214, 53468, 53186, 53657, 55054, 56874, 58135, 58237, 57432, 56416, 55674, 55316, 55302, 55572, 55995, 56417, 56828, 57336, 57897, 58226, 58163, 58025, 58398, 59515, 60951, 61901, 61696]
54192F1696j521k317k090r66L19J092J270J082N99r4n77m72o0M3j94j95K35N26
54174E8376K13k87j58P65J809K183J694P90J08j05j33l61p93j153j322j434j526
54157E8666j408r21j11Q46J645J896J426N84q4m37p52j165j436j267o14K70Q99
54140E8037Q38K22j95J5L07j8o64p86l63j32k11J23R82J370O66l49o48l78k75
54121E8541l61j48K86M01J58P1K37J37n62j500k041j875j143l24J05J12J35M49
54103E2678P41O11K42J56M61P24N59mo27q81m57M79J307J466R12Lq89j458j520
54084E4503j231r77q43n31K2L47O5n82j110j234p52M46J789K130J062l31p74l40
54066E1659K6L3J40M04L28j30l63j00K36L22L98O78Q21L71o71j803k381k096j333
$$ y = [61696, 60175, 57858, 55768, 54802, 55121, 56213, 57483, 58565, 59164, 59070, 58493, 58021, 57961, 58004, 57810, 57615, 57850, 58376, 58589, 58302, 58144, 58909, 60718, 62901, 64595, 65385, 65493, 65388, 65255, 64894, 64101, 62948, 61626, 60192, 58666, 57258, 56337, 56226, 57072, 58717, 60613, 62039, 62623, 62539, 62102, 61350, 60185, 58749, 57482, 56868, 57138, 58037, 58875, 59097, 58902, 58917, 59224, 59206, 58542, 57756, 57393, 57261, 57050, 57173, 58155, 59525, 60191, 59842, 59194, 58816, 58541, 58180, 58032, 58318, 58719, 58877, 58948, 59185, 59322, 58760, 57260, 55219, 53344, 52201, 51877, 51982, 52094, 52229, 52678, 53419, 54030, 54272, 54428, 54889, 55613, 56172, 56168, 55541, 54660, 54203, 54682, 55989, 57455, 58367, 58370, 57481, 56023, 54503, 53272, 52295, 51452, 50921, 50943, 51290, 51355, 50773, 49663, 48429, 47677, 48123, 49912, 52042, 53104, 52773, 51999, 51659, 51685, 51718, 51858, 52262, 52590, 52460, 52097, 51997, 52233, 52555, 52953, 53631, 54452, 54823, 54152, 52349, 49968, 47872, 46539]
54047D6539q31o74j00J133J862J008n63r32K48J392J340O39J15l73j029j253o79
54030D7842q3k00l82L83J734K362J839Q61q5j097j929j846p51M30Q51O59M68N48
54012E1604Q44J331J854J954J289J48p49r24m37L24J005J443J624J553J221P32
53996F4816L37K17K84L73M97P62J009R03M08K2K98J187K017K119J428N41J31L89
53978G7738J000J620K204K812L271L293K941K760L233M134M614M112L054K483
53964A19269K934L937M672M836M601M082L351K838L036L703L908L214K283J917
53950A68581J941J589P51J23J96O82J054J087O96k40j494k382k455k136k159k538
53934A63296k519j635m02K37j18j031j769j910j586j298j452j935k204j879j174
$$ y = [46539, 45708, 45034, 44934, 46067, 47929, 48937, 48374, 47442, 47690, 49082, 50422, 51061, 51176, 50803, 49774, 48521, 47842, 47759, 47559, 47177, 47560, 49294, 51656, 53495, 54356, 54271, 53174, 51245, 49399, 48648, 49078, 49929, 50588, 51056, 51604, 52448, 53779, 55633, 57587, 58876, 59024, 58275, 57351, 56914, 57238, 58243, 59686, 61310, 62863, 64084, 64816, 65153, 65370, 65654, 66027, 66524, 67286, 68295, 69198, 69606, 69628, 69926, 71113, 73130, 75249, 76677, 77218, 77349, 77738, 78738, 80358, 82562, 85374, 88645, 91938, 94879, 97639, 100872, 105006, 109620, 113732, 116786, 119269, 122203, 126140, 130812, 135648, 140249, 144331, 147682, 150520, 153556, 157259, 161167, 164381, 166664, 168581, 170522, 172111, 172862, 172985, 173181, 173863, 174917, 176004, 176700, 176460, 174966, 172584, 170129, 167993, 165834, 163296, 160777, 159142, 158740, 158977, 158859, 157828, 156059, 154149, 152563, 151265, 149813, 147878, 145674, 143795, 142621]
53919A42621o68p13j192j729j963j761j358j190j324j268o81p4l14j382k181j841
53903A22982p04K71O80Q11R42R60O12j62j114j708j527q55n38q71j029q1J656
53886A20325K948L148K741K429K340K355K520K909L407L888M277M341L841L019
53872A64488K478K403K392K230K284K773L174K880K057J343Q94L73k75n92k75
53857A88627L52P58Q00P98J126J839K630L098L131L005L071L376L684L769L648
53842B23712L508L508L600L539L091K208J094J23k88l2L61O9j045k067k106j517
53826B37758j453k276l153l306k999k867l010l162l301l551l780l840l889m068
53812A93103m110l806l577l989m801n065m315l161k578k856l446l621l263k961
$$ y = [142621, 141953, 141240, 140048, 138319, 136356, 134595, 133237, 132047, 130723, 129455, 128774, 128700, 128386, 127004, 124823, 122982, 122278, 122549, 123229, 124040, 124982, 125942, 126554, 126392, 125278, 123570, 122043, 121188, 120650, 119779, 118750, 118669, 120325, 123273, 126421, 129162, 131591, 133931, 136286, 138806, 141715, 145122, 149010, 153287, 157628, 161469, 164488, 166966, 169369, 171761, 173991, 176275, 179048, 182222, 185102, 187159, 188502, 189396, 189769, 189494, 188902, 188627, 188979, 189737, 190537, 191335, 192461, 194300, 196930, 200028, 203159, 206164, 209235, 212611, 216295, 220064, 223712, 227220, 230728, 234328, 237867, 240958, 243166, 244260, 244383, 244095, 244063, 244424, 244493, 243448, 241381, 239275, 237758, 236305, 234029, 230876, 227570, 224571, 221704, 218694, 215532, 212231, 208680, 204900, 201060, 197171, 193103, 188993, 185187, 181610, 177621, 172820, 167755, 163440, 160279, 157701, 154845, 151399, 147778, 144515, 141554]
53798A41554l270l923m051l315k344j806j610j413j410j879k333k002j160j008
53784A10030k045l347l770l258k530j966j352m94M09R59R34M33k07p37j169j465
53768I0425j275l55Q05J287Q74L58M52Q84Q99L04m20q44r21p52l86R0M83O57N81
53749I3146M07M68J043J907K427K296J879J626J487J351J632K710L907L971K784
53734A23041J795K189L268L440K458J666K016K797K829K169J822K102K255J752
53720A55599J138J164J624J708J153M94J83J6l41p68q98p15o06q76j431j896k010
53703A53538j820j596j543j599j554j377j312j551j882j871j466j208j624k462
53689A30673k811k128q65Q5L94L62K56N2j51q8J49P7m43q89q91p87r34r50l60
$$ y = [141554, 138284, 134361, 130310, 126995, 124651, 122845, 121235, 119822, 118412, 116533, 114200, 112198, 111038, 110030, 107985, 104638, 100868, 97610, 95080, 93114, 91762, 91268, 91677, 92636, 93570, 94003, 93796, 93059, 91890, 90425, 89150, 88795, 89600, 90887, 91761, 92119, 92571, 93455, 94354, 94658, 94238, 93394, 92473, 91721, 91335, 91425, 91908, 92565, 93146, 93553, 94021, 95064, 96971, 99398, 101694, 103573, 105199, 106686, 108037, 109669, 112379, 116286, 120257, 123041, 124836, 127025, 130293, 133733, 136191, 137857, 139873, 142670, 145499, 147668, 149490, 151592, 153847, 155599, 156737, 157901, 159525, 161233, 162386, 162880, 163063, 163079, 162738, 161970, 161072, 160357, 159751, 158875, 157444, 155548, 153538, 151718, 150122, 148579, 146980, 145426, 144049, 142737, 141186, 139304, 137433, 135967, 134759, 133135, 130673, 127862, 125734, 124869, 124954, 125348, 125710, 125966, 126018, 125867, 125779, 125928, 126005, 125562, 124673, 123782, 122995, 122061, 121111, 120751]
53670A20751L87M26j61l91K21J076J533J667J667J287M48k49k06L52Q26J088J331
53653A32053J404J039N55O31J356K003J913J151K78k08p5N19J033R35K37n28r20
53636A43376r54q26n59p9M98Q38O65O5m13j41R35K110K573K227J632J332J427
53619A54706J703J838J564R42N14P81J487J804J275L14k91j51N31J115Q75l58
53603A68649j701j837m78J134J629J013L43J46o1p07j425j710j749j993k263j953
53587A57037j061l27j71j05L90R11O96q8l92K56J084J177O18J32n5k76o76r86
53569A58164r88o83j07N98R94Q50P11J293K323K686J914P85J39o2j04K84J335
53552A70132K439K791K576K642L183L544L336K887K490J969J292R76J368J992
$$ y = [120751, 121138, 121564, 121403, 121012, 121233, 122309, 123842, 125509, 127176, 128463, 128911, 128662, 128456, 128808, 129634, 130722, 132053, 133457, 134496, 135051, 135682, 137038, 139041, 140954, 142105, 142383, 142175, 142100, 142619, 143652, 144587, 144824, 144296, 143376, 142422, 141596, 141037, 140958, 141456, 142294, 142959, 143024, 142611, 142470, 143405, 145515, 148088, 150315, 151947, 153279, 154706, 156409, 158247, 159811, 160753, 161267, 162048, 163535, 165339, 166614, 166928, 166637, 166486, 167017, 168132, 169007, 168649, 166948, 165111, 164633, 165767, 167396, 168409, 168752, 168898, 168837, 168130, 166705, 164995, 163246, 161253, 158990, 157037, 155976, 155649, 155478, 155373, 155763, 156674, 157370, 157282, 156890, 157146, 158230, 159407, 160025, 160157, 160102, 159826, 159150, 158164, 157176, 156493, 156386, 156984, 157978, 158828, 159539, 160832, 163155, 165841, 167755, 168540, 168679, 168617, 168513, 168797, 170132, 172571, 175362, 177938, 180580, 183763, 187307, 190643, 193530, 196020, 197989, 199281, 200257, 201625, 203617]
53538B03617K081J563J110J278J918K451K496K251K216K595L008K965K481K002
53524B34032J753J562J341J367J822K371K450J814O78m74j088q07J47J012J216
53509B49196R34P44Q08P35K52l10l99Q5O68Q35N80L41M51P83R75Q52M88Mm69o84
53489B56869m04L11J122J792K350K850L208L297L051K432J519P28N85J091J619
53474B82420J645J447J752K841M241N254N564N388N182N200N212M776L944L466
53460C38332M043N477O855P517P544P310O996O735O897P818R248J0445J0889J0786
53446D46892J0721J0944J1255J1528J1976J2722J3440J3684J3507J3340J3419
53435E83428J3635J3956J4539J5356J6016J6223J6074J5811J5516J5252J5139
$$ y = [203617, 205698, 207261, 208371, 209649, 211567, 214018, 216514, 218765, 220981, 223576, 226584, 229549, 232030, 234032, 235785, 237347, 238688, 240055, 241877, 244248, 246698, 248512, 249190, 248716, 247628, 246821, 246968, 247980, 249196, 250130, 250874, 251682, 252417, 252669, 252359, 251960, 252045, 252713, 253548, 254128, 254469, 254920, 255703, 256678, 257530, 258018, 258022, 257553, 256869, 256465, 256776, 257898, 259690, 262040, 264890, 268098, 271395, 274446, 276878, 278397, 279125, 279710, 280801, 282420, 284065, 285512, 287264, 290105, 294346, 299600, 305164, 310552, 315734, 320934, 326146, 330922, 334866, 338332, 342375, 347852, 354707, 362224, 369768, 377078, 384074, 390809, 397706, 405524, 414772, 425217, 436106, 446892, 457613, 468557, 479812, 491340, 503316, 516038, 529478, 543162, 556669, 570009, 583428, 597063, 611019, 625558, 640914, 656930, 673153, 689227, 705038, 720554, 735806, 750945]
53424G50945J5129J4921J4431J4010J3981J4154J4096J3688J3144J2694J2523
53413I03716J2790J3356J3612J2993J1574J0011Q977Q783R251R704R424Q423P452
53400A040066O935O346N165L881L174K498O68k161m301m724m423m879o086p002
53386A035157p357p891q894r672r720r615j0160j1119j1506j0966j0275j0328
53374I17654j1047j1613j1477j0777r933r277r033r164r129q297o812n555m960
53361H00580m377l083j402k63L0j57n72j076j055J61K244M035N011N761O805P808
53345H20450Q321Q499Q570Q321P835Q036R733J2381J4611J5792J6426J7123J7859
53332I73957J8352J8640J9082J9976K1293K2634K3653K4549K5880K7686K9142
$$ y = [750945, 766074, 780995, 795426, 809436, 823417, 837571, 851667, 865355, 878499, 891193, 903716, 916506, 929862, 943474, 956467, 968041, 978052, 987029, 995812, 1005063, 1014767, 1024191, 1032614, 1040066, 1047001, 1053347, 1058512, 1062393, 1065567, 1068065, 1068733, 1066572, 1062271, 1057547, 1053124, 1048245, 1042159, 1035157, 1027800, 1019909, 1011015, 1001343, 991623, 982008, 971848, 960729, 949223, 938257, 927982, 917654, 906607, 894994, 883517, 872740, 862807, 853530, 844497, 835333, 826204, 817907, 811095, 805540, 800580, 796203, 793120, 791718, 791455, 791485, 791328, 790756, 789680, 788625, 788786, 791030, 795065, 800076, 805837, 812642, 820450, 828771, 837270, 845840, 854161, 861996, 870032, 879765, 892146, 906757, 922549, 938975, 956098, 973957, 992309, 1010949, 1030031, 1050007, 1071300, 1093934, 1117587, 1142136, 1168016, 1195702, 1224844]
53321A224844K9468K8853K8102K7632K7366K7353K7800K8484K8712K8129K7144
53310A533887K6323K5675K4789K3487K1995K0456J8568J5964J2906J0260Q495
53299A742805O984M750J783r81l012m946p556j0639j3431j5707j7759j9577k0758
53286A641956k1241k1582k2248k3103k3686k3805k3679k3625k3723k3775k3622
53275A387867k3359k3096k2661k1911k1272k1309k1757k1646k0649j9536j8857
53264A151814j8003j6306j4314j3000j2201j1038r554q710q744q707p992p224
53252A016021p191p707q113q274q373q205p339n925m806m807n933p258p605o581
53238I17904m882l439k422j477n70J7L72R26J704K317K755L408M219M662M748
$$ y = [1224844, 1254312, 1283165, 1311267, 1338899, 1366265, 1393618, 1421418, 1449902, 1478614, 1506743, 1533887, 1560210, 1585885, 1610674, 1634161, 1656156, 1676612, 1695180, 1711144, 1724050, 1734310, 1742805, 1749789, 1754539, 1756322, 1755341, 1752329, 1747383, 1739827, 1729188, 1715757, 1700050, 1682291, 1662714, 1641956, 1620715, 1599133, 1576885, 1553782, 1530096, 1506291, 1482612, 1458987, 1435264, 1411489, 1387867, 1364508, 1341412, 1318751, 1296840, 1275568, 1254259, 1232502, 1210856, 1190207, 1170671, 1151814, 1133811, 1117505, 1103191, 1090191, 1077990, 1066952, 1057398, 1048688, 1039944, 1031237, 1023245, 1016021, 1008830, 1001123, 993010, 984736, 976363, 968158, 960819, 954894, 950088, 945281, 939348, 932090, 924485, 917904, 913022, 909583, 907161, 905684, 905114, 905131, 905503, 906429, 908133, 910450, 913205, 916613, 920832, 925494, 930242]
53223I30242N256O512P839Q680R437J0540J1426J1366J0722J0492J0876J1133
53211A044521J0737R884Q976Q237P760P388O642N285L829K864K161J106j67r78
53197A118245j431k519m615o742p898q341q975r970j0827j1440j2229j3237j3803
53184A006218j3538j2942j2819j3293j3818j3924j3600j3013j2311j1711j1461
53173H63788j1456j1190j0366r416r106r658j0541j1077j0990j0316r188p874
53161G42610o748n999n463m946m544m492m803n228n456n319m918m629m814n382
53147F69869n850n929n830n848n917n879n971o619p762q747r041q754q418q385
53133E70919q553q649q587q570q783r074r048q551p941p744q135q790r217r142
$$ y = [930242, 935498, 942010, 949849, 958529, 967966, 978506, 989932, 1001298, 1012020, 1022512, 1033388, 1044521, 1055258, 1065142, 1074118, 1082355, 1090115, 1097503, 1104145, 1109430, 1113259, 1116123, 1118284, 1119390, 1119223, 1118245, 1116814, 1114295, 1109680, 1102938, 1095040, 1086699, 1077724, 1067754, 1056927, 1045487, 1033258, 1020021, 1006218, 992680, 979738, 966919, 953626, 939808, 925884, 912284, 899271, 886960, 875249, 863788, 852332, 841142, 830776, 821360, 812254, 802596, 792055, 780978, 769988, 759672, 750484, 742610, 735862, 729863, 724400, 719454, 714910, 710418, 705615, 700387, 694931, 689612, 684694, 680065, 675251, 669869, 664019, 658090, 652260, 646412, 640495, 634616, 628645, 622026, 614264, 605517, 596476, 587722, 579304, 570919, 562366, 553717, 545130, 536560, 527777, 518703, 509655, 501104, 493163, 485419, 477284, 468494, 459277, 450135]
53119D50135q632p926p214o637o460o995q105q984q833p781o758o387o410o306
53105C46707n985n588n071m421l984m047m317m276l961l889m250m670m793m640
53091B82815m313l787l178k854k985l269l313l089k790k435j986j676j865k442
53077B42833k745k258j282o21n99p14l27M36P86K38p79j419j373j057r63r61n07
53060B28688N34J506J625R46L58M82R62J129R89J028J213R20Qp19n26J70K21r07
53042B38627k588l698l637k772k143k540l728m690m722m109l550l302l170l038
53028A90940l025l178l337l300k989k598k609l345m326m511l491k085j260r63
53014A49923n26J03L28q3p15j241j714j996j745j141r79j580k239k172j541j038
$$ y = [450135, 441503, 433577, 426363, 419726, 413266, 406271, 398166, 389182, 380349, 372568, 365810, 359423, 353013, 346707, 340722, 335134, 330063, 325642, 321658, 317611, 313294, 309018, 305057, 301168, 296918, 292248, 287455, 282815, 278502, 274715, 271537, 268683, 265698, 262429, 259116, 256027, 253237, 250802, 248816, 247140, 245275, 242833, 240088, 237830, 236548, 235927, 235328, 234614, 234287, 234723, 235509, 235747, 234968, 233549, 232176, 231119, 230156, 229195, 228688, 229222, 230728, 232353, 233299, 233657, 234139, 235101, 236230, 237219, 238247, 239460, 240380, 240388, 239669, 239143, 239313, 239534, 238627, 236039, 232341, 228704, 225932, 223789, 221249, 217521, 212831, 208109, 204000, 200450, 197148, 193978, 190940, 187915, 184737, 181400, 178100, 175111, 172513, 169904, 166559, 162233, 157722, 154231, 152146, 150886, 149923, 149397, 149500, 149828, 149745, 149030, 147789, 146075, 144079, 142334, 141193, 140214, 138634, 136395, 134223, 132682, 131644]
52998A31644q76p54n59n01o74r93j496k202k633k050m26J167J545O08o68j340
52982A19792j301r70o08j66K67K61n26j830k842k850j822m13N66O93R5q43j713
52965A05790k109j722o57M46R70R05O74M41K7n20p84n93k81j54p3R6J30p7j36
52946A02373K52O69N05j62p39r50q97n44J30O15K95n65r69m79L50R44J394J879
52928A04101K103J784J171O22J59j91m1P76J668J948J755J745J997J975J531J291
52912A24394J741K464K683K267J827J896K380K828K977K868K627K333K013J568
52898A56866Q11k23j008r59k29K86K5o08r12q73r76j353j688j856k007k146k138
52881A41012k164k497k866k647j867j259j201j162n96K57Q03Q40M61j95p38n85
$$ y = [131644, 130768, 130014, 129455, 128954, 128280, 127287, 125791, 123589, 120956, 118906, 118480, 119647, 121192, 121800, 121132, 119792, 118491, 117521, 116913, 116747, 117014, 117275, 116749, 114919, 112077, 109227, 107405, 106992, 107558, 108251, 108346, 107503, 105790, 103681, 101959, 101302, 101748, 102718, 103623, 104297, 104738, 104765, 104245, 103461, 102868, 102587, 102433, 102360, 102456, 102586, 102509, 102373, 102625, 103294, 103799, 103637, 102898, 101948, 101051, 100507, 100637, 101252, 101547, 100982, 100013, 99534, 99884, 100828, 102222, 104101, 106204, 107988, 109159, 109781, 109940, 109749, 109708, 110484, 112152, 114100, 115855, 117600, 119597, 121572, 123103, 124394, 126135, 128599, 131282, 133549, 135376, 137272, 139652, 142480, 145457, 148325, 150952, 153285, 155298, 156866, 157677, 157454, 156446, 155487, 155258, 155544, 155569, 154961, 154049, 153176, 152200, 150847, 149159, 147303, 145296, 143150, 141012, 138848, 136351, 133485, 130838, 128971, 127712, 126511, 125349, 124753, 125010, 125813, 126653, 127114, 126919, 126181, 125596]
52865A25596K55R09P29J59l0J04Kk50o0N80R59O47l0o31j037j112o01L43J035
52846A27567R96M73Jk03j73P0M07N13K29r6M6O71J275J485J472J614J895J860
52828A40102J246M19kQ2K36J84J72L93N59L78J43K85O45P09M92M88P66Q03L82
52809A48482Q9M37J039J117O30L22P43J601K183K175J916J881K062J929J190M13
52793A68209N41J758L137L665L269K556J934J411J094J286J967K620K774K456
52779A98677J997J578J207R45Q74R10Q43N55J08l41n77m55j41j61q97k023k739
52762B00360k653k215k106k448k851l016k949k671k107j436j141j526k224k496
52748A68521k007j182p65j047j527j424n70K49Pj425l013l517k669j387q03j146
$$ y = [125596, 125851, 126760, 127489, 127648, 127618, 127722, 127724, 127474, 127414, 127994, 128953, 129600, 129570, 128939, 127902, 126790, 126189, 126532, 127567, 128563, 129036, 129037, 128834, 128661, 128731, 129138, 129651, 129880, 129784, 129830, 130501, 131776, 133261, 134733, 136347, 138242, 140102, 141348, 141767, 141765, 141847, 142083, 142267, 142439, 142832, 143391, 143769, 143912, 144197, 144842, 145551, 146043, 146531, 147297, 148100, 148482, 148571, 149008, 150047, 151164, 151794, 152116, 152859, 154460, 156643, 158818, 160734, 162615, 164677, 166606, 167796, 168209, 168750, 170508, 173645, 177310, 180579, 183135, 185069, 186480, 187574, 188860, 190827, 193447, 196221, 198677, 200674, 202252, 203459, 204404, 205278, 206188, 207031, 207586, 207694, 207353, 206776, 206321, 206180, 206019, 205122, 203099, 200360, 197707, 195492, 193386, 190938, 188087, 185071, 182122, 179451, 177344, 175908, 174767, 173241, 171017, 168521, 166514, 165332, 164567, 163520, 161993, 160569, 159999, 160248, 160255, 158830, 155817, 152300, 149631, 148244, 147441, 146295]
52732A46295j630j424n91Q0J03k23m32n99j000j413j324p37k28j58k94l67m90
52715A35568p95j069j108j094j294j548j446r11l61k64o93j249j477j341j196
52700A19722j140p41J92Q90M19r11j766j581j158j218j336r85o53r71j456j219
52684A06088m90k18m65l83K10M41j94j065j400j227r27o05l11k57m26m78m00o38
52666I7255j307j786j516p08Q3N50N97K59l2K66Q94Q53j40j056j011n68o64r66
52648I1003m90O28J229J011R93J814K677K530J544P07N44Q42J238J531J586J436
52632A10823J317J359J308Q80K29k30l54l40l77m62n57o42o46n02l19l19n92j034
52614A09542j549k156k808l233l118k488j867j881k580l221k909j526K8O62J17
$$ y = [146295, 144665, 143241, 142650, 142730, 142833, 142610, 142178, 141579, 140579, 139166, 137842, 137105, 136877, 136719, 136425, 136058, 135568, 134773, 133704, 132596, 131502, 130208, 128660, 127214, 126303, 125942, 125678, 124985, 123736, 122259, 120918, 119722, 118582, 117841, 118033, 118923, 119342, 118431, 116665, 115084, 113926, 112708, 111372, 110387, 109734, 108763, 107307, 106088, 105598, 105380, 104915, 104532, 104742, 105183, 104989, 103924, 102524, 101297, 100370, 99765, 99454, 99197, 98771, 98293, 97893, 97255, 95948, 94162, 92646, 91938, 92021, 92571, 93168, 93427, 93395, 93661, 94555, 95408, 95268, 94212, 93201, 92633, 91969, 91003, 90513, 91141, 92370, 93381, 94374, 96188, 98865, 101395, 102939, 103646, 104190, 105032, 106270, 107801, 109387, 110823, 112140, 113499, 114807, 115687, 115916, 115686, 115332, 114992, 114615, 114153, 113596, 112954, 112308, 111806, 111487, 111168, 110576, 109542, 107993, 105837, 103029, 99796, 96678, 94190, 92323, 90442, 87862, 84641, 81732, 80206, 80234, 80896, 81013]
52599H1013r00j514j473j125q15n08o3L35L11j60n75n07j98k78q86j421j284o38
52581F9314j95l56q03r65o35p9L34M84M84M71M46L37J69O7R2J06q3m64q06q33
52561F7085m01L95J155J324O92j88m52R4P30P53L09l0j91n07q97q47k86J47N9
52542F8944p6L26J100J715K073K299K111J198N6m19k50l84j178j699j075J88R21
52525G5850Q18N34N02M94L06J82L04M22L00J67M05R94J520J680J539J362J345
52508H8724J449J432J071M18j60l00M2O11J088J250R78L55k60l95L6N44O03L15
52490I7801K96P99J316J263Q37P78J424K361K936K804J982Q28j8j09K54L55O7
52473A15974J8N22R47O34l6j78L01P09P17P07R35J055P60K55j89n96q54n29L94
$$ y = [81013, 80113, 78599, 77126, 76001, 75186, 74678, 74615, 74950, 75261, 75101, 74526, 74019, 73821, 73543, 72657, 71236, 69952, 69314, 69119, 68763, 67960, 66995, 66360, 66281, 66615, 67099, 67583, 68054, 68500, 68837, 69006, 69073, 69165, 69271, 69188, 68724, 67918, 67085, 66684, 67079, 68234, 69558, 70250, 70062, 69610, 69704, 70434, 71187, 71496, 71466, 71275, 70768, 69871, 69024, 68738, 68885, 68944, 68868, 69194, 70294, 72009, 74082, 76381, 78492, 79690, 79746, 79327, 79077, 78693, 77515, 75816, 74741, 74929, 75850, 76668, 77202, 77704, 78198, 78504, 78686, 78990, 79412, 79712, 79879, 80284, 81278, 82798, 84478, 86017, 87379, 88724, 90173, 91605, 92676, 93094, 92934, 92634, 92676, 93287, 94375, 95625, 96603, 96958, 96698, 96303, 96339, 96883, 97486, 97801, 98097, 98896, 100212, 101475, 102312, 103090, 104514, 106875, 109811, 112615, 114597, 115425, 115407, 115298, 115552, 115907, 115974, 115992, 116514, 117461, 118095, 118059, 117881, 118182, 118891, 119608, 120315, 121250, 122305, 123065, 123320, 123131, 122535, 121681, 121152, 121546]
52454A21546J116R84M56M16P55N50l67r51m11P03J347J324J132R53N97K03J44
52437A30497K85J07k89j94M45O21k93j380j354l59L42K44J18N82J144J141P94
52420A32451P09Q62P81M94N46J127J684J575P66j74o50n12q6K49M71Q08J246J426
52402A43773J132N87J00k62m46k44L62R55J156J044Q17L61l38o79j1J360K392
52385A52059K543K175J782J393R41N83M21L33L07N08Q08P86M60M40J013J514J230
52368A69296M75J70N54J007J080J016J123J253J155R61R31R51O74Pp46j217j218
52351A77472p16J29Q37P93j30j163j273k98P64Q50L6o98p16l63k88o46j130j487
52333A71973j638j518j115n61l2L58M53Q2o28j178j215r27o52l14L29J077J375
$$ y = [121546, 122662, 123646, 124102, 124518, 125273, 125823, 125456, 124505, 124094, 124797, 126144, 127468, 128600, 129553, 130150, 130353, 130497, 130782, 130889, 130600, 130406, 130851, 131472, 131179, 129799, 128445, 128086, 128428, 128672, 128790, 129372, 130516, 131657, 132451, 133160, 134022, 134803, 135297, 135843, 136970, 138654, 140229, 140995, 140821, 140171, 139659, 139573, 139822, 140293, 141101, 142347, 143773, 144905, 145492, 145592, 145330, 144884, 144640, 145002, 145957, 147113, 148157, 148974, 149335, 148997, 148318, 148307, 149667, 152059, 154602, 156777, 158559, 159952, 160893, 161476, 161897, 162230, 162537, 163045, 163853, 164639, 165099, 165539, 166552, 168066, 169296, 169771, 169941, 170495, 171502, 172582, 173598, 174721, 175974, 177129, 178090, 179021, 179972, 180646, 180653, 179907, 178690, 177472, 176756, 176885, 177722, 178515, 178385, 177222, 175949, 175651, 176415, 177265, 177301, 176603, 175887, 175524, 175236, 174590, 173460, 171973, 170335, 168817, 167702, 167141, 167109, 167467, 167920, 168002, 167374, 166196, 164981, 164054, 163402, 163088, 163417, 164494, 165869]
52316A65869J025L45l64j059j561j521r46l56m7L57J146J754J370J96o24m23K65
52299A65426O48P15Q70J005O45j16n37j85N43J079J358J574J664J506J348J561
52283A79104K054K417K536K641K711K406J687J043P98O60L19J16O47J801K809
52268B03749L172L125L041K845K311J670J475J835K148J832J125Q79J548K689
52254B33444L530L785L694L572L672M285N469O677P224P117P044P427P976Q361
52240C13277Q714R155R379R197R076R581J0601J1601J2378J2995J3281J3056J2715
52227D55006J2917J3727J4591J5116J5291J5087J4432J3644J3177J2948J2519
52216F08455J1985J1859J2030J1657J0493R382Q928Q494P220N436M199L800L644
$$ y = [165869, 166894, 167239, 166875, 165816, 164255, 162734, 161788, 161432, 161385, 161742, 162888, 164642, 166012, 166208, 165584, 165161, 165426, 166074, 166789, 167659, 168664, 169309, 169193, 168656, 168471, 169014, 170093, 171451, 173025, 174689, 176195, 177543, 179104, 181158, 183575, 186111, 188752, 191463, 193869, 195556, 196599, 197397, 198057, 198376, 198492, 199139, 200940, 203749, 206921, 210046, 213087, 215932, 218243, 219913, 221388, 223223, 225371, 227203, 228328, 229207, 230755, 233444, 236974, 240759, 244453, 248025, 251697, 255982, 261451, 268128, 275352, 282469, 289513, 296940, 304916, 313277, 321991, 331146, 340525, 349722, 358798, 368379, 378980, 390581, 402959, 415954, 429235, 442291, 455006, 467923, 481650, 496241, 511357, 526648, 541735, 556167, 569811, 582988, 595936, 608455, 620440, 632299, 644329, 655986, 666479, 675861, 684789, 693283, 700503, 705939, 710138, 713938, 717582]
52203G17582L404L459L961M245L483J680k30j264j308j168j538k091j987j224
52189G27004p53j021j149j76J459K528K573K137J736J546J958L372N327O737P246
52174G60524P600Q415R290R513R007Q158P226O379N831N548N106M228L165K250
52160H52240J412M62m43j001j232j431j817k501l563m971o514q045r523j0703
52146H02370j1155j0889j0575j0801j1396j1805j1866j1805j1686j1386j0929
52135F78077j0472r991r359q704q265p939p385o602o042o050o443o742o576n859
52121E71648m778l728l087k898k888k833k785k905l173l392l402l200k845k343
52107E27391j756j356j467k027k511k467k007j576j407j415j469j488j475j764
$$ y = [717582, 720986, 724445, 728406, 732651, 736134, 737814, 737584, 736320, 735012, 733844, 732306, 730215, 728228, 727004, 726251, 725230, 724081, 723905, 725364, 727892, 730465, 732602, 734338, 735884, 737842, 741214, 746541, 753278, 760524, 768124, 776539, 785829, 795342, 804349, 812507, 819733, 826112, 831943, 837491, 842597, 846825, 849990, 852240, 853652, 854114, 853671, 852670, 851438, 850007, 848190, 845689, 842126, 837155, 830641, 822596, 813073, 802370, 791215, 780326, 769751, 758950, 747554, 735749, 723883, 712078, 700392, 689006, 678077, 667605, 657614, 648255, 639551, 631286, 623347, 615962, 609360, 603318, 597268, 590825, 584083, 577507, 571648, 566870, 563142, 560055, 557157, 554269, 551436, 548651, 545746, 542573, 539181, 535779, 532579, 529734, 527391, 525635, 524279, 522812, 520785, 518274, 515807, 513800, 512224, 510817, 509402, 507933, 506445, 504970, 503206]
52093E03206k841m373m905l420j021J14n35j364j145n60n58o22M0P21J77j283
52077D81631k220k208k073k082j513k45O71N13j68o05q34j149j457j699k113k582
52061D61867k511j789j125r13n96L07J316J815K035K390K597K320K191L099M795
52046D77798O161O729P024P429P711P796Q282R716J1780J3497J4150J3890J3592
52033F05555J4051J5193J6198J6544J6577J6781J6917J6428J5474J4894J5168
52022G79780J5871J6206J5773J4713J3435J2127J0542Q431O281N104N164N329
52010I08756M310K171Qj543k756l943m984n769o396o844p008p136p628q333q586
51995H44319q124p402o871o470o036n657n387n023m380l466k266p85O27J521J978
$$ y = [503206, 500365, 495992, 491087, 487667, 486646, 486760, 486225, 484861, 483716, 483156, 482598, 481976, 482016, 482737, 482914, 481631, 479411, 477203, 475130, 473048, 471535, 471290, 471961, 472474, 472306, 471701, 470867, 469718, 468261, 466562, 464449, 461867, 459356, 457567, 456442, 455529, 454933, 455240, 456556, 458371, 460406, 462796, 465393, 467713, 469904, 473003, 477798, 483959, 490688, 497712, 505141, 512852, 520648, 528930, 538646, 550426, 563923, 578073, 591963, 605555, 619606, 634799, 650997, 667541, 684118, 700899, 717816, 734244, 749718, 764612, 779780, 795651, 811857, 827630, 842343, 855778, 867905, 878447, 886878, 893159, 898263, 903427, 908756, 913066, 915237, 915245, 913702, 910946, 907003, 902019, 896250, 889854, 883010, 876002, 868866, 861238, 852905, 844319, 836195, 828793, 821922, 815452, 809416, 803759, 798372, 793349, 788969, 785503, 783237, 782452, 783079, 784600, 786578]
51980G86578K541L330L910M128M462N153N676N582N272N340N595N401M703M033
51966H51704L688L508L340L162K773J922P95r8n79j055k025l580n412p091q316
51951H42736r136r866j0641j1210j1387j1509j2048j2955j3794j4443j5132j5832
51939F94783j6180j6130j6217j6788j7436j7538j7078j6554j6225j5905j5453
51928E13279j5006j4637j4117j3298j2536j2411j2992j3662j3765j3245j2513
51917C65097j1800j0951r850q725p897p374o920o465o174o186o423o747p050p146
51903B55389o775n904m936m374m371m704n137n531n560m799l344k106j984k813
51889A93051l522l418k865k510k384k151j882j943k269k285j728j050q47j167
$$ y = [786578, 789119, 792449, 796359, 800487, 804949, 810102, 815778, 821360, 826632, 831972, 837567, 842968, 847671, 851704, 855392, 858900, 862240, 865402, 868175, 870097, 870892, 870794, 870215, 869160, 867135, 863555, 858143, 851052, 842736, 833600, 823734, 813093, 801883, 790496, 778987, 766939, 753984, 740190, 725747, 710615, 694783, 678603, 662473, 646256, 629468, 612032, 594494, 577416, 560862, 544637, 528732, 513279, 498273, 483636, 469519, 456221, 443685, 431274, 418282, 404620, 390855, 377610, 365097, 353297, 342346, 332496, 323771, 315874, 308500, 301580, 295115, 288941, 282755, 276332, 269585, 262535, 255389, 248614, 242710, 237774, 233400, 229029, 224325, 219188, 213657, 208097, 203298, 199954, 197848, 195864, 193051, 189529, 186111, 183246, 180736, 178352, 176201, 174319, 172376, 170107, 167822, 166094, 165044, 164197, 163030]
51875A63030j547j550j137o98p72j477k180k046j027j2J92k48n48k61M00R80J148
51858A52247P88P0n52p44p06r25j459j773j408o37j48k50n79p08p01q89j224j294
51840A39108r97p83j030j494j713j664j611j474r72l06r0m80r50j096j096j072
51824A22280o35M02J346J314M11m20o37o06q00j032p87J4Q46J129Q04M02M85J042
51806A25558J497J385Q63M48M29O94R21Q24L21l07o50o10m27j79L85J229J745
51789A34126J489R07P41J053J327J367J381J365J066O56O81J246J772J750J226
51774A52153M69l02p16m64O3L7o19r47k83Q25J485J636J703J644J176N28J40j84
51756A58344r16j726j695p13J94K13k93n32l29n3O0l2l82q49r71m85J97M30J66
$$ y = [163030, 161483, 159933, 158796, 158098, 157326, 155849, 153669, 151623, 150596, 150584, 150776, 150528, 149980, 149719, 150119, 151099, 152247, 153035, 153105, 152553, 151809, 151103, 150178, 148719, 146946, 145538, 144901, 144753, 144503, 143924, 143216, 142515, 141626, 140402, 139108, 138111, 137328, 136298, 134804, 133091, 131427, 129816, 128342, 127370, 127064, 126974, 126494, 125544, 124448, 123352, 122280, 121645, 122047, 123393, 124707, 125118, 124698, 124061, 123455, 122655, 121623, 120836, 120850, 121696, 122825, 123629, 124031, 124516, 125558, 127055, 128440, 129303, 129751, 130180, 130874, 131795, 132619, 132940, 132633, 131983, 131373, 130946, 130767, 131152, 132381, 134126, 135615, 136522, 137263, 138316, 139643, 141010, 142391, 143756, 144822, 145478, 146159, 147405, 149177, 150927, 152153, 152622, 152320, 151604, 151140, 151203, 151240, 150621, 149674, 149391, 150216, 151701, 153337, 155040, 156684, 157860, 158388, 158528, 158344, 157428, 155702, 154007, 153294, 153488, 153701, 153408, 152876, 152547, 152494, 152554, 152522, 152140, 151291, 150320, 149835, 150032, 150462, 150628]
51737A50628q5N8M76Q54J012R40P24M79J80l15r37j258r65l35N9P9M7J08l2n39
51717A51178j052j075n93j8K91K79N4k68n64o79m52R0N84N21j34o76m24K84M16
51698A47762k89q50m05N36R10P00Q41J642K274K107J676J782K233K141J254L32
51682A64646K44J076K176K850K955K957L386M182M758M782M664N003N817O589
51668B16085O879O631O071N643N829O632P367P413P000O750O560N768M399L376
51654C02403L127K775J418m37j564j798k107k990l762l730l216k889k776k551
51640B81903k340k494k798k610j819r85m83j39J73J44l60q47q11m06n6L41J236
51623B67649K612L930M809N258N275M711L696K712K045J562J143R01P71M20r2
$$ y = [150628, 150543, 150601, 151077, 151931, 152943, 153883, 154607, 155086, 155266, 154951, 154014, 152756, 151791, 151456, 151515, 151594, 151641, 151749, 151717, 151178, 150126, 149051, 148458, 148440, 148731, 149010, 149064, 148796, 148232, 147553, 147101, 147191, 147775, 148296, 148162, 147486, 147062, 147346, 147762, 147473, 146623, 146218, 146754, 147664, 148364, 149205, 150847, 153121, 155228, 156904, 158686, 160919, 163060, 164314, 164646, 164890, 165966, 168142, 170992, 173947, 176904, 180290, 184472, 189230, 194012, 198676, 203679, 209496, 216085, 222964, 229595, 235666, 241309, 247138, 253770, 261137, 268550, 275550, 282300, 288860, 294628, 299027, 302403, 305530, 308305, 309723, 309286, 307722, 305924, 303817, 300827, 297065, 293335, 290119, 287230, 284454, 281903, 279563, 277069, 274271, 271661, 269842, 268857, 268374, 268235, 268408, 268552, 268192, 267345, 266534, 266128, 266072, 266413, 267649, 270261, 274191, 279000, 284258, 289533, 294244, 297940, 300652, 302697, 304259, 305402, 306303, 307074, 307494, 307402]
51608C07402q6P88J764J763Q57K70Q39K054K825K738K254J989K187K751L321L377
51592C37093K613J454R26J593K761L083K079O03l33p39j180j659j740j639k169
51577C42746l406m283l986l068k620k895l361l695l937m023l853l663l692l635
51563B92629l126k588k841l833m604m556m024l455k844k259k183k776l391l333
51549B46816k720k124j686j104l27K39J98m46j270j774j760j491j288j098o96
51534B29469k74k70n88o21k11O2j45k90J83R28J263J231J375J778J992J804J467
51517B39153J211J126J419K209L060L297K885K530K785L416L772L465K607J674
51503B74609J152J106J129Q73M94K63M4m21r73j316j610k113k433j970j061p57
$$ y = [307402, 307316, 308104, 309868, 311631, 312488, 312758, 313597, 315651, 318476, 321214, 323468, 325457, 327644, 330395, 333716, 337093, 339706, 341160, 342086, 343679, 346440, 349523, 351602, 352205, 351872, 351133, 349953, 348294, 346554, 344915, 342746, 339340, 335057, 331071, 328003, 325383, 322488, 319127, 315432, 311495, 307472, 303619, 299956, 296264, 292629, 289503, 286915, 284074, 280241, 275637, 271081, 267057, 263602, 260758, 258499, 256316, 253540, 250149, 246816, 244096, 241972, 240286, 239182, 238855, 239094, 239292, 238846, 237576, 235802, 234042, 232551, 231263, 230165, 229469, 229195, 228925, 228337, 227716, 227505, 227567, 227422, 227132, 227315, 228243, 229506, 230737, 232112, 233890, 235882, 237686, 239153, 240364, 241490, 242909, 245118, 248178, 251475, 254360, 256890, 259675, 263091, 266863, 270328, 272935, 274609, 275761, 276867, 277996, 278869, 279363, 279626, 279670, 279249, 278276, 276960, 275350, 273237, 270804, 268834, 267773, 267016]
51487B67016j286j638j101k82m3j71M9N79Q71R92J558K586L312L259K797K452
51471B80950K291K265K595L431M338M589L861K586J578J357J702J877J408N42
51457C15370j81n92p77n66K71J289J493M73j020j941k040j765j458j126q48q46
51441C05736j157j513j661j607j541j650j973k245k066j442r81j252k051k700
51427B81897k891k822k637k267j975k278l103l625l290k592k285k340k197j747
51413B45848j331j014n77j75j96m33j17R36J949K278K237K421K791L031L286L804
51397B64738M182L858L211L329M485N661N899N453N118M915M232L037K189K350
51383C22657L118L577L438L156L071K955K565K216K291K430J845N34l96p4R81
$$ y = [267016, 265730, 264092, 262991, 262709, 262666, 262495, 262544, 263123, 263994, 264986, 266544, 269130, 272442, 275701, 278498, 280950, 283241, 285506, 288101, 291532, 295870, 300459, 304320, 306906, 308484, 309841, 311543, 313420, 314828, 315370, 315189, 314597, 313820, 313254, 313525, 314814, 316307, 316780, 315760, 313819, 311779, 310014, 308556, 307430, 306582, 305736, 304579, 303066, 301405, 299798, 298257, 296607, 294634, 292389, 290323, 288881, 287900, 286648, 284597, 281897, 279006, 276184, 273547, 271280, 269305, 267027, 263924, 260299, 257009, 254417, 252132, 249792, 247595, 245848, 244517, 243503, 242926, 242751, 242555, 242122, 242005, 242941, 244890, 247168, 249405, 251826, 254617, 257648, 260934, 264738, 268920, 272778, 275989, 279318, 283803, 289464, 295363, 300816, 305934, 310849, 315081, 318118, 320307, 322657, 325775, 329352, 332790, 335946, 339017, 341972, 344537, 346753, 349044, 351474, 353319, 353853, 353457, 353383, 354364]
51368C54364J604J547J571K074K477K263J847J882K207K130J493Q30N19L88J97
51353C77393k8k68o55j104j176o56J6J70l00r23j282j410j540j750j906j816j416
51336C61349r51q88j441k167k347j811j139q63p98m49P6J17n82j374j453q58l76
51319C44045n89j255j668j352m08N96R64L28j010k319l120l534l868m091m021
51304C18698l836l993m600n267n690n996o305o342n933n483n525n861n813n242
51290B42812m705m480m129l371k718k729l098l135k829k696k794k692k415k537
51276A98484l132l395k825k021j792j931j615p70j53j88m11k81Q9K56Q6k74p25
51259A79402j154j228o53L55J146J280R44O82Q00J124J358J514J873K489K951
$$ y = [354364, 355968, 357515, 359086, 361160, 363637, 365900, 367747, 369629, 371836, 373966, 375459, 376289, 376808, 377196, 377393, 377365, 377097, 376442, 375338, 374162, 373506, 373522, 373692, 373392, 372469, 371187, 369777, 368237, 366487, 364581, 362765, 361349, 360398, 359510, 358069, 355902, 353555, 351744, 350605, 349742, 348944, 348495, 348571, 348688, 348106, 346732, 345279, 344421, 344045, 343456, 342201, 340533, 339181, 338773, 339369, 340333, 340661, 339651, 337332, 334212, 330678, 326810, 322719, 318698, 314862, 310869, 306269, 301002, 295312, 289316, 283011, 276669, 270736, 265253, 259728, 253867, 248054, 242812, 238107, 233627, 229498, 226127, 223409, 220680, 217582, 214447, 211618, 208922, 206128, 203436, 201021, 198484, 195352, 191957, 189132, 187111, 185319, 183388, 181773, 181003, 180850, 180662, 180251, 179970, 180059, 180315, 180401, 180127, 179402, 178248, 177020, 176367, 176722, 177868, 179148, 180092, 180774, 181574, 182698, 184056, 185570, 187443, 189932, 192883]
51244A92883K801K124J535J556K117K746L050K974K700K427K236K111K086K260
51230B25606K547K558J945R46K15L4p9o84j646k362k623k832l293l789l974l887
51214B08682l810l824l757l445k845k104j670k058l217m352m743m563m469m582
51200A59243m408l754l010k445j902j441j555k253k656k099j201r63j254j090
51186A29212k54M04L31j2j29k36n65o73j16O95R61N65N1j97k14o9K35N62P05O38
51166A31894L80k04j067j609j215j35P01Q22P23J004J471J476Q44Q2l35m81o22
51149A33729o36k22L87M09m81j509j674j081p05r25j023l38P66J533J730J493
51133A31453P92k96j247j658j812k106k215j596m82L17N01M41M15M04N34Q91J024
$$ y = [192883, 195684, 197808, 199343, 200899, 203016, 205762, 208812, 211786, 214486, 216913, 219149, 221260, 223346, 225606, 228153, 230711, 232656, 233602, 233817, 233851, 233772, 233088, 231442, 229080, 226457, 223625, 220332, 216543, 212569, 208682, 204872, 201048, 197291, 193846, 191001, 188897, 187227, 185169, 181952, 177600, 172857, 168294, 163825, 159243, 154835, 151081, 148071, 145626, 143724, 142283, 140728, 138475, 135819, 133720, 132519, 131556, 130302, 129212, 128958, 129362, 129693, 129681, 129552, 129316, 128751, 128078, 127962, 128657, 129618, 130183, 130234, 130037, 129823, 129754, 129989, 130551, 131256, 131894, 132274, 132070, 131003, 129394, 128179, 128044, 128745, 129567, 130290, 131294, 132765, 134241, 135085, 135167, 134832, 134351, 133729, 133093, 132871, 133258, 133667, 133186, 131677, 130003, 128922, 128217, 127292, 126269, 125931, 126697, 128230, 129960, 131453, 132245, 131949, 130702, 129044, 127232, 125126, 122911, 121315, 120833, 121150, 121651, 122092, 122507, 122911, 123445, 124336, 125360]
51116A25360M08n91j066q71p28r82j228j300j575j987j728n48O93J238J374J484
51100A17953J144J1j123j237m64K97O98R50R72N47L3j02k29r99j968j940p09N86
51082A14420J034R07P32M18j89o61n97l63o28j459k273k508k088j380r09q52p59
51065A02845j11Q25J246R44O17Q02J177J287J316J573J736J278L78k25j65L10
51049A15833Q20J156J154Q45O49R92J713K219K205J859J400Q72L57l1l85q25j085
51032A29748p20J40P35O50L50M45P88P94L79K9Jjk28m25k87k5j49p10j202j185
51012A29127p84m03k50k93n05q45j063q58k47M25R04J188J273J001M11r6k16j85
50994A28584m15q12q39l00K89L09k14o48m33L92J246J535J163O42N71R69J247
$$ y = [125360, 125768, 125177, 124111, 123240, 122512, 121530, 120302, 119002, 117427, 115440, 113712, 113164, 113857, 115095, 116469, 117953, 119097, 119108, 117985, 116748, 116284, 116581, 117279, 118229, 119201, 119748, 119781, 119679, 119450, 118451, 116483, 114543, 113834, 114420, 115454, 116361, 117093, 117511, 117322, 116661, 116064, 115701, 115073, 113614, 111341, 108833, 106745, 105365, 104456, 103604, 102845, 102734, 103559, 104805, 105749, 106366, 107168, 108345, 109632, 110948, 112521, 114257, 115535, 115913, 115688, 115523, 115833, 116653, 117809, 118963, 119808, 120457, 121449, 123162, 125381, 127586, 129445, 130845, 131717, 132074, 132043, 131658, 130833, 129748, 129028, 129168, 129903, 130553, 130903, 131348, 132136, 132930, 133309, 133338, 133339, 133338, 133110, 132685, 132398, 132373, 132224, 131514, 130312, 129127, 128343, 127940, 127690, 127397, 126892, 126047, 124984, 124126, 123879, 124304, 125208, 126396, 127669, 128670, 129081, 128985, 128769, 128584, 128169, 127357, 126518, 126218, 126507, 126816, 126602, 125954, 125521, 125913, 127159, 128694, 129857, 130499, 131070, 132039, 133286]
50977A33286R52L96L41J079K050K515K423K377K759L171K978K241J666J611J594
50962A61439J032J38l94l94l37m73l77L74J477K218K286J972J676J472J146N50
50946A73805r3k64L22J269J939K280K800L555L802L165K542L075M470N259M803
50931B12729M134M434N451O027N744N359N714O857Q275R557J0595J1377J1894
50918C08147J2294J2970J4322J6288J8294J9823K1039K2547K4637K6988K9204
50907E26553L1245L3266L5334L7522L9948M2519M4819M6575M7962M9196M9997
50896I84936M9805M8391M6050M3198L9994L6359L2212K7683K3079J8461J3434
50885A363602P731J910l116p261j1335j5658j9418k1843k3260k4322k4939k4854
$$ y = [133286, 134238, 134634, 134975, 136054, 138104, 140619, 143042, 145419, 148178, 151349, 154327, 156568, 158234, 159845, 161439, 162471, 162609, 162215, 161821, 161484, 161011, 160634, 161008, 162485, 164703, 166989, 168961, 170637, 172109, 173255, 173805, 173712, 173448, 173770, 175039, 176978, 179258, 182058, 185613, 189415, 192580, 195122, 198197, 202667, 207926, 212729, 216863, 221297, 226748, 232775, 238519, 243878, 249592, 256449, 264724, 274281, 284876, 296253, 308147, 320441, 333411, 347733, 364021, 382315, 402138, 423177, 445724, 470361, 497349, 526553, 557798, 591064, 626398, 663920, 703868, 746387, 791206, 837781, 885743, 934939, 984936, 1034741, 1083132, 1129182, 1172380, 1212374, 1248733, 1280945, 1308628, 1331707, 1350168, 1363602, 1371333, 1373243, 1370127, 1362866, 1351531, 1335873, 1316455, 1294612, 1271352, 1247030, 1222091, 1197237]
50873A197237k4636k5000k5495k5157k4230k4066k5178k6642k7642k8351k8926
50862I11914k8909k8242k7844k8287k8811k8483k7580k6986k6786k6429k5751
50851F07806k4928k3783k2025j9948j8081j6396j4610j3005j2098j1753j1382
50840D19797j0852j0311r364p447n016l300k732k544k098j652j468j124k84O30
50826C62235J161J627K574L814M648M766M532M535N228O664Q243R058Q882Q511
50812D36478Q864R967J1229J2301J3292J4380J5695J7338J9226K1073K2826K4802
50800F27471K7037K8969L0335L2020L5232L9976M5086M9746N4254N9168O4453
50789A093747O9811P5244Q0835Q6352R1485R6251J00768J04817J07864J09434
$$ y = [1197237, 1172601, 1147601, 1122106, 1096949, 1072719, 1048653, 1023475, 996833, 969191, 940840, 911914, 883005, 854763, 826919, 798632, 769821, 741338, 713758, 686772, 659986, 633557, 607806, 582878, 559095, 537070, 517122, 499041, 482645, 468035, 455030, 442932, 431179, 419797, 408945, 398634, 389270, 381823, 376807, 373507, 370775, 368231, 366133, 364481, 363013, 361889, 361605, 362235, 363396, 365023, 367597, 371411, 376059, 380825, 385357, 389892, 395120, 401784, 410027, 419085, 427967, 436478, 445342, 455309, 466538, 478839, 492131, 506511, 522206, 539544, 558770, 579843, 602669, 627471, 654508, 683477, 713812, 745832, 781064, 821040, 866126, 915872, 970126, 1029294, 1093747, 1163558, 1238802, 1319637, 1405989, 1497474, 1593725, 1694493, 1799310, 1907174, 2016608]
50779B016608J09266J07276J03551R8240R1282Q2493P1988O0295M7792L4426K0270
50768B843487O105p010j8640k9012l8238m5952n1766n5649n7804n8513n8208n7390
50756B371410n6340n5200n4348n4213n4620n4900n4900n5411n7165n9808o2361
50745A752144o4304o5627o6180o5754o4763o4004o3611o2862o1119n8447n5199
50734A060274n1653m8235m5386m2912m0068l6666l3434l0893k8585k5984k3547
50723F52911k2045k1278k0329j8779j6811j4409j1449q604p122p290p887p553
50711D89355o186m645l593l015k582k018j323p14l05J80J036J996K518K676L213
50696D76593M469N852O667P021P528Q466R684J1032J2463J3884J5183J6382J7554
$$ y = [2016608, 2125874, 2233150, 2336701, 2434941, 2526223, 2608716, 2680704, 2740999, 2788791, 2823217, 2843487, 2849592, 2842582, 2823942, 2794930, 2756692, 2710740, 2658974, 2603325, 2545521, 2487008, 2428800, 2371410, 2315070, 2259870, 2205522, 2151309, 2096689, 2041789, 1986889, 1931478, 1874313, 1814505, 1752144, 1687840, 1622213, 1556033, 1490279, 1425516, 1361512, 1297901, 1235039, 1173920, 1115473, 1060274, 1008621, 960386, 915000, 872088, 832020, 795354, 761920, 731027, 702442, 676458, 652911, 630866, 609588, 589259, 570480, 553669, 539260, 527811, 519207, 512085, 504795, 496908, 489355, 483169, 478524, 474931, 471916, 469334, 467316, 465993, 465279, 464974, 465154, 466190, 468186, 470704, 473380, 476593, 481062, 486914, 493581, 500602, 508130, 516596, 526280, 537312, 549775, 563659, 578842, 595224, 612778]
50683F12778J8780K0211K2039K4243K6695K9465L2667L5929L8658M0999M3878
50672I46342M7712N1679N4823N7336O0015O2916O5359O6984O7994O8429O7919
50661A617508O6220O3308N9001N3084M5872L8008K9635K0422J0484N50q936j8094
50649A977062k6661l3533l7895m0305m2058m3739m4969m5220m4384m2671m0568
50638A535059l8856l8127l8163l8219l7908l7588l7810l8719l9999m1123m1680
50627A106867m1712m1709m1905m1685m0186l7549l5002l3382l2121l0165k7448
50616G04003k4839k2871k1259j9659j8094j6460j4391j1978j0002q858p818o033
50604E21741l879k382j583m93J190K480K697K703L782N864P832R202J0572J2422
$$ y = [612778, 631558, 651769, 673808, 698051, 724746, 754211, 786878, 822807, 861465, 902464, 946342, 994054, 1045733, 1100556, 1157892, 1217907, 1280823, 1346182, 1413166, 1481160, 1549589, 1617508, 1683728, 1747036, 1806037, 1859121, 1904993, 1943001, 1972636, 1993058, 2003542, 2004092, 1995156, 1977062, 1950401, 1916868, 1878973, 1838668, 1796610, 1752871, 1707902, 1662682, 1618298, 1575627, 1535059, 1496203, 1458076, 1419913, 1381694, 1343786, 1306198, 1268388, 1229669, 1189670, 1148547, 1106867, 1065155, 1023446, 981541, 939856, 899670, 862121, 827119, 793737, 761616, 731451, 704003, 679164, 656293, 635034, 615375, 597281, 580821, 566430, 554452, 544450, 535592, 527774, 521741, 517862, 515480, 513897, 513404, 514594, 517074, 519771, 522474, 526256, 532120, 539952, 549154, 559726, 572148]
$$ [...]
##END NTUPLES=NMR SPECTRUM
##END=
