
##TITLE=AC1203_CTOAH12045_5946457_1FB8grXUvw
##JCAMPDX= 6.0         $$ Bruker NMR JCAMP-DX V2.0
##DATA TYPE= NMR SPECTRUM
##DATA CLASS= NTUPLES
##ORIGIN= BRUKER
##OWNER= Administrator
$$ 1.72 TOPSPIN		Version 2.1
$$ 2012-04-10 23:06:52.312 -0500  Administrator@TOPSPIN
$$ Compression mode = diff/dup
##.OBSERVE FREQUENCY= 400.13188235
##.OBSERVE NUCLEUS= ^1H
##.ACQUISITION MODE= SIMULTANEOUS (DQD)
##.ACQUISITION SCHEME= undefined
##.AVERAGES= 8
##.DIGITISER RES= 22
##SPECTROMETER/DATA SYSTEM= spect
##.PULSE SEQUENCE= zg30
##.SOLVENT NAME= COFFEE_meoh
##.SHIFT REFERENCE= INTERNAL, COFFEE_meoh, 1, 14.98061
##AUDIT TRAIL= $$ (NUMBER, WHEN, WHO, WHERE, PROCESS, VERSION, WHAT)
$$ ##TITLE= Audit trail, TOPSPIN		Version 2.1
$$ ##JCAMPDX= 5.01
$$ ##ORIGIN= Bruker BioSpin GmbH
$$ ##OWNER= Administrator
$$ $$ C:\Bruker\TOPSPIN/data/COFFEE/nmr/AC1203_CTOAH12045_5946457_1FB8grXUvw/10/pdata/1/auditp.txt
$$ ##AUDIT TRAIL=  $$ (NUMBER, WHEN, WHO, WHERE, PROCESS, VERSION, WHAT)
(   1,<2012-04-10 23:06:45.531 -0500>,<Administrator>,<TOPSPIN>,<go>,<TOPSPIN 2.1>,
      <created by zg
	started at 2012-04-10 23:05:39.062 -0500,
	POWCHK enabled, PULCHK disabled,
       configuration hash MD5:
       1A 1E CE 29 27 FD 77 03 67 4E F0 E3 C4 B2 CB 90
       data hash MD5: 64K
       6D 09 F2 30 87 3D 61 C4 E9 6D BB F6 BB 90 C8 A9>)
(   2,<2012-04-10 23:06:48.140 -0500>,<Administrator>,<TOPSPIN>,<proc1d>,<TOPSPIN 2.1>,
      <Start of raw data processing
       efp LB = 0 FT_mod = 6 PKNL = 1 PHC0 = 0 PHC1 = 0 SI = 32K 
       data hash MD5: 32K
       45 39 B9 F2 E9 49 B6 97 0F 2C 87 26 BC 3F 1D B6>)
(   3,<2012-04-10 23:06:48.609 -0500>,<Administrator>,<TOPSPIN>,<proc1d>,<TOPSPIN 2.1>,
      <pk PHC0 = 210.0476 PHC1 = 0 
       data hash MD5: 32K
       19 65 BC D5 F0 20 88 64 16 1F BF 75 1E 7F EA DB>)
(   4,<2012-04-10 23:06:48.671 -0500>,<Administrator>,<TOPSPIN>,<proc1d>,<TOPSPIN 2.1>,
      <abs ABSG = 1 
       data hash MD5: 32K
       B8 40 32 51 56 7E 3C 71 54 3E ED 2F A7 14 C9 72>)
(   5,<2012-04-10 23:06:48.703 -0500>,<Administrator>,<TOPSPIN>,<proc1d>,<TOPSPIN 2.1>,
      <abs ABSG = 2 
       data hash MD5: 32K
       DC 69 74 D6 4B 5F BC 94 4F 73 C6 42 F6 02 20 3A>)
(   6,<2012-04-10 23:06:48.734 -0500>,<Administrator>,<TOPSPIN>,<proc1d>,<TOPSPIN 2.1>,
      <abs ABSG = 3 
       data hash MD5: 32K
       53 7C F7 6C 14 28 0A 95 F8 65 E5 6A 06 16 5A 5B>)
(   7,<2012-04-10 23:06:48.765 -0500>,<Administrator>,<TOPSPIN>,<proc1d>,<TOPSPIN 2.1>,
      <abs ABSG = 4 
       data hash MD5: 32K
       EE 44 DC 18 2B 89 91 8A F9 D4 3F A1 67 2C 0A 33>)
(   8,<2012-04-10 23:06:48.796 -0500>,<Administrator>,<TOPSPIN>,<proc1d>,<TOPSPIN 2.1>,
      <abs ABSG = 5 
       data hash MD5: 32K
       F0 6A 66 73 29 D3 9F EC EC D9 D0 68 6A 9B E0 B0>)
$$ ##END=
$$ 
$$ $$ hash MD5
$$ $$ 52 2A 42 6A DE CA ED 9B 87 81 B3 9B 9A EE E4 56
##$RELAX= 
##$RELAX= 
##$RELAX= 
##$RELAX= 
##$RELAX= 
##$RELAX= 
##$RELAX= 
$$ Bruker specific parameters
$$ --------------------------
$$ [...]
##$TP= (0..7)
150 150 150 150 150 150 150 150
##$TP07= 0
##$TPNAME0= <>
##$TPNAME1= <>
##$TPNAME2= <>
##$TPNAME3= <>
##$TPNAME4= <>
##$TPNAME5= <>
##$TPNAME6= <>
##$TPNAME7= <>
##$TPOAL= (0..7)
0.5 0.5 0.5 0.5 0.5 0.5 0.5 0.5
##$TPOFFS= (0..7)
0 0 0 0 0 0 0 0
##$TUNHIN= 0
##$TUNHOUT= 0
##$TUNXOUT= 0
##$USERA1= <user>
##$USERA2= <user>
##$USERA3= <user>
##$USERA4= <user>
##$USERA5= <user>
##$V9= 5
##$VALIST= <valist>
##$VCLIST= <CCCCCCCCCCCCCCC>
##$VD= 0
##$VDLIST= <DDDDDDDDDDDDDDD>
##$VPLIST= <PPPPPPPPPPPPPPP>
##$VTLIST= <TTTTTTTTTTTTTTT>
##$WBST= 1024
##$WBSW= 4
##$XGAIN= (0..3)
0 0 0 0
##$XL= 0
##$YL= 0
##$YMAX_a= 519471
##$YMIN_a= -646488
##$ZGOPTNS= <>
##$ZL1= 120
##$ZL2= 120
##$ZL3= 120
##$ZL4= 120
##$ABSF1= 14.98061
##$ABSF2= -5.57192
##$ABSG= 5
##$ABSL= 3
##$ALPHA= 0
##$AQORDER= 0
##$ASSFAC= 0
##$ASSFACI= 0
##$ASSFACX= 0
##$ASSWID= 0
##$AUNMP= <proc_prof1d_extract_pilot.lims>
##$AXLEFT= 0
##$AXNAME= <>
##$AXNUC= <1H>
##$AXRIGHT= 0
##$AXTYPE= 0
##$AXUNIT= <>
##$AZFE= 0.1
##$AZFW= 0.1
##$BCFW= 0
##$BC_mod= 0
##$BYTORDP= 0
##$COROFFS= 0
##$CY= 15
##$DATMOD= 1
##$DC= 0
##$DFILT= <>
##$DTYPP= 0
##$F1P= 0
##$F2P= 0
##$FCOR= 0.5
##$FTSIZE= 32768
##$FT_mod= 6
##$GAMMA= 0
##$GB= 0
##$INTBC= 1
##$INTSCL= 1
##$ISEN= 128
##$LB= 0
##$LEV0= 0
##$LPBIN= 0
##$MAXI= 10000
##$MC2= 0
##$MEAN= 0
##$ME_mod= 0
##$MI= 0
##$NCOEF= 0
##$NC_proc= -8
##$NLEV= 6
##$NOISF1= 0
##$NOISF2= 0
##$NSP= 0
##$NTH_PI= 0
##$NZP= 0
##$OFFSET= 14.98061
##$PC= 1
##$PHC0= 210.0476
##$PHC1= 0
##$PH_mod= 1
##$PKNL= yes
##$PPARMOD= 0
##$PPDIAG= 0
##$PPIPTYP= 0
##$PPMPNUM= 2147483647
##$PPRESOL= 1
##$PSCAL= 4
##$PSIGN= 0
##$PYNMP= <proc.py>
##$REVERSE= no
##$SF= 400.13
##$SI= 32768
##$SIGF1= 0
##$SIGF2= 0
##$SINO= 400
##$SIOLD= 32768
##$SPECTYP= <>
##$SREGLST= <1H.CDCl3>
##$SSB= 0
##$STSI= 32768
##$STSR= 0
##$SW_p= 8223.68421052632
##$SYMM= 0
##$S_DEV= 0
##$TDeff= 65536
##$TDoff= 0
##$TI= <>
##$TILT= no
##$TM1= 0
##$TM2= 0
##$TOPLEV= 0
##$USERP1= <user>
##$USERP2= <user>
##$USERP3= <user>
##$USERP4= <user>
##$USERP5= <user>
##$WDW= 1
##$XDIM= 32768
##$YMAX_p= 460795127
##$YMIN_p= -729131
##$CURPLOT= <Network HP LaserJet P1505>
##$CURPRIN= <$Network HP LaserJet P1505>
##$DFORMAT= <normdp>
##$LAYOUT= <+/1D_H.xwp>
##$LFORMAT= <normlp>
##$PFORMAT= <normpl>
##$SURQMSG= 1
$$ End of Bruker specific parameters
$$ ---------------------------------
##NTUPLES= NMR SPECTRUM
##VAR_NAME=  FREQUENCY,     SPECTRUM/REAL,   SPECTRUM/IMAG
##SYMBOL=    X,             R,               I
##VAR_TYPE=  INDEPENDENT,   DEPENDENT,       DEPENDENT
##VAR_FORM=  AFFN,          ASDF,            ASDF
##VAR_DIM=   32768,         32768,           32768
##UNITS=     HZ,            ARBITRARY UNITS, ARBITRARY UNITS
##FACTOR=    0.250966925370066, 1,           1
##FIRST=     8223.43324360095, 55006,        -9363
##LAST=      0,             4229,            10955
##MIN=       0,             -729131,         0
##MAX=       8223.43324360095, 460795127,    0
$$ Real data points
##PAGE= N=1
##DATA TABLE= (X++(R..R)), XYDATA
$$ [...]
19473a85150K422I2161K6828a76334B19662q8488M586k8557b13812M0522P8319
$$ -185150 -182728 92161 118989 -176334 219662 131174 135760 107203 -213812 -173290 -94971
19462i4971I6287a37644j52605a00622C61994d11951C32422c01439a35039m5193
$$ -94971 96287 -137644 -290249 -100622 361994 -411951 332422 -301439 -135039 -180232
19452a80232A6423b41811k07342a38230q7571A35285J5018a51269C30684A24245
$$ -180232 16423 -241811 -449153 -138230 -225801 135285 150303 -151269 330684 124245
19441a53351k75948g5030c2417j48307a3505o5897r8130d9554A15534c30762g6308
$$ -153351 -429299 -75030 -32417 -180724 -13505 -79402 -177532 -49554 115534 -330762 -76308
19429a34112C0443d2541e578n5388A96776c27784a26255l24757J17889h0601j06137
$$ -134112 30443 -42541 -5578 -60966 196776 -327784 -126255 -451012 -333123 -80601 -186738
19418a86738g6760j50640C33404c05318M9776B7964P5942B0469b10879A05101
$$ -186738 -76760 -227400 333404 -305318 -255542 27964 103906 20469 -210879 105101
19407a888A28737b98672j2728J44598M1801c1685k40799A41509J82230D4162Q4453
$$ -1888 128737 -298672 -311400 -166802 -125001 -31685 -272484 141509 323739 44162 128615
19396A28615a04624J2028p7458q0199l9729n5328O128a11061d2300l77903a72645
$$ 128615 -104624 -92596 -170054 -250253 -289982 -345310 -339182 -111061 -42300 -420203 -172645
19384g9939m0066j7460a6471A50855b72334a4129j41958n4596p0637A3068a89864
$$ -79939 -120005 -137465 -16471 150855 -272334 -14129 -156087 -210683 -281320 13068 -189864
19372B7621a09139d5959m6047j4486L5858j05045H9627a88634f5876B35316a29950
$$ 27621 -109139 -45959 -92006 -106492 -70634 -175679 89627 -188634 -65876 235316 -129950
19360B00591c4128C8418a30587k22672P1696i2263d35m23110n3772A23420n3782
$$ 200591 -34128 38418 -130587 -353259 -281563 -92263 -435 -423545 -477317 123420 69638
19349F9638h8338A6334J51925a3638o534C97832A40498C6536b42141f5116h877
$$ 69638 -88338 16334 168259 -13638 -20172 397832 140498 36536 -242141 -65116 -8877
19337A66157c10521H1640f0162h612k09850j7982e9912o0328C79815d0167k26031
$$ 166157 -310521 81640 -60162 -8612 -218462 -236444 -59912 -120240 379815 -40167 -266198
19326b66198a13734o8288a6167k12044A01144a02457q3213j20663a25366H1301
$$ -266198 -113734 -182022 -16167 -228211 101144 -102457 -185670 -306333 -125366 81301
19315E9388h819j63206o980g3B15119a10671p0218Q882A13804i4944j8751G13
$$ 59388 -8819 -172025 -179005 -73 215119 -110671 -180889 -172007 113804 -94944 -113695 713
19302b15840A61563a24200k2737G4420b9155g774j68103d6900B26669H6098R9714
$$ -215840 161563 -124200 -146937 74420 -29155 -7774 -175877 -46900 226669 86098 185812
19291A85812c43029a44821a8513B16142B643d8627k47227h1236r5817A8937J7608
$$ 185812 -343029 -144821 -18513 216142 2643 -48627 -295854 -81236 -177053 18937 36545
19280C6545d50881A3230g2299o1118A41791Q065d33468a93810B29067a67527A51067
$$ 36545 -450881 13230 -72299 -133417 141791 149856 -433468 -193810 229067 -167527 151067
19268e7196C33h0196j96944P5959B627a08983A7354Q4036a31454M9283k31397
$$ -57196 333 -80196 -277140 -201181 2627 -108983 17354 101390 -131454 -82171 -313568
19257c13568i8011bp8329A20792a28981r1191E4033O9891E5130c79806a40805
$$ -313568 -98011 -2 -78331 120792 -128981 -220172 54033 123924 55130 -379806 -140805
19245h8279m00002J95268A3561O5015c04445e15j8902j66492B46478d5215l08583
$$ -88279 -488281 -293013 13561 78576 -304445 -515 -19417 -185909 246478 -45215 -353798
19234c53798J19577I4993a04879b2379F8069b11383j8884k03380b1968k04622
$$ -353798 -234221 94993 -104879 -22379 68069 -211383 -230267 -433647 -21968 -226590
19224b26590A07237d32562g4826j91270e514Q33I4400a64858M1898j35343l7953
$$ -226590 107237 -432562 -74826 -266096 -5514 -4681 94400 -164858 -122960 -258303 -296256
19213b96256P4604B28469B71K97295A39792a00615a9725A60252L1337r0888j5347
$$ -296256 -221652 228469 271 297566 139792 -100615 -19725 160252 191589 100701 85354
19202H5354p52f21315b59009k751F0178d30079b675E6637K3118a60167k40485
$$ 85354 84602 -621315 -259009 -261760 60178 -430079 -2675 56637 79755 -160167 -400652
19191d00652f4007l9845o4982A9615g1420F2724d35401J10594R7882J09480c2031
$$ -400652 -64007 -103852 -168834 19615 -71420 62724 -435401 -324807 -226925 -117445 -32031
19179b21743f548j06459A44893h4471K4127j94877J21143H82K40957K1914b562
$$ -221743 -6548 -113007 144893 -84471 -60344 -255221 -134078 882 241839 263753 -2562
19167d03959A4992c22825a51749f7694A65203L9454G8384c79987J32408d3781
$$ -403959 14992 -322825 -151749 -67694 165203 204657 78384 -379987 -247579 -43781
19156a12213C44684A62504J29472a10856J4236l0540C05083c0987r523J7190A47784
$$ -112213 344684 162504 291976 -110856 -96620 -127160 305083 -30987 -40510 -23320 147784
19144d2663K674r7533B49732b13635M2838l9968A44875G913L7500K6120h0698
$$ -42663 -39989 -137522 249732 -213635 -170797 -210765 144875 7913 45413 71533 -80698
19132a00219K1161n9603b3038J973j13622j24194m5637F3030a23974o0977k01988
$$ -100219 -79058 -138661 -23038 -21065 -134687 -258881 -304518 63030 -123974 -184951 -386939
19121c86939a36738q2265L9568k0668m4308a06829H3733e8635F8692J25675o2634
$$ -386939 -136738 -219003 -179435 -200103 -244411 -106829 83733 -58635 68692 194367 131733
19110A31733M6097b45575A33822a98708G9498J17755G0267a00195D851M8057a79955
$$ 131733 177830 -245575 133822 -198708 79498 197253 70267 -100195 4851 52908 -179955
19098a48075d0677j07404r22A20890b96803C335M9769a65927N3097E5858e0669
$$ -148075 -40677 -148081 -149003 120890 -296803 3335 53104 -165927 -112830 55858 -50669
19086F0704N0040a24262A28297b38533I8682g3327c0169I5063a7317k94685J37614
$$ 60704 110744 -124262 128297 -238533 98682 -73327 -30169 95063 -17317 -312002 -174388
19075a74388q2633n2429h5840j74432e084r9995r1621a5379j8474j39194j79123
$$ -174388 -257021 -309450 -85840 -260272 -5084 -105079 -196700 -15379 -33853 -173047 -352170
19064c52170A00526c27274A6694h1022l2884J9187D66402a5950G9344J6710f8313
$$ -352170 100526 -327274 16694 -81022 -113906 -94719 466402 -15950 79344 96054 -68313
19052b1365N411N403k02567O0865D8272c6025I7515c16963J57602j18239d106
$$ -21365 -15954 -10551 -213118 -152253 48272 -36025 97515 -316963 -159361 -277600 -4106
19040h317A05676a07958A15763D5333A6382K2340L9812b07773B297c89405O5874
$$ -8317 105676 -107958 115763 45333 16382 38722 78534 -207773 2297 -389405 -323531
19029c23531A16335a70854H2501f1359C7057c1618I155b81096a39396l68912D0290
$$ -323531 116335 -170854 82501 -61359 37057 -31618 9155 -281096 -139396 -508308 40290
19017c10925j08210h3391q2545D7061a96727A10497a260k70889A96340b9279p1717
$$ -310925 -419135 -83391 -165936 47061 -196727 110497 -1260 -272149 196340 -29279 -100996
19006a00996M9899A13652m1709c7454B06270a20570D42464d9679D95269d8503
$$ -100996 -51097 113652 71943 -37454 206270 -120570 442464 -49679 495269 -48503
18995h0248l3693A72409K52092b25188A11193l3764M4239L4175L8947a18228q3299
$$ -80248 -113941 172409 424501 -225188 111193 77429 121668 155843 194790 -118228 -201527
18984b01527B56040f7168K0623D8625f3012A22006D7943d51569J61268J24736
$$ -201527 256040 -67168 -46545 48625 -63012 122006 47943 -451569 -290301 -165565
18974a65565G6172d12784d7648F1136a11903F878a0344r7206H1742l530J9197
$$ -165565 76172 -412784 -47648 61136 -111903 6878 -10344 -107550 81742 78212 97409
18963I7409f569A03994a10498A13847l8238L33875J44804G8722c4954H9162K15051
$$ 97409 -6569 103994 -110498 113847 75609 409484 554288 78722 -34954 89162 304213
18952C04213a25280L7922B19121a5197l0908l03229D6102L5893a71992g6762k26019
$$ 304213 -125280 -87358 219121 -15197 -46105 -349334 46102 81995 -171992 -76762 -302781
18941c02781N1829a13n3689k3611b363B51078a40985c6058H181a79468M7665A4505
$$ -302781 -250952 -113 -53802 -77413 -2363 251078 -140985 -36058 8181 -179468 -131803 14505
18928F4208J05354B0425M9805k550a50934g1445A46422k6249B3456g6667a1056
$$ 64208 169562 20425 70230 67680 -150934 -71445 146422 120173 23456 -76667 -11056
18916e6618k21578b7537A51628a03046j7024D0811n800a38020j25328j1992B08641
$$ -56618 -278196 -27537 151628 -103046 -120070 40811 35011 -138020 -263348 -275340 208641
18904b22903I0237J64549a95231k2668A9329J58124B5271c58107B87999J88436
$$ -222903 90237 254786 -195231 -217899 19329 177453 25271 -358107 287999 476435
18894D76435A57558n234a546A65320P791b73083H4039J65476B1925c77929B16673
$$ 476435 157558 152324 -1546 165320 173111 -273083 84039 249515 21925 -377929 216673
18882b9059A27057g8599i420B70342h8250H1119b36503J4745j66609J87780j93711
$$ -29059 127057 -78599 -9420 270342 -88250 81119 -236503 -221758 -388367 -200587 -394298
18871c94298D5359J13905D253M4699e326A16954O617j8592i1972E8565b4616l49882
$$ -394298 45359 159264 4253 48952 -5326 116954 123571 104979 -91972 58565 -24616 -374498
18859c74498A06126i4802G164a72067M5396r1344M1816C5907b17335B0710g2277
$$ -374498 106126 -94802 7164 -172067 -126671 -218015 -176199 35907 -217335 20710 -72277
18847a95283Q047Q2530j5189j57514F573g0761j32296P0208j96961A519a9851
$$ -195283 -187236 -104706 -119895 -277409 6573 -70761 -203057 -132849 -329810 1519 -19851
18835a21784A55411J41204a70795C6801K36182i8278A50718A1693a50842N0024
$$ -121784 155411 296615 -170795 36801 272983 -98278 150718 11693 -150842 -100818
18825a00818k15960n4904f3306C35452C8923b53413R3428f9952a8823l164m2199
$$ -100818 -316778 -371682 -63306 335452 38923 -253413 -159985 -69952 -18823 -21987 -64186
18814f4186m5923G3800i5578k04343B52532G9460a41671d1009j13206F2969L2311
$$ -64186 -110109 73800 -95578 -299921 252532 79460 -141671 -41009 -154215 62969 95280
18803I5280P5740b9548q639A2512Q9662a3409j01517F1856L57193j86017j06127
$$ 95280 171020 -29548 -38187 12512 102174 -13409 -114926 61856 419049 233032 126905
18792A26905K54227E2754n99b40918J00855I8604A7649g5212k24300h4121N04
$$ 126905 381132 52754 52155 -240918 -140063 98604 17649 -75212 -299512 -84121 -83617
18781h3617H6397b9441n2289F2806b67737L9494b0872B74226a39867A42099n4867
$$ -83617 86397 -29441 -81730 62806 -267737 -228243 -20872 274226 -139867 142099 87232
18770H7232a03885N846k6512A74951b44943j1694Q5335p2551A09446A5745J96017
$$ 87232 -103885 -98039 -124551 174951 -244943 -256637 -171302 -243853 109446 15745 211762
18759B11762c3312k45718D1357f1446F4600B871a99529A27976a10668A90528I1507
$$ 211762 -33312 -279030 41357 -61446 64600 2871 -199529 127976 -110668 190528 91507
18747b0376j9883r7357A49137a33768G5133K559a71842j04589b1735k25805K8563
$$ -20376 -40259 -137616 149137 -133768 75133 77692 -171842 -276431 -21735 -247540 -218977
18736b18977j17203A16308b81055h8379h949A44962D5452b09546c846l93244F223
$$ -218977 -336180 116308 -281055 -88379 -8949 144962 45452 -209546 -3846 -397090 6223
18724d703B5875J32454D9828J72378a5601j00443A65349a11586A54004f4013A16942
$$ -4703 25875 158329 49828 222206 -15601 -116044 165349 -111586 154004 -64013 116942
18712d4172j71542e3006a4980j38340c2121F7346h6662k01554B51627a67097l7906
$$ -44172 -215714 -53006 -14980 -153320 -32121 67346 -86662 -288216 251627 -167097 -205003
18701b05003B2011L2947g3361B0473a18806G6724j5288P2135E5545a20844G7322
$$ -205003 22011 54958 -73361 20473 -118806 76724 61436 133571 55545 -120844 77322
18689I47K8054L7195b90048C47674q2808d23559i3912A44633a8652j85882j9786
$$ 947 29001 66196 -290048 347674 264866 -423559 -93912 144633 -18652 -204534 -224320
18678b24320F0898R6823b55334f1247j48210I652c0633G854J56558a57508B83153
$$ -224320 60898 157721 -255334 -61247 -209457 9652 -30633 7854 164412 -157508 283153
18666d57107B13573a11801k31823c416A49784b87321M0144a05584C81351a26848
$$ -457107 213573 -111801 -343624 -3416 149784 -287321 -247177 -105584 381351 -126848
18655h3814k75739j37636b39375J00432J9352j35653d0629l56713J09574O9641
$$ -83814 -359553 -497189 -239375 -138943 -119591 -255244 -40629 -397342 -287768 -218127
18645b18127F1196i1914E4139K6126a38244A57209B4851M0450d6941A81851A0977
$$ -218127 61196 -91914 54139 80265 -138244 157209 24851 65301 -46941 181851 10977
18633h7392B49467A08531a37681a8396p3913A86642d01702A20854a94647j06034
$$ -87392 249467 108531 -137681 -18396 -92309 186642 -401702 120854 -194647 -300681
18623c00681B0393h6210L1758E2224g8115r3467r0192j67238a52360j06818d8198
$$ -300681 20393 -86210 -54452 52224 -78115 -171582 -261774 -429012 -152360 -259178 -48198
18611A61974e00548B22999b93491A20927C8264e9421q6204j27785p4502G2781
$$ 161974 -500548 222999 -293491 120927 38264 -59421 -145625 -273410 -347912 72781
18600A54420d11943A7071M8919a44722a2150B68398A04198j1802N283A8738b2006
$$ 154420 -411943 17071 65990 -144722 -12150 268398 104198 92396 97679 18738 -22006
18588i8605B14013d2022j99007D8439c05388J39820C0571i3427D966J72999h2962
$$ -98605 214013 -42022 -241029 48439 -305388 -165568 30571 -93427 4966 177965 -82962
18576C08559d1075j90949A05628K82799c49k68303A66474b89706A1658i2256A29635
$$ 308559 -41075 -232024 105628 388427 -349 -268652 166474 -289706 11658 -92256 129635
18564b33537i6851j19737A08320A8176d43744M2755D337a30341k75G0308c17462
$$ -233537 -96851 -216588 108320 18176 -443744 -400989 4337 -130341 -130616 70308 -317462
18552A05032O4091a1694B2118J69275E7840b95058P3881e8361A59173a11811B32511
$$ 105032 169123 -11694 22118 191393 57840 -295058 -221177 -58361 159173 -111811 232511
18540b89547d3176D8512Q3393a86525m9683A2090b19626A38346a51293d8349B218
$$ -289547 -43176 48512 131905 -186525 -236208 12090 -219626 138346 -151293 -48349 2218
18528A4568b38841d6608C06827b36080B0572a63690F7803l932a8826A31287d88274
$$ 14568 -238841 -46608 306827 -236080 20572 -163690 67803 63871 -18826 131287 -488274
18516e7573F2393e2566j27529g7880A43605O485c07884A92947A6640c33735B7987
$$ -57573 62393 -52566 -180095 -77880 143605 150090 -307884 192947 16640 -333735 27987
18504I4383c19075A55176J01165E7796O6722b10969I489O3725a69162C4931i2663
$$ 94383 -319075 155176 256341 57796 124518 -210969 9489 73214 -169162 34931 -92663
18492a90814e1439k47178M0012A47722e7745O581o0149A07957c83221G4508j2573
$$ -190814 -51439 -298617 -258605 147722 -57745 -51164 -111313 107957 -383221 74508 61935
18481F1935i0772a1089A44611D7189e387E2555b87125Q3972N2832B02637a11099
$$ 61935 -90772 -11089 144611 47189 -5387 52555 -287125 -203153 -150321 202637 -111099
18469c08219F7157O0305B1274N5762K4766a17366j03176g8047J7103j6619k2118
$$ -308219 67157 127462 21274 77036 101802 -117366 -220542 -78047 -60944 -77563 -99681
18458i9681A820P0517l4026G213J817a42822E0843b27131O9675A90500a67107
$$ -99681 1820 72337 38311 7213 9030 -142822 50843 -227131 -157456 190500 -167107
18446c85051J86247B37913b59378A86020A5050K5606Q4604K08190G2659A11b80891
$$ -385051 -198804 237913 -259378 186020 15050 40656 125260 333450 72659 111 -280891
18434a81805d4793f789l1608A52401a53065B84817b34858b3320p9319I7107d9641
$$ -181805 -44793 -6789 -38397 152401 -153065 284817 -234858 -23320 -102639 97107 -49641
18422b27847A86544h7212K5190D0105d2765q4823B5439g2671L3971o6695k3657
$$ -227847 186544 -87212 -62022 40105 -42765 -127588 25439 -72671 -38700 -105395 -129052
18411a29052c8764A75059H6742a41101C42937a84619B21394C660a23068n8140
$$ -129052 -38764 175059 86742 -141101 342937 -184619 221394 3660 -123068 -181208
18401a81208C4094L5878b12735B9972J38383a49603A8377C818a03893c2329k2080
$$ -181208 34094 69972 -212735 29972 168355 -149603 18377 3818 -103893 -32329 -54409
18390e4409m90H9025C4577b54936Q1855b6983C44195H1682b40608a04863B23511
$$ -54409 -54899 89025 34577 -254936 -173081 -26983 344195 81682 -240608 -104863 223511
18378d9009p3612j83971i7141j46341M5746N3590B02432b23672a01941j90963
$$ -49009 -122621 -306592 -97141 -243482 -197736 -144146 202432 -223672 -101941 -292904
18368b92904g4042m9201k11565k2086B564c2939A62519b20984M2267o1283A26834
$$ -292904 -74042 -123243 -334808 -356894 2564 -32939 162519 -220984 -178717 -240000 126834
18356A65775n9166a05490j45497i4236N540j13139l4479B04865q468b015j07563
$$ 165775 106609 -105490 -250987 -94236 -88696 -201835 -236314 204865 196397 -2015 -109578
18345a09578d1671j50115B01468b76757I8432h299j77482A95060b83161C5046
$$ -109578 -41671 -191786 201468 -276757 98432 -8299 -185781 195060 -283161 35046
18334a45916L4650B35760a14426G9667a61913I9690c51901a28805j41595i8967
$$ -145916 -111266 235760 -114426 79667 -161913 99690 -351901 -128805 -270400 -98967
18323A3941E967J74630a9404A90301L8831a09361D7748a464A1463a60371J9799
$$ 13941 5967 180597 -19404 190301 229132 -109361 47748 -1464 11463 -160371 -140572
18312a40572G8196b26339a08170k1693j27549A72566a16219C5675b40388j20382
$$ -140572 78196 -226339 -108170 -129863 -257412 172566 -116219 35675 -240388 -360770
18302c60770J06930B0065a09576B3671Q6025a49627j97130p587G0995a42484k02492
$$ -360770 -253840 20065 -109576 23671 109696 -149627 -346757 -354344 70995 -142484 -344976
18291c44976A6772c49311c8413E8566b56639C07729A18994b49947J21626B1367
$$ -344976 16772 -349311 -38413 58566 -256639 307729 118994 -249947 -128321 21367
18280b43418a16517j2796H8424K15505B3802O658J25058b02553R2567E4001B0197
$$ -243418 -116517 -129313 88424 303929 23802 30460 155518 -202553 -109986 54001 20197
18268A3249J10457J46352E7740J65244c18980B9067P7613B6022K59932m9111A16416
$$ 13249 123706 270058 57740 222984 -318980 29067 106680 26022 285954 236843 116416
18256F8270b0284C1878b93888C106a20111L4521C7808j2740a92254m698Q7710
$$ 68270 -20284 31878 -293888 3106 -120111 -85590 37808 25068 -192254 -196952 -109242
18245a09242j24350B34194g3704l35083a2725I8271m7596c43360b3638j69435
$$ -109242 -233592 234194 -73704 -408787 -12725 98271 50675 -343360 -23638 -193073
18235a93073B52187A22179a67312A99024G1810K51373A3760P0969a56582I4496
$$ -193073 252187 122179 -167312 199024 71810 323183 13760 84729 -156582 94496
18224C25615A42021d9265j893f713j34493A07860b90887B5851K29444C5949a19875
$$ 325615 142021 -49265 -51158 -6713 -141206 107860 -290887 25851 255295 35949 -119875
18212b88995b1865k30896B90266H5283a12761A27197b02786C5289N310b39002
$$ -288995 -21865 -252761 290266 85283 -112761 127197 -202786 35289 40599 -239002
18201A57471N1109d35145G4741j6654a6202A925a6311r5110J302L8570A98274
$$ 157471 208580 -435145 74741 58087 -16202 1925 -16311 -111421 -110119 -71549 198274
18189B56151b35464A56799e8349G021K60252j28456c31960A68755B4801a35022
$$ 256151 -235464 156799 -58349 7021 267273 138817 -331960 168755 24801 -135022
18178a31683B3660M8734J8364b18436Q553j2921p4918A0245a43017B857J61175
$$ -131683 23660 72394 90758 -218436 -209883 -222804 -297722 10245 -143017 2857 164032
18167A64032a63654k9655B12128I5082a20033B5257L8342i9100k43244J22471
$$ 164032 -163654 -193309 212128 95082 -120033 25257 63599 -99100 -342344 -219873
18157b19873D0375J8122h3701A54193k4715J27981h0471k17908i7598K883a7074
$$ -219873 40375 58497 -83701 154193 129478 257459 -80471 -298379 -97598 -94715 -17074
18145c69919D00048j42761a65625C8071K8164M4647b89390D05867a20645r0221
$$ -369919 400048 257287 -165625 38071 66235 110882 -289390 405867 -120645 -210866
18135b10866A28121L9252k0844M0047e7089k95470i8212B65932j0107e0127A17921
$$ -210866 128121 167373 146529 186576 -57089 -352559 -98212 265932 255825 -50127 117921
18123a52264P1795c8751k8599B94289C9560d70030C3325I943J90827g0137a4009
$$ -152264 -80469 -38751 -67350 294289 39560 -470030 33325 9943 200770 -70137 -14009
18111g0115l9497j00771f8577a0736j2511B32135b61277a21974g970A70730J61941
$$ -70115 -109612 -210383 -68577 -10736 -23247 232135 -261277 -121974 -7970 170730 332671
18100C32671H3091a7731j1663j63050N5382o3807A38086b41893A82787a64100
$$ 332671 83091 -17731 -29394 -192444 -137062 -200869 138086 -241893 182787 -164100
18089C72729I013a55907m8512o8663A39906d2952D5771c16312g998l2597D3094
$$ 372729 9013 -155907 -204419 -273082 139906 -42952 45771 -316312 -7998 -40595 43094
18077A67292C3656J62551F9612K9175K9833g3550n9091a3791j36092k5729g3264
$$ 167292 33656 196207 69612 98787 128620 -73550 -132641 -13791 -149883 -175612 -73264
18065A47899a19640A46096P6233H4682C0578O8893Q4158b00844A22144a96099
$$ 147899 -119640 146096 222329 84682 30578 99471 183629 -200844 122144 -196099
18054C39821c61225c0949D7333a06840A8458M32607j63421c27534A79511m6857
$$ 339821 -361225 -30949 47333 -106840 18458 451065 287644 -327534 179511 132654
18044A32654i4089A60950c29590A47029R6418e7809A75964k7002A1316M03668
$$ 132654 -94089 160950 -329590 147029 243447 -57809 175964 148962 11316 414984
18034D14984A9880A823b70298b1412P782p6819o1294F1125a15277L0145n6802
$$ 414984 19880 1823 -270298 -21412 -13630 -90449 -151743 61125 -115277 -85132 -141934
18023a41934k7619A44989E3839e9662D0098b3963C71903B9065N3344l0975g0571
$$ -141934 -169553 144989 53839 -59662 40098 -23963 371903 29065 82409 51434 -70571
18011a41311j7125j41007B74124E8857P5196k8862K67126A31489a73569A41714
$$ -141311 -158436 -299443 274124 58857 134053 105191 372317 131489 -173569 141714
18000D60908D566b284C380J55470n61J34963l0159o8810c0399A15952a80188E9590
$$ 460908 4566 -2284 3380 158850 158289 293252 263093 194283 -30399 115952 -180188 59590
17987a36358A70692b85957E9575b21438a9411j93997g1703j23909I359A192a27059
$$ -136358 170692 -285957 59575 -221438 -19411 -213408 -71703 -195612 9359 1192 -127059
17975a64810k19948B37783F1416j8146g6299A3686J8145a81206a2571B22982J60136
$$ -164810 -384758 237783 61416 43270 -76299 13686 31831 -181206 -12571 222982 383118
17964C83118h9508o1021p9914A27118n5725J64760C3130J30164i282I5287m5943
$$ 383118 -89508 -150529 -230443 127118 71393 236153 33130 163294 -9282 95287 49344
17953D9344R1456e2993A26884J02307a71978Q0809B2219c9810e389A17778M8549
$$ 49344 140800 -52993 126884 229191 -171978 -91169 22219 -39810 -5389 117778 166327
17942A66327G5729a20867f899m902j66354Q3174j16311A64276b30661B08825b18009
$$ 166327 75729 -120867 -6899 -11801 -178155 -94981 -211292 164276 -230661 208825 -218009
17930c9020j7698n355q1249m0265E65K60131C5796J48051a4033A52599C7697h8464
$$ -39020 -56718 -62073 -143322 -183587 565 260696 35796 183847 -14033 152599 37697 -88464
17917D0382i8401B2570R6158c04047N7654A26881c0287D5806c5158C44045b35330
$$ 40382 -98401 22570 118728 -304047 -246393 126881 -30287 45806 -35158 344045 -235330
17905b15297g0173A00654C1384Q0180K1518m0460b20083B46861j21857b95333
$$ -215297 -70173 100654 31384 111564 133082 92622 -220083 246861 125004 -295333
17894B43592a73724B02986h8961H6603a84803I7272G640R2065h9834A72396g2295
$$ 243592 -173724 202986 -88961 86603 -184803 97272 7640 99705 -89834 172396 -72295
17882b05305h9734B38237c58886a44803e1349A02867R7833A7155a50410A00059
$$ -205305 -89734 238237 -358886 -144803 -51349 102867 200700 17155 -150410 100059
17871a15409B08865c12120A22143A015a82140A95615a30127A61634K7213i4066
$$ -115409 208865 -312120 122143 1015 -182140 195615 -130127 161634 188847 -94066
17860H8059a04164B20402a19019j2979B827M5121J33299G2104K87365b55606b6520
$$ 88059 -104164 220402 -119019 -131998 2827 47948 181247 72104 359469 -255606 -26520
17848A73146L693D6464P2446L381J08161a86096C42791f2510E0353a00179B8447
$$ 173146 176839 46464 118910 122291 230452 -186096 342791 -62510 50353 -100179 28447
17836A58818R4749A03416J71949H1456R9023a12765A05574a02313A01251m8316
$$ 158818 253567 103416 275365 81456 180479 -112765 105574 -102313 101251 52935
17826E2935J00748i5380B13782A02589a03741F6638e6516A17709J7453b5970B81916
$$ 52935 153683 -95380 213782 102589 -103741 66638 -56516 117709 135162 -25970 281916
17814H0095a38435A11801j0637a08919B88022n1478a42045G5064J27348h2449
$$ 80095 -138435 111801 101164 -108919 288022 236544 -142045 75064 202412 -82449
17803A27704k2156d1598B39614B5732r351R3033m4706J34954b0960H3992a2122
$$ 127704 105548 -41598 239614 25732 16381 109414 64708 199662 -20960 83992 -12122
17791C0825A0879P4537K416h419j20873d5178A2750a05189e0879j34778a2430
$$ 30825 10879 85416 87832 -8419 -129292 -45178 12750 -105189 -50879 -185657 -12430
17779A25315o2582R6318j974I87L04243D2663R6602R5602E9650g1188j34666N6556
$$ 125315 62733 159051 157077 987 305230 42663 139265 234867 59650 -71188 -205854 -149298
17767a49298I1342b6455C7411K42267F6354c293G7935A9985K92663A33552a78789
$$ -149298 91342 -26455 37411 279678 66354 -3293 77935 19985 312648 133552 -178789
17755A96729C3351K76832e23D31471n0892b25396K6988l3341H2825b12178G5304
$$ 196729 33351 310183 -523 431471 380579 -225396 -198408 -231749 82825 -212178 75304
17743A31367m6452a77745B44665J15466A27157h3012I1061k3619R8148b09073
$$ 131367 84915 -177745 244665 360131 127157 -83012 91061 67442 165590 -209073
17732F1281Q0118F007b19984c1194l8836H4701a13923A1202K31866c81849a03165
$$ 61281 141399 6007 -219984 -31194 -70030 84701 -113923 11202 243068 -381849 -103165
17720C4463N30b08342a01132j56386R1306H8326K14396j44718h410I7726K9734
$$ 34463 34993 -208342 -101132 -257518 -166212 88326 302722 158004 -8410 97726 127460
17709A27460g8423B43502i642c246E9468J03798Q080C7839J95368j11644M8155
$$ 127460 -78423 243502 -9642 -3246 59468 163266 171346 37839 233207 121563 169718
17698A69718G4184a48976A48940a7278j18693E61032h8440B46796H8398B4055
$$ 169718 74184 -148976 148940 -17278 -135971 561032 -88440 246796 88398 24055
17687C72544h7B06457k4076K1797p0405F1398J12123a71497b2807A20850D7218
$$ 372544 -87 206457 182381 204178 133773 61398 173521 -171497 -22807 120850 47218
17675B44357g9782c4235k7834B16023C8433b67225e8179B244M99410A59570b8750
$$ 244357 -79782 -34235 -62069 216023 38433 -267225 -58179 2244 501654 159570 -28750
17663A07198b8423E023a06963A73278i6351A6039O428a1530q4382B97555o6438
$$ 107198 -28423 5023 -106963 173278 -96351 16039 22467 -11530 -95912 297555 231117
17652B31117p9911b87488D43312A83750o1638R1352h6955A07691D3038J9586K45446
$$ 231117 151206 -287488 443312 183750 122112 213464 -86955 107691 43038 62624 308070
17641C08070A26139L5580Q1169e6425F9912j8106j044i1320A49434a89093A79954
$$ 308070 126139 161719 242888 -56425 69912 51806 50762 -91320 149434 -189093 179954
17629B10917L12178j95930A10542m781K56359c5493D62307a25229C17500b7870
$$ 210917 523095 327165 110542 105761 362120 -35493 462307 -125229 317500 -27870
17618A98704r702E3006M7904K2978J74064C2965J43799a49483C72613a74035D37184
$$ 198704 189002 53006 100910 123888 297952 32965 176764 -149483 372613 -174035 437184
17606a76237P5038A9388K57274E6297J39458P2543g7798A11944J3768J71723a72393
$$ -176237 -101199 19388 276662 56297 195755 268298 -77798 111944 125712 297435 -172393
17594c7295C18711o5070E9571J18819a5982q0092C67314G7164M4917b5259A52301
$$ -37295 318711 253641 59571 178390 -15982 -96074 367314 77164 122081 -25259 152301
17582E1339K43175c4795A80080N6378i7695B92705f0008j34723a3395A00726p437
$$ 51339 294514 -34795 180080 236458 -97695 292705 -60008 -194731 -13395 100726 93289
17571I3289J96687a27470B778J16068L6586M2984l689F1807a05653A11480M4868
$$ 93289 289976 -127470 2778 118846 155432 198416 194727 61807 -105653 111480 156348
17560A56348A8297L32989j12846f9935B37994j1999p3853K66852j83438a07488
$$ 156348 18297 351286 238440 -69935 237994 225995 152142 418994 235556 -107488
17549A42480Q2680B3273J6903O8363j4210L9582a00674C0110L10331G1491H119
$$ 142480 225160 23273 40176 108539 94329 133911 -100674 30110 340441 71491 8119
17537d7985A13304C6123a05486C5516K72430E2706K37243P8911F398J20387K40934
$$ -47985 113304 36123 -105486 35516 307946 52706 289949 368860 6398 126785 367719
17526C67719A21617N7398a45393C49266b22190C67802A13313J26908J98475j76380
$$ 367719 121617 179015 -145393 349266 -222190 367802 113313 240221 438696 262316
17516B62316J67769o9869K55831B80704J77151j91596N20684J77943j47765J92212
$$ 262316 430085 360216 616047 280704 457855 266259 786943 964886 817121 1009333
17506A009333l88283j09023M379k30868l9900M82896k72652D9779O12031B50870
$$ 1009333 621050 512027 516406 285538 245638 728534 455882 49779 661810 250870
17495G35185p820K74148J8910p0445C44669M38291B08512L18210j5362A22685
$$ 735185 727365 1001513 1020423 949978 344669 782960 208512 526722 511360 122685
17484C50420o9805j4001M6557J48137F4541e3678A5568K37871Q1563J1657j48668
$$ 350420 280615 266614 313171 461308 64541 -53678 15568 253439 335002 346659 197991
17473A97991j9729J81763A42638l0092M1627K49227m1533j28630L50714E2125
$$ 197991 178262 360025 142638 112546 154173 403400 361867 233237 583951 52125
17462C84571E7350K34253O5176j1455M2507J75646A75599J62662Q4691p6877r5420
$$ 384571 57350 291603 356779 345324 387831 563477 175599 338261 422952 346075 250655
17451B50655f3391F20611A78549j0175G7045O34071A59790a91186E0471K58248
$$ 250655 -63391 620611 178549 168374 77045 711116 159790 -191186 50471 308719
17441C08719M0714J49304j40513H5034l2599L67145o2361m0194L00989j61263
$$ 308719 349433 498737 358224 85034 52435 419580 357219 317025 618014 456751
17431D56751j7766f9117B33055k1483J15760M9499j82107J59451M31K54431B12741
$$ 456751 438985 -69117 233055 211572 327332 376831 194724 354175 354606 609037 212741
17419A58481L02230k22008J61066J1815J0564j18272J27086o9003a226C48335
$$ 158481 460711 238703 399769 411584 422148 303876 430962 361959 -1226 348335
17408E52978K5205A42259g4567C58682q0102M39509L5830B62696J04612j03774
$$ 552978 578183 142259 -74567 358682 278580 718089 753919 262696 367308 263534
17398B63534j19212N2988L6315a26976C00753M4013N6550G1134K35473j8917J24369
$$ 263534 144322 197310 233625 -126976 300753 344766 401316 71134 306607 287690 412059
17387D12059j81378J21561j02276J65790j93303L6150L6702g825q4317B89546
$$ 412059 230681 352242 249966 415756 222453 258603 295305 -7825 -92142 289546
17376A06115Q789K26736l3061j49007p2467K38194p9695K36557A74992l8258K89366
$$ 106115 114904 341640 308579 159572 87105 325299 245604 482161 174992 136734 426100
17365D26100j95755I9425O48312A28354R3431J21044G4105L87113k08579K75481
$$ 426100 230345 99425 747737 128354 221785 342829 74105 461218 252639 528120
17355E28120A87211K05113a3934C23083r0162K09659k08169o2625K11017j76463
$$ 528120 187211 392324 -13934 323083 232921 442580 234411 171786 382803 206340
17345B06340o3703M2790a4774A18152K03946K50298k00693j15272M31483C10369
$$ 206340 142637 185427 -14774 118152 322098 572396 371703 256431 687914 310369
17334A49377K38273E5232J60039J73324j27953p483L1880j00723R5540j25983
$$ 149377 387650 55232 215271 388595 260642 253159 285039 184316 279856 153873
17324A53873J16000M4531R5014A15063J04008J20384O3602i6065F0346J63303
$$ 153873 269873 314404 409418 115063 219071 339455 403057 -96065 60346 223649
17314B23649Q8387H4395K55615j24959K76799A85981M3993G6711J89315Q4123
$$ 223649 312036 84395 340010 215051 491850 185981 229974 76711 266026 350149
17304C50149l9857K5136g6890B66934J96723o4270j29917Q6486J99232j63030
$$ 350149 310292 335428 -76890 266934 463657 399387 269470 355956 555188 392158
17294C92158d637G5660M31791N2142a18604B14751N57706A2710J71925O2418K683
$$ 392158 -4637 75660 507451 559593 -118604 214751 772457 12710 184635 247053 249736
17283B49736h9610A31102L16397A10111K11227R2432J12759A74509J22753M2503
$$ 249736 -89610 131102 447499 110111 321338 413770 526529 174509 297262 339765
17273C39765k5877j9058j24309Q5571Q0703m8663f5724B50043p7871F6269L22847
$$ 339765 313888 294830 170521 256092 336795 288132 -65724 250043 172172 66269 389116
17262C89116o9830j26500K36107G9921K38189k9360L8305K94502A54701K63796
$$ 389116 319286 192786 428893 79921 318110 288750 327055 621557 154701 418497
17252D18497o0285j55819J77030n4145m6164J71043j77000I6449R8887b7711B21790
$$ 418497 358212 202393 379423 325278 279114 450157 273157 96449 195336 -27711 221790
17240D41259j92744o300J07966Q6216j62389L49546k00641A69728J98938r0907
$$ 441259 248515 242215 350181 436397 274008 623554 422913 169728 368666 277759
17230B77759q6685J55496J56991A20005M51182j85516l5649j33304a1929D07203
$$ 277759 191074 346570 503561 120005 571187 385671 350022 216718 -11929 407203
17219C50269g9092B71425j3710K97289J68156B65003O1664J60269j60218P8098
$$ 350269 -79092 271425 257715 555004 723160 265003 326667 486936 326718 404816
17209D04816A22736L68536B45627l6531Q6638J54466J71757o5680k00946K80389
$$ 404816 122736 491272 245627 209096 295734 450200 621957 556277 355331 635720
17199F35720k99150A55364L03158j0744A93285K11981L10699C08472j39849J69528
$$ 635720 336570 155364 458522 447778 193285 405266 715965 308472 168623 338151
17189C38151A48974l6465J23707L12957k59398J70587k23430l6917M14550B36040
$$ 338151 148974 112509 236216 549173 289775 460362 236932 200015 614565 236040
17178A77334M74726q3878A83594J42752J48544N5478q8298B14100L23210l2861
$$ 177334 652060 568182 183594 326346 474890 530368 442070 214100 537310 504449
17168E04449j83960J78428B43320M82096C56401j59902K41618o2183m2426k4644
$$ 504449 320489 498917 243320 725416 356401 196499 438117 375934 333508 308864
17158C08864J85362m7991J61193q6829J31148J47179j40745j53262J08628m4631
$$ 308864 494226 446235 607428 520599 651747 798926 658181 504919 613547 568916
17148E68916q8689r0533A37387M46568J22252l22064n9769L1493j2629j68183
$$ 568916 480227 389694 137387 583955 706207 384143 324374 355867 343238 175055
17138A75055Q5461K76752q5905M1419j75173K34635A99505N94519k50913n4789
$$ 175055 260516 537268 451363 492782 317609 552244 199505 794024 543111 488322
17128D88322m2827K19142p4412A80278K13490J70847n5797j38184O3310J38792
$$ 488322 445495 664637 590225 180278 393768 564615 508818 370634 433944 572736
17118E72736k32611K53733K3306k39434K70580j91791J41057J04913j16545m5093
$$ 572736 340125 593858 617164 377730 648310 456519 597576 702489 585944 540851
17108E40851N4106j208M9889N7499l18305K10178j55668M3312L32648j47079k09441
$$ 540851 594957 593749 643638 701137 382832 593010 437342 480654 813302 666223 456782
17097D56782J33123k67453M35701J8735J03587k47816K2420j28501K89751J24456
$$ 456782 589905 322452 758153 776888 880475 632659 655079 526578 816329 940785
17087I40785k93603L0460K46713l99126K33669j19720j55029K78730o5506j64917
$$ 940785 647182 677642 924355 525229 758898 639178 484149 762879 697373 532456
17077E32456k4089O0630K29850j74330N2631K31534J7230k23487j37878O0573
$$ 532456 508367 568997 798847 624517 677148 908682 925912 702425 564547 625120
17067F25120J4432K9837J51086K10204l72543k9396K34557j34532K32230k15245
$$ 625120 639552 669389 820475 1030679 658136 628740 863297 728765 960995 745750
17057G45750j64411j06890L93191k84566k9097M20548q281L2698l44036J07742
$$ 745750 581339 474449 867640 583074 553977 974525 966244 998942 654906 762648
17047G62648M26918l37940k08562q8509L88493k34126j43028K18155J94621j94837
$$ 762648 1189566 851626 643064 554555 943048 708922 565894 784049 978670 783833
17037G83833J27142m0621k56999k5666M30139j32537O8708l04110j57067O40829
$$ 783833 910975 870354 613355 587689 1017828 885291 953999 649889 492822 1133651
17027A133651l23445J30628M217Q2267n5143J24904r6418N9148l81486M00430
$$ 1133651 810206 940834 945051 1027318 972175 1097079 1000661 1059809 678323 1078753
17017A078753j78357P410J44370q3901j0717r6309P2079o8847L16138k90523J06279
$$ 1078753 900396 907806 1052176 968275 957558 861249 933328 864481 1180619 890096 996375
17006I96375j96384O12467k16611j35272k41219N59354l85693j404J01699P4362
$$ 996375 799991 1412458 1195847 1060575 819356 1378710 993017 991613 1093312 1167674
16996A167674k61199O7098N2485o9129J37056J78657R0612m70375m4943M01567
$$ 1167674 906475 973573 1026058 956929 1093985 1272642 1363254 892879 847936 1249503
16986A249503k0115M9100l74999K44679K35198j045l69598J90081Q7975j06801
$$ 1249503 1229388 1278488 903489 1148168 1383366 1382321 1012723 1202804 1290779 1183978
16976A183978j48218J37816J46412K01642l73116O716K22806k25150J1383k22647
$$ 1183978 1035760 1173576 1319988 1521630 1148514 1155230 1378036 1152886 1164269 941622
16966I41622L33250R7946p0077k17508K99605j4386Q633q4062R8525N1137N3245
$$ 941622 1274872 1372818 1302741 1085233 1384838 1370452 1379085 1295023 1393548 1444685 1497930
16955A497930J8642R1981j40924r1724P0299J52591J9771J9140l17803m7339M36469
$$ 1497930 1516572 1608553 1467629 1375905 1446204 1598795 1618566 1637706 1319903 1272564 1709033
16944A709033N9499L8742l93441K794j95601N48124q3208J952K94433k03020K55104
$$ 1709033 1768532 1807274 1413833 1416627 1221026 1769150 1685942 1687894 1982327 1779307 2034411
16933B034411j90348l64427L74824Q4824j74966M6154j19333J77711k32412K0840
$$ 2034411 1844063 1479636 1854460 1939284 1764318 1810472 1691139 1868850 1636438 1657278
16923A657278J08673J31262l2136n1856K85383j64523j79146J36786J07531R8402
$$ 1657278 1765951 1897213 1865077 1813221 2098604 1934081 1754935 1891721 1999252 2097654
16913B097654P9466M7284m01242L15944J38525m3514o7842J34177j93161o9659
$$ 2097654 2177120 2224404 1823162 2139106 2277631 2234117 2166275 2300452 2107291 2037632
16903B037632M84604q442l13769K38029p7996k24982Q29563k52730l07713K30887
$$ 2037632 2522236 2513794 2200025 2438054 2360058 2135076 2964639 2711909 2404196 2635083
16893B635083J3853l8660P8743O4877P2792m4776k15850J92092P2511K56850J6441
$$ 2635083 2648936 2610276 2689019 2753896 2826688 2781912 2566062 2758154 2830665 3087515 3103956
16882C103956l05171K70207j59642l2785K55300j36166J67420l3443J82764k08857
$$ 3103956 2798785 3068992 2909350 2876565 3131865 2995699 3163119 3129676 3312440 3103583
16872C103583Q2447Q2366p359J95701J46787k52604k41732P13591j71477J9136
$$ 3103583 3186030 3268396 3261037 3456738 3603525 3350921 3109189 3822780 3651303 3670439
16862C670439k4240j63199M99656k76620L10219k65735O32780j45625k70505J81600
$$ 3670439 3646199 3483000 3982656 3706036 4016255 3750520 4383300 4237675 3967170 4148770
16852D148770N2616m2766k17784K52849L24688Q739K82475l57660k01786O53831
$$ 4148770 4201386 4158620 3940836 4193685 4518373 4527112 4809587 4451927 4250141 4903972
16842D903972l03511M41312j14593K12767Q7329n11273P80791k50725J56701j17445
$$ 4903972 4600461 5041773 4927180 5139947 5227276 4716003 5496794 5246069 5402770 5285325
16832E285325M47959J9863r2393J71407K36149J71009j56768M3580j30837K67459
$$ 5285325 5733284 5753147 5660754 5832161 6068310 6239319 6082551 6126131 5995294 6262753
16822F262753L46080j82618K09078L21818O840L46013o3332Q7193j65841M12174
$$ 6262753 6608833 6426215 6635293 6957111 6963951 7309964 7246632 7333825 7167984 7580158
16812G580158L1512r242J68349J21994O37839N8832j98269M83278M0437N00118
$$ 7580158 7611670 7602428 7770777 7892771 8530610 8589442 8391173 8874451 8914888 9415006
16802I415006k94824J68546O56487K75576j43365k6160N52079L1609J80607J25876
$$ 9415006 9120182 9288728 9945215 10220791 10077426 10051266 10603345 10634954 10815561 10941437
16792A0941437L89403K60188P9060J11779N32629M51748J71086L97584O39835
$$ 10941437 11330840 11591028 11670088 11781867 12314496 12766244 12937330 13334914 13974749
16783A3974749K34133j65473L63020O80704M06009K75460N41056J49818M40239
$$ 13974749 14208882 14043409 14406429 15087133 15493142 15768602 16309658 16459476 16899715
16774A6899715P36613N34509N4549N94310O64210N92068N89398J00368R50906
$$ 16899715 17636328 18170837 18225386 18819696 19483906 20075974 20665372 20765740 21716646
16765B1716646O34496P15900R71178O9316R48602P18930J292679J86279J123178
$$ 21716646 22351142 23067042 24038220 24107536 25056138 25775068 27067747 27254026 28377204
16756B8377204Q78482R60301J260537Q21636J364976P35863J556279J165399J288255
$$ 28377204 29255686 30215987 31476524 32298160 33663136 34398999 35955278 37120677 38408932
16747C8408932J325667J683664J408328J265892J627691J792237K229836J633713
$$ 38408932 39734599 41418263 42826591 44092483 45720174 47512411 49742247 51375960
16739E1375960J934407J908294K074190K396456K311969K132898K541987K757762
$$ 51375960 53310367 55218661 57292851 59689307 62001276 64134174 66676161 69433923
16731F9433923K433977K872316K535239L032411K844177K942198K796970L489139
$$ 69433923 71867900 74740216 77275455 80307866 83152043 86094241 88891211 92380350
16723I2380350K686105L371714L113183L032728L040095K506566K793184K537389
$$ 92380350 95066455 98438169 101551352 104584080 107624175 110130741 112923925 115461314
16715A15461314K606957J959062J769831J818963J423534J193398O33398N82013
$$ 115461314 118068271 120027333 121797164 123616127 125039661 126233059 126866457 127448470
16707A27448470k69796l46006p25446r06619j671182j597780j608787k132670
$$ 127448470 127178674 126832668 126107222 125200603 123529421 121931641 120322854 118190184
16699A18190184k471198k485423k556413l178397l024382k941331k637439l226153
$$ 118190184 115718986 113233563 110677150 107498753 104474371 101533040 98895601 95669448
16691I5669448l225715l270440l076240k880945k767202l090986k811279k606663
$$ 95669448 92443733 89173293 86097053 83216108 80448906 77357920 74546641 71939978
16683G1939978k890011k771768k442564k413438k107079k307806j967493k092303
$$ 71939978 69049967 66278199 63835635 61422197 59315118 57007312 55039819 52947516
16675E2947516j995433j634974k037791j778462j655097j655947j569514j292777
$$ 52947516 50952083 49317109 47279318 45500856 43845759 42189812 40620298 39327521
16667C9327521j351449j438179j185486j267709j180936j265237p78237j296283
$$ 39327521 37976072 36537893 35352407 34084698 32903762 31638525 30860288 29564005
16659B9564005o94012r57765q70749p37026q47326o82135o09669r48874p33298
$$ 29564005 28869993 27912228 27041479 26304453 25457127 24774992 24165323 23216449 22483151
16650B2483151n76860r20840k46258p04305n24720n78938m08150n63960m86083
$$ 22483151 21906291 20985451 20739193 20034888 19510168 18931230 18523080 17959120 17473037
16641A7473037m73731m99596l34132j65120n51456m10952n10460j89537q0144
$$ 17473037 16999306 16499710 16165578 16000458 15449002 15038050 14527590 14338053 14257909
16632A4257909q23952n06712M8662j54915n11733K4562n07075m54042k552n63531
$$ 14257909 13433957 12927245 12975907 12820992 12309259 12333821 11826746 11372704 11370152 10806621
16622A0806621R1423l65709j56505k91608m6038k46174k86705l84747K21562o20903
$$ 10806621 10898044 10532335 10375830 10084222 10038184 9792010 9505305 9120558 9342120 8721217
16612H721217L2866j45166q8036j71684p8614k21772k42021J10165m11570r6026
$$ 8721217 8754083 8608917 8520881 8349197 8270583 8048811 7806790 7916955 7505385 7409359
16602G409359j29674Q7875k56945j20753n18177J13325J11314k16512J24899l31932
$$ 7409359 7279685 7367560 7110615 6989862 6471685 6585010 6696324 6479812 6604711 6272779
16592F272779k38736l59601J96484K9876j71850j58135l2402j47056J82662m15166
$$ 6272779 6034043 5674442 5870926 5900802 5728952 5570817 5538415 5391359 5574021 5158855
16582E158855O6536j1113q7316k15995O8331L8418m46752o019J23866n1596J26034
$$ 5158855 5225391 5214278 5126962 4910967 4979298 5017716 4570964 4564945 4688811 4637215 4763249
16571D763249k06305m96902K43270k08186N76419o74256j03737K75853J8881l90044
$$ 4763249 4556944 4060042 4303312 4095126 4671545 3997289 3893552 4169405 4188286 3798242
16561C798242j79960j13246l4154N21780k41935k16383K301K079o6738o7223j49702
$$ 3798242 3618282 3505036 3470882 3992662 3750727 3534344 3536645 3538724 3471986 3404763 3255061
16550C255061J04260k98948L47666m78125K63812k53595K65949K0668j87083l44447
$$ 3255061 3359321 3060373 3408039 2929914 3193726 2940131 3206080 3226748 3039665 2695218
16540B695218Q0290J98094P4465k38504r228R4817k70177j20414L03155Q8698
$$ 2695218 2775508 2973602 3048067 2809563 2800335 2895152 2624975 2504561 2807716 2896414
16530B896414n51255J08060M74500k57700R5252j29323O6845j80374J47921r7857
$$ 2896414 2345159 2453219 2927719 2670019 2765271 2635948 2702793 2522419 2670340 2572483
16520B572483j28935k3935j43377J34426k13278K08453j20876R4992k46624K9367
$$ 2572483 2443548 2419613 2276236 2410662 2197384 2405837 2284961 2379953 2133329 2162696
16510B162696P8260Q7353k34199k06377K66592N2344m23983L42672j66738Q3674
$$ 2162696 2240956 2328309 2094110 1887733 2154325 2206669 1782686 2125358 1958620 2042294
16500B042294l8051j40131m759L20746m68586J32409o3257K72324l15097q1572
$$ 2042294 2004243 1864112 1859353 2180099 1711513 1843922 1780665 2052989 1737892 1656320
16490A656320J12467j33111K04189o2549j02905k9133k560Q1228j49940m2563
$$ 1656320 1768787 1635676 1839865 1777316 1674411 1645278 1642718 1723946 1574006 1531443
16480A531443m1833J67786O9078j03602j5705o3494L12134k19230k14414n6830
$$ 1531443 1489610 1657396 1726474 1622872 1607167 1543673 1855807 1636577 1422163 1365333
16470A365333P4484P5920j88399K15984j46160L03157l43151N9631j66569M18869
$$ 1365333 1439817 1515737 1327338 1543322 1397162 1700319 1357168 1416799 1250230 1669099
16460A669099m1409k44125k20197K47132J42342K70343k34280o2577j13774m2704
$$ 1669099 1627690 1383565 1163368 1410500 1552842 1823185 1588905 1526328 1412554 1369850
16450A369850j69634r0569K78437j72266J53730j42192Q9109j45144j75721K79447
$$ 1369850 1200216 1109647 1388084 1215818 1369548 1227356 1316465 1171321 995600 1275047
16440A275047K14184n13850K18170J63063l85445K47086r2033j8585K50886l35692
$$ 1275047 1489231 975381 1193551 1356614 971169 1218255 1126222 1107637 1358523 1022831
16430A022831p5968L40240n8760Q4279k08250l7385o4894J64566M5649j25858
$$ 1022831 946863 1287103 1228343 1312622 1104372 1066987 1002093 1166659 1212308 1086450
16420A086450J01249L34k72944L44059m46435M47230r6768o4817l62397K17241
$$ 1086450 1187699 1188033 915089 1259148 812713 1259943 1163175 1098358 735961 953202
16410I53202R1790q4927j666J25696m3062j41526k07515M95293p713k21950J12577
$$ 953202 1044992 960065 958399 1084095 1041033 899507 691992 1187285 1179572 957622 1070199
16399A070199j45887k52070K97873J46787k48949m383L3913k42981J80136M09241
$$ 1070199 924312 672242 970115 1116902 867953 863570 897483 654502 834638 1243879
16389A243879n11802K70199r217L7221o2546J37747l3715D32508J97733P7758
$$ 1243879 732077 1002276 993059 1030280 967734 1105481 1071766 432508 630241 707999
16379G07999M09208m18048R4959J83536m03947M73318k41669J28161N4501k82757
$$ 707999 1117207 699159 794118 977654 573707 1047025 805356 933517 988018 705261
16369G05261l2262j30876K67209P4921m11007K13042J87069q7807P2721l15979
$$ 705261 672999 542123 809332 884253 473246 686288 873357 785550 858271 542292
16359E42292Q3091j04835j9800M4419J95660j86615L15194R2319q2798j28777
$$ 542292 625383 520548 500748 545167 740827 554212 869406 961725 878927 750150
16349G50150k74266j58673L0584L88704n1260j43543k25606J0963J89103L92454
$$ 750150 475884 317211 347795 736499 685239 541696 316090 327053 516156 908610
16339I08610L1585m41105L86207j83431q516O7407k27524J58727k0005K19702
$$ 908610 940195 499090 885297 701866 693350 760757 533233 691960 671955 891657
16329H91657j73654k3043j37807j51101L01396L538l29311K12674l1045r7920
$$ 891657 718003 694960 557153 406052 707448 710986 381675 594349 563304 465384
16319D65384L24461J10683m19099L26195k63916K0409K11571J70550D39110K47580
$$ 465384 789845 900528 481429 807624 543708 564117 775688 946238 439110 686690
16309F86690r939L5701l25764L07125j71843K63623C79997I6485J11934K36861
$$ 686690 676751 712452 386688 693813 521970 785593 379997 96485 208419 445280
16299D45280r714j42218K17696j07831K54106j02734K765j52183A67754J67070
$$ 445280 435566 293348 511044 403213 657319 554585 557350 405167 167754 334824
16289C34824K2338M99031l71564n5467N5065k1563P1m7839K8160j50062P5611
$$ 334824 357162 856193 484629 429162 484227 462664 462735 414896 443056 292994 368605
16278C68605K28891A66374K66063N835J4223M7513C8039N58665j8810j20989l9599
$$ 368605 597496 166374 432437 438272 452495 500008 38039 596704 577894 456905 417306
16267D17306J56420k72634L15241B43776K07082K73909C62302K06071j25686j25950
$$ 417306 573726 301092 616333 243776 450858 724767 362302 568373 442687 316737
16257C16737J61749K58398B34275O9032J36362j67602J21099j32158P3035k0480
$$ 316737 478486 736884 234275 303307 439669 272067 393166 261008 334043 313563
16247C13563R6304j22398o1239J96817m5810j08128L1326J53900n3149L10541
$$ 313563 409867 287469 226230 423047 377237 269109 300435 454335 401186 711727
16237G11727j2027k22310j85618K18665H3638K53841k205Q9647A28861N55994
$$ 711727 699700 477390 291772 510437 83638 337479 335274 424921 128861 684855
16227F84855l5995j91746p0981j78077L28212J945k38962J55285j62404l2559
$$ 684855 648860 457114 386133 208056 536268 538213 299251 454536 292132 259573
16217B59573J53672L02968B70359J74059j77899q7370J12213A23933K26520m5170
$$ 259573 413245 716213 270359 444418 266519 179149 291362 123933 350453 305283
16207C05283A08213K3817K84546k9482J86616a2484E29370A9740J04314L89110
$$ 305283 108213 132030 416576 387094 573710 -12484 529370 19740 124054 513164
16197E13164K21659C08612j43427J72468r0286N0564K6341q133j07524J80664
$$ 513164 734823 308612 165185 337653 247367 297931 324272 316139 208615 389279
16187C89279J01600j71747P096j39842J12629J22138D767K1787K68624o1922N1297
$$ 389279 490879 319132 326228 186386 299015 421153 4767 26554 295178 233256 284553
16176B84553F6709K46441J2692n3859d0063p9624C35020G931K66410D0452M8090
$$ 284553 66709 313150 325842 271983 -40063 -119687 335020 7931 274341 40452 88542
16165H8542L72342A93785k7136B6934K15265L92670B50448r4066P6524L02974
$$ 88542 460884 193785 166649 26934 242199 634869 250448 156382 232906 535880
16155E35880B11170K2508K0814l8841J31416A19708L42494F9345L21046I1834
$$ 535880 211170 233678 254492 215651 347067 119708 462202 69345 390391 91834
16144A35372N320b2854H424g0206B89616A15922m2452K36014n9812j03563J51547
$$ 135372 140692 -22854 8424 -70206 289616 115922 73470 309484 249672 146109 297656
16133B97656A6744K08297K18135A50263J96428d7758J4435A98055K5285a41643
$$ 297656 16744 225041 443176 150263 346691 -47758 -33323 198055 223340 -141643
16122B60524b46008D25009a7234C90830n9245j10986F6695K0667K72272a72258
$$ 260524 -246008 425009 -17234 390830 331585 220599 66695 87362 359634 -172258
16111F3399J33355K06786n4752a3053k4632I8451i0540G37919A69646J63051d9938
$$ 63399 196754 403540 348788 -13053 -37685 98451 -90540 737919 169646 332697 -49938
16099a5863E22834I7028A9068a25629A25075K3286h7645B94512E3705g238C68158
$$ -15863 522834 97028 19068 -125629 125075 148361 -87645 294512 53705 -7238 368158
16087E5719L29648H9929K58637E6730P0945e0713A16497m3223j6900J8263L10079
$$ 55719 385367 89929 348566 56730 127675 -50713 116497 73274 56374 74637 384716
16076C84716A19585n1953J29452Q8121b6364A22753K03945i415D288J9835J60650
$$ 384716 119585 67632 197084 285205 -26364 122753 326698 -9415 4288 24123 184773
16065A84773G5616K12719D1183M39476B06287I7094Q8917J79832E1908L77463
$$ 184773 75616 288335 41183 480659 206287 97094 186011 365843 51908 429371
16055D29371b08880A0337J77850p6354L7499a01175B09513H4132J76851C0555
$$ 429371 -208880 10337 188187 111833 149332 -101175 209513 84132 260983 30555
16044A28296K23749a80188A42825b31515a93B5945N2058c7120G0549J71736f6821
$$ 128296 352045 -180188 142825 -231515 -193 25945 78003 -37120 70549 242285 -66821
16032D30265I1555Q6628p4180i0547C2195L50104G7387K3486N8858R2942b13328
$$ 430265 91555 178183 104003 -90547 32195 382299 77387 100873 159731 252673 -213328
16020b65379E798J33424n7213O9189k2033J32702j6290d057A24989L7028K4017
$$ -265379 5798 139222 82009 151198 129165 261867 245577 -4057 124989 162017 186034
16009A86034l5257m5950P1224J73383i0368B1094e5290B43611g6463b2428r8764
$$ 186034 150777 104827 176051 349434 -90368 21094 -55290 243611 -76463 -22428 -121192
15998a21192J2521k2487H4751f2629B0051K30340d7536b464G4491a67566A64233
$$ -121192 -108671 -131158 84751 -62629 20051 250391 -47536 -2464 74491 -167566 164233
15986B9901J72062D6199O300K47570a1127D05208I7279L7243M957c9793j7764
$$ 29901 201963 46199 52499 300069 -11127 405208 97279 134522 139479 -39793 -57557
15975e7557B93619L46503A67238R27088k89984L55388J70628n92571p223j75065
$$ -57557 293619 640122 167238 1094326 804342 1159730 1330358 737787 730564 555499
15965E55499j34507F2331K71027I9690K2707b54353G4421k8580J36638a4970B65255
$$ 555499 420992 62331 333358 99690 122397 -254353 74421 45841 182479 -14970 265255
15953b5354A70815a61711D0519Q956N8996j7270C9456a55320A16432a46221I0793
$$ -25354 170815 -161711 40519 49475 108471 91201 39456 -155320 116432 -146221 90793
15941H7121l3276O2861C7157a3547j0915I1493O513b80420o3104A30642L342R126
$$ 87121 53845 116706 37157 -13547 -24462 91493 98006 -280420 -343524 130642 133984 143110
15929A43110P5420J14484f2405C26773O4116a7552q5815B03024A7980a39845B52380
$$ 143110 218530 333014 -62405 326773 390889 -17552 -103367 203024 17980 -139845 252380
15917c17511A96563h1236A8218a47172g1336c0974j88314h1441a1359F7988a6863
$$ -317511 196563 -81236 18218 -147172 -71336 -30974 -219288 -81441 -11359 67988 -16863
15905B43298J7311h360m3124R68k30236A7850c7863A37318a77463F7016a08727
$$ 243298 260609 -8360 -51484 -50516 -280752 17850 -37863 137318 -177463 67016 -108727
15893a26658B60635A11636L3544e7277k11025I7237a09875p8272K9218H1246J6021
$$ -126658 260635 111636 145180 -57277 -268302 97237 -109875 -188147 -158929 81246 97267
15882I7267e2576B17821a48174d6513B28007E7060d9090A573Q5589J36297a07341
$$ 97267 -52576 217821 -148174 -46513 228007 57060 -49090 1573 87162 223459 -107341
15870B57092d4697j30093A50801a38982d4972j90845M6111B07004a53160c9071
$$ 257092 -44697 -174790 150801 -138982 -44972 -235817 -189706 207004 -153160 -39071
15859A9182K2438a87030A3103a09735j52954i4232q4137n739e8226k8503A61888
$$ 19182 41620 -187030 13103 -109735 -262689 -94232 -178369 -184108 -58226 -86729 161888
15847E3660P062J31160b21098a4255A05669B3147O8655f1702k36611E8405O2949
$$ 53660 60722 191882 -221098 -14255 105669 23147 91802 -61702 -298313 58405 121354
15836A21354c67925A49812A5872K66209d14088I8301c75515b3393d904k32096
$$ 121354 -367925 149812 15872 282081 -414088 98301 -375515 -23393 -4904 -237000
15826b37000E896R6965m1116J22354A286a63272C0244J00714j2095J4811a10915
$$ -237000 5896 102861 61745 184099 1286 -163272 30244 130958 118863 133674 -110915
15814A02505l6739c86896A14965a71501M5657N8543k01569A11864c75976B29765
$$ 102505 65766 -386896 114965 -171501 -125844 -67301 -268870 111864 -375976 229765
15803A13714h9802D0753a97466B33559q7451c97014j7996a47412b7374I9709K40022
$$ 113714 -89802 40753 -197466 233559 146108 -397014 -415010 -147412 -27374 99709 339731
15792C39731H8791a15479k9693A20117b343n1822j37517k25763E9779d9343F1476
$$ 339731 88791 -115479 -145172 120117 -2343 -54165 -191682 -417445 59779 -49343 61476
15780A08446J17916C9256a29561F9861F574J56038O0350D6865a17580A44806b67850
$$ 108446 226362 39256 -129561 69861 6574 162612 222962 46865 -117580 144806 -267850
15768d14910a0619j10760q0991P5301b9054B01193E7726L9993B872a19800A11334
$$ -414910 -10619 -121379 -202370 -127069 -29054 201193 57726 97719 2872 -119800 111334
15756B56907i1703K6399l26572P0976f1037A08196a45842m2632B91247G8030L19879
$$ 256907 -91703 -65304 -391876 -320900 -61037 108196 -145842 -188474 291247 78030 397909
15745C97909d30028i0020B38983i458m9073k6566g941A59416c5515A836K26700
$$ 397909 -430028 -90020 238983 -9458 -58531 -85097 -7941 159416 -35515 1836 228536
15734B28536Q2547j05583f5760o79B3853J14527c03488C96268j96287a33885B9415
$$ 228536 311083 205500 -65760 -66439 23853 138380 -303488 396268 199981 -133885 29415
15722B7075G458i8551E6007b03106R5031E9940h7492o303G4368J07057c8319B6813
$$ 27075 7458 -98551 56007 -203106 -108075 59940 -87492 -93795 74368 181425 -38319 26813
15709B87495c34129a50282p73A52231b55733A79288K18499c62645h239A47044
$$ 287495 -334129 -150282 -151055 152231 -255733 179288 397787 -362645 -8239 147044
15698A63615K19499e1641A25629f7859b4931D9081a13069j4213E6308i9448B06085
$$ 163615 383114 -51641 125629 -67859 -24931 49081 -113069 -127282 56308 -99448 206085
15686B30335a74117A35121a94665D7689j5573d3765B75979A18236O10a27933A58990
$$ 230335 -174117 135121 -194665 47689 32116 -43765 275979 118236 118846 -127933 158990
15674C3341L3292a8574C7422K62519a75521I4949a98519L3345E8826Q1436D2711
$$ 33341 66633 -18574 37422 299941 -175521 94949 -198519 -165174 58826 140262 42711
15662A74015C1721J3648L6407h6665D8909K35164m2875C6737J5410a52487f6537
$$ 174015 31721 45369 81776 -86665 48909 284073 241198 36737 52147 -152487 -66537
15650e8849l7205M1427k3670D11740f5680r9514B1614b68793J17423K7190B90186
$$ -58849 -96054 -54627 -78297 411740 -65680 -165194 21614 -268793 -151370 -124180 290186
15638B9261a32946c6776k6465j31611R479A46781j9581b3712A2221a44377d2273
$$ 29261 -132946 -36776 -63241 -194852 -185373 146781 127200 -23712 12221 -144377 -42273
15626B7546a08878d8920E4950J53036a85006C9329P6317a25601J7933p605D0799
$$ 27546 -108878 -48920 54950 207986 -185006 39329 115646 -125601 -107668 -115273 40799
15614c16650i4644j09820A19600b88538d9705j60644j00778a18548D4763J14304
$$ -316650 -94644 -204464 119600 -288538 -49705 -210349 -311127 -118548 44763 159067
15604A59067b00765I0745i5812B2535J58916c38527j0002d7300q3960A23551c50516
$$ 159067 -200765 90745 -95812 22535 181451 -338527 -348529 -47300 -131260 123551 -350516
15592B04761C0088g4112j28975Q1804a4581C22215b12777N7910A17567a90089
$$ 204761 30088 -74112 -203087 -121283 -14581 322215 -212777 -154867 117567 -190089
15581C4082c68769I880a1109M463G156L1394Q4793c2282R577n2137K6117k89658
$$ 34082 -368769 9880 -11109 -6646 7156 38550 123343 -32282 -22705 -74842 -48725 -338383
15569c38383A30664a45214b8296j02357d6162j02141B8556d9653A82467c6025
$$ -338383 130664 -145214 -28296 -130653 -46162 -148303 28556 -49653 182467 -36025
15558b0499j35607e2413J5236j74319q6063a14411k8234A9354b58130a23393J291
$$ -20499 -156106 -52413 -37177 -211496 -297559 -114411 -142645 19354 -258130 -123393 -122102
15547a22102C3858d17036R5992C72830d6841k29862O4153P519D2133a33335A18036
$$ -122102 33858 -417036 -321044 372830 -46841 -276703 -212550 -205031 42133 -133335 118036
15535B27378k6480a43534e6304A48295c14484e5314I3269k0335P9483a8187B75464
$$ 227378 200898 -143534 -56304 148295 -314484 -55314 93269 72934 152417 -18187 275464
15523B81113j39034a29832A70386J55166n7802E9036a01238k30581C43686A69714
$$ 281113 142079 -129832 170386 325552 267750 59036 -101238 -331819 343686 169714
15512A35483O4664n5349c1132D1622b36903d6585l09858D22947i0627A88951e4823
$$ 135483 200147 144798 -31132 41622 -236903 -46585 -356443 422947 -90627 188951 -54823
15500B7722b17805C24590l8825A00343J2313a28436D4469O5836k2966d0118C21766
$$ 27722 -217805 324590 285765 100343 112656 -128436 44469 110305 87339 -40118 321766
15488D12921A44615J46629m5586G1991K03696c7629B33203o6488n6852C1558J37193
$$ 412921 144615 291244 245658 71991 275687 -37629 233203 166715 109863 31558 168751
15477A68751a14166A92283D3182O2029f04B2840h9633k4398F104e2434c71H9449
$$ 168751 -114166 192283 43182 105211 -604 22840 -89633 -114031 6104 -52434 -371 89449
15464d7461A90355a2098b215A77981G3056M62424L39215k59209k91701j8612h750
$$ -47461 190355 -12098 -2215 177981 73056 535480 874695 615486 323785 305173 -8750
15452C68904H135J57809p8605C3109M8720J32957c73253b7123E8266K11768B2765
$$ 368904 8135 165944 87339 33109 81829 214786 -373253 -27123 58266 270034 22765
15440d1740k30886A17905b20878a7072k8549C41197j45559a36199b7984A15369
$$ -41740 -272626 117905 -220878 -17072 -45621 341197 195638 -136199 -27984 115369
15429C72895R0266P0310J63328L15042l06035K08383D28657O6621j90245A10032
$$ 372895 463161 533471 696799 1011841 705806 914189 428657 495278 305033 110032
15418B57284P4493j21068O3599a01485C80629I2248C4833P2826l1014f6102K7829
$$ 257284 331777 210709 274308 -101485 380629 92248 34833 107659 76645 -66102 -38273
15407c8273o3829H5980a30148D2947J71402J30322d0293A30167d2834A1070a5672
$$ -38273 -102102 85980 -130148 42947 214349 344671 -40293 130167 -42834 11070 -15672
15395C9389a27051D9579d670l0146A32934a8458j56712A31091c9063k75077A33864
$$ 39389 -127051 49579 -4670 -34816 132934 -18458 -175170 131091 -39063 -314140 133864
15383G7295b3631N311m0879j92621c8901J1773j15505k1943A74198L982b31440
$$ 77295 -23631 -18320 -59199 -251820 -38901 -27128 -142633 -164576 174198 178180 -231440
15371a29972k9300e7290l99349A92312Q3772J40430j86142d198j19242A77339
$$ -129972 -159272 -57290 -456639 192312 276084 416514 230372 -4198 -123440 177339
15360B56714A06235a11674A01123L38175F3288b31165b6839D0119L14327A44064
$$ 256714 106235 -111674 101123 439298 63288 -231165 -26839 40119 354446 144064
15349B71765m2124F3631K09727k635j13903J09839C8139L6596L7318d3320E62119
$$ 271765 229641 63631 273358 270723 156820 266659 38139 74735 112053 -43320 562119
15337c9452B3381L12434A13013N4434M9109j01850K55188m4394k582p8162K87839
$$ -39452 23381 335815 113013 167447 216556 114706 369894 325500 322918 244756 532595
15326E32595G3452d9055A20477h6471C80515j54968G7688d4084j22907G5787K13346
$$ 532595 73452 -49055 120477 -86471 380515 225547 77688 -44084 -166991 75787 289133
15315B89133R5582h9678A31935J22884q3978G1449M06639A55161d8852p6480C03204
$$ 289133 384715 -89678 131935 254819 170841 71449 478088 155161 -48852 -125332 303204
15303C48828j38095a73844E9969M76633I2177m4490a4048C11034a00171C36720
$$ 348828 210733 -173844 59969 536602 92177 47687 -14048 311034 -100171 336720
15292B02107a18836B3688K86958I0106a76685g6775G2143M63164B7121A3290c9514
$$ 202107 -118836 23688 310646 90106 -176685 -76775 72143 535307 27121 13290 -39514
15280B95683O4594b8128B4434K80011b168B0071a00426E9357i6042C55779a1375
$$ 295683 360277 -28128 24434 304445 -2168 20071 -100426 59357 -96042 355779 -11375
15268F5982J10565f0091A89708e6238D3512d0156B52466i9881J7558A95517i1827
$$ 65982 176547 -60091 189708 -56238 43512 -40156 252466 -99881 -82323 195517 -91827
15256D18023k06722b26641G2795P4731C4256a66542H5440a21022I5707K108l724
$$ 418023 211301 -226641 72795 147526 34256 -166542 85440 -121022 95707 97815 94091
15245I4091g197I1901e5540j33180M4553A67519b08461c5354D92144A63026M647
$$ 94091 -7197 91901 -55540 -188720 -144167 167519 -208461 -35354 492144 163026 167673
15234A67673Q3926k7335K37080c0851H05549j42694O72168K8595J8104j28760
$$ 167673 251599 224264 461344 -30851 805549 662855 1335023 1363618 1381722 1252962
15224A252962n23041j87783j51390A30316n7602o857K87503A36393A2450J08006
$$ 1252962 729921 542138 390748 130316 72714 65857 353360 136393 12450 120456
15214A20456C6060d3633A17673P6186A1397J7986f6435D16437a13183A13834K01245
$$ 120456 36060 -43633 117673 193859 11397 29383 -66435 416437 -113183 113834 315079
15203C15079D9690i7440J9620m33A70668J96226b22464I419b05366q4833B71000
$$ 315079 49690 -97440 -77820 -78253 170668 366894 -222464 9419 -205366 -290199 271000
15191A52583j5915k1688M4203G8206k2409p500d5986C68874k1494j15780c4831
$$ 152583 136668 114980 159183 78206 55797 48297 -45986 368874 347380 231600 -34831
15179a01379A40653e632F1813b60428C9259L1735J80978A7445c5785k1656D17600
$$ -101379 140653 -5632 61813 -260428 39259 70994 251972 17445 -35785 -57441 417600
15167D40386b50442h8997a8152l7457b6058G3457j5499K32355j18551A4114J67933
$$ 440386 -250442 -88997 -18152 -55609 -26058 73457 57958 290313 171762 14114 182047
15156A82047b07674B945J76315K63652H6077K24452a56162B9837P7080Q4734M0497
$$ 182047 -207674 2945 179260 442912 86077 310529 -156162 29837 106917 191651 232148
15145B32148R8012g1015A42290b9741A85855M7141O8822j27241B8492a12478l9921
$$ 232148 330160 -71015 142290 -29741 185855 232996 301818 174577 28492 -112478 -152399
15134a52399B26823h6879A19899J46042A6802h3944A33066n8929M29761j95915
$$ -152399 226823 -86879 119899 265941 16802 -83944 133066 74137 503898 307983
15124C07983R4417A25774M1250d9358D32494j68911J6826H9500c8760A80377J18942
$$ 307983 402400 125774 167024 -49358 432494 263583 280409 89500 -38760 180377 299319
15113B99319j44854p3649P2794J24828J02406j11505G6856a4423E76766R7311
$$ 299319 154465 80816 153610 278438 380844 269339 76856 -14423 576766 674077
15103F74077j21548k32645n6403i1681A98248a1614l0908A39862J89285A10249
$$ 674077 552529 319884 263481 -91681 198248 -11614 -42522 139862 329147 110249
15092h4784B16599l0837K8948G2899b90979b9762A82323R6257A24472l132a30314
$$ -84784 216599 185762 214710 72899 -290979 -29762 182323 278580 124472 121340 -130314
15080A31922J89819D6826P9643d2432B24019a07055q847k8724A32106m9572b9879
$$ 131922 321741 46826 126469 -42432 224019 -107055 -115902 -144626 132106 82534 -29879
15068I6685a31957A30403o3089J72714D843Q891a60518A92804m6980J60798l5787
$$ 96685 -131957 130403 67314 240028 4843 13734 -160518 192804 145824 306622 270835
15057B70835k3805J11185a7731C49126B5652J98536A2803a11356H4786K3777k9520
$$ 270835 247030 358215 -17731 349126 25652 224188 12803 -111356 84786 108563 79043
15046G9043K4125N39116B66804P8857A21489J74532D8960L90652j0434c0089A45095
$$ 79043 103168 642284 266804 345661 121489 296021 48960 439612 429178 -30089 145095
15034A57641R6638M3391K0954P7208o417j30929N9915q9898J53592M2990P7101
$$ 157641 254279 297670 318624 395832 389415 258486 318401 228503 382095 425085 502186
15023E02186q1399B09888J24207J75324B00039L74933k54400M54874l25475J53157
$$ 502186 420787 209888 334095 509419 200039 574972 320572 775446 449971 603128
15013F03128j25567l2156P6023n6055l5863K69133A42900N10474B46546J30337
$$ 603128 477561 445405 521428 465373 429510 698643 142900 653374 246546 376883
15003C76883N7681K06033j45238j03601p1740K73578A91624K48914Q937M8220
$$ 376883 434564 640597 495359 391758 320018 593596 191624 440538 449475 497695
14993D97695G0280L35282J32243j02678K7827j96084L74223A08268M35768N2366
$$ 497695 70280 405562 537805 435127 462954 266870 641093 108268 544036 596402
14983E96402N7392l11773n5690O6094K11472j5619j69442I2651M80210N6479j45628
$$ 596402 653794 342021 286331 352425 563897 548278 378836 92651 572861 629340 483712
14972D83712J12842A93436J33300J66603J98930q9146L15099j27586l13911J52138
$$ 483712 596554 193436 326736 493339 692269 603123 918222 790636 476725 628863
14962F28863j01028J33408q5387n5585j50752O78765n21803N4012B14155L86756
$$ 628863 527835 661243 575856 520271 369519 1048284 526481 580493 214155 600911
14952F00911B12244n7102M40135j17063q1689o9132L0011J03592n3342L2439K1163
$$ 600911 212244 155142 595277 478214 396525 327393 357404 460996 407654 440093 461256
14941D61256j97977n1430n2579O3955L4109K36247i299D24094L54403k49330j69103
$$ 461256 263279 211849 159270 223225 257334 493581 -9299 424094 778497 529167 360064
14930C60064J02631K38990j77693L29239J2118k45251m0709j8771J69854j97888
$$ 360064 462695 701685 523992 853231 865349 620098 579389 560618 730472 532584
14920E32584k60055L74254j41059J6550K7925Q55043l2786j53443k10119K55932
$$ 532584 272529 646783 505724 522274 550199 1405242 1372456 1219013 1008894 1264826
14910A264826J67098J71579K16876r8496l02280K13301O6728j41417M30097J59990
$$ 1264826 1431924 1603503 1820379 1721883 1419603 1632904 1699632 1558215 1988312 2148302
14900B148302k59903M0157k46474n83922k3599J85022k65446k20609k82788P953
$$ 2148302 1888399 1928556 1682082 1098160 1074561 1259583 994137 773528 490740 498693
14890D98693K67682k57180M50303m10970K11926B65174J27103L30866l36014K4370
$$ 498693 766375 509195 959498 548528 760454 265174 392277 723143 387129 411499
14880D11499N9156G5783L65147K02425n1592q3080B53052L67595M4320J35549
$$ 411499 470655 75783 440930 643355 591763 508683 253052 620647 664967 800516
14870H00516j32820J68237R7988k50778J73885j68638J48950K29043l91130J29398
$$ 800516 667696 835933 933921 683143 857028 688390 837340 1066383 675253 804651
14860H04651k45150K79953l16209L5022K31775j67571l7940K0457M9246M6545
$$ 804651 559501 839454 523245 558267 790042 622471 584531 604988 654234 700779
14850G00779O7174o5220J6735l37730J19953B17269K19066j85016L58092J4932
$$ 700779 767953 702733 719468 381738 501691 217269 436335 251319 609411 624343
14840F24343j47236J8744p1718j46347J19708K88979k12077J45392p3559M4163
$$ 624343 477107 495851 424133 277786 397494 686473 474396 619788 546229 590392
14830E90392L97172k87138L39005j93211J37209R540l3238K44745l66193k22455
$$ 590392 987564 700426 1039431 846220 983429 992969 959731 1204476 838283 615828
14820F15828K93879j41396M2007k41449J93960l03427K70727C51267M80158k60694
$$ 615828 909707 768311 810318 568869 762829 459402 730129 351267 831425 570731
14810E70731k07314K56573k68804M56088k9059q8846k99516N01144J2629l15499
$$ 570731 363417 619990 351186 807274 778215 689369 389853 890997 903626 588127
14800E88127L61805O3511D62187k05872L80205j11057k00165N83277o8844P5030
$$ 588127 949932 1013443 462187 256315 636520 525463 325298 908575 839731 914761
14790I14761j09575K10479K62209l71249k404k49327L49600m44911p768J45813
$$ 914761 805186 1015665 1277874 906625 904221 654894 1004494 559583 551815 697628
14780F97628k91596K5414Q797J57808J07172l14955K29143L0246k13311k071K80614
$$ 697628 406032 431446 440243 598051 705223 390268 619411 649657 436346 434275 714889
14769G14889k59603R7374K7640L23494k18721k94973N16405J46354m04794J29847
$$ 714889 455286 552660 580300 903794 685073 390100 906505 1052859 648065 777912
14759G77912p3092R9524N8641m27208J88794J5815n5821N4528P0744C17498L85555
$$ 777912 704820 804344 862985 435777 624571 640386 584565 639093 709837 317498 703053
14748G03053K30631m03854q2096j67594J33114L82581r5424j55344O0689K7781
$$ 703053 933684 529830 447734 280140 413254 795835 700411 545067 605756 633537
14738F33537l5790K8643j7898K94168j91875k15889L61971k33999O9798r6918
$$ 633537 597747 626390 608492 902660 710785 494896 856867 622868 692666 595748
14728E95748k8839L22433j64773J98406k5605l63664M73739o8190K5996k34208
$$ 595748 566909 889342 724569 922975 897370 533706 1007445 939255 965251 731043
14718G31043k39950L88816N31678m56956L95720M4830J97885k07882K26467j24340
$$ 731043 491093 879909 1411587 954631 1350351 1395181 1593066 1385184 1611651 1487311
14708A487311M962j83689o194j37170l00265J78152k81533N5915L6671J46231
$$ 1487311 1492273 1308584 1302390 1165220 864955 1043107 761574 817489 854160 1000391
14698A000391j81746K78826l72720K54416o923K15868k05726m7438O8786M77380
$$ 1000391 818645 1097471 724751 979167 972244 1188112 982386 934948 1003734 1481114
14688A481114k05756n3922P55870l62255L70439n57876o3756j70144l02788K60396
$$ 1481114 1275358 1221436 1977306 1615051 1985490 1427614 1363858 1193714 890926 1151322
14678A151322R8938l97464K24961K06637k60784j23720k02013L74389j90635k18188
$$ 1151322 1250260 852796 1077757 1284394 1023610 899890 697877 1072266 881631 663443
14668F63443k4910L32334L4247J64981m94149K75298j23138K34788k18873k8582
$$ 663443 638533 970867 1005114 1170095 675946 951244 828106 1062894 844021 815439
14658H15439K75771k8454J64936l43706J44045J94642k70245j51102K19263j12256
$$ 815439 1091210 1062756 1227692 883986 1028031 1222673 952428 801326 1020589 908333
14648I08333Q8471N1528K91431Q6065l16521Q8545P8206k2280j24886J2900K35166
$$ 908333 996804 1048332 1339763 1425828 1109307 1197852 1276058 1253778 1128892 1141792 1376958
14637A376958J25078m59545J28966K40898k05683j17768J11237Q1565j80272P4910
$$ 1376958 1502036 1042491 1171457 1412355 1206672 1088904 1200141 1281706 1101434 1176344
14627A176344j74762m9024K04838k0945K63858k57821q106J49025n8325l9260
$$ 1176344 1001582 952558 1157396 1136451 1400309 1142488 1134382 1283407 1225082 1185822
14617A185822P432J30749k2168j53083L43003n13207M19212k10725L32035P1275
$$ 1185822 1193254 1324003 1301835 1148752 1491755 978548 1397760 1187035 1519070 1590345
14607A590345j87256j35481j04104J86444J84016J68704l28681Q8899J5886p5234
$$ 1590345 1403089 1267608 1163504 1349948 1533964 1702668 1373987 1462886 1478772 1403538
14597A403538k7508K21547k18102n9034l5083K75307j18685l20893O21399l41846
$$ 1403538 1376030 1597577 1379475 1320441 1285358 1560665 1441980 1121087 1742486 1400640
14587A400640o909J18016K74857k23027J46678r4747J44983o9498J89372m54551
$$ 1400640 1393731 1511747 1786604 1563577 1710255 1615508 1760491 1690993 1880365 1425814
14577A425814L66080P567J34894l39685K39429J03394j52042l71816O33509l3291
$$ 1425814 1791894 1799461 1934355 1594670 1834099 1937493 1785451 1413635 2047144 2013853
14567B013853j42702k04825Q3223M09962k13810K2748N40861n06697O4488O8767
$$ 2013853 1871151 1666326 1749549 2159511 1945701 1968449 2509310 2002613 2067101 2135868
14557B135868k36900J08133Q083K63322l34786O44077l7462j21898J61071L7101
$$ 2135868 1898968 2007101 2015184 2278506 1943720 2587797 2550335 2428437 2589508 2626609
14547B626609k987J85728p445J37802M43325M7401J99880J48703M62400L35955
$$ 2626609 2623622 2809350 2801905 2939707 3383032 3430433 3630313 3779016 4241416 4577371
14537D577371R86736N77595J520203K398749M079171P047004J0278399J26579
$$ 4577371 5564107 6141702 7661905 10060654 14139825 21186829 31465228 31591807
14529C1591807j3736221q013642l726926j340545n14332J88011N18414j325243
$$ 31591807 17855586 9841944 6115018 4774473 4260141 4448152 4966566 3641323
14521C641323o43237j55570j45313n40185M26535k50060n399j48302k87444O19606
$$ 3641323 2998086 2842516 2697203 2157018 2583553 2333493 2328094 2179792 1892348 2511954
14511B511954k93469J64783q0567M4648k49688J86415J47743J14268k32116K87230
$$ 2511954 2218485 2383268 2302701 2347349 2097661 2284076 2431819 2546087 2313971 2601201
14501B601201J21272k16357j21009L56699K99441l54342L02878j67663j8388L6551
$$ 2601201 2722473 2506116 2385107 2741806 3041247 2686905 2989783 2822120 2803732 2840283
14491B840283Q118J23394P6337O1575M33013o70585K55578L400J71438r5307J19466
$$ 2840283 2848401 2971795 3048132 3109707 3542720 2872135 3127713 3131113 3302551 3207244 3326710
14480C326710p026L2244m1613P0548j98786J04908L9720K70062j66187L25225
$$ 3326710 3319684 3351928 3310315 3380863 3182077 3286985 3326705 3596767 3430580 3755805
14470C755805q0270J26406J30484j68305K24933Q8259L3339j4025K4317l25832
$$ 3755805 3675535 3801941 3932425 3764120 3989053 4077312 4110651 4096626 4120943 3795111
14460C795111L47728j47283J06307l42637M14630K11878k87235L14793r0682K82805
$$ 3795111 4142839 3995556 4101863 3759226 4173856 4385734 4098499 4413292 4322610 4605415
14450D605415j38998L37779O7066k76915N8895j65194M14500j3022J98811m49597
$$ 4605415 4466417 4804196 4871262 4594347 4653242 4488048 4902548 4889526 5088337 4638740
14440D638740N91661K2473k01275K61065J29960k14638L64910k97582L89400m9915
$$ 4638740 5230401 5252874 5051599 5312664 5442624 5227986 5592896 5295314 5684714 5634799
14430E634799Q9189J98882l0205k89679L37926L92843j72603O4160R5660K32651
$$ 5634799 5723988 5922870 5892665 5602986 5940912 6333755 6161152 6225312 6320972 6553623
14420F553623J14287Q6511o9480O4253L81167k70497J76368J10394O1187M88941
$$ 6553623 6667910 6754421 6684941 6749194 7130361 6859864 7036232 7146626 7207813 7696754
14410G696754l77859K21488N0819L25332j05694K45799M28384K63987j07829K69064
$$ 7696754 7318895 7540383 7591202 7916534 7810840 8056639 8485023 8749010 8641181 8910245
14400H910245q0794m67839L64990J22594K99570j7662M34106j97846K19857L34174
$$ 8910245 8829451 8361612 8726602 8849196 9148766 9131104 9565210 9367364 9587221 9921395
14390I921395L546J41845P13482l59380L73052j58785K74464J59424k24935N04642
$$ 9921395 9924941 10066786 10780268 10420888 10793940 10635155 10909619 11069043 10844108 11348750
14380A1348750J71460L63205o1765M72884j69093M82482K36768Q3664L82365J5379
$$ 11348750 11520210 11883415 11821650 12294534 12125441 12607923 12844691 12928355 13310720 13326099
14370A3326099M75534Q8631N45685J68247M09348J37136O23345Q0866L8732M33780
$$ 13326099 13801633 13890264 14435949 14604196 15013544 15150680 15774025 15854891 15893623 16327403
14360A6327403L84197M2422Q0390L97677P96015L64126p238M57844M57081Q09919
$$ 16327403 16711600 16754022 16834412 17232089 18028104 18392230 18384992 18842836 19299917 20109836
14350B0109836M38573L61971N98465K69102M45832L89412J68059R43754K10574
$$ 20109836 20548409 20910380 21508845 21777947 22223779 22613191 22781250 23725004 23935578
14341B3935578N19593Q72304O05153N29551J01797R14895N68557R45175P96999
$$ 23935578 24455171 25327475 25932628 26462179 26563976 27478871 28047428 28992603 29789602
14332B9789602Q34447L93039J101118J050675P61864J079334Q88095J160822R63256
$$ 29789602 30624049 31017088 32118206 33168881 33930745 35010079 35898174 37058996 38022252
14323C8022252J253006J132256R80779J358368J066784J569378J056338J598527
$$ 38022252 39275258 40407514 41388293 42746661 43813445 45382823 46439161 48037688
14315D8037688J716435J492273J615467J847602J477342K127500K455177K138795
$$ 48037688 49754123 51246396 52861863 54709465 56186807 58314307 60769484 62908279
14307F2908279K028845K430203K454362K544256K796004K796257K860234L412347
$$ 62908279 64937124 67367327 69821689 72365945 75161949 77958206 80818440 84230787
14299H4230787L089194L391658M075994L688093M534544M727698M687612N262279
$$ 84230787 87319981 90711639 94787633 98475726 103010270 107737968 112425580 117687859
14291A17687859M968164N921816O057147O377222O527754P498094P422997Q020752
$$ 117687859 122656023 128577839 134634986 141012208 147539962 155038056 162461053 170481805
14283A70481805Q526658Q954622R848742J0015538J0853472J1439229J1648665
$$ 170481805 179008463 187963085 197811827 207827365 218680837 230120066 241768731
14276B41768731J2625162J3115564J3567673J4364357J4015483J3714179J4159120
$$ 241768731 254393893 267509457 281077130 295441487 309456970 323171149 337330269
14269C37330269J3578784J3750172J3454966J2536278J2047863J1436221J0066495
$$ 337330269 350909053 364659225 378114191 390650469 402698332 414134553 424201048
14262D24201048R254709Q707081P377316O327801L488173J056007k81739O64731
$$ 424201048 433455757 442162838 449540154 455867955 459356128 460412135 460130396 460795127
14254D60795127j963770p954142o282319q569469j1524461j1676605j3120696
$$ 460795127 458831357 450877215 444594896 436025427 424500966 412824361 399703665
14247C99703665j3867656j5182627j4868760j3914722j3277617j4495450j4222502
$$ 399703665 385836009 370653382 355784622 341869900 328592283 314096833 299874331
14240B99874331j3515695j3630204j2892833j2641324j1646200j1107938r958916
$$ 299874331 286358636 272728432 259835599 247194275 235548075 224440137 214481221
14233B14481221r842209j0384769r754496r520152q757043q175009p621696p038964
$$ 214481221 204639012 194254243 184499747 174979595 166222552 158047543 150425847 143386883
14225A43386883o502384o227225o041292n305587n490138m808179m615689m612202
$$ 143386883 136884499 130657274 124615982 119310395 113820257 109012078 104396389 99784187
14217I9784187l901598l480914l738748l573971l485538k838940l068972k527737
$$ 99784187 95882589 92401675 88662927 85088956 81603418 78764478 75695506 73167769
14209G3167769l039508k251620k417173k209881j907692k291928k029036j809282
$$ 73167769 70128261 67876641 65459468 63249587 61341895 59049967 57020931 55211649
14201E5211649j576771k001149j349407j359100j725358j287511j534071j312503
$$ 55211649 53634878 51633729 50284322 48925222 47199864 45912353 44378282 43065779
14193D3065779r60041p87872j447127r29404j520794r10995o03940r93822j014028
$$ 43065779 42105738 41317866 39870739 38941335 37420541 36509546 35905606 34911784 33897756
14184C3897756q23758j037588q43781n77769p78840m62949o44453r37450o53228
$$ 33897756 33073998 32036410 31192629 30614860 29836020 29373071 28728618 27791168 27137940
14175B7137940r73166l89972m52087p72863m70583n24781m13368q95819j56340
$$ 27137940 26164774 25774802 25322715 24549852 24079269 23554488 23141120 22245301 22088961
14166B2088961m88112n17970o56088k57694j46515l63843p27555k1153o42546
$$ 22088961 21600849 21082879 20426791 20169097 20022582 19658739 18931184 18910031 18267485
14157A8267485l65119l95955k84855j82604n60030j64368n95952j47615k0171
$$ 18267485 17902366 17506411 17221556 17038952 16478922 16314554 15718602 15570987 15550816
14148A5550816m44279J07478m03007n61881k42632M071m24429k67493j10153l64767
$$ 15550816 15106537 15214015 14811008 14249127 14006495 14010566 13586137 13318644 13208491 12843724
14138A2843724j61379k77897j41045l37370K8390J4456o00921k05306m8471j82576
$$ 12843724 12682345 12404448 12263403 11926033 11954423 11968879 11367958 11162652 11114181 10931605
14128A0931605O921k18526k12458k01920P678l33895k3786O5589m96840j94477
$$ 10931605 10938526 10720000 10507542 10305622 10313300 9979405 9955619 10021208 9524368 9329891
14118I329891R8312j92076K09924m41702P8776n37659j24700J54746N3514o70025
$$ 9329891 9428203 9236127 9446051 9004349 9083125 8545466 8420766 8575512 8629026 7959001
14108G959001Q7816l9494j75747j45446O9860K4922j24330n3637k39354j48931
$$ 7959001 8046817 8007323 7831576 7686130 7755990 7780912 7656582 7602945 7363591 7214660
14098G214660k00052P3195j50796L07372l09825l49234K96422k25617n2821M8575
$$ 7214660 7014608 7087803 6937007 7244379 6934554 6585320 6881742 6656125 6603304 6651879
14088F651879j15232k41987j26567L8556l36034R1205k09226L79376n11416j4991
$$ 6651879 6536647 6294660 6168093 6206649 5870615 5961820 5752594 6131970 5620554 5605563
14078E605563j2222j87293K47984q1210J03999l02209j93730q4635J92588k42703
$$ 5605563 5593341 5406048 5654032 5572822 5676821 5374612 5180882 5096247 5288835 5046132
14068E046132j25905r1327Q7599J24568j01661j68905J5286q5647j81020L34565
$$ 5046132 4920227 4828900 4916499 5041067 4939406 4770501 4785787 4700140 4519120 4853685
14058D853685m28572K14336k75305P8194J54479k22748j37124k41428K09004K06281
$$ 4853685 4425113 4639449 4364144 4442338 4596817 4374069 4236945 3995517 4204521 4410802
14048D410802m9944R9959m7348r8748J53642m48272j77376K5773J88612k37649
$$ 4410802 4360858 4460817 4413469 4314721 4468363 4020091 3842715 3868488 4057100 3819451
14038C819451J6687J48312k59020j19937R6292K91294o26557J87899j15858J29698
$$ 3819451 3836138 3984450 3725430 3605493 3701785 3993079 3366522 3554421 3438563 3568261
14028C568261n68203M16233k80020K62107o3638J19867L0138o27724Q0630K35621
$$ 3568261 3000058 3416291 3136271 3398378 3334740 3454607 3484745 2857021 2937651 3173272
14018C173272j99948K195r2230K60797J27014k65171J40886m71516L02130l26348
$$ 3173272 2973324 2975519 2883289 3144086 3271100 3005929 3146815 2675299 2977429 2651081
14008B651081J38628r6647j10991J24111r615J09851j99551k8462l34709J77150
$$ 2651081 2789709 2693062 2582071 2706182 2696567 2806418 2606867 2578405 2243696 2420846
13998B420846K45133L05232m75003k22376J67338L6004o9978q8697N8215k37210
$$ 2420846 2665979 2971211 2496208 2273832 2441170 2477174 2407196 2318499 2376714 2139504
13988B139504J39159l09937N40366M6208j11425k89424M70993l81184J78877O01767
$$ 2139504 2278663 1968726 2509092 2555300 2443875 2154451 2625444 2244260 2423137 3024904
13978C024904o69K5757P23665J068594J549330L405876O506686J0791624O412694
$$ 3024904 3024235 3049992 3773657 4842251 6391581 9797457 16304143 27095767 33508461
13969C3508461j1498131q314530m564425k137785j264245j078158o82869j63970
$$ 33508461 22010330 13695800 9131375 6993590 5729345 4651187 3968318 3804348
13961C804348k56259K19382l66123o30219J96626j12798m67139K97998Q7442j26112
$$ 3804348 3548089 3767471 3401348 2771129 2967755 2854957 2387818 2685816 2773258 2647146
13951B647146j41920J6616l72260K46983k81117L6147j33732K68348l75593Q4960
$$ 2647146 2505226 2521842 2149582 2396565 2115448 2151595 2017863 2286211 1910618 1995578
13941A995578L32530l35637J53095k07162k5455O996N5765k82423J13668J5061
$$ 1995578 2328108 1992471 2145566 1938404 1912949 1919945 1975710 1693287 1806955 1822016
13931A822016k54184J88761K24404m11538N16853m08078j47093N23034K55917
$$ 1822016 1567832 1756593 1980997 1569459 2086312 1678234 1531141 2054175 2310092
13922B310092l86157l40734P2456Q5296m9467p9866j24313K62908l98087M62059
$$ 2310092 1923935 1583201 1655657 1740953 1691486 1611620 1487307 1750215 1352128 1814187
13912A814187J69029o11842J55674J30017k84896L30679k77382L59158j8654j65781
$$ 1814187 1983216 1371374 1527048 1657065 1372169 1702848 1425466 1784624 1765970 1600189
13902A600189j45634m2532j63002L05033k63449J79170K35928l7827j64065J90868
$$ 1600189 1454555 1412023 1249021 1554054 1290605 1469775 1705703 1667876 1503811 1694679
13892A694679l42136J27821j07405J27166n4967J26746q5462j14297K00728m12212
$$ 1694679 1352543 1480364 1372959 1500125 1445158 1571904 1486442 1372145 1572873 1160661
13882A160661L23508j9279j38661r7890j46765J92781J22180N6570m4602O2653
$$ 1160661 1484169 1464890 1326229 1228339 1081574 1274355 1396535 1453105 1408503 1471156
13872A471156k55234J49819j84368j63022K23487m7047j86517N17661m77716K31478
$$ 1471156 1215922 1365741 1181373 1018351 1241838 1194791 1008274 1525935 1048219 1279697
13862A279697P1695k96357O643K02234k97713M82524l53275j55069K93303L9152
$$ 1279697 1351392 1055035 1061678 1263912 966199 1448723 1095448 940379 1233682 1272834
13852A272834o246k83127L13799q2403M414k9362l06723J00171J84509n9937k77
$$ 1272834 1266588 983461 1297260 1214857 1219271 1189909 883186 983357 1167866 1107929 1107652
13841A107652k129J52336j75295M8024k70175K81316r3592j08912J92167J69255
$$ 1107652 1105523 1257859 1082564 1130588 860413 1141729 1048137 939225 1131392 1300647
13831A300647m24628L19020j21320k05917K21602M5875j12276J83792k45992K22395
$$ 1300647 876019 1195039 1073719 867802 1089404 1135279 1023003 1206795 960803 1183198
13821A183198k24862k40854K55121j83583N25839j63509n37870N49305j65456
$$ 1183198 958336 717482 972603 789020 1314859 1151350 613480 1162785 997329
13812I97329p8884j41326J47621O1812p3299l59957M69418k5119J09093m24902
$$ 997329 918445 777119 924740 986552 913253 553296 1022714 997595 1106688 681786
13802F81786N65100p8260n52420J22451K23880l2803k88318L57949r1508j32363
$$ 681786 1246886 1168626 616206 738657 962537 929734 641416 999365 907857 775494
13792G75494J28878j90069J51014L516p2783J02557J66033l94174Q0616l9738
$$ 775494 904372 714303 865317 868833 796050 898607 1064640 670466 751082 711344
13782G11344J56932k88469K65993j63070J46840K11663j18538l1358J85876j19875
$$ 711344 868276 579807 845800 682730 829570 1041233 922695 891337 1077213 957338
13772I57338j33862K42844k22178K37154j33827l25576J22189k45279L01625O1438
$$ 957338 823476 1066320 844142 1081296 947469 621893 744082 498803 800428 861866
13762H61866l4345j01348j8945j4348L27436l70790O2226j63099Q8941j36776
$$ 861866 827521 726173 707228 692880 1020316 649526 711752 548653 637594 500818
13752E00818J47357O915P6735L6835P396j69494N0581n7243m4741J60580q8035
$$ 500818 648175 655090 731825 768660 776056 606562 657143 599900 555159 715739 627704
13741F27704K67489m29275K41029j72688p2051j355J38530p9533J77411J67750
$$ 627704 895193 465918 706947 534259 462208 460853 599383 519850 697261 865011
13731H65011q7573k69516K55493M0283j65583K2070k40234L05411j57110l4048
$$ 865011 777438 507922 763415 803698 638115 660185 419951 725362 568252 534204
13721E34204K7685J44759j55840k41873m7208N24220j48045R4455q1357q9506
$$ 534204 561889 706648 550808 308935 261727 785947 637902 732357 651000 561494
13711E61494l089P9184B05964N39831n8911K02031k56282j0734L3577C06642L32486
$$ 561494 558405 637589 205964 745795 686884 888915 632633 621899 655476 306642 639128
13700F39128j86794K80450l45604J61086k34834r9257N43275j65061r7899j04937
$$ 639128 452334 732784 387180 548266 313432 214175 757450 592389 494490 389553
13690C89553Q7123J01336l7764j17132J59759P2084j46456o644K61269l21022
$$ 389553 476676 578012 540248 423116 582875 654959 508503 501859 763128 442106
13680D42106M2143K4290k34320J29750Q5741k24073R1752J76912J9765B41964
$$ 442106 484249 508539 274219 403969 489710 265637 357389 534301 554066 241964
13669F60644l04730L46292j72200J8562j80660A83457L22072j11412K17409k30757
$$ 660644 355914 702206 530006 548568 367908 183457 505529 394117 611526 380769
13659C80769J87461l7504n3963r3358K56405J7748C08598L01220k7107l0204J1021
$$ 380769 568230 530726 476763 383405 639810 657558 308598 609818 582711 552507 563528
13648E63528j65254j65467L45632M3595p8141k03704M7366K71397r967k22413
$$ 563528 398274 232807 578439 622034 543893 340189 387555 658952 648985 426572
13638D26572N7432q3313A11714J87105L82268K2765j16537k00463L74365B39300
$$ 426572 484004 400691 111714 298819 681087 703852 587315 386852 761217 239300
13627B99437N4775H9847M90834j08919j66091L92421J02932C56021j46545L64736
$$ 299437 354212 89847 580681 471762 305671 698092 801024 356021 209476 574212
13617E74212r0025L7614j24434o34N5221j60409N01291k44864A12460L95722l361
$$ 574212 484187 521801 397367 396733 451954 291545 792836 547972 112460 508182 504821
13606E04821M5817j5835A88785J70870K98181k68542N8072m761J60924j22463
$$ 504821 550638 534803 188785 359655 657836 389294 447366 442605 603529 481066
13596D81066j04516K42678j11141J92272k98313A12188L9037K32303P7346Q6710
$$ 481066 376550 619228 508087 700359 402046 112188 151225 383528 460874 547584
13586E47584k59704L8556L74280J0533j51298A25209J07913l7029J41090n0245
$$ 547584 287880 326436 700716 711249 559951 125209 233122 196093 337183 286938
13576B86938n5696m9282L97662A13856O85201j65725B57703j04407L39395j59875
$$ 286938 231242 181960 579622 113856 799057 633332 257703 153296 492691 332816
13566C32816g2733G2236J47045J12266J40436j48643A38959J46812J36422p821
$$ 332816 -72733 72236 219281 331547 471983 323340 138959 285771 422193 414372
13556D14372A44617p1809J06824J55085p1956K49351A65796M92787B43514M0479
$$ 414372 144617 72808 179632 334717 262761 512112 165796 658583 243514 283993
13546B83993H9518M51493A23635j3361K42996K17362k24000l7935k7002L6120
$$ 283993 89518 541011 123635 110274 353270 570632 346632 308697 281695 317815
13536C17815A05899M61651A27030J51576p7441m7154K79408A93963N8418R0839
$$ 317815 105899 567550 127030 278606 201165 154011 433419 193963 252381 343220
13526C43220j56207K02240O3152N0892k45388O3726q0891n1461b59685B00619
$$ 343220 187013 389253 452405 503297 257909 321635 240744 189283 -259685 200619
13515C01225K53848k30231R1292H4204L84190A94862P9061K3025A28998M66341
$$ 301225 555073 324842 416134 84204 468394 194862 273923 296948 128998 595339
13505E95339k25118N3766f3797C58632P8914A44561J78710b13936A72857P5075
$$ 595339 370221 423987 -63797 358632 437546 144561 323271 -213936 172857 247932
13495B47932j20093m6273i5925C05835P8420j14041J96793j3936j86794A14899
$$ 247932 127839 81566 -95925 305835 384255 270214 467007 453071 266277 114899
13484D49431j2701A73319D2085a6867D93811B04427o6525B5193g6284E88898H2192
$$ 449431 436730 173319 42085 -16867 493811 204427 137902 25193 -76284 588898 82192
13472B09300L73926A05905J0035J13962J87428q5516H1639J77150a2565E45143
$$ 209300 583226 105905 115940 229902 417330 331814 81639 258789 -12565 545143
13461B74534f6248A10221c604C56396J29459A38702L34977A93347J75157j21169
$$ 274534 -66248 110221 -3604 356396 485855 138702 473679 193347 368504 247335
13451B47335J58747j55566f561B31599E012L56805j63589j0989L97177A26838
$$ 247335 406082 250516 -6561 231599 5012 361817 198228 187239 584416 126838
13440A70428M17415k83030Q4307f6120K8664A27911K14014b0993k0493B29477
$$ 170428 587843 304813 389120 -66120 -37456 127911 341925 -20993 -41486 229477
13429C57421J17603j00590A54791m5802K84360J88942f4655F5942L31274a27063
$$ 357421 475024 374434 154791 108989 393349 582291 -64655 65942 397216 -127063
13418I3378J0725Q1432B6862K27679b03329B37384J20989r7285J37785j06808
$$ 93378 104103 185535 26862 254541 -203329 237384 358373 261088 398873 292065
13408B92065j10469N7725j7431K5537d0562m728C7228A1642O2934L50495C3823
$$ 292065 181596 239321 221890 247427 -40562 -45290 37228 11642 74576 425071 33823
13396F7297R8238c7184C21510p1334P0589j51256E4098K33425k1217d8055B61537
$$ 67297 165535 -37184 321510 250176 320765 169509 54098 287523 266306 -48055 261537
13384A58678R1748J77146F6240L30385e4758C17195L4767j05589a36817B20962
$$ 158678 250426 427572 66240 396625 -54758 317195 351962 246373 -136817 220962
13373B28862J45J7850L1690k8566C1536L49973e5270A00864L26739C5582c23201
$$ 228862 229007 246857 278547 249981 31536 381509 -55270 100864 427603 35582 -323201
13361B46961H7411P4401O0380N7506o9425N6159m16A21385J35279J9892K55695
$$ 246961 87411 161812 222192 279698 210273 266432 266016 121385 256664 276556 532251
13350E32251B57952c3979A73558G8108K87407O1555A10956J54433L8609O1500
$$ 532251 257952 -33979 173558 78108 365515 427070 110956 265389 303998 365498
13340C65498j81523F6720J28415I6283f2022B62662N9234I8351J10825P7488K2927
$$ 365498 183975 66720 195135 96283 -62022 262662 321896 98351 209176 286664 309591
13329C09591J86922A75044O3691E8958J59460M2447M9004B7770L87789e1766A90902
$$ 309591 496513 175044 238735 58958 218418 260865 309869 27770 415559 -51766 190902
13317C32675j6427n7168A791i7746A36507h8784C87858K51449A27906J8482K57087
$$ 332675 316248 259080 1791 -97746 136507 -88784 387858 639307 127906 146388 403475
13306D03475A80376K2309e9065B2571L37985b71437B21060c5498C98400j86727
$$ 403475 180376 202685 -59065 22571 360556 -271437 221060 -35498 398400 211673
13296B11673r6678M77794A25487Q1254L15088G1924C1732K73029q8041I0411K28640
$$ 211673 114995 592789 125487 206741 521829 71924 31732 304761 216720 90411 319051
13285C19051g311A36263K23884a14616A87714K59244A48809b6615B11140J93325
$$ 319051 -7311 136263 360147 -114616 187714 446958 148809 -26615 211140 404465
13275D04465J95152a7B47645O1037A23861E8984P1418J86863J5694j64815b0914
$$ 404465 599617 -17 247645 308682 123861 58984 130402 317265 332959 168144 -20914
13263b29165A28357K20620G7973O8268K4843a49985K5785I4602K01610K10175
$$ -229165 128357 348977 77973 146241 171084 -149985 -124200 94602 296212 506387
13253E06387G3527K79763C8632i8576j54633H8472c6263c246A74757L0167d6358
$$ 506387 73527 353290 38632 -98576 -253209 88472 -36263 -3246 174757 204924 -46358
13241d5866B92518J3136j43383b1735B38687o5812k8205J50499o2172a18536A66062
$$ -45866 292518 305654 162271 -21735 238687 172875 144670 295169 232997 -118536 166062
13229F28498A68175M4627j7744m6091J38571a29940A15184K96101j77784a18317
$$ 628498 168175 212802 195058 148967 287538 -129940 115184 411285 233501 -118317
13218e6712k9495E2226Q2005K55699D9576N8184l9097b0831A04344N0356L4429
$$ -56712 -86207 52226 134231 389930 49576 107760 68663 -20831 104344 154700 189129
13207A89129K38336d5462B8832Q4878e538D6332J76166J85513b91851h2682c0938
$$ 189129 427465 -45462 28832 113710 -5538 46332 222498 408011 -291851 -82682 -30938
13195G0622K53576c2099H1347a73022A87566q5261j0482e361A51401g2652F5159
$$ 70622 324198 -32099 81347 -173022 187566 102305 91823 -5361 151401 -72652 65159
13183B69522a06598A12004b41049A71956o8010b39357g9450D60177a29087m116
$$ 269522 -106598 112004 -241049 171956 103946 -239357 -79450 460177 -129087 -133203
13173a33203C3557K45212f8947i746k5502C50955a39180c1414A2516M75244b49502
$$ -133203 33557 278769 -68947 -9746 -35248 350955 -139180 -31414 12516 487760 -249502
13161f056C33979I9331a33911l35766G1236M9938H469J45146b4800B98115D8369
$$ -6056 333979 99331 -133911 -469677 71236 121174 8469 153615 -24800 298115 48369
13149B3205J16502m6761k9858i5519F35512A02942a03883B82596e8866B35987
$$ 23205 139707 92946 63088 -95519 635512 102942 -103883 282596 -58866 235987
13138A2598P0652K10655J17875a5453l64332A74023e6662B46712J03770a71834
$$ 12598 83250 293905 411780 -15453 -379785 174023 -56662 246712 350482 -171834
13127A26110a22940F3777K71461A61082G9868e5320j61595I4182J01847b86705
$$ 126110 -122940 63777 335238 161082 79868 -55320 -216915 94182 196029 -286705
13116d4436J503I5612Q2558J7534I3836J87279a43065K1450D2954K48709g0895
$$ -44436 -42933 95612 178170 195704 93836 281115 -143065 -121615 42954 291663 -70895
13104A95329N8268h9524A67890d9702D96959I5530a72485F7657a87250D51055
$$ 195329 253597 -89524 167890 -49702 496959 95530 -172485 67657 -187250 451055
13093C42857A23737a01412A45993D0046J5248j0998m997f1856C4902J83461j00471
$$ 342857 123737 -101412 145993 40046 55294 44296 39299 -61856 34902 218363 117892
13082A17892B6410P5216f4421p1919f023l4988F6706K01782J7627E3492e5732
$$ 117892 26410 101626 -64421 -136340 -6023 -41011 66706 268488 286115 53492 -55732
13070A43768A0432c2189m3041J2556C7051L77014c17580J15064d9000A71104K27050
$$ 143768 10432 -32189 -75230 -62674 37051 414065 -317580 -202516 -49000 171104 398154
13059C98154C3991A6801b23135K6278C5497A1425L8661C903J13355N6820n9337
$$ 398154 33991 16801 -223135 -196857 35497 11425 50086 3903 117258 174078 114741
13048A14741l7852a19206D6346J56566a64458A46438a20098D1828L32030e7410
$$ 114741 76889 -119206 46346 202912 -164458 146438 -120098 41828 373858 -57410
13037C0696f8655C0056M9873K34771H5614b9784C9721N2503M4149l2231b55415
$$ 30696 -68655 30056 79929 314700 85614 -29784 39721 92224 136373 104142 -255415
13025f0120B54839J41571a90228H8494A9714a50234m5178A93665D1249a63096
$$ -60120 254839 396410 -190228 88494 19714 -150234 -195412 193665 41249 -163096
13014b3546A24394E803e9722j96509C34413C8788J75390p1970J10140B401d19
$$ -23546 124394 5803 -59722 -256231 334413 38788 214178 142208 252348 2401 -419
13002D4914K60006J31537e0889k9553k2983b1852I8397O345b0384j11169N2236
$$ 44914 304920 436457 -50889 -80442 -103425 -21852 98397 104742 -20384 -131553 -79317
12991g9317A92523D3134a17392C33318R9788a49262A6065f67F84L60540p8500
$$ -79317 192523 43134 -117392 333318 433106 -149262 16065 -667 684 361224 282724
12980B82724a70903A42933f5866B68055J20339A50379A7064f8693A14545M1391
$$ 282724 -170903 142933 -65866 268055 388394 150379 17064 -68693 114545 155936
12970A55936J06071j09824p4186K38736b25424C69177D6480Q3127a78687A02942
$$ 155936 262007 152183 77997 316733 -225424 369177 46480 129607 -178687 102942
12959A18665a81276m4602H0127K12978d6661j4913G1039c3433n64548d3990E9135
$$ 118665 -181276 -225878 80127 293105 -46661 -61574 71039 -33433 -597981 -43990 59135
12947b1288k97771H1442a13109c4547n1479K6215A85414F7136c4768l8109G5327
$$ -21288 -319059 81442 -113109 -34547 -86026 -59811 185414 67136 -34768 -72877 75327
12935F7638d2157C8493q604a20183a7966l08355c5134j62991k1140Q2772A40574
$$ 67638 -42157 38493 29889 -120183 -17966 -326321 -35134 -198125 -219265 -136493 140574
12923A75494R4839O07a2566j2109B01796H7333a3804b288m2196A64019a84009
$$ 175494 270333 270940 -12566 -24675 201796 87333 -13804 -2288 -44484 164019 -184009
12911A731K52465G6564P7886K81002A4088a77262P2197C8571J05047E7089j5646
$$ 1731 254196 76564 154450 435452 14088 -177262 -105065 38571 143618 57089 41443
12900D1443e2934B16820A6627N0659L12653F7072f9574J2999j65860J07059B26552
$$ 41443 -52934 216820 16627 67286 379939 67072 -69574 -56575 -222435 -115376 226552
12888D2917f1997n9622j35166d0937B92909a02028J5407I5735L0532b4523k1430
$$ 42917 -61997 -121619 -256785 -40937 292909 -102028 -86621 95735 126267 -24523 -45953
12877d5953A52842M9390d1460B11994K7376C171O6959c65881a60295H7446e3505
$$ -45953 152842 202232 -41460 211994 239370 3171 70130 -365881 -160295 87446 -53505
12865A41206L7910D9506J8445d4913F8374P5500M437a16385A2424O9187k4234
$$ 141206 179116 49506 67951 -44913 68374 143874 148311 -116385 12424 81611 57377
12854E7377c36800A18900a52653c7332B39455o6397B4450b5343A63107M3847J01886
$$ 57377 -336800 118900 -152653 -37332 239455 173058 24450 -25343 163107 206954 308840
12843C08840H4269j9776R6272c566f01r9943C09889a90716c4722k52428I2540
$$ 308840 84269 64493 160765 -3566 -601 -100544 309889 -190716 -34722 -287150 92540
12831f0945l5318k99113D4464b31169Q3802C13645d3892k32860B67740n0154a62190
$$ -60945 -96263 -395376 44464 -231169 -147367 313645 -43892 -276752 267740 217586 -162190
12819A74582a89941P2244e2799k31837i6189l5545I0917b1445D6343J38038E0293
$$ 174582 -189941 -117697 -52799 -284636 -96189 -131734 90917 -21445 46343 184381 50293
12807C79343A35910i361j18677a1735D97049b75714C21187j53072R0247B723J74644
$$ 379343 135910 -9361 -128038 -11735 497049 -275714 321187 168115 258362 2723 177367
12796A77367H1818J8436C6607J50651O6666A26487a22907B15746b8590C2267f0994
$$ 177367 81818 100254 36607 187258 253924 126487 -122907 215746 -28590 32267 -60994
12784b05395A58376g7514j13738h8025n95j79i037B92476e8620r2728h032k20309
$$ -205395 158376 -77514 -191252 -88025 -88620 -88799 -9037 292476 -58620 -151348 -8032 -228341
12772b28341E5051a9299k03486J08258a4988C81739l9795b06942l4176J7931e26
$$ -228341 55051 -19299 -222785 -114527 -14988 381739 341944 -206942 -241118 -223187 -526
12760d5018o3813q1882K3577e3695k19904a16949G8590h8551q4250C43036B5671
$$ -45018 -108831 -190713 -167136 -53695 -273599 -116949 78590 -88551 -172801 343036 25671
12748b49752A21209m2721l8552K11751j7510F2756i7627l20102A16876b36703
$$ -249752 121209 78488 39936 251687 234177 62756 -97627 -417729 116876 -236703
12737B20988K24476B8398d1646A82204b0958j62943k2299A01203h5027m6290B73110
$$ 220988 445464 28398 -41646 182204 -20958 -183901 -206200 101203 -85027 -131317 273110
12725C07009A3089Q3852J42840d4041B6792c7716C8634J976J14405K67432b31503
$$ 307009 13089 96941 239781 -44041 26792 -37716 38634 40610 155015 422447 -231503
12713i432A98324e1516o2000J6313e051I1152a20266n4380A84212h0888D8249
$$ -9432 198324 -51516 -113516 -97203 -5051 91152 -120266 -174646 184212 -80888 48249
12701E8532i0265a5375A30810l9570m0362M33993A53570O6586K13529c01G5261
$$ 58532 -90265 -15375 130810 91240 50878 484871 153570 220156 433685 -301 75261
12689B49758h9327b2929A68963a35262A48212C4380O6236J02762b5311j51310
$$ 249758 -89327 -22929 168963 -135262 148212 34380 100616 203378 -25311 -176621
12679a76621B16588K053a75456j61654P5241C20227d8568E8592J00235b9822k55953
$$ -176621 216588 218641 -175456 -337110 -261869 320227 -48568 58592 158827 -29822 -285775
12668b85775J11824b0146o6928B39291o2492P0526A03787a06366D305d28839A21446
$$ -285775 -173951 -20146 -87074 239291 176799 247325 103787 -106366 4305 -428839 121446
12656b6874E1811J21120J18542J1186g1592B27960B0142a46661C22034c0629A14234
$$ -26874 51811 172931 291473 302659 -71592 227960 20142 -146661 322034 -30629 114234
12644B96856f828A46335j8918J65184g9626B64519a12268n9769d5167D6987i1019
$$ 296856 -6828 146335 127417 292601 -79626 264519 -112268 -172037 -45167 46987 -91019
12632B22012c0250A66830b05032B30933g5911F2517M4001O1502F9345K8694c18446
$$ 222012 -30250 166830 -205032 230933 -75911 62517 106518 168020 69345 98039 -318446
12620C1463d8656k9522D009K68255a00121j28286h2154E7152J78093N9455L6408
$$ 31463 -48656 -78178 4009 272264 -100121 -228407 -82154 57152 235245 294700 331108
12609C31108f5564C02824b22956A63680H1534L14585E5700o376M7107l5748f1274
$$ 331108 -65564 302824 -222956 163680 81534 396119 55700 49324 96431 60683 -61274
12597C1867e1147A63897L39705a0941B2782b35081A22749b17641C2086J47626
$$ 31867 -51147 163897 503602 -10941 22782 -235081 122749 -217641 32086 179712
12587A79712h4023B30655a66227D11534H2206a30597E6895a15904e3893E0396
$$ 179712 -84023 230655 -166227 411534 82206 -130597 56895 -115904 -53893 50396
12576D1401P464K3409e03482A48110a40630g0213A25402b00266D78457b15804
$$ 41401 48865 72274 -503482 148110 -140630 -70213 125402 -200266 478457 -215804
12565i7437C2965i3502D6457J79804J87246j61028a09315B23582L292b6730H6499
$$ -97437 32965 -93502 46457 226261 413507 252479 -109315 223582 226874 -26730 86499
12553h0944q0275J0424d6040A82590J23006f6775B50792a42670j78448C25826
$$ -80944 -161219 -150795 -46040 182590 305596 -66775 250792 -142670 -321118 325826
12542A27803f8157p1397b4904F7334d5441C11400h2226D084N9958M0245b98769
$$ 127803 -68157 -139554 -24904 67334 -45441 311400 -82226 4084 64042 104287 -298769
12530g6629C76250b81585i3710A30a67370O8237A19623Q8432o4555m0546J2863
$$ -76629 376250 -281585 -93710 130 -167370 -99133 119623 208055 143500 102954 115817
12519A15817g1447L2854r1299A62316E0030g8197F6453k0675R7299c48272A00787
$$ 115817 -71447 -38593 -129892 162316 50030 -78197 66453 45778 143077 -348272 100787
12507a45452J1765A26933k7593K1789N0519P530L2450b2066j46166C89402j38042
$$ -145452 -133687 126933 99340 121129 171648 179178 211628 -22066 -168232 389402 251360
12496B51360a9131A25897o410J80454j40503a6215A58707K00729b06870D72629
$$ 251360 -19131 125897 119487 299941 159438 -16215 158707 359436 -206870 472629
12485b1400j60056i595n0855k0273m11B76961b9225E3968a05059B09198a10970
$$ -21400 -181456 -9595 -60450 -80723 -81134 276961 -29225 53968 -105059 209198 -110970
12473A1226O1677b0336E2684c41927A73663a45371L6565o0020p1195F9506a32558
$$ 11226 72903 -20336 52684 -341927 173663 -145371 -108806 -168826 -240021 69506 -132558
12461D0189K1080r940J64667a80896k4914P7151J8956B7555Q765c15927i0666
$$ 40189 61269 51329 215996 -180896 -205810 -128659 -109703 27555 36320 -315927 -90666
12449A44485F5996L70188g3331p97H5271P7549a00459c6840C56791b66372A22
$$ 144485 65996 436184 -73331 -74128 85271 162820 -100459 -36840 356791 -266372 122
12437i3033E590b22610L2232A44442d6478C15920a10993B06011a16324k86978
$$ -93033 5590 -222610 -190378 144442 -46478 315920 -110993 206011 -116324 -403302
12427d03302h3593B97859I0606l1199a07402G867O8558a35359L9414j39216C3001
$$ -403302 -83593 297859 90606 59407 -107402 7867 76425 -135359 -95945 -235161 33001
12415A59560a71803C0484a1498k2765B60712i4761E2812b36142D3802i2896A8577
$$ 159560 -171803 30484 -11498 -34263 260712 -94761 52812 -236142 43802 -92896 18577
12403a72190E1599J6379b4083l08537A87418k9271g210A80084c71478O8382i0274
$$ -172190 51599 67978 -24083 -332620 187418 158147 -7210 180084 -371478 -303096 -90274
12391A10547E4999L4382g1294A14169J73271d37011C3867b22311F4546a05950
$$ 110547 54999 89381 -71294 114169 287440 -437011 33867 -222311 64546 -105950
12380d2208l2662q5154E5508J75437b58304F539J8033J12298J9721L8732c94393
$$ -42208 -74870 -160024 55508 230945 -258304 6539 24572 136870 156591 195323 -394393
12368a03221a8772j42262f1067j50962B47544a48641B49549A3979P7837f8878
$$ -103221 -18772 -161034 -61067 -212029 247544 -148641 249549 13979 91816 -68878
12357C35379a04272A63959J46394g3720A0426a23904j57546A62735A0341K10510
$$ 335379 -104272 163959 310353 -73720 10426 -123904 -281450 162735 10341 220851
12347B20851C8325f3889A29036B4384J2572M6079J40447a5736F491d37598G2208
$$ 220851 38325 -63889 129036 24384 36956 83035 223482 -15736 6491 -437598 72208
12335c1227j23942E23309A64648a2838q0696H5788b05285A29686E9405K8933K6808
$$ -31227 -155169 523309 164648 -12838 -93534 85788 -205285 129686 59405 88338 115146
12324A15146K35867a37771k6355c5526A7049i9399A43445g7803I2833b5248A954
$$ 115146 351013 -137771 -164126 -35526 17049 -99399 143445 -77803 92833 -25248 1954
12312a84919A08003R0258J80776A75791g7740A63920O321J73792d4271A47339
$$ -184919 108003 198261 379037 175791 -77740 163920 170241 344033 -44271 147339
12301D79937j31959m2001A36813l7085R9868J27560j33921E2593d3424k35676
$$ 479937 347978 305977 136813 99728 199596 327156 193235 52593 -43424 -279100
12291b79100J10338E9614i5493A07937b82736C16308P6396M914C1144K7706K8900
$$ -279100 -168762 59614 -95493 107937 -282736 316308 392704 397618 31144 58850 87750
12280H7750f690B28120A11631C8825b6495p656A08351C1484L4862K84252a7051
$$ 87750 -6690 228120 111631 38825 -26495 -34151 108351 31484 66346 350598 -17051
12268a49639C09657R1751A47741L7187k7117D2530J12805K56476j3622p8163G9428
$$ -149639 309657 401408 147741 184928 157811 42530 155335 411811 398189 320026 79428
12256B00186e5459B58149j20409a84957C47239j41100m6250G5567K80115j19774
$$ 200186 -55459 258149 137740 -184957 347239 206139 159889 75567 355682 235908
12246B35908p9083O6209g1197j77700A36388a69395A3482J95454L04692j22401
$$ 235908 156825 223034 -71197 -248897 136388 -169395 13482 208936 513628 391227
12236C91227P796A96617O1655G4711a19072l6495I8554R4129B2738L7340P6256
$$ 391227 399023 196617 258272 74711 -119072 -155567 98554 192683 22738 60078 136334
12225A36334j4068a05955D2954d7006r0105c5515o3368L5754B8429L47438b05621
$$ 136334 122266 -105955 42954 -47006 -137111 -35515 -98883 -63129 28429 375867 -205621
12213A70766L2100J3100J8807A11277a61501O7759A80778o7478f8756A40386n7645
$$ 170766 202866 215966 234773 111277 -161501 -93742 180778 113300 -68756 140386 82741
12202H2741B2505L0661Q0078J01814R2774d8097A54659m3465D9413j0133J50475
$$ 82741 22505 53166 133244 235058 327832 -48097 154659 111194 49413 39280 189755
12191A89755d8578A183a2992A19873j8469a04096C02383N5437h2295B33581N7450
$$ 189755 -48578 1183 -12992 119873 101404 -104096 302383 357820 -82295 233581 291031
12180B91031A35851D0927b21495e7395H0712K39058r4773R5802C6503N7716A26
$$ 291031 135851 40927 -221495 -57395 80712 319770 224997 320799 36503 94219 126
12168B38812k2867a32226B35389A14546J15837a95036f6428A91306a24102e9092
$$ 238812 215945 -132226 235389 114546 230383 -195036 -66428 191306 -124102 -59092
12157e0170r7023p1059e8270C73214j31376r0925J07994g7174D929M94347B29788
$$ -50170 -147193 -218252 -58270 373214 241838 150913 258907 -77174 4929 499276 229788
12145B45110o6582L3602P9743C3134J12334a63083B30723b0072C30523h6709B72096
$$ 245110 178528 212130 291873 33134 145468 -163083 230723 -20072 330523 -86709 272096
12133e5900C52248F6796e687H3325J03633H1815N0575b16388A89371k2401L10049
$$ -55900 352248 66796 -5687 83325 186958 81815 132390 -216388 189371 166970 477019
12122D77019A17935L6444b3960o8067H360M3796h2291k0210j8951A8392q317L58820
$$ 477019 117935 154379 -23960 -92027 8360 52156 -82291 -102501 -121452 18392 10075 368895
12110C68895b47145B29796M8646n2569A11473Q4999E5074J22818k1178J00163
$$ 368895 -247145 229796 278442 225873 111473 196472 55074 177892 156714 256877
12100B56877q8645c06143C9925a17716B19884b12906C94835H6959J71618a56315
$$ 256877 168232 -306143 39925 -117716 219884 -212906 394835 86959 258577 -156315
12089C80239A65172a05365A57647D2752R4114g6759k807B54985m0648e13223e4913
$$ 380239 165172 -105365 157647 42752 136866 -76759 -79566 254985 214337 -513223 -54913
12077B78286A8111K03879o1442d0859B0543J70391l7667N3318P778N1991a96046
$$ 278286 18111 221990 160548 -40859 20543 190934 153267 206585 214363 266354 -196046
12065A8402P0276K7011K6610J46066a43101O3602C59716d978A78583F1959M48409
$$ 18402 88678 115689 142299 288365 -143101 -79499 359716 -4978 178583 61959 510368
12054E10368D7649c4735A59213J94684j18509f2245A18062m9733d4213j1083B27635
$$ 510368 47649 -34735 159213 353897 235388 -62245 118062 68329 -44213 -55296 227635
12042H274f663C55977H7684K13016b27047A26469a00040o9766B12592a52092c8643
$$ 8274 -6663 355977 87684 300700 -227047 126469 -100040 -169806 212592 -152092 -38643
12030c6463k25977D39688A02431m2938b5977O812l7574k29159I4970e4436j54679
$$ -36463 -262440 439688 102431 59493 -25977 -19165 -56739 -285898 94970 -54436 -209115
12019b09115A74204G8748d2627C49456d1492H7177J7074a63239r7632R1579A78298
$$ -209115 174204 78748 -42627 349456 -41492 87177 104251 -163239 -260871 -169292 178298
12007C97441A97063o7689K1176C6094A5634f44482A07717l5988L59791G8916J29813
$$ 397441 197063 129374 150550 36094 15634 -644482 107717 71729 431520 78916 208729
11996B08729K72431A12591b01562r8839J10403c4204A09163K43200C4203K61079
$$ 208729 481160 112591 -201562 -300401 -189998 -34204 109163 352363 34203 295282
11986B95282p6466b14171B56568D2542J59605r7771a05894K4862B97406f6378
$$ 295282 218816 -214171 256568 42542 202147 104376 -105894 -81032 297406 -66378
11975c3663C4950M9574M6474J41994c28021J02443b6272B73411g9101H8854g8320
$$ -33663 34950 84524 130998 272992 -328021 -225578 -26272 273411 -79101 88854 -78320
11963C25257L5821i4795j36972C17707G7752b0629A57721N4516a89590C8433a828
$$ 325257 361078 -94795 -231767 317707 77752 -20629 157721 212237 -189590 38433 -1828
11951C32689G0542d4933k79242J28923i3308H1819h8105j3626B5041J6309d2658
$$ 332689 70542 -44933 -324175 -195252 -93308 81819 -88105 -101731 25041 41350 -42658
11939b49235J02867a5435j33474B03656d7541r6655B66078h1405k6200C999O7233
$$ -249235 -146368 -15435 -148909 203656 -47541 -144196 266078 -81405 -107605 3999 71232
11928G1232N0107B4174J79410l9864K86199A38861k9155J2909b15321A12905b08238
$$ 71232 121339 24174 203584 163720 449919 138861 109706 122615 -215321 112905 -208238
11916c02209G5307c30675h0150B16292c8939j04693C77293A14182a87191e3467
$$ -302209 75307 -330675 -80150 216292 -38939 -143632 377293 114182 -187191 -53467
11905H6229e6810n7524j78357D0501O8224m1025P6189J888a10407d6752A36180
$$ 86229 -56810 -114334 -292691 40501 108725 67700 143889 145777 -110407 -46752 136180
11893d8877n2447j15354B50585c05851A88744m5552k6009E6702F756b86828A31678
$$ -48877 -101324 -216678 250585 -305851 188744 143192 117183 56702 6756 -286828 131678
11881D6365K9439i0631l831C57773a5525C59724b49756a5123B48626c27108D14217
$$ 46365 75804 -90631 -94462 357773 -15525 359724 -249756 -15123 248626 -327108 414217
11869a45212C90M8008c20321A79468Q2278a94064a0924C0472a32273L900J8504
$$ -145212 390 48398 -320321 179468 261746 -194064 -10924 30472 -132273 -128373 -109869
11858a09869B93890F1335d0652H943a92658Q9278a5231m1287B37758m5788C0742
$$ -109869 293890 61335 -40652 8943 -192658 -103380 -15231 -56518 237758 191970 30742
11846a35895B4456R4621h4819E0115a54902C58888B4599Q2641d6369A4125a60493
$$ -135895 24456 119077 -84819 50115 -154902 358888 24599 107240 -46369 14125 -160493
11834I3342B4984J15036e0082k09192g5471j6145b3132j96671J00256B9947e08576
$$ 93342 24984 140020 -50082 -259274 -75471 -91616 -23132 -219803 -119547 29947 -508576
11822B48128a89763A9210d41C8571O1469i9294A49962n8964c4477m13848a8639
$$ 248128 -189763 19210 -441 38571 100040 -99294 149962 90998 -34477 -448325 -18639
11810A91001a03612b3163j71093I041a18875e2704j5848F3699b22026L0488F0926
$$ 191001 -103612 -23163 -194256 9041 -118875 -52704 -68552 63699 -222026 -191538 60926
11798A6938R5339J3230c9178F605f346D1581J18162B4991d4011k91929R856B31765
$$ 16938 112277 125507 -39178 6605 -6346 41581 159743 24991 -44011 -335940 -326084 231765
11785I0956J14583f05k89419a5883k91594C95182j88820a52326l7415f0960Q640
$$ 90956 205539 -605 -290024 -15883 -307477 395182 206362 -152326 -189741 -60960 -52320
11774e2320H328c52750A0969e6130c664G7456a08124j70919G1278c1912k06686
$$ -52320 8328 -352750 10969 -56130 -3664 77456 -108124 -279043 71278 -31912 -238598
11763b38598A04405a2610C33531A10558d1445j17866N3490A09893C0547a25472
$$ -238598 104405 -12610 333531 110558 -41445 -159311 -105821 109893 30547 -125472
11752A74148Q7412j29585a76296k36755a04147j79406L4031B3881a16368r9393
$$ 174148 261560 131975 -176296 -413051 -104147 -283553 -249522 23881 -116368 -215761
11742b15761B18230k2954e4625k34541l6532J20270L8221D8179a36506F3971Q654
$$ -215761 218230 195276 -54625 -289166 -325698 -205428 -167207 48179 -136506 63971 72625
11731G2625a10001b9727F4079a73522C00103N7649J8858A32869e4333A21887r656
$$ 72625 -110001 -29727 64079 -173522 300103 357752 376610 132869 -54333 121887 112231
11720A12231B5230J03673d50057D0355b02981A40598M4737B29J42f3826C56406
$$ 112231 25230 128903 -450057 40355 -202981 140598 185335 229 371 -63826 356406
11708E9324c0177j61726d560A66271d9807q4279i260l12379A73193K6338b7964
$$ 59324 -30177 -191903 -4560 166271 -49807 -134086 -9260 -321639 173193 199531 -27964
11696h3693j13468B09085a14504G0798J9081Q3721G5632J2824J80175A06188J5482
$$ -83693 -197161 209085 -114504 70798 89879 173600 75632 88456 268631 106188 121670
11685A21670e8425A74377o0631a02476k24184a28438A34116M8958A4447b62925
$$ 121670 -58425 174377 113746 -102476 -326660 -128438 134116 183074 14447 -262925
11674A48203F0953d4952k9880A45370M5014B9045a52291P1634B00929b50354A91313
$$ 148203 60953 -44952 -74832 145370 190384 29045 -152291 -80657 200929 -250354 191313
11662B56581A4509M3950a54249C1649f8857C86429A80368a3139A40756J29150
$$ 256581 14509 58459 -154249 31649 -68857 386429 180368 -13139 140756 269906
11652B69906a2656E069L0380f0681q3560D7605c2923C35210i3995c7885a4442
$$ 269906 -12656 5069 35449 -60681 -144241 47605 -32923 335210 -93995 -37885 -14442
11640D3358h4126d0367j34071B61038I2656K607b4100E4638e0140A11658b33852
$$ 43358 -84126 -40367 -174438 261038 92656 95263 -24100 54638 -50140 111658 -233852
11628A01579a82303A3157b28054C25383A4462J59871F2598j4174a41708e8080
$$ 101579 -182303 13157 -228054 325383 14462 174333 62598 48424 -141708 -58080
11617D6994M3020a34335k85278g619j22801A670a88627G9500b68056p1143a54146
$$ 46994 90014 -134335 -419613 -7619 -130420 1670 -188627 79500 -268056 -339199 -154146
11605H7301m1547K94726a32829B4488Q4641K1954J02048b45441C4246b4576k1043
$$ 87301 45754 340480 -132829 24488 109129 131083 233131 -245441 34246 -24576 -45619
11594d5619A08198j6591J35129a35862f6889A06109C5442i8241B41909b18294
$$ -45619 108198 91607 226736 -135862 -66889 106109 35442 -98241 241909 -218294
11583c0001A11069e5795n5039C27413A51526a1327m6316l4008r1440N7A35693
$$ -30001 111069 -55795 -110834 327413 151526 -11327 -57643 -91651 -183091 -183034 135693
11571d5552p3993A77107b28531B83896F711L55983c1734H6395J78095j6467A05846
$$ -45552 -119545 177107 -228531 283896 6711 362694 -31734 86395 264490 248023 105846
11559b22354j53265E35401B29597n4643G5417C2679J82082a07025e217l2398H3825
$$ -222354 -375619 535401 229597 174954 75417 32679 214761 -107025 -5217 -37615 83825
11547f5654D3769J85438b25871c558C64146j63636b45228a02486A77212a89776
$$ -65654 43769 229207 -225871 -3558 364146 200510 -245228 -102486 177212 -189776
11536a46571C4486b44393g6693A77864k4123a97038g3168k3805C46569A17888
$$ -146571 34486 -244393 -76693 177864 153741 -197038 -73168 -96973 346569 117888
11525e3550C7199a53195E7285K37022f641H6763R9682i8316C6808c68202F0414
$$ -53550 37199 -153195 57285 294307 -6641 86763 186445 -98316 36808 -368202 60414
11513A48852a34275J5212j15630C35913o6997p5617J3879d02891d663B99216A44699
$$ 148852 -134275 -119063 -234693 335913 268916 193299 207178 -402891 -4663 299216 144699
11501H9514a01128I4284g7710A96015b23555B46954j0651I0462a34701A42263
$$ 89514 -101128 94284 -77710 196015 -223555 246954 236303 90462 -134701 142263
11490B27208K3538J0658D0532Q5946A3238d4008J082B29353K41557A97383p356
$$ 227208 250746 261404 40532 126478 13238 -44008 -42926 229353 470910 197383 190027
11479A90027g5814B16291A04668m8419b67647A04257D9460k1145K15309G9155
$$ 190027 -75814 216291 104668 56249 -267647 104257 49460 28315 243624 79155
11468A22520e038A01838A2592K92661m3951H3620d6208m5110K5636o7780D340
$$ 122520 -5038 101838 12592 305253 261302 83620 -46208 -91318 -65682 -133462 4340
11456e2447B36487d28097a2949E8332d4618B72567I9174J33643h078A23557m6820
$$ -52447 236487 -428097 -12949 58332 -44618 272567 99174 232817 -8078 123557 76737
11445G6737J19799r7194a31993F7375K8099i4333D3365O4561L8268J13243G00
$$ 76737 196536 99342 -131993 67375 95474 -94333 43365 107926 146194 259437 700
11433A79612a01131C2329b00376A47240a38648j41164J28994C7795a19195p508
$$ 179612 -101131 32329 -200376 147240 -138648 -279812 -150818 37795 -119195 -126703
11423a26703J7645a316E1701J8738f3568G9590q986b09113K7721B93316A27876
$$ -126703 -109058 -1316 51701 70439 -63568 79590 70604 -209113 -181392 293316 127876
11411d0642A69909i5270c0360r3728L8105b8483C4814N426J15293M1190E0239
$$ -40642 169909 -95270 -30360 -124088 -85983 -28483 34814 40240 155533 196723 50239
11399C42891f7824k18751A16350b13009D45557I7101m1184a1728E841j250c2580
$$ 342891 -67824 -286575 116350 -213009 445557 97101 55917 -11728 5841 4591 -32580
11387F6859O3602L727a19314A65016c13704e5567E9771J84605b34826P0354j4346
$$ 66859 130461 134188 -119314 165016 -313704 -55567 59771 244376 -234826 -164472 -178818
11376a78818A86517b32975A50329f0907B9273O8539f2447a6191N514k75851A5054
$$ -178818 186517 -232975 150329 -60907 29273 97812 -62447 -16191 -10677 -286528 15054
11364b04443B90826b09335a00708a8431r3088B78304A01214B4659a19588G8512
$$ -204443 290826 -209335 -100708 -18431 -111519 278304 101214 24659 -119588 78512
11353B75555n7072a54623b4073B21944h0100j41659B3092b11124A05697C9084
$$ 275555 218483 -154623 -24073 221944 -80100 -221759 23092 -211124 105697 39084
11342H198a67409G5437l3539b1393l8934j48923O2028F1606d665F5221a59279
$$ 8198 -167409 75437 41898 -21393 -60327 -209250 -147222 61606 -4665 65221 -159279
11330A9582J22013N713J5247c73925J20004i8543o1724C21323i8661D552d8358
$$ 19582 141595 147308 162555 -373925 -253921 -98543 -160267 321323 -98661 4552 -48358
11318b3580k06791B31095o7421a30127p6801B11222a31793K462j11589A05017
$$ -23580 -230371 231095 163674 -130127 -206928 211222 -131793 -129331 -240920 105017
11307b328A97581E3386K16751a66491b575I5435g3065D25P2670a18360m2930h612
$$ -2328 197581 53386 270137 -166491 -2575 95435 -73065 425 73095 -118360 -161290 -8612
11294A89210c29095P4654c1448p9545p5382l0102K197C44964A59347b0892A93826
$$ 189210 -329095 -254441 -31448 -110993 -186375 -216477 -214280 344964 159347 -20892 193826
11282e5325A05333a24879A19844a13866d517j21875A97053b71832M9222R0499
$$ -55325 105333 -124879 119844 -113866 -4517 -126392 197053 -271832 -222610 -132111
11272a32111j91981H6693R1715a03180C14821b52369E9181c9677e112D562J56146
$$ -132111 -324092 86693 178408 -103180 314821 -252369 59181 -39677 -5112 4562 160708
11261A60708b1577n0675A02251a83905A00816a52118j92282j540A87006B3053
$$ 160708 -21577 -72252 102251 -183905 100816 -152118 -344400 -345940 187006 23053
11250A28468b73957q3576A01487b02195B34021k2158A6434d4632b127A30301g0703
$$ 128468 -273957 -357533 101487 -202195 234021 211863 16434 -44632 -2127 130301 -70703
11238b91305i2950j18021f2568C5841d4064B3910f725j83844g7021p2371j2978
$$ -291305 -92950 -210971 -62568 35841 -44064 23910 -6725 -190569 -77021 -149392 -162370
11227a62370p3493A64254B4542c2063A14972b12545P4023K2385n332j07165a12887
$$ -162370 -235863 164254 24542 -32063 114972 -212545 -138522 -116137 -121469 -228634 -112887
11215c54852a64914f2342e200o8613p9108L4246H428L46187r6344a48941G8776
$$ -354852 -164914 -62342 -5200 -73813 -152921 -118675 8428 354615 258271 -148941 78776
11203F8649K76402a45860b5146j25729o1229G719e14741a64768f8868j7470A24858
$$ 68649 345051 -145860 -25146 -150875 -212104 7719 -514741 -164768 -68868 -86338 124858
11191I7811B2740d08960E8959a9358A07543k2188b20423i604A74857a07311A71010
$$ 97811 22740 -408960 58959 -19358 107543 85355 -220423 -9604 174857 -107311 171010
11179g7760F1909R5962p3115i8530k89359B864b43020b6087A43780d2290j55759
$$ -77760 61909 157871 84756 -98530 -387889 2864 -243020 -26087 143780 -42290 -198049
11168a98049A69849F6315a62462o037q9460b0507l5842j24229j30329e4878A39283
$$ -198049 169849 66315 -162462 -168499 -257959 -20507 -56349 -180578 -310907 -54878 139283
11156A06373a0740A56529a11274n8724k28630A23410b16417P99A54354n4649g9513
$$ 106373 -10740 156529 -111274 -169998 -398628 123410 -216417 -215618 154354 99705 -79513
11144b2322C020h1000P451b1748E4277b76971D62334F0517g3338A41508c07123
$$ -22322 3020 -81000 -73549 -21748 54277 -276971 462334 60517 -73338 141508 -307123
11132f3024I496P5471b46742N5234M2561B583b15144e8688j02989D0523J59910
$$ -63024 9496 84967 -246742 -191508 -148947 2583 -215144 -58688 -161677 40523 200433
11121B00433b16518b1858o5855A6166c622A82583i2805A20115K43268b03058A31075
$$ 200433 -216518 -21858 -87713 16166 -3622 182583 -92805 120115 363383 -203058 131075
11109a0503p2185B9618J87041i9529A0014a27855k27923d1854j15086m191G9045
$$ -10503 -82688 29618 216659 -99529 10014 -127855 -355778 -41854 -156940 -161131 79045
11097C02697c3494l24154B72503f9726D6049a32722e8093k14581a02628B49543
$$ 302697 -33494 -357648 272503 -69726 46049 -132722 -58093 -272674 -102628 249543
11086B12592f3454G3325J57364b04377A8025N9529L0377M8250n6778a65796C2612
$$ 212592 -63454 73325 230689 -204377 18025 77554 107931 156181 99403 -165796 32612
11074g2712n2678G574L28781C3613a94089C14324A05716p511Q399K84560j54244
$$ -72712 -125390 7574 336355 33613 -194089 314324 105716 98205 106604 391164 236920
11063B36920p516n6035e5376A20669K78875J02153A94554k8662n5817E3249L59309
$$ 236920 229404 173369 -55376 120669 399544 501697 194554 165892 110075 53249 412558
11052D12558J9617k3142j2799j40152Q0295n8502A25785J88116A15117M70347
$$ 412558 432175 409033 396234 256082 336377 277875 125785 313901 115117 585464
11042E85464B62397q99J35502M42J55523R8516k02507J83858j98138K33330B23417
$$ 585464 262397 261498 397000 397442 552965 651481 448974 632832 434694 668024 223417
11030D29542J16397J00388J09713r0211l2747j5216j22690P1613j37398J07417
$$ 429542 545939 646327 756040 665829 633082 617866 495176 566789 429391 536808
11020E36808J8450r8449J14810J47126j30018k01478J04822J13378k07677J32431
$$ 536808 555258 456809 571619 718745 588727 387249 492071 605449 397772 530203
11010E30203K76688k75586L2696L94162C18507r9536L11763A47813L41264L7763
$$ 530203 806891 531305 564001 958163 318507 218971 530734 147813 489077 526840
11000E26840A79806K73614P7441B12739q1897N61484j9014k22281P7909k64266
$$ 526840 179806 453420 530861 212739 130842 692326 673312 451031 528940 264674
10990B64674J42417L46847k31429K35062l67719L02794P3513J63C79417J61400
$$ 264674 407091 753938 522509 757571 389852 692646 766159 766322 379417 540817
10980E40817l0121l243J66596k62916K37972J54395B85051K73874L33915D36547
$$ 540817 510696 507453 674049 411133 649105 803500 285051 558925 892840 436547
10969F25525K66967k56243Q640k798L85502k82384J26485J91686q0213n3571K65739
$$ 625525 892492 636249 644889 642091 1027593 745209 871694 1063380 983167 929596 1195335
10958A195335Q3447P4949N36781o6540Q1432l47225N29007j29324l42126q1126
$$ 1195335 1278782 1353731 1890512 1823972 1905404 1558179 2087186 1957862 1615736 1534610
10948A534610K89373p77083K73427P4989k54852K47767k63976K99082m96110R50639
$$ 1534610 1823983 1046900 1320327 1395316 1140464 1388231 1124255 1423337 927227 1877866
10938A877866k24166P5336m24640J45845l97166m7644R0983o9972l91353r2775
$$ 1877866 1653700 1729036 1304396 1450241 1053075 1005431 1096414 1026442 635089 542314
10928E42314k61900J69684R825q3642J73221F5026J8674M4709K55135E4527K04044
$$ 542314 280414 450098 459923 376281 549502 65026 83700 128409 383544 54527 258571
10917B58571B8652g6256A18344Q8656d3052C00307a5957A77360B2735d6385A57129
$$ 258571 28652 -76256 118344 207000 -43052 300307 -15957 177360 22735 -46385 157129
10905A63379D1436h9845I7919a93527H6014q114a3069p7542j73164J4739d0651
$$ 163379 41436 -89845 97919 -193527 86014 77900 -13069 -90611 -263775 -249036 -40651
10893a01603A49916c12276A94049A0528L6374d5808E7571J64764c12317d331A92556
$$ -101603 149916 -312276 194049 10528 46902 -45808 57571 222335 -312317 -4331 192556
10881G9873a73243B54356a14491b451o4399B26475M870J126a87751M3356C5167
$$ 79873 -173243 254356 -114491 -2451 -66850 226475 231345 232471 -187751 -144395 35167
10869B37499G3878a86180A34978e4113A72919a69156F7571i3215D72350I2092
$$ 237499 73878 -186180 134978 -54113 172919 -169156 67571 -93215 472350 92092
10858A97514g0917m9560I1531a04582k0680k08820a41875B99589i9594o3345A31435
$$ 197514 -70917 -120477 91531 -104582 -125262 -334082 -141875 299589 -99594 -162939 131435
10846b7007k55583j57988B43287b01854B7278K89677j51288b6905j7916C91760
$$ -27007 -282590 -440578 243287 -201854 27278 316955 165667 -26905 -44821 391760
10835d1978q7395j57806a41541d665j58395c3436C5795c39318G919a70223J6472
$$ -41978 -129373 -287179 -141541 -4665 -163060 -33436 35795 -339318 7919 -170223 -153751
10824a53751k94352a594C16557a39144H2862k5019a09286e3398A32607a22553
$$ -153751 -448103 -1594 316557 -139144 82862 57843 -109286 -53398 132607 -122553
10813C3293f6639p2714A15635a69701E0399a7058l04371A62717e5141l9003C20728
$$ 33293 -66639 -139353 115635 -169701 50399 -17058 -321429 162717 -55141 -94144 320728
10801a06098L0944B6168i4047K0629j3717j94628A23264a997B24781d6499A43547
$$ -106098 -75154 26168 -94047 -73418 -87135 -281763 123264 -1997 224781 -46499 143547
10789a54177K5279k0044B98901A27590f8937K445k43002J18361f0024j02343j46288
$$ -154177 -128898 -148942 298901 127590 -68937 -66492 -309494 -191133 -60024 -162367 -308655
10778c08655R6748l0659F1454b40171k27761b21199c1068A16830c34973J54338
$$ -308655 -211907 -242566 61454 -240171 -467932 -221199 -31068 116830 -334973 -180635
10768a80635P1202k97319h0725o7062g2134k34704d1087j63017n4060c66n616
$$ -180635 -109433 -406752 -80725 -147787 -72134 -306838 -41087 -204104 -258164 -366 -5982
10757e982q4359p6127F0277R9727A5514K72113b21658B08491A568J05677R2268
$$ -5982 -90341 -166468 60277 160004 15514 287627 -221658 208491 1568 107245 199513
10746A99513K7080a63056K7010A44999f2020A0926N1804N2544a09216l59648G8454
$$ 199513 226593 -163056 -136046 144999 -62020 10926 62730 115274 -109216 -468864 78454
10734B03564a59366A24220P3213i5792F849J11728a0531j2962A3581d22569A95831
$$ 203564 -159366 124220 197433 -95792 6849 118577 -10531 -23493 13581 -422569 195831
10722e6961A92167a30777j14999b1009q8185B46013a5823j18949q2636A74255
$$ -56961 192167 -130777 -245776 -21009 -109194 246013 -15823 -134772 -217408 174255
10711B67838A33353D5495g1849A14882E5226b49509c2522j24505L5357j37204
$$ 267838 133353 45495 -71849 114882 55226 -249509 -32522 -157027 -121670 -258874
10701b58874c7557H7571a79280J4B2550b25813h8053r26m38646C25173a71056
$$ -258874 -37557 87571 -179280 -179266 22550 -225813 -88053 -88979 -527625 325173 -171056
10689e5235A66606c24433d4715j12865A99899d073H6732J48107h6651A2608b6638
$$ -55235 166606 -324433 -44715 -157580 199899 -4073 86732 234839 -86651 12608 -26638
10677e4460B76027c7385j38917K6652l0245A65805k9095e9263j55987d3486j29761
$$ -54460 276027 -37385 -176302 -149650 -179895 165805 136710 -59263 -215250 -43486 -173247
10666a73247H4348K5923J78480a83778M7707B62801b15809E875O583J34992M862
$$ -173247 84348 110271 288751 -183778 -136071 262801 -215809 5875 12458 147450 152312
10655A52312D8725N709b532k09089Q8154q5179I3982g7621A84919D7379Q6861
$$ 152312 48725 54434 -2532 -211621 -123467 -208646 93982 -77621 184919 47379 134240
10644A34240a05621k08469J56420j38372A70946d8809q1011A32918i6837q8597
$$ 134240 -105621 -314090 -157670 -296042 170946 -48809 -129820 132918 -96837 -185434
10634a85434Q0997F9919a40503C43502c70124a6395j21331B80779a57631l0471
$$ -185434 -104437 69919 -140503 343502 -370124 -16395 -137726 280779 -157631 -188102
10624a88102G0781J8220K91187I0378b05929j79745e2981j93690h5215k43406
$$ -188102 70781 89001 380188 90378 -205929 -385674 -52981 -246671 -85215 -328621
10614c28621A58268g3953j00280J7634J1045m3002C5716A1736J59000o8864f2830
$$ -328621 158268 -73953 -174233 -156599 -145554 -188556 35716 11736 170736 101872 -62830
10602a29671d1889q4631H2959a75361A36367a51306A58975a22505J2544H7053
$$ -129671 -41889 -126520 82959 -175361 136367 -151306 158975 -122505 -109961 87053
10591g6505A72541b02484k8364A52802d4165A67663J6666i6505I0213f2316C19238
$$ -76505 172541 -202484 -230848 152802 -44165 167663 184329 -96505 90213 -62316 319238
10579c12982a7953j96135B03001d31096f267k37033D317g4570j64813d4478A96721
$$ -312982 -17953 -214088 203001 -431096 -6267 -243300 4317 -74570 -239383 -44478 196721
10567e5767q7923q7740j77609A05770a37924j3282k9288A82434a33288c095j28074
$$ -55767 -143690 -231430 -409039 105770 -137924 -151206 -180494 182434 -133288 -3095 -131169
10556a31169D2593a78741B1658E55J03737d0179k9970A14122J0613E1656K74862
$$ -131169 42593 -178741 21658 555 104292 -40179 -70149 114122 124735 51656 326518
10545C26518b09292a8080l4657J1201k4176J8747k3166j45097D6945L1526a72014
$$ 326518 -209292 -18080 -52737 -41536 -65712 -46965 -70131 -215228 46945 78471 -172014
10533h5445A61191R2059c15100J14812h2626l59643A27320a06092L9477A5703
$$ -85445 161191 253250 -315100 -200288 -82626 -442269 127320 -106092 -66615 15703
10522i6150F5352b94498a33563K2799B69530H2050b9159J4015j97582F2133h0894
$$ -96150 65352 -294498 -133563 -110764 269530 82050 -29159 -15144 -212726 62133 -80894
10510a41594l3014A24413b437o4608n9369r3563A04701n0920J8966g5176B47618
$$ -141594 -174608 124413 -2437 -67045 -126414 -219977 104701 53781 72747 -75176 247618
10498A70617h2896E1020c89760l6058J69420e748j1769B8524b69895J05217l5128
$$ 170617 -82896 51020 -389760 -425818 -256398 -5748 -17517 28524 -269895 -164678 -199806
10487a99806I3114b07063h9483A1681O319a22314L1986D8695J51040F4594c00927
$$ -199806 93114 -207063 -89483 11681 18000 -122314 -90328 48695 199735 64594 -300927
10475D6730b6431c700n936J797j81321L9550a3163B08318r3034h9273p422A20089
$$ 46730 -26431 -3700 -9636 -7839 -189160 -149610 -13163 208318 115284 -89273 -96695 120089
10462D6713K71762i1313B91842j09076j0796k3618D9245b44473D478a5430q508
$$ 46713 318475 -91313 291842 182766 171970 148352 49245 -244473 4478 -15430 -23938
10451b3938A25203R5675A2233K24527C6267a53398F9175l3364b88950g072A93831
$$ -23938 125203 220878 12233 236760 36267 -153398 69175 35811 -288950 -7072 193831
10439B22189J30683c9193l7487c8107l47834a5867q7960L4905k07079C85669b43447
$$ 222189 352872 -39193 -76680 -38107 -385941 -15867 -103827 -68922 -276001 385669 -243447
10427C06310A7785a93366O9155C2392c13591L7162a19444E2651h9109B4750Q9682
$$ 306310 17785 -193366 -124211 32392 -313591 -276429 -119444 52651 -89109 24750 114432
10416A14432N4959a18926m2246a9175m1071k82419A1388K6522i2813C8730p361
$$ 114432 169391 -118926 -161172 -19175 -60246 -342665 11388 37910 -92813 38730 31369
10405C1369Q612N1293i4571n4368c7938l24696J60318G1747A0136b90291D9418
$$ 31369 39981 91274 -94571 -148939 -37938 -362634 -202316 71747 10136 -290291 49418
10393B54104i0792b9157k30297K5958a13695j59846L4950J08105A0725g8023A28013
$$ 254104 -90792 -29157 -259454 -233496 -113695 -273541 -238591 -130486 10725 -78023 128013
10381a26867A54006p0827I309J33492b38613A16536d12182A65420G0323c3930
$$ -126867 154006 83179 9309 142801 -238613 116536 -412182 165420 70323 -33930
10370F7331J24236i1448M1768B0851O3701J17433H677L32193g5819E02742A03690
$$ 67331 191567 -91448 -49680 20851 84552 201985 8677 340870 -75819 502742 103690
10358a63201K5360C62189E7441N1058L5146O6477J65755j53628G4221L29749J60165
$$ -163201 -137841 362189 57441 108499 143645 210122 375877 222249 74221 403970 564135
10347E64135j09910j1845G9865J80570J38562J0661E8369K11073J78562A21326
$$ 564135 454225 442380 79865 260435 398997 409658 58369 269442 448004 121326
10336B44465J46150N3670R0992j92619j44190K73974j05437c80463A59801K5635
$$ 244465 390615 444285 535277 342658 198468 472442 367005 -380463 159801 185436
10326A85436J73949A05924L10440E3443M52127a77137M9233C63146A25464D9921
$$ 185436 359385 105924 416364 53443 505570 -177137 -127904 363146 125464 49921
10315C20504A01888f6237f660B312J42098K5296h5276B26350a51221R119C94772
$$ 320504 101888 -66237 -6660 2312 144410 169706 -85276 226350 -151221 -142102 394772
10303b00988K1439d0184B37111a15096A08058L53974b3746p0718G1317a29407
$$ -200988 -179549 -40184 237111 -115096 108058 462032 -23746 -94464 71317 -129407
10292b23031R8371P663k8420A03398D7003J81284p4185F1033b74676a07882j50031
$$ -223031 -124660 -116997 -145417 103398 47003 228287 154102 61033 -274676 -107882 -257913
10281b57913k14719a04750p1950f5125k86340A19935h6105C13090m7577a63293
$$ -257913 -472632 -104750 -176700 -65125 -351465 119935 -86105 313090 265513 -163293
10270A95068d7656o3262A03589O0258D9635J46143c0703l39726J60451I0197A2498
$$ 195068 -47656 -110918 103589 163847 49635 195778 -30703 -370429 -209978 90197 12498
10258h4431r072k84705d2043B7623b22437P0270A92056j722C9256a45400B19077
$$ -84431 -93503 -378208 -42043 27623 -222437 -152167 192056 190334 39256 -145400 219077
10246b09665A22115E2312d8567C74887j81506M0973m189j7407K44908B11698J37134
$$ -209665 122115 52312 -48567 374887 193381 234354 230165 212758 457666 211698 348832
10235C48832R0691r0542f4787C3517a54276D4559L121e0264C3240d72738E3920
$$ 348832 439523 348981 -64787 33517 -154276 44559 47680 -50264 33240 -472738 53920
10223a35937j9303k8306f7797O47K6215D5096a07421J9534j71261g5517k0877
$$ -135937 -155240 -183546 -67797 -67150 -40935 45096 -107421 -87887 -259148 -75517 -96394
10212i6394A35351b59227O9177q9093g9058F0476a51109E1736a1740F1636b5950
$$ -96394 135351 -259227 -190050 -279143 -79058 60476 -151109 51736 -11740 61636 -25950
10200c5032B98693A16212J18696I3744e4803n7783A04385a83458D6441L8325a27961
$$ -35032 298693 116212 234908 93744 -54803 -112586 104385 -183458 46441 84766 -127961
10188B7850f3813j65258E9267g7446j73965P9795M1491A16438i2231j77235P1862
$$ 27850 -63813 -229071 59267 -77446 -251411 -171616 -130125 116438 -92231 -269466 -197604
10177a97604j00630L0903A04671e5094l08037f5575j07822n0014a07226B68870
$$ -197604 -298234 -267331 104671 -55094 -363131 -65575 -173397 -223411 -107226 268870
10166H2148h5341j5781j18253E8659L6725N6573a46198B84441a32779B91088d0209
$$ 82148 -85341 -101122 -219375 58659 95384 151957 -146198 284441 -132779 291088 -40209
10154c06548q5947C6275Q8623b31037J09958A74461c58261D8336c2641k82933
$$ -306548 -392495 36275 124898 -231037 -121079 174461 -358261 48336 -32641 -315574
10144c15574P2290N5847P5505A73635a20794k54658B28394E5952i7565j60190
$$ -315574 -243284 -187437 -111932 173635 -120794 -375452 228394 55952 -97565 -257755
10134b57755i73l72631d2968k56028A32621a17664A16568d6264F9404A7858b6659
$$ -257755 -973 -373604 -42968 -298996 132621 -117664 116568 -46264 69404 17858 -26659
10122A02034J16155g096n1732j29539I4879l419a96106A45354b43714d9936l4064
$$ 102034 218189 -7096 -58828 -188367 94879 91460 -196106 145354 -243714 -49936 -84000
10111h4000l3710j75928B31387a07335c4578B2258c624o8317B2722b40174c8638
$$ -84000 -117710 -293638 231387 -107335 -34578 22258 -3624 -71941 22722 -240174 -38638
10099b47482C0543a30516k20996e9967m20151B8452j1166b72631D5462a60315
$$ -247482 30543 -130516 -351512 -59967 -480118 28452 17286 -272631 45462 -160315
10088c62113J08490A19495b93869a41444h120A54214A98a52195O3435a7534k39990
$$ -362113 -253623 119495 -293869 -141444 -8120 154214 198 -152195 -88760 -17534 -257524
10077b57524C12713a76366J7095r8438K4240L6024c4957e339n1448B94732b97214
$$ -257524 312713 -176366 -159271 -257709 -233469 -197445 -34957 -5339 -56787 294732 -297214
10065b1520m0086n5375a0784k8697r2168B7426b50025C5750b8404H4020e0734
$$ -21520 -61606 -116981 -10784 -39481 -131649 27426 -250025 35750 -28404 84020 -50734
10053B59384h3559m9528K4565E6261K0957M4908P2899b03890p6957h7688r1868
$$ 259384 -83559 -133087 -108522 56261 77218 122126 195025 -203890 -280847 -87688 -179556
10042a79556n8550A36515c153A16735a58180N6277G8522k3382a2337j67415A76767
$$ -179556 -238106 136515 -3153 116735 -158180 -101903 78522 55140 -12337 -179752 176767
10030a93066q7506A04460p580k5143h7888k19508j8431Q7472A3248g2714A26325
$$ -193066 -280572 104460 96880 71737 -87888 -307396 -325827 -238355 13248 -72714 126325
10018h0157C0896m388a27440C2603R1404N0527e9960F8873e9319n0693B55982
$$ -80157 30896 26508 -127440 32603 124007 174534 -59960 68873 -59319 -110012 255982
10006b08361f6202j09369f0110B60686e29719b10593B90872b10318a04337j0973
$$ -208361 -66202 -175571 -60110 260686 -529719 -210593 290872 -210318 -104337 -115310
9996a15310B39695B5344R7428h0895K0562k13245I9759b18290A18783E1330K7033
$$ -115310 239695 25344 122772 -80895 -60333 -273578 99759 -218290 118783 51330 78363
9985G8363f9238j04656O0110A44168d2977j17919j29099B78294r1987F2712R6321
$$ 78363 -69238 -173894 -113784 144168 -42977 -160896 -289995 278294 186307 62712 159033
9974A59033B2402i4317o107o8866p8193J5286C24709c44433J04198o6680h038
$$ 159033 22402 -94317 -100424 -169290 -247483 -232197 324709 -344433 -240235 -306915 -8038
9962g0048k9553j35288I4504i9161A67435R2312b35514r3976A806P0020a47533
$$ -70048 -99601 -234889 94504 -99161 167435 259747 -235514 -329490 1806 71826 -147533
9950H0901a09047A6666b53572g7453j25212L9501j47180N3505G9162J51838f8235
$$ 80901 -109047 16666 -253572 -77453 -202665 -163164 -310344 -256839 79162 231000 -68235
9938a51772j30936j6047l1902b2646l4094o6891A14061c27001J49958C6799a04510
$$ -151772 -282708 -298755 -330657 -22646 -56740 -123631 114061 -327001 -177043 36799 -104510
9926B2721d36103a48298b1655j65810D529b08671m5046C37698a78852Q6988B70562
$$ 22721 -436103 -148298 -21655 -187465 4529 -208671 -253717 337698 -178852 -91864 270562
9914b58815o2899O7207a10220b6602j49005G6033a17117j94185J42703l18043
$$ -258815 -321714 -254507 -110220 -26602 -175607 76033 -117117 -311302 -168599 -486642
9904d86642a40585J9121b5793j68744A65404C9629J29967A5376a17489B5002b0500
$$ -486642 -140585 -121464 -25793 -194537 165404 39629 169596 15376 -117489 25002 -20500
9892a91584E6870A8807J59072b1116F2919k559K41197f9359C86843d5867j3509
$$ -191584 56870 18807 177879 -21116 62919 60360 301557 -69359 386843 -45867 -59376
9881e9376j90855A65926H1959b3283j28096C5903J19784Q1136a18726K0451K5474
$$ -59376 -250231 165926 81959 -23283 -151379 35903 155687 236823 -118726 -98275 -72801
9870g2801r8612B6198g6906K4761k22261a12828j73774E6691b23467I3473A9880
$$ -72801 -171413 26198 -76906 -52145 -274406 -112828 -286602 56691 -223467 93473 19880
9858f5232P428c411j03835B43142c99862e7135I2326J70528A02276a6103j22146
$$ -65232 -57804 -3411 -107246 243142 -399862 -57135 92326 262854 102276 -16103 -138249
9847a38249o8940f5022J4979n9652k579c3383H2588a58145E5155a80520n0180
$$ -138249 -207189 -65022 -50043 -109695 -112274 -33383 82588 -158145 55155 -180520 -230700
9836b30700i0975q7035N9896A33837L7131d23p3154C0941e0326j19921k21069
$$ -230700 -90975 -178010 -118114 133837 170968 -423 -73577 30941 -50326 -170247 -391316
9825c91316i0435j7495q8056F1932j7164J63802d5220A86122c09577A84917n5580
$$ -391316 -90435 -107930 -195986 61932 44768 208570 -45220 186122 -309577 184917 129337
9814A29337a18564A44903d69573D32775c28886A59766c30273a29778d9976k4050
$$ 129337 -118564 144903 -469573 432775 -328886 159766 -330273 -129778 -49976 -74026
9804g4026k2718j7137A39501b82053J18599C4113a30364j50856A08424c68559
$$ -74026 -96744 -113881 139501 -282053 -163454 34113 -130364 -281220 108424 -368559
9793f5659k3281A36039f0233C40519c20425A39478c30099j56434a60062l125E6878
$$ -65659 -88940 136039 -60233 340519 -320425 139478 -330099 -486533 -160062 -163187 56878
9781h2504j36218B12731a66375q2407b2265k81414a7735o0767l4650M2884k8571
$$ -82504 -218722 212731 -166375 -248782 -22265 -303679 -17735 -78502 -113152 -70268 -98839
9770i8839I1401b10262f4975k41837g8386B95197A45459Q8047c69544c1471B52503
$$ -98839 91401 -210262 -64975 -306812 -78386 295197 145459 233506 -369544 -31471 252503
9758a84590c6372j8661j08918j6460j68597a66861d3337B53095c0380E0589c81571
$$ -184590 -36372 -55033 -163951 -180411 -349008 -166861 -43337 253095 -30380 50589 -381571
9746a45200O4950j860l76065K01605i387D9884e32771a51885B42856g6004r1774
$$ -145200 -80250 -82110 -458175 -256570 -9387 49884 -532771 -151885 242856 -76004 -167778
9735a67778A5264J94369M3199d56360b15404F3050J43180j02559C1306a10957
$$ -167778 15264 209633 252832 -456360 -215404 63050 206230 103671 31306 -110957
9724a40517k14394Q4325j28029g2365J0403j08218l9898M4896A07425c22886b6651
$$ -140517 -354911 -270586 -398615 -72365 -61962 -170180 -210078 -165182 107425 -322886 -26651
9712b19691e3037A350M20553e9638A44f5238j49482F9556b94756H1041a23669
$$ -219691 -53037 1350 421903 -59638 144 -65238 -214720 69556 -294756 81041 -123669
9700A2634C350a1234k2802j77005B14659M3290b11732A52371l0777a93585D0016
$$ 12634 3350 -11234 -34036 -211041 214659 257949 -211732 152371 121594 -193585 40016
9688c1991A26536b3915A40102f3448l4355c1707k12080k6091j02120a10075A1708
$$ -31991 126536 -23915 140102 -63448 -97803 -31707 -243787 -269878 -371998 -110075 11708
9676a50117B68115b7687q2007A03674C4729h7151a5536k4602k10407q6364J33235
$$ -150117 268115 -27687 -109694 103674 34729 -87151 -15536 -40138 -250545 -336909 -203674
9665b03674l0807n771a01191R004D46991A31879i2066j43381A19854a87725p5731
$$ -203674 -234481 -240252 -101191 -92187 446991 131879 -92066 -235447 119854 -187725 -263456
9654b63456H640B347a95716f8524A69917D4241N3659d9054p6564f0471j55966
$$ -263456 8640 2347 -195716 -68524 169917 44241 97900 -49054 -125618 -60471 -216437
9643b16437a7313E9707Q3447d10709M9909A90389C8155b95453O9657h6696K8487
$$ -216437 -17313 59707 143154 -410709 -360800 190389 38155 -295453 -225796 -86696 -58209
9632e8209k97603G5277J5325J56595j22689E5620b05296H1005C7382a96822I2316
$$ -58209 -355812 75277 90602 247197 124508 55620 -205296 81005 37382 -196822 92316
9620F4390J52901I339g8108k18179M1264P2861n3023F9568R7512a77782d226j23928
$$ 64390 217291 9339 -78108 -296287 -255023 -182162 -235185 69568 167080 -177782 -4226 -128154
9608a28154e3059r2805j52897C1013g7305E4267a94014j08430P4986C9195a81167
$$ -128154 -53059 -145864 -298761 31013 -77305 54267 -194014 -302444 -227458 39195 -181167
9596G6909c98726a10713o6484A93892c60250a8921j89656m573G2243a22816k95653
$$ 76909 -398726 -110713 -177197 193892 -360250 -18921 -208577 -213150 72243 -122816 -418469
9585d18469J22930F9920b28680H8492R551k3036b42461p7923a07520l18748D827
$$ -418469 -295539 69920 -228680 88492 98043 75007 -242461 -320384 -107520 -426268 4827
9573i8826k23865L2115J27564P2125A20846a78503n6166B13145j8617c31932E966
$$ -98826 -322691 -290576 -163012 -90887 120846 -178503 -234669 213145 194528 -331932 5966
9561A15412i7172j10117B20995b17979d5492j3090n4216P913k88916C15678b09370
$$ 115412 -97172 -207289 220995 -217979 -45492 -58582 -112798 -104885 -393801 315678 -209370
9549I7066A9733a34959H7551l9727J24838a60617j59647A7028b5515l5653G4750
$$ 97066 19733 -134959 87551 47824 172662 -160617 -320264 17028 -25515 -61168 74750
9537C9763e1759C89081a96798N7900l548D30402b37867J06850M4553j14953b6418
$$ 39763 -51759 389081 -196798 -138898 -142446 430402 -237867 -131017 -86464 -201417 -26418
9525b63784a01077A05051a82483p8580A41973D423a2669C1536K45540A2657b56839
$$ -263784 -101077 105051 -182483 -261063 141973 4423 -12669 31536 277076 12657 -256839
9513b13417b6044p1024C2904a76032b0968E2743M6838c20244J52136r4921A16770
$$ -213417 -26044 -97068 32904 -176032 -20968 52743 99581 -320244 -168108 -263029 116770
9501G0918b8607m05512A81332D7103f8593D7919J78012a14887j02502R9359K5384
$$ 70918 -28607 -434119 181332 47103 -68593 47919 225931 -114887 -217389 -118030 -92646
9490i2646k21700J37753A1822J00275C8468i5293D8384c2576j08000C7497b02731
$$ -92646 -314346 -176593 11822 112097 38468 -95293 48384 -32576 -140576 37497 -202731
9478H8853a23758D5108a50735K6300d4559j26332O2999e3268r8239j16820a27416
$$ 88853 -123758 45108 -150735 -124435 -44559 -170891 -107892 -53268 -151507 -268327 -127416
9466b4558j4797j9565K5734D8115a34709r4997k0790a21839H294e3486m5907A06399
$$ -24558 -39355 -58920 -33186 48115 -134709 -229706 -250496 -121839 8294 -53486 -99393 106399
9453h5950l00763B93500A11164a13721E6774g0571B58207f9887q1602j05276b5310
$$ -85950 -386713 293500 111164 -113721 56774 -70571 258207 -69887 -151489 -256765 -25310
9441a39025C00117a59305C5492J05501J25558b60919J09962B9315R4339g057k2108
$$ -139025 300117 -159305 35492 140993 266551 -260919 -150957 29315 123654 -7057 -29165
9430b9165H1490h2021q9168n592l7997I43J0059K59828b5459A72399a22296H2536
$$ -29165 81490 -82021 -171189 -176781 -214778 943 11002 270830 -25459 172399 -122296 82536
9417b2002j60016p7803e3098J6499B25637b12381G9846a5180p3939P987l876L8721
$$ -22002 -182018 -259821 -53098 -36599 225637 -212381 79846 -15180 -89119 -81132 -85008 -46287
9405d6287o2700D2983g754j03404m3996A11944a20424F4719b22355e8172j86524
$$ -46287 -108987 42983 -7754 -111158 -155154 111944 -120424 64719 -222355 -58172 -244696
9394b44696B2648J85853a6217m84473a22954g226k65316E5033A0132a93871I8023
$$ -244696 22648 208501 -16217 -500690 -122954 -7226 -272542 55033 10132 -193871 98023
9382f0636H1848m715g1886l4781r9538M0522l6395b5477k79957E15979h8718l0640
$$ -60636 81848 77133 -71886 -106667 -206205 -165683 -202078 -25477 -305434 515979 -88718 -119358
9370a19358A59780J450b9598p3174B9236b00424B09402e4770q4309k81555I0503
$$ -119358 159780 161230 -29598 -102772 29236 -200424 209402 -54770 -139079 -420634 90503
9358a39010H2444a81060d3049q5833C09745b32829d1995k35346A05646k0661B0219
$$ -139010 82444 -181060 -43049 -128882 309745 -232829 -41995 -277341 105646 84985 20219
9346a17989E6949h4584A59032b7349p5290j20933h6986K4860A55262D4661h8555
$$ -117989 56949 -84584 159032 -27349 -102639 -223572 -86986 -62126 155262 44661 -88555
9334a91374C2213J78595a51866J3702N0169k19526a5214B07230E9081P406J38277
$$ -191374 32213 210808 -151866 -138164 -87995 -307521 -15214 207230 59081 66487 204764
9323B04764a59163O0042p7216B00773i3044b9039D315b32587a06851A02097a50348
$$ 204764 -159163 -99121 -176337 200773 -93044 -29039 4315 -232587 -106851 102097 -150348
9311a63872k26989g1680b8816F532Q0561e4080p2703A13373a76248N9579A42550
$$ -163872 -390861 -71680 -28816 6532 87093 -54080 -126783 113373 -176248 -116669 142550
9299b58148O5155g4264q9687A1989m129O6652P8785f8685K2991F9336E364a9348
$$ -258148 -192993 -74264 -163951 11989 7860 74512 153297 -68685 -45694 69336 5364 -19348
9286b80370a9458G0767a13398C910J89491a9481G3150a57970k21100J76626P7460
$$ -280370 -19458 70767 -113398 3910 193401 -19481 73150 -157970 -379070 -202444 -124984
9275a24984B58849b54697e1709D4941j2705a54135M8598L8108k23068A03600e4951
$$ -124984 258849 -254697 -51709 44941 32236 -154135 -105537 -67429 -290497 103600 -54951
9263A0120R9182g2294k18661B7664M4744P5280d0937p3898d5008B07576q4611
$$ 10120 109302 -72294 -290955 27664 72408 147688 -40937 -114835 -45008 207576 122965
9252A22965a11225B26110A07975b01269d5323A65076b66839a6544o2469j40588
$$ 122965 -111225 226110 107975 -201269 -45323 165076 -266839 -16544 -79013 -219601
9242b19601A03769a58452n035G0801a53694N8395k19665R5255B3436e8639j56299
$$ -219601 103769 -158452 -163487 70801 -153694 -95299 -314964 -219709 23436 -58639 -214938
9231b14938N776b58j43946j17269O2201o201e9185J88C9546J03050J18080b00114
$$ -214938 -209162 -258 -144204 -261473 -199272 -205473 -59185 -58997 39546 142596 260676 -200114
9218A43843A6326b20971Q0262A19735n1359a72485D0381J03606f0885j1731Q787
$$ 143843 16326 -220971 -140709 119735 68376 -172485 40381 143987 -60885 -72616 -63829
9207f3829F661h0692A62308G2775B7034b0690C6961a73755b251l42545A81404
$$ -63829 6661 -80692 162308 72775 27034 -20690 36961 -173755 -2251 -344796 181404
9195D2674i2912B1064a5290A07044l3384K6015b63985N3859a00800j86784J15184
$$ 42674 -92912 21064 -15290 107044 73660 99675 -263985 -210126 -100800 -287584 -172400
9184a72400G2592c0461I1097c88878R6609f6046J9693H5680A5500b72999a33824
$$ -172400 72592 -30461 91097 -388878 -292269 -66046 -46353 85680 15500 -272999 -133824
9172A31614E1224c1801k2961k70896B7821b3381q2685N0406C0674B709b8725f624
$$ 131614 51224 -31801 -54762 -325658 27821 -23381 -106066 -55660 30674 2709 -28725 -6624
9159b40385A4737K0462R842G297b94243a47058I3508B6856J5675J59936b85601
$$ -240385 14737 35199 45041 7297 -294243 -147058 93508 26856 42531 202467 -285601
9147c85765J3626I2947C3037g4055j11207p0798b5797B0420M916L32445A21697
$$ -385765 -372139 92947 33037 -74055 -185262 -256060 -25797 20420 25336 357781 121697
9135A00918e3205l37926a63958A41787a76947E5913J2041M0142e0489E018a05594
$$ 100918 -53205 -391131 -163958 141787 -176947 55913 67954 108096 -50489 5018 -105594
9123d4107k1733B4986a03615j5287A51809g4072b2117j37551B45579G3397b35580
$$ -44107 -65840 24986 -103615 -118902 151809 -74072 -22117 -159668 245579 73397 -235580
9111H0194N1858e822n3567K7283A3944b47253A17785e7541A95308b6740E4468
$$ 80194 132052 -5822 -59389 -32106 13944 -247253 117785 -57541 195308 -26740 54468
9099A6329i2861e961j55409D08213a21206j08554A86946A2127Q9532c79472D09995
$$ 16329 -92861 -5961 -161370 408213 -121206 -229760 186946 12127 101659 -379472 409995
9087I462a48492N4298c7462D489K5918a36298N7743B01785J98141A34523d93456
$$ 9462 -148492 -94194 -37462 4489 30407 -136298 -78555 201785 399926 134523 -493456
9075c6135G3513k5687H843d1603k44776J36822k73651A32978a94557J5368K1881
$$ -36135 73513 47826 8843 -41603 -286379 -149557 -423208 132978 -194557 -179189 -157308
9064a57308j28866A28859J28659a83616J2000l2121P7775I3934h2090j47578A66387
$$ -157308 -286174 128859 257518 -183616 -171616 -203737 -125962 93934 -82090 -229668 166387
9052d0970n416j94605L8657A29793b71590A44183a95822B07669J16465D3434e609
$$ -40970 -46386 -240991 -202334 129793 -271590 144183 -195822 207669 324134 43434 -5609
9040b64234A47239i4131m0368o609B01659a93911J6945C20748a57620c7904A00317
$$ -264234 147239 -94131 -134499 -141108 201659 -193911 -176966 320748 -157620 -37904 100317
9028a50620A9086K8822K0220K3102b28337A96777B1203a57336f9023n4407l6699
$$ -150620 19086 47908 68128 91230 -228337 196777 21203 -157336 -69023 -123430 -160129
9017a60129j95565d2727D2956R6295a20780q3912A04453a72459N5718b546n2760
$$ -160129 -355694 -42727 42956 139251 -120780 -204692 104453 -172459 -116741 -2546 -55306
9006e5306B20788j08596C0827ra58197D8841b22405k1200R7120d7438o9643e4972
$$ -55306 220788 112192 30827 30818 -158197 48841 -222405 -243605 -146485 -47438 -117081 -54972
8993i6573E7279b27530h2170k48927a18720M5258K5029I726a11939L2051I9112
$$ -96573 57279 -227530 -82170 -331097 -118720 -73462 -48433 9726 -111939 -79888 99112
8981a79137g9758E1320h3272J4860b4457j41556g9312G9534a78572K558H6065
$$ -179137 -79758 51320 -83272 -68412 -24457 -166013 -79312 79534 -178572 -176014 86065
8969i7321E2133J65679b00579q3523O0467B04914r6380b99721h6364k22248A6928
$$ -97321 52133 217812 -200579 -284102 -223635 204914 108534 -299721 -86364 -308612 16928
8957f996k65896R3396O6610D200b85989p7948J23291j1776A20251J71682a47551
$$ -6996 -272892 -179496 -112886 4200 -285989 -363937 -240646 -252422 120251 291933 -147551
8945b25211k68393A6214M9631a15716j8072H7828b9603C68741a13698A789N9833
$$ -225211 -493604 16214 65845 -115716 -133788 87828 -29603 368741 -113698 1789 61622
8934F1622Q6366h1524m8704j07755p0519J7272R3539I57a65999p2016I3152c67678
$$ 61622 147988 -81524 -130228 -237983 -308502 -291230 -197691 957 -165999 -238015 93152 -367678
8921a5504H8401a60204B26877g381j85371G8094J20852J38016j27442n5057F3873
$$ -15504 88401 -160204 226877 -7381 -192752 78094 198946 336962 209520 154463 63873
8909C42134J5876J12556L61089K05048J080640J874399L705016l690022j710611
$$ 342134 358010 470566 831655 1036703 2117343 3991742 7696758 4006736 2296125
8900B296125H83742p6741l23779j01040A11717P5653a70402A16426n6006B5937
$$ 2296125 883742 807001 483222 382182 111717 187370 -170402 116426 60420 25937
8889A35253j5908c45058A93621H4913c8086C1144a03945k98496A78592a70741
$$ 135253 119345 -345058 193621 84913 -38086 31144 -103945 -402441 178592 -170741
8878A88587b05249G3634a88453E6064K31069a51483k23170A50379b58865q082
$$ 188587 -205249 73634 -188453 56064 287133 -151483 -374653 150379 -258865 -266947
8868b66947a30449J9058m2296A16519a54456C3948a69745A74014a79366L1367
$$ -266947 -130449 -111391 -153687 116519 -154456 33948 -169745 174014 -179366 -147999
8858a47999A85449a22865J3279B72164E794a75997d0043F4583e5356k350b67k95847
$$ -147999 185449 -122865 -109586 272164 5794 -175997 -40043 64583 -55356 -57706 -267 -296114
8846b96114K2923r5399a30962F2067J11407a28020A58255a95695A0096A094b19212
$$ -296114 -273191 -368590 -130962 62067 173474 -128020 158255 -195695 10096 1094 -219212
8834b0341E37594j91143R476F2612a85480e6221l30232B53712G5263N4836J76987
$$ -20341 537594 346451 355927 62612 -185480 -56221 -386453 253712 75263 130099 307086
$$ [...]
##END NTUPLES=NMR SPECTRUM
##END=
