
##TITLE=AC1204_BRAAS12063_5946503_ShiT139uOt
##JCAMPDX= 6.0         $$ Bruker NMR JCAMP-DX V2.0
##DATA TYPE= NMR SPECTRUM
##DATA CLASS= NTUPLES
##ORIGIN= BRUKER
##OWNER= Administrator
$$ 1.72 TOPSPIN		Version 2.1
$$ 2012-04-10 22:41:18.828 -0500  Administrator@TOPSPIN
$$ Compression mode = diff/dup
##.OBSERVE FREQUENCY= 400.13188235
##.OBSERVE NUCLEUS= ^1H
##.ACQUISITION MODE= SIMULTANEOUS (DQD)
##.ACQUISITION SCHEME= undefined
##.AVERAGES= 64
##.DIGITISER RES= 22
##SPECTROMETER/DATA SYSTEM= spect
##.PULSE SEQUENCE= noesygpps1d.comp
##.SOLVENT NAME= COFFEE_meoh
##.SHIFT REFERENCE= INTERNAL, COFFEE_meoh, 1, 14.9689
##AUDIT TRAIL= $$ (NUMBER, WHEN, WHO, WHERE, PROCESS, VERSION, WHAT)
$$ ##TITLE= Audit trail, TOPSPIN		Version 2.1
$$ ##JCAMPDX= 5.01
$$ ##ORIGIN= Bruker BioSpin GmbH
$$ ##OWNER= Administrator
$$ $$ C:\Bruker\TOPSPIN/data/COFFEE/nmr/AC1204_BRAAS12063_5946503_ShiT139uOt/12/pdata/1/auditp.txt
$$ ##AUDIT TRAIL=  $$ (NUMBER, WHEN, WHO, WHERE, PROCESS, VERSION, WHAT)
(   1,<2012-04-10 22:41:14.046 -0500>,<Administrator>,<TOPSPIN>,<go>,<TOPSPIN 2.1>,
      <created by zg
	started at 2012-04-10 22:29:42.281 -0500,
	POWCHK enabled, PULCHK disabled,
       configuration hash MD5:
       1A 1E CE 29 27 FD 77 03 67 4E F0 E3 C4 B2 CB 90
       data hash MD5: 64K
       91 C6 C3 FD 0D 09 D6 18 24 F0 97 15 1C C3 7F 80>)
(   2,<2012-04-10 22:41:16.859 -0500>,<Administrator>,<TOPSPIN>,<proc1d>,<TOPSPIN 2.1>,
      <Start of raw data processing
       efp LB = 0.3 FT_mod = 6 PKNL = 1 PHC0 = 0 PHC1 = 0 SI = 128K 
       data hash MD5: 128K
       E8 FF 6A 7F 0D 7C 31 1F 01 90 4F 4C 0E 83 BF 2D>)
(   3,<2012-04-10 22:41:18.062 -0500>,<Administrator>,<TOPSPIN>,<proc1d>,<TOPSPIN 2.1>,
      <pk PHC0 = 30.18494 PHC1 = 0 
       data hash MD5: 128K
       97 15 71 4D 20 CA D3 98 B1 B9 74 99 EE 46 CE A4>)
(   4,<2012-04-10 22:41:18.296 -0500>,<Administrator>,<TOPSPIN>,<proc1d>,<TOPSPIN 2.1>,
      <abs ABSG = 1 
       data hash MD5: 128K
       BE B7 F9 6D C9 EF 6A 74 5A A0 C8 5B 66 2D AD BA>)
(   5,<2012-04-10 22:41:18.375 -0500>,<Administrator>,<TOPSPIN>,<proc1d>,<TOPSPIN 2.1>,
      <abs ABSG = 2 
       data hash MD5: 128K
       7B E6 6F CC 86 28 68 C9 BE 08 ED 5D 45 E1 C3 9D>)
(   6,<2012-04-10 22:41:18.625 -0500>,<Administrator>,<TOPSPIN>,<proc1d>,<TOPSPIN 2.1>,
      <abs ABSG = 3 
       data hash MD5: 128K
       F0 1F 6C 24 12 47 61 51 68 95 97 55 15 10 92 DB>)
(   7,<2012-04-10 22:41:18.687 -0500>,<Administrator>,<TOPSPIN>,<proc1d>,<TOPSPIN 2.1>,
      <abs ABSG = 4 
       data hash MD5: 128K
       60 2A F5 50 E9 F1 40 F7 BF CC A2 B4 15 EE A0 DB>)
(   8,<2012-04-10 22:41:18.734 -0500>,<Administrator>,<TOPSPIN>,<proc1d>,<TOPSPIN 2.1>,
      <abs ABSG = 5 
       data hash MD5: 128K
       39 B3 76 A3 FC A4 6A C4 D3 6D EA FF B4 EC 42 67>)
$$ ##END=
$$ 
$$ $$ hash MD5
$$ $$ 24 E6 1C D4 CF 43 21 7A 32 B5 DB 0E 62 18 F6 4D
##$RELAX= 
##$RELAX= 
##$RELAX= 
##$RELAX= 
##$RELAX= 
##$RELAX= 
##$RELAX= 
##$RELAX= 
$$ Bruker specific parameters
$$ [...]
##$TP07= 0
##$TPNAME0= <>
##$TPNAME1= <>
##$TPNAME2= <>
##$TPNAME3= <>
##$TPNAME4= <>
##$TPNAME5= <>
##$TPNAME6= <>
##$TPNAME7= <>
##$TPOAL= (0..7)
0.5 0.5 0.5 0.5 0.5 0.5 0.5 0.5
##$TPOFFS= (0..7)
0 0 0 0 0 0 0 0
##$TUNHIN= 0
##$TUNHOUT= 0
##$TUNXOUT= 0
##$USERA1= <user>
##$USERA2= <user>
##$USERA3= <user>
##$USERA4= <user>
##$USERA5= <user>
##$V9= 5
##$VALIST= <valist>
##$VCLIST= <CCCCCCCCCCCCCCC>
##$VD= 0
##$VDLIST= <DDDDDDDDDDDDDDD>
##$VPLIST= <PPPPPPPPPPPPPPP>
##$VTLIST= <TTTTTTTTTTTTTTT>
##$WBST= 1024
##$WBSW= 4
##$XGAIN= (0..3)
0 0 0 0
##$XL= 0
##$YL= 0
##$YMAX_a= 14098886
##$YMIN_a= -5921332
##$ZGOPTNS= <>
##$ZL1= 120
##$ZL2= 120
##$ZL3= 120
##$ZL4= 120
##$ABSF1= 14.9689
##$ABSF2= -5.583631
##$ABSG= 5
##$ABSL= 3
##$ALPHA= 0
##$AQORDER= 0
##$ASSFAC= 0
##$ASSFACI= 0
##$ASSFACX= 0
##$ASSWID= 0
##$AUNMP= <proc_prof1d_extract.lims>
##$AXLEFT= 0
##$AXNAME= <>
##$AXNUC= <1H>
##$AXRIGHT= 0
##$AXTYPE= 0
##$AXUNIT= <>
##$AZFE= 0.1
##$AZFW= 0.1
##$BCFW= 0
##$BC_mod= 0
##$BYTORDP= 0
##$COROFFS= 0
##$CY= 15
##$DATMOD= 1
##$DC= 0
##$DFILT= <>
##$DTYPP= 0
##$F1P= 0
##$F2P= 0
##$FCOR= 0.5
##$FTSIZE= 131072
##$FT_mod= 6
##$GAMMA= 0
##$GB= 0
##$INTBC= 1
##$INTSCL= 1
##$ISEN= 128
##$LB= 0.3
##$LEV0= 0
##$LPBIN= 0
##$MAXI= 10000
##$MC2= 0
##$MEAN= 0
##$ME_mod= 0
##$MI= 0
##$NCOEF= 0
##$NC_proc= -3
##$NLEV= 6
##$NOISF1= 0
##$NOISF2= 0
##$NSP= 0
##$NTH_PI= 0
##$NZP= 0
##$OFFSET= 14.9689
##$PC= 1
##$PHC0= 30.18494
##$PHC1= 0
##$PH_mod= 1
##$PKNL= yes
##$PPARMOD= 0
##$PPDIAG= 0
##$PPIPTYP= 0
##$PPMPNUM= 2147483647
##$PPRESOL= 1
##$PSCAL= 4
##$PSIGN= 0
##$PYNMP= <proc.py>
##$REVERSE= no
##$SF= 400.130004685163
##$SI= 131072
##$SIGF1= 0
##$SIGF2= 0
##$SINO= 400
##$SIOLD= 131072
##$SPECTYP= <>
##$SREGLST= <1H.CDCl3>
##$SSB= 0
##$STSI= 131072
##$STSR= 0
##$SW_p= 8223.68421052632
##$SYMM= 0
##$S_DEV= 0
##$TDeff= 65536
##$TDoff= 0
##$TI= <>
##$TILT= no
##$TM1= 0
##$TM2= 0
##$TOPLEV= 0
##$USERP1= <user>
##$USERP2= <user>
##$USERP3= <user>
##$USERP4= <user>
##$USERP5= <user>
##$WDW= 1
##$XDIM= 131072
##$YMAX_p= 522355450
##$YMIN_p= -269376275
##$CURPLOT= <Network HP LaserJet P1505>
##$CURPRIN= <$Network HP LaserJet P1505>
##$DFORMAT= <normdp>
##$LAYOUT= <+/1D_H.xwp>
##$LFORMAT= <normlp>
##$PFORMAT= <normpl>
##$SURQMSG= 1
$$ End of Bruker specific parameters
$$ ---------------------------------
##NTUPLES= NMR SPECTRUM
##VAR_NAME=  FREQUENCY,     SPECTRUM/REAL,   SPECTRUM/IMAG
##SYMBOL=    X,             R,               I
##VAR_TYPE=  INDEPENDENT,   DEPENDENT,       DEPENDENT
##VAR_FORM=  AFFN,          ASDF,            ASDF
##VAR_DIM=   131072,        131072,          131072
##UNITS=     HZ,            ARBITRARY UNITS, ARBITRARY UNITS
##FACTOR=    0.0627417313425165, 1,          1
##FIRST=     8223.62146879498, -2685,        -96029
##LAST=      0,             262,             -97049
##MIN=       0,             -269376275,      0
##MAX=       8223.62146879498, 522355450,    0
$$ Real data points
##PAGE= N=1
##DATA TABLE= (X++(R..R)), XYDATA
$$ [...]
60710A297665J9038K1588K3603K3152K0754J8778J7937J6333J2765R098P725Q153
60698A496589Q049O542M544K731J300J062K618M789N821N733N709N840N533N344
60684A562204N978O102L943O10j140j280k376m919o348n532m861o429r065j0662
60670A526225j0868j0006p949n690n521p834r950r867q906q871r006p897o262
60657A417598n422m877l771l025l566l998k709j016j445l845n873o608p060p536
60643A356847p190o229o210p742r582j0258r305p027m362k787k960l696l427k249
60629A273823j318r01o08r13k552m706n677n464n981q388j1560j3692j4280j4082
60615A183701j3927j3872j3242j1528r495q735r572j0273r205o978n368m856m547
$$ y = [1297665, 1316703, 1338291, 1361894, 1385046, 1405800, 1424578, 1442515, 1458848, 1471613, 1480711, 1488436, 1496589, 1504638, 1511180, 1515724, 1518455, 1519755, 1520817, 1523435, 1528224, 1534045, 1539778, 1545487, 1551327, 1556860, 1562204, 1568182, 1574284, 1578227, 1578837, 1577697, 1576417, 1574041, 1569122, 1562774, 1557242, 1552381, 1545952, 1536887, 1526225, 1515357, 1505351, 1497402, 1491712, 1486191, 1478357, 1468407, 1458540, 1449634, 1440763, 1431757, 1423860, 1417598, 1412176, 1407299, 1403528, 1400503, 1396937, 1392939, 1390230, 1389214, 1387769, 1383924, 1378051, 1371443, 1364383, 1356847, 1349657, 1343428, 1337218, 1329476, 1319894, 1309636, 1300331, 1293304, 1288942, 1286155, 1283195, 1279499, 1276072, 1273823, 1272505, 1271604, 1270996, 1270083, 1267531, 1262825, 1257148, 1251684, 1245703, 1237315, 1225755, 1212063, 1197783, 1183701, 1169774, 1155902, 1142660, 1131132, 1121637, 1112902, 1103330, 1093057, 1083852, 1076874, 1071506, 1066650, 1062103]
60602A062103l905l163k360j282j61P04J663K969L789L192J735P07K11n02j103
60587A064597k95K050M368N353N129M265K994J800J515K099K374J697J106J944
60573A100996L936N606O409P393R454J1710J2515J1792J1357J2549J4660J6483
60561A224860J8301K0868K3254K3746K2761K2622K4050K5072K4235K2798K2482
60550A475049K2897K2647K1350J9019J5103R919N665L936L320J422j873n265q965
60537A584224j4097j9652k2837k2685k1045j9690j8424j6589j4514j2673j0876
60526A391142r039p671o993o452n573m516l620l055k954l168l032k150j240j352
60512A330327k428l499l942l650k337J47L054N305O614P264P350P158P566Q805
$$ y = [1062103, 1058198, 1055035, 1052675, 1051393, 1051232, 1051936, 1053599, 1056568, 1060357, 1063549, 1065284, 1065991, 1066202, 1065700, 1064597, 1064302, 1066352, 1070720, 1076073, 1081202, 1085467, 1088461, 1090261, 1091776, 1093875, 1096249, 1097946, 1099052, 1100996, 1104932, 1110538, 1116947, 1124340, 1133794, 1145504, 1158019, 1169811, 1181168, 1193717, 1208377, 1224860, 1243161, 1264029, 1287283, 1311029, 1333790, 1356412, 1380462, 1405534, 1429769, 1452567, 1475049, 1497946, 1520593, 1541943, 1560962, 1576065, 1585984, 1591649, 1595585, 1598905, 1600327, 1598454, 1593189, 1584224, 1570127, 1550475, 1527638, 1504953, 1483908, 1464218, 1445794, 1429205, 1414691, 1402018, 1391142, 1382103, 1374432, 1367439, 1360987, 1355414, 1350898, 1347278, 1344223, 1341269, 1338101, 1335069, 1332919, 1331679, 1330327, 1327899, 1324400, 1320458, 1316808, 1314471, 1314618, 1317672, 1322977, 1329591, 1336855, 1344205, 1351363, 1358929, 1367734]
60498A367734R577Q834P666P793Q940R641J0009J1413J3642J4901J4823J5111
60486A500084J6650J8317J9481K1500K5564L0630L4853L7761M0124M2840M6651
60475A834455N1583N5767N6163N1639M4126L5754K6129J3912Qj2535k1568k7471
60463B107962l1649l4459l4856l1813k5786j8624j1775n013K322R357J4386J7546
60451A957598K1026K6036L1138L4486L6277L7812L9479M1239M4230N0030N8650
60440B378001O8726P9624R1921J05785J20388J35391J51934J71399J93801K17870
60430C714840K42333K66589K90626L14795L39664L65673L92638M19259M42378
60421F788795M56286M53254M26027L70817K88477J83372O1969o7171j93207l04677
$$ y = [1367734, 1377311, 1386145, 1393811, 1401604, 1410544, 1420185, 1430194, 1441607, 1455249, 1470150, 1484973, 1500084, 1516734, 1535051, 1554532, 1576032, 1601596, 1632226, 1667079, 1704840, 1744964, 1787804, 1834455, 1886038, 1941805, 1997968, 2049607, 2093733, 2129487, 2155616, 2169528, 2169536, 2157001, 2135433, 2107962, 2076313, 2041854, 2006998, 1975185, 1949399, 1930775, 1919000, 1913987, 1916309, 1925666, 1940052, 1957598, 1978624, 2004660, 2035798, 2070284, 2106561, 2144373, 2183852, 2225091, 2269321, 2319351, 2378001, 2446727, 2526351, 2618272, 2724057, 2844445, 2979836, 3131770, 3303169, 3496970, 3714840, 3957173, 4223762, 4514388, 4829183, 5168847, 5534520, 5927158, 6346417, 6788795, 7245081, 7698335, 8124362, 8495179, 8783656, 8967028, 9028997, 8961826, 8768619, 8463942]
60411H463942l92680m52993m85940m95250m86810m66836m39835m08096l73298
60402D462204l37886l04415k74057k46492k21013j97302j75482j55948j38907
60393B410702j23847j09950r7390q7423q0596p5403o9605o2509n5302m9603m6197
60382A552877m4703m3673m1468l7799l4015l1282k9153k6710k4254k2649k1575
60371A195596j9948j7750j6047j5194j4318j2803j1127r973r412r173q915q046
60359A042890o096l494j336k77p2j21Q5Q75K008K578K017J135J303K762M447N383
60343A054087N463M971M209L690L949M954O100O779O739O207N859O224O842O751
60329A132824O050N980O876P384O574N406M910M308K604P43K28N45O4j337k745
$$ y = [8463942, 8071262, 7618269, 7132329, 6637079, 6150269, 5683433, 5243598, 4835502, 4462204, 4124318, 3819903, 3545846, 3299354, 3078341, 2881039, 2705557, 2549609, 2410702, 2286855, 2176905, 2079515, 1992092, 1911496, 1836093, 1766488, 1703979, 1648677, 1599074, 1552877, 1508174, 1464501, 1423033, 1385234, 1351219, 1319937, 1290784, 1264074, 1239820, 1217171, 1195596, 1175648, 1157898, 1141851, 1126657, 1112339, 1099536, 1088409, 1078436, 1069024, 1059851, 1050936, 1042890, 1036794, 1033300, 1031964, 1031687, 1031615, 1031494, 1031579, 1032454, 1034462, 1037040, 1039057, 1040192, 1041495, 1044257, 1048704, 1054087, 1059550, 1064521, 1068730, 1072420, 1076369, 1081323, 1087423, 1094202, 1100941, 1107148, 1113007, 1119231, 1126073, 1132824, 1138874, 1144854, 1151730, 1159114, 1165688, 1171094, 1176004, 1180312, 1182916, 1183659, 1183887, 1184432, 1184496, 1183159, 1180414]
60314A180414m407o898q627p201l388q36j338k961l484l024k201m32K422M848
60300A142887N831O483P884Q911Q088O269N527O174O713O373O134P232R735J2648
60286A246889J4695J5061J3895J2074J0399R280Q885Q818P915N395K263K66l86
60273A355449r05j555j259J00J061J135J971M666P644Q824Q436P956P360N488
60259A406371K476j70j783l169m927o494p108o677n461l803k360j913k486l174
60245A359322l141k560k331k904l572l181j536L30J472K063K612K861K456K120
60231A354011K823M016M169L140K493L142M046L912K979K518L397N581Q155R603
60217A413985R150P978P955R053R529Q918R000J1133J4416J7505K0485K3615K5752
$$ y = [1180414, 1176007, 1169109, 1160482, 1153281, 1149893, 1149057, 1147719, 1144758, 1141274, 1138250, 1136049, 1135617, 1138039, 1142887, 1148718, 1155201, 1163085, 1171996, 1180084, 1186353, 1191880, 1198054, 1204767, 1211140, 1217274, 1224506, 1234241, 1246889, 1261584, 1276645, 1290540, 1302614, 1313013, 1322293, 1331178, 1339996, 1347911, 1353306, 1355569, 1355835, 1355449, 1354544, 1352989, 1351730, 1351830, 1352891, 1354026, 1355997, 1360663, 1368307, 1377131, 1385567, 1393523, 1400883, 1406371, 1408847, 1408677, 1406894, 1403725, 1398798, 1392304, 1385196, 1378519, 1373058, 1369255, 1366895, 1364982, 1362496, 1359322, 1356181, 1353621, 1351290, 1348386, 1344814, 1341633, 1340097, 1340427, 1341899, 1343962, 1346574, 1349435, 1351891, 1354011, 1356834, 1360850, 1365019, 1368159, 1370652, 1373794, 1377840, 1381752, 1384731, 1387249, 1390646, 1396227, 1404382, 1413985, 1423135, 1431113, 1439068, 1448121, 1457650, 1466568, 1475568, 1486701, 1501117, 1518622, 1539107, 1562722, 1588474]
60204A588474K5810K4741K4566K6045K8671L2126L6301M0480M3988M7392N1789
60193A970383N7177O2551O7432P2204P7200Q2409Q8060R4680J02518J11383J20951
60182B906948J30798J40430J49607J58426J66752J73965J79488J83109J84571
60173D374094J83495J79741J73317J63920J51456J36975J21923J06354Q9248P0708
60163E751231N2221L4340J6051k579j8991l0835l8616m4063m7218m6909m3197
60152E581435l7244k9218j8218m328J0777K5588M0186N5735P3112R1931J10501
60141E900257J26986J40960J53296J64251J72614J77092J77508J73945J65895
60132G352804J53231J36841J17302R4103O7485L9979J4365r217l2567n6269p8618
$$ y = [1588474, 1614284, 1639025, 1663591, 1689636, 1718307, 1750433, 1786734, 1827214, 1871202, 1918594, 1970383, 2027560, 2090111, 2157543, 2229747, 2306947, 2389356, 2477416, 2572096, 2674614, 2785997, 2906948, 3037746, 3178176, 3327783, 3486209, 3652961, 3826926, 4006414, 4189523, 4374094, 4557589, 4737330, 4910647, 5074567, 5226023, 5362998, 5484921, 5591275, 5680523, 5751231, 5803452, 5837792, 5853843, 5851264, 5832273, 5801438, 5762822, 5718759, 5671541, 5624632, 5581435, 5544191, 5514973, 5496755, 5492427, 5503204, 5528792, 5568978, 5624713, 5697825, 5789756, 5900257, 6027243, 6168203, 6321499, 6485750, 6658364, 6835456, 7012964, 7186909, 7352804, 7506035, 7642876, 7760178, 7854281, 7921766, 7961745, 7976110, 7966893, 7934326, 7878057, 7799439]
60121G799439r7405j11419j20428j24907j25726j23147j16423j05134r0476p4148
60111F710226n6585l7320j6612M529K5437M5735O4525Q0862R4712J06260J14603
60100G136372J18319J17136J11824J02712Q9812P4330N8595M3914K9661J5048
60090G897723J123r621j5366j6345j4119r510j476J1527K9235M9616P1272R4606
60078H088665J20209J47600J76438K07536K41285K76320L11287L46893L84420
60069A0300653M22947M59873M93673N24242N50813N71585N85462N92319N91264
60060A5092831N80434N59060N28126M88426M39591L81845L17284K48032J74016
60051A8809645R4046Q893p7800j61765k40256l11643l73772m24003m61007m85516
$$ y = [7799439, 7702034, 7590615, 7470187, 7345280, 7219554, 7096407, 6979984, 6874850, 6784374, 6710226, 6653641, 6616321, 6599709, 6604238, 6629675, 6675410, 6739935, 6820797, 6915509, 7021769, 7136372, 7254691, 7371827, 7483651, 7586363, 7676175, 7750505, 7809100, 7853014, 7882675, 7897723, 7898846, 7889225, 7873859, 7857514, 7843395, 7833885, 7832409, 7843936, 7873171, 7922787, 7994059, 8088665, 8208874, 8356474, 8532912, 8740448, 8981733, 9258053, 9569340, 9916233, 10300653, 10723600, 11183473, 11677146, 12201388, 12752201, 13323786, 13909248, 14501567, 15092831, 15673265, 16232325, 16760451, 17248877, 17688468, 18070313, 18387597, 18635629, 18809645, 18903691, 18912584, 18834784, 18673019, 18432763, 18121120, 17747348, 17323345, 16862338, 16376822]
60041A6376822m98538m99651m88269m66058m36413m01321l60427l13771k63738
60032A2648636k13243j63402j14427o7594k4673J3786M7901P6536R7589J10067
60022A2411176J14572J11785J01691Q4539O1634L4884O132k3145n2028q0037j06685
60011A2664518j31484j54604j76755j97957k17214k33765k47768k59050k66260
60002A0779661k68098k64667k56927k45736k32055k16800j99554j78652j53771
59993H763401j27344j01931p7199n0835k1805Q544L7828O4020Q6515J06887J27465
59982H815546J47946J64690J74552J77810J75861J68060J53270J32877J09395
59973A0220007Q2948N2099J7632j7374n1123q4077j16145j45260j69235j87209
$$ y = [16376822, 15878284, 15378633, 14890364, 14424306, 13987893, 13586572, 13226145, 12912374, 12648636, 12435393, 12271991, 12157564, 12089970, 12065297, 12079083, 12126984, 12203520, 12301109, 12411176, 12525748, 12637533, 12739224, 12823763, 12885397, 12920281, 12926413, 12903268, 12851240, 12771203, 12664518, 12533034, 12378430, 12201675, 12003718, 11786504, 11552739, 11304971, 11045921, 10779661, 10511563, 10246896, 9989969, 9744233, 9512178, 9295378, 9095824, 8917172, 8763401, 8636057, 8534126, 8456927, 8406092, 8384287, 8392831, 8430659, 8494679, 8581194, 8688081, 8815546, 8963492, 9128182, 9302734, 9480544, 9656405, 9824465, 9977735, 10110612, 10220007, 10302955, 10355054, 10372686, 10355312, 10304189, 10220112, 10103967, 9958707, 9789472, 9602263]
59963I602263j99093k05330k07211k05650j99748j88272j72168j53691j33540
59954G937560j11042q6808o2595l8561j3204J3720M0608O6563R2231J17825J42713
59943H099010J67286J92481K16916K37059K51139K60328K65108K63078K51850
59934A0204255K31926K05343J73506J37898J00775O3332K4658j5763n5856r2929
59924A0977145j26450j57034j83648k03716k15611k19480k15852k04865j87150
59915I263339j64711j40337j15907r1153o4491l5557o312K1153M7027P2557R7258
59904H882866J19305J38258J54989J69002J78287J82315J82702J80289J74064
59895A0362077J63971J52316J40846J28615J14426R9628Q6765P6925P0118O7008
$$ y = [9602263, 9403170, 9197840, 8990629, 8784979, 8585231, 8396959, 8224791, 8071100, 7937560, 7826518, 7739710, 7677115, 7638554, 7625350, 7639070, 7679678, 7746241, 7838472, 7956297, 8099010, 8266296, 8458777, 8675693, 8912752, 9163891, 9424219, 9689327, 9952405, 10204255, 10436181, 10641524, 10815030, 10952928, 11053703, 11117035, 11141693, 11125930, 11070074, 10977145, 10850695, 10693661, 10510013, 10306297, 10090686, 9871206, 9655354, 9450489, 9263339, 9098628, 8958291, 8842384, 8751231, 8686740, 8651183, 8644871, 8666024, 8713051, 8785608, 8882866, 9002171, 9140429, 9295418, 9464420, 9642707, 9825022, 10007724, 10188013, 10362077, 10526048, 10678364, 10819210, 10947825, 11062251, 11161879, 11248644, 11325569, 11395687, 11462695]
59885A1462695O8526P4723Q5477J01500J23437J50878J83295K20775K62721L06979
59875A3041006L51652L96713M42491M87420N28527N63261N89445O04223O04314
59866A7609052N87086N50531M93132M14851L17909K06109Q4233m1467j63686k76225
59856A9781525l75164m57557n20535n62939n86470n93953n87261n67975n38651
59847A4991020n01947m59336m12036l62145l11501k60230k07914j55385j04073
59838A2216453n4442o594L8382P9320J16497J50506J79914K01812K14528K18220
59828A3354596K12695J96222J66983J24867P1492R349n8733j29664j99957k65770
59818A3482080l23755l72156m10525m38124m53837m58124m53786m43614m28126
$$ y = [11462695, 11531221, 11605944, 11691421, 11792921, 11916358, 12067236, 12250531, 12471306, 12734027, 13041006, 13392658, 13789371, 14231862, 14719282, 15247809, 15811070, 16400515, 17004738, 17609052, 18196138, 18746669, 19239801, 19654652, 19972561, 20178670, 20262903, 20221436, 20057750, 19781525, 19406361, 18948804, 18428269, 17865330, 17278860, 16684907, 16097646, 15529671, 14991020, 14489073, 14029737, 13617701, 13255556, 12944055, 12683825, 12475911, 12320526, 12216453, 12162011, 12155417, 12193799, 12273119, 12389616, 12540122, 12720036, 12921848, 13136376, 13354596, 13567291, 13763513, 13930496, 14055363, 14126855, 14136204, 14077471, 13947807, 13747850, 13482080, 13158325, 12786169, 12375644, 11937520, 11483683, 11025559, 10571773, 10128159, 9700033]
59809I700033m06845l80910l53009l25179k97958k71417k45698k20607j95817
59800G002593j71769j49727j30813j15319j02746r2300q3667p7513p4579p4054
59790E930106p3690p1912o8960o5492o1267n5912m9986m4294l9058l4691l2421
59779E332423l3114l6240m0890m6989n4422o1829o7456p0573p1072o8613o3414
59768D717811n6969n0620m3908l5705k6396j7547r876k897L849J0566J7835K6106
59756D532249L4738M2856N0850N9732O9121P7232Q2921Q6527Q8738Q9751Q9680
59745E304395Q8643Q6246Q1860P5579O8165N9985N0838M1062L2045K5496K2511
59734E936825K3199K6694L1819L8184M6451N7163O9985Q4690J02022J22554J45386
$$ y = [9700033, 9293188, 8912278, 8559269, 8234090, 7936132, 7664715, 7419017, 7198410, 7002593, 6830824, 6681097, 6550284, 6434965, 6332219, 6239919, 6156252, 6078739, 6004160, 5930106, 5856416, 5784504, 5715544, 5650052, 5588785, 5532873, 5482887, 5438593, 5399535, 5364844, 5332423, 5299309, 5263069, 5222179, 5175190, 5120768, 5058939, 4991483, 4920910, 4849838, 4781225, 4717811, 4660842, 4610222, 4566314, 4530609, 4504213, 4486666, 4476790, 4473893, 4477742, 4488308, 4506143, 4532249, 4566987, 4609843, 4660693, 4720425, 4789546, 4866778, 4949699, 5036226, 5124964, 5214715, 5304395, 5393038, 5479284, 5561144, 5636723, 5704888, 5764873, 5815711, 5856773, 5888818, 5914314, 5936825, 5960024, 5986718, 6018537, 6056721, 6103172, 6160335, 6230320, 6315010, 6417032, 6539586, 6684972]
59723F684972J69395J95342K25176K59164K95173L31163L67150M04082M41697
59714I373314M78034N10229N34658N46219N38186N03544M37590L40547K18817
59705A3481138Q4207m8658j66014k58687l23892l63671l81478l80264l63281l35071
59695A0944329l00614k63613k25853j87718j49077j10196p2164l6042j768L1267
59685I628551O2759R1939J19602J48067J78481K09636K40334K71334L03824L37453
59675A1591980L71610M07494M46988M89969N34603N80043O27332O77543P30466
59666A6458028P85302Q41462Q98162R53811J006036J052032J089102J115439J130210
59657B5329584J132770J122322J098953J064725J023474R80098R40141R08830
$$ y = [6684972, 6854367, 7049709, 7274885, 7534049, 7829222, 8160385, 8527535, 8931617, 9373314, 9851348, 10361577, 10896235, 11442454, 11980640, 12484184, 12921774, 13262321, 13481138, 13565345, 13516687, 13350673, 13091986, 12768094, 12404423, 12022945, 11642681, 11279400, 10944329, 10643715, 10380102, 10154249, 9966531, 9817454, 9707258, 9635094, 9599052, 9597284, 9628551, 9691310, 9783249, 9902851, 10050918, 10229399, 10439035, 10679369, 10950703, 11254527, 11591980, 11963590, 12371084, 12818072, 13308041, 13842644, 14422687, 15050019, 15727562, 16458028, 17243330, 18084792, 18982954, 19936765, 20942801, 21994833, 23083935, 24199374, 25329584, 26462354, 27584676, 28683629, 29748354, 30771828, 31751926, 32692067, 33600897]
59649C3600897Q89361Q82232Q86366Q99975R19924R41494R59668R69945R67326
59640D1917188R45883R00781Q30380P35970O20556M88901L47763K04798O7505
59631D7059725n6632j60669k40219k94133l22304l24170l00425k54489j90336
59622D4916348j09754j3378R6652K16981L45249M80050O19056P58744Q95465J025269
59612D9230682J143036J242900J318530J361507J360952J307258J195841J025630
59604E9186336P95899N08780J75502j82903n42519q82752j186721j440272j634164
59595E4797186j766394j840508j862222j838692j779664j696900j601771j503912
59587D0907123j412058j335073j281341j256591j261683j291687j336401j382206
$$ y = [33600897, 34490258, 35372490, 36258856, 37158831, 38078755, 39020249, 39979917, 40949862, 41917188, 42863071, 43763852, 44594232, 45330202, 45950758, 46439659, 46787422, 46992220, 47059725, 47003093, 46842424, 46602205, 46308072, 45985768, 45661598, 45361173, 45106684, 44916348, 44806594, 44793216, 44889868, 45106849, 45452098, 45932148, 46551204, 47309948, 48205413, 49230682, 50373718, 51616618, 52935148, 54296655, 55657607, 56964865, 58160706, 59186336, 59982235, 60491015, 60666517, 60483614, 59941095, 59058343, 57871622, 56431350, 54797186, 53030792, 51190284, 49328062, 47489370, 45709706, 44012806, 42411035, 40907123, 39495065, 38159992, 36878651, 35622060, 34360377, 33068690, 31732289, 30350083]
59579C0350083j415396j426650j413870j380486j330860j267996j195106j116872
59571A9802847j037650r59626q83920q12124p45380o83154o24439n69317n18123
59562A2969114m70435m26421l87637l54478l24068k93165k62238k34408k11186
59553A0005078j91736j75675j63646j55204j48928j44916j44722j48292j53258
59544H578701j57801j62222j67093j71685j74875j75948j74169j69160j62011
59535G063737j54377j46228j36176j24122j11635r9511q6954p3723o1057m9751
59525F020203l8965k7645j5743l724P661J6987K3466K8726L5193M2396M7374M9288
59513F185217N0940N4654N9211O2553O5276O9461P5769Q3652R3099J04252J16285
$$ y = [30350083, 28934687, 27508037, 26094167, 24713681, 23382821, 22114825, 20919719, 19802847, 18765197, 17805571, 16921651, 16109527, 15364147, 14680993, 14056554, 13487237, 12969114, 12498679, 12072258, 11684621, 11330143, 11006075, 10712910, 10450672, 10216264, 10005078, 9813342, 9637667, 9474021, 9318817, 9169889, 9024973, 8880251, 8731959, 8578701, 8420900, 8258678, 8091585, 7919900, 7745025, 7569077, 7394908, 7225748, 7063737, 6909360, 6763132, 6626956, 6502834, 6391199, 6291688, 6204734, 6131011, 6069954, 6020203, 5981238, 5953593, 5937850, 5934126, 5941787, 5958774, 5982240, 6010966, 6046159, 6088555, 6135929, 6185217, 6236157, 6290811, 6350022, 6412575, 6477851, 6547312, 6623081, 6706733, 6799832, 6904084, 7020369]
59502G020369J28458J41448J56212J72360J88991K06408K25485K46117K67658
59493H753506K90208L14071L38451L62103L84836M07095M28292M46782M61290
59484A2186634M71254M75974M74619M67158M54353M36768M14556L88308L59171
59475A6128795L27707K93350K55711K16305J78496J45464J18427R6927Q0370O8691
59465A7910243O1914O0279O4907P7012R5534J16525J35776J51069J60914J62379
59455A8996552J51937J27814Q9906L8251k6256j00076j78344k58073l38057m15513
59445A8088141m85315n43312n88340o20039o37009o38807o28236o09700n85740
59436A2751643n56350n21171m81277m39026l96843l56074l16786k78881k43082
$$ y = [7020369, 7148827, 7290275, 7446487, 7618847, 7807838, 8014246, 8239731, 8485848, 8753506, 9043714, 9357785, 9696236, 10058339, 10443175, 10850270, 11278562, 11725344, 12186634, 12657888, 13133862, 13608481, 14075639, 14529992, 14966760, 15381316, 15769624, 16128795, 16456502, 16749852, 17005563, 17221868, 17400364, 17545828, 17664255, 17761182, 17841552, 17910243, 17972157, 18032436, 18097343, 18174355, 18269889, 18386414, 18522190, 18673259, 18834173, 18996552, 19148489, 19276303, 19366209, 19404460, 19378204, 19278128, 19099784, 18841711, 18503654, 18088141, 17602826, 17059514, 16471174, 15851135, 15214126, 14575319, 13947083, 13337383, 12751643, 12195293, 11674122, 11192845, 10753819, 10356976, 10000902, 9684116, 9405235, 9162153]
59427I162153k10099j79263j49190j19635r1294o3811l5659o388K2560N0011P6633
59416H456018J03612J30966J58123J85113K12206K39052K64942K89426L12035
59407A0351493L31774L47207L56606L58027L49826L31259L02062K61865K10955
59398A3201074J51233Q5286J4841n8606j31971k01169k63550l18208l63939l98732
59388A1716259m21880m34962m40127m38552m30919m17972m00282l78726l55382
59379G997457l32522l10568k88513k66374k45376k25549k05454j84939j65979
59370E772183j49671j34352j18073j01396q6301p3547o2334n1661m0878k9694
59360D924276j8494q079J323J0087J8014K4357K9213L3879L9638M7199N6870O7372
$$ y = [9162153, 8952054, 8772791, 8623601, 8503966, 8412672, 8348861, 8313202, 8306814, 8329374, 8379385, 8456018, 8559630, 8690596, 8848719, 9033832, 9246038, 9485090, 9750032, 10039458, 10351493, 10683267, 11030474, 11387080, 11745107, 12094933, 12426192, 12728254, 12990119, 13201074, 13352307, 13437593, 13452434, 13393828, 13261857, 13060688, 12797138, 12478930, 12114991, 11716259, 11294379, 10859417, 10419290, 9980738, 9549819, 9131847, 8731565, 8352839, 7997457, 7664935, 7354367, 7065854, 6799480, 6554104, 6328555, 6123101, 5938162, 5772183, 5622512, 5488160, 5370087, 5268691, 5182390, 5108843, 5046509, 4994848, 4953970, 4924276, 4905782, 4897703, 4899026, 4909113, 4927127, 4951484, 4980697, 5014576, 5054214, 5101413, 5158283, 5225655]
59348E225655P4827P5463P0153O4234O2401O5592P2989Q4053R7647J11960J26969
59337F131943J44495J64075J81233J92226J98903K06748K19479K37521K60270
59328G936893K87449L18799L54183L93595M36031M79506N23406N69514O19148
59319A1918524O70464P20134P66550Q09420Q46955Q75327Q90706Q90759Q74718
59310A9263557Q43450P99283P45039O83467O17690N50976M85378M21582L60316
59301B4770738L02355K46672J90615J32930P4518J5063m8703j19132j93662k66825
59291B5104569l35001l97254m52754m99929n37940n67332n89554o06947o22462
59282B0495396o37837o52627o65812o77321o86749o91920o90444o81902o67262
$$ y = [5225655, 5300482, 5375945, 5446098, 5510332, 5572733, 5638325, 5711314, 5795367, 5893014, 6004974, 6131943, 6276438, 6440513, 6621746, 6813972, 7012875, 7219623, 7439102, 7676623, 7936893, 8224342, 8543141, 8897324, 9290919, 9726950, 10206456, 10729862, 11299376, 11918524, 12588988, 13309122, 14075672, 14885092, 15732047, 16607374, 17498080, 18388839, 19263557, 20107007, 20906290, 21651329, 22334796, 22952486, 23503462, 23988840, 24410422, 24770738, 25073093, 25319765, 25510380, 25643310, 25717828, 25732891, 25684188, 25565056, 25371394, 25104569, 24769568, 24372314, 23919560, 23419631, 22881691, 22314359, 21724805, 21117858, 20495396, 19857559, 19204932, 18539120, 17861799, 17175050, 16483130, 15792686, 15110784, 14443522]
59273A4443522o47183o22291n93997n63438n30447m95029m58795m23487l89124
59264I719731l55164l22385k91851k62894k34052k05478j78728j54648j32907
59255G581624j13048r4648p6903n9326m2345k6344j0815M618J9394L3179M6675
59244G262061O0232P3027Q4847R7096J10511J23387J33745J41906J49173J55283
59234H391268J59106J60636J60353J57660J51938J44142J35619J26475J16813
59225I704010J08302J02334R7974R3948R1509R2845R7705J04189J11950J21701
59215A0726467J32144J40313J44942J46761J45231J37511J21385R7394O7696L4445
59205A1894289l27l4755o7540r7573j23448j44136j59478j69061j71733j67564
$$ y = [14443522, 13796339, 13174048, 12580051, 12016613, 11486166, 10991137, 10532342, 10108855, 9719731, 9364567, 9042182, 8750331, 8487437, 8253385, 8047907, 7869179, 7714531, 7581624, 7468576, 7373928, 7297025, 7237699, 7195354, 7169010, 7158195, 7162813, 7182207, 7215386, 7262061, 7322293, 7395320, 7480167, 7577263, 7687774, 7811161, 7944906, 8086812, 8235985, 8391268, 8550374, 8711010, 8871363, 9029023, 9180961, 9325103, 9460722, 9587197, 9704010, 9812312, 9914646, 10012620, 10106568, 10198077, 10290922, 10388627, 10492816, 10604766, 10726467, 10858611, 10998924, 11143866, 11290627, 11435858, 11573369, 11694754, 11792148, 11859844, 11894289, 11893962, 11859207, 11791667, 11694094, 11570646, 11426510, 11267032, 11097971, 10926238, 10758674]
59195A0758674j58977j48128j34346j16240r5240p4468n4849l4971j4440N183
59185I932198K2913L9356N4821O8270P8645Q5960R0874R4330R7419J00603J03640
59174A0769029J07203J13413J23449J36072J50299J68123J92166K21768K53982
59165A2235504K87461L22602L58419L92157M21673M45351M59684M59796M42840
59156A5825487M08773L57662K88753K02739J03034n626j18344k30043l36146m33362
59146A6062927n18351n86609o34975o64786o79983o82384o71360o48042o16783
59137A0359654n81771n44550n05613m66273m28075l91904l58287l27314k98199
59128F457668k70285k44459k22106k03056j85950j70116j55414j40983j26210
$$ y = [10758674, 10599697, 10451569, 10317223, 10200983, 10105743, 10031275, 9976426, 9941455, 9927015, 9932198, 9955111, 9994467, 10049288, 10117558, 10196203, 10282163, 10373037, 10467367, 10564786, 10665389, 10769029, 10876232, 10989645, 11113094, 11249166, 11399465, 11567588, 11759754, 11981522, 12235504, 12522965, 12845567, 13203986, 13596143, 14017816, 14463167, 14922851, 15382647, 15825487, 16234260, 16591922, 16880675, 17083414, 17186448, 17180822, 17062478, 16832435, 16496289, 16062927, 15544576, 14957967, 14322992, 13658206, 12978223, 12295839, 11624479, 10976437, 10359654, 9777883, 9233333, 8727720, 8261447, 7833372, 7441468, 7083181, 6755867, 6457668, 6187383, 5942924, 5720818, 5517762, 5331812, 5161696, 5006282, 4865299, 4739089]
59119D739089j12341j01021r1806q3164p5063o8206o1616n3703m5099l7594l0873
59108C978603k3234j4938p660j135O201J3600J8837K2664K8481L7046M5328N1521
59096D155314N7447O4788P2498P9454Q6455R3892J00318J05088J09908J16273
59086E041435J23576J30893J38289J45308J50677J54551J58459J62163J63316
59077F368667J61166J57612J53443J46844J37061J26163J15301J02536Q6769P0827
59067G626389N7999M8064L9451L2943L0286L1079L3926L9253M8201O0065P3379
59056H121035Q8537J06892J28075J50232J72253J93969K14965K34831K53650K70720
59046I935159K83816K91199K93162K89911K79236K58126K25826J83674J33120
$$ y = [4739089, 4626748, 4525727, 4433921, 4350757, 4275694, 4207488, 4145872, 4092169, 4047070, 4009476, 3978603, 3955369, 3940431, 3932771, 3931636, 3937837, 3951437, 3970274, 3992938, 4021419, 4058465, 4103793, 4155314, 4212761, 4277549, 4350047, 4429501, 4515956, 4609848, 4710166, 4815254, 4925162, 5041435, 5165011, 5295904, 5434193, 5579501, 5730178, 5884729, 6043188, 6205351, 6368667, 6529833, 6687445, 6840888, 6987732, 7124793, 7250956, 7366257, 7468793, 7555562, 7626389, 7684388, 7732452, 7771903, 7804846, 7835132, 7866211, 7900137, 7939390, 7987591, 8047656, 8121035, 8209572, 8316464, 8444539, 8594771, 8767024, 8960993, 9175958, 9410789, 9664439, 9935159, 10218975, 10510174, 10803336, 11093247, 11372483, 11630609, 11856435, 12040109, 12173229]
59037A2173229P6005J6129m1685r4188j40236j79151k09907k31818k45035k50588
59027A0872755k50538k47453k42970k37319k30705k24380k19822k17702k18115
59018H783751k20830k24883k29006k32960k37374k41904k44918k45581k44862
59009F661433k43727k41641k37659k31815k24652k16309k06729j96039j84524
59000D678338j73072j63324j55990j49271j40700j30388j20606j12366j04725
58991C427896r7420r1510q7014q2562p7928p4304p1475o7524o2177n7582n4681
58980B603719n1736m7619m3538m0047l5517k9575k5005k3748k3547k1245j7199
58969B244943j3728j1152q256n299l662l194k224J36L221N665O091M103J424N65
$$ y = [12173229, 12249234, 12265363, 12223678, 12129490, 11989254, 11810103, 11600196, 11368378, 11123343, 10872755, 10622217, 10374764, 10131794, 9894475, 9663770, 9439390, 9219568, 9001866, 8783751, 8562921, 8338038, 8109032, 7876072, 7638698, 7396794, 7151876, 6906295, 6661433, 6417706, 6176065, 5938406, 5706591, 5481939, 5265630, 5058901, 4862862, 4678338, 4505266, 4341942, 4185952, 4036681, 3895981, 3765593, 3644987, 3532621, 3427896, 3330476, 3238966, 3151952, 3069390, 2991462, 2917158, 2845683, 2778159, 2715982, 2658400, 2603719, 2551983, 2504364, 2460826, 2420779, 2385262, 2355687, 2330682, 2306934, 2283387, 2262142, 2244943, 2231215, 2220063, 2211807, 2206508, 2202846, 2199652, 2197428, 2197564, 2200785, 2206450, 2212541, 2216644, 2218068, 2218633]
58955B218633J529J854P69P64L489O800P963P422P113P171O905P064Q463R915
58941B295854R973R360R322R154P721N972N374N386N086N861R456J4364J7096
58928B409979J6551J4681J3425J3396J4955J8087K1338K3066K3540K4247K5624
58917B618889K7136K8787L0832L2758L4350L6743M0570M4143M5609M5997M7811
58906C033625N1315N4606N6882N9258O2501O6096O9561P2910P5836P8030Q0219
58895C760839Q3411Q7206R0290R2543R5296R9600J05209J11264J17282J23705
58885D766645J31704J41839J52801J62743J72078J83255J97288K12420K27022
58876F347795K41709K57475K74109K91768L11820L34364L57227L79450M03623
$$ y = [2218633, 2220162, 2222016, 2222785, 2223549, 2227038, 2233838, 2241801, 2249223, 2256336, 2263507, 2270412, 2277476, 2285939, 2295854, 2305827, 2315187, 2324509, 2333663, 2341384, 2347356, 2352730, 2358116, 2363202, 2369063, 2378519, 2392883, 2409979, 2426530, 2441211, 2454636, 2468032, 2482987, 2501074, 2522412, 2545478, 2569018, 2593265, 2618889, 2646025, 2674812, 2705644, 2738402, 2772752, 2809495, 2850065, 2894208, 2939817, 2985814, 3033625, 3084940, 3139546, 3196428, 3255686, 3318187, 3384283, 3453844, 3526754, 3602590, 3680620, 3760839, 3844250, 3931456, 4021746, 4114289, 4209585, 4309185, 4414394, 4525658, 4642940, 4766645, 4898349, 5040188, 5192989, 5355732, 5527810, 5711065, 5908353, 6120773, 6347795, 6589504, 6846979, 7121088, 7412856, 7724676, 8059040, 8416267, 8795717, 9199340]
58867I199340M32576M65726N00969N38214N78540O21734O67259P16060P68590
58858A4489008Q22482Q74943R26190R77750J028333J073840J110437J135129J144332
58849B3582444J134458J103110J047625R63877Q49012P04562N35015L45134J41284
58840C0406521o6505k67408m54284o23062p69297q88565r79446j043284j081802
58831B4232868j097484j094982j078813j050504j010710r62941r11948q59506
58823A6165980q05243p50797o99398o51821o06388n62757n22281m84771m48532
58814A0633992m13893l83380l57921l35654l14678k94247k73342k51287k29866
58805G779724k11819j96833j81854j65680j50227j36860j24410j11591r8741q6372
$$ y = [9199340, 9631916, 10097642, 10598611, 11136825, 11715365, 12337099, 13004358, 13720418, 14489008, 15311490, 16186433, 17112623, 18090373, 19118706, 20192546, 21302983, 22438112, 23582444, 24716902, 25820012, 26867637, 27831514, 28680526, 29385088, 29920103, 30265237, 30406521, 30340016, 30072608, 29618324, 28995262, 28225965, 27337400, 26357954, 25314670, 24232868, 23135384, 22040402, 20961589, 19911085, 18900375, 17937434, 17025486, 16165980, 15360737, 14609940, 13910542, 13258721, 12652333, 12089576, 11567295, 11082524, 10633992, 10220099, 9836719, 9478798, 9143144, 8828466, 8534219, 8260877, 8009590, 7779724, 7567905, 7371072, 7189218, 7023538, 6873311, 6736451, 6612041, 6500450, 6401709, 6315337]
58795F315337p4295o2790n2495m2809l2462k1712j1811k297Q758K1759L5234M8415
58783F128832O1638P4306Q5211R5219J06922J21163J36326J51340J66795J82766
58773G310518J98311K13737K30824K50005K69602K88715L08743L31273L56257
58764I757985L83046M11633M42389M75872N12886N53441N96168O40368O87742
58755A4461530P39857P94660Q48200Q99182R48906R96682J038266J068954J085548
58746B2881785J084852J062771J015537R40208Q34370O97910N35085L52749J56953
58737B9562220m6503k49252m41415o15536p66972q91511r86325j053047j096157
58728B3415502j118019j118883j101663j072512j035714r91695r41067q87174
$$ y = [6315337, 6241042, 6178252, 6125757, 6082948, 6050486, 6028774, 6016963, 6014666, 6023424, 6045183, 6080417, 6128832, 6190470, 6264776, 6349987, 6445206, 6552128, 6673291, 6809617, 6960957, 7127752, 7310518, 7508829, 7722566, 7953390, 8203395, 8472997, 8761712, 9070455, 9401728, 9757985, 10141031, 10552664, 10995053, 11470925, 11983811, 12537252, 13133420, 13773788, 14461530, 15201387, 15996047, 16844247, 17743429, 18692335, 19689017, 20727283, 21796237, 22881785, 23966637, 25029408, 26044945, 26985153, 27819523, 28517433, 29052518, 29405267, 29562220, 29515717, 29266465, 28825050, 28209514, 27442542, 26551031, 25564706, 24511659, 23415502, 22297483, 21178600, 20076937, 19004425, 17968711, 16977016, 16035949, 15148775]
58720A5148775q33327p80659p29868o82099o36954n92606n49271n09910m76270
58711I357811m46773m19335l93712l70082l47904l27201l08599k91255k73166
58702F179784k54153k36108k19923k04921j91466j80668j70984j58927j44312
58693D418322j31160j21870j14108j05194r6049q8482q1761p4566o7809o2878
58683C474445n9163n5653n3151n2562n2571n1229m8673m6587m6031m7145m9768
58672B911912n2979n5082n5143n3724n1746m9797m8763m9278n0228m9563m7004
58661B348605m4278m2619m1979m2509m4379m6005m5093m1792l8437l6095l4002
58650A891417l2283l1908l1819k9705k6263k4948k6462k7150k4442k0402j8076
$$ y = [15148775, 14315448, 13534789, 12804921, 12122822, 11485868, 10893262, 10343991, 9834081, 9357811, 8911038, 8491703, 8097991, 7727909, 7380005, 7052804, 6744205, 6452950, 6179784, 5925631, 5689523, 5469600, 5264679, 5073213, 4892545, 4721561, 4562634, 4418322, 4287162, 4165292, 4051184, 3945990, 3849941, 3761459, 3679698, 3605132, 3537323, 3474445, 3415282, 3359629, 3306478, 3253916, 3201345, 3150116, 3101443, 3054856, 3008825, 2961680, 2911912, 2858933, 2803851, 2748708, 2694984, 2643238, 2593441, 2544678, 2495400, 2445172, 2395609, 2348605, 2304327, 2261708, 2219729, 2177220, 2132841, 2086836, 2041743, 1999951, 1961514, 1925419, 1891417, 1859134, 1827226, 1795407, 1765702, 1739439, 1714491, 1688029, 1660879, 1636437, 1616035, 1597959]
58639A597959j7541j7470j7806j8755j9374j8953j8005j6776j4998j3633j4253
58628A410395j5897j5644j3142j1219j1047j0269p504m884m165l727j835K13P17
58615A311992O21J491K776L336L542L909L754K943K754L506L693K890K869M328
58601A354404N312M593L741M062M337L563L059L811M563M750O397J0603J4866
58588A428061J6500J6577J7844K0802K4174K7453L0789L3832L6464L9292M2312
58577A734100M4965M8083N3258N9609O4260O6960P0729P6778Q2680Q7231R3002
58566B481655J01846J11833J21365J32492J47097J63191J78304J93580K11245
58557C842608K30653K49884K68786K87513L04349L17590L27243L32644L30900
$$ y = [1597959, 1580418, 1562948, 1545142, 1526387, 1507013, 1488060, 1470055, 1453279, 1438281, 1424648, 1410395, 1394498, 1378854, 1365712, 1354493, 1343446, 1333177, 1325673, 1320789, 1316624, 1312897, 1311062, 1311275, 1311992, 1312613, 1314104, 1316880, 1320216, 1323758, 1327667, 1331421, 1334364, 1337118, 1340624, 1344317, 1347207, 1350076, 1354404, 1359716, 1364309, 1368050, 1372112, 1376449, 1380012, 1383071, 1386882, 1391445, 1396195, 1402592, 1413195, 1428061, 1444561, 1461138, 1478982, 1499784, 1523958, 1551411, 1582200, 1616032, 1652496, 1691788, 1734100, 1779065, 1827148, 1880406, 1940015, 2004275, 2071235, 2141964, 2218742, 2301422, 2388653, 2481655, 2583501, 2695334, 2816699, 2949191, 3096288, 3259479, 3437783, 3631363, 3842608, 4073261, 4323145, 4591931, 4879444, 5183793, 5501383, 5828626, 6161270, 6492170]
58548F492170L19733K98939K67274K21863J63398R8144L1764l5110j02007j63534
58538G592634k13509k51078k78620k96534l04235l03666k97621k86706k71526
58529E089139k55305k40584k25775k08795j91401j76002j61028j43954j26662
58520C359633j13080j03254r4154q4792p6455o9351o3001n8440n6303n4332n0434
58509B536037m6393m4770m4097m1230l6816l4040l3304l2338l0620k9842l0690
58498B131897l2552l5409l9132m2150m3568m4726m6023m4856m0068l5488l4859
58487A693066l5894l3930k9219k5665k4200k2495j9999j8297j7348j5810j4404
58476A435805j4729j5699j5054j3419j2834j2614j0741q139p230p391o190m078
$$ y = [6492170, 6811903, 7110842, 7378116, 7599979, 7763377, 7861521, 7893285, 7858175, 7756168, 7592634, 7379125, 7128047, 6849427, 6552893, 6248658, 5944992, 5647371, 5360665, 5089139, 4833834, 4593250, 4367475, 4158680, 3967279, 3791277, 3630249, 3486295, 3359633, 3246553, 3143299, 3049145, 2964353, 2887898, 2818547, 2755546, 2697106, 2640803, 2586471, 2536037, 2489644, 2444874, 2400777, 2359547, 2322731, 2288691, 2255387, 2223049, 2192429, 2162587, 2131897, 2099345, 2063936, 2024804, 1982654, 1939086, 1894360, 1848337, 1803481, 1763413, 1727925, 1693066, 1657172, 1623242, 1594023, 1568358, 1544158, 1521663, 1501664, 1483367, 1466019, 1450209, 1435805, 1421076, 1405377, 1390323, 1376904, 1364070, 1351456, 1340715, 1332576, 1325346, 1317955, 1311765, 1307687]
58464A307687l492m294m521m661o635r290r545p659p035q964j1571j3637j5554
58451A200829j6709j5736j3234j1068r481p875p229q371r223p469m610l676m299
58438A081849m035l074l470m850n106m206l371j971O88K200J77l006l288j268
58424A047269n43j260o18J216J176j127l034l673m424m980l744j836j985l725
58410A018712m232l358l362m135l495j729j345k580l447l605l904l066N52M787
58396I85793N999M633L882M043L097J582J558J901O8k570k775j766l504p552r710
58381I84679r173q885r255p839n189m655o106n902l424j757j723j158l23j955
58367I17335n460o960n652m478m249k871o28j73r63K71L281M510L799M597P159
$$ y = [1307687, 1304195, 1299901, 1295380, 1290719, 1284084, 1274794, 1265249, 1257590, 1250555, 1241591, 1230020, 1216383, 1200829, 1184120, 1168384, 1155150, 1144082, 1134601, 1126726, 1119497, 1111126, 1101903, 1094434, 1089824, 1086148, 1081849, 1077814, 1074740, 1071270, 1066420, 1061314, 1057108, 1053737, 1051766, 1052454, 1054654, 1054831, 1051825, 1048537, 1047269, 1046726, 1045466, 1044848, 1046064, 1047240, 1046113, 1043079, 1039406, 1034982, 1030002, 1026258, 1024422, 1022437, 1018712, 1014480, 1011122, 1007760, 1003625, 1000130, 998401, 997056, 994476, 991029, 987424, 983520, 980454, 981006, 985793, 991792, 996425, 1000307, 1004350, 1007447, 1009029, 1010587, 1012488, 1012556, 1009986, 1007211, 1005445, 1001941, 994389, 984679, 975506, 966621, 957366, 949527, 944338, 939683, 933577, 927675, 924251, 922494, 920771, 919613, 919290, 917335, 911875, 904915, 899263, 894785, 890536, 887665, 887037, 886864, 885901, 886172, 889453, 893963, 897762, 902359, 909518]
58352I09518Q059P068P941J1399J3743J3534J3463J4569J4678J3602J3864J5296
58340A056734J4872J2593J1599J1890J0339P290O492P828P082L756K066L033K820
58327A158394K52j217o24j450m580o141m378k287j694j089n82k427n298m925j620
58312A120334k84j872k195j51O90q7J432N162N967L073K196N670Q740Q303P250
58297A164228P252N556K078J529N072P622O715O299Q449R445P383N775O072M602
58283A248077N70r39K333N830O512P321R842J0698Q982R063J2178J3380J0723
58270A344570R141J1209J2569J0766J0115J3219J6039J5946J6435J9448K1214
58259A500671J9984J9548K1085K0347J6944J6953K1878K4823K2377K0409K2865
$$ y = [909518, 917577, 924645, 932586, 943985, 957728, 971262, 984725, 999294, 1013972, 1027574, 1041438, 1056734, 1071606, 1084199, 1095798, 1107688, 1118027, 1125317, 1131809, 1139637, 1146719, 1150475, 1152541, 1155574, 1158394, 1158646, 1157429, 1156805, 1155355, 1150775, 1144634, 1140256, 1137969, 1136275, 1135186, 1134604, 1132177, 1126879, 1121954, 1120334, 1120050, 1118178, 1115983, 1115832, 1116522, 1116435, 1117867, 1123029, 1128996, 1132069, 1134265, 1139935, 1148675, 1156978, 1164228, 1171480, 1177036, 1179114, 1180643, 1185715, 1193337, 1200052, 1206351, 1214800, 1224245, 1231628, 1237403, 1243475, 1248077, 1248647, 1247708, 1250041, 1255871, 1262383, 1269704, 1279546, 1290244, 1299226, 1308289, 1320467, 1333847, 1344570, 1353711, 1364920, 1377489, 1388255, 1398370, 1411589, 1427628, 1443574, 1460009, 1479457, 1500671, 1520655, 1540203, 1561288, 1581635, 1598579, 1615532, 1637410, 1662233, 1684610, 1705019, 1727884]
58248A727884K4992K3402K2682K5862K8164K6669K6346L0007L2067K9017K6534
58237B023626K9162L2510L2403L2448L5692L8247L7868L9246M4355M7428M5803
58226B438788M5329M8712M9758M5846M4311M9097N3212N2381N3517O1107O7854
58215C009912O8177O8392P3663P7570P5035P3115P8020Q3715Q4394Q5875R3269
58204C871137R9879J00215J01653J10957J21495J26224J30949J42062J53647J59649
58194E117867J66217J78916J90574J95232K00884K14603K28585K35122K41707
58185F969707K56643K73700K85980L00478L23389L45806L60014L74760L98242
58176I888719M21836M37444M54314M81189N09198N30659N56673N97125O42221
$$ y = [1727884, 1752876, 1776278, 1798960, 1824822, 1852986, 1879655, 1906001, 1936008, 1968075, 1997092, 2023626, 2052788, 2085298, 2117701, 2150149, 2185841, 2224088, 2261956, 2301202, 2345557, 2392985, 2438788, 2484117, 2532829, 2582587, 2628433, 2672744, 2721841, 2775053, 2827434, 2880951, 2942058, 3009912, 3078089, 3146481, 3220144, 3297714, 3372749, 3445864, 3523884, 3607599, 3691993, 3777868, 3871137, 3971016, 4071231, 4172884, 4283841, 4405336, 4531560, 4662509, 4804571, 4958218, 5117867, 5284084, 5463000, 5653574, 5848806, 6049690, 6264293, 6492878, 6728000, 6969707, 7226350, 7500050, 7786030, 8086508, 8409897, 8755703, 9115717, 9490477, 9888719, 10310555, 10747999, 11202313, 11683502, 12192700, 12723359, 13280032, 13877157, 14519378]
58167A4519378O83448P32166P96407Q61205R14824R71724J045210J121612J188026
58158B2834000J260258J354176J455488J549292J652973J786067J934700K081048
58150C5908002K238859K421890K608901K782551K972029L213649L503758L837272
58142E9486911M252915M786645N422874O151726P029079Q115550R409690J0913960
58134A15569350J2696453J4786231J7069239J9395862K1732840K4141483K6785749
58127B52177207L0106667L4586230L9638170M2657047L9989987K9716461J3620704
58120D82492473l810935j8356704k8107226l3281922l4987055l4401122l2535695
58113B97011814l0092669k7398638k4587318k1811468j9215806j6829128j4622220
$$ y = [14519378, 15202826, 15934992, 16731399, 17592604, 18507428, 19479152, 20524362, 21645974, 22834000, 24094258, 25448434, 26903922, 28453214, 30106187, 31892254, 33826954, 35908002, 38146861, 40568751, 43177652, 45960203, 48932232, 52145881, 55649639, 59486911, 63739826, 68526471, 73949345, 80101071, 87130150, 95245700, 104655390, 115569350, 128265803, 143052034, 160121273, 179517135, 201249975, 225391458, 252177207, 282283874, 316870104, 356508274, 399165321, 439155308, 468871769, 482492473, 478681538, 460324834, 432217608, 398935686, 363948631, 329547509, 297011814, 266919145, 239520507, 214933189, 193121721, 173905915, 157076787, 142454567]
58106A42454567j2615260j0834684r233505p751477o399374n204268m136674l173836
58098H3105489k360029j703169j088733m41564N3165M1065o46484j803980l026889
58089G2128871l994705m579522m795673m731523m499039m184967l833163l469205
58081C8041074l118180k793216k492902k219934j983461j779954j593399j418562
58073B0641466j264990j136286j024837r28140q51196p91263p37955o89071o49806
58064A2567922o17158n81807n44212n12339m84990m53688m19229l89984l65591
58055H198924l38665l11010k92136k82895k75778k69426k67574k65734k55079
58046E640627k38398k26814k21545k13796k01707j92111j85857j76390j63441
$$ y = [142454567, 129839307, 119004623, 109771118, 102019641, 95620267, 90415999, 86279325, 83105489, 80745460, 79042291, 77953558, 77511994, 77565159, 77606224, 76959740, 75155760, 72128871, 68134166, 63554644, 58758971, 54027448, 49528409, 45343442, 41510279, 38041074, 34922894, 32129678, 29636776, 27416842, 25433381, 23653427, 22060028, 20641466, 19376476, 18240190, 17215353, 16287213, 15436017, 14644754, 13906799, 13217728, 12567922, 11950764, 11368957, 10824745, 10312406, 9827416, 9373728, 8954499, 8564515, 8198924, 7860259, 7549249, 7257113, 6974218, 6698440, 6429014, 6161440, 5895706, 5640627, 5402229, 5175415, 4953870, 4740074, 4538367, 4346256, 4160399, 3984009, 3820568]
58037C820568j54032j49048j42050j32002j24550j20121j13056j03109r5901r1644
58027B595055q4933p5936p0463o8808o5701o1250o0680o3220o2370n7425n3873
58016A870396n2372m8223m1925l9163l9870l8130l3460l1503l2750l1309k5968
58005A455723k2077k1036j8209j2842j0190j1850j3251j2573j3116j5206j4609
57994A290764j0978r319j1208j2631j1996j2271j3753j2874r747q837j0574j0198
57982A156378o620m528n888o918n420l874l399j701J256K378J632K317M030K524
57968A132167k276n358n218n922q947j0321q099n770n766n998n121n130o694p627
57954A043920p667q941j0530q896m887l717o427q154o592n296o369o743m469k305
$$ y = [3820568, 3666536, 3517488, 3375438, 3243436, 3118886, 2998765, 2885709, 2782600, 2686699, 2595055, 2510122, 2434186, 2363723, 2294915, 2229214, 2167964, 2107284, 2044064, 1981694, 1924269, 1870396, 1818024, 1769801, 1727876, 1688713, 1648843, 1610713, 1577253, 1545750, 1513000, 1481691, 1455723, 1433646, 1412610, 1394401, 1381559, 1371369, 1359519, 1346268, 1333695, 1320579, 1305373, 1290764, 1279786, 1270467, 1259259, 1246628, 1234632, 1222361, 1208608, 1195734, 1185987, 1177150, 1166576, 1156378, 1149758, 1145230, 1139342, 1132424, 1127004, 1123130, 1119731, 1118030, 1119286, 1121664, 1123296, 1125613, 1129643, 1132167, 1129891, 1124533, 1119315, 1113393, 1104446, 1094125, 1086026, 1080256, 1074490, 1068492, 1063371, 1058241, 1051547, 1043920, 1036253, 1027312, 1016782, 1007886, 1002999, 999282, 992855, 984701, 978109, 972813, 966444, 959701, 955232, 952927]
57940I52927k169j963p02r63l378m215j388K102L360L277K787N54l296o171p921
57925I32841j1590j7182k0012j7783j4049j2066j0440p592n390n151m644k203
57913H04739K07P14M17K54q57k728l045j751j830l865m621l130k984o000q681
57898G66839q077o386o449p079o388n651o424p236o295m417k722p25J230J322
57884G01542pL17K574K934r4k675j923m55j368l212l646l883n511o747n907n084
57868F66855o370p669o364m187m294o005o510n567m766m069k628j261r33n09J227
57853F06950L278M609O337R096J0715R421P062O248O524O214N775O370P180O982
57839G02761O369N788L733k99l514l552k328k978n040n971n650n978p412q850
$$ y = [952927, 950758, 948795, 948093, 947130, 943752, 939537, 938149, 940251, 943611, 946888, 949675, 950229, 946933, 940762, 932841, 921251, 904069, 884057, 866274, 852225, 840159, 829719, 822127, 816737, 811586, 806942, 804739, 804946, 805660, 806077, 806331, 805474, 802746, 799701, 797950, 796120, 792255, 787634, 784504, 781520, 775520, 766839, 758762, 752376, 745927, 738848, 732460, 726809, 720385, 713149, 706854, 702437, 699715, 698990, 700220, 701542, 701535, 701852, 704426, 707360, 707266, 704591, 702668, 702213, 700845, 697633, 693987, 690104, 684593, 677846, 671939, 666855, 660485, 652816, 646452, 642265, 637971, 631966, 625456, 619889, 615123, 611054, 608426, 607165, 606232, 605723, 606950, 610228, 614837, 621174, 630270, 640985, 650406, 657468, 663716, 670240, 676454, 682229, 688599, 695779, 702761, 709130, 714918, 718651, 718352, 714838, 711286, 708958, 705980, 700940, 694969, 689319, 683341, 675929, 667079]
57825F67079r881j0473r865q086p028p643p940o161l943l583m167l473j886j260
57811E81690j221J63K960N489O968P714P677O993O902Q017Q918Q413P545P254
57797F65482O009K354j890l778l327k808l194l887m880o585q302q988q844q463
57783F08899p674o765p076q532q613n949k868j971k346j994j773l602o352p163
57769E36221n818m712n128o453q227j0205j1165j0303r018q976r332q375o759
57756D31750o403p237p755p886q489q906p792n793m702m617m316l752l596l137
57742C47369j214J462L279M244N160N456M426L536M618O664P195N977M592L427
57728D06191K084J741L659O088O130M276L616M844N596M656L220J757p05l600
$$ y = [667079, 657198, 646725, 636860, 628774, 621746, 614103, 606163, 600002, 596059, 592476, 588309, 584836, 582950, 581690, 580469, 580632, 583592, 589081, 596049, 603763, 611440, 618433, 625335, 633352, 642270, 650683, 658228, 665482, 671491, 673845, 671955, 668177, 664850, 662042, 658848, 654961, 650081, 643496, 635194, 626206, 617362, 608899, 601225, 594460, 587384, 578852, 570239, 564290, 561422, 559451, 557105, 555111, 553338, 549736, 543384, 536221, 530403, 525691, 520563, 514110, 505883, 495678, 484513, 474210, 465192, 456216, 446884, 438509, 431750, 425347, 418110, 410355, 402469, 393980, 385074, 377282, 371489, 366787, 362170, 357854, 354102, 350506, 347369, 346155, 347617, 350896, 355140, 360300, 365756, 370182, 373718, 378336, 385000, 392195, 398172, 402764, 406191, 408275, 410016, 413675, 419763, 425893, 430169, 433785, 438629, 444225, 448881, 452101, 453858, 453153, 449553]
57714D49553m554l136j899k581l926m174l410k432j540j161j843k850k683j296
57700D12068O5J304L459O025O795N082K801J660J248O87K58M92J163J968K897
57685D47972L672M006M525N998P791Q654Q730R135R832R879R434R404R358Q129
57671E56519O319O003P732R997J1692J2899J3354J2567J1595J2272J4406J6062
57659F91417J6735J7807J9652K1010K1709K3371K6566K9653L1344L2330L3585
57648I65179L5122L7088M0079M3691M6604M8667N1003N3897N6689N9834O4654
57637A502507P0749P6337Q1470Q8133R6621J04986J12895J22778J35711J49253
57627B541440J61254J73106J87163K03218K19615K35798K51655K65876K76729
$$ y = [449553, 444999, 441863, 439964, 437383, 433457, 429283, 425873, 423441, 421901, 420740, 418897, 416047, 413364, 412068, 412133, 413437, 416896, 422921, 429716, 434798, 437599, 439259, 440507, 441194, 441452, 441944, 443107, 445075, 447972, 451644, 455650, 460175, 466173, 473964, 482618, 491348, 500483, 510315, 520194, 529628, 539032, 548390, 556519, 562838, 568841, 576573, 586570, 598262, 611161, 624515, 637082, 648677, 660949, 675355, 691417, 708152, 725959, 745611, 766621, 788330, 811701, 838267, 867920, 899264, 931594, 965179, 1000301, 1037389, 1077468, 1121159, 1167763, 1216430, 1267433, 1321330, 1378019, 1437853, 1502507, 1573256, 1649593, 1731063, 1819196, 1915817, 2020803, 2133698, 2256476, 2392187, 2541440, 2702694, 2875800, 3062963, 3266181, 3485796, 3721594, 3973249, 4239125, 4515854]
57618D515854K83116K83471K75336K57531K31281J97925J57575J11566O4475K1725
57608F399855j3594m0510n9329p3277q9257j13742j47603j85873k21582k48947
57598E206141k64580k68183k62131k49410k32243k12783j93268j74464j55368
57589C193711j35700j17266j01624q7932p4531o1319m9244l8615k9310k1341j3904
57578B462925n176N505J6391K5563L3328M1191M9756N8928O8968Q0029R1723J04248
57566C033379J18499J34073J48760J61339J73046J84856J95155K01936K05447
57557D556490K06348K02653J90903J69410J38476R8694N1525Q76m8261r2785j31785
57546E342544j64746j91090k10794k23800k29507k28269k22459k14537k05026
$$ y = [4515854, 4798970, 5082441, 5357777, 5615308, 5846589, 6044514, 6202089, 6313655, 6378130, 6399855, 6386261, 6345751, 6286422, 6213145, 6123888, 6010146, 5862543, 5676670, 5455088, 5206141, 4941561, 4673378, 4411247, 4161837, 3929594, 3716811, 3523543, 3349079, 3193711, 3058011, 2940745, 2839121, 2751189, 2676658, 2615339, 2566095, 2527480, 2498170, 2476829, 2462925, 2457749, 2463254, 2479645, 2505208, 2538536, 2579727, 2629483, 2688411, 2757379, 2837408, 2929131, 3033379, 3151878, 3285951, 3434711, 3596050, 3769096, 3953952, 4149107, 4351043, 4556490, 4762838, 4965491, 5156394, 5325804, 5464280, 5562974, 5614499, 5615375, 5567114, 5474329, 5342544, 5177798, 4986708, 4775914, 4552114, 4322607, 4094338, 3871879, 3657342, 3452316]
57537C452316j93785j81986j70919j60044j48242j36030j24730j14438j04781
57528B117361r6498r0120q4184p7093o9767o4089n9736n5153n0643m7574m5159
57517A377345m1269l6250l2662l0944k8473k3784j8976j6698j6894j7571j7142
57506A096682j5102j1824q502o134m212j567J580L965N483P208R220J0484J1195
57493A098476J3095J6712K0257K2162K3110K4536K6585K8639L0747L3442L6778
57482A374539M0339M3843M7385N1505N6860O3316O9657P5103Q0677Q8042R7336
57471B088602J07302J17078J26624J35835J44595J53186J61209J66633J67476
57462C368540J63846J56544J44418J25242R8839O7093L1538o526m3774p5957j01852
$$ y = [3452316, 3258531, 3076545, 2905626, 2745582, 2597340, 2461310, 2336580, 2222142, 2117361, 2020863, 1930743, 1846559, 1769466, 1699699, 1635610, 1575874, 1520721, 1470078, 1422504, 1377345, 1336076, 1299826, 1267164, 1236220, 1207747, 1183963, 1164987, 1148289, 1131395, 1113824, 1096682, 1081580, 1069756, 1061254, 1055120, 1050908, 1049341, 1050921, 1054886, 1060369, 1067577, 1076797, 1087281, 1098476, 1111571, 1128283, 1148540, 1170702, 1193812, 1218348, 1244933, 1273572, 1304319, 1337761, 1374539, 1414878, 1458721, 1506106, 1557611, 1614471, 1677787, 1747444, 1822547, 1903224, 1991266, 2088602, 2195904, 2312982, 2439606, 2575441, 2720036, 2873222, 3034431, 3201064, 3368540, 3532386, 3688930, 3833348, 3958590, 4057429, 4124522, 4156060, 4149534, 4105760, 4029803, 3927951]
57451C927951j23573j42254j55987j62854j63558j60008j53366j44708j35516
57442B586127j26367j16711j06732r7640q9423q0547p0783o2068n5425m9167m1704
57431A689560l3992k7580k2044j6192j0258n086l79M583R588J4247J8987K3977
57419A645411K8363L1948L6304M2739N0412N7952O5571P3956Q2341Q9760R7181
57408B301938J06247J16397J25222J31529J36270J40371J43020J42253J36081
57399C479328J22890J01827P3356L9390K819l3366o7183r8071j25642j48249j63979
57388C183120j72952j77110j77586j74058j67078j58900j50937j42335j32251
57379A729913j21789j12268j03204r3739q4698p7455p1777o6424o1024n6030n1632
$$ y = [3927951, 3804378, 3662124, 3506137, 3343283, 3179725, 3019717, 2866351, 2721643, 2586127, 2459760, 2343049, 2236317, 2138677, 2049254, 1968707, 1897924, 1835856, 1780431, 1731264, 1689560, 1655568, 1627988, 1605944, 1589752, 1579494, 1574408, 1574029, 1578612, 1588200, 1602447, 1621434, 1645411, 1673774, 1705722, 1742026, 1784765, 1835177, 1893129, 1958700, 2032656, 2114997, 2204757, 2301938, 2408185, 2524582, 2649804, 2781333, 2917603, 3057974, 3200994, 3343247, 3479328, 3602218, 3704045, 3777401, 3816791, 3819610, 3786244, 3719061, 3620990, 3495348, 3347099, 3183120, 3010168, 2833058, 2655472, 2481414, 2314336, 2155436, 2004499, 1862164, 1729913, 1608124, 1495856, 1392652, 1298913, 1214215, 1136760, 1064983, 998559, 937535, 881505, 829873]
57368H29873m7907m5092m2655l9346l5287l2567l2362l2843l1455k8042k4231
57357D38086k1145j9295j9237k0385k0470j8154j5098j3587j3419j3034j2292
57346B51970j1854j1099r213p363p155p783p328o046n662o070n681m660m769n954
57332A51333o117m571l092l031l825m785n951o682n879m230l860n022n395l524
57318H5369q81M51J84r58k477l563l153j646r21j613j914k50K310L536K797J119
57302G8390m83j646k234k274j967j416q15p99j693k539k070o92j15q92j840k133
57286E4782k327k759k549j077Q13J982K386K635L052L696M434M630L745K493K321
57271G8257L307L820K755J036K88R28K099K790K637K185K475L754M886M907M725
$$ y = [829873, 781966, 736874, 694219, 654873, 619586, 587019, 554657, 521814, 490359, 462317, 438086, 416941, 397646, 378409, 358024, 337554, 319400, 304302, 290715, 277296, 264262, 251970, 240116, 229017, 219804, 212441, 205286, 197503, 190175, 184129, 178467, 172397, 166716, 162056, 157287, 151333, 145216, 140645, 137553, 134522, 130697, 125912, 119961, 113279, 107400, 103170, 99310, 94288, 88893, 85369, 84488, 84939, 85123, 84165, 81688, 78125, 74972, 73326, 72405, 70792, 68878, 68628, 70938, 74474, 77271, 78390, 77907, 76261, 74027, 71753, 69786, 68370, 67555, 66756, 65063, 62524, 60454, 59762, 59647, 58755, 56915, 54782, 52455, 49696, 47147, 46070, 46883, 48865, 51251, 53886, 56938, 60634, 65068, 69698, 73443, 75936, 78257, 81564, 85384, 88139, 89175, 89463, 90391, 92490, 95280, 97917, 100102, 102577, 106331, 111217, 116124, 120849]
57256A20849O020Q734J1210J2582J3494J4393J4879J4978J5455J6478J7440J8399
57244B84911K0140K2487K4085K4361K4291K4840K5859K6885K7815K8553K9085
57233E63312K9982L1577L2884L2765L1974L2431L4628L7379L9906M2406M4840
57222I54084M7063M9757N3237N5805N5741N4530N5249N7887N9162N7096N2697
57211A552308M6902L9117K9456J9242Q659l020j4286k2049k6141k9477l2781l3400
57199A534530l0837k8833k9482k9571k6041k1233j8977j8560j6700j3144j0163
57188A290989q115n300j144L649Q995J4684J9054K1214K3283K7522L2495L5072
57176A462398L5077L4940L5651L6034L5391L4094L2081K9282K7008K6601K7208
$$ y = [120849, 126869, 135603, 146813, 159395, 172889, 187282, 202161, 217139, 232594, 249072, 266512, 284911, 305051, 327538, 351623, 375984, 400275, 425115, 450974, 477859, 505674, 534227, 563312, 593294, 624871, 657755, 690520, 722494, 754925, 789553, 826932, 866838, 909244, 954084, 1001147, 1050904, 1104141, 1159946, 1215687, 1270217, 1325466, 1383353, 1442515, 1499611, 1552308, 1599210, 1638327, 1667783, 1687025, 1695684, 1692664, 1678378, 1656329, 1630188, 1600711, 1567930, 1534530, 1503693, 1474860, 1445378, 1415807, 1389766, 1368533, 1349556, 1330996, 1314296, 1301152, 1290989, 1282874, 1277574, 1276430, 1280079, 1289074, 1303758, 1322812, 1344026, 1367309, 1394831, 1427326, 1462398, 1497475, 1532415, 1568066, 1604100, 1639491, 1673585, 1705666, 1734948, 1761956, 1788557, 1815765]
57165A815765K7087K6585K7710L1196L5847M0225M3509M5559M7589N1478N6973
57154B249523O1187O2459O2726O4085O5221O3992O1478O0285O0260N9197N6780
57143B927193N4684N3278N1188M7854M4210M1178L9409L9720M1880M3856M4094
57132C428544M3502M3461M3391M2070L9865L7684L5392L3072L2017L2504L2741
57121C844243L1914L1845L3533L4894L4372L3653L3965L2997K8832K3778K0657
57110D184683J8447J5429J3219J3356J3213J0162O724O534Q115P944O809P457
57098D312092Q682P699N880O141O983N440L282L547L344k458j2276k0199k5774
57085D302383l3584m4167n3574o1428p1438q3774r4581j03206j12631j22839j31120
$$ y = [1815765, 1842852, 1869437, 1897147, 1928343, 1964190, 2004415, 2047924, 2093483, 2141072, 2192550, 2249523, 2310710, 2373169, 2435895, 2499980, 2565201, 2629193, 2690671, 2750956, 2811216, 2870413, 2927193, 2981877, 3035155, 3086343, 3134197, 3178407, 3219585, 3258994, 3298714, 3340594, 3384450, 3428544, 3472046, 3515507, 3558898, 3600968, 3640833, 3678517, 3713909, 3746981, 3778998, 3811502, 3844243, 3876157, 3908002, 3941535, 3976429, 4010801, 4044454, 4078419, 4111416, 4140248, 4164026, 4184683, 4203130, 4218559, 4231778, 4245134, 4258347, 4268509, 4275233, 4281767, 4289882, 4297826, 4304635, 4312092, 4320774, 4328473, 4334353, 4340494, 4347477, 4352917, 4356199, 4359746, 4363090, 4360632, 4348356, 4328157, 4302383, 4268799, 4224632, 4171058, 4109630, 4038192, 3954418, 3859837, 3756631, 3644000, 3521161, 3390041]
57074C390041j38773j49974j64122j76782j87797k00677k14739k26092k35713
57065A695372k47862k61329k71469k80179k94190B6102c10103l62185l99162m47115
57055a518565n00024n58517o29241p11742p99116q92083r98860j120622j251237
57046h980007j391871j550644j727522j916024k120522k354145k619033k907936
57038b5567704l225934l589706m005947m476055n024045n692478o506230p463511
57030f5551610q556121r761315j1014963j2226917j3300647j4084809j4380472
57023a48876854j4193594j4021740j4615675j6142212j7601126j7356792j4423752
57016b57231745r196947k947583L196216Q695424J3318570J6801701J8889801
$$ y = [3390041, 3251268, 3101294, 2937172, 2760390, 2572593, 2371916, 2157177, 1931085, 1695372, 1447510, 1186181, 914712, 634533, 340343, 26102, -310103, -672288, -1071450, -1518565, -2018589, -2577106, -3206347, -3918089, -4717205, -5609288, -6608148, -7728770, -8980007, -10371878, -11922522, -13650044, -15566068, -17686590, -20040735, -22659768, -25567704, -28793638, -32383344, -36389291, -40865346, -45889391, -51581869, -58088099, -65551610, -74107731, -83869046, -94884009, -107110926, -120411573, -134496382, -148876854, -163070448, -177092188, -191707863, -207850075, -225451201, -242807993, -257231745, -266428692, -269376275, -266180059, -257484635, -244166065, -227364364, -208474563]
57009b08474563J9553149J9044321J7779200J6190894J4616133J3224222J2031569
57002i6035075J0992911J0072043R239856Q458417P701329O971882O282457N631726
56994c0684454N014911M438361L909083L423603K979144K583002K240194J943660
56986d152496J685524a000736B83471J128199R88503Q65205P58012O59141N63948
56977E246479M77953M05484L41377K81288K30083J92018J61945J34415J12559
56968G583601R9729R0584P8913O6973N8874N1687M1240L0418K3556J8161R962
56957H153698J086m207p206j1070j4010j3069j0583j0201j0718j0145j1647j8697
56945H033231k8503l7100m6747o0430p2594p4822p0550p6422j07387j64287k34862
$$ y = [-208474563, -188921414, -169877093, -152097893, -135906999, -121290866, -108066644, -96035075, -85042164, -74970121, -65730265, -57271848, -49570519, -42598637, -36316180, -30684454, -25669543, -21231182, -17322099, -13898496, -10919352, -8336350, -6096156, -4152496, -2466972, -1000736, 283471, 1411670, 2400173, 3265378, 4023390, 4682531, 5246479, 5724432, 6129916, 6471293, 6752581, 6982664, 7174682, 7336627, 7471042, 7583601, 7683330, 7773914, 7852827, 7919800, 7978674, 8030361, 8071601, 8102019, 8125575, 8143736, 8153698, 8154784, 8150577, 8143371, 8132301, 8118291, 8105222, 8094639, 8084438, 8073720, 8063575, 8051928, 8033231, 8004728, 7967628, 7920881, 7860451, 7787857, 7713035, 7642485, 7566063, 7458676, 7294389, 7059527]
56934G059527l01908l51387l78622l88763l89537l84142l72421l55626l36164
56925C800957l14699k91208k67328k44624k22501k00838j82265j68529j57120
56916A751845j45023j33329j24494j17553j10096j02599r6677r1035q3374p4564
56906F73101o6942o0095n2258m4052l6787k8892j8306o733K775J0896J9984K8247
56894D20938L0983K7278K0853J4336P047j280q594j3190j5170j4946j2990j0964
56882D44301j0278r767p484m172k004n82K446P128J1164J4065J8005K4023L0262
56869E17107L4375L5062L1152K2061R696k394j2129j9453k4258k6243k6657k7528
56857E10791k8936k9202k7775k5739k3565k0536j6541j2437q816o038m956n652
$$ y = [7059527, 6757619, 6406232, 6027610, 5638847, 5249310, 4865168, 4492747, 4137121, 3800957, 3486258, 3195050, 2927722, 2683098, 2460597, 2259759, 2077494, 1908965, 1751845, 1606822, 1473493, 1348999, 1231446, 1121350, 1018751, 922074, 831039, 747665, 673101, 606159, 546064, 493806, 449754, 412967, 384075, 365769, 359036, 361811, 372707, 392691, 420938, 451921, 479199, 500052, 514388, 521435, 520155, 511561, 498371, 483201, 468255, 455265, 444301, 434023, 424256, 416772, 412600, 410596, 410014, 412460, 419588, 430752, 444817, 462822, 486845, 517107, 551482, 586544, 617696, 639757, 649453, 647059, 634930, 615477, 591219, 564976, 538319, 510791, 481855, 452653, 424878, 399139, 375574, 355038, 338497, 326060, 317244, 311206, 306250, 300598]
56845C00598o215m823k364q58k51P87K013K381K762M819P792R445R764J0516J1603
56830C47969J1235R692R406J1071J2859J3821J4768J5289J3277Q354K821j667
56818D68895n641r219j0966j0514r720r805r584p743m786j604K061O613J1648
56805D09635J6875K2415K7726L1820L5030L8823M3501M7633M9805M9036M3598
56794H15897L1921J5294k264j7251k8168l4238l5195l2535k8602k4033j8163j1631
56782F31032n902l01P299J6632K4964L1355L7645M4685N1095N6712O3356P0152
56770A028724P1566O2702M4365K1191k692k4281m0744n0752n5384n6004n2788
56759I45903m6525l9679l3707k7350j9397j1271m914K21O101J3389K1413K9468
$$ y = [300598, 294383, 289560, 287196, 286338, 286087, 286874, 288887, 291268, 294030, 298849, 306641, 316086, 325850, 336366, 347969, 359204, 368896, 378302, 389373, 402232, 416053, 430821, 446110, 459387, 467741, 470562, 468895, 463254, 454035, 443069, 432555, 422835, 413030, 403446, 395703, 390917, 389313, 391374, 397987, 409635, 426510, 448925, 476651, 508471, 543501, 582324, 625825, 673458, 723263, 772299, 815897, 847818, 863112, 860848, 843597, 815429, 781191, 745996, 713461, 684859, 660826, 642663, 631032, 625130, 624829, 632128, 648760, 673724, 705079, 742724, 787409, 838504, 895216, 958572, 1028724, 1100290, 1162992, 1207357, 1228548, 1225856, 1201575, 1160831, 1110079, 1054695, 998691, 945903, 899378, 859699, 825992, 798642, 779245, 767974, 763060, 763281, 769382, 782771, 804184, 833652]
56747H33652L6559M1225M2860M1829L7297K7090J1232o347k1337l2559m0559m5028
56735I25914m5702m3950m1284l7616l2759k7991k4213k0218j4794q939m035N39
56723F24952N813J0766J3846J5589J7350J8508J7184J2865O345j817j0839j8726
56711G11836k3900k6844k8480k8202k5619k2722k1759k2003k1096j8715j6415
56700D56081j4693j2859j1186j0473r894p918n236m157n023n737n047m056l879
56687C55923l974l507k765k406k505k763k882k597k096k110k731k786j499k0R9
56672C21381p99j361j702l039n146o228n453l928k930k698l174m439n960o579
56658B67945n789m267k970k187j599o88P05J931K082J327Q60J056P83o38k028
$$ y = [833652, 870211, 911436, 954296, 996125, 1033422, 1060512, 1071744, 1065397, 1044060, 1011501, 970942, 925914, 880212, 836262, 794978, 757362, 724603, 696612, 672399, 652181, 637387, 628448, 624413, 624952, 630765, 641531, 655377, 670966, 688316, 706824, 724008, 736873, 743218, 741401, 730562, 711836, 687936, 661092, 632612, 604410, 578791, 556069, 534310, 512307, 491211, 472496, 456081, 441388, 428529, 417343, 406870, 396976, 389058, 383822, 379665, 374642, 368905, 363858, 359802, 355923, 351949, 348442, 345677, 343271, 340766, 338003, 335121, 332524, 330428, 328318, 325587, 322801, 321302, 321282, 321381, 320582, 319221, 317519, 314480, 309334, 303106, 297653, 293725, 290795, 288097, 284923, 280484, 274524, 267945, 262156, 257889, 254919, 252732, 251133, 250445, 251150, 253081, 255163, 256490, 257350, 258406, 259189, 258551, 256523]
56643B56523k072j379j498k608l515l331k091l95O72J43j445k282j752j290j811
56628B31869j989o11R74P64p43j309l1K049L678M151L261J840J386J920J667J19
56612B48995n05J333L664L883K653K323L112L599L600L677L083J173m04k0P19
56597B80885o77l119l529k082j888l771n211m624l114j672m8J249J089K70Q77
56582B54635K767L783L570L779M305L090L26j025N0J033L67o5J317K881K683J512
56566B85008J017J226J715K892M391M370K250J15j17R27J897K729L372K758P68
56551C15318p16m10M95N00M6J46O53J270K401L597L190J012n50O1J182P71l16
56534C28650p3J294K091J907J487Q35m22j549j497o94m15q54j123o59M02J608
$$ y = [256523, 254451, 253072, 251574, 248966, 245451, 242120, 240029, 239634, 240306, 240449, 239004, 236722, 234970, 233680, 231869, 229880, 229269, 230243, 231007, 230264, 228955, 228924, 230973, 234651, 238802, 242063, 243903, 245289, 247209, 248876, 248995, 248490, 249823, 253487, 257370, 260023, 262346, 265458, 269057, 272657, 276334, 279417, 280590, 280186, 280166, 280885, 280208, 277089, 273560, 271478, 269590, 265819, 260608, 255984, 252870, 251198, 251150, 252399, 253488, 253758, 254635, 257402, 261185, 264755, 268534, 272839, 275929, 276255, 275230, 275280, 276313, 276680, 276615, 277932, 280813, 283496, 285008, 286025, 287251, 288966, 291858, 296249, 300619, 302869, 302984, 302867, 303794, 305691, 308420, 311792, 314550, 315318, 314602, 314192, 314687, 315187, 315233, 315379, 316032, 317302, 319703, 323300, 326490, 327502, 326952, 327013, 328195, 328966, 328650, 328577, 329871, 331962, 333869, 335356, 336191, 335769, 334220, 332723, 332029, 331614, 330760, 329637, 328978, 329380, 330988]
56518C30988K076R44j138k062q21J001J489J008J347L036M890N609M889L364K296
56503C58916K727M353N668N624M516L228K567L209N082O664O295M262K373J581
56489D17065J594K458M331N820M991K296Q8j062k713m860n209l287j972l092m431
56474D12017l438j311q54k220l486l985m556n369n763n611n202m329k783j145
56460C61965o2M82N25j85j181j329m93K55N17R85J557J047o16k043k817l908n025
56443C49674m234j310J345K278K739L470K898L76j727j382K20J228J903K638K031
56428C62147m16k237j396N74J451J909L282M168K651L0r77j87R15K310M501N971
56412C84696M969K748J896K550L182L845N419O741N968M054L637M958N899N698
$$ y = [330988, 333064, 334008, 332870, 330808, 329987, 330988, 332477, 333485, 334832, 337868, 342758, 348367, 353256, 356620, 358916, 361643, 365996, 371664, 377288, 381804, 385032, 387599, 390808, 395890, 402554, 408849, 413111, 415484, 417065, 418659, 421117, 425448, 431268, 436259, 438555, 438643, 437581, 434868, 430008, 424799, 421512, 419540, 416448, 412017, 408579, 407268, 406414, 404194, 400708, 396723, 392167, 386798, 381035, 375424, 370222, 365893, 363110, 361965, 361903, 362385, 362910, 362725, 361544, 360215, 359722, 359977, 360494, 361479, 363036, 364083, 363467, 361424, 358607, 354699, 349674, 345440, 344130, 345475, 347753, 350492, 353962, 356860, 357236, 355509, 354127, 354347, 355575, 357478, 360116, 362147, 361731, 359494, 358098, 358672, 360123, 362032, 365314, 369482, 372133, 372163, 371186, 370999, 371914, 374224, 378725, 384696, 389665, 392413, 394309, 396859, 400041, 403886, 409305, 416046, 422014, 426068, 429705, 434663, 440562, 446260]
56398D46260N673O362O664N828M208K362J163J946M519O133M572J137j532l105
56384D92190m501m988l490j487j202j871j145N44N64j452l255l845m329m839m021
56369D52873k062j161k236l700m109l822l470k893k146j832k053k351k698l287
56355D15053l693l535l294l255k667j335n70r13o32J375L082K270K49m16j81j092
56339D00446k408j535J267K852J828o8j181j544j305l83K36m89j528j055N65J557
56323C97255J796K309K489J013r45o61K007M417M976M332L006R06q76p25Q77J946
56307D24122K011K025J814M95r69o61J060K068J931K078K916L667M590O369P768
56292D61284O997M871L604L214K300J520K556M372M481L350L515M689M225K313
$$ y = [446260, 451933, 458295, 464959, 470787, 474995, 477357, 478520, 480466, 484985, 491118, 495690, 496827, 495295, 492190, 487689, 482701, 479211, 477724, 476522, 474651, 473506, 474050, 474614, 473162, 469907, 466062, 461733, 456894, 452873, 450811, 449650, 447414, 443714, 439605, 435783, 432313, 429420, 427274, 425442, 423389, 421038, 418340, 415053, 411360, 407825, 404531, 401276, 398609, 397274, 396704, 395791, 395159, 396534, 399616, 401886, 402135, 401719, 401538, 400446, 398038, 396503, 397770, 400622, 402450, 402382, 401201, 399657, 398352, 397969, 398205, 397716, 396188, 395133, 395698, 397255, 399051, 401360, 403849, 404862, 403917, 403256, 405263, 409680, 414656, 418988, 421994, 422900, 422024, 421299, 422176, 424122, 426133, 428158, 429972, 430467, 429498, 428837, 429897, 431965, 433896, 435974, 438890, 442557, 447147, 453516, 461284, 468281, 473152, 476756, 479970, 482270, 483790, 486346, 490718, 495199, 498549, 502064, 506753, 510978, 513291]
56278E13291K146M469O380O314O031O734P227O968P151P757P187N778N946P951
56264F01330R167Q686Q808J0644J1978J1033R197Q335Q330Q694R867J1642J2712
56251G30423J2754J2647J2287J0770Q834Q162Q257P233N574N467O398N547K987
56238H37340K158M419P181Q461R129R706R044P641Q154J1168J4109J5717J7681
56225I61908K0540K2099K1690K2100K5177K9038L1618L3653L6172L8365L9893
56214A282253M2393M6721N1256N4654N7733O1565O6118P1632P8688Q6408R3536
56203A992957J01339J11988J24115J34226J42749J53948J68936J83649J95110
56194C309017K04978K15152K24416K31546K37518K42347K43525K39588K31747
$$ y = [513291, 515437, 519906, 526286, 532600, 538631, 545365, 552592, 559560, 566711, 574468, 581655, 587433, 593379, 601330, 610497, 619183, 627991, 638635, 650613, 661646, 670843, 679178, 687508, 696202, 706069, 717711, 730423, 743177, 755824, 768111, 778881, 787715, 795877, 804134, 811367, 816941, 822408, 828806, 834353, 837340, 839498, 843917, 851098, 859559, 868688, 878394, 887438, 895079, 903233, 914401, 928510, 944227, 961908, 982448, 1004547, 1026237, 1048337, 1073514, 1102552, 1134170, 1167823, 1203995, 1242360, 1282253, 1324646, 1371367, 1422623, 1477277, 1535010, 1596575, 1662693, 1734325, 1813013, 1899421, 1992957, 2094296, 2206284, 2330399, 2464625, 2607374, 2761322, 2930258, 3113907, 3309017, 3513995, 3729147, 3953563, 4185109, 4422627, 4664974, 4908499, 5148087, 5379834]
56185E379834K20440K03952J81845J56141J27917R6807O4768L5787J0477j4353
56175F463615l9477o1382p8150r2026j04354j13226j18386j23175j29161j33849
56165E470429j36346j40104j47138j54515j59522j63599j68001j70495j69632
56156D061077j67753j66587j64303j59972j56304j54588j51554j44600j35882
56147B659534j27866j19391j09441j00347r3614q6883p8479p0760o5695o1379
56137A745679n6183n1821m9093m5371l9652l5294l4138l2858k8853k4780k3237
56126A324399k2007j8891j6278j6334j6306j3368r768q454p814n324k358r01M36
56113A187032K945M569M277N290R620J3853J4709J4277J5304J6031J4449J3021
$$ y = [5379834, 5600274, 5804226, 5986071, 6142212, 6270129, 6366936, 6431704, 6467491, 6477968, 6463615, 6424138, 6362756, 6284606, 6192580, 6088226, 5975000, 5856614, 5733439, 5604278, 5470429, 5334083, 5193979, 5046841, 4892326, 4732804, 4569205, 4401204, 4230709, 4061077, 3893324, 3726737, 3562434, 3402462, 3246158, 3091570, 2940016, 2795416, 2659534, 2531668, 2412277, 2302836, 2202489, 2108875, 2021992, 1943513, 1872753, 1807058, 1745679, 1689496, 1637675, 1588582, 1543211, 1503559, 1468265, 1434127, 1401269, 1372416, 1347636, 1324399, 1302392, 1283501, 1267223, 1250889, 1234583, 1221215, 1211447, 1202993, 1195179, 1189855, 1187497, 1186596, 1187032, 1189977, 1194546, 1198823, 1204113, 1213733, 1227586, 1242295, 1256572, 1271876, 1287907, 1302356, 1315377]
56101A315377J4310J6123J5742J4654J4651J3878J1247R999J2210J4691J4931
56090A467813J5883K0030K4245K5763K7573L2352L6804L8099M0269M7741N7696
56079A834268O5488P2629Q2845R4961J06351J18634J33432J47006J55376J59874
56069B970864J61797J57332J44620J29956J19727J11685J01486R1678Q5755P8978
56059D153878O4321M3148K1659J343j8692l4921m4290n1711o3713p8493r0672
56048C901857j01479j15079j28922j37119j39883j40671j37768j27943j14875
56039B758118j04775r6813q6550p5218o6840n9932n1072m2742l8842l6571l1721
56028B067042k7363k7863k9288k5807k0673k0119k1242j7246j0308p484p763n069
$$ y = [1315377, 1329687, 1345810, 1361552, 1376206, 1390857, 1404735, 1415982, 1425981, 1438191, 1452882, 1467813, 1483696, 1503726, 1527971, 1553734, 1581307, 1613659, 1650463, 1688562, 1728831, 1776572, 1834268, 1899756, 1972385, 2055230, 2150191, 2256542, 2375176, 2508608, 2655614, 2810990, 2970864, 3132661, 3289993, 3434613, 3564569, 3684296, 3795981, 3897467, 3989145, 4074900, 4153878, 4218199, 4261347, 4283006, 4284349, 4265657, 4230736, 4186446, 4134735, 4071022, 3992529, 3901857, 3800378, 3685299, 3556377, 3419258, 3279375, 3138704, 3000936, 2872993, 2758118, 2653343, 2556530, 2469980, 2394762, 2327922, 2267990, 2216918, 2174176, 2135334, 2098763, 2067042, 2039679, 2011816, 1982528, 1956721, 1936048, 1915929, 1894687, 1877441, 1867133, 1859649, 1851886, 1846817]
56016A846817n23L50o59K452Q003R747Q886J1214J5335J5786J4871J8940K5676
56003A976895K7611K5795K7424L2114L3192L0581L0032L1540L0670K9153L2074
55992B307081L6974L7671L5992L7706M0582L9124L7011M1135M7462M7113M2549
55981B750400M3006M7799M9479M9677N5675O4680O7790O6507O9093P3896P3249
55970C411251P0285P4287Q2571Q5087Q3846Q9154R9690J05445J07660J16151J29572
55959D454999J38278J43876J55419J69313J74624J75289J84525K00036K08315
55950F004674K10874K21251K38030K46944K48830K58843K78071K92790L02277
55941H302584L19780L45188L64513L77611L98129M25162M44259M57355M81273
$$ y = [1846817, 1846294, 1846644, 1845985, 1848437, 1856440, 1866187, 1875073, 1886287, 1901622, 1917408, 1932279, 1951219, 1976895, 2004506, 2030301, 2057725, 2089839, 2123031, 2153612, 2183644, 2215184, 2245854, 2275007, 2307081, 2344055, 2381726, 2417718, 2455424, 2496006, 2535130, 2572141, 2613276, 2660738, 2707851, 2750400, 2793406, 2841205, 2890684, 2940361, 2996036, 3060716, 3128506, 3195013, 3264106, 3338002, 3411251, 3481536, 3555823, 3638394, 3723481, 3807327, 3896481, 3996171, 4101616, 4209276, 4325427, 4454999, 4593277, 4737153, 4892572, 5061885, 5236509, 5411798, 5596323, 5796359, 6004674, 6215548, 6436799, 6674829, 6921773, 7170603, 7429446, 7707517, 8000307, 8302584, 8622364, 8967552, 9332065, 9709676, 10107805, 10532967, 10977226, 11434581, 11915854]
55932A1915854N15557N43436N65793O00996O49541O93548P33203P87277Q55050
55923A7860255R15725R68895J035949J117861J193264J262475J349591J456154
55915B7160169J559129J660318J788582J946381K105817K264340K448675K656234
55907D3589645K854322L048676L288641L592460L936697M332462M835492N464869
55899G4943264O195676P051069Q109153R396515J0877098J2568851J4550756J6827038
55891A60519420J9329165K2088815K5236094K8790272L2683929L6992323M1584410
55884C67224428M5077321M4544116L7227056K3048789N233740j1760239k4866788
55877D85728423l3269592l7548616l8683174l7683332l5455407l2611879k9461023
$$ y = [11915854, 12431411, 12974847, 13540640, 14141636, 14791177, 15484725, 16217928, 17005205, 17860255, 18775980, 19744875, 20780824, 21898685, 23091949, 24354424, 25704015, 27160169, 28719298, 30379616, 32168198, 34114579, 36220396, 38484736, 40933411, 43589645, 46443967, 49492643, 52781284, 56373744, 60310441, 64642903, 69478395, 74943264, 81138940, 88190009, 96299162, 105695677, 116572775, 129141626, 143692382, 160519420, 179848585, 201937400, 227173494, 255963766, 288647695, 325640018, 367224428, 412301749, 456845865, 494072921, 517121710, 522355450, 510595211, 485728423, 452458831, 414910215, 376227041, 338543709, 303088302, 270476423, 241015400]
55870B41015400k6221200k3125325k0313354j7785873j5522933j3549407j1859559
55863A12637749j0386557r087655p978237p054813o262588n565479m976444m493237
55855E6832739m070146l678358l334351l045022k780417k523532k295394k108298
55847C2997221j941134j781416j646701j544108j450551j352747j267617j204318
55839B0808629j143363j071614j002939r46462q87729q18685p54852p05973o59079
55830A2817933o06339n61044n30666n01591m65554m34892m17133l99943l75413
55821H525358l54372l42657l27454l01542k77931k66007k55237k36823k20342
55812E942993k14404k10556k00556j91168j88256j83887j72256j61788j59044
$$ y = [241015400, 214794200, 191668875, 171355521, 153569648, 138046715, 124497308, 112637749, 102251192, 93163537, 85185300, 78130487, 71867899, 66302420, 61325976, 56832739, 52762593, 49084235, 45749884, 42704862, 39924445, 37400913, 35105519, 32997221, 31056087, 29274671, 27627970, 26083862, 24633311, 23280564, 22012947, 20808629, 19665266, 18593652, 17590713, 16644251, 15756522, 14937837, 14182985, 13477012, 12817933, 12211594, 11650550, 11119884, 10618293, 10152739, 9717847, 9300714, 8900771, 8525358, 8170986, 7828329, 7500875, 7199333, 6921402, 6655395, 6400158, 6163335, 5942993, 5728589, 5518033, 5317477, 5126309, 4938053, 4754166, 4581910, 4420122, 4261078]
55803D261078j56726j49081j43161j43527j41569j31219j20313j15676j11689
55794C048117j03874r8930j00923j01749r5518q8721q6658q3579p5635o9634o9480
55783B073416o7549n9075n1657n1086n0828m5076l9144l7652l5180k8140k3323
55772A584706k5255k7305k4610k3347k7832l0843k6705k1909k2717k3858j9790
55761A310535j5853j7732k0491j8531j6329j8983k1802j9453j6189j7124j8318
55750A109730j5155j1666j2107j2097p456l013l255l106K331P520N975J773J581
55737A061055K902L81l558m375n080j0216j6274j7613j6295j7085j8299j6408
55725I39135j4133j5379j7348j5885j3499j4112j5036j1916o790l912k565r65
$$ y = [4261078, 4104352, 3955271, 3812110, 3668583, 3527014, 3395795, 3275482, 3159806, 3048117, 2944243, 2845313, 2744390, 2642641, 2547123, 2458402, 2371744, 2288165, 2212530, 2142896, 2073416, 2005867, 1946792, 1895135, 1844049, 1793221, 1748145, 1709001, 1671349, 1636169, 1608029, 1584706, 1559451, 1532146, 1507536, 1484189, 1456357, 1425514, 1398809, 1376900, 1354183, 1330325, 1310535, 1294682, 1276950, 1256459, 1237928, 1221599, 1202616, 1180814, 1161361, 1145172, 1128048, 1109730, 1094575, 1082909, 1070802, 1058705, 1051249, 1048236, 1044981, 1041875, 1044206, 1051726, 1057701, 1059474, 1061055, 1063957, 1064338, 1060780, 1056405, 1051325, 1041109, 1024835, 1007222, 990927, 973842, 955543, 939135, 925002, 909623, 892275, 876390, 862891, 848779, 833743, 821827, 815037, 811125, 808560, 807595]
55713H07595j856p219j2747j4388j4905j7564j9322j7041j4218j4533j4820j1715
55701F47267q944j0505j2736j0988q293r367j1605j0195o997o321o746m941l014
55688E36615m451p361q821j1039j6027j9498j7410j3447j2458j1973q030l857
55676D02243m231o311m798j566j420k726j257Q35j031m549m340j849k450n576
55662C60974o521n535o348p914o278k882k559m765m661j670M68Q36J424J651k47
55647C15973j914R9L641L937J657J342L531M970M932M924L921L06l206k948p30
55632C40435p63k391k166o85o60n70K665O763O924L779J752J371K37n57J783N189
55616C63106N382L432L503M726L103j07l1K780L112M60n44J087J428l67o26J462
$$ y = [807595, 805739, 798520, 785773, 771385, 756480, 738916, 719594, 702553, 688335, 673802, 658982, 647267, 638323, 627818, 615082, 604094, 595801, 586434, 574829, 564634, 557637, 551316, 544570, 539629, 536615, 532164, 524803, 515982, 504943, 488916, 469418, 452008, 438561, 426103, 414130, 406100, 402243, 398012, 391701, 386903, 385337, 383917, 381191, 379934, 380769, 379738, 375189, 370849, 369000, 366550, 360974, 354453, 348918, 342570, 334656, 328378, 325496, 322937, 318172, 313511, 311841, 312309, 313145, 314569, 316220, 315973, 314059, 314158, 317799, 321736, 323393, 324735, 328266, 333236, 338168, 343092, 347013, 347319, 344113, 341165, 340435, 339672, 337281, 335115, 334430, 333770, 333200, 335865, 342628, 349552, 353331, 355083, 356454, 356691, 356134, 357917, 363106, 368488, 371920, 375423, 380149, 383252, 383145, 383114, 385894, 389006, 389466, 388922, 390009, 391437, 391070, 390444, 391906]
55600C91906K402J302J191K467J943l39k20L050M903K947L46j89j81j167j906
55585D08455j774k428m306n636o007o875p963p559o753q559j2245j3558j1471
55572C13321r789j0805j2088j1187r193p928p198o360n592m603k851j364j575
55559B22788k566k394j591k037l282l575l510m645n575l797n95N72j85K12K045
55544A91865K624J427N24R3j590l731l483r70P95R82J355J775K38k490l232j689
55528A84493p05j123r22L71R97P51R40Q64r73k690j328J214L85l137m037j152
55512A73948R50K11K49L291O209O147M832M520M440L774L890N153N462L866J998
55497B28940M66k061m968n372l299k596m855o888o183m494l840l286k030j635
$$ y = [391906, 394308, 395610, 396801, 399268, 401211, 400872, 400652, 403702, 408605, 411552, 411898, 411709, 411528, 410361, 408455, 406681, 404253, 399947, 394311, 388304, 381429, 373466, 365907, 359154, 350595, 338350, 324792, 313321, 303532, 292727, 280639, 269452, 260259, 252331, 245133, 238773, 233181, 228578, 225727, 224363, 222788, 220222, 217828, 216237, 214200, 210918, 207343, 203833, 199188, 193613, 189816, 189221, 189793, 189608, 189820, 191865, 194489, 195916, 196440, 196533, 194943, 191212, 187729, 186759, 187554, 188536, 189891, 191666, 191904, 189414, 186182, 184493, 183788, 182665, 181743, 182114, 183111, 183862, 184802, 185666, 184693, 182003, 180675, 181889, 182274, 179137, 175100, 173948, 174898, 175109, 175358, 178649, 184858, 191005, 195837, 200357, 204797, 208571, 212461, 217614, 223076, 226942, 228940, 229406, 227345, 222377, 217005, 213706, 211110, 206255, 199367, 193184, 188690, 184850, 181564, 179534, 177899]
55483A77899k650k818j094J03r68k296j629R7J043J315J557J424J209K198L953
55468A79343M053J928jj53K97L37O55J159M62r64o60J537K608J036j211k620m294
55451A83512o707q079p637o923o523n176l389l756o106o713m339k615m037n881
55437A05631m989k647j513j280p23r06k967n279n830n215m697l630j408L99L01
55422F5247p35j318j756k279j595O03K064J055j042k119k181k061j634r62j019
55407E0268j689j375J55J018M96J85P73Q74K94Q95K588K397m96k670j879o38j486
55390D9710k541j293N11j84k431k899r77J217K416K781K233J001N09J365J945
55375E3363Q92o72j399j956k911k739m43J947K103P73p9m73j194j369K7J777K145
$$ y = [177899, 175249, 172431, 171337, 171440, 170472, 168176, 166547, 166644, 167687, 169002, 170559, 171983, 173192, 175390, 179343, 183396, 185324, 185323, 185170, 185467, 185804, 186459, 187618, 188080, 187116, 186456, 187993, 190601, 191637, 190426, 187806, 183512, 176805, 168726, 161089, 154166, 147643, 142467, 139078, 135322, 129216, 122503, 118164, 115549, 111512, 105631, 100642, 97995, 96482, 95202, 94479, 93573, 90606, 85327, 79497, 74282, 69585, 65955, 64547, 64946, 65247, 64512, 63194, 61438, 59159, 57564, 58167, 60231, 61286, 60244, 58125, 55944, 53883, 52249, 51287, 50268, 48579, 47204, 47359, 48377, 48873, 49058, 49831, 50705, 50999, 51894, 54482, 56879, 56383, 53713, 51834, 51196, 49710, 47169, 45876, 46387, 46203, 43772, 40873, 39896, 41113, 43529, 46310, 48543, 49544, 50053, 51418, 53363, 54255, 53583, 52184, 50228, 47317, 44578, 44135, 46082, 48185, 48958, 48879, 48406, 47212, 45843, 45870, 47647, 49792]
55358D9792J584J452J572J272J223J995K379J350J62L05J031R82O47J126J975
55343F8847K290K310K170R61j232k362j455m10p60j097QR44k89k545l421k823
55327F1136k000r29N34P76j267l533l411j440J68J126K300L017K209J007J135
55312F0828J779Q45j469l120l350k881j839l8J440J346K92k94k94j50O51K258
55296E6004L035J781m9n78m92j289k053r33J278K031Q63l91o77n82n29l36k37
55279E6846n44p92o62q09j332q88J003K447J874N01J9k24j373k333j721p57j147
55262E0108j753o18J100Q14r30j169P00K308K233J385O12j94n86J65J352J677
55246E7204J494J924K430J764O32O06J011r7k215k933k042j911l304m021k594
$$ y = [49792, 51376, 52828, 54400, 55672, 56895, 58890, 61269, 62619, 62781, 63086, 64117, 65099, 65746, 66872, 68847, 71137, 73447, 75617, 76578, 75346, 72984, 71529, 71119, 70359, 69262, 69270, 70214, 69925, 67380, 63959, 61136, 59136, 58207, 58741, 59517, 58250, 54717, 51306, 49866, 50034, 51160, 53460, 56477, 58686, 59693, 60828, 62607, 63452, 61983, 58863, 55513, 52632, 50793, 50755, 52195, 53541, 53833, 53539, 53245, 53095, 53746, 56004, 59039, 60820, 60771, 60193, 59701, 58412, 56359, 55426, 56704, 58735, 59598, 59207, 58530, 57948, 57419, 57083, 56846, 56302, 55510, 54848, 54039, 52707, 51819, 52822, 55269, 57143, 57644, 57663, 57439, 56066, 53733, 52012, 51255, 50108, 48355, 47737, 48837, 49651, 48721, 47552, 48252, 50560, 52793, 54178, 54790, 54596, 54010, 54175, 55527, 57204, 58698, 60622, 63052, 64816, 65448, 66054, 67065, 66968, 64753, 61820, 59778, 57867, 54563, 50542, 47948]
55231D7948o21k10j123j674j044K29J121R93K21r8K78K60o93j380q15Ql7j22Q33
55212D4074J728J087nN24K100K316P55p59j344j666j633l53J541K129J125K62
55196E1881M71R04R18R96J350J417R70J87j122k792l325j575J030K016J191L36
55180E4853O7o78k209l460l813l541k567p47Q99J199P94J055J620J292P89J859
55164D7412L929M461K844J201R83J268J027O64O14M53J60M21J212J664J543J294
55148G1150O36r84k591k383m15J346J792J542R71l65k112k931k547k065j831q36
55132E8377J185K787K692J364K26K21J245K076J251r70k224j066O62L25j609k424
55116F4118j275J57P27R54J125P14p5l64k84o44j158r08l09l43l91P14J954J215
$$ y = [47948, 47327, 47117, 45994, 44320, 43276, 43505, 44626, 45619, 45840, 45742, 46020, 46280, 45587, 44207, 43392, 43400, 43363, 43241, 44074, 45802, 46889, 46884, 47408, 49508, 51824, 52579, 51820, 50476, 48810, 47177, 46824, 48365, 50494, 51619, 51881, 52352, 53256, 54174, 55170, 56520, 57937, 58907, 59094, 57972, 55180, 51855, 50280, 51310, 53326, 54517, 54853, 54920, 54242, 52033, 48573, 44760, 41219, 38652, 37905, 38804, 40003, 40797, 41852, 43472, 44764, 45553, 47412, 51341, 55802, 58646, 59847, 60830, 62098, 63125, 63789, 64403, 64856, 65016, 65437, 66649, 68313, 69856, 71150, 71786, 70802, 68211, 65828, 65413, 66759, 68551, 70093, 71064, 70699, 68587, 65656, 63109, 61044, 59213, 58377, 59562, 62349, 65041, 66405, 66631, 66852, 68097, 70173, 71424, 70454, 68230, 67164, 67826, 68151, 66542, 64118, 62843, 63000, 63727, 64681, 65806, 66520, 66445, 66081, 65797, 65153, 63995, 63087, 62778, 62435, 62044, 62758, 64712, 65927]
55098F5927j109k546k387k116j967m99J979K976J734M31M72N03o04j698j674j304
55082E8118j315j058m85r76k684l371j594R51J983J618J189R08M23K50R71K136
55066E7064L195M240M826L701Q96j476j947j621j980k292j098R24J690Q21J04
55051F7047R16K517L206K314O64n06p45m03K67J311K272K181J072M27J087J828
55035H5455J264Mo93j128k061k495j030J386K592K438K296K091Q21n11J41K065
55019I2635K387P45j04J042K157J819J285J399Q29r86k153j502o20q58r07N78
55003I7746K324K546J691J002K81r11j584r56j78n02j080m39R83J501L47j964
54987A00807m285m913k646J120L032J734m72j035l19J21L52J190K142K210J597
$$ y = [65927, 64818, 62272, 59885, 57769, 55802, 55303, 57282, 60258, 61992, 62423, 62895, 63398, 62794, 61096, 59422, 58118, 56803, 55745, 55260, 54284, 51600, 48229, 46635, 47586, 49569, 51187, 52376, 53284, 53707, 53957, 54928, 57064, 60259, 64499, 69325, 73026, 73922, 72446, 70499, 68878, 66898, 64606, 63508, 64432, 66122, 66943, 67047, 67963, 70480, 73686, 76000, 76664, 76158, 75413, 75010, 75277, 76588, 78860, 81041, 82113, 82540, 83627, 85455, 86719, 86723, 86030, 84902, 82841, 80346, 79316, 80702, 83294, 85732, 88028, 90119, 90940, 90429, 90570, 92635, 95022, 95767, 95663, 96705, 98862, 100681, 101966, 103365, 104194, 103208, 101055, 99553, 98933, 98075, 97168, 97746, 100070, 102616, 104307, 105309, 105590, 104679, 103095, 102139, 101961, 101459, 100379, 99940, 100923, 102424, 102771, 100807, 96522, 91609, 88963, 90083, 93115, 94849, 94377, 93342, 93023, 93144, 93496, 94686, 96828, 99038, 100635]
54972A00635J022L80m96r65o97n12r49j365j431j774k172j139J286K584J401N
54956I5813R50L173L860K589J063l3j133j690p50P27N74j432l128k826j069N10
54940I7198Q56J10n41J07J648K151O49j336j807q40R7M46P96J395J731J351K51
54923A04262j071j634q88J20k59j617j623M23K173J611o8o42p5M29J038K593M240
54906A09012M270K854J909K403L527M382M881N003M554L847L657M346N650P160
54892A67455Q600R932J1395J2987J4003J3993J3982J5352J7621J8953J8850J8139
54880C41262J6242J1268L757k545n290o431q831j2302j4971j6282j6488j5231
54868B74158j3006j2047j3230j3834j1199o915m531m504m435l362k537k536k468
$$ y = [100635, 101657, 102037, 101541, 100576, 99879, 99367, 98418, 97053, 95622, 93848, 91676, 90537, 91823, 94407, 95808, 95813, 96763, 99936, 103796, 106385, 107448, 107415, 106282, 104592, 103842, 104569, 105143, 103711, 100583, 97757, 96688, 97198, 98054, 98164, 97623, 97730, 99378, 101529, 102178, 100842, 99035, 98195, 98292, 98738, 99534, 100929, 102660, 104011, 104262, 103191, 101557, 100669, 100789, 100530, 98913, 97290, 97713, 99886, 101497, 101429, 100787, 100712, 101141, 102179, 104772, 109012, 113282, 116136, 118045, 120448, 123975, 128357, 133238, 138241, 142795, 146642, 150299, 154645, 160295, 167455, 176055, 185987, 197382, 210369, 224372, 238365, 252347, 267699, 285320, 304273, 323123, 341262, 357504, 368772, 372529, 369984, 364694, 358263, 349432, 337130, 322159, 305877, 289389, 274158, 261152, 249105, 235875, 222041, 210842, 203927, 199396, 194892, 190457, 187095, 184558, 182022, 179554]
54855A79554j928j160L72L166N772O260N357N677P851R891J0456J0467J1069J2198
54841B65002J3605J5455J7271J7727J6014J2397P372J378m648r609j3017j4786
54829C24161j4889j4147j4370j6239j7882j7058j4078j1024q913p409o569o838
54817A74745p672p936p425o534n005k642o12k76j230k132k828l849m628m210l102
54802A14664k382j641K7J588J170p18j600p15R9n29j754k251j754m97J122J971
54786A06800R64j310l093l586l132j716P73K905K608N5k151k233j034k11k16n89
54770I4834r09r06n52j91L9N66J354J374L79J35K032M451M692K842J379J382J667
54753A14568J544J711K213K048J298J427K947M683N756O344O356N315L949L772
$$ y = [179554, 177626, 176466, 176838, 180004, 185776, 192036, 197393, 203070, 210921, 220812, 231268, 241735, 252804, 265002, 278607, 294062, 311333, 329060, 345074, 357471, 364843, 366221, 361573, 351964, 338947, 324161, 309272, 295125, 280755, 264516, 246634, 229576, 215498, 204474, 195561, 188152, 181583, 174745, 167073, 159137, 151712, 145178, 140173, 137531, 136919, 136643, 135413, 133281, 130453, 126604, 121976, 117766, 114664, 112282, 110641, 110668, 112256, 113426, 112708, 111108, 110393, 110492, 109963, 108209, 105958, 104204, 103707, 104829, 106800, 107764, 106454, 103361, 99775, 96643, 94927, 95700, 98605, 101213, 101268, 99117, 96884, 95850, 95639, 95423, 94834, 93925, 93019, 92467, 92276, 92315, 92881, 94235, 95609, 95988, 96123, 98155, 102606, 107298, 110140, 111519, 112901, 114568, 116112, 117823, 120036, 122084, 123382, 124809, 127756, 132439, 138195, 144539, 150895, 156210, 160159, 163931]
54739A63931M843N852O621Q289J0835J2767J3692J4797J6237J6576J5559J4986
54727C04985J5742J6254J4902J1973Q203L529j488n198p095q738j1220j3551j4579
54714C13719j4595j3928j1980r095p232p158o950n042k988l058m717n666n141
54701B16169l920k040J065M598O817P314P259P418P548P663Q461J0188J2125J3497
54687C04162J4204J4695J5538J6823J7559J6181J2215P009K243j668n136q230
54675D05595j0762j3006j5236j6884j7052j5777j4155j3230j3154j3270j2633
54664B50436j0721q000n725m987o017q162j0045j0052p602m091j813j661k513
54651A69047k910k585k131j992k168k352k158j646j516k108k473j438N09J590
$$ y = [163931, 168774, 174626, 181247, 189536, 200371, 213138, 226830, 241627, 257864, 274440, 289999, 304985, 320727, 336981, 351883, 363856, 372059, 375588, 374100, 368902, 361807, 353069, 341849, 328298, 313719, 299124, 285196, 273216, 264121, 256889, 249731, 242781, 237739, 234751, 231693, 226976, 221310, 216169, 212249, 210209, 211274, 215872, 222689, 230003, 237262, 244680, 252228, 259891, 268352, 278540, 290665, 304162, 318366, 333061, 348599, 365422, 382981, 399162, 411377, 418386, 420629, 418961, 413825, 405595, 394833, 381827, 366591, 349707, 332655, 316878, 302723, 289493, 276339, 263069, 250436, 239715, 231715, 225990, 221003, 214986, 206824, 196779, 186727, 179125, 175034, 173221, 171560, 169047, 166137, 163552, 161421, 159429, 157261, 154909, 152751, 151105, 149589, 147481, 145008, 143570, 144079, 145669]
54637A45669J034j07o41n97n60p26j031j354j315o33K36O71J020K034L234L219
54621A50153J778L08k03j26K31J418L375M573L636J064j409k484j863m5J825K725
54605A64956K847L239M134M559L917K886K360K498L140M075M528L564J559K16
54591B08478N19J626K238K103J656J158P64N99M36M9Q5J465L711N137N006M409
54575B39439M491N074N415N223M590L971M384O225P807O697K931q20k774l876
54561B88777n461p089p821p968q131p923o965n968n577n203m227l294l159l212
54547B06779k429j062k91o58j705k519k238p92L95l27k494l783l103j780j037
54532A82956k59J032J505P6j920k634k574l543n469o368n167k898j193q86j852
$$ y = [145669, 146703, 146596, 145955, 145358, 144798, 144072, 143041, 141687, 140372, 139739, 139975, 140646, 141666, 143700, 146934, 150153, 151931, 152239, 152036, 151910, 152141, 153559, 156934, 161507, 165143, 166207, 164798, 162314, 160451, 160406, 162231, 164956, 167803, 171042, 175176, 179735, 183652, 186538, 188898, 191396, 194536, 198611, 203139, 206703, 208262, 208478, 208997, 210623, 212861, 214964, 216620, 217778, 218542, 219141, 219577, 219626, 219711, 221176, 224887, 230024, 235030, 239439, 243930, 249004, 254419, 259642, 264232, 268203, 272587, 278812, 286619, 293316, 296247, 295427, 292653, 288777, 283316, 276227, 268406, 260438, 252307, 244384, 237419, 231451, 225874, 220671, 216444, 213150, 209991, 206779, 204350, 203288, 202997, 202339, 200634, 198115, 195877, 195085, 195480, 195153, 192659, 188876, 185773, 183993, 182956, 182697, 183729, 185234, 185310, 183390, 180756, 178182, 174639, 169170, 162802, 157635, 154737, 153544, 152658, 150806]
54517A50806l177l665l067k459k774l534l676k847j196R64K500J715j452m520
54503A23618n112l637k101j321p86l65l23k09O75J804J930R20n4p4P29J700K158
54486A19552J677O26K0K54O08N89P99J726K657K767K286J576K25j720k695j390
54470A29557J216L083L584L418K867J808Q83J055K240L682N054N977N277K422
54456A72123r02k398j991j448j580j673j468j729k642l276l026k328j718j355
54442A44589j490k246k800k060k63J032P29r01k962m533m703l177q66J002K253
54427A23604L310L874L279J953J057P20m2j508k625k513j427m4J187J779J369
54412A33973M90K05O64Q49O0j066j381n02R49J897J596L47o67o98k64j40rQ31
$$ y = [150806, 147629, 143964, 140897, 138438, 135664, 132130, 128454, 125607, 124411, 125375, 127875, 129590, 128138, 123618, 118506, 114869, 112768, 111447, 110661, 110296, 109973, 109764, 110439, 112243, 114173, 115093, 115039, 114965, 115694, 117394, 119552, 121229, 121855, 121875, 122129, 122737, 123326, 124125, 125851, 128508, 131275, 133561, 135137, 135362, 133642, 130947, 129557, 130773, 133856, 137440, 140858, 143725, 145533, 146416, 147471, 149711, 153393, 158447, 164424, 169701, 172123, 171221, 168823, 166832, 165384, 163804, 162131, 160663, 158934, 156292, 153016, 149990, 147662, 145944, 144589, 143099, 140853, 138053, 135993, 135730, 136762, 137491, 136590, 133628, 129095, 124392, 121215, 120349, 121351, 123604, 126914, 130788, 134067, 136020, 137077, 137797, 137755, 136247, 133622, 131109, 129682, 129638, 130825, 132604, 133973, 134463, 134668, 135332, 136181, 136241, 135175, 133794, 133292, 134241, 136138, 137734, 138081, 137414, 136716, 136452, 136312, 136303, 137134]
54394A37134J831J562k04j948k352j796j502j859k257k129j541p80J11J119J735
54379A27124J250j60j192r79l73o25j320j049M4K83o85j091Q0J384J258K55m31
54362A23773r37j576j359L36J992J973J178J483K577K795K262K559L611L570J894
54347A46131J51n60p97r47l33J205K622L227L419L412K741J544R21J471K617L822
54331A70646N147O338O683O216N854N943N765M836L514K045K55j496k246j811
54317B17689j187j259j961k915l868m309l819k956k780l286l437k876k417k614
54303A78005k999l072k931k637j984j161o74m31M0M37o4j290k037j817j306p89
54287A55290M43K594M445M654L228J233j70r3J704M329O194O369N154L506K369
$$ y = [137134, 138965, 140527, 140323, 138375, 136023, 134227, 132725, 130866, 128609, 126480, 124939, 124159, 124270, 125389, 127124, 128374, 128214, 127022, 126043, 125670, 125045, 123725, 122676, 122720, 123003, 122318, 121227, 121307, 122691, 123949, 124204, 123773, 122836, 121260, 119901, 120237, 122229, 124202, 125380, 126863, 129440, 132235, 134497, 137056, 140667, 144237, 146131, 146282, 145722, 144925, 143978, 143645, 144850, 147472, 150699, 154118, 157530, 160271, 161815, 162736, 164207, 166824, 170646, 175793, 182131, 188814, 195030, 200884, 206827, 212592, 217428, 220942, 222987, 223242, 221746, 219500, 217689, 216502, 215243, 213282, 210367, 206499, 202190, 198371, 195415, 192635, 189349, 185912, 183036, 180619, 178005, 175006, 171934, 169003, 166366, 164382, 163221, 162547, 162116, 162156, 162593, 162529, 161239, 159202, 157385, 156079, 155290, 155733, 158327, 162772, 167426, 170654, 171887, 171717, 171624, 173328, 177657, 183851, 190220, 195374, 198880, 201249]
54272B01249K161K123P91j835l397j953J023K311J192j81m84q13k148l657m524
54257A91858n309o367o726n910n140n283n044l014m46r1k545n344n778l650j108
54242A30103l59j753l765m768m540l813k852j379L59J470J376K21j563l259l792
54227A01686k787j401q99q22P5J506K094J722J489J378K82j406j651N0J643J586
54211A04545Q64Q67J290J483J895K624K291J15k234k596j140K73O42K92k55n58
54195A10398j61N96N69l92o88P57K654L092K051P41n89k345l880l853k132J1J468
54178A08297J951J539P72O87J652K483J861K50p87q28q28j310j604j057k1O73
54162A13730O01p9q55j163p77J10J081J541P93j236l350m042l202j921p06Q07
$$ y = [201249, 203410, 205533, 206324, 204489, 201092, 199139, 200162, 202473, 203665, 203484, 203000, 202187, 200039, 196382, 191858, 186549, 180182, 173456, 167546, 162406, 157123, 152079, 149065, 148619, 148528, 145983, 140639, 134861, 131211, 130103, 129744, 127991, 124226, 119458, 114918, 111105, 108253, 106874, 107233, 108703, 110079, 110300, 108737, 105478, 101686, 98899, 97498, 96599, 95777, 95852, 97358, 99452, 101174, 102663, 104041, 104323, 102917, 101266, 101316, 102959, 104545, 105409, 106276, 107566, 109049, 110944, 113568, 115859, 115974, 113740, 111144, 110004, 110277, 110919, 111211, 110956, 110398, 110237, 110833, 111402, 111010, 110322, 111079, 113733, 116825, 118876, 119617, 119028, 116683, 112803, 108950, 106818, 106829, 108297, 110248, 111787, 112559, 113246, 114898, 117381, 119242, 119492, 118705, 117877, 117049, 115739, 114135, 113078, 113057, 113730, 114331, 114252, 113397, 112234, 111457, 111567, 112648, 114189, 114982, 113746, 110396, 106354, 103152, 101231, 100525, 101332]
54146A01332K204K120M23j020p86K82P10N12M74O29P80J371K489L033K349J520
54130A18422J542J360l77k625l142j817o12m11k04M97N83o03j823j531R0J547
54114A10896J825J146L73Nk71r90j876j860o29O05O08j51k25P52J771J955J481
54097A15415J012R44J160J065J05j346k180k009j721k026k381k085j434q01L28
54082A04046K047K831J336j143j928m91J030Q75l39r76m01P43J301L94j721l445
54066A04159l313j614J65J244J849J980J234p7r49j066j082j321j266o73r5J8
54050I9193n6O0L84R55J847K559K205P33p85j426j385j312j246o73O25K086K669
54033A06433J781J16p17N1J355J610P19j04j94q7k75m52k67N1K92P03J364J743
$$ y = [101332, 103536, 105656, 106079, 105059, 104273, 104555, 105265, 105777, 106251, 106880, 107660, 109031, 111520, 114553, 116902, 118422, 119964, 121324, 120947, 118322, 115180, 113363, 112751, 112340, 112136, 112633, 113216, 112613, 110790, 109259, 109349, 110896, 112721, 113867, 114240, 114245, 113974, 112984, 111108, 109248, 108619, 109224, 109832, 109681, 109456, 110208, 111979, 113934, 115415, 116427, 117371, 118531, 119596, 119701, 118355, 116175, 114166, 112445, 110419, 108038, 105953, 104519, 103718, 104046, 106093, 108924, 110260, 109117, 107189, 106698, 107728, 108603, 108264, 107288, 106887, 107630, 108931, 109325, 107604, 104159, 100846, 99232, 99397, 100641, 102490, 104470, 105704, 105627, 104678, 103612, 102530, 101209, 99943, 99270, 99175, 99193, 99137, 99197, 99581, 100536, 102383, 104942, 107147, 107880, 107095, 105669, 104284, 102972, 101726, 101053, 101678, 103764, 106433, 108214, 108330, 107613, 107664, 109019, 110629, 111348, 111244, 111050, 110963, 110688, 110236, 109969, 110020, 110312, 111015, 112379, 114122]
54015A14122J447Q64M78n0j332k933l435k123j0J328J572J574J722J401L89l64
53999A14650r3N82Q33J136K148K998K480J491J993L626L885K110O73J096J626
53984A41234L43j520j627j13J180J808K713M029N150O265P698Q371P110M992M208
53969A91841M898N324M930N014O302P893Q888R189Q523O564M247L200L553L845
53955B74211L260K400J838J592K083L684N174M702K606J240J474J536O0j852k762
53940C01246l110l924m836m956m503m123l533k226q41o14j769l337m315m440m174
53925B50545m253m883n297m763l767l283l019j819J72J317Q45j68o45q61j315
53910B18806j748k105k892l750l151o75J810K442J648Q98L90n33j528j422J61
$$ y = [114122, 115569, 116433, 116911, 116861, 115529, 112596, 109161, 107038, 107028, 108356, 109928, 111502, 113224, 114625, 115014, 114650, 114557, 115139, 115972, 117108, 119256, 122254, 124734, 126225, 128218, 131844, 135729, 137839, 138512, 139608, 141234, 141577, 140057, 138430, 138317, 139497, 141305, 144018, 148047, 153197, 159462, 167160, 175531, 182641, 187633, 191841, 196739, 202063, 206993, 212007, 218309, 226202, 235090, 244279, 252802, 259366, 263613, 266813, 270366, 274211, 277471, 279871, 281709, 283301, 285384, 289068, 294242, 298944, 301550, 302790, 304264, 305800, 305860, 304008, 301246, 298136, 294212, 289376, 284420, 279917, 275794, 272261, 270035, 269194, 268580, 266811, 263474, 259159, 254719, 250545, 246292, 241409, 236112, 231349, 227582, 224299, 221280, 219461, 219633, 220950, 221795, 221627, 220982, 220121, 218806, 217058, 214953, 212061, 208311, 205160, 204485, 206295, 208737, 210385, 211283, 211673, 211140, 209612, 208190, 208351]
53895B08351K474M474N180L940J403m88n74J41J90n6P77K644M035M263M326N247
53879B46327O717P720P786P261O819O836P045O831O101N552N796O533O986O782
53865C41092O119N278M339L174J578k82j591j606o20M30J140J680J783R78m0L19
53849C63771K412M719N896O271O693P233P772Q565R290Q716O382L528J473J16
53835D42837r24j181o24o83k343m394n210n307o146p427p703p126p274q429r212
53820C68854r032q756q769q366p576p682r053j0129r495p749o372n763n329m717
53806B60066m157m039m601n489n600m204k411k403m768p555q489p252n048k971
53792A91079j494q41r28j288j582j906k273k391k190j986j825j429j028j395k449
$$ y = [208351, 210825, 215299, 220479, 224419, 225822, 225334, 224760, 224901, 225091, 225035, 225812, 228456, 232491, 236754, 241080, 246327, 253044, 260764, 268550, 275811, 282630, 289466, 296511, 303342, 309443, 314995, 320791, 327324, 334310, 341092, 347211, 352489, 356828, 360002, 361580, 361298, 359707, 358101, 357481, 357911, 359051, 360731, 362514, 363492, 363452, 363771, 366183, 370902, 376798, 383069, 389762, 396995, 404767, 413332, 422622, 431338, 437720, 441248, 442721, 442837, 441913, 440732, 440108, 439425, 437082, 432688, 427478, 422171, 416025, 408598, 400895, 393769, 386495, 378066, 368854, 359822, 351066, 342297, 333931, 326355, 318673, 309620, 299491, 289996, 282247, 275875, 270112, 264783, 260066, 255909, 251870, 247269, 241780, 236180, 231976, 229565, 227162, 222394, 214839, 206350, 199098, 194050, 191079, 189585, 188744, 187816, 186528, 184946, 183040, 180767, 178376, 176186, 174200, 172375, 170946, 169918, 168523, 166074]
53777A66074k790j515K15N48n54j264l39J358K091J321N6n81o18q33j350j273
53761A60546m8J410J793J313J442K658L557K797J027Q9Q32K365L184K609J460
53746A87034J445L197M918M101J070p44R87M376N994N375M749N053M907L794L582
53731B39838N715Q740J0029Q821O264L569J419M90J058K389L434L781L244J303
53717C00094j839m331m210j761Q31J995J823R08m86j891k636k683k618k577k204
53702B78415j752k051l063l614l057k129j657j381q65o42j505l166m476m632l745
53687B40680k507j619j178n79N07J316J055N19J184K594K567N00j444j460m92
53672B41643j55j57M08Q82K98m62j17N22n4j023l36J709K882K781L064L809K921
$$ y = [166074, 163284, 161769, 161984, 162532, 161978, 160714, 160375, 161733, 163824, 165145, 165201, 164620, 164002, 163169, 161819, 160546, 160498, 161908, 163701, 165014, 166456, 169114, 172671, 175468, 176495, 176584, 177416, 179781, 182965, 185574, 187034, 188479, 191676, 196594, 200695, 201765, 201021, 202008, 206384, 212378, 217753, 222502, 227555, 232462, 236256, 239838, 245553, 254293, 264322, 273143, 279407, 282976, 284395, 284885, 285943, 288332, 291766, 295547, 298791, 300094, 298255, 293924, 289714, 287953, 288784, 290779, 292602, 293510, 293024, 291133, 288497, 285814, 283196, 280619, 278415, 276663, 274612, 271549, 267935, 264878, 262749, 261092, 259711, 258846, 258204, 256699, 253533, 249057, 244425, 240680, 238173, 236554, 235376, 234797, 235304, 236620, 237675, 238194, 239378, 241972, 244539, 245039, 243595, 242135, 241643, 241488, 241331, 241739, 242621, 242919, 242457, 242340, 242862, 242808, 241785, 241449, 243158, 246040, 248821, 251885, 255694, 258615]
53655B58615M2k069j503J57P46O62J126J569R76J54K90O08j92j297r57M38R69
53638B60334M65O56K102L261L122K611K688K810K277J724K152L356M292M435L998
53623C00283L284K606K568L664N517O926O878N481L816K831K475K079J391P47
53609C50546K65l14p30l9J984L921M176K832J216Q5o94r86l28Q11J018l17k165
53592C61281l248l442l157k228l68J707K694K178R81n8r18j783k291j923q21L09
53576C48913R57J098Q01J32n41n88J95J241J810J694J232R26J110J648J839J152
53560C63619J94K30J454K594K833L122M589O454O961N878M628M179M208M348M741
53545D20032N186N122M723M713M945M608L988M395N892O911O818O921P942Q400
$$ y = [258615, 258657, 256588, 255085, 255242, 255988, 256650, 257776, 259345, 260321, 260475, 260765, 261373, 261181, 259884, 258927, 259365, 260334, 260799, 261455, 263557, 266818, 269940, 272551, 275239, 278049, 280326, 282050, 284202, 287558, 291850, 296285, 300283, 303567, 306173, 308741, 312405, 317922, 324848, 331726, 337207, 341023, 343854, 346329, 348408, 349799, 350546, 350811, 350497, 349767, 349728, 351712, 355633, 359809, 362641, 363857, 363942, 363248, 362262, 361934, 362745, 363763, 363446, 361281, 358033, 354591, 351434, 349206, 348838, 350545, 353239, 355417, 356398, 356340, 355422, 353639, 351348, 349425, 348604, 348913, 349870, 350968, 351769, 351901, 351360, 350772, 350967, 352208, 354018, 355712, 356944, 357870, 358980, 360628, 362467, 363619, 363813, 364043, 365497, 368091, 370924, 374046, 378635, 385089, 392050, 397928, 402556, 406735, 410943, 415291, 420032, 425218, 430340, 435063, 439776, 444721, 449329, 453317, 457712, 463604, 470515, 477333, 484254, 492196, 500596]
53531E00596P116N579N890P538Q360P832P260P251P089O522O166N939M897L040
53517E91075J746J873K672L121L269L625M086M165L718K979K238J754J721K134
53503F30176K860L714M348M415M131M026L854K656O49j11J676M265M924L685L014
53488F78282L961M910M612M125M636N262M600L195K778L716M816N276N408N576
53474G41153N659N752O362P494Q287P967O861O169O832Q735J0829J1965J1810
53461H45875J1021J0579J0944J1823J2711J3593J5096J7659K0522K2047K1518
53450A013388K0331K0449K1861K2583K1581K0509K1603K4554K6764K6675K5634
53439A265932K6021K8432L1394L3259L3563L2825L2028L2339L4456L7582L9681
$$ y = [500596, 507712, 513291, 519181, 526719, 535079, 542911, 550171, 557422, 564511, 571033, 577199, 583138, 588035, 591075, 592821, 594694, 597366, 600487, 603756, 607381, 611467, 615632, 619350, 622329, 624567, 626321, 628042, 630176, 633036, 636750, 641098, 645513, 649644, 653670, 657524, 660180, 660829, 660718, 662394, 666659, 671583, 675268, 678282, 682243, 687153, 691765, 695890, 700526, 705788, 710388, 713583, 716361, 720077, 724893, 730169, 735577, 741153, 746812, 752564, 758926, 766420, 774707, 782674, 789535, 795704, 802536, 811271, 822100, 834065, 845875, 856896, 867475, 878419, 890242, 902953, 916546, 931642, 949301, 969823, 991870, 1013388, 1033719, 1054168, 1076029, 1098612, 1120193, 1140702, 1162305, 1186859, 1213623, 1240298, 1265932, 1291953, 1320385, 1351779, 1385038, 1418601, 1451426, 1483454, 1515793, 1550249, 1587831, 1627512]
53428A627512L9376L7375L5521L4706L4335L3613L2523L1538L1047L1395L2723
53417B001664L4365L4886L3362L0551K8418K8413L0241L2177L2520L0933K8498
53406B346028K6436K5064K4039K3138K2239K0989J9085J6714J4068J0792O763
53395B555355K965M86j126l179n688p487q576j0572j4134j7534j8878j8455j7921
53382B435256j8281j9681k2030k4617k6019k5597k4424k3795k3752k3965k4932
53371B178163k6916k8707k8984k8126k7324k6616k5307k3636k2307k0933j8541
53360A900766j5308j2252r695p510o307o517o788n308k550n52L94K018M903P352
53346A842646Q249Q844J0702J3613J6656J9731K2831K5235K6673K8185L0549L2910
$$ y = [1627512, 1666888, 1704263, 1739784, 1774490, 1808825, 1842438, 1874961, 1906499, 1937546, 1968941, 2001664, 2036029, 2070915, 2104277, 2134828, 2163246, 2191659, 2221900, 2254077, 2286597, 2317530, 2346028, 2372464, 2397528, 2421567, 2444705, 2466944, 2487933, 2507018, 2523732, 2537800, 2548592, 2555355, 2558320, 2558806, 2557680, 2554501, 2548813, 2541326, 2532750, 2522178, 2508044, 2490510, 2471632, 2453177, 2435256, 2416975, 2397294, 2375264, 2350647, 2324628, 2299031, 2274607, 2250812, 2227060, 2203095, 2178163, 2151247, 2122540, 2093556, 2065430, 2038106, 2011490, 1986183, 1962547, 1940240, 1919307, 1900766, 1885458, 1873206, 1863511, 1856001, 1849694, 1843177, 1836389, 1831081, 1828531, 1827979, 1828373, 1830391, 1835294, 1842646, 1850895, 1859739, 1870441, 1884054, 1900710, 1920441, 1943272, 1968507, 1995180, 2023365, 2053914, 2086824]
53334B086824L4196L5010L6696L9252M1658M3907M7166N1778N6305N9141O0338
53323B592271O1283O2841O4523O5622O6510O8103P0161P1124P0162O8438O7646
53312C328684O7897O7973O7060O5272O3038O1016N9985N9521N7460N2205M5149
53301C995260L9060L4500K9781K4288J9489J6155J2839Q051K086m311j1343j8954
53289D146901k5679l0138l2781l5054l7659m0464m3240m5665m7436m9024n1247
53278C708514n3585n4305n3065n1909n2527n3920n4089n2886n1749n1513n1928
53267C127038n2554n2814n1851m9649m7594m6711m6108m4456m2144m0483l9464
53256B613210l7935l5539l2967l0682k8812k7861k8004k8053k6765k4848k4035
$$ y = [2086824, 2121020, 2156030, 2192726, 2231978, 2273636, 2317543, 2364709, 2416487, 2472792, 2531933, 2592271, 2653554, 2716395, 2780918, 2846540, 2913050, 2981153, 3051314, 3122438, 3192600, 3261038, 3328684, 3396581, 3464554, 3531614, 3596886, 3659924, 3720940, 3780925, 3840446, 3897906, 3950111, 3995260, 4034320, 4068820, 4098601, 4122889, 4142378, 4158533, 4171372, 4179423, 4181509, 4177198, 4165855, 4146901, 4121222, 4091084, 4058303, 4023249, 3985590, 3945126, 3901886, 3856221, 3808785, 3759761, 3708514, 3654929, 3600624, 3547559, 3495650, 3443123, 3389203, 3335114, 3282228, 3230479, 3178966, 3127038, 3074484, 3021670, 2969819, 2920170, 2872576, 2825865, 2779757, 2735301, 2693157, 2652674, 2613210, 2575275, 2539736, 2506769, 2476087, 2447275, 2419414, 2391410, 2363357, 2336592, 2311744, 2287709]
53245B287709k4381k4272k3001k1402j9801j7389j4220j1820j0902j0063p810
53234B102648m552j491J163L621N282N604N575O785R401J2224J4572J6798J9030
53221B196660K0717K1725K2846K4768K7232K9653L1795L3384L3670L2161K9490
53210B504101K6975K5448K4824K4568K3949K2165J8961J5256J2355J0372Q041
53199B717015M583J017r69j145r93j990m217o750q958j1046j3517j6269j8469
53186B638292j9488j9734k0219k1381k2850k4337k5919k7416k8328k8795k9581
53175B370244l0634l0756k9418k7877k7498k7994k8406k8712k9212k9227k8235
53164B052275k7334k7685k8142k6657k3747k2099k2711k3747k3689k3110k2662
$$ y = [2287709, 2263328, 2239056, 2216055, 2194653, 2174852, 2157463, 2143243, 2131423, 2120521, 2110458, 2102648, 2098096, 2096605, 2097768, 2101389, 2106671, 2112275, 2117850, 2124635, 2134036, 2146260, 2160832, 2177630, 2196660, 2217377, 2239102, 2261948, 2286716, 2313948, 2343601, 2375396, 2408780, 2442450, 2474611, 2504101, 2531076, 2556524, 2581348, 2605916, 2629865, 2652030, 2670991, 2686247, 2698602, 2708974, 2717015, 2721598, 2722615, 2721646, 2720501, 2719508, 2717518, 2713301, 2706551, 2697593, 2686547, 2673030, 2656761, 2638292, 2618804, 2599070, 2578851, 2557470, 2534620, 2510283, 2484364, 2456948, 2428620, 2399825, 2370244, 2339610, 2308854, 2279436, 2251559, 2224061, 2196067, 2167661, 2138949, 2109737, 2080510, 2052275, 2024941, 1997256, 1969114, 1942457, 1918710, 1896611, 1873900, 1850153, 1826464, 1803354, 1780692]
53153A780692k1576j9444j7566j7185j7952j9089k0582k2116k2530k1680k1311
53142A559661k2725k4892k6220k6704k6916k6288k4278k1974k0764k0332j9742
53131A298826j9530k0739k2638k3477k3047k2648k2783k2795k2537k2529k2418
53120A053685k1147j8933j7520j8012j9627k0941k1275k0657j9435j8230j7517
53109H40391j7074j6476j5848j5393j4576j2830j0885j0158j0821j1504j1053
53098F93773r762q836r258j0966j2521j2039r329o640o337q269j0343j1036j0234
53085E68203q416o476n790o778p750o837m750l882m940o321o777o568n957m688
53071D82273l475l861n730o829n670l253j172J49L96j303m316n713l574O8J744
$$ y = [1780692, 1759116, 1739672, 1722106, 1704921, 1686969, 1667880, 1647298, 1625182, 1602652, 1580972, 1559661, 1536936, 1512044, 1485824, 1459120, 1432204, 1405916, 1381638, 1359664, 1338900, 1318568, 1298826, 1279296, 1258557, 1235919, 1212442, 1189395, 1166747, 1143964, 1121169, 1098632, 1076103, 1053685, 1032538, 1013605, 996085, 978073, 958446, 937505, 916230, 895573, 876138, 857908, 840391, 823317, 806841, 790993, 775600, 761024, 748194, 737309, 727151, 716330, 704826, 693773, 684011, 675175, 665917, 654951, 642430, 630391, 621062, 614422, 608085, 599816, 589473, 578437, 568203, 559787, 553311, 547521, 540743, 532993, 526156, 521406, 517524, 512584, 506263, 499486, 492918, 486961, 482273, 478798, 474937, 469207, 462378, 456708, 453455, 452283, 452432, 452828, 451525, 447209, 441496, 437922, 437990, 439734]
53056D39734J072N40J287J657K48j867k874k606k027j460n59M79R33O88M07M08
53040D36060J08j011k458l282l274l034l073l391l909m538m749m022k992l190
53026C93245n032o945p350o629o038n562m374k920k611l400l532k347j643l121
53012C31741n648o526m919k718j992k740l512l591l686m455n059m065j745k88
52998B80797j037k463k125l3J450R34m23j006q37p87r26p98n27o02r13r11m70
52981B69323l7k7n36j372j930j440J79J967K764K252Q67q83k523l475l435k796
52965B58898k217j842j400r38q20r54o00O50J999K165Q95o32j255j072q79p37
52949B51261rJ215J741P46j084k486l085l185k713j375L75J523J835K147K983
$$ y = [439734, 440806, 441346, 442633, 444290, 444538, 442671, 439797, 437191, 435164, 433704, 433145, 433624, 434557, 435245, 435652, 436060, 436168, 435157, 432699, 429417, 426143, 423109, 420036, 416645, 412736, 408198, 403449, 399427, 396435, 393245, 388213, 381268, 373918, 367289, 361251, 355689, 351315, 348395, 345784, 342384, 338852, 336505, 334862, 331741, 326093, 319567, 314648, 311930, 309938, 307198, 303686, 300095, 296409, 291954, 286895, 282830, 281085, 280797, 279760, 277297, 275172, 275139, 276589, 277523, 277100, 276094, 275257, 274470, 273544, 272746, 272219, 271617, 270704, 269793, 269323, 269286, 269259, 268723, 267351, 265421, 263981, 264160, 266127, 268891, 271143, 272010, 271127, 268604, 265129, 261694, 258898, 256681, 254839, 253439, 252501, 251681, 250727, 250127, 250777, 252776, 254941, 255836, 255204, 253949, 252877, 251998, 251261, 251252, 252467, 254208, 254954, 253870, 251384, 248299, 245114, 242401, 241026, 241401, 242924, 244759, 246906, 249889]
52934B49889L504K391l08k680k625j32K443K761R10j104j905j762j182n0J380
52919B51530K067J718J497K268L262L621L901M601M620L079J584K329M581N553
52905B96211M533L607M122M897M659L988L856M087M260M495M530L523J836J370
52891C49974L000M978N047K988J2l028n480o106m143p13K087L126K423K55k712
52876C51708m899m896l151j597j562k696l860m354m166l597k872k037j219p58
52862C10044p65p37j25P74J179R71P32P05O14M85O87J051J018P02P45J012P73
52845C19865L48R69K534L093J501q14j812j342n95p1N99J458J999J815Q37o34
52829C29750j713j481j46J060J450J399J136L99l12K14J825K652J854J032J624
$$ y = [249889, 253393, 255784, 255476, 252796, 250171, 250039, 252482, 255243, 256153, 255049, 253144, 251382, 250200, 250150, 251530, 253597, 255315, 256812, 259080, 262342, 265963, 269864, 274465, 279085, 282164, 283748, 286077, 290658, 296211, 300744, 304351, 308473, 313370, 318029, 322017, 325873, 329960, 334220, 338715, 343245, 346768, 348604, 349974, 352974, 357952, 362999, 365987, 365999, 362971, 357491, 351385, 347242, 346529, 348616, 351742, 354165, 354420, 351708, 346809, 341913, 338762, 337165, 335603, 332907, 329047, 324693, 320527, 316930, 314058, 312021, 310802, 310044, 309279, 308542, 308417, 309191, 310370, 311341, 312073, 312778, 313392, 313877, 314564, 315615, 316633, 317335, 318080, 319092, 319865, 320213, 321182, 323716, 326809, 328310, 327496, 325684, 324342, 323747, 323676, 324275, 325733, 327732, 329547, 330384, 329750, 328037, 326556, 326410, 327470, 328920, 330319, 331455, 331854, 331542, 331756, 333581, 336233, 338087, 339119, 340743]
52814C40743K522K003N99J31Q75J592J619J140R7j310j681N7K545L320K087Q77
52798C57216J024J762J981J679J275Q88P45J270K298K978K637J324k79r28M57
52783C76327L276N101M429K867L115N297P007O724N320M082L111K117J322Q72
52769D30967M44q2m67q77j881l397m593m961m773m413m128m294m937n222m449
52754C82937l354l168l612l349k279j768k471l554m367n182n755m979k785r19
52740C35395p57j556j838j451j274j744k646l674m326l920k502j174r27j630k654
52725C03322l704m484m403l295j833p46k43n19j859l667m474l684k442j934j751
52710B64284r56J68O31M15L13M05q9j466l037l995m095l546k832k488k451j941
$$ y = [340743, 343265, 345268, 345867, 345998, 346873, 348465, 350084, 351224, 351321, 350011, 348330, 348387, 350932, 354252, 356339, 357216, 358240, 360002, 361983, 363662, 364937, 365825, 366570, 367840, 370138, 373116, 375753, 377077, 376798, 375870, 376327, 379603, 384704, 389133, 392000, 395115, 400412, 407419, 414143, 419463, 423545, 426656, 428773, 430095, 430967, 431411, 431329, 430862, 429985, 428104, 424707, 420114, 415153, 410380, 405967, 401839, 397545, 392608, 387386, 382937, 379583, 376415, 372803, 369454, 367175, 365407, 362936, 359382, 355015, 349833, 344078, 339099, 336314, 335395, 334638, 333082, 331244, 329793, 328519, 326775, 324129, 320455, 316129, 312209, 309707, 308533, 307606, 305976, 303322, 299618, 295134, 290731, 287436, 285603, 284857, 284614, 284095, 282236, 278569, 274095, 270411, 267969, 266035, 264284, 263328, 263496, 264127, 264542, 264855, 265260, 265171, 263705, 260668, 256673, 252578, 249032, 246200, 243712, 241261, 239320]
52694B39320o55L12l76k389m009m278l910l930m363m648m580m243l525k306r72
52679A95448j98j82m25l93k61p34k029l231l066j475Rk17k000l566l427j862l86
52662A72005J3j91Q1J037J747J381K12r27j773k599l227k942j606j21N91N73M01
52645A64655L07K10J98L28K58k84p75l18J113K502K941K542J999J737J759K043
52629A81215K613L259L579L397L032K969L313L622L305K165N48j061k435l658
52615B05863m763n540n650m942l609k105j012q05j552k789l787m128l884l269
52601A58028k284r18M78J265J011j52j603k517k346j287j23N95J121J854K422
52586A55544J998N15j022j661j435r75o20l12l9j4l58q73j070n50O59K149L570
$$ y = [239320, 238665, 238977, 238601, 236212, 232203, 227925, 224015, 220085, 215722, 211074, 206494, 202251, 198726, 196420, 195448, 195250, 195068, 194643, 194250, 193989, 193255, 191226, 187995, 184929, 183454, 183463, 183246, 181246, 177680, 174253, 172391, 172005, 172018, 171827, 171908, 172945, 174692, 176073, 176285, 175358, 173585, 170986, 167759, 164817, 163211, 163090, 163681, 164254, 164655, 164962, 165172, 165370, 165698, 165956, 165672, 164897, 164579, 165692, 168194, 171135, 173677, 175676, 177413, 179172, 181215, 183828, 187087, 190666, 194063, 197095, 200064, 203377, 206999, 210304, 212469, 213017, 211956, 209521, 205863, 201100, 195560, 189910, 184968, 181359, 179254, 178242, 177437, 175885, 173096, 169309, 165181, 161297, 158028, 155744, 154826, 155304, 156569, 157580, 157428, 155825, 153308, 150962, 149675, 149552, 150147, 151268, 153122, 155544, 157542, 158057, 157035, 155374, 153939, 152964, 152344, 152032, 151993, 151979, 151621, 150748, 149678, 149128, 149787, 151936, 155506]
52569A55506M745N279M611K878J120R2o29j637k515k688k732l407l849k581k93
52554A53900N47q19k326k264j583j817k537k434j650j255j381j329q33R0J650
52539A35959L424L967K701J225J230K013J776M86l69k19L95J413L064M390M100
52524A65555K676J725J418O84k01L55K343L588K773J025j53n98l85Q84K613K849
52508A87151R02j107p46J635L621L715K483J311J048J558K001J727J076Q07R12
52493B08094R43J236K462L868L654J567n20j221j227j473j378j51J550K632L151
52478B23187L590L484K219N55l6P00J559J426L15p84o99R44L080M137L780K978
52462B50435K324J495O00N52J448K023J612J134J206Q50n18j382j71K135L198
$$ y = [155506, 160251, 165530, 170141, 173019, 174139, 174231, 173602, 171965, 169450, 166762, 164030, 160623, 156774, 154193, 153900, 154447, 153628, 151302, 149038, 147455, 145638, 143101, 140667, 139017, 137762, 136381, 135052, 134219, 134309, 135959, 139383, 143350, 146051, 147276, 148506, 150519, 152295, 152781, 152412, 152193, 152588, 154001, 157065, 161455, 165555, 168231, 169956, 171374, 172058, 171857, 172212, 174555, 178143, 180916, 181941, 181788, 181190, 180805, 181689, 184302, 187151, 188053, 186946, 186200, 187835, 191456, 195171, 197654, 198965, 200013, 201571, 203572, 205299, 206375, 207182, 208094, 209037, 210273, 212735, 216603, 220257, 221824, 221304, 220083, 218856, 217383, 216005, 215854, 217404, 220036, 223187, 226777, 230261, 232480, 233035, 232999, 233699, 235258, 236684, 236999, 236215, 235516, 236460, 239540, 243677, 247457, 250435, 252759, 254254, 254854, 255406, 256854, 258877, 260489, 261623, 262829, 263679, 263161, 261779, 261608, 263743, 266941]
52447B66941K412R93k18j226j620p97O14J131L63p31j405j707j605r00j03j78
52431B61964j191k115k122j276o0R25J042K97k18M78J787K272J548N00j64l92
52415B63275pJ240K673L018K040R15O13Q93J162J439J896K229K036J520J336J809
52399B88087K550K755K041J037Q20J625K454K351J444L36q10j882k191j291KM59
52383B99787J37K52J427K930L651L181J912P47N20J114J359M47q25j032o8P38
52367C16277M00n77q99J76K085L277K569N65q91j002p75r93o88J041K953L194
52351C26712K159J810K407K148K88j360q93J204K889K967J971J246J538K052J233
52336C48371r78k363j171J039J236o26j412N98L216L636K086O53K7p65k137l252
$$ y = [266941, 269353, 270346, 270128, 268902, 267282, 266485, 267099, 268230, 268593, 267862, 266457, 264750, 263145, 262245, 262142, 261964, 260773, 258658, 256536, 255260, 255200, 256125, 257167, 257464, 257246, 257724, 259511, 261783, 263331, 263831, 263667, 263275, 263268, 264508, 267181, 270199, 272239, 273154, 273767, 274660, 275822, 277261, 279157, 281386, 283422, 284942, 286278, 288087, 290637, 293392, 295433, 296470, 297290, 298915, 301369, 303720, 305164, 305500, 304690, 302808, 300617, 299326, 299328, 299787, 299924, 300176, 301603, 304533, 308184, 311365, 313277, 314024, 314544, 315658, 317017, 317464, 316639, 315607, 315539, 316277, 316677, 316100, 315201, 315377, 317462, 320739, 323308, 323873, 322982, 321980, 321205, 320212, 319524, 320565, 323518, 326712, 328871, 330681, 333088, 335236, 335524, 334164, 333271, 334475, 337364, 340331, 342302, 343548, 345086, 347138, 348371, 347393, 345030, 343859, 344898, 346134, 345508, 344096, 344694, 347910, 351546, 353632, 354285, 354312, 353547, 351410, 348158]
52320C48158l285k193m90R02J040N9m94P09L054M673M458K849J034P0L83J423
52304C62350K086J994J962K710L653L762L096K552K466K465K499K998L911M503
52290D03007M382M049M054M246M155L742L275K845K437K346L061M498N726N795
52276D57618M819L905L921M644N281N521N687O126O806P521Q121Q565Q982R457
52262E46974R593Q682O891N746O625Q926J0601J0570R743R579J0485J1918J3245
52249F69578J4001J3996J3677J3906J4901J5941J6509J7160J8713K0926K2786
52238H52094K3883K4784K5959K6910K6794K5663K4706K5013K6401K7766K8583
52227A138556K9385L0503L1031K9925K7799K6599K7279K8636K8807K7383K5558
$$ y = [348158, 344873, 342680, 342190, 343092, 344132, 344191, 343697, 344406, 347460, 352133, 356591, 359440, 360474, 360544, 360927, 362350, 364436, 366430, 368392, 371102, 374755, 378517, 381613, 384165, 386631, 389096, 391595, 394593, 398504, 403007, 407389, 411438, 415492, 419738, 423893, 427635, 430910, 433755, 436192, 438538, 441599, 446097, 451823, 457618, 462437, 466342, 470263, 474907, 480188, 485709, 491396, 497522, 504328, 511849, 519970, 528535, 537517, 546974, 556567, 565249, 572140, 577886, 584511, 593437, 604038, 614608, 624351, 633930, 644415, 656333, 669578, 683579, 697575, 711252, 725158, 740059, 756000, 772509, 789669, 808382, 829308, 852094, 875977, 900761, 926720, 953630, 980424, 1006087, 1030793, 1055806, 1082207, 1109973, 1138556, 1167941, 1198444, 1229475, 1259400, 1287199, 1313798, 1341077, 1369713, 1398520, 1425903, 1451461]
52216A451461K4568K4431K4172K3067K1542K0624K0492J9934J7715J4143J0784
52205A672933Q796Q017P480O222L865J008r77j151J34J893L605N023N499M713
52191A727060L677L813N181O780Q325J0249J2006J2232J1031J0460J1849J4100
52179A836763J5512J6032J6547J7212J7803J8858K0887K2959K3531K2568K1537
52168B050209K1161K0336J7791J4162J1747J2040J3801J3957J0711N540J499n8
52156B192896k75o49j549l045n556q762j1167j1939j2262j3539j5088j5090j3435
52143B080540j2070j2434j3825j4616j4211j3244j2491j2075j1597j0746r672
52132A943559q637p503o011m519l796l868l815l134k486k635l282l648l539l215
$$ y = [1451461, 1476029, 1500460, 1524632, 1547699, 1569241, 1589865, 1610357, 1630291, 1648006, 1662149, 1672933, 1681729, 1689746, 1697226, 1703448, 1707313, 1708321, 1707344, 1706193, 1706327, 1708220, 1711825, 1716848, 1722347, 1727060, 1730737, 1734550, 1739731, 1746511, 1754836, 1765085, 1777091, 1789323, 1800354, 1810814, 1822663, 1836763, 1852275, 1868307, 1884854, 1902066, 1919869, 1938727, 1959614, 1982573, 2006104, 2028672, 2050209, 2071370, 2091706, 2109497, 2123659, 2135406, 2147446, 2161247, 2175204, 2185915, 2191455, 2192954, 2192896, 2192621, 2191972, 2190423, 2187378, 2181822, 2173060, 2161893, 2149954, 2137692, 2124153, 2109065, 2093975, 2080540, 2068470, 2056036, 2042211, 2027595, 2013384, 2000140, 1987649, 1975574, 1963977, 1953231, 1943559, 1934922, 1927419, 1921408, 1916889, 1913093, 1909225, 1905410, 1902276, 1899790, 1897155, 1893873, 1890225, 1886686, 1883471]
52118A883471k838k687l216m181m447l558k664k885l563l463l005l703n648p213
52104A830400p374o767o149n280m015l248l888n613p341q412q792q642q246p941
52090A738692p598o581m755l180l110m408n497n096l691k992l956n642o205m928
52076A671053k951k060l082n437p694q369o885m295k668l075m463m972m063k845
52062A608194k610l653n330o650o947o416n796n137l407q1L405M941M310L425
52048A578248L858N219O346P049P974R478J1449J3894J6894K0034K2442K3675
52036A726560K4295K5369K7418K9941L1970L2974L3154L3004L2960L3424L4599
52025B065668L6035L6799L6356L4984L3109L0778K8136K5808K4165K2605K0254
$$ y = [1883471, 1880633, 1877946, 1874730, 1870549, 1866102, 1862544, 1859880, 1856995, 1853432, 1849969, 1846964, 1843261, 1837613, 1830400, 1823026, 1816259, 1810110, 1804830, 1800815, 1797567, 1793679, 1788066, 1780725, 1772313, 1763521, 1754879, 1746633, 1738692, 1731094, 1724513, 1719758, 1716578, 1713468, 1709060, 1703563, 1698467, 1694776, 1691784, 1687828, 1682186, 1675981, 1671053, 1668102, 1666042, 1662960, 1657523, 1649829, 1641460, 1634575, 1630280, 1627612, 1624537, 1620074, 1615102, 1611039, 1608194, 1605584, 1601931, 1596601, 1589951, 1583004, 1576588, 1570792, 1565655, 1562248, 1562167, 1565572, 1570513, 1574823, 1578248, 1582106, 1587325, 1593671, 1600720, 1608694, 1618172, 1629621, 1643515, 1660409, 1680443, 1702885, 1726560, 1750855, 1776224, 1803642, 1833583, 1865553, 1898527, 1931681, 1964685, 1997645, 2031069, 2065668, 2101703, 2138502, 2174858, 2209842, 2242951, 2273729, 2301865, 2327673, 2351838, 2374443, 2394697]
52014B394697J7034J3458R736N901K511K88r56k246m082n870o841p079p375q350
52000B400826r830j0933j0971j0393j0401j1320j1951j1165r482q253p674o722
51988B281731m755k167M28K662M160M807N243O115O892O527N317M801N630O705
51974B334096O858O284N776N661N963O616O854N508K585l06j935k908m366o186
51960B370500p602q788j0490j2505j3885j4501j5237j6564j7972j9068k0299k2115
51948B191474k4062k5297k5760k6339k7839k9922l1354l1425l0926l1285l2836
51937A874429l4584l5710l6478l7237l7457l6627l5532l5520l6768l8144l8690
51926A471682l8462l7887l7221l6803l6991l7511l7442l6252l4383l2596l1150
$$ y = [2394697, 2411731, 2425189, 2434925, 2440826, 2443337, 2443625, 2442669, 2440423, 2436341, 2430471, 2423630, 2416551, 2409176, 2400826, 2390996, 2380063, 2369092, 2358699, 2348298, 2336978, 2325027, 2313862, 2304380, 2296127, 2288453, 2281731, 2276976, 2274809, 2275237, 2277899, 2282059, 2286866, 2292109, 2298224, 2305116, 2311643, 2316960, 2321761, 2327391, 2334096, 2340954, 2347238, 2353014, 2358675, 2364638, 2371254, 2378108, 2383616, 2386201, 2385895, 2383960, 2381052, 2376686, 2370500, 2362898, 2354110, 2343620, 2331115, 2317230, 2302729, 2287492, 2270928, 2252956, 2233888, 2213589, 2191474, 2167412, 2142115, 2116355, 2090016, 2062177, 2032255, 2000901, 1969476, 1938550, 1907265, 1874429, 1839845, 1804135, 1767657, 1730420, 1692963, 1656336, 1620804, 1585284, 1548516, 1510372, 1471682, 1433220, 1395333, 1358112, 1321309, 1284318, 1246807, 1209365, 1173113, 1138730, 1106134, 1074984]
51915A074984k9866k8535k6972k5119k3356k2297k1937k1486k0446j9411j9207
51904H16352j9574j9347j7933j5937j4299j3391j3071j3065j2985j2408j1290
51893F53052j0159r625r875j0720j1649j1753j0295p814o103o288p425p843p416
51880E36087p267p541p093n697m795n197n477m148k251k024l611n008n021m467
51866D66490m120l404j982j052j733l094l122j341O56J129j34k051l493m075m081
51851D34593l842l336k568k070k404l210l501l157l156l950m457l579j929j113
51837C92321j627k546l056l307l683m072m051l237j425J025K895K898R57j708
51823C71384l744m478l833k269q54n04r23j051o39n33j059j270n12L41J94m08
$$ y = [1074984, 1045118, 1016583, 989611, 964492, 941136, 918839, 896902, 875416, 854970, 835559, 816352, 796778, 777431, 759498, 743561, 729262, 715871, 702800, 689735, 676750, 664342, 653052, 642893, 633268, 623393, 612673, 601024, 589271, 578976, 571162, 565059, 558771, 551346, 543503, 536087, 528820, 521279, 514186, 508489, 503694, 498497, 493020, 488872, 486621, 484597, 480986, 475978, 470957, 466490, 462370, 458966, 456984, 455932, 454199, 451105, 447983, 446642, 447298, 448427, 448293, 446242, 442749, 438674, 434593, 430751, 427415, 424847, 422777, 420373, 417163, 413662, 410505, 407349, 403399, 398942, 395363, 393434, 392321, 390694, 388148, 385092, 381785, 378102, 374030, 369979, 366742, 365317, 366342, 369237, 372135, 373092, 371384, 367640, 363162, 359329, 357060, 356206, 355702, 354779, 353728, 353089, 352556, 351497, 350227, 349715, 350056, 350250, 349842]
51807C49842k4J518K946L376L093K470J472N21N42J495K009J306M86P86J546J270
51791C74654J38j79P83J556J079L12O31J882L012L757M416M557L420J512M53R27
51775D02910J879K210K244K716K992J570j570m233m236j923K60N93l07q61o60
51760D03584l70j61N67J793K429J888J054Q81Q55N8r32n51J283K725K389J060
51744D18552L75O86J097R41L34m82j419k218k487k189j585p21N92K114L049K855
51728D19494J815O30l29j064j567j773j742j455n93R76K518K945K214J487J520
51713D25076J605Q32k60l83N19J201R90N29M40M93N48J069K019K366J699J276
51697D40019K318M002M497L505K442K378L080M020N060N908N970N163M153L664
$$ y = [349842, 349818, 351336, 354282, 357658, 360751, 363221, 364693, 365214, 365756, 367251, 369260, 370566, 371052, 371838, 373384, 374654, 374792, 374613, 375396, 376952, 378031, 378343, 378974, 380856, 383868, 387625, 392041, 396598, 400018, 401530, 401983, 402910, 404789, 406999, 409243, 411959, 414951, 416521, 414951, 410718, 406482, 404559, 404819, 405412, 405105, 404244, 403584, 403214, 403053, 403620, 405413, 407842, 409730, 410784, 411665, 412520, 412578, 411646, 411095, 412378, 415103, 417492, 418552, 418927, 419613, 420710, 421651, 421985, 421503, 420084, 417866, 415379, 413190, 411605, 410884, 411476, 413590, 416639, 419494, 421309, 421939, 421610, 420546, 418979, 417206, 415464, 414009, 413416, 414392, 416910, 419855, 422069, 423556, 425076, 426681, 427513, 427253, 426870, 427389, 428590, 429580, 430109, 430549, 431042, 431590, 432659, 434678, 437044, 438743, 440019, 442337, 446339, 450836, 454341, 456783, 459161, 462241, 466261, 471321, 477229, 483199, 488362, 492515, 496179]
51683D96179L975M969O030O136M902L363K871L492M350N127O028O610O168N278
51669E65478N333O366O899O403O195P199Q268P840N980L772J826M88M41J732K903
51654F37123K461Q06l66k67L11K63p88k444l751l753k533j331j070j241r79o38
51638F21803j312l097m797n277m413k825j299l02L88J277K082J706q5j748j639
51623F00462o0J379J951K255K753L106K994K654K304J776Q29n37j969k663j900
51608F15334k22O11l43j873k253j625j379j623r33J439M468O714P583P125N706
51593F38729M212L400K826J416o67j963j824j374j930l525n499p364q416p728
51579F10293n613m166n168p881r859r740q401p531p833q641q819p867o331n136
$$ y = [496179, 500154, 505123, 511153, 517289, 522191, 525554, 528425, 531917, 536267, 541394, 547422, 554032, 560200, 565478, 570811, 577177, 584076, 590479, 596674, 603873, 612141, 619981, 625961, 629733, 631559, 632047, 632488, 634220, 637123, 639584, 640390, 640024, 639757, 640068, 640331, 639543, 637099, 633348, 629595, 627062, 625731, 624661, 623420, 622441, 621803, 620491, 617394, 612597, 607320, 602907, 600082, 598783, 598481, 598869, 600146, 602228, 603934, 603849, 602101, 600462, 600402, 601781, 603732, 605987, 608740, 611846, 614840, 617494, 619798, 621574, 622403, 621866, 619897, 617234, 615334, 615112, 615723, 615380, 613507, 611254, 609629, 608250, 606627, 605694, 607133, 611601, 618315, 625898, 633023, 638729, 642941, 646341, 649167, 650583, 649916, 647953, 646129, 644755, 642825, 639300, 633801, 626437, 618021, 610293, 604680, 600514, 595346, 587465, 577606, 567866, 559465, 551934, 544101, 535460, 526641, 518774, 512443, 507307]
51565E07307m641m563m649m869m998m713m201m029m231m216l741l204k901k684
51551D49667k555k646k544j646n02n86k127l392k939j508o43n01k89n3n60j706
51535D25470k366j896p59K81Q38Q49O02O65J256J969K582L564N059O098N874N215
51519D55301N458O382O717O390O588P586Q220P962P774Q187Q080O472M305L146
51505E48568K929K330R70j36k68l3m39j580k641k898k558k582l620n081n648m744
51489E22569l087j629n85K38Q34J347K344M015N444N578M734M349N205O711P902
51474E65969Q442Q387P742O700N835N580N681N457M481K868J112j72n81k70J76
51459F27407K95J19o1o8J71O52J071Q05m29j963k640k002o67N48J518K459L061
$$ y = [507307, 502666, 498103, 493454, 488585, 483587, 478874, 474673, 470644, 466413, 462197, 458456, 455252, 452351, 449667, 447112, 444466, 441922, 440276, 439774, 439188, 437061, 433669, 430730, 429222, 428579, 428078, 427789, 427736, 427176, 425470, 423104, 421208, 420449, 420730, 421568, 422417, 423019, 423684, 424940, 426909, 429491, 433055, 438114, 444212, 450086, 455301, 460759, 467141, 473858, 480248, 486836, 494422, 502642, 510604, 518378, 526565, 534645, 541117, 545422, 548568, 551497, 553827, 554797, 554661, 554393, 554360, 553921, 552341, 549700, 546802, 544244, 541662, 538042, 532961, 527313, 522569, 519482, 517853, 517268, 517506, 518340, 519687, 522031, 526046, 531490, 537068, 541802, 546151, 551356, 558067, 565969, 574411, 582798, 590540, 597240, 603075, 608655, 614336, 619793, 624274, 627142, 628254, 628082, 627501, 627231, 627407, 627702, 627821, 627760, 627692, 627863, 628515, 629586, 630391, 629962, 627999, 625359, 623357, 622690, 623238, 624756, 627215, 630276]
51442F30276K670J326l1p77j413k605l931m462m354m761n960o648n714l884k732
51427E87000k691l013l268l658l960l411k016j030j516l000m038l660j995J06
51413E49850J670K326K748L899N582O416N669M410L963L966L141J712J688M283
51399F01323Q034J0220R743P943O859P279Q558R789J0678J1231J1205J0377R212
51386G22451Q535Q304P460N513L605L142L731L540J658q94k665l387l700m047
51372G53246m355m317l537j964m21j49j289k478k441j477o96m06p8M46P06M00
51356G31190m38j922m054n975o609o281o598q202r714r781r244j0010j2183j3754
51342F26425j3224j1257r305p725o089m528l636l293k757j979j869k867m001l937
$$ y = [630276, 632946, 634272, 634241, 633464, 632051, 629446, 625515, 621053, 616699, 611938, 605978, 599330, 593616, 589732, 587000, 584309, 581296, 578028, 574370, 570410, 566999, 564983, 563953, 562437, 559437, 555399, 551739, 549744, 549850, 551520, 553846, 556594, 560493, 566075, 572491, 578160, 582570, 586533, 590499, 593640, 595352, 597040, 601323, 609357, 619577, 629320, 637263, 644122, 651401, 659959, 669748, 680426, 691657, 702862, 713239, 722451, 730986, 739290, 746750, 752263, 755868, 759010, 762741, 766281, 767939, 767045, 764380, 760993, 757293, 753246, 748891, 744574, 741037, 739073, 738652, 738503, 737214, 734736, 732295, 730818, 730122, 729716, 729638, 730084, 730790, 731190, 730752, 728830, 724776, 718801, 712192, 705911, 699313, 691111, 681397, 671616, 662372, 652362, 640179, 626425, 613201, 601944, 592639, 584914, 578825, 574297, 570661, 567368, 564611, 562632, 560763, 557896, 553895, 549958]
51328E49958k541q65J57M88O52J133K062L084L495K865J570M45j26n57j482l033
51312E57305m762o082o793p352q452j0091j1212j0737q987p631p921r353j0319
51299D47613r927q751p871p584p390p013o908p389p742o882n011l836m590o382
51285C50337p122n813l310j081O6N9p38j688k281k639l191l746l476k069m81n2
51269C12775j024k230k261r11O02R92N59Q62K501L911L175O14j534j775o11Q56
51253C16501K187L113L148K468K307L501N258O128N767N011M633M722N098N679
51239C75521O406P069P228O443M942L772L531L202J378j371k886k508k184l568
51225D06975n610o331n733n264n400n537n789o985q840r855r235p744o469n808
$$ y = [549958, 547417, 546552, 546709, 547197, 547849, 548982, 551044, 554128, 557623, 560488, 562058, 562503, 562377, 561820, 560338, 557305, 552543, 546461, 539668, 532316, 523864, 513773, 502561, 491824, 482837, 475206, 467285, 457932, 447613, 437686, 428935, 421064, 413480, 406090, 399077, 392169, 384780, 377038, 370156, 365145, 361309, 356719, 350337, 343215, 337402, 334092, 333011, 333077, 333136, 332398, 330710, 328429, 325790, 322599, 318853, 315377, 313308, 312827, 312775, 311751, 309521, 307260, 306349, 306951, 307943, 308502, 309364, 311865, 315776, 318951, 319565, 318031, 316256, 315645, 316501, 318688, 321801, 324949, 327417, 329724, 333225, 338483, 344611, 350378, 355389, 360022, 364744, 369842, 375521, 381927, 388996, 396224, 402667, 407609, 411381, 414912, 418114, 419492, 418121, 415235, 412727, 410543, 406975, 401365, 395034, 389301, 384037, 378637, 373100, 367311, 360326, 351486, 341631, 332396, 324652, 318183, 312375]
51211C12375n756o099o139n234l779k849k822l207l611l952l783k591q72K16L43
51196B62240J45j79j166k759l823l571k432j218k28N05J010J665K804L792L553
51181B60338K179R39M14om45J2J458K316J640Q32J581L135L334J757P1m78k91
51164B78786l7L25P30N15m99j321r68J71P33o5j725l064l220k144m41J179K327
51147B71282K864K695J938J230J293J953K052Q37p74j075K00J319O51j306k879
51132B82280l565m165m744m244k535j165r80o00J196K853K073m00j461j08J261
51117B65696N98j049j748j653k123l232l819l414k591j761q08J93Q37Q81M24j25
51101B46306LJ292K814K736P18j095o54J238K039Q89o75j236j252j750k505k432
$$ y = [312375, 306619, 300520, 294381, 289147, 285368, 282519, 279697, 276490, 272879, 268927, 265144, 262553, 261681, 261897, 262240, 262385, 262206, 261040, 258281, 254458, 250887, 248455, 247237, 247009, 247514, 248524, 250189, 252993, 256785, 260338, 262517, 263456, 263870, 263864, 263419, 263431, 264889, 267205, 268845, 269677, 271258, 274393, 277727, 279484, 279555, 279077, 278786, 278749, 279074, 279804, 280319, 279820, 278499, 277531, 277702, 278435, 278370, 276645, 273581, 270361, 268217, 267776, 268955, 271282, 274146, 276841, 278779, 280009, 281302, 283255, 285307, 286144, 285370, 284295, 284495, 285814, 286465, 285159, 282280, 278715, 274550, 269806, 265562, 263027, 261862, 260882, 260282, 261478, 264331, 266404, 266004, 264543, 264435, 265696, 266294, 265245, 263497, 261844, 259721, 256489, 252670, 249256, 246665, 244904, 244096, 244289, 245126, 246007, 246431, 246306, 246309, 247601, 250415, 253151, 253869, 252774, 252120, 253358, 255397, 256286, 255611, 254375, 253123, 251373, 248868, 246436]
51085B46436j267l4K20m13j041j262j551k191k514j952j296j740k830k821j314
51070B24430o7l26r80m69N73K09j866l813l820j640J898N626Q187Q556O881M452
51054B47831K718K303K625K261M70j426j103J704M408M752L548K978L277K958
51040B79304J573J95o38j447k241k155r97K95J046J308Q39p40k472k453l10K093
51024B73200L098K976K651K204J574J348J606J267j99j416q67P77J582J084N65
51009B91450P94J060O59J14L15J218J973J954J214J08j125k341l201l237k422
50994B88533j526j400j953k276j841r22J90J586K988L475K690J653J587K226K266
50979B97276J325N85J261L104M792N391N079M481L790K735J413O35J132K596M005
$$ y = [246436, 245169, 245135, 245355, 244942, 243901, 242639, 241088, 238897, 236383, 234431, 233135, 231395, 228565, 225744, 224430, 224363, 224037, 223057, 222588, 223161, 223370, 221504, 217691, 213871, 212231, 214129, 219755, 227942, 236498, 243379, 247831, 250549, 252852, 255477, 257738, 258208, 256782, 255679, 257383, 261791, 266543, 270091, 273069, 276346, 279304, 280877, 281072, 280434, 278987, 276746, 274591, 273594, 273889, 274935, 276243, 277082, 276342, 273870, 271417, 271107, 273200, 276298, 279274, 281925, 284129, 285703, 287051, 288657, 289924, 289725, 288309, 287442, 288219, 289801, 290885, 291450, 292244, 293304, 293963, 294077, 294392, 295610, 297583, 299537, 300751, 300859, 299734, 297393, 294192, 290955, 288533, 287007, 285607, 283654, 281378, 279537, 278615, 278805, 280391, 283379, 286854, 289544, 291197, 292784, 295010, 297276, 298601, 299186, 300447, 303551, 308343, 313734, 318813, 323294, 327084, 329819, 331232, 331867, 332999, 335595, 339600]
50964C39600M771N002M677L385J291l99n51N74J679J808J003j01q58q96k66P67
50948C61486K162L924N357N260L532J986K522M710O237N814M657M602N862P286
50934D25397Q210R010J0114J1408J2743J4184J5569J6425J6790J7474J8948K0446
50922E96718K1010K1115K2277K4918K7666K9203K9916L1071L3120L5730L8933
50911I11677M3046M7664N1861N5524N9461O4018O8591P2909P7701Q3328Q8666
50900A624446R2378R4761R7211J00072J02112J02173J00349R7216R2896Q7439
50890B591053Q1345P4885O7331N7893M7280L7414K9380K2522J5980J0208O177
50879C041468L723J718l34j969k984l850m739n241n669p556j2067j8690k6284
$$ y = [339600, 344371, 349373, 354050, 357435, 358726, 358327, 357776, 358350, 360029, 361837, 362840, 362739, 361881, 360985, 360719, 361486, 363648, 367572, 372929, 378189, 381721, 383707, 386229, 390939, 397176, 402990, 407647, 412249, 418111, 425397, 433607, 442617, 452731, 464139, 476882, 491066, 506635, 523060, 539850, 557324, 576272, 596718, 617728, 638843, 661120, 686038, 713704, 742907, 772823, 803894, 837014, 872744, 911677, 954723, 1002387, 1054248, 1109772, 1169233, 1233251, 1301842, 1374751, 1452452, 1535780, 1624446, 1716824, 1811585, 1908796, 2008868, 2110980, 2213153, 2313502, 2410718, 2503614, 2591053, 2672398, 2747283, 2814614, 2872507, 2919787, 2957201, 2986581, 3009103, 3025083, 3035291, 3041468, 3045191, 3046909, 3046575, 3044606, 3041622, 3037772, 3033033, 3027792, 3022123, 3014567, 3002500, 2983810, 2957526]
50866B957526l4672m4058n3547o1682o8328p4722q1449q7425r1367r3417r4729
50855B172130r5936r6411r4840r0456q4063p7713p2885o9057o4554n8658n2128
50844A315429m5949m0505l6157l3356l1673k9670k6472k2847j9942j7483j4247
50833I97128j0129o686n200m872l626p25K194L151K356J912L088M972O188O729
50819I96480P425Q549J0054J2309J5263J7605J8308J8505K0067K2732K4643K5608
50807A197548K7520L1050L4364L6122L7613M0470M4145M7421N0839N5701O1779
50796A664572O8149P5334Q4394R4367J03015J10165J18126J28371J39708J50533
50786B736734J61240J73216J86387J98941K09031K16110K20793K23905K25393
$$ y = [2957526, 2922854, 2878796, 2825249, 2763567, 2695239, 2620517, 2539068, 2451643, 2360276, 2266859, 2172130, 2076194, 1979783, 1884943, 1794487, 1710424, 1632711, 1559826, 1490769, 1426215, 1367557, 1315429, 1269480, 1228975, 1192818, 1159462, 1127789, 1098119, 1071647, 1048800, 1028858, 1011375, 997128, 986999, 980313, 975113, 970241, 966615, 965890, 968084, 971235, 973591, 975503, 978591, 983563, 989751, 996480, 1003905, 1012454, 1022508, 1034817, 1050080, 1067685, 1085993, 1104498, 1124565, 1147297, 1171940, 1197548, 1225068, 1256118, 1290482, 1326604, 1364217, 1404687, 1448832, 1496253, 1547092, 1602793, 1664572, 1732721, 1808055, 1892449, 1986816, 2089831, 2199996, 2318122, 2446493, 2586201, 2736734, 2897974, 3071190, 3257577, 3456518, 3665549, 3881659, 4102452, 4326357, 4551750]
50777D551750K24059K18469K08176J93727J75862J55343J33275J10650Q7620O4252
50767F123183M2096K3748J0261M4q785j5764j8814j7135j2282o531j319K493L745
50754F124940J092o302j8565l5294n5436p7144r8550j18980j39122j59560j79311
50743E237768j96118k08201k15543k19442k21116k20689k17231k09710j98122
50734C331596j83923j69284j55874j44154j33500j22824j11443r9783q8998p9598
50724B042215p0826o1862n3258m6308m1328l7415l3787l0295k6609k2202j7588
50713A600737j4434j3738j4637j5581j6004j6134j5967j5177j3824j2424j1539
50702A441278j1506j2080j2292j1261r350p701o502m839k502n14Q04K876O862
$$ y = [4551750, 4775809, 4994278, 5202454, 5396181, 5572043, 5727386, 5860661, 5971311, 6058931, 6123183, 6165279, 6189027, 6199288, 6199332, 6190547, 6174783, 6155969, 6138834, 6126552, 6120021, 6118702, 6121195, 6124940, 6126032, 6119730, 6101165, 6065871, 6010435, 5933291, 5834741, 5715761, 5576639, 5417079, 5237768, 5041650, 4833449, 4617906, 4398464, 4177348, 3956659, 3739428, 3529718, 3331596, 3147673, 2978389, 2822515, 2678361, 2544861, 2422037, 2310594, 2210811, 2121813, 2042215, 1971389, 1909527, 1856269, 1809961, 1768633, 1731218, 1697431, 1667136, 1640527, 1618325, 1600737, 1586303, 1572565, 1557928, 1542347, 1526343, 1510209, 1494242, 1479065, 1465241, 1452817, 1441278, 1429772, 1417692, 1405400, 1394139, 1384789, 1377088, 1370586, 1365747, 1363245, 1362731, 1363535, 1366411, 1373273]
50689A373273J1698J5372J7356J8666K0469K3508K7895L2348L5043L6541M0305
50678A652474M8268N7280O2745O4944O8622P6290Q5323R2464R8211J04898J12692
50667B524211J19736J25068J29276J32740J34762J34482J31760J27037J20708
50658C679780J12423J00985Q5633O7540M9214L2181J6106M16j4189k6288l4927
50647D068874l9788m1120l9892l7230l3293k7659k0977j5168j1448r433q837j0721
50635C773308j6192k4803l5297m7128o0389p4951r0399j05838j19113j27509j30377
50624B941312j30087j29034j26689j21069j12335j03087r5377q8980q2540p5097
50614A877017o6483n7397m9103m2160l5613k8432k1290j5601j1266o915k274J442
$$ y = [1373273, 1384971, 1400343, 1417699, 1436365, 1456834, 1480342, 1508237, 1540585, 1575628, 1612169, 1652474, 1700742, 1758022, 1820767, 1885711, 1954333, 2030623, 2115946, 2208410, 2306621, 2411519, 2524211, 2643947, 2769015, 2898291, 3031031, 3165793, 3300275, 3432035, 3559072, 3679780, 3792203, 3893188, 3978821, 4046361, 4095575, 4127756, 4143862, 4144278, 4130089, 4103801, 4068874, 4029086, 3987966, 3948074, 3910844, 3877551, 3849892, 3828915, 3813747, 3802299, 3792866, 3784029, 3773308, 3757116, 3732313, 3697016, 3649888, 3589499, 3514548, 3424149, 3318311, 3199198, 3071689, 2941312, 2811225, 2682191, 2555502, 2434433, 2322098, 2219011, 2123634, 2034654, 1952114, 1877017, 1810534, 1753137, 1704034, 1661874, 1626261, 1597829, 1576539, 1560938, 1549672, 1542757, 1540483, 1541925]
50602A541925L676N451P651R895J1656J3168J4611J5659J6604J8448K1088K2757
50590A702589K2509K1971K3172K5642K7441K8430L0543L4849M0141M4880M8899
50579B051066N2586N5701N8105O0653O4228O8261P1260P2586P2871P2761P1947
50568B772025O9594O5258N9295N2758M6785M1582L6001K8626J9500J0429L362
50557C205215j200m162o734r480j1923j2684j0494n719o25K471L379L903N520
50544C157467P693Q614P308M502J467j677o172j3035k1693l0677l9442m8654n8487
50531B967214o7654p4775p9987q4216q7476q8915q8367q6652q4359q1408p7946
50520B065459p4497p0881o6210o0449n4938n0534m6247m0697l4256k8570k4420
$$ y = [1541925, 1545601, 1551052, 1558703, 1568598, 1580254, 1593422, 1608033, 1623692, 1640296, 1658744, 1679832, 1702589, 1725098, 1747069, 1770241, 1795883, 1823324, 1851754, 1882297, 1917146, 1957287, 2002167, 2051066, 2103652, 2159353, 2217458, 2278111, 2342339, 2410600, 2481860, 2554446, 2627317, 2700078, 2772025, 2841619, 2906877, 2966172, 3018930, 3065715, 3107297, 3143298, 3171924, 3191424, 3201853, 3205215, 3204015, 3199853, 3193119, 3183639, 3171716, 3159032, 3148538, 3142819, 3142194, 3144665, 3148044, 3151947, 3157467, 3165160, 3173774, 3181082, 3185584, 3187051, 3185374, 3179202, 3166167, 3144474, 3113797, 3074355, 3025701, 2967214, 2899560, 2824785, 2744798, 2660582, 2573106, 2484191, 2395824, 2309172, 2224813, 2143405, 2065459, 1990962, 1920081, 1853871, 1793422, 1738484, 1687950, 1641703, 1601006, 1566750, 1538180, 1513760]
50509A513760k1142j7998j4917j1781p995l276J736O067R261J1494J3200J4868
50497A493277J6897J9382K2114K4848K7467K9916L2231L4634L7308M0001M2102
50486A820177M3322M4138M5308M6915M8105M7949M6513M4889M4131M4395M5301
50475B321143M6766M9070N2233N5788N9299O2815O6806P1861P8261Q5586R2885
50464C042513R9785J07039J15291J23586J30225J35148J39976J45196J48631J47856
50454D335246J43123J36568J29118J19656J06962R1062P2498N1586K8984O135
50444E220938j5539l5566n4277p1968q8224j01702j10752j14833j15172j13257
50434D399648j08786j00133q7015p1627n6513m2258k8105j3974p83J0822K0709
$$ y = [1513760, 1492618, 1474620, 1459703, 1447922, 1439927, 1436651, 1438387, 1444454, 1453715, 1465209, 1478409, 1493277, 1510174, 1529556, 1551670, 1576518, 1603985, 1633901, 1666132, 1700766, 1738074, 1778075, 1820177, 1863499, 1907637, 1952945, 1999860, 2047965, 2095914, 2142427, 2187316, 2231447, 2275842, 2321143, 2367909, 2416979, 2469212, 2525000, 2584299, 2647114, 2713920, 2785781, 2864042, 2949628, 3042513, 3142298, 3249337, 3364628, 3488214, 3618439, 3753587, 3893563, 4038759, 4187390, 4335246, 4478369, 4614937, 4744055, 4863711, 4970673, 5061735, 5134233, 5185819, 5214803, 5220938, 5205399, 5169833, 5115556, 5043588, 4955364, 4853662, 4742910, 4628077, 4512905, 4399648, 4290862, 4190729, 4103714, 4032087, 3975574, 3933316, 3905211, 3891237, 3890454, 3901276, 3921985]
50423C921985K8002L0740K7431J8503N656r933k8199m8993p0782r0882j07099
50412C676429j19065j27770j33893j36893j36094j32277j27450j22939j18337
50403B521711j12706j06041r8865r0995q1940p2386o3910n6908n0107m2779l6129
50392A708945l1314k7194k1732j5041r179n080j590K201N662Q336J1108J4536
50380A639658J7652J9877K2487K6419K9904L0728L0048L1275L5127L8550L9313
50369A961038L8991L9868M1176M0652L8451L6801L6271L4938L1696K8043K5587
50358B353512K3634K0729J7414J5627J5931J7070J8265K0219K3486K7266L0741
50347B583894L4340L8644M2827M5611M7245M9210N1971N4287N4858N3496N0348
$$ y = [3921985, 3949987, 3980727, 4008158, 4026661, 4032317, 4022384, 3994185, 3945192, 3874410, 3783528, 3676429, 3557364, 3429594, 3295701, 3158808, 3022714, 2890437, 2762987, 2640048, 2521711, 2409005, 2302964, 2204099, 2113104, 2031164, 1958778, 1894868, 1837960, 1787853, 1745074, 1708945, 1677631, 1650437, 1628705, 1613664, 1604485, 1599405, 1597815, 1600016, 1605678, 1614014, 1625122, 1639658, 1657310, 1677187, 1699674, 1726093, 1755997, 1786725, 1816773, 1848048, 1883175, 1921725, 1961038, 2000029, 2039897, 2081073, 2121725, 2160176, 2196977, 2233248, 2268186, 2299882, 2327925, 2353512, 2377146, 2397875, 2415289, 2430916, 2446847, 2463917, 2482182, 2502401, 2525887, 2553153, 2583894, 2618234, 2656878, 2699705, 2745316, 2792561, 2841771, 2893742, 2948029, 3002887, 3056383, 3106731]
50336C106731M5239L8393L0880K3438J5403N546o428j9684l3203m6332n8779p0432
50324C030772q0862q8765r2631r2430r0045q7356q4288p9431p2053o2760n2586
50313B147565m2212l1982k2052j2636m364J992O518J0205J3390J4801J2931P857
50301B102013Q21p301j6105k4758l2273l8507m3750m7554m9159m9012m8586m8541
50289A697288m8165m6833m4935m2919m0414l6907l2729k9002k6711k5785k4851
50278A298037k2337j8408j5166j4061j3793j2012q530n282l397k046k75J897M395
50265A189022P391J0238J1824J2558J4208J7090J9197J9161J8346J8698K0049
50254A357782K1065K1634K2631K4216K5826K7214K8136K7716K5436K2256J9570
$$ y = [3106731, 3151970, 3190363, 3221243, 3244681, 3260084, 3265630, 3259202, 3239518, 3206315, 3159983, 3101204, 3030772, 2949910, 2861145, 2768514, 2676084, 2586039, 2498683, 2414395, 2334964, 2262911, 2200151, 2147565, 2105353, 2073371, 2051319, 2038683, 2034319, 2036311, 2042829, 2053034, 2066424, 2081225, 2094156, 2102013, 2102834, 2095533, 2079428, 2054670, 2022397, 1983890, 1940140, 1892586, 1843427, 1794415, 1745829, 1697288, 1649123, 1602290, 1557355, 1514436, 1474022, 1437115, 1404386, 1375384, 1348673, 1322888, 1298037, 1275700, 1257292, 1242126, 1228065, 1214272, 1202260, 1193730, 1188448, 1185051, 1183005, 1182730, 1184627, 1189022, 1196413, 1206651, 1218475, 1231033, 1245241, 1262331, 1281528, 1300689, 1319035, 1337733, 1357782, 1378847, 1400481, 1423112, 1447328, 1473154, 1500368, 1528504, 1556220, 1581656, 1603912, 1623482]
50243A623482J7645J6149J5306J5214J4712J2485Q888N419K819R06l80j144k251
50230A729250m364o681q026q721r929j1523j2407j2599j3316j5049j7204j9494
50218A589937k1920k3530k3146k1379k0045j9421j8221j6490j6163j7871j9657
50207A372094j9912j9443j9140j7824j4457j0765r185r207q102m858j217J125
50195A239109K456L842N515O898P399O875N861N269N314N129M132L162L271L934
50181A308166L678K126J74j534k961l685l174k186k416m226o220p517q959j1141
50167A260125j2650j1807r276p342o841o362m725k718j643j217j10J761K875K321
50153A202391J313J712L645N529O229O148O150O354O330N595L683N87k356l243
$$ y = [1623482, 1641127, 1657276, 1672582, 1687796, 1702508, 1714993, 1723881, 1729300, 1732119, 1733025, 1732645, 1731501, 1729250, 1724886, 1718205, 1710179, 1701458, 1691529, 1680006, 1667599, 1655000, 1641684, 1626635, 1609431, 1589937, 1568017, 1544487, 1521341, 1499962, 1479917, 1460496, 1442275, 1425785, 1409622, 1391751, 1372094, 1352182, 1332739, 1313599, 1295775, 1281318, 1270553, 1261368, 1252161, 1244059, 1239201, 1237984, 1239109, 1241565, 1245407, 1250922, 1257820, 1265219, 1272094, 1277955, 1283224, 1288538, 1293667, 1297799, 1300961, 1304232, 1308166, 1311844, 1313970, 1314144, 1312610, 1309649, 1305964, 1302790, 1300604, 1298188, 1293962, 1287742, 1280225, 1271266, 1260125, 1247475, 1235668, 1226392, 1219050, 1212209, 1205847, 1201122, 1198404, 1196761, 1195544, 1195434, 1197195, 1200070, 1202391, 1203704, 1205416, 1209061, 1214590, 1220819, 1226967, 1233117, 1239471, 1245801, 1251396, 1255079, 1255666, 1253310, 1250067]
50139A250067j999r82k111m446n884o312p252q939r978r911j0025j1019j1732
50126A159477j1129r979r445r338q991q755r284j0201j0750j1128j1803j2061
50114A036613j0816q556p073p035p145o026l998k404j877j837j399l92M10pj934
50099I76524m766p745j0542j2910j4405j4814j4523j4040j3576j3376j3738j4155
50087H27934j3278j0621p638o174o339o926p212p188o650n529m756n250o201o012
50073G28160m791m017l749k276Q43L541M027K969J821P70j78K26K845O179P925
50058G44295P857P446P442P585Q223J0049J2411J3674J3426J2732J2191J1467
50046H68798J0860J1430J2973J3669J2679J1569J2074J3597J4232J3392J2145
$$ y = [1250067, 1248068, 1247086, 1244975, 1240529, 1234645, 1228333, 1221081, 1212142, 1202164, 1192253, 1182228, 1171209, 1159477, 1148348, 1138369, 1128924, 1119586, 1110595, 1101840, 1092556, 1082355, 1071605, 1060477, 1048674, 1036613, 1025797, 1017241, 1010168, 1003133, 995988, 989962, 985964, 983560, 981683, 979846, 978447, 978055, 978465, 978458, 976524, 971758, 964013, 953471, 940561, 926156, 911342, 896819, 882779, 869203, 855827, 842089, 827934, 814656, 804035, 796397, 790223, 783884, 776958, 769746, 762558, 755908, 750379, 745623, 740373, 734172, 728160, 723369, 719352, 715603, 713327, 714170, 717711, 721738, 724707, 726528, 727298, 727120, 727346, 730191, 736370, 744295, 752152, 759598, 767040, 774625, 782848, 792897, 805308, 818982, 832408, 845140, 857331, 868798, 879658, 891088, 904061, 917730, 930409, 941978, 954052, 967649, 981881, 995273, 1007418]
50035A007418J1339J0674R569Q126P107P259Q563R939J0041Q607O716N546N369
50022A116273N916O994Q296R259R776J0542J2044J3591J4086J3472J2794J2913
50010A245956J3833J5280J7207J9517K1682K3093K3730K4223K5096K5969K5823
49999A481409K4265K2289K1303K1617K2385K2923K3282K3484K3054K1718J9779
49988A727508J7374J4147J0349P454O704P294O901M150j15l975o390p907r765
49975A773729j2410j4861j5846j5523j5509j6877j8786j9618j8930j7536j6195
49964A591638j5166j4707j4914j5016j3838j1332q771p166o066m468k292m16M72
49951A477958N83P16J524K949M128M033K479N07n07j51P02R24K95n41j151j883
$$ y = [1007418, 1018757, 1029431, 1039000, 1047126, 1054233, 1061492, 1070055, 1079994, 1090035, 1098642, 1105358, 1110904, 1116273, 1122189, 1129183, 1137479, 1146738, 1156514, 1167056, 1179100, 1192691, 1206777, 1220249, 1233043, 1245956, 1259789, 1275069, 1292276, 1311793, 1333475, 1356568, 1380298, 1404521, 1429617, 1455586, 1481409, 1505674, 1527963, 1549266, 1570883, 1593268, 1616191, 1639473, 1662957, 1686011, 1707729, 1727508, 1744882, 1759029, 1769378, 1776832, 1783536, 1790830, 1797731, 1801881, 1801766, 1797791, 1791401, 1783494, 1773729, 1761319, 1746458, 1730612, 1715089, 1699580, 1682703, 1663917, 1644299, 1625369, 1607833, 1591638, 1576472, 1561765, 1546851, 1531835, 1517997, 1506665, 1497894, 1490728, 1484662, 1480194, 1477902, 1477486, 1477958, 1478541, 1479257, 1480781, 1483730, 1487858, 1491891, 1494370, 1494877, 1494370, 1494219, 1494921, 1495845, 1496140, 1495599, 1494448, 1492565]
49935A492565l086m234m538m202m229m813m884l609j532M33K328M633P120R320
49921A481272J1661J4856J8326K0490K0851K0590K0753K0796J9470J6477J2741
49910A678283R546P800P572P988P971P398P039P171O854M970J326l690r906j7194
49896A723128k4901l2131l8378m3509m7381m9993n1735n2966n3478n2727n0538
49885A225391m7267m3527l9951l6936l4284l1341k7998k5127k3551k2775k1399
49874H71235j8749j5595j3178j1983j1582j1219j0391q983p216n452m099l455
49862G49333l318k894j626k73m20k358m100l409n47J963K261R72j62m70n64r50
$$ y = [1492565, 1489479, 1485245, 1480707, 1476505, 1472276, 1467463, 1462579, 1458970, 1457438, 1457871, 1460199, 1464832, 1471952, 1481272, 1492933, 1507789, 1526115, 1546605, 1567456, 1588046, 1608799, 1629595, 1649065, 1665542, 1678283, 1687829, 1695629, 1703201, 1711189, 1719160, 1726558, 1733597, 1740768, 1747622, 1752592, 1753918, 1750228, 1740322, 1723128, 1698227, 1666096, 1627718, 1584209, 1536828, 1486835, 1435100, 1382134, 1328656, 1275929, 1225391, 1178124, 1134597, 1094646, 1057710, 1023426, 992085, 964087, 938960, 915409, 892634, 871235, 852486, 836891, 823713, 811730, 800148, 788929, 778538, 769555, 762339, 756887, 752788, 749333, 746015, 743121, 741495, 741222, 740802, 738444, 734344, 730935, 730388, 732351, 734612, 735584, 735422, 734952, 734388, 733438]
$$ [...]
##END NTUPLES=NMR SPECTRUM
##END=
