
##TITLE=AC1204_BRAAS12063_7164085_X9wEiwGAoq
##JCAMPDX= 6.0         $$ Bruker NMR JCAMP-DX V2.0
##DATA TYPE= NMR SPECTRUM
##DATA CLASS= NTUPLES
##ORIGIN= BRUKER
##OWNER= Administrator
$$ 1.72 TOPSPIN		Version 2.1
$$ 2012-12-01 14:54:39.514 -0500  Administrator@X
$$ Compression mode = diff/dup
##.OBSERVE FREQUENCY= 400.02188249412
##.OBSERVE NUCLEUS= ^1H
##.ACQUISITION MODE= SIMULTANEOUS (DQD)
##.ACQUISITION SCHEME= undefined
##.AVERAGES= 64
##.DIGITISER RES= 22
##SPECTROMETER/DATA SYSTEM= spect
##.PULSE SEQUENCE= noesygpps1d.comp
##.SOLVENT NAME= COFFEE_meoh
##.SHIFT REFERENCE= INTERNAL, COFFEE_meoh, 1, 14.96233
##AUDIT TRAIL= $$ (NUMBER, WHEN, WHO, WHERE, PROCESS, VERSION, WHAT)
$$ ##TITLE= Audit trail, TOPSPIN		Version 2.1
$$ ##JCAMPDX= 5.01
$$ ##ORIGIN= Bruker BioSpin GmbH
$$ ##OWNER= Administrator
$$ $$ E:\/data/COFFEE/nmr/AC1204_BRAAS12063_7164085_X9wEiwGAoq/12/pdata/1/auditp.txt
$$ ##AUDIT TRAIL=  $$ (NUMBER, WHEN, WHO, WHERE, PROCESS, VERSION, WHAT)
(   1,<2012-12-01 14:54:33.207 -0500>,<Administrator>,<X>,<go>,<TOPSPIN 2.1>,
      <created by zg
	started at 2012-12-01 14:43:02.581 -0500,
	POWCHK enabled, PULCHK disabled,
       configuration hash MD5:
       86 BA 57 50 F2 9D 5C 9B 26 00 A9 28 5F 66 2E 89
       data hash MD5: 64K
       D6 B7 22 CD B2 11 E3 40 D3 9A 01 67 A7 B4 66 2B>)
(   2,<2012-12-01 14:54:36.464 -0500>,<Administrator>,<X>,<proc1d>,<TOPSPIN 2.1>,
      <Start of raw data processing
       efp LB = 0.3 FT_mod = 6 PKNL = 1 PHC0 = 0 PHC1 = 0 SI = 128K 
       data hash MD5: 128K
       E0 CE CC 17 F2 3F 48 A8 60 CC 8C 51 A4 9B A1 3D>)
(   3,<2012-12-01 14:54:37.644 -0500>,<Administrator>,<X>,<proc1d>,<TOPSPIN 2.1>,
      <pk PHC0 = -81.13953 PHC1 = 0 
       data hash MD5: 128K
       6B AD E0 BA 75 63 1B 45 FE FD 2D A2 4F 0A E5 41>)
(   4,<2012-12-01 14:54:38.402 -0500>,<Administrator>,<X>,<proc1d>,<TOPSPIN 2.1>,
      <abs ABSG = 1 
       data hash MD5: 128K
       8E CD C5 DA 44 A5 C8 D1 87 C1 7C 99 3D A5 8B 07>)
(   5,<2012-12-01 14:54:38.604 -0500>,<Administrator>,<X>,<proc1d>,<TOPSPIN 2.1>,
      <abs ABSG = 2 
       data hash MD5: 128K
       8B 92 C7 D8 34 D5 7B A5 70 CD 3C 48 92 15 D8 0A>)
(   6,<2012-12-01 14:54:38.789 -0500>,<Administrator>,<X>,<proc1d>,<TOPSPIN 2.1>,
      <abs ABSG = 3 
       data hash MD5: 128K
       D3 01 56 82 61 9C 64 D1 7E 6E 0B 79 A7 E1 E5 EF>)
(   7,<2012-12-01 14:54:38.991 -0500>,<Administrator>,<X>,<proc1d>,<TOPSPIN 2.1>,
      <abs ABSG = 4 
       data hash MD5: 128K
       1F 9C DA 63 BE 0B 67 E9 9D 1B BF AD ED 47 9E 3D>)
(   8,<2012-12-01 14:54:39.177 -0500>,<Administrator>,<X>,<proc1d>,<TOPSPIN 2.1>,
      <abs ABSG = 5 
       data hash MD5: 128K
       7F 05 8D 6E C0 FB 51 39 AC B6 29 8A B8 17 70 3A>)
$$ ##END=
$$ 
$$ $$ hash MD5
$$ $$ CC 69 5D 12 15 FB CE D1 95 A7 5A 6D 97 F3 74 04
##$RELAX= 
##$RELAX= 
##$RELAX= 
##$RELAX= 
##$RELAX= 
##$RELAX= 
##$RELAX= 
##$RELAX= 
$$ Bruker specific parameters
$$ --------------------------
##$DU= <E:\>
##$EXPNO= 12
$$ [...]
##$TP07= 0
##$TPNAME0= <>
##$TPNAME1= <>
##$TPNAME2= <>
##$TPNAME3= <>
##$TPNAME4= <>
##$TPNAME5= <>
##$TPNAME6= <>
##$TPNAME7= <>
##$TPOAL= (0..7)
0.5 0.5 0.5 0.5 0.5 0.5 0.5 0.5
##$TPOFFS= (0..7)
0 0 0 0 0 0 0 0
##$TUNHIN= 0
##$TUNHOUT= 0
##$TUNXOUT= 0
##$USERA1= <user>
##$USERA2= <user>
##$USERA3= <user>
##$USERA4= <user>
##$USERA5= <user>
##$V9= 5
##$VALIST= <valist>
##$VCLIST= <CCCCCCCCCCCCCCC>
##$VD= 0
##$VDLIST= <DDDDDDDDDDDDDDD>
##$VPLIST= <PPPPPPPPPPPPPPP>
##$VTLIST= <TTTTTTTTTTTTTTT>
##$WBST= 1024
##$WBSW= 4
##$XGAIN= (0..3)
0 0 0 0
##$XL= 0
##$YL= 0
##$YMAX_a= 8301345
##$YMIN_a= -17875315
##$ZGOPTNS= <>
##$ZL1= 120
##$ZL2= 120
##$ZL3= 120
##$ZL4= 120
##$ABSF1= 14.96233
##$ABSF2= -5.595852
##$ABSG= 5
##$ABSL= 3
##$ALPHA= 0
##$AQORDER= 0
##$ASSFAC= 0
##$ASSFACI= 0
##$ASSFACX= 0
##$ASSWID= 0
##$AUNMP= <proc_prof1d_extract.lims>
##$AXLEFT= 0
##$AXNAME= <>
##$AXNUC= <1H>
##$AXRIGHT= 0
##$AXTYPE= 0
##$AXUNIT= <>
##$AZFE= 0.1
##$AZFW= 0.1
##$BCFW= 0
##$BC_mod= 0
##$BYTORDP= 0
##$COROFFS= 0
##$CY= 15
##$DATMOD= 1
##$DC= 0
##$DFILT= <>
##$DTYPP= 0
##$F1P= 0
##$F2P= 0
##$FCOR= 0.5
##$FTSIZE= 131072
##$FT_mod= 6
##$GAMMA= 0
##$GB= 0
##$INTBC= 1
##$INTSCL= 1
##$ISEN= 128
##$LB= 0.3
##$LEV0= 0
##$LPBIN= 0
##$MAXI= 10000
##$MC2= 0
##$MEAN= 0
##$ME_mod= 0
##$MI= 0
##$NCOEF= 0
##$NC_proc= -2
##$NLEV= 6
##$NOISF1= 0
##$NOISF2= 0
##$NSP= 0
##$NTH_PI= 0
##$NZP= 0
##$OFFSET= 14.96233
##$PC= 1
##$PHC0= -81.13953
##$PHC1= 0
##$PH_mod= 1
##$PKNL= yes
##$PPARMOD= 0
##$PPDIAG= 0
##$PPIPTYP= 0
##$PPMPNUM= 2147483647
##$PPRESOL= 1
##$PSCAL= 4
##$PSIGN= 0
##$PYNMP= <proc.py>
##$REVERSE= no
##$SF= 400.020009103429
##$SI= 131072
##$SIGF1= 0
##$SIGF2= 0
##$SINO= 400
##$SIOLD= 131072
##$SPECTYP= <>
##$SREGLST= <1H.CDCl3>
##$SSB= 0
##$STSI= 131072
##$STSR= 0
##$SW_p= 8223.68421052631
##$SYMM= 0
##$S_DEV= 0
##$TDeff= 65536
##$TDoff= 0
##$TI= <>
##$TILT= no
##$TM1= 0
##$TM2= 0
##$TOPLEV= 0
##$USERP1= <user>
##$USERP2= <user>
##$USERP3= <user>
##$USERP4= <user>
##$USERP5= <user>
##$WDW= 1
##$XDIM= 131072
##$YMAX_p= 463787295
##$YMIN_p= -14276
##$CURPLOT= <Network HP LaserJet P1505>
##$CURPRIN= <$Network HP LaserJet P1505>
##$DFORMAT= <normdp>
##$LAYOUT= <+/1D_H.xwp>
##$LFORMAT= <normlp>
##$PFORMAT= <normpl>
##$SURQMSG= 1
$$ End of Bruker specific parameters
$$ ---------------------------------
##NTUPLES= NMR SPECTRUM
##VAR_NAME=  FREQUENCY,     SPECTRUM/REAL,   SPECTRUM/IMAG
##SYMBOL=    X,             R,               I
##VAR_TYPE=  INDEPENDENT,   DEPENDENT,       DEPENDENT
##VAR_FORM=  AFFN,          ASDF,            ASDF
##VAR_DIM=   131072,        131072,          131072
##UNITS=     HZ,            ARBITRARY UNITS, ARBITRARY UNITS
##FACTOR=    0.0627417313425164, 1,          1
##FIRST=     8223.62146879497, 4374,         -65386
##LAST=      0,             5687,            -65784
##MIN=       0,             -14276,          0
##MAX=       8223.62146879497, 463787295,    0
$$ Real data points
##PAGE= N=1
##DATA TABLE= (X++(R..R)), XYDATA
$$ [...]
63229E38788K2339K3633K4213K4452K5127K5915K5651K4100K2405K1640K1732
$$ 538788 561127 584760 608973 633425 658552 684467 710118 734218 756623 778263 799995
63218G99995K1952K1835K1417K1039K1001K1151K1003K0346J9258J7301J3490
$$ 799995 821947 843782 865199 886238 907239 928390 949393 969739 988997 1006298 1019788
63207A019788P758J569l719q522j3975j9903k4949k8399l0576l1672l1385k9811
$$ 1019788 1027546 1029115 1025396 1016874 1002899 982996 958047 929648 899072 867400 836015 806204
63195H06204k7645k5297k2690j9924j7282j4505j0962o725k663P28L864P191J0452
$$ 806204 778559 753262 730572 710648 693366 678861 667899 661174 658511 659239 663103 670294 680746
63182F80746J3164J5330J7330J9371K1215K2412K2795K2886K3498K4758K5873
$$ 680746 693910 709240 726570 745941 767156 789568 812363 835249 858747 883505 909378
63171I09378K6150K5807K5337K4679K3557K2186K0863J9273J6896J3794J0280
$$ 909378 935528 961335 986672 1011351 1034908 1057094 1077957 1097230 1114126 1127920 1138200
63160A138200O169J085m713j0592j6305k1792k6554k9982l2146l3523l4222l4155
$$ 1138200 1144369 1145454 1140741 1130149 1113844 1092052 1065498 1035516 1003370 969847 935625 901470
63148I01470l3584l2725l1168k8573k5535k2884k0479j7798j5319j4078j3937
$$ 901470 867886 835161 803993 775420 749885 727001 706522 688724 673405 659327 645390
63137F45390j3541j2153j0336q743p328n955m781l688k302q79k15l69l79L14J048
$$ 645390 631849 619696 609360 600617 593289 587334 582553 578865 576563 575684 575469 575100 574721 575035 576083
63122E76083J033N60N11J174K045K524K450K218K498L550M787N444N573N836O295
$$ 576083 577116 577676 578187 579361 581406 583930 586380 588598 591096 594646 599433 604877 610450 616286 622581
63107F22581O218N227L970L325L426L839M245M591M841M899M725M417M149L978
$$ 622581 628799 634026 637996 641321 644747 648586 652831 657422 662263 667162 671887 676304 680453 684431
63093F84431L625K745J503M88q5n27q23m15O12J015j8j438j560k82J088J842K510
$$ 684431 688056 690801 692304 692792 692707 692180 691357 690942 691554 692569 692551 691113 689553 689271 690359 692201 694711
63076F94711L585M837N960O835P179O880O684P492R019J0181J0845J1897J3549
$$ 694711 698296 703133 709093 715928 723107 729987 736671 744163 753182 763363 774208 786105 799654
63063G99654J4860J5324J5676J6650J8093J9783K2063K4910K7409K8977L0395
$$ 799654 814514 829838 845514 862164 880257 900040 922103 947013 974422 1003399 1033794
63052A033794L2786L6117L9410M2019M4028M5712M7148M8255M8859M8909M8630
$$ 1033794 1066580 1102697 1142107 1184126 1228154 1273866 1321014 1369269 1418128 1467037 1515667
63041A515667M8249M7541M6182M4478M3191M2578M2249M2059M2451M3650M5139
$$ 1515667 1563916 1611457 1657639 1702117 1745308 1787886 1830135 1872194 1914645 1958295 2003434
63030B003434M6067M5726M3538L9254L3311K6392J8549R322j260j2470k3654l4411
$$ 2003434 2049501 2095227 2138765 2178019 2211330 2237722 2256271 2265593 2264333 2251863 2228209 2193798
63018B193798m4014n1610n7129o1143o3667o3995o1953n8420n4232m9363m3492
$$ 2193798 2149784 2098174 2041045 1979902 1916235 1852240 1790287 1731867 1677635 1628272 1584780
63007A584780l6603k8864k0672j2978o627j151M754J1376J7647K2944K7895L2883
$$ 1584780 1548177 1519313 1498641 1485663 1479036 1477885 1482639 1494015 1511662 1534606 1562501 1595384
62995A595384L7014L9457M0747M1835M2748M3055M2941M2821M2562M1911M1133
$$ 1595384 1632398 1671855 1712602 1754437 1797185 1840240 1883181 1926002 1968564 2010475 2051608
62984B051608M0392L8961L5877L1019K4887J7786R746Q04r213k0529l2560m3802
$$ 2051608 2092000 2130961 2166838 2197857 2222744 2240530 2250276 2251080 2241867 2221338 2188778 2144976
62972B144976n3228o1142o8069p3624p7274p9374q0421p9882p6960p2133o6925
$$ 2144976 2091748 2030606 1962537 1888913 1811639 1732265 1651844 1571962 1495002 1422869 1355944
62961A355944o2267n7951n3504m8807m4004l9470l5708l2677k9611k6113k2885
$$ 1355944 1293677 1235726 1182222 1133415 1089411 1049941 1014233 981556 951945 925832 902947
62950I02947k0687j9023j6870j4262j2111j0732r643q691q240q175p802o993o471
$$ 902947 882260 863237 846367 832105 819994 809262 799619 790928 782688 774513 766711 759718 753247
62937G53247o683p157p277p041o766o667o909p564q241q393q112q069q369q211
$$ 753247 746564 739407 732130 725089 718323 711656 704747 697183 688942 680549 672437 664368 655999 647788
62923F47788p090n715n177n533n901n655m968m264l693l266l055l028k969k791
$$ 647788 640698 634983 629806 624273 618372 612717 607749 603485 599792 596526 593471 590443 587474 584683
62909E84683k739l001l355l459l414l588l846l510k321j001l74l48k88j15k69
$$ 584683 581944 578943 575588 572129 568715 565127 561281 557771 555450 554449 554075 553727 553439 553324 553055
62894E53055o94o95k0O74P34K98j76n95j056j457j723k067k571k854k570k051
$$ 553055 552361 551666 551646 552320 553054 553352 553176 552581 551525 550068 548345 546278 543707 540853 538283 536232
62878E36232j923k237k373j837q89k62l28o73n99o1J53m59j259j222l59L34K17
$$ 536232 534309 532072 529699 527862 526973 526711 526383 525710 525111 525050 525203 524744 523485 522263 521904 522238 522455
62861E22455m22j167k012k842l233l092k877k839k660k160j645j307r91r02j652
$$ 522455 522033 520866 518854 516012 512779 509687 506810 503971 501311 499151 497506 496199 495208 494306 492654
62846D92654l080l939l490k558k197k125j499n82l40p20p08n4K89k77j083j286
$$ 492654 489574 485635 482145 479587 477390 475265 473766 473184 472844 472124 471416 471362 471651 471374 470291 469005
62830D69005j084j260j966k545k361j457m75l7k09n20n72m99o86j141j434j219
$$ 469005 467921 466661 464695 462150 459789 458332 457857 457820 457611 457091 456519 456020 455334 454193 452759 451540
62814D51540o69l36n54j007r80k69M11K99k45m4J313K971M072M758N472O016O030
$$ 451540 450871 450535 449981 448974 447994 447725 448136 448435 448190 448146 449459 452430 456502 461260 466732 472748 478778
62797D78778N924O484P773R071R869J0338J0945J2093J4003J6459J8680K0001
$$ 478778 484702 491186 498959 508030 517899 528237 539182 551275 565278 581737 600417 620418
62785F20418K0633K1471K3136K5534K8263L1025L3760L6721M0446M5302N1026
$$ 620418 641051 662522 685658 711192 739455 770480 804240 840961 881407 926709 977735
62774I77735N6975O2758O8404P3912P8899Q2760Q5090Q5939Q5557Q3797P9816
$$ 977735 1034710 1097468 1165872 1239784 1318683 1401443 1486533 1572472 1658029 1741826 1821642
62763A821642P2711O2465M9996L6259K1679O528q674k3365l7172m9659o0269o8702
$$ 1821642 1894353 1956818 2006814 2043073 2064752 2071280 2062606 2039241 2002069 1952410 1892141 1823439
62751A823439p5047p9396q1719q2289q1671q0085p7258p3199o8588o4084n9758
$$ 1823439 1748392 1668996 1587277 1504988 1423317 1343232 1265974 1192775 1124187 1060103 1000345
62740A000345n5496n1438m7603m3712l9744l6143l3024k9774k6022k2436j9884
$$ 1000345 944849 893411 845808 802096 762352 726209 693185 663411 637389 614953 595069
62729E95069j8257j6788j5140j3498j1882j0101q251o625n288m169l365k897k384
$$ 595069 576812 560024 544884 531386 519504 509403 501152 494527 489239 485070 481705 478808 476424
62716D76424j454j87J201K732M298N403N924O657Q386J0668J2426J3562J5085
$$ 476424 474970 474783 475984 478716 483014 488417 494341 500998 509384 520052 532478 546040 561125
62703E61125J7638K0659K3341K5798K8862L2974L7614M1869M5556M9512N4586
$$ 561125 578763 599422 622763 648561 677423 710397 748011 789880 835436 884948 939534
62692I39534O0503O6209P1230P5970Q0534Q4117Q5884Q5610Q3046P7548O9072
$$ 939534 1000037 1066246 1137476 1213446 1293980 1378097 1463981 1549591 1632637 1710185 1779257
62681A779257N8642M7044L3811J8457K101j3442k7648m1174n3988o4877p2826
$$ 1779257 1837899 1884943 1918754 1937211 1939312 1925870 1898222 1857048 1803060 1738183 1665357
62670A665357p7865q0501q1234q0765p9739p7986p4791p0049o4571n9164n4140
$$ 1665357 1587492 1506991 1425757 1344992 1265253 1187267 1112476 1042427 977856 918692 864552
62659H64552m9705m6010m2615l8712l4270l0305k7613k5695k3465k0602j7870
$$ 864552 814847 768837 726222 687510 653240 622935 595322 569627 546162 525560 507690
62648E07690j6113j5332j4731j3591j2006j0641r850r365q845q321p857p333o842
$$ 507690 491577 476245 461514 447923 435917 425276 415426 406061 397216 388895 381038 373705 366863
62635C66863o734o855o368m954l580l363m038m449m166l706l371k815j853q71
$$ 366863 360129 353274 346906 341952 338372 335009 330971 326522 322356 318650 315279 312464 310611 309740
62621C09740l20l18p15j116r53j28O70Q44P95J243K005K355K330K650L363L717
$$ 309740 309420 309102 308387 307271 306318 306190 306860 307704 308499 309742 311747 314102 316432 319082 322445 326162
62605C26162L525L636M655O036O984P563Q403R770J1398J3006J4577J6288J8333
$$ 326162 329687 333323 337978 344014 350998 358561 366964 376734 388132 401138 415715 432003 450336
62592D50336K0798K3688K7068L0939L4838L7970M0116M1959M4014M5612M5599
$$ 450336 471134 494822 521890 552829 587667 625637 665753 707712 751726 797338 842937
62581H42937M3701M0483L6239L0778K4153J6796Q990Q66p122j4432k1033k7039
$$ 842937 886638 927121 963360 994138 1018291 1035087 1044077 1044943 1037821 1023389 1002356 975317
62569I75317l1923l4946l6319l7042l7578l7520l6626l5209l3331l0627k7271
$$ 975317 943394 908448 872129 835087 797509 759989 723363 688154 654823 624196 596925
62558E96925k4275k2314k0930j9307j7275j5205j3448j2281j1854j1798j1328
$$ 596925 572650 550336 529406 510099 492824 477619 464171 451890 440036 428238 416910
62547D16910j0147q903q394q599q752q236p143o134n781n937n762m642k964j631
$$ 416910 406763 397860 389466 380867 372115 363879 356736 350602 344821 338884 333122 328480 325516 323885
62533C23885j023p89m92L7Q77K038L280M344N282O194O816O938P039P928R713
$$ 323885 322862 322073 321581 321618 322495 324533 327813 332157 337439 343633 350449 357387 364426 372354 382067
62518C82067J1699J3295J4555J5843J7417J9411K1801K4411K7198L0264L3444
$$ 382067 393766 407061 421616 437459 454876 474287 496088 520499 547697 577961 611405
62507F11405L6302L8885M1876M5354M8093M8847M7816M5854M2828L7901L1075
$$ 611405 647707 686592 728468 773822 821915 870762 918578 964432 1007260 1045161 1076236
62496A076236K3162J4431M688n360j4187k1221k7363l3367l8657m2117m3252m2389
$$ 1076236 1099398 1113829 1118517 1113157 1098970 1077749 1050386 1017019 978362 936245 892993 850604
62484H50604m0482l8830l8066l7298l5153l1669k8175k5346k2598j9600j7019
$$ 850604 810122 771292 733226 695928 660775 629106 600931 575585 552987 533387 516368
62473E16368j5261j3729j1929j0277r145q074o627n150m052l080j973j058o05
$$ 516368 501107 487378 475449 465172 456027 447953 441326 436176 432124 429044 427071 426013 425408
62460D25408k34L99J035J476K067L009L825M249M855O092P330P698P468P688Q686
$$ 425408 425174 425573 426608 428084 430151 433160 436985 441234 446089 452181 459511 467209 474677 482365 491051
62445D91051R702R942R384Q485P532O337M545K142m12k771n210q075j0924j2854
$$ 491051 500753 510695 520079 528564 536096 542433 546978 549120 548708 545937 540727 532652 521728 508874
62431E08874j3664j3963j4109j3809j2954j2015j1313j0510r241p633o019m668
$$ 508874 495210 481247 467138 453329 440375 428360 417047 406537 397296 389663 383644 378976
62419C78976l923l951m170l621k174o67L31J121J989K652K973L518M803O480P730
$$ 378976 375053 371102 366932 363311 361137 360470 360801 361922 363911 366563 369536 373054 377857 384337 392067
62404C92067Q080P653P043P069Q026R094R092P914O537N640N030M340L409J855
$$ 392067 400147 407800 414843 421912 429938 439032 448124 456038 462575 468215 473245 477585 480994 482849
62390D82849n42k964m163m252m633n832o668o191n122m605m553m137l048j487
$$ 482849 482307 479343 475180 470928 466295 460463 453795 447604 442482 437877 433324 429187 426139 424652
62376D24652L37K056L220M115N725Q324J0999J3086J5074J7486J9967K2301K5237
$$ 424652 424989 427045 430265 434380 440105 448429 459428 472514 487588 505074 525041 547342 572579
62363E72579K9368L4041L8364M2363M6238M9416N1423N2907N4535N5550N4560
$$ 572579 601947 635988 674352 716715 762953 812369 863792 916699 971234 1026784 1081344
62352A081344N1221M6050L9212L0638K1010J1473K614n438j2329j7839k2586k7326
$$ 1081344 1132565 1178615 1217827 1248465 1269475 1280948 1283562 1278124 1265795 1247956 1225370 1198044
62340A198044l1912l5725l8756m1346m3157m3437m2027l9379l5896l2012k8541
$$ 1198044 1166132 1130407 1091651 1050305 1007148 963711 921684 882305 846409 814397 785856
62329G85856k6044k4168k2393k1011k0461k0145j8980j6891j4762j3110j1780
$$ 785856 759812 735644 713251 692240 671779 651634 632654 615763 601001 587891 576111
62318E76111j0754j0163r528q009n607l315j886j111m15L93J141J521J260L86
$$ 576111 565357 555194 545666 537657 532050 528735 526849 525738 525323 525716 526857 528378 529638 530024
62304E30024o73j555k370l341m349n138n717o119o170n831n422n099m539l574
$$ 530024 529351 527796 525426 522085 517736 512598 506881 500762 494592 488761 483339 478240 473701 470127
62290D70127k612j965j254p1J277K227K714K922K808K455K394K927L689M418N510
$$ 470127 467515 465550 464296 464225 465502 467729 470443 473365 476173 478628 481022 483949 487638 492056 497566
62275D97566P135Q486Q835Q724R254J0532J1781J2585J3189J3903J4990J6821
$$ 497566 504701 513187 522022 530746 540000 550532 562313 574898 588087 601990 616980 633801
62263F33801J9339K1813K3876K6362L0285L5335M0302M4646M8704N2552N5519
$$ 633801 653140 674953 698829 725191 755476 790811 831113 875759 924463 977015 1032534
62252A032534N6769N5750N2256M6550L9141L0073J9019O623n114j4588k2000k8298
$$ 1032534 1089303 1145053 1197309 1243859 1283000 1313073 1332092 1338715 1333601 1319013 1297013 1268715
62240A268715l3546l7430m0462m3311m5491m6036m5035m3266m0803l7360l3559
$$ 1268715 1235169 1197739 1157277 1113966 1068475 1022439 977404 934138 893335 855975 822416
62229H22416l0364k7564k4226k0429j7074j4168j0968p788n952n679n638m973
$$ 822416 792052 764488 740262 719833 702759 688591 677623 669835 663883 658204 652566 647593
62217F47593m315m153l720k392r54m70o94o24q4K06n0j69O66K361L962M704M882
$$ 647593 643278 639125 635405 633013 632059 631589 630895 630271 630187 630393 630343 630174 630840 633201 637163 641867 646749
62200F46749N408O514P486P955Q758J0773J3500J5670J6979J8295K0264K2568
$$ 646749 652157 658671 666157 674112 682870 693643 707143 722813 739792 758087 778351 800919
62188H00919K4566K6034K7210K8519L0080L1159L0573K8000K4379K0478J5991
$$ 800919 825485 851519 878729 907248 937328 968487 999060 1027060 1051439 1071917 1087908
62177A087908J0798O186L479K186Q90l43l0K433N929R250J2414J6097K0597K5504
$$ 1087908 1098706 1104892 1108371 1110557 1111447 1111104 1111074 1113507 1119436 1128686 1141100 1157197 1177794 1203298
62163A203298K9729L2077L2290L1146K8910K4599J7860J0565N028J273k159n412
$$ 1203298 1233027 1265104 1297394 1328540 1357450 1382049 1399909 1410474 1415502 1416775 1414616 1409204
62151A409204p394q447j0490j4109j7510j9130j9526j9875k0033j9108j6804j3484
$$ 1409204 1401810 1393363 1382873 1368764 1351254 1332124 1312598 1292723 1272690 1253582 1236778 1223294
62139A223294r819o850n398m955m101k475j225j162j630j662j213n83L35J648
$$ 1223294 1213475 1206625 1201227 1196272 1192171 1189696 1188471 1187309 1185679 1184017 1182804 1182221 1182556 1184204
62125A184204L130M744O667Q548R698J0369J1770J4334J7000J8721J9705K0650
$$ 1184204 1187334 1192078 1198745 1207293 1216991 1227360 1239130 1253464 1270464 1289185 1308890 1329540
62113A329540K1694K2703K3727K4689K5283K5589K6040K6580K6732K6702K7316
$$ 1329540 1351234 1373937 1397664 1422353 1447636 1473225 1499265 1525845 1552577 1579279 1606595
62102A606595K8673K9969L1013L2617L5059L7377L8928M0429M2664M5068M6403
$$ 1606595 1635268 1665237 1696250 1728867 1763926 1801303 1840231 1880660 1923324 1968392 2014795
62091B014795M6086M4275M1564L9106L8208L9078M0746M2610M5030M7871M9632
$$ 2014795 2060881 2105156 2146720 2185826 2224034 2263112 2303858 2346468 2391498 2439369 2489001
62080B489001M9006M6534M3914M2289M1808M2099M2479M2338M1898M1955M2583
$$ 2489001 2538007 2584541 2628455 2670744 2712552 2754651 2797130 2839468 2881366 2923321 2965904
62069B965904M3044M3301M4404M6605M8376M8316M7106M6337M6176M5365M3148
$$ 2965904 3008948 3052249 3096653 3143258 3191634 3239950 3287056 3333393 3379569 3424934 3468082
62058C468082M0015L6715L3416K9878K5941K1910J8602J6662J5666J4425J2347
$$ 3468082 3508097 3544812 3578228 3608106 3634047 3655957 3674559 3691221 3706887 3721312 3733659
62047C733659R867P364M609J610q95k331k918k990k537j820j527j797j958j736
$$ 3733659 3743526 3750890 3755499 3757109 3756214 3753883 3750965 3747975 3745438 3743618 3742091 3740294 3738336 3736600
62033C736600j771k400k966k961k901l378m179n080o495q490j0151j0835j1189
$$ 3736600 3734829 3732429 3729463 3726502 3723601 3720223 3716044 3710964 3704469 3695979 3685828 3674993 3663804
62020C663804j2003j2900j3129j2841j2524j1897j0423q353o289m193j700J097
$$ 3663804 3651801 3638901 3625772 3612931 3600407 3588510 3578087 3569734 3563445 3559252 3557552 3558649
62008C558649L969P076J0439J3457J5773J7977K0655K3441K5745K7687K9393L0127
$$ 3558649 3562618 3569694 3580133 3593590 3609363 3627340 3647995 3671436 3697181 3724868 3754261 3784388
61996C784388K9046K6262K2135J6320Q451p20r932j8592k6473l2880l7255m0082
$$ 3784388 3813434 3839696 3861831 3878151 3886602 3885882 3875950 3857358 3830885 3798005 3760750 3720668
61984C720668m2150m3382m3412m2822m2625m2890m2871m2290m1482m0624l9710
$$ 3720668 3678518 3635136 3591724 3548902 3506277 3463387 3420516 3378226 3336744 3296120 3256410
61973C256410l8993l8639l8236l7474l6853l6837l6861l6101l4718l3436l2370
$$ 3256410 3217417 3178778 3140542 3103068 3066215 3029378 2992517 2956416 2921698 2888262 2855892
61962B855892l1261l0249k9387k7981k5576k3055k1479k0372j8536j6130j4382
$$ 2855892 2824631 2794382 2764995 2737014 2711438 2688383 2666904 2646532 2627996 2611866 2597484
61951B597484j3452j2111r681o835m286j907N82L176O023R316J2601J5163J7153
$$ 2597484 2584032 2571921 2562240 2555405 2551119 2549212 2549794 2552970 2558993 2568309 2580910 2596073 2613226
61938B613226J9290K1346K2194K1597K0800K0835K1242K1070K0286J9550J9060
$$ 2613226 2632516 2653862 2676056 2697653 2718453 2739288 2760530 2781600 2801886 2821436 2840496
61927B840496J8274J6585J3984J1248R544R584J1242J4193J8608K4797L2504M1267
$$ 2840496 2858770 2875355 2889339 2900587 2910131 2919715 2930957 2945150 2963758 2988555 3021059 3062326
61915C062326N1229O2914P6379R1255J07391J24781J43132J62346J83210K06740
$$ 3062326 3113555 3176469 3252848 3344103 3451494 3576275 3719407 3881753 4064963 4271703
61905D271703K33082K62097K94832L33165L77739M27423M81078N38584N99156
$$ 4271703 4504785 4766882 5061714 5394879 5772618 6200041 6681119 7219703 7818859
61896G818859O59159P12136P50250P64847P46142O84219N72450M11813K13166
$$ 7818859 8478018 9190154 9940404 10705251 11451393 12135612 12708062 13119875 13333041
61887A3333041m450k18778m09839n63650o73727p40642p69740p68055p42611p00539
$$ 13333041 13328591 13109813 12699974 12136324 11462597 10721955 9952215 9184160 8441549 7741010
61877G741010o49030n93799n37994m83342m31709l84679l42260l03473k68123
$$ 7741010 7091980 6498181 5960187 5476845 5045136 4660457 4318197 4014724 3746601
61868C746601k36956k10119j86604j65378j46079j28489j12213r7282q4186p2908
$$ 3746601 3509645 3299526 3112922 2947544 2801465 2672976 2560763 2463481 2379295 2306387
61858B306387o2465n1832m0983l0710k1663j3698o071J655Q869J4408J7988K0522
$$ 2306387 2243922 2192090 2151107 2120397 2098734 2085036 2078965 2080620 2089489 2103897 2121885 2142407
61846B142407K2596K3343K1592J7453J1935N543j555q408j3717j7268j9718k0913
$$ 2142407 2165003 2188346 2209938 2227391 2239326 2244869 2243314 2234906 2221189 2203921 2184203 2163290
61834B163290j9733j5859j0505n004L66N725J0719J4815J7695J8821J7342J3039
$$ 2163290 2143557 2127698 2117193 2112189 2112555 2118280 2128999 2143814 2161509 2180330 2197672 2210711
61822B210711O815k23p774j5905k4094l1311l6864m0686m2887m3335m1854l8663
$$ 2210711 2217526 2217303 2209529 2193624 2169530 2138219 2101355 2060669 2017782 1974447 1932593 1893930
61810A893930l4521l0226k5953k1267j5886j0071m109K112Q584J4725K0039K4875
$$ 1893930 1859409 1829183 1803230 1781963 1766077 1756006 1751897 1754009 1762593 1777318 1797357 1822232
61798A822232K9896L5141M0327M5823N2390N9940O7426P4182Q0717Q7937R6126
$$ 1822232 1852128 1887269 1927596 1973419 2025809 2085749 2153175 2227357 2308074 2396011 2492137
61787B492137J05116J14997J26279J39388J54324J70950J89706K11751K38064
$$ 2492137 2597253 2712250 2838529 2977917 3132241 3303191 3492897 3704648 3942712
61778C942712K68565L02721L41027L85164M36544M95677N63200O40353P27579
$$ 3942712 4211277 4513998 4855025 5240189 5676733 6172410 6735610 7375963 8103542
61769H103542Q23535R26223J033942J143609J248437J338060J399993J419469
$$ 8103542 8927077 9853300 10887242 12030851 13279288 14617348 16017341 17436810
61761A7436810J378902J260871J054987P64260M07465J6740l69055p13724r91748
$$ 17436810 18815712 20076583 21131570 21895830 22303295 22320035 21950980 21237256 20245508
61752B0245508j191097j311476j361268j354439j306616j231550j140133j041281
$$ 20245508 19054411 17742935 16381667 15027228 13720612 12489062 11348929 10307648
61744A0307648r41962q46387p56517o73698n99021n32431m72945m19957l73435
$$ 10307648 9365686 8519299 7762782 7089084 6490063 5957632 5484687 5064730 4691295
61735D691295l32766k96669k64401k35942k10839j87959j66678j47273j29907
$$ 4691295 4358529 4061860 3797459 3561517 3350678 3162719 2996041 2848768 2718861
61726B718861j14236j00326q8912q0399p4319p0008o6996o4665o2470o0571n9332
$$ 2718861 2604625 2504299 2415387 2334988 2260669 2190661 2123665 2059000 1996530 1935959 1876627
61715A876627n8106n5629n1817m8105m5612m3885m1822l8919l5366l1715k8711
$$ 1876627 1818521 1762892 1711075 1662970 1617358 1573473 1531651 1492732 1457366 1425651 1396940
61704A396940k6700k5039k2908k0653j9379j9210j9090j8422j7690j7323j7155
$$ 1396940 1370240 1345201 1322293 1301640 1282261 1263051 1243961 1225539 1207849 1190526 1173371
61693A173371j7210j7781j8344j7765j5992j4361j3673j3289j2607j2098j2094
$$ 1173371 1156161 1138380 1120036 1102271 1086279 1071918 1058245 1044956 1032349 1020251 1008157
61682A008157j1898j0979r940r353q622p080n336m453m441m517m349m147l974
$$ 1008157 996259 985280 975340 965987 957365 950285 944949 940496 936055 931538 927189 923042 919068
61669I19068l742l513l250k712k058j978k705l558l960m248m893n556n598m964
$$ 919068 915326 911813 908563 905851 903793 901815 899110 895552 891592 887344 882451 876895 871297 866333
61655H66333m043l172k669k689k580j222J384L655M296L896L854M421M664L932
$$ 866333 862290 859118 856449 853760 851180 849958 851342 854997 859293 863189 867043 871464 876128 880060
61641H80060K471R57P1K40J181J981K150K245L029M480O070P534Q932J0422J2334
$$ 880060 882531 883488 883559 883799 884980 886961 889111 891356 894385 898865 904935 912469 921401 931823 944157
61626I44157J4819J7034J7453J5540J2399R168N617J188l536p474j0603j3579
$$ 944157 958976 976010 993463 1009003 1021402 1030570 1036187 1037375 1033839 1026365 1015762 1002183
61614A002183j6210j7471j7110j6143j5546j5290j4918j4370j3858j3412j2889
$$ 1002183 985973 968502 951392 935249 919703 904413 889495 875125 861267 847855 834966
61603H34966j2258j1639j1110j0611j0034r347q595p708o542n244m300l930l709
$$ 834966 822708 811069 799959 789348 779314 769967 761372 753664 747122 741878 737578 733648 729939
61590G29939l232k789k713k419j022J225L100M023M583N318O053O681P564Q796
$$ 729939 726707 723918 721205 718786 717764 718989 722089 726112 730695 736013 742066 748747 756311 765107
61576G65107J0023J1298J3151J5465J7325J8384J9381K0808K2279K3721K5915
$$ 765107 775130 786428 799579 815044 832369 850753 870134 890942 913221 936942 962857
61565I62857K8927L1227L1556L0779L0613L1207L1246L0030K8276K6974K6386
$$ 962857 991784 1023011 1054567 1085346 1115959 1147166 1178412 1208442 1236718 1263692 1290078
61554A290078K6148K5696K4707K3547K2897K2651K1800J9844J7556J5625J3422
$$ 1290078 1316226 1341922 1366629 1390176 1413073 1435724 1457524 1477368 1494924 1510549 1523971
61543A523971J0007N738J719j869n799j0353j4878j8774k1962k4304k5336k4823
$$ 1523971 1533978 1539716 1541435 1539566 1533767 1523414 1508536 1489762 1467800 1443496 1418160 1393337
61531A393337k3168k1117j9246j7634j5800j3187r910o790m349k162N68M093Q036
$$ 1393337 1370169 1349052 1329806 1312172 1296372 1283185 1273275 1266485 1262136 1259974 1260542 1264635 1272671
61518A272671J1899J5502J9231K3823K9485L5386M0700M5974N2531O0684O9753
$$ 1272671 1284570 1300072 1319303 1343126 1372611 1407997 1448697 1494671 1547202 1607886 1677639
61507A677639P9771R1611J05100J18737J32124J47049J64921J84563K03828K22143
$$ 1677639 1757410 1849021 1954121 2072858 2204982 2352031 2516952 2701515 2905343 3127486
61497C127486K39811K55633K66935K71391K67263K52406K24905J85052J35775
$$ 3127486 3367297 3622930 3889865 4161256 4428519 4680925 4905830 5090882 5226657
61488E226657Q1085K4948k8761p6670j16676j47981j70508j84883j92392j94159
$$ 5226657 5307742 5332690 5303929 5227259 5110583 4962602 4792094 4607211 4414819 4220660
61478D220660j90602j82350j71052j58432j44980j30525j15578j01066q7121p3236
$$ 4220660 4030058 3847708 3676656 3518224 3373244 3242719 3127141 3026075 2938954 2865718
61468B865718n9417m6239l3917k2194j0973k67J0125K0206K9361L7107M3754M9653
$$ 2865718 2806301 2760062 2726145 2703951 2692978 2692711 2702836 2723042 2752403 2789510 2833264 2882917
61456B882917N4357N7417N9323O0578O0531N8408N5094N2466N1165N0302M9233
$$ 2882917 2937274 2994691 3054014 3114592 3175123 3233531 3288625 3341091 3392256 3442558 3491791
61445C491791M8313M7933M7959M8269M8798M9045M8482M7371M6252M4745M1977
$$ 3491791 3540104 3588037 3635996 3684265 3733063 3782108 3830590 3877961 3924213 3968958 4010935
61434D010935L8054L4003L0264K6330K1889J7149J1886N402k195r741j6388k2498
$$ 4010935 4048989 4082992 4113256 4139586 4161475 4178624 4190510 4195912 4193717 4183976 4167588 4145090
61422D145090k8748l5036m0542m4383m6122m6030m4891m3112m0259l6009l1045
$$ 4145090 4116342 4081306 4040764 3996381 3950259 3904229 3859338 3816226 3775967 3739958 3708913
61411C708913k6259k1485j6080j0444n823k654k92J556K131O83k691p305j2362
$$ 3708913 3682654 3661169 3645089 3634645 3628822 3626168 3625876 3627432 3629563 3630246 3627555 3620250 3607888
61398C607888j7091k1057k4354k6904k7928k6828k4076k0248j4645o166M819J6905
$$ 3607888 3590797 3569740 3545386 3518482 3490554 3463726 3439650 3419402 3404757 3398591 3403410 3420315
61386C420315K9806M4547O1506P9848R9165J20036J42437J65034J86901K08720
$$ 3420315 3450121 3494668 3556174 3636022 3735187 3855223 3997660 4162694 4349595 4558315
61376D558315K31290K53666K73478K88369K96451K96084K86003K65459K33874
$$ 4558315 4789605 5043271 5316749 5605118 5901569 6197653 6483656 6749115 6982989
61367F982989J91175J39070Q1652K4199k8811p4961j14101j47531j76399k00691
$$ 6982989 7174164 7313234 7394886 7419085 7390274 7315313 7201212 7053681 6877282 6676591
61357F676591k19934k34441k44908k51153k52421k49005k42385k33640k22897
$$ 6676591 6456657 6222216 5977308 5726155 5473734 5224729 4982344 4748704 4525807
61348D525807k10556j97750j85053j71947j58191j44683j32240j20497j08743
$$ 4525807 4315251 4117501 3932448 3760501 3602310 3457627 3325387 3204890 3096147
61339C096147r7038q5692p4364o2593n0752l9671k9518j9649r449J079J1232J9999
$$ 3096147 2999109 2913417 2839053 2776460 2725708 2686037 2656519 2636870 2627421 2628500 2639732 2659731
61327B659731K6931L2687L8224M3399M7120M8979M9770N0152M9784M8307M6157
$$ 2659731 2686662 2719349 2757573 2800972 2848092 2897071 2946841 2996993 3046777 3095084 3141241
61316C141241M3739M0679L6680L2476K9060K6486K4171K1819J9353J6418J2795
$$ 3141241 3184980 3225659 3262339 3294815 3323875 3350361 3374532 3396351 3415704 3432122 3444917
61305C444917Q866M921L97n286j1478j6868k1126k5092k9256l3072l6050l8658
$$ 3444917 3453783 3458704 3459101 3453815 3442337 3425469 3404343 3379251 3349995 3316923 3280873 3242215
61293C242215m1617m4849m7730n0021n1849n2864n2279n0028m7242m4934m2572
$$ 3242215 3200598 3155749 3108019 3057998 3006149 2953285 2901006 2850978 2803736 2758802 2716230
61282B716230l8811l3509k8046k3383j8894j3733q503m593k388j256q79j543l132
$$ 2716230 2677419 2643910 2615864 2592481 2573587 2559854 2551351 2546758 2544370 2543114 2542235 2540692 2537560
61269B537560m956o567p928q742q523p404o010m484k549n98L58J20k29M15K377
$$ 2537560 2532604 2526037 2518109 2509367 2500844 2493440 2487430 2482946 2480397 2479799 2480157 2480277 2480048 2480463 2482840
61254B482840N911J1667J9845K9679M0417N2113O5049P8889R2812J05859J16836
$$ 2482840 2488751 2500418 2520263 2549942 2590359 2642472 2707521 2786410 2879222 2985081 3101917
61243C101917J24626J28934J29961J26863J17446R9938P4415M2129M592l5677
$$ 3101917 3226543 3355477 3485438 3612301 3729747 3829685 3904100 3946229 3950821 3915144
61233C915144p4488j07688j33462j52249j64655j70501j69816j63766j54307j43376
$$ 3915144 3840656 3732968 3599506 3447257 3282602 3112101 2942285 2778519 2624212 2480836
61223B480836j32396j21874j11352j00229q8791p8093o8871o0995n4017m7829
$$ 2480836 2348440 2226566 2115214 2014985 1926194 1848101 1779230 1718235 1664218 1616389
61213A616389m2538l8061l4107l0407k6754k2849j8456j3731r169n017q91L614
$$ 1616389 1573851 1535790 1501683 1471276 1444522 1421673 1403217 1389486 1380317 1375300 1374409 1378023
61201A378023Q054J1471J3688J5622J7886J9798K0358J9625J8213J5990J2513
$$ 1378023 1386077 1397548 1411236 1426858 1444744 1464542 1484900 1504525 1522738 1538728 1551241
61190A551241Q519N713M721M394L469J920K08j764m158o461q146r599j1572j4000
$$ 1551241 1559760 1565473 1570194 1574588 1578057 1579977 1580185 1578421 1574263 1567802 1559656 1550057 1538485 1524485
61176A524485j6102j7525j8747k0282k2003k3420k4286k4842k5465k6205k6747
$$ 1524485 1508383 1490858 1472111 1451829 1429826 1406406 1382120 1357278 1331813 1305608 1278861
61165A278861k6927k7109k7755k8734k9450k9578k9236k8480k7140k5279k3333
$$ 1278861 1251934 1224825 1197070 1168336 1138886 1109308 1080072 1051592 1024452 999173 975840
61154I75840k1641k0140j8701j7446j6703j6837j8005j9721k0924k1001k0524
$$ 975840 954199 934059 915358 897912 881209 864372 846367 826646 805722 784721 764197
61143G64197k0350k0238j9201j7109j4963j3392j1918j0071q216o777n402l644
$$ 764197 743847 723609 704408 687299 672336 658944 647026 636955 628739 621962 616560 612916
61131F12916j854o98j08O32K005L857N694P020P672Q060Q806R911J0697J0801
$$ 612916 611062 610364 610256 610888 612893 616750 622444 629464 637136 645196 654002 663913 674610 685411
61117F85411J0751J1219J2018J2395J2054J1525J1562J2382J3464J3891J3104
$$ 685411 696162 707381 719399 731794 743848 755373 766935 779317 792781 806672 819776
61106H19776J1387R480P743N943L761J216j427l801n485o315o632o883p105p137
$$ 819776 831163 840643 848386 854329 858090 859306 857879 854078 848593 842278 835646 828763 821658 814521
61092H14521p184p548p978p989p777q054q905r607r814j0067j0828j1707j2102
$$ 814521 807337 799789 791811 783822 776045 767991 759086 749479 739665 729598 718770 707063 694961
61079F94961j1968j1502j0641r440q428q104q268q294p791o753n324l831k704
$$ 694961 682993 671491 660850 651410 642982 634878 626610 618316 610525 603772 598448 594617 591913
61066E91913k104j761j415j105r79j099j507k059k129j105O57J953K235K292K981
$$ 591913 589809 588048 586633 585528 584549 583450 581943 579884 577755 576650 577307 579260 581495 583787 586768
61051E86768L840L795K827K029K046K363K355K268K622L213L412L296L674M916
$$ 586768 590608 594403 597230 599259 601305 603668 606023 608291 610913 614126 617538 620834 624508 629424
61037F29424O385P310P655P785P818P866Q454R920J1697J2905J3482J3953J4350
$$ 629424 635809 643119 650774 658559 666377 674243 682697 692617 704314 717219 730701 744654 759004
61024G59004J4313J4111J4407J5047J5194J4819J4816J5400J5733J5598J6052
$$ 759004 773317 787428 801835 816882 832076 846895 861711 877111 892844 908442 924494
61013I24494J7781K0008K1848K3612K5887K8484L1077L3983L7428M0843M3582
$$ 924494 942275 962283 984131 1007743 1033630 1062114 1093191 1127174 1164602 1205445 1249027
61002A249027M5530M6694M7326M8715N2410N8372O5538P4280Q5975R9756J12552
$$ 1249027 1294557 1341251 1388577 1437292 1489702 1548074 1613612 1687892 1773867 1873623 1986175
60991A986175J23278J34237J47534J63743J85343K17274K61927L18161L87805
$$ 1986175 2109453 2243690 2391224 2554967 2740310 2957584 3219511 3537672 3925477
60982C925477M77489N90237P21826Q71215J047565J259981J509989J804023K152284
$$ 3925477 4402966 4993203 5715029 6586244 7633809 8893790 10403779 12207802 14360086
60973A4360086K514956K744245K631578K072958J200177L20689k90510n39028
$$ 14360086 16875042 19619287 22250865 24323823 25524000 25844689 25554179 25015151
60965B5015151m76510j85213K47619O60282Q07908N01000k29982j130037j893548
$$ 25015151 24538641 24353428 24601047 25261329 26069237 26570237 26340255 25210218 23316670
60956B3316670k347551k491626k413731k204253j932172j650852j393969j170615
$$ 23316670 20969119 18477493 16063762 13859509 11927337 10276485 8882516 7711901
60948G711901r77160q12306o76688n65700m72162l93783l31722k83992k45719
$$ 7711901 6734741 5922435 5245747 4680047 4207885 3814102 3482380 3198388 2952669
60939B952669k14355j89721j70210j53293j38675j27148j17285j06740r5698q5832
$$ 2952669 2738314 2548593 2378383 2225090 2086415 1959267 1841982 1735242 1639544 1553712
60929A553712p7003o8232o0739n6645n5440n4773n3835n3064n1568m8013m3272
$$ 1553712 1476709 1408477 1347738 1291093 1235653 1180880 1127045 1073981 1022413 974400 931128
60918I31128l9235l5771l1680k7700k5470k4271k2035j8986j7147j6570j5330
$$ 931128 891893 856122 824442 796742 771272 747001 724966 705980 688833 672263 656933
60907F56933j3083j1501j1086j0473r156q142p645o725n530n372o163o102m441
$$ 656933 643850 632349 621263 610790 601634 593492 585847 579122 573592 568220 562057 555955 551514
60894E51514k453j252n36J52O96J252K243L352L920M175M681M943M243L229K965
$$ 551514 549061 547809 547273 547425 548121 549373 551616 554968 558888 563063 567744 572687 576930 580159 583124
60879E83124K999K267J270J241J703J120n40k049l208m576n502m935l757l771
$$ 583124 586123 588390 589660 590901 592604 593724 593184 591135 587927 583351 577849 572914 569157 565386
60865E65386m671m663l808l849m840m871l358j777q47K39J393J377N54J054L430
$$ 565386 560715 556052 552244 548395 543555 538684 535326 533549 532702 532941 534334 535711 536265 537319 540749
60850E40749N726O707P413Q665R645J0062J1184J3469J5361J5728J5412J5171
$$ 540749 546475 553182 560595 569260 578905 588967 600151 613620 628981 644709 660121 675292
60838F75292J4234J2160J0213R400Q889P770O705O447O245N132L564K491J919
$$ 675292 689526 701686 711899 721299 730188 737958 744663 751110 757355 762487 766051 768542 770461
60825G70461J427J098R55N33j89n02k32j78p29j219j263j408k000k688l537n190
$$ 770461 771888 772986 773941 774474 774285 773783 773551 773373 772644 771425 770162 768754 766754 764066 760529 755339
60809G55339p360q686q753q784r586j0354j0258r796r679r641r258q728q147p091
$$ 755339 747979 739293 730540 721756 712170 701816 691558 681762 672083 662442 653184 644456 636309 629218
60795F29218n643m635m295l780k605j302k40R89K440L447L872M463N560O697P822
$$ 629218 623575 618940 614645 610865 608260 606958 606718 607707 610147 613594 617466 621929 627489 634186 642008
60780F42008R382J0937J1302J0554J0135J0531J0616R929R650J0393J0912J0127
$$ 642008 651390 662327 673629 684183 694318 704849 715465 725394 735044 745437 756349 766476
60768G66476Q786P987P587P218P333Q013Q132O981N543M921M706L995K964K219
$$ 766476 775262 783249 790836 798054 805387 813400 821532 828513 834056 838977 843683 847678 850642 852861
60754H52861J611Q26K86M20Q26R79J006J080R15N02M02P02O82l4r77j949l414
$$ 852861 854472 855298 855584 856004 856830 857809 858815 859895 860810 861312 861714 862416 863098 863064 862087 860138 856724
60737H56724n280o599p022p354q056q531q381q077p894p444o799o620o686n927
$$ 856724 851444 844845 837823 830469 822413 813882 805501 797424 789530 782086 775287 768667 761981 756054
60723G56054m364l316l138k609j316o17j190j611o91N95Q58M43L36L32k71j307
$$ 756054 751690 748374 745236 742627 741311 740694 739504 737893 737202 737797 738655 739098 739434 739766 739495 738188
60707G38188k326l438m512m747m087l733m198m316l230j889j375j238p78n07r35
$$ 738188 735862 732424 727912 723165 719078 715345 711147 706831 703601 701712 700337 699099 698321 697814 696879
60692F96879j304r76q03j720l207m472n847p637q894q874q450q642q975q749q600
$$ 696879 695575 694599 693796 692076 688869 684397 678550 670913 662019 653145 644695 636053 627078 618329 609729
60677F09729r184r552q590p038o301o196n616m540l732l099k042p71Q4O75J442
$$ 609729 600545 590993 582403 575365 569064 562868 557252 552712 548980 545881 543839 543068 543152 543827 545269
60662E45269K095K266K421K976L340K953K353K137J841J101Q06J788L339M354
$$ 545269 547364 549630 552051 555027 558367 561320 563673 565810 567651 568752 569558 571346 574685 579039
60648E79039M885N308N113L971K940L043L623L463K651J980J552J343J966L461
$$ 579039 583924 589232 594345 598316 601256 604299 607922 611385 614036 616016 617568 618911 620877 624338
60634F24338M502M366M374N785P574Q153Q064Q896J0513J1588J2002J2654J3494
$$ 624338 628840 633206 637580 643365 650939 659092 667156 676052 686565 698153 710155 722809 736303
60621G36303J3739J3551J3537J3203J1653R375P525O044M192K338J320O51p82
$$ 736303 750042 763593 777130 790333 801986 811361 818886 824930 829122 831460 832780 833431 832649
60608H32649k694l856m107m206m227l824l539m119n047n489o022p551r249r635
$$ 832649 829955 826099 821992 817786 813559 809735 806196 802077 797030 791541 785519 777968 768719 759084
60594G59084r153r453j0459j0401q673o525m867l315j532K22J934L726M924M824
$$ 759084 749931 740478 730019 719618 710945 704420 699553 696238 694706 694928 696862 700588 705512 710336
60580G10336M148M138M490L906K404J304J037P77J71k39l22m47l26O34K005K802
$$ 710336 714484 718622 723112 727018 729422 730726 731763 732540 732711 732472 732150 731703 731377 732011 734016 736818
60564G36818L061L407L474K482J012L67L82j95j431k195k265k479k852k618j970
$$ 736818 739879 743286 746760 749242 750254 750621 751003 750808 749377 747182 744917 742438 739586 736968 734998
60549G34998j805j700k51K500N073P113R761J3246J6353J8786K1875K6276L0996
$$ 734998 733193 731493 731242 733742 738815 745928 755689 768935 785288 804074 825949 852225 883221
60536H83221L5406M0163M5118M8072M6862M1377L2726K1674Q873m488j7058k7654
$$ 883221 918627 958790 1003908 1051980 1098842 1140219 1172945 1194619 1203492 1199004 1181946 1154292
60524A154292l4961l8062l7570l5137l1580k6620k0522j4474r033l651J708N887
$$ 1154292 1119331 1081269 1043699 1008562 976982 950362 929840 915366 906333 902682 904390 910277
60512I10277Q054Q755Q913Q869Q886R486J0743J2079J3174J4421J6378J9481K4147
$$ 910277 918331 927086 935999 944868 953754 963240 973983 986062 999236 1013657 1030035 1049516 1073663
60499A073663L0318L7113M4002N1889O1900P3573Q5711R8528J13187J29484J45981
$$ 1073663 1103981 1141094 1185096 1236985 1298885 1372458 1458169 1556697 1669884 1799368 1945349
60488A945349J62546J80822K01973K25822K52490K82834L16257L48847L73741
$$ 1945349 2107895 2288717 2490690 2716512 2969002 3251836 3568093 3916940 4290681
60479D290681L82130L64911L16476K38291J37778K3825r4746k06800k99128l62003
$$ 4290681 4672811 5037722 5354198 5592489 5730267 5754092 5659346 5452546 5153418 4791415
60469D791415l93908m00007l87195l61552l28439k92595k57570k25477j96916
$$ 4791415 4397507 3997500 3610305 3248753 2920314 2627719 2370149 2144672 1947756
60460A947756j71184j47629j26985j10427r7430q6028p5329o6187n8997n2571
$$ 1947756 1776572 1628943 1501958 1391531 1294101 1208073 1132744 1066557 1007560 954989
60450I54989m5953l9781l4954l1172k7657k4288k1283j8641j6463j5011j3996
$$ 954989 909036 869255 834301 803129 775472 751184 729901 711260 694797 679786 665790
60439F65790j2791j1488j0721j0399r831r178r230r639r085p540o552o734o778
$$ 665790 652999 641511 630790 620391 610560 601382 592152 582513 573428 565888 559336 552602 545824
60426E45824n694m318l630l227k550k078k131j773k26J708K773K982L093L160
$$ 545824 540130 535812 532182 528955 526405 524327 522196 520423 520197 521905 524678 527660 530753 533913
60412E33913K705J794J082J064J774K820L479L400L248L861M854N064M452M190
$$ 533913 536618 538412 539494 540558 542332 545152 548631 552031 555279 559140 563994 569058 573510 577700
60398E77700M768N337N246M880M662M521M668N520O544O570N552M631M155L293
$$ 577700 582468 587805 593051 597931 602593 607114 611782 617302 623846 630416 635968 640599 644754 648047
60384F48047J927J107J056O03p24j760j793j846k812l940m320m364m620m524l603
$$ 648047 649974 651081 652137 652740 652016 650256 648463 646617 643805 639865 635545 631181 626561 622037 618434
60369F18434k702k663k867k242q82M41J463K243K624K790L470M788N838O025N930
$$ 618434 615732 613069 610202 607960 607078 607519 608982 611225 613849 616639 620109 624897 630735 636760 642690
60354F42690O185O502O511O472O536O372O075O306P064P528P588Q041Q791Q514
$$ 642690 648875 655377 661888 668360 674896 681268 687343 693649 700713 708241 715829 723870 732661 741175
60340G41175O842N163M394L720K515J708J954K239J745J511K590M120M912N671
$$ 741175 748017 753180 757574 761294 763809 765517 767471 769710 771455 772966 775556 779676 784588 790259
60326G90259P727J0563J2499J2992J2533J0937P574K965j413m810p518r783j1434
$$ 790259 797986 808549 821048 834040 846573 857510 865084 868049 866636 861826 854308 844525 833091
60313H33091j2374j2573j1919j0644r409q375o991n202l947l761l895l645l388
$$ 833091 820717 808144 796225 785581 776172 767797 760806 755604 751657 747896 744001 740356 736968
60300G36968l508l341k269q82j6M06O70M58k41m90J96Q58O01Q0K80P89O21k3j56
$$ 736968 733460 730119 727850 726968 726952 727358 728028 728486 728245 727755 727951 728809 729410 729490 729770 730559 731180 731157 731001
60281G31001N06J521K612L594M036L856L572L356K809K204K709M470N904N961
$$ 731001 731507 733028 735640 739234 743270 747126 750698 754054 756863 759067 761776 766246 772150 778111
60267G78111N741O620Q156R266J0249J1956J4008J5505J6659J8198J9947K1473
$$ 778111 783852 790472 798628 807894 818143 830099 844107 859612 876271 894469 914416 935889
60255I35889K3285K5984K8965L1464L4073L7709M1952M5961N0333N6260O3418
$$ 935889 959174 985158 1014123 1045587 1079660 1117369 1159321 1205282 1255615 1311875 1375293
60244A375293P0419P6938Q3729R0845R7496J03525J09564J15639J20838J24280
$$ 1375293 1445712 1522650 1606379 1697224 1794720 1898245 2007809 2123448 2244286 2368566
60234B368566J25491J24029J19786J13362J05286R5212Q2746O8577N3889L9142
$$ 2368566 2494057 2618086 2737872 2851234 2956520 3051732 3134478 3203055 3256944 3296086
60224C296086K4227R285n438j9779l2916m3258n0028n4125n6488n6611n3678m8138
$$ 3296086 3320313 3329598 3324160 3304381 3271465 3228207 3178179 3124054 3067566 3010955 2957277 2909139
60212B909139m0907l2044k1520j0327O00J1818K4354L8072N2244O6794Q1553R5253
$$ 2909139 2868232 2836188 2814668 2804341 2804941 2816759 2841113 2879185 2931429 2998223 3079776 3175029
60200C175029J06800J16697J25592J32278J34816J32881J27342J18241J05094
$$ 3175029 3281829 3398526 3524118 3656396 3791212 3924093 4051435 4169676 4274770
60191D274770Q8620P0332N0751K9671P830j3393l3576n2941p0789q5766r7392
$$ 4274770 4363390 4433722 4484473 4514144 4521974 4508581 4475005 4422064 4351275 4265509 4168117
60180D168117j05820j10491j10668j06874j00227r0737p7997o3103m7999l3008
$$ 4168117 4062297 3951806 3841138 3734264 3634037 3543300 3465303 3402200 3354201 3321193
60170C321193j6905N23J7826L3951M9221O3853P6882Q7001R3379R5462R3010Q6602
$$ 3321193 3304288 3304811 3322637 3356588 3405809 3469662 3546544 3633545 3726924 3822386 3915396 4001998
60158D001998P7202O5247N0895L4984J8685K583j2948k6778l7607m5246n0212
$$ 4001998 4079200 4144447 4195342 4230326 4249011 4251594 4238646 4211868 4174261 4129015 4078803
60147D078803n2352n0960m5987l7998k7257j3896J367J7710L5141N3959P3870
$$ 4078803 4026451 3975491 3929504 3891506 3864249 3850353 3851720 3869430 3904571 3958530 4032400
60136D032400R4593J16705J40658J65706J91073K17451K45843K75538L04699L32357
$$ 4032400 4126993 4243698 4384356 4550062 4741135 4958586 5204429 5479967 5784666 6117023
60126F117023L58211L80985L98786M10813M17061M16636M08040L91062L66748
$$ 6117023 6475234 6856219 7255005 7665818 8082879 8499515 8907555 9298617 9665365
60117I665365L35570K97166K51873K01107J46164Q7772K6833l5540r8443j60506
$$ 9665365 10000935 10298101 10549974 10751081 10897245 10985017 11011850 10976310 10877867 10717361
60107A0717361k19102k71361l15575l50563l74478l85883l85591l75886l58293
$$ 10717361 10498259 10226898 9911323 9560760 9186282 8800399 8414808 8038922 7680629
60098G680629l33511l02927k68423k30965j90988j49868j09437p0302l2231M143
$$ 7680629 7347118 7044191 6775768 6544803 6353815 6203947 6094510 6024208 5991977 5996120
60088E996120L7564O7640R4333J16255J31302J38827J39621J33982J21469J02473
$$ 5996120 6033684 6101324 6195657 6311912 6443214 6582041 6721662 6855644 6977113 7079586
60078G079586P8461N0913K1520p127l2938n6131p7980r8203j15559j30489j44826
$$ 7079586 7158047 7208960 7230480 7223353 7190415 7134284 7056304 6958101 6842542 6712053 6567227
60067F567227j58815j70685j79262j84966j87993j87552j83349j76070j66098
$$ 6567227 6408412 6237727 6058465 5873499 5685506 5497954 5314605 5138535 4972437
60058D972437j53376j38599j22880j06201q7916o8697n0066l2024j3106P012K7025
$$ 4972437 4819061 4680462 4557582 4451381 4363465 4294768 4244702 4212678 4199572 4206584 4233609
60047D233609M6248O5317Q4273J01901J17306J30293J39883J44418J43514J38094
$$ 4233609 4279857 4345174 4429447 4531348 4648654 4778947 4918830 5063248 5206762 5344856
60037E344856J28216J12865R2339O8828M4032J7989r252l6609o3112q8313j11100
$$ 5344856 5473072 5585937 5678276 5747104 5791136 5809125 5799873 5763264 5700152 5611839 5500739
60026E500739j29847j44223j55036j61944j63313j58856j50412j39545j26391
$$ 5500739 5370892 5226669 5071633 4909689 4746376 4587520 4437108 4297563 4171172
60017D171172j11385r6058q1095o5571m8949l2042j5158K710K1829M0802N8908
$$ 4171172 4059787 3963729 3882634 3817063 3768114 3736072 3720914 3723624 3745453 3786255 3845163
60006C845163P7535R7954J19195J39519J58533J76351J91768K02701K07827K06694
$$ 3845163 3922698 4020652 4139847 4279366 4437899 4614250 4806018 5008719 5216546 5423240
59996E423240J99049J84984J65229J40721J12419Q1754N0235J8277j4597m8045
$$ 5423240 5622289 5807273 5972502 6113223 6225642 6307396 6357631 6375908 6361311 6313266
59986F313266q0447j10207j36361j57758j73088j81985j84909j81828j72450j57866
$$ 6313266 6232819 6122612 5986251 5828493 5655405 5473420 5288511 5106683 4934233 4776367
59976D776367j40262j20804r9427p6791n4527l3138j1607J0309L1267N0410O8359
$$ 4776367 4636105 4515301 4415874 4339083 4284556 4251418 4239811 4250120 4281387 4331797 4400156
59965D400156Q5362J00271J12145J21170J27167J28970J26260J20442J12708J02678
$$ 4400156 4485518 4585789 4697934 4819104 4946271 5075241 5201501 5321943 5434651 5537329
59955E537329Q9846P4988N9333M3683K9070J6798P057j046p411j0370q854l462
$$ 5537329 5627175 5702163 5761496 5805179 5834249 5851047 5858104 5857058 5849647 5839277 5830423 5826961
59943E826961N380J8674L7329O0833Q8347J19690J54494J91798K31264K73341
$$ 5826961 5832341 5851015 5888344 5949177 6037524 6157214 6311708 6503506 6734770 7008111
59933G008111L17450L61329M02667M39802M70261M90379M97056M88187M61029
$$ 7008111 7325561 7686890 8089557 8529359 8999620 9489999 9987055 10475242 10936271
59924A0936271M12466L42119K53576J51796M1431p1427j78512k72534l49888m09239
$$ 10936271 11348737 11690856 11944432 12096228 12137659 12066232 11887720 11615186 11265298 10856059
59914A0856059m49421m70438m74826m66110m46731m18670l84677l47392l08227
$$ 10856059 10406638 9936200 9461374 8995264 8548533 8129863 7745186 7397794 7089567
59905G089567k68201k28690j90293j52168j13611p5223l7664o57L5897P1135J04437
$$ 7089567 6821366 6592676 6402383 6250215 6136604 6061381 6023717 6023060 6058957 6130092 6234529
59894F234529J35931J64983J89745K08945K22377K28701K24778K08399J79916
$$ 6234529 6370460 6535443 6725188 6934133 7156510 7385211 7609989 7818388 7998304
59885G998304J40319Q9970L0783l2528r5217j54924k09796k56393k91679l15680
$$ 7998304 8138623 8228593 8259376 8226848 8131631 7976707 7766911 7510518 7218839 6903159
59875F903159l30137l35784l32795l22582l07244k88130k66437k43995k21878
$$ 6903159 6573022 6237238 5904443 5581861 5274617 4986487 4720050 4476055 4254177
59866D254177j99441j76322j54026j34012j15551r7320p9845o4538n1583m0617
$$ 4254177 4054736 3878414 3724388 3590376 3474825 3377505 3297660 3233122 3181539 3140922
59856C140922l2374k7681k5802k5489k6744k9740l3057l4789l4623l3165l0204
$$ 3140922 3108548 3080867 3055065 3029576 3002832 2973092 2940035 2905246 2870623 2837458 2807254
59845B807254k5336j9383j3491p642j763K633L586Q24m769j2742k2527l2214l9790
$$ 2807254 2781918 2762535 2749044 2741402 2739639 2742272 2745858 2746682 2741913 2729171 2706644 2674430 2634640
59832B634640m5032m8698n0624n0117m7442m3309l7631l0265k2191j4602p648
$$ 2634640 2589608 2540910 2490286 2440169 2392727 2349418 2311787 2281522 2259331 2244729 2237081
59821B237081j399L128N480P288J0556J5352K0751K6960L4652M3006N0297N5812
$$ 2237081 2235682 2238810 2244290 2251578 2262134 2277486 2298237 2325197 2359849 2402855 2453152 2508964
59809B508964N9748O1934O2348O2036O1769O0468N6497M9817M1441L1750K1033
$$ 2508964 2568712 2630646 2692994 2755030 2816799 2877267 2933764 2983581 3025022 3056772 3077805
59798C077805J0819K765l152p842j1215j2572j1972r548m462L773J3749K3725
$$ 3077805 3088624 3091389 3088237 3080395 3069180 3056608 3044636 3035088 3030626 3034399 3048148 3071873
59786C071873L3993M5997O0040P5670R3427J14228J37783J63564J92611K26345
$$ 3071873 3105866 3151863 3211903 3287573 3381000 3495228 3633011 3796575 3989186 4215531
59776D215531K64138L03924L44604L85563M23825M53183M65614M52326M05088
$$ 4215531 4479669 4783593 5128197 5513760 5937585 6390768 6856382 7308708 7713796
59767G713796L20282K03222O7794o8364j88798k81462l41205l70209l74771l61318
$$ 7713796 8034078 8237300 8305094 8236730 8047932 7766470 7425265 7055056 6680285 6318967
59757F318967l35452l02671k67468k31891j96622j62905j32052j04093p8603n6112
$$ 6318967 5983515 5680844 5413376 5181485 4984863 4821958 4689906 4585813 4507210 4451098
59747D451098l6899j9336j464J6529L3330M9179O5387Q1962R8003J13977J31269
$$ 4451098 4414199 4394863 4393399 4409928 4443258 4492437 4557824 4639786 4737789 4851766 4983035
59736D983035J49752J68133J86598K06985K30317K56098K84086L14905L48772
$$ 4983035 5132787 5300920 5487518 5694503 5924820 6180918 6465004 6779909 7128681
59727G128681L85229M24248M66007N09626N53462N96315O36860O72221O98698
$$ 7128681 7513910 7938158 8404165 8913791 9467253 10063568 10700428 11372649 12071347
59718A2071347P13778P16166P04505O78027O38593N90910N40961M95091M59547
$$ 12071347 12785125 13501291 14205796 14883823 15522416 16113326 16654287 17149378 17608925
59709A7608925M38836M34503M46207M72937N11862N57295O02776O43546O75354
$$ 17608925 18047761 18482264 18928471 19401408 19913270 20470565 21073341 21716887 22392241
59700B2392241O92114O87061O55922N97472N12327M03627K78301J45385J3100
$$ 22392241 23084355 23771416 24427338 25024810 25537137 25940764 26219065 26364450 26377550
59691B6377550j11172k19563l05273l65351m00082m10204l96709l62472l11544
$$ 26377550 26266378 26046815 25741542 25376191 24976109 24565905 24169196 23806724 23495180
59682B3495180k46824j70172q3944R660J10308K18441L33062M52414N75800P02257
$$ 23495180 23248356 23078184 22994240 23003900 23114208 23332649 23665711 24118125 24693925 25396182
59672B5396182Q28023R47316J054528J142987J202425J220625J187453J095581
$$ 25396182 26224205 27171521 28226049 29369036 30571461 31792086 32979539 34075120
59664C4075120R39407P17961M39848J23124k09739n35151q29282j071590j250250
$$ 34075120 35014527 35732488 36172336 36295460 36085721 35550570 34721288 33649698 32399448
59655C2399448j362939j412802j406078j352928j266401j158774j040206r20653
$$ 32399448 31036509 29623707 28217629 26864701 25598300 24439526 23399320 22478667
59647B2478667q10615p20072o58656o35513o54527p08512p80617q52430r09722
$$ 22478667 21668052 20947980 20289324 19653811 18999284 18290772 17510155 16657725 15748003
59638A5748003r42728r46528r23032q79521q23409p59693o92866o27562n66213
$$ 15748003 14805275 13858747 12935715 12056194 11232785 10473092 9780226 9152664 8586451
59629H586451n08771m55562m07934l65649l26675k90452k58510k31097k06004
$$ 8586451 8077680 7622118 7214184 6848535 6521860 6231408 5972898 5741801 5535797
59620E535797j81836j59624j40077j21953j04449q8690p5514o4063n3798m5736
$$ 5535797 5353961 5194337 5054260 4932307 4827858 4739168 4663654 4599591 4545793 4500057
59610D500057m0589l7756l7237m0288m7106n5831o4807p3885q2743r0068r5232
$$ 4500057 4459468 4421712 4384475 4344187 4297081 4241250 4176443 4102558 4019815 3929747 3834515
59599C834515r8705j00144r8400r4080q9552q5533q0124p2278o3721n6140m8888
$$ 3834515 3735810 3635666 3537266 3443186 3353634 3268101 3187977 3115699 3051978 2995838 2946950
59588B946950m0866l2569k4864j7600j0591m250J651P964J4224J8728K1222K3282
$$ 2946950 2906084 2873515 2848651 2831051 2820460 2816210 2817861 2825825 2840049 2858777 2879999 2903281
59576B903281K5437K6365K5670K4860K4549K3394K1037J9461K0111K2126K4790
$$ 2903281 2928718 2955083 2980753 3005613 3030162 3053556 3074593 3094054 3114165 3136291 3161081
59565C161081K9172L5749M2839M9158N5754O3826P2780Q2095R2918J05954J19825
$$ 3161081 3190253 3226002 3268841 3317999 3373753 3437579 3510359 3592454 3685372 3791326 3911151
59554C911151J33336J47516J63706J81363J99486K18441K38589K58614K76926
$$ 3911151 4044487 4192003 4355709 4537072 4736558 4954999 5193588 5452202 5729128
59545E729128K93301L07635L18508L24535L25805L22743L14797L01628K84469
$$ 5729128 6022429 6330064 6648572 6973107 7298912 7621655 7936452 8238080 8522549
59536H522549K65165K44700K23041J99114J71013J38298J04568P5425N3368L6996
$$ 8522549 8787714 9032414 9255455 9454569 9625582 9763880 9868448 9943873 9997241 10034237
59526A0034237K5527K0878K4246L3780M7565O6093Q9678J15700J40259J60432
$$ 10034237 10059764 10080642 10104888 10138668 10186233 10252326 10342004 10457704 10597963 10758395
59516A0758395J73106J73994J60076J31638R0332L7207k5884r5136j66804k38523
$$ 10758395 10931501 11105495 11265571 11397209 11487541 11524748 11498864 11403728 11236924 10998401
59506A0998401l07090l67307m15100m49966m72677m82756m80218m67547m47666
$$ 10998401 10691311 10324004 9908904 9458938 8986261 8503505 8023287 7555740 7108074
59497G108074m21640l90356l56587l23103k90309k57834k26891j98995j73793
$$ 7108074 6686434 6296078 5939491 5616388 5326079 5068245 4841354 4642359 4468566
59488D468566j50202j28404j08842r0648p2826n5740l9830k4269q373P275K2555
$$ 4468566 4318364 4189960 4081118 3990470 3917644 3861904 3822074 3797805 3789432 3796707 3819262
59477C819262L8911N7121P5826R3880J12379J32521J53431J73907J94594K16322
$$ 3819262 3858173 3915294 3991120 4085000 4197379 4329900 4483331 4657238 4851832 5068154
59467E068154K37977K57828K75295K89571K98138K98558K90198K72593K44089
$$ 5068154 5306131 5563959 5839254 6128825 6426963 6725521 7015719 7288312 7532401
59458G532401K04017J54465R8069L6114k9335r3647j52385k04132k48529k83508
$$ 7532401 7736418 7890883 7988952 8025066 7995731 7902084 7749699 7545567 7297038 7013530
59448G013530l07011l19815l24251l21628l12920l00312k85657k68863k49831
$$ 7013530 6706519 6386704 6062453 5740825 5427905 5127593 4841936 4573073 4323242
59439D323242k30311k11900j93975j75783j58647j43868j30331j16617j03571
$$ 4323242 4092931 3881031 3687056 3511273 3352626 3208758 3078427 2961810 2858239
59430B858239r2377q2001p1139o0906n2845m5943l8346l0434k3629j7674j1694
$$ 2858239 2765862 2683861 2612722 2551816 2498971 2453028 2414682 2384248 2360619 2342945 2331251
59419B331251o311k159K136P840J3565J7382J9878K2784K6400L0549L5643M0016
$$ 2331251 2324940 2322781 2324917 2332757 2346322 2363704 2383582 2406366 2432766 2463315 2498958 2538974
59407B538974L9087L0828K0005J3271J2097J4092J8715K7046L7710M8143N8834
$$ 2538974 2578061 2608889 2628894 2642165 2654262 2668354 2687069 2714115 2751825 2799968 2858802
59396B858802P1409Q3206Q8902Q7940Q5898Q8090R5667J08254J26058J48186J72429
$$ 2858802 2930211 3013417 3102319 3190259 3276157 3364247 3459914 3568168 3694226 3842412 4014841
59385D014841J98057K26452K58386K93176L30695L71561M15045M59212N03051
$$ 4014841 4212898 4439350 4697736 4990912 5321607 5693168 6108213 6567425 7070476
59376G070476N45954N85107O16029O35543O41990O33352O08435N69744N22330
$$ 7070476 7616430 8201537 8817566 9453109 10095099 10728451 11336886 11906630 12428960
59367A2428960M69809M14243L59051L08399K63510K22831J85835J53257J23451
$$ 12428960 12898769 13313012 13672063 13980462 14243972 14466803 14652638 14805895 14929346
59358A4929346R2054N6099J5603k9318p9547j34351j90369k44044k92651l32745
$$ 14929346 15021400 15077499 15093102 15063784 14984237 14849886 14659517 14415473 14122822 13790077
59348A3790077l60740l76133l81991l81729l77748l73159l71717l74962l81760
$$ 13790077 13429337 13053204 12671213 12289484 11911736 11538577 11166860 10791898 10410138
59339A0410138l91057m02575m14367m22641m25148m22453m15142m02317l83801
$$ 10410138 10019081 9616506 9202139 8779498 8354350 7931897 7516755 7114438 6730637
59330F730637l61477l37234l11460k84443k57455k31532k06752j83318j61785
$$ 6730637 6369160 6031926 5720466 5436023 5178568 4947036 4740284 4556966 4395181
59321D395181j41926j22971j05164q9344p4967o0562m6250l3678k3209j3200k501
$$ 4395181 4253255 4130284 4025120 3935776 3860809 3800247 3753997 3720319 3697110 3683910 3681409
59310C681409Q313J8486K8061L7066M5443N3930O3251P2476P9841Q5008Q8715
$$ 3681409 3689722 3708208 3736269 3773335 3818778 3872708 3935959 4008435 4088276 4173284 4261999
59299D261999R0692R0011Q7072Q2934P7029O8027N6702M5391L4701K3467J1922
$$ 4261999 4352691 4442702 4529774 4612708 4689737 4757764 4814466 4859857 4894558 4918025 4929947
59288D929947K249m322q427j0293q970m211L166J2987K5699M0610N6368P3054
$$ 4929947 4932196 4927874 4919447 4909154 4900184 4895973 4899139 4912126 4937825 4978435 5034803 5107857
59276E107857R1495J10766J28747J44628J57936J65563J63341J50964J32335J10626
$$ 5107857 5199352 5310118 5438865 5583493 5741429 5906992 6070333 6221297 6353632 6464258
59266F464258Q6013N8512K9689O41k8565n6451p9893r7306j09631j17444j19769
$$ 6464258 6550271 6608783 6638472 6639113 6610548 6554097 6474204 6376898 6267267 6149823 6030054
59255F030054j16489j09238r9062q5784p0447n5720m2940l1264k0526j2314p386
$$ 6030054 5913565 5804327 5705265 5619481 5549034 5493314 5450374 5419110 5398584 5386270 5378884
59244E378884m623l444m720q341j2373j5572j8368k0497k0179j6477j0093r69
$$ 5378884 5374261 5370817 5366097 5357756 5345383 5329811 5311443 5290946 5270767 5254290 5244197 5243228
59232E243228J2304K9900N0230P2889R9545J30954J65673K02630K42244K83773
$$ 5243228 5255532 5285432 5335662 5408551 5508096 5639050 5804723 6007353 6249597 6533370
59222F533370L24275L61203L93423M18520M31849M29743M11177L75282L20338
$$ 6533370 6857645 7218848 7612271 8030791 8462640 8892383 9303560 9678842 9999180
59213I999180K47044J60192O5191l4833j36773k34943l22977l96803m54186m93257
$$ 9999180 10246224 10406416 10471607 10436774 10300001 10065058 9742081 9345278 8891092 8397835
59203H397835n13446n16606n05758m83913m54696m22079l88200l53034l17219
$$ 8397835 7884389 7367783 6862025 6378112 5923416 5501337 5113137 4760103 4442884
59194D442884k83251k52981k25826k00687j77805j57638j39763j23943j10660
$$ 4442884 4159633 3906652 3680826 3480139 3302334 3144696 3004933 2880990 2770330
59185B770330r9630q9534p9955p1862o5476n9557n3386m7542m2153l6438l0558
$$ 2770330 2670700 2581166 2501211 2429349 2363873 2304316 2250930 2203388 2161235 2124797 2094239
59174B094239k5622k1476j6774j1720q040n698k522K180O559R762J3448J8517
$$ 2094239 2068617 2047141 2030367 2018647 2010607 2004909 2002387 2004567 2011126 2020888 2034336 2052853
59162B052853K3398K7042L0817L5735M0488M3962M7221N1305N5449N9188O3789
$$ 2052853 2076251 2103293 2134110 2169845 2210333 2254295 2301516 2352821 2408270 2467458 2531247
59151B531247O9900P5994Q0844Q5355R0421R5085R8343J00622J02023J01362R8263
$$ 2531247 2601147 2677141 2757985 2843340 2933761 3028846 3127189 3227811 3329834 3431196 3529459
59140C529459R3910Q8460Q0193O8724N6350M4639L2363J8612N225n881j5245k3627
$$ 3529459 3623369 3711829 3792022 3860746 3917096 3961735 3994098 4012710 4017935 4012054 3996809 3973182
59128C973182k9606l1696l0733k8047k3202j5619o402L465J4959K9100M4942O1211
$$ 3973182 3943576 3911880 3881147 3853100 3829898 3814279 3807877 3811342 3826301 3855401 3900343 3961554
59116C961554P8126R5981J13842J31327J49675J69398J88886K06917K24390K41827
$$ 3961554 4039680 4135661 4249503 4380830 4530505 4699903 4888789 5095706 5320096 5561923
59106E561923K57282K68493K74903K75744K68350K50364K21939J84176J37696
$$ 5561923 5819205 6087698 6362601 6638345 6906695 7157059 7378998 7563174 7700870
59097G700870Q4562K9500k2782o9897j10284j42064j65113j81851j94083k01407
$$ 7700870 7785432 7814932 7792150 7722253 7611969 7469905 7304792 7122941 6928858 6727451
59087F727451k04339k06110k09158k12267k13563k13819k14446k14569k12745
$$ 6727451 6523112 6317002 6107844 5895577 5682014 5468195 5253749 5039180 4826435
59078D826435k09585k06232k02122j96450j90013j83515j76063j67313j58920
$$ 4826435 4616850 4410618 4208496 4012046 3822033 3638518 3462455 3295142 3136222
59069C136222j51795j44158j34533j24382j15588j07603r9373r1759q5578p9522
$$ 3136222 2984427 2840269 2705736 2581354 2465766 2358163 2258790 2167031 2081453 2001931
59059B001931p2452o5647o0467n5910n0792m5989m2299l8570l4273l1344l0832
$$ 2001931 1929479 1863832 1803365 1747455 1696663 1650674 1608375 1569805 1535532 1504188 1473356
59048A473356l0390k7870k4815k3501k3034k1512j9551j8456j7160j4202j0584
$$ 1473356 1442966 1415096 1390281 1366780 1343746 1322234 1302683 1284227 1267067 1252865 1242281
59037A242281p662m449j09L304L920L500M421N710N678O027R230J3930J7094J8880
$$ 1242281 1234619 1230170 1230061 1233365 1237285 1240785 1245206 1250916 1256594 1262621 1271851 1285781 1302875 1321755
59023A321755K1148K2952K1935J8853J6342J4301J0668N924K640J200j14j405
$$ 1321755 1342903 1365855 1387790 1406643 1422985 1437286 1447954 1453878 1456518 1457718 1457604 1456199
59011A456199j258N5J130K555N851R910J2117J2511J3229J4264J3427J0251O537
$$ 1456199 1454941 1454996 1456126 1458681 1464532 1474442 1486559 1499070 1512299 1526563 1539990 1550241 1556778
58998A556778L030j077n524q934j1334j3841j6049j6474j5272j3832j2186r515
$$ 1556778 1559808 1558731 1553207 1544273 1532939 1519098 1503049 1486575 1471303 1457471 1445285 1435770
58986A435770o579m845l836k127j25R09J743L967O743P908P698Q227R817J1015
$$ 1435770 1429191 1424346 1420510 1418383 1418258 1419167 1420910 1424877 1431620 1439528 1447226 1455453 1465270 1476285
58972A476285J1773J3458J5980J7943J9360K1423K4000K6017K7784L0221L2425
$$ 1476285 1488058 1501516 1517496 1535439 1554799 1576222 1600222 1626239 1654023 1684244 1716669
58961A716669L2811L2025L1883L2151L1377L0174L0578L2629L4507L5613L6784
$$ 1716669 1749480 1781505 1813388 1845539 1876916 1907090 1937668 1970297 2004804 2040417 2077201
58950B077201L8124L9387M1748M6260N1416N5082N8039O2660O9039P5527Q2132
$$ 2077201 2115325 2154712 2196460 2242720 2294136 2349218 2407257 2469917 2538956 2614483 2696615
58939B696615R0036R8537J05894J12558J20345J29083J37319J45705J56453J69986
$$ 2696615 2786651 2885188 2991082 3103640 3223985 3353068 3490387 3636092 3792545 3962531
58929C962531J85235K02379K22128K43256K64363K87211L14851L47219L82023
$$ 3962531 4147766 4350145 4572273 4815529 5079892 5367103 5681954 6029173 6411196
58920F411196M18961M59381N02793N47659N94744O45484O97637P46580P90261
$$ 6411196 6830157 7289538 7792331 8339990 8934734 9580218 10277855 11024435 11814696
58911A1814696Q28456Q57586Q70850Q63580Q34197P80034O96981N84299M46173
$$ 11814696 12643152 13500738 14371588 15235168 16069365 16849399 17546380 18130679 18576852
58902A8576852K88235J16440o0380k31142l87071n23021o34713p18655p75238
$$ 18576852 18865087 18981527 18921147 18690005 18302934 17779913 17145200 16426545 15651307
58893A5651307q08205q20618q14433p93656p63768p27540o85097o38267n90996
$$ 15651307 14843102 14022484 13208051 12414395 11650627 10923087 10237990 9599723 9008727
58884I008727n45246n00390m57099m17829l82882l49957l18336k89897k65369
$$ 9008727 8463481 7963091 7505992 7088163 6705281 6355324 6036988 5747091 5481722
58875E481722k43246k23075k06123j92069j78613j65024j52663j41527j29844
$$ 5481722 5238476 5015401 4809278 4617209 4438596 4273572 4120909 3979382 3849538
58866C849538j17608j06925r8278q9971q1729p5117p0019o4346n7875n2528m8423
$$ 3849538 3731930 3625005 3526727 3436756 3355027 3279910 3209891 3145545 3087670 3035142 2986719
58855B986719m3404l7132l1723k7659k2867j6641j0733n746k34N959J1213J5694
$$ 2986719 2943315 2906183 2874460 2846801 2823934 2807293 2796560 2790814 2790580 2796539 2807752 2823446
58843B823446K1588K9091L5964M1729M8333N6109O3135O9375P7183Q6736R5331
$$ 2823446 2845034 2874125 2910089 2951818 3000151 3056260 3119395 3188770 3265953 3352689 3448020
58832C448020J02292J10260J20403J30665J40164J51086J64558J78782J93000
$$ 3448020 3550312 3660572 3780975 3911640 4051804 4202890 4367448 4546230 4739230
58823D739230K09365K29096K50598K73182K98925L29107L62298L97724M37027
$$ 4739230 4948595 5177691 5428289 5701471 6000396 6329503 6691801 7089525 7526552
58814G526552M81042N28109N76962O27843O79316P27398P69143Q03527Q27591
$$ 7526552 8007594 8535703 9112665 9740508 10419824 11147222 11916365 12719892 13547483
58805A3547483Q35312Q21654P84202P20058O25711N01953L55212J92712K0206
$$ 13547483 14382795 15204449 15988651 16708709 17334420 17836373 18191585 18384297 18404503
58796A8404503j54208l19049m64990n88175o86615p57650q01242q21778q23883
$$ 18404503 18250295 17931246 17466256 16878081 16191466 15433816 14632574 13810796 12986913
58787A2986913q09656p81828p45684p05266o61040o13564n66163n21681m79773
$$ 12986913 12177257 11395429 10649745 9944479 9283439 8669875 8103712 7582031 7102258
58778G102258m39661m02572l69397l38939l10406k84837k62599k42456k24355
$$ 7102258 6662597 6260025 5890628 5551689 5241283 4956446 4693847 4451391 4227036
58769D227036k09792j98209j86638j74096j62575j52509j41550j29276j18586
$$ 4227036 4017244 3819035 3632397 3458301 3295726 3143217 3001667 2872391 2753805
58760B753805j10620j02782r3742q5782p9867p3124o3987n5404m9902m5599m0151
$$ 2753805 2643185 2540403 2446661 2360879 2281012 2207888 2143901 2088497 2038595 1992996 1952845
58749A952845l4807l1346k8622k5190k2046j9952j7358j3635j0994j0679j0741
$$ 1952845 1918038 1886692 1858070 1832880 1810834 1790882 1773524 1759889 1748895 1738216 1727475
58738A727475r992j0457j3403j6745j9012k2051k6915l1003l2179l2112l2574
$$ 1727475 1717483 1707026 1693623 1676878 1657866 1635815 1608900 1577897 1545718 1513606 1481032
58727A481032l2251l0125k8244k7965k7246k4810k3210k4417k6043k5438k4002
$$ 1481032 1448781 1418656 1390412 1362447 1335201 1310391 1287181 1262764 1236721 1211283 1187281
58716A187281k3918k3997k2395k0317j9532j9096j7751j6579j6358j5397j2879
$$ 1187281 1163363 1139366 1116971 1096654 1077122 1058026 1040275 1023696 1007338 991941 979062
58705I79062j1066j1285j1298r573q341r300j0158q918p748q900j0462j0062r186
$$ 979062 967996 956711 945413 935840 927499 918199 908041 899123 891375 882475 872013 861951 852765
58692H52765r995j1178j0855j0292j0884j0862q781o934p330p747n788l469l512
$$ 852765 842770 831592 820737 810445 799561 788699 779918 772984 765654 757907 752119 748650 745138
58679G45138m367l360j666j666k272j310J79L83Q44L683P132Q119P054O149N337
$$ 745138 740771 737411 735745 734079 731807 730497 730676 731059 731903 735586 742718 750837 757891 764040 769377
58664G69377L823L200M916O921O604M833L517J768j752n293o535o246n914m570
$$ 769377 773200 776400 781316 788237 794841 799674 803191 804959 803207 797914 791379 785133 779219 774649
58650G74649j471J081J340J545L948O536O664N888P047R516J1425J3586J7043
$$ 774649 773178 774259 775599 777144 781092 787628 794292 800180 807227 816743 828168 841754 858797
58637H58797J9812K0236K0626K3399K6728K8203K9561L3355L8274M2280M6938
$$ 858797 878609 898845 919471 942870 969598 997801 1027362 1060717 1098991 1141271 1188209
58626A188209N3901O0563O4328O8019P5745Q6491R7082J08475J23455J40798J57451
$$ 1188209 1242110 1302673 1367001 1435020 1510765 1597256 1694338 1802813 1926268 2067066 2224517
58615B224517J74138J93340K13787K32241K48446K63027K72665K72679K62294
$$ 2224517 2398655 2591995 2805782 3038023 3286469 3549496 3822161 4094840 4357134
58606D357134K42445K10901J65250J08702M7701j4179p4967j29608j72539k03367
$$ 4357134 4599579 4810480 4975730 5084432 5132133 5117954 5042987 4913379 4740840 4537473
58596D537473k24834k37056k38904k33006k23871k12530j97984j81967j67344
$$ 4537473 4312639 4075583 3836679 3603673 3379802 3167272 2969288 2787321 2619977
58587B619977j53767j39795j27068j17390j08267r6575q4242p4890o7389n8374
$$ 2619977 2466210 2326415 2199347 2081957 1973690 1877115 1792873 1717983 1650594 1592220
58577A592220m8698m1549l6423l0790k5515k2803k0892j6800j2195j0614j0871
$$ 1592220 1543522 1501973 1465550 1434760 1409245 1386442 1365550 1348750 1336555 1325941 1315070
58566A315070r158n704l463k251j54J314m84l920n916p974j3329k0376k5122k7841
$$ 1315070 1305912 1300208 1296745 1294494 1294340 1295654 1295170 1291250 1285334 1277360 1264031 1243655 1218533 1190692
58552A190692l0976l2919l0637k6123k3496k1854j7908j3268j1882j2357j0410
$$ 1190692 1159716 1126797 1096160 1070037 1046541 1024687 1006779 993511 981629 969272 958862
58541I58862o994o344p752p138n223o181r336j0191q709q813j0500j0330q891
$$ 958862 951868 945524 937772 930634 925411 919230 909894 899703 890994 882181 871681 861351 852460
58528H52460r894j2481j2377j0115j0202j2487j2484j0029r568j1743j2615j1479
$$ 852460 842566 830085 817708 807593 797391 784904 772420 762391 752823 741080 728465 716986
58516G16986j1563j2694j1101p107n320o470o447m119k816l333k649l70N10j08
$$ 716986 705423 692729 681628 674521 669201 662731 656284 652165 649349 646016 643367 642997 643507 643399
58502F43399Q54L283L927K978L735N763N474L452L942P021Q595Q276R790J3366
$$ 643399 644253 647536 651463 654441 658176 663939 669413 672865 676807 683828 692423 700699 710489 723855
58488G23855J5151J4496J4473J5016J3017R384Q447J0114R954P176N097L930Q28
$$ 723855 739006 753502 767975 782991 796008 805392 813839 823953 833907 841083 846180 850110 850938
58475H50938l166m262l617n832j0053j1172r489j0260j3717j4851j3256j3705
$$ 850938 847772 843510 839893 834061 824008 812836 803347 793087 779370 764519 751263 737558
58463G37558j6362j6105j2537j1053j2694j2462r178p513q606q089n136m135n601
$$ 737558 721196 705091 692554 681501 668807 656345 647167 639654 631048 622959 617823 613688 608087
58450F08087m807j252l2j898j537K230M267L324M546R222J1850J0416J0059J3381
$$ 608087 603280 602028 601996 600098 598561 600791 605058 608382 612928 622150 634000 644416 654475 667856
58436F67856J6269J6517J7463J9991J9856J6000J2846J1527P761R27l785m785
$$ 667856 684125 700642 718105 738096 757952 773952 786798 798325 806086 807013 803228 798443
58424G98443o375r329q869m514k038k895j720K710M540K017J109M293O174M199
$$ 798443 792068 782739 773870 769356 767318 764423 762703 765413 769953 771970 773079 777372 783546 787745
58410G87745L406O301Q155O738O757J0194J2122J0389R704J1771J1320O226J681
$$ 787745 791151 797452 805607 812345 819102 829296 841418 851807 861511 873282 884602 890828 892509
58397H92509O2l228r667j3592j2698j2216j4333j3988r619p193q916q848m604
$$ 892509 892571 889343 879676 866084 853386 841170 826837 812849 803230 796037 787121 778273 773669
58384G73669k178m036l896J079M341K098Q4K102L112J05j398J671L541R13l48
$$ 773669 771491 767455 763559 764638 768979 771077 771161 773263 776375 776480 775082 776753 780294 781207 780859
58369G80859L388O367M606L375O456Q718O472M708O977Q595O715O492J0496J2811
$$ 780859 784247 790614 795220 798595 805051 813769 820241 824949 831926 840521 847236 853728 864224 877035
58355H77035J0393R266J2815J5358J3887J4286J9021K0945J6544J2815J3575J1818
$$ 877035 887428 896694 909509 924867 938754 953040 972061 993006 1009550 1022365 1035940 1047758
58343A047758L656l277l728l950q304j0166n394j490l671m988k25L700J408k39
$$ 1047758 1051414 1048137 1044409 1040459 1032155 1021989 1016595 1015105 1011434 1006446 1006221 1009921 1011329 1011090
58329A011090M374Q580O743N393J0019J3927J1531R654J4098J8092J5743J3733
$$ 1011090 1015464 1024044 1030787 1036180 1046199 1060126 1071657 1081311 1095409 1113501 1129244 1142977
58317A142977J7872K1365J8504J6501K1268K5169K1614J8008K1086K3380J7770
$$ 1142977 1160849 1182214 1200718 1217219 1238487 1263656 1285270 1303278 1324364 1347744 1365514
58306A365514J1564J2121J2519N815l88J710N170K420L53O239J2638J1687J0322
$$ 1365514 1377078 1389199 1401718 1407533 1407145 1408855 1414025 1416445 1416798 1423037 1435675 1447362 1457684
58293A457684J5829K0633J7284J3955J8776K3609K0036J6305K1218K6561K3421
$$ 1457684 1473513 1494146 1511430 1525385 1544161 1567770 1587806 1604111 1625329 1651890 1675311
58282A675311K0418K7144L5032L3794L1415L8160M6232M5352M3101M9227N5376
$$ 1675311 1695729 1722873 1757905 1791699 1823114 1861274 1907506 1952858 1995959 2045186 2100562
58271B100562N1312M5663M9122N2928M5903L6774L7282L9457L2522K5655L0321
$$ 2100562 2151874 2197537 2246659 2299587 2345490 2382264 2419546 2459003 2491525 2517180 2547501
58260B547501L7022L3798L0473L9469N0391M9559M6835N6099O7390O6352O2922
$$ 2547501 2584523 2618321 2648794 2688263 2738654 2788213 2835048 2891147 2958537 3024889 3087811
58249C087811P1859Q3319Q2398P9163Q8761J00811J00008R7461J09131J23260
$$ 3087811 3159670 3242989 3325387 3404550 3493311 3594122 3694130 3791591 3900722 4023982
58239D023982J22883J19945J32147J47349J47487J45759J61788J82313J86559
$$ 4023982 4146865 4266810 4398957 4546306 4693793 4839552 5001340 5183653 5370212
58230E370212J87743K07596K33022K41783K47254K72062L01848L12956L20776
$$ 5370212 5557955 5765551 5998573 6240356 6487610 6759672 7061520 7374476 7695252
58221G695252L50721L87468M05504M22671M67954N24535N63061O01552O70477
$$ 7695252 8045973 8433441 8838945 9261616 9729570 10254105 10817166 11418718 12089195
58212A2089195P50330Q09951Q73446R78556J104376J216268J344143J533909J762725
$$ 12089195 12839525 13649476 14522922 15501478 16605854 17822122 19166265 20700174 22462899
58203B2462899J992789K265396K643897L112879L644306M311777N219292O378244
$$ 22462899 24455688 26721084 29364981 32477860 36122166 40433943 45653235 52031479
58195E2031479P791507R583431J1877970J4627338J7758948K1402561K5745358
$$ 52031479 59822986 69406417 81284387 95911725 113670673 135073234 160818592
58188A60818592L0795298L6554295M3039980M9245897N1959928M6795878L1684302
$$ 160818592 191613890 228168185 271208165 320454062 372413990 419209868 450894170
58181D50894170R497638j3335679l1030072m1339186m5124963m4338803m0783455
$$ 450894170 460391808 447056129 416026057 374686871 329561908 285223105 244439650
58174B44439650l5921700l0820923k6028422k1718566j7981755j4873220j2314679
$$ 244439650 208517950 177697027 151668605 129950039 111968284 97095064 84780385
58167H4780385j0158251q329417o803426n505854m345867l296427k355640j478923
$$ 84780385 74622134 66292717 59489291 53983437 49637570 46341143 43985503 42506580
58159D2506580o07872K93856J247696K164117K683305K305935Q74941j137946
$$ 42506580 41898708 42192564 43440260 45604377 48287682 50593617 51468558 50330612
58151E0330612k967218m135314m626803m626992m300238l797164l269001k791268
$$ 50330612 47363394 43228080 38601277 33974285 29674047 25876883 22607882 19816614
58143A9816614k355334j960536j641227j398886j190900j001259q53970p48942
$$ 19816614 17461280 15500744 13859517 12460631 11269731 10268472 9414502 8665560
58135H665560o51119n51434m77020m33231l92397l46455l16690l05311k88268
$$ 8665560 8014441 7463007 6985987 6552756 6160359 5813904 5497214 5191903 4903635
58126D903635k61638k46779k44654k31244k02796j81436j71893j55251j29263
$$ 4903635 4641997 4395218 4150564 3919320 3716524 3535088 3363195 3207944 3078681
58117C078681j13373j09864r9979q2599p7894q8381r3570q7497q5741r1297q8662
$$ 3078681 2965308 2855444 2755465 2672866 2594972 2506591 2413021 2325524 2239783 2148486 2059824
58106B059824p6175p0427p3974p1015n9074n3459n6427n2968m1145l6257m0747
$$ 2059824 1983649 1913222 1839248 1768233 1709159 1655700 1599273 1546305 1505160 1468903 1428156
58095A428156l9552k9575k4982k8949k8314k0699j9320k6295k8004k1592j9982
$$ 1428156 1388604 1359029 1334047 1305098 1276784 1256085 1236765 1210470 1182466 1160874 1140892
58084A140892k6005k7319k1591k1386k9081l1697k5780k3309k7732k7808k0508
$$ 1140892 1114887 1087568 1065977 1044591 1015510 983813 958033 934724 906992 879184 858676
58073H58676j6937k0038j9044j1517q778j3723j4959q719n470q953r445l762j756
$$ 858676 841739 821701 802657 791140 782362 768639 753680 744961 739491 730538 721093 717331 715575
58060G15575o754r027m833l025o955q413n098n724j2159j4616j0139q030j1584
$$ 715575 708821 699794 694961 691936 684981 676568 671470 665746 653587 638971 628832 620802 609218
58047F09218j2242p296n556r712j0661n296k625o171p373k681m30m190n707j069
$$ 609218 596976 589680 584124 574412 563751 558455 555830 549659 542286 539605 539175 534985 529278 528209
58033E28209K014l15r36L260M675M9k779J07J532k208l986O8L111J015k62K654
$$ 528209 530223 529908 528972 532232 536907 536956 534177 534284 535816 533608 529622 529690 532801 533816 533554 536208
58017E36208L876O67o47K467L145j344l589NK301j031l859k168j542n234p085
$$ 536208 540084 540751 540104 542571 545716 544372 540783 540788 543089 542058 538199 536031 534489 529255 522170
58002E22170l454l03j535j902J717L642O15j684O3L47l839o658n035n111j0225
$$ 522170 518716 518413 516878 514976 516693 520335 520950 519266 519329 519676 515837 509179 504144 499033 488808
57987D88808j3837j1497q852j0376j1091p055l454m519n490k308M29j176k558
$$ 488808 474971 463474 454622 444246 433155 426100 422646 418127 412637 410329 410758 409582 407024
57974D07024K58L070K213J733M724O545L831J319K681L479L16j992L06K369q9
$$ 407024 407282 410352 412565 414298 419022 425567 429398 430717 433398 436877 437193 435201 435507 437876 437787
57959D37787k702j055R88r31l560l180k940n696p210l975l40n83j325R71K520
$$ 437787 435085 434030 435018 434087 430527 427347 424407 418711 411501 407526 407186 406603 405278 406249 408769
57944D08769k98l197j372K082K473J599K487K615n16l311k509j491l566n497m290
$$ 408769 408471 405274 403902 405984 408457 410056 412543 415158 414642 411331 408822 407331 403765 398268 393978
57929C93978l755p445j1542j1734j0765j2192j3058r963o328o230o854m266j045
$$ 393978 390223 382778 371236 359502 348737 336545 323487 313524 307196 300966 294112 289846 288801
57916B88801r94j808k4K058J368O08K906N273M255K898N087Q135P954O657P985
$$ 288801 287807 285999 285975 288033 289401 290009 292915 298188 302443 305341 310428 318563 326517 333174 341159
57901C41159R886Q731O368O158O318L938J294J612K752J431m34J60J169m54k829
$$ 341159 351045 359776 366144 372302 378620 382558 383852 385464 388216 389647 389213 389373 390542 390088 387259
57886C87259l232l604o084p706n726l507m796o790n357k587k547l902l315k028
$$ 387259 384027 380423 374339 366633 360907 357400 352604 345814 340457 337870 335323 331421 328106 326078
57872C26078k527k802l64K120J491K67J824L832K867J224K404M141K793N80J366
$$ 326078 323551 320749 320385 322505 323996 324263 326087 329919 332786 334010 336414 340555 343348 343928 345294
57857C45294L229K264M2J57R81q82l385k498K06N19r05q34k27j738l462k139K37
$$ 345294 348523 350787 350829 350986 351967 351085 347700 345202 345408 345927 345022 344188 343961 342223 338761 336622 336859
57840C36859j45j701n94J816J604l22m56K61j329l837l844k795m350p097p041
$$ 336859 336714 335013 334419 336235 337839 337517 337061 337322 335993 332156 328312 325517 321167 314070 307029
57825C07029n251n866q318q734p404p729r221q561o409o301p779p304n059m360
$$ 307029 301778 295912 287594 278860 271456 263727 254506 245945 239536 233235 225456 218152 213093 208733
57811B08733n208m713l102l113m213l379q93L92N30J719L203K614J229K215M844
$$ 208733 203525 198812 195710 192597 188384 185005 184112 184504 185034 186753 189956 192570 193799 196014 200858
57796B00858N961N777O604P425N623K697K243L619L536K401L055M589L813J631
$$ 200858 206819 212596 219200 226625 232248 234945 237188 240807 244343 246744 249799 254388 258201 259832
57782B59832J566K967K162n67j601q70j680m159n257m926o001q105p874n322l900
$$ 259832 261398 264365 266527 265960 264359 263489 261809 257650 252393 247467 241466 233361 225487 220165 216265
57767B16265m268l736j938j231j429J46L153M355L370K986L699L337K018K146
$$ 216265 211997 208261 206323 205092 203663 203809 206962 211317 214687 217673 221372 224709 226727 228873
57753B28873L426L218J749J688K791K361Q20J211L262L599J923J403K684L026
$$ 228873 232299 235517 237266 238954 241745 244106 244926 246137 249399 252998 254921 256324 259008 262034
57739B62034J728J067J530J308O85J696L375K726N06M89K896M141L431L815O098
$$ 262034 263762 264829 266359 267667 268352 270048 273423 276149 276655 277144 280040 284181 287612 291427 297525
57724B97525P437O887O914Q372R132Q669R113J0848J1819J1778J2527J3673J3027
$$ 297525 304962 311849 318763 327135 336267 344936 354049 364897 376716 388494 401021 414694 427721
57711D27721J1412J1966J4465J5623J5271J6620J9986K2027K1976K2851K5612
$$ 427721 439133 451099 465564 481187 496458 513078 533064 555091 577067 599918 625530
57700F25530K7770K8959L2158L7983M3214M6521N0452N6275O2117O7717P5862
$$ 625530 653300 682259 714417 752400 795614 842135 892587 948862 1010979 1078696 1154558
57689A154558Q7430R9910J12407J27226J45027J63343J81330K01118K22844K43117
$$ 1154558 1241988 1341898 1454305 1581531 1726558 1889901 2071231 2272349 2495193 2738310
57679B738310K59751K73187K81843K81194K69102K47288K16430J75343J26818
$$ 2738310 2998061 3271248 3553091 3834285 4103387 4350675 4567105 4742448 4869266
57670D869266P8889L8120O130j6593l0360m2529o7198j12945j73597k33760k80146
$$ 4869266 4948155 4986275 4992405 4975812 4945452 4902923 4835725 4722780 4549183 4315423 4035277
57659D035277l05992l10218k97144k74409k47671k18717j89244j62631j40302
$$ 4035277 3729285 3419067 3121923 2847514 2599843 2381126 2191882 2029251 1888949
57650A888949j20318j01500q5458p2865o1682n0792m1654l4607k7498j9692j3377
$$ 1888949 1768631 1667131 1581673 1508808 1447126 1396334 1354680 1320073 1292575 1272883 1259506
57639A259506r106m134K959J0016J5569K1360K8688L6308M3754N2709O3359P3524
$$ 1259506 1250400 1246266 1249225 1259241 1274810 1296170 1324858 1361166 1404920 1457629 1520988 1594512
57627A594512Q3200R5455J11022J26603J40610J55688J73100J89455K01834K11427
$$ 1594512 1677712 1773167 1884189 2010792 2151402 2307090 2480190 2669645 2871479 3082906
57617C082906K18814K20013K10690J90555J60594J20010O9465J3975m0732r1855
$$ 3082906 3301720 3521733 3732423 3922978 4083572 4203582 4273047 4287022 4246290 4154435
57607D154435j37218j73110j97578k12602k20290k20229k13013k02509j91610
$$ 4154435 4017217 3844107 3646529 3433927 3213637 2993408 2780395 2577886 2386276
57598B386276j79178j64079j48753j35779j24322j12968j02672r4086q5407p5849
$$ 2386276 2207098 2043019 1894266 1758487 1634165 1521197 1418525 1324439 1239032 1163183
57588A163183o7812o2639n7800n1302m5283m1957l9552l5723l1614k9016k6760
$$ 1163183 1095371 1032732 974932 923630 878347 836390 796838 761115 729501 700485 673725
57577F73725k3480k0755j9940j8930j5727j2295j1257j1536j0898r928r873r314
$$ 673725 650245 629490 609550 590620 574893 562598 551341 539805 528907 518979 509106 499792
57565D99792o823m369m233m937l908j966j383j626p17J111K504L865N991P767
$$ 499792 492969 488600 484367 479430 475522 473556 472173 470547 469830 470941 473445 477310 483301 491068
57551D91068Q296R232J2030J5036J6354J7237J9538K2227K3764K5572K9599L4652
$$ 491068 499364 508596 520626 535662 552016 569253 588791 611018 634782 660354 689953 724605
57539G24605L8594M2168M7239N3291N9033O5519P4206Q3827R2584J01569J12725
$$ 724605 763199 805367 852606 905897 964930 1030449 1104655 1188482 1281066 1382635 1495360
57528A495360J25314J37613J50048J63179J74550J81110J82921J80898J72638
$$ 1495360 1620674 1758287 1908335 2071514 2246064 2427174 2610095 2790993 2963631
57519B963631J54262J25246Q8235M5760L30m3874q2966j15920j42513j60670j69088
$$ 2963631 3117893 3243139 3331374 3377134 3377464 3333590 3250624 3134704 2992191 2831521 2662433
57508B662433j70427j68352j63094j53422j41085j29345j18550j07014r5166q5046
$$ 2662433 2492006 2323654 2160560 2007138 1866053 1736708 1618158 1511144 1415978 1330932
57498A330932p6531o7722n8478n0317m3465l6990l1133k6717k3002j8735j4303
$$ 1330932 1254401 1186679 1128201 1077884 1034419 997429 966296 939579 916577 897842 883539
57487H83539j0499o546j769K371M596O470R962J4205J7511K0784K5848L2082L7928
$$ 883539 873040 866494 864725 867096 871692 878162 888124 902329 919840 940624 966472 998554 1036482
57474A036482M4007N1692O0295O8797P8496R0639J03344J14380J25099J37834
$$ 1036482 1080489 1132181 1192476 1261273 1339769 1430408 1533752 1648132 1773231 1911065
57464A911065J51127J61359J67410J69796J66696J54989J34231J05854O9828K6203
$$ 1911065 2062192 2223551 2390961 2560757 2727453 2882442 3016673 3122527 3192355 3218558
57454C218558k1051o5781j04604j36831j60909j75116j80847j81286j77441j69011
$$ 3218558 3197507 3131726 3027122 2890291 2729382 2554266 2373419 2192133 2014692 1845681
57444A845681j58005j47396j37062j24959j11645r9744q9694q0000p1045o4588
$$ 1845681 1687676 1540280 1403218 1278259 1166614 1066870 977176 897176 826131 761543
57434G61543n9974n4781m8871m4066m0315l5982l1474k8663k7137k4804k1761
$$ 761543 701569 646788 597917 553851 513536 477554 446080 417417 390280 365476 343715
57423C43715j9805j8637j6491j3981j3196j3422j1990r161p877q689r135q287
$$ 343715 323910 305273 288782 274801 261605 248183 236193 227032 219155 210466 201331 193044
57411A93044p729p816p043n569n370o394o369m901m021m257l892k556j927k374
$$ 193044 185315 177499 170456 164887 159517 153123 146754 141853 137832 133575 129683 127127 125200 122826
57397A22826k459k146k812l830k948n02N47n66j421q56n27j190j236p7N99R1q9
$$ 122826 120367 118221 115409 111579 108631 108129 108676 108110 106689 105833 105306 104116 102880 102803 103402 103493 103404
57380A03404O70R40K21j52J29l17j536j756p90o48j851k377j299k59k77k11N06
$$ 103404 104074 105014 105235 105083 105212 104895 103359 101603 100813 100165 98314 95937 94638 94379 94102 93891 94397
57363I4397O25l06r22o94q06j482j328k52r8j381k278j838j423j921k322k015
$$ 94397 95022 94716 93794 93100 92294 90812 89484 89232 89134 87753 85475 83637 82214 80293 77971 75956
57347G5956j813j798q30Q83J484N58j16L36P09M30O22J697K529K790L387M060
$$ 75956 74143 72345 71515 72398 73882 74440 74324 74660 75369 75799 76421 78118 80647 83437 86824 90884
57331I0884L395J734J140J922K255J771K157L502L542J617J2J69Q05R23J474K715
$$ 90884 94279 96013 97153 99075 101330 103101 105258 108760 112302 113919 113931 114100 114905 115828 117302 120017
57315A20017L155K499K556L898M657L979L545M247M522L512K834L510M153L858
$$ 120017 123172 125671 128227 132125 136782 140761 144306 148553 153075 156587 159421 162931 167084 170942
57301A70942M060N764P593Q381R040J0288J1108J1013J1338J2711J3822J4151
$$ 170942 175002 180766 188359 196740 205780 216068 227176 238189 249527 262238 276060 290211
57289B90211J5265J7925K0556K2052K3526K5808K7865K9238L1223L4083L5894
$$ 290211 305476 323401 343957 366009 389535 415343 443208 472446 503669 537752 573646
57278E73646L5754L5434L6067L6059L4058L1305K8997K5951K0894J4705Q416J346
$$ 573646 609400 644834 680901 716960 751018 782323 811320 837271 858165 872870 881286 882632
57266H82632o812j4308j9680k3672k7101k9079k9060k8423k8172k7261k4856k2182
$$ 882632 875820 861512 841832 818160 791059 761980 732920 704497 676325 649064 624208 602026
57254F02026k0364j8585j6027j3542j1818j0008p679n938n151l897j605J35M27
$$ 602026 581662 563077 547050 533508 521690 511682 504003 498065 492914 489017 487412 487547 487974
57241D87974P93K438M219M936N279N851N761M781M479N503O237N732N404O176
$$ 487974 488767 491205 495424 500360 505639 511490 517251 522032 526511 532014 538251 543983 549387 555563
57227E55563O616N827N505P023Q990R733R859J0414J0912J1090J2123J4190J5283
$$ 555563 562179 568006 573511 580534 589524 599257 609116 619530 630442 641532 653655 667845 683128
57214F83128J4443J3571J4136J4728J4028J3395J4081J4547J3211J1518J1586
$$ 683128 697571 711142 725278 740006 754034 767429 781510 796057 809268 820786 832372
57203H32372J2840J3593J4046J5254J6860J8061J9220K0651K1551K1747K2432
$$ 832372 845212 858805 872851 888105 904965 923026 942246 962897 984448 1006195 1028627
57192A028627K3686K3687K2070K1253K2595K4037K3719K3052K3787K4803K4483
$$ 1028627 1052313 1076000 1098070 1119323 1141918 1165955 1189674 1212726 1236513 1261316 1285799
57181A285799K3712K3832K3987K3131K2428K3100K4021K3884K3560K3951K3909
$$ 1285799 1309511 1333343 1357330 1380461 1402889 1425989 1450010 1473894 1497454 1521405 1545314
57170A545314K2668K1943K3169K4994K5844K6468K7670K8253K7662K7752K9306
$$ 1545314 1567982 1589925 1613094 1638088 1663932 1690400 1718070 1746323 1773985 1801737 1831043
57159A831043K9859K7886K5992K6769K8451K8239K7189K8004L0482L2903L5635
$$ 1831043 1860902 1888788 1914780 1941549 1970000 1998239 2025428 2053432 2083914 2116817 2152452
57148B152452L9568M3004M3907M3611M4771M7280M9398N1102N3117N4443N4115
$$ 2152452 2192020 2235024 2278931 2322542 2367313 2414593 2463991 2515093 2568210 2622653 2676768
57137B676768N3519N3897N3592N0839M7100M4338M1290L5946K9683K5336K3081
$$ 2676768 2730287 2784184 2837776 2888615 2935715 2980053 3021343 3057289 3086972 3112308 3135389
57126C135389K1668K1750K4462K8529L2200L6217M1613M6541M8531M8005M6542
$$ 3135389 3157057 3178807 3203269 3231798 3263998 3300215 3341828 3388369 3436900 3484905 3531447
57115C531447M3948M0171L7709L8890M3000M8974N8084P1002Q5506J00541J19242
$$ 3531447 3575395 3615566 3653275 3692165 3735165 3784139 3842223 3913225 3998731 4099272 4218514
57104D218514J44575J75727K12574K59693L21871L99774M94599O12856P62110
$$ 4218514 4363089 4538816 4751390 5011083 5332954 5732728 6227327 6840183 7602293
57095G602293R46343J169749J439434J758600K121575K519226K941359L367817
$$ 7602293 8548636 9718385 11157819 12916419 15037994 17557220 20498579 23866396
57087B3866396L766288M106441M366346M518918M534450M421948M253821M108685
$$ 23866396 27632684 31739125 36105471 40624389 45158839 49580787 53834608 57943293
57079E7943293L975828L739441L272894K537716J589167N16232n97439j671103
$$ 57943293 61919121 65658562 68931456 71469172 73058339 73574571 72977132 71306029
57071G1306029k625499l401009l970743m334345m507575m518254m401597m191966
$$ 71306029 68680530 65279521 61308778 56974433 52466858 47948604 43547007 39355041
57063C9355041l918744l607439l279300k949458k628948k327987k054253j809581
$$ 39355041 35436297 31828858 28549558 25600100 22971152 20643165 18588912 16779331
57055A6779331j592176j401217j236438j095064r73004q68080p78988p02297o33741
$$ 16779331 15187155 13785938 12549500 11454436 10481432 9613352 8834364 8132067 7498326
57046G498326n71627n16266m67017m22419l82199l46620l14725k85299k58584
$$ 7498326 6926699 6410433 5943416 5520997 5138798 4792178 4477453 4192154 3933570
57037C933570k35151k14190j94666j76946j61643j48116j35652j24717j15590
$$ 3933570 3698419 3484229 3289563 3112617 2950974 2802858 2667206 2542489 2426899
57028B426899j07201r8752r0957q4446p8542p2770o7800o3674n9053n3447m8251
$$ 2426899 2319698 2220946 2129989 2045543 1967001 1894231 1826431 1762757 1703704 1650257 1602006
57017A602006m4335m0583l5940l0883k5630j9111j0937k328O213J6018K7909M0995
$$ 1602006 1557671 1517088 1481148 1450265 1424635 1405524 1394587 1392259 1398472 1414490 1442399 1483394
57005A483394N5084P2372R5383J24185J54571J75803J71447J29318N4589k9907
$$ 1483394 1538478 1610850 1706233 1830418 1984989 2160792 2332239 2461557 2516146 2486239
56995B486239r9542j42934j61898j62698j51520j34582j16732r9560q3123o8382
$$ 2486239 2386697 2243763 2081865 1919167 1767647 1633065 1516333 1416773 1333650 1265268
56985A265268n6121m5211l4366k4411j7070j3081j2972j7623k6083l4783m0834
$$ 1265268 1209147 1163936 1129570 1105159 1088089 1075008 1062036 1044413 1018330 983547 942713
56974I42713m4437m6456m5945m2069l6438l1108k5984k0174j4186q764l276K744
$$ 942713 898276 851820 805875 763806 727368 696260 670276 650102 635916 627152 623876 626620
56962F26620Q064J1737J4969J9221K4040K8556L3202L7792L9482L4983K3969R004
$$ 626620 634684 646421 661390 680611 704651 733207 766409 804201 843683 878666 902635 911639
56950I11639o631j9799k8038l1106l0960k9209k5961k1688j7966j5221j2079q119
$$ 911639 905008 885209 857171 826065 795105 765896 739935 718247 700281 685060 672981 664862
56938F64862m814k435J174P082J3187J7734K2335K9265L7715M4665M7344M3147
$$ 664862 660048 657613 658787 665869 679056 696790 719125 748390 786105 830770 878114 921261
56926I21261K9996R493j2207k9123l9727m5203m6118m3073l8211l3332k8149k2475
$$ 921261 951257 960750 948543 919420 879693 834490 788372 745299 707088 673756 645607 623132
56914F23132j8043j6028j4828j2711j0596r848r341p423m928l618l160k178p65
$$ 623132 605089 589061 574233 561522 550926 541078 531737 524314 519386 515768 512608 510430 509665
56901E09665L20J509L300M832N627P092J0218J3548J5490J6775J8669K0716K2389
$$ 509665 509985 511494 514794 519626 525253 532345 542563 556111 571601 588376 607045 627761 650150
56888F50150K4817K8618L2152L4187L5809L7072L4340K4360R137o252j8931k8362
$$ 650150 674967 703585 735737 769924 805733 842805 877145 901505 910642 904390 885459 857097
56876H57097l3466l3439l0307k7126k4346k0650j6180j2048p660j675N274J1566
$$ 857097 823631 790192 759885 732759 708413 687763 671583 659535 651875 650200 655474 667040
56864F67040J7588K5051L4190M4137N5231O8014Q0144Q6414Q1802O3765L3575
$$ 667040 684628 709679 743869 788006 843237 911251 991395 1077809 1159611 1223376 1256951
56853A256951k432l4610n5978o6167o8486o5184n7515m7905l8650k9625j9831
$$ 1256951 1254519 1219909 1163931 1097764 1029278 964094 906579 858674 820024 790399 770568
56842G70568r850m94R343K0915L3328M5522N8764P4600R2214J10283J28541J43403
$$ 770568 760718 760224 769567 790482 823810 869332 928096 1002696 1094910 1205193 1333734 1477137
56830A477137J44397J20685P2059J0759m7314r1019j16035j23922j20280j10893
$$ 1477137 1621534 1742219 1814278 1825037 1777723 1686704 1570669 1446747 1326467 1215574
56820A215574r8393q3507o8064n4239m1946k9690j7431o075M977J7157L0245M3075
$$ 1215574 1117181 1033674 965610 911371 869425 839735 822304 816229 821206 838363 868608 911683
56808I11683N6144P0993Q7028J00210J04128R1870O0063J4025l2985o8824r0011
$$ 911683 967827 1038820 1125848 1226058 1330186 1422056 1482119 1496144 1463159 1394335 1304324
56797A304324r9281r9244r1963q1541p1917o2950n2511m1274l1684k3488j4462
$$ 1304324 1205043 1105799 1013836 932295 860378 797428 744917 703643 671959 648471 634009
56786F34009m777L401R985J6913K4625L2244M0256M8896N4197M9971L4326J1314
$$ 634009 629232 632633 642618 659531 684156 716400 756656 805552 859749 909720 944046 955360
56774I55360j3418l5445n1038n8211n8866n6737n3113m7268m0251l4622l0650
$$ 955360 941942 906497 855459 797248 738382 681645 628532 581264 541013 506391 475741
56763D75741k6348k1296j7134j4417j2147j0314r702r451p875n493m188l843k936
$$ 475741 449393 428097 410963 396546 384399 374085 364383 354932 347057 341564 337376 333533 330597
56750C30597j788j858k447j671k25m47k049k448j183k72l81l06r5r49k112j637
$$ 330597 328809 326951 324504 322833 322608 322161 320112 317664 316481 316209 315828 315522 315427 314478 312366 310729
56734C10729j45j18j528j986j189j256k535l052k342k009k224j527m04j054l190
$$ 310729 310584 310466 308938 306952 305763 304507 301972 298920 296578 294569 292345 290818 290414 289360 286170
56719B86170l976k672j524j555j322l85j84p85n35M44J39j430j923q85l54p44
$$ 286170 282194 279522 277998 276443 275121 274736 274552 273767 273232 273676 273815 272385 270462 269577 269223 268479
56703B68479j44J624K259J246P87J549J497Q0m15R88K262K105J764J895J319J06
$$ 268479 268335 269959 272218 273464 274251 275800 277297 277377 276962 277950 280212 282317 284081 285976 287295 287401
56687B87401J49J446J497k92j412p50m50j727k659j865q62r03q50PK99n52q94
$$ 287401 287550 288996 290493 290201 288789 288039 287589 285862 283203 281338 280476 279573 278723 278730 279029 278477 277583
56670B77583K6O88M01O39J840K121P62k24L83J083P23L45N44K11o61j84J899L153
$$ 277583 277609 278297 278698 279337 281177 283298 284060 283836 284219 285302 286025 286370 286914 287125 286464 286280 288179 291332
56652B91332K357J296J203Q27m34r37l4L69q14k027k220k536l436l460k400k221
$$ 291332 293689 294985 296188 297015 296581 295644 295610 295979 295165 293138 290918 288382 284946 281486 279086 276865
56636B76865l336l479j917j022j935k469j354o95j922k988k098o99l60J6J339
$$ 276865 273529 270050 268133 267111 265176 262707 261353 260658 258736 255748 253650 252951 252591 252607 253946
56621B53946K034J131M66J342K080J365Q87K063L160K339P10j12p28j852k340
$$ 253946 255980 257111 257577 258919 260999 262364 263251 265314 268474 270813 271523 271411 270683 268831 266491
56606B66491j620j325k210k439j052p8q86j615p05K30l54r95l14J58q97j713o60
$$ 266491 264871 263546 261336 258897 257845 257767 256881 255266 254561 254791 254437 253442 253128 253286 252389 250676 250016
56589B50016N36p9j069k87J280J453N16J9l8j93K05J300J483J15q39m6Q74M41
$$ 250016 250552 250473 249404 249117 250397 251850 252366 252385 252347 252154 252359 253659 255142 255257 254418 254372 255246 255687
56571B55687O4J302L013L654L816M253M006K810K443L516L850K403J551K893M197
$$ 255687 255751 257053 260066 263720 267536 271789 275795 278605 281048 284564 288414 290817 292368 295261 299458
56556B99458L381K262L141M711M691L704L283K739J184Q7O66J283M06m98j9J37
$$ 299458 302839 305101 308242 312953 317644 321348 324631 327370 328554 328641 329307 330590 330996 330498 330479 330616
56540C30616j727l825l877k943l082l764l789m102n493o160m734l139l288l710
$$ 330616 328889 325064 321187 318244 315162 311398 307609 303507 298014 291854 287120 283981 280693 276983
56526B76983k629j421j714j943m29J042L38j032q02n1o87j581r48l6o31j497r60
$$ 276983 274354 272933 271219 269276 268847 269889 270227 269195 268393 268342 267655 266074 265126 265090 264459 262962 262002
56509B62002l81j293j907m25J059J39j299m04J486J526N96J115K072J094o70n15
$$ 262002 261621 260328 258421 257996 259055 259194 257895 257491 258977 260503 261099 262214 264286 265380 264710 264195
56493B64195Q55R68L62J054K091J310j73J81J584J557O59J068K023J292k60j54
$$ 264195 265050 266018 266380 267434 269525 270835 270662 270843 272427 273984 274643 275711 277734 279026 278766 278612
56477B78612J046J031K85R68K544K893K471L055L782K774J303J891L678M050L389
$$ 278612 279658 280689 280974 281942 284486 287379 289850 292905 296687 299461 300764 302655 306333 310383 313772
56462C13772L848M833M307L122L472M368L284J102P05J848J962R72P23P84n92
$$ 313772 317620 322453 326760 329882 333354 337722 341006 342108 342813 344661 346623 347595 348318 349102 348510
56447C48510k383k312j252j719l085k878j606j626k372j465M91Q97o2k22J43p11
$$ 348510 346127 343815 342563 340844 337759 334881 333275 331649 329277 327812 328303 329200 329138 328916 329059 328348
56431C28348j825j102K32m65k150j864l38o49k497k961k059k233l263k897j726
$$ 328348 326523 325421 325653 325188 323038 321174 320836 320187 317690 314729 312670 310437 307174 304277 302551
56416C02551k143l326k481k82L17k58P61K612K016n33j329l2J12j542k272j444
$$ 302551 300408 297082 294601 294319 294636 294378 295139 297751 299767 299234 297905 297873 297985 296443 294171 292727
56400B92727j130j276K34K538K426J51p39M42Q19l95r23k77l39r47o8J533J039
$$ 292727 291597 290321 290555 293093 295519 295670 294931 295373 296192 295797 294874 294597 294258 293311 293243 294776 295815
56383B95815r55j109O54J238L98Q85K514K047o24j961j011m31p42N49L383M428
$$ 295815 294860 293751 294405 295643 296041 296926 299440 301487 300863 298902 297891 297460 296718 297267 300650 305078
56367C05078K952J865K144J710O29J649M526N486L571K148K877L467K635K135
$$ 305078 308030 309895 312039 313749 314378 316027 320553 326039 329610 331758 334635 338102 340737 342872
56353C42872K582K247J040R36J656P86j280j528J39Q28L11J266L508L770J822
$$ 342872 345454 347701 348741 349677 351333 352119 350839 349311 349450 350278 350589 351855 355363 359133 360955
56338C60955R63J869J823P36J710M762O059M557L424L896L719K724L622O140O624
$$ 360955 361918 363787 365610 366346 368056 372818 378877 383434 386858 390754 394473 397197 400819 406959 413583
56323D13583M742M342O348P199N751N240O802P489O426O485Q042P666M871L662
$$ 413583 418325 422667 429015 436214 441965 447205 454007 461496 467922 474407 482449 490115 494986 498648
56309D98648N280N879L673J901K369K423Q15K42J570J664m81j477J75J542J192
$$ 498648 503928 509807 513480 515381 517750 520173 520988 521230 522800 524464 523983 522506 522681 524223 525415
56294E25415J532L063K751M03J70L220N414M801M822P381R378R042R186J1167
$$ 525415 526947 530010 532761 533164 533334 536554 541968 546769 551591 558972 568350 577392 586578 597745
56280E97745J2180J1449J2540J6537J9503J9721K0795K4416K7087K7332K9031
$$ 597745 609925 621374 633914 650451 669954 689675 710470 734886 761973 789305 818336
56269H18336L3990L8239L9704M2552M9537N6902O1436O6142P4204Q3501R1842
$$ 818336 852326 890565 930269 972821 1022358 1079260 1140696 1206838 1281042 1364543 1456385
56258A456385J01598J14421J26990J36632J45727J56304J65723J71748J76340
$$ 1456385 1557983 1672404 1799394 1936026 2081753 2238057 2403780 2575528 2751868
56249B751868J80338J80154J73706J63926J52519J36218J13326Q7974O3720L8990
$$ 2751868 2932206 3112360 3286066 3449992 3602511 3738729 3852055 3940029 4003749 4042739
56239D042739J3021r978k7112m1325n5252o6441p3000p7898q3288q6429q5697
$$ 4042739 4055760 4045782 4018670 3977345 3922093 3855652 3782652 3704754 3621466 3535037 3449340
56228C449340q4664q5965q7234q7218q9563r6005j02237j05051j07225j10945
$$ 3449340 3364676 3278711 3191477 3104259 3014696 2918691 2816454 2711403 2604178 2493233
56218B493233j13077j11642j10174j10805j09776j04703r9447r6637r2434q4089
$$ 2493233 2380156 2268514 2158340 2047535 1937759 1833056 1733609 1636972 1544538 1460449
56208A460449p5715p0903o6435n9089n1957m8113m4652l8883l3909l2261l0537
$$ 1460449 1384734 1313831 1247396 1188307 1136350 1088237 1043585 1004702 970793 938532 907995
56197I07995k6047k2177k1506k0524j6880j4598j6121j6569j2391q199q402r396
$$ 907995 881948 859771 838265 817741 800861 786263 770142 753573 741182 732983 724581 715185
56185G15185o996m250m667m909j705J110p3j261J623M821M051K778N274Q306P768
$$ 715185 708189 703939 699272 694363 692658 693768 693695 692434 694057 698878 702929 705707 710981 719287 727055
56170G27055O856R513J2320J1097R035J0205J1520R356P382R454J1490Q892N371
$$ 727055 733911 743424 755744 766841 775876 786081 797601 806957 814339 823793 835283 844175 849546
56157H49546N733O794M297J958M409P897P287N816Q433J1997J1721J0948J4794
$$ 849546 855279 862073 866370 868328 872737 880634 887921 893737 902170 914167 925888 936836 951630
56144I51630K0414K3211K6396L4498M3842M9574N5814O8541Q4522R7508J09171
$$ 951630 972044 995255 1021651 1056149 1099991 1149565 1205379 1273920 1358442 1455950 1565121
56133A565121J23346J35472J38569J34063J26623J14529R5782P7412O7524O3635
$$ 1565121 1688467 1823939 1962508 2096571 2223194 2337723 2433505 2510917 2578441 2642076
56123B642076N9156N4829N2908M7135L0854R438p043j7910k7615l4311l5055l6332
$$ 2642076 2701232 2756061 2808969 2856104 2886958 2896396 2889353 2871443 2843828 2809517 2774462 2738130
56111B738130m6622o3429p9200r4207j11582j25853j29274j24272j17644j08253
$$ 2738130 2691508 2628079 2548879 2454672 2343090 2217237 2087963 1963691 1846047 1737794
56101A737794r2544p5734o4666n5760m2832l0282k5299k3865j8302j2048j2569
$$ 1737794 1645250 1569516 1504850 1449090 1406258 1375976 1350677 1326812 1308510 1296462 1283893
56090A283893j6230j4920j1380j2979j6458j4188r551j0547j3858j1028m864l897
$$ 1283893 1267663 1252743 1241363 1228384 1211926 1197738 1188187 1177640 1163782 1152754 1147890 1143993
56078A143993o033l560J169J043o59L441R229Q223M265O375J1204R897O097R137
$$ 1143993 1137960 1134400 1135569 1136612 1135953 1139394 1148623 1156846 1161111 1167486 1178690 1188587 1194684 1203821
56064A203821J5382J4850J0544J2422J7832J7095J2981J5068K0253J8656J3614
$$ 1203821 1219203 1234053 1244597 1257019 1274851 1291946 1304927 1319995 1340248 1358904 1372518
56053A372518J5574K1415K0322J4997J6196K1453K0441J6090J8737K4716K3075
$$ 1372518 1388092 1409507 1429829 1444826 1461022 1482475 1502916 1519006 1537743 1562459 1585534
56042A585534J7990K1546K9783K9664K4423K7424L5992L6611L1318L3127L9700
$$ 1585534 1603524 1625070 1654853 1684517 1708940 1736364 1772356 1808967 1840285 1873412 1913112
56031A913112L8056L1212L3149M1281M1295L5490L8208M6959M7016M1101M4816
$$ 1913112 1951168 1982380 2015529 2056810 2098105 2133595 2171803 2218762 2265778 2306879 2351695
56020B351695N5812N7800N2196N4908O4580O5757O0672O5189P5982P5480O6891
$$ 2351695 2407507 2465307 2517503 2572411 2636991 2702748 2763420 2828609 2904591 2980071 3046962
56009C046962O9659Q2323Q5672Q0610Q5900R9994J03438R7988J03952J19606J23794
$$ 3046962 3116621 3198944 3284616 3365226 3451126 3551120 3654558 3752546 3856498 3976104 4099898
55998D099898J18228J25181J43484J50245J46393J55538J77048J86895J86037
$$ 4099898 4218126 4343307 4486791 4637036 4783429 4938967 5116015 5302910 5488947
55989E488947J99484K26019K39176K39963K56131K87081L04194L08477L30411
$$ 5488947 5688431 5914450 6153626 6393589 6649720 6936801 7240995 7549472 7879883
55980G879883L69571L94661M07081M41066M96634N39293N70795O28868P11597
$$ 7879883 8249454 8644115 9051196 9492262 9988896 10528189 11098984 11727852 12439449
55971A2439449P78273Q31841R19243J042734J158252J270408J434505J654234
$$ 12439449 13217722 14049563 14968806 16011540 17169792 18440200 19874705 21528939
55963B1528939J880409K123827K457894K896330L393573L984386M786369N846872
$$ 21528939 23409348 25533175 27991069 30887399 34280972 38265358 43051727 48898599
55955D8898599P144505Q760070J0855054J3447589J6429783J9851239K3928939
$$ 48898599 56043104 64803174 75658228 89105817 105535600 125386839 149315778
55948A49315778K8742615L4259575M0602234M7431150N2438661N1204338M0054235
$$ 149315778 178058393 212317968 252920202 300351352 352790013 403994351 444048586
55941D44048586J9738709m161317k4888242l8541306m4953700m5882863m3260226
$$ 444048586 463787295 459625978 434737736 396196430 351242730 305359867 262099641
55934B62099641l8709663l3529406k8512940k3945090j9921982j6542732j3800566
$$ 262099641 223389978 189860572 161347632 137402542 117480560 100937828 87137262
55927H7137262j1543727r651359q112923o896738n890349n020318m304358l741505
$$ 87137262 75593535 65942176 57829253 50932515 45042166 40021848 35717490 31975985
55919C1975985l262816k828238k467965k190790j944756j701960j495586j341079
$$ 31975985 28713169 25884931 23416966 21226176 19281420 17579460 16083874 14742795
55911A4742795j200361j053804r32690q51175p75387o87402o14866n71039n26772
$$ 14742795 13542434 12488630 11555940 10704765 9929378 9241976 8627110 8056071 7529299
55902G529299m67159m18169l92807l65491l23058k89233k75976k60073k29858
$$ 7529299 7062140 6643971 6251164 5885673 5562615 5273382 4997406 4737333 4507475
55893D507475k07703k04739j98559j76828j59784j58953j55020j36777j22480
$$ 4507475 4299772 4095033 3896474 3719646 3559862 3400909 3245889 3109112 2986632
55884B986632j22712j19931j04055r1994r3315r1524p7542o7771p1211p1705o0194
$$ 2986632 2863920 2743989 2639934 2547940 2454625 2363101 2285559 2217788 2146577 2074872 2014678
55873B014678n2547n7939o0725n1057m3367m7219m8911l9409l2471l7695m2243
$$ 2014678 1962131 1904192 1843467 1792410 1749043 1701824 1652913 1613504 1581033 1543338 1501095
55862A501095l6215l0508l3040l2360k1313j3000j7162k3485k3444k5931l6251
$$ 1501095 1464880 1434372 1401332 1368972 1347659 1334659 1317497 1294012 1270568 1244637 1208386
55851A208386m2153l6004k9440l1363l2374k5317k0209k4193k6955k0697j4954
$$ 1208386 1166233 1130229 1100789 1069426 1037052 1011735 991526 967333 940378 919681 904727
55840I04727j7373j8983j2717p793j1423j4493r487m992q560j2311r220o872j1573
$$ 904727 887354 868371 855654 847861 836438 821945 812458 807466 798906 786595 777375 770503 758930
55827G58930j5280j1564q396j2081j4603r987p080j2819j8381j5584j1772j4859
$$ 758930 743650 732086 723690 711609 697006 687019 679939 667120 648739 633155 621383 606524
55815F06524j8274j4586r946j1353j2969q490m131o095p829k713K958K300R26
$$ 606524 588250 573664 563718 552365 539396 530906 526775 520680 512851 510138 513096 515396 516322
55802E16322N152R176O709L663O606R811O299Q86Kq08o972j3008j2630j0691j3221
$$ 516322 521474 530650 537359 541022 547628 557439 563738 564624 564626 563818 556846 543838 531208 520517 507296
55787E07296j5520j1960p815r503j2417j0120o482p273q573m947m85p27k142l63
$$ 507296 491776 479816 472001 462498 450081 439961 433479 426206 417633 412686 412201 411474 409332 408969
55773D08969j16o166j2864j3594j2176j4375j6566j3575r467r604j0115o016j843
$$ 408969 408853 402687 389823 376229 364053 349678 333112 319537 310070 300466 290351 284335 282492
55760B82492l357o515n490l841o859j0393q500m958o068q854p434m478n292o938
$$ 282492 279135 272620 267130 263289 256430 246037 237537 232579 226511 217657 210223 205745 200453 193515
55746A93515m165j71p06l151k008L97j052l894l007n68j270k793p62K081J191
$$ 193515 189350 189179 188473 185322 183314 183711 182659 178765 175758 175190 173920 171127 170365 172446 173637
55731A73637n80J404M112K513o55l26J012j421m858m226k143l888p135o569m043
$$ 173637 173057 174461 178573 181086 180431 180105 181117 179696 174838 170612 168469 164581 157446 150877 146834
55716A46834m400n666l262L61J45j654K05L711L436R72J744M823N474M660O467
$$ 146834 142434 136768 133506 133867 134012 132358 132563 136274 139710 140682 142426 147249 152723 157383 163850
55701A63850R024P419L049J148J436j15k843l164k168l185m422k112J649K215
$$ 163850 172874 180293 183342 184490 185926 185811 182968 179804 177636 174451 170029 167917 169566 171781
55687A71781P68J486L329K531M76J089L140K907J625K653M290L126J279K372L717
$$ 171781 172549 174035 177364 179895 180371 181460 184600 187507 189132 191785 196075 199201 200480 202852 206569
55672B06569P14m113m970k617j997k877j588O60q3k287j413J500J936N45J320
$$ 206569 207283 203170 198200 195583 193586 190709 189121 189781 189698 187411 185998 187498 189434 189979 191299
55657A91299L337K662N81J484M276M212J707J095K188J240j169j353k17j671m705
$$ 191299 194636 197298 197879 199363 203639 207851 209558 210653 212841 214081 212912 211559 211342 209671 204966
55642B04966n098l723m966q059q293n899n521p439p476n267m685o130o074m208
$$ 204966 199868 196145 191179 183120 174827 168928 163407 155968 148492 143225 138540 132410 126336 122128
55628A22128l787m938m662l330m127o362o183l726k769l615l113j258j035k110
$$ 122128 118341 113403 108741 105411 101284 94922 88739 85013 82244 78629 75516 74258 73223 71113
55614G1113j410N32L80j332j102P13O67q49l73J581J243j082j454L13O65o39m26
$$ 71113 69703 70235 70615 69283 68181 68894 69561 68712 68339 69920 71163 70081 68627 68940 69605 68966 68540
55597F8540J157Q39j004p98J161J053j103j383N95J214j20l61N70l32k424j754
$$ 68540 69697 70536 69532 68734 69895 70948 69845 68462 69057 70271 70151 69790 70360 70028 67604 65850
55581F5850J407K426M58m34R88J249p51j767o55k59j371j178P76J303k50n11J695
$$ 65850 67257 69683 70141 69707 70695 71944 71193 69426 68771 68512 67141 65963 66739 68042 67792 67281 68976
55564F8976L349K928K481K803J968j30j072p60j689l617l462j148J3n93k19J277
$$ 68976 72325 75253 77734 80537 82505 82375 81303 80543 78854 75237 71775 70627 70640 70047 69828 71105
55548G1105Q33j595k340o93j42j718k174k91Q78j07o63O01J540J080J074K016
$$ 71105 71938 70343 68003 67310 67168 65450 63276 62985 63863 63756 63093 63694 65234 66314 67388 69404
55532F9404J861N10M80J990K411J543K168M374M854L012K138L254L441J683O99
$$ 69404 71265 71775 72255 74245 76656 78199 80367 84741 89595 92607 94745 97999 101440 103123 103822
55517A03822J350Q73j573l115k717l071n068n841m313l364m385m800l200j937
$$ 103822 105172 106045 104472 101357 98640 95569 90501 84660 80347 76983 72598 67798 64598 62661
55503F2661k424k708j781j562k639k752j400j146k557k755q71K2j543k851k079
$$ 62661 60237 57529 55748 54186 51547 48795 47395 46249 43692 40937 40066 40088 38545 35694 33615
55488C3615j114j230p64P77J020o97j623n76M0r02j079N66J739J428J788L287
$$ 33615 32501 31271 30507 31284 32304 31607 29984 29408 29448 28546 27467 28033 29772 31200 32988 36275
55472C6275L048L15j512p51l29k119l415k083l86n33q92J71R33O2m32Q48J659
$$ 36275 39323 39638 38126 37375 37046 34927 31512 29429 29043 28510 27618 27789 28722 28784 28352 29200 30859
55455C0859K18j398j044j20m73j073n80L7l0L62J371R81j104k010l90J181P33
$$ 30859 31077 29679 28635 28515 28042 26969 26389 26426 26396 26758 28129 29110 28006 25996 25606 26787 27520
55438B7520j09J00j01j507k016n57N64r0m15J002J948P38n63J1R14M81J21J143
$$ 27520 27411 27511 27410 25903 23887 23330 23894 23804 23389 24391 26339 27077 26514 26525 27439 27920 28041 29184
55420B9184J859Q67j36L89J033N47M16J634K294J155J92R23J585O48k85K02O02
$$ 29184 31043 31910 31774 32163 33196 33743 34159 35793 38087 39242 39434 40357 41942 42590 42305 42507 43109
55403D3109j75l07J264K160N92j322j312o63j232j997j551r69j258j088K19O52
$$ 43109 42934 42627 43891 46051 46643 45321 44009 43346 42114 40117 38566 37597 36339 35251 35470 36122
55387C6122q58k083j428p59j553j924m41P83n2j012j37R69N00j28M78N90j098
$$ 36122 35264 33181 31753 30994 29441 27517 27076 27859 27807 26795 26658 27627 28127 27999 28477 29067 27969
55370B7969k302j143K50k56o97J143L216K647O83K9J54p26j685j140l60j007j736
$$ 27969 25667 24524 24774 24518 23821 24964 28180 30827 31510 31539 31693 30967 29282 28142 27782 26775 25039
55353B5039q97M2n44r70M68J686M22j302o29R50M64j103r40K53j44j581j544l12
$$ 25039 24142 24184 23640 22670 23138 24824 25246 23944 23315 24265 24729 23626 22686 22939 22795 21214 19670 19358
55335A9358Mk86O12K047K035J053Q88J048P0j100p60O9m06j006K57J930J272p94
$$ 19358 19362 19076 19688 21735 23770 24823 25711 26759 26829 25729 24969 25038 24632 23626 23883 25813 27085 26291
55317B6291j124L49R81J55l67j43k74n98j70J97p54j799r82P09Q24l89p00J84
$$ 26291 25167 25516 26497 26652 26285 26142 25868 25270 25100 25297 24543 22744 21762 22471 23295 22906 22206 22390
55299B2390Q42J285K366L034J655o84j495p35k29k69K8J04r85j936j004O39O41
$$ 22390 23232 24517 26883 29917 31572 30888 29393 28658 28429 28160 28188 28292 27307 25371 24367 25006 25647
55282B5647m84n33K97J26p63n20N73O58l7L50J675K064J390J173J470J027J62
$$ 25647 25163 24630 24927 25053 24290 23770 24343 25001 24964 25314 26989 29053 30443 31616 33086 34113 34275
55265C4275K48Q72M78o20r27p35j358k133j419Q2K65o83p74J30L98m7K41J213
$$ 34275 34523 35395 35873 35253 34326 33591 32233 30100 28681 28763 29028 28345 27571 27701 28099 28052 28293 29506
55247B9506J383O71K82J72n82j359q59K25K34m28k03M66l0j161r69M29J146Q09
$$ 29506 30889 31560 31842 32014 31432 30073 29214 29439 29673 29245 29042 29508 29478 28317 27348 27777 28923 29732
55229B9732N79N00k06p85LJ201J003L8J70Q94L07j043q47Q72J913J760J869K386
$$ 29732 30311 30811 30605 29820 29823 31024 32027 32065 32235 33129 33436 32393 31546 32418 34331 36091 37960 40346
55211D0346J994Q45M12N79jr54q08r8n54j640j328O0K86p96j217o87p65j372p89
$$ 40346 42340 43185 43597 44176 44175 43221 42413 42315 41761 40121 38793 38853 39139 38343 37126 36439 35674 34302 33513
55192C3513P11R40l16r22k32J46k81k08M30J42r78j080J0M22k71l71O37J258R64
$$ 33513 34224 35164 34848 33926 33694 33840 33559 33351 33781 33923 32945 31865 31875 32297 32026 31655 32292 33550 34514
55173C4514R52J436J186J89j45K25j02j003q33L73P92J74J75R84R03l49j070p82
$$ 34514 35466 36902 38088 38277 38132 38357 38255 37252 36419 36792 37584 37758 37933 38917 39820 39471 38401 37619
55155C7619q22j330r19K26K31r45j183qO47J69L13J659K345J455N17N14M26k68
$$ 37619 36797 35467 34548 34774 35005 34060 32877 32869 33516 33685 33998 35657 38002 39457 39974 40488 40914 40646
55137D0646n48k74p74j997k036m58P33M48p1k6l06j015p11P72J632J222J052J726
$$ 40646 40098 39824 39050 37053 35017 34559 35292 35740 35669 35643 35337 34322 33611 34383 36015 37237 38289 40015
55119D0015J818Q37K94P21N76o77j325n52J42j01K4J089J489M10n15q8N47L83
$$ 40015 41833 42670 42964 43685 44261 43584 42259 41707 41849 41748 41772 42861 44350 44760 44245 44157 44704 45087
55101D5087L33R56J030k8p40j68M58K28J78R51J236K61n91k46J86k69n16M77J660
$$ 45087 45420 46376 47406 47378 46638 46470 46928 47156 47334 48285 49521 49782 49191 48945 49131 48862 48346 48823 50483
55082E0483J740J147O77M2p50n91P31J628J159N29Q42J326J075N89L00m45j629
$$ 50483 52223 53370 54047 54089 53339 52748 53479 55107 56266 56795 57637 58963 60038 60627 60927 60482 58853
55065E8853j842o20M21J47m43l10k6j10J87R98R39m57j531j177o44j098j486n96
$$ 58853 57011 56391 56812 56959 56516 56206 56180 56070 56257 57255 58194 57737 56206 55029 54385 53287 51801 51205
55047E1205O89R47L99j35q14j757k039j229m27m97p20l92r2j70K02J240J578M99
$$ 51205 51894 52841 53240 53105 52291 50534 48495 47266 46839 46342 45622 45230 45138 44968 45170 46410 47988 48487
55029D8487o82p41m00o63j011o68j18L3K24Q57J421J680K219K942K744J502N72
$$ 48487 47805 47064 46664 46001 44990 44322 44204 44237 44461 45318 46739 48419 50638 53580 56324 57826 58398
55012E8398N34M09j28N1J138J538N35m55m46m20j032j238n30j99q77j183l58J46
$$ 58398 58932 59341 59213 59264 60402 61940 62475 62020 61574 61154 60122 58884 58354 58155 57278 56095 55737 55883
54994E5883n66j018q0Q16K76n00O0J133J197O86P63J028N62j38j97L5O9M82J481
$$ 55883 55317 54299 54219 55035 55311 54811 54871 56004 57201 57887 58650 59678 60240 60102 59905 59940 60009 60491 61972
54975F1972J917J190M65M91K18q44j076N79K346K197Q47J40K23L71R06K112K845
$$ 61972 63889 65079 65544 66035 66253 65409 64333 64912 67258 69455 70302 70442 70665 71036 71942 74054 76899
54958G6899K370K055L218M800N236N028N425O077O186O512Q041R945J1032J1868
$$ 76899 79269 81324 84542 89342 94578 99606 105031 111108 117294 123806 131847 141792 152824 164692
54944A64692J3405J4770J4585J3175J1437Q793M371r17n513r279j2585j4634j4640
$$ 164692 178097 192867 207452 220627 232064 240857 245228 244311 238798 229519 216934 202300 187660
54931A87660j3523j2536j1470r925q886r015q934p296n172m281m188l467k294
$$ 187660 174137 161601 150131 140206 131320 122305 113371 106075 100903 96622 92434 88967 86673
54918H6673j670j287l72M44L53K67J411L142M178M788N767O584O694P262R258
$$ 86673 85003 83716 83344 83788 84141 84408 85819 88961 93139 97927 103694 110278 116972 124234 133492
54903A33492J1228J1415J0807J1459J2915J2918J0876P993M746P17l660p429j0582
$$ 133492 144720 156135 166942 178401 191316 204234 215110 223103 227849 228566 224906 217477 206895
54890B06895j3297j4587j3777j2228j1500j0945r333p535p037p055n897m152l609
$$ 206895 193598 179011 165234 153006 141506 130561 121228 113693 106656 99601 93704 89552 85943
54877H5943l907l301k026j860k725k741j497m68k32J5K54m18j563j660p21k97
$$ 85943 82036 78735 76709 74849 72124 69383 67886 67418 67186 67201 67455 67037 65474 63814 63093 62796
54861F2796p51q39j76J63k82p34q55j118j348p57M56J245J396J438J111j98j724
$$ 62796 62045 61206 61030 61193 60911 60177 59322 58204 56856 56099 56555 57800 59196 60634 61745 61547 59823
54844E9823k022j222p76j049j088o32m74q18j045j070j217j006K00J580J708Q32
$$ 59823 57801 56579 55803 54754 53666 53034 52560 51742 50697 49627 48410 47404 47604 49184 50892 51724
54828E1724M97J093J580J486J349J302R18M28M43O90M83J23L00N45L1p13n62K16
$$ 51724 52221 53314 54894 56380 57729 59031 59949 60377 60820 61510 61993 62116 62416 62961 62992 62279 61717 61933
54810F1933N74O91J391K177J918J063J113K185L170L866M924O015O204N837O009
$$ 61933 62507 63198 64589 66766 68684 69747 70860 73045 76215 80081 85005 91020 97224 103061 109070
54795A09070O542O600O842Q654J1533J3521J4086J4289J4280J2987J0285P181
$$ 109070 115612 122212 129054 137708 149241 162762 176848 191137 205417 218404 228689 235870
54783B35870L875k16m590p967j0351j2495j3675j2450r606p731p645p707o885
$$ 235870 239745 239529 234939 226972 216621 204126 190451 178001 168395 160664 153019 145312 138427
54770A38427n986n520m788l675l062k887j973k74Q10Q43J027K031L135L953M914
$$ 138427 132441 126921 122133 118458 115396 112509 110536 110262 111072 111915 112942 114973 118108 122061 126975
54755A26975N729N524M912N714Q106J0168J0903J1504J2959J4474J5111J5012
$$ 126975 132704 138228 143140 148854 156960 167128 178031 189535 202494 216968 232079 247091
54743B47091J4157J1665P307K211k620p077j0912j3503j5012j6200j6875j6176
$$ 247091 261248 272913 280220 282431 279811 272734 261822 248319 233307 217107 200232 184056
54731A84056j4469j3085j2114j0507q449p317p077o090m059k675k670k687j905
$$ 184056 169587 156502 144388 133881 125432 118115 111038 104948 100889 98214 95544 92857 90952
54718I0952j390j727j678n44K74m32j555j468m38J89Q3j24q6N4K5m92j372j607
$$ 90952 89562 87835 86157 85613 85887 85455 83900 82432 81994 82183 82266 82142 82056 82110 82135 81643 80271 78664
54700G8664m98Q87R36O0Q1J083J228Kp96j02P75O00P4M4pm33k27J111K197J745
$$ 78664 78166 79053 79989 80049 80130 81213 82441 82443 81647 81545 82320 82920 82994 83038 83031 82598 82371 83482 85679 87424
54680H7424N63J41M78O26L29p6m51o39k79M40Q35R54J561K534K730J947J420J796
$$ 87424 87987 88128 88606 89232 89561 89485 89034 88395 88116 88556 89391 90345 91906 94440 97170 99117 100537 102333
54662A02333K245K250K511L276L536K845K245K401K406J564P45Q39J300J406J521
$$ 102333 104578 106828 109339 112615 116151 118996 121241 123642 126048 127612 128357 129196 130496 131902 133423
54647A33423J939J902J056N37J283K494L004L083L590M386M875N197N632N582
$$ 133423 135362 137264 138320 138857 140140 142634 145638 148721 152311 156697 161572 166769 172401 177983
54633A77983M277J946o04k846m432n070n177n730o874p601p321o663o163n349
$$ 177983 182260 184206 183602 180756 176324 171254 166077 160347 153473 145872 138551 131888 125725 120376
54619A20376l886k470j821j712j643j594j540j206p23n23l64L90J373J539J025
$$ 120376 116490 114020 112199 110487 108844 107250 105710 104504 103781 103258 102894 103284 104657 106196 107221
54604A07221J088J888K101J222L74K20n1q37j149n44j61p51j429j482j683k540
$$ 107221 108309 110197 112298 113520 113894 114114 114063 113226 112077 111533 111372 110621 109192 107710 106027 103487
54588A03487k994k300j626k219l325l475k683j897j350q20o29j012j347j111p68
$$ 103487 100493 98193 96567 94348 91023 87548 84865 82968 81618 80798 80169 79157 77810 76699 75931
54573G5931p81p28k79K9j37j75K41L95q8m26q8J82j89n06j60K62K65M84J226J434
$$ 75931 75150 74422 74143 74172 74035 73860 74101 74496 74408 73982 73894 74076 73887 73381 73221 73483 73748 74232 75458 76892
54553G6892L45r98j281q24o34p00n24l12l62k40L28O68M06L84J200J946J596O34
$$ 76892 77237 76239 74958 74134 73500 72800 72276 71964 71602 71362 71690 72358 72764 73148 74348 76294 77890 78524
54535G8524J26J75M39J128K290L108L098L027L547L952L434K480J897J469P19
$$ 78524 78650 78825 79264 80392 82682 85790 88888 91915 95462 99414 102848 105328 107225 108694 109413
54520A09413k7m34r93j925k413j996j581j972k496k333k003k300k768k581j911
$$ 109413 109386 108952 107959 106034 103621 101625 100044 98072 95576 93243 91240 88940 86172 83591 81680
54505H1680j267n15L28M86k65p82k83L75K94J27P19J403J103J22n48p78q75o43
$$ 81680 80413 79898 80226 80712 80447 79665 79382 79757 80051 80178 80897 82300 83403 83525 82977 82199 81324 80681
54487H0681m8K25n7q6M52O27J37K73J728L010K612J224K33l84j025r40L32J459
$$ 80681 80633 80858 80801 80715 81167 81794 81931 82204 83932 86942 89554 90778 91011 90627 89602 88662 88994 90453
54469I0453J203M65N58Q46J06j041j313j060j206j160q9Q92L11q53n74Q22J274
$$ 90453 91656 92121 92679 93525 93631 92590 91277 90217 89011 87851 87762 88654 88965 88112 87538 88360 89634
54452H9634M48n9L09M81P6l2L70L87l16j101j612j913j641n63L25j32j341j785
$$ 89634 90082 90023 90332 90813 90889 90857 91227 91614 91298 90197 88585 86672 85031 84468 84793 84661 83320 81535
54434H1535j229n97j36M92Q94M50k39j65L33L18J24O21J210O64n57q43m2N51M89
$$ 81535 80306 79709 79573 80065 80959 81409 81170 81005 81338 81656 81780 82401 83611 84275 83718 82875 82833 83384 83873
54415H3873M28L85k13r08o60K22N21L23P37J630J741J053Q66J434J661J339J584
$$ 83873 84301 84686 84473 83565 82905 83127 83648 83971 84708 86338 88079 89132 89998 91432 93093 94432 96016
54398I6016K691L477L296K924K932K860K491K464L029L457L111K139R36q4l32
$$ 96016 98707 102184 105480 108404 111336 114196 116687 119151 122180 125637 128748 130887 131823 131739 131407
54383A31407K39O38J70l19J20N98l30k133l048k894k936l294k820j510q08j190
$$ 131407 131646 132284 132454 132135 132255 132853 132523 130390 127342 124448 121512 118218 115398 113888 113080 111890
54367A11890j629j633j771j948j297j47Nj012j588r54k34k99m69j25K06J95M85
$$ 111890 110261 108628 106857 104909 103612 103465 103470 102458 100870 99916 99682 99383 98914 98789 98995 99190 99675
54350I9675J263J623J167Q07J139J404R51M50Q18J922L044L744L717K820J635
$$ 99675 100938 102561 103728 104535 105674 107078 108029 108479 109297 111219 114263 118007 121724 124544 126179
54335A26179J102J282J403J218J173J260R07J60l31o33j504k871l687l538l091
$$ 126179 127281 128563 129966 131184 132357 133617 134524 134684 134353 133720 132216 129345 125658 122120 119029
54320A19029k758k292j830j966k506k571k166k242l009l550l378k991k611j829
$$ 119029 116271 113979 112149 110183 107677 105106 102940 100698 97689 94139 90761 87770 85159 83330
54306H3330q38n44j047j319q29k63l27r31j707k327k255j347n84q48j316n89Q78
$$ 83330 82492 81948 80901 79582 78753 78490 78163 77232 75525 73198 70943 69596 69012 68164 66848 66259 67137
54289F7137J335M95k43l34n84j015n22P34R28n76k021j905j001o53p26m64L5L30
$$ 67137 68472 68967 68724 68390 67806 66791 66269 67003 67931 67355 65334 63429 62428 61775 61049 60585 60620 60950
54271F0950N05O68N85M58R22J794J988J266P31J123J829K077J803J010l64j520
$$ 60950 61455 62123 62708 63166 64088 65882 67870 69136 69867 70990 72819 74896 76699 77709 77345 75825
54255G5825j235L19J546J542Q69M1j023j826j489n53n70j447j263N39J979J617
$$ 75825 74590 74909 76455 77997 78866 78907 77884 76058 74569 74016 73446 71999 70736 71275 73254 74871
54239G4871O06M65P42L84k96m97m58n98m87J02L48k01o15j94K01l34j074q80r
$$ 74871 75477 75942 76684 77068 76772 76275 75817 75219 74732 74834 75182 74981 74366 74172 74373 74039 72965 72085 72076
54220G2076N39N44L38p7n89n80J41Q52J113J392J769J345j21j314j177m50k93
$$ 72076 72615 73159 73497 73420 72831 72251 72392 73244 74357 75749 77518 78863 78742 77428 76251 75801 75508
54203G5508n39m28p6rj64l01n42o90m4J208J583K74j505k147j612q35k21K23K36
$$ 75508 74969 74541 74465 74456 74292 73991 73449 72759 72715 73923 75506 75780 74275 72128 70516 69681 69460 69683 69919
54184F9919j78l43P6M89M60L63L71j05j174j890j586p14K35J346K236J954P34
$$ 69919 69741 69398 69474 69963 70423 70786 71157 71052 69878 67988 66402 65688 65923 67269 69505 71459 72193
54167G2193J98Q89J264K43r76r27j15K26J34J66M2n03p05j11L90J56Q1Q14J205
$$ 72193 72391 73280 74544 74787 73811 72884 72769 72995 73129 73295 73337 72834 72129 72018 72408 72564 72645 73459 74664
54148G4664K83p53l94N37K93q69j302p67m06m76j61N76Q41L90j17l64n36n82m05
$$ 74664 74947 74194 73800 74337 74630 73761 72459 71692 71286 70810 70649 71225 72066 72456 72339 71975 71439 70857 70452
54129G0452m49r53j183n24L40M87K28K89L76p7n66l71pl24q92p27p3J36j37l54
$$ 70452 70003 69050 67867 67343 67683 68170 68398 68687 69063 68986 68420 68049 68042 67718 66826 66099 66026 66162 66025 65671
54109F5671o55j264j359j98J299J732J345J297J478R35j2j13N59O54j74q16o33
$$ 65671 65016 63752 62393 62195 63494 65226 66571 67868 69346 70281 70269 70156 70715 71369 71195 70379 69746
54092F9746j92O7L72O40L03o09j341j488j206n61L43P97K86m18j41R03J407R14
$$ 69746 69554 69621 69993 70633 70936 70327 68986 67498 66292 65731 66074 66871 67157 66739 66598 67501 68908 69822
54074F9822J87j43j15K48R22J339R95M47N94J163J113L09l97o02o59p30o04m23
$$ 69822 70009 69866 69751 69999 70921 72260 73255 73702 74296 75459 76572 76881 76484 75882 75223 74493 73889 73466
54056G3466m55l42L88J320J682J565J568J584J139N97P25J374J760J772J862J902
$$ 73466 73011 72669 73057 74377 76059 77624 79192 80776 81915 82512 83237 84611 86371 88143 90005 91907
54040I1907J581J481K368L644M003L489L383M106M750M716M453M432M657N266
$$ 91907 93488 94969 97337 100981 104984 108473 111856 115962 120712 125428 129881 134313 138970 144236
54026A44236O345P068O408M769L758M076M846N097M765L991K773J534J018J167
$$ 144236 150581 157649 164057 168826 172584 176660 181506 186603 191368 195359 198132 199666 200684 201851
54012B01851J061J92r40j651j790j625j689k584m194n379n228m270l616l446l292
$$ 201851 202912 203104 202164 200513 198723 197098 195409 192825 188631 183252 178024 173754 170138 166692 163400
53997A63400l224l461l433k622j913k450l602l718k711k135k573k899k358j610
$$ 163400 160176 156715 153282 150660 148747 146297 142695 138977 136266 134131 131558 128659 126301 124691
53983A24691j214o73L06R83P67J32k53l55k97K8M26L90J7P3P90J475J616J521
$$ 124691 123477 122804 123110 124093 124860 124992 124739 124384 124087 124115 124541 124931 124948 125021 125811 127286 128902 130423
53965A30423J546J510J188P25K23l94r95j263j225j121q49k23M00M44K3k52j42
$$ 130423 131969 133479 134667 135392 135615 135221 134226 132963 131738 130617 129768 129545 129945 130389 130412 130160 130018
53948A30018K56J060K217K923K494J523J202J712K411L174M287N313N481N070
$$ 130018 130274 131334 133551 136474 138968 140491 141693 143405 145816 148990 153277 158590 164071 169141
53934A69141N042N317M846L422K057J348P87j05j084j866k390k316j344r5M10
$$ 169141 174183 179500 184346 187768 189825 191173 191960 191855 190771 188905 186515 184199 182855 182760 183170
53919A83170J64J10O64J476K436L680M724M936M781N266O250O693O449O298O333
$$ 183170 183334 183444 184108 185584 188020 191700 196424 201360 206141 211407 217657 224350 230799 237097 243430
53904B43430N916N240N105N103L891J550k48p90j204k204k893k608k199k475k972
$$ 243430 249346 254586 259691 264794 268685 270235 269987 269197 267993 265789 262896 260288 258089 255614 252642
53889B52642l150l476m268m824m750m873n857o998p322o932o423n890n370n216
$$ 252642 249492 246016 241748 236924 232174 227301 221444 214446 207124 200192 193769 187879 182509 177293
53875A77293n340m934l738k659k434k629k617k569k778k914k711k552k694k776
$$ 177293 171953 167019 163281 160622 158188 155559 152942 150373 147595 144681 141970 139418 136724 133948
53861A33948k660k809l296l395k803k187j899j274J4J021Q78R3m15o75j145j600
$$ 133948 131288 128479 125183 121788 118985 116798 114899 113625 113639 114660 115538 115631 115216 114541 113396 111796
53845A11796j599j344j190r40m14j19m68r74r98p16n40j70P72J708J682Q01J81
$$ 111796 110197 108853 107663 106723 106309 106190 105722 104748 103750 103034 102494 102324 103096 104804 106486 107287 107468
53828A07468M53J035R75J79m72j30R54J586J054l0o66p27o19k68N30J160Q13l
$$ 107468 107921 108956 109931 110110 109638 109508 110462 112048 113102 113072 112406 111679 111060 110792 111322 112482 113295 113292
53810A13292Q7J386K773L408L480L233K554J781J600J914K032K122L028M456M964
$$ 113292 113379 114765 117538 120946 124426 127659 130213 131994 133594 135508 137540 139662 142690 147146 152110
53795A52110M224L646M126M725M343L339K579K143J837J825K019J897J547J766
$$ 152110 156334 159980 164106 168831 173174 176513 179092 181235 183072 184897 186916 188813 190360 192126
53781A92126K541K711J841R88R23R04K05n82p09n67q01j204j429j707k038j858
$$ 192126 194667 197378 199219 200207 201130 202034 202239 201657 200948 200381 199580 198376 196947 195240 193202 191344
53765A91344j255j285k210k781k263j700k106k789k724k286k191k014j197m20
$$ 191344 190089 188804 186594 183813 181550 179850 177744 174955 172231 169945 167754 165740 164543 164123
53751A64123m67p93n78l06p33j246q03K66Q80Q56O21M1j009j672j212m11m20q71
$$ 164123 163656 162863 162285 161979 161246 160000 159197 159463 160343 161199 161820 161861 160852 159180 157968 157557 157137 156266
53733A56266o70K2J36l60m92N5O46Q14M88m82j795k296j318K9L01j60M1R88J491
$$ 156266 155596 155618 155754 155394 154902 154957 155603 156417 156905 156423 154628 152332 151014 151043 151344 151184 151225 152213 153704
53714A53704J157P79P63P38P39J346K446L100K949K659K825L256L520L438L015
$$ 153704 154861 155640 156403 157141 157880 159226 161672 164772 167721 170380 173205 176461 179981 183419 186434
53699A86434K604K876M010N189N611N498N370M921L740K497K221K671K726K084
$$ 186434 189038 191914 195924 201113 206724 212222 217592 222513 226253 228750 230971 233642 236368 238452
53685B38452J487J413J699K243K979L371K916K051J597J533J291R11Q62J024R26
$$ 238452 239939 241352 243051 245294 248273 251644 254560 256611 258208 259741 261032 261943 262805 263829 264755
53670B64755P38Q59R10K85n80p26k78k44q21j183q84l05L10J055J571J210J63
$$ 264755 265493 266352 267262 267547 266967 266241 265963 265719 264898 263715 262831 262526 262836 263891 265462 266672 266835
53653B66835o63j001j395j986k171j680j005n77l83m26p25q09j11J021J617J462
$$ 266835 266172 265171 263776 261790 259619 257939 256934 256357 255974 255548 254823 254014 253903 254924 256541 258003
53637B58003J301J560J760J398P00J89Q7K51L13n6o52p71j14P64J397K103L008
$$ 258003 259304 260864 262624 264022 264722 264911 264998 265249 265562 265506 264854 264083 263969 264733 266130 268233 271241
53620B71241L237K179Q79Q60J943K637K407K162K626L537M476N293N688N505N414
$$ 271241 274478 276657 277536 278396 280339 282976 285383 287545 290171 293708 298184 303477 309165 314670 320084
53605C20084O167P196P203O109N176N136N462N607N695N696N199M391M216N061
$$ 320084 326251 333447 340650 346759 351935 357071 362533 368140 373835 379531 384730 389121 393337 398398
53591C98398O181O785O842O649O363O124O027N837N389N107N311N409M792M113
$$ 398398 404579 411364 418206 424855 431218 437342 443369 449206 454595 459702 465013 470422 475214 479327
53577D79327M388N046M519K735J331J126J116M90l4L07Q86P76J95j45k89o27r71
$$ 479327 483715 488761 493280 496015 497346 498472 499588 500078 500044 500351 501237 502013 502208 502063 501774 501147 500176
53560E00176r03n55l23k32j29j18l16n80q12j090j328j313j281j695k304k135
$$ 500176 499273 498718 498395 498163 498034 497916 497600 497020 496208 495118 493790 492477 491196 489501 487197 485062
53544D85062q46O46J295J039M78L9q8K45R75J784K474L070L439L366L063L044
$$ 485062 484216 484862 486157 487196 487674 487713 487625 487870 488845 490629 493103 496173 499612 502978 506041 509085
53528E09085L452M014M642N508O462P138P528P882Q159Q305Q890J0437J2247J3019
$$ 509085 512537 516551 521193 526701 533163 540301 547829 555711 563870 572175 581065 591502 603749 616768
53514F16768J2739J2757J3796J5140J6078J6898J7921J8679J8771J8641J8853
$$ 616768 629507 642264 656060 671200 687278 704176 722097 740776 759547 778188 797041
53503G97041J9378K0137K1386K3021K4326K5006K5752K7128K8677K9760L0488
$$ 797041 816419 836556 857942 880963 905289 930295 956047 983175 1011852 1041612 1072100
53492A072100L1169L1501L1100L0329K9840K9757K9849L0109L0530L0786L0709
$$ 1072100 1103269 1134770 1165870 1196199 1226039 1255796 1285645 1315754 1346284 1377070 1407779
53481A407779L0752L1360L2264L2871L3056L2983L2512L1339K9609K7899K6623
$$ 1407779 1438531 1469891 1502155 1535026 1568082 1601065 1633577 1664916 1694525 1722424 1749047
53470A749047K5756K5000K4039K2666K0847J8684J6427J4613J3859J4109J4395
$$ 1749047 1774803 1799803 1823842 1846508 1867355 1886039 1902466 1917079 1930938 1945047 1959442
53459A959442J3876J2817J1846J0607Q193M739J346j627m958q837j2052j3681
$$ 1959442 1973318 1986135 1997981 2008588 2016781 2021520 2022866 2021239 2016281 2007444 1995392 1981711
53447A981711j4572j6157j8416k0074k0546k0779k2096k4710k7586k9519l0307
$$ 1981711 1967139 1950982 1932566 1912492 1891946 1871167 1849071 1824361 1796775 1767256 1736949
53436A736949l0774l1634l2640l3155l3186l3150l2989l2243l0912k9408k7768
$$ 1736949 1706175 1674541 1641901 1608746 1575560 1542410 1509421 1477178 1446266 1416858 1389090
53425A389090k5796k3853k2545k1651k0399j8787j7502j6460j4673j1856q893
$$ 1389090 1363294 1339441 1316896 1295245 1274846 1256059 1238557 1222097 1207424 1195568 1186675
53414A186675o351l786r95J367L074M956P464R816J1520J3505J6632K0015K2140
$$ 1186675 1180324 1176538 1175543 1176910 1179984 1184940 1192404 1202220 1213740 1227245 1243877 1263892 1286032
53401A286032K2925K3524K4609K6067K7908L0265L2774L4976L7190M0056M3306
$$ 1286032 1308957 1332481 1357090 1383157 1411065 1441330 1474104 1509080 1546270 1586326 1629632
53390A629632M5992M7795M9396N1521N4317N7546O0717O3226O4965O6695O9228
$$ 1629632 1675624 1723419 1772815 1824336 1878653 1936199 1996916 2060142 2125107 2191802 2261030
53379B261030P2276P4787P6230P6932P7265P7251P6982P6750P6479P5598P3745
$$ 2261030 2333306 2408093 2484323 2561255 2638520 2715771 2792753 2869503 2945982 3021580 3095325
53368C095325P1214O8414O5190O1063N6054N0902M6338M2356L8510L4793L1692
$$ 3095325 3166539 3234953 3300143 3361206 3417260 3468162 3514500 3556856 3595366 3630159 3661851
53357C661851K9122K5928K1060J4865Q572K741k944q475j3338j7781k3362l1441
$$ 3661851 3690973 3716901 3737961 3752826 3761398 3764139 3761195 3752720 3739382 3721601 3698239 3666798
53345C666798m1644n2163o1280o8185p2850p5686p7103p7196p5982p3974p2094
$$ 3666798 3625154 3572991 3511711 3443526 3370676 3294990 3217887 3140691 3064709 2990735 2918641
53334B918641p0925p0428p0457p0944p1449p1192o9872o8013o6292o4877o3584
$$ 2918641 2847716 2777288 2706831 2635887 2564438 2493246 2423374 2355361 2289069 2224192 2160608
53323B160608o2196o0391n7874n4727n1309m7721m3863l9986l6658l4143l2327
$$ 2160608 2098412 2038021 1980147 1925420 1874111 1826390 1782527 1742541 1705883 1671740 1639413
53312A639413l1158l0458k9459k7377k4429k1403j8327j4657j0842q338p589p234
$$ 1639413 1608255 1577797 1548338 1520961 1496532 1475129 1456802 1442145 1431303 1422965 1415376 1408142
53300A408142n926l928k206r84mO18Q00J161K418M420O402P943R249J0835J3186
$$ 1408142 1402216 1398288 1396082 1395098 1395094 1395712 1396512 1397673 1400091 1404511 1410913 1418856 1428105 1438940 1452126
53285A452126J6334J9595K2254K4543K7280L0496L3357L5399L6852L7547L6897
$$ 1452126 1468460 1488055 1510309 1534852 1562132 1592628 1625985 1661384 1698236 1735783 1772680
53274A772680L5275L4148L4168L4411L4088L3604L3146L1735K8895K5989K4457
$$ 1772680 1807955 1842103 1876271 1910682 1944770 1978374 2011520 2043255 2072150 2098139 2122596
53263B122596K3763K2478K0517J8734J7041J4583J1480Q782O733M381J053k876
$$ 2122596 2146359 2168837 2189354 2208088 2225129 2239712 2251192 2259974 2266707 2271088 2272141 2269265
53251B269265o789j0504j4058j7523k1068k4726k8216l1402l4495l7421l9581
$$ 2269265 2262476 2251972 2237914 2220391 2199323 2174597 2146381 2114979 2080484 2043063 2003482
53240B003482m0849m2024m3553m4506m3903m2440m1640m1690m1354l9924l8021
$$ 2003482 1962633 1920609 1877056 1832550 1788647 1746207 1704567 1662877 1621523 1581599 1543578
53229A543578l6501l5548l4993l4695l4445l4191l4324l5117l5962l5819l4420
$$ 1543578 1507077 1471529 1436536 1401841 1367396 1333205 1298881 1263764 1227802 1191983 1157563
53218A157563l2494l0869k9785k9000k8023k6372k4048k1632j9692j8412j7940
$$ 1157563 1125069 1094200 1064415 1035415 1007392 981020 956972 935340 915648 897236 879296
53207H79296j8442j9438j9847j9302j8634j8462j8152j7080j5988j5906j6376
$$ 879296 860854 841416 821569 802267 783633 765171 747019 729939 713951 698045 681669
53196F81669j6086j4883j3798j3305j2869j2188j1750j1910j2393j2781j2911
$$ 681669 665583 650700 636902 623597 610728 598540 586790 574880 562487 549706 536795
53185E36795j2744j2476j2546j3023j3221j2632j1715j1073j0402r295q456q743
$$ 536795 524051 511575 499029 486006 472785 460153 448438 437365 426963 417668 409212 400469
53173D00469r440q940p154n708n551n834n546m974m933n442n930o025n660m935
$$ 400469 391029 382089 374935 369227 363676 357842 352296 347322 342389 336947 331017 324992 319332 314397
53159C14397m236l998m005l533k482j785k253l417m020l455k368j843k160k547
$$ 314397 310161 306163 302158 298625 296143 294358 292105 288688 284668 281213 278845 277002 274842 272295
53145B72295k238j602j631k329k461j325N7K99n24j330j743k199k657k499j668
$$ 272295 270057 268455 266824 264495 262034 260709 260766 261065 260541 259211 257468 255269 252612 250113 248445
53130B48445r31p99j001j081q22j13Q83J465J098L10J09N51P91M96K41M01O56
$$ 248445 247514 246715 245714 244633 243811 243698 244581 246046 247144 247454 247563 248114 248905 249401 249642 250043 250699
53113B50699Q77J542K788L792L686K612J401N43o4o39j174j590j988k578l283
$$ 250699 251576 253118 255906 259698 263384 265996 267397 267940 267876 267237 266063 264473 262485 259907 256624
53098B56624l546k964k040j828k628l635m116m215m247m020l465l134l273l192
$$ 256624 253078 250114 248074 246246 243618 239983 235867 231652 227405 223385 219920 216786 213513 210321
53084B10321k376j547j539j841j494q40r80j831k199j716j274j446j756j726j469
$$ 210321 207945 206398 204859 203018 201524 200684 199704 197873 195674 193958 192684 191238 189482 187756 186287
53069A86287j049l37K20j73j379k214j985j266q55p70o48l97p4L29O81Q10Q18
$$ 186287 185238 184901 185121 184948 183569 181355 179370 178104 177249 176479 175831 175434 175360 175689 176370 177180 177998
53052A77998P97L28j032k766l648l077j546J46J395J685R00j92n84k05K56N19
$$ 177998 178795 179123 178091 175325 171677 168600 167054 167200 168595 170280 171180 170988 170404 170199 170455 170974
53036A70974Q13R09J30j424k654k743j943r27j63k2p04j770k396k239j541n06
$$ 170974 171787 172696 172826 171402 168748 166005 164062 163135 162972 162950 162246 160476 158080 155841 154300 153794
53020A53794O52J260O61p67j948k353k152j351J02J463J647O53n03j231j690j733
$$ 153794 154446 155706 156367 155600 153652 151299 149147 147796 147898 149361 151008 151661 151158 149927 148237 146504
53004A46504q81M60J111P99N48J010J559J502J062O60K49j70l06l14p42j415j370
$$ 146504 145623 146083 147194 147993 148541 149551 151110 152612 153674 154334 154583 154413 154107 153793 153051 151636 150266
52987A50266l74N60O40K60K4j26k41J10J008J792K058K198K402K191J552J426
$$ 150266 149892 150452 151092 151352 151376 151250 151009 151119 152127 153919 155977 158175 160577 162768 164320 165746
52971A65746K265L090K834J886J339J480J914K520L342L947L847L274K846K692
$$ 165746 168011 171101 173935 175821 177160 178640 180554 183074 186416 190363 194210 197484 200330 203022
52957B03022K394J649N63m29p94m23J5k31r00j071o13m08r25j590j908k146k454
$$ 203022 205416 207065 207628 207199 206405 205982 205997 205766 204866 203795 203182 202774 201849 200259 198351 196205 193751
52940A93751k359j768j500k042k699k581j770q27L7O54N67k16q33o82k87l59o72
$$ 193751 191392 189624 188124 186082 183383 180802 179032 178205 178242 178896 179463 179247 178414 177732 177445 177086 176414
52923A76414n87j25K62M58N37K82m37j117j122m11N23J176J264Q63N05N97P08
$$ 176414 175827 175702 175964 176422 176959 177241 176804 175687 174565 174154 174677 175853 177117 177980 178485 179082 179790
52906A79790J30q36j123n25J8ML2M74P50M65J52J60J1m72n71J8M56K37J42P76
$$ 179790 179920 179084 177961 177436 177454 177458 177490 177964 178714 179179 179331 179491 179502 179030 178459 178477 178933 179170 179312 180088
52886A80088J346J031M50N23Q83P33L83N34Q33O06L44R90K204K742K270J555J133
$$ 180088 181434 182465 182915 183438 184321 185054 185437 185971 186804 187410 187754 188744 190948 193690 195960 197515 198648
52869A98648R33R19J039Q47J31m53l05Q0n0l85j65M59Q10R26J165J139L46n11
$$ 198648 199581 200500 201539 202386 202517 202064 201759 201839 201789 201404 201239 201698 202508 203434 204599 205738 206084 205573
52851B05573k94Q01J578J709J907K387K640K720L325M434N121M960M461L943L105
$$ 205573 205279 206080 207658 209367 211274 213661 216301 219021 222346 226780 231901 236861 241322 245265 248370
52836B48370J924R56L77l06j354k379l033l292l040k236j507j654k404k647k062
$$ 248370 250294 251250 251627 251321 249967 247588 244555 241263 238223 235987 234480 232826 230422 227775 225713
52821B25713j553j819k391k525k190j767j426j192j159j314j559j987k661l110
$$ 225713 224160 222341 219950 217425 215235 213468 212042 210850 209691 208377 206818 204831 202170 199060
52807A99060k724j716j082j402k248k845k834k298j579j223j552k200k498k315
$$ 199060 196336 194620 193538 192136 189888 187043 184209 181911 180332 179109 177557 175357 172859 170544
52793A70544k068j928j634j141q41j059j690k355k526j660J66J789J860L52j308
$$ 170544 168476 166548 164914 163773 162932 161873 160183 157828 155302 153642 153808 155597 157457 157809 156501
52778A56501j775j094l33l21q79j148o25J30P9r17j839j891j512j532j863j792
$$ 156501 154726 153632 153299 152978 152099 150951 150326 150456 150535 149618 147779 145888 144376 142844 140981 139189
52762A39189j178n97m53o55j029j475j825j998k077j936j271l80k46j198k240
$$ 139189 138011 137414 136961 136306 135277 133802 131977 129979 127902 125966 124695 124315 124069 122871 120631
52747A20631k417k110k043j886j096l90q07j752j652m63K47j87o29k52Q7n91j700
$$ 120631 118214 116104 114061 112175 111079 110689 109882 108130 106478 106015 106262 106075 105446 105194 105281 104690 102990
52730A02990k016j391n67Q1P55J481J922J889J563J184P65J33p38j406j305n66
$$ 102990 100974 99583 99016 99097 99852 101333 103255 105144 106707 107891 108656 108789 108051 106645 105340 104774
52714A04774j04m26q45n84p2k91j104j347n58M70R28Q68O03K21j2M23J551K609
$$ 104774 104670 104244 103399 102815 102743 102452 101348 100001 99443 99913 100841 101709 102312 102533 102521 102944 104495 107104
52696A07104K905K506J971J834K320L102L300K330P82j46m4L97M37l7p97j514
$$ 107104 110009 112515 114486 116320 118640 121742 125042 127372 128154 128008 127964 128361 128798 128761 127964 126450
52680A26450j694j101k74j16q45j856k492k480j828j007r00j809k770k713j948
$$ 126450 124756 123655 123381 123265 122420 120564 118072 115592 113764 112757 111857 110048 107278 104565 102617
52665A02617j570j648j295l25L92L98J75Rm84j336j791j374n01K73Q13R54L87
$$ 102617 101047 99399 98104 97779 98171 98569 98744 98753 98269 96933 95142 93768 93267 93540 94353 95307 95694
52648I5694o32j316j317j002o59k71q1m32r25p71p6L07K94O65J449J642R43M56
$$ 95694 95062 93746 92429 91427 90768 90497 90416 89984 89059 88288 88212 88519 88813 89478 90927 92569 93512 93968
52630I3968R57J771K002J742J290L53j022j813j347m39k36o46q07n19k18j28j63
$$ 93968 94925 96696 98698 100440 101730 102083 101061 99248 97901 97462 97226 96580 95773 95254 95036 94908 94745
52613I4745k78k20M33J350J357j4j550j824j001k74p6J00N29Q83R35Q01N51K33
$$ 94745 94467 94247 94680 96030 97387 97373 95823 93999 92998 92724 92648 92748 93277 94160 95095 95896 96447 96680
52595I6680J66O37J441K041K094J536N29m23p71o06n25o29k69Q11J903K339K385
$$ 96680 96846 97483 98924 100965 103059 104595 105124 104701 103930 103324 102799 102170 101901 102712 104615 106954 109339
52578A09339K456K315J715J168J217J536J531J299J234J251J147J203J573J673
$$ 109339 111795 114110 115825 116993 118210 119746 121277 122576 123810 125061 126208 127411 128984 130657
52564A30657J123O58J081J808J688Q97N99R36P73k85r97k58J288K164J936J423
$$ 130657 131780 132438 133519 135327 137015 137912 138511 139447 140220 139935 138938 138680 139968 142132 144068 145491
52548A45491J324J427J142M26j55j33K97O07O28O22O89O06L05P0jj12j81K20R50
$$ 145491 146815 148242 149384 149810 149655 149522 149819 150426 151054 151676 152365 152971 153276 153346 153345 153233 153052 153272 154222
52529A54222J070J67p21l65R22J751J554J041Q53P36K65m35j049j575k069k281
$$ 154222 155292 155459 154738 154373 155295 157046 158600 159641 160494 161230 161495 161060 160011 158436 156367 154086
52513A54086j870q61L09J072J115N61j98r19j549j889j578p05L2J56J40P25J789
$$ 154086 152216 151355 151664 152736 153851 154412 154214 153295 151746 149857 148279 147574 147606 147762 147902 148627 150416
52496A50416K429K145J386Q23N55K40k88p48p23j34N72Q40N96K63J54J05j30l78
$$ 150416 152845 154990 156376 157199 157754 157994 157706 156958 156235 156101 156673 157513 158109 158372 158526 158631 158501 158123
52478A58123k54K90Q44R97P35M36M65P38Q27O00N20R65J560J679J387J233J175
$$ 158123 157869 158159 159003 160000 160735 161171 161636 162374 163201 163801 164321 165286 166846 168525 169912 171145 172320
52461A72320O38l02p06j41N73N72J92L47J162J937K103J649Q63J89R4N90J047
$$ 172320 172958 172656 171950 171809 172382 172954 173146 173493 174655 176592 178695 180344 181207 181396 181490 182080 183127
52444A83127R65O55P84J429J982J884J125J93l00r6L76L81k52j002j457j770k085
$$ 183127 184092 184747 185531 186960 188942 190826 191951 192144 191844 191748 192124 192505 192253 191251 189794 188024 185939
52427A85939k084j490o05O6L66L77L9o81j565k301k670k436j562n94k68n18m72
$$ 185939 183855 182365 181760 181826 182192 182569 182608 181927 180362 178061 175391 172955 171393 170799 170531 170013 169541
52410A69541L01J178J494J412J387J406J322J315J476J396Q41L13M07R57J325
$$ 169541 169842 171020 172514 173926 175313 176719 178041 179356 180832 182228 183069 183382 183789 184746 186071
52395A86071J228Q38M35L44P20J141R38K38JN97J191R92L83K11N67J022J311J233
$$ 186071 187299 188137 188572 188916 189636 190777 191715 191953 191954 192551 193742 194734 195117 195328 195895 196917 198228 199461
52377A99461N51l30m16M80J226J038P52J421K592L155L097L101L056K478J896
$$ 199461 200012 199682 199266 199746 200972 202010 202762 204183 206775 209930 213027 216128 219184 221662 223558
52362B23558K232L026K903J785J152J876L087L608L357K895K501K247K225K329
$$ 223558 225790 228816 231719 233504 234656 236532 239619 243227 246584 249479 251980 254227 256452 258781
52348B58781K250J949J739J839K235K822L327L277K591J922J810J923J771J689
$$ 258781 261031 262980 264719 266558 268793 271615 274942 278219 280810 282732 284542 286465 288236 289925
52334B89925K233K992L033K328J731J735K111K678L381L787L462K802K620L001
$$ 289925 292158 295150 298183 300511 302242 303977 306088 308766 312147 315934 319396 322198 324818 327819
52320C27819L422L779M327M852N031N358O488P838Q147P451P069P539Q058Q192
$$ 327819 331241 335020 339347 344199 349230 354588 361076 368914 377061 384512 391581 399120 407178 415370
52306D15370Q659R870J1158J2048J3060J4455J5442J5505J5441J6120J7114J7585
$$ 415370 424029 433899 445057 457105 470165 484620 500062 515567 531008 547128 564242 581827
52294E81827J7811J8639J9925K0587K0145J9324J9076J9543K0027J9704J8443
$$ 581827 599638 618277 638202 658789 678934 698258 717334 736877 756904 776608 795051
52283G95051J7025J6338J6335J6112J5042J3386J1686J0138Q688P256N715M046
$$ 795051 812076 828414 844749 860861 875903 889289 900975 911113 919801 927057 932772 936818
52271I36818K572J576P35m78j882k767k958k922k821k431j986k188l053l718l758
$$ 936818 939390 940966 941701 941223 939341 936574 933616 930694 927873 925442 923456 921268 918215 914497 910739
52256I10739l633l598l115j952p59J9Q93K294L690M544N397O996Q982J0364J0900
$$ 910739 907106 903508 900393 898441 897682 897701 898594 900888 904578 909122 914519 921515 930497 940861 951761
52241I51761J1159J1546J2072J2795J3770J4621J4874J4519J3872J3119J2394
$$ 951761 962920 974466 986538 999333 1013103 1027724 1042598 1057117 1070989 1084108 1096502
52230A096502J1951J1681J0875R032O696M929M104L701L048J865K24j523k946
$$ 1096502 1108453 1120134 1131009 1140041 1146737 1151666 1155770 1159471 1162519 1164384 1164608 1163085 1160139
52217A160139l932m769n621o246o500o707p183p824q487r326j0273j0622r825
$$ 1160139 1156207 1151438 1145817 1139571 1133071 1126364 1119181 1111357 1102870 1093544 1083271 1072649 1062824
52204A062824q329p074o365n809n188m694m433m221l928l524k834j696m17L92
$$ 1062824 1054495 1047421 1041056 1035247 1030059 1025365 1020932 1016711 1012783 1009259 1006425 1004729 1004312 1004704
52190A004704N17L66L62L84Pp54j218o43R07K435K948K397J501Q38M56K06k8m66
$$ 1004704 1005221 1005587 1005949 1006333 1006340 1005586 1004368 1003725 1004632 1007067 1010015 1012412 1013913 1014751 1015207 1015413 1015385 1014919
52172A014919j249k062k350k022j542j316j444k039l055l836l626k739k392l068
$$ 1014919 1013670 1011608 1009258 1007236 1005694 1004378 1002934 1000895 997840 994004 990378 987639 985247 982179
52158I82179l904m116m084m359m526l936k996k713l321m207m921n370n290m427
$$ 982179 978275 974159 970075 965716 961190 957254 954258 951545 948224 944017 939096 933726 928436 924009
52144I24009l266k759l254m249n194n907o211n855m974m115l623l381l256l375
$$ 924009 920743 917984 914730 910481 905287 899380 893169 887314 882340 878225 874602 871221 867965 864590
52130H64590l799m322m749n082n302n237m784m073l351k827k653k823l020k766
$$ 864590 860791 856469 851720 846638 841336 836099 831315 827242 823891 821064 818411 815588 812568 809802
52116H09802j818l85J039K047K572K953L617M696N981P242Q414R443J0239J1011
$$ 809802 807984 807599 808638 810685 813257 816210 819827 824523 830504 837746 846160 855603 865842 876853
52102H76853J2285J4283J6397J7660J7826J7719J8382J9954K1523K2170K1973
$$ 876853 889138 903421 919818 937478 955304 973023 991405 1011359 1032882 1055052 1077025
52091A077025K1782K2022K2139K1518K0460J9668J8999J7543J5005J2381J0796
$$ 1077025 1098807 1120829 1142968 1164486 1184946 1204614 1223613 1241156 1256161 1268542 1279338
52080A279338J0278R942R044P492N574L541J386j067l698n794o608o322n955o226
$$ 1279338 1289616 1299558 1308602 1316094 1321668 1325209 1326595 1325528 1321830 1316036 1309428 1303106 1297151 1290925
52066A290925o942p623q172q626q782q517q070p624o897n608m053k836k152j685
$$ 1290925 1283983 1276360 1268188 1259562 1250780 1242263 1234193 1226569 1219672 1214064 1210011 1207175 1205023 1203338
$$ [...]
##END NTUPLES=NMR SPECTRUM
##END=
