
##TITLE=AC1204_BRAAS12063_7164085_X9wEiwGAoq
##JCAMPDX= 6.0         $$ Bruker NMR JCAMP-DX V2.0
##DATA TYPE= NMR SPECTRUM
##DATA CLASS= NTUPLES
##ORIGIN= BRUKER
##OWNER= Administrator
$$ 1.72 TOPSPIN		Version 2.1
$$ 2013-01-30 04:42:24.605 -0500  Administrator@X
$$ Compression mode = diff/dup
##.OBSERVE FREQUENCY= 400.02188249412
##.OBSERVE NUCLEUS= ^1H
##.ACQUISITION MODE= SIMULTANEOUS (DQD)
##.ACQUISITION SCHEME= undefined
##.AVERAGES= 8
##.DIGITISER RES= 22
##SPECTROMETER/DATA SYSTEM= spect
##.PULSE SEQUENCE= zg30
##.SOLVENT NAME= COFFEE_meoh
##.SHIFT REFERENCE= INTERNAL, COFFEE_meoh, 1, 14.98509
##AUDIT TRAIL= $$ (NUMBER, WHEN, WHO, WHERE, PROCESS, VERSION, WHAT)
$$ ##TITLE= Audit trail, TOPSPIN		Version 2.1
$$ ##JCAMPDX= 5.01
$$ ##ORIGIN= Bruker BioSpin GmbH
$$ ##OWNER= Administrator
$$ $$ E:\/data/COFFEE/nmr/AC1204_BRAAS12063_7164085_X9wEiwGAoq/20/pdata/1/auditp.txt
$$ ##AUDIT TRAIL=  $$ (NUMBER, WHEN, WHO, WHERE, PROCESS, VERSION, WHAT)
(   1,<2013-01-30 04:42:16.324 -0500>,<Administrator>,<X>,<go>,<TOPSPIN 2.1>,
      <created by zg
	started at 2013-01-30 04:41:10.246 -0500,
	POWCHK enabled, PULCHK disabled,
       configuration hash MD5:
       86 BA 57 50 F2 9D 5C 9B 26 00 A9 28 5F 66 2E 89
       data hash MD5: 64K
       48 5C 2C 6F D3 88 DF FB 6F 79 08 15 CF F7 32 3A>)
(   2,<2013-01-30 04:42:19.386 -0500>,<Administrator>,<X>,<proc1d>,<TOPSPIN 2.1>,
      <Start of raw data processing
       efp LB = 0 FT_mod = 6 PKNL = 1 PHC0 = 0 PHC1 = 0 SI = 32K 
       data hash MD5: 32K
       7D DE 11 E4 EC 35 54 CF D3 8E 03 C6 27 78 CC 75>)
(   3,<2013-01-30 04:42:19.855 -0500>,<Administrator>,<X>,<proc1d>,<TOPSPIN 2.1>,
      <pk PHC0 = 98.89893 PHC1 = 0 
       data hash MD5: 32K
       3A 42 F4 1F 9D D5 C1 3E 21 35 52 65 5F E4 5F 10>)
(   4,<2013-01-30 04:42:20.105 -0500>,<Administrator>,<X>,<proc1d>,<TOPSPIN 2.1>,
      <abs ABSG = 1 
       data hash MD5: 32K
       68 1F 5C A2 A6 50 CD 22 F9 A6 63 98 5D A3 1D 17>)
(   5,<2013-01-30 04:42:20.246 -0500>,<Administrator>,<X>,<proc1d>,<TOPSPIN 2.1>,
      <abs ABSG = 2 
       data hash MD5: 32K
       4F 1C 7D 8F B7 8E 69 C4 6E 65 A1 20 E0 60 B4 D2>)
(   6,<2013-01-30 04:42:20.386 -0500>,<Administrator>,<X>,<proc1d>,<TOPSPIN 2.1>,
      <abs ABSG = 3 
       data hash MD5: 32K
       BF EE AF 65 48 41 DA D0 F0 DD 5C 43 0E 7B 1C 95>)
(   7,<2013-01-30 04:42:20.543 -0500>,<Administrator>,<X>,<proc1d>,<TOPSPIN 2.1>,
      <abs ABSG = 4 
       data hash MD5: 32K
       D9 07 AE 03 85 B5 F1 02 60 43 08 97 62 5E C3 14>)
(   8,<2013-01-30 04:42:20.699 -0500>,<Administrator>,<X>,<proc1d>,<TOPSPIN 2.1>,
      <abs ABSG = 5 
       data hash MD5: 32K
       CD 0A 49 B3 9C 38 D9 4A 55 4D D8 B9 56 CE 3B A6>)
$$ ##END=
$$ 
$$ $$ hash MD5
$$ $$ FC 71 0A 65 28 A3 DA 80 33 FD AC 45 1B 6C 0C 4C
##$RELAX= 
##$RELAX= 
##$RELAX= 
##$RELAX= 
##$RELAX= 
##$RELAX= 
##$RELAX= 
$$ Bruker specific parameters
$$ --------------------------
##$DU= <E:\>
##$EXPNO= 20
##$NAME= <AC1204_BRAAS12063_7164085_X9wEiwGAoq>
$$ [...]
##$TP= (0..7)
150 150 150 150 150 150 150 150
##$TP07= 0
##$TPNAME0= <>
##$TPNAME1= <>
##$TPNAME2= <>
##$TPNAME3= <>
##$TPNAME4= <>
##$TPNAME5= <>
##$TPNAME6= <>
##$TPNAME7= <>
##$TPOAL= (0..7)
0.5 0.5 0.5 0.5 0.5 0.5 0.5 0.5
##$TPOFFS= (0..7)
0 0 0 0 0 0 0 0
##$TUNHIN= 0
##$TUNHOUT= 0
##$TUNXOUT= 0
##$USERA1= <user>
##$USERA2= <user>
##$USERA3= <user>
##$USERA4= <user>
##$USERA5= <user>
##$V9= 5
##$VALIST= <valist>
##$VCLIST= <CCCCCCCCCCCCCCC>
##$VD= 0
##$VDLIST= <DDDDDDDDDDDDDDD>
##$VPLIST= <PPPPPPPPPPPPPPP>
##$VTLIST= <TTTTTTTTTTTTTTT>
##$WBST= 1024
##$WBSW= 4
##$XGAIN= (0..3)
0 0 0 0
##$XL= 0
##$YL= 0
##$YMAX_a= 600470
##$YMIN_a= -508178
##$ZGOPTNS= <>
##$ZL1= 120
##$ZL2= 120
##$ZL3= 120
##$ZL4= 120
##$ABSF1= 14.98509
##$ABSF2= -5.573092
##$ABSG= 5
##$ABSL= 3
##$ALPHA= 0
##$AQORDER= 0
##$ASSFAC= 0
##$ASSFACI= 0
##$ASSFACX= 0
##$ASSWID= 0
##$AUNMP= <proc_prof1d_extract_pilot.lims>
##$AXLEFT= 0
##$AXNAME= <>
##$AXNUC= <1H>
##$AXRIGHT= 0
##$AXTYPE= 0
##$AXUNIT= <>
##$AZFE= 0.1
##$AZFW= 0.1
##$BCFW= 0
##$BC_mod= 0
##$BYTORDP= 0
##$COROFFS= 0
##$CY= 15
##$DATMOD= 1
##$DC= 0
##$DFILT= <>
##$DTYPP= 0
##$F1P= 0
##$F2P= 0
##$FCOR= 0.5
##$FTSIZE= 32768
##$FT_mod= 6
##$GAMMA= 0
##$GB= 0
##$INTBC= 1
##$INTSCL= 1
##$ISEN= 128
##$LB= 0
##$LEV0= 0
##$LPBIN= 0
##$MAXI= 10000
##$MC2= 0
##$MEAN= 0
##$ME_mod= 0
##$MI= 0
##$NCOEF= 0
##$NC_proc= -8
##$NLEV= 6
##$NOISF1= 0
##$NOISF2= 0
##$NSP= 0
##$NTH_PI= 0
##$NZP= 0
##$OFFSET= 14.98509
##$PC= 1
##$PHC0= 98.89893
##$PHC1= 0
##$PH_mod= 1
##$PKNL= yes
##$PPARMOD= 0
##$PPDIAG= 0
##$PPIPTYP= 0
##$PPMPNUM= 2147483647
##$PPRESOL= 1
##$PSCAL= 4
##$PSIGN= 0
##$PYNMP= <proc.py>
##$REVERSE= no
##$SF= 400.02
##$SI= 32768
##$SIGF1= 0
##$SIGF2= 0
##$SINO= 400
##$SIOLD= 32768
##$SPECTYP= <>
##$SREGLST= <1H.CDCl3>
##$SSB= 0
##$STSI= 32768
##$STSR= 0
##$SW_p= 8223.68421052631
##$SYMM= 0
##$S_DEV= 0
##$TDeff= 65536
##$TDoff= 0
##$TI= <>
##$TILT= no
##$TM1= 0
##$TM2= 0
##$TOPLEV= 0
##$USERP1= <user>
##$USERP2= <user>
##$USERP3= <user>
##$USERP4= <user>
##$USERP5= <user>
##$WDW= 1
##$XDIM= 32768
##$YMAX_p= 455902580
##$YMIN_p= -655345
##$CURPLOT= <Network HP LaserJet P1505>
##$CURPRIN= <$Network HP LaserJet P1505>
##$DFORMAT= <normdp>
##$LAYOUT= <+/1D_H.xwp>
##$LFORMAT= <normlp>
##$PFORMAT= <normpl>
##$SURQMSG= 1
$$ End of Bruker specific parameters
$$ ---------------------------------
##NTUPLES= NMR SPECTRUM
##VAR_NAME=  FREQUENCY,     SPECTRUM/REAL,   SPECTRUM/IMAG
##SYMBOL=    X,             R,               I
##VAR_TYPE=  INDEPENDENT,   DEPENDENT,       DEPENDENT
##VAR_FORM=  AFFN,          ASDF,            ASDF
##VAR_DIM=   32768,         32768,           32768
##UNITS=     HZ,            ARBITRARY UNITS, ARBITRARY UNITS
##FACTOR=    0.250966925370066, 1,           1
##FIRST=     8223.43324360094, -314828,      32200
##LAST=      0,             -125587,         -123027
##MIN=       0,             -655345,         0
##MAX=       8223.43324360094, 455902580,    0
$$ Real data points
##PAGE= N=1
##DATA TABLE= (X++(R..R)), XYDATA
$$ [...]
19507a30996j98992B12142a54666b8415j4687I426c07546G6558a91717k5761A35603
19495f9880m5325e5133q8842k71379a47547Q138m9739D0052a12905A73405f803
19483b95256b6687B85313b45666B09286a86386B35652b26087l9673A38300E6464
19472c82797b1232k13099J14758A59059b33131E8560b40043J5424j73618J16526
19462b81711B0981J57571a21585j95744I0388c42905F8703e0806j00740n04c6276
19450a13549d4094A80158E2907P3367A5670c31480A86724b08846a8740n182l5457
19439e9379A90127b86037b5819l3661j63105B5248J42872d4924A18798b96306
19428b00093H0177O5638Q5585e3253K2440o402A56282p8047a15462b1083A45429
$$ y = [-130996, -329988, 212142, -154666, -28415, -43102, 9426, -307546, 76558, -191717, -217478, 135603, -69880, -115205, -55133, -143975, -415354, -147547, -139409, -189148, 40052, -112905, 173405, -6803, -295256, -26687, 285313, -245666, 209286, -186386, 235652, -226087, -265760, 138300, 56464, -382797, -21232, -234331, -119573, 159059, -233131, 58560, -240043, -224619, -398237, -281711, 20981, 178552, -121585, -317329, 90388, -342905, 68703, -50806, -151546, -152050, -36276, -113549, -44094, 180158, 52907, 126274, 15670, -331480, 186724, -208846, -18740, -23922, -59379, 190127, -286037, -25819, -59480, -222585, 25248, 168120, -44924, 118798, -296306, -200093, 80177, 145815, 231400, -53253, -30813, -37215, 156282, 78235, -115462, -21083, 145429]
19416B14625b22126C08460b07039b3175A61228h0545a9553B01919a96137j08329
19406c04466a45652k87378g1897n2507k00632E6320a09245j91433e4081j19187
19396a73268E0759f2377j12680A32847b87049a8491l73569J33865G8509J32389
19386B10898a94374A55451i7611h700k11618i2598I431K28443f7910Q233n4836
19375a14513n2793h2078L4818l05944O6148J10050B3548a25859a6187j4794j64053
19364a95034h1185K5483l4866B977a6454j25430j66234A58174n0977H226d2339
19352b69332O9084C3145J2971d3651o9304k94335J30390C194R6626m9477J0161
19341F0504J8201c3608f120F5504l1976J14429o9838a43417l91548B02377b62349
$$ y = [214625, -222126, 308460, -207039, -23175, 161228, -80545, -19553, 201919, -196137, -304466, -145652, -433030, -71897, -124404, -325036, 56320, -109245, -300678, -54081, -173268, 50759, -62377, -175057, 132847, -287049, -18491, -392060, -258195, 78509, 210898, -194374, 155451, -97611, -8700, -220318, -92598, 9431, 237874, -67910, -59677, -114513, -167306, -82078, -47260, -353204, -287056, -177006, 23548, -125859, -16187, -30981, -195034, -81185, -55702, -90568, 2977, -16454, -141884, -308118, 158174, 107197, 8226, -42339, -269332, -200248, 33145, 46116, -43651, -112955, -407290, -276900, 3194, 99820, 50343, 60504, 78705, -33608, -6120, 65504, 33528, 147957, 78119, -143417, -534965, 202377, -262349]
19329a72041E4864b75247A96587f3147G1780b7539A16170e7776p4484k96601K02055
19318b26806A88054k816I430a15482A9354f8653q7360A58172J11495A8405c20104
19306C16364H3151a92371q0745A32661g1495H2406c31246D1507O3396M1903B6146
19294a7259k3633A08355f2924D5642b88715G9389a77533M5855n1173d0555l09422
19283c49977E5415b28730A56851a07699A1183L6267b33355i9163l8714H5805b6169
19271e9698A68860a14239l3278A9356c85702B05184e0204B6218c10947a46488
19260D5592A2269a56198G7390a42200E7464K44970e0700C2438K7777L26648b72136
19248a73338f5338n0818o0577A697a79392G2126A4916a16395A6944c9888F7374
$$ y = [-172041, 54864, -275247, 196587, -63147, 71780, -27539, 116170, -57776, -132260, -428861, -226806, 188054, 185238, 9430, -115482, 19354, -68653, -156013, 158172, 269667, 18405, -320104, 316364, 83151, -192371, -273116, 132661, -71495, 82406, -331246, 41507, 104903, 146806, 26146, -17259, -40892, 108355, -62924, 45642, -288715, 79389, -177533, -131678, -182851, -40555, -349977, 55415, -228730, 156851, -107699, 11183, 47450, -233355, -99163, -137877, 85805, -26169, -59698, 168860, -114239, -147517, 19356, -385702, 205184, -50204, 26218, -310947, -146488, 45592, 12269, -156198, 77390, -142200, 57464, 302434, -50700, 32438, 60215, 386863, -272136, -173338, -65338, -116156, -176733, 1697, -179392, 72126, 14916, -116395, 16944, -39888, 67374]
19236h4308P312l3276o9720f883k3277o883G9631j5636b44674J979b9121k61526
19224b90647j86747a33880m34K4168r8002E221b12473i1145H4960a56323G065
19212e8489B3925c65272a10400J2510c2266C39311a02420j5897K6986b0547j03541
19201a24088l44590J67709e0820J5199A40053b55254C8726a72706h2755n2259
19191a35014A45813b75223F2268g3005G0771c14041I6012C0785a82242A61824
19180b60658J25229e7860j92304E7393d48826E5239P8305b2174C46004a95169
19169h0959R880k68961H1535b64950j8086A72549c78650A49884h870n7194o2944
19158a29008j08846b883j40216d6835j90318A86716d5444n1204d1123q133p1527
$$ y = [-84308, -76996, -110272, -179992, -6883, -30160, -37043, 79631, 63995, -244674, -242695, -29121, -290647, -477394, -133880, -134314, -110146, -208148, 5221, -212473, -91145, 84960, -156323, 7065, -58489, 23925, -365272, -110400, -97890, -32266, 339311, -102420, -118317, -91331, -20547, -124088, -468678, -300969, -50820, -35621, 140053, -255254, 38726, -172706, -82755, -135014, 145813, -275223, 62268, -73005, 70771, -314041, 96012, 30785, -182242, 161824, -260658, -135429, -57860, -250164, 57393, -448826, 55239, 133544, -22174, 346004, -195169, -80959, -71079, -340040, 81535, -264950, -283036, 172549, -378650, 149884, -8870, -66064, -129008, -237854, -2883, -143099, -46835, -237153, 186716, -45444, -96648, -41123, -49256, -120783]
19147a20783l0480A1478J36980f1200j02910p6940a8812j72338M4311J216j58528
19136c04151J13317d5078B86617a6873A4689b55682l7636h5194G8279R7893c54265
19124E3445g9262k75260A89507B6568b99888M7692g4747A0625D096Q7864b68141
19112F4631b19539D2763h6283K7921A16207a04072r9825m713p4853J15641j8143
19101a85965A46756i8429j26436E0916c7377j77946c3132J4810k09211A3958c90510
19089I087a14804A04477k4673d5641l47979c504j63879K7970A79707a03040M7829
19078e5211j36327a9024n3094A8893P7465d1112A54714f0139A53969a22501J376
19067a21125B1542E950f0093A07113k7052N4385J70846a23531F7324a15722B8075
$$ y = [-120783, -151263, 11478, 148458, -61200, -164110, -241050, -18812, -191150, -146839, -145623, -304151, -190834, -45078, 286617, -16873, 14689, -255682, -293318, -85194, 78279, 176172, -354265, 53445, -79262, -354522, 189507, 26568, -299888, -252196, -74747, 10625, 4096, 91960, -268141, 64631, -219539, 42763, -86283, -58362, 116207, -104072, -203897, -208610, -283463, -167822, -185965, 146756, -98429, -224865, 50916, -37377, -215323, -33132, -18322, -227533, 13958, -390510, 9087, -114804, 104477, 79804, -45641, -393620, -3504, -167383, -139413, 179707, -103040, -55211, -191538, -19024, -72118, 18893, 96358, -41112, 154714, -60139, 153969, -122501, -121125, 21542, 5950, -60093, 107113, 80061, 134446, 305292, -123531, 67324, -115722, 28075]
19055c91580J07626L2891A82559h8856m92318a73160N2621E8231a09751m2171
19045a51922C53746a48761R57C29319H2116a98216h6107a147j59564a8938p6217
19034i5155o3214L0568r6324A97972a68559m7152G0899a40768B00125a23070A27409
19022a77728D34609F7024a76278F7392k9835c17777E5347a56460N9393K3687M592
19011f8788k13768j01418a03599B11319h4991n4798l6069A05319A9998J30445
19001A50443J1885a514A28639a88248J5225k08119a8609D8296O9170l9879p447
18990G0140b28613i8843C22346I3576J76691j28825o3110L42296A89561N444i0000
18978c21977A89354B4990a26652r2917f3367j0152A10312J68095K26329B17941
$$ y = [-391580, -283954, -251063, 182559, -88856, -581174, -173160, -120539, 58231, -109751, -151922, 353746, -148761, -147804, 329319, 82116, -198216, -86107, -1147, -160711, -18938, -95155, -158369, -127801, -224125, 197972, -168559, -215711, 70899, -140768, 200125, -123070, 127409, -177728, 434609, 67024, -176278, 67392, 37557, -317777, 55347, -156460, -97067, -73380, -68788, -282556, -383974, -103599, 211319, -84991, -139789, -175858, 105319, 19998, 150443, 162328, -1514, 128639, -188248, -173023, -381142, -18609, 48296, 117466, 77587, 70140, -228613, -98843, 322346, 93576, 270267, 141442, 78332, 420628, 189561, 195005, -90000, -321977, 189354, 24990, -126652, -219569, -63367, -73519, 110312, 278407, 504736, 217941]
18967A21401m2844P4125f2652j20896f837k03562a8688k3740m0453j31486Q9205
18956a25162e713l76606J24161a06640A16021R7123d44347H685b95064M3703H5276
18944h491m9076o3604m3828g8385L5714j17466A36771b06731h9596K7745D4407
18932A36772a2077A67015a07630M4116l55100e768D2216Q608O813h7544B47579
18920a19983p8426C61201b83643a16679l928A76961b12628c9860p7273H5320a38500
18908B39949C8060N13647p633j50186c69677a72341B26210g2713l26434a82729
18897a68911f7987A31515d327k55800E5061a06818G8704c04443B5434M14218b45320
18885B19068G8116L821d34026M7686J76806B33467H3535f8496p466m2494r4137
$$ y = [121401, 78557, 152682, -62652, -183548, -6837, -210399, -18688, -42428, -82881, -214367, -125162, -5713, -382319, -258158, -106640, 116021, 213144, -444347, 8685, -295064, -251361, 85276, -8491, -57567, -121171, -164999, -78385, -42671, -160137, 136771, -206731, -89596, -61851, 44407, 136772, -12077, 167015, -107630, -63514, -418614, -5768, 42216, 50824, 57637, -87544, 247579, -119983, -198409, 361201, -283643, -116679, -120607, 176961, -212628, -39860, -117133, 85320, -138500, 239949, 38060, 551707, 544074, 393888, -369677, -172341, 226210, -72713, -399147, -182729, -168911, -67987, 131515, -4327, -260127, 55061, -106818, 78704, -304443, 25434, 439652, -245320, 219068, 78116, 81937, -434026, -386340, -209534, 233467, 83535, -68496, -75962, -118456, -212593]
18874b12593C0814b53244B7851c11674B40141q9639b88335A17718E276j561L26665
18863C30380f3060I4255b3198H0908e7694k0409j25694j41296a0443n55p5910
18852h6908H1100K1803C5917c8503D329a8623e723A90399a12592D7440B765a19370
18839A95849c3492j2957B03188e0560B2491b16935j4484A88200N4001a23526A28664
18827e0126j06232A73911n6279b25222q2345F5775D531a55712A17199J16646O2781
18816B96626b58392B6067d7872A50369C6944j7494e5108D7272R0125E178J89992
18805A95170B3746K01892j4401r3416g2131K3506j89207C0581c00613D03697b4938
18793e52092E9380Q6120b27914G5343a15471H532K2476a69046j91108a3524g90
$$ y = [-212593, 30814, -253244, 27851, -311674, 240141, 150502, -288335, 117718, 5276, 3715, 330380, -63060, 94255, -23198, 80908, -57694, -78103, -203797, -345093, -10443, -10998, -86908, 81100, 102903, 35917, -38503, 4329, -18623, -5723, 190399, -112592, 47440, 2765, -119370, 195849, -33492, -46449, 203188, -50560, 22491, -216935, -231419, 188200, 242201, -123526, 128664, -50126, -156358, 173911, 117632, -225222, -307567, 65775, 4531, -155712, 117199, 233845, 296626, -258392, 26067, -47872, 150369, 36944, 19450, -55108, 47272, 137397, 5178, 195170, 23746, 225638, 211237, 117821, -72131, -48625, -237832, 30581, -300613, 403697, -24938, -552092, 59380, 145500, -227914, 75343, -115471, 8532, 31008, -169046, -360154, -13524, -790]
18781b37253d9415j2135k4541L1153j23242M1810k69933A72664d6120m7613P359
18770h6374B0741K28394D3493b58629c0314J4476C2761J46069c1212H4335a29685
18758A68428b91694J43266A4834a4964k52514n8962a1716j60722m5076b0654k90713
18747c11367R7901k54951H0678e7293b6540A11211l6800O7706d09954f2329k893
18736f5222A10862O6305h1821A85404e0551o4486D905b53295J2896A27097b4961
18724d5032E9263M5886b55288c9690A9752M5952B9686K78398g7830j30945m6373
18713b55148A80501g9995B00283b1436p1734C03327b62511m9915d0134G1134b32851
18701A70125F0654a08987O750A19783h3901A75896a43034A79558g9773C7170a18210
$$ y = [-237253, -49415, -61550, -86091, -54938, -178180, -136370, -406303, 172664, -46120, -93733, -86374, 20741, 249135, 43493, -258629, -30314, -15838, 32761, 178830, -31212, 84335, -129685, 168428, -291694, -148428, 14834, -14964, -267478, -326440, -11716, -172438, -217514, -20654, -311367, -213466, -468417, 80678, -57293, -26540, 111211, 74411, 142117, -409954, -62329, -65222, 110862, 177167, -81821, 185404, -50551, -115037, 4905, -253295, -240399, 127097, -24961, -45032, 59263, 105149, -255288, -39690, 19752, 65704, 29686, 308084, -77830, -208775, -255148, 180501, -79995, 200283, -21436, -93170, 303327, -262511, -312426, -40134, 71134, -232851, 170125, 60654, -108987, -102237, 119783, -83901, 175896, -143034, 179558, -79773, 37170, -118210]
18689e8103j70224A07151D255b1902l37697f4008j7590L9619B7855a01249d4638
18677b99835J25791C47542E7826b10124A9230b69826J04456k71021g6820a3753
18666c11986A47391a2707m69614A71991a1855m03637A71555i5840A83246P8738
18656B61984c83756E0309O6373b07056H6302A0071b52443e983A25435a34643M3106
18645i1537G3692h6832a6720l1625B2199J98805c51944e977j87799m8367N0696
18634a91447A48115a16703n5142j05546B18400C016K80375b9747D4913a58614
18623a53336n6277H722f634j22635A49583a11441E4906a18040E2685K25167A26365
18611A99100h9552k79846J81921d267m7889l0354j47229A28216b8042B42622a38621
$$ y = [-58103, -228327, 107151, 4255, -21902, -359599, -64008, -81598, -41979, 27855, -101249, -44638, -299835, -174044, 347542, 57826, -210124, 19230, -269826, -165370, -436391, -76820, -13753, -311986, 147391, -12707, -482321, 171991, -11855, -415492, 171555, -95840, 183246, 261984, -383756, 50309, 116682, -207056, 86302, 10071, -252443, -5983, 125435, -134643, -91537, 73692, -86832, -16720, -48345, 22199, 221004, -351944, -5977, -193776, -242143, -191447, 148115, -116703, -171845, -277391, 218400, 3016, 283391, -29747, 44913, -158614, -153336, -209613, 8722, -6634, -129269, 149583, -111441, 54906, -118040, 52685, 277852, 126365, 199100, -89552, -369398, -187477, -4267, -52156, -82510, -229739, 128216, -28042, 242622, -138621]
18599A93257a06691A6255a9995l9847j95125J22653n7692Q3924H4271c1996F5391
18587a53689G1579g2787A37537a54847B1937a94937Q1064k4777d3034k88079a02490
18575d6758k7764I5343c8155r0209N9351B78816b41090g3227j39993A95573a11880
18563b32947p8882J16340K7056j97962B76570b09902b4740j01827j3973j46231
18553b86771B32387D1117J38553d12168a27338j64705j45317c0663o3678k622
18543i6963B26167c14024K5758h3642j8522j11040C7308Q6088g8638a7279A7544
18531B25204b88304h0167B64227a58180a5318k46102a25734n1420L7314R323G4569
18519c2037F4342I2J69142c24013g7621A26695c01623d9272A58752a37724B17732
$$ y = [193257, -106691, 16255, -19995, -59842, -254967, -132314, -190006, -106082, 84271, -31996, 65391, -153689, 71579, -72787, 137537, -154847, 21937, -194937, -113873, -138650, -43034, -331113, -102490, -46758, -74522, 95343, -38155, -128364, -69013, 278816, -241090, -73227, -213220, 195573, -111880, -232947, -311829, -195489, -168433, -366395, 276570, -209902, -24740, -126567, -140540, -286771, 232387, 41117, 179670, -412168, -127338, -292043, -437360, -30663, -94341, -96963, 226167, -314024, -288266, -83642, -102164, -213204, 37308, 123396, -78638, -17279, 17544, 225204, -288304, -80167, 264227, -158180, -15318, -261420, -125734, -177154, -139840, -130517, 74569, -32037, 64342, 92, 169234, -324013, -77621, 126695, -301623, -49272, 158752, -137724, 217732]
18507C34866a98371L2270L2097d892I8462a26060N2071n7802O1355p1725O5609
18496g6552j21726D5104J93172F5781b61183i7809o2933B96476e0647p4923l5191
18485a60761M6374j1771A26448c7881p5728G4J056b7202L492F8176e7736n7180
18473a14916B59574j11147a61754r4223A8716J38689b11640L568N3577c7751A77109
18461H5923l0899a13709B65843D8376a10494j66798F3735c81448a4566j54375
18451a68941b6395r0515E8240c7273j36953G0678j9617k4533j09h0778A30106
18439b66261c6422C9623h2770m8775D27001I4137b85118i3802p3786l4231B39496
18427A291a45920a5690D3096J09721A9642e9097l31869h1728j15129g4869F4444
$$ y = [334866, -198371, -166101, -134004, -4892, 98462, -126060, -73989, -131791, -70436, -142161, -76552, -198278, 45104, 238276, 65781, -261183, -97809, -160742, 296476, -50647, -125570, -160761, -114387, -126158, 126448, -37881, -113609, 74, 1130, -27202, -23710, 68176, -57736, -114916, 259574, 148427, -161754, -255977, 18716, 157405, -211640, -208072, -154495, -37751, 177109, 85923, 55024, -113709, 265843, 48376, -110494, -277292, 63735, -381448, -14566, -168941, -26395, -116910, 58240, -37273, -174226, 70678, 51061, 26528, 26419, -80778, 130106, -266261, -36422, 39623, -82770, -131545, 427001, 94137, -285118, -93802, -167588, -201819, 239496, 1291, -145920, -15690, 43096, 152817, 19642, -59097, -390966, -81728, -196857, -74869, 64444]
18415b22817d2558J7312A29537P5522a38159j89296e2320F1721a63190A94762
18404b90318g3258G0817L1715g6357j06112H1943d2497m66A42685n0273a05400
18392G702i1917j44770f4955r0463Q573B17137o5271b97558B59454d49273a63088
18380D142K31804q8693C9062A8834b81478J23328A81794b54518I5407f2747B45264
18368A35152g1072B81954r4459A5855h7158A62585f3912j02055B42261g0575A7653
18356e1665F8764a20706B5002b44391N1752Q7036D0488i422p887k15193A84045
18344A71068a51068B90500d26629J60755a16265C44050I2939J65079i3843c1229
18333A638b49134C46736H8625a74515m470P131n4724k29037A69403a86823c8786
$$ y = [-222817, -42558, -25246, 129537, 205059, -138159, -327455, -52320, 61721, -163190, 194762, -290318, -73258, 70817, 102532, -76357, -182469, 81943, -42497, -42963, 142685, 92412, -105400, 7702, -91917, -236687, -64955, -155418, -146845, 217137, 151866, -297558, 259454, -449273, -163088, 4142, 235946, 147253, 39062, 18834, -281478, -158150, 181794, -254518, 95407, -62747, 245264, 135152, -71072, 281954, 187495, 15855, -87158, 162585, -63912, -165967, 242261, -70575, 17653, -51665, 68764, -120706, 25002, -244391, -192639, -105603, 40488, -9422, -17309, -232502, 184045, 171068, -151068, 290500, -426629, -265874, -116265, 344050, 92939, 258018, -93843, -31229, 1638, -249134, 346736, 88625, -174515, -178985, -171854, -226578, -455615, 169403, -186823, -38786]
18321B23742d70810K35226A9621a16761O09E7161J46361J33706c25843a56401
18310E946a19989d8592n2155A46994b77057A86933d1736k04443g9542B47356g8305
18298b7310A34336h6025a9392o0895k86806C4991a30020j70250g433C5842i2921
18286B05055J67134c7765q3971r9580j29299h03o3112m03406A20395b31035A44476
18274c09490D4874a28365A50965c17584O9163A8109M659N8674M8896m2971C9945
18262A7912e3375B15187b60631J08062k4775b6018m5655J761a9587j65594B18270
18250a99939Q6771K608j04682A77083a5364A90284p528O2527a17350F478b53154
18238c30525B81402i0260D5535b23377j7105B19045j5140b9079A55377C9614b77878
$$ y = [223742, -470810, -235584, 19621, -116761, -116152, 57161, 203522, 337228, -325843, -156401, 5946, -119989, -48592, -100747, 146994, -277057, 186933, -41736, -246179, -79542, 247356, -78305, -27310, 134336, -86025, -19392, -80287, -367093, 34991, -130020, -300270, -7433, 35842, -92921, 205055, 372189, -37765, -121736, -221316, -350615, -803, -63915, -467321, 120395, -231035, 144476, -309490, 44874, -128365, 150965, -317584, -248421, 18109, 22768, 81442, 130338, 87367, 39945, 17912, -53375, 215187, -260631, -152569, -177344, -26018, -71673, -69912, -19587, -185181, 218270, -199939, -113168, -110560, -215242, 177083, -15364, 190284, 182756, 245283, -117350, 6478, -253154, -330525, 281402, -90260, 45535, -223377, -240482, 219045, 203905, -29079, 155377, 39614, -277878]
18226a02893c6367f320A91603F851J55217F4636J5170a15753j32904A42333b83139
18214b12951f6005A59794b28206B06420a37362A05603K6062a69223j3482A29080
18203f9223j00619g7395A71174L6925b94057B09272N7831b90921b000C48068c07592
18191a30623B5199b643C5496a442A22152b71474j34685A87e3943j7872B37813
18179a02320F4319J5470a21875C1810K98966j64722j6513J7321e6385G9157a39425
18167g9966F7081i8907C76226a84192A02849f8661A27345a41965K9339j86760
18157b99386e4539j25751A0506h7739k45341e0011C9386R2212F3561K24427A35304
18145a582A16259f9457G610M7903A0810L2070J59013b33325J00565O1060H2680
$$ y = [-102893, -36367, -6320, 191603, 6851, 162068, 64636, 79806, -115753, -248657, 142333, -283139, -212951, -66005, 159794, -228206, 206420, -137362, 105603, 131665, -169223, -182705, 129080, -69223, -169842, -77395, 171174, 208099, -294057, 209272, 267103, -290921, -2000, 348068, -307592, -130623, 25199, -2643, 35496, -1442, 122152, -271474, -406159, 187, -53943, -71815, 237813, -102320, 64319, 79789, -121875, 31810, 330776, 166054, 149541, 166862, -56385, 79157, -139425, -79966, 67081, -98907, 376226, -184192, 102849, -68661, 127345, -141965, -112626, -299386, -54539, -180290, 10506, -87739, -333080, -50011, 39386, 131598, 63561, 287988, 135304, -1582, 116259, -69457, 7610, 55513, 10810, 42880, 201893, -233325, -132760, -71700, 82680]
18133h0102m53j97267a35806m3906J0787O7538l3967n129m8542d0517n1191L1846
18121e9862j35657A854N7058a81866F5434g5617j89625B13334a37575j4555P2379
18110g9751k8828q7835l1662q6434a56470r2637r4140J11440A71626c74997c6155
18098h7580B6166J76754D0411J40108a02170k63721A65239o9070i0299A02599
18087a84566B37026G8324L378A308c01919A74864f0197A70142a55044a7479k17776
18076b35255C8496J47509G6786c24879o8714C592L16839b14646F0542h8290j15568
18065b03858j69752h1029j43789B13403B3781M0587d3021B18938a49718j23782
18055b73500P2773B63005a2457k17249B9164a40426n1252A99467a62075C6756
$$ y = [-80102, -80555, -277822, -135806, -179712, -168925, -101387, -135354, -140483, -189025, -40517, -91708, -59862, -195519, 1854, 58912, -181866, 65434, -75617, -265242, 213334, -137575, -152130, -79751, -108579, -196414, -228076, -314510, -156470, -249107, -343247, -231807, 171626, -374997, -36155, -87580, 26166, 202920, 40411, 180519, -102170, -365891, 165239, 96169, -90299, 102599, -184566, 237026, 78324, 81702, 1308, -301919, 174864, -60197, 170142, -155044, -17479, -235255, 38496, 186005, 76786, -324879, -393593, 3592, 320431, -214646, 60542, -88290, -203858, -373610, -81029, -224818, 213403, 23781, 64368, -43021, 218938, -149718, -273500, -200727, 263005, -12457, -229706, 29164, -140426, -191678, 199467, -162075, 36756]
18044F2569i9230k12408c2780G9841c93451D4213f2393C4315P6573b18628O5531
18033a53097A8196K39837g3431F5259e2630F0321J20097a10798j38497A00173
18022a57274c0743A57347K10399E0464K45976b44646j23008B62203a18500r7759
18012b16259A43137o7042a79137p9159B34059j1933m8380h1847m3763A73848R7407
18001B71255G091K4295J1977b64644a02154b3943l1809A5434a969j14149D4922
17989c42967D5391h9454c8598j62256K0948H0944a00930I4106b3136j42870K2834
17978a43172B25847C1877f1480r9939e6223I8010J82487b79690h5557a7423o1774
17967g9197A19447J9326m8810a10961A11440P249a35674A34641b74335d4784A72845
$$ y = [62569, -99230, -311638, -32780, 79841, -393451, 44213, -62393, 34315, 110888, -218628, -153097, 18196, 258033, -73431, 65259, -52630, 60321, 180418, -110798, -249295, 100173, -157274, -30743, 157347, 367746, 50464, 296440, -244646, -367654, 262203, -118500, -216259, 143137, 76095, -179137, -258296, 234059, 222126, 173746, -81847, -125610, 173848, 271255, 7091, 31386, 43363, -264644, -102154, -23943, -55752, 15434, -1969, -116118, 44922, -342967, 45391, -89454, -38598, -200854, -179906, 80944, -100930, 94106, -23136, -166006, -143172, 225847, 31877, -61480, -161419, -56223, 98010, 280497, -279690, -85557, -17423, -79197, 119447, 138773, 89963, -110961, 111440, 118689, -135674, 134641, -274335, -44784, 172845]
17955A20306a09459A47261d7183j99458L7218c1409l29528a75163Q4238A22961
17944a32377e15E2114a60397A8959m953h530k59356d5377n3735A7175J43032p3758
17932H6449b20336j64253E2548J37128b80074A89653G0509e5251j28131J2457
17922a70925B5903Q5791D374J4350b21225A43545F457J01930a54002C3581K34823
17911B68404a07106q5559d8812A41784Q0883h529j30286G5924L7061a31468E877
17899H0425k2785a99151a1423G1776g1881n8028B48970j06775a58099E33956k5383
17888E08573a57714p329A36842b94771N2070a07810b4200A7020b2274B30496m923
17877B25573E7949N9290g2574A56386P1431q4262D0257B007b40971A41110m5276
$$ y = [120306, -109459, 147261, -47183, -246641, -209423, -31409, -360937, -175163, -90925, 122961, -132377, -515, 52114, -160397, 18959, 14006, -8530, -267886, -45377, -99112, 17175, 160207, 86449, -220336, -384589, 52548, 189676, -280074, 189653, 70509, -55251, -183382, -170925, 25903, 111694, 4374, 18724, -221225, 143545, 6457, 108387, -154002, 33581, 268404, -107106, -192665, -48812, 141784, 222667, -8529, -138815, 75924, 112985, -131468, 5877, 80425, 57640, -199151, -11423, 71776, -71881, -129909, 248970, 142195, -158099, 533956, 508573, -157714, -165043, 136842, -294771, -242701, -107810, -24200, 17020, -22274, 230496, 225573, 57949, 117239, -72574, 156386, 227817, 143555, 40257, 2007, -240971, 141110, 95834]
17866I5834b934D6059J30241b00674g7218H2804k3458a82422L1891B89904d16249
17854A73135J28255o8962O9977b30225B3451a37111G6663C0774a75132B9141a52988
17842D614L10284p4962H1970B145R6807L9058b22904A01790a36858A01285b11026
17830B33918F9122M2419b39188I9932m4432c7280k61248E0809b73044d3194F3510
17818b44577H7904J00610c7667A97094i4598B00360a7177C57499b91062E6178
17807A95318k5372d6657A11262f773m02741E3828a72383a2639A96089k1513B2620
17795A58138G221K0412K56587e4602B20227b4495M086C6241a26133f2402B0364
17783C32849A19642h7768B30195J42124o6586b80658c6770A34270N9864J44023
$$ y = [95834, -2934, 46059, 176300, -200674, -77218, 82804, 59346, -182422, -150531, 289904, -416249, 173135, 301390, 232428, 302405, -230225, 23451, -137111, 76663, 30774, -175132, 29141, -152988, 4614, 314898, 239936, 81970, 2145, 98952, 138010, -222904, 101790, -136858, 101285, -211026, 233918, 69122, 111541, -239188, 99932, 55500, -37280, -298528, 50809, -273044, -43194, 63510, -244577, 87904, 188514, -37667, 197094, -94598, 200360, -17177, 357499, -291062, 56178, 195318, 169946, -46657, 111262, -6773, -409514, 53828, -172383, -12639, 196089, 174576, 22620, 158138, 7221, 27633, 284220, -54602, 220227, -24495, -20409, 36241, -126133, -62402, 20364, 332849, 119642, -87768, 230195, 372319, 305733, -280658, -36770, 134270, 194134, 338157]
17773C38157C8861J58260k9706d3664j10460D580J08055K19059C5209J81847F9478
17761i4617l8404N3389j84041B66812a11507e0872p0868B28163c32918O652A13981
17749b8788I0431l3854i4955F5944J15452a93678B39970c24224C65248b06417
17738c62210A82588D6472N4925a33160J3095k2244G6936A789K60993l9665b562
17726c4013j08012j5502B8708A4174J8596e3036I9890d6661C8572e4626C50J7123
17714A7473K9305a96709B03552q3820b40032A97720a30275B03492b5959A16955
17703B72735p6052F1443a7979B90020h8268A12170i3183C77741F2378j3712O912
17692E5578d8800m7053B63197H0915E301b87594A31887A0936J2781a30661c7079
$$ y = [338157, 38861, 197121, 167415, -43664, -154124, 4580, 112635, 331694, 35209, 217056, 69478, -94617, -133021, -79632, -263673, 266812, -111507, -50872, -121740, 228163, -332918, -326266, 113981, -28788, 90431, 56577, -94955, 65944, 181396, -193678, 239970, -324224, 365248, -206417, -362210, 182588, 46472, 101397, -133160, -120065, -142309, 76936, 1789, 262782, 223117, -2562, -34013, -142025, -157527, 28708, 14174, 32770, -53036, 99890, -46661, 38572, -54626, 350, 17473, 46778, -196709, 203552, 119732, -240032, 197720, -130275, 203492, -25959, 116955, 272735, 196683, 61443, -17979, 290020, -88268, 112170, -93183, 377741, 62378, 48666, 55578, -48800, -95853, 263197, 80915, 5301, -287594, 131887, 10936, 23717, -130661, -37079]
17680C5326K66284a12317I6612O5944a4330j7405A43416J66258G1253a16947I4172
17668C36233i1875A87509R4550B1765n954b26898a1796B16321f0980q1811F7203
17656B14717F5782d9947K4407C10066g8809c0666A39871n1180J24555G0837a52412
17644b66851B72820f6711B61825f3913A09042M2836N2504n7921A7860a59411B33487
17632B55606a00591p7661c1811E5008a06011A50965h5941A81417q6916O6157n7473
17621A03185K63819p0916e86G8577M4202L27481c09716A92192P5939H3981R407
17610I3388J16868r6219d0349A27110b88571m8843A22233Q4212B0295Q6143L8522
17599A44960E0691A5570J24203n3960C1603J00990n6228L0208j3131K62896H5874
$$ y = [35326, 301610, -112317, 96612, 162556, -14330, -31735, 143416, 309674, 71253, -116947, 94172, 336233, -91875, 187509, 282059, 21765, 15811, -226898, -11796, 216321, -60980, -142791, 67203, 214717, 65782, -49947, -25540, 310066, -78809, -30666, 139871, 88691, 213246, 70837, -152412, -266851, 272820, -66711, 261825, -63913, 109042, 151878, 204382, 146461, 17860, -159411, 233487, 255606, -100591, -178252, -31811, 55008, -106011, 150965, -85941, 181417, 94501, 160658, 103185, 367004, 296088, -586, 78577, 122779, 450260, -309716, 192192, 268131, 83981, 93388, 210256, 114037, -40349, 127110, -288571, -337414, 122233, 206445, 20295, 106438, 144960, 50691, 15570, 139773, 85813, 31603, 132593, 76365, 106573, 93442, 356338, 85874]
17587B15372k8799G902K6547K58907b43983C52675h3639B32178I6891e4070E1459
17575H6826e1375G7895K1780J40181P3004A07277k8491R3406K03179a0413B02979
17563E70007A02152j7722K87448j74133f4713A77402a18115G5196m785A401J78157
17552A79558J78947I2636Q1174a6835C33168g9207j05430b2901C28180j03778
17542B24402o0839L04962A18587M4650J6734H2625b4699C7427L00100j28299o4971
17531A44257k127B0976d9585A90330R8480k775N09917K3432k5743k8032j26967
17520F38642j20541L44496B72200L55626A70873K13373J69116A87201L36731K10948
17510G34880K87495j41004P0122k60878l20029O4005q7482A40403d5150G2806
$$ y = [215372, 186573, 7902, 34449, 293356, -243983, 352675, -83639, 232178, 96891, -54070, 51459, 86826, -51375, 77895, 99675, 239856, 312860, 107277, 78786, 172192, 375371, -10413, 202979, 570007, 102152, 84430, 371878, 197745, -64713, 177402, -118115, 75196, 70411, 1401, 179558, 358505, 92636, 173810, -16835, 333168, -79207, -184637, -22901, 328180, 224402, 163563, 468525, 118587, 163237, 179971, 82625, -24699, 37427, 337527, 209228, 144257, 142130, 20976, -49585, 190330, 288810, 286035, 795952, 819384, 793641, 765609, 638642, 518101, 862597, 272200, 627826, 170873, 384246, 553362, 187201, 523932, 734880, 1022375, 881371, 951493, 690615, 370586, 434591, 347109, 140403, -45150, 72806]
17499E65491j86510H7821M60957B63104b90086E51817A89637N5236o6923L14016
17489D91966j37308f552B14527J05867j20759B1382L05592m1712A03837b9372
17478B84234L6741j54602K23625R207j50757J36139l081n8334R6318j70664J47913
17467C96739J22086J62689B23143a826H4036j8053L42083E6795L47794F6331Q6101
17456A52432k2836k3515k7393L59494g9849B79960R6636A81112K05186L279n9280
17445C30297K58403B20227r1291P24464l82798a6718A09706K85337J74676B31669
17434D56778q0730j16140o7283L65683k42347J74393p5918M4609j53376p1068
17424B34601G6167J49659N55831C43760p1388K62458E1067N05374B32979O7732
$$ y = [565491, 378981, 87821, 548778, 263104, -290086, 551817, 189637, 244873, 177950, 491966, 354658, -6552, 214527, 320394, 199635, 21382, 326974, 285262, 103837, -29372, 284234, 320975, 166373, 389998, 399205, 248448, 384587, 381506, 323172, 419490, 248826, 396739, 518825, 681514, 223143, -1826, 84036, 65983, 408066, 56795, 404589, 66331, 152432, 129596, 106081, 78688, 438182, -79849, 279960, 376596, 181112, 386298, 389577, 330297, 588700, 220227, 128936, 853400, 470602, -16718, 109706, 395043, 569719, 231669, 456778, 376048, 259908, 192625, 558308, 315961, 490354, 414436, 459045, 305669, 234601, 76167, 225826, 781657, 343760, 272372, 534830, 51067, 556441, 232979, 300711]
17414C00711K23300J04100E1161M39579B02030K31356Q7274j8481j77380O6960
17404C91759M9286A59402L3533H2283R8437K94840B12862L907d0467I6891J23587
17393B20478n3363J01667k2961r8055q615J29027q8985j4794D7753J74814K98867
17382E21434F4165K86388P0964A87553K69816j19303j26672J10794A24495Q6041
17372B10536f39H9025M92765B90886R1015A85873c2765C36426A25290L2672J68277
17361C26239K0962o2828K51996j82865A66537L77106F9532M6963j0671b18567
17350D40655j81302j11689J51214j43387K66113B01330m9555K54238b10885B04894
17339e6402D73681D0585M36842A60444j7741R0506j14477J43473q4224K94513
$$ y = [300711, 524011, 628111, 51161, 490740, 202030, 433386, 520660, 502179, 324799, 391759, 441045, 159402, 192935, 82283, 180720, 475560, 212862, 216769, -40467, 96891, 220478, 167115, 268782, 245821, 147766, 139151, 268178, 179193, 164399, 47753, 222567, 521434, 64165, 350553, 421517, 187553, 457369, 338066, 211394, 322188, 124495, 210536, -639, 89025, 581790, 290886, 381901, 185873, -32765, 336426, 125290, 157962, 326239, 347201, 284373, 536369, 353504, 166537, 543643, 69532, 116495, 105824, -218567, 440655, 259353, 147664, 298878, 155491, 421604, 201330, 151775, 406013, -210885, 204894, -56402, 473681, 40585, 477427, 160444, 142703, 233209, 118732, 262205, 177981, 472494]
17329D72494A22602L17470H7329K68988A48929K53747A95850K48101A94159q0438
17319A13721K78461L5181H0083N9521L82445B3960K45152P2492J55027I845K30045
17308B39890A18552E1649N7046K51360o2731J65745M7761J1855o5541P8047k30253
17297C04938j10948g6199H874O34666B36284l9329L47699I910J13131K17261K04046
17286E44348A59663J81252j5848J4805K7143c7282B9815L93743d1628L686C76096
17274a13804C42972J4829A77092L22892j27211G5049O669J03831E9093J81694
17264B40787r6430M8640K77617q524j8564A67741J0535M06107A00933K37209A52187
17252D03922R8316j16641j22829E2090L03001j68898M64295j53753A19278R7075
$$ y = [472494, 122602, 440072, 87329, 356317, 148929, 402676, 195850, 443951, 194159, 113721, 392182, 427363, 80083, 139604, 522049, 23960, 269112, 341604, 496631, 9845, 239890, 118552, 51649, 108695, 360055, 297324, 463069, 510830, 522685, 457144, 535191, 304938, 193990, -76199, 8874, 643540, 236284, 196955, 544654, 9910, 123041, 340302, 544348, 159663, 340915, 325067, 339872, 367015, -37282, 29815, 423558, -41628, -37942, 376096, -113804, 342972, 357801, 177092, 499984, 372773, 75049, 81718, 185549, 59093, 240787, 144357, 192997, 470614, 462090, 443526, 167741, 178276, 584383, 100933, 338142, 152187, 403922, 502238, 385597, 262768, 52090, 355091, 186193, 650488, 496735, 119278, 216353]
17242B16353J16410A10563L39488B3976L95630A72809Q1714J18481n7319q4437
17232B31248K42528p6278m586c298I2562K29162l6074L56047B88075H3943J72292
17221B56235l2915J69227J59658A93604E8876J18586K36307K39973B3677N87263
17211F10940a01633A95584J09448A40501L0214J82017F4347M11940j06821K09559
17201E79025B83242J19714j35628J10400q6314J71082j09850A49881b7404D89023
17190E68190B43547N4177r7503L91321j81465j02925J48182B20153J10151j08572
17180B21732K41805j57277J78318q5562J46934r5170A74128M06563G5820K02717
17170B78537K33241j03074J65472A83209J10646o7747L20139r6491j2419J216
$$ y = [216353, 332763, 110563, 450051, 23976, 419606, 172809, 254523, 373004, 315685, 231248, 473776, 397498, 392912, -3298, 92562, 321724, 285650, 641697, 288075, 83943, 256235, 223320, 392547, 552205, 193604, 58876, 177462, 413769, 653742, 23677, 610940, -101633, 195584, 305032, 140501, 170715, 352732, 64347, 476287, 369466, 579025, 283242, 402956, 267328, 377728, 291414, 462496, 352646, 149881, -27404, 489023, 568190, 243547, 297724, 200221, 591542, 410077, 307152, 455334, 220153, 330304, 221732, 463537, 306260, 484578, 399016, 545950, 450780, 174128, 580691, 75820, 278537, 511778, 408704, 574176, 183209, 293855, 226108, 546247, 449756, 437337, 438553]
17160D38553J01778o576k05447J45617K63674l49601M723J939J76768N4562k34857
17149C91133D3542P34884l10426J08178N732r6536K92039k64515J7045k38108
17139B91835J91803o0054j87973K73042B51560L3714k5456L42620j38332j98121
17129B65985m6394L46151k17047M30919L9288C69393K02603j80714J5925K36085
17119F43292m5022k27879J0869L22650j49928P892L02029C81601N1770j40578
17109B92793j14699J60803J29172J07955j87953R6619Q6285B10747O44185j19075
17099G35857k0380j34472K80023k78534J07935k29078r3370Q7508K79468j38830
17089E96127R1338N1538l7599o2188J08220k16957p6120M66621l02080l68q9754
$$ y = [438553, 540331, 533755, 328308, 473925, 737599, 387998, 392721, 394660, 571428, 625990, 391133, 43542, 778426, 468000, 576178, 581910, 485374, 777413, 512898, 529943, 291835, 483638, 423584, 235611, 508653, 251560, 285274, 259818, 602438, 464106, 265985, 219591, 565742, 348695, 779614, 818902, 369393, 571996, 391282, 407207, 643292, 598270, 370391, 381260, 703910, 553982, 561874, 863903, 381601, 433371, 292793, 178094, 338897, 468069, 576024, 388071, 484690, 570975, 210747, 854932, 735857, 715477, 581005, 861028, 582494, 690429, 461351, 367981, 455489, 734957, 596127, 687465, 739003, 701404, 639216, 747436, 530479, 454359, 920980, 618900, 618532, 528778]
17078E28778J51963K99978l26612J17519j27311L1703J34953l21275m346L58077
17068H43427n9641r8849M666Q7822k59741K03622m6758K95471j63133r8784m7718
17057F60384j94841L28641j36433J8976q1837N60046n70750K0185J00971J32641
17047H37983o3497K14027k23229J71025m11580N80600D73705M72506k12349J78284
17037I12146m6691J2780R8389J1405l83015K59477j76677L32007k65380L64633
17027A119074J36975k07884l05117o0534M78814l36491r5714K65484j89372O10351
17017A415586l13592r2077k01636J34505L20176k82723J6368J10025k00326L46041
17007A252347j31004J44398k86439K50528k12744J55322K31204m27088Q6996M4889
$$ y = [528778, 680741, 980719, 654107, 771626, 644315, 676018, 810971, 489696, 485350, 843427, 783786, 684937, 689603, 777425, 517684, 721306, 674548, 970019, 806886, 708102, 660384, 465543, 794184, 657751, 676727, 594890, 1154936, 584186, 604371, 705342, 837983, 774486, 988513, 765284, 936309, 524729, 1105329, 473705, 946211, 733862, 912146, 865455, 878235, 976624, 988029, 605014, 864491, 687814, 1019821, 754441, 1119074, 1256049, 1048165, 743048, 682514, 1161328, 824837, 729123, 994607, 805235, 1415586, 1101994, 1009917, 808281, 942786, 1262962, 980239, 996607, 1106632, 906306, 1252347, 1121343, 1265741, 979302, 1229830, 1017086, 1172408, 1403612, 976524, 1063520, 1108409]
16997A108409K99815j71661j15826r2602J45570L26245k07636J9101j56363L15149
16987A470201l04482j16403L12432k43285N5518J044n4254K51778n3762j81642
16977A137145n8540K10979Q869k5695o9644Q0481J57294k12556K2031J96982J07994
16966A555340j6953k55817J95352l7833Q1451N4458l62363L85465k86745L4174
16956A346529K94465j28468K42116p5529j00498K68729k894j39928L8742J89588
16946A932852m0699p0965J14287j53328n7004m0806L110n9488J74623l18937M14226
16935A897871J301j9584K15791k01437P7306r613J962p4349J15959j1370K72425
16924B266262l88725J93942K08906j26350L0881N2744J50567k99135L51673l71489
$$ y = [1108409, 1408224, 1236563, 1120737, 1028135, 1173705, 1499950, 1292314, 1311415, 1155052, 1470201, 1165719, 1049316, 1361748, 1118463, 1173981, 1175025, 1120771, 1372549, 1318787, 1137145, 1078605, 1289584, 1298453, 1272758, 1203114, 1283595, 1440889, 1228333, 1250364, 1447346, 1555340, 1538387, 1282570, 1477922, 1440089, 1521540, 1575998, 1213635, 1599100, 1312355, 1346529, 1640994, 1512526, 1754642, 1679113, 1578615, 1847344, 1844450, 1704522, 1743264, 1932852, 1892153, 1821188, 1935475, 1782147, 1725143, 1684337, 1687447, 1627959, 1802582, 1483645, 1897871, 1899172, 1879588, 2095379, 1893942, 1971248, 1961635, 1963597, 1889248, 2005207, 1993837, 2266262, 1877537, 2071479, 2280385, 2154035, 2184916, 2237660, 2388227, 2089092, 2440765, 2069276]
16914B069276L08185j92887J26639R8432l10700K04109L9626j03244j40575K43553
16904B342414K17306j135N8132L6242l06324M9717L73137l8810Q2082k26496M2445
16893B628710J60093k08550K88927K63523n78238N02159J46162r3725j02245K40375
16883C247191R3407l46378J6036L57987k19007k072p0054N88834j30780K4501
16873C559665r75K9155O9217O3325k97621K48358J87130J06929K23714l20671
16863C868226J99430j0012K53146l041J2171l79721O98328o6340K54324m21549
16853D404962j27496K99104L26308J41675k14741P3494j98215M98865K08313j04570
16843E307699J09423K17882p5067j37912M32895J49803o9687j58145K66505K58342
$$ y = [2069276, 2377461, 2184574, 2311213, 2409645, 2098945, 2303054, 2342680, 2239436, 2098861, 2342414, 2559720, 2558585, 2616717, 2652959, 2346635, 2396352, 2769489, 2730679, 2812761, 2586265, 2628710, 2788803, 2580253, 2869180, 3132703, 2554465, 3056624, 3202786, 3109061, 3006816, 3247191, 3340598, 2994220, 3010256, 3368243, 3149236, 3147164, 3077110, 3665944, 3535164, 3559665, 3558690, 3587845, 3657062, 3720387, 3422766, 3671124, 3858254, 3965183, 4188897, 3868226, 4067656, 4057644, 4310790, 4307749, 4319920, 3940199, 4638527, 4572187, 4826511, 4404962, 4277466, 4576570, 4902878, 5044553, 4829812, 4903306, 4705091, 5203956, 5412269, 5307699, 5417122, 5635004, 5559937, 5422025, 5854920, 6004723, 5935036, 5776891, 6043396, 6301738]
16833F301738k15055O51493l3170r9966L62256Q2438M0332J04445J82029O9181
16823G445721J21178L34446j20425M0702L83750M3802N24419j44441L65202J3845
16813I008199L00553l2071M02643L00030M12572k45491r6878M04762L95862J98348
16803A1048529L29718J40880M34946l0210O20960q8829M53066L51490K69353L17460
16793A3847363O08261K05761j323O95506K16313O88854L08780j30631P24046O64370
16783A7827300L98369O90789L60405M70049N21237O34947P61571L48972N46638
16774B2560277J109094N01413O03033R61583Q10724P76188J149002Q29594Q83945
16765C0184853R30083J085334J106586J123142J166176J058651J278942J027267
$$ y = [6301738, 6086683, 6738176, 6705006, 6605040, 6967296, 7049734, 7090066, 7194511, 7376540, 7445721, 7566899, 7901345, 7780920, 7821622, 8205372, 8249174, 8773593, 8629152, 8994354, 9008199, 9308752, 9276681, 9679324, 9979354, 10391926, 10146435, 10049557, 10454319, 10850181, 11048529, 11378247, 11519127, 11954073, 11923863, 12544823, 12455994, 12909060, 13260550, 13529903, 13847363, 14455624, 14661385, 14660062, 15355568, 15571881, 16260735, 16569515, 16438884, 17162930, 17827300, 18225669, 18916458, 19276863, 19746912, 20268149, 20903096, 21664667, 22013639, 22560277, 23669371, 24170784, 24773817, 25735400, 26546124, 27322312, 28471314, 29300908, 30184853, 31114936, 32200270, 33306856, 34429998, 35596174, 36654825, 37933767, 38961034]
16757C8961034J971795J260992J570019J567982J672735J998227J285530K064943
16749E2353257K055541K090181J923299K320622K131696K593509K342371K259958
16741G0070434K522283K456744L031938K432762K621261L086815K512052K742809
16733I1477098K546678K360381K553179K046675K567295J935048J793019J545137
16725A08824510J447436J277331N97971O28338N52347m57075J13591j121725p08412
16716A11154312j189898j310281k380598j477019j971891k090254k598836k631903
16708I5503632k587351k613028l018180k514435k613087k943919k330640l023667
16700G3859325k492089k578703j892865k840121k265954k459210k260572j877369
$$ y = [38961034, 40932829, 42193821, 43763840, 45331822, 47004557, 49002784, 50288314, 52353257, 54408798, 56498979, 58422278, 60742900, 62874596, 65468105, 67810476, 70070434, 72592717, 75049461, 78081399, 80514161, 83135422, 86222237, 88734289, 91477098, 94023776, 96384157, 98937336, 100984011, 103551306, 105486354, 107279373, 108824510, 110271946, 111549277, 112147248, 112775586, 113327933, 112870858, 112984449, 111862724, 111154312, 109964414, 108654133, 106273535, 104796516, 102824625, 100734371, 98135535, 95503632, 92916281, 90303253, 87285073, 84770638, 82157551, 79213632, 76882992, 73859325, 71367236, 68788533, 66895668, 64055547, 61789593, 59330383, 57069811, 55192442]
16692E5192442j912887j962572k097326j970289j341332j746703j763826j175834
16684D1221673j565664j773153r50126j464638j088866j483297n61348j348624
16676C0985957j036750o80093j190119j008933m95366j143806p02887o05579r51641
16667B3170783j103912m05162k72430p46017m83401p85447k74192n62068r59548
16658A7578606m65679m26169m68581l45276l64981n00724j67541m52600n59879
16649A3827176r8614m64054j85721k94291k81427o45352J42171o62038q7376m14799
16639A0835675L6580m10742J17077l55230l48237m22781J56960k32341l74779
16630I002182k09661r8918j58658k02542j81204J44420n16766L1771k51129Q060
$$ y = [55192442, 53279555, 51316983, 49219657, 47249368, 45908036, 44161333, 42397507, 41221673, 39656009, 37882856, 36932730, 35468092, 34379226, 32895929, 32334581, 30985957, 29949207, 29269114, 28078995, 27070062, 26574696, 25430890, 24728003, 24122424, 23170783, 22066871, 21661709, 21389279, 20643262, 20159861, 19374414, 19100222, 18538154, 17578606, 17112927, 16686758, 16218177, 15872901, 15507920, 15007196, 14839655, 14387055, 13827176, 13728562, 13264508, 13078787, 12784496, 12503069, 11857717, 11999888, 11337850, 11250474, 10835675, 10872255, 10461513, 10578590, 10223360, 9875123, 9452342, 9609302, 9376961, 9002182, 8792521, 8693603, 8534945, 8332403, 8151199, 8295619, 7778853, 7810624, 7559495, 7567555]
16620G567555l08542k71512Q767k70131k02261J70305n64365J13047P2569P25
16610F316157j32285j71313k86940J36227l31672k25651N7396N7559r7731l16782
16600E004965j09585L13416j80080k68222K93609O5649m86795p3527K5310j66594
16590D418146J08472r0494r1595k42593q3342l5635k1953l93090N2693j7321J33428
16579C736716N9291r7115j45935J78667k46858K4231l12121J31053j48551L65654
16569C545032m82738j44089K48944l1761j72254L0902N5516j17286m1477L6967
16559B927756J09569n20933K97385k28343n4014M7340J22501J45075l46283l68640
16549B131413N48974l10697K67391k73355r2126K07301m27187K12880P7079j34352
$$ y = [7567555, 7259013, 6987501, 6996268, 6726137, 6523876, 6694181, 6129816, 6242863, 6315432, 6316157, 6183872, 6012559, 5725619, 5861846, 5530174, 5304523, 5361919, 5419478, 5321747, 5004965, 4895380, 5208796, 5028716, 4760494, 5054103, 5119752, 4632957, 4559430, 4584740, 4418146, 4526618, 4436124, 4344529, 4101936, 4018594, 3982959, 3961006, 3567916, 3620609, 3603288, 3736716, 3796007, 3698892, 3552957, 3731624, 3484766, 3508997, 3196876, 3327929, 3179378, 3545032, 3062294, 2918205, 3167149, 3135388, 2963134, 2994036, 3049552, 2932266, 2890789, 2927756, 3037325, 2516392, 2813777, 2585434, 2531420, 2578760, 2701261, 2846336, 2500053, 2131413, 2680387, 2369690, 2637081, 2363726, 2271600, 2478901, 2051714, 2264594, 2341673, 2207321]
16539B207321q5350K75416K7102k11390j77274K14458n44941J52376K94499J37750
16529B289967l22618j15877k11388N79726j31256k2749k95776l39641K85941L35670
16519B051999j70529M8519k29556k0138j16983p2011O6466j6823K42471j64835
16509A618580J79404n60509O46981J11052n11134j37988L08747J75592l56681
16500A474044M8454m1907p879j84852J32175j89021O9930K5365P8335j19172k4166
16489A261306K34203k60775K08236k23752J90597k97725J7772L8413j52866K23000
16479A238409q3962J75660l36094J15989R9442j28628J93460m14186L78349k33898
16469A004541r0002J44346j44579M092l57203M58346k8342J08262k02045K14052
$$ y = [2207321, 2121971, 2397387, 2424489, 2213099, 2035825, 2250283, 1705342, 1857718, 2152217, 2289967, 1967349, 1851472, 1640084, 2219810, 2088554, 2065805, 1770029, 1430388, 1716329, 2051999, 1881470, 1929989, 1700433, 1680295, 1563312, 1491301, 1557767, 1540944, 1783415, 1618580, 1797984, 1237475, 1884456, 1995508, 1484374, 1346386, 1655133, 1830725, 1474044, 1522498, 1480591, 1472712, 1287860, 1420035, 1231014, 1300944, 1326309, 1404644, 1285472, 1261306, 1495509, 1234734, 1442970, 1219218, 1409815, 1112090, 1129862, 1168275, 1015409, 1238409, 1154447, 1330107, 994013, 1110002, 1209444, 1080816, 1274276, 860090, 1238439, 1004541, 914539, 1058885, 914306, 918398, 561195, 1019541, 991199, 1099461, 897416, 1111468]
16459A111468k46711J58966M6186m52827M68719m22009K23700j85077K48837j47733
16449H03519M38439l46527k9736j8951J91330j49639J38472J51886n11716J75950
16439H43027J62970l56841K01474R9704m9577k25520j51601J44242M6302K0982
16429G35162J62717k41835j41045L80338p5905J07454q5141l1854k22520J70351
16419G57722R5754k40793j58444M90239m23965J54455L64336l25468k42745k6285
16409D44806L28768j86013B74514J32201K62827P0841K27851k08449l64880K26819
16399F21724O1040k33771K21803o3147j05741m6387Q2764J62765K00016l25739
16389E75327j89136K16761J02136k42412L5655K28141k23501L0850q8856J64858
$$ y = [1111468, 864757, 1023723, 1069909, 617082, 1085801, 663792, 887492, 702415, 951252, 803519, 1241958, 895431, 865695, 846744, 1038074, 888435, 1026907, 1178793, 667077, 843027, 1005997, 649156, 850630, 950334, 900757, 675237, 523636, 667878, 714180, 735162, 897879, 656044, 514999, 895337, 819432, 926886, 841745, 809891, 587371, 757722, 853476, 612683, 454239, 944478, 520513, 674968, 1039304, 713836, 471091, 444806, 773574, 587561, 274514, 406715, 669542, 740383, 968234, 759785, 394905, 621724, 682764, 448993, 670796, 607649, 501908, 455521, 538285, 701050, 901066, 575327, 386191, 602952, 705088, 462676, 498331, 726472, 502971, 533821, 444965, 609823]
16379F09823k1978o959K02558l85482L80557B90063J03477j0103L65756J38904
16369H88097k52577B35350N00006B60337J97148J91323Q0208j39390k28769k0580
16359C40277l9251K01040H8140K03503J98623o7363M1543j31482L73213k45418
16349D60759r2983o9521M1340N80439C04252J83078j07853o1602R5973o8559L01782
16338F47071j82374K81320B47665C5569N59339j57262K06212M5731j54761k6443
16328E08385n1904j81823q3781K95086r5256r2904J1798K24930k43556k9668L5085
16317B96392J7130l6039J21367l5051j77570J40184l5098Q135k6860o3307J2761
16306B22044K86925B42445K56487A63895M91763l20752J37318I9503B3616J88124
$$ y = [609823, 587845, 580886, 783444, 397962, 778519, 290063, 393540, 383437, 749193, 888097, 635520, 235350, 735356, 260337, 457485, 648808, 729016, 589626, 360857, 340277, 301026, 502066, 88140, 291643, 490266, 422903, 464446, 332964, 706177, 460759, 367776, 298255, 339595, 920034, 304252, 487330, 379477, 317875, 413848, 345289, 647071, 464697, 746017, 247665, 35569, 594908, 437646, 643858, 689589, 534828, 508385, 456481, 274658, 190877, 485963, 390707, 297803, 309601, 534531, 290975, 261307, 296392, 313522, 277483, 398850, 363799, 186229, 326413, 291315, 299450, 272590, 209283, 222044, 508969, 242445, 498932, 163895, 655658, 334906, 472224, 99503, 23616, 211740]
16296B11740J75305A05415O6365K63969j45929K34326I7970J73349K49887B12241
16285A95407m9879n9280K29718j36712f4810C53898I7042m3106Q0881a10316C71628
16273b3703B21237B0676L26069L72480B88181c9834B01936N3061J61418m3190
16263C73225J60486j76555I1186J77380j14227n1623Q1576K15701A09565J00313
16253B09878m5176J4033L90648A83833K50032i867A45031b9352B82952L5292q0351
16242B37893A17167N1751L9136O8531J40161a7625H2542E787L67091A42491q18
16231A41673a38207F6447J17959J34568q4741H9763K52140j39856O3800F0793
16220I9743a17778e99E0091J58228I8500N4111K62172A61304j8848o7267J61559
$$ y = [211740, 387045, 105415, 171780, 435749, 289820, 524146, 97970, 271319, 521206, 212241, 195407, 145528, 86248, 315966, 179254, -64810, 353898, 97042, 53936, 134817, -110316, 371628, -23703, 221237, 20676, 346745, 719225, 288181, -39834, 201936, 254997, 416415, 373225, 533711, 357156, 91186, 268566, 154339, 102716, 184292, 399993, 109565, 209878, 164702, 178735, 569383, 183833, 433865, -9867, 145031, -29352, 282952, 318244, 237893, 117167, 168918, 208054, 276585, 416746, -17625, 82542, 5787, 372878, 142491, 141673, -138207, 66447, 184406, 318974, 234233, 89763, 341903, 202047, 265847, 60793, 99743, -117778, -599, 50091, 208319, 98500, 152611, 414783, 161304, 142456, 75189, 236748]
16209B36748P0709I5810K47476c5784E05875j08990j10556J72108r045g0903m0336
16198a11239A21239N1102K1797a5568K093B18046k6895A3247a48854A63219J95886
16187C59105j12318J74103A5983a19389B18447C1659N0639P3731j1286p0131P4496
16176A49108c9111B55114A26712d8281B57558L4004j04358d7929G8711N8811J18047
16165B55569k2550H7963a35537B15916b06596B11907J32528j03181j00665a89335
16154b50711B56002d18431A47143K17849A64887c18159C25567D5382J65654N0532
16144B61568o0746K7369j13899B2662P2121K32469A43561J8539j2547J14071j16387
16133A47237A3911L16108f3938a7316m7494A94158b42009A01392N5449R3728H210
$$ y = [236748, 307457, 95810, 343286, -35784, 505875, 396885, 286329, 458437, 449392, -70903, -111239, 121239, 172341, 194138, -15568, -13475, 218046, 191151, 13247, -148854, 163219, 359105, 246787, 420890, 15983, -119389, 218447, 31659, 82298, 156029, 144743, 74612, 149108, -39111, 255114, 126712, -48281, 257558, 291562, 187204, -47929, 78711, 137522, 255569, 233019, 87963, -135537, 215916, -206596, 211907, 344435, 241254, 140589, -189335, -250711, 256002, -418431, 147143, 364992, 164887, -318159, 325567, 45382, 211036, 261568, 200822, 228191, 114292, 22662, 94783, 327252, 143561, 162100, 149553, 263624, 147237, 13911, 330019, -63938, -17316, -64810, 194158, -242009, 101392, 156841, 250569, 8210]
16121b9169j75952N4842A57642Q3731o6324Q5614j04358J56326B7349A3525i3354
16109C23435B707K66890B8439g2968C09722I9278a37501B89643j44461c7764l63579
16098d01343d5237B37584K9959g3040E534b03277I891J80357b40585e8273J5594
16087d2679D12323a59049A51079l4950J77303j25767e2337B58636r0989l9071
16077A28576E3600N8986D7840h1468a3420e975D26238f767A95284m6491g1334
16065C20059b50135O6631A03519a7334F6520c1700E67646A14793R0965e1715q9453
16054a41168q4772A35692g161B89072b00198A8288O2294J5609a00403B83508e3109
16042A09849a02020B52881d48754A26188K72275a80298B41455a78908A66468p7264
$$ y = [-29169, -205121, -150279, 157642, 241373, 175049, 260663, 156305, 312631, 27349, 13525, -93354, 323435, 2707, 269597, 28439, -72968, 309722, 99278, -137501, 289643, 145182, -37764, -401343, -45237, 237584, 267543, -73040, 5534, -203277, 9891, 190248, -240585, -58273, -42679, 412323, -159049, 151079, 116129, 293432, 167665, -52337, 258636, 167647, 128576, 53600, 112586, 47840, -81468, -13420, -5975, 426238, -6767, 195284, 148793, -71334, 320059, -250135, -183504, 103519, -17334, 66520, -31700, 567646, 114793, 205758, -51715, -141168, -225940, 135692, -7161, 289072, -200198, 18288, 80582, 96191, -100403, 283508, -53109, 109849, -102020, 252881, -448754, 126188, 398463, -180298, 241455, -178908, 166468, 89204]
16032H9204b97769J06162K0078Q2559p0547b7877j89470G207a9092A89896H730
16020F7389J42366a66094a4766p1907J3131E3290a00551l8644A09297b34179g4693
16008A51836C7781K71039m8790R7267b0641k5115b1842l3701c958l26419B83151
15996d63850a83655J5452M6977A27324a6341A49382K65068J6819j12347P575L37467
15985F63964O54594m38632M82036l39104C73129J47610F0951L6808a12297E3429
15974A38554b4998B20609A04378a23988e3124o3864A27547g5900k38217B0224
15963h4101P925j6412J9602p4219A25678J52105c39758c7929B8376c26175J3212
15952c12963e1687m409A05481l7364a35081k17532h9391D1185K05389g3145F622
$$ y = [89204, -297769, -191607, -171529, -88970, -159517, -27877, -217347, 7207, -19092, 189896, 8730, 67389, 209755, -166094, -14766, -86673, -73542, 53290, -100551, -139195, 109297, -234179, -74693, 151836, 37781, 308820, 260030, 357297, -20641, -45756, -21842, -55543, -3958, -330377, 283151, -463850, -183655, -168203, -121226, 127324, -16341, 149382, 414450, 431269, 318922, 326497, 663964, 1318558, 879926, 1361962, 1022858, 373129, 520739, 60951, 97759, -112297, 53429, 138554, -24998, 220609, 104378, -123988, -53124, -116988, 127547, -75900, -314117, 20224, -84101, -76176, -92588, -72986, -147205, 125678, 277783, -339758, -37929, 28376, -326175, -312963, -51687, -56096, 105481, 68117, -135081, -352613, -89391, 41185, 246574, -73145, 6622]
15940a13167B4215i484F900M7430d1612m01719C7364a91665A43814C3651a12073
15928B03106b773E5277M0812d0281l96617a01131K2249A25026C1791J9090K36148
15917B87029L8351a2863A51490a34000A70888L657a04699p9954j71078J42111
15907b13620E6396R444a69160m6391C3392J53814d7365A01719a23114k796l9732
15896a65642J633m2562f4363K3261A35229E3779c49853a14439e3414j23367B5426
15884b0181k24434h0907E5148d2145m5901J3292k57885A44653g9030j9724A45026
15872C8320K25893c30726b254j02646l4272A04697b55951B65242a9650o384k79953
15861c05987B32118B9250a11345A61969e5077b2777j5062a3514H0601g1725q586
$$ y = [-113167, 24215, -9484, 6900, 54330, -41612, -443331, 37364, -191665, 143814, 33651, -112073, 203106, -2773, 55277, 96089, -40281, -436898, -101131, -78882, 125026, 31791, 50881, 287029, 325380, -12863, 151490, -134000, 170888, 174545, -104699, -184653, -355731, -213620, 56396, 65840, -169160, -215551, 33392, 187206, -47365, 101719, -123114, -125910, -165642, -164009, -206571, -64363, -41102, 135229, 53779, -349853, -114439, -53414, -176781, 25426, -20181, -244615, -80907, 55148, -42145, -88046, -74754, -332639, 144653, -79030, -98754, 145026, 38320, 264213, -330726, -2254, -104900, -139172, 104697, -255951, 265242, -19650, -26034, -305987, 232118, 29250, -111345, 161969, -55077, -22777, -37839, -13514, 80601, -71725, -80311]
15850h0311k2935j90832p5185P8307a16016A99902F8216k3684a11962e5199p5116
15839a30315l4914C96640A82843I664a30903n5882c3410E0919B4944K10649a31986
15827f2548E0505g7762A6972a36077A87063f9956D5235h8468D3611d31183a92113
15815C1407b66220B3084J4065c56838A97006d51204c8987H0225b53936b2783q6386
15804a09169G2071d8622j03711b262k37048E5489p424b66216A08428k8589a12891
15792B01287b00729B3487K00209D4332H390a85273B44425b88093a44042a4504
15781a92572B135h0492B7754b46305A1657c3029k70616a0388j0914j11771K6518
15770a06555l0797j6264d0700C62691I7208d1978A29572g0857E0476N1062N168
$$ y = [-80311, -103246, -294078, -369263, -290956, -116016, 199902, 68216, 44532, -111962, -55199, -130315, -165229, 396640, 182843, 9664, -130903, -186785, -33410, 50919, 24944, 235593, -131986, -62548, 50505, -77762, 16972, -136077, 187063, -69956, 45235, -88468, 43611, -431183, -192113, 31407, -266220, 23084, 37149, -356838, 197006, -451204, -38987, 80225, -253936, -22783, -109169, 72071, -48622, -152333, -2262, -239310, 55489, 48065, -266216, 108428, 79839, -112891, 201287, -200729, 23487, 223696, 44332, 8390, -185273, 244425, -288093, -144042, -14504, -192572, 2135, -80492, 27754, -246305, 11657, -33029, -303645, -10388, -21302, -133073, -106555, -137352, -153616, -40700, 362691, 97208, -41978, 129572, -70857, 50476, 101538, 106706]
15759A06706a04120m7658K2332B17294J85205j54158a45726C8027e3977G0630
15748a06472A4380f2320B36781a47344E7409a87000D19329A6653a11137c9424
15737a80936k7651c7181n961C60270h2900j06253A09958a51210k66852A16880
15726i9273A26970b60423a5036D0894M7898f363B52839n8836B1531N9767a58279
15714A31882J1389E5566a08115r7110A10748h0461A89a27006l69A8809b44977
15702B26101d52054i2984j15096r2954h2936A59590A9202e8127n1704D9654a4388
15690b57503A6469K0654j868J55342O5673d1938B50389b42494m5384A1107a4506
15678b22516J1325A17003a20921a8933H2639L6475a20401D3841h4795B03156I8664
$$ y = [106706, -104120, -151778, -129446, 217294, 402499, 248341, -145726, 38027, -53977, 70630, -106472, 14380, -62320, 236781, -147344, 57409, -187000, 419329, 16653, -111137, -39424, -180936, -208587, -37181, -43142, 360270, -82900, -189153, 109958, -151210, -418062, 116880, -99273, 126970, -260423, -15036, 40894, 88792, -6363, 252839, 194003, 21531, 81298, -158279, 131882, 143271, 55566, -108115, -205225, 110748, -80461, 189, -127006, -127375, 18809, -244977, 226101, -452054, -92984, -208080, -301034, -82936, 159590, 19202, -58127, -109831, 49654, -14388, -257503, 16469, 37123, 35255, 190597, 256270, -41938, 250389, -242494, -287878, 11107, -14506, -222516, -211191, 117003, -120921, -18933, 82639, 119114, -120401, 43841, -84795, 203156, 98664]
15666B90612H4430c60386J71133d0131l95128A23338l7819b16354A2451i540A85409
15654d32820i2466k07437M8574o4007B06726d1685A89138a72185A12445J00496
15644B12941E5179K87321a27054A70561K7883a31237j05571G2913b97721j39805
15634d37526b10301E4656a13715l7618N1621b119B66120b8079H1933l5323c582
15622b71641F8696a81268b1543j91127A12731a8124A27165i6331B92495c9845
15611d33014a50852F6481b9937N944j30969f827G4616b8487K304j14750q1464
15600b22397Q0655I0591L91014a75181A30707a54034f304k4637I1842J69131b08928
15588a94716A56329c8467a3120k26733c0775D893K4711Q3465b3396A83709a20496
$$ y = [290612, 84430, -360386, -189253, -40131, -435259, 123338, 85519, -216354, 12451, -9540, 185409, -432820, -92466, -299903, -251329, -315336, 206726, -41685, 189138, -172185, 112445, 212941, 55179, 342500, -127054, 170561, 198444, -131237, -236808, 72913, -297721, -437526, -210301, 54656, -113715, -151333, -99712, -2119, 266120, -28079, 81933, 46610, -3582, -271641, 68696, -181268, -21543, -212670, 112731, -18124, 127165, -96331, 292495, -39845, -433014, -150852, 66481, -29937, -23993, -154962, -6827, 74616, -28487, -26183, -140933, -222397, -141742, 90591, 481605, -175181, 130707, -154034, -6304, -30941, 91842, 260973, -208928, -194716, 156329, -38467, -13120, -239853, -30775, 4893, 29604, 113069, -23396, 183709, -120496]
15576b09400a4776A53846i5600j32034Q4333j62080I9673J25471a97226B8943
15565a16797q188l3589j33138N7075M3319A0663P8061i8720k09520a08436q7028
15554a95464p3136A50865b09571B05334e7963A35482a22556A62386d5584H4997
15543b15363F1093b16942F185O8385L12473r8907A18102C1453b41325A2968g3482
15531b72240B20254r0026g3237I6539J01556C587b52682B52234a58956B28435
15520C3606i977D0411J29602L4151p9694e0620C25207A3118f3890J7542A51813
15508a10018H4334J4680M26971f7662b7141B21824r0696E0956M8552J86484A06345
15496B97817a13833B5066K26055j4208a0606I6956c5239E1250g3481b7857n02653
$$ y = [-209400, -14776, 153846, -95600, -227634, -143301, -305381, 99673, 225144, -197226, 28943, -116797, -124985, -158574, -291712, -234637, -191318, 10663, 88724, -98720, -308240, -108436, -195464, -268600, 150865, -209571, 205334, -57963, 135482, -122556, 162386, -45584, 84997, -215363, 61093, -216942, 6185, 74570, 387043, 288136, 118102, 31453, -241325, 12968, -73482, -272240, 220254, 130228, -73237, 96539, 198095, 3587, -252682, 252234, -158956, 228435, 33606, -9977, 40411, 170013, 204164, 124470, -50620, 325207, 13118, -63890, -46348, 151813, -110018, 84334, 99014, 525985, -67662, -27141, 221824, 131128, 50956, 99508, 285992, 106345, 297817, -113833, 25066, 251121, 236913, -10606, 96956, -35239, 51250, -73481, -27857, -530510]
15485e30510D9813b36984J13303A37429n6168h0316B06432a84764h4113A56451
15474C86876r972M31051l35598j53228m5075b8754l4514a3694C3156J50281a05096
15462c18698A47395o9958b6612B89546A05684K04356j03246n1387K41730A31159
15451b2187A59951b03022A88437B4898L1933i2187A63890o7286K65389M01442
15441G63435K320M19598k89455l18613p0032j74307A28428a9702A99339b59773
15430g1624A79266J00108A20388a58984L4937c1120m3826l62828a460C12747c49
15418e3772l37075p13i1975B957e66A29349K8019a59762k47165a50158C10246
15406A29755A1863K3104i8537B54076q9322b8116j71601n2349B30511G5984B3704
$$ y = [-530510, 49813, -236984, -123681, 137429, 81261, -80316, 206432, -184764, -84113, 156451, 386876, 376904, 807955, 472357, 319129, 274054, -28754, -63268, -13694, 33156, 183437, -105096, -318698, 147395, 77437, -26612, 289546, 105684, 310040, 206794, 155407, 397137, 131159, -22187, 159951, -203022, 188437, 24898, 56831, -92187, 163890, 96604, 361993, 763435, 765755, 1185353, 895898, 577285, 507253, 332946, 128428, -19702, 199339, -259773, -71624, 179266, 279374, 120388, -158984, -124047, -31120, -74946, -437774, -1460, 312747, -349, -53772, -390847, -391560, -91975, 2957, -566, 129349, 157368, -159762, -406927, -150158, 310246, 129755, 11863, 34967, -98537, 254076, 164754, -28116, -199717, -252066, 230511, 75984, 23704]
15394a0059A33629a90666e1549G1166b9162j29345A25321g0265B59661B8797a1208
15382A38454m7956K9557c1607J4139B64434j30286k4571d5180A05436K9980J3281
15371A48697n4475d3289B38840a62902h136F8996d2634b093D9775M48510b17970
15359C40387j64589K2879d4387C6883J37581K58827H0932K13744l6016H8834P9465
15348A68299M4207a37964e8551B32025J1379j17858J40199q2116J79338J04261
15338D67228A88651o132j0333J30936j51539D5350f2028k08963A71543J70515
15328C42058A18993J10510K02953B03299P4308A23546e656k75496f8361c0564
15317f6531D01725c05851B2508K1918L5431P6709A0276K46826A01130K48127G4439
$$ y = [-10059, 133629, -190666, -51549, 71166, -29162, -158507, 125321, -70265, 259661, 28797, -11208, 138454, 90498, 120055, -31607, -17468, 264434, 134148, 109577, -45180, 105436, 135416, 148697, 94222, -43289, 238840, -162902, -8136, 68996, -42634, -2093, 49775, 498285, -217970, 340387, 175798, 198677, -44387, 36883, 174464, 433291, 80932, 294676, 258660, 88834, 168299, 212506, -137964, -58551, 232025, 243404, 125546, 265745, 183629, 362967, 467228, 188651, 182519, 172186, 303122, 151583, 45350, -62028, -270991, 171543, 342058, 118993, 229503, 432456, 203299, 277607, 123546, -5656, -281152, -68361, -30564, -66531, 401725, -305851, 22508, 44426, 79857, 156566, 10276, 257102, 101130, 349257, 74439]
15305C30695a06317J0016B02427f2197R254A42349B6885J60463b74646A18535
15294d6371A64206D8320L760j9993a78515O7643C4924k030a93410K6954B98592
15282A78864L1267a15612c0097r4362E9504J35267r0711K32230e9840a1760l62603
15271c74363e7267p2204B91916C1320N7568R3780c56340I362b48456g1909A70502
15259B04880f3375j22867P7341p5904A32445P8817d9698C09954b99229A60582
15248A10398C9298a10233D6478a1157B85618A00723Q63581J021484q92814L50258
15238A443232k01116D05283A58708a66272H6882A0941J24463B5119K38015o3937
15228A99197c04721A45889J22905C4524c2303r0046G0774a89020k1357f0953F1966
$$ y = [330695, -106317, -96301, 202427, -62197, -52943, 142349, 26885, 187348, -274646, 118535, -46371, 164206, 48320, 52080, 32087, -178515, -110872, 34924, 32894, -193410, -166456, 298592, 178864, 210131, -115612, -30097, -124459, 59504, 194771, 104060, 336290, -59840, -11760, -374363, -57267, -129471, 291916, 31320, 88888, 182668, -356340, 9362, -248456, -71909, 170502, 204880, -63375, -186242, -108901, -184805, 132445, 211262, -49698, 309954, -299229, 160582, 110398, 39298, -110233, 46478, -11157, 285618, 100723, 964304, 1985788, 1092974, 1443232, 1242116, 405283, 158708, -166272, 86882, 10941, 135404, 25119, 263134, 199197, -304721, 145889, 268794, 34524, -32303, -122349, 70774, -189020, -210377, -60953, 61966]
15216D4671L38756a44686A05269a23433B0467b54484B44392d1515o5490B97000
15205e2161B82735F3605a55070p115A19971c98794d5716H3301R5431i6600B41170
15193d7615D558d8620A13536J74557q4740l8098g8416A41404k2143n8441J7544
15182G8364f3580I1777J46961a99257N9314A88402f7222k884a9189C02925e3763
15170c60678H6554j4127C5206f9267F4749K55159A16096d1782A56858C8717a85594
15158C4219a87464d3794q4976C8491K80209I2717a9543C1170J05840E9399h9359
15146F4521J01632a62535C67878a26429b852j79361A92928R893K5637C8085e176
15134F3594R3853b6936j35141c6159k6845D65270j81465A16247J89997a36477
$$ y = [44671, 383427, -144686, 105269, -123433, 20467, -254484, 244392, -41515, -107005, 297000, -52161, 282735, 63605, -155070, -162185, 119971, -398794, -45716, 83301, 178732, -96600, 241170, -47615, 4558, -48620, 113536, 288093, 203353, 165255, -78416, 141404, 119261, 60820, 78364, -63580, 91777, 238738, -199257, -139943, 188402, -67222, -70106, -19189, 302925, -53763, -360678, 86554, 72427, 35206, -69267, 64749, 319908, 116096, -41782, 156858, 38717, -185594, 34219, -187464, -43794, -128770, 38491, 318700, 92717, -19543, 31170, 137010, 59399, -89359, 64521, 166153, -162535, 367878, -126429, -2852, -182213, 192928, 202821, 228458, 38085, -5176, 63594, 157447, -26936, -162077, -36159, -63004, 465270, 283805, 116247, 306244, -136477]
15123G9381a52970A66094i9346C35714j34271O04373B90787l3794E5718i2553
15112A72790p8604j5673K86404e0743A95018P3025e66q4536B09816e7440A2494
15100a55B54867A05048h4856B93971D6423J2445N5900J12706M8610A21689J51377
15089B73066J4110a41456C88967F8988e500B51759b92181A84869J52805A41580
15078e0174B42363L3675D1361A1154N7336k6951R1285p041C3480b03921B93219
15066c2750A51593O2641a26292H5105g3318A90328d2761D70399I3283K86340j67027
15055B12596J1872K37437D4198J1818a04372C90356A10896L80253j33600J45756
15045E03305C6256J68476l6977J1034J04391K8177A04051N5646o2634k1493b3603
$$ y = [79381, -152970, 166094, -99346, 335714, 201443, 805816, 290787, 256993, 55718, -92553, 172790, 94186, 78513, 364917, -50743, 195018, 268043, -566, -85102, 209816, -57440, 12494, -155, 254867, 105048, -84856, 293971, 46423, 58868, 114768, 227474, 276084, 121689, 273066, 287176, -141456, 388967, 68988, -5500, 251759, -292181, 184869, 337674, 141580, -50174, 242363, 276038, 41361, 11154, 68490, 41539, 132824, 125783, 33480, -203921, 293219, -32750, 151593, 214234, -126292, 85105, -73318, 190328, -42761, 470399, 93283, 379623, 212596, 224468, 461905, 44198, 56016, -104372, 390356, 110896, 491149, 357549, 503305, 36256, 204732, 167755, 178789, 283180, 311357, 104051, 159697, 97063, 75570, -23603]
15033C71188O0605P6504J54290J28552j44264j21543J39073L7646C34617l0182
15023C04435K07175M8042P8010K04734C32722K20489j51651i711B16149O9716
15013B85865K56901J171p3530o9581P516o4103l4891r1085J04679J01218j45932
15002B78228M2533n4403Q4964j69946J60490f318B38609A1013M84675o9568k07381
14991B18739J71142J30725B07272K92316B32386L69770A76933J35154L26565N205
14981F43857j00280J6123N3772B44137M08899B80120Q7775A57789K79301K98075
14971G35165j78361j48154j17730o4566J68160L776j6919H3978K53499b6931B35870
14959A22649O2454N09448A14077K94190i459j50748E63095j70241j09126j9238
$$ y = [371188, 431793, 508297, 662587, 791139, 646875, 525332, 664405, 702051, 334617, 304435, 511610, 559652, 637662, 842396, 332722, 553211, 401560, -9711, 216149, 285865, 542766, 543937, 470407, 400826, 408342, 344239, 309348, 218263, 322942, 424160, 278228, 320761, 266358, 351322, 181376, 341866, -6318, 238609, 11013, 495688, 426120, 218739, 389881, 520606, 207272, 499588, 232386, 602156, 176933, 312087, 638652, 643857, 543577, 559700, 613472, 244137, 653036, 280120, 367895, 157789, 437090, 735165, 556804, 408650, 290920, 226354, 394514, 398290, 381371, 83978, 337477, -26931, 235870, 122649, 185103, 694551, 114077, 408267, -9459, -160207, 563095, 392854, 283728, 264490]
14949B64490M13760B4615M25411j29941r1872l4606M05671j07277J23580k86982
14939C28599K13746k52104M39207d7838B33566M74786B85197N26190n6993L75378
14929A129772r4835L0258j5359J74301L30446K57980m05844j60321q4537l1916
14919A129945K75879K56342N48486n8348J76077p04292n10936J0205r3987E11883
14908D78457J32033m2273n285q3747B28908J92607A05001b2651E31655B01920
14897C40240L1946A36708L90569j7606A35694N7021K04780J12957K76757C30312
14886E30043R5007j56215K17597O7730j19822k93741O57363k61842J66714D29419
14875B44892L20715j88087A70402M29322j18419k1769O3995q545K0189m6035L49758
$$ y = [264490, 678250, 24615, 450026, 320085, 228213, 193607, 599278, 492001, 615581, 328599, 542345, 290241, 729448, -47838, 233566, 708352, 285197, 811387, 754394, 1129772, 1034937, 1065195, 1049836, 1224137, 1554583, 1812563, 1406719, 1246398, 1161861, 1129945, 1405824, 1662166, 2210652, 2152304, 2328381, 1624089, 1113153, 1123358, 1029371, 511883, 478457, 610490, 568217, 562932, 479185, 228908, 421515, 105001, -22651, 531655, 201920, 340240, 372186, 136708, 527277, 509671, 135694, 192715, 397495, 510452, 787209, 330312, 530043, 625050, 468835, 686432, 754162, 634340, 340599, 997962, 736120, 902834, 429419, 244892, 565607, 377520, 170402, 599724, 481305, 459536, 523531, 514986, 535175, 489140, 838898]
14864H38898n0662m7522j93378J33967k63903j42624K84282j44489j17109R8608
14854C96068J4460A93400N44503k88325A97044L7455M69005l46528M24910j01384
14844F80502q8589M34586J99942j63789j22693O4179k42719P5444C69975N22950
14834H92925o9114q9176B66763L61638m2751B59778K72101j4270P5402k1872m6414
14823E24725Q3707j358k44951J11695K0758P6114K83770k81357K16109j46869
14813F42343p9295p1131A46977K6450L24272k31009M05606J40632L5841J40527
14803I89296j30838r0890j55179B48318M9568M4985N2679k5477R2166k24480J92357
14792D30116j196j12292J99454J19687j4094L5056M5345j32448L1704p7439P8005
$$ y = [838898, 788236, 740714, 547336, 681303, 417400, 274776, 559058, 414569, 297460, 396068, 410528, 193400, 737903, 449578, 197044, 234499, 703504, 356976, 781886, 680502, 591913, 1026499, 1226441, 1062652, 939959, 1004138, 761419, 836863, 369975, 892925, 823811, 734635, 266763, 628401, 585650, 259778, 531879, 517609, 593011, 571139, 524725, 608432, 607074, 362123, 473818, 494576, 570690, 854460, 573103, 789212, 642343, 563048, 491917, 146977, 173427, 497699, 266690, 672296, 812928, 848769, 989296, 858458, 767568, 612389, 248318, 297886, 342871, 395550, 370073, 462239, 237759, 430116, 428920, 316628, 516082, 635769, 621675, 656731, 702076, 569628, 601332, 523893, 601898]
14781F01898r7208J69152l6532O9213k67082M97179m9793j43300j77220r8163
14771D68144Q1500L2075j68666l2765J45007F0444N15145j39675o3107k1134I0426
14759C92841J12059j03072j95868N15212C04142M66005k65589L86047l71409p4276
14749D44920K71182k98766K35112m4962A56363N06713k23727K82025k99098L09348
14739G31624k58121J36777j13157J63178K74200j74446R4467J08615k60014Q5729
14729G88852M16009Q3379K81618K78879j58108k54178q8053m90596O2731l4008
14719H86525o5294j12550q0992k59663K65594m9487J15239J34928j77500J10854
14709G67654K62931k88957M16731k33735l0336q718K15677M94843j2687L04612
$$ y = [601898, 504690, 673842, 637310, 706523, 439441, 936620, 886827, 743527, 566307, 468144, 549644, 581719, 413053, 380288, 525295, 60444, 575589, 435914, 372807, 351673, 90426, 392841, 504900, 401828, 205960, 721172, 304142, 770147, 504558, 890605, 519196, 444920, 716102, 417336, 652448, 607486, 156363, 663076, 439349, 721374, 422276, 731624, 473503, 610280, 497123, 660301, 934501, 760055, 854522, 963137, 703123, 788852, 1204861, 1288240, 1569858, 1848737, 1690629, 1436451, 1348398, 857802, 920533, 886525, 821231, 708681, 627689, 368026, 633620, 584133, 699372, 834300, 656800, 767654, 1030585, 741628, 1158359, 924624, 894288, 885570, 1101247, 1596090, 1583403, 1888015]
14699A888015l38669j94916j70939J10926j08259m13263o3269j9943j41936L79851
14689I27598l37462P7140k41117J994M99041j13900j81731k8467J08319p0265
14679F41150J81043m00489N89368r4356l31867K62380n7019q6264p1822L16585
14669I48709j78071o2108J36778j76081J01644L1052P5960J04481j9488l37167
14659F25709O93202D18890M98845j05745M3054j17265M02928J7998k61024L13190
14649A210871j49524k41386J32754J57325M947n4914k73072L15435j99162j30858
14639G72416k81942N43013Q8030J19738k87238k30418M00982J73957l79918K67312
14629A185932k01331M98167l99604p7882K67885j09090l5781K53529k64883J60880
$$ y = [1888015, 1549346, 1354430, 1183491, 1294417, 1186158, 772895, 709626, 689683, 547747, 927598, 590136, 667276, 426159, 428153, 927194, 813294, 631563, 603096, 711415, 641150, 822193, 421704, 1011072, 916716, 584849, 847229, 790210, 703946, 632124, 948709, 770638, 708530, 845308, 669227, 770871, 801923, 877883, 982364, 962876, 625709, 1318911, 418890, 917735, 811990, 855044, 737779, 1140707, 1158705, 897681, 1210871, 1061347, 819961, 952715, 1110040, 1114987, 1060073, 787001, 1102436, 903274, 772416, 490474, 1033487, 1121517, 1241255, 954017, 723599, 1124581, 1298538, 918620, 1185932, 984601, 1482768, 1083164, 1005282, 1273167, 1164077, 1128296, 1381825, 1116942, 1277822]
14619A277822j62498o0269K98432l53337M11349n20171L19001r0887N4301K51569
14609A425312k92991J50462k61619L42528j9348j32750P3084M1382J95834k43000
14599A278894o7734p5143L25930k91375j5741l399J86808q198k9175K0834M0705
14588A362406p1810J93413J00878l26560M75281k796k8612L64549o58082K00373
14578A609040k10715K20392K0091q8151o9832M00094l53161J41331m5581J29636
14568A753144L242k21341L22456k53177K29022j0860j96497O03197l99198J96795
14558B026783K2759K26701J81748k449M00612k63884Q40053J62847R73610J711449
14548F280229L239789P465113J8673239J5416181A7097042E513477k711331o52889
$$ y = [1277822, 1115324, 1055055, 1353487, 1000150, 1411499, 891328, 1210329, 1119442, 1173743, 1425312, 1132321, 1282783, 1021164, 1363692, 1344344, 1211594, 1284678, 1326060, 1521894, 1278894, 1211160, 1136017, 1461947, 1170572, 1154831, 1151432, 1338240, 1330042, 1300867, 1321701, 1362406, 1290596, 1484009, 1584887, 1258327, 1733608, 1730812, 1702200, 2066749, 1408667, 1609040, 1398325, 1618717, 1638808, 1550657, 1480825, 1880919, 1527758, 1669089, 1623508, 1753144, 1756386, 1535045, 1857501, 1604324, 1833346, 1822486, 1625989, 2229186, 1829988, 2026783, 2049542, 2276243, 2457991, 2455542, 2856154, 2592270, 3432323, 3595170, 4568780, 6280229, 9520018, 16985131, 35658370, 51074551, 17097042, 5513477, 2802146, 2149257]
14540B149257m0464J6211J113469J993362k326129j254850K16136k81906J06256
14531A691342m9752j6377J98705L09329j02073m28915K11598J50194J74800m29457
14521A709394L33802J39585j49133L7011n4617k07822K85809R8315Q8930J04359
14511B385633j0468K38071k43106K45211j33825L6360J43480k53179j04778K59480
14501B562879q3812K51900n01702L29222j447N2219l87920L57660j44536M28849
14491B863312J85267j49260m1914J06482k12954K47426J00708j4549j03249J37732
14481C119001N2210p3640j4738j76839M79178l58822R8090K20661k0226M45218
14471C770093n76824L15158K07788k39284J61814J61594j06175M14895p27965
$$ y = [2149257, 2108793, 2125004, 3238473, 5231835, 2905706, 1650856, 1866992, 1585086, 1691342, 1641590, 1625213, 1823918, 2133247, 2031174, 1602259, 1813857, 1964051, 2138851, 1709394, 2043196, 2182781, 2033648, 2070659, 2016042, 1808220, 2094029, 2192344, 2281274, 2385633, 2375165, 2613236, 2370130, 2615341, 2481516, 2517876, 2661356, 2408177, 2303399, 2562879, 2479067, 2730967, 2229265, 2558487, 2557040, 2609259, 2221339, 2578999, 2434463, 2863312, 3048579, 2899319, 2857405, 2963887, 2750933, 2998359, 3099067, 3084518, 2981269, 3119001, 3171211, 3097571, 3082833, 2905994, 3385172, 3026350, 3124440, 3345101, 3324875, 3770093, 3193269, 3508427, 3716215, 3476931, 3638745, 3800339, 3694164, 4109059, 3381094]
14462C381094K80040K31252l43762J147361l83769j06190k15329M01129j36338
14453D255488j79526J16086J62806J40337q4680n1713L15106J84702q181l62911
14443D487514K80101R8683L57176J7691J103j23038J77771J849O2283j93957N00173
14432E667349J43070J00623j9065k38340J4990N12867k93606L32724Q6394m6202
14422F260804J12163M05389o8963N46856k86287R8708K01172J00240j3561M16699
14412G773220l61246K30516k1687r3925M76741J92581k56123K96598K98639R3358
14402H628672P6804k24779L68247J67283J82074J46720m01595L39286J57347L2997
14392I473056M10875M5195M18770j34581N91405J57427m7280J89215K82989L19603
$$ y = [3381094, 3661134, 3892386, 3548624, 4695985, 4312216, 4206026, 3990697, 4391826, 4255488, 4075962, 4192048, 4354854, 4495191, 4410511, 4358798, 4673904, 4858606, 4850425, 4487514, 4767615, 4866298, 5223474, 5241165, 5242268, 5119230, 5297001, 5298850, 5361133, 5167176, 5667349, 5810419, 5911042, 5891977, 5653637, 5668627, 6181494, 5887888, 6220612, 6307006, 6260804, 6372967, 6778356, 6709393, 7256249, 6969962, 7068670, 7269842, 7370082, 7356521, 7773220, 7411974, 7642490, 7620803, 7526878, 8003619, 8196200, 7940077, 8236675, 8535314, 8628672, 8705476, 8480697, 8848944, 9016227, 9198301, 9345021, 8943426, 9282712, 9440059, 9473056, 9883931, 9929126, 10347896, 10213315, 10804720, 10962147, 10914867, 11104082, 11387071, 11706674]
14382A1706674L58371L37240q1552L19683k6354K32497K15157M87705O4426M46849
14372A4060696K12307J91083J91315M03644L71680N13694J13520P44907Q3840
14363A6886686J91582J52087M88586K23071N36448N96555K99089K62359L45545
14354A9982008R29469K48952M58012P09424O16882J85216J108272K94914M45529
14345B4978678N48600R00568O71978N38073J204045P79251N52526J145647M97438
14336C1816804J002341J057685Q98818J286102Q80660J028995J155858J221451
14328D0348714J889638R87950J419061J215016K085274J683144J584510J877295
14320E3090602K106767J838346K121926K156657K281949K291789K737422K669792
$$ y = [11706674, 12065045, 12402285, 12320733, 12640416, 12614062, 12846559, 13061716, 13549421, 13613847, 14060696, 14273003, 14464086, 14655401, 15059045, 15430725, 15944419, 16057939, 16802846, 16886686, 17078268, 17230355, 17718941, 17942012, 18478460, 19075015, 19374104, 19636463, 19982008, 20911477, 21160429, 21618441, 22327865, 22944747, 23129963, 24238235, 24533149, 24978678, 25527278, 26427846, 27099824, 27637897, 28841942, 29621193, 30173719, 31319366, 31816804, 32819145, 33876830, 34775648, 36061750, 36942410, 37971405, 39127263, 40348714, 42238352, 43226302, 44645363, 45860379, 47945653, 49628797, 51213307, 53090602, 55197369, 57035715, 59157641, 61314298, 63596247, 65888036, 68625458, 71295250]
14312G1295250L197527K868407L122507L637195L581707M040801L935875M629007
14304A00308276M668271N204118N268381N491077N963660O539926P180158P221760
14296A47845627P615456Q433129Q619211R388414J0285894J0841277J1132264
14289B14161272J2213053J2260537J3622276J4017798J4877406J5172804J5566391
14282C11891537J6221667J6368178J6733069J6259554J5795972J5357487J3931302
14275D22558766J2597342R914629M993929K512322J772405O56213Q96974j682595
14267D54219985l585077q021755j0578666j2106705j3867146j5081857j6054095
14260C74924684j6351130j6829198j6383474j6089169j5811729j5092996j4794036
$$ y = [71295250, 74492777, 77361184, 80483691, 84120886, 87702593, 91743394, 95679269, 100308276, 104976547, 110180665, 115449046, 120940123, 126903783, 133443709, 140623867, 147845627, 155461083, 163894212, 172513423, 181901837, 192187731, 203029008, 214161272, 226374325, 238634862, 252257138, 266274936, 281152342, 296325146, 311891537, 328113204, 344481382, 361214451, 377474005, 393269977, 408627464, 422558766, 435156108, 445070737, 450064666, 452576988, 454349393, 455005606, 455902580, 454219985, 450634908, 442613153, 432034487, 419927782, 406060636, 390978779, 374924684, 358573554, 341744356, 325360882, 309271713, 293459984, 278366988, 263572952]
14253B63572952j4121413j3293429j2551280j2257262j1242547r126465r476029
14246A81504527j0132390q813709p821168p525807p228707o988742o368996o146573
14238A20478435n483744m938760m872489m989403m303495m084922m029222k996306
14230H4780094l739070l498254k745018l392818k456941k980149k212233k366789
14222F1388822k224189k194652j643737k062297k125547j557366j565222j909345
14214D6106467j047242j051816j724231j348393j346752j214076p65566n04450
14206C7103941r39624j727364j035854q05316j087818n15112j48769j445825r72787
14197B8425472n07864j111901o92823J83268q13150j136880l94918o42969o67777
$$ y = [263572952, 249451539, 236158110, 223606830, 211349568, 200107021, 190980556, 181504527, 171372137, 162558428, 154737260, 147211453, 139982746, 132994004, 126625008, 120478435, 114994691, 110055931, 105183442, 100194039, 95890544, 91805622, 87776400, 84780094, 81041024, 77542770, 74797752, 71404934, 68947993, 65967844, 63755611, 61388822, 59164633, 56969981, 55326244, 53263947, 51138400, 49581034, 48015812, 46106467, 45059225, 44007409, 42283178, 40934785, 39588033, 38373957, 37608391, 37103941, 36164317, 34436953, 33401099, 32595783, 31507965, 30992853, 30844084, 29398259, 28425472, 27917608, 26805707, 26112884, 26296152, 25483002, 24346122, 23951204, 23308235, 22640458]
14188B2640458m27557n73380k61354k81799r01877l18633l12138o72049l00857
14179A8590814l65607l40838o01970l43455r9466p53652Q1382m21969o56128l6579
14169A5052532m27684J98801p20916o0321o48318L28154o55777j56819k74201
14160A2635451j36725l33071Q9924k00779l88117j99918Q1168l87146j58755j63132
14150A0838900J34944k79036m23587n66332K46266l98046L0578p4678l48904j12102
14140I048003k1678L9099k84211k34849m3254j3678l00449Q7554l16536O4699
14130H024700l02215k84954L95438m59725j78548k07947O2687l78608L15603l22435
14120F663996K8707K2994l95015L70000j08788j22201j12285j49006J26109r8579
$$ y = [22640458, 22212901, 21639521, 21378167, 21096368, 20194491, 19875858, 19563720, 18891671, 18590814, 18225207, 17884369, 17282399, 16938944, 16839478, 16085826, 16167208, 15745239, 15089111, 15052532, 14624848, 14823649, 14102733, 14042412, 13394094, 13722248, 13066471, 12909652, 12635451, 12498726, 12165655, 12255579, 12054800, 11666683, 11466765, 11547933, 11160787, 11002032, 10838900, 10973844, 10694808, 10271221, 9704889, 9951155, 9553109, 9583687, 9509009, 9160105, 9048003, 9026325, 9065424, 8781213, 8546364, 8503110, 8489432, 8188983, 8276537, 7960001, 8024700, 7722485, 7437531, 7832969, 7373244, 7194696, 6986749, 7049436, 6670828, 6986431, 6663996, 6692703, 6715697, 6320682, 6690682, 6581894, 6459693, 6347408, 6198402, 6324511, 6225932]
14110F225932n62450M80592n98886L30628l72958O69k90272N11166k85258j731
14100E437432k15050j37226K43250r3462j72352K6005j20533R0785n02589J34166
14090D690426N7932r1838Q6616m55883L63861k58973Q6066k04804m4456R0725
14080D319672J69490n81290k89302L85423M4860j71345J51685l29145r4881L226
14070C608393L76133k36578j07058m1821J52320J40792k26541q4676q6497K87451
14060C781918J447K8141l60892j82348J85991k94909O2177o0557j36711l1596
14050B992661N2344J67387M0293l41658K71347j97326j07428k27036R0495J30697
14040B871776J57592k40814j38412o7987L5108J28407l66179K77942P8876K32029
$$ y = [6225932, 5663482, 6144074, 5545188, 5875816, 5502858, 5503527, 5213255, 5724421, 5439163, 5437432, 5222382, 5085156, 5328406, 5234944, 5062592, 5088597, 4968064, 5058849, 4556260, 4690426, 4748358, 4656520, 4743136, 4287253, 4651114, 4392141, 4478207, 4273403, 4228947, 4319672, 4489162, 3907872, 3618570, 4003993, 4048853, 3877508, 4029193, 3700048, 3605167, 3608393, 3984526, 3747948, 3640890, 3599069, 3751389, 3892181, 3665640, 3580964, 3494467, 3781918, 3783365, 3811506, 3450614, 3268266, 3454257, 3159348, 3221525, 3160968, 3024257, 2992661, 3045005, 3212392, 3252685, 2911027, 3182374, 2985048, 2877620, 2650584, 2741079, 2871776, 3029368, 2788554, 2650142, 2582155, 2617263, 2745670, 2379491, 2657433, 2736309, 2968338]
14030B968338k79968j38557L21557l17286J33198j5471k81347O7564l4977K28701
14020B651752n75101M30901j66507p1071l28678K19256j62563J88542n2508O8536
14010B202559m01506K33883J91872k88790J37462J3488l24949L95765l54290L34248
14000B139742o243n48878J28163l5697j77178J0153J30866j96281J05878P5549
13990A626074K51997J089435K063680N636415J6095239K7662937B6221431A0958965
13981F319457j445825q62435m94356l58698l57383K2229n11662L31095j91236
13972B451186k45590M67734l38795r6689k30101Q0298p8809l12681L13360J01525
13962B111438k80253J14368p3401J59098j62077R478Q0199n55313L81222l66037
$$ y = [2968338, 2688370, 2549813, 2871370, 2554084, 2687282, 2671811, 2390464, 2458028, 2423051, 2651752, 2076651, 2507552, 2341045, 2269974, 1941296, 2160552, 1997989, 2186531, 2134023, 2202559, 1801053, 2034936, 2226808, 1938018, 2075480, 2088968, 1764019, 2159784, 1805494, 2139742, 2133499, 1584621, 1712784, 1677087, 1499909, 1510062, 1640928, 1444647, 1550525, 1626074, 1878071, 2967506, 5031186, 10667601, 26762840, 54425777, 26221431, 10958965, 6319457, 4873632, 4011197, 3516841, 3158143, 2800760, 2822989, 2311327, 2642422, 2451186, 2205596, 2673330, 2334535, 2237846, 2007745, 2088043, 2009234, 1696553, 2009913, 2111438, 1831185, 1945553, 1872152, 2031250, 1869173, 1878651, 1958850, 1403537, 1784759, 1418722]
13952A418722M63531m92330J43988q8881K42595j08219k21375J94418J31875j99651
13942A484673L806K2937K55615l78431k00644P42368j32055J6690k97083L80066
13932A897942l78084l1109k97941K61534k5735j15893K50462R9646q7962n00712
13922A072148M71919l41074K90022j13060k50802L49733l2691m79566M48743k84396
13912A130976l5358J31892j97095M65718l0730k11364R6331n01729K72229N7712
13902A178582j08101O9800k81981N92824l18073j59924P8281j7418J47535j27208
13892A054317J09351m3974J57270j42946k46118L97709m50353K80301K97171k87744
13882A124984K8271j82066n4070N9461K21614r3711j52394L45812l2781j48435
$$ y = [1418722, 1882253, 1389923, 1533911, 1445030, 1687625, 1579406, 1358031, 1552449, 1684324, 1484673, 1488479, 1511416, 1767031, 1388600, 1187956, 1930324, 1798269, 1814959, 1517876, 1897942, 1519858, 1488749, 1190808, 1452342, 1426607, 1310714, 1561176, 1660822, 1572860, 1072148, 1544067, 1202993, 1493015, 1379955, 1129153, 1478886, 1446195, 966629, 1415372, 1130976, 1095618, 1227510, 1030415, 1496133, 1465403, 1254039, 1350370, 848641, 1120870, 1178582, 1070481, 1140281, 858300, 1451124, 1133051, 973127, 1051408, 1033990, 1181525, 1054317, 1163668, 1119694, 1276964, 1134018, 887900, 1285609, 835256, 1115557, 1412728, 1124984, 1153255, 971189, 917119, 976580, 1198194, 1104483, 952089, 1297901, 1265120, 1116685]
13872A116685k13242j38416K97645J28807j41768J78751n4411l12979J63652K34111
13862A258835l26322L50679l72853J98129J74523n07045J83044j24650K10668
13853A045008j07782l8074K5251N4162k05830L12862j36407O0341k14996J18906
13843I13441l979J02191D62133K20523K58846j41411K19917J78823n66946M1771
13833F73656J74519L65220k42694j53595l13842K83358j87244J53978L03723m33558
13823F23521k70916O77570k32097K5874m699q476j15157N5078M3209K08069m18312
13812E83664J67324j59601L84395l00330k2993r0120j41526J53348L92671m37887
13802E28945K05831J18171k15282J35467j66754k03720L47345L6020l15977J31293
$$ y = [1116685, 903443, 765027, 1062672, 1191479, 1049711, 1228462, 1174051, 861072, 1024724, 1258835, 932513, 1283192, 910339, 1108468, 1282991, 775946, 958990, 834340, 1045008, 937226, 899152, 924403, 978565, 772735, 1085597, 949190, 1009531, 794535, 913441, 909462, 1011653, 462133, 682656, 941502, 800091, 1020008, 1198831, 631885, 673656, 848175, 1213395, 970701, 817106, 503264, 786622, 599378, 753356, 1057079, 623521, 352605, 1030175, 798078, 823952, 819253, 810777, 695620, 750698, 793907, 1001976, 583664, 750988, 591387, 975782, 675452, 652459, 562339, 420813, 574161, 966832, 528945, 734776, 852947, 637665, 773132, 606378, 402658, 750003, 786023, 470046, 601339]
13792F01339j89577J87421L4574j76153k02380L84618k06860N01216l59183P0397
13782F45412K2984l1160A91098M69760J75568D6729M32839J75306k42428Q1878
13772D94324L23141r2377N1782j59206J22385l49381J91163l2712K97191P0958
13762I17268k91220J31636o2040q6231p4748M65653C75241M98025r3431L9240
13752H19075C56340K87228K66693C81925q2576r7392K97465J89134Q2363A65572
13741B80631L25394k37933J07522n5599j02008M29056l03923R8595J46990l4725
13731F54000J3686Q468k80284J94876k5334j8170j37020R0374J18305J72302C44598
13719G24540j41531k03541j0046K11612r5526l2389B16859K13706P5250K16906
$$ y = [601339, 411762, 599183, 633757, 457604, 255224, 639842, 432982, 934198, 575015, 645412, 668396, 637236, 191098, 660858, 836426, 46729, 479568, 654874, 412446, 494324, 817465, 725088, 776870, 617664, 740049, 390668, 581831, 549119, 846310, 917268, 626048, 757684, 695644, 609413, 534665, 1000318, 375241, 873266, 779835, 819075, 356340, 643568, 910261, 381925, 299349, 201957, 499422, 688556, 770919, 165572, 280631, 606025, 368092, 475614, 420015, 318007, 747063, 443140, 541735, 688725, 654000, 667686, 676154, 395870, 590746, 565412, 547242, 410222, 500596, 618901, 791203, 344598, 724540, 583009, 379468, 369422, 581034, 485508, 453119, 216859, 430565, 505815, 722721]
13709G22721k85364K69054k22025N6646R402B30644K64168k31417J47546M5949
13699D56890j46286M99406l67672n4952O7426Q349N4935o2635J3756N1016P9283
13688E99516K9607k25313L1608M1347l6030J66840j74143J60666n6704L6623A87231
13676B94581M00905B28048K14293q5218j34242K33012o5719j35355r0674O6300
13666B30445L99591B17093J73735J43711k00521A1847K42254Q9900r0248J58400
13656D12153J70109k18940J8421A81606J68554j52901a03395C08928j02197J21384
13646C28115J33769j58610Q7600N9834n0428A83478H1251M55484k5353A72842
13635a7104C63215K08240r8725j93441J00861J30135B8811M14174M9650R6188
$$ y = [722721, 437357, 706411, 484386, 541032, 550434, 230644, 494812, 263395, 410941, 456890, 310604, 810010, 442338, 387386, 454812, 463161, 518096, 455461, 469217, 520233, 599516, 629123, 403810, 435418, 476765, 440735, 607575, 433432, 594098, 537394, 574017, 187231, 294581, 695486, 228048, 442341, 357123, 222881, 455893, 390174, 254819, 164145, 230445, 630036, 217093, 390828, 534539, 334018, 11847, 254101, 344001, 253753, 412153, 582262, 363322, 381743, 181606, 350160, 197259, -103395, 308928, 206731, 328115, 461884, 303274, 390874, 450708, 400280, 183478, 81251, 536735, 511382, 172842, -17104, 363215, 571455, 472730, 279289, 380150, 510285, 28811, 442985, 492635, 588823]
13625E88823k39473J28055j53102j37177R0874L04845E8610J06391N0445J80203
13615C95649J50190B60302J15967j42114O9805A45413K31668A64129L69382C0362
13604F48715B54061P487K5435j20995a24021C43274J954o4740I9848J44537R2392
13593C36777J10277I4406R0948o8062L0428J91567K03359I0945M92022k43586
13583C39381I9841L45916j37129P0986m2723J3347n0617m112N8380a3163C30347
13571A95528B24K98327M0531k7982K3282R8472k04913E3317K33184j05541M6683
13560B27643K34625j47770N7618j66596L09163A03065B9732K79959R4162r0900
13550C12953j5780a50013A40928Q6304q1111K0837J19918J18307j57237H3591
$$ y = [588823, 349350, 477405, 324303, 187126, 278000, 582845, 58610, 165001, 215446, 395649, 545839, 260302, 376269, 234155, 303960, 145413, 377081, 164129, 533511, 30362, 648715, 254061, 261548, 286983, 165988, -124021, 343274, 345228, 280488, 99848, 244385, 336777, 447054, 94406, 185354, 117292, 147720, 339287, 542646, 90945, 582967, 339381, 99841, 445757, 308628, 379614, 336891, 350238, 299621, 295509, 353889, -13163, 330347, 195528, 224, 298551, 339082, 311100, 334382, 432854, 227941, 53317, 286501, 180960, 227643, 462268, 314498, 372116, 205520, 514683, 103065, 29732, 309691, 403853, 312953, 297173, -150013, 140928, 227232, 146121, 166958, 286876, 405183, 247946, 83591]
13539D07281j28910Q287G1529P4564m4476M35584I1943K38210j25087J13949p6920
13528B42095D4914R7016K11538A05320K80054M1172B627K22025L86270k76392
13518C34530A10016M40222B39064H4771k0045b7058H3364b4626A85768p4815K70210
13507C81163A07093E506e7259C26739L7638j17774J08490k1300j26254L84325
13497E91864A92780n2788Q1400J87708B01032O2959p0013A8953K43414o3860Q1910
13486B80417m1028M3721j03992k6035K68751Q6053I1581M00154I220a47693c1232
13474I2272L9886K66408G0450j5666K40225C3702P1114B2871e837A95735J80784
13463C76519n1617A16435P3646J60317J00840j54047A22543h8969B93748n7049
$$ y = [407281, 278371, 286658, 71529, 146093, 101617, 537201, 91943, 330153, 205066, 319015, 242095, 44914, 141930, 353468, 105320, 385374, 426546, 2627, 224652, 610922, 334530, 110016, 550238, 239064, 84771, 64726, -27058, 83364, -24626, 185768, 110953, 381163, 107093, 5506, -57259, 326739, 364377, 246603, 355093, 333793, 207539, 591864, 192780, 139992, 221392, 409100, 201032, 263991, 193978, 18953, 262367, 198507, 280417, 239389, 283110, 179118, 153083, 421834, 507887, 91581, 491735, 9220, -147693, -31232, 92272, 132158, 398566, 70450, 54784, 295009, 33702, 104816, 22871, -5837, 195735, 376519, 324902, 116435, 190081, 350398, 451238, 297191, 122543, -88969, 293748, 236699]
13453B36699b7960b299A42607J18195a28196B68937E7378K90698A57928p5590
13443H2338a70228H9839f7562H5791J19210I5185a04292F7706c9952B3298K28464
13432B51762P9695J52033A55809N5437H2766i5559A72446C200K47050R3410j29848
13421B13812J05181j44417n9687k7848a2974A33280A9730L16379K52224A55608
13410B88135e4231B79940J38289j60355j21333d09325A93864C1422K85143A28063
13399A94616G8106J13756e5399B03095m8827B2698d087F1054L30130A92065F3515
13387B31149g9546B65185Q9505a28973A18598m5593R0633N1735q1886b6985B98664
13375H6065K09843p4719n0831K52214B03070a54263D18505j46897J46949H4930
$$ y = [236699, -27960, -2299, 142607, 260802, -128196, 268937, 57378, 348076, 157928, 82338, -170228, 89839, -67562, 85791, 205001, 95185, -104292, 67706, -39952, 23298, 251762, 331457, 483490, 155809, 211246, 82766, -95559, 172446, 3200, 250250, 343660, 213812, 318993, 174576, 114889, 87041, -12974, 133280, 19730, 336109, 588333, 155608, 288135, -54231, 279940, 418229, 257874, 136541, -409325, 193864, 31422, 316565, 128063, 194616, 78106, 191862, -55399, 203095, 154268, 22698, -4087, 61054, 391184, 192065, 63515, 231149, -79546, 265185, 354690, -128973, 118598, 73005, 163638, 215373, 133487, -26985, 298664, 86065, 295908, 221189, 170358, 422572, 203070, -154263, 418505, 271608, 418557, 84930]
13364F56925C14350H4865K91024E9220j9559J78935P4942A20927J26929I7747
13353I4116J08309D3853J2409L07007m5606q3585l9648J71867j8779j01614D0528
13341D94776B42062q5252J78903M4321J01205j74065p939H6469J51828j6915m4579
13330A76803q6415a0495C72922j38054G0367A319b0620B56733G1467K56465A01009
13318A15036K77051b04593C27838c6240E56458A68854j9438K55259B01973M9761
13308B51734c4296A69765m638m2751Q6876j01074K86458A71229p4109d3170j26599
13297a69769f7046B40604f719k27350B14520c2776g620m5594A78121a51973D7008
13285B26604l167A06582N6780C4892C829K7212k682L84028j07015D2596a53704
$$ y = [656925, 314350, 84865, 375889, 59220, 39661, 218596, 293538, 120927, 247856, 97747, 94116, 202425, 43853, 56262, 363269, 317663, 234078, 194430, 366297, 347518, 245904, 40528, 494776, 242062, 156810, 335713, 380034, 481239, 307174, 299235, 86469, 238297, 221382, 176803, 90388, -10495, 372922, 234868, 70367, 1319, -20620, 256733, 71467, 327932, 101009, 115036, 392087, -204593, 327838, -36240, 556458, 168854, 149416, 404675, 201973, 251734, -34296, 169765, 165127, 122376, 209252, 108178, 394636, 171229, 97120, -43170, -169769, -67046, 240604, -6719, -234069, 214520, -32776, -7620, -53214, 178121, -151973, 47008, 226604, 223437, 106582, 163362, 34892, 3829, 31041, 28359, 412387, 305372, 42596, -153704]
13273H9585a33270b0913m6392C16125C9223L39025A60313p5300d5604A44026O764
13262A50790l3114J77887P6194a79235B82847p3613J11237h1439j24908A77523
13251A20114Q7268D8404F075M9011b04815B10998e2663B02260F0265R4739J66159
13240C21163k1642A14319n0053J60337G2733H487b9603H3010K33431A16359m1514
13229G4845a27216A60107A3324N1921K07613a99798A84682m949b141l7314A62074
13217F6299O0910g3787L5343C57586c26922H1075K7664J15989L8148E5821N9136
13206A14957a02656j2947N3701j21887E642K04779k0291h9388A53398o950A3089
13194A34713a98936P2177A75119J49651I3147e6786K2595I2893B21O0736i3141
$$ y = [89585, -133270, -20913, -67305, 316125, 39223, 378248, 160313, 85013, -45604, 144026, 150790, 117676, 295563, 371757, -179235, 282847, 209234, 320471, -81439, -206347, 177523, 120114, 207382, 48404, 6075, 55086, -204815, 210998, -52663, 202260, 60265, 155004, 321163, 299521, 114319, 64266, 224603, 72733, 8487, -29603, 83010, 316441, 116359, 74845, -127216, 160107, 13324, 65245, 272858, -199798, 184682, 179733, -2141, -39455, 162074, 66299, 127209, -73787, -38444, 357586, -326922, 81075, 108739, 224728, 262876, 55821, 114957, -102656, -115603, -61902, -183789, 5642, 210421, 190130, -89388, 153398, 146448, 13089, 134713, -198936, -126759, 175119, 324770, 93147, -56786, -34191, 92893, 221, 60957, -93141]
13182e6889E3565J92664K97527d0939A76465A2172h4639C12015b8557A1007J84350
13171A95357a7690G0113c29490e793G5241P3296c87040h253H0498b11574A51625
13159A69426b31808G3446I951O4616g174m0153A04815B3543d0628C63313G2051
13147B27173I8103l3016K83686a06597L2203A3361a53958E6080K16685D4294c57391
13135A0910K54582j18800J86792h0753A05141L23990B4961d5664C00765a26841
13124b41153A64641l1870O8454a1068k8672j14320f9555j81364A68467q1992N9886
13113A46361J09948H5797m0820b24214C8471b44857a6356j63292h8097D42567
13102A91145B245c5565B24777B9104J38043c1682A29866l4180b5602A11856D1129
$$ y = [-56889, 53565, 246229, 543756, -40939, 176465, 12172, -84639, 312015, -28557, 11007, 195357, -17690, 70113, -329490, -5793, 75241, 148537, -387040, -8253, 80498, -211574, 151625, 169426, -231808, 73446, 9951, 74567, -7174, -47327, 104815, 23543, -40628, 363313, 72051, 227173, 98103, 65087, 348773, -106597, -74394, 13361, -153958, 56080, 272765, 44294, -357391, 10910, 265492, 146692, 333484, -80753, 105141, 429131, 24961, -45664, 300765, -126841, -241153, 164641, 132771, 201225, -11068, -39740, -154060, -69555, -250919, 168467, 86475, 146361, 256309, 85797, 44977, -224214, 38471, -244857, -16356, -179648, -88097, 442567, 191145, 2245, -35565, 224777, 29104, 167147, -31682, 129866, 95686, -25602, 111856, 41129]
13090i520D3151M3549a41614A92733C1573a51896N8009a5527B51360N0176a51789
13078G4185a71554A36763K55626a29865d5051q9431B36738e8719A19686J63214
13068B82900b50987H8309k0647b1321B09148o1607b18043C51831H4858b20154
13057A15977L37814A1032a13244C83385A74492N6952K08391a32430I9057N3179
13047A52236G0902R8007a38229D16313A03836J8473A9060F769e2482B37320j12167
13036A25153k5197Q1838J66898A06617b32317C47114f6601G854h5635B13981P1122
13025B85103A22827E0303e194D42702a07337C17990K2269i4894B82419L2854L9636
13014C54909j38633b56961H8838G868b47750B5435J10626a39362A03852l2067
$$ y = [-9520, 43151, 86700, -141614, 192733, 31573, -151896, -93887, -15527, 251360, 301536, -151789, 74185, -171554, 136763, 392389, -129865, -45051, -134482, 236738, -58719, 119686, 282900, -250987, 88309, 67662, -21321, 209148, 147541, -218043, 351831, 84858, -220154, 115977, 453791, 11032, -113244, 383385, 174492, 231444, 439835, -132430, 99057, 152236, 70902, 168909, -138229, 416313, 103836, 122309, 19060, 6769, -52482, 237320, 125153, 99956, 181794, 348692, 106617, -232317, 347114, -66601, 7854, -85635, 213981, 285103, 122827, 50303, -5194, 442702, -107337, 317990, 340259, -94894, 282419, 315273, 354909, 216276, -256961, 88838, 7868, -247750, 25435, 136061, -139362, 103852, 71785]
13004G1785M1950b09265B88810c0190C3548b65951B56007a64866B65538D6490
12993A11153L7578K931a01487l63685E7013J58784C0638K07672r1317b30470a08303
12981A41665O2880c9647C15766h8148q5592D06673d5750q7207O1A52621D1503
12969i0556a5391n8690j61847F7933A3228N7943a18518d7024q4281A49450B2948
12957a71319A34741a63697k01149A70102E445g4313j15435k32977B66321j20644
12947A45677c14610B35393b22673F9306J80240I753N0308b08598B4023M3067e0785
12935C07514b14904d4495j75660D2244a2623B30840n0444b95295J16185j44785
12925c23895d6726A30309a83677h0523A82478a2156B22952N0781f3668j86888
$$ y = [71785, 113735, -209265, 288810, -30190, 33548, -265951, 256007, -164866, 265538, 46490, 111153, 148731, 151662, -101487, -465172, 57013, 215797, 30638, 238310, 146993, -230470, -108303, 141665, 204545, -39647, 315766, -88148, -173740, 406673, -45750, -132957, -132896, 152621, 41503, -90556, -15391, -74081, -235928, 67933, 13228, 71171, -118518, -47024, -131305, 149450, 22948, -171319, 134741, -163697, -364846, 170102, 5445, -74313, -189748, -422725, 266321, 145677, -314610, 235393, -222673, 69306, 249546, 9753, 60061, -208598, 24023, 67090, -50785, 307514, -214904, -44495, -220155, 42244, -12623, 230840, 180396, -295295, -179110, -323895, -46726, 130309, -183677, -80523, 182478, -12156, 222952, 273733, -63668, -250556]
12915b50556C42660e3110B5552a34578A48856o1215J29116d1448G3054g4486B27949
12903h590m8282j62711e848l20660B89932b13968D1567K15580P4105d9487r9842
12892a49329B27478A03489J28075F3942J06501a91364b7838j15717M4383n9950
12882a59122A36517n5915R2024b40229B20373C6086J19199i8504l0013I8036a26113
12870d9261a5997A0022i8045j65464A45382l3032c17400B13015B5639j512c08282
12858c08976a00417A0104L62299A32204D9166K32270D0827J16861b28809a13679
12847h5303A32296K0093a4549C81425a64166J9326f195j67205D9816e9860A30738
12835c29788I8923b43431A77938b52781A64598n6809A8992a28576A90890N2023
$$ y = [-250556, 342660, -53110, 25552, -134578, 148856, 87641, 216757, -41448, 73054, -74486, 227949, -8590, -56872, -219583, -5848, -326508, 289932, -213968, 41567, 257147, 331252, -49487, -149329, 227478, 103489, 231564, 63942, 170443, -191364, -27838, -143555, -99172, -159122, 136517, 80602, 172626, -240229, 220373, 36086, 155285, -98504, -128517, 98036, -126113, -49261, -15997, 10022, -98045, -263509, 145382, 112350, -317400, 213015, 25639, 24127, -308282, -308976, -100417, 10104, 372403, 132204, 49166, 281436, 40827, 157688, -228809, -113679, -85303, 132296, 152389, -14549, 381425, -164166, -144840, -6195, -173400, 49816, -59860, 130738, -329788, 98923, -243431, 177938, -252781, 164598, 107789, 18992, -128576, 190890, 242913]
12825B42913F4527P6726c19837A00918L334C4123L1198a59089b1528C3802b78302
12813C5378b52543L8474A96636c6321q0811b242B10547a38759B08365a96323B03316
12801c92036G6085M8858c50559a39108l1405C37138A31514k7810a24993K8236
12791i6757E7221Q1663f9945B80746m6046E2051f2553B57541b2334k06348E670
12779a47554A03186b60076A13434J77866A10056b37453E8359c13599H0130K16076
12769B96206D8584g5881b0075l98094F5224b4514j52370b4264r3267A27693A7988
12757h1720o1452c4427l9677C2261a65743C0191c8963a8750j66073A64073a84954
12745D0378N4274m3939J92612a8224k80442A66636D8768b75013B28395m4377m9075
$$ y = [242913, 64527, 141253, -319837, 100918, 104252, 34123, 65321, -159089, -21528, 33802, -278302, 35378, -252543, -214069, 196636, -36321, -117132, -2242, 210547, -138759, 208365, -196323, 203316, -392036, 76085, 124943, -350559, -139108, -170513, 337138, 131514, 103704, -124993, -96757, 57221, 138884, -69945, 280746, 234700, 52051, -62553, 257541, -22334, -228682, 5670, -147554, 103186, -260076, 113434, 291300, 110056, -237453, 58359, -313599, 80130, 296206, 48584, -75881, -20075, -418169, 65224, -24514, -176884, -24264, -117531, 127693, 17988, -81720, -143172, -34427, -74104, 32261, -165743, 30191, -38963, -18750, -184823, 164073, -184954, 40378, 94652, 50713, 243325, -18224, -298666, 166636, 48768, -275013, 228395, 184018, 134943]
12734A34943j9597R9524m5302c00709C9207j9289J95389a70688Q4731C1348J2253
12723D3601K24392a44179m8072B44218c07397J44042B90912a24579m3402f0287
12712f1942k7922A19445C8604Q5441K63574A01989f4467A35079o853L05677A73205
12700c6676B05795D2005p727b54170B08160E1109q389K78440M610J7575C4723
12688A44399c71686A15868g717o0553B49916a43427K8204E2056j7637J68400o9749
12677A33070E0441J05253B8862c14244B36667c68716g9045j40247I6829J60747
12667B57576j03390N1620c5728A15842J6103n3877M2799R8295i9831D38501I4673
12655G1655J63705k0771f3309D37633A86289q9144m6653R1393l4132b17999A24042
$$ y = [134943, 115346, 214870, 169568, -300709, 39207, 19918, 215307, -170688, -85957, 31348, 43601, 267993, -144179, -192251, 244218, -307397, -163355, 290912, -124579, -167981, -60287, -61942, -89864, 119445, 38604, 124045, 387619, 101989, -64467, 135079, 128226, 433903, 173205, -36676, 205795, 42005, 34278, -254170, 208160, 51109, 42720, 321160, 325770, 343345, 34723, 144399, -371686, 115868, -7717, -68270, 249916, -143427, -115223, 52056, 34419, 202819, 133070, 50441, 155694, 28862, -314244, 236667, -368716, -79045, -219292, 96829, 257576, 154186, 205806, -35728, 115842, 131945, 78068, 120867, 219162, -99831, 438501, 94673, 71655, 235360, 214589, -63309, 437633, 186289, 97145, 50492, 141885, 107753, -217999, 124042]
12643B44442E6631A7328b568k85979g5768j5000A57808a44158B7095a53382A08019
12631A57640F2221J53376K92931k50097Q3620A11545K16180h6158j71180c3713
12620D32905A50757A58M83387j47234D2816f9513C6075a29512G2277L7287p614
12609A01950J75855a42706d3494p2252j20229Q1102A37525J22323B9542a11922
12598I9667K8602h7420M0140E351R79a72904B00228b5579L590A42848l5704O70
12586A07814a22337M508D9499J25670n8557a1145B3481R4867J903K78431j45070
12575B53612F3930j9661L7051a79089N9932A1795a39501B67284c29682D23740
12564a18169j47585B45428a9720r0143m268K6415q2271B43977H3231b8369B4650
$$ y = [244442, 56631, 17328, -2568, -288547, -75768, -90768, 157808, -144158, 27095, -153382, 108019, 157640, 62221, 215597, 508528, 258431, 342051, 111545, 327725, -86158, -257338, -33713, 432905, 150757, 158, 483545, 336311, 42816, -69513, 36075, -129512, 72277, 109564, 101950, 277805, -142706, -43494, -115746, -235975, -154873, 137525, 259848, 29542, -111922, 99667, 128269, -87420, -47280, 5351, 6330, -172904, 200228, -25579, -21989, 142848, 107144, 107814, -122337, -117829, 49499, 175169, 116612, -11145, 23481, 118348, 120251, 398682, 253612, 63930, 44269, 81320, -179089, -119157, 11795, -139501, 267284, -329682, 423740, -118169, -265754, 245428, -19720, -109863, -114131, -87716, -169987, 243977, 83231, -28369, 24650]
12552A95161a22858I3201b98906A07910b27420A32840n8834L3644a53845N861
12542a47984O3987j14103c9354B03173e3244k68973B27779k0039a03682F0293
12531E6957B4210J03676g6930A42118a8809A93173a50075A34568c94652a5969
12520I8653m7740M9384f7777D125a11208c0714k2114C49270b0831A0115b49243
12508B78601a81214g2860F6173a5869l26027J27421A4227a07574n5812D3116h5511
12496I0938J4122b3804C4366J18117j6512b61068B44607B6510b1899G0468L6058
12485A06526M9374L68084H5876j8813J97757p4561r2627K69793g0559A27960D3351
12473h4067D02769E5032a18709b0025A95636i3122k52495J27709B50036a47548
$$ y = [195161, -122858, 93201, -298906, 107910, -227420, 132840, 74006, 107650, -153845, -147984, -83997, -198100, -39354, 203173, -53244, -322217, 227779, 207740, -103682, 60293, 56957, 24210, 127886, -76930, 142118, -18809, 193173, -150075, 134568, -394652, -15969, 98653, 50913, 100297, -67777, 4125, -111208, -30714, -52828, 349270, -20831, 10115, -249243, 278601, -181214, -72860, 66173, -15869, -341896, -214475, 14227, -107574, -163386, 43116, -85511, 90938, 105060, -23804, 34366, 152483, 135971, -261068, 244607, 26510, -21899, 70468, 106526, 155900, 523984, 85876, 67063, 264820, 190259, 97632, 367425, -70559, 127960, 43351, -84067, 402769, 55032, -118709, -20025, 195636, -93122, -345617, -217908, 250036, -147548]
12462a88252d5113j1886I7153Q0359g7697r3644d825j24717A60897E8442K40652
12451B99094H5421K89877c0299k77843A16121A3801c06254k23932G0344g4637
12440A18896K805N4004a34255o1628h9720a4808l7005A86315a21150o8446F4866
12428A31805F1919J18828p2784a73163j40500a03950j92162B70359A01128b27758
12417a52274A79540a44931A39024a99126B07081R324H6955i0376m568m524A89406
12405D2395a15723l3673H0785E824i1556A93045g1265A71889C4629K08520j03753
12394A39396D5805c22649A72586N3135C5757a63625M9568A59547o5334J01047
12384A95260F1353J86435A05717J61265H594L4805j7722a23306I7668O1056D2995
$$ y = [-188252, -45113, -56999, 97153, 177512, -77697, -171341, -4825, -129542, 160897, 58442, 299094, 85421, 375298, -30299, -308142, 116121, 13801, -306254, -530186, 70344, -74637, 118896, 121701, 175705, -134255, -195883, -89720, -14808, -51813, 186315, -121150, -189596, 64866, 131805, 61919, 180747, 107963, -173163, -313663, -103950, -296112, 270359, 101128, -227758, -152274, 179540, -144931, 139024, -199126, 207081, 216405, 86955, -90376, -94944, -99468, 189406, 42395, -115723, -149396, 80785, 5824, -91556, 193045, -71265, 171889, 34629, 243149, 139396, 45805, -322649, 172586, 225721, 35757, -163625, -114057, 159547, 94213, 195260, 61353, 247788, 105717, 266982, 8594, 43399, 25677, -123306, 97668, 158724, 42995]
12372f5487q9907B99953A36717H666c65795b431p7258C8424d243p0340A4977O7935
12360H2912b8070A34760Q7923A07067C886b09258a79A15110E5884a73758l418
12349a77176D83555i3359a8334j03884j48646E0498A3263a34782A70385b4379
12338h5024H2936J18559a54422B65508b1742B79509J41204F8313M59658A46372
12327A89389p5635a11368A02361J63691E1722J16846E4437L65084A64751A7901
12316A69965B8781J35843a91038d777G5566j2470J73145k7597r5558O666c011
12304A69366P1164a0764A71817L2124F1606h388B08624a33884C95842j92430K2078
12293B25490e9574j89236A06429a19629A80215L38676B7212P7015n707g3226E2556
$$ y = [-65487, -155394, 299953, 136717, 8666, -365795, -2431, -79689, 38424, -4243, -74583, 14977, 82912, -28070, 134760, 222683, 107067, 3886, -209258, -179, 115110, 55884, -173758, -177176, 483555, -93359, -18334, -122218, -270864, 50498, 13263, -134782, 170385, -24379, -85024, 82936, 201495, -154422, 265508, -21742, 279509, 420713, 68313, 527971, 146372, 189389, 113754, -111368, 102361, 266052, 51722, 168568, 54437, 419521, 164751, 17901, 169965, 28781, 164624, -191038, -4777, 75566, 63096, 236241, 208644, 113086, 119752, -3011, 169366, 240530, -10764, 171817, 203941, 61606, -8388, 208624, -133884, 395842, 203412, 225490, -59574, -248810, 106429, -119629, 180215, 518891, 27212, 104227, 98520, -73226, 52556]
12281C7881J00869d3673E38405A36078j811J07581b08653B609J53080o3316k0243
12270G2130L77055k11865e9200J5582B65588F7313a18282a4997A38216E9696J80355
12259B40051g4302E1643J91291i2459C2724J75734o2600F5526J22336J04559a32073
12247C53747j63711B6646K8665K80980j40343b1689A85429p6937J08756a78455
12236I0817J77402E181c9266A88763H1331K1580L6481K53109A81272n4519J16625
12225B43378p3070J27890A47759L53808R4253j84890F2159K31487L12062j19907
12215D85801K6841p9583g1266B13162l2413D9348J24175Q1565A20162h5067A38525
12203A61445F255J15342L49554j42153B5598L10114a31327A06443Q2670O4839
$$ y = [37881, 138750, -43673, 538405, 136078, 134267, 241848, -208653, 2609, 155689, 92373, 72130, 449185, 237320, -59200, -43618, 265588, 67313, -118282, -14997, 138216, 59696, 240051, -74302, 51643, 242934, -92459, 32724, 208458, 145858, 65526, 187862, 292421, -132073, 353747, 190036, 26646, 55311, 336291, 195948, -21689, 185429, 108492, 217248, -178455, 90817, 268219, 5181, -39266, 188763, 81331, 102911, 139392, 392501, 181272, 126753, 243378, 170308, 298198, 147759, 501567, 595820, 410930, 62159, 293646, 605708, 485801, 512642, 433059, -71266, 213162, 180749, 49348, 173523, 255088, 120162, -85067, 138525, 161445, 6255, 121597, 471151, 328998, 25598, 335712, -131327, 106443, 189113, 253952]
12193B53952o2224d1519C29402E0751M41901j74644I2011a5006C36994F6966K1685
12182H8651O9181B8749J92364K20352j96778K9098j08240A3335J24349d4531B05700
12170A88649A8462L52230M2576J7517E2716c231C09578m4634I855h957B58529
12158A26925l0177K57549n9912j2925b48044A04888l2470L37786A20749b9921
12147A31372i0109C53719d903I3461N5839O9970r2936l2032q810a6356B06681
12135B65948q7828M1709j7223l6904b71438J07021B77316Q3475H9414L62507A70992
12123B36149j01372J50209o5389j00282l2581A6753J96879l4373j5780L8931D7109
12111C10535a48632A3913K11487c8640H0544J94598J04206b49312B62605I7191
$$ y = [253952, 191728, -41519, 329402, 50751, 492652, 318008, 92011, -15006, 336994, 66966, 88651, 157832, 28749, 221113, 441465, 244687, 273785, 165545, 13335, 137684, -44531, 205700, 188649, 18462, 370692, 413268, 430785, 52716, -3231, 309578, 264944, 9855, -8957, 258529, 126925, 96748, 354297, 294385, 281460, -248044, 104888, 72418, 410204, 120749, -29921, 131372, -90109, 353719, -4903, 93461, 149300, 219270, 126334, 94302, 85492, -16356, 206681, 265948, 178120, 219829, 202606, 165702, -271438, -164417, 277316, 360791, 89414, 451921, 170992, 236149, 134777, 284986, 219597, 119315, 86734, 16753, 213632, 179259, 163479, 202410, 47109, 310535, -148632, 13913, 225400, -38640, 80544, 275142, 379348, -249312, 262605, 97191]
12100E9959j4107N8873L6114k6845c0527j28388B31689k2881H1350K29686n5163
12089B55873R5711A14502a74227A08361M0047n8785J99379j16071D5946J86129
12079B32075D0818K1931c2314B27555A08995j790J30722Q060G18a45881B7250
12067D4874P6530B7015a28777M8099j3289A02512Q3022j5927f6774k59778p4387
12056d00939H7152a46527l596B54926i148B09479b03516A83891l1211M7144A040
12044A86997i1077A43507c22251A04411b73721a09551D8949J68665m9662a18185
12033a10221C64881e0194E4350A1839c23784i8577j03037A09350a6017A99645
12022A43521c8867a8262k14721J08625J7931C02612G2007c10525n0246A0972e22
$$ y = [59959, 45852, 104725, 140839, 113994, -30527, -158915, 231689, 208808, 81350, 311036, 255873, 351584, 114502, -174227, 108361, 148408, 89623, 289002, 172931, 45946, 232075, 40818, 62749, -32314, 227555, 108995, 107205, 237927, 245987, 718, -145881, 27250, 44874, 121404, 27015, -128777, -80678, -93967, 102512, 185534, 169607, -66774, -326552, -400939, 87152, -146527, -150123, 254926, -9148, 209479, -203516, 183891, 152680, 199824, 1040, 186997, -91077, 143507, -322251, 104411, -273721, -109551, 48949, 217614, 167952, -118185, -110221, 364881, -50194, 54350, 11839, -323784, -98577, -201614, 109350, -16017, 199645, 143521, -38867, -18262, -232983, -124358, -106427, 302612, 72007, -310525, -360771, 10972, -522]
12010a11438k62470A14945h0485A40297a22377j9917A66808i9507F8200N1357
12000A19557M4826e4786k9136K7599B03279g2786j29783F6921J83825a28864B02862
11988a62833J0419e9419F8055J23454a22169A59195E4650c0457r6400e5839j7745
11977g3584k3028F5958M9976e3822b3428j02719n797A4511Q06K9098n449a65399
11964e473j47670b3565j05297l9860K6433l3984C3789M3480b7103o090k14709
11953b47902E9082a65797G4456b40911A40630i6224j60466O5567O3785l9022N9603
11942a06757c1188j35112I3709N2036O8452a89534j44765i7198o8001n3305R8068
11931a20436N4660A35652b67334i0463a8574C12770G3513a62086L7464k52274
$$ y = [-111438, -373908, 114945, -80485, 140297, -122377, -142294, 166808, -99507, 68200, 119557, 164383, -54786, -83922, -56323, 203279, -72786, -202569, 66921, 250746, -128864, 202862, -162833, -152414, -59419, 68055, 191509, -122169, 159195, 54650, -30457, -126857, -55839, -73584, -96612, 65958, 115934, -53822, -23428, -126147, -131944, 14511, 15317, 44415, 38966, -165399, -5473, -153143, -23565, -128862, -168722, -142289, -176273, 33789, 77269, -27103, -33193, -247902, 59082, -165797, 74456, -240911, 140630, -96224, -256690, -191123, -127338, -166360, -106757, -31188, -166300, 93709, 145745, 214197, -189534, -334299, -97198, -165199, -218504, -120436, -65776, 135652, -267334, -90463, -18574, 312770, 73513, -162086, -124622, -376896]
11921c76896m0753d7365k96560a25230A64976a18429m1269B92161a25762A80795
11910b7426A93952F5936b79313a34413A5952J69204a01756A75832R2682c0155
11899a61094A84863b61163r5090A7521g124b244q492B30621F5069j3935a16622
11887a56807p2222K8204n3161g0582B72189b91689h4082n71263a92767C0524J02861
11876A33385b66179c5164k9398D4056M5130b68320a06605M5364j24360B3153O8177
11865I1330f7154p3344m2765A24844Q1876J27665a21105B33393a25950I4480j1487
11854H2993D0315j7482e71014D2089a90517B5645J0630c5879k66646O2345c2593
11842D7515a2294A01978K02415I0617e5906C3577c33k67672e8046A39460e721
$$ y = [-376896, -417649, -47365, -343925, -125230, 164976, -118429, -159698, 292161, -125762, 180795, -27426, 193952, 65936, -279313, -134413, 15952, 185156, -101756, 175832, 268514, -30155, -161094, 184863, -261163, -356253, 17521, -7124, -2244, -10736, 230621, 65069, 51134, -116622, -156807, -229029, -200825, -253986, -70582, 272189, -291689, -84082, -655345, -192767, 30524, 133385, -266179, -35164, -64562, 44056, 89186, -268320, -106605, -61241, -185601, 23153, 91330, -67154, -140498, -183263, 124844, 206720, 334385, -121105, 233393, -125950, 94480, 82993, 40315, 22833, -571014, 42089, -190517, 25645, 36275, -35879, -302525, -240180, -32593, 47515, -12294, 101978, 304393, 90617, -55906, 33577, -333, -268005, -58046, 139460, -5721]
11830b59982a4923F1864g9946B85164D1080g8611j33820P4569k68215A45501c5993
11818a99123A14710b00438A53434k7323J6021C1866a79536j90570a9914C86893
11807b52978e4969H9495a85406j23412C466e0040j5767j04979j67695a29456B87483
11795A52892K03565a1488o7671b3451j90640R9009A77971H4204A0190b23596A10155
11783E1970J2163a76261A35325B3530a55056G6954C0196b87293J5184A74790b83695
11771a04687m1110a763j68212C13198D8938L9039M8332a77219A75566G0623N3788
11760A24411a56091j10338A48277J19096b51446a04972r9989g9986r4999c9203
11749h7525E5600e6669l2537B23216d0011E2395E058c656A92384b02659i314A42628
$$ y = [-259982, -14923, 61864, -79946, 285164, 41080, -78611, -212431, -137862, -406077, 145501, -35993, -199123, 114710, -200438, 153434, 126111, 142132, 31866, -179536, -370106, -19914, 386893, -252978, -54969, 89495, -185406, -308818, 3466, -50040, -65807, -170786, -338481, -129456, 287483, 152892, 356457, -11488, -79159, -23451, -214091, -115082, 177971, 84204, 10190, -223596, 110155, 51970, 64133, -176261, 135325, 23530, -155056, 76954, 30196, -287293, -272109, 174790, -283695, -104687, -145797, -1763, -169975, 313198, 48938, 87977, 136309, -177219, 175566, 70623, 124411, -156091, -266429, 148277, 267373, -251446, -104972, -204961, -79986, -174985, -39203, -87525, 55600, -56669, -89206, 223216, -40011, 52395, 5058, -3656, 192384, -202659, -9314, 142628]
11736a40527H9473B057n39c812k8215A76699b90117J37205n0320G1089c94457
11724B023J93585F2312J3053b62681m7878A78311m6678C573d08428B60339A6390
11712E3902e2716H6265d61495h4215A09674a28767C5495L7764b09952C10099C3142
11700a20578j19661h3866D14154b46822A83319K5448k20J4056a45553j0034B38738
11688A85256K27703A66916A8472a21189A11525c72740A08408L0654i548n0844
11678f0392D35352c2991k51897A55214K40452A63121K5217O7447b6578G9196d4285
11666a4104j63508A38413e0326A03414b38279B74286j20465m6125n191B1345f9025
11654F5a41142D1237a05160j11209C28560a17786I300i0503j2427A39615d3222
$$ y = [-140527, 89473, 2057, 1518, -3812, -32027, 176699, -290117, -152912, -203232, 71089, -394457, 2023, 195608, 62312, 75365, -262681, -310559, 178311, 131633, 3573, -408428, 260339, 16390, 53902, -52716, 86265, -461495, -84215, 109674, -128767, 35495, 73259, -209952, 310099, 33142, -120578, -240239, -83866, 414154, -246822, 183319, 208767, 208547, 222603, -145553, -155587, 238738, 185256, 412959, 166916, 18472, -121189, 111525, -372740, 108408, 139062, -9548, -60392, 435352, -32991, -284888, 155214, 395666, 163121, 188338, 255785, -26578, 79196, -44285, -14104, -177612, 138413, -50326, 103414, -238279, 274286, 153821, 107696, 102505, 21345, -69025, 65, -141142, 41237, -105160, -216369, 328560, -117786, 9300, -90503, -102930, 139615, -43222]
11642c8045B9682c7173B33388a38553E3327c03442Q3392B36225r298p3102b50521
11630A8913c65987g2069m3120D05143A66888J17829a54317B28044c6405G9124
11619i2097A34572a33062A87866I671f8986k3379B33233a15191k02763D1348K09492
11608B50840A7064D279b04456H5845b83476D70582b77292H120J70254a9438B11431
11596D3651a25969j38358d4376j57297e1707g804A03438Q4288a9139A51663a24404
11584b36393d1751C1467O5155a66931B20389m2109J22481C5657L7306K66862h4001
11572A77593c4467A00173Q1256A8965K58392b0703j06239j58026J15402B19760
11561A75235A46L7362j8682J90220D7167J9061a27839H7129b64419A34828o1313
$$ y = [-38045, 29682, -37173, 233388, -138553, 53327, -303442, -220050, 236225, 226927, 153825, -250521, 18913, -365987, -72069, -115189, 405143, 166888, 284717, -154317, 228044, -36405, 79124, -92097, 134572, -133062, 187866, 9671, -68986, -92365, 233233, -115191, -317954, 41348, 250840, 17064, 4279, -204456, 85845, -283476, 470582, -277292, 8120, 178374, -19438, 211431, 43651, -125969, -264327, -44376, -201673, -51707, -7804, 103438, 187726, -19139, 151663, -124404, -236393, -41751, 31467, 96622, -166931, 220389, 178280, 300761, 35657, 72963, 339825, -84001, 177593, -34467, 100173, 181429, 18965, 277357, -20703, -126942, -284968, -169566, 219760, 175235, 146, 37508, 18826, 209046, 47167, 66228, -127839, 87129, -264419, 134828, 73515]
11550G3515P8054b06422F6546K02705E1876O213K17923g8906K1869H7522L953
11539I1475a38552l7025C4358J2888e5141G4496a0375j7147B72726g3194o4731
11528a37925C14192C8595K59492r4375J19056J7564A24981n1207b86079C213i3110
11516B08878c0011l256E28278H6148J8730N8483j0064a21481A6927L20777B4924
11504A77882l5615Q5693D4762J97201a21624C05393M893F2040a27950A86705J05065
11493B91770A26569K10451D3368J04084L12683j75931D4757J24384H749K38940
11483B47689j5529J69157j17032n2837C8181J82928M5370l9326K25093A73057
11472a31485C98553j63762a65897A65095K05588f5518A48266J90004A28042b656
$$ y = [73515, 151569, -206422, 66546, 269251, 51876, 58089, 276012, -78906, -57037, 87522, 91475, -138552, -175577, 34358, 47246, -55141, 74496, -10375, -27522, 272726, -73194, -137925, 314192, 38595, 298087, 203712, 322768, 340332, 124981, 73774, -286079, 3213, -93110, 208878, -30011, -33267, 528278, 86148, 104878, 163361, 153297, -121481, 16927, 337704, 24924, 177882, 142267, 227960, 44762, 241963, -121624, 305393, 310286, 62040, -127950, 186705, 291770, 126569, 337020, 43368, 147452, 460135, 284204, 44757, 169141, 8749, 247689, 232160, 401317, 284285, 231448, 38181, 221109, 266479, 227153, 452246, 173057, -131485, 398553, 234791, -165897, 165095, 370683, -65518, 148266, 338270, 128042, -2656]
11461A87436a05568A89239e0895r8500D67534A31978a7290E3692N4453f3912B6461
11449f5362E02694j35864b9208A45776a97389b6745F1006J84554a99225C4213
11438e7334j9538A77278J08176g2056A35069J2947a60480a24B18094J54204i0246
11426A60331b16669A67772G3303f9011B59851J44008E0852a24783D6774P1854
11416A18628a55298N1131K1311A90957K014b8339E8561N9232D7087c1676A15956
11404a26997n3534e2109D6192b02304Q0246C2527A0773J86037D5129a15347A57639
11392a56647B19225N6506k7998j11783d3864A99280b50054A64458a63662H7060
11381C2166b02117p1064D9370M8811a89700b8332k7726A30652a7547p3356A68383
$$ y = [187436, -105568, 189239, -50895, -149395, 467534, 131978, -17290, 53692, 108145, -63912, 26461, -65362, 502694, 366830, -29208, 145776, -197389, -26745, 61006, 245560, -199225, 34213, -57334, -76872, 177278, 285454, -72056, 135069, 148016, -160480, -124, 218094, 372298, -90246, 160331, -216669, 167772, 73303, -69011, 259851, 403859, 50852, -124783, 46774, 118628, -155298, -104167, -82856, 190957, 192971, -28339, 58561, 117793, 47087, -31676, 115956, -126997, -180531, -52109, 46192, -202304, -122058, 32527, 10773, 196810, 45129, -115347, 157639, -156647, 219225, 275731, 247733, 135950, -43864, 199280, -250054, 164458, -163662, 87060, 32166, -202117, -273181, 49370, 98181, -189700, -28332, -56058, 130652, -17547, -90903, 168383]
11369A46861J25392a66411M6969B08376e6855C5950a87486C32360a06947i486
11358A35852J51844f4381A50376b95167c8193D35577h485A58299a32094q1732
11348b13826m662B75999b32148L2594A30060e3631B828a46844M7791R253B00387
11336d0512q8168k3772o7076f8145l14471c3047p5506H9468a93610A14596b14814
11324A00149J16989a27295A95896b63690a20711r9498h2228A85007Q666A7685
11313a99223n4110g5042b5505H2702J41084J93541b2810A18807l9243K83904B4688
11301e765o7571C25468A45901B3757J49097a90789a7489l53161a29576L0141G9487
11289a25182m730B5358a14697c7519I0007b4621r4301C28241d53818B6272J27384
$$ y = [146861, 272253, -166411, -119442, 208376, -56855, 35950, -187486, 332360, -106947, -9486, 135852, 287696, -64381, 150376, -295167, -38193, 435577, -8485, 158299, -132094, -213826, -218488, 275999, -232148, -199554, 130060, -53631, 2828, -146844, -99053, -89800, 200387, -40512, -128680, -152452, -219528, -68145, -382616, -33047, -108553, 89468, -193610, 114596, -214814, 100149, 217138, -127295, 195896, -263690, -120711, -220209, -82228, 185007, 193673, 17685, -199223, -253333, -75042, -25505, 82702, 223786, 417327, -22810, 118807, 79564, 363468, 24688, -5765, -73336, 325468, 145901, 23757, 172854, -190789, -17489, -370650, -129576, -99435, 79487, -125182, -129912, 25358, -114697, -37519, 90007, -24621, -118922, 328241, -453818, 26272, 153656]
11278A53656m5695b08663B6054a90491E58716H6111b9816r7107j29019H6999a07832
11266a37525N1263l8273b1712j21766I8812d7354j08348L0145A35600h6369m0683
11255a27052a938B33420A01118C1678O4384K27471b2929B18405I2933O6129A489
11243h8490a7441H2448C0033j275C456d53640b3553m4951l13890H6356b32483
11231a02134d3221j50025C942f9265j7258F7158R3807b19716K5013m720G8527
11219a891A05560b5568B7418e58989A06109B5953a99674j2702k372L6619e6840
11207B36795a33893d9157l82039A70943d07969m7080e1869F6395e07009c5037
11196B25722b94633k2748a45256A46423h1336l83068b181j70812A08177c90248
$$ y = [153656, 107961, -208663, 26054, -190491, 558716, 86111, -29816, -126923, -255942, 86999, -107832, -137525, -86262, -124535, -21712, -143478, 98812, -47354, -155702, -125557, 135600, -86369, -127052, -1938, 233420, 101118, 31678, 96062, 323533, -22929, 218405, 92933, 159062, 1489, -88490, -17441, 82448, 30033, 28758, 3456, -453640, -23553, -68504, -382394, 86356, -232483, -102134, -43221, -193246, 3942, -69265, -86523, 67158, 160965, -219716, -194703, -199423, 78527, -1891, 105560, -25568, 27418, -558989, 106109, 25953, -199674, -212376, -214748, -178129, -56840, 236795, -133893, -49157, -431196, 170943, -407969, -455049, -51869, 66395, -507009, -35037, 225722, -294633, -317381, -145256, 146423, -81336, -464404, -2181, -172993, 108177, -390248]
11185a01235f549j86544C0994N8269G158i2838B25577a74317l01059i261A7991
11173A6871E02c74572C2437j3322a63840o8290P4122B20667b61587f311k60292
11162b66603F3271k1416d39846c2145A1310a5203r2636A2315c46949i2039L7142
11151e4897j4321j32764I988J60420c5604A40208a37913K4690k48147I0307L9441
11140A29748k8364B8816a05069m2143A70929J21127i1195m0911E9264P1379c6536
11128D1704J03517b4455B30166K25872A80006q9863P6093f1708B79965b09536
11117h8016C17292g6801L6368q3818B36031g0680B78069j11525J07375j29091
11107A44828n8993A4245K62193A00846n0095e1734m783C56796O563j52783J90528
$$ y = [-101235, -6549, -193093, 30994, 89263, 7158, -92838, 225577, -174317, -475376, -9261, 17991, 16871, 502, -374572, 32437, 19115, -163840, -232130, -158008, 220667, -261587, -6311, -266603, 63271, 41855, -439846, -32145, 11310, -15203, -107839, 12315, -346949, -92039, -54897, -69218, -201982, 9988, 170408, -35604, 140208, -137913, -113223, -361370, 90307, 129748, 101384, 28816, -105069, -147212, 170929, 292056, -91195, -132106, 59264, 130643, -36536, 41704, 145221, -24455, 230166, 456038, 180006, 90143, 166236, -61708, 279965, -209536, -88016, 317292, -76801, -40433, -124251, 236031, -70680, 278069, 166544, 273919, 144828, 85835, 14245, 276438, 100846, 50751, -51734, -56517, 356796, 363359, 210576, 401104]
11096D01104C295K53693n5804J03549j24120N0186G9542O6210J38635K37622J15268
11085F37277H2569K29388A52626M32672A89308R2019k6375J26281c8134D46864
11074B61682j10510J25508K18128j1466L5519k57146J89720J98106k43582J01681
11064E07640L4923j25828p5198J94171J56960j63835O7025k77976L57755p8011
11054E97626J68053j5958j39364M71294j77048m18759K01176J96098J31537j98690
11044H15965K69020j58271O9458l49781N37497k40120O9837n7265l22119L30220
11034I64441k691J58957J33439m38687R9531j31211J46312k48640o9096P1880
11024F84235J63401R9811k38345J87523j01723K99940m89034K70610j10913K10095
$$ y = [401104, 3295, 256988, 201184, 304733, 180613, 230799, 79542, 145752, 284387, 522009, 637277, 82569, 311957, 152626, 585298, 189308, 281327, 254952, 381233, -38134, 446864, 261682, 151172, 276680, 494808, 483342, 518861, 261715, 451435, 649541, 405959, 507640, 542563, 416735, 341537, 535708, 692668, 528833, 595858, 317882, 675637, 597626, 765679, 749721, 610357, 1081651, 904603, 485844, 687020, 883118, 1014655, 815965, 1084985, 926714, 996172, 646391, 1183888, 943768, 1013605, 956340, 634221, 964441, 961750, 1120707, 1254146, 815459, 914990, 783779, 930091, 681451, 612355, 684235, 847636, 947447, 709102, 896625, 794902, 1094842, 605808, 876418, 765505, 975600]
11014I75600l00310n3306R4023O2853N5189k33847J33763J72259D12211M38528
11004H50739J05993j14276K67100l06666M941o1662K20904k13961p4905j86582
10994D91625K4225M25330k33841q0536R7363J89564j48890K43933l71302N14910
10984A152381m37516N34825l55413R6332n4719K91774J37385o1561L0725L56013
10974A690226j87645M26025L42864K32432L98431K18806O0087M24671L73973l16181
10964C663689P2272j84534o73033k35036m03003k96610R502m8272k67770k09774
10954A427431M07733j83150j02631o3554l34134l72934L81760j34734o7783j39746
10944H18258l11273j9441N5581k04669j31750k9335B6210L9895K04321o0765H586
$$ y = [975600, 675290, 621984, 716007, 778860, 834049, 600202, 733965, 906224, 412211, 850739, 956732, 842456, 1109556, 802890, 807831, 746169, 967073, 753112, 678207, 491625, 515850, 941180, 707339, 626803, 724166, 913730, 764840, 1008773, 637471, 1152381, 714865, 1249690, 894277, 990609, 935890, 1227664, 1365049, 1303488, 1334213, 1690226, 1502581, 1928606, 2271470, 2503902, 2902333, 3121139, 3181226, 3605897, 3979870, 3663689, 3735961, 3551427, 2878394, 2643358, 2240355, 1943745, 1953247, 1904975, 1637205, 1427431, 1835164, 1652014, 1549383, 1485829, 1151695, 778761, 1160521, 1025787, 958004, 818258, 506985, 487544, 543125, 338456, 206706, 177371, 26210, 66105, 270426, 209661, 8586]
10932C15518K14859A43823k8523B3968N4841b9843H1559a08705p460d6807A35863
10920a66026O6497A41604J17532D7225c63549A97463i8030j90484f7186J1829
10910e5357C8716g136C4562f1622l62118A44822n7050B9278h2060m3008J8949
10899a06119A40950a15830N5339o9414j27057Q7793a6976A68371H0098J18358
10889A98456a23564C5025M8937K02560D2920K53863a2537F765J53508c28517A6664
10877h2020O793n1292q700A07900b2654k58043A03894o133a14544j43155J5639
10866b42060H3480O427o354b21402A4221b02093g7174A29447C3053c3206A68607
10854C76211a43239d3644H328M3231j9655a37501N7565K1024o3210A59331b71327
$$ y = [315518, 530377, 143823, 115300, 23968, 78809, -29843, 81559, -108705, -116165, -46807, 135863, -166026, -99529, 141604, 259136, 47225, -363549, 197463, -98030, -288514, -67186, -55357, 38716, -7136, 34562, -61622, -423740, 144822, 87772, 29278, -82060, -125068, -106119, 140950, -115830, -60491, -129905, -256962, -169169, -16976, 168371, 80098, 198456, -123564, 35025, 83962, 286522, 42920, 296783, -12537, 6765, 160273, -328517, 16664, -82020, -75227, -126519, -135219, 107900, -22654, -280697, 103894, 97761, -114544, -257699, -242060, 83480, 89907, 83553, -221402, 14221, -202093, -77174, 129447, 33053, -33206, 168607, 376211, -143239, -43644, 8328, 51559, 31904, -137501, -79936, -58912, -122122, 159331, -271327]
10842B18847g1284j35759q2494b3821p0960B47997b67799b4970A27600b56952
10831i3792L3020J4008j12414A21814a18094l3322n17C1048i6300p3190H7638
10819c9971A89759L8707d4787l34179A02699c22479a41842m3661J688G3648Q0087
10808A53735f9772A39840a0533j39275K0423B35498a27926A24940J24112I8615
10797A01203D3558c51395h6229L0675m2542A32730a15565A17345c2286I7496l921
10786I3575b47197A62869B1692f2577j55004A14286K79050c5123E7307a10692
10775G7402M3814a67914J9853A61381b40388B09789f5891h388j42345B52814g8964
10763a27430K13I5011j7101E412b71888a21206C9542e26775a81161k1745b4615
$$ y = [218847, -71284, -207043, -289537, -23821, -94781, 247997, -267799, -24970, 127600, -256952, -93792, -60772, -46764, -159178, 121814, -118094, -151416, -151933, 31048, -96300, -169490, 87638, -39971, 189759, 228466, -44787, -378966, 102699, -322479, -141842, -185503, -183815, 73648, 153735, -69772, 139840, -10533, -149808, -129385, 235498, -127926, 124940, 249052, 98615, 101203, 43558, -351395, -86229, -55554, -98096, 132730, -115565, 117345, -32286, 97496, 93575, -247197, 162869, 21692, -62577, -217581, 114286, 393336, -35123, 57307, -110692, 77402, 121216, -167914, -148061, 161381, -240388, 209789, -65891, -8388, -150733, 252814, -78964, -127430, -127217, 95011, 77910, 5412, -271888, -121206, 39542, -526775, -181161, -202906, -24615]
10751a09632J5214r9449A15936a91204L9905A68497a14219E1337j0552f6094C14244
10739a38237B7030O5184d3995j32681G5656a35785O7705A0661N9757P4145h4251
10727B09873d01p4972D9724n226N2648B8533b59268k39216a79932g9366D4529
10715a5463G4787K97130A19507g103o8042k37939D1636b67394g1939I2202A8040
10703c9680o995D6634c48481b4642k85395A09091a300k05987j47807a77133B46946
10691b43249C322a18183n046e9686E6189R2573a29910j85157a30788A71594M7438
10680B19032a32313E7178b84253c9912C4217L975K50480c5351D6803L3115h2649
10668a43008O9090L6698C08733j53993b3774F2710c27977B63875h6177p313k58874
$$ y = [-109632, -94418, -193867, 115936, -191204, -151299, 168497, -114219, 51337, 40785, -66094, 314244, -138237, 27030, 92214, -43995, -176676, 75656, -135785, -68080, 10661, 70418, 144563, -84251, 209873, -401, -75373, 49724, 44498, 97146, 28533, -259268, -498484, -179932, -79366, 44529, -15463, 74787, 371917, 119507, -7103, -75145, -313084, 41636, -267394, -71939, 92202, 18040, -39680, -46675, 46634, -348481, -24642, -310037, 109091, -1300, -207287, -355094, -177133, 246946, -243249, 3322, -118183, -123229, -59686, 56189, 148762, -129910, -315067, -130788, 171594, 219032, -132313, 57178, -284253, -39912, 34217, 38192, 288672, -35351, 46803, 79918, -82649, -143008, -73918, -37220, 308733, 154740, -23774, 62710, -327977, 263875, -86177, -93490, -352364]
10657c52364c606m1889A34511c33354B02605F6389b30149A38702a00994k7711
10647a28705I2034a03646C201d560m0333j07600a8975r0074m1945A28894K6705
10636A55599f713B12691b32211P3707F6553J15923c24773J41780M7589p7061K7238
10625a85227Q1811L4672j57151O0786D7114b42366j33057a59047B92847a57348
10614A82742c3869j6298E6222g2778j65301a06861l6420C52640e4168G6435J18715
10603A95150c29678j65360a27538m9542h2578k03046f5324F7790O1849Q4928g6000
10591h9866A05659a3325j66197O2912D8656b36194a791k48890P2672O79c025j499
10579d524r2321B33441a09128Q574j84811e3542C20835G8574b64512G781a41995
$$ y = [-352364, -3606, -45495, 134511, -333354, 202605, 66389, -230149, 138702, -100994, -128705, 92034, -103646, 3201, -4560, -44893, -152493, -18975, -109049, -150994, 128894, 155599, -6713, 212691, -232211, -158504, 66553, 182476, -324773, -182993, -135404, -212465, -185227, -103416, -68744, -225895, -165109, 47114, -242366, -375423, -159047, 292847, -157348, 182742, -33869, -50167, 56222, -72778, -238079, -106861, -143281, 352640, -54168, 76435, 195150, -329678, -495038, -127538, -177080, -82578, -285624, -65324, 67790, 129639, 214567, -76000, -89866, 105659, -13325, -179522, -116610, 48656, -236194, -1791, -250681, -178009, -177330, -3025, -4524, -96845, 233441, -109128, -100554, -285365, -53542, 320835, 78574, -264512, 7781, -141995]
10567F5058a25893A50621a4992A73544b56309B09126a60384D7198D227J96463
10557B00690a50856L7280k85I9618D3242b90948E1832a0494I0428a92620R4639
10546i7981c0856m1214p8892B20612A01500J8770B8900L5355B5854J48185a96994
10534g1962n6226A09283a10573C7629f4318A0707K18976A11190R373M5997l4558
10523A32002c538l1445E6445d8959l18051J04186C3020i4359L045l32737d6475
10511H4413h1796b6734n418j34450j2721G516b64275A82394B0687d5168j312A11676
10498a49162k7679A13619N8808C801Q3675c28617f2581m0961l01300a05728K3274
10487h2454q9608e4974j14966I7810a9004B73367a26361A26521a40957C43000
$$ y = [65058, -125893, 150621, -14992, 173544, -256309, 209126, -160384, 47198, 4227, 200690, -150856, -113576, -113861, 99618, 43242, -290948, 51832, -10494, 90428, -192620, -97981, -30856, -72070, -150962, 220612, 101500, 120270, 28900, 64255, 25854, 174039, -196994, -71962, -128188, 109283, -110573, 37629, -64318, 10707, 229683, 111190, 120563, 166560, 132002, -3538, -34983, 56445, -48959, -367010, -262824, 33020, -94359, -91314, -424051, -46475, 84413, -81796, -26734, -32152, -166602, -179323, 7516, -264275, 182394, 20687, -45168, -46480, 111676, -149162, -176841, 113619, 172427, 3801, 87476, -328617, -62581, -103542, -404842, -105728, -82454, -172062, -54974, -169940, 97810, -19004, 273367, -126361, 126521, -140957, 343000]
10476C39829E3209M00134j31961M3710K7707p6971b39110O2707A62955h2870A01191
10464c25600h317C11772c87688J55267a1635A5736a11849M8091j42843B5621K00909
10453B26530F8648N9027b86237C5951a94387p6527H8067k5955e1980n8888A4500
10441A46409A0729a98608e7845b6058H3574b56602e7146A54474g651p2100j77294
10430b57045a00956p6843O7019A21915j1195a18221N2438A8195e6382E0275a43362
10418a23255l3767J6742P182f0904K1245j34211d0935n0683O552C19196b9671
10406A37718b02906l6734A68203c99530H5990e8405l09657a74745m1521B16755
10395C1900o788K23812a42917d3575G8163a70933C09012A15539O9192L1739j6123
$$ y = [339829, 53209, 453343, 321382, 365092, 392799, 315828, -239110, -176403, 162955, -82870, 101191, -325600, -8317, 311772, -387688, -232421, -11635, 15736, -111849, -63758, -206601, 25621, 226530, 68648, 127675, -286237, 35951, -194387, -270914, 88067, 62112, -51980, -110868, 14500, 146409, 10729, -198608, -57845, -26058, 83574, -256602, -57146, 154474, -7651, -79751, -257045, -100956, -177799, -110780, 121915, 110720, -118221, -65783, 18195, -56382, 50275, -143362, -123255, -157022, -140280, -133098, -60904, -39659, -173870, -40935, -91618, -85066, 319196, -29671, 137718, -202906, -239640, 168203, -399530, 85990, -58405, -368062, -174745, -216266, 216755, 31900, 25112, 248924, -142917, -43575, 78163, -170933, 309012, 115539, 184731, 216470, 200347]
10384B00347l0364c7882r3451I2378j025J52648J65231a28767p358D84977j85109
10373B99868P5275A10422K70469L10658k42733j02733J48308A22938M74032o7547
10363E29423J3712K49318C47662m8577J7510J72501j14074J53247F9909M5193
10353A15102N3670J25101E1183M02351L01544j61466p0947j41190o7949d043B80213
10341E11528A36285L4980N2822N8257G8194Q0218E597J08383K20167c0820G414
10329a01967B71570i8639J7403B56673i5764R479A22794R785M1294K05961K5397
10318D05231n6109B5960K25589f4621A57322J3566b46658B93345L6175l5477A28738
10306F8419c633B44949a1058D7870J79022a97841B48828f4010j21303G9329d37376
$$ y = [200347, 169983, -37882, -131333, 92378, 91353, 244001, 409232, -128767, -136125, 484977, 299868, 375143, 110422, 380891, 691549, 448816, 346083, 494391, 122938, 596970, 529423, 543135, 792453, 347662, 299085, 316595, 489096, 375022, 528269, 69909, 115102, 168772, 293873, 51183, 453534, 755078, 593612, 522665, 381475, 313526, -4043, 280213, 511528, 136285, 171265, 224087, 282344, 78194, 158412, 5597, 113980, 334147, -30820, 7414, -101967, 271570, -98639, -81236, 256673, -95764, -86285, 122794, 132579, 173873, 379834, 405231, 349122, 25960, 251549, -64621, 157322, 170888, -246658, 293345, 329520, 294043, 128738, 68419, -3633, 244949, -11058, 47870, 226892, -197841, 248828, -64010, -185313, 79329, -437376]
10294A58919h4993C49166e438D18976b7514A75250C0051c82264f2141j76623d9424
10282A8605c12202D66K41260a33370q5428G2586a25533f0718j39930h3422A88533
10270b4976A01610O6791N023d0627l40454d3726r7015A12122a61907F127f0580
10258a25129m3227D3758L8548c24420F6126L39491K76794j07720B57273A07289
10247I8196d6716C31617A25740A0724M1905M2661f5716k37495b3140r6176B19524
10235B69110l7312a23788n3613j86795a0071k05724I3023b88327J39833A65282
10224b76973C3066b16299i6783j14059B6790O1272a5783B1033L28500h6350A89355
10212b18060J04246l02214a84114n7398A07241a76504r19A73085d4099j26845
$$ y = [158919, -84993, 349166, -5438, 418976, -27514, 175250, 30051, -382264, -62141, -238764, -49424, 18605, -312202, 466, 241726, -133370, -218798, 72586, -125533, -60718, -200648, -83422, 188533, -24976, 101610, 168401, 173424, -40627, -381081, -43726, -140741, 112122, -161907, 6127, -60580, -125129, -168356, 43758, 82306, -324420, 66126, 405617, 682411, 574691, 257273, 107289, 98196, -46716, 331617, 125740, 10724, 52629, 95290, -65716, -303211, -23140, -119316, 219524, 269110, 231798, -123788, -177401, -364196, -10071, -215795, 93023, -288327, -148494, 165282, -276973, 33066, -216299, -96783, -210842, 26790, 88062, -15783, 21033, 349533, -86350, 189355, -218060, -113814, -416028, -184114, -241512, 107241, -176504, -177423, 173085, -44099, -170944]
10202a70944f1155j76841J15269p1605B12112b62230B7451b36295P6438A40881
10191A2666h3105k1607j17627q5ER6691C7441K68097a69123j70962A37556K20631
10179C58187a06602j03709b2350j36298r5382r6260D9388b54967A8322J13298
10169A31620a44073k05125B14033b76134r1395c3993j16562n612c1286k19886
10159b51172j31075D42634j53206a84924d3098r8202G1152a93693A72570o5427
10149A07143J68609b77542P2737G4387a50244m0670l43250F6732L35598A53557
10138f1389j09618g9804j42230C51437a67463j20284A65122b48538d5671l7498
10128h3169K1073k17073d910l01914f1645I9936H131a83090P1400r3689K3889
$$ y = [-170944, -61155, -237996, -122727, -194332, 212112, -262230, 27451, -236295, -159857, 140881, 12666, -83105, -104712, -222339, -222424, 5, 96696, 37441, 305538, -169123, -340085, 137556, 358187, -106602, -210311, -22350, -158648, -254030, -350290, 49388, -254967, 18322, 131620, -144073, -349198, 214033, -276134, -367529, -33993, -150555, -156167, -31286, -251172, -382247, 442634, 289428, -184924, -43098, -141300, 71152, -193693, 172570, 107143, 275752, -277542, -204805, 74387, -150244, -190914, -534164, 66732, 402330, 153557, -61389, -171007, -79804, -222034, 351437, -167463, -287747, 165122, -248538, -45671, -83169, -62096, -279169, -4910, -306824, -61645, 99936, 8131, -183090, -111690, -205379, -181490]
10117a81490B49711a46279B20222b37304A1532J85234d53647g211k1098A26135
10106h9403J8110B48823a40007G6493c35621i9533j714l404j2771m86523D593
10094a76719I2885h1427j14889O3059j60530C7263J990b652m02320A27664c59479
10082H1554J8324J20014e6080J871A90971o2719K0601a5201B44772o6353b6785
10070g8726p4778a5453F8459a56071K6396c8811a0922j17887M6082A2488K22464
10059B34952A4406L1957j3085p137L07306c17878A25566c49397d8949j29538p6457
10048b54944J25897r4461A57777b25005K0522q6530G700a97819G2218R331C2039
10036d9212j55741B06555a13835j57754D5938b92447A07300f1684n1007A17187
$$ y = [-181490, 249711, -146279, 220222, -237304, 11532, 196766, -453647, -7211, -28309, 126135, -89403, -71293, 248823, -140007, 76493, -335621, -99533, -101247, -104651, -117422, -603945, 4593, -176719, 92885, -81427, -196316, -133257, -293787, 37263, 39253, -2652, -404972, 127664, -359479, 81554, 99878, 219892, -56080, -54209, 190971, 128252, 148853, -15201, 244772, 178419, -26785, -78726, -153504, -15453, 68459, -156071, -129675, -38811, -10922, -128809, -82727, 12488, 234952, 14406, 46363, 33278, 26141, 333447, -317878, 125566, -349397, -48949, -178487, -254944, -129047, -223508, 157777, -225005, -204483, -291013, 7700, -197819, 72218, 81549, 32039, -49212, -204953, 206555, -113835, -271589, 45938, -292447, 107300, -61684, -112691, 117187]
10025b10636N2385N7715k33494J48033j29971L8831J21749e08A51532a83901a7002
10013A6918a5448B38399G3639h4230j48735A87228K0431G5260b02165G3984j9191
10002E4793b41089P910i9574L2653j03761i039k8797k90643i2027H3939a66519
9990g3220c0232n04156b2016D0991j7784a2912k7440B2169b68736D5204a44150
9978a36805k3481d0862p0170C7965a58861b6558E2372d0060C1926b16070i8140
9966d4098F6202b75851q5903A26283c06595J47861D5184J7322A1743b98430B64694
9954A21126J48498G1255b18120d9933a3619j00628G6233e6287A54900a77954l5707
9943b13661A25646a30465F0205A543J99003b59157D0801b47752A9097b7517j80715
$$ y = [-210636, -158251, -100536, -334030, -185997, -315968, -277137, -155388, -508, 151532, -183901, -17002, 16918, -15448, 238399, 73639, -84230, -232965, 187228, 207659, 75260, -202165, 73984, 54793, -241089, -233179, -99574, -66921, -170682, -9039, -37836, -328479, -92027, 83939, -166519, -73220, -30232, -534388, -22016, 40991, 23207, -12912, -40352, 22169, -268736, 45204, -144150, -136805, -160286, -40862, -111032, 37965, -158861, -26558, 52372, -40060, 31926, -216070, -98140, -44098, 66202, -275851, -361754, 126283, -306595, -158734, 45184, 62506, 11743, -298430, 264694, 121126, 269624, 71255, -218120, -49933, -13619, -114247, 76233, -56287, 154900, -177954, -213661, 125646, -130465, 60205, 1543, 200546, -259157, 40801, -247752, 19097, -27517, -208232]
9932b08232f7579j9390r1230B7756J53805A8794a54575D0938a66996b6009D3877
9920a03631M7562k15487e9603k53609G8779a56312m3214k14809a91169K1950O1105
9909a08114E1446b58621A03267l5591J8213b8492B2530O0323J7518a04632E0245
9897c44590J22002f7355h423j55639d607G6596a4546k42870h55l65574J23171
9886b43258N6131C9970b36071B7854d06131J73135M2176E44K48819a95622A62974
9874B0604h1497k73688A8601L09298a91230g6853j58370P4160P9946B16701D7078
9862D80443c32608A37853m679a78317p541P4580k11788d1918C15833j26646d13101
9850A95188b61531J15521A95522d9161j93318A79573e0680k8023a6402C94328
$$ y = [-208232, -67579, -86969, -178199, 27756, 181561, 18794, -154575, 40938, -166996, -26009, 43877, -103631, -56069, -271556, -59603, -313212, 78779, -156312, -199526, -414335, -191169, -169219, -108114, 51446, -258621, 103267, 67676, 85889, -28492, 22530, 82853, 100371, -104632, 50245, -344590, -222588, -67355, -8423, -164062, -4607, 76596, -14546, -257416, -855, -366429, -243258, -187127, 39970, -236071, 27854, -406131, -232996, -190820, 544, 249363, -195622, 162974, 20604, -81497, -355185, 18601, 327899, -191230, -76853, -235223, -161063, -81117, 216701, 47078, 480443, -332608, 137853, 133174, -178317, -185858, -111278, -323066, -41918, 315833, 189187, -413101, 195188, -261531, -146010, 195522, -49161, -242479, 179573, -50680, -78703, -16402, 394328]
9839a88569d78k51573d8394A54706a12567A79032B274J68625M7503i5527k5127
9828a20654r9927j4813J609j8320j2392A57337a76991P895k504B3306a0813j7851
9816b8664B00196l1360a22370M1078j28538J5528G1732h8374k01141H4038a30940
9804b88311a20400I3803e8090D30875H065N8608K86751j62931a54563g1604j20083
9793a91687l076k07055h3778j62498R4332H1492B8206N9541J8461e07780b3995
9781a44203L4558A13884a54425j11418B1704J6095K44886H2995J58633c5702p1383
9770a07085B64803B0561N407K6299i5656A73276D1435J43660c27594J45703g3065
9758H740M1848b23282a2170o0304b8104r7492j09678J02565A37471o6453j7510
$$ y = [-188569, -478, -252051, -48394, 154706, -112567, 179032, 2274, 170899, 218402, -95527, -120654, -220581, -235394, -233785, -252105, -264497, 157337, -176991, -169096, -171600, 23306, -10813, -28664, 200196, 168836, -122370, -81292, -209830, -194302, 71732, -88374, -289515, 84038, -130940, -288311, -120400, 93803, -58090, 430875, 8065, 66673, 353424, 190493, -154563, -71604, -191687, -194763, -401818, -83778, -246276, -151944, 81492, 28206, 87747, 106208, -507780, -23995, -144203, -109645, 113884, -154425, -265843, 21704, 37799, 282685, 82995, 241628, -35702, -107085, 264803, 20561, 25968, 52267, -95656, 173276, 41435, 185095, -327594, -181891, -73065, 8740, 50588, -223282, -12170, -72474, -28104, -125596, -235274, -132709, 137471, 71018, 53508]
9747E3508c8658j34003O820G1468h6343A17597a94169M4518L7857l3039o1612
9736b06445e8429A58672e4963f226l1046m04524J60922a32921q9491a9888k9942
9725d9830F9727b79858a0575j38728C8441a19580r4716O6894l28510c105l6488
9714c9593B34186b04128m3602A67580l8192b32386Q3079j01417J20419b362A81027
9702d0026I4787F608b77097O3039I1428J16388b42290A65822q422e1737B81650
9690B98304j43768E3761f4326p7615k83029J56133a15033L9590A37423f8311A06575
9678a82585A49802e3956G2044a04029B2976a7178n0827m5078I089d108A0507L6737
9666D7244b58335o6498B39882Q0110a29593O3553m545l6087a2511o2419A04632
$$ y = [53508, -38658, -172661, -165841, 71468, -86343, 117597, -194169, -149651, -111794, -144833, -206445, -58429, 158672, -54963, -6226, -37272, -441796, -280874, -132921, -222412, -19888, -49830, 69727, -279858, -10575, -149303, 38441, -119580, -214296, -147402, -475912, -3105, -39593, 234186, -204128, -247730, 167580, 129388, -232386, -149307, -250724, -130305, -2362, 181027, -40026, 94787, 6608, -277097, -214058, 91428, 207816, -242290, 165822, 157400, -51737, 281650, 298304, 154536, 53761, -64326, -141941, -424970, -268837, -115033, -75443, 137423, -68311, 106575, -182585, 149802, -53956, 72044, -104029, 22976, -17178, -68005, -113083, 9089, -4108, 10507, 47244, -258335, -324833, 239882, 319992, -129593, -66040, -70585, -106672, -12511, -74930, 104632]
9654a49567N9364k00988Q9177l1730r5378H9815a38222d0095G2197e8596G4837
9642h4735P7A53974g6492A10743a79519c9510h236j89720K0238h8178l3053B6143
9629a68515D0441e6911F6118a42148k11215A6491c61952a58091H2607a1358j74069
9618a85427A34828B4772P2045a52454c2064H0615P382h6702k45672Q4549a07245
9606b93197G5917G514d2987A13643b04591K9428C8583b59592J26823m5489A38162
9594c1791j92138B42402A05978k0507i6202I920L91903A86714C4727a08432b5563
9582a18772M9140k67519F2677J96945a04786m349n9280F9833A6126b78549j1156
9571b89705c3492j09965K7603q9913p6142A46052k8562a3743A45253b01530K247
$$ y = [-149567, -90203, -291191, -202014, -233744, -329122, 89815, -138222, -40095, 72197, -58596, 74837, -84735, -84658, 153974, -76492, 110743, -179519, -39510, -8236, -197956, -177718, -88178, -121231, 26143, -168515, 40441, -56911, 66118, -142148, -353363, 16491, -361952, -158091, 82607, -11358, -185427, 134828, 24772, 96817, -152454, -32064, 80615, 87997, -86702, -332374, -247825, -107245, -293197, 75917, 7514, -42987, 113643, -204591, -175163, 38583, -259592, -132769, -178258, 138162, -31791, -223929, 242402, 105978, 85471, -96202, 9920, 401823, 186714, 34727, -108432, -25563, -118772, -69632, -337151, 62677, 259622, -104786, -109135, -168415, 69833, 16126, -278549, -289705, -33492, -143457, -115854, -205767, -281909, 146052, 117490, -13743, 145253, -201530, -199283]
9560a99283r5093B298d13318C59649a1586k96218A6917e17066i1997j5864n5993
9549a63854p0996B40644b9509A74770c22263B91248j14410c5004j24639C2653
9538a20922K3463b5815l8658j83299R6490B53726i8576A54672b5144n4002F35
9526c9568k31333A42243g1539H343a22056B24380g4597j71292H3195l5227b30728
9514A04692j359N6220n53n6556L0278C0713N5965k383J17928Q9121n9796g6037
9501B30207b68126q4085I9847C0076L5132a70361j04107C4328e8796C0645o654
9490B3991a41596k8479e9539k07122f903p2600g792D7348b11644E0156a01091
9478e8507j00044A5169b7608q4581a8125j03926r6565b7177A4088a95696B60757
$$ y = [-199283, -294376, 2298, -413318, 359649, -11586, -307804, 16917, -517066, -91997, -107861, -163854, -234850, 240644, -29509, 174770, -322263, 291248, 176838, -35004, -159643, 32653, -120922, -97459, -25815, -64473, -247772, -151282, 253726, -98576, 154672, -25144, -79146, 635, -39568, -270901, 142243, -71539, 8343, -122056, 224380, -74597, -245889, 83195, 47968, -230728, 104692, 103333, 159553, 159000, 102444, 132722, 30713, 86678, 84295, 202223, 291344, 231548, -76037, 230207, -268126, -352211, 99847, 30076, 65208, -170361, -274468, 34328, -58796, 30645, 23991, -141596, -170075, -59539, -266661, -6903, -79503, -7792, 47348, -211644, 50156, -101091, -58507, -158551, 15169, -27608, -112189, -18125, -122051, -218616, -27177, 14088, -195696, 260757]
9466e3701n2978E880L3844J32224a84618d4654A99670d00426a6662A6570a29237
9454A29144L3373D6758i4204k09632A93942a13544M1694H4624a89801C46292b32451
9442a24107P392k26135a26005A0573K0321c4609B80048a76186M6627a6482j41888
9431a58370k3846B04484b9679k91364a23753a5938C26184A35159a95680g8737
9420b57796N0185f1432m0304j00422J2149C5811f4163j72039A63044D8634J58423
9409B07057a31364B70a03158l95208a2827E6250c04168J28876j6943O6112k11985
9398c38108h2929j20439B55414f8707A03940b1447j3991m324O743J0651k53752
9387b76120L4633P9439B34320d63974a6415k5874o6990r1609b338k5748m50708
$$ y = [-53701, -106679, 5880, 39724, 171948, -184618, -44654, 199670, -400426, -16662, 16570, -129237, 129144, 162517, 46758, -94204, -303836, 193942, -113544, -71850, 84624, -189801, 346292, -232451, -124107, -116715, -342850, -126005, 10573, 30894, -34609, 280048, -176186, -129559, -16482, -158370, -182216, 204484, -29679, -321043, -123753, -15938, 326184, 135159, -195680, -78737, -257796, -207611, -61432, -101736, -202158, -190009, 35811, -64163, -236202, 163044, 48634, 207057, -131364, 270, -103158, -498366, -12827, 56250, -304168, -175292, -192235, -126123, -338108, -82929, -203368, 255414, -68707, 103940, -21447, -35438, -39762, -33019, -22368, -276120, -241487, -162048, 234320, -463974, -16415, -42289, -109279, -200888, -2338, -28086, -478794]
9376d78794B74266a03186D3660c13599A46531e008p3130G3475f0493C9738a61841
9364a53074K4391E0277c13117A18547L0976F8864e060I6105B9294F756a25012
9352a01000c851k22957B8006b21571a03527b1968k21671B21041j09814b5417o8038
9341i3455r197c9110A34905b24607c5052p8608A74177C5758a7113j24497G3310
9329b29919f3852o3450A11165c40403h66l49865R3406h8177a1892j03209n8263
9318a73364l8194B30101i6155k17907q1811A40636a19959A48548a82500c0625
9307d39736A0393d01509J78640B78780F1890L89347a05937q9822F1113a27631
9296A05595O8155J71713b45940M8768K7702C945P9150c5264A76474b98793A63527
$$ y = [-478794, 274266, -103186, 43660, -313599, 146531, -5008, -78138, 73475, -60493, 39738, -161841, -153074, -128683, 50277, -313117, 118547, 149523, 68864, -5060, 96105, 29294, 6756, -125012, -101000, -3851, -226808, 28006, -221571, -103527, -21968, -243639, 221041, 111227, -25417, -93455, -102652, -39110, 134905, -224607, -35052, -113660, 174177, 35758, -17113, -141610, 73310, -229919, -63852, -127302, 111165, -340403, -866, -350731, -257325, -88177, -11892, -115101, -173364, -211558, 230101, -96155, -314062, -395873, 140636, -119959, 148548, -182500, -30625, -439736, 10393, -401509, -222869, 278780, 61890, 451237, -105937, -195759, 61113, -127631, 105595, 173750, 345463, -245940, -197172, -169470, 3945, 83095, -35264, 176474, -298793, 163527]
9284a63045r1993A32279a2377k17327E1123e696k51156E8341c2097b940k3007
9273b5947r5685B8784b48490p4403B22321F1965K7759a25116A246K63516a70700
9261B04836q1244b008k21763R1264B77765a71415F0487f7878j40513R6521A56799
9249f4360o2259E1898K6325i7256c5706B5108g1055j37827B5126J62952b38128
9237c6657n26745a0629I2724A6648D141K08094c98621g7748A26637c84638b9606
9225D6491c5053j53115L442m6509G587J13059m3535B7751i2902k00579e1763A8877
9212a73047d8112A04004g0666j5561d1405j30699b2941k52803C6221K7037a62628
9200A20824b86782A7735a35083A82053c0366A19651Q6851a64741A84078a05569
$$ y = [-163045, -255038, 132279, -12377, -229704, 51123, -5696, -256852, 58341, -32097, -2940, -25947, -121632, 28784, -248490, -322893, 222321, 61965, 89724, -125116, 1246, 264762, -170700, 204836, 123592, -2008, -223771, -132507, 277765, -171415, 60487, -67878, -208391, -111870, 156799, -64360, -126619, 51898, 78223, -97256, -35706, 25108, -71055, -208882, 25126, 188078, -238128, -36657, -563402, -10629, 92724, 16648, 4141, 212235, -398621, -77748, 126637, -384638, -29606, 46491, -35053, -188168, -184726, -231235, 7587, 120646, 77111, 27751, -92902, -293481, -51763, 18877, -173047, -48112, 104004, -70666, -86227, -41405, -172104, -22941, -275744, 36221, 63258, -162628, 120824, -286782, 17735, -135083, 182053, -30366, 119651, 206502, -164741, 184078, -105569]
9189H4498n032f1001l35020A23260a91169A6132F320O4402a10660L1153j56908
9178b36415A09763f6719j1361G344c49371o5928f8097J7958C2477d7035H3205
9166b33982J11322e0002C534e9633o2763k78817a58412H1769K00047a50308K2316
9155a27992j7333a0193I5277j2356O721e6508k26034L6262i4659D0535J22015
9144A62550a19512j22664j0744a24996B04418a97354A2198P0799a34251J5211
9134a19040d6630k79044f4254k99934B37276g515m52279e959A80286J44406A51170
9122a54017K8480e9104A25101e5002k73016a194k43678E3597a57339p5032O7446
9111a64925j18463A80874E3532a74773B52614A09776d22397f4660B82914F6886
$$ y = [84498, 79466, -61001, -396021, 123260, -191169, 16132, 6320, 70722, -110660, -79507, -236415, 109763, -66719, -78080, 7344, -349371, -415299, -68097, -50139, 32477, -47035, 83205, -233982, -122660, -50002, 3534, -59633, -122396, -401213, -158412, 81769, 281816, -150308, -127992, -145325, -10193, 95277, 82921, 89642, -56508, -282542, -246280, -94659, 40535, 162550, -119512, -242176, -252920, -124996, 204418, -197354, 12198, 82997, -134251, -119040, -46630, -325674, -64254, -364188, 237276, -7515, -459794, -5959, 180286, 324692, 151170, -154017, -125537, -59104, 125101, -55002, -328018, -1194, -244872, 53597, -157339, -232371, -164925, -283388, 180874, 53532, -174773, 252614, 109776, -422397, -64660, 282914, 66886]
9100b10163j1281k72822a81491A47333c97943e5645r8345A24903d48936b13582
9089E3557B3878a15199e50k77400a32196n8785P3929d119k00732j70830a42523
9077B5957K10609a0747j06247o5643Q8760o851k47106g8048j56570i5735C9913
9065a91257f1922j00267i908A20480d43327a90103g0602J8885D7584g439k73493
9054b80932J39875n2054r0972A8654b74772E1366J29278a14155k0568n0277A74859
9042a56377C57451G7745M2510a19749F3889b04522D260e2216l31431B2354b97339
9030c11024A2344a45839E8217a2587k26967D55241A60655b15946A55756o0941
9020I4815b33923A8141a70953A03607a86637F8540L64533a67646A0159a26597
$$ y = [-210163, -221444, -494266, -181491, 147333, -397943, -55645, -153990, 124903, -448936, -213582, 53557, 23878, -115199, -550, -277950, -132196, -190981, -117052, -4119, -204851, -375681, -142523, 25957, 236566, -10747, -116994, -182637, -93877, -100728, -347834, -78048, -234618, -95735, 39913, -191257, -61922, -162189, -9908, 120480, -443327, -190103, -70602, -51717, 47584, -7439, -280932, -141057, -193111, -284083, 18654, -274772, 51366, 180644, -114155, -134723, -185000, 174859, -156377, 357451, 77745, 120255, -119749, 63889, -204522, 4260, -52216, -383647, 22354, -297339, -311024, 12344, -145839, 58217, -12587, -239554, 455241, 160655, -215946, 155756, 94815, -233923, 18141, -170953, 103607, -186637, 68540, 433073, -167646, 10159, -126597]
9009I9564b65091A74820B351L3029K95068o7022K4647C6187e9515n0592a7758
8997c40689g808k0969j96722b4627n9666a2164B4891K04966C8458f6568j28412
8986a94980A74115b04586C216i3406l57274B87686E3188a60935A77663B7323a42924
8974a63531J4441a6918n0436l2302E6227g3177C32551b51284K0039A2142b53985
8962d7682C0093b64156e3231A33481e6913j23236g0702E636d71200J53978C49396
8950A27420e4452l9644C35328G0193j8848J17503c78205f4696A24598b58320k67
8939b58587E391N9747b87358c0747F6346c8407A7480K82968f0748A52076h5766
8927c4974I0418L26063D9352L32638J50492J21071J030944K811645J2277025G167544
$$ y = [99564, -265091, 174820, 2351, 35380, 330448, 263426, 288073, 36187, -59515, -110107, -17758, -340689, -7808, -28777, -225499, -24627, -84293, -12164, 24891, 229857, 38458, -66568, -194980, 174115, -204586, 3216, -93406, -450680, 287686, 53188, -160935, 177663, 27323, -142924, -163531, -149090, -16918, -67354, -99656, 56227, -73177, 332551, -251284, -231245, 12142, -253985, -47682, 30093, -264156, -53231, 133481, -56913, -180149, -70702, 5636, -471200, -317222, 349396, 127420, -54452, -94096, 335328, 70193, 51345, 168848, -378205, -64696, 124598, -258320, -258587, 5391, 65138, -287358, -30747, 66346, -38407, 17480, 300448, -60748, 152076, -85766, -34974, 90418, 416481, 49352, 381990, 532482, 653553, 1684497, 4496142, 16773167, 7167544]
8916A253432C51839E8081L65817A4903a95208A23143c35894f1778A52637f878
8905E14918l8065k02502q1485a00955B13746c12765a14067G6842a20268j25866
8895b46134B38721d6243a8571j68448A72007a09953j15416J6620c0396j04673
8885a35069H3427a14051A1673a60866d7476j28759L7903L5576G2083f7138j64866
8874b32004d8061b3608A94006h8108B7384g8028b6327j02415A60360b21921E6712
8862A39561a22883j0899A35393O8018M185h8370l4013c8128j84495Q9285Q818
$$ y = [1253432, 351839, 58081, 423898, 14903, -195208, 123143, -335894, -61778, 152637, -6878, 514918, 476853, 274351, 192866, -100955, 213746, -312765, -114067, 76842, -120268, -246134, 238721, -46243, -18571, -187019, 172007, -109953, -225369, -208749, -30396, -135069, 83427, -114051, 11673, -160866, -47476, -176235, -138332, -102756, 72083, -67138, -232004, -48061, -23608, 194006, -88108, 27384, -78028, -26327, -128742, 160360, -221921, 56712, 139561, -122883, -133782, 135393, 203411, 207596, -88370, -122383, -38128, -222623, -133338, -124520]
$$ [...]
##END NTUPLES=NMR SPECTRUM
##END=
