
##TITLE=AC1205_HSMAH12053_5946155_tolVC2PjQu
##JCAMPDX= 6.0         $$ Bruker NMR JCAMP-DX V2.0
##DATA TYPE= NMR SPECTRUM
##DATA CLASS= NTUPLES
##ORIGIN= BRUKER
##OWNER= Administrator
$$ 1.72 TOPSPIN		Version 2.1
$$ 2012-04-10 19:29:08.156 -0500  Administrator@TOPSPIN
$$ Compression mode = diff/dup
##.OBSERVE FREQUENCY= 400.13188235
##.OBSERVE NUCLEUS= ^1H
##.ACQUISITION MODE= SIMULTANEOUS (DQD)
##.ACQUISITION SCHEME= undefined
##.AVERAGES= 8
##.DIGITISER RES= 22
##SPECTROMETER/DATA SYSTEM= spect
##.PULSE SEQUENCE= zg30
##.SOLVENT NAME= COFFEE_meoh
##.SHIFT REFERENCE= INTERNAL, COFFEE_meoh, 1, 14.98061
##AUDIT TRAIL= $$ (NUMBER, WHEN, WHO, WHERE, PROCESS, VERSION, WHAT)
$$ ##TITLE= Audit trail, TOPSPIN		Version 2.1
$$ ##JCAMPDX= 5.01
$$ ##ORIGIN= Bruker BioSpin GmbH
$$ ##OWNER= Administrator
$$ $$ C:\Bruker\TOPSPIN/data/COFFEE/nmr/AC1205_HSMAH12053_5946155_tolVC2PjQu/10/pdata/1/auditp.txt
$$ ##AUDIT TRAIL=  $$ (NUMBER, WHEN, WHO, WHERE, PROCESS, VERSION, WHAT)
(   1,<2012-04-10 19:28:56.906 -0500>,<Administrator>,<TOPSPIN>,<go>,<TOPSPIN 2.1>,
      <created by zg
	started at 2012-04-10 19:27:49.437 -0500,
	POWCHK enabled, PULCHK disabled,
       configuration hash MD5:
       1A 1E CE 29 27 FD 77 03 67 4E F0 E3 C4 B2 CB 90
       data hash MD5: 64K
       0A 31 E0 64 C2 3F FB 11 4A 65 06 04 92 4D 13 E3>)
(   2,<2012-04-10 19:29:00.812 -0500>,<Administrator>,<TOPSPIN>,<proc1d>,<TOPSPIN 2.1>,
      <Start of raw data processing
       efp LB = 0 FT_mod = 6 PKNL = 1 PHC0 = 0 PHC1 = 0 SI = 32K 
       data hash MD5: 32K
       85 44 C0 94 C6 F9 F2 04 DF BB D5 F2 DD 96 29 5C>)
(   3,<2012-04-10 19:29:01.468 -0500>,<Administrator>,<TOPSPIN>,<proc1d>,<TOPSPIN 2.1>,
      <pk PHC0 = 209.4763 PHC1 = 0 
       data hash MD5: 32K
       27 B3 10 EC 20 B6 1E D0 60 20 4C E9 FB C3 7B C5>)
(   4,<2012-04-10 19:29:01.828 -0500>,<Administrator>,<TOPSPIN>,<proc1d>,<TOPSPIN 2.1>,
      <abs ABSG = 1 
       data hash MD5: 32K
       85 67 9B 1C DE C2 41 43 65 F7 04 9C 9B 4E 31 2B>)
(   5,<2012-04-10 19:29:01.953 -0500>,<Administrator>,<TOPSPIN>,<proc1d>,<TOPSPIN 2.1>,
      <abs ABSG = 2 
       data hash MD5: 32K
       F1 0C F9 04 0A 73 E7 3D 1A 79 B7 8F B8 2B 0D B7>)
(   6,<2012-04-10 19:29:02.062 -0500>,<Administrator>,<TOPSPIN>,<proc1d>,<TOPSPIN 2.1>,
      <abs ABSG = 3 
       data hash MD5: 32K
       5F 4F 2B 2A 21 3D A1 14 39 46 7B 53 50 11 F0 57>)
(   7,<2012-04-10 19:29:02.156 -0500>,<Administrator>,<TOPSPIN>,<proc1d>,<TOPSPIN 2.1>,
      <abs ABSG = 4 
       data hash MD5: 32K
       C6 1F 42 43 B1 7B F4 84 9C 1B E4 CC E5 CA 8D B1>)
(   8,<2012-04-10 19:29:02.203 -0500>,<Administrator>,<TOPSPIN>,<proc1d>,<TOPSPIN 2.1>,
      <abs ABSG = 5 
       data hash MD5: 32K
       D2 1E 13 3C F4 46 36 B0 F3 12 B2 25 78 FC DB 60>)
$$ ##END=
$$ 
$$ $$ hash MD5
$$ $$ 3B 36 B0 68 E3 0F 74 8A 7F 3B EB 64 21 B4 64 1D
##$RELAX= 
##$RELAX= 
##$RELAX= 
##$RELAX= 
##$RELAX= 
##$RELAX= 
##$RELAX= 
$$ Bruker specific parameters
$$ --------------------------
$$ [...]
##$TP= (0..7)
150 150 150 150 150 150 150 150
##$TP07= 0
##$TPNAME0= <>
##$TPNAME1= <>
##$TPNAME2= <>
##$TPNAME3= <>
##$TPNAME4= <>
##$TPNAME5= <>
##$TPNAME6= <>
##$TPNAME7= <>
##$TPOAL= (0..7)
0.5 0.5 0.5 0.5 0.5 0.5 0.5 0.5
##$TPOFFS= (0..7)
0 0 0 0 0 0 0 0
##$TUNHIN= 0
##$TUNHOUT= 0
##$TUNXOUT= 0
##$USERA1= <user>
##$USERA2= <user>
##$USERA3= <user>
##$USERA4= <user>
##$USERA5= <user>
##$V9= 5
##$VALIST= <valist>
##$VCLIST= <CCCCCCCCCCCCCCC>
##$VD= 0
##$VDLIST= <DDDDDDDDDDDDDDD>
##$VPLIST= <PPPPPPPPPPPPPPP>
##$VTLIST= <TTTTTTTTTTTTTTT>
##$WBST= 1024
##$WBSW= 4
##$XGAIN= (0..3)
0 0 0 0
##$XL= 0
##$YL= 0
##$YMAX_a= 518458
##$YMIN_a= -646549
##$ZGOPTNS= <>
##$ZL1= 120
##$ZL2= 120
##$ZL3= 120
##$ZL4= 120
##$ABSF1= 14.98061
##$ABSF2= -5.57192
##$ABSG= 5
##$ABSL= 3
##$ALPHA= 0
##$AQORDER= 0
##$ASSFAC= 0
##$ASSFACI= 0
##$ASSFACX= 0
##$ASSWID= 0
##$AUNMP= <proc_prof1d_extract_pilot.lims>
##$AXLEFT= 0
##$AXNAME= <>
##$AXNUC= <1H>
##$AXRIGHT= 0
##$AXTYPE= 0
##$AXUNIT= <>
##$AZFE= 0.1
##$AZFW= 0.1
##$BCFW= 0
##$BC_mod= 0
##$BYTORDP= 0
##$COROFFS= 0
##$CY= 15
##$DATMOD= 1
##$DC= 0
##$DFILT= <>
##$DTYPP= 0
##$F1P= 0
##$F2P= 0
##$FCOR= 0.5
##$FTSIZE= 32768
##$FT_mod= 6
##$GAMMA= 0
##$GB= 0
##$INTBC= 1
##$INTSCL= 1
##$ISEN= 128
##$LB= 0
##$LEV0= 0
##$LPBIN= 0
##$MAXI= 10000
##$MC2= 0
##$MEAN= 0
##$ME_mod= 0
##$MI= 0
##$NCOEF= 0
##$NC_proc= -8
##$NLEV= 6
##$NOISF1= 0
##$NOISF2= 0
##$NSP= 0
##$NTH_PI= 0
##$NZP= 0
##$OFFSET= 14.98061
##$PC= 1
##$PHC0= 209.4763
##$PHC1= 0
##$PH_mod= 1
##$PKNL= yes
##$PPARMOD= 0
##$PPDIAG= 0
##$PPIPTYP= 0
##$PPMPNUM= 2147483647
##$PPRESOL= 1
##$PSCAL= 4
##$PSIGN= 0
##$PYNMP= <proc.py>
##$REVERSE= no
##$SF= 400.13
##$SI= 32768
##$SIGF1= 0
##$SIGF2= 0
##$SINO= 400
##$SIOLD= 32768
##$SPECTYP= <>
##$SREGLST= <1H.CDCl3>
##$SSB= 0
##$STSI= 32768
##$STSR= 0
##$SW_p= 8223.68421052632
##$SYMM= 0
##$S_DEV= 0
##$TDeff= 65536
##$TDoff= 0
##$TI= <>
##$TILT= no
##$TM1= 0
##$TM2= 0
##$TOPLEV= 0
##$USERP1= <user>
##$USERP2= <user>
##$USERP3= <user>
##$USERP4= <user>
##$USERP5= <user>
##$WDW= 1
##$XDIM= 32768
##$YMAX_p= 461031714
##$YMIN_p= -681005
##$CURPLOT= <Network HP LaserJet P1505>
##$CURPRIN= <$Network HP LaserJet P1505>
##$DFORMAT= <normdp>
##$LAYOUT= <+/1D_H.xwp>
##$LFORMAT= <normlp>
##$PFORMAT= <normpl>
##$SURQMSG= 1
$$ End of Bruker specific parameters
$$ ---------------------------------
##NTUPLES= NMR SPECTRUM
##VAR_NAME=  FREQUENCY,     SPECTRUM/REAL,   SPECTRUM/IMAG
##SYMBOL=    X,             R,               I
##VAR_TYPE=  INDEPENDENT,   DEPENDENT,       DEPENDENT
##VAR_FORM=  AFFN,          ASDF,            ASDF
##VAR_DIM=   32768,         32768,           32768
##UNITS=     HZ,            ARBITRARY UNITS, ARBITRARY UNITS
##FACTOR=    0.250966925370066, 1,           1
##FIRST=     8223.43324360095, -25523,       -82994
##LAST=      0,             -48712,          -69217
##MIN=       0,             -681005,         0
##MAX=       8223.43324360095, 461031714,    0
$$ Real data points
##PAGE= N=1
##DATA TABLE= (X++(R..R)), XYDATA
$$ [...]
23779 -91497 -146478 161697 -185499 -47041 74527 247018 444368 -31290 -291941 -67004 -150832
23768 -150832 -286692 182017 -44844 -186355 -66280 -239011 -178331 20078 -311679 128125
23757 55922 268926 -178486 471958 120590 -129998 -64804 -27251 191993 -17663 117647
23746 130103 -155104 -291535 -280784 227122 -77556 100884 -126323 -311172 -104777 16648
23735 91232 -295751 -12259 -352161 52682 132543 241457 -111078 -202854 93206 103955 94610
23724 94610 26998 225172 -153887 11283 352897 75865 -184565 67722 91872 186655 -38023
23712 19675 -92475 87251 115375 260045 -144795 -143326 -119531 -159687 30597 476046 -100958
23700 102621 61484 -8678 -2086 151851 122569 -39604 -120927 111207 -52170 135299 38037
23688 107969 -140581 111080 39924 -120156 47117 -24541 -277541 108578 -196658 -62954
23677 -100333 -69310 -88903 -36921 160383 -16264 43784 38696 -45844 32627 -275695 75149
23665 -100706 -168649 40495 -66478 -108224 183731 -83869 198756 20565 219671 55104 -306686
23653 115692 128692 27589 -198029 -47224 84051 -3012 -163904 -10256 -59185 -186114 -114055
23642 -114055 -108957 -146263 27494 -55708 24698 -82133 -50648 -455715 -141306 31308 -253564
23630 -179334 -327733 229328 70129 -289818 -158664 -47092 -230330 -115936 -226147 115538
23619 -342739 50277 156710 -111681 -33196 160480 -292769 -90190 -214926 43690 -428148
23608 -23836 -180830 -369810 -189317 119516 -173650 -51436 -82939 -244369 -364732 176278
23597 156799 -181064 91251 -143855 -121420 76748 38400 -55733 -45173 -141304 277259 -13998
23585 75546 88482 -144340 282182 234359 322142 -152009 324836 -42449 367269 140236
23574 -37790 334844 54416 135551 5675 -3256 169261 -192914 47702 -65955 -116598 -115769 36817
23561 24023 41592 -265672 -106738 -65592 -250100 -506203 4546 -221633 -12502 -171143 -133550
23550 -133550 -195724 -258083 -162415 -272564 -183788 -86176 160180 -10630 320682 -165561 -150401
23539 -150401 253166 -322092 -230540 -15222 96531 140397 -198052 58725 -135798 187131
23528 -55991 90918 -86513 -48316 -370634 188964 225505 10179 71963 -163862 -61477 -202143
23517 -202143 -118868 112427 -47725 215220 157234 193613 82499 -177958 -292956 -330190 10186
23505 82141 -24102 43261 391311 -17327 -5788 234321 -10383 296884 -126910 -92876 20115
23493 -225157 -162670 -47476 108917 156890 -488294 233033 -23251 202337 -87179 279069
23482 -169901 -168706 -65850 72553 -45761 248074 -213610 69087 -303921 145291 159193 -135162
23470 -450750 240091 144561 103988 -35559 -287542 110373 202936 251956 81806 18676 -142690
23458 -135138 -4143 -115962 152630 77502 20890 57000 -1589 159323 -185226 124099 1273
23446 -58349 56636 -41150 258738 -120079 49651 -57707 -178912 164577 -25771 92126 -444026
23434 -203495 170251 -207408 -21300 226667 75698 39987 -2256 -45233 113146 -375419 33193
23422 185830 -92089 126895 -112796 -41086 -17976 -63079 179306 87552 -29302 -45930 -353759
23411 -353759 125985 -314063 249153 140808 -289743 80613 259031 87540 54106 37919
23401 37919 53768 -502568 156868 -129500 -44917 -11761 -2034 -252812 115369 65971 -162882
23389 124446 42282 -55782 165544 -105977 -161633 275090 59657 -105858 -126409 165799
23378 18896 -104820 -197988 -88695 -231451 -127340 -85322 -306832 -289052 9803 25904 80905
23367 80905 -133920 253184 -46320 -279410 -596 -84731 73481 205448 32044 103842 24913
23355 91 -1937 -223830 122859 56941 -151708 -114714 -111120 -211818 189487 99522 165142 88899
23343 88899 94209 71134 -168487 -130566 17966 -127067 167522 73928 48414 49160 13904 -21752
23330 -386991 -62337 20630 137353 -52085 21389 27717 10620 -156283 -108306 176694 -92520
23318 -547784 21115 -291137 -222382 -88033 -126260 50310 -240498 160732 -288222 13213 22235
23307 22235 -87826 124278 -68364 -99644 65677 -33113 48950 -34711 -153937 219185 37871
23295 61555 388019 80486 -234323 -178648 102220 -63350 113513 73150 91590 -198552 -111479
23284 -111479 -133467 -318841 85826 -114480 -48078 156624 254076 2068 -56923 -103080 -17530
23272 -131428 12712 -195691 186778 -81045 -120583 -55112 -162973 76881 323596 174869
23262 174869 -20628 135602 -253855 -181131 213189 266153 126128 -6384 130540 -259893
23251 299952 50023 -432482 -76602 -232571 -304148 3309 -145047 -133860 -34008 -247699 179077
23239 37236 -511285 600902 -151380 -330105 -119918 66292 -159141 35927 -103275 -111611
23229 -111611 -57689 -23764 139105 -62675 131400 -250128 -112635 1857 -335443 -163169
23218 -11391 72386 -123715 -278638 124652 125788 -137689 -202288 172761 59759 -217858 -163753
23207 -163753 -43665 -49479 -320351 -249021 124723 -117375 235793 430455 149315 -131631
23196 -44139 215339 -286357 397725 35955 -389546 109628 30836 81591 -37508 139012
23185 49931 56330 200265 -137005 -29648 26079 -287401 -43429 -133657 -35873 -145338 -43606
23173 -23466 306101 -328548 30336 165693 24551 25580 -58166 -42921 -93331 82195 -67966
23161 431106 -42705 50326 9071 -74609 -35327 -21777 -292303 -72758 -255342 -164167 29300
23149 67751 -466783 12995 6763 66402 92974 -150045 -59384 -83183 -236170 5104 -241813
23137 35389 95571 -196607 -384744 216801 192416 -29271 -244908 68267 197639 206905 -236068
23125 103704 176060 14441 -165345 85574 -68319 154229 302375 -1576 145191 -170151 122728
23113 -137547 114806 186674 72987 -3558 176940 212592 324860 38584 -100151 -59869 249801
23101 184532 -12370 106323 323462 -1093 8012 -254306 -187664 -119637 -32713 -312290 49080
23089 204801 -339967 -72020 131394 -80873 46111 -6601 -89022 244692 -65309 -85197 29483
23077 3558 388067 -256110 12893 -48456 -14037 70411 145611 -16051 223734 -13736 32269
23065 309240 -51992 -119204 -234739 95668 -88592 2449 -130349 -176473 96670 152393 169678
23054 169678 89639 32015 -32564 -14513 943 -34815 12651 -161658 -165704 -8466 245243 -195184
23041 -5349 -15691 202390 -15850 180776 426573 38587 130460 -10925 51224 -172485 67571
23029 -125987 -16113 -152692 231515 -66519 -99851 -167055 -187555 288411 -10737 -292914 347789
23017 -111334 -169362 65236 -70775 -212630 46440 -252039 -152948 322936 231380 61504 23287
23005 33032 180527 -107877 148896 -56735 -216202 295014 -97939 323273 -6704 -126301
22995 -126301 101129 133841 -55358 -249549 -261453 -36182 -70731 -31796 155686 61952 -131837
22983 -92813 -551932 -88699 65704 -74596 61717 -214255 8456 80313 -108027 -202975 -163320
22972 -163320 130340 -153936 -169157 15639 -35593 335872 47103 159096 -53779 -41453 -173834
22961 -173834 124728 -170787 229591 268994 75974 11055 99385 86417 -90250 -275095 136771
22949 -67973 -58211 45160 121075 -150584 25402 -229912 185228 -180774 -224414 -170467 -410245
22938 -410245 17418 20362 -262789 73518 198497 -81083 -14956 -254967 161586 83950 -7900
22926 -181584 -119678 53069 -328731 59467 24211 64747 -89654 256579 229592 -145404 -450588
22915 -450588 -143806 -110141 -16324 -276596 161610 -114327 -46223 12986 123160 6885 -156344
22903 312748 -47647 78190 -400497 -82342 -107806 138847 4975 -18245 -17213 -97065 290493
22891 261225 -259276 -167493 -26680 -258688 -321583 -130112 132301 42589 -97080 53547 118697
22880 118697 -91178 42775 -163983 -9633 -398732 -109753 -364268 -33169 193573 -53820 98428
22868 -93235 -172712 -52545 -297667 -47864 114992 122503 102179 -187819 -302496 -276805 -179342
22857 -179342 209474 -97746 -25907 169737 -130319 -71409 -181821 95453 -48493 -51835 -64963
22846 -64963 29467 111032 -49004 -174654 48437 -363403 -284666 68039 128516 93173 34724
22834 -94657 -154941 -177681 70792 -76551 23256 -308034 143923 133181 -155131 26466 -74446
22822 -105220 91929 -76539 286660 -23446 -20338 -42650 42159 192093 -3802 49466 -185923
22810 202324 31213 101580 153516 -106613 -19916 80190 198999 -370539 -249933 -90465 -89312
22799 -89312 -82921 -56211 -173510 -160818 -29020 -8235 -147444 -583116 211642 277935 -173541
22787 30239 10820 179981 -122584 -329026 10206 -231804 -29949 217078 -351915 -72459
22776 -89128 125159 -41353 -118818 32139 188022 272118 8532 163596 -127161 -192329 -223320
22765 -223320 114477 98485 176447 -498291 -175593 -177574 -25973 160387 34922 -58235 31614
22753 202982 -198071 130156 -424706 66573 -201684 -153944 -151361 -74991 103389 -70737 340337
22741 -83973 37395 133354 -213045 95182 229884 -115373 154929 2098 -115266 170103 69643
22729 -66577 -440457 -230710 -217053 -89908 -87352 153470 -111634 -4922 -310923 -106886 62741
22717 -167689 -160884 -30404 36702 -105310 11542 -132676 153828 77215 319167 -239908 97199
22705 -106816 -358880 -76943 -73906 101980 -37943 -301395 -25280 -68720 6370 115994 -201767
22693 -129516 -413510 -76716 -131846 -350325 -152617 49057 -90875 -15361 168879 -52722 -341916
22682 -341916 -51485 -129462 273835 -461671 -101929 62943 -69805 2775 99978 105801 -384847
22670 -262670 30189 -42095 -106462 -124941 75988 -203816 55912 198381 215466 -143736 -93117
22659 -93117 -145153 -77107 52374 -539816 -45269 -149415 81269 -156344 -238475 -19314 -2239
22647 -37287 -139866 -76708 6170 -164129 138802 -120372 -307933 -130184 -269992 -152304
22637 -152304 -57093 -157042 16887 83875 -322274 127738 -17801 -30903 -33648 -106501 58119
22625 119128 27620 -147936 174682 -262273 -201770 -33103 236509 78946 -182580 -183209 66490
22613 138662 96515 117695 16433 -95694 -175585 108736 207628 -25672 9805 -165463 -356386
22602 -356386 246377 -170380 -139843 -35666 -106537 -115773 -110187 184342 75773 93603 -61851
22590 148809 -166507 -41079 -23209 200894 -94437 -73205 51677 -134985 -89568 -300402 207117
22578 -110403 122085 80474 -81194 48562 -142891 -88306 -138010 20214 135018 152458 34417
22566 -3332 -140973 147300 -259997 -153542 13725 -168758 -228902 -77590 -223495 -141146 244735
22554 -188007 70394 -87630 56026 -19485 25830 88789 174020 -15851 321056 -66130 -202248
22543 -202248 -216277 -141833 -313980 84636 -192183 -234540 -156893 139136 -134789 -88850 -64255
22532 -64255 -278564 -193498 55238 50694 -313034 -134829 26848 -94894 -234977 -254759 162691
22520 -82986 -19242 -76867 -51450 112957 -47982 -343762 70141 -284895 -112961 -159192 175055
22508 -230730 141120 39500 131433 -117880 -144145 87753 60843 -57741 -330934 14034 -180562
22496 -97045 213285 -206117 182460 29233 -17577 -537609 -199300 9375 213558 81893 -107814
22484 -217872 3677 46052 83150 -101773 46611 -56083 20682 -114455 -25708 -256028 -3950
22472 -83722 -154844 -33085 -75189 -49879 15009 -173305 -7085 -138168 -65319 -6396 13025 -82912
22459 -101739 287395 -47739 -247640 125633 -66132 -25177 -12225 116061 94918 73732 -93762
22447 -80709 402412 -83266 90821 -123385 88063 53793 -158261 165342 175303 -11587 40118
22435 -103430 -80133 -23649 220146 -154574 -207190 -79436 -93217 136866 -402715 -29633 18736
22423 -82766 -42207 -90051 -31842 260456 190656 127734 -77308 -144856 -148171 253724 -140122
22411 209644 -186015 -235793 218402 -51620 -397942 -98586 53154 12722 76379 -207045 -74650
22399 196570 143364 -114925 -13910 -369780 111066 135505 -205014 -145505 -27537 -95254 -135716
22388 -135716 -97330 -29749 273233 -59391 -126182 39202 -487 248195 302052 31360 -103522
22376 -101467 26980 82261 256506 -104783 -400718 -217898 15722 26674 61173 -323832
22365 -248561 124156 -97134 -289049 63059 -130656 187396 -109385 210228 13190 -212254
22354 -280125 -44016 -269074 -115498 -82449 280578 -19368 -38591 -184815 8802 15110 -97671
22342 -20048 -285876 -1019 -453527 -87405 -31225 -49477 163003 -353201 -193035 -251821 -124177
22330 -287665 26736 571 -279114 -115133 138687 -80724 -48561 191638 169092 111042 -168911
22318 -139941 44552 -132285 -216718 -191857 -195865 -30227 22964 133595 -63663 -163432 -316256
22307 -316256 341633 -59788 309464 -177422 -298423 83128 294568 122533 -120634 -228183
22297 -228183 -1288 106364 137056 82958 242210 35104 433257 -150502 -141036 181009 -91711
22285 -206926 130286 83661 -133281 -156222 29680 76807 270 -163830 -141957 139243 -40626
22273 -55984 104063 8650 145688 -237535 232603 -98575 257019 -176602 182558 276965
22263 276965 80419 -185934 36377 172209 -174827 76801 75355 104803 -35540 -387482 53752
22251 181918 -111689 -104404 -15219 -61868 79008 -247062 -271517 -57843 43411 -190775 -108061
22240 -108061 -118438 17437 -48656 -236411 -64207 -222939 10442 57097 214172 64459 -114843
22228 161935 -10539 162510 -135831 -45911 111158 -310322 -226708 -12107 203320 -106165
22217 -346095 -35352 -3551 79408 -161607 297430 -329018 -46278 121949 -283355 132331
22206 -133958 31106 103657 -85310 82548 -186552 -226487 186036 152774 -154551 226479 -277016
22194 -323104 -282106 -152418 -344905 -89878 -256368 -256274 77038 61805 -94730 78735 87183 -382796
22181 -274542 166941 -47543 144224 138285 -50017 -300388 -82884 87348 -378072 -8349 -258644
22170 -258644 23029 234087 159873 -93848 57927 -38564 -21281 -63660 115643 -108891 49945
22158 -122682 -57697 212321 -371481 -12558 126393 -313258 -64641 -277385 231353 140138
22148 140138 -31 -19896 5761 244945 14160 -171152 186429 -212492 -131226 -282462 235652
22136 -74354 -200567 -138239 -604 67027 -109913 68156 -168972 -61028 -79697 225577 -129218
22124 -260908 -107628 113134 -383935 199724 -41621 -154860 -102492 -120088 -327890 227325
22113 13102 203876 37110 66396 -184765 -63469 -249341 -20825 212306 -7247 -130607 107399
22101 -233575 -98950 3337 -155132 -13443 -49969 -484332 79669 -50960 50415 -53723 -86174
22090 -86174 -67599 161138 115650 -98507 -217075 -3597 70675 53147 56509 -280035 39149
22078 -37328 -73657 36638 -238963 -220530 -97625 60294 -107556 -142302 -127088 -211932 -116557
22067 -116557 256328 -20114 -308463 439618 -293108 -193180 11292 -206511 -123540 -78955
22057 -78955 -63943 -131740 20810 26276 13389 48732 -345713 132345 -99379 6227 91285 50768
22045 50768 -77128 27744 -5522 -48991 84629 158649 -164684 -225485 -132794 -268363 49466
22033 -309654 58062 129771 30125 -279176 100267 74976 -353541 -209681 -162890 -162137 -90056
22022 -90056 -146836 -162318 -280867 56260 36216 94346 -328133 -246072 -97878 141378 -215691
22010 -283266 -26567 256858 -190500 27430 -36125 92989 -259603 -26561 -386534 140916
21999 53564 -137131 367164 -167626 -153206 -337572 -194619 -225513 3864 74299 160027 180369
21988 180369 -358867 -153597 -98219 104745 -98318 -81418 -157191 10069 -18308 -28980 -69986
21977 -69986 -390168 -245774 -39320 65509 13805 28786 -75034 -110016 147923 107385 28974
21965 -16374 -415100 -142984 139093 -72638 50496 61105 50230 -113570 49759 -231694 -198151
21954 -198151 -175462 159256 42336 -63952 264849 -182150 -254793 -159280 194610 -152857
21943 -313722 -191702 -258489 -108116 -152985 -2543 25686 135876 -232983 60810 -90723 313372
21931 -262889 50701 -47417 21620 237429 273336 -206824 106372 -21090 135081 88397 48695
21920 48695 -150315 -79853 7094 -35696 -211240 -47222 -358946 -198398 139303 -358406 86752
21908 -36043 -150218 151581 -208025 5176 -212711 5696 138422 25404 114131 137383 -2015
21896 -77033 98619 4341 67190 -218217 -97390 123834 47533 -121196 -75050 -183515 67410
21884 345552 99055 -20870 55502 -103435 -82260 216317 52780 244808 21678 -58085 343751
21872 120913 -56971 -23046 -354283 -173082 128315 -81434 -112659 -205794 46843 -44999 -201621
21861 -201621 -34998 -381013 209416 -54019 -334970 -45415 98801 -84041 -29852 54643 -336640
21849 -84951 -97904 10343 124289 -30057 -118744 -155439 -403432 -179006 -93631 92846 132888
21838 132888 -177067 95370 -139644 -45796 152083 -98873 80809 -123669 156650 -66146
21827 -261158 129968 -49714 39852 -18491 -240667 -26958 -12671 -35353 -47306 130002 -69612
21815 -324402 115274 -47200 116893 -37315 -21354 -10006 -113315 -190513 -226150 18473 -196618
21803 -36372 -412996 -31106 -230791 -113987 147199 -334867 24461 68391 27836 412529
21793 412529 83269 -195131 244078 62283 99929 33907 -95216 -102032 132862 -15265 207631
21781 -229304 -365547 -123225 42111 -41197 2983 25696 279819 293487 183236 -267229 89345
21769 -149688 30415 8080 -15801 -291088 173529 -98553 -41754 -299523 64620 -12880 -422685
21758 -422685 -316846 -118802 164336 169833 35336 -30583 159765 199755 184368 -8190 -151322
21747 -151322 -78504 26351 290811 128481 93427 157359 173519 135771 -7550 -333497 216019
21735 18347 -190968 158289 2531 -127790 50282 -214983 231174 -32858 143524 -98662 -43887
21723 90725 -18367 216711 -285033 -181912 -277981 -70306 168138 -13621 187077 66545 15490
21711 70518 137956 -208197 -177122 -19807 -199189 108941 22865 -86153 -81076 -178202 -195425
21700 -195425 96273 57162 186798 -55177 -33349 253926 -205837 -182086 -4405 -153795 -116360
21689 -116360 89310 28765 191374 -56309 -77072 -150522 -103332 -148975 -55830 -23337 -117071
21678 -117071 243651 -59961 -60395 340199 -207243 -108670 -129708 -41411 -82166 168761 -203062
21666 -5628 -53912 101623 -112685 -138103 -85542 222218 -232835 230803 -126716 19608 159473
21655 159473 -180515 -128123 44569 -114891 -97177 -363589 137908 60322 -3012 14475 -162623
21643 36864 -280635 -70005 -398298 -13696 15984 166756 322278 -33061 -46817 -6090 -48878
21632 -48878 -67551 128717 -188965 89235 153892 -119792 -181264 -156467 -127415 -187255 -86266
21620 43930 70680 184252 -119139 -102716 -21721 -54577 -91249 -214375 -343657 -36513 56201
21608 8359 -59096 84235 8252 -129804 -215539 -223668 -116061 37692 90290 270074 -156469
21596 120627 220163 -87859 -259840 -11344 -5597 -308916 -77437 -149562 51607 -450197 93564
21584 -142316 -30644 -157149 -72377 -78755 -10709 153065 28796 -238554 389170 -223017 -245599
21573 -245599 -208417 -80307 -314217 78844 114586 -27035 -278212 49811 6004 240291 -148560
21561 213780 -239809 -151659 135576 152100 57760 75918 119622 -448846 16782 -281194 -156749
21550 -156749 -93764 -171363 28323 -79849 178751 -12852 -133659 110511 -56719 28633 -57289
21538 -34489 71950 -389250 -58598 -145349 182640 92389 27623 -99267 -89177 47248 -135419
21526 -82790 -62945 154385 -89515 -118755 96534 -3322 -206797 425917 -116967 39333 82058
21515 82058 72273 114278 42591 -67092 120504 143823 98999 -219347 -130830 -40618 -113477
21504 -113477 -229658 100081 -78663 199430 -2865 6021 -57458 -116272 111813 -194804 -173628
21493 -173628 -179512 60761 -146655 81436 88626 143422 -310178 -205608 -11465 20660 -243541
21481 -111602 143245 -78053 -190962 -196706 -201388 118475 -14423 -207476 -211342 42550 -122250
21469 48232 -129069 76843 -256324 129414 15973 -200906 -132412 268184 66988 -17620 22833
21457 -82845 -140152 281390 23023 -94779 24253 -66427 -119868 -26333 -52794 121875 -3929
21445 -207759 354430 -116142 -81973 153662 52402 -156521 -245933 -263581 2461 -24421 -76226
21434 -76226 -412614 -306441 -278502 -52037 429346 120862 59772 252910 217067 271848 551544
21423 551544 32990 296914 314537 243393 129747 37468 114443 -108246 -47169 17469 60113
21412 60113 47896 -238596 88133 -210719 -283353 -133568 -174915 -79120 189307 -306747 -210995
21401 -210995 229082 -305500 -15133 52564 301717 19609 87824 -227920 -319731 -324375 -194474
21390 -194474 7797 -300389 34473 41503 28036 -183235 -61690 73752 -41334 -18166 -184461
21379 -184461 -399067 -191868 -96849 322894 -285592 -52195 -197423 179971 -196674 -158106
21369 -158106 38947 -122286 259698 -167869 15043 -375653 -66903 76712 39661 49757 -189398
21357 -6756 -150233 -26417 192876 -90393 -31409 81198 61893 73317 -31584 -142285 -279464
21346 -279464 15700 -114753 -85501 113786 -321745 -70305 244182 -331935 -141274 -137108
21336 -137108 -423768 -53493 9956 -28334 -105940 -579957 -205194 69891 -61955 -143430 -314591
21325 -314591 -115824 -119064 -99716 -50598 -29541 -121513 -382410 -244733 79246 39301 55032
21314 55032 -337581 -57209 -80121 -238176 -159151 17672 -152761 64563 281795 -14455 22064
21302 -39423 121545 -321906 -215510 -51766 -125011 -102793 -4318 -200917 -315916 -236489 -189394
21291 -189394 -76968 -20050 129058 31615 2325 -71567 80987 187775 -73724 -200928 32134
21279 -2409 -311769 142929 -208840 18647 61358 364242 -154711 -19092 -176321 -205698 -186631
21268 -186631 99857 195580 94664 68718 -123075 -457142 88413 132126 -38787 -58927 32888
21256 147326 -266596 -111295 -242983 220110 -7264 -271549 -106294 41163 -102418 -157739
21246 -157739 -81979 77899 107831 282328 140930 -184058 -278927 134862 197446 285563 7740
21234 -289548 70666 -230206 41852 -170797 -139473 -189958 181558 -128019 117960 -31412
21223 102362 246625 45007 -170881 77752 -302613 -342896 -67009 78774 216106 -47393 -7937
21211 -177295 -32661 -234131 60082 -166414 -1319 -83118 -150204 -62193 -63734 -58249 283110
21199 -125163 399663 -182501 9704 94886 -284107 -127904 -221616 66974 46866 133971 -112003
21187 87721 139555 -197896 -177397 301928 -55137 154284 133084 249465 -520732 -312319
21177 -312319 95142 -255649 -258210 -347952 112558 10867 -188783 73898 -94018 -242519 -113467
21165 302114 16596 1870 24759 62888 -151733 133840 -30735 165384 -271915 -134355 21929
21153 22514 153364 -22575 12787 -159395 14902 249889 11582 -47303 115295 19941 -14351
21141 16895 237328 249443 61338 -93936 -178907 137712 -295099 -328109 139329 164273 73903
21129 -337443 -138272 109625 51868 36114 -409345 39549 161291 -50272 108497 149640
21119 149640 -92668 -431148 266598 105044 -245185 -39470 -115341 -215546 -131030 -131384 -82212
21108 -82212 293246 -246563 20841 -153672 -220012 -303094 -106555 83446 142881 -106037 158164
21096 72829 -103916 143385 -10006 -23803 -95810 106335 -170154 118312 150568 249356 -188566
21084 153637 78615 -179605 29012 -90861 -137211 124486 -151337 -263187 166212 109958
21074 109958 147396 -325737 -540237 94632 -53715 -133950 -106107 -211684 -250597 -60204 106597
21062 -167686 66590 -149973 -104430 205573 192367 185382 -5372 124156 24090 -54513 -6081
21050 -153111 22318 -53228 -170819 -205429 -203896 19498 -205430 -131244 -68818 -160480 -348496
21039 -348496 238830 -77406 126826 -147544 -220261 -25429 -113748 113917 57110 -3228 33692
21027 64629 51739 -297884 315133 41503 5250 88290 79946 70595 -251504 246360 104541
21015 -13346 69508 -407927 -160647 80416 53189 -8466 138372 -63265 17700 40270 26407
21004 26407 -79095 129906 13003 -222334 141094 141545 307670 -65840 65863 4657 199044
20993 199044 231818 344253 139591 -15630 -160640 278066 16761 -397984 141487 300467
20983 300467 -192618 87262 -390280 -137229 -247370 -58463 7652 -101688 215655 108162
20973 108162 64341 -228666 -237201 116745 132300 292937 51848 -26969 36043 -91039 -29608
20961 27621 267081 231536 16190 -189791 -17655 -67707 -405668 -148853 269575 58961 -43207
20949 -170046 -19656 -152328 -217801 -125163 12512 -11878 177960 205672 -11890 -69333 277075
20937 267450 99319 -35145 -117452 -43409 160190 59834 277837 607907 237323 366373
20927 366373 404557 -91065 -21298 -129244 -211221 70642 -348949 286001 59911 -246348 -32807
20915 5369 -65976 -288354 -185920 302643 36868 57658 167018 -54671 -3815 -141474 -73378
20904 -73378 26416 -76868 112490 92751 -166029 2361 84925 -145595 4816 36774 96373
20893 96373 -155272 35359 -165393 -247484 -25362 50635 181376 -76666 -171145 -164509 -65152
20881 -178066 -250450 -446953 52888 88907 9439 10509 -281715 -86123 56302 78572 -155991
20869 -33437 41250 -122821 -202811 -181878 -248562 37339 -160545 -99814 -339569 -234421 -125997
20858 -125997 160576 -127966 -223845 -7831 6032 -247812 159784 -117726 357236 -569035
20847 470654 120465 97675 -115670 -53233 43529 -62457 189155 -91639 47336 -43975 -180412
20836 -180412 147685 -29122 -5170 -104161 -8885 204389 -46811 -80800 -77155 222998 -205530
20824 -46054 -81453 -101724 -47790 -77843 -150384 86242 -155717 50230 -413081 -124963 -223322
20813 -223322 -333944 -23055 19185 -123207 -157806 -167456 -121930 143293 -472620 -227535 -109231
20801 14514 -144673 -89902 -53352 115878 -140721 -253766 113252 -12554 -150569 -245141
20791 -245141 175589 -160274 87552 125973 -135410 -116859 -363525 236072 -92215 -110072
20781 -110072 -358786 4727 -213692 124869 122775 -134042 -93158 -63508 -207894 121322 -153971
20769 -145546 48789 -152464 -32836 -121371 -65871 -231232 -233980 -30044 268655 -47491 14713
20757 -25244 -13632 38702 -148916 -90130 -33666 -20288 -150368 -174995 -159820 -114945 22016
20745 -405276 -31740 -150172 -78889 51498 191257 34739 217197 -161266 -144396 -222993 -263910
20734 -263910 -266238 -173704 -64593 -19969 197530 17054 -406318 2729 -246790 172502 -243810
20722 -147963 33906 15575 -29672 -68421 -166572 -190804 -81769 -288821 46091 -212332 25835
20710 -255326 -39249 -314279 134947 -261306 -12367 -95944 14652 -229263 -93485 80893 61846
20699 61846 296257 90522 -274013 -24356 -161431 153184 -81909 -252354 54412 266592
20689 266592 372858 -187546 62160 -212001 144999 239460 -276888 -253153 -120780 -84054
20679 -84054 -101220 230251 275168 55319 93372 9996 -216533 -97970 -384584 -224837 -237821
20668 -237821 -78982 -104452 -230606 283528 -19991 -110907 -29848 172973 165320 -159512 251022
20656 -26916 -207396 32676 286819 86801 -251139 173708 -4215 119892 34021 -109689 -330182
20645 -330182 -52149 -78006 120060 -104805 -184195 -32355 -598802 -109555 -144780 -125248 116849
20633 -320055 78718 -262822 -189631 -50071 -334174 -93260 -103956 -110707 -473262 -253415 -253836
20622 -253836 -193780 192646 -115605 -118928 -128891 -249319 -49245 66593 54626 -166838 -56180
20610 -119538 -84945 325 -41558 -395788 -33426 165394 -220841 270580 -361530 -503196 27022
20598 76881 -289024 58519 -13982 -167986 50023 -140846 95546 44757 58159 -89052 -201455
20587 -201455 29800 -3123 -181670 -59453 21894 -1791 33252 81785 73730 -181243 -188251 -173124
20575 -173124 159216 99952 121629 109044 143925 -129682 268560 166680 94373 89905 -64245
20563 72075 222870 -54050 -2256 64250 -6321 -48108 -313829 108093 41671 210032 -51652
20551 140201 -119017 196784 -143527 161112 225878 -126989 -31663 -210069 284917 -9180
20540 249168 -264602 -5759 -529884 -257136 -198467 -195775 240890 -279283 -192286 68150 -153531
20528 -238124 114827 -178441 -11852 -226904 -84693 -55293 240182 -160782 -248244 125784
20517 -173141 -73756 -15774 -30745 -95695 -194476 136177 112570 36127 -42216 261811 -146611
20505 16592 -87670 -143716 136380 145246 35391 -102939 -171081 -59089 -5250 -164656 15675
20493 -12742 23096 -85995 -41103 -160822 -90532 -46000 48130 -198825 -9900 40839 -53774
20481 -71644 -464931 44294 -240451 -333066 -361824 -78812 -710 79637 -32466 130734 38207
20469 116664 135681 -8953 -220497 -45328 -195113 -224928 -358236 35715 -182450 -36309 -134036
20458 -134036 240432 4421 515488 5124 -297506 -43119 -63089 -266962 162435 79172 98768
20447 98768 294474 -33755 -80054 211990 321037 294360 -54336 64905 -39823 -172940 -90104
20436 -90104 -126938 -218647 75975 1193 -292163 -86851 -258642 -87891 -84410 -1788 209114 341892
20424 341892 -141284 109503 1113 584 64866 -141267 -216214 227166 -52079 -248965 -381302
20413 -381302 -207581 -82593 131602 -355190 -174909 118205 -9894 -95595 -37814 25078 -151334
20401 -100490 -210026 -101679 91431 -184655 -92297 254556 -100231 -52498 -43080 141544
20390 -136181 213837 -4620 -96756 41473 10839 7972 256661 -67458 31461 -78136 105883
20378 216200 -287762 -125389 -97788 -144280 -202126 -176102 -201492 -203263 -369954 103082 -273764
20366 -49569 -75872 -381806 101417 61768 -300788 -226157 -345972 -103983 -305547 -153084
20356 -153084 -62855 -127811 190765 87048 40969 -367698 -50589 -212912 -134718 -250933 126332
20344 -194083 -214493 69892 -130653 -92391 201708 12158 -151714 277209 -14357 -137524
20334 -137524 -157757 -38313 -201941 272639 183048 156044 -94849 -155823 103904 131572 -186032
20322 69852 217325 -262675 -84877 -59522 -97923 -12025 -158215 42046 -18192 -36564 -360639
20311 -360639 -218737 52286 -42309 -87886 154349 83833 -291820 -429589 31590 -244137
20300 245156 -219962 -157500 -65442 -164741 -19648 -87349 29882 -5014 72424 -269531 -86173
20288 -84869 -331726 56971 207372 -76515 -47046 394050 -31496 -173308 17145 -158734 55032
20276 -167945 381325 -207847 228714 -123665 -93981 60979 -286861 -225378 178679 -187073
20265 -34757 -57783 59265 16234 -21018 101547 2906 125761 -109671 96016 -11573 -2840
20253 2851 27263 -122838 -223329 145104 105555 83158 24656 41346 101068 86073 -359527
20241 480167 -110379 149657 -216875 -121812 -53045 -103772 -443758 37445 209455 -298199
20230 211896 -45739 306248 117002 -229149 -120765 -193303 -231574 -400705 -359625 54315
20219 -316998 75332 -23270 -93562 62580 -172656 -45306 120110 -339022 -9962 -149002 -171999
20208 -171999 26894 -204437 56942 -93716 36371 -38051 -164802 -231352 108750 -58508 294993
20196 188640 122331 -205112 -234958 73554 121959 -153060 143938 -235644 -99912 41827 -143942
20184 134258 120880 166045 -358105 168532 134552 -186834 40853 -168710 148117 -112961
20173 625 -103834 329178 -64082 -244750 225154 -187632 7729 -26274 90210 -335689 207931
20161 39304 -183502 318472 285297 64717 -166445 -9387 296134 -276271 -77233 76415 -34412
20149 -2946 220639 -58974 104521 -46945 -71608 -261909 -131394 156369 146177 -29805 -147398
20138 -147398 -180003 144616 -162413 -67481 444949 582253 687229 227130 191842 427984
20128 427984 202429 375908 124671 280572 473659 176318 168849 -120072 -25695 -37134
20118 -37134 -62262 70870 -304055 153546 -83855 93327 -242987 -3268 -22089 106825 42382
20106 -85806 -275833 -243906 -222796 -137052 -56997 -338113 20995 -245720 -290622 -3519 47327
20094 -78853 -81984 122908 -225850 26347 -146392 -168019 -62547 -70135 -327707 115459 -219030
20082 -23446 55112 19424 -181756 -525428 54838 21941 -237472 38344 -21104 60723 95425
20071 95425 137687 -207052 -126587 416 4886 -238273 -37342 -2489 -56160 -167070 110547 -261225
20058 -317793 85564 -61176 -47179 -289749 -467126 -154099 36180 -187854 82009 -8124 -348772
20047 -348772 156439 -29762 184260 -24277 -45542 98567 114821 130949 -51744 294128 -67697
20035 365928 -153756 4607 -341228 293572 -166704 -170808 -212166 -256727 -17955 119607 171688
20024 171688 -69220 -317907 -118416 240462 41077 -285609 260655 52563 -205581 64600
20013 -241339 -66773 140140 -3450 -152884 -2157 66259 -33162 -107346 51178 -226127 70411
20001 -465055 182985 256388 -131873 -24911 -110236 121695 -180385 41451 29232 -289962
19990 -137371 11354 289179 -111269 68519 -50308 73432 -282511 266440 475350 25308
19979 80082 -49357 213664 164768 251066 -138378 -9529 42325 37938 346520 177608 70799
19967 -97734 215732 84864 -232523 108747 -140432 240658 -119885 2693 -95729 -250049
19957 -250049 17943 214794 104304 87973 -131586 303168 -60951 266850 142463 196609
19947 196609 560709 211611 203117 283779 130609 157542 -14733 -241449 448049 252347
19937 252347 105124 190244 -65057 -242702 166774 -108575 -125145 -104583 -119343 -30948 46085
19925 152898 -60163 158723 317589 -402241 167360 -219342 93421 -39833 173750 -44720
19914 -262567 -46957 26109 6445 15582 -24664 71898 88478 80020 126568 -443362 -102080 -197706
19902 -197706 17378 31893 -13739 -35208 -225457 233980 80581 -57745 61550 -31423 -165619
19891 -165619 285932 -57905 -406251 -244309 182065 -215116 -262951 -9968 39704 -116010
19880 93924 -18767 -225289 -95777 55813 -309375 85490 33179 392808 -96659 -260674 -323333
19869 -323333 -472922 -225553 -110789 -83479 -172830 73109 243156 317653 151571 -292637
19858 -131955 -264834 -25369 229636 211572 57653 -261350 124867 -361377 136853 -142301
19847 -114458 4495 -24884 -32238 24432 -216441 251673 -327140 -204278 21814 -191446 -142613
19836 -142613 -109260 -166572 61464 18876 -38767 -256171 54851 -345020 -83339 -309484 -24252
19824 -246132 -338639 -37698 -8477 -87817 40425 -137140 -100682 25294 -284666 133991 -181343
19812 -111075 187336 -52780 206453 -260635 -284391 -6811 -411347 -127886 -32469 -382798
19802 -382798 -215913 54983 95529 28333 -41607 -235730 40083 -43591 -1226 -179715 148999
19790 -60660 -109723 -2143 -46798 -141870 -175584 -103225 -159962 -93703 -154116 -162552 -185469 -135561
19778 -135561 116520 18111 -32589 117635 -238000 136948 249620 -105219 -151770 -198125
19768 -198125 33667 152261 116426 100561 -202822 65899 -188284 -269301 -74899 -32905 62108
19756 -310481 -20091 -28326 -167101 282299 -348529 182093 -71852 97532 -173331 -208534 120394
19744 -314132 -48575 -4959 -132351 -85127 -14743 28375 -79602 157555 83700 -189941 -182636
19733 -182636 62470 -28012 -347 -173801 -70120 290138 -177183 339640 217727 66026 -341622
19721 -254904 108519 80441 149410 65206 564880 392446 107313 673590 -18444 138056
19710 204309 -64282 41764 -210106 156037 -104531 -340179 -6169 -104855 -260265 -328361 19102
19698 256521 58814 -92501 -50053 91381 -47482 -42747 -28164 213787 144956 -334295 -102620
19686 121001 -2227 453380 257586 317910 37395 368814 337759 -224609 -67110 261609 64271
19674 321848 118092 -11051 196641 63164 -2376 30999 -28667 -297887 -53773 -169292 -262739
19663 -262739 8498 129035 121120 15492 -46626 -48423 -139905 145534 75013 -159982 34282
19651 -242750 -46649 -166394 -96459 -84915 -108011 123933 -46150 -216088 72296 44054 130583
19640 130583 -36388 -188637 -422279 8475 84431 7844 -125546 336223 112953 57268 22338
19628 -73729 -187804 -94805 -235692 28421 -182954 -18558 -88132 -163164 -89865 173563 102254
19617 102254 -73798 -235976 -384427 -105812 83811 41070 -121738 151958 -91006 -102152
19607 -102152 -98153 -19785 -62227 15220 -347891 90584 -9804 -134326 -224793 -224638 129787 -22972
19594 107661 196698 -164318 -117713 -255083 -213637 95710 -166955 -90147 42367 42637 -397114
19582 116090 14454 58190 -947 -109282 -213927 -218280 -236352 31867 -89185 122656 -21172
19570 -213205 83208 -2934 -104931 1386 -154006 -375588 -537119 12450 53196 102908 288281
19559 288281 213291 -35442 -213620 86063 307316 42286 97887 -94522 -128048 242483 -37023
19547 -106620 -130493 443201 9657 -30213 -123866 46291 -136375 47874 14876 256267 -139095
19535 143495 8650 -111191 -72841 101845 -338263 -231644 109641 -212512 232048 -64840
19524 28233 219032 240833 177464 -140107 -292065 -118458 -190181 -181557 31383 -421525 -364165
19513 -364165 -155848 32275 81556 104981 19441 -60186 157780 142332 -5454 -75444 -78937
19502 -78937 -320581 -54686 377467 -51960 -109752 -164610 -131382 -13543 40610 80497 -354678
19490 -107625 -345588 -158679 68014 -4061 -135069 -414326 -281305 -155362 122595 -18723
19479 -325050 72039 6117 -112660 166711 -197964 -196079 -2737 184756 -144103 159545 -196067
19467 168524 -232117 -295466 997 -275145 -227550 -192490 46169 297770 9257 68551 164201
19456 164201 156952 -215609 -195992 -90551 -482181 -198495 -15826 -111775 -115766 137154 -146767
19444 33751 -37328 87985 228884 -423466 225281 -15902 -146898 64650 -183081 -22311 -126518
19433 -126518 -387352 -191766 -148023 -142926 -176223 -12520 218598 -302406 -148172 -42213 -347691
19422 -347691 -98688 -149589 -95262 166211 -156373 261710 -114777 -131440 -54498 143219
19411 -164428 -183546 49561 -66698 121381 -24549 -136708 -4301 -157174 -119872 31074 -240573
19399 -20064 -23407 -128533 -104074 -206774 -100637 -472667 -287745 -297316 109674 -122544 152802
19387 118423 104146 -433165 153112 48038 25658 -117382 -248230 -342675 181211 -231704
19376 -95158 -8954 5297 -80231 -128979 -320604 208554 131057 -24964 -14282 -174691 -140515
19365 -140515 -138012 -291723 332803 -5084 156103 -18604 -336957 12868 -242724 208702 68061
19353 -139645 -24951 100000 -52801 121950 -19629 145383 2252 140216 106177 -49717 -101504
19342 -101504 -77361 -170807 -114655 -98801 105092 91718 26325 -8168 30847 -177645 -75677
19330 -164996 132566 -293631 -24833 -13176 111606 -34958 93227 236648 -265722 89558
19319 194216 -62463 -3597 -189701 -17207 156514 -212898 23654 64999 164516 -221659 105619
19307 -96709 -186310 162794 32708 15318 -346304 115781 -303339 -100029 -173433 -1108 59198
19295 -215930 -9227 227698 -346682 -479063 -174194 137831 -311509 277784 -68991 97090
19284 223066 145632 -32331 96639 289134 78351 73559 -304425 3552 -121137 11361 -147473
19272 -491347 52256 18071 -237437 -147522 -389586 352608 -333034 -274879 -46202 184659
19261 -43056 -5215 -1717 -17577 -270569 -51867 -160087 269055 16418 53934 191516 70993
19249 424174 -52727 -202097 -118043 -239244 83829 192704 32252 -97161 -46671 208540 6187
19237 100322 167558 113148 20484 111021 84458 -216108 -232118 97182 -243345 -219504 -6622
19225 -302702 -104639 -222622 179699 43294 279183 -25282 173243 -56940 -162385 -347146
19215 -347146 -4657 -301878 -90874 -281919 -154501 -196245 -273414 24090 -18095 -15299 -270104
19204 -270104 -242589 -42999 147115 26699 -188859 -65917 -338491 -276993 -64982 -115166 -299881
19193 -299881 -51070 38601 -144262 -107286 43810 -411340 92972 -158123 -295986 62439 45064
19182 45064 -216679 -103582 -189030 -270962 326252 -75482 -18582 -246530 125553 -34084 -85623
19171 -85623 -300090 -195835 -45485 75551 -114294 46002 -530521 -159626 -150953 -305500 -164421
19160 -164421 -307541 5174 122865 30975 -79622 154930 -18509 -312026 -168677 73927 -195697
19148 118704 33761 105766 -124298 -146354 162455 -82068 90893 53899 -116963 10950 80662
19137 80662 -141560 56409 -156963 434395 -240380 234864 162924 77028 -15149 400965
19126 301 -75312 -93075 -101373 -175405 -327989 -8401 41879 -37317 -213488 -32972 -505969 101401
19113 51070 -45019 -318424 211010 187292 135201 -158412 -62384 267886 9396 86916 -29419
19101 -430830 -69498 181498 -240002 -354622 -162796 -168159 -7771 -216600 58524 -146268 290303
19089 60900 -263993 -80216 -286281 -44008 87934 98803 -208742 -86487 -190279 154141 78558
19078 78558 230602 -107661 -101814 -227113 -152245 -144112 -58150 -224486 -150588 -287669 -208924
19067 -208924 63753 -48700 -38987 -497651 -193566 -164173 -271425 -100970 53989 16338 -164239
19055 -11515 -349410 112310 -282109 -75579 143733 169224 -102450 22275 56585 44044 -90092
19043 2190 149412 49651 443604 -106093 182546 105814 22906 52457 -160478 -435204 55909
19031 -209942 -71363 -17082 -123705 -4126 257234 -204558 -245123 256708 42300 -107168 -178492
19020 -178492 -189257 -570416 -153698 213459 55654 203356 191169 132758 -109476 -64655
19010 -64655 -37681 -122243 327245 -109574 369640 91397 -16222 62103 -245929 31922 -35776
18998 -233739 -71316 -162728 -303584 75883 -206864 -70489 -45619 11198 179334 123371 96156
18987 96156 104263 -47179 99149 150144 -60874 -190787 306514 155058 -59137 -154849 98056
18975 -483906 -152489 34828 102345 87186 -33020 212209 115253 264518 -33281 50435 -339514
18963 112695 -55560 357158 -17386 262051 197354 367325 325808 523861 -7766 -158270 210341
18951 124376 -13814 103143 -121061 -176825 -160739 -181796 -10262 -18787 -208019 -2834 86614
18939 54388 -56232 92802 203502 -11425 -51053 -10257 146976 108108 -191467 -38069 -572840
18928 -572840 -159599 -223897 185650 224788 -172012 -135724 179334 -211440 314047 -73848
18917 159179 -323963 -39534 -477396 288367 86402 -233886 210921 126984 -125827 -286148
18907 -286148 249438 183730 -53022 -469304 -269483 228365 -247258 -12400 13523 207694
18897 207694 139355 314497 468536 336264 284808 29357 258344 -20749 -243098 16485
18886 105236 182940 -271693 -17755 -146981 -183492 106106 11840 30359 -22590 77345 -252993
18874 46023 47251 -250091 177711 -244448 111191 142435 -15829 -287875 -323230 -12903 -2378
18862 -26857 -138584 19197 -370009 -48365 -38627 -227008 -61947 -259416 -332553 100995 -250898
18850 133622 29850 -182456 -146602 158414 -72529 -72219 -198753 -37758 97429 26965 -236839
18838 -20976 -284775 -17448 55916 153300 155380 26183 119289 205599 128268 -9891 -19907 -247353
18826 -247353 81022 349327 -123611 135275 -279040 -268258 -17104 -135775 -319068 -126991
18815 185911 -336411 -96359 6428 142200 -106456 -136260 -74812 40932 -193808 -33482 446409
18803 85520 -216968 -421033 200959 -237033 74103 79030 183139 -119674 139244 50568
18792 -37223 -394711 49872 2830 -145428 209944 -253362 23829 -95483 6404 5705 133902
18781 133902 -103080 53071 190729 212643 64542 -226046 23622 175075 121092 31074 -13529
18769 212886 -10138 -148588 -138116 -161641 -51707 -50876 -81942 -297190 -123846 -68846 -223896
18758 -223896 -51073 22530 206759 62916 -113321 -225182 190591 75158 -31031 264298
18747 -144774 -478088 218113 -97231 -242718 254372 -319691 -338868 -73766 209407 -56361
18736 -104815 -260098 -88489 -286252 -17274 -192035 -97458 275736 -164508 -198522 110930
18725 -7471 -170729 -71492 106147 -312090 218391 -274352 -116082 -128432 -361870 -443717
18715 -443717 -1819 -217879 -47976 -44326 124528 255128 -181076 -93454 -55028 -214620 38828
18703 -80504 -381119 -106066 -266339 -254990 106009 -66541 -144863 -335721 -310033 -65471 -61962
18692 -61962 -80452 -393665 -260045 -119695 29589 41624 -71099 -220330 172136 -144386
18681 108074 195883 -322598 65876 405393 85960 -33869 -83200 -125764 -254368 15266 84153
18670 84153 -294090 -394107 378589 247531 68006 -245987 -7697 -209548 -274682 30633 -163368
18658 -10117 -87055 -289740 55230 193991 -228247 150975 56235 6369 179024 -49923 -89263
18647 -89263 -187212 -99977 221041 79012 58675 79905 -125074 -63406 -157863 -62502 37545
18635 -268348 -165379 -72040 115506 13404 -589907 -141031 78728 -156963 -223624 -61788
18624 239013 183165 -182095 -164397 -100762 64961 -336010 -354358 -35922 -101989 -275403 -90391
18612 -87878 174038 56614 46885 -119750 -305446 115172 -66538 -183410 -180588 -269151 66923
18600 256622 -154591 326579 13464 52515 -35382 -75325 57707 155655 -129756 -91698 -184428
18589 -184428 -55635 -37517 79235 -290105 -110207 221599 -52131 67619 -184608 263741
18578 -171497 -177742 -173425 -322039 126285 57988 -324765 147556 158175 -164908 -265236 183231
18566 -250882 -40442 41428 -301892 128799 82556 -171675 16913 68460 -100243 -110305 25300
18554 -10644 45902 43256 18086 -267840 -143629 -71518 215478 -10876 -158442 -37954 143217
18542 200682 -133719 -240685 -137200 -70586 46967 81335 171298 -34800 73058 55171 -152948
18530 -127504 161925 -172825 -77660 -108714 -104023 147413 -70544 -59941 44396 119542 -95048
18518 -177672 -426264 -17780 -14848 -30732 -20727 81998 112944 -2319 -172602 72023 -276963
18506 254531 210344 -124646 -81958 -290817 201008 -33191 27633 -239852 -6642 -139619 -56266
18494 94558 -21020 -152768 -154279 -357023 -396061 -269673 328740 92141 -106458 122387 -31948
18482 199193 -17724 175398 93013 -119279 -51537 186629 -113572 25158 -117044 -266877
18472 -266877 -14165 -173758 -155980 -23609 -63861 126286 -9510 92725 -110356 -139299 -385785
18461 -385785 -172362 -16139 25010 -204760 -273946 -403663 44551 -164826 -144153 115423
18450 13309 -131183 -6803 49752 201216 -159111 26863 -176785 -175348 -233457 -93962 55277
18438 161396 56151 329526 -90235 9041 163508 -293075 -149690 -223043 -323064 224658
18427 -173488 -138422 -253174 -263892 -236056 -33475 -200829 97302 82083 -226547 91341 274286
18416 274286 -74245 104931 280481 260777 -152664 -133069 5632 -181985 142258 -209949
18405 7366 -78528 27444 -170514 263388 -155069 126596 26933 -64642 -35463 -295862 75152
18393 -294706 -266613 -233684 143882 427098 45245 198646 241229 -250149 77504 -39625 271182
18381 177243 22306 312001 -109906 -203806 -113733 -89763 56116 62477 152513 -273561 110839
18369 146886 -33058 -330798 302136 -133797 -82941 -131888 -152595 105849 -115512 -264109
18359 -264109 -346385 -107898 -204063 318861 -78594 -222603 132327 -163442 -72098 -169757
18349 -169757 12096 294414 50247 -143819 -151891 176128 40153 -87740 -36171 -131112 -73203
18338 -73203 -123779 -181449 -14753 -167571 167167 -15256 -199090 28670 -324249 344065 7825
18326 182013 -211716 84679 27385 -32783 -81884 -263090 -6911 -143043 -298127 99689 50950
18315 50950 32013 61394 -408126 92912 194358 -18953 -13756 -22640 -121761 -159421 237251
18303 258840 -317422 -112541 -191549 -328146 -306587 -125077 -433155 -58484 184345 26316
18292 211786 -11796 -357491 -220388 -154748 1925 350050 154249 -77376 -113491 89914 -117610
18280 34462 276860 -74355 -55599 258590 39475 85888 -33133 -52299 116546 -2625 -80655
18269 -80655 23196 -227400 110421 -253589 -30971 112244 48068 -23864 -129158 -93712 82599
18257 -238153 -58 -14176 -13833 -122985 91079 -20576 -87530 -231776 -129670 135638 135168 -165244
18244 10007 -526821 -238993 -135145 -185433 -139840 41621 88268 265298 -161422 41811 -34133
18232 33970 -179300 -43648 -183450 -266934 -301410 58857 45352 -206676 -190573 -67237 3817
18220 54359 5483 -97703 216118 179883 -89856 -141560 -68678 46355 -87077 -253999 121383
18208 177308 219093 -7598 56448 198403 81432 -26907 -143052 -94325 -64650 -261199 451310
18196 29308 60023 21230 121686 5188 -68132 3986 -194931 46290 5657 229249 -171867
18184 -133956 46651 -100326 120201 -299635 -191815 320601 -284281 -50549 187022 208104
18174 208104 -147694 -91404 37251 64580 30241 72569 -62521 94057 -82870 182149 96911
18163 96911 -6758 152000 -166150 162386 126695 86559 -204806 -113983 -289999 -309833 215408
18151 -231332 -103943 -250810 135596 51135 258306 -55397 -355100 68637 82490 180914
18141 180914 -104382 29419 22798 185299 -41424 -131507 -54277 -18025 -323307 159052 126603
18130 126603 2724 -25215 -327543 -7987 43796 7939 -35366 70046 -130195 -156764 188142
18118 -41389 15874 -112118 -41993 -155311 -112646 -25302 -358161 91253 -141794 -162788 99640
18106 -852 135840 341905 -124379 94496 225182 337667 -153274 -73064 46653 -348065 -16291
18094 101160 -56666 81000 -4380 -365365 -18049 -113346 124944 -134419 -95074 -6579 -119156
18083 -119156 12232 162171 -58330 -15955 -366323 12617 204095 210977 89352 -241243 -217887
18072 -217887 -80453 -272897 38398 10071 38502 -72045 -35690 -60411 108096 -56502 115946
18060 -165997 357029 124273 44509 257326 -85377 -65493 -16905 -26817 -234467 328876 -10869
18048 -141281 -270174 -194543 -134541 291557 -107822 -138655 -29199 4747 -220420 -97905 -182117
18037 -182117 319466 219309 -65295 421986 -101246 -259985 -48410 -20928 -243193 174011
18026 17644 -138851 -97195 90885 -366127 -62691 -185160 52953 230321 -102331 -6631 -238854
18015 -238854 7902 -241542 106846 -125360 120750 -30662 -106637 75550 -259125 -32776 182601
18003 185342 40085 347279 -186460 -27035 57663 150800 271090 88965 -341162 -193117
17993 -193117 19750 200994 45336 226228 -53311 345195 207502 64177 -373335 391498
17982 229207 177003 -243074 100758 55507 217528 234537 -326303 -205159 107220 216766
17972 216766 -314013 -9912 80422 -49473 18975 185024 -140505 -197930 -103683 9760 -204122
17960 -102480 131042 346360 7331 283111 -240635 -351253 -250389 -21423 -135641 52417
17949 265011 -148156 17402 242324 -166738 61879 93640 39658 328158 -1325 12709 -77148
17937 -152489 159812 -86916 -83655 -43258 306379 86646 -69541 131397 144929 -58180 106410
17925 236587 175409 429559 -219522 -99099 -69297 -116215 -76896 -159784 -2423 -250686 167669
17913 -14380 -284893 -115265 40820 72916 119848 -29635 75874 -88533 69933 4878 102599
17902 102599 -206637 -85081 181159 23278 185724 72355 222597 -192377 -47099 246470
17891 37679 10387 15325 113671 -78063 369898 357045 -225841 53738 -97098 -128023 239937
17879 209976 117206 -87763 -225433 129264 251521 102429 54194 -20615 68106 113456 113661
17868 113661 49806 -162843 77536 268746 167202 -165531 -81349 -121440 -14637 -161410
17858 -161410 142653 -38692 187472 241143 -96831 82983 -33883 115091 -31880 -4577 211574
17846 281502 18980 -88772 63602 -103307 122130 -130550 -221421 -8256 163587 78999 282902
17835 282902 278395 123630 56325 231585 257214 378979 160836 99201 52185 -320993 -107358
17823 73626 364176 133407 108464 173071 82925 -50063 -35351 180898 317985 41196 -96040
17811 348336 43359 -312616 140022 199035 151985 187090 242310 57644 -120244 78080 -4486
17799 45253 -41560 33438 -16425 88305 56488 -95043 172824 152041 -141011 -182848 72303
17787 -28776 135435 360006 294301 -3011 -96831 -74234 -57329 349290 -22288 284714 -41686
17775 -194291 -220192 165473 -194525 -301133 242211 -27681 276543 142737 -70531 297658
17764 239019 106541 -56344 158649 51362 132210 -119301 -117532 -28976 370977 74037 123830
17753 123830 239025 150836 12657 24443 98798 217894 -122797 98857 142288 163443 -23152
17741 321747 243579 223513 93344 12545 -90540 -100459 363426 -35470 58969 68457 -169627
17729 -135116 311121 -15399 215616 267441 16664 296644 152356 151510 287371 -73111 -271220
17718 -271220 -397714 130681 231861 114128 351246 54369 274769 7618 286067 133303
17707 87125 68600 -114796 169664 -137476 78118 194022 -232395 101676 14055 112882
17697 112882 199503 36809 72721 115150 62845 200810 61187 262457 237488 -16274 337720
17685 -4312 48399 135983 -63727 84353 -206119 204135 -12903 -202628 -280883 71334 506130
17674 506130 -145933 9226 19680 -152847 -162828 252325 234399 -24394 -20123 141544 264408
17663 264408 164278 135452 -188959 -153879 60385 140595 125296 137784 -114395 -49914 274877
17651 -238405 16505 81270 109741 -354263 290068 -53700 283348 131628 -183013 11989
17640 -24701 319115 -111558 265709 125177 -148683 41543 16956 241536 66336 -67878
17629 -9483 218595 -456349 119165 245643 -16727 178493 57696 -65548 206555 19178 99600
17618 99600 344049 260797 238415 -33008 277219 256308 629116 301888 478346 67861 241169
17607 241169 63709 108506 111451 -122030 188063 78141 112059 140391 337178 -229512 269723
17595 373111 6194 100050 31297 136285 145598 195906 -38530 -129482 -16432 -27653 114269
17583 -14819 151497 496597 40920 300411 161652 -255478 357511 202975 248240 382165
17573 382165 487348 313141 277970 311349 124147 -90920 -21879 110270 226195 39397
17562 125147 38424 88545 296792 -73751 229781 34196 -12096 -89755 264188 56983 -21171
17550 229872 5617 397825 74082 -184904 -5836 -56883 595196 2646 141734 193048 253174
17539 253174 55964 112898 127574 116547 161641 11542 -12960 -220 100406 132391 131265 554874
17527 554874 240067 -12985 346912 192465 19263 239273 81165 291590 93700 147292
17517 147292 320751 477065 181021 394223 89255 516601 701617 629713 1007183 1050024
17507 1050024 933920 549959 676012 176843 329350 304738 482007 298442 387758 338643
17497 338643 250486 720073 851250 1051054 1002878 1030920 650437 426026 681913 638246
17487 638246 525992 386406 165822 261213 -54146 257007 305934 71741 469509 210499
17476 56680 424405 474956 376872 233691 319401 89437 102273 452295 298191 342639 263222
17465 263222 181571 289839 338254 -115892 296501 195848 314436 373342 253262 185109
17455 185109 346573 106187 -9137 113997 243347 138521 303102 110067 437602 -1435
17444 263027 333973 -32873 189086 240345 306866 120702 197038 371266 209075 448993
17434 448993 188170 366369 401133 340088 435878 5496 566481 446266 59037 218449 466161
17423 466161 281774 368613 755748 180340 157799 787012 361095 322329 453050 183794
17412 490865 160786 340441 126520 353461 610526 382156 258057 83768 361617 119242
17401 393454 183347 242071 690491 345840 276637 425498 147072 13264 281348 226635
17391 226635 329350 71441 553362 603428 186929 414090 316634 481357 252727 198804
17381 198804 348865 233568 462451 34570 456915 261885 -75695 101331 418394 64585
17370 322064 515567 -2039 383726 442317 769514 108572 242964 -97811 254412 46018
17359 169180 375664 212922 552739 8049 -73969 229671 356658 145805 288173 146272
17349 146272 317309 183969 294015 168382 286713 9097 702260 301327 705896 183391
17338 351475 544083 222521 447744 263852 225950 196873 439764 355043 415491 164426
17327 269594 491384 371126 359944 299885 -29031 363825 11631 80927 324240 -239376
17316 84277 474591 415215 443688 98024 197213 303667 202413 366920 684346 378892
17306 378892 306134 367238 258807 245461 275207 218183 23260 232454 201719 377755 320394
17295 320394 42515 102267 427881 20325 396709 322465 207524 233694 329338 553025 133843
17283 315072 727879 322425 259562 211937 363789 736851 93639 295813 409463 141258
17272 504257 88636 165992 71548 207889 306633 545553 261120 432695 272780 108108
17261 596354 60493 210789 177902 506670 305975 15842 315181 598596 350335 200702
17251 200702 262357 463851 398392 182116 453060 106044 491825 115630 159064 222632
17241 222632 258997 244419 375867 439929 291494 253439 543717 295746 342779 313526 88644
17229 570428 493567 696791 413476 212312 312940 414831 159898 516469 289849 245225
17219 245225 251885 537556 402837 375342 267956 420836 116891 105803 364794 117213
17208 693527 235669 472044 288043 240885 560250 225123 302405 329022 414027 445631
17198 445631 121479 157112 479323 531908 287278 444281 435094 88320 512140 483502 404217
17187 404217 319915 228094 405177 665344 502075 197099 492005 247868 509369 605005
17177 605005 422641 198133 317192 259172 420897 267829 97782 372833 198325 496395
17167 496395 490729 472999 566289 474539 389074 534548 589051 448078 529598 188047 662834
17156 662834 472952 465664 529735 500019 381819 463946 580913 476530 534362 275320 637547
17145 637547 71433 392663 653781 748667 531184 257625 285425 611694 493328 351654
17135 351654 561945 663586 566469 662950 279417 762884 363449 537445 437481 354270
17125 354270 611694 466999 595156 493393 403906 521546 635011 570733 656156 457419
17115 457419 458056 496590 420702 522294 658323 522851 592860 121323 747884 643058 727526
17104 727526 668808 649136 536794 637094 501506 314938 779909 569544 740664 625108
17094 625108 759565 623328 473142 800953 812089 310679 640366 549208 800581 668511
17084 668511 456186 690042 733338 613604 617909 745393 675352 733958 968647 307861
17073 852007 657094 592640 777249 487676 496719 742034 450364 770100 1058635 554551
17063 554551 567080 737543 610649 869148 598209 797247 913065 745202 858785 953150
17053 953150 660931 938141 517833 918394 1120975 791451 883642 714590 794594 964102
17043 964102 635330 777018 809277 1087392 817412 670323 694331 792510 1012530 803064
17033 803064 677699 1008724 825603 736049 726403 854486 823642 920316 522855 911514
17023 911514 590132 648535 969346 1010099 945974 1211062 734909 941648 770582 1019023
17013 1019023 768445 1193013 1122020 937194 918725 1035928 1066525 983349 1038375 1196296
17003 1196296 1134066 965010 1124715 1280520 965993 1121799 781397 917217 985074 1135506
16993 1135506 1180592 1139252 963162 983590 935135 1111141 909256 1323370 1191365 1091609
16983 1091609 1041034 1140660 1080748 1265936 1204423 1368147 1320894 975511 1189689 1230237
16973 1230237 1230178 1241400 1360058 1252507 1285278 1441499 1083707 1175130 1420286 1123066 1500127
16962 1500127 1620756 1360173 1199117 1291441 1790694 1415285 1631909 1197546 1532677 1602965
16952 1602965 1380460 1564202 1751144 1545666 1218446 1939384 1479867 1723119 1669980 1644812
16942 1644812 1587958 1555882 1588155 1814525 1302123 1295946 1630690 1414816 1699242 1580283
16932 1580283 2027873 1496163 2057092 1693152 1945229 1695452 1638144 1610749 2360811 1702617
16922 1702617 1733729 1704884 1825056 1984771 2036198 1627109 2104761 2141875 1960997 2098442
16912 2098442 2258599 1839060 1999742 1722917 2098038 2048828 1903915 2050815 2329204 2523410
16902 2523410 2190495 2095579 2583874 2326314 2099664 2580866 2565799 2434772 2362427 2343768
16892 2343768 2404373 2665376 2346612 2825011 2593697 2758449 2837831 2597468 2946175 2714923
16882 2714923 3024566 2946305 2871716 2529816 2854621 3072125 2800765 2794420 3038477 3165314
16872 3165314 3050237 3355485 3266478 3124544 3132983 3120858 3402703 3574854 3613276 3430383
16862 3430383 3807160 3651665 3375817 3647855 3671146 4057621 3709059 3778069 3913218 4346923
16852 4346923 4143945 3724354 3989484 4333499 4436597 4144071 4314278 4575393 4412291
16843 4412291 4639739 4615199 4687087 4844958 4936817 4779781 4899939 4895795 4928499 5302922
16833 5302922 5136768 5418050 5335613 5706504 5176967 5589527 5552133 5761861 5764841 6095572
16823 6095572 6266899 6305125 6458859 6446299 6272084 6714339 6777395 6782152 7415545 7350453
16813 7350453 7411354 7253217 7710653 7678942 7600002 8123095 7807028 8184550 8168845 8571078
16803 8571078 8496135 8887829 9276462 9295383 9719818 9641489 9764068 10153198 10190902 10266887
16793 10266887 10696723 11070926 10944991 11271218 11751260 11994146 12238903 12647807 12508184
16784 12508184 13217041 13286960 13728527 13998657 14267736 14677216 15150836 15391325 15891174
16775 15891174 16174300 16721642 17456192 17946481 18105075 18626734 19014234 19487239 20103240
16766 20103240 20643608 21485598 22100322 22507539 23285172 23997887 24960961 25624148 26055257
16757 26055257 26993856 28164580 28747343 30074731 31045356 32172998 33219934 34202969 35415348
16748 35415348 36586443 38021258 39244579 41204219 42669294 43863471 45453266 47100385
16740 47100385 49075474 50725143 52891120 55199151 57401988 59670614 61930619 64240609
16732 64240609 66865619 69346124 72118864 74861319 78052861 80801688 83880101 87212933
16724 87212933 90140235 93732730 96755094 100219170 103464504 106553231 109348580 112513610
16716 112513610 115305975 117989262 120649216 122893533 124794900 126641592 127979707 128950196
16708 128950196 129506784 130291441 130480007 129874662 129066556 127847154 126401887 124960846 122362393
16699 122362393 120227619 117556943 114682068 111985852 108809608 105753793 102567553 99493241
16691 99493241 96114877 93016449 89483674 86462634 83254696 80177233 77435418 74141943
16683 74141943 71551443 69057362 66143662 63820472 60884161 58975276 56440414 54192935
16675 54192935 52158259 50018015 48309619 46251989 45000171 43111539 41615312 40298523
16667 40298523 38544881 37123282 35702365 34625982 33575907 32437474 31177001 30171511
16659 30171511 29387688 28265294 27511623 26552430 25518801 25079304 24465475 23414259 22486730
16650 22486730 22483475 21494823 20773807 20247861 19545230 18969218 18386110 17669572 17182126 17667911
16640 17667911 16385930 16361324 15661695 15370288 15074273 14406785 14067329 13979950 13498918
16631 13498918 13245705 13198869 12606511 12331241 12171085 11655315 11432431 11000794 11212264
16622 11212264 10656830 10556252 10249475 9939787 10188718 9776277 9393117 9292375 9073775
16613 9073775 8794613 8403138 8689480 8356090 8095506 8056522 7605842 7515529 7582348 7310931
16603 7310931 7196380 7110090 7163599 7108526 6804556 6412683 6627114 6254286 6408404 5989620
16593 5989620 5880774 6048784 5890861 5712330 5791082 5779263 5496375 5701296 5312865 5132519
16583 5132519 5412308 5174088 4759924 5184300 5057775 4920435 4995479 4871862 4528452 4430410
16573 4430410 4432828 4414952 4628369 4447920 4323902 4238926 3924485 3838731 3864536 4222788
16563 4222788 3803187 3762794 3646780 4153141 3764261 3726579 3882616 3660324 3765980 3471865
16553 3471865 3544215 3554246 3155322 3415011 3130696 3154914 3349736 2958772 2861896 3224064
16543 3224064 2936062 3051604 3000657 3115704 2913335 2919434 2852700 2804369 3044853 2485894
16533 2485894 2684604 2626565 2978523 2586822 2579160 2601786 2878763 2248406 2226011 2399866
16523 2399866 2656474 2349956 2341836 2290964 2278222 2218501 2208137 2527293 2321374 2363722 2276708
16512 2276708 1865817 2181824 1989357 2148471 2178874 2346700 2287381 1906756 2145036 1513563
16502 1513563 2340807 2254550 1649636 2254017 1895643 1928056 1971922 1972190 2059280 1727601 1470532
16491 1470532 1713311 1721720 1965212 1893459 1474138 1634544 1634848 1599433 1687659 1923054 1775583
16480 1775583 1522937 1420250 1585425 1458502 1374566 1476082 1598248 1811943 1720025 1402080
16470 1402080 1367691 1523055 1340730 1476707 1365509 1203541 1299221 1249290 1506920 1386820
16460 1386820 1124978 1618952 1302217 1592209 1416341 1295299 1407087 1352241 1301313 1056505
16450 1056505 1138219 1368247 1606393 1242173 1210279 1149213 1505735 1285565 1133734 1248991
16440 1248991 1069865 1318191 1579256 1245997 1298969 1239342 927170 1020397 1000239 1297609
16430 1297609 1291188 1057903 1222902 1097282 1184933 1022339 590044 777698 1404945 1152980
16420 1152980 1311226 1005483 774831 882779 1079544 868212 831057 936900 1106993 1267961
16410 1267961 1013262 816880 884072 1002760 774462 851359 806614 569286 1137501 821291
16400 821291 1068929 969596 924117 852147 843208 958687 887825 994567 833184 807510 695763
16389 695763 837914 873226 820176 853426 526192 820984 1041099 913474 949701 761229
16379 761229 765210 819659 1011739 357388 1170010 667009 834111 767983 997808 1129612
16369 1129612 871534 768969 915613 817722 935178 583428 639833 756778 902137 938364
16359 938364 798246 983808 542030 800452 623300 788363 868317 598341 691657 801586
16349 801586 623241 639946 802690 718722 414243 881662 814737 542876 633207 227328
16338 834110 1007334 642185 401546 766964 804126 753606 694334 641985 566990 660682 678821
16327 678821 788333 570989 214851 786003 691711 534463 216415 259338 707345 790233
16317 790233 554118 472544 644623 586655 373732 432846 427316 571467 807704 492902
16307 492902 465204 529777 504008 319769 743166 39613 377596 558424 433454 884627
16297 884627 776109 535914 626968 447691 411633 638159 917408 450407 278592 668028
16287 668028 554761 679066 224452 631807 786123 455238 383216 780457 663533 591065
16277 591065 748552 408098 290427 566967 478116 651006 49315 595271 558101 104447
16266 577328 335061 898900 559767 513292 512241 395683 394885 188966 133091 516595 407778
16255 407778 347918 289986 441894 114782 427986 260760 389783 223720 221872 372930
16245 372930 505137 496905 206655 672965 294846 294927 586026 551651 323400 403369 602497
16234 602497 145142 699210 124192 318064 59157 551155 749596 233279 397782 555302
16224 555302 353944 681759 -79875 333527 81357 322017 314975 267405 263312 389364 452048
16213 452048 487859 437896 443941 332446 65862 195629 664551 150679 553689 3650 432463
16202 432463 437650 487917 305131 431742 87390 19319 352816 371767 313223 209355 365406
16191 365406 133196 337579 345239 392895 468693 106275 183970 369191 -123792 429108
16180 168455 -120583 114628 275022 48371 446299 358577 248865 431439 249431 448008
16170 448008 523899 594923 191030 504434 258840 280075 -70780 377087 148773 441600
16160 441600 268571 297668 416341 259854 521436 53411 200391 294336 43743 206299
16150 206299 351169 311464 183987 219205 25839 -1017 91554 145345 444817 237959 409570
16139 409570 112124 239219 37403 -102688 38197 200234 428587 86224 334294 263037
16129 263037 18902 180883 303674 142653 226176 201836 98176 99400 106832 389836 59618
16117 -41389 158883 133993 230377 288744 149401 566864 215054 149317 598122 -28351 -129911
16106 -129911 36975 88290 368340 21917 31957 143422 336066 130652 203538 374629
16096 374629 203587 333275 -172903 297188 164120 -153938 -7272 191359 147788 516697
16086 516697 395082 85163 10271 91653 296171 398946 204302 224539 90358 156149 235540
16075 235540 88037 -148916 -9666 256031 345298 497489 271172 -95130 229027 -91270 114996
16063 58224 126676 -98297 -121890 57124 315707 111607 -117220 -183950 323542 61662 -65854
16051 -235821 198198 11400 123949 -307825 127243 -440769 -86656 281613 -120673 77303
16040 -32622 320211 157730 132610 29697 -1698 158639 -128874 74309 -114940 -99326 113605
16028 -59583 17457 100216 84052 -300793 97050 129229 336322 -89216 -991 -119261 -102069
16017 -102069 48980 141196 -264513 222925 160656 200566 304773 149039 -104997 63361
16006 137881 68926 225146 298127 73022 -51270 102242 73464 55995 177084 -19843 61537
15994 250486 -8076 169221 284306 22566 65472 254879 124565 315951 203156 20284
15983 92337 199806 253303 181007 57658 255872 -27232 4233 47997 -91876 501830 439542
15972 439542 777576 745912 1002400 689093 975219 744777 680881 398631 232633 -150762
15961 423456 157749 -78871 53896 -76026 201243 -86228 -33224 -145229 136749 106467 -115458
15949 -49345 156863 55497 -61516 165622 -10741 182800 -33553 -186172 206981 276851 -16216
15937 122851 231017 233273 47307 -41614 -68119 -136350 249543 48267 126816 -61858 67738
15925 -89207 -116506 -103824 -101006 -76348 52604 -43053 -114407 -356694 485355 -330261 -209771
15914 -209771 107233 111210 176534 -130435 -77545 -5295 -21649 136975 -165022 5658 286188
15903 286188 177826 242474 -117992 36793 272707 -60855 -287891 393572 -19913 -43175
15893 -43175 39820 -61266 -189308 -231586 -190532 44304 149548 79354 -55340 3120 -139415
15881 -27944 102370 -91564 -105356 -80784 -298517 -181411 53098 -105402 55376 50218 217594
15870 217594 80591 60277 -80740 18611 -237949 -159722 -87634 -46877 7226 -255647 -340459
15859 -340459 -160841 -67121 235996 -63548 -75313 -44255 -108313 -41387 -253931 -264238 -139367
15848 -139367 -83425 -13140 -193447 1202 59664 -144666 -232862 171539 82113 -128246 -84315
15837 -84315 191824 -27943 225 60402 46900 102624 -68313 -302942 -199957 -22650 140772
15825 18302 -114320 70478 57273 -161586 135579 194146 84668 -237402 -131502 -184703 -258401
15814 -258401 -307824 -137846 -214568 -395374 142667 -256641 216016 -107883 153739 106021
15804 106021 -195564 102062 -313734 -68414 -212213 -379282 -312032 148458 -21905 112237
15793 -101804 -275527 43557 184961 289574 -29042 298334 192686 119072 -12304 -150169
15783 -150169 94713 -13710 -89803 166686 -346955 -117938 -18028 -153159 -139926 56907 -50713
15771 -48238 -159172 -344078 -39537 -169007 -201381 271411 242736 144393 127579 -258334 -221025
15760 -221025 153171 -9932 6384 -439020 -163669 24398 110714 141256 -208792 -28076 165372
15748 -52370 171179 247652 -64675 90805 86473 -211323 205429 182246 -74688 -306809 359388
15736 394426 -94014 136024 -230644 70164 294924 69980 -72484 309138 38861 198725
15726 198725 -27244 368892 -48967 187293 88792 109985 -245828 76420 -54914 -32636 47339
15714 46710 -57905 248394 -170325 214353 168181 172938 220839 -437321 -108987 -178702 117690
15702 424630 152001 -196510 92438 -108337 -224718 -210315 37635 -115929 -32377 174644
15691 162778 -336574 22619 164528 63970 82968 89917 -205762 184022 201035 -45687 288937
15679 391419 15016 31627 147548 -131524 -88751 -55885 -72047 134480 1411 25731 92777
15668 92777 203771 -38461 15825 39793 235263 -314261 106324 -199696 -344666 -173499
15658 -173499 168418 -24475 -293011 295267 7217 133216 -125794 -91662 309427 -49691
15647 -65193 131478 -336220 186684 -215114 42868 60988 76002 133801 -22394 143581 -280662
15635 -50914 -65401 -158316 -207709 -45810 -31932 132257 -19966 108223 79816 270492 -58535
15623 245477 35443 -160333 153356 -115080 -179466 118483 -116839 196342 -111516 -255235
15613 -255235 64343 146516 -196305 3231 -167807 -128362 -508870 -91448 27680 -117676 68528
15601 -18261 -135408 -143030 -262318 -161080 312559 168637 -374465 -67345 -282657 -175932
15591 -175932 130182 63997 -1695 -172321 279015 160598 -70457 -201103 150106 -161291
15580 275564 -56464 11821 -202161 34702 130908 -45369 -312349 -149799 -135337 -92673 -76214
15569 -76214 -185390 -94942 -105071 -89250 144627 -223692 -187166 102370 -214232 -3306 228693
15557 -132382 -197377 123974 126886 -160676 10704 100020 -138163 -140022 -61840 31253 -7336
15545 -61152 -9957 -178214 -146361 -28994 141819 -29413 -206173 102020 -76997 -164707 27184
15533 168409 -58934 17681 -233101 -30518 -72756 34344 -12786 83874 58459 225864 63993
15521 74191 273886 90403 -41031 145968 -108417 -237202 138225 -1651 -69155 -84141 143316
15509 -220906 145581 217198 -95556 237341 95382 174099 71796 -146117 44011 363093 141065
15497 67756 149211 617988 420150 154076 254286 9587 213078 -31295 412799 -63333 366778
15485 44903 19331 -137468 337464 155887 93000 150809 -75242 192082 104152 145762 80192
15474 80192 235855 -178498 -65770 161285 194059 86478 -167952 8285 -110467 318862 168926
15463 168926 43952 249843 16619 128741 169906 565332 453486 612941 -36389 -215255
15453 -215255 -6111 283583 15167 -3886 121881 -8725 134856 314904 83524 -225782 175891
15441 45984 -61196 -238563 -53406 73410 246724 107010 -243238 15935 280335 193630 83530
15429 28373 217081 158082 567131 620632 1066123 704041 532054 520338 267361 148215
15419 148215 -230778 84283 -85972 63782 107710 -85120 83470 175178 -76881 361041 209244
15408 209244 -169394 -100305 -281387 -272040 -340553 236672 -93593 176292 72196 294231 206671
15397 206671 154632 340852 265456 106975 -179274 399675 -215811 -142341 311749 -292358
15386 74979 5367 -204810 -7380 -189949 60149 -22960 -8348 191672 -137441 -182788 471732
15374 60459 -285969 180094 270165 130570 -178214 -31008 121872 160015 50333 -69188 36045
15362 -183672 274807 105824 167349 334502 255589 211087 42313 343964 192629 233552
15352 233552 270423 302996 425334 -160986 26137 33113 194556 89813 71584 331124 138521
15340 253943 137130 31764 530999 309040 327395 74896 244728 159758 -34279 240378
15329 203184 254207 -71129 497109 153742 45245 71962 80051 96368 55226 -54443 379449
15317 299293 -8787 -4363 -152769 266583 -93949 257913 319631 417547 -28441 -121537 -39813
15305 31271 -1850 -32975 81041 -44467 -52779 412301 140088 338689 238525 16491 443354
15294 443354 363105 149283 100849 322151 -73370 354972 102177 74292 62269 -9694 97049
15282 -54371 -95340 2844 -61009 -60895 -74180 3561 -33196 256831 -32896 -175375 -168020 166315
15269 -118533 -100232 209228 11923 88598 -52581 163549 81385 79068 167792 -66496 198487
15257 322235 448994 127106 -363008 237529 46416 -218532 -195883 -217121 114598 69383
15247 69383 194761 61756 255231 62697 -176389 164729 181279 105902 -89941 -57700 146887
15235 34085 365131 315603 20646 266246 275056 659065 992368 1442641 1383239 1344052 1291473
15224 1291473 759532 385496 96155 233071 97064 336864 360313 57715 312305 254876
15214 254876 156780 -14464 -111030 56701 154466 33088 47724 193037 -74320 153738 -262345
15202 320907 63642 -22857 172735 165816 -37520 126321 -17466 145752 141032 346313 96640
15190 153548 -273642 -80153 166760 -105924 8977 164342 -108431 -43599 86485 8259 -258345
15178 -274186 -114206 42313 63038 -293168 68397 92791 -96461 -231547 3764 137992 188468
15167 188468 -296414 239710 99936 126677 149165 377633 -232432 294407 94011 72635
15157 72635 105827 -50474 366488 33039 65313 -226402 169203 174938 147668 99702 98039
15146 98039 139171 189916 -26858 -141791 776 17498 -165799 -78527 557821 136150 350149
15135 350149 114447 13482 54730 37296 226700 -106169 -214127 158519 77824 -49085
15124 106549 191097 -89042 433635 151238 -203899 245435 112950 -5951 364338 203871
15114 203871 113544 124631 87341 340184 136757 51247 412476 222429 444996 204250
15103 533079 153157 258025 327034 288453 34047 47184 119416 332904 -96432 -7356 -92962
15092 -92962 106223 54855 358838 -52717 317581 73452 204599 164074 -63269 423762 92772
15080 137775 207085 44303 138432 -7340 -40005 -28129 177727 149189 151752 58867 104550 215945
15068 215945 320592 190953 237926 177386 152090 359542 252068 142699 25151 151249
15058 151249 129277 7248 414717 210768 -121992 340349 521767 187701 375129 -24243
15047 414919 645860 324741 150553 33103 308604 232886 234151 247453 256754 430790 499167
15036 499167 206679 404297 306571 122179 524675 460069 350054 318673 462176 385490
15026 385490 510019 191913 34226 641544 560662 383027 186136 837565 650452 471636
15016 471636 386535 589200 718700 373924 708655 637720 607705 119479 373677 723970
15006 723970 833681 590518 473617 558832 265516 398200 229232 451496 316382 234932
14996 234932 229861 438746 543698 386382 712761 566088 578316 380206 390275 568289
14986 568289 335001 690064 522764 429481 769317 298682 557166 294226 340493 650700
14976 650700 576011 459910 713338 843347 480554 473646 305794 478448 796295 583065
14966 583065 494109 716716 517369 671259 582637 477371 498637 638379 667329 502453
14956 502453 469112 480132 649108 520073 352155 18924 433869 432539 -103940 535682
14945 464617 114826 508593 162680 266389 96780 303684 286174 431661 364645 416091
14935 416091 281561 83801 612164 400891 339384 361804 927400 418910 381762 274256
14925 274256 543834 445606 479057 715907 238194 217961 513420 635109 755832 916805
14915 916805 864425 918935 1188898 1290867 1104458 1444949 1486446 1328923 1198537 1204278
14905 1204278 1448102 1279488 1249697 1705455 1837749 1998176 1837291 1587266 1348945 974986
14895 974986 940884 795539 864129 609157 443363 209459 467474 230141 222762 317505
14885 317505 628835 545078 506367 624536 231571 362560 224565 457980 502833 493738
14875 493738 465222 396944 865356 430305 442689 542326 589073 564617 1003285 1049771 943022
14864 943022 886963 682007 543730 533151 630520 823532 326429 293592 160937 500323
14854 500323 731845 662819 507588 427524 707049 470034 603333 628585 526992 522567
14844 522567 537166 377817 651915 771942 413055 465823 593976 411252 666986 330431
14833 402079 539931 196144 613451 677411 393771 817075 1008655 868067 756404 807988
14823 807988 956047 886190 1296268 845848 507070 474394 632242 813037 615521 654755
14813 654755 530706 837635 652115 561392 822085 510078 656791 877612 531513 735712
14803 735712 904423 889694 1063094 935745 535439 858005 535433 546072 789958 628387
14793 628387 506256 452210 547591 603231 855143 667198 905496 813793 757567 767847 720968
14782 720968 578150 589198 646581 453273 511050 821969 589153 512122 594810 737869
14772 737869 746013 578012 739895 640838 568801 811029 594648 814035 482249 1049772
14762 1049772 848059 974638 1180726 898662 1118344 862284 945631 882775 658416 787901
14752 787901 510353 498723 677465 820385 676148 856280 698048 671202 1030415 646184
14742 646184 659804 520773 619405 839482 808446 862695 947003 969961 658511 787766 528589
14731 528589 789076 1012738 679585 698361 645002 892283 988850 1162238 664049 907075
14721 907075 588390 768277 701362 733981 653253 1033603 1064477 998717 1439180 1146678
14711 1146678 1511396 1799638 1566339 1478005 794878 1161675 1493949 1062251 963909 1275857
14701 1275857 998074 1064801 996892 866234 870015 971052 879028 1078747 1054926 951716
14691 951716 1298175 931866 874791 1203944 1365416 1543635 1650983 1211503 1705971 1343009
14681 1343009 1422111 1066341 1048020 698334 1505863 1172979 1140793 806493 1170211 822942
14671 822942 972287 1192157 894502 1061089 1011804 459715 908122 1148473 1173551 901366
14661 901366 1168472 980325 885341 884321 965822 1032806 940694 1173414 1059398 1191785 1052894
14650 1052894 1205155 883303 1207263 816933 1080755 1213251 1150266 1071622 868185 893710
14640 893710 1248001 1073681 1393627 1303784 1429584 1480525 1309214 1580126 1044101 1164343
14630 1164343 1222001 1226140 1120224 1252271 949450 1189454 1047592 1238725 1176907 1396403
14620 1396403 1345877 1193104 1162757 1557958 1320529 1461972 1261417 1166555 1185212 1288600
14610 1288600 1326257 1588082 1258249 1226697 1425451 1646465 1634265 1432943 1391850 1462442
14600 1462442 1389427 1602904 1505393 1510672 1354377 1577827 1207767 1762798 1350131 1693562
14590 1693562 1545648 1656881 1606202 1655269 1467597 1855136 1566004 1868564 1602203 1978067
14580 1978067 1552856 1688109 1858881 1848804 1768255 1739130 1720505 2048134 1818573 1415678
14570 1415678 1858357 1658636 1841102 1634591 1813676 2152533 1957420 2010710 1917650 1676813
14560 1676813 2212780 2130470 1994062 2201977 2367935 2328408 2331315 2433421 2109423 2279684
14550 2279684 2516124 2477299 2510585 2316310 2807896 2958279 2967200 3585485 3182796 3614470
14540 3614470 3758247 4316104 4830606 5178064 6196635 7654965 10205484 14379219 21197291
14531 21197291 31145310 31396819 18011654 10825432 6698085 4604596 4280902 5067642
14523 5067642 4761732 3584961 2960248 2384446 2362485 2623354 2454941 2377311 2628391 2293884
14513 2293884 2247604 2214671 2181226 2436343 2811436 2430292 2444444 2578291 2491789 2377708
14503 2377708 2365653 2675592 2418916 2603290 2531178 2693968 2832056 2941161 2828844 2965834
14493 2965834 2976661 2804444 3194360 2530529 2794003 2976989 2781108 3244730 3281852 3450242
14483 3450242 3165693 3363779 3310672 3300298 3473320 3482882 3404044 3259725 3299190 3573863
14473 3573863 3547161 3564798 3676660 3608955 3765750 3838225 3774136 3924495 3605968 3878184
14463 3878184 3722596 4243584 4250904 4498348 4257219 4225077 4630253 4242948 4319326 4538086
14453 4538086 4594241 4638381 4599227 4666324 4720770 4512762 4823441 4467495 4698570 5141980
14443 5141980 4714781 5023793 5182642 5225249 5505644 4953214 5576179 5383745 5533966 5493825
14433 5493825 5540486 5684664 5645942 5571483 5825563 6008371 5809574 6294807 5923161 5945916
14423 5945916 6080012 6471609 6462658 6933062 6730680 6813994 6760296 7058220 6933319 7182307
14413 7182307 7140096 7194950 7516801 7720846 7655046 7804796 8027629 8105321 7957112 8579965
14403 8579965 8564805 8657265 9175696 8925445 8771477 8761419 9049154 9034289 9471173 9581099
14393 9581099 9408770 9700500 10036853 10190866 10312319 10444336 10806017 11339492 10937503
14384 10937503 10994461 11406844 11112878 11530179 11329784 11814848 12399116 12357197 12387469 12926716
14374 12926716 12855621 13184953 13469882 13532269 14031819 14147480 14904565 15158505 15024410 15188486
14364 15188486 15335287 15949824 16518898 16424834 16789893 16586005 17461174 17380131 17809121 18508224
14354 18508224 18895215 19216620 19443854 19680353 20343232 20906777 21350875 21723399 22014015
14345 22014015 22380544 23002101 23435971 24017166 24762388 25016522 25434559 26017859 26934882
14336 26934882 27697473 28001025 29061216 29810769 30539507 31519655 32020015 33207890 33822965
14327 33822965 34515472 35709029 36490586 37828045 38442907 39987896 41043052 42466804
14319 42466804 43647723 44774799 46106579 47648000 49231666 50773509 52389795 54052450
14311 54052450 56016563 58072687 59861023 62087189 64415240 66684491 69178244 71396266
14303 71396266 74617765 77357641 80176484 83265807 86498966 90344682 93940125 98020518
14295 98020518 102234259 106484125 111127274 116492128 121783518 127454977 133492329 139775810
14287 139775810 146700640 153940517 161377868 169503461 178105245 186793035 196776173 206996432
14279 206996432 217589741 228944590 240691726 253684333 266804252 280677208 294905618
14272 294905618 309510035 323951279 338070573 352562053 366788064 380731125 393625167
14265 393625167 406465758 418207352 428257347 437766624 446382422 453403272 458123020
14258 458123020 460109834 460523556 461031714 460867344 456555861 450795846 444394976 436635001
14250 436635001 424575311 411717058 397734501 383545689 369435842 354991148 340621602
14243 340621602 326189597 311335583 297600482 284654762 271318143 258920530 247101941
14236 247101941 235486644 224834064 214187769 203782678 193674111 183461599 174422530
14229 174422530 165837746 158042126 150072693 142657364 136123078 129690743 124079543 118648671
14221 118648671 113521065 108463968 103826447 99416957 95571112 91617033 87990937 84709567
14213 84709567 81116737 77940877 74810252 72297350 69799164 67120436 64717722 62418059
14205 62418059 60675317 58671001 56574251 54722954 52970590 51283801 49718537 48304993
14197 48304993 46692468 45345263 44152447 42669632 41934708 40617468 39709703 38375237
14189 38375237 36948010 36004153 34950189 34274193 33790172 32422007 31704583 30787011 30377865
14180 30377865 29324130 28594103 28274477 27411907 26766938 26174523 25224226 24837135 24215713
14171 24215713 23562921 23368436 22517036 22239722 21615612 21016168 20486477 20014141 19932536
14162 19932536 19573851 18824424 18497187 18142028 17572898 17693880 17237887 17079662 16591401
14153 16591401 16154445 15879241 15614125 15317434 14771845 14611430 14453716 14031124 13967900
14144 13967900 13631477 13520787 13228185 13111174 12539347 12751845 12519165 12272135 12143888
14135 12143888 11600458 11558068 11448775 11261010 10951130 10935470 10580363 10598799 10145425 10186582
14125 10186582 10000157 9951306 10093437 9806603 9500551 9402555 9107722 8954837 9546715 8635852
14115 8635852 8668707 8652824 8635060 8332752 8144976 8127410 7873756 7748814 7921310 7858002
14105 7858002 7509136 7353831 7655983 7395137 7454089 6916938 7144210 6803992 7146329 6660114
14095 6660114 6774759 6876948 6400135 6239430 6382388 5978776 6019718 6313348 6284798 6408322
14085 6408322 6069560 5917956 5969732 5754003 5564666 5486908 5772909 5491573 5586073 5036384
14075 5036384 5294254 5134232 5187563 5250004 5156850 5051341 5011803 4881850 4993825 4825081
14065 4825081 4789863 4738919 4399535 4545786 4573129 4482093 4657144 4470367 4358506 3911808
14055 3911808 4062608 4258722 4340004 4105076 3680086 4077466 4192684 3802411 4094102 4027368
14045 4027368 4254957 4372935 3793035 3956618 4139556 3896543 3822809 3168769 3435211 3471358
14035 3471358 3432435 3520682 3646492 3356793 3485218 3110385 2989822 3285839 3296098 3309940
14025 3309940 3118123 2829094 3323096 3022891 2981640 2925886 3052742 2928648 2829533 3156248
14015 3156248 2802535 2898503 3120575 2759587 3147313 2847364 2488648 2899345 2365782 2785830
14005 2785830 2754152 2821601 2750085 2416752 2566599 2733834 2398983 2718646 2499252 2666232
13995 2666232 2070968 2281186 2046393 2338550 2639510 2369846 2268202 2260505 2084381 2454720
13985 2454720 2124616 1916174 2401183 2178866 2231603 2390353 2727465 3118079 3640626 3360521
13975 3360521 4743318 6679736 9737837 15511810 26269025 32931486 22341656 14288310
13967 14288310 9463923 6987619 5255817 4682026 4027655 3589047 3716593 3507471 3043003
13958 3043003 3020264 2705037 2858136 2725688 2482050 2430720 2553635 2560468 2414490 2292109
13948 2292109 2234530 1893950 2172411 2138557 2046496 2058749 1719042 2138872 2090390 1882531
13938 1882531 2131802 1945490 1819507 1707809 1861304 1754036 1955258 1721341 2012421
13929 2012421 1955139 1753165 2189804 2012352 2043303 1479197 1881640 2018425 1624109 1568959
13919 1568959 1771453 1893281 1378141 1497246 1911178 1318693 1567731 1717958 1484836
13910 1484836 1356477 1617895 1013111 2038513 1737580 1295569 1696539 1609777 1369387
13901 1369387 1613900 1435482 1281853 1125564 1364087 1485056 1599165 1445516 1225471
13892 1225471 1574235 1419837 1234977 1230458 1357611 1262691 1450795 1182946 1596839 1264977
13882 1264977 1195282 1059093 1336584 1141474 1487759 1032130 1596894 1441103 1412342 1268443
13872 1268443 1230238 1133988 1402004 1253798 929224 906581 1388247 1140346 982936 1174593
13862 1174593 1175759 1259409 1105432 1244716 995424 943307 1148515 1027445 1358950 1166861
13852 1166861 1325283 1132619 991247 930377 1191004 1052881 881230 884404 846434 1274443
13842 1274443 751828 837335 907498 625500 1173920 1090773 1134778 1086214 752431 1287868
13832 1287868 1109570 1286383 923665 847560 653302 859333 1014874 1024006 1081249 793032
13822 793032 863345 1007249 700606 618035 920987 1153317 717371 891814 906194 1056229
13812 1056229 772105 934390 761205 802799 1102289 813862 536773 893333 814424 1062416
13802 1062416 859539 569052 834302 948755 648716 855800 1039204 679008 689717 870298
13792 870298 827939 782266 778275 610844 980442 760616 980083 724465 889698 745127
13782 745127 489894 777989 780358 954485 492275 755882 651672 748831 1033361 663614
13772 663614 416584 1205932 785401 787402 623130 719915 1181277 660286 717851 699456
13762 699456 716956 850661 567973 806303 603462 656796 890131 766184 476894 747770
13752 747770 614538 755667 566048 901253 679614 408818 494315 607096 667249 681256
13742 681256 834895 189478 614134 891628 709584 468669 511007 558933 496370 375893
13732 375893 418729 632356 653475 813657 741418 797302 731488 748211 146783 596467 495736
13721 495736 417706 412462 505895 547500 721714 816190 569562 583656 173970 701519 740387
13710 740387 402483 716703 396905 581602 668180 592900 672048 433578 787020 694392
13700 694392 589366 571974 209488 778085 548346 691232 191964 265423 172195 358651
13690 358651 328468 681145 299389 584645 392993 460381 429603 520453 398067 345407
13680 345407 120412 444229 356590 581115 601481 453647 119651 239382 386659 366411
13670 366411 423498 129727 665830 652173 244829 431757 448577 406371 539051 547252 401183
13659 401183 503760 581090 545865 434940 410530 210900 421910 551309 469823 422952
13649 422952 480910 613673 316342 320617 843317 450466 428760 737326 459776 600664
13639 600664 620906 166611 221730 169361 306712 620544 306252 257137 354508 254660 504054
13628 504054 304196 399800 346187 25140 383491 463371 29278 334337 326343 347281 592928
13617 592928 99428 435940 385770 482988 345704 452105 192630 230734 932295 359911
13606 405524 381422 69276 390496 461931 337622 216745 287834 295470 511121 400514 450272
13595 450272 263276 422707 620300 225009 402283 465057 -23144 443284 501057 563046
13585 563046 131490 415596 258678 357317 280603 460029 492286 93893 281775 295044
13575 295044 -99045 517894 465550 519914 172041 387403 92590 621331 367652 -170192
13564 85116 841904 112107 41997 454579 234717 357893 409078 391253 311954 175846
13554 175846 274755 254023 248009 -30646 408747 468873 266804 -213463 49597 238727 411873
13543 411873 415693 268463 469393 438086 239337 168620 263965 453329 7255 334841 535239
13532 535239 262844 363575 391496 500627 268942 518092 399795 305491 258375 381777
13522 381777 378906 565708 155241 576603 244069 -27291 471294 115294 100168 257938
13512 257938 365227 441343 145825 194175 400572 -546 174554 149543 339880 342873 271014
13501 271014 272512 222683 74656 154077 -124230 295816 448372 56092 121017 428273 170754
13489 417579 429540 176641 169924 326529 67163 164390 495051 -25844 273181 170433 285720
13478 285720 295009 179341 226026 62289 127402 393009 67634 519215 156665 191322 382340
13467 382340 384309 231543 400655 213009 97831 180670 257787 86922 50748 228395 446207
13456 446207 396588 347974 152784 274012 155239 326936 12043 223350 510562 366783
13446 366783 76327 230961 -2240 276715 22185 165206 338342 111150 268625 -852 221028
13434 13337 157726 25929 282026 417125 328710 160064 220545 446803 255129 201645
13424 201645 210674 -7587 88176 328609 244187 233676 195278 328783 423400 168913 297160
13413 297160 -46906 221240 21828 -60119 86852 -55795 193008 209082 54426 -62674 -143589
13402 -143589 -30132 213381 16611 493521 56994 140832 126198 387079 496155 15681 167697
13391 167697 -116067 281941 147072 62981 189776 158143 228680 168006 30899 71361 188825
13380 188825 -10156 330559 27339 9376 -37145 233893 296952 109539 290399 -4067 106427
13368 140980 193777 14194 1699 -94606 1687 205247 148056 65663 251762 324761 174407
13357 174407 148679 143957 234474 221073 112313 77394 473656 495482 244241 -169779 30294
13345 432874 183823 95951 -264695 -77619 -125100 279242 217547 -81524 245655 260779 311791
13334 311791 487451 21992 344326 59852 222879 373957 355099 296585 219515 151109 171310
13323 171310 250627 196821 158004 283207 250640 -8214 88599 78932 122931 82381 -66051 140889
13310 327297 221413 500806 277925 323325 271906 265613 176134 388845 339682 11798 278578
13299 278578 -75681 54825 333927 245614 -5244 449326 -9859 220104 33378 -64230 235861
13287 318384 218094 17457 -154526 470697 349699 127018 49181 301628 471772 43615
13276 -11848 9280 120637 395170 -19939 234037 -52885 145797 133006 304422 -47394 178028
13264 31485 -5726 161649 -67430 141096 101417 74820 -151330 387823 431685 -53352 236423
13252 86587 -12318 -108563 -225823 188393 18908 109003 211365 -50626 221954 238620 6235
13240 106379 -177064 -103228 -43495 -6507 271161 -99396 7945 -68280 94353 48155 244749
13229 244749 -129 -124836 56489 152114 211984 -44473 -314358 -95871 101160 -170242 -57184
13217 188987 150516 -204231 163996 126517 -100341 284584 55648 101088 -448342 100573
13206 291746 99138 151443 111078 287313 145050 7893 -108305 405960 -76433 -13042 53211
13194 81419 -78529 150506 51178 325650 62808 -101348 41306 110242 73610 311612 -2878
13182 -16998 40245 182719 135827 144882 127157 167504 90018 250095 74919 99356 174597
13171 174597 125230 -215872 -163908 -44806 199228 -42539 -52781 162871 278230 260560 -144286
13159 -98866 -234587 28651 141465 93785 -42261 319521 -363419 386096 128880 -778 67418
13147 180253 -358911 275364 -159108 248617 -214056 -81182 69952 66591 37951 181869
13137 181869 182648 84267 451870 68080 50254 51188 38835 47830 -46892 -77960 328524 -40089
13124 -110427 -7813 135680 272929 142784 -11568 434368 -61735 315389 96297 145962 -286614
13112 203490 -221563 241269 -112997 -41776 151547 -286371 178089 645662 -44501 -306373
13102 -306373 47000 78042 306674 68686 -96163 335171 -230918 215244 201189 -84756 59129
13090 145347 23071 73743 134230 266806 166576 286166 168141 78866 265054 240661
13080 240661 -8495 152028 -77354 416165 80258 134768 68210 111078 -133669 -329255 -129528
13068 93270 56187 181353 -335698 343893 48995 -3793 -113496 379191 -178152 -2029 -95725
13057 -95725 -199134 70565 163277 237197 138123 79082 63517 -28978 49550 278836 108189
13045 -19392 20233 101808 189983 411781 227334 3232 -181238 -70360 20321 -3104 251952
13033 225776 132587 -4054 348852 94354 6739 -282251 -172779 208221 10141 148782 -76037
13021 112019 -148738 -94456 99042 38377 114480 404110 279097 -79818 131275 105505 -100262
13009 136057 -275670 -220115 -67268 142837 -172874 131152 -144991 -183838 113623 52347
12998 51792 282866 24609 70703 245421 84200 -5210 -90162 59556 271472 193245 11379
12986 -162266 255367 97458 3547 243870 -106590 135904 -33991 -189283 214370 -67263
12975 -227168 -3910 -135147 -191032 -39773 -77985 287782 68290 357162 5742 -5137 -47330
12964 -47330 57158 151641 -222753 272857 41119 73237 74 -126271 280440 -171714 -45534
12952 148184 -37772 -159341 147037 -135887 32319 -20762 -295876 48704 -17504 152804
12941 -299389 308939 167914 125527 169868 -14401 -266355 308420 131676 102482 -114644
12930 191845 122101 145483 110091 109145 -103151 -2262 -216228 51369 319508 -126729 87687
12918 320118 -276634 519545 -339876 128563 180421 -227462 -157149 -330342 -190783 128984
12907 -314989 -25821 70396 -78924 -407872 210916 -245921 147360 16291 -92449 -45483 230039
12895 162793 -108760 -179514 15719 -88654 98173 -112288 159353 -57701 53055 174869 -12132
12883 -33122 -150447 -22788 227965 271846 -32247 395331 368242 9386 -265585 122316 29271
12871 104480 -71942 -98352 -41549 -162627 263785 19676 -189001 -272935 14684 13576 93800
12860 93800 133294 276073 -31066 -159023 -265589 -36027 -141038 67075 -264656 -187490 -96748
12849 -96748 -30454 -207579 -22877 -113750 -33351 481115 81966 257874 72203 -190823 -88395
12837 24228 -145024 -66864 92832 124329 -150671 199587 -419295 -125830 150010 189823
12827 189823 -16344 311305 139664 -54587 -135699 -118861 2629 -90391 -130815 25684 38691
12816 38691 15315 110779 -8156 138287 250083 93501 24967 -147702 23296 367851 -111317
12804 -64633 -212002 -3030 -8976 864 157304 -166924 64732 -67055 -129197 -25452 23760 27296
12792 27296 -22235 -174139 -149727 -204769 -317295 -171465 -21248 -374984 -36334 -114708 68820
12780 -120667 -81831 -14991 -134717 -119645 -199942 -65038 69542 57781 209418 -393373 29352
12768 -518584 300191 -373489 -180347 130959 64430 198783 146024 174414 -135043 67841
12757 -160214 -330796 99441 -16912 -105889 15958 -165543 -193910 137399 408212 34769 16936
12745 152059 -133970 80555 -375101 118314 -38694 216303 155021 -135734 245199 -276790
12734 -275911 -108007 -68497 84326 -70809 28276 120601 148515 202742 -96969 -24827 35043
12722 106559 206674 94818 104313 67288 -136088 165551 248599 -51182 105643 123644 -177219
12710 -236476 360220 -56520 -87169 -74087 -46573 294277 -119218 -136227 72599 -425675 -247310
12699 -247310 -112467 176098 -236427 -157672 199717 56062 172250 -68104 184386 -14842
12688 126261 -177350 26195 93116 78159 110284 -117372 -19634 310731 153492 93029 -138271
12676 78815 -52050 37305 44056 71150 502741 -169274 -22042 -232151 260955 201648 145517
12665 145517 -11720 -153466 -131150 -140347 154795 145759 -82754 157276 354983 91171 140955
12654 140955 7802 -77595 73496 455185 4332 89807 -106955 -100526 332317 -192533 78135
12642 -155241 146841 37728 56479 -164511 -74535 88765 342009 98423 205992 7542 -118507
12630 -171549 268945 74073 -142563 103856 82240 -15405 -42147 442478 243936 -300091
12619 -72490 -113640 102652 48346 199782 287624 168567 124822 -63515 114941 733939 -209758
12607 -133127 280434 -314174 188109 -54240 15835 -141303 122548 -52174 99662 -219326
12596 141878 97641 6077 -103650 -214720 -33372 138022 -182997 232393 -121449 100370
12585 46358 -80785 578490 288789 -145720 170882 147510 -444926 94279 32689 372208
12575 372208 -36407 141105 -81266 -78837 -247901 -37421 113030 -183620 134564 -3353 -209337
12564 -209337 411531 -129248 59795 94274 290122 -74307 -81728 33266 -58162 172244 -176826
12552 102318 -232280 25552 60467 -30843 137662 286101 -458327 -229805 103075 2378
12541 -80427 -59212 -86888 165703 -323863 44008 -13004 179537 182180 -55122 227350 -387449
12529 382962 229936 -329076 -55279 -16713 60609 -82853 -292905 -73133 6211 -27082 144592
12517 176633 -90396 -231992 -189959 48022 261230 50874 78780 346820 115048 -238102
12506 -2273 -39878 105207 175232 -424068 -149306 271483 25743 34451 15583 -76095 10830
12494 2932 120100 2069 72752 -83636 -138789 73613 -192664 127372 66919 -20121 -212501
12483 -212501 -144152 -247964 -82989 -229821 -218469 -82066 -83766 160576 143635 110356 -281551
12471 -254307 -342325 -132962 -240391 -96570 37570 139729 182169 219008 -24960 103631 217067
12460 217067 -128584 -76366 -187163 196693 -99550 20944 82518 77421 -126761 118497 -287041
12448 155574 -337810 56786 68173 32135 -39907 296856 -197571 -283727 421668 -4419 -39708
12437 -39708 226423 -126101 -67676 131162 -20336 150909 -134504 -10768 -56371 41563 -82029
12425 95289 -196251 -13472 -78381 -163327 -137903 -47326 144469 -106079 -45977 -130682 -60270
12413 21183 -152080 -67492 -298605 -142248 -69880 264748 132329 69081 -58672 -53826 -201402
12402 -201402 -155430 -178965 19064 124273 -279261 37319 -82041 -323699 -30697 -156247 -39654
12390 131302 108503 -22887 -152552 -231548 -416252 -101156 -122797 -80458 -337006 188450
12379 312276 -165259 -54401 -62782 81722 277481 266397 -74344 21057 73124 25677 24517
12368 24517 43107 -5212 -110670 -211429 294596 -261426 -75442 -97293 16591 51771 323567
12357 323567 -25237 292881 103950 11963 284037 69779 122867 116980 375285 98052 359948
12346 359948 -21048 57508 -5190 192016 79087 10524 -129115 -344919 108357 363821 67578
12334 -214696 -92276 219871 -218194 172621 -328905 165555 267654 93108 -240804 159659
12323 -215528 -65432 39867 99911 -69037 432396 149215 36952 327182 41131 287595 21185
12311 73261 306387 147852 226391 113582 -307148 223531 73548 -208888 266670 -207301
12300 71614 40720 -25424 396696 149098 213874 151521 -117978 113466 278989 131124
12289 209413 82600 65817 -233604 372202 -33062 -138031 -66943 417101 -31350 -57706 -143547
12278 -143547 69060 -36766 252041 327518 -46532 -82752 66391 81320 70118 549186 149349
12266 89491 199582 95769 -372005 120275 378585 24141 411589 92663 -71788 211119
12255 48145 188925 344565 52183 344218 165146 -178570 142441 117882 363246 144278
12244 174007 72084 -299360 166800 -80010 403832 52058 21222 -101718 151235 97158
12234 97158 -250749 160944 245136 27778 213926 68624 -66774 63445 -1757 -6816 -10562 -131173
12222 -131173 -319 140020 -5689 125614 325189 263579 94352 30454 163547 253793 100472
12210 250871 190217 222502 113115 -80744 141003 188320 195639 15975 -82508 -184471 40263
12198 62553 66748 151255 33208 79655 226041 348436 -74220 229584 39953 -710 138638
12186 -21461 73124 -17182 -21983 60213 136852 -83998 -52021 232060 329237 110720 -15340
12174 27920 468494 -218644 144976 91631 -68751 17632 75691 114285 208650 233825 238264
12163 238264 144579 -52505 180473 276522 289496 238828 284944 326810 -99006 413084 54892
12151 -169147 153444 427554 174299 197920 509788 -60504 150676 216491 183685 289820
12141 289820 294433 29493 313534 47644 262365 12046 -136608 211763 74295 -10924 168351
12129 -152798 -219095 -225156 42964 132947 -143163 -59188 89112 -58721 12099 473106 70901
12117 164467 255204 43248 -396604 -117754 284114 -79760 359422 124063 162281 108319
12107 108319 99339 24628 -87649 268360 -61060 172274 282436 141041 42957 334364 124456
12095 362701 -126662 319864 77851 -116245 -20396 -239964 490361 -165979 -179505 -146735
12085 -146735 362464 51003 64567 165301 224517 56297 10420 -47814 181164 -150088 220030
12073 385117 34672 206023 372490 274908 266637 -170619 36171 54733 354448 9387 219853
12062 219853 193621 204011 -12453 -14137 245043 109149 80807 -101983 -61305 33754 -20448
12050 336343 339382 123509 227726 479661 -175092 28660 -102182 59893 491894 -398438
12039 134831 -42039 -43970 -66488 95320 11068 291175 -147755 173818 -29302 154771 -41055
12027 127490 -165230 -241127 -344 147165 -199283 -13890 -6719 -233066 -172523 -150878 122294
12015 -37758 -37700 -57865 -169956 -124136 -36027 -67239 205162 -80813 48952 -110542 175636
12003 -100765 197625 -121113 53954 322943 -54385 -60969 -122929 -58329 15544 380293 -89886
11991 72312 -71119 29582 54242 -168563 1818 -216712 -7939 -222020 142066 350260 -187468
11979 136583 89600 -206020 168396 217839 30799 30281 48505 -101530 -481472 -377766 -278218
11968 -278218 -51288 71206 13588 -115676 -94693 -80028 -78134 -34311 -207758 181596 -226535
11956 102354 81759 40679 159068 236264 -234879 -369551 -159867 -71481 95143 72083 -136273
11944 -10269 -245911 72879 76356 -207672 10586 -214780 94837 -78809 -81331 -188479 68564
11932 134567 195685 -153923 -83118 -270393 101817 -168366 -143118 9895 -186841 -338140
11922 -338140 37894 -59590 -154925 108414 132400 88638 -19600 -273782 12636 -13158 -26993
11911 -26993 210541 -93372 -55713 2550 -101942 -203816 -91383 -117381 219419 109755 206691
11900 206691 134525 -275350 31597 -28732 199353 -408389 -167210 192272 -171675 -194983
11890 -194983 104548 -75381 340472 -278148 304847 212578 -319674 220957 28516 42114
11880 42114 -216266 35966 -149965 242991 265640 -124386 -402498 -351376 253915 -57743
11869 -39735 -53189 -14574 -254358 59073 98745 -36458 -255738 87574 -74347 106171 -108731
11857 -320214 -87648 193381 -15694 -30213 -63078 -53984 -209381 96321 68088 16301 -144558
11845 -341551 -115994 219320 -64847 -53198 -108591 10874 54992 -279298 -312548 -258945 -94281
11833 126953 221870 62854 60264 183634 54394 280451 -145648 -7314 -217523 162091 102283
11822 102283 15572 -122835 -158694 53788 25417 116475 -273535 -74268 -44395 303882 190151
11811 190151 -15213 34525 -104821 -130850 -300874 -16027 169826 -10579 -277396 -237200 116638
11799 311477 -321134 33238 -52922 -21916 267982 108415 -81307 -305550 -232854 99983 63859
11788 63859 -148393 -32203 -2083 7914 170476 -169774 -131687 -95071 -146219 -161150 126565
11776 276461 -173204 -187917 271423 -5706 195364 -150546 51202 -15313 19748 199555 47963
11764 -139767 -265234 -357389 304090 115999 -210905 81057 161509 -186354 -244375 -76626
11753 -354784 -181859 7427 72552 -69245 -92916 37296 37166 -9658 -382837 47139 -275480 -21322
11740 127021 -184594 161839 163796 -98709 180076 -314905 -184042 -28724 -38084 105485 -218853
11728 -221928 255122 -60940 -6312 -149537 -192525 42827 -232245 127661 -157012 246107
11717 175213 104568 -14152 -5856 150057 -93340 74300 28992 -163013 72603 134464 -60869
11705 -25237 27740 -42902 -323586 -118742 83689 8206 -110162 -110380 -74078 -328342 -70677
11693 98639 -3683 494 54063 -13342 212659 -164484 158981 54365 300043 241538 -15780
11681 -7687 239662 287487 -31103 161549 -22095 -206155 57437 95157 -22599 21906 278446
11670 278446 14114 -42380 23243 205715 312609 104714 254467 -47651 -231638 -52237
11659 33218 362281 -21302 -271798 -94672 179576 204253 -26075 -14896 353162 -120878 -72557
11648 -72557 84906 162953 190009 58799 46664 418340 -78145 -241428 23479 -70038 52187
11636 294024 -15715 258847 18189 -158336 -296082 -40594 -63718 -336307 28331 69937 -213141
11624 -81290 323532 256071 196243 -114331 375867 333542 -284042 -273096 114866 -133992
11613 -15512 391787 -15029 -35335 205491 81486 -32679 -9471 291445 215524 -187886 -42787
11601 265596 46497 29122 -152025 -33999 71355 -159231 94711 76806 171877 -56384 184953
11589 -24365 -51051 -174164 66970 -158037 -164310 -17922 154793 -45894 56590 100947 332730
11578 332730 133763 -145803 -254455 -96526 -153391 234857 95780 86716 63206 -108657 -79080
11567 -79080 100619 -39809 337791 -254123 63567 190965 54964 39783 -3958 -199312 -20039
11555 66702 220312 141233 37759 315878 85015 344817 -120161 -24928 94026 -112931 124380
11543 89807 14236 39021 35971 139562 257343 134654 -25034 120642 -162821 -147362 -111978
11532 -111978 24222 -504804 93375 -49219 -31977 11689 -117923 113759 98173 161645 73391
11520 220310 14998 -31306 339702 -66810 -194337 35487 -58123 196195 61749 -199297 147782
11508 42134 -246978 -169815 136858 22222 121284 69871 50014 174226 126275 486713 141816
11496 247756 -163871 1873 45218 90323 192361 363955 446855 204874 -163101 193383
11485 104026 82860 151510 -218947 186722 67726 110646 35812 -26112 -122457 29307 147467
11474 147467 -240532 -256497 355666 -375349 32896 81004 49274 -95549 -234641 91579 163057
11463 163057 201830 192403 121117 -53784 -53863 -32773 12417 100531 112994 42989 339498 -99368
11450 -234871 35502 184392 84428 114146 -29800 -35274 -231244 11850 -17064 -243991 -38063
11438 32682 35771 281533 143929 228114 -202723 -50107 104195 -297772 -102300 121545
11427 36500 139186 171329 -8295 32681 243577 -100114 130399 19103 145797 3088 240763
11416 240763 -118718 300646 18003 54014 9319 -162346 134456 -379315 172116 145030
11406 145030 245276 -11182 -352566 -111373 22238 185418 -47455 10681 100356 -50639 270656
11394 269381 144935 -294893 103621 373235 -73954 -33852 -178203 52700 -10991 -50900
11384 -50900 -238872 83242 -212729 48204 124481 -35598 -40385 406048 413668 -22982 180665
11372 -86517 184971 -164049 -336020 53163 -218175 -334298 -87493 -94802 -145047 -189179 -147194
11361 -147194 208342 323338 303739 -66777 -55683 30744 52586 -285219 -101417 83217 -126908
11349 16830 -43770 -107935 -59177 15439 -129917 -266770 85300 -181715 -130132 -69347 59107
11337 21673 225189 148919 118846 87901 -9849 58536 -127838 24396 -162609 -314116 -68942
11325 79016 156729 -246154 218393 208092 71334 -307198 -88334 252021 165398 -244584 135752
11313 45021 137346 11951 -84325 -89662 -114867 -187097 70900 -298814 -121677 -216242 29794
11301 -98764 57179 -145236 62183 268159 -244380 4835 -77680 390106 -248192 31035 74027
11290 74027 -152364 281556 -115972 -1910 -238817 60333 -168112 -289864 -171403 -29042
11279 88013 -227162 -79326 -193936 -21209 -96224 -179255 -133690 31414 -228048 -71226 -205334
11268 -205334 -258269 28040 -215285 -239342 16965 50243 -90289 -339703 18951 103070 -128389
11256 -193956 -157407 26550 310736 296747 -235347 -121760 -155151 -32725 -329205 -49694 -85938
11245 -85938 -269121 -21967 4212 84360 18953 -136824 27660 82712 -207138 -400600 431150
11233 56579 34351 -478793 72211 -70972 -54350 28491 16491 146795 -113910 -87687 -32044
11221 185552 -193597 35793 -79520 65168 172306 -50414 -72829 -65352 301916 -351497 -63201
11209 -426325 -233999 -172403 172298 11446 75369 242842 207174 56353 -21513 -306482 -65606
11197 -108310 -424426 116773 101009 -333156 -46016 -417412 -364546 -262017 -46012 113722
11186 159823 -205985 19782 -205643 -195568 -82479 -16475 -6718 -321288 -62442 -129292 3044
11174 -155911 -101834 -622751 92169 163317 50727 -37683 -19600 -343402 -161575 253813 -160074
11162 -41187 -148937 -101873 207379 -35119 122068 -222115 -31937 409088 -367700 -48864
11151 82850 24884 -419570 -590 -277414 24003 39116 128016 66400 30837 20847 281654 76255
11138 -75940 -47692 -245724 -96847 202534 17715 190256 35203 -115805 98055 300101 174640
11127 174640 -199526 -452711 -111624 -32552 131261 -242441 413187 67677 33659 -139039
11116 17558 43259 -212234 -2130 -55946 22619 121985 -144343 117149 88953 67225 182082
11105 182082 -34803 -169849 37300 163008 248669 -69442 -148761 -126310 -164464 -69119 -97251
11094 -97251 73483 -83602 -50209 -47480 382925 238091 -228536 -73563 183269 -138598 193117
11082 184097 -100025 -14179 116141 202046 376109 -111717 487502 217628 313075 341036
11072 341036 82756 307943 84364 332568 -8153 181257 -53625 140401 251932 383762
11062 383762 -18194 482839 396438 255455 242774 92403 147115 -155141 395348 182346
11051 268805 280004 46409 249306 103488 210545 795028 237734 553985 401421 567332
11041 567332 572969 370876 300331 197394 95371 643419 650488 728649 757648 530001 440721
11030 440721 256356 336463 638054 456485 523376 512722 590232 455650 609870 785198
11020 785198 754123 515319 491883 517753 599631 532544 631132 604260 699411 369888 867211
11009 867211 517525 615964 410057 498425 414793 421177 619026 283395 413650 583412
10999 583412 348585 633696 392697 180068 444364 467370 826145 315521 113713 455876
10989 455876 311786 236328 335211 884509 278814 293661 479817 672938 654873 528865
10979 528865 638636 212078 567828 302036 603588 962528 719480 591119 550567 440794
10969 440794 655808 582806 838103 1060503 702393 1104088 663112 920707 1081665 1208822
10959 1208822 1299945 1272300 1631362 1572776 1799936 1697597 2116658 1889300 1961832 2099259
10949 2099259 1730442 1643448 1647448 1563291 1230018 1283797 1010306 1152949 1520107 1661188
10939 1661188 1349571 1622751 1269520 1461001 1499865 995170 797889 1147916 620941 854296
10929 854296 271690 414146 264488 376287 207256 518158 205672 478770 -38936 46847
10918 -344392 -282223 158971 -164904 89650 -5088 231522 -15496 97166 -36434 230315 -163108
10906 -295129 62909 -73362 -174704 109910 -132553 -46921 24236 -68904 175541 106463 21796
10894 59720 -322045 336108 -24121 -119186 -140726 -130041 -258288 11433 -143172 76159 -59716
10882 -172842 -19792 -308852 57348 -43942 143271 -292123 -83802 224380 324721 -17140
10871 64953 -87949 36369 -75270 -79094 475899 -250995 -16421 144335 3839 -258938 -73574
10859 119778 -126260 80976 -1286 157739 -26265 32429 122219 -71927 -10361 188504 -89173
10847 -104552 100913 -98423 -260409 -133628 232585 -57356 -25335 -268976 178597 -89841
10836 132893 -159090 -115090 70848 -82528 171721 336765 58574 -188887 80491 13552 73210
10825 73210 -448695 320815 -114896 201795 36960 156728 -75308 4946 -41092 37299 156153
10814 156153 64265 -45128 -32544 -129940 -432730 -237905 -148865 73342 -121500 2794 -37874
10802 -382572 -71698 148236 99568 104047 37515 -148777 -188697 64366 -123534 -51628 63955
10790 -97672 -110355 -219497 32134 -55698 -70251 -171996 -104494 -128682 -170932 -86768 79168
10778 3448 -185482 -338118 202968 -120063 -247013 -241642 32763 40798 60927 -170360 -119512
10767 -119512 -235674 308 145878 -173724 -26943 -98950 97390 -367506 21276 -243598 -127651
10756 -127651 80305 -42705 162347 -76786 -163790 -127973 106816 213313 -206 -87464 -60449
10745 -60449 -70233 -4532 161632 123908 47560 4489 -78022 -331057 9576 -157811 -112061 -328300
10733 -328300 172189 -359768 56451 53057 -19315 21478 -77768 253406 -145982 -229580 27321
10721 -105753 -447874 -133289 -50958 -266243 -29835 -15823 38022 -225687 46663 -93564 86753
10709 -106924 164313 -9714 26694 -157698 95702 -71030 172869 4473 97942 48452 -269320
10697 70502 -308146 -318883 48603 -72778 266918 -89317 -235467 -186643 -63284 -145751 -292130
10686 -292130 234996 -237302 34605 -317754 -289619 -22860 -248839 -191387 -62435 -151500 143989
10674 180993 -259725 -145041 -276015 -80321 138872 138987 -29606 80105 74434 226250 -41781
10662 -13469 -270522 -31401 -50556 -129006 278081 -134024 689 -18032 85432 -122808 -238 -86062
10650 -86062 97763 221999 -283560 15547 -126668 151489 -102238 37842 -207798 13413
10639 -50237 115293 -73505 -61518 93168 -120859 -146446 -196846 226443 -28230 382402 -166719
10627 184167 90526 -10219 -331331 -220366 -40122 232812 -237598 44464 -80682 -300373
10617 -300373 -235273 16728 -57493 -8762 -19873 -39545 4580 127733 -1534 279677 120144
10605 -177698 -182493 21940 -87673 -26547 243882 -244251 5182 -135523 -42535 28196 124623
10594 124623 -66953 323422 -201463 -162552 -6717 -17880 -67133 -253948 5687 12333 198318
10583 198318 185218 -189799 -356326 -225014 -179307 159053 -278199 -105483 188714 158450
10573 158450 -120017 -19262 -42639 -22820 -165664 -285043 193417 438229 293175 70371
10562 -149630 135811 60072 -98504 -110757 82212 -20322 -122667 -199230 -31274 9905 39778
10551 39778 48712 -209915 -266030 -367376 -370723 199193 134875 3154 101606 169852 -205565
10539 -164130 -110973 -93279 -13760 -38403 -267578 -166252 184945 -265578 134051 -42651
10528 157237 -229723 -12615 94142 239549 105800 89426 -73102 -230668 331370 -83605
10517 -209708 -13292 -10489 20098 123278 -49777 -101098 -382701 16733 -86468 53808 28644
10506 28644 148494 25897 -241746 79045 -50130 -143743 -201476 82615 -59625 -15337 -3390
10494 -328856 -67585 361903 -94409 -342093 160565 -70720 -336743 4007 -283467 -122355
10483 -399203 -153793 -44667 18080 194721 18477 7471 -167216 778 -3170 34228 149960
10472 149960 56713 -5541 -144689 68677 -172425 347577 16522 46474 187804 14591 344234
10461 344234 346247 375709 21066 389132 522290 385939 159444 22270 229372 -41151 237255
10449 101382 152173 -45726 184581 323486 -31965 -163056 -189335 105671 -176449 -92494
10439 -92494 -40785 -35576 -17471 31846 -422112 138854 28164 -28595 148262 -106691 15930
10427 -160527 166600 -212107 -341074 -248644 -185357 84975 322656 4493 -114488 131122
10416 320155 367211 -148168 -363062 -84591 -270746 27813 45127 -130200 -60623 -251909
10406 -251909 -171697 183736 -26303 -61501 45405 -57373 -323757 -163077 -356172 118266
10395 14889 78677 -200787 141026 -133820 170394 196209 -327297 -325805 193371 -16890 174343
10383 -82161 82892 146529 -96457 84771 -53269 -41555 -114114 41635 161783 251256 147255
10372 147255 143582 -16680 381749 270959 63523 160830 -167534 -74531 79432 4814 -181267
10360 176921 -164817 318622 -15145 94430 9198 307084 166211 375594 446642 230580
10350 230580 436398 -111370 168668 385709 464438 348186 134521 194419 54618 52423
10340 52423 85929 530645 168990 220365 -33958 166633 -41692 183387 259991 391332 323466
10329 323466 250251 447733 234211 222040 163730 435850 75365 20666 386410 339131 332396
10318 332396 -155140 353810 -144331 -81993 20496 54111 68514 34968 -26984 70428 150644
10307 150644 149453 51565 45939 23393 321185 158424 -161149 277394 416064 384534 359298
10296 359298 88644 156381 -157392 241760 63549 -155828 90242 145485 -246319 -11938 272302
10284 -161714 241175 -93641 -295964 69395 -41814 -73689 -42595 -27769 122822 -68266 -307949
10273 -307949 -22203 73539 -73334 -60783 -119154 -382190 -238321 -173315 -44961 -105007 -19990
10261 -114427 -340664 75501 300981 -215833 31252 91010 -179224 -186543 -166670 -84589 233553
10249 -243228 240874 -251 26389 -95499 -366762 37773 -12795 -19471 217466 125301 100343
10238 100343 232768 257821 125587 98215 31506 28910 -19572 18755 33011 -342988 -1386
10226 -21127 52075 -208671 -358063 -227279 -149285 39265 126815 -14149 141712 -223759 230603
10214 -154723 -183836 221303 -14394 -167804 -307501 -11454 -188367 108330 -37940 -423040
10204 -423040 2948 -270636 -368882 -113114 158750 -287660 340874 18894 -68633 180908
10193 -96372 61960 -169783 -257348 -212438 116547 -36901 -681005 8292 -102641 -408463 -282796
10182 -282796 -54336 165774 81538 -70513 157826 72090 -174098 141740 69728 -14284 47427
10170 -128411 2131 38998 -436871 171111 159965 -234458 -14510 -226201 -188344 -362956 -263233
10159 -263233 -175783 -166098 209519 483640 -128243 113480 315899 -245330 202050 279160
10149 279160 219820 -83283 406148 55147 -3061 -349202 -228104 90020 -92104 117019 -61598
10137 -185226 365919 -226526 46085 -75685 -575568 -13890 -401297 19892 -61693 -288376
10127 -288376 -46186 -24103 273010 20953 -138129 -457475 -447801 -291927 -7253 -52417 -183575
10116 -183575 246388 -140856 125134 -41697 -162525 -218191 -140472 59516 178971 -454789
10105 -416913 -165051 -92092 150735 -173112 -179520 -75419 -102743 -213180 -91313 -59265 -69105
10094 -69105 -204790 -44884 -75301 -77913 -55570 -178684 -265790 -155478 -155358 -90120 -56553 13843
10081 -560044 -157225 -131425 -4891 -45347 -276903 -395975 8787 -213359 -595 -103692 -341608
10070 -341608 110094 -50035 -56204 -42638 -4437 -389796 166152 27315 -40296 -421292 -114285
10058 -126718 72262 320216 -35359 -29629 151176 16218 -85074 -340005 -60380 72378 -265496
10046 31913 -153462 -75633 -2387 89701 30299 38672 211998 42861 -301910 -32782 152671
10034 -136988 -205462 -59381 2680 -127670 40946 -195215 -105197 -322193 98126 58312 -16563
10022 -23813 -158553 -172390 95458 -205556 -21718 -124511 -30506 -153689 -328831 -435746
10012 -435746 -183105 -252967 177265 45381 -142732 -79696 -52318 71040 -275793 -108209
10001 -129503 -139247 -42031 47158 -70108 60002 -10907 -431 80354 -514407 -497423 -64268 -172288
9989 -172288 137110 14241 -94955 287876 9330 189846 -418976 -126512 -164574 47907 131356
9978 131356 -271732 -43673 3467 -94640 -46299 -152962 -275767 -213269 -111275 -82018 188661
9966 113695 -205390 -198431 -48394 74732 369280 180140 131050 -9066 -296748 -144069 -365109
9955 -365109 -23826 -174909 -148810 134615 114819 4899 -103548 266541 -101772 50411 69369
9944 69369 -178947 -144714 -82071 2481 -92165 -50769 -267246 53429 -331645 83800 146782
9933 146782 -6905 -131996 8438 -34790 19158 -73141 -30184 -96878 -261114 -249603 -162824 -33509
9920 -145038 -8332 -136885 -99717 108599 -116964 -71703 -146838 52914 -4501 -177899 52284
9908 -103266 -452820 -293064 -164245 88170 29065 -401675 84461 -231953 -500830 -233956
9897 -51281 30042 -163588 -232536 -71096 -49441 -43563 -47865 -91632 -76329 -160254 -307622 -116211
9884 -182489 347238 72799 -264541 298736 297857 -159375 335236 40841 -121893 48190 -341986
9872 -116289 -75277 -170926 251982 -8864 57468 -478391 -267812 27910 -9747 -359791 1627
9860 -263067 109439 -286651 -362939 350795 -68067 -3814 64466 -290841 -136386 68082 -102418
9848 49576 -21805 93228 108156 -121358 -100230 -63511 -227351 7421 76523 46681 104150 -38925
9835 91145 -183183 -209456 -381392 -136759 79838 -368119 127312 -322743 66325 -25681 -121255
9824 -121255 -125953 52245 22797 -194763 86522 -297488 -301306 -114512 -296980 -25939 -115903
9813 -115903 -107916 -182575 23290 137442 -136945 247501 -205389 -77355 -195255 -25708 250362
9801 -199880 -15427 -140790 -252900 -333215 92054 236949 14287 -107253 18515 100216 -241015
9789 58764 -116610 -171767 -126581 -138014 -259214 7631 -33661 -119959 186489 234340 -154590
9777 -119572 -113995 -248389 -174969 184191 77182 -45108 -417101 -196427 -17908 -316207 53224
9765 196498 -133366 -73587 65734 136034 -155903 -116634 -260746 25911 -55403 -67687 -129106
9754 -129106 -7364 -83005 -128306 -124093 -449731 -114274 153701 -310850 88797 -13214 36556
9742 45697 -66171 -132547 -161101 200874 -242729 -178755 -367241 -8371 -357959 -71814 -110372
9731 -110372 -418202 -165865 -256149 -371506 -105570 8131 -31308 149565 -225294 -488119
9721 -488119 14431 -58838 -183913 -276209 83744 -119928 -255526 -168253 -54188 -185483 -254085
9710 -254085 -480536 25070 134211 -19433 -164758 165399 -20574 70214 -214036 -138124 -163212
9699 -163212 93249 139781 -534107 -32304 147065 -126039 -29367 -48167 -37282 -36816 -55584
9688 -55584 -247068 17657 -59067 92655 126847 -125113 -390382 -41228 -206941 -292081 134991
9676 -37046 -480913 -383645 -147847 -87985 236849 130941 -32215 96135 262656 5622 -210592
9664 -25257 42833 115379 -230983 145774 -18478 -237777 22842 40612 -385145 -117402 6256
9652 219687 -84908 -320328 -85998 268985 -81774 -48734 78340 -288338 -298672 -220377 100294
9640 100634 -194831 -6774 141668 -121924 -85636 -39920 -330036 249021 -186933 169405
9629 108002 -305177 -44095 -258239 -53596 50080 -345056 -32791 -339415 -135351 -265461
9619 -265461 -108429 -222617 54489 -303101 -213121 -124476 -325865 -124557 176890 -130170
9608 -304435 188276 -184668 15951 158584 -449360 -158499 -54756 -54748 152659 -150082 -220454
9597 -220454 -156471 -202291 -129179 -365737 -134095 435759 -102713 24417 -138786 113411
9586 183023 210501 23942 -115346 -90369 507 -88360 27755 -287473 -154340 30612 -131419
9574 60145 26287 -4146 75674 216722 -118348 127411 -200867 64220 289 -326079 67299
9562 88313 -154304 -381206 43495 -346746 54773 -266248 196184 -125984 71736 98274 74887
9551 74887 -48391 -339302 -166379 -49495 49471 -114872 32301 155268 14345 19783 111865
9540 111865 96311 165572 112514 -26148 132368 -311157 -52991 16144 -105370 -198513 -54814
9528 328569 134653 -33981 -237335 18416 -41344 327135 -201758 174987 -98831 53123 -62435
9516 16667 -236301 -196206 67662 -230662 227374 -12069 290543 -349048 -280152 -41630 -103115
9505 -103115 -140103 -424862 -9516 13444 -18954 -180324 -268968 283282 -127168 77015 177527
9494 177527 151361 49181 -43940 -153389 45306 -311369 207189 -175623 -87182 -7160 -31766
9483 -31766 234686 78608 -330269 125180 -241055 -125948 -140811 -90456 -140278 22766 323776
9472 323776 -139 46927 -112558 -38138 -37122 -205493 254279 -91718 -41207 169293 -137074
9460 248269 186098 -399559 -74961 -6334 -55499 170806 176085 -226271 -21765 -321118 63771
9448 -43201 -56474 -309140 -355854 -94194 177113 -55707 -53728 -65312 -150964 -51159 68095 -311563
9435 50627 -61902 -208712 -159519 -6835 122562 107155 30538 -210738 -97882 279822 -203677
9423 -317835 -141311 -251172 -5465 -94434 164092 -227290 -243369 -410300 -130432 -329997
9413 -329997 -248423 253205 -70573 -88317 -177315 -197619 -227282 -223395 -75106 66005 -225623
9401 -78785 90655 -465889 67770 179685 57724 -75592 174376 4342 -28992 264032 -162552
9389 71589 -18024 132163 -210899 -11703 99901 -116945 -29934 141331 201578 -241259 -275105
9378 -275105 -294712 106137 271635 -6990 237105 -198932 -128038 -35874 -29966 108643 123227
9367 123227 -106897 -86339 90749 -166772 -19963 -124794 -135962 133314 -25997 64435 22288
9355 8360 -494191 183832 87168 -161107 -407781 108634 -161976 -105426 -77160 -111944 245524
9343 123874 -622175 -303159 312126 -76219 90465 -203039 223292 69643 -223402 -20864
9332 63430 -529809 -291690 -39042 -196116 -188595 316834 -45348 233981 -287902 -139159 146053
9320 -163412 -4065 17405 -433964 14491 71715 96720 -148828 -406776 6194 -973 -220494 -67534
9307 -398922 16144 176949 33327 142322 -10147 -162855 -298795 -209654 71313 -96206 -98667
9296 -98667 -90558 -136367 62768 -97238 54886 48327 -168861 -4310 -68761 59483 -244199 -185331
9284 -185331 5108 -155075 141562 12025 12878 -131300 298719 -201510 -80653 -949 72665 -317988
9271 248519 161908 209061 29557 -34167 -154642 -116243 151812 -169633 -135373 -71702 29513
9259 79915 156622 16069 27156 30918 -49117 14249 165307 -276754 -138351 -23629 141115
9247 194443 -259796 -43326 261786 42644 116903 -176917 -79413 -75748 -177759 -101400 -390457
9236 -390457 -226973 -39729 -212298 6338 -222880 17808 121311 -197729 -299149 3794 4692
9225 4692 -89053 129022 200373 -292888 -177903 137133 307317 -404863 -203313 -163180 47280
9213 -139987 -26769 103336 255286 24188 100277 -122351 175329 -211011 -42427 61687 -220910
9201 110619 -115402 -187274 93958 -91384 -52294 25967 24628 -21411 -280016 -276470 130441
9189 -7998 -67771 14408 16608 -120575 -306449 -19649 -373298 -298859 -208209 -59527 -130190 -287738
9177 -287738 -216429 -186380 -151981 -145278 -192790 329594 91194 -184237 -133867 -388935 -217309
9166 -217309 11711 -229121 -171794 -220820 -175900 -94440 46017 -20626 -25399 19409 -244857
9154 58815 27990 -374095 -39269 9732 -18691 22662 -63502 4427 -91387 66351 -350288 -94199
9141 394596 -204477 -115792 -209753 33731 -32278 -394553 -228543 -254213 110099 490061 -66678
9129 96071 -21717 -33246 26715 35334 -183481 -266941 -30388 62371 76703 -73199 -111061 38992
9116 40751 -186516 60763 -388326 226585 -114024 10217 -4290 35989 -15894 -170314 103377
9104 -45126 -386957 55167 -124750 -279459 18523 -68291 -27838 -262122 -224163 -23401 -340165
9093 -340165 -146840 -183008 96118 -143402 -178272 -131954 -312224 -69719 95515 -107948 -124271
9082 -124271 214893 157641 124815 232607 -247572 -153650 193324 -186870 169173 -202178
9071 -291632 -82261 348947 -74452 18488 -208221 -120620 4563 -199764 256915 -9912 90392
9059 372982 -65792 13197 -146712 -33816 32412 -34770 296505 -53029 113961 356699 -236874
9047 -64372 -19849 -94673 38105 -198865 169352 117819 122642 61744 -285369 150827 -126529
9035 -35199 -111541 -171280 -23542 -223997 354041 46793 35322 -93163 -115503 -115551 78539 -343886
9022 -373389 -250285 84082 43700 -406531 64910 -110778 -15049 -6637 211100 -323954 229496
9010 20524 -323670 128227 -297850 -101913 10702 75861 -239317 -149911 73683 -11148 -100362
8999 -100362 -130260 -567737 301158 -155035 70555 271197 -337819 140725 3385 -40500 150246
8987 394649 32417 -222844 -106376 -141484 -280836 -114301 76974 -150310 -186105 31770 -180873
8975 67490 -50871 -46710 -7000 198399 115088 -399797 -140505 222341 -212162 -115771 344286
8963 -21960 -68150 36399 -31782 176233 -225378 -56130 76592 34673 -22488 -228112 207143
8951 -30893 89963 220747 -338807 -301379 167271 -113309 86083 -242974 -320773 -268848 -7881
8939 -30224 -186114 -38160 -185146 -128405 -367858 -437479 -403043 -147651 72936 -47252 -544738
8928 -544738 -51478 236108 14560 82994 -66939 -93190 104630 87200 60860 -8020 123555
8916 55075 123375 219745 340997 6251 295327 -19954 502799 177783 374926 1046448 1241091
8905 1241091 2480217 4593561 8246056 4088813 2058166 983786 575867 281398 381049
8896 381049 155569 184986 -287516 -315323 -173308 -112475 350259 -39673 50188 -53912 -48367
8885 -48367 104904 149679 -219989 515859 20091 127332 -31582 -281470 -219498 235078 97823
8873 -263672 -24467 -171238 -54174 -271056 162242 42792 -219999 -59170 245399 -113773
8862 -222363 278029 -276400 144517 -31057 -103356 -442980 -183454 -98533 85662 176921 -239835
8850 -133367 -255260 -32309 -86264 -58015 -78434 -125253 291297 162701 -673781 -215574 -283775
8839 -283775 30514 126664 -7345 -212917 -243627 13162 -19712 -94030 -115752 -329591 10477
8827 162579 -95621 154983 -152615 73456 422437 -325405 -301286 -163406 227581 -131116
8816 20043 301507 287351 -47146 112601 -64192 -65743 -23401 62732 -141061 -88466 -199580
8805 -199580 -238901 -260664 -121693 -156115 204816 137612 277291 147019 229560 211309 -324257
8793 -133988 -38996 -365392 -148310 50999 -76034 -30861 -230744 -104646 -66877 -225490 -403631
8782 -403631 44826 323877 -215376 68143 -39473 -50107 -144495 -84207 -170208 -299621 -129809
8770 -271015 95239 6253 -209970 9399 -16762 451542 301679 78328 -99652 92375 -295862
8758 205056 29588 56628 46996 47377 -39227 -10916 306344 -5117 60109 238043 152215 166383
8746 166383 32933 -136134 272457 -238959 -271401 -264837 -92158 39408 98616 -93169 -94604
8735 -94604 -155423 -30917 8253 99323 105806 128947 -80183 -101286 477388 -283577 -182379 -213696
8723 -213696 -84168 91760 -119450 -21588 141904 -48746 -144867 -33477 -202614 -188724 -27583
8711 -189895 -243533 12567 -337474 193514 -207653 148085 -189664 24596 27771 9311 -5829
8699 109918 42094 186200 -79888 -155736 -183733 -196014 -30644 -151852 154119 135290 -234901
8687 28000 -269615 -301331 94059 -97753 -98606 -30499 86447 15134 -192670 -300128 445735
8675 -6159 -193331 41939 -179557 -172334 75912 50110 -89556 -15919 200004 38355 -252184
8663 65555 68238 -84608 -447188 -31799 -150103 -70049 194065 158951 68169 -182578 85699
8651 -8557 177081 87976 -336311 44554 163798 -212365 -18547 71229 -98081 -335638 -72946
8639 -85593 -196386 -195376 -269662 -276085 110627 -11718 4952 -73939 -154188 -18243 -249362 -40441
8626 -146186 -87500 -15647 -273539 163532 74275 38893 130403 40601 -337648 129678 3520
8614 -253120 -93741 82896 -62661 -82330 147365 241785 57860 -13577 -136200 -220252 -11746
8602 777 -354272 -147069 -636318 182219 -32094 -39123 344025 -37449 -48527 233883 49594
8590 -166416 2086 258688 -313204 124591 -201165 -297 -120093 -35321 93989 135246 3136
8578 -1433 -183017 -103085 -132818 65023 -28705 -337513 5683 -241744 114069 -39766 -33403 28195
8565 -183620 124542 -72246 81959 -393223 -10124 -84765 -26388 -101304 128588 -160964 180370
8553 82232 -166518 74842 -196896 259532 175512 135918 -169014 211014 -318081 -111824
8542 222500 -84681 -109333 83694 -94628 99382 -333417 -228564 1103 -448798 -170861 -97600
8531 -97600 -1078 -179920 -490831 -220071 -117678 -8817 -168302 233184 83334 115601 -224879
8519 -179315 -305151 -407086 -330698 -79987 206016 -80195 -71156 -197562 12313 -203494 -189703
8508 -189703 -19355 -79620 208632 -60835 149438 -117614 111096 258219 -266281 175728
8497 35474 -211136 84073 -169091 -123127 -337516 -394124 162659 297376 -285905 96084 44395
8485 163799 271603 64894 49044 -213015 -418837 -53810 -275286 145342 -193736 -47160
8474 -201848 162117 -264061 -144250 -30661 -170062 -18843 -53254 93766 -213830 -129772 34771
8462 108325 123802 -203189 -117719 161391 183267 29358 43899 144268 183575 -4175 -71114
8451 -71114 -46142 257441 -58582 -217446 61163 -112942 16120 31577 185277 170867 -129341
8439 -368919 -253625 -191261 3668 -42219 -33571 -76819 -199735 95718 -149550 82028 281170
8428 281170 -158319 -54283 231967 170885 -529732 -298743 -296567 169801 53853 -93141 -101677
8417 -101677 -185659 -172013 153655 -112003 -4072 -213583 150282 152101 270528 136296 -77699
8405 124417 -453 -287795 101331 -152088 258761 -207368 -106901 -181358 -89859 -39756 -87536
8394 -87536 -22559 127001 -168894 82203 -313326 147669 -153940 188824 -168496 -23064
8383 -28072 -277462 49369 -286969 -226082 -347317 -160102 77993 49202 -20508 -349002 -373868
8372 -373868 194764 28752 188022 -57848 -481935 -278099 -143093 -70309 28005 147593
8362 147593 -20634 -55099 -41145 -277374 94072 -316104 388693 359648 -22594 -92651 37286
8350 -91606 68623 -62206 -49271 -320804 -9645 -199715 -193855 17530 -32435 -15308 -164026 -145672
8338 -145672 4170 -35315 -456785 112636 67539 69789 45012 -110298 -164868 225162 187207
8327 187207 -132973 -132412 -143708 -185594 238089 -103458 -3555 -185391 -181163 -208872 -254927 26633
8314 -18582 58606 -204862 -199978 -46778 -81269 -156682 237922 -200331 -356333 197334 164282
8303 164282 488916 66754 12854 -145598 -157655 -109752 -264933 304756 58050 159167 33949
8291 -277876 -169819 -387916 149829 -109137 -304655 -296917 1071 -55971 -183549 162142 -94138
8279 -277690 219786 83476 138957 152173 -119115 -86295 -14954 69318 -234634 -42872 20390
8267 73215 -74182 -14542 77092 -74414 55773 -175952 -69465 297417 -72881 21766 -103596
8255 -66272 -51303 -198798 50647 -110401 81930 -194568 -227740 -72748 127710 -169505 -126023
8244 -126023 -51184 -214627 -25728 104568 19960 249238 -123098 216101 -35262 -51821 -144134
8233 -144134 -47131 193437 -145313 -208084 -93635 -161899 -51937 -301935 -121801 52573 -6241
8221 -138225 1104 18592 -14013 -200813 39335 -377334 51302 -64555 134607 -228110 52320
8209 54215 -99556 163384 173223 169530 -60941 -55258 143741 13207 -70187 284257 -153278 32580
8196 47485 -76290 -52128 7594 -190986 220921 -128339 -59974 -94776 -261521 59474 31316
8185 31316 -142253 -53284 -232347 38390 -222760 -86033 -77565 -310874 -122026 -61367 105605
8173 -71758 75868 19723 -4670 55680 -137577 -167053 -150760 -326558 -197442 141604 -8498
8161 -76756 -116010 -18257 93640 -147448 141883 -140406 -173981 -50720 -281841 180686 83253
8149 -113162 -24365 -137203 -54003 203320 -205163 -304816 -85498 294895 -169125 245292
8138 122810 -313301 -273650 32450 188159 -51275 -26367 -509317 -272688 -229491 -346904 144950
8126 -183289 -202801 -121319 -344471 -191050 -71537 -4922 -48981 132568 -35848 43918 108284
8115 108284 -90872 76643 -43733 -58263 83855 215929 -158017 -125719 -78596 -148247 -6562
8103 -154627 -340893 287626 299670 64754 16601 492261 -58618 25224 90172 -166231 -292274
8092 -292274 134347 55642 -150864 202141 -79598 -275344 189484 120351 30592 -152501
8081 -301564 18867 228445 -69353 -20108 -120480 51460 133420 -269628 -164096 -219319 -9622
8069 -95693 20818 -116531 -34358 -68453 230601 83927 102464 -218692 196041 -200766 -572241
8058 -572241 114977 -206891 -184543 164058 207613 60045 -41916 61006 148009 75129 -342705
8046 45535 134308 -82452 -217128 -100322 -254919 85745 71580 -166635 13448 -163685 73962
8034 31829 224499 -123305 -3615 -38878 -287241 380770 435073 149989 96957 148217 248012
8023 248012 71545 26987 -119848 19096 -37386 42240 -184873 74336 -140567 95795 -292052
8011 -113677 -57942 -138489 174022 -152782 79953 232059 3429 -51586 55696 -41747 21559
7999 74600 48133 -515626 -46453 -20510 -122657 -30734 54862 -193578 144826 41606 -296980
7987 -191827 -223042 -236603 -138975 -291325 100124 -52742 -73370 -239014 137110 -31695 -298282
7976 -298282 -170694 3330 -64442 91192 33425 9149 -321179 -256760 60558 -69767 37296 -311076
7963 -135717 120357 -45575 -106408 -135696 170080 -136486 -488927 201436 185509 99959 -238078
7951 395930 -172146 -315863 154330 -360513 191808 -163431 115867 -158897 381706 19006
7940 -133728 -189846 59054 -77823 -107157 -52635 40977 109386 259472 -26467 379635 -374319
7928 -138958 11199 -193412 -172687 -177887 -42008 16899 26936 -261129 82177 -17853 70 202430
7916 202430 -233883 -311701 113568 -70159 -31786 509012 125864 11561 170019 -12148 353878
7904 -404279 -157677 101808 -54855 -61795 -154735 -107786 -104756 10214 -35156 -169910 133360
7892 166329 4200 50158 -20247 -16105 -180670 -63607 210748 -13915 -50702 -57553 -69815 183940
7879 94900 -190919 -3364 119871 -72964 57070 -307736 61748 206598 -44859 -137858 46829
7867 37910 20053 -113992 247889 -401525 -203378 -327629 90211 -426800 -278650 -90851
7856 19294 16551 -206977 207490 -121658 -249492 200626 -123084 89537 -38969 171346 -90052
7844 269077 -111402 -405645 345210 25660 -63563 125208 -228420 81427 -253792 -58665
7833 -26950 -185939 26465 -311686 -199625 -143285 -398993 -209189 -180098 300203 -48425 277513
7821 -93459 -3207 138677 -204420 64138 -242625 -75071 170372 -283443 298135 -269263 -32828
7809 23683 -42203 269564 -51628 365989 175624 4147 -376298 -77305 115487 94828 -273520
7797 20565 -204015 -142958 -11365 165533 47126 -140167 24191 51033 -25932 -158779 -85102
7786 -85102 66231 -364696 -127420 236427 282140 -325345 -136100 -23408 -200255 124404
7775 5447 229292 59710 -262128 -130810 203576 499 207699 -83561 -36803 -67534 52217
7763 -21298 -259033 135903 458645 -15691 11925 40363 41368 -154089 -31913 -12614 -73236
7752 -73236 -186423 150092 -407051 -108644 -59187 -54693 -139659 -10589 93115 53229 24091
7740 -290384 -375066 -140856 55210 -122115 -123203 61088 -92918 -64443 -294387 -253966 27597
7728 -199907 -73217 -317728 -234356 -231674 -4856 -63771 279074 -64033 111516 -17994 -76547
7717 -76547 140836 -120619 137227 103911 131478 -181364 137784 -183247 -353955 -74956
7706 166544 -199864 -237673 98856 -151310 155621 -152980 24294 69362 -51639 7321 -72059
7694 -81965 10572 -323321 -16188 80316 -129909 -419690 13414 -85535 16199 -247111 -43312
7682 -294266 -328142 112948 309335 49185 -307343 96222 -257884 159757 129754 -204985
7671 -298693 -11951 77216 -120437 253645 -1949 56591 -120190 -128963 -185984 -18581 -53067
7660 -53067 -122472 126918 -200042 -38120 291719 -369440 452060 33410 -70593 -42238 30730
7648 171265 -178911 -290791 -104396 -339216 -187601 71001 -19150 33887 153976 -250927
7637 66351 101703 -108553 -81948 -259255 -115273 119840 112219 246148 -125993 -103257 129931
7625 -72754 -89555 6913 289707 -182645 -250841 -212296 -111238 -298807 -62178 -4448 -28668
7614 -28668 -202700 9794 -203373 480054 -27298 -18305 96197 57112 4731 114022 -31845 -16344
7602 -16344 -46318 225216 53826 8416 -101024 -209705 156850 -46432 44775 238467 -29453
7590 -55122 -55987 55740 266229 -81981 118939 -197839 -42020 -402607 -157186 -53892 -114322
7579 -114322 247788 258673 -135742 -128828 28461 -67168 -360860 -124330 -83268 128943 217975
7568 217975 -11601 6143 -294601 16785 261738 60279 77079 85405 110505 -120024 -206262
7557 -206262 -52813 -8199 -120983 -108188 -8995 20135 168181 418930 -179364 -114498 -86644
7546 -86644 -69478 -62148 61631 -340211 -205897 88422 -213642 -28540 4978 77114 76595 38248
7533 88207 -33627 -101028 -20528 -183142 -29845 -3540 -197443 -44804 -108145 -301089 -97619
7521 -189139 -32368 81376 -160806 205305 80259 -179865 118698 196815 59246 14226 -176608
7509 20415 31966 462184 -257740 -85809 52070 157629 7810 107436 -34735 334032 103417
7497 -220127 232566 -220585 -80650 -126552 -56563 -92947 260178 -223483 -97139 -196165 -112594
7486 -112594 -105057 -410322 -247573 -303574 247091 -36596 126595 -146764 191933 -37318 -217904
7475 -217904 -243536 -49581 116844 64689 -51120 -2798 201183 -301922 309479 -201841 64137
7463 212833 -158427 52834 -101999 205392 -329504 9730 122826 -77917 47869 -284051 -89720
7451 -180931 110387 -138552 -232125 20019 -151833 447968 120520 -54855 -32106 347288
7440 76362 -194980 -60384 68634 72740 234534 -52100 43150 -112731 -203393 -256986 -142693
7429 -142693 -121002 134659 -212173 174700 -168739 38252 -91815 18537 49986 360517 52341
7417 37096 -1316 -265643 -39953 8102 -73266 179053 -107944 73568 -58341 -146187 -251676
7406 -251676 74075 -98449 154887 -27659 164604 122284 47066 -47876 -3380 53398 -151054
7394 45067 125223 -358737 -297945 -135568 -15305 -222101 148034 130114 -42633 -229965 -46913
7382 -326692 69014 34037 -410498 105849 -226837 235302 109511 -223633 -138765 -50998
7371 -116545 -30584 -293149 113669 -23763 -210734 62731 -239458 -36211 69965 180490 -100982
7359 -61153 153073 -235913 -110234 18897 -187133 11656 -2835 -203636 106012 -174193 -49075
7347 -44570 100759 281111 317533 -196741 180502 -271469 376392 237902 176505 -315968
7336 -89116 -142658 82984 -75804 147121 48783 -105081 -21584 112107 -190933 -7820 -129327
7325 -129327 188699 269464 131250 159117 -357224 16958 184781 -232896 117135 -198803
7314 -108743 39738 225155 -235151 183987 83713 -155002 1342 127067 293230 -656788
7303 147697 216108 -200279 193957 272944 -92717 -150451 177096 -128693 85627 -67702 -308737
7292 -308737 29102 -48133 -38158 -26174 -102842 143024 -96083 166210 -220766 -96943 43537
7280 127462 132267 -135797 75642 -103640 55800 -61227 109728 9233 -39238 148725 246986
7269 246986 331689 42501 195010 -14891 2161 -10742 -43736 -355550 -19295 78045 -38401
7257 -97725 269438 112029 6011 157477 46042 -142920 134346 -171413 -63233 82133 -285472
7245 -26643 -391857 -368326 -290940 165530 -390749 194450 -106603 41043 200003 -130034
7234 -391568 306306 17911 -284428 194340 -169255 30686 127566 -2889 219840 -96016 134216
7222 -40409 160126 -7302 -324322 83737 -214184 -130407 -357823 -166351 -114049 -208075 135747
7210 182889 289670 184275 -102782 31594 -39944 189970 -383837 -21870 271542 63530
7199 41251 89852 64337 -158994 -114298 -97460 -217723 -21104 -194838 -61299 111947 -16741
7187 -74688 -29055 -8836 -26108 -6404 78802 -159167 51577 82259 -191137 241789 -58504 -266157
7175 -266157 117185 38436 34415 -146583 -220527 14902 -22179 -74443 -110188 -45306 -136896
7164 -136896 -170122 -182172 -136268 35528 50120 180618 -3669 -85643 241205 16264 -379267
7152 341802 -154531 -95140 36317 154888 58266 33072 -48539 -145151 -103907 289670 -80166
7140 -222646 153544 -123986 24733 6643 -130038 -124074 -169219 -172331 -299226 71717 -419889
7128 132299 -62117 -255385 -87563 17556 -212153 -70563 73547 -360985 166737 -250071 -241008
7117 -241008 57400 126222 202441 -51828 55099 298076 -202551 4296 -1459 61437 114540 123429
7105 123429 -18845 -146928 126290 -27724 -130860 167982 -8588 38478 46192 17766 15954
7094 15954 112269 -49129 65067 -322304 -8661 15044 69673 337946 -38196 212246 117539
7083 117539 342999 34701 134512 -147727 -277401 62091 28717 -120712 7478 -74402 372988
7071 163963 395375 238054 -263675 8419 324263 -110411 -146531 123374 95697 -71206 -78359
7060 -78359 -61524 133359 -23578 -3573 -283649 -129041 254743 4161 -33557 25365 -80481
7048 217997 -213931 110895 79950 -180052 70191 87797 -318152 36030 27193 15451 -174385
7036 107715 183213 56791 193694 -76920 114055 93965 97013 -163394 12668 -37563 118205
7024 -71653 -257326 45165 117656 204568 -105171 -94763 154030 69516 -60427 -229416 17245
7012 -63705 130958 167586 -158980 113299 9296 208201 -138557 15168 -118087 128760 212423
7001 212423 -408085 -247717 105425 -126379 -568 -69549 -62589 193622 112134 -126504 97723
6989 166225 9233 8650 96568 -233101 -72177 -113712 146128 188080 -127082 -232331 -134412
6978 -134412 220754 43679 28600 -172296 -80957 -151911 -88427 -198899 97004 253227 -120213
6966 -27218 170662 141181 -97926 305225 -3656 -414431 10247 354823 68749 -54489 -14285
6954 27054 -115648 -29466 80166 -243737 11877 -236294 -98452 -262499 -81320 68829 -152642
6942 -127492 135484 -157292 -104156 32511 -152484 106319 -107098 160392 -78951 497140
6931 190501 -330856 -192613 -154860 27012 -119686 -207757 -350567 -22475 44042 18518 36988
6920 36988 -46157 -330936 238600 -4365 -97597 40003 -29244 -366132 -233202 88941 166428
6909 166428 207683 12522 138611 -70022 -10196 -125625 -126855 -295884 -181453 341355 139196
6897 249018 89352 88624 -52893 -18061 140909 182563 9740 -118768 9855 235514 -66435 -216074
6885 -216074 -22639 103648 -113914 -207275 196095 156465 270505 42584 -387841 231937
6874 -284015 69096 -102722 -22028 -167179 -134653 -164481 -41920 -27031 17163 99213 94546
6863 94546 105087 68181 -183157 37443 -260431 -57268 78922 172736 -103617 -283501 -11032
6851 382736 -197218 -41205 -222723 37306 379574 354694 154863 -115701 206124 109603
6841 109603 -152095 123482 106193 73751 -34838 207964 -203115 -6118 112261 136602 -153970
6829 -86810 -173162 19182 -95998 -100555 167129 -338136 81716 -130768 62395 78611 25930
6817 -191717 -93031 106685 15028 70105 -24840 -42889 513660 61574 68507 238797 -188633
6805 -1298 -209036 -124926 7033 4707 -17396 192613 -138598 -185938 119514 337320 230811
6794 230811 -410959 170168 -347601 266666 -118800 68731 93368 -26144 -82488 -393355
6784 -393355 -2927 371646 -150732 -282872 162729 -57108 181516 30449 27967 48178 -54865
6772 315662 32272 79036 161963 -6811 167987 -372213 25296 -70278 -124221 62312 -56068
6760 -50707 67438 -122580 -99929 -27775 -379270 91350 121701 16088 143857 -402504 122371
6748 143969 222135 202961 5123 73689 62343 -88708 181728 27293 187271 -323674 169090
6736 -329909 -53080 -168811 -50736 -15004 24925 47669 26555 32260 -37745 -26283 -7724 -22359
6724 -22359 119880 -39207 50254 16543 -11554 -143085 -140256 102370 162914 -88003 -265747
6713 -265747 -72088 87866 -28765 235994 73655 -24156 158406 -8818 -18275 400902 -177926
6701 -169853 174257 -308876 -57529 -172511 53757 -126607 22044 -231540 -48725 420986
6690 217120 -190039 59410 182648 56885 -153392 37378 215985 -3981 -228016 -17171 179209
6678 -133146 -146767 40508 8949 -70333 -52329 306938 -186434 147939 106277 -99630 -174912
6667 -174912 75196 -46642 153670 112178 -110438 105629 -13689 -95140 -95601 79247 384296
6656 384296 -49718 161550 -53718 -82249 -11451 160925 51392 -389647 346474 36359 41482
6645 41482 -24784 25698 202917 -153295 -417317 -372867 -118912 -47221 -21896 -211436 123144
6633 -135002 171098 -162797 190891 -45381 -367932 41029 -58827 19363 -87708 115477 232261
6622 232261 -6700 -171213 81966 -34554 -58161 -59242 225952 135966 21410 6310 -44479 132590
6609 -147127 -415361 88585 -309333 120748 -79403 -193441 185000 -180524 -52701 -75158
6599 -75158 40512 45034 152891 -146002 165143 -30318 -20893 -348285 -140320 -78583 -39830
6588 -39830 99447 1580 -141907 135098 -36488 220198 191137 -116477 -82431 -59293 -241031
6577 -241031 180169 54113 -101816 -115336 -43741 31281 198263 179684 95286 69489 -122027
6565 143443 63979 -37124 181170 -289125 -53209 -78833 -69009 -199722 352583 322364 -526288
6553 -50766 -37668 -11485 113227 -104598 287231 165420 -9757 213393 -353751 -197853 179260
6541 311744 -120342 -103919 -43017 292027 -223929 239806 -51599 -60272 140468 -216980 -87379
6529 26951 107786 110879 -80997 -132069 -150526 233523 188286 -211986 65661 -30994 292080
6517 206442 16281 -286404 216490 271877 85025 -69551 -46515 -294427 -189358 -74197 -52561
6506 -52561 -163103 -145177 -192902 48027 -129375 -244756 142455 -53749 -152131 65366 90254
6495 90254 -363950 -57444 -2943 113229 -52387 -90541 -76709 -70535 -183887 151400 46951
6483 248320 -72920 -243318 349869 293258 3338 -140784 -146007 -361988 381380 280041 184417
6472 184417 -255903 -108898 -8525 364407 -105439 -140784 -120076 125004 -95867 -3056 -199406
6461 -199406 -120421 260606 -204831 -79624 -63291 -174827 -87294 -29586 -63836 -71450 62092
6449 -233365 -37149 160153 -235131 258347 -78291 7838 -50081 84464 -174737 20616 -190469
6437 -41803 99965 283793 -161105 -40043 -82623 21772 -174125 -54507 -48506 14727 -14909
6425 -51581 -286197 172284 145112 -90378 206501 338997 13347 53280 207581 179561 29898
6413 -2131 -84003 -1411 -143017 -8923 89793 -77575 -87091 263465 373139 72685 117807 197693
6401 197693 -159418 -2556 7056 -49998 157763 -137358 77371 -72526 -191926 -35035 158606
6389 54549 167569 43492 107498 -349835 100384 64221 6708 191096 -96376 12222 140359
6378 140359 -173850 97318 146652 -107636 276646 115342 -268255 71478 -47803 212377
6367 -116498 -121717 53974 -327664 40926 -7711 -99337 15166 197639 -310489 141515 -75305
6355 164445 -81122 43394 -64583 -32973 -216157 -107129 90099 95346 -78534 218455 35203
6343 21175 150513 241557 -198566 -69902 66133 -129472 -111270 101370 -149004 56685 83323
6332 83323 357102 -49945 214266 322449 -212210 95927 -107750 -155875 -100136 -1345 -285925
6321 -285925 -24753 29553 235665 21016 -91337 168283 200776 -198623 -75474 135573 170852
6310 170852 -105040 -135312 40857 139071 -135074 -133837 12581 60119 23359 111362 -136417
6298 -181501 287373 86405 -63473 -3899 -107395 32139 -178663 -23928 -93859 -333733 15871
6286 -62860 -317385 17903 149677 -169493 -29494 22747 -266651 -12654 -90496 80724 16068
6274 14218 -111455 112160 14031 -182272 65764 91557 -134168 -173294 -49316 40991 -73579
6262 128701 408171 -152649 216581 -243293 78378 -24736 105310 343993 127728 68755
6252 68755 426919 272052 -61113 79449 -395810 28586 -290075 61377 151677 -101334 -117633
6241 -117633 220178 -102458 136411 -5947 77492 32131 400868 -5 -225824 102775 111513 -46825
6228 -108149 235906 -272995 200440 146531 -101318 29028 278650 -67506 -21765 32624 -116950
6216 -28547 -54261 -201523 -19733 441189 -93951 -256677 -91409 -98504 -34868 -104495 98436
6204 240295 56538 28688 -237215 109548 -95341 -7821 -99806 -39072 -200542 -93986 169150
6192 7454 -128309 93835 -39046 -136191 212475 36054 25497 167062 52385 -92000 -2135 -149932
6180 -149932 -193399 -143741 -217407 35200 -100399 -25741 27747 62456 -48233 -30498 71724
6168 -31844 45391 43147 282570 -132859 22850 -264169 48565 163508 4851 -144193 -56774
6156 152259 187038 183930 49684 -52956 357880 45339 -39612 85985 214722 -61207 284010
6144 -183643 2158 213555 -53955 -200426 -14598 161756 -191275 65404 -28886 -132872 235440
6132 100653 -97388 -158643 -245789 55153 -111997 -232016 -113451 -327438 -222492 -156794 -39938
6120 -168647 67808 105250 77103 49241 -162728 -228247 184778 -8955 206980 219987 223036
6109 223036 -77503 -209098 134843 -100922 -197330 -64949 171883 61342 -28778 180051 -52079
6097 -3953 85847 -127975 166844 94727 -239682 -38798 -257850 -74849 -411253 -95768 243989
6085 28189 -191757 -147018 -45607 -39880 15401 -16496 64315 239226 208014 88381 2323 137841
6073 137841 14930 78750 -6861 -72523 279013 233120 -168684 -310991 21432 88587 161695
6062 161695 456 45178 -275253 -205456 -32627 -55469 -250809 107362 237379 -165394 -232747
6051 -232747 -122945 -115411 -7838 5048 -54481 -31742 146541 -110923 -30283 183258 46826
6039 -21472 242150 62420 68518 -247874 -62552 -59127 -6015 -97597 36925 -130305 -89963 28557
6026 -157140 -105578 -92266 96678 -117903 118077 32969 -133715 -13405 -153350 -88284 20458
6014 -226751 241283 -144167 -109937 156088 -25823 12073 127856 -43212 -229432 192269
6003 -88710 -42443 137575 -43474 -102185 -320335 86373 94936 77866 -29260 221992 -103639
5991 -128065 -12410 113244 256617 -145222 -59666 -66024 63318 -165108 -99109 21917 -74880
5979 121937 129132 108941 -24269 -92100 135929 -102964 -181439 -308291 171610 -1754 10317
5967 39243 -15424 164726 -169339 -255365 11372 330721 -41487 115604 11944 228507 152375
5956 152375 -367472 55835 165313 119096 112948 48215 53664 -107972 95025 -67969 -207187
5945 -207187 -194695 305817 -237643 86247 -210850 6386 -69973 168301 270204 -115781 -156243
5934 -156243 78728 300169 -310900 -59592 237542 -9483 -273595 26367 -146653 161224 250030
5923 250030 -120306 206611 -3425 84733 129764 -164510 -79228 264546 179302 136549 -19589
5911 211277 74546 -54175 -55687 -182962 -148159 113547 7840 -193734 75301 35968 -93087
5899 -34154 165750 16033 52043 -172379 55825 62710 27843 27640 116198 381115 341223 81882
5886 58908 6300 -90296 -221483 4469 41052 89892 -64031 -44023 239642 -6737 194440 27234
5873 -44231 -118280 -184729 11554 -61716 -121676 189458 153909 -284928 212100 18430 -87044
5861 28841 34526 225359 -147304 -38476 -64426 -23449 -22358 171861 226783 48402 -33065 119335
5848 115692 -285922 -207776 -92574 -166950 70451 -89688 311784 381623 157890 -44973 49878
5836 89290 -36018 -238352 -111366 -132587 -153836 168131 -109160 -223191 -67550 -82018 111705
5824 -136718 -123679 -597637 -107219 112529 -129333 242072 -10101 33483 -106263 293609
5813 -136545 -48616 -314389 -189129 221452 -19502 -1416 1421 213023 -217821 83070 103975
5802 103975 295488 185824 68889 -313012 82041 -4452 -108194 -198185 80873 -169514 102836
5790 -212486 -17585 -50298 -125199 154559 -84305 -124366 27376 -30599 -75769 196357 9102
5778 182743 206507 197912 336642 247517 -202588 206200 164504 48065 -79111 298523 33460
5766 -4798 163160 67459 275702 -217768 49051 137395 -154216 518 -8185 -253482 425067
5754 283224 82836 78983 572 -177546 -38579 177990 149915 -13414 101555 56307 69748 -84135
5741 34824 -248474 -53530 -18652 2482 93821 -227794 -240683 -255324 231719 442464 -313637
5729 259275 -11385 -54692 43258 3144 -44272 115924 26790 243144 -165540 -27255 84618
5717 -93061 -117223 224665 -46221 60785 -188924 56835 46205 -10096 48862 305160 267380
5706 267380 404176 -327139 122508 -35009 -492528 69599 288751 74921 13821 99091 16004
5694 -411415 -214300 265739 -100328 -174207 84896 359811 -51605 67505 -183910 128927
5683 132737 -100290 98814 -33032 337757 137377 -247804 489297 -41426 176932 -204925
5672 -255979 43926 -142510 -336443 132084 31446 419853 1572 -133809 -187780 104689 -100886
5660 -464513 209135 -128157 -127607 221779 154808 -165073 220421 -111425 64553 277317 119546
5648 191199 -45420 47302 -216496 -210235 58160 -117419 -131286 159749 -176082 -231603 -79182
5636 59950 -194168 149430 322076 232749 168086 -338756 78824 -55754 74413 -151315 -67691
5624 63572 -34742 41190 -164726 -155755 97300 359899 108504 131983 4157 94565 -307711
5612 -159183 -10409 -235320 -23957 15509 -41690 118730 339315 -178985 210767 55723 -59171
5600 11986 108499 -101584 -248699 -27147 49795 67859 168776 267340 -180156 -142365 -36233
5588 -157066 -66157 23999 107480 274872 -160597 -101941 393774 24961 139233 -196394 -42370
5576 -14981 352412 -11046 -94815 105219 -325467 357462 -100432 104529 -244713 -4692 -77337
5565 -77337 45253 -3459 20522 -458254 129875 -74946 -34049 -48622 -133870 118981 31594
5553 3840 -154575 -134095 -292825 -25270 -388601 -25023 166957 -58785 -37069 -56915 -210557
5542 -210557 -117101 -143623 1482 -67108 58264 -74217 43196 46141 150858 209156 187985 -118140
5529 -147042 -15231 134490 278133 -50109 93969 -15199 104345 11702 -185211 168459 33426
5517 24330 -172824 409626 332828 -40435 220637 -136544 -58866 -89598 173829 -22167 214663
5505 4857 -320629 79020 235411 143923 -279458 -21031 -231246 -20355 96497 131946 99272
5494 99272 62613 -250290 -393630 272988 1694 92420 -84581 371131 -19785 -75106 257719
5482 116450 8167 5086 296309 -271957 -485503 181108 232336 95172 -119391 -415795 179344
5470 33984 -1085 83521 -29695 212247 -42637 120481 -272970 53853 119739 141925 216994
5459 216994 -100457 -108949 136109 19517 190849 91357 39213 197109 -70717 196640 22361
5447 82585 -31297 42314 -335510 68685 258649 -50013 118766 -187337 -206595 -57992 -47235
5436 -47235 -330299 139018 14777 -80235 55998 -19754 -284770 19564 381723 359036 -78338
5424 85481 39634 456171 -46858 -295787 -125644 209527 -45765 -128032 -302172 -103274 -49292
5412 117169 198611 152283 -117416 -217848 144577 104554 24904 170150 115420 95468 274507
5401 274507 -8242 53728 -112860 132096 381220 -26145 75276 21262 133216 192722 -139211
5389 4287 325989 188863 125594 -244721 -34775 14968 203527 -23650 184681 57646 -163625
5377 87307 -177892 57189 41975 176295 92935 164789 -256456 -110452 -105755 12606 -11517
5365 273314 -97315 394828 -277371 -290172 -172084 15664 206686 -135317 -16058 -87968 162332
5353 -10721 -230132 -136046 419737 56479 -195637 20371 58970 -33749 -141315 111513 55420
5341 16731 -128594 41061 -219521 14787 50099 -127448 -192984 -127963 250333 303242 -54847
5329 -133117 60262 -593 -84125 -25686 -190075 -211592 -196457 -38094 -94734 123428 73813 -126743
5316 -5200 -119636 -156368 -124641 -146735 -44544 59672 95168 22533 -111566 -142831 77666 427764
5304 427764 -172073 -36442 135908 163147 66557 -215377 178415 92678 -18326 28987 -474998
5292 47054 44493 -16919 92674 347834 -79306 -19453 -101196 -1183 37163 31399 -254031 17123
5279 175948 77481 21620 324884 -134044 231552 12188 -89283 58747 28521 104496 260359
5268 260359 170104 -37846 25673 336853 24425 47197 40342 -6100 234929 87614 153084 59833
5255 -180461 29249 -61672 142237 -130839 -88431 37212 7950 9220 -83475 28155 -122876
5243 -1423 -145038 -82081 -119284 -299239 107363 -185182 255176 -50875 -18663 -198024 163607
5231 18058 88483 -99109 212292 -98442 312123 -174534 -263550 68467 230988 271586 -50643
5219 74460 -239319 53708 248931 -143798 -80458 -31715 332608 -144399 313173 -96569 46226
5207 -52818 78486 -130069 169758 -96532 130142 47202 211052 -81854 -264472 392506 -66106
5195 12082 -117954 170806 58956 13305 -18517 -162719 -188214 163684 -85197 -268330 171196
5183 -48980 19656 -57848 -21371 50292 -102046 36111 -70977 80782 74901 157767 224533 265229
5171 265229 66589 -33206 34448 151605 -196554 84747 -136384 -356024 49334 -50823 273897
5159 87603 21809 -67853 -294587 -116753 75123 -291955 12884 131325 -234328 -136992 95870
5147 74066 179236 -146063 -280931 29661 8136 28480 -302627 87377 115049 -124404 -66843
5136 -66843 -205567 159364 -122405 -127191 324436 19496 32045 -325001 -104845 2628 -170919
5124 52308 27310 102837 215814 -37702 -519215 97765 50180 -61748 -58019 -23906 228203
5112 190891 -14567 19925 -40744 25565 -155366 165427 27147 -139968 63034 120662 -80564
5100 98001 126194 -40764 25540 183165 82649 116235 -105515 -134652 70191 -309633 99825
5088 -42755 62515 65224 -96357 -195575 372692 24057 13597 -155566 -382202 -158153 357083
5076 250571 -47392 68432 28291 -61378 -101628 106587 -7168 86789 63912 -39452 -274595
5065 -274595 -346813 -50759 -3678 88165 -340878 210545 -199307 71288 104609 255227 -75905
5053 -384956 -71015 42303 87374 107408 170414 -136026 253189 -358942 143437 -147729 -151380
5042 -151380 259970 186046 172259 -71348 -100359 -113783 288138 -78594 -132980 120674 -59851
5030 -106874 -126287 41732 12964 55326 -289069 182067 357306 -56216 -19907 -58159 184959
5018 124914 212660 -138007 -52353 -54416 -232562 70458 -204872 275320 74385 54553 160094
5007 160094 71641 337494 231348 29547 192476 131235 307384 -186106 18010 215459
4997 215459 -318534 74402 170315 -170671 -149394 -151304 -192989 -103349 -82219 5548 -10945 -96801
4985 -96801 -96019 -36849 80010 158738 65448 -54395 54862 203556 -53911 -101633 118423 -261732
4972 -284081 -137741 44587 49887 -53006 289535 54937 219558 -123112 9662 -385201 -84021
4960 -190053 -173952 -44330 -44334 -20435 125825 -42253 3040 -157532 -217248 288498 56621 61882
4948 61882 55657 19351 -509289 -23113 137912 157818 266911 -143167 -66738 385134 -63421
4936 -137274 -217485 76139 121656 116455 -128290 26973 91916 72651 50365 15649 -124231
4924 79117 84024 -176260 350321 -128106 -323539 -117353 2547 -112218 178125 -98040 267457
4912 -96523 245280 121316 -88513 439738 -15185 -68947 2472 109459 -13978 -127619 -206990
4901 -206990 115254 67925 67351 92608 45466 105849 229052 -249334 -63951 120426 81651
4890 81651 118708 -140335 40039 -262392 150395 121496 -476852 -66801 -20837 -196624 13777
4878 -184804 -315334 205856 -214273 74749 -135451 59398 114618 -238840 48784 -3416 -93124
4867 -93124 -77666 355277 -318991 -101545 -1179 -32523 26853 -430089 -12194 238800 94075
4855 -235579 -39400 132692 102786 109174 -324705 155239 -225509 -4181 24698 204370 -130862
4843 109093 -292710 -59613 -177758 26891 -25644 49596 144360 -294664 -266604 90372 178122
4832 178122 254561 180492 106629 45877 28392 65906 -112840 190523 5413 -187012 4274
4820 -267187 -4061 257596 104457 -2696 257068 98843 -43776 46190 183814 33472 134213
4809 134213 -167035 -151670 -13247 45828 -188791 -105029 -117991 -116435 22237 261679 125935
4797 368397 -8380 138003 -129156 -251055 -115576 -156090 -27361 -89823 260036 100094 260090
4786 260090 -132363 142957 149829 286651 -116358 -318265 -185893 94345 -241414 3917 -115195
4774 -67249 -112425 22640 201822 82173 -208401 -262368 25170 -109926 106900 -45699 -167636
4763 -167636 -77979 150732 -154923 163540 -121295 -141778 -178961 19716 94959 -28804 48256
4751 136383 105802 -344068 91842 66874 -21743 -133518 78070 -1229 -192031 -138790 -142961
4740 -142961 55531 343109 50294 200606 -91325 82318 103960 -54012 106564 111717 89904
4729 89904 -253492 -188255 359799 -200288 -11897 179376 67923 -334414 31902 201642 5843
4717 88396 28171 171700 47228 -78963 -30697 113506 120318 61668 39464 -118084 -82287
4706 -82287 -36512 -190727 -172214 92447 -57163 36025 75870 213398 82229 22542 -232335
4694 -9740 -62186 -17579 164962 194003 144668 -13759 38738 219207 93791 404255 99440
4682 -126388 169769 -145360 -150150 -301898 107802 32996 -173186 -16008 37774 -47471 47195
4670 -58483 -136738 7850 240629 -162681 122331 98568 -50229 -101527 -201558 59358 51514
4659 51514 239381 178275 -195764 103624 130567 -88114 185781 25011 14683 -214956 -223844
4648 -223844 183574 145479 -86767 350037 13507 -181670 7572 61957 -229596 282150 107160
4636 -76583 -70690 -16317 -98932 293047 48694 -115455 -67833 -54682 177247 -201319 -112661
4625 -112661 -74173 60777 -7257 407570 36234 213300 -3808 -134845 175489 25169 -435111
4613 133552 -155940 -18477 57761 82359 80545 -34121 -219862 158195 176764 -83180 -165057
4602 -165057 -62524 84571 -137137 48347 -392580 1336 -154805 183121 -175544 -125119 -178414
4591 -178414 -259424 161592 228903 317307 -347711 296252 -54590 220958 -304358 357647
4580 85478 -68429 -198444 121529 -177067 -233189 270751 -177241 21975 -12469 357201 137135
4568 -47731 11890 -73913 200107 -179511 -24565 140042 -194980 -276669 155867 -153675 196985
4556 262545 -257484 -187640 187445 -49040 -107452 255005 -203021 11040 -180399 -112321 12401
4544 -105344 118882 157217 -145262 -97156 77189 98271 178555 44242 -167776 -110455 72895
4532 250161 11908 -59959 82699 205300 248325 -99621 -39855 -62973 160014 -41287 -168538
4521 -168538 129985 -53284 332827 192333 68206 225289 258584 -250607 98036 530 166311
4510 166311 -40677 -146946 51534 236933 -504730 -122923 467494 -85147 142138 130358
4500 130358 154590 34842 -30064 -112361 -147635 -340178 -141069 -132435 275392 158329 16318
4488 -263171 -377422 90022 -243426 -117558 235329 133306 -326396 -75860 132950 247713
4478 247713 -61559 -163614 -222384 309308 -27310 -117391 20943 67993 348235 144625 -35193
4466 147959 -28597 -310657 3066 -84565 -89848 155110 75583 246307 317828 229503 -118485
4454 -3481 21213 270556 -27440 170907 78261 -344719 274462 -101995 346175 -50964 -87284
$$ [...]
##END NTUPLES=NMR SPECTRUM
##END=
