
##TITLE=AC1205_HSMAH12053_5946155_tolVC2PjQu
##JCAMPDX= 6.0         $$ Bruker NMR JCAMP-DX V2.0
##DATA TYPE= NMR SPECTRUM
##DATA CLASS= NTUPLES
##ORIGIN= BRUKER
##OWNER= Administrator
$$ 1.72 TOPSPIN		Version 2.1
$$ 2012-04-10 19:43:01.890 -0500  Administrator@TOPSPIN
$$ Compression mode = diff/dup
##.OBSERVE FREQUENCY= 400.13188235
##.OBSERVE NUCLEUS= ^1H
##.ACQUISITION MODE= SIMULTANEOUS (DQD)
##.ACQUISITION SCHEME= undefined
##.AVERAGES= 64
##.DIGITISER RES= 22
##SPECTROMETER/DATA SYSTEM= spect
##.PULSE SEQUENCE= noesygpps1d.comp
##.SOLVENT NAME= COFFEE_meoh
##.SHIFT REFERENCE= INTERNAL, COFFEE_meoh, 1, 14.96836
##AUDIT TRAIL= $$ (NUMBER, WHEN, WHO, WHERE, PROCESS, VERSION, WHAT)
$$ ##TITLE= Audit trail, TOPSPIN		Version 2.1
$$ ##JCAMPDX= 5.01
$$ ##ORIGIN= Bruker BioSpin GmbH
$$ ##OWNER= Administrator
$$ $$ C:\Bruker\TOPSPIN/data/COFFEE/nmr/AC1205_HSMAH12053_5946155_tolVC2PjQu/12/pdata/1/auditp.txt
$$ ##AUDIT TRAIL=  $$ (NUMBER, WHEN, WHO, WHERE, PROCESS, VERSION, WHAT)
(   1,<2012-04-10 19:42:54.890 -0500>,<Administrator>,<TOPSPIN>,<go>,<TOPSPIN 2.1>,
      <created by zg
	started at 2012-04-10 19:31:22.968 -0500,
	POWCHK enabled, PULCHK disabled,
       configuration hash MD5:
       1A 1E CE 29 27 FD 77 03 67 4E F0 E3 C4 B2 CB 90
       data hash MD5: 64K
       DC 37 C1 A6 DE 7F BB B2 CE 36 75 DC 22 F1 BD 83>)
(   2,<2012-04-10 19:42:59.312 -0500>,<Administrator>,<TOPSPIN>,<proc1d>,<TOPSPIN 2.1>,
      <Start of raw data processing
       efp LB = 0.3 FT_mod = 6 PKNL = 1 PHC0 = 0 PHC1 = 0 SI = 128K 
       data hash MD5: 128K
       2E 3E 3D F5 C0 9D 40 1A DB 01 91 65 37 E3 B9 FD>)
(   3,<2012-04-10 19:43:00.562 -0500>,<Administrator>,<TOPSPIN>,<proc1d>,<TOPSPIN 2.1>,
      <pk PHC0 = 31.59668 PHC1 = 0 
       data hash MD5: 128K
       C6 3C FA B1 8B 13 FD 80 C0 A7 C9 D0 64 4D 11 DE>)
(   4,<2012-04-10 19:43:01.437 -0500>,<Administrator>,<TOPSPIN>,<proc1d>,<TOPSPIN 2.1>,
      <abs ABSG = 1 
       data hash MD5: 128K
       FC C1 74 4E 89 8F 46 FB 91 6B 42 9F 3A 57 3A 5A>)
(   5,<2012-04-10 19:43:01.531 -0500>,<Administrator>,<TOPSPIN>,<proc1d>,<TOPSPIN 2.1>,
      <abs ABSG = 2 
       data hash MD5: 128K
       FC CE 38 B7 E7 B0 88 DC B0 96 50 FF 98 ED F7 88>)
(   6,<2012-04-10 19:43:01.593 -0500>,<Administrator>,<TOPSPIN>,<proc1d>,<TOPSPIN 2.1>,
      <abs ABSG = 3 
       data hash MD5: 128K
       1B 6A 10 E3 EB 3D 43 6B 14 61 9B 51 C0 2F 61 54>)
(   7,<2012-04-10 19:43:01.656 -0500>,<Administrator>,<TOPSPIN>,<proc1d>,<TOPSPIN 2.1>,
      <abs ABSG = 4 
       data hash MD5: 128K
       62 AE 4D CA 05 4B 02 E2 38 86 CE 5B 72 E1 5E A5>)
(   8,<2012-04-10 19:43:01.718 -0500>,<Administrator>,<TOPSPIN>,<proc1d>,<TOPSPIN 2.1>,
      <abs ABSG = 5 
       data hash MD5: 128K
       1D F3 FB 69 E5 A8 C3 14 A6 75 BD FD 90 F0 9C 9F>)
$$ ##END=
$$ 
$$ $$ hash MD5
$$ $$ DA 5E A6 F4 54 DF C3 8A DC 83 35 64 12 64 16 2E
##$RELAX= 
##$RELAX= 
##$RELAX= 
##$RELAX= 
##$RELAX= 
##$RELAX= 
##$RELAX= 
##$RELAX= 
$$ Bruker specific parameters
$$ [...]
##$TP07= 0
##$TPNAME0= <>
##$TPNAME1= <>
##$TPNAME2= <>
##$TPNAME3= <>
##$TPNAME4= <>
##$TPNAME5= <>
##$TPNAME6= <>
##$TPNAME7= <>
##$TPOAL= (0..7)
0.5 0.5 0.5 0.5 0.5 0.5 0.5 0.5
##$TPOFFS= (0..7)
0 0 0 0 0 0 0 0
##$TUNHIN= 0
##$TUNHOUT= 0
##$TUNXOUT= 0
##$USERA1= <user>
##$USERA2= <user>
##$USERA3= <user>
##$USERA4= <user>
##$USERA5= <user>
##$V9= 5
##$VALIST= <valist>
##$VCLIST= <CCCCCCCCCCCCCCC>
##$VD= 0
##$VDLIST= <DDDDDDDDDDDDDDD>
##$VPLIST= <PPPPPPPPPPPPPPP>
##$VTLIST= <TTTTTTTTTTTTTTT>
##$WBST= 1024
##$WBSW= 4
##$XGAIN= (0..3)
0 0 0 0
##$XL= 0
##$YL= 0
##$YMAX_a= 13972183
##$YMIN_a= -5981819
##$ZGOPTNS= <>
##$ZL1= 120
##$ZL2= 120
##$ZL3= 120
##$ZL4= 120
##$ABSF1= 14.96836
##$ABSF2= -5.58417
##$ABSG= 5
##$ABSL= 3
##$ALPHA= 0
##$AQORDER= 0
##$ASSFAC= 0
##$ASSFACI= 0
##$ASSFACX= 0
##$ASSWID= 0
##$AUNMP= <proc_prof1d_extract.lims>
##$AXLEFT= 0
##$AXNAME= <>
##$AXNUC= <1H>
##$AXRIGHT= 0
##$AXTYPE= 0
##$AXUNIT= <>
##$AZFE= 0.1
##$AZFW= 0.1
##$BCFW= 0
##$BC_mod= 0
##$BYTORDP= 0
##$COROFFS= 0
##$CY= 15
##$DATMOD= 1
##$DC= 0
##$DFILT= <>
##$DTYPP= 0
##$F1P= 0
##$F2P= 0
##$FCOR= 0.5
##$FTSIZE= 131072
##$FT_mod= 6
##$GAMMA= 0
##$GB= 0
##$INTBC= 1
##$INTSCL= 1
##$ISEN= 128
##$LB= 0.3
##$LEV0= 0
##$LPBIN= 0
##$MAXI= 10000
##$MC2= 0
##$MEAN= 0
##$ME_mod= 0
##$MI= 0
##$NCOEF= 0
##$NC_proc= -3
##$NLEV= 6
##$NOISF1= 0
##$NOISF2= 0
##$NSP= 0
##$NTH_PI= 0
##$NZP= 0
##$OFFSET= 14.96836
##$PC= 1
##$PHC0= 31.59668
##$PHC1= 0
##$PH_mod= 1
##$PKNL= yes
##$PPARMOD= 0
##$PPDIAG= 0
##$PPIPTYP= 0
##$PPMPNUM= 2147483647
##$PPRESOL= 1
##$PSCAL= 4
##$PSIGN= 0
##$PYNMP= <proc.py>
##$REVERSE= no
##$SF= 400.130004901818
##$SI= 131072
##$SIGF1= 0
##$SIGF2= 0
##$SINO= 400
##$SIOLD= 131072
##$SPECTYP= <>
##$SREGLST= <1H.CDCl3>
##$SSB= 0
##$STSI= 131072
##$STSR= 0
##$SW_p= 8223.68421052632
##$SYMM= 0
##$S_DEV= 0
##$TDeff= 65536
##$TDoff= 0
##$TI= <>
##$TILT= no
##$TM1= 0
##$TM2= 0
##$TOPLEV= 0
##$USERP1= <user>
##$USERP2= <user>
##$USERP3= <user>
##$USERP4= <user>
##$USERP5= <user>
##$WDW= 1
##$XDIM= 131072
##$YMAX_p= 493070855
##$YMIN_p= -173091410
##$CURPLOT= <Network HP LaserJet P1505>
##$CURPRIN= <$Network HP LaserJet P1505>
##$DFORMAT= <normdp>
##$LAYOUT= <+/1D_H.xwp>
##$LFORMAT= <normlp>
##$PFORMAT= <normpl>
##$SURQMSG= 1
$$ End of Bruker specific parameters
$$ ---------------------------------
##NTUPLES= NMR SPECTRUM
##VAR_NAME=  FREQUENCY,     SPECTRUM/REAL,   SPECTRUM/IMAG
##SYMBOL=    X,             R,               I
##VAR_TYPE=  INDEPENDENT,   DEPENDENT,       DEPENDENT
##VAR_FORM=  AFFN,          ASDF,            ASDF
##VAR_DIM=   131072,        131072,          131072
##UNITS=     HZ,            ARBITRARY UNITS, ARBITRARY UNITS
##FACTOR=    0.0627417313425165, 1,          1
##FIRST=     8223.62146879498, -4556,        -103201
##LAST=      0,             -330,            -104767
##MIN=       0,             -173091410,      0
##MAX=       8223.62146879498, 493070855,    0
$$ Real data points
##PAGE= N=1
##DATA TABLE= (X++(R..R)), XYDATA
$$ [...]
66852 3578202 3604989 3633815 3663330 3692512 3720213 3745216 3767513 3788534 3809517 3830517 3851313
66841 3851313 3872054 3892462 3911675 3929539 3946834 3963515 3978163 3990132 4000830 4011550 4021347
66830 4021347 4028681 4034093 4039437 4045032 4049389 4051517 4051948 4051539 4050604 4049209 4047143 4043677 4038411 4032144 4025828
66815 4025828 4018977 4010308 3999731 3988359 3976607 3963547 3948287 3930995 3912547 3894083 3876611 3859920
66803 3859920 3842117 3821568 3799176 3777359 3756792 3735621 3711977 3685772 3657822 3628856 3599859
66792 3599859 3571896 3544855 3517527 3489351 3460835 3431874 3401307 3368942 3336474 3305262 3274519
66781 3274519 3242857 3210437 3178259 3146337 3114103 3081872 3050369 3019250 2987538 2955239 2923241
66770 2923241 2891711 2859848 2827227 2794345 2761770 2729734 2698631 2668942 2640442 2612209 2583552
66759 2583552 2554309 2524294 2493332 2461963 2431279 2401795 2373146 2345159 2318409 2293230 2268829
66748 2268829 2243992 2218350 2192353 2166253 2139699 2112322 2084303 2056291 2029070 2003394 1979772
66737 1979772 1958098 1937592 1917339 1896834 1875842 1853962 1830919 1807320 1784356 1762273 1739810
66726 1739810 1716027 1692182 1670603 1651730 1633645 1614851 1596152 1578895 1562514 1545233 1526655
66715 1526655 1508148 1490715 1473754 1456239 1438115 1420023 1402357 1385159 1368531 1352647 1337557
66704 1337557 1323268 1309819 1296987 1284130 1270630 1256563 1242796 1230336 1219475 1209468 1199136
66693 1199136 1187896 1176040 1163944 1151422 1138344 1125512 1114099 1104072 1093925 1082345 1069609
66682 1069609 1056914 1044821 1032933 1020799 1008498 996438 985143 975158 966490 958036 948324 937159
66670 937159 926002 916290 907922 899953 892180 884972 877760 868969 857957 846177 835755 827439 820456
66657 820456 813831 807126 800241 793365 787086 781905 777603 773457 768911 763580 756913 748642 739519 730898
66643 730898 723538 717312 711903 706961 701655 695048 687214 679244 671949 665302 659291 654351 650509 646911
66629 646911 642694 637633 631649 624646 617386 611421 607310 603717 599175 593869 588690 583507 577816 572417
66615 572417 568648 566136 563018 558664 554635 552355 551118 549134 545532 540505 534348 527373 520418 514567
66601 514567 510342 507536 505573 503700 501103 497332 492611 487536 482700 478678 476000 474754 474269 473441 471356
66586 471356 467700 462897 457925 453671 450240 447041 443546 439746 435931 432500 429980 428606 427643 425668
66572 425668 421968 417387 413397 410547 408101 405029 401094 397123 394386 393489 393691 393465 391813 388848 385121
66557 385121 380924 376511 372437 369163 366564 364379 362982 363099 364613 366061 365666 362862 358743 355038 352690
66542 352690 351413 350420 349275 347997 346784 345996 346044 346649 346400 343839 339139 334094 330280 327869 326374 325638
66526 325638 325472 325047 323542 321175 318926 317398 316413 315476 314110 311998 309383 307125 305791 304837 303270
66511 303270 300928 298475 296287 294081 291725 289671 288345 287634 287155 286614 285821 284826 284152 284306 284927 284958 283877
66494 283877 282181 280457 278584 276249 273618 270995 268294 265434 262861 260988 259444 257638 255983 255678
66480 255678 257068 258850 259306 257932 255518 253001 250615 248067 245127 242070 239753 239141 240399 242379 243414
66465 243414 242781 241218 239859 239017 238342 237799 237701 237765 236940 234707 232008 230272 229855 230068 230446 231129 231967 232117
66447 232117 230916 228674 226337 224765 224406 224970 225157 223449 219788 215979 213885 213624 214028 214270 214209 213595
66431 213595 212084 210061 208441 207426 206254 204473 202750 202046 202545 203775 205181 206155 206074 204923 203614
66416 203614 203018 202850 202034 200177 198184 197340 198036 199528 200793 201485 201994 202551 202576 201381 199433 198227 198558
66399 198558 199494 199558 198450 196943 195495 193876 192147 191093 191308 192352 193160 192990 191828 190214 188913 188427
66383 188427 188615 188937 189115 189204 188989 187875 185764 183663 182886 183672 184941 185439 184979 184540 185268 187332 189726
66366 189726 191160 191098 189883 188116 186340 185141 184889 185162 184929 183635 181710 179778 177945 176217 175041
66351 175041 174703 174584 173724 171983 170038 168425 167243 166532 166150 165383 163598 161317 159634 158405 156149 152285
66335 152285 148395 146436 146499 147268 148075 149347 151364 153712 155864 157322 157263 155206 152230 150393 150458 151097
66319 151097 150860 150064 149961 150789 151663 152085 152569 153656 155026 155853 155696 154914 154327 154384 154584 154017 152604 151257
66301 151257 150390 149006 146115 142611 140576 140774 141932 142660 142892 143021 142818 142090 141533 141875 142675 142960 142661
66284 142661 142336 141699 139691 136227 132772 130687 129743 128850 127620 126601 126350 126931 128169 129853 131704 133477
66268 133477 135089 136424 137090 136692 135323 133616 132287 131679 131593 131429 130673 129465 128581 128555 128940 128750 127612
66251 127612 126236 125701 126507 128288 130186 131395 131682 131628 132191 133749 135569 136344 135310 132809 129919 127697
66235 127697 126634 126428 126091 124560 121616 118275 116114 116100 118042 120985 123865 125893 126793 126953 127146 127792
66219 127792 128555 128807 128397 127713 127150 126792 126567 126390 126073 125442 124719 124618 125821 128289 131139 133179 133616
66202 133616 132391 129947 126765 123222 119778 116968 115040 113892 113607 114650 117114 119978 121809 122179 121858
66187 121858 121526 120911 119490 117507 115892 115463 116472 118606 121109 123155 124420 125101 125301 124797 123655 122533
66171 122533 121911 121489 120863 120304 120080 119459 117458 114599 112844 113361 115240 116928 118118 119408 120689 121043
66155 121043 120130 118611 116817 113930 109336 104418 101979 103622 108094 112492 114741 114747 113639 112587 112281
66140 112281 112902 114247 116018 118086 120318 122212 123113 122990 122728 123408 125421 128285 130993 132477 132246 130992
66124 130992 130177 130545 131185 130530 128127 125089 122916 122387 123455 125543 127666 128773 128466 127295 126104 125143
66108 125143 124048 122643 121508 121401 122088 122102 120131 116697 113917 113321 114273 114916 114268 112841 111456 110282
66092 110282 109205 108448 108324 108618 108681 108157 107349 106719 106218 105414 104365 103902 104566 105505 105273 103795 102642 102942
66074 102942 103997 104695 105283 106502 107670 107346 105825 105203 106470 107990 107706 105652 103276 101194 98897
66059 98897 96164 93555 91586 90359 89930 90216 90571 90328 89909 90588 92829 95439 96824 96674 96039 96044 96994
66042 96994 98564 100253 101434 101397 99941 97972 96964 97501 98703 99540 100265 101784 103798 104671 103452 101128
66026 101128 99267 98167 97094 95723 94423 93429 92704 92558 93519 95472 97629 99453 101011 102287 102855
66011 102855 102540 101818 101205 100608 99580 97927 95809 93588 91839 91220 92003 93829 96096 98445 100775 103003
65995 103003 104931 106191 106271 104891 102517 100239 98893 98416 98175 97705 97069 96747 97320 99010 101322 103402
65979 103402 104883 106156 107619 109099 110313 111521 113082 114464 114393 112325 109403 107587 107865 109510 111136
65964 111136 112353 114187 117763 122735 127401 130422 131911 132540 132163 130184 127119 124798 124593 126085 127873
65949 127873 129045 129329 128477 126531 124423 123197 122484 120680 117008 112550 108789 105959 103576 101861 101568
65934 101568 102683 104308 105757 106834 107054 105736 103269 101344 101290 102777 104642 106274 107435 107464 105765
65919 105765 102903 100213 98304 96779 95420 94630 94399 93834 92480 91516 92759 96620 101661 106107 109203
65904 109203 111071 111949 111956 111278 110169 108854 107663 107086 107319 107784 107531 106351 105240 105409 106878 108397 108757
65887 108757 107868 106490 105288 104518 104379 105089 106463 107780 108420 108620 109265 110816 112663 113797 114047 114223
65871 114223 114830 115130 114019 111634 109325 107919 106845 105465 104550 105517 108446 111750 113950 114955 115347
65856 115347 115205 114230 112571 110837 109406 108270 107429 106953 106617 106025 105222 104808 105242 106356 107740 109240
65840 109240 110808 112161 112968 113156 112741 111629 110079 109047 109258 109969 109514 107374 104943 103784 103853 104119
65824 104119 104243 104689 105584 106641 108085 110393 112948 114183 113647 112919 113668 115550 116938 117158 116927 116893 116884
65807 116884 116738 116810 117153 116880 114988 111648 108184 105759 104425 103544 102892 102986 104185 105796 106563 106093 105357
65790 105357 105573 106987 109081 111546 114407 117292 119208 119349 117926 116034 114755 114437 114742 115214 115644 115839
65774 115839 115437 114385 113466 113776 115501 117671 119206 119757 119448 118561 117804 118159 119941 122410 124719 126581
65758 126581 127599 126927 124575 122346 122235 124164 126340 127592 128210 128697 129095 129784 131609 134546 137149 138091
65742 138091 137762 137720 138857 140558 141506 141137 140301 140377 141592 142661 142548 141974 142287 143329 143694 142916 141928 141225
65724 141225 140092 138285 137051 137492 138847 139312 137817 134303 129195 123599 119274 117183 116369 115180 113284
65709 113284 111714 111267 111772 112670 113492 113828 113528 112889 112248 111581 110835 110209 109671 108787 107582 106848 106799 106178
65691 106178 103808 100520 98329 97972 98490 99053 99844 101035 102092 102499 102272 101497 100193 98776 97822 97213
65675 97213 96368 95410 95041 95136 94721 93820 94001 96229 99169 100670 100158 98545 96473 94005 91832 91357 93154
65658 93154 96106 98488 99504 99595 99729 100641 102401 104330 105392 104917 103053 100579 98255 96293 94473 92833
65642 92833 92044 92673 94083 94727 93997 93301 94632 98114 101644 103148 102688 101990 102343 103502 104603 105452 106468
65625 106468 107642 108149 107115 104458 100878 97338 94755 93797 94508 96126 97552 98024 97386 95975 94479
65610 94479 93609 93610 94234 95339 97039 98920 99687 98424 95912 93934 93299 93351 93401 93714 94802 96464 97911
65593 97911 98392 97628 96164 95361 96240 98134 99285 99037 98536 98904 99725 100000 99652 99175 98599 97806 97180 96852
65575 96852 95928 93850 92049 92660 95576 98302 99019 98329 97502 96617 95430 94803 95774 97763 99064 98958 98221
65558 98221 97689 97451 97573 98491 100166 101584 101698 100389 98161 95401 92540 90476 89997 90734 91333 90923 90047
65541 90047 89934 91113 92945 94336 94684 94191 93433 92697 91867 91043 91000 92514 95191 97583 98829 99672 101261
65524 101261 103279 104127 103025 101105 99953 99539 98197 94643 89713 86018 85830 89079 93411 96425 97775
65509 97775 98758 100036 100714 99933 98310 96868 95233 92200 87976 84450 82880 82570 82586 83690 87213 92463
65493 92463 96698 97932 96760 95040 93809 93143 93238 94413 96225 97654 98396 99158 100363 101275 101021 99925
65477 99925 99084 98867 98587 97709 96742 96679 97975 100184 102145 102387 99987 95611 91433 89414 89618 90531 90901
65460 90901 90747 90586 90430 90098 90148 91710 95184 99564 103391 106102 108135 109951 111477 112525 113224 113827
65444 113827 114434 115024 115408 115033 113483 111556 111166 113310 116472 117972 116871 114738 113512 113580 114243 115113
65428 115113 116282 117617 118675 119270 119729 120640 122399 124760 126716 127313 126807 126535 127412 129083 130798 132346
65412 132346 133627 134040 133172 131565 129888 127745 124339 120112 116582 114495 113175 111936 111182 111625 113150
65397 113150 114976 116363 116633 115032 111348 106606 102656 100900 101459 103441 105924 108732 112229 116193 119179
65382 119179 119481 116759 112344 108002 104802 103028 102443 102386 102238 102092 102558 103785 105128 105878 105715 104405
65366 104405 101953 99433 98696 100497 103479 105626 106167 105484 104039 102394 101642 102440 103785 103882 102300 100246
65350 100246 98773 97839 97303 97666 99290 101830 104971 108886 113365 117278 119665 120850 121856 123255 125158
65335 125158 127614 130134 131452 130965 130108 130954 133422 135218 134965 134051 134506 136138 137147 137074 137631 140331
65319 140331 144511 148392 151358 154435 158738 164101 169187 172606 174103 175069 177723 183248 190788 198771
65305 198771 207006 216611 227719 238411 246720 253001 259341 266898 274708 280849 283770 282499 276863 268064
65291 268064 258275 249124 241050 234227 228964 224617 219280 211891 203926 197618 192811 187031 178751 169163
65277 169163 160402 153339 147780 143481 139887 135759 130439 125228 122339 122414 123907 124916 124843 124111 123095
65262 123095 121780 120067 117993 115776 113645 111429 108429 104234 99669 96305 94765 94080 93106 91959 91423
65247 91423 91298 90350 88145 86143 86294 88747 91606 93024 92977 92640 92619 92574 92375 92471 92732 91954 89468 86661
65229 86661 85684 86810 88193 88394 87968 88190 89322 90965 93173 96072 98811 99982 99044 96633 93636 90760
65213 90760 88812 88337 88753 88690 87595 86396 86267 87321 88956 90876 93129 95404 97025 97809 98562 100387
65197 100387 103453 106635 108663 109628 110853 112960 114699 114535 112985 112259 113473 115433 116526 116599 116158 114827
65181 114827 111964 108329 105822 105497 106665 107887 107987 106256 102741 98666 95651 94119 93008 91297 89146
65166 89146 87244 85740 84362 83102 82224 81864 82001 82563 83197 83231 82340 81152 80828 81988 84108 85906 86348
65149 86348 85440 84028 82711 81314 79854 79439 81149 84207 86584 87700 89125 91982 95069 96608 96650
65134 96650 96338 95885 95050 94834 96483 98871 99066 96038 91987 89332 88107 87247 86655 86565 86238 85087 84267
65117 84267 85365 87933 89931 90421 90262 90127 89466 87831 85820 84062 82387 80710 79855 80578 82363 83957
65101 83957 84811 85351 86112 87216 88532 89880 91076 92137 93302 94573 95368 94941 93121 90540 88296 87481
65085 87481 88611 91096 93510 94799 95158 95397 95631 95117 93435 91291 89885 89794 90813 92669 95337 98474
65069 98474 100993 101864 101501 101826 104437 108814 112769 114642 114599 113802 113029 112455 112190 112321 112590 112614 112424 112328
65051 112328 112328 112171 112039 112674 114572 117365 120184 122377 123716 124355 124914 126319 129102 133010 137703 143597
65035 143597 151396 160800 170400 179080 186869 194020 200062 204625 208640 213468 218796 222702 224297 225180
65021 225180 227398 230787 233447 234355 234190 233696 232459 229641 224919 218306 209955 200719 192153 185228 179438
65006 179438 173715 167770 161956 156353 150809 145656 141517 138345 135301 131742 127923 124599 122290 120917
64992 120917 119829 118156 115553 112647 110449 109332 108835 108419 107972 107534 106943 105967 104523 102658 100484 98226
64976 98226 96223 94923 94889 96409 98757 100213 99547 97453 95777 95295 95014 93868 92279 91437 91642 92095
64960 92095 92072 91664 91438 91764 92482 92968 92805 92603 93697 96533 99779 101775 102510 103233 104301 104643 103644 102283
64942 102283 101548 100721 98508 95453 93846 95074 98080 100777 102046 101923 100754 99144 98271 99153 101434
64927 101434 103521 104096 103135 101415 99620 98151 97319 97185 97290 96845 95290 92704 89787 87499 86532 86908
64911 86908 87920 88367 87080 83846 80171 78586 80313 83734 85953 85886 84991 84809 84921 84029 82127 80495
64895 80495 80010 80502 81632 83315 85138 86240 86144 85171 83827 82329 80944 80227 80475 81242 81654 81135 79845
64878 79845 78710 78880 80655 82922 84249 84613 85337 87114 88900 89270 88169 86593 85031 83122 80743
64863 80743 78652 77871 78859 81324 84423 87099 88654 89204 89364 89466 89284 88504 87195 85772 84787 84796 86096
64846 86096 88322 90407 91177 90246 88451 87336 87868 89501 90721 90641 89758 88942 88224 87116 85786 85068 85256
64829 85256 85643 85573 85384 85879 87233 88813 89861 90077 89800 89903 91159 93324 95080 95370 94548 93760 93413
64812 93413 93002 92392 92400 93699 95808 97720 99106 100237 100997 100739 99231 97180 95618 95121 95738 97210 98950
64795 98950 100151 100282 99447 98062 96347 94306 92028 89769 87833 86566 86286 86914 87759 87969 87226 85837
64779 85837 84227 82655 81445 81070 81731 82977 83975 84242 84055 84164 85129 86899 89013 91092 92970 94340
64763 94340 94592 93277 90695 87803 85552 84420 84473 85511 86987 87960 87488 85375 82631 80960 81395 83322
64747 83322 85140 85960 86397 87555 89665 92077 94208 95984 97452 98421 98496 97221 94366 90416 86623 84177
64731 84177 83386 83872 85180 86706 87541 87321 87083 88322 90999 93349 93872 92769 91163 89828 89247 90054
64715 90054 92510 95853 98903 101165 102907 104405 105603 106339 106526 106198 105600 105020 104493 104057 104313 105905
64699 105905 108186 109308 108331 106497 105654 106202 107561 109709 112658 114858 114138 110669 107382 106604 107481 107703
64683 107703 106704 105854 106007 106245 105194 102595 99293 96401 94878 95401 97969 101601 104829 106747 107611 108330
64667 108330 109435 110676 111504 111679 111316 110682 110138 109956 109842 109012 107216 105391 104651 104829 104771 104074 103600 104003
64649 104003 104655 104642 104198 104351 105453 106812 107692 108029 108101 107922 107121 105226 102113 98476 95709 94855 95640
64632 95640 96886 97979 99521 102378 106384 110337 113123 114490 114761 114231 113202 112415 112849 114698 116774
64617 116774 117451 116260 114207 112452 111147 109789 108186 106549 105014 103870 104204 107272 112649 117580 119096
64602 119096 116839 113257 110950 110423 110620 110838 111300 112142 112891 113272 113771 114779 115620 115179 113361 111275 109933
64585 109933 109422 109489 110221 111563 112653 112368 110580 108424 107223 107428 108661 110359 112145 113772 115057 115939
64569 115939 116464 116631 116307 115440 114405 113953 114531 115627 116099 115381 114113 113280 112927 112247 110904 109676 109366
64552 109366 109545 109009 107444 106030 106125 107723 109521 110328 110091 109619 109640 110229 111023 111829 112943 114730 116830
64535 116830 118022 117210 114673 112167 111573 113279 115776 116838 115386 112452 110279 110268 111751 112839 112353
64520 112353 110784 109579 109793 111400 113566 115428 116707 117599 118157 118087 117393 116713 116487 116077 114515 112092
64504 112092 110398 110611 112481 115132 118004 120497 121623 120884 119101 117659 117194 117521 118317 119112 119035 117575
64488 117575 115485 114059 113447 112529 110657 108782 108513 110462 113721 116673 118237 118656 118994 119636 119665 118321
64472 118321 116623 116421 117785 118533 116827 113310 110049 108173 107395 107244 107693 108610 109451 109829 110076 111087
64456 111087 113619 117505 121335 123244 122448 119982 117653 116380 115797 115207 114507 114191 114776 116265 117963 118939
64440 118939 119024 119333 121305 124953 128244 128644 125413 120332 116185 114621 115358 117022 118367 118855 118673 118479
64424 118479 118843 119719 120642 121475 122539 123776 124354 123563 121730 119704 117843 116220 115437 116297 118627 121184
64408 121184 122911 123646 123671 123290 122980 123120 123290 122567 120833 119172 118615 119007 119435 119233 118433 117813 118664 121690
64390 121690 125783 128673 129226 128388 127478 126489 124726 122250 119737 117535 115849 115398 116882 119921 123261
64375 123261 125873 127301 127392 126459 125500 125499 126623 128485 130692 132537 132929 131676 130337 130566 131860 132209 130929
64358 130929 129533 129615 131066 132690 133500 133023 131401 129778 129674 131311 133212 133968 133690 133187 132546 131383
64342 131383 129846 128463 127290 126115 125309 125559 126730 127737 127781 127119 126305 125273 123649 121746 120544 120535
64326 120535 121029 120995 120320 119765 119754 119858 119702 119759 120733 122579 124686 126774 128986 131305 133536 135757 138165
64309 138165 140489 142166 143024 143184 142402 140391 137848 136243 136250 137217 138481 140250 142497 143900 143078 140683
64293 140683 139281 140859 144981 149476 152577 154170 155200 156207 156697 155960 154091 151801 149472 147020 144652
64278 144652 142980 142227 142024 142284 143496 145774 148298 150253 151697 152916 153648 153717 153821 154723 156018 156648
64262 156648 156406 156017 156015 156572 158155 161019 163955 165049 164233 163850 165813 169223 171806 172829 173311 173901 174177
64245 174177 174160 175025 177560 180803 183100 184099 184960 186822 189791 193432 197531 201947 206014 208627 209106 207976
64229 207976 206831 207353 210294 215152 220682 225747 229911 233561 237501 242200 247254 251668 254733 256487
64215 256487 257281 257255 256528 255557 254683 253426 250881 247006 242921 239616 236914 234235 231907 230859 231116 231420
64199 231420 230626 228905 227228 226036 224887 223113 220390 216801 212935 210018 209319 210896 213164 214298 214145
64184 214145 214312 216220 219567 223002 225761 228125 230722 234186 239189 245740 252378 257192 260089 263065
64170 263065 267668 273129 277809 281520 285170 288752 291173 291952 291732 290933 289088 285863 281721 277218 272661
64155 272661 268890 267302 268146 269565 269289 266906 263739 260896 258402 256097 254411 253937 254737 256312 257949
64140 257949 259057 259593 260334 262433 266378 271389 275927 278846 280155 280882 282332 285262 289422 293630 296479
64125 296479 297351 296865 296124 295564 294850 293863 293117 292957 293101 293493 294832 297463 300342 302247 303598 305862 309426
64108 309426 313538 318349 325365 335201 346257 356479 365313 373181 380234 386840 394379 404156 415882
64095 415882 428292 440876 453999 467735 481806 496516 512608 530087 548004 565288 580987
64084 580987 593881 603039 608973 613254 616540 617605 614662 607223 596555 584760 573453 562780 551629
64071 551629 539208 526247 514120 503020 491944 480502 469747 460881 453933 448172 443116 438622
64059 438622 434485 430528 426854 423714 421279 419648 418747 418178 417592 417253 417674 418732 419866 421329 424304
64044 424304 429357 435572 441871 448501 456437 465925 476554 488479 502534 518979 536771 554209 569908
64031 569908 583324 594949 606032 617503 629013 639423 648212 655807 662500 667712 670652 671118 669165
64018 669165 664403 656278 644990 631761 618185 605542 594539 585267 577371 570551 565004 561131 558838
64005 558838 557448 556326 555260 554215 553234 552883 554319 558359 564590 571765 578977 586071 593267 601101 610706
63990 610706 623345 639265 657530 677239 698412 721304 745422 769791 793874 817646 841037
63979 841037 863942 886649 909584 932606 955061 976527 996952 1015965 1032728 1046897 1059365
63968 1059365 1071580 1084226 1096810 1108481 1119070 1129384 1140549 1153016 1166069 1178416 1189313
63957 1189313 1199088 1208468 1217327 1224231 1227629 1227832 1227570 1229933 1235673 1243220 1251503 1261782 1275962 1293948
63943 1293948 1313971 1335269 1359096 1386900 1418732 1453977 1492513 1534320 1578730 1625194 1674472
63932 1674472 1728081 1786613 1849366 1915805 1986737 2063762 2147953 2239276 2336988 2440421 2549670
63921 2549670 2665780 2790202 2923950 3067394 3220787 3384629 3559444 3745685 3944412
63912 3944412 4158018 4389844 4643015 4920003 5223362 5556332 5922399 6324759 6767008
63903 6767008 7254439 7794155 8393687 9059656 9797583 10612293 11507975 12487828 13553271
63894 13553271 14702480 15929029 17222292 18569876 19959718 21379595 22814443 24243778
63886 24243778 25640892 26974300 28211228 29321694 30280827 31068586 31668809 32069465 32263206
63877 32263206 32246472 32017936 31578660 30934119 30096104 29083223 27920303 26636655 25262979
63868 25262979 23828270 22358721 20878295 19408888 17969649 16576997 15245518 13987920
63860 13987920 12813557 11727516 10731449 9824745 9004787 8267092 7606146 7015997 6489880
63851 6489880 6020115 5599279 5221512 4882388 4577930 4304230 4057665 3834765 3631938
63842 3631938 3445934 3274688 3117349 2973191 2840596 2717201 2601094 2491688 2389132
63833 2389132 2292759 2200565 2110603 2022515 1937092 1854637 1774623 1696905 1622271 1551507 1484678
63822 1484678 1421639 1362464 1306984 1254583 1204928 1158331 1114956 1074269 1035765 999685 966507
63811 966507 936166 908142 881845 856645 832183 809056 788364 770112 752851 735625 719471
63800 719471 706185 696277 688997 683569 679232 674754 669341 663910 660197 658580 657823 656919 656087 655746 655508
63785 655508 654454 651734 646840 640026 632511 625422 618398 609931 599031 585798 570567 553647 536036
63772 536036 519192 503647 488800 474371 460972 448762 436688 423964 411390 400255 390429 380450
63760 380450 369260 357264 345962 336971 330881 326495 321762 316048 310869 307668 305620 302784 298895
63747 298895 295502 293347 291143 287546 283110 279306 276277 272704 267723 262065 257058 253096 249524 245852
63733 245852 242690 241307 242265 244601 246489 246752 245587 243875 242028 239802 237006 233990 231275 229091 227469
63718 227469 226470 225912 225074 223283 220845 218856 217824 216990 215421 213297 211568 210611 209902 208924 207803 206996
63702 206996 206844 207426 208317 208492 207165 204879 203187 203000 203886 205181 206929 209113 210700 210552 209090 208117
63686 208117 208892 211123 214014 217459 221658 226141 230009 233072 236073 239503 242749 244985 246745 249905
63672 249905 255821 263951 272742 281493 290656 300532 310547 320084 329238 338164 346147 352029 355393 356777
63658 356777 356740 355246 352039 347308 341835 336664 332585 329641 327118 324181 320612 316870 313588 311096 309205
63643 309205 307199 304247 300211 295962 292590 290371 288806 287430 286011 284013 280682 276074 271586 268990
63629 268990 269052 271198 274167 276722 278136 278538 278800 279719 281372 283501 286393 290948 297756 306373 315588
63614 315588 324301 332081 339071 345481 351277 356387 361042 365416 368805 369711 367350 362797 358036 353896
63600 353896 349557 344069 337595 330942 324554 318433 312526 306767 301201 296494 293840 293819 295817 299062 303568
63585 303568 309127 313972 315889 314795 313084 313128 315413 319475 325388 333385 342779 352449 362269 373261
63571 373261 386373 401580 418093 434897 451255 467219 483707 501799 522012 544406 569027
63560 569027 595748 623960 653027 683003 714456 747649 782181 817247 851741 884223 913296
63549 913296 937950 957225 969903 975230 974050 968688 961696 954928 949323 944675 939703 933213 925316
63536 925316 916731 906919 893945 876592 855711 833101 810055 787614 767129 749266 732880 716069
63524 716069 698319 680870 665127 651574 640112 630377 621536 612749 604305 597578 593323 590689 588541
63511 588541 587202 587989 591294 596143 601847 609158 619218 631950 646284 661779 679168 699126 721165
63498 721165 744320 768615 795321 825661 859494 895199 930571 963842 994100 1020968 1043998
63487 1043998 1062602 1076595 1086484 1092884 1095975 1096001 1094167 1092320 1091480 1091069 1089750 1086587 1081121 1072809
63473 1072809 1060907 1044764 1023923 998192 968115 935294 901625 867923 833602 797909 761295
63462 761295 725323 691440 660153 631288 604596 579928 557150 536235 517281 500165 484419
63451 484419 469959 457772 449165 443938 439893 434565 427269 419226 412226 407525 405463 405340 405829 406167
63437 406167 406861 408775 411832 415271 418832 422748 426766 430274 433599 438084 444487 452146 460142 468411
63423 468411 477179 486114 494687 502708 509810 515023 517640 518073 517202 515410 512831 509893 506622 502035 495457
63408 495457 488192 482582 479283 476629 472953 468584 465123 463667 464276 466475 469605 473108 476943 481426
63394 481426 486326 490598 493433 495239 497124 499798 503466 508503 515676 525706 538970 555399 574196
63381 574196 593793 612799 631264 650665 672498 697170 724397 754205 786981 822590 859922
63370 859922 897718 935799 975266 1017377 1062220 1108484 1154446 1199077 1242224 1283895 1323413
63359 1323413 1359206 1389310 1412148 1427063 1434319 1434774 1429556 1419871 1406868 1391495 1374505 1356564
63347 1356564 1338188 1319360 1299280 1276741 1250873 1221490 1188860 1153477 1116158 1078003 1039975
63336 1039975 1002761 967216 934423 904626 876458 848318 820790 796807 778783 766094 755941
63325 755941 746186 736762 728895 723939 722759 725179 729843 735340 741760 750714 763768 781317 802761
63312 802761 826990 852610 878639 905450 934534 967042 1002882 1041214 1081085 1121384 1160975
63301 1160975 1199213 1235733 1269475 1298622 1321780 1338442 1348204 1350791 1347480 1341165 1333801 1324699
63289 1324699 1312560 1298278 1284040 1270085 1254217 1234765 1212423 1188631 1163511 1136232 1106550
63278 1106550 1075006 1042112 1008157 973723 939765 907098 875930 845866 816369 787531 760425
63267 760425 736423 716030 698555 682878 668313 654793 642588 631958 622937 615401 609350 604879
63255 604879 601798 599677 598368 597887 597441 595488 591565 587370 584946 584274 583890 583458 584087 586011 587605 587326
63239 587326 585412 582982 580536 578024 575340 571898 566740 560157 554496 552123 552869 554469 555199 555135 555009
63224 555009 554946 554559 553604 552213 550825 549908 549573 549656 550489 553145 558351 565448 573095 580790 588905 597305
63208 597305 604827 610446 614406 617876 621893 626895 632873 639523 646360 653005 659550 666568 674621 683587
63194 683587 692670 701430 710677 721765 734977 749379 764615 781720 801249 821413 839641 855949
63182 855949 873425 895045 921047 949726 979594 1010109 1041425 1074513 1110807 1150451 1191264
63171 1191264 1230745 1269137 1309319 1353294 1399741 1445600 1489212 1531116 1572285 1612650 1651411
63160 1651411 1688084 1722974 1756861 1790170 1822128 1850964 1875535 1896604 1915646 1932236 1943620
63149 1943620 1947398 1943691 1933847 1917882 1894686 1864371 1828725 1789036 1745014 1696732 1646391 1596969
63137 1596969 1549906 1505347 1464217 1428559 1399729 1377357 1360291 1347636 1338670 1332847 1330427 1332381
63125 1332381 1339025 1349318 1362087 1377331 1395637 1416773 1439788 1464340 1491015 1520051 1550273
63114 1550273 1579543 1606077 1629424 1650562 1670984 1691263 1710457 1727258 1741471 1753614 1763124
63103 1763124 1768004 1766733 1759722 1748309 1733026 1713567 1689741 1661438 1628223 1590287 1549731 1509507
63091 1509507 1470731 1432118 1392453 1352559 1314315 1278890 1246808 1218651 1194471 1173106 1153373
63080 1153373 1135589 1120723 1108347 1096832 1085616 1075891 1068642 1063261 1058710 1054954 1052372 1050674 1049393
63067 1049393 1048926 1049959 1052018 1053540 1053640 1053176 1053848 1056549 1060662 1064680 1067484 1069306 1071568 1075701 1082096
63052 1082096 1090226 1099430 1109123 1118325 1125648 1130421 1133855 1138555 1146242 1155875 1164609 1170898 1176139 1182745
63038 1182745 1191165 1199780 1207350 1214167 1220529 1225595 1228779 1231327 1235234 1240937 1247176 1252922 1258335 1263826
63024 1263826 1269313 1274927 1281734 1291114 1303558 1318301 1334012 1349923 1366481 1384771 1405075 1426456
63012 1426456 1448414 1472494 1500969 1533801 1568188 1601772 1635294 1671205 1710600 1752813 1797432
63001 1797432 1845067 1895955 1949304 2004645 2062742 2124369 2189015 2255756 2324791 2397093 2472974
62990 2472974 2552089 2634541 2720528 2808745 2896560 2982564 3067879 3154039 3240306 3324165 3403980
62979 3403980 3480188 3554039 3626248 3696949 3766192 3834177 3901217 3967215 4030641 4088382 4137381
62968 4137381 4176196 4204240 4219935 4220914 4206106 4176284 4132358 4074463 4003315 3921201 3830739 3733604
62956 3733604 3631498 3527618 3425914 3329156 3238533 3154777 3078754 3011193 2952672 2903867 2865192
62945 2865192 2836361 2816847 2806552 2805367 2812352 2826084 2845576 2870147 2898597 2929460 2962127 2996887
62933 2996887 3033698 3071618 3109578 3146895 3182750 3215925 3245708 3272574 3297176 3318610 3334188
62922 3334188 3341292 3339266 3329046 3310846 3282786 3242469 3189729 3126958 3056643 2979479 2895253 2804570
62910 2804570 2709005 2610423 2511119 2413920 2320873 2232022 2146434 2064147 1986188 1913015 1844313
62899 1844313 1780364 1722375 1671041 1625663 1584917 1547708 1513079 1480283 1449369 1420956 1395144
62888 1395144 1371340 1349372 1329831 1312868 1297453 1282419 1267649 1253657 1240549 1227832 1214889
62877 1214889 1201353 1187491 1174384 1162960 1152463 1140667 1126268 1110504 1095747 1082974 1071343
62866 1071343 1059921 1048949 1039267 1031086 1023666 1016244 1009133 1003562 1000141 997822 995000 991382 987924
62853 987924 984993 981694 977294 972254 967388 962985 959331 957071 956238 955745 954752 953831 953868 954556 955096 955773
62837 955773 957508 960073 962071 962757 962791 963010 963349 963216 962147 959871 956398 952375 948771 945929 943332 940506
62821 940506 937727 935668 934651 934341 933855 932142 928666 923880 918855 914451 910964 908290 906055 903712 900900
62806 900900 897638 893907 889335 883746 877697 871947 866615 861498 857002 853934 852316 851140 849449 847093
62792 847093 844246 840801 836546 831640 826630 822202 818830 816407 814321 812296 811060 811709 814404 818124
62778 818124 821647 824326 826015 826833 827125 827382 828213 830549 835244 841848 848255 852571 855044 857221 859683
62763 859683 862018 864764 869422 876029 882492 887314 891518 896728 902761 908677 915147 923742 934239 944577
62749 944577 953707 962907 973702 985760 997672 1009084 1021279 1035909 1053584 1073571 1094681 1116633
62737 1116633 1140476 1167447 1197605 1229994 1263993 1299839 1337890 1378212 1421199 1468005 1519805
62726 1519805 1576798 1638226 1703343 1772430 1846983 1928689 2017817 2112888 2212515 2317378 2429586
62715 2429586 2549976 2676791 2807192 2939140 3071317 3202021 3329021 3450210 3563609
62706 3563609 3666756 3756479 3829274 3881797 3911534 3917634 3901109 3863863 3807528 3733326 3642665
62695 3642665 3537439 3419908 3292647 3158528 3020446 2881109 2743050 2608284 2477584
62686 2477584 2350679 2227778 2110592 2001317 1900900 1808960 1724958 1648488 1578563 1513733
62676 1513733 1453276 1397586 1347118 1301592 1260427 1223272 1189832 1159791 1133179 1110181 1090366
62665 1090366 1072843 1057634 1046063 1039111 1035925 1034592 1033871 1033605 1034016 1035550 1039104 1045500 1054779 1066576
62651 1066576 1080996 1098470 1119063 1142683 1169710 1200509 1234510 1270811 1309776 1353016 1401468
62640 1401468 1454457 1511152 1572168 1639067 1712565 1791682 1874364 1958742 2044179 2131301 2220642
62629 2220642 2311133 2400198 2485149 2563791 2633810 2692740 2738987 2771925 2790594 2793359 2779637
62618 2779637 2750931 2709134 2654660 2587566 2509883 2425245 2336258 2243578 2147744 2050567 1954195
62607 1954195 1859849 1768140 1679970 1596411 1518043 1444762 1376051 1311383 1250878 1195569 1146329
62596 1146329 1102385 1061729 1023310 987915 956331 927554 899846 873013 848481 827217 808579
62585 808579 791308 774732 758661 742924 727674 713774 702245 693224 685748 678614 671303 663976
62573 663976 656661 648720 639547 629812 621489 616073 612933 610011 606124 602013 599064 597748 597734 598840 601067
62558 601067 603957 606826 609813 614148 621097 630946 643129 656867 671366 685814 699792 713718 728583
62545 728583 745147 763530 783553 805352 829663 857544 889746 926258 966550 1010234 1057292
62534 1057292 1107710 1161327 1218244 1278889 1343187 1409933 1477540 1545217 1612813 1679463 1743117
62523 1743117 1801655 1853967 1899493 1937001 1964294 1979247 1981052 1970521 1949236 1918450 1878956
62512 1878956 1831941 1779456 1723549 1665268 1605080 1543999 1483460 1424128 1365734 1308353 1253064
62501 1253064 1201028 1152661 1108083 1067604 1031189 998143 968011 941188 917868 896853 876297
62490 876297 855439 834862 815287 796801 779133 762006 745259 729243 714855 702668 692207
62479 692207 682739 674425 667910 663095 659322 656697 656129 657936 661401 665882 671303 677250 682831 688221
62465 688221 695411 706417 721188 738077 756021 775412 797033 820985 846854 874390 903758 935275
62453 935275 969013 1004765 1042585 1083291 1127929 1176417 1227049 1277621 1326740 1373775 1418035
62442 1418035 1458664 1495200 1527532 1555032 1576013 1588304 1590423 1582346 1565313 1540991 1510724 1475427
62430 1475427 1435901 1392973 1347463 1300333 1252896 1206689 1163113 1123218 1087418 1055008 1024373
62419 1024373 994502 966265 941482 920695 902690 886265 871500 858883 848190 838949 831318 825774
62407 825774 822355 820769 820805 822138 824235 827019 831003 836207 841676 846844 852633 860108 868674 876903 884759
62392 884759 893558 903787 914527 925247 936690 949295 961982 973358 983169 991648 998184 1001713
62380 1001713 1001942 999092 992639 981462 965589 946987 928093 909837 891493 872281 852617 833597
62368 833597 815579 797844 779816 762175 746317 732947 721694 712049 704189 698800 696419 696873 699052
62355 699052 701429 703417 706107 710939 717671 724600 730987 738217 747972 760093 773086 786108 799397
62342 799397 812998 826137 838073 848970 859719 871133 883259 895161 905484 913496 919441 923741
62330 923741 926411 927646 928219 928358 926765 922090 915437 910177 908891 911423 916207 922326 929572 937747 947222
62315 947222 959593 976356 997063 1020097 1045432 1075283 1111379 1152625 1196559 1242677 1293202
62304 1293202 1350532 1414827 1484442 1557899 1634571 1713653 1793386 1871764 1947569 2020097 2087853
62293 2087853 2147973 2197356 2234376 2259419 2273772 2278100 2272015 2255016 2227687 2191743 2148865 2099806
62281 2099806 2044926 1985446 1923559 1861108 1798515 1735462 1672370 1610801 1552421 1498031 1447634
62270 1447634 1400974 1357663 1317049 1278508 1241979 1207917 1176510 1147183 1119256 1093044 1069824
62259 1069824 1050467 1034477 1020754 1008921 999127 990804 982677 974457 967564 963363 961239 959359 956947
62246 956947 954746 953311 951984 949893 947075 944042 940831 936960 931963 925719 918735 912353 907937 905401
62232 905401 903185 900276 897662 897204 899657 904525 911159 918932 926837 934338 942622 953760 968315 984839
62218 984839 1001992 1019978 1039344 1059536 1079709 1100340 1122983 1148699 1177574 1209552 1244802
62207 1244802 1283088 1323530 1365460 1409364 1456725 1508911 1566113 1627353 1691569 1758504 1828014
62196 1828014 1898556 1967083 2030698 2087805 2137294 2177633 2207748 2228009 2238981 2239351 2226657 2200506
62184 2200506 2163957 2121029 2073643 2021576 1964570 1903508 1839980 1775695 1712239 1650684 1591394
62173 1591394 1534816 1482295 1435358 1394168 1357552 1324866 1297002 1274908 1257710 1243157 1229743
62162 1229743 1217599 1207398 1199366 1193740 1191276 1192233 1195080 1197173 1197127 1196013 1195940 1197874 1201246 1205201 1209389
62147 1209389 1213532 1217078 1219825 1222460 1225869 1230114 1234699 1239823 1246613 1255773 1266615 1278056 1290268
62134 1290268 1304733 1322669 1343945 1367553 1392523 1418206 1444257 1470842 1498612 1527971 1558367
62123 1558367 1588417 1616629 1642102 1665040 1686879 1709579 1734511 1762214 1793177 1828026 1866544
62112 1866544 1907359 1949555 1994035 2042277 2094027 2147443 2201307 2255717 2310182 2362321 2409211
62101 2409211 2449245 2482062 2507502 2525501 2536485 2541036 2539438 2532201 2520608 2506010 2488757 2468464
62089 2468464 2445148 2419466 2392095 2363674 2335440 2309325 2287140 2269771 2256980 2247610 2240133 2233435
62077 2233435 2227117 2220978 2214707 2208507 2203547 2201029 2200986 2202567 2205368 2209811 2216342 2224970 2235527 2247715
62063 2247715 2260951 2274984 2290773 2309884 2332739 2358163 2384998 2413473 2444467 2478018 2513250
62052 2513250 2549555 2587243 2626993 2669039 2713031 2758588 2805847 2855284 2906963 2960323 3015037
62041 3015037 3071712 3131144 3193079 3256436 3320740 3386452 3453576 3520652 3585610 3647286 3705993
62030 3705993 3763320 3821719 3883465 3949187 4017532 4086621 4155412 4223367 4289615 4353424 4415231
62019 4415231 4476322 4537504 4598762 4660171 4722364 4785890 4850703 4916539 4983392 5051442 5121010
62008 5121010 5192871 5268082 5346950 5428223 5509586 5588918 5664886 5736619 5803366 5864649 5920467
61997 5920467 5971069 6016607 6057122 6092676 6123171 6148184 6167446 6181637 6192327 6200880 6207677 6212551
61985 6212551 6215533 6216816 6216467 6214867 6213136 6212267 6211869 6210605 6208001 6204944 6202120 6198944 6194729 6190163 6186566
61970 6186566 6183928 6180565 6174821 6166547 6156770 6146428 6135636 6123993 6111426 6098706 6086926 6076338
61958 6076338 6065955 6054632 6042401 6030574 6020724 6013679 6009119 6005801 6002545 5999451 5997814 5998351 5999898
61945 5999898 6000579 6000036 5999639 6000600 6002861 6005973 6009975 6014572 6018100 6018260 6013966 6006002 5995834 5984066 5969936
61930 5969936 5951934 5928855 5900552 5867865 5831901 5793431 5753005 5711302 5668996 5626266 5582790
61919 5582790 5538396 5493442 5448331 5402825 5356339 5308980 5261742 5215302 5169034 5121941 5074432
61908 5074432 5028274 4984499 4942112 4899436 4856196 4813582 4772730 4733971 4697373 4663030 4630610
61897 4630610 4599369 4568930 4539617 4511830 4485651 4461277 4439236 4419679 4401843 4384638 4367675
61886 4367675 4351521 4337229 4325837 4318059 4314081 4313692 4316622 4322570 4331005 4341540 4354681 4371636 4392961
61873 4392961 4417928 4445804 4477330 4514245 4557551 4606995 4662230 4723810 4792870 4870388 4957022
61862 4957022 5053316 5159842 5277364 5407035 5550293 5708646 5883838 6078218 6294525 6535213
61852 6535213 6802362 7098409 7426580 7790330 8192637 8636080 9123290 9656864 10238800
61843 10238800 10870060 11550403 12278164 13049754 13858728 14694252 15539320 16369777 17154793
61834 17154793 17858533 18442849 18871520 19115919 19160015 19002267 18654196 18137592 17481812
61825 17481812 16720746 15888811 15016910 14130240 13248644 12388157 11561803 10779094 10045509
61816 10045509 9363253 8732856 8154062 7625578 7144815 6708443 6313039 5955065 5630742
61807 5630742 5336502 5069418 4826786 4605591 4402942 4216869 4046138 3889470 3745625
61798 3745625 3614126 3494925 3387168 3289145 3199791 3119339 3047959 2984571 2927693 2876744 2831535
61787 2831535 2791061 2753886 2719536 2688450 2660603 2635267 2612312 2592714 2577312 2565852 2557728
61776 2557728 2552891 2551337 2552168 2553971 2556004 2558516 2562051 2566928 2573366 2581599 2591685 2603464 2616840
61763 2616840 2632051 2649634 2670261 2694629 2723323 2756496 2793483 2832903 2873651 2916089 2961969
61752 2961969 3012887 3069096 3130174 3196379 3268658 3347582 3433232 3525993 3626458 3734387 3848926
61741 3848926 3970375 4100806 4242272 4395252 4559613 4736152 4926073 5129586 5346385
61732 5346385 5577409 5824952 6091129 6377404 6685783 7019459 7381982 7776609 8206605
61723 8206605 8675271 9185443 9740071 10343904 11003685 11725952 12515237 13374900 14308850
61714 14308850 15321411 16415979 17594535 18857539 20202461 21621495 23100377 24617723
61706 24617723 26142815 27632628 29031864 30277394 31304510 32052850 32473232 32536084 32237913
61697 32237913 31601287 30668480 29493295 28134472 26650599 25095675 23515902 21948536
61689 21948536 20422351 18958778 17573315 16276671 15074938 13969142 12955803 12029238
61681 12029238 11184013 10415527 9718949 9088346 8517105 7999005 7528863 7102336 6715149
61672 6715149 6362612 6040245 5745017 5475522 5230537 5007710 4803986 4616814 4444256
61663 4444256 4284421 4135869 3998445 3872517 3757087 3649687 3548568 3454002 3366757 3286161
61653 3286161 3210544 3138891 3071068 3006847 2945734 2887533 2832196 2779241 2728207 2679541 2634129
61642 2634129 2591925 2551816 2512811 2474500 2436402 2398010 2359835 2323369 2289488 2257569 2226630
61631 2226630 2196493 2167214 2138172 2108675 2079054 2050336 2023116 1997503 1973856 1952576 1933090
61620 1933090 1913962 1894426 1875375 1858438 1844369 1832543 1821759 1811165 1800507 1789859 1779339
61609 1779339 1769052 1759022 1748937 1738118 1726186 1713797 1702275 1692239 1682987 1673551 1663955 1654937
61597 1654937 1646661 1638351 1629146 1618889 1608151 1598023 1589840 1584391 1581084 1578376 1575374 1572696 1571484
61584 1571484 1571945 1573279 1574745 1576248 1577986 1580065 1582680 1586283 1591144 1596678 1601423 1604060 1604716 1605156 1607290
61569 1607290 1611331 1615704 1618919 1621187 1623837 1627470 1631314 1634353 1636437 1637951 1638824 1638322 1635753 1631031
61555 1631031 1624511 1616548 1607363 1597353 1587253 1577697 1568515 1558835 1548182 1537165 1526632 1516408
61543 1516408 1505616 1494163 1483036 1472873 1463198 1453498 1444205 1435863 1428245 1421407 1416850 1416151 1418656
61530 1418656 1422049 1425288 1429559 1436068 1444541 1454594 1466999 1482278 1499209 1516243 1533758 1553363
61518 1553363 1575341 1598301 1621473 1645999 1673628 1705099 1740084 1777776 1817134 1857326 1898491
61507 1898491 1941547 1986884 2033674 2080638 2127026 2172636 2217426 2261442 2304729 2347074 2388112
61496 2388112 2427635 2465295 2500035 2530641 2557099 2580677 2602331 2621854 2638958 2654290 2668443
61485 2668443 2680462 2688322 2690811 2688367 2682239 2673504 2662851 2650721 2637430 2623434 2609505 2596538
61473 2596538 2585350 2576766 2571429 2569134 2568759 2569578 2572568 2579922 2593317 2613069 2638778 2670155 2707196
61460 2707196 2750229 2800078 2857843 2924311 2999803 3084542 3178845 3283091 3398107 3525679 3668015
61449 3668015 3826364 4000577 4190382 4396610 4620635 4862895 5122608 5398779 5690689
61440 5690689 5996933 6314284 6637751 6961438 7278714 7581343 7858880 8099662 8293190
61431 8293190 8432332 8513985 8538244 8507320 8425267 8298261 8134276 7941799 7728597 7501707
61421 7501707 7268044 7034153 6805048 6583945 6373652 6177738 5999644 5840863 5700824
61412 5700824 5578656 5474405 5388438 5320466 5269639 5235208 5216701 5213700 5225623 5251386 5289170
61401 5289170 5336969 5393523 5458145 5529469 5605153 5683288 5763332 5844950 5926731 6007030 6085513
61390 6085513 6162703 6238289 6311271 6381829 6451679 6522031 6592278 6661372 6729551 6797745 6865801
61379 6865801 6932246 6995505 7054504 7108220 7155612 7196282 7230606 7258825 7280288 7293934 7299286
61368 7299286 7296657 7286412 7268397 7242380 7209034 7170157 7127643 7082409 7034714 6985536 6937075
61357 6937075 6891564 6849877 6811730 6777115 6746984 6722439 6703633 6689686 6679389 6671728 6665918 6661314
61345 6661314 6657347 6653261 6647775 6639370 6627325 6612579 6597273 6583377 6572012 6564271 6562298 6568976 6586572
61332 6586572 6616115 6658228 6714230 6786230 6876547 6987382 7120776 7278347 7460867 7668286
61322 7668286 7900147 8155766 8434072 8733467 9051731 9385531 9729814 10077921 10422431
61313 10422431 10755434 11067607 11347595 11583502 11765800 11889085 11951478 11953263 11896579 11785661
61303 11785661 11626169 11423620 11182579 10907312 10602878 10275437 9931780 9578653 9222185
61294 9222185 8867476 8518559 8178616 7850066 7534455 7232792 6946450 6677640 6428588
61285 6428588 6200212 5992006 5803481 5635393 5489182 5365191 5261760 5176186 5106302 5051084
61275 5051084 5010222 4983603 4971083 4972158 4985659 5010095 5044407 5088034 5140152 5199300 5263936
61264 5263936 5332773 5404245 5476309 5547359 5616900 5684464 5748354 5806460 5858275 5905054 5947890
61253 5947890 5986588 6020657 6050269 6075519 6095548 6109242 6116355 6117304 6112193 6100685 6082445 6057042
61241 6057042 6023644 5981587 5931384 5874840 5814159 5750938 5685533 5616997 5544101 5467014 5387708
61230 5387708 5308250 5229208 5150494 5073313 5000060 4932205 4869415 4811203 4758515 4712885 4674506
61219 4674506 4641934 4613465 4588121 4565201 4543517 4521570 4498366 4473813 4448439 4422960 4398113
61208 4398113 4374474 4352264 4331665 4313588 4299678 4291019 4287061 4286648 4290124 4299718 4317771 4345437
61196 4345437 4383247 4431961 4492284 4564626 4649821 4749217 4863136 4989718 5126017 5269594
61186 5269594 5418159 5568375 5716286 5858355 5990550 6106424 6197514 6256089 6276922 6256946
61176 6256946 6195184 6093851 5958508 5796219 5613798 5417634 5213775 5007207 4801568 4599935
61166 4599935 4405261 4219729 4044655 3881591 3732527 3598123 3476479 3364768 3261928
61157 3261928 3168995 3087051 3015601 2952931 2897386 2848076 2804640 2766547 2732875 2703117 2678140
61146 2678140 2659712 2648849 2645009 2646958 2653715 2664426 2678158 2694309 2712480 2731393 2748719 2762850
61134 2762850 2774271 2784211 2792383 2797078 2797253 2793372 2786115 2775261 2760283 2741316 2718977 2693629 2665356
61121 2665356 2634588 2602430 2570112 2538137 2506047 2473162 2439373 2404933 2369709 2333364 2296377
61110 2296377 2259990 2224631 2188971 2151207 2110864 2068854 2026281 1983940 1942602 1902883 1864805
61099 1864805 1828052 1792507 1758061 1724238 1690749 1658214 1627520 1598474 1569850 1540763 1511307
61088 1511307 1481743 1451852 1421356 1390511 1360138 1331405 1305344 1281887 1259574 1237210 1215926
61077 1215926 1198449 1185959 1176723 1168552 1161660 1157990 1158281 1161107 1164777 1169140 1175139 1183313 1193213 1203914
61063 1203914 1214742 1225716 1237500 1250773 1265461 1280700 1295635 1310023 1324004 1337676 1351280
61052 1351280 1365444 1380564 1395901 1409992 1422286 1433767 1445311 1455844 1463041 1465898 1465743 1464361
61040 1464361 1461861 1457016 1449306 1439912 1430716 1422775 1415805 1408797 1401052 1392847 1385199 1378947 1374060 1369823
61026 1369823 1365504 1360729 1355337 1348963 1340863 1330445 1318240 1305938 1294877 1284766 1274763 1265517
61014 1265517 1258741 1254440 1250094 1243606 1235935 1229520 1225058 1221450 1218434 1217295 1218713 1221410 1223499 1224134
61000 1224134 1223416 1221841 1220574 1221475 1225912 1233710 1243509 1253687 1262920 1270825 1278744 1289188 1303678 1321298
60986 1321298 1339797 1357761 1375238 1392831 1411035 1430433 1451785 1475531 1501322 1528168 1555110
60975 1555110 1582054 1610096 1640773 1674734 1711313 1749657 1790042 1833789 1881969 1934473 1990377
60964 1990377 2048942 2110086 2174047 2240907 2310731 2383943 2461037 2541863 2625847 2713421 2806770
60953 2806770 2908551 3020062 3141025 3270669 3408345 3553563 3706514 3868650 4041948
60944 4041948 4227657 4426511 4640059 4870886 5121618 5394756 5693631 6022367 6384675
60935 6384675 6783673 7223323 7709297 8248536 8849206 9521202 10275402 11122579 12075073
60926 12075073 13149684 14366287 15743011 17296585 19049945 21036208 23291770 25848182
60918 25848182 28730570 31944342 35426435 38983352 42288106 44982773 46836711 47845659
60910 47845659 48204690 48197682 48094856 48096427 48291203 48608127 48802314 48531718 47508395 45630173
60900 45630173 43007823 39888214 36543564 33193550 29979756 26976271 24213684 21700643
60892 21700643 19435879 17412458 15620165 14047734 12682032 11504531 10490611 9614155
60884 9614155 8852675 8188094 7604900 7089621 6631480 6221837 5852920 5517902 5211880
60875 5211880 4931687 4674711 4438421 4220635 4019290 3831873 3655579 3488080 3327913
60866 3327913 3174472 3028088 2889644 2759409 2636494 2520029 2410577 2309512 2217161 2132298
60856 2132298 2053442 1979810 1910898 1846059 1784990 1728105 1675888 1628142 1584211 1543577 1505777
60845 1505777 1470065 1435746 1402931 1372454 1344848 1319716 1296381 1274776 1255242 1237530 1220603
60834 1220603 1203674 1187128 1172128 1159537 1149494 1141745 1136050 1132345 1130765 1131283 1133155 1135174 1137043
60821 1137043 1140087 1145800 1153806 1162037 1168863 1174186 1178459 1181816 1184575 1187548 1190989 1193823 1194718 1193549
60807 1193549 1191214 1188351 1184879 1180485 1175017 1168575 1161680 1155107 1149188 1143603 1138291 1134055 1131729 1131135
60793 1131135 1131508 1132645 1134943 1138660 1143905 1151228 1161522 1175314 1192557 1212796 1234937 1257262 1278455
60780 1278455 1298415 1317410 1334910 1350263 1364175 1378141 1392374 1405611 1417293 1428593 1440588
60769 1440588 1452517 1462818 1471235 1478973 1487048 1495193 1502305 1507594 1511390 1515023 1519650 1525174 1530660
60756 1530660 1535719 1540669 1545217 1547934 1547563 1544228 1538928 1532570 1525912 1519475 1512705 1504019 1492689 1480068
60742 1480068 1467843 1455576 1441338 1424670 1407531 1391961 1377922 1364096 1350105 1337162 1326802
60731 1326802 1319509 1314600 1311134 1308782 1307850 1308610 1310881 1314463 1319640 1326849 1335961 1346252 1357165 1368930
60717 1368930 1382415 1398369 1416641 1436193 1456161 1476829 1499011 1522568 1546370 1569929 1593991
60706 1593991 1618891 1643326 1665724 1685993 1704779 1721696 1735685 1746778 1756020 1763892 1770192 1775340
60694 1775340 1780095 1783853 1785036 1783803 1782717 1783791 1786241 1788207 1789405 1790772 1792534 1794125 1795297 1795731
60680 1795731 1793976 1788454 1779623 1769837 1760870 1752664 1744598 1736664 1728807 1720224 1710276 1699628 1689629 1680785
60666 1680785 1672506 1664290 1656446 1649387 1642728 1635716 1628593 1622902 1619962 1619308 1619289 1619114 1619518 1621226 1623661
60651 1623661 1625749 1627227 1628206 1627857 1624730 1618512 1610652 1602890 1595694 1588452 1580749 1572992 1565895 1559669
60637 1559669 1553810 1547754 1541648 1536307 1532311 1529447 1527161 1525125 1522944 1519741 1514656 1507594 1498885 1488375
60623 1488375 1475598 1460811 1445001 1428574 1410813 1391275 1371207 1352813 1337055 1322606 1307179
60612 1307179 1289691 1271142 1253621 1238682 1226644 1217065 1209460 1203538 1199233 1196839 1196874 1199391 1203545
60599 1203545 1208196 1212847 1217631 1222452 1226659 1229709 1231873 1234075 1237102 1241017 1245282 1249492 1254002 1259530
60585 1259530 1265979 1272053 1276532 1279785 1283512 1288991 1296013 1303415 1310179 1315961 1321196 1326983 1334469 1343953
60571 1343953 1354768 1366195 1378345 1391966 1407625 1425307 1444716 1465677 1488132 1511909 1536724
60560 1536724 1562525 1589616 1618174 1647778 1677750 1707826 1737905 1767172 1794320 1818984 1842117
60549 1842117 1864292 1884298 1900240 1911490 1918551 1921352 1918815 1910167 1895791 1876664 1853654 1827372
60537 1827372 1798042 1765657 1731016 1696454 1664536 1635996 1609865 1585594 1563874 1545217 1529036
60526 1529036 1514758 1502856 1494148 1488743 1486033 1484853 1483422 1480288 1476057 1473096 1472704 1473462 1473220 1471745
60512 1471745 1470250 1469224 1468230 1467514 1468404 1471966 1478271 1487068 1498315 1511845 1527000 1542724 1557778
60499 1557778 1571230 1583275 1595193 1607929 1621057 1633705 1645964 1658494 1671174 1683216 1694551
60488 1694551 1706223 1719444 1735006 1753442 1774860 1798723 1824700 1853747 1887415 1926039 1968472
60477 1968472 2013548 2060704 2108907 2156018 2199613 2237622 2267873 2288036 2296714 2294047 2280952 2258657
60465 2258657 2229496 2197147 2165083 2135232 2108773 2087488 2073199 2066189 2065359 2070099 2080981 2098293
60453 2098293 2120677 2145963 2173038 2202276 2234228 2268554 2304666 2343164 2386075 2435637 2493218
60442 2493218 2559546 2635459 2722008 2820201 2931304 3057258 3200233 3361765 3542640 3743410
60432 3743410 3964396 4205233 4465146 4743929 5042407 5362230 5705969 6077305 6479806
60423 6479806 6914272 7376386 7855361 8332841 8782790 9174634 9479255 9673776 9742785 9678663
60413 9678663 9483860 9172854 8769610 8301195 7792587 7265388 6738261 6226316 5739864
60404 5739864 5284491 4862814 4476503 4127018 3814699 3537396 3290551 3069211 2870065
60395 2870065 2691541 2532538 2391819 2268276 2160634 2066499 1982516 1906118 1836657 1774307
60385 1774307 1718242 1666579 1618059 1573011 1532520 1497123 1466545 1440188 1417176 1395973 1374648
60374 1374648 1352057 1328650 1305836 1284649 1265319 1247897 1232604 1219277 1207104 1195385 1184285
60363 1184285 1174327 1165472 1157342 1150179 1144682 1140712 1136970 1132603 1128671 1127282 1129283 1133334 1137341 1140472
60349 1140472 1143672 1148505 1155612 1164081 1172113 1178403 1183013 1186960 1191103 1195663 1200735 1206825 1214473 1223427
60335 1223427 1232499 1240436 1246847 1252306 1257622 1263172 1268881 1274655 1280492 1286086 1290603 1293341 1294629 1295657
60321 1295657 1297134 1298435 1298473 1297156 1295416 1293842 1291965 1289244 1286147 1283569 1281370 1278338 1273941 1269577
60307 1269577 1267451 1268318 1270879 1273538 1276145 1279555 1283943 1288422 1292390 1296384 1301206 1306920 1313328 1320917
60293 1320917 1330453 1341876 1354412 1367653 1381764 1396693 1412060 1427804 1443876 1459115 1471635
60282 1471635 1480870 1488196 1494798 1500024 1502834 1503999 1505510 1508203 1511238 1513705 1515569 1517119 1518650 1520843
60268 1520843 1524437 1529325 1534843 1541072 1548741 1557457 1564890 1568387 1566939 1561426 1553543 1544814 1535917 1526488
60254 1526488 1515955 1504733 1494140 1485058 1477354 1470747 1465350 1461089 1457426 1454116 1451491 1449634 1448067
60241 1448067 1446738 1446444 1447683 1449949 1452861 1457015 1462669 1468358 1472053 1473451 1474121 1475659 1478505 1482205
60227 1482205 1485928 1489023 1491917 1496066 1502214 1509323 1516326 1524173 1534447 1546414 1557514 1566965 1576771
60214 1576771 1588417 1600527 1610992 1619947 1629166 1639657 1651535 1665438 1682256 1701575 1721938 1742820
60202 1742820 1765225 1790289 1818412 1849895 1885158 1923818 1964599 2006950 2052198 2102408 2158568
60191 2158568 2220505 2288209 2362412 2443792 2532314 2627775 2730793 2842791 2964759 3096197
60181 3096197 3235661 3382422 3537127 3700447 3871435 4047851 4227836 4410254 4593080
60172 4593080 4772348 4943551 5103781 5251756 5385952 5503631 5602154 5680778 5740733 5783648
60162 5783648 5810262 5820570 5814876 5794593 5762362 5721799 5677065 5632083 5589640 5551250 5518138
60151 5518138 5492244 5475987 5471259 5479240 5501191 5538699 5592737 5663051 5748962 5850341 5967145
60140 5967145 6098360 6242125 6396678 6560147 6729225 6898901 7064066 7220947 7366574
60131 7366574 7497386 7609135 7698281 7763138 7803602 7819981 7812225 7780194 7724563 7647383 7551889
60120 7551889 7442148 7322977 7199622 7076816 6958150 6846712 6746060 6659919 6591144 6541662
60110 6541662 6513189 6506843 6521865 6555950 6607479 6676601 6763455 6866033 6980292 7101503 7224727
60099 7224727 7345019 7458500 7562920 7656240 7735209 7796558 7839403 7865485 7877310 7877253 7868200
60088 7868200 7853550 7836312 7819303 7806440 7802707 7812502 7839035 7885450 7955055 8049760 8169555
60077 8169555 8314575 8486837 8688927 8921679 9184304 9476423 9798875 10152659 10537998
60068 10537998 10954486 11401141 11875703 12373996 12890197 13417725 13950004 14480472 15001819
60059 15001819 15505371 15981622 16421650 16817943 17164031 17453807 17681456 17841834 17931024
60050 17931024 17947008 17889925 17761465 17564348 17302971 16984325 16617282 16210947 15774617 15319258
60040 15319258 14857582 14401770 13961633 13545019 13158658 12807823 12496224 12227180 12004105
60031 12004105 11829030 11701396 11619182 11580337 11581973 11618967 11684796 11773466 11879480 11996263
60021 11996263 12115931 12230736 12333837 12419008 12480906 12515907 12521931 12497465 12441665 12355413 12241258
60010 12241258 12101915 11939336 11755143 11551195 11329571 11092621 10843277 10585025 10321775
60001 10321775 10058185 9799654 9551089 9315799 9096185 8895173 8716095 8561417 8432448
59992 8432448 8330090 8254991 8207212 8186778 8194263 8229692 8291135 8375736 8481897 8608811 8753663
59981 8753663 8911017 9075404 9242781 9408611 9566149 9708066 9828976 9925509 9994907 10034695
59971 10034695 10043030 10018401 9959726 9867809 9746148 9599377 9431418 9246018 9048251 8844061
59961 8844061 8638522 8435721 8240197 8057287 7891758 7746718 7623866 7524045 7447662 7395433
59951 7395433 7368834 7369187 7396238 7448363 7524394 7624625 7749879 7900214 8074783 8272316 8491018
59940 8491018 8727895 8978309 9236091 9494122 9745179 9982673 10200903 10394979 10560696
59931 10560696 10694425 10792936 10853417 10873945 10854019 10794658 10698149 10567782 10407694 10222898
59921 10222898 10019524 9804920 9587105 9373829 9172050 8987811 8825819 8688923 8578570
59912 8578570 8496036 8442732 8419088 8423788 8454685 8510146 8589137 8690343 8811613 8949834 9101007
59901 9101007 9260893 9426128 9594315 9762590 9926694 10082269 10226698 10358977 10478270
59892 10478270 10583659 10675267 10754513 10822985 10881951 10933448 10981163 11029693 11083347 11146121 11222659
59881 11222659 11318653 11440090 11592014 11777890 12000056 12260760 12562579 12907547 13295881
59872 13295881 13725588 14193049 14693765 15222557 15772999 16336104 16899080 17445619 17957721
59863 17957721 18417128 18805450 19104913 19301273 19386766 19359923 19223298 18982828 18649194 18237701
59853 18237701 17765466 17249133 16705237 16150716 15600994 15067781 14559721 14084565 13649272
59844 13649272 13258339 12913769 12617238 12371019 12176204 12031215 11933184 11880177 11871169 11904352
59834 11904352 11976607 12084400 12224003 12390441 12576930 12775630 12978125 13174740 13354110
59825 13354110 13504361 13614806 13676429 13681664 13625154 13505109 13323310 13083408 12789730 12448105
59815 12448105 12067324 11658782 11234144 10803195 10373578 9951831 9543952 9154859 8787759
59806 8787759 8444538 8126693 7835488 7571284 7333353 7120763 6932974 6769061 6626576
59797 6626576 6501765 6390858 6290809 6199044 6113239 6031550 5952767 5876286 5802302 5731775 5665524
59786 5665524 5603473 5545467 5492602 5446461 5406661 5370230 5334102 5297256 5259441 5218763 5172173
59775 5172173 5118412 5059251 4997476 4934677 4871672 4810435 4754507 4707134 4669128 4638675 4613264
59764 4613264 4591848 4575231 4564648 4560485 4562519 4570911 4586321 4609072 4638744 4674795 4717325 4766923
59752 4766923 4823795 4887253 4956140 5029658 5107609 5189824 5275575 5363570 5452072 5538706 5620519
59741 5620519 5694967 5761043 5819246 5870687 5916690 5958925 5999032 6038014 6076755 6117362 6163304
59730 6163304 6218031 6284125 6363912 6459960 6574405 6708501 6863339 7040529 7241980 7469952
59720 7469952 7727754 8019284 8346884 8710257 9108092 9539713 10003917 10496517 11009356
59711 11009356 11529909 12039400 12511470 12915239 13222093 13411776 13475448 13416648 13250272 12998653
59701 12998653 12686387 12337150 11972572 11610536 11263148 10937441 10638804 10372770 10143377
59692 10143377 9951575 9796663 9678516 9597434 9552622 9542151 9564330 9618338 9703678 9819774
59682 9819774 9966127 10142524 10349116 10586491 10855419 11156331 11489337 11854986 12254785
59673 12254785 12690965 13166149 13683317 14245416 14854611 15512194 16219361 16977533 17787787
59664 17787787 18650419 19564937 20529384 21538971 22585818 23660381 24752471 25850488
59656 25850488 26940721 28008900 29043224 30036399 30985947 31893617 32764479 33605938 34427158
59647 34427158 35238618 36050510 36869839 37698376 38533165 39368233 40194943 41000811 41768917
59638 41768917 42479452 43112801 43652418 44086162 44406264 44609549 44698755 44683604 44579762 44406447
59628 44406447 44184987 43938494 43690636 43463462 43276487 43147485 43092552 43124767 43253919 43488217
59618 43488217 43835021 44298988 44880760 45578749 46391178 47314486 48339642 49450513 50624429
59609 50624429 51832074 53036545 54193967 55255693 56170139 56884726 57350309 57527590 57392064
59600 57392064 56936197 56170254 55121776 53832109 52350713 50730367 49023913 47280500
59592 47280500 45541517 43839244 42198465 40636957 39162840 37772227 36450516 35175819
59584 35175819 33921900 32661839 31374341 30050106 28693325 27317716 25941362 24583555
59576 24583555 23262828 21994502 20788605 19650176 18581881 17586338 16665874 15820485
59568 15820485 15046891 14340076 13695418 13109056 12576958 12094710 11658152 11263350 10906119
59559 10906119 10582798 10291667 10032238 9802318 9596698 9409578 9237549 9079418 8933776
59550 8933776 8797834 8668146 8541306 8414053 8283755 8149073 8009629 7865223 7716000
59541 7716000 7563171 7408637 7253767 7099360 6946864 6798777 6657533 6524618 6401035
59532 6401035 6287832 6185727 6094792 6015135 5947476 5892416 5849349 5816708 5793349 5779357 5775478
59521 5775478 5781969 5798003 5822012 5852547 5888810 5930335 5976388 6026176 6079661 6137574 6200208
59510 6200208 6266650 6335808 6408002 6485021 6568728 6660376 6761286 6873280 6997819 7135277
59500 7135277 7285759 7450451 7631444 7830210 8046945 8281608 8535075 8808895 9104258
59491 9104258 9421441 9759781 10117802 10493807 10886846 11296576 11721201 12155705 12593042
59482 12593042 13027149 13453865 13868941 14266696 14641671 14990566 15311132 15599568 15850573
59473 15850573 16060442 16229523 16361735 16462541 16537341 16590525 16625312 16644936 16654335 16660268 16669730
59462 16669730 16689032 16724414 16782138 16866860 16980281 17121561 17287743 17472435 17664818 17851495
59452 17851495 18019319 18155699 18247108 18279658 18242143 18127802 17933138 17656752 17300471 16870888
59442 16870888 16378830 15837499 15261136 14664078 14059523 13458968 12872909 12311204 11781797
59433 11781797 11289375 10835996 10422755 10050298 9718439 9426433 9173638 8959145 8781019
59424 8781019 8636821 8524942 8444633 8394865 8374061 8381084 8415632 8477591 8566836 8683719 8828603
59413 8828603 9000459 9196793 9415502 9656009 9917926 10199244 10496415 10805255 11120651
59404 11120651 11435577 11741320 12028759 12289097 12513770 12694428 12823175 12892790 12897499 12834500
59394 12834500 12704769 12512005 12261277 11959352 11615588 11240793 10844565 10434392 10017399
59385 10017399 9601569 9194318 8800354 8421781 8060016 7716989 7394718 7094555 6817041
59376 6817041 6562081 6329108 6117302 5925750 5753289 5598398 5459736 5336921 5230342
59367 5230342 5139827 5063617 4999017 4944173 4899069 4864700 4841418 4828157 4823234 4825703 4835906 4854758
59355 4854758 4882492 4918102 4959993 5006982 5058201 5111892 5164854 5214009 5258811 5301774 5346483
59344 5346483 5395464 5450146 5512295 5584753 5670552 5771286 5885985 6011323 6143391 6280132
59334 6280132 6422604 6574244 6739137 6920860 7122158 7345083 7591570 7864310 8166874
59325 8166874 8502709 8874304 9283601 9732610 10222930 10755226 11330283 11950417 12618597
59316 12618597 13335691 14099140 14904199 15745137 16614430 17501451 18392655 19272929 20127056
59307 20127056 20941438 21705856 22413637 23059921 23640620 24153705 24600496 24984357 25308226
59298 25308226 25573971 25783063 25935901 26030169 26061141 26024010 25915060 25730796 25467927 25125701
59288 25125701 24707710 24220604 23671516 23067284 22415264 21723546 21000252 20253193 19489960
59279 19489960 18717600 17942306 17170047 16407418 15661331 14937881 14241966 13577730 12948570
59270 12948570 12356665 11803202 11289260 10815917 10383337 9990349 9635157 9315933 9030474
59261 9030474 8775971 8549800 8350365 8176687 8027301 7900035 7792907 7704890 7635581 7584293
59251 7584293 7549702 7530364 7525249 7533454 7553594 7584164 7624782 7676441 7739875 7813958 7896301 7985037
59239 7985037 8079123 8176992 8276072 8374004 8469613 8562337 8651405 8735964 8815311 8888658 8955509
59228 8955509 9016949 9075872 9135094 9195593 9257201 9320623 9388151 9462948 9548300 9647013 9760450
59217 9760450 9888178 10029044 10181945 10344465 10511169 10674608 10828188 10967292 11088029
59208 11088029 11186524 11259889 11306675 11325734 11315558 11275363 11206200 11110795 10993251 10859261 10715282
59197 10715282 10566442 10415888 10266821 10124086 9992487 9874193 9769180 9677906 9602021 9542360
59187 9542360 9497627 9465530 9444026 9430691 9421978 9414693 9408368 9405312 9407862 9416032 9428203 9443804
59175 9443804 9464765 9494492 9536155 9592241 9665166 9757573 9872218 10012196 10181303 10383516
59165 10383516 10621766 10897318 11210173 11559655 11944730 12364127 12815518 13293129 13785709
59156 13785709 14277769 14753316 15197674 15595714 15930299 16184476 16345147 16403894 16355124 16195537
59146 16195537 15926199 15554421 15093130 14558645 13968671 13340933 12692238 12037992 11391845
59137 11391845 10764994 10165518 9598555 9067101 8572602 8115273 7694587 7309719 6959417
59128 6959417 6641843 6354976 6096866 5864962 5655636 5465411 5292758 5137833 5000145
59119 5000145 4877261 4766209 4665617 4575908 4497762 4430930 4374307 4326569 4286503 4253093 4225827
59108 4225827 4205124 4192165 4187784 4191466 4201863 4218299 4241167 4270674 4306127 4347128 4394620 4449698
59096 4449698 4511854 4579674 4652996 4732956 4819738 4911709 5007357 5106983 5211664 5321387 5435009
59085 5435009 5551410 5669809 5789308 5908830 6027217 6142796 6253256 6356614 6451969 6538628
59075 6538628 6614978 6679201 6731011 6771631 6801998 6822131 6832745 6836509 6836760 6835430 6833101 6830964
59063 6830964 6831910 6839660 6857464 6887772 6932239 6991363 7064513 7151070 7251596 7367459 7499329
59052 7499329 7646508 7807795 7982651 8171502 8375305 8594878 8830104 9079494 9340783
59043 9340783 9611984 9891357 10176093 10461469 10741607 11010596 11262413 11489950 11684513
59034 11684513 11836425 11936748 11979718 11964366 11893485 11770816 11599808 11385045 11133277 10851746
59024 10851746 10546278 10221990 9884878 9540934 9194094 8846695 8501741 8162885 7832073
59015 7832073 7509203 7194859 6891763 6602543 6327479 6065586 5816733 5581390 5359150
59006 5359150 5148922 4950131 4762553 4585457 4418282 4262027 4118573 3988301 3869221
58997 3869221 3758568 3654547 3556452 3464148 3377871 3297883 3223728 3154222 3088613 3027437 2971645
58986 2971645 2920829 2872626 2824225 2774616 2725294 2678521 2634829 2592566 2550004 2507482 2466955
58975 2466955 2429761 2395588 2363765 2334805 2310047 2290074 2274178 2261478 2251938 2245825 2242464 2240254
58963 2240254 2238079 2236149 2235158 2235061 2235244 2235587 2236631 2238611 2240828 2242242 2242520 2242560 2244174 2248920 2256681 2265412
58947 2265412 2272824 2278469 2283931 2291184 2301184 2313687 2327502 2340851 2352374 2362091 2370900 2379139 2386410
58934 2386410 2392839 2399452 2406969 2415215 2424126 2434311 2446020 2458564 2471604 2486063 2502773 2520960
58922 2520960 2539296 2557878 2577908 2599663 2622086 2644428 2667235 2691636 2718600 2748970 2783160
58911 2783160 2820449 2859329 2898985 2939895 2982815 3027882 3075064 3124759 3177270 3232044 3287980
58900 3287980 3344494 3402014 3461568 3524073 3589891 3658768 3730084 3803237 3877916 3954286 4033077
58889 4033077 4115282 4201514 4291760 4386002 4484939 4589863 4701920 4821794 4950059 5087546
58879 5087546 5235299 5394271 5564982 5747529 5942123 6149580 6370911 6606519 6856677
58870 6856677 7123165 7409481 7718604 8051120 8406481 8785625 9191289 9626094 10091724
58861 10091724 10590067 11123813 11695337 12305935 12956712 13649413 14385732 15166491 15992025
58852 15992025 16862476 17776624 18730560 19718033 20731593 21762345 22798493 23824643 24822347
58843 24822347 25770503 26645285 27420951 28072164 28576576 28916317 29078706 29057165 28852298
58834 28852298 28472288 27932000 27251147 26452462 25560472 24600596 23597715 22574089 21547810
58825 21547810 20532921 19540707 18580603 17660173 16784894 15958392 15182668 14457967 13782827
58816 13782827 13154704 12570544 12026707 11518934 11043300 10597460 10180638 9792303 9431153
58807 9431153 9095275 8782594 8490960 8218467 7964360 7729332 7514272 7318625 7140216
58798 7140216 6976524 6825879 6687740 6562464 6450790 6353113 6269049 6197835 6139083 6092938
58788 6092938 6059603 6038906 6030222 6032712 6045843 6069767 6104867 6150976 6207766 6276007 6357291 6451831
58776 6451831 6557711 6673557 6801059 6943328 7101390 7273963 7460285 7661149 7877325
58767 7877325 8109273 8358953 8629742 8923537 9239855 9578931 9943821 10337853 10761818
58758 10761818 11215848 11702877 12227768 12793351 13399447 14045875 14734460 15467587 16246216
58749 16246216 17069843 17937136 18845538 19790209 20763076 21752106 22741367 23712324 24645086
58740 24645086 25518150 26307837 26989484 27539831 27938526 28168853 28219412 28086366 27774142
58731 27774142 27294414 26664866 25907792 25047506 24107639 23110509 22077917 21030591 19986174
58722 19986174 18958390 17958112 16994098 16072436 15196464 14367967 13588010 12856425 12171424
58713 12171424 11530423 10931009 10371033 9848335 9360647 8905445 8479929 8081746 7709646
58704 7709646 7362798 7039488 6737241 6454234 6189782 5943323 5713755 5500013 5301578
58695 5301578 5118110 4949120 4794014 4651798 4520743 4399163 4286617 4183398 4088729 4000467
58685 4000467 3916992 3838430 3765495 3697928 3634726 3575204 3519061 3465751 3414360 3363984 3314090
58674 3314090 3264763 3216733 3170719 3126770 3084660 3044637 3006793 2969735 2931176 2890395 2849016
58663 2849016 2808545 2767907 2724395 2676642 2625873 2574486 2524069 2474743 2425851 2377098 2328989
58652 2328989 2282080 2236071 2190267 2144974 2101597 2061074 2022881 1986009 1950288 1916244 1884196
58641 1884196 1854096 1825993 1800019 1775922 1752847 1729612 1705392 1680492 1656288 1633793 1612300
58630 1612300 1590287 1567793 1547068 1530389 1517871 1507818 1498611 1489762 1481765 1475626 1472240 1471636 1472834
58617 1472834 1474728 1477040 1480414 1485749 1493318 1502062 1509921 1515532 1519570 1523674 1528054 1531120 1531681 1530483
58603 1530483 1529099 1528200 1527517 1526673 1525229 1522454 1517927 1512307 1506954 1502846 1499970 1497579 1495094 1493177 1493883
58588 1493883 1499039 1508413 1520101 1532768 1546698 1562659 1580922 1601777 1625923 1653588 1684075 1716785
58576 1716785 1752103 1790824 1833402 1880094 1930975 1985398 2042368 2102103 2166344 2236639 2313202
58565 2313202 2396027 2486034 2584372 2691704 2809098 2938605 3081950 3239545 3411861 3600670
58555 3600670 3807544 4031801 4271350 4524965 4792303 5072005 5361153 5656313 5953734
58546 5953734 6248575 6534950 6806399 7055010 7270499 7441951 7561115 7623392 7626385 7569867
58536 7569867 7457947 7299471 7104489 6880627 6633452 6369296 6096031 5820945 5549025
58527 5549025 5283898 5029579 4790201 4567946 4362231 4171595 3996034 3836927 3695111
58518 3695111 3570013 3460390 3364674 3280308 3203969 3133185 3067066 3005078 2946007 2888691 2832814
58507 2832814 2778262 2724627 2672220 2622613 2576930 2534117 2492011 2449778 2408230 2368033 2328641
58496 2328641 2288902 2247920 2205406 2161858 2118292 2075299 2032662 1990307 1949063 1909883 1872827
58485 1872827 1837505 1803945 1772372 1742820 1715654 1691590 1670238 1649511 1627760 1605870 1585921
58474 1585921 1568456 1552555 1538054 1525796 1515641 1506006 1495807 1485534 1475979 1467067 1458455 1450296
58462 1450296 1442806 1435727 1428601 1421097 1412923 1404013 1394816 1385815 1376709 1366684 1355502 1343763 1332179
58449 1332179 1321134 1310731 1300588 1289814 1277952 1265771 1254384 1243896 1233815 1224483 1216960 1211387
58437 1211387 1206460 1200782 1194134 1187344 1181463 1176958 1173149 1168715 1163292 1158126 1154364 1151295 1147311 1142143
58423 1142143 1136856 1132004 1127245 1122739 1119449 1117800 1117175 1116955 1117030 1117116 1116690 1115830 1115070 1114264 1112741 1110778
58407 1110778 1109677 1109897 1110290 1109840 1109192 1109710 1111742 1114648 1117985 1121849 1126178 1130425 1134196 1137993 1142956
58392 1142956 1149575 1156853 1163416 1169425 1176397 1184713 1192462 1197544 1199772 1199748 1196899 1190438 1181596 1172846
58378 1172846 1165034 1157032 1148248 1139613 1131800 1124231 1116512 1109444 1103808 1099180 1094576 1089427 1083577 1077187
58364 1077187 1071046 1066231 1063189 1061794 1062136 1064321 1067663 1071343 1075876 1082529 1091005 1099161 1105658 1111733
58350 1111733 1119635 1130038 1141658 1152791 1162861 1172887 1184581 1198572 1213685 1228529 1243278
58339 1243278 1258763 1274271 1287861 1298988 1309420 1321086 1334168 1347622 1360462 1371969 1381514
58328 1381514 1388696 1393354 1395438 1395468 1394829 1394750 1395172 1395364 1395152 1394701 1393756 1392358 1391672 1392616 1394212 1394988 1395522
58311 1395522 1397839 1402638 1409026 1416714 1426317 1437483 1448915 1460528 1473608 1488478 1503854 1518837
58299 1518837 1533653 1548069 1560929 1571649 1580474 1587146 1591253 1594027 1597548 1601849 1605062 1606877 1609462
58286 1609462 1614231 1620116 1626019 1632629 1640668 1649328 1657694 1665925 1674022 1681253 1687773 1695032 1703647 1712666
58272 1712666 1721752 1732056 1744016 1756488 1769207 1783974 1801925 1821467 1840381 1858439 1876840
58261 1876840 1896648 1918838 1944073 1971305 1998240 2024071 2050067 2076811 2103108 2128627 2155198
58250 2155198 2184107 2214140 2243558 2271973 2299178 2324440 2348297 2372812 2398697 2424474 2449767
58239 2449767 2476835 2507276 2539831 2573243 2608624 2646919 2686611 2726341 2767548 2812091 2859322
58228 2859322 2907820 2957960 3010338 3063607 3116558 3170760 3228686 3290526 3354933 3421530 3490732
58217 3490732 3562608 3637720 3717465 3801857 3888704 3976568 4066641 4160305 4257294 4358008 4464959
58206 4464959 4579627 4700277 4825097 4955124 5091894 5234746 5382987 5538469 5703638
58197 5703638 5879175 6065515 6264018 6474447 6694163 6922272 7161824 7415699 7683418
58188 7683418 7964379 8260621 8573494 8901135 9242454 9600305 9977643 10374305 10791036
58179 10791036 11232909 11704697 12206137 12735291 13293011 13880424 14496002 15139466 15815172
58170 15815172 16528064 17280505 18077070 18927835 19842381 20824972 21879700 23014584 24234918
58161 24234918 25537784 26919090 28381636 29931836 31575534 33323954 35197820 37218680
58153 37218680 39401993 41764904 44333250 47133661 50187456 53521802 57179812 61212422
58145 61212422 65671742 70623695 76156240 82361727 89320637 97115669 105852859 115662277
58137 115662277 126701770 139180682 153356742 169475649 187717582 208212374 231079048
58130 231079048 256448815 284537243 315729303 350336382 387752133 425449154 458858838
58123 458858838 482701980 493070855 488866841 471800160 445295946 413177623 378730015
58116 378730015 344288773 311260680 280384028 252008990 226270192 203174350 182665277
58109 182665277 164662034 149050337 135664591 124305370 114777485 106912446 100573434
58102 100573434 95648935 92023698 89540248 87995101 87165106 86794268 86526426 85888995
58094 85888995 84417367 81844849 78192993 73703753 68703155 63499074 58334238 53372943
58086 53372943 48710906 44399226 40463119 36908210 33725399 30898227 28404143 26210902
58078 26210902 24279867 22575393 21067482 19727387 18527784 17447810 16472335 15585853
58070 15585853 14771833 14017456 13313925 12652701 12026559 11433697 10875663 10351583 9858918
58061 9858918 9398399 8972255 8577810 8208281 7859905 7533021 7225965 6933065 6649444
58052 6649444 6373374 6103511 5838356 5579209 5329531 5090525 4860753 4640330 4431637
58043 4431637 4235464 4050114 3874861 3710760 3557502 3412883 3276086 3148388 3030213
58034 3030213 2920450 2818874 2725909 2639600 2556194 2474522 2396861 2324762 2257030 2192617 2132509
58023 2132509 2077353 2025465 1974422 1923020 1871028 1818763 1767363 1717884 1669984 1623089 1578591
58012 1578591 1538881 1504316 1473156 1444272 1417760 1393081 1369021 1345657 1324171 1304618 1286034
58001 1286034 1268672 1253878 1241646 1230498 1219969 1210902 1203112 1195105 1186501 1178562 1171856 1165474 1158877
57988 1158877 1152449 1145875 1138203 1130120 1123912 1120247 1116922 1111870 1105768 1100597 1096910 1093559 1089276 1083839
57974 1083839 1078316 1074343 1072486 1071406 1069390 1066276 1062825 1058970 1054306 1049719 1046528 1044227 1040954 1036115
57960 1036115 1030615 1024514 1016634 1006906 997086 988403 980031 970584 959766 948020 935721 923350 911553
57947 911553 900646 890614 881435 872738 863732 854462 846388 840466 835535 830200 825351 822794 822138 821334
57933 821334 819635 817483 813865 806796 796718 786715 778834 772696 768220 766820 768721 771592 773458 775126
57919 775126 778394 783441 789157 794506 798408 799836 799289 798890 799874 801057 800670 798461 795066 790577 784874
57904 784874 778418 771793 765244 759290 754716 751329 747771 743226 738291 733685 729272 724961 721245 718113
57890 718113 714643 710544 706979 705154 705100 706500 709427 713400 716851 718608 719085 719205 719028 718202 716925 715605
57874 715605 714203 712496 710313 707131 702330 696216 689865 683628 676901 669734 663308 658227 653573 648416
57860 648416 643074 638174 633720 629959 628007 628601 631087 634533 638913 644452 650802 657736 665690 674721
57846 674721 683873 692509 701303 710876 720226 727601 732336 734959 736196 736803 737737 739425 741133 741677 740413
57831 740413 737138 731780 724727 716795 708318 698961 688989 679768 672370 666383 660766 655118 649525 644125
57817 644125 639611 637323 637878 640209 642587 644012 644305 643818 643813 646169 651795 659851 669082 679083 689654
57802 689654 699874 708682 715713 720907 724132 725801 726950 727938 727924 726238 723267 719333 713905 706804 699114
57787 699114 691854 684710 677036 668953 660478 650798 639695 628540 618493 608727 597972 586859 577124
57774 577124 569300 562844 557738 553956 549881 543373 534574 525857 518789 512592 505893 498543 491207 484152
57760 484152 476927 468776 459311 449274 440187 432590 425225 416967 408874 402947 399374 396599 393938 392341
57746 392341 392256 392392 391402 389751 389168 390934 395164 401207 408286 416040 424598 433802 442558 449513 454305
57731 454305 457687 460600 463613 466915 470129 472430 473534 474376 476110 478732 481247 482687 482219 479024 473323
57716 473323 467088 462397 459183 455698 450921 445214 438923 431964 424950 419234 415372 412683 410612 409416
57702 409416 409337 410340 412862 417330 422498 425968 427320 429396 435399 445811 459347 475660 495256 517233
57688 517233 538982 558474 575531 590457 602632 611326 617250 622281 627654 632989 637196 639962 642195
57675 642195 645338 650442 657527 665379 672215 677201 681412 686760 693952 702160 710787 720520 732015 744440
57661 744440 756412 768022 780936 796593 815095 835737 857804 880822 904793 930254 957513
57650 957513 985801 1013837 1041347 1069517 1099921 1133430 1170074 1209337 1250569 1293712 1339647
57639 1339647 1389352 1442868 1499809 1560859 1627843 1701982 1782764 1868965 1960279 2057621 2162415
57628 2162415 2276196 2400648 2537342 2687287 2851050 3029598 3224789 3438460 3670704
57619 3670704 3919449 4182277 4458367 4747687 5048070 5353880 5657760 5952762 6232521
57610 6232521 6490701 6721250 6917808 7071068 7167338 7192008 7135946 6999127 6789738 6521752
57600 6521752 6212881 5881738 5544206 5211619 4891794 4590500 4311430 4055887 3823658
57591 3823658 3614200 3426699 3259632 3111163 2980119 2866314 2769855 2690155 2625365 2572605
57581 2572605 2528990 2492868 2464390 2444872 2435287 2435016 2442282 2456109 2477558 2508300 2548298 2596040
57569 2596040 2651109 2715123 2789620 2874447 2969079 3074232 3190950 3319280 3459130 3611368
57559 3611368 3776386 3952294 4136179 4326357 4521420 4717405 4907741 5085754 5245269
57550 5245269 5379029 5479012 5539180 5556538 5529579 5457993 5344691 5196111 5019310 4820098
57540 4820098 4604634 4380608 4154916 3931205 3711288 3498139 3295772 3106526 2929970
57531 2929970 2764692 2610258 2467267 2336151 2216262 2106031 2004077 1910064 1824200 1746092
57521 1746092 1674638 1608932 1548592 1493404 1443450 1399382 1361403 1327930 1296474 1266036 1237448
57510 1237448 1211245 1186745 1163764 1143639 1127486 1114573 1103438 1093721 1085914 1080125 1076088 1073909
57498 1073909 1074037 1076951 1083222 1092998 1104964 1116894 1128004 1139792 1153815 1169772 1186814 1205620
57486 1205620 1227735 1253575 1282465 1314232 1349444 1388322 1430545 1476043 1525119 1577967 1634902
57475 1634902 1696824 1764668 1838613 1918497 2004704 2097947 2198558 2306671 2422600 2546322
57465 2546322 2677115 2814494 2958804 3109720 3264527 3418955 3569265 3712241 3843350
57456 3843350 3956305 4044806 4104020 4130768 4123742 4083899 4013672 3915592 3792659 3650157 3495563
57445 3495563 3335729 3174764 3015162 2859839 2711893 2572926 2442986 2322301 2212067
57436 2212067 2113206 2025185 1946715 1877103 1816205 1763366 1717387 1677749 1645034 1619724 1601251
57425 1601251 1588866 1582798 1583623 1590748 1602378 1617025 1634473 1655497 1681421 1713724 1753092 1798841
57413 1798841 1850097 1907450 1972464 2045600 2125752 2211892 2304113 2403041 2509524 2624990 2750415
57402 2750415 2884293 3022952 3163432 3304477 3443813 3576077 3694718 3794663 3871670 3920328
57392 3920328 3934906 3912364 3853752 3763152 3646187 3508681 3355265 3189199 3014168 2835553
57382 2835553 2658938 2487865 2323886 2168019 2020992 1882809 1753516 1634111 1525513
57373 1525513 1427038 1337158 1255370 1181895 1115669 1054171 995601 940282 889687 844745 805049
57362 805049 768940 734377 700392 667712 637587 610431 586001 564076 544005 524326 504009
57351 504009 483661 464453 446416 429033 412951 399438 388205 377254 365074 351899 338713
57340 338713 326149 314565 304237 295224 287623 281861 278051 275360 272839 270505 268686 266820 264123
57327 264123 261019 258541 256519 253813 250285 247103 245004 243635 242711 242450 242559 242086 240667 238786 236475
57312 236475 232849 227395 220777 214020 207674 201890 196523 191032 185172 179756 175829 173257 171153 169397
57298 169397 168295 166969 163887 159346 155743 154799 155921 157768 159824 161654 162243 161369 160538 161264 163138
57283 163138 164640 165248 165698 166616 167945 169542 171498 173727 175806 177506 179327 182232 186502 190990 194223
57268 194223 196509 199948 205702 212324 217914 222738 228040 233255 236693 238529 240611 243220 244682 244862
57254 244862 246488 251688 259198 266460 272859 279391 286557 294239 302748 312560 323722 336544 351997
57241 351997 370247 389519 407553 423668 438699 453715 469694 487624 507913 530159 554046
57230 554046 579689 606720 634232 662344 692466 725013 758256 790846 824291 861283 902350
57219 902350 945725 989866 1034400 1078902 1122441 1164338 1203960 1239644 1269057 1290954 1305746
57208 1305746 1314178 1316237 1311653 1300844 1285094 1265948 1244491 1221104 1196152 1170874 1147054 1125742
57196 1125742 1106998 1091059 1078832 1070753 1065958 1063214 1062056 1062556 1064804 1069113 1075970 1085227 1096087
57183 1096087 1108297 1122426 1138520 1155718 1173893 1194287 1217368 1241118 1262731 1281282 1297641
57172 1297641 1312663 1326793 1340797 1355514 1371144 1387858 1406806 1429613 1457164 1489621 1527075
57161 1527075 1569450 1616252 1667078 1721654 1778805 1836399 1893150 1949381 2004992 2057950 2106311
57150 2106311 2150837 2193955 2236745 2278513 2318758 2357803 2395717 2432345 2468599 2506376 2546957
57139 2546957 2590270 2635625 2682214 2729171 2776178 2823986 2873441 2924031 2974029 3021865 3066831
57128 3066831 3109027 3149415 3189379 3229302 3267965 3304074 3337816 3370207 3401751 3432683 3463737
57117 3463737 3495499 3527599 3559555 3591699 3624273 3656408 3687362 3718121 3750569 3785491 3822365
57106 3822365 3860402 3898776 3936650 3974089 4012170 4051220 4090010 4127838 4166011 4205888 4247065
57095 4247065 4289450 4335617 4388353 4446451 4505356 4561662 4614791 4664601 4709955 4750145 4785803
57084 4785803 4817661 4845337 4867320 4881293 4885113 4878639 4864091 4843625 4817483 4785385 4747859 4704220
57072 4704220 4650965 4584846 4506663 4419715 4325554 4223745 4114752 4000186 3880692 3756177
57062 3756177 3627557 3495817 3359750 3216622 3063717 2896567 2707056 2486762 2231939
57053 2231939 1942973 1620386 1264178 875261 453400 -5605 -507735 -1057275 -1659029 -2322214
57043 -2322214 -3058774 -3880691 -4803959 -5853686 -7062484 -8469987 -10132556 -12131353 -14563284
57034 -14563284 -17524008 -21100327 -25366715 -30377339 -36168733 -42772186 -50183179 -58271509
57026 -58271509 -66758471 -75414735 -84386337 -94286316 -105806119 -119075494 -133304668 -147010976
57018 -147010976 -158627735 -167048614 -171832058 -173091410 -171247955 -166811708 -160277633 -152130312
57010 -152130312 -142874651 -133014242 -122978379 -113060327 -103411729 -94084632 -85088704 -76438080
57002 -76438080 -68172996 -60354013 -53043787 -46294636 -40144129 -34610214 -29686063 -25342152
56994 -25342152 -21534762 -18212679 -15320654 -12804309 -10615409 -8712195 -7056457 -5613423
56986 -5613423 -4353689 -3252061 -2284916 -1431407 -676429 -9130 581374 1106156 1573047
56977 1573047 1986473 2350943 2672258 2955611 3205646 3428811 3632947 3823802 4003979
56968 4003979 4175385 4340076 4498051 4646589 4782997 4906758 5018851 5120784 5214675 5302460
56958 5302460 5384447 5460019 5529809 5595387 5656681 5711751 5759669 5801838 5840107 5875555 5909493
56947 5909493 5943208 5975787 6005074 6033197 6069059 6121221 6186255 6243991 6264281 6219813 6096589
56936 6096589 5897312 5637586 5338368 5019373 4695918 4378331 4072518 3781547 3507616
56927 3507616 3252596 3016941 2799261 2597676 2411036 2238293 2077472 1926165 1782652
56918 1782652 1645787 1514171 1386474 1262775 1144988 1035570 935915 846014 765472 694519
56908 694519 633773 583099 541344 507658 482544 466690 458941 456496 457326 461482 469669 481399 495069
56895 495069 508922 521085 529215 531204 526375 515644 500695 483362 465436 448364 432994 419786
56883 419786 409091 401020 395511 392900 394080 399561 408628 420055 433473 449514 468697 490696 514643
56870 514643 539471 563686 585103 601033 608896 607166 596308 578682 557021 532976 507364 481413
56858 481413 456899 435025 415908 399305 385184 373386 363384 354714 347157 340373 334134 329191
56846 329191 327036 328202 331528 335666 340457 345983 351217 355114 358671 364295 372884 382792 392037 400452
56832 400452 409281 419802 432949 449194 467781 486619 503832 519126 533050 545303 554443 558922
56820 558922 557771 550639 538030 521599 503724 486620 471820 460064 451305 445137 441616 441365 444689
56807 444689 451198 460801 474503 493515 517999 547213 580453 617223 656903 698567 740136 776874
56795 776874 802030 811005 804997 789422 769075 746152 722297 700005 681105 665542 652801 643498
56783 643498 638811 639441 646020 659610 680802 709037 743700 785263 834413 890353 950423 1010593
56771 1010593 1065596 1109360 1136672 1144817 1133837 1106145 1066341 1020016 971300 921917 873255
56760 873255 828252 789755 757824 730543 707438 690390 681040 679037 683401 694133 711461 734636
56748 734636 762482 794232 828493 861634 888362 904194 907047 896879 874766 842751 803931 761962
56736 761962 720033 680056 642672 608071 576894 550266 528894 512396 499916 491399 487895 490282
56724 490282 497880 508751 521515 536416 554179 573903 592583 606748 614184 614084 606424 591959
56712 591959 572559 550642 527867 504559 480517 456174 432781 411531 392653 375595 360127
56701 360127 346908 336527 328194 320252 312239 305568 301490 299081 296192 292000 287540 283853 280849 278323
56687 278323 276876 276937 277559 277229 275722 274356 274382 275696 277276 278345 278694 278225 276715 274211 271298 268624
56671 268624 266095 262995 259122 255527 253608 253530 254116 254427 254839 256182 258317 260293 261658 262935 264639
56656 264639 266527 268088 269272 270242 270706 270086 268335 266251 264884 264844 266102 268084 269942 271061 271506 271730
56640 271730 271892 271744 271266 270886 270836 270722 270170 269515 269321 269448 269250 268620 268153 268111 267866 266726 264857 262956
56622 262956 261308 259665 257952 256576 255791 255085 253636 251499 250022 250645 253264 256195 257973 258803 259857
56607 259857 261571 263253 264169 264299 263896 263019 261800 260679 259899 258993 257000 253169 247448 240552 233465 226518
56591 226518 218990 210121 200443 191412 183599 176004 167586 158774 151012 145419 142391 141861 143096 144648
56577 144648 145531 146383 148737 153103 158363 163064 166668 169490 172123 175205 179197 183839 188047 190662 191400
56562 191400 191108 191094 192070 193498 194156 193617 192927 193373 194789 195722 195305 194256 193793 194191 194871 195369 195571 195351
56544 195351 194688 194062 193999 194132 193426 191652 189997 189602 189997 189845 189110 189395 191725 194799 196325 195698 194541
56527 194541 194647 196228 198365 200438 202532 204787 206960 208769 210428 212579 215498 218372 219778 219273 218305
56512 218305 219021 222194 226796 231505 235961 240474 245286 250553 256407 262488 267862 271944 275372 279544
56498 279544 285346 292418 299358 304625 307862 310618 315037 321305 327027 329855 330166 330240 331200 331947 331140 329059
56482 329059 327108 326298 326832 328493 330689 332276 332086 329884 326565 323215 320051 316511 312387 308516 305924
56467 305924 304360 302281 298576 293828 289503 286353 284128 282477 281349 280507 279327 277317 274436 270858
56453 270858 266834 262940 260003 258487 258094 258052 257705 256785 255324 253399 250910 247687 243873 239978 236334
56438 236334 232831 229572 227558 228118 231569 236761 241945 245772 247628 247744 247254 247629 249545 252381 255058
56423 255058 257264 259745 263427 268356 273405 277053 278583 278578 278209 278142 278319 278619 279374 281119 284121 288306
56407 288306 293575 299985 307521 315619 323124 329062 333571 337764 342542 347849 353211 358525 363965 369518
56393 369518 375129 380906 386606 391310 394340 396264 398108 399697 399760 397834 395023 392431 389768 386170 381661
56378 381661 377030 372823 369263 366701 365157 363614 360940 357623 355559 355655 356533 356267 354699 353180 352506
56363 352506 352194 351749 351522 351819 351930 350759 348137 345073 342785 341748 341416 340662 338806 336400 334497 332902
56347 332902 329959 324837 319260 315748 314508 313472 311384 309270 308371 308115 307172 305407 303542 301562 298836
56332 298836 295622 293252 292667 293547 294941 296042 296274 295299 293285 290817 288515 287005 287187 289947 295509
56317 295509 303386 312982 323919 335707 347486 358291 367575 375669 383820 393390 404556 415931 425783
56304 425783 433496 439584 444634 448770 451956 454278 455958 457518 459771 463199 467407 471614 475551 479452
56290 479452 483431 487392 491395 495455 499170 502255 505321 509192 513357 516110 516662 516252 516544 517674 518781
56275 518781 520068 523169 529293 537854 547295 556749 566341 576262 586218 595844 605070 613973 622749 632068
56261 632068 642895 655438 668612 681178 693247 706023 720135 734901 749304 763107 776840
56250 776840 791250 806852 823446 839885 854848 868013 879968 890984 900605 908645 915742 922553
56238 922553 929106 935319 941495 947960 954881 962780 972384 983534 995070 1006374 1018261 1031878 1047644
56225 1047644 1065894 1087507 1112947 1141460 1172216 1205573 1242258 1281955 1323747 1367460 1413762
56214 1413762 1463583 1518286 1579605 1648215 1722996 1802931 1889165 1983917 2087812 2199750 2319163
56203 2319163 2447090 2585164 2734811 2897439 3074129 3264733 3467920 3682049 3905508
56194 3905508 4136624 4374059 4616806 4862910 5108654 5349668 5581901 5800435 5998588
56185 5998588 6170270 6312935 6426653 6510760 6563306 6583629 6573520 6535688 6472796 6388183 6285825
56174 6285825 6169041 6040486 5903411 5761290 5615770 5466390 5312771 5155789 4996362
56165 4996362 4834438 4669762 4502617 4333553 4163408 3993700 3825848 3659933 3495293
56156 3495293 3332316 3172566 3017481 2868310 2726758 2593767 2467837 2346655 2230560
56147 2230560 2122427 2023979 1934320 1852310 1778007 1711046 1649905 1593783 1543259 1498121 1456477
56136 1456477 1417016 1380362 1347193 1316868 1288932 1264075 1242423 1222756 1204666 1189568 1178190
56125 1178190 1168866 1159965 1152264 1147181 1144349 1142859 1143469 1147282 1153253 1159211 1164757 1171336 1179899 1190209
56111 1190209 1202166 1216297 1233017 1252335 1273907 1296596 1318807 1340227 1362408 1386691 1412412
56100 1412412 1438098 1463229 1487606 1510098 1529695 1547117 1564024 1581280 1599152 1618446 1640127
56089 1640127 1664435 1691566 1722501 1757949 1797231 1839614 1886159 1939122 2000225 2070661 2151921
56078 2151921 2245093 2349832 2465276 2591303 2727344 2870234 3014659 3155707 3290219 3416201
56068 3416201 3532327 3638127 3733845 3819979 3897013 3964828 4021794 4065000 4091876 4101064 4091981
56057 4091981 4065191 4023742 3972349 3913848 3847279 3769866 3679518 3574940 3455761 3324405 3186503
56046 3186503 3047836 2911878 2781237 2659532 2549844 2452515 2366194 2290030 2223440 2165211
56036 2165211 2114672 2072646 2039489 2013215 1991080 1971743 1954303 1936842 1918082 1899287 1882366
56025 1882366 1867158 1852558 1839047 1827760 1818179 1809258 1802094 1798878 1799573 1802013 1805108 1809869 1817355
56012 1817355 1827407 1839371 1852613 1866622 1881854 1899815 1921048 1943842 1966239 1988266 2010873
56001 2010873 2034022 2057469 2082091 2108626 2136384 2164883 2195184 2227745 2260688 2292505 2324841
55990 2324841 2360175 2398295 2437614 2478317 2521439 2566412 2612539 2661459 2714867 2771077 2827211
55979 2827211 2883880 2944255 3009301 3077283 3147418 3220643 3297121 3376117 3458071 3543993 3633349
55968 3633349 3725321 3821403 3923810 4032108 4144491 4261594 4385927 4518277 4657798 4804854
55958 4804854 4960569 5124427 5295521 5475289 5665706 5865845 6073633 6289853 6516856
55949 6516856 6754594 7001844 7260054 7531808 7816531 8111976 8419093 8741452 9081167
55940 9081167 9439703 9821148 10229597 10664198 11121495 11601506 12106578 12635732 13185907
55931 13185907 13758200 14357940 14990044 15659773 16376477 17150245 17985697 18884565 19852205
55922 19852205 20894558 22010423 23194288 24445847 25770130 27171116 28654541 30235985
55914 30235985 31937309 33775998 35766423 37929407 40290705 42872337 45696812 48798800
55906 48798800 52222441 56011494 60216992 64912623 70186968 76122090 82796591 90309246
55898 90309246 98784669 108363658 119214534 131553731 145631411 161704284 180057982
55891 180057982 201046179 225044541 252332412 283008298 316869591 353011713 389202388
55884 389202388 421656535 445838102 458072298 456932207 443515809 420648439 391720137
55877 391720137 359789213 327148937 295278854 265030297 236873126 211063646 187713061
55870 187713061 166823552 148326267 132098656 117959573 105679239 95014709 85739473
55863 85739473 77651036 70573829 64365031 58909279 54103377 49851297 46071598 42698222
55855 42698222 39671641 36937208 34452604 32187825 30115825 28210224 26452599 24833552
55847 24833552 23344046 21971438 20704637 19536370 18458807 17462612 16541240 15690610
55839 15690610 14903804 14171511 13488318 12853085 12262451 11709239 11188016 10697077 10234164
55830 10234164 9795228 9378285 8983670 8609655 8252397 7910984 7587862 7283384 6994387
55821 6994387 6718938 6457856 6210426 5973093 5743901 5524273 5315057 5114514 4921433
55812 4921433 4736543 4559438 4387648 4220252 4059250 3905979 3759062 3617188 3481155
55803 3481155 3352040 3229921 3115412 3009911 2913308 2823489 2738435 2656461 2574547 2489733
55793 2489733 2402879 2318117 2237929 2161466 2088005 2018698 1954008 1892632 1834264 1780531 1732068
55782 1732068 1687373 1645834 1609124 1578126 1551026 1525911 1502949 1482506 1463478 1445213 1429022
55771 1429022 1415810 1403681 1389632 1372551 1353263 1332675 1311090 1288485 1264529 1238947 1212220
55760 1212220 1185140 1157668 1129361 1100835 1073368 1047177 1021722 997677 976786 959722 945807
55749 945807 934795 926798 920395 913097 904212 895286 887354 879849 872652 867009 863655 861940 861353 861978
55735 861978 862843 861779 857648 850979 842117 830864 818388 807003 797110 786528 773897 760760 749350
55722 749350 740268 733239 728006 723293 716903 708029 697642 685688 670194 650457 628898 608108 588163
55709 588163 568608 550898 536549 524441 512307 499831 488191 477568 467295 457751 450054 444118
55697 444118 438576 432246 424405 414324 402099 389481 378388 368906 359893 351026 343001 336136 330187
55684 330187 325229 321399 317851 313156 306847 299871 293652 289312 287423 287664 288904 290185 291313 292135 291964
55669 291964 290508 288715 287801 287754 287487 286015 282883 278016 271997 265968 260459 254736 248167 241770 237479
55654 237479 236054 236602 237920 239459 240952 241922 241899 240961 240023 240575 243642 248699 254015 258452 262466 266979
55638 266979 271742 275506 277572 278600 279904 282338 285908 290117 294446 298507 302080 305570 310324 317609
55624 317609 326814 335590 342522 348627 355116 360836 363827 364642 365787 367896 368932 367602 365180 362987
55610 362987 360340 356467 352599 350382 349555 348967 348863 350338 353164 355857 357656 359203 361463 364905 369296
55595 369296 373398 375481 375102 373909 373772 374771 375923 376940 377914 377998 376106 372627 368945 365313 360545 353876
55579 353876 345775 336817 327071 316946 307497 299250 291447 282940 273307 262797 251802 240647 229473
55566 229473 218077 206375 195129 185637 178375 172548 167432 163581 161887 161540 159898 154986 147689 140823
55552 140823 136164 133183 130700 128671 127638 127329 126868 125910 124436 121836 117584 112685 109004 106976 105395
55537 105395 103753 103178 104296 105725 105765 104374 102266 99202 94721 89808 86190 84184 82575 80538 78453
55522 78453 76835 75708 75266 76055 77999 79978 80920 80846 80485 80248 80073 80079 80799 82549 84805 86645 87953
55505 87953 89870 93679 99346 105475 110504 113620 114773 114469 113434 111977 109732 106523 103219 101015 100013
55490 100013 99233 97783 95298 91593 87082 83213 81109 79819 77334 73464 70207 69046 69522 70837 73040
55475 73040 75922 78493 80640 83772 88723 94377 99454 104221 109227 113747 117005 119768 123240 127379
55461 127379 131658 136357 141597 146223 149291 151705 154749 158098 161207 165656 173695 184837 196063 205112
55447 205112 211544 214835 213941 209180 202565 195555 187884 178918 168726 157670 146402 136433 129050 123450
55433 123450 117553 110958 105348 101555 98093 93377 87785 82520 77891 73719 70215 67324 64302 60912
55419 60912 58169 56861 56230 55103 53558 52384 51534 50281 48572 47183 46583 46287 45264 42668 38573
55404 38573 34420 32228 32734 34599 35799 35472 34143 32827 32391 33275 35164 37286 39258 41062 41926 40369
55388 40369 36329 32411 31657 34328 37990 40423 41170 40379 38009 34982 33577 35125 37969 39165 38025
55373 38025 36588 36412 36460 35050 32634 31178 31272 31438 30382 28515 26740 24923 22472 19638 17317 15934
55357 15934 15307 15269 15708 16279 16759 17579 19400 22276 25680 29106 32174 34385 35361 35238 34472 33501 32855
55340 32855 33059 33904 34359 33880 33339 33954 35711 37609 38954 39503 38885 37088 35250 34743 35483 36218 36428
55323 36428 36736 37425 37887 37885 38124 38958 39505 38802 37166 35712 34960 34500 33847 33262 33657 35565 38108 39420
55305 39420 38634 36952 36014 35649 34274 31242 27615 24667 22793 21924 21754 21446 20422 19719 21111 24411
55289 24411 27043 27040 25216 23481 22205 20472 18023 15596 13767 12621 12348 13176 14655 15713 15454 13690
55273 13690 10960 8285 6544 5786 5539 5916 7656 10745 13850 15799 16927 18268 19922 20933 20382
55258 20382 18070 14549 11008 8645 7674 7445 7760 9061 10837 11210 9350 7232 7355 9365 10689 10199
55242 10199 9299 9226 9187 8039 6267 5168 4990 5103 5442 6660 8912 11308 12712 12708 11805 10995 11030 11918
55224 11918 13154 14475 16090 18038 19744 20597 20690 20607 20653 20673 20538 20419 20628 21443 23012 25074 26872 27817
55206 27817 28278 29216 30866 32284 32496 31595 30253 28663 26685 24748 23679 23570 23632 23329 22982 22939 22997 23055
55188 23055 23556 24508 24784 23344 20836 19047 18897 19779 20755 21544 22233 22817 23304 23691 23694 23001 21853 20817
55170 20817 19990 19123 18635 19636 22504 26019 28548 29789 30944 33292 36848 40311 42145 41777 39838
55155 39838 37318 34781 32555 31140 30799 31071 31488 32520 34946 38361 41294 42935 43695 43794 42476 39369
55139 39369 35767 33612 33603 34958 36575 37670 37583 35933 33136 30363 28830 29216 31538 35135 38832 41471
55123 41471 42559 42396 41628 40622 39266 37395 35460 34463 34944 36264 37221 37285 36950 37185 38872 42280 46386
55106 46386 49038 48642 45702 42156 39455 37865 37067 36393 34854 32209 29849 29340 30273 31069 31716 33705
55090 33705 36928 38838 37724 35030 33024 31775 30039 27856 26437 26230 26802 28118 30291 32445 33379
55075 33379 33268 33275 33561 33118 31709 30708 31496 33926 36773 39073 40693 41999 43209 44021 44053 43664 43795
55058 43795 44688 45675 46723 49158 53749 58941 62415 63917 65154 67232 69712 72062 74374 76321 76918
55043 76918 75996 74838 74654 75243 75654 75411 74541 73168 71752 71241 72287 74509 76879 78708 80003 81122
55027 81122 82261 83266 83941 84588 85960 88361 91042 92891 93494 93139 92133 90687 89174 87885 86741
55012 86741 85738 85278 85424 85369 84612 84211 85680 88797 91687 93017 92980 92204 91102 90439 91056 92396 92572
54995 92572 90613 87635 85125 83078 80691 77991 75769 74418 73692 73169 72310 70481 67667 64818 62922
54980 62922 62063 61826 62086 62796 63508 63803 63820 63790 63525 63067 63389 65584 69547 74160 78497 81989 83734 82828
54962 82828 79691 76206 74132 73845 74755 76256 77921 79472 81193 83932 88038 92422 95264 95801 95026
54947 95026 94597 95424 97437 100148 102902 104797 105153 104237 103034 102046 100765 98691 96347 94693 93914 93491
54931 93491 93255 93531 94243 94686 94388 93436 91871 89629 87436 86741 88010 89888 90898 91369 92657 94976
54915 94976 97267 99017 100800 102747 103864 103556 102790 102848 103669 104415 105068 106258 107818 108996 110241 113374
54899 113374 119219 126155 132093 137137 143038 150448 158295 166047 175069 186776 200412 213804 225973
54886 225973 237961 251187 265849 281140 296320 311200 325898 340330 353671 364193 369959 369917
54874 369917 364225 353591 338779 320944 301859 283206 265678 249193 233897 220255 208000 195788
54862 195788 182787 170374 161254 156569 154649 153117 151475 150765 151350 152339 153128 154157 155752 157435 159186
54847 159186 162478 168978 178585 189590 200572 211539 223443 237262 253268 270456 286732 300285
54835 300285 310839 319103 325143 327910 326390 320640 311599 300228 286986 271841 254798 236589 218693
54822 218693 202416 188042 175225 163893 154337 146593 140287 135064 130725 126876 122791 117815 111958
54809 111958 106285 102629 102262 104475 106975 108036 107777 107044 105924 104190 102457 101731 102077 102723 103209 103447
54793 103447 102892 100838 97640 94589 92407 90679 88832 86796 84642 82434 80591 79465 78461 76527
54779 76527 73720 71386 70484 70690 71392 72497 73756 74353 73924 73213 72958 72731 71706 70184 69573 70886 73716
54762 73716 76693 78781 80223 82187 85331 88952 92022 94637 97589 100734 102991 104089 105118 106916
54748 106916 109067 111137 113883 118340 124403 131117 137842 144514 151277 158502 166641 175422 183643 190421
54734 190421 196233 202282 209469 218666 231245 248122 268231 288733 307017 322366 335858 348793
54722 348793 360841 369552 372209 368497 360842 351933 342667 332800 322464 312094 301653 291149 281536
54709 281536 274028 268631 264257 260189 256606 253711 251177 248675 246433 245172 245798 248993 254630 261617
54695 261617 268696 275425 282379 290794 302160 317493 336377 357127 378418 400335 423402 447353
54683 447353 471770 497255 524493 551996 575910 592580 600779 601373 595661 584556 568876 549596
54671 549596 527582 503284 477059 449927 423694 399777 378002 357225 337245 319229 303869
54660 303869 290047 276087 261755 248206 236396 226373 217801 210344 203667 197730 192966 189636 187266
54647 187266 185152 183047 180820 178007 174468 170958 168123 165344 161637 157412 154192 152658 152040 151497 151060
54632 151060 150981 151002 150663 149797 148700 148274 149850 153996 159510 164325 167449 169438 171225 173397 176384 180095
54616 180095 183294 184660 184898 186531 190921 196489 200750 203307 205878 209872 214970 219970 224228 228047
54602 228047 232206 237414 244018 251847 260018 267094 272020 275228 278379 282597 287484 292323 297497 303721
54588 303721 310457 316465 321770 327698 334930 342968 351837 362844 376906 393327 411008 429847 450200
54575 450200 472070 495833 522680 552971 584750 615163 642939 668337 691044 709479 722041
54564 722041 727753 725545 714397 694747 668857 639137 606828 572845 539049 507664 479637 454251
54552 454251 430316 407276 385365 365396 348515 335499 325882 318041 310480 302874 295726 289417 283983
54539 283983 279454 275679 271842 266826 260345 253208 246267 239530 232555 225158 217389 209363 201545 194740
54525 194740 189245 184487 179955 175987 172974 170325 167090 163206 159261 155379 151362 147663 145047 143334
54511 143334 141615 139740 138410 137659 136607 135076 134139 134300 134357 133027 130890 129655 130054 131399 132810 133967
54495 133967 134796 135131 134729 133330 131020 128758 127932 128891 130496 131811 133734 138016 144782 151790 156395
54480 156395 157941 158245 159899 164025 169614 175166 180562 186579 192898 198167 202539 208568 218260 230343
54466 230343 242021 252754 264499 278550 293952 309240 323924 337489 348387 355161 357811 357233
54454 357233 353969 348322 341019 332698 322953 310928 296932 282784 270227 259437 249296 238855
54442 238855 228208 218105 209074 201114 194040 187772 182099 176506 170583 164620 159412 155448 152507 150113
54428 150113 148098 146656 146001 146080 146473 146631 146380 146222 146799 148021 149061 149380 149471 150260 151942 153725 154699
54411 154699 154713 154443 154849 156586 159579 162872 165095 165518 164825 164565 165642 167454 168695 168752 168049 167211 166426
54394 166426 165620 164723 163488 161552 159073 156958 155928 155529 154682 153200 152131 152205 152463 151080 147480 143042
54378 143042 139499 137181 135324 133662 132777 132762 132554 131282 129688 129348 130697 132674 134147 134782 134562 133503
54362 133503 132207 131688 132107 132524 132531 133276 135938 139887 143487 146218 148708 150862 151452 149996 147880 146925
54346 146925 147700 149872 153386 158264 163713 168510 172340 175942 179893 184020 188272 193307 199505 205766
54332 205766 210129 211672 211417 211277 212471 214986 217976 220320 221092 219974 217287 213503 208984 204293 200314
54317 200314 197502 195223 192357 188502 184097 179556 174993 170748 167318 164460 161127 156830 152550 149790
54303 149790 149155 150235 152278 154340 155314 154719 153344 152342 151805 150961 149782 149564 151578 155630 160204 163704
54287 163704 165457 166005 166729 168922 172909 178037 183384 188299 192456 195877 198891 201632 203675 204676 205275
54272 205275 206536 208317 209071 207765 205222 202865 200745 197847 193952 190033 186689 183226 178729 173245
54258 173245 167457 161831 156725 152658 149678 146752 142672 137596 132963 129825 127924 126477 125042 123206
54244 123206 120208 115679 110514 106288 103796 102610 101996 101822 102413 103752 105046 105130 103443 100524 97329
54229 97329 94127 90739 87851 87148 89338 92723 94733 94633 93727 93121 92531 91532 90761 91196 92896 95096
54213 95096 97053 98245 98201 96920 95476 95649 98570 103575 108429 111056 111372 111191 112050 113604 114756 115616
54197 115616 117103 118916 119528 118457 117044 116469 116430 116556 117567 119767 121649 121549 120030 119108 119622 120816
54181 120816 122006 123054 123319 121898 119274 117351 117327 118509 119575 120091 120405 120885 121773 123125 124551 125550
54165 125550 126198 126855 127215 126550 125018 123739 123353 123645 124783 127494 131258 133751 133418 131602 130712 130975
54149 130975 130677 129274 128290 128796 129713 129648 129195 130101 132709 135440 136730 136412 135134 133351 131325 129373
54133 129373 127540 125398 122623 119479 116316 113019 109545 106651 105238 105046 104841 103955 102834 101911 100929
54118 100929 99774 99025 98959 98866 98270 98129 99715 102611 105008 105871 105770 105598 105558 105668 106205 107155 107959 108332
54100 108332 108791 109900 111363 112299 112073 110585 108101 105239 102897 101675 101319 100867 99466 97169 94979
54085 94979 93891 93766 93475 92422 91363 91163 91204 90038 87441 84792 83243 82421 81253 79286 76815 74448
54069 74448 72945 72823 73611 74109 73837 73635 74329 75460 76052 76136 76691 78275 80430 82344 83553 83995 83929 83874
54051 83874 84297 85265 86522 87711 88388 88124 87012 85876 85543 86031 86716 87166 87413 87530 87473 87438 87927 89149
54033 89149 90517 91138 90904 90786 91642 92875 92892 91224 89533 89802 91965 94205 95391 96052 96866 97450 97279
54016 97279 96779 96631 96671 96374 95967 96227 97394 98942 100116 100220 98951 97273 97367 100478 105000 107869 107987
53999 107987 107164 107483 108930 110230 110942 111678 112721 113523 113639 113537 114318 116916 121476 127203 132823 137510
53983 137510 141416 145168 149016 152749 156313 160094 164529 169747 175672 182056 188316 193767 198441 203401
53969 203401 209740 217371 225305 233068 241308 250751 261039 270974 279638 287054 293995 301377 309436 317155
53955 317155 322835 325683 326628 327187 327868 328155 327634 326330 324135 320823 316765 312864 309544 306274 302283
53940 302283 297288 291491 285416 279791 274991 270579 266007 261705 258533 256125 252918 248256 243354 239450
53926 239450 236060 232043 227593 223913 221322 218968 216309 213772 211727 209761 207457 205318 204397 205075 206381
53911 206381 206607 204833 201976 200025 199971 200899 201433 201572 202469 204687 207465 209658 210691 210539 209501 208405
53895 208405 208547 210755 214395 217546 218522 217459 216219 216492 218200 220206 222302 225511 230278 235476 239931
53880 239931 244065 249071 255046 261006 266491 272064 278209 284625 290766 296418 301623 306520 311308 315907
53866 315907 319654 321861 322611 322650 322722 323552 326135 331119 337864 344834 351053 356620 361815 366477 370474 374172
53850 374172 378176 382980 388947 396105 403781 410883 416732 421451 425608 429685 433636 436629 437703 437182
53836 437182 436851 437783 438578 437075 433567 430713 430030 429947 427947 423323 416986 409668 401438 392376 382769 372961
53820 372961 363485 354748 346135 336245 324806 313584 304443 297153 290172 283039 276678 271506 266613 261138
53806 261138 255454 250511 246530 242773 238358 233178 228104 224046 220579 216051 209687 203071 198462 195788
53792 195788 192588 187228 181102 176995 176102 177362 179027 179962 179745 178526 176933 175474 173849 171206 167195
53777 167195 162516 158487 156366 156890 159752 163387 165897 166634 166575 166809 167062 166157 163664 160576 158400 157992
53761 157992 159112 160625 161244 160701 160249 161437 164317 167380 169362 170491 171811 173977 177016 180489 183440
53746 183440 185055 186054 188677 194257 201342 207243 211152 214656 219407 225484 232082 238592 244594 249683
53732 249683 253855 257504 260834 263878 267194 271758 277807 284439 290560 295583 299061 300640 300883 301265 302624
53717 302624 304134 304351 302777 299905 296277 292204 288087 284471 281860 280567 280278 279680 277318 273179 268660
53702 268660 264648 260630 256233 252500 250656 250488 251072 252229 253971 255135 254259 251642 249056 247413 246046
53687 246046 244378 242763 241309 239248 236223 233162 231121 230048 229345 228833 228430 227603 225982 224033 222311
53672 222311 220410 217576 214146 211462 210273 209983 209713 209431 209556 209814 209189 207070 204032 201130 198686 196226
53656 196226 193624 191695 191248 191956 192793 193387 194423 196688 200284 204771 209539 213908 217433 220386 223435
53641 223435 226553 228780 229515 229594 230478 232457 234328 235042 235286 237049 241604 248152 254672 260019 264845 270286
53625 270286 276230 281443 285153 287734 289705 290878 290936 290257 289620 289446 289875 291225 293577 296004 297017 296116
53609 296116 294414 293406 293488 294014 294442 294832 295242 295192 294035 291648 288520 285283 282429 280380 279424 279407 279719
53592 279719 279783 279438 278741 277633 276112 274674 274169 275048 276871 278761 280279 281654 283157 284432 284794 284182
53576 284182 283517 283837 285316 287363 289485 291573 293491 294945 295917 296807 298092 300206 303571 308039 312382
53561 312382 315318 317285 320126 324634 329591 333908 338378 344109 350439 355986 360830 365668 369431 370192
53547 370192 368586 368026 370827 376080 382154 389134 397345 405291 411195 415691 421062 428253 436169 443537
53533 443537 449911 455042 458852 462262 466760 472767 479258 485109 489994 493866 496550 498111 499001 499609 500184
53518 500184 501159 502947 505430 508157 510842 513117 514314 514391 514589 515890 517162 516458 514193 513196 515036 517915
53502 517915 519173 518510 517614 517850 519722 523508 528757 533693 536888 539397 543614 549758 555047 556990 556363
53487 556363 556060 557855 561273 565208 569457 574376 579757 584775 589128 593749 599987 608051 616615 624159
53473 624159 630458 636586 643657 651900 660741 669397 677391 684815 692289 700687 710825 723165 737477
53460 737477 752753 767895 782622 797463 812950 829395 847412 867681 889770 912148 934072
53449 934072 956670 981218 1007195 1033351 1060063 1088910 1119944 1151169 1181349 1211850 1244854
53438 1244854 1280826 1318687 1357547 1397061 1436709 1475935 1514915 1554225 1593725 1632472 1669761
53427 1669761 1705675 1740587 1774727 1808346 1841870 1875656 1909796 1944261 1979168 2014873 2051684
53416 2051684 2089160 2125839 2160301 2192790 2225087 2258273 2291168 2321663 2349102 2374540 2398950
53405 2398950 2422062 2442973 2461099 2476401 2489214 2499931 2508399 2513750 2515389 2513936 2510519 2505377
53393 2505377 2497995 2488416 2477269 2464402 2448746 2430048 2409649 2388824 2367197 2343592 2317773 2290552
53381 2290552 2262719 2234692 2206757 2178785 2150039 2120072 2089611 2059861 2031227 2003527 1977157
53370 1977157 1953053 1931463 1911662 1893035 1875751 1860258 1846754 1835252 1825488 1816757 1808604 1801918
53358 1801918 1798551 1799407 1803488 1809076 1815235 1821861 1829044 1836997 1846189 1856989 1869481 1884012 1901432
53345 1901432 1922394 1946840 1974509 2005234 2038204 2071800 2105237 2139880 2177822 2219514 2264032
53334 2264032 2311254 2361975 2415585 2469588 2522652 2576825 2635187 2698058 2763064 2828574 2895353
53323 2895353 2964679 3036379 3109310 3182562 3255393 3326962 3397150 3466941 3536938 3605944 3672153
53312 3672153 3735438 3797215 3858006 3916336 3970365 4019443 4063477 4101886 4134186 4160798 4182106
53301 4182106 4197143 4204385 4203680 4196347 4183410 4164818 4140476 4110784 4075760 4034776 3987888 3936561
53289 3936561 3882419 3825954 3767188 3706721 3645198 3582484 3518507 3454397 3391524 3329777 3268201
53278 3268201 3207194 3148458 3092603 3038408 2984997 2933055 2882802 2832279 2779457 2725427 2673761
53267 2673761 2626749 2583567 2542184 2501767 2462805 2426063 2392155 2361498 2333973 2308856 2285429
53256 2285429 2263368 2242352 2221744 2201076 2180489 2160342 2140653 2121281 2102464 2084706 2068196
53245 2068196 2052670 2038001 2024772 2014130 2006838 2002275 1998481 1993671 1987957 1983345 1981869 1983943 1988652
53232 1988652 1995175 2003453 2013635 2025545 2038958 2054105 2071583 2091727 2114230 2138428 2163849 2190429
53220 2190429 2218348 2247878 2279233 2311998 2344541 2374651 2401380 2425896 2449825 2473066 2494192
53209 2494192 2512813 2530098 2546442 2559959 2568460 2572123 2572839 2571311 2566334 2557132 2544950 2531478 2516631
53196 2516631 2498972 2477993 2454936 2431091 2406050 2378171 2346682 2312785 2278578 2245123 2211860
53185 2211860 2177720 2142349 2106128 2069570 2033275 1998344 1966209 1937638 1911784 1886362 1859153
53174 1859153 1829799 1800139 1772264 1746104 1719602 1691596 1663657 1638277 1615892 1594889 1574190
53163 1574190 1554396 1536215 1519208 1502800 1487443 1473858 1461850 1450759 1440484 1431143 1422056 1412158
53151 1412158 1401258 1390037 1378820 1367169 1354656 1341149 1326259 1309480 1291303 1273343 1256710
53140 1256710 1240840 1224572 1207818 1191386 1175533 1159712 1143748 1128244 1113359 1098003 1080977
53129 1080977 1062592 1044390 1027309 1010757 993681 976019 958687 942284 926192 909114 890482
53118 890482 871250 853148 836994 821951 806804 791701 777849 765383 752535 737739 721915
53107 721915 707515 695496 684449 672930 661379 650926 641248 630828 618982 606483 594226 582363
53095 582363 570996 560671 551529 542700 533287 523534 514252 505416 496248 486649 477654 470181 464148 459108
53081 459108 454993 451581 447872 442906 437000 431399 426840 423125 419878 416838 413490 409490 405695 403669
53067 403669 403574 403470 401470 397870 394275 391216 387708 382886 377101 371342 366368 362472 359556 357382 356023
53052 356023 355793 356188 355494 352312 347266 342314 338663 336287 335074 334996 335114 334025 331903 330796 332183 335340
53036 335340 338776 342104 345461 348126 349144 348872 348695 349357 350455 351357 351698 351178 349776 348139 347009 346271
53020 346271 345123 343081 340181 336394 331648 326430 321612 317470 313335 308422 302762 297390 293747 292453
53006 292453 292241 290584 286089 279967 274462 270254 266345 262062 257863 254051 250033 245421 240953 237732
52992 237732 236167 236016 236775 237510 237026 234894 231944 229234 226944 224797 223058 222308 222429 222531 221940 220694
52976 220694 218893 216076 211691 206116 200855 197451 196106 195492 194006 191235 188199 186458 187004 189568 192612
52961 192612 194329 194295 193908 194614 195885 195762 193443 190401 188650 188718 189831 191302 192909 194282 194826 194375
52945 194375 193479 192952 193274 194277 195211 195320 194622 193884 193556 193022 191346 188650 186293 185608 186659 188216 188791
52928 188791 187929 186708 186853 189035 192026 193746 193104 190729 188132 186420 185779 185885 186724 188903 192916 198038
52912 198038 202428 204823 205894 207404 210107 213085 215118 216005 216267 216190 215852 215855 217336 221012 226431 232245
52896 232245 237084 240287 242195 243896 246468 250224 254667 259143 263412 267698 272467 278225 285182 292912
52882 292912 300551 307491 313586 318645 322285 324665 326749 329091 330761 330460 328610 327319 328018 330023 331672
52867 331672 332015 330944 328618 325537 322540 319974 317231 313685 309575 305378 300986 296313 292209 289825
52853 289825 289324 289900 290615 290490 288529 284922 281773 281159 282584 283773 283985 284937 287993 292052 295080 296548
52837 296548 297329 298086 298877 299813 300985 301898 301775 300622 299591 300166 302908 306750 309696 310693 310645 310972 311466
52820 311466 310697 308436 306270 305384 305209 305042 305546 307311 309086 309111 307758 307276 308915 311649 313820 314885
52804 314885 315186 315056 314696 314407 314451 314898 315761 317015 318454 319824 321094 322338 323378 323871 323745 323375 323342
52787 323342 324000 325090 325761 325525 325251 326476 329363 332139 333309 333732 335480 339015 342612 344556 344901 344914
52771 344914 345769 348095 352009 356784 360853 362865 362928 362593 363383 365333 367020 367164 365951 364566 363676 362982
52755 362982 362260 362008 362680 363838 364504 363864 361330 356604 350244 343671 338053 333508 329646 326170 322513
52740 322513 317850 312260 307071 303129 299422 294480 288469 282764 278096 274431 272020 270898 269525 265749
52726 265749 259433 252815 247944 244954 243035 241614 240107 237779 234616 231444 228696 226018 223514 222253
52712 222253 222795 224104 224675 224020 222409 219828 215942 210701 204458 197985 192582 189406 188160 187168 185311
52697 185311 183223 182102 182106 182531 182757 182241 180341 177039 173328 169983 166492 162166 157775 154814 153231 151146
52681 151146 147209 142415 139024 138168 139048 140238 141165 142042 142687 142194 140066 137164 134802 133291 132166 131512
52665 131512 131763 132202 131179 128388 125625 124483 124504 124549 124733 125544 126086 125015 122825 121469 121681 122220 121909
52648 121909 121007 120174 119429 118762 118681 119402 120228 120467 120444 120932 121967 122795 122826 122279 121968 122596 124103 125775 127318
52629 127318 129612 133654 138807 143027 145158 146116 147289 148717 149793 151031 153773 158272 163339 168127
52615 168127 173035 178216 182249 183480 182289 180854 180658 181361 182269 183647 185624 186760 185173 181067 176906
52600 176906 174693 173977 172951 170803 168225 166095 164452 162784 160853 159068 158125 158209 158605 158361 157264 155725
52584 155725 153779 151008 147664 145020 143972 143855 143293 141757 139647 137456 135656 134998 135966 138029 140187
52569 140187 142066 143765 145012 145425 145355 145260 144355 141258 136310 131944 130011 129797 129482 128546 127707 127197 126469
52552 126469 125345 124313 123542 122669 121816 121985 123894 126991 130113 132728 134963 136796 137933 138528 139265 140366
52536 140366 141125 140963 140468 140608 141121 140759 139328 138438 139560 142227 144968 147332 149856 152533 154747 156699
52520 156699 159426 163072 166353 168340 169630 171063 172315 172796 173062 174059 175485 176222 176167 176276 176774 176680 175663
52503 175663 175212 177125 181458 186728 191691 196063 199737 202251 203317 203364 203134 202950 202679 202298 202196 202787
52487 202787 203944 205071 205831 206695 208592 211976 216354 220721 224411 227485 230372 233181 235428 236542 236668
52472 236668 236718 237420 238510 239112 238800 237843 236604 235361 234938 236717 241243 246984 251187 252268 251100 249943
52456 249943 250342 252094 253941 255004 255535 256243 257011 256700 254689 252215 251379 252672 254273 254234 252721 251484
52440 251484 251610 252656 253853 255147 256740 258293 259148 259047 258190 256744 254741 252406 250213 248416 246778
52425 246778 245018 243490 243172 244783 248021 251910 255805 259717 263574 266653 268202 268528 268988 270870 274431
52410 274431 278869 282861 285195 285327 283587 280796 277685 274786 272591 271411 271128 271438 272352 274091 276551
52395 276551 279228 281715 283916 285829 287553 289457 291821 294197 295631 295682 294776 293530 292286 291523 292041
52380 292041 294288 297813 301662 304943 306882 306916 305237 302953 301327 300999 301870 303267 304123 303752 302627 301617
52364 301617 300282 297054 291738 286627 283977 283292 282520 281251 281067 282889 285695 288155 290035 291469 292193
52349 292193 292403 293280 295587 298304 299662 299309 298693 299421 301715 304389 305872 305428 303834 302832 303549 305473
52333 305473 307183 307950 308256 308831 309631 310070 310086 310607 312662 315986 318810 319322 317372 314613 313005 313339 315028
52316 315028 316881 318019 318364 318626 319752 322190 325467 328449 330165 330701 331248 332883 335220 336769 336887
52301 336887 336851 338470 342062 346410 350454 354315 358703 364023 370076 376140 381311 385203 388244 390992 393510
52286 393510 396027 399635 405245 411929 417517 421099 423948 427665 432441 437597 442790 447880 452352 455904
52272 455904 459327 464087 471028 479780 489061 497366 503911 509355 515156 521841 528472 534240 539890 546946
52258 546946 556031 566596 577653 588006 596349 602429 608044 615949 627619 642571 659533 677377
52246 677377 695107 712215 729476 748494 769950 792809 815608 838003 860745 884659 910103
52235 910103 936962 964723 992772 1020966 1049684 1079047 1108391 1136961 1164908 1193165 1222336
52224 1222336 1252077 1281697 1311036 1340448 1369890 1398269 1424055 1446651 1466980 1486453 1505501
52213 1505501 1523368 1539229 1553117 1565660 1577294 1587950 1597209 1604571 1609767 1613083 1615241 1616675
52201 1616675 1617030 1615713 1612933 1609888 1607746 1606669 1605989 1605138 1604225 1603853 1604708 1607291 1611668 1617301 1623393
52186 1623393 1629636 1636602 1645311 1656561 1670700 1687552 1706247 1725425 1744238 1763115 1783168 1804849
52174 1804849 1827563 1850439 1872839 1894022 1913030 1929325 1943249 1955550 1966770 1977237 1987094
52163 1987094 1995777 2001738 2003394 2000545 1994668 1987657 1980251 1971596 1960343 1946266 1930688 1915135 1899773
52150 1899773 1883602 1865956 1847102 1827364 1806567 1784693 1762338 1740093 1718181 1697115 1677808
52139 1677808 1660258 1642981 1624906 1607260 1592291 1580337 1569483 1558121 1546581 1535913 1526411
52128 1526411 1518005 1511105 1506089 1502443 1499186 1495863 1492524 1489054 1485168 1480921 1476597 1472067 1466771 1460526
52114 1460526 1454040 1448413 1444085 1440368 1436164 1431239 1426564 1423088 1420380 1417126 1413000 1409119 1406106 1402448
52100 1402448 1395864 1386155 1375775 1367278 1360940 1355332 1349544 1343978 1339143 1334629 1329687 1324314 1319263 1315172
52086 1315172 1312140 1309923 1307979 1305361 1301285 1296057 1290934 1286752 1283255 1280084 1277671 1276346 1275112 1272445
52072 1272445 1268165 1263469 1259081 1254587 1249989 1246613 1245471 1245525 1244762 1242661 1240539 1239592 1239745 1240579 1242327
52057 1242327 1245336 1249256 1253474 1257993 1263343 1269906 1277814 1287244 1298156 1309739 1320814 1331114 1341917
52044 1341917 1355115 1371780 1391677 1413999 1438387 1465297 1495359 1528281 1562578 1596768 1630731
52033 1630731 1665397 1701030 1736595 1771247 1805719 1841409 1878454 1915571 1951595 1986279 2019609
52022 2019609 2051295 2081148 2108989 2133806 2153949 2168840 2179728 2188043 2193710 2196069 2195879 2195093 2194608
52009 2194608 2193187 2188876 2180787 2169405 2155872 2141308 2126309 2110701 2094049 2076579 2059328 2043295
51997 2043295 2028676 2014974 2001630 1988654 1976957 1967930 1962221 1959034 1956961 1955295 1954060 1953265 1953233
51984 1953233 1955453 1961669 1971644 1982892 1993263 2002852 2012735 2022847 2032294 2040924 2049249 2057167 2064190
51971 2064190 2070917 2078726 2087500 2094833 2098430 2098684 2097939 2097482 2096050 2091379 2082667 2071289 2059320 2047615
51957 2047615 2035207 2020436 2002468 1981665 1958723 1933827 1906842 1878025 1848231 1818429 1789057
51946 1789057 1759682 1729088 1695905 1659636 1621296 1582836 1545627 1509486 1473238 1436053 1398021
51935 1398021 1359612 1321068 1282552 1244445 1206984 1169714 1131809 1093172 1054945 1018706 985161
51924 985161 953756 923471 893849 865153 837630 810910 784512 758808 734980 713704 694289
51913 694289 675508 656917 638844 621477 604801 589224 575308 562707 550385 538248 527555
51902 527555 519056 511611 503552 494787 486495 479198 472332 465580 459347 453686 447831 441279 434572 428563
51888 428563 423514 419249 415359 410771 403993 394747 384953 377197 372323 369180 366368 363345 359932 355928
51874 355928 351650 348081 345835 344375 342779 341052 340149 340782 342570 344368 345162 344615 342889 340161 336400
51859 336400 331735 326800 322252 317974 313266 308081 303550 300796 299508 298204 295704 291934 287508 283162
51845 283162 279556 276895 274617 272006 269276 267422 266743 266169 264528 261978 259611 258024 256907 255713 254023
51830 254023 251386 247643 243563 240561 239511 240164 241752 243579 244879 244841 243390 241584 240670 240831 241270 241296
51814 241296 240763 239552 237358 234451 232128 231740 233179 234756 234881 233736 233069 234337 237227 240070 241572
51799 241572 242003 242720 244687 247583 250340 252346 253950 255804 257994 259945 260999 260865 259709 258260 257884
51784 257884 260032 265107 271806 277808 281261 281872 280780 279503 278893 278928 279270 279579 279160 277022 273072 268952
51768 268952 266673 266358 266426 266300 267571 271549 276731 280097 280503 279494 278995 279517 280616 281735 282123 281071
51752 281071 278905 277088 276827 278119 280360 283109 285927 288304 290314 292546 294790 295567 293721 289959 286066
51737 286066 283129 281248 280283 279822 278909 276951 274785 273713 273562 272934 271563 271112 273016 276428 279120 279809
51721 279809 278906 277497 276445 276254 276984 278176 279335 280585 282360 284464 285968 286268 285841 285620 285882 286149
51705 286149 286105 286126 286767 288058 289658 291591 294493 298964 304829 311147 316853 321381 324813 327632 330330
51690 330330 333122 335956 338836 342155 346675 352990 360803 368758 375368 380474 385718 393202 403628 415915
51676 415915 428549 440953 453436 466220 478843 490418 500217 507962 513611 517050 518301 518168 518195
51663 518195 519338 520787 520830 518930 516275 514035 512026 509702 507666 507066 507707 507784 505812 502142 498313 495330
51647 495330 492941 490399 487672 485804 485891 487616 489147 488941 487398 486166 486023 486292 486452 487263 489601 492796
51631 492796 495116 495827 495987 497028 499272 502185 505461 509173 513115 516836 520455 524764 530131 535848 541040
51616 541040 545690 550040 553424 554765 554237 553334 553051 553080 553350 555146 559561 565554 570944 575069 579193 584262
51600 584262 589507 593690 596615 598708 599837 599324 596809 592555 587076 580848 574117 566657 558008 548298
51586 548298 538527 529668 521674 513791 505681 497753 490507 484002 478027 472364 466758 460909 454863 449311
51572 449311 445159 442525 440196 436467 430812 424576 419595 416189 413016 409009 404784 401609 399400 396601
51558 396601 392183 387039 382929 380384 378237 375231 371474 368061 365640 363906 362364 361019 360132 359826 360176
51543 360176 361284 362788 363652 363037 361274 359547 358725 358983 360356 362843 365850 368317 369817 371088 373149
51528 373149 376303 380245 384602 389060 393412 397935 403323 409883 417200 424894 433109 441737 449776 456289
51514 456289 461509 466110 469794 471635 471667 470933 469917 468107 465373 462531 459922 456580 451687 446111 441527
51499 441527 438654 437220 436895 437064 436179 433005 428668 426200 427535 431862 437211 442591 447946 453064 457571
51484 457571 461620 465650 469548 472706 474901 476685 478971 482479 487308 492654 497219 500325 502433 504173
51470 504173 505233 504785 502739 499898 496945 493921 490735 487656 485203 483997 484679 487374 491220 494901 497722
51455 497722 499692 500733 500628 499887 499770 500991 502937 504521 505280 505305 504673 503411 501543 498715 494295 488301
51439 488301 481795 475791 470217 464547 459015 454357 450526 446486 441406 435575 429998 425548 422517 420670
51425 420670 419624 419309 419931 421305 422614 423267 423780 425303 428303 432092 435522 437863 439308 441108 444980
51410 444980 451782 460720 470136 478890 486702 493717 500403 507427 514825 521664 527503 533766 542298 552598
51396 552598 562118 569722 577260 586709 597127 605868 611975 616631 620621 623095 623221 621677 619750 617857
51382 617857 615758 613568 611698 610142 608677 607749 608334 610624 613434 615410 616576 618261 621604 626478 631866
51367 631866 636878 641258 645077 648028 649031 646896 641816 635925 631538 628705 625303 619783 612884 606022
51353 606022 599052 590875 581700 573262 566825 562252 559207 557926 558216 558815 558667 558131 558086 558474 558631 558624 559182
51336 559182 560377 561359 561613 561645 562047 562493 562263 561447 561039 561816 563493 565060 565684 565132 563610 561439 558689
51319 558689 554801 548675 539631 528396 516697 505744 495458 485243 474907 464496 453950 443455
51307 443455 433574 424366 415046 405365 396631 389980 384079 376272 366193 356519 349530 344526 339662 334803
51293 334803 330939 327790 323965 319400 315833 314465 314335 313564 311303 307998 304515 301607 299651 298284 296687
51278 296687 294763 293625 294280 296094 297336 297252 296784 296971 297457 297235 296330 295750 295868 295886 295109 293842 292626
51261 292626 291577 291205 292985 297931 305049 312267 318602 324227 328871 331756 333370 335685 339923 345259
51247 345259 350424 355376 360519 365309 368889 371471 374013 376871 379623 381757 382654 381435 377914 373376
51233 373376 369276 365315 359803 351917 342529 332795 323124 313928 306267 300889 297123 293556 289606 285765
51219 285765 282360 278764 274301 269550 266003 264223 263007 261008 258639 257320 257042 255922 252632 248108
51205 248108 244260 241970 241119 241498 242494 242587 240648 237546 235333 234862 235176 235130 234587 234011 233836 234417 235843
51188 235843 237593 238976 239914 240803 241773 242739 243838 245030 245591 244982 244012 243993 244826 245079 243985 242262 240897
51171 240897 240269 240471 241151 240814 237858 232907 228749 227189 227234 227225 227392 229083 232437 236235 239377 241234 241159
51154 241159 239201 237116 237233 239893 242927 243915 242363 239604 237328 236413 236594 236992 237284 238370 241430 246252
51138 246252 250912 253402 253347 252086 251259 251362 251535 250640 248507 246073 244449 244091 244763 245794 246323 245927 245217
51121 245217 245240 245971 246004 244200 241080 238031 235644 233478 231031 228204 225104 222172 220345 220291 221519 222800
51105 222800 223385 223298 222739 222080 222278 224215 227277 229419 229138 226956 224635 223457 223563 224441 225393 225697 224857
51088 224857 222879 220192 217248 214156 210640 206506 202312 199326 198398 198968 199689 200018 200589 201958 203693
51073 203693 205091 206193 207489 209046 210603 212298 214520 216976 218564 218557 217554 217011 217994 220583 224273
51058 224273 228534 232960 237051 240102 241496 241266 240354 240000 240653 241543 241481 240029 237775 235631 234218 233886
51042 233886 234823 236762 238779 239759 239117 237011 234018 230918 228646 227954 228874 230654 232425 233946 235695
51027 235695 238325 241949 245815 248755 250109 250175 249585 248499 246794 244872 243589 243245 243287 243402 244323 246915
51011 246915 250775 254466 257072 258835 260153 260725 260248 259526 260146 262901 266895 270384 272314 272872 272698 271871
50995 271871 269877 266702 263767 263335 266520 271916 276631 278920 279538 280387 282293 284517 286129 287123 288224
50980 288224 290192 293503 298142 303402 308140 311513 313308 313807 313800 314615 317207 320939 324059 325715 326724
50965 326724 327923 328772 328352 326817 324820 322265 318922 315787 314537 315903 319694 325882 334070 342137 347371
50950 347371 349418 350567 352674 355404 358152 361837 367486 374373 381170 388203 397021 408048 419973 431439
50936 431439 442378 453611 465762 478671 491595 504216 517492 532790 549914 567048 583364
50925 583364 600634 621176 645056 670699 697575 726637 758274 791646 826492 864191 906167
50914 906167 952120 1000751 1051867 1107045 1168122 1235342 1307256 1382459 1461146 1544540 1633003
50903 1633003 1725634 1821881 1922415 2027657 2136288 2246004 2354762 2460259 2559188 2648782
50893 2648782 2728824 2800732 2864833 2919896 2964982 2999924 3023893 3035526 3035272 3026151 3011301 2991894
50881 2991894 2968201 2941374 2912980 2883678 2853512 2822924 2792340 2761040 2727456 2690563 2650377
50870 2650377 2607329 2561745 2513725 2462879 2408259 2349022 2285117 2217028 2145079 2069414 1990521
50859 1990521 1909340 1826952 1744436 1663012 1584108 1509215 1439462 1375060 1315274 1259426 1207882
50848 1207882 1161612 1120859 1084917 1053199 1025651 1001886 980846 961870 945412 932035 921264
50837 921264 912058 904024 897588 893346 891713 892691 895370 898064 899702 900936 903357 907876 914311 922121
50823 922121 930828 939924 949233 959391 971384 985605 1001861 1020350 1041890 1066909 1094558 1123208
50811 1123208 1151774 1180512 1210674 1243521 1279746 1319761 1364111 1413140 1466393 1523171 1583924
50800 1583924 1650336 1723584 1803250 1888803 1981711 2084987 2200511 2327614 2464573 2610943
50790 2610943 2768042 2937451 3119503 3313145 3516894 3729486 3949655 4175714 4405818
50781 4405818 4638274 4870872 5099783 5319822 5525974 5714123 5880351 6020769 6132924
50772 6132924 6216718 6273173 6302801 6306093 6285051 6243186 6184198 6111664 6029963 5944283 5859191
50761 5859191 5777652 5701417 5631471 5567544 5507654 5448646 5387150 5320016 5244360 5157767 5058674
50750 5058674 4946562 4821627 4683972 4533229 4369416 4194272 4011180 3823502 3633661
50741 3633661 3444152 3258380 3079415 2908550 2746088 2593055 2450840 2319534 2198133
50732 2198133 2086428 1985255 1894640 1813131 1739555 1674122 1617060 1567247 1523150 1484270 1450671
50721 1450671 1421694 1396113 1373186 1352714 1334533 1318730 1305975 1296639 1289660 1283110 1276035 1269094
50709 1269094 1263304 1258690 1254334 1249502 1244515 1240479 1238038 1236646 1235623 1235883 1239553 1247302 1256991 1265961
50695 1265961 1274152 1283979 1297572 1315348 1337019 1362469 1391329 1422989 1457711 1496817 1541026 1589315
50683 1589315 1640278 1694164 1752873 1818266 1891125 1971441 2058860 2152859 2253164 2360232 2474943
50672 2474943 2597690 2728033 2865143 3008076 3155424 3305100 3454706 3601888 3744210
50663 3744210 3878943 4003319 4115048 4212554 4294789 4360810 4409332 4438676 4447385 4435064 4402612
50652 4402612 4351826 4285265 4206713 4121188 4033740 3947940 3865636 3788031 3716543 3652421 3595688
50641 3595688 3544712 3496942 3450201 3403345 3355532 3304917 3248557 3183959 3110408 3028279 2937490
50630 2937490 2837700 2730190 2618463 2506234 2395279 2285899 2178953 2076475 1980272 1890821
50620 1890821 1807857 1731498 1662317 1600679 1546493 1499667 1460349 1428418 1402709 1381212 1362477
50609 1362477 1346794 1335503 1329012 1326069 1325360 1327323 1333620 1344954 1360078 1377119 1395405 1415662
50597 1415662 1438645 1463869 1489926 1516133 1543718 1574960 1611104 1651613 1695571 1742961 1794041
50586 1794041 1848297 1905033 1964663 2028407 2096887 2169966 2247724 2330470 2417756 2508430 2601756
50575 2601756 2697439 2794481 2891254 2986904 3081256 3172830 3258582 3336550 3407387 3472045 3529174
50564 3529174 3576483 3613773 3642796 3664515 3678375 3684358 3684068 3679410 3671604 3662094 3653237 3647226 3644962
50551 3644962 3646362 3650904 3657308 3663455 3667456 3668501 3666325 3660383 3650019 3634866 3614299 3586736 3550087
50538 3550087 3502816 3444371 3375015 3295913 3209097 3116646 3019772 2919204 2816532 2714439 2614991
50527 2614991 2518045 2422158 2327316 2236110 2151557 2074137 2001885 1933351 1869241 1810708 1757294
50516 1757294 1707912 1663143 1624911 1593800 1568074 1545767 1526638 1511623 1501435 1496332 1496308 1500601
50504 1500601 1507651 1516547 1528139 1543920 1563975 1586826 1611155 1636932 1664845 1695265 1728035 1762888
50492 1762888 1799721 1838448 1878721 1920107 1962835 2008043 2056493 2107004 2157074 2205504 2253627
50481 2253627 2303436 2355408 2409032 2464663 2523576 2586434 2652925 2722980 2797386 2877148 2963159
50470 2963159 3056640 3158907 3270279 3389921 3517155 3652310 3795863 3947203 4104591 4265901
50460 4265901 4429064 4592146 4753434 4911366 5064200 5209762 5345372 5467709 5572895
50451 5572895 5657275 5718351 5754831 5766033 5751818 5713153 5652310 5572394 5476842 5368985 5251559
50440 5251559 5127032 4999105 4873376 4755238 4647150 4549280 4462838 4391263 4337496 4301436
50430 4301436 4280830 4273318 4276563 4287623 4303692 4322663 4341539 4354831 4356048 4340664 4306615 4252546
50418 4252546 4177378 4081737 3968347 3840559 3701521 3554800 3404380 3253358 3103467 2956323
50408 2956323 2814267 2679519 2553343 2436455 2329389 2231895 2142880 2061714 1989104 1926072
50398 1926072 1872518 1827252 1788876 1756213 1728566 1706172 1689778 1679201 1673016 1670428 1672624 1681192
50386 1681192 1695711 1714176 1735544 1760498 1789612 1822041 1856478 1892406 1929824 1968563 2008529
50375 2008529 2050055 2093333 2137745 2182211 2225941 2268576 2309996 2350402 2390199 2429254 2466580
50364 2466580 2501332 2533874 2565228 2595597 2624234 2650774 2675982 2700812 2725489 2750049 2775309
50353 2775309 2802591 2832791 2866354 2903965 2946364 2993331 3043537 3095693 3149231 3203649 3257995
50342 3257995 3311464 3363671 3413467 3458115 3494855 3523078 3543746 3556618 3559302 3549502 3527005 3492784
50330 3492784 3447094 3389508 3320233 3240367 3151265 3054751 2953909 2852669 2754374 2661267 2575116
50319 2575116 2497335 2428302 2367563 2315285 2272908 2241766 2221531 2210618 2207727 2212210 2222853 2237033
50307 2237033 2251506 2263748 2272186 2275285 2271035 2257688 2234761 2202905 2163009 2116074 2063994 2009441
50295 2009441 1954207 1898218 1841114 1784529 1731647 1684303 1641439 1600897 1561911 1525186 1491145
50284 1491145 1459099 1428281 1399124 1373331 1352685 1337566 1326363 1316594 1306964 1298259 1292101 1289095
50272 1289095 1288541 1289544 1291786 1295375 1300728 1308790 1320738 1336916 1356350 1377648 1400143 1423793 1448240
50259 1448240 1472655 1496657 1520819 1545806 1571261 1596062 1619690 1642904 1666911 1692246 1718686
50248 1718686 1745851 1773290 1800024 1824618 1846013 1864192 1879820 1893344 1904535 1912819 1917862 1919761
50236 1919761 1918796 1915239 1909538 1902415 1894323 1884813 1873017 1858915 1843528 1827469 1810054 1790568 1769662
50223 1769662 1748306 1725754 1700104 1671050 1640609 1610554 1580503 1549433 1517889 1487396 1458525
50212 1458525 1430935 1404886 1381271 1360229 1340921 1322751 1305698 1289513 1273783 1259046 1246609
50201 1246609 1236683 1227817 1218881 1210807 1205463 1203243 1202544 1201339 1198706 1195118 1191831 1189913 1189444 1189635 1189882
50186 1189882 1190330 1191207 1192090 1192278 1191611 1190326 1188246 1184646 1179047 1171878 1164190 1156745 1149398 1141540 1133194
50171 1133194 1125345 1118716 1112674 1106275 1100187 1096286 1095025 1094476 1092680 1089746 1086812 1084268 1082451 1082828
50157 1082828 1086430 1091566 1095217 1096785 1098495 1101817 1105551 1108265 1110574 1113519 1116223 1116961 1115784 1114339
50143 1114339 1113586 1113152 1112584 1111582 1108990 1103206 1094146 1083720 1073852 1064798 1055763 1046281 1036425 1026461
50129 1026461 1016852 1008048 999700 990661 980403 969952 960675 952436 943798 933937 923597 914105 906245
50116 906245 900314 896469 894236 892102 888435 882969 876955 871744 867607 864081 860913 858232 856098 854383
50102 854383 852931 851292 848408 843227 835809 827267 818374 808822 798225 787250 777148 768506 761132
50089 761132 754848 749622 745005 740315 735631 731925 729796 728580 727274 725981 725922 727971 731465 734529 735511
50074 735511 734304 732412 731658 732625 734349 735556 736143 737423 741023 747588 756502 766732 777850 790028
50060 790028 803062 815868 827386 837867 848761 861266 875342 890190 905259 920555 936275
50049 936275 952382 968337 983182 996211 1007669 1018451 1028909 1038312 1045772 1051325 1055822 1060072
50037 1060072 1064514 1069461 1075010 1080623 1085311 1088545 1090876 1093489 1097133 1101580 1106135 1110631 1115709 1121904
50023 1121904 1128760 1135373 1141786 1149074 1157627 1166058 1172681 1177893 1184184 1193658 1206241 1220631 1236341
50010 1236341 1254060 1274150 1295469 1315971 1334278 1350529 1365956 1381958 1399477 1418715 1439043
49999 1439043 1459321 1478760 1497604 1516700 1536287 1555527 1573394 1589764 1605290 1620316 1634143
49988 1634143 1645391 1653110 1657748 1660954 1663936 1665799 1664070 1657344 1647081 1636121 1625648 1614419 1600940
49975 1600940 1585443 1569220 1552766 1535485 1517041 1498161 1479879 1462478 1445577 1428978 1413065
49964 1413065 1398463 1385674 1375015 1366499 1359612 1353563 1348089 1343833 1341571 1341244 1342081 1343506 1345361 1347333
49950 1347333 1348894 1350066 1351559 1353785 1356289 1358703 1361713 1366319 1372388 1378710 1384350 1389207 1393351 1396822
49936 1396822 1400383 1405395 1412052 1418244 1421253 1420528 1418006 1415446 1412289 1406748 1398462 1389145 1380659 1373379
49922 1373379 1366868 1361289 1357198 1354197 1350774 1345631 1338541 1329709 1318955 1305841 1290123 1271755 1250823
49909 1250823 1227725 1202863 1175926 1146202 1114184 1082224 1052782 1026367 1001909 978724 957149
49898 957149 937380 918746 900421 882183 864265 846962 830631 815627 802107 790154 779875
49887 779875 770808 761423 750201 737466 725386 715661 707799 700040 691429 682431 673969 666603 660554
49874 660554 655917 652557 649984 647511 644608 641232 637810 634843 632651 631567 632094 634459 638189 642519
49860 642519 647104 651874 656388 660012 662774 665380 668269 671284 674402 678056 682399 686939 691352 695981
49846 695981 700947 705451 708776 711636 715564 720944 726424 730519 733194 735557 738511 742285 747087 753529
49832 753529 761989 771864 782009 792084 803083 816286 832009 849774 869373 891113 915091 940861
49820 940861 968018 996673 1027115 1059179 1091975 1123992 1153577 1179890 1203574 1226190 1248821
49809 1248821 1271302 1292685 1312197 1329992 1347346 1365892 1386092 1406554 1425246 1440988 1453137
49798 1453137 1460406 1461333 1455902 1445535 1431246 1412843 1390107 1363625 1334151 1302262 1269047 1235942
49786 1235942 1203353 1170573 1137548 1105409 1074553 1043735 1012247 981604 953592 927737 902508
49775 902508 878224 856786 838844 823153 808768 795995 784674 773269 760649 747761 736424
49764 736424 726973 717974 708233 698535 691009 686668 683875 679835 673657 667173 662411 659373 657069 655552
49750 655552 655429 655924 655202 652734 650041 648845 649486 651143 652561 652475 650502 647964 646993 648542 651812 655405
49734 655405 658065 658600 656557 653274 650993 650458 650463 650032 649740 650302 651091 651021 650090 649237 649173 649860 650681 650777 649960
49715 649960 649494 651145 655152 660122 665311 671711 680164 689661 698717 707538 717492 729025 741404 754332
49701 754332 768544 784731 802723 821976 842319 864073 887677 913076 939310 964983 989399
49690 989399 1012802 1035186 1055454 1072388 1086137 1098233 1110304 1123085 1136285 1148984 1160383
49679 1160383 1170458 1179655 1187906 1194433 1198477 1199364 1195725 1185874 1169665 1149156 1126798 1103834 1080972
49666 1080972 1059229 1038914 1018854 998163 978123 960741 945913 931625 916838 902560 889944
49655 889944 878770 868266 858244 849014 841095 835313 832220 831007 829813 827432 824030 820107 815809
49642 815809 811679 809041 808826 810517 812823 814912 816519 817360 817080 815607 813241 810627 808854 809067 811546
49627 811546 815300 818831 821244 822686 824106 826617 830572 835035 838489 840274 841055 841790 842690 843310 843212 842354
49611 842354 841210 840703 841670 844144 847412 850788 853915 856362 857671 858189 859249 861870 865469 868375 869592
49596 869592 869772 870389 872148 874244 875238 874639 873445 872979 873492 874227 874546 874449 874125 873652 873148 872677 872011 871065
49578 871065 870503 871176 872891 874546 875684 877009 878991 880831 881460 880983 880420 880472 881164 882362 884018 886062
49562 886062 888569 891828 895839 900038 903940 907862 912608 918703 926292 935384 945586 955934 965643 974979
49548 974979 984819 995365 1005829 1015488 1024678 1034616 1046403 1060152 1074909 1089571 1104080 1119501
49536 1119501 1136724 1155502 1175090 1195326 1216456 1238282 1260455 1283604 1309209 1337931 1368592
49525 1368592 1399269 1429133 1458910 1489867 1522718 1557305 1593021 1629557 1667457 1707938 1751951
49514 1751951 1799277 1848587 1898476 1948556 1999581 2052607 2108096 2165794 2225119 2285408 2346129
49503 2346129 2407447 2470486 2536213 2603925 2671580 2738047 2804299 2871770 2940176 3007760 3073187
49492 3073187 3136273 3197129 3255626 3311719 3365358 3415936 3462582 3505086 3543768 3578288 3607451
49481 3607451 3630469 3647642 3659486 3666039 3667584 3665328 3660602 3653688 3643952 3630856 3614599 3596291
49469 3596291 3577908 3561512 3547903 3536492 3526874 3519807 3515932 3514365 3513847 3515037 3520300 3531018 3546185
49456 3546185 3564076 3584386 3608007 3635195 3664700 3694652 3723996 3753031 3782615 3812800 3842438
49445 3842438 3870362 3896598 3921721 3945006 3963987 3976254 3981283 3980337 3975020 3966149 3953395 3935465
49433 3935465 3910868 3879013 3840510 3796293 3746831 3692434 3633844 3571835 3506367 3436796 3363164
49422 3363164 3286981 3210442 3134874 3059985 2984631 2908303 2831801 2756480 2683148 2612009 2543344
49411 2543344 2477600 2414757 2354148 2295070 2237181 2180376 2125085 2072835 2025567 1983693 1945409
49400 1945409 1908491 1872310 1837711 1805652 1776704 1751148 1728497 1707303 1686326 1665738 1646469
49389 1646469 1628851 1612808 1598775 1587080 1576673 1565940 1554813 1544681 1536108 1528210 1520692 1514937
49377 1514937 1512224 1512073 1513141 1514622 1516014 1516862 1518012 1521953 1530236 1541219 1551950 1562076 1574250
49364 1574250 1590720 1610957 1633104 1656557 1682296 1711052 1741460 1769919 1792492 1807517 1816346
49353 1816346 1821348 1823865 1824704 1825632 1828706 1834259 1841131 1849089 1859447 1872776 1887583 1902389 1918061
49340 1918061 1936717 1958876 1982935 2007253 2031584 2056340 2081394 2106014 2129521 2151730 2173040
49329 2173040 2194116 2215166 2235505 2254215 2271313 2287896 2305009 2322771 2340896 2359602 2379387
49318 2379387 2399851 2419442 2436911 2452911 2469766 2489642 2513180 2539699 2568082 2597229 2626277
49307 2626277 2655051 2684275 2715024 2748033 2783580 2821511 2860930 2900383 2939199 2978498 3020166
49296 3020166 3064808 3111417 3159061 3208023 3258957 3311704 3365562 3420250 3476061 3533422 3592905
49285 3592905 3655524 3722325 3793444 3867803 3943901 4020922 4099198 4179808 4263686 4350986 4441150
49274 4441150 4533539 4628000 4724887 4824512 4926425 5029317 5131968 5234345 5337278 5440909
49264 5440909 5544213 5646639 5749436 5854159 5960076 6064339 6164907 6262075 6356571 6447276
49254 6447276 6531807 6608760 6678369 6741182 6796942 6844872 6884456 6915738 6939106 6954845 6962929
49243 6962929 6963480 6957573 6947133 6933658 6917181 6896849 6872370 6844718 6815736 6787468 6761630 6739023
49231 6739023 6719195 6700883 6683131 6666222 6651760 6641804 6637577 6638663 6643467 6650647 6660261 6673672
49219 6673672 6692347 6716363 6743793 6771820 6799006 6826322 6855437 6886172 6916262 6943407 6966542
49208 6966542 6985034 6997788 7003746 7002467 6993661 6976949 6952739 6922546 6887419 6846543 6798257 6742063
49196 6742063 6678806 6609341 6534213 6454514 6371783 6286645 6198405 6106608 6012602 5919097 5828312
49185 5828312 5740679 5655089 5570223 5485788 5402650 5321944 5244244 5169563 5097652 5028167 4960993
49174 4960993 4896719 4836218 4779379 4724842 4671657 4620613 4573021 4528579 4485613 4443443 4403418
49163 4403418 4367217 4334895 4305037 4276275 4248214 4221237 4195854 4172155 4149763 4128404 4108388
49152 4108388 4090235 4073897 4058683 4043974 4029650 4015933 4003160 3991641 3981375 3971952 3963102 3955119
49140 3955119 3948340 3942567 3937731 3934931 3935742 3940241 3946580 3953002 3959755 3968564 3980662 3995752 4012534
49127 4012534 4029794 4047121 4064857 4083321 4102064 4120227 4137783 4156130 4177143 4201670 4228974
49116 4228974 4257452 4285939 4314555 4344356 4376212 4410325 4446902 4486500 4528960 4572510 4615145
49105 4615145 4656952 4700085 4746205 4794825 4844420 4894239 4944600 4996262 5050116 5106785 5165914
49094 5165914 5226367 5287568 5349963 5413795 5478267 5542691 5607605 5673662 5740042 5805115 5868332
49083 5868332 5930119 5990041 6046419 6098051 6145188 6188491 6228177 6264730 6299309 6332449 6363121
49072 6363121 6390282 6415003 6439833 6466006 6492282 6516772 6538970 6559634 6579588 6599392 6619490
49061 6619490 6639612 6658332 6674272 6687798 6700693 6714100 6727713 6741173 6755022 6769633 6784224
49050 6784224 6797957 6811253 6824819 6837893 6848932 6857967 6866911 6877164 6888114 6898485 6908221 6918324
49038 6918324 6929580 6942106 6955578 6969205 6981787 6992481 7001414 7009415 7017424 7026316 7036572 7047720
49026 7047720 7058743 7069594 7081746 7096537 7113447 7130751 7147480 7163867 7180152 7196038 7211413
49015 7211413 7226663 7241892 7256557 7270309 7283629 7297065 7310205 7322013 7332019 7340530 7347525 7351991
49003 7351991 7352800 7349935 7344161 7335474 7322728 7305277 7284349 7261940 7238457 7212285 7181655 7146273
48991 7146273 7107223 7066242 7025381 6986288 6948882 6911208 6871271 6828841 6785128 6741358 6698386
48980 6698386 6657161 6618524 6582362 6547532 6512792 6477711 6443004 6410469 6382243 6359317 6340610
48969 6340610 6323881 6307615 6291782 6277018 6263698 6251882 6241733 6233716 6228464 6226252 6226360 6227154 6227211
48956 6227211 6226467 6226038 6226973 6229225 6231584 6232519 6231463 6229444 6228077 6227743 6227271 6225593 6222776 6218916 6213018
48941 6213018 6204172 6193240 6181995 6170805 6158443 6144108 6128215 6110892 6091195 6068654 6044545
48930 6044545 6020524 5996512 5970818 5942219 5911230 5879342 5847424 5814890 5780145 5741898 5700107
48919 5700107 5655610 5608999 5560273 5509552 5457547 5405088 5352537 5299921 5247203 5194232 5140897
48908 5140897 5087732 5036037 4986894 4940153 4894681 4849693 4805803 4764859 4728655 4697514 4670162
48897 4670162 4645262 4622948 4604404 4590012 4578672 4569268 4562197 4558942 4560528 4566821 4577039 4590469
48885 4590469 4606920 4626803 4650558 4677553 4705735 4732951 4758820 4785064 4813924 4846337 4881504
48874 4881504 4917848 4954246 4990512 5027130 5064836 5104449 5146615 5191270 5237467 5284229 5331654
48863 5331654 5380839 5432610 5486615 5541795 5597397 5653456 5710607 5769593 5830640 5893177 5956455
48852 5956455 6020653 6087002 6156568 6229128 6303568 6379245 6456594 6536363 6618434 6701699 6785193
$$ [...]
##END NTUPLES=NMR SPECTRUM
##END=
