
##TITLE=AC1205_HSMAH12053_7160751_hP5IrhI0yX
##JCAMPDX= 6.0         $$ Bruker NMR JCAMP-DX V2.0
##DATA TYPE= NMR SPECTRUM
##DATA CLASS= NTUPLES
##ORIGIN= BRUKER
##OWNER= Administrator
$$ 1.72 TOPSPIN		Version 2.1
$$ 2012-12-01 01:25:32.060 -0500  Administrator@X
$$ Compression mode = diff/dup
##.OBSERVE FREQUENCY= 400.02188249412
##.OBSERVE NUCLEUS= ^1H
##.ACQUISITION MODE= SIMULTANEOUS (DQD)
##.ACQUISITION SCHEME= undefined
##.AVERAGES= 8
##.DIGITISER RES= 22
##SPECTROMETER/DATA SYSTEM= spect
##.PULSE SEQUENCE= zg30
##.SOLVENT NAME= COFFEE_meoh
##.SHIFT REFERENCE= INTERNAL, COFFEE_meoh, 1, 14.98509
##AUDIT TRAIL= $$ (NUMBER, WHEN, WHO, WHERE, PROCESS, VERSION, WHAT)
$$ ##TITLE= Audit trail, TOPSPIN		Version 2.1
$$ ##JCAMPDX= 5.01
$$ ##ORIGIN= Bruker BioSpin GmbH
$$ ##OWNER= Administrator
$$ $$ E:\/data/COFFEE/nmr/AC1205_HSMAH12053_7160751_hP5IrhI0yX/10/pdata/1/auditp.txt
$$ ##AUDIT TRAIL=  $$ (NUMBER, WHEN, WHO, WHERE, PROCESS, VERSION, WHAT)
(   1,<2012-12-01 01:25:24.143 -0500>,<Administrator>,<X>,<go>,<TOPSPIN 2.1>,
      <created by zg
	started at 2012-12-01 01:24:24.667 -0500,
	POWCHK enabled, PULCHK disabled,
       configuration hash MD5:
       86 BA 57 50 F2 9D 5C 9B 26 00 A9 28 5F 66 2E 89
       data hash MD5: 64K
       35 4E 9A 60 E5 35 50 8B 4D A7 8E BD 6C F4 10 1B>)
(   2,<2012-12-01 01:25:26.988 -0500>,<Administrator>,<X>,<proc1d>,<TOPSPIN 2.1>,
      <Start of raw data processing
       efp LB = 0 FT_mod = 6 PKNL = 1 PHC0 = 0 PHC1 = 0 SI = 32K 
       data hash MD5: 32K
       3D F1 A1 13 E5 D3 83 57 3A E8 CD 67 BE EF 79 E6>)
(   3,<2012-12-01 01:25:27.460 -0500>,<Administrator>,<X>,<proc1d>,<TOPSPIN 2.1>,
      <pk PHC0 = 97.33887 PHC1 = 0 
       data hash MD5: 32K
       BA BC D3 63 1E 3C EB 4F BC AD 02 7E AC E5 D9 FD>)
(   4,<2012-12-01 01:25:27.704 -0500>,<Administrator>,<X>,<proc1d>,<TOPSPIN 2.1>,
      <abs ABSG = 1 
       data hash MD5: 32K
       A1 86 2A B0 F4 43 EB FF 63 DE DC FA ED BA 4B 1A>)
(   5,<2012-12-01 01:25:27.841 -0500>,<Administrator>,<X>,<proc1d>,<TOPSPIN 2.1>,
      <abs ABSG = 2 
       data hash MD5: 32K
       2E 3B 23 63 C5 5F 10 D3 52 3E 9E C2 AA 60 B7 DF>)
(   6,<2012-12-01 01:25:27.993 -0500>,<Administrator>,<X>,<proc1d>,<TOPSPIN 2.1>,
      <abs ABSG = 3 
       data hash MD5: 32K
       D5 B7 68 C6 59 24 BB 18 03 58 DF 06 A8 C8 A0 72>)
(   7,<2012-12-01 01:25:28.146 -0500>,<Administrator>,<X>,<proc1d>,<TOPSPIN 2.1>,
      <abs ABSG = 4 
       data hash MD5: 32K
       AE B4 CC 0E 25 89 1C FD 84 5A 13 FC 0A B3 C8 09>)
(   8,<2012-12-01 01:25:28.283 -0500>,<Administrator>,<X>,<proc1d>,<TOPSPIN 2.1>,
      <abs ABSG = 5 
       data hash MD5: 32K
       58 F4 30 EE 95 D0 9D 9E EC C0 FE 2F 7E D8 DE 90>)
$$ ##END=
$$ 
$$ $$ hash MD5
$$ $$ 41 E0 44 97 4B 68 EF FC B3 5F B0 47 29 FA 7E 97
##$RELAX= 
##$RELAX= 
##$RELAX= 
##$RELAX= 
##$RELAX= 
##$RELAX= 
##$RELAX= 
$$ Bruker specific parameters
$$ --------------------------
##$DU= <E:\>
##$EXPNO= 10
##$NAME= <AC1205_HSMAH12053_7160751_hP5IrhI0yX>
$$ [...]
150 150 150 150 150 150 150 150
##$TP07= 0
##$TPNAME0= <>
##$TPNAME1= <>
##$TPNAME2= <>
##$TPNAME3= <>
##$TPNAME4= <>
##$TPNAME5= <>
##$TPNAME6= <>
##$TPNAME7= <>
##$TPOAL= (0..7)
0.5 0.5 0.5 0.5 0.5 0.5 0.5 0.5
##$TPOFFS= (0..7)
0 0 0 0 0 0 0 0
##$TUNHIN= 0
##$TUNHOUT= 0
##$TUNXOUT= 0
##$USERA1= <user>
##$USERA2= <user>
##$USERA3= <user>
##$USERA4= <user>
##$USERA5= <user>
##$V9= 5
##$VALIST= <valist>
##$VCLIST= <CCCCCCCCCCCCCCC>
##$VD= 0
##$VDLIST= <DDDDDDDDDDDDDDD>
##$VPLIST= <PPPPPPPPPPPPPPP>
##$VTLIST= <TTTTTTTTTTTTTTT>
##$WBST= 1024
##$WBSW= 4
##$XGAIN= (0..3)
0 0 0 0
##$XL= 0
##$YL= 0
##$YMAX_a= 674939
##$YMIN_a= -570026
##$ZGOPTNS= <>
##$ZL1= 120
##$ZL2= 120
##$ZL3= 120
##$ZL4= 120
##$ABSF1= 14.98509
##$ABSF2= -5.573092
##$ABSG= 5
##$ABSL= 3
##$ALPHA= 0
##$AQORDER= 0
##$ASSFAC= 0
##$ASSFACI= 0
##$ASSFACX= 0
##$ASSWID= 0
##$AUNMP= <proc_prof1d_extract_pilot.lims>
##$AXLEFT= 0
##$AXNAME= <>
##$AXNUC= <1H>
##$AXRIGHT= 0
##$AXTYPE= 0
##$AXUNIT= <>
##$AZFE= 0.1
##$AZFW= 0.1
##$BCFW= 0
##$BC_mod= 0
##$BYTORDP= 0
##$COROFFS= 0
##$CY= 15
##$DATMOD= 1
##$DC= 0
##$DFILT= <>
##$DTYPP= 0
##$F1P= 0
##$F2P= 0
##$FCOR= 0.5
##$FTSIZE= 32768
##$FT_mod= 6
##$GAMMA= 0
##$GB= 0
##$INTBC= 1
##$INTSCL= 1
##$ISEN= 128
##$LB= 0
##$LEV0= 0
##$LPBIN= 0
##$MAXI= 10000
##$MC2= 0
##$MEAN= 0
##$ME_mod= 0
##$MI= 0
##$NCOEF= 0
##$NC_proc= -8
##$NLEV= 6
##$NOISF1= 0
##$NOISF2= 0
##$NSP= 0
##$NTH_PI= 0
##$NZP= 0
##$OFFSET= 14.98509
##$PC= 1
##$PHC0= 97.33887
##$PHC1= 0
##$PH_mod= 1
##$PKNL= yes
##$PPARMOD= 0
##$PPDIAG= 0
##$PPIPTYP= 0
##$PPMPNUM= 2147483647
##$PPRESOL= 1
##$PSCAL= 4
##$PSIGN= 0
##$PYNMP= <proc.py>
##$REVERSE= no
##$SF= 400.02
##$SI= 32768
##$SIGF1= 0
##$SIGF2= 0
##$SINO= 400
##$SIOLD= 32768
##$SPECTYP= <>
##$SREGLST= <1H.CDCl3>
##$SSB= 0
##$STSI= 32768
##$STSR= 0
##$SW_p= 8223.68421052631
##$SYMM= 0
##$S_DEV= 0
##$TDeff= 65536
##$TDoff= 0
##$TI= <>
##$TILT= no
##$TM1= 0
##$TM2= 0
##$TOPLEV= 0
##$USERP1= <user>
##$USERP2= <user>
##$USERP3= <user>
##$USERP4= <user>
##$USERP5= <user>
##$WDW= 1
##$XDIM= 32768
##$YMAX_p= 475224926
##$YMIN_p= -717143
##$CURPLOT= <Network HP LaserJet P1505>
##$CURPRIN= <$Network HP LaserJet P1505>
##$DFORMAT= <normdp>
##$LAYOUT= <+/1D_H.xwp>
##$LFORMAT= <normlp>
##$PFORMAT= <normpl>
##$SURQMSG= 1
$$ End of Bruker specific parameters
$$ ---------------------------------
##NTUPLES= NMR SPECTRUM
##VAR_NAME=  FREQUENCY,     SPECTRUM/REAL,   SPECTRUM/IMAG
##SYMBOL=    X,             R,               I
##VAR_TYPE=  INDEPENDENT,   DEPENDENT,       DEPENDENT
##VAR_FORM=  AFFN,          ASDF,            ASDF
##VAR_DIM=   32768,         32768,           32768
##UNITS=     HZ,            ARBITRARY UNITS, ARBITRARY UNITS
##FACTOR=    0.250966925370066, 1,           1
##FIRST=     8223.43324360094, -64160,       -132917
##LAST=      0,             -261683,         -104307
##MIN=       0,             -717143,         0
##MAX=       8223.43324360094, 475224926,    0
$$ Real data points
##PAGE= N=1
##DATA TABLE= (X++(R..R)), XYDATA
$$ [...]
19465i201p9119A99293b18168m2919G9015a88997h0496j24260c7639C6968K2142
19454E9110g5125a5868j21770A98027c99644a17581B16211e7511A52497a80051
19443C73259i6718F9146a41801E8384L0735a07183B46111a47009G6795c59523
19432c37444e1762p6374o8898J6216A04810J7972j3575m9169f8594J5334A74241
19420b80433A51002h6739j7515C05356A02609b60956D5184g2594C41302F3936
19409i5353A70521A1757b86234A26840J31669c53098R1691B77896A10831d37076
19398c9803A78342a98263B34642c04410i4489a0722G1194J2088a55822E6823J14924
19387A71747F9633g2353k99986A06883A4466b36134O6751J0329j36937f3043r438
$$ plain form
19465 -9201 -88320 199293 -218168 -261087 79015 -188997 -80496 -204756 -37639 36968 59110
19454 59110 -75125 -15868 -137638 198027 -399644 -117581 216211 -57511 152497 -180051
19443 373259 -96718 69146 -141801 58384 89119 -107183 246111 -147009 76795 -359523
19432 -337444 -51762 -128136 -197034 -180818 104810 122782 109207 60038 -68594 -53260 174241
19420 -280433 151002 -86739 -104254 305356 102609 -260956 45184 -72594 341302 63936
19409 -95353 170521 11757 -286234 126840 258509 -353098 -261407 277896 110831 -437076
19398 -39803 178342 -198263 234642 -304410 -94489 -10722 71194 83282 -155822 56823 171747
19387 171747 69633 -72353 -372339 106883 14466 -236134 -169383 -159054 -295991 -63043 -72481
19376g2481k07129i8117E2953g265k0843H221a37253j00692B67908H6304h390
19364b27819n6221d0093k7457n6541n1071d410m5844I2076A3790c58476D7015
19352a34365F6573j0626b58714I752b85777I8574a61103B033a36769D8199J08329
19341A56528C9842g8875A31611b39930C4248K27897c9189A25656a21833e5366
19330a43600b979m7495B08355D9333b93627k43229F7545J04439p5145A411c81105
19318b46204j53017q1890C08719D7811b03407j83762f0242j44015l8867R9840
19308a43284L5620k2924B42628d20285a39523f9388l30092J28324c7414k0923
19298e8337j94160a8284j08744d4257A15123h7462j6343I4413K46512A27129N2647
$$ plain form
19376 -72481 -279610 -98117 52953 -7265 -28108 8221 -137253 -237945 267908 86304 -8390
19364 -227819 -284040 -40093 -67550 -124091 -175162 -4410 -50254 92076 13790 -358476 47015
19352 -134365 66573 55947 -258714 9752 -285777 98574 -161103 2033 -136769 48199 156528
19341 156528 39842 -78875 131611 -239930 34248 262145 -39189 125656 -121833 -55366
19330 -143600 -2979 -50474 208355 49333 -293627 -536856 67545 171984 96839 1411 -381105
19318 -246204 -399221 -481111 308719 47811 -203407 -387169 -60242 -204257 -243124 -143284
19308 -143284 -107664 -130588 242628 -420285 -139523 -69388 -399480 -271156 -37414 -58337
19298 -58337 -252497 -18284 -127028 -44257 115123 -87462 -103805 94413 340925 127129 179776
19287A79776G7296K1373g0481j51931O7252R727a0123J565l1592r3851b7581k6112
19275e3693H85a36959k7128Q1450j18696G7824E328a81062n4874C0571f2601k630
19263f5231k43038C8047a36706l7551f9583G3919g4921a6616l66534a22471M72
19252a21999M0863l7901G0654a8646Q866A44355J4639a84450j22705j49658a74390
19240B1981d46139E7601A445b21918k9728i1210j04940j1015A32852f1946P685
19229e4261A83923d92499J90698E0239d557n30379f7973n7274C1927c16504J03456
19218b13048d0284A2413g9155D3724J485a08000r1486A10488a17698j28395P738
19207b38355b1479j6992l30821A02483c6022l206B45944a88324B56838b05087
$$ plain form
19287 179776 77296 98669 -70481 -222412 -155160 -145433 -10123 -8558 -40150 -134001 -27581 -53693
19275 -53693 885 -136959 -164087 -82637 -201333 77824 5328 -181062 -235936 30571 -62601 -65231
19263 -65231 -308269 38047 -136706 -174257 -69583 73919 -74921 -16616 -383150 -122471 -121999
19252 -121999 -81136 -119037 70654 -18646 -9780 144355 158994 -184450 -307155 -456813 -174390
19240 21981 -446139 57601 1445 -221918 -251646 -91210 -196150 -207165 132852 -61946 -54261
19229 -54261 183923 -492499 -301801 50239 -4557 -534936 -67973 -125247 31927 -316504 -213048
19218 -213048 -40284 12413 -79155 43724 45209 -108000 -199486 110488 -117698 -246093 -238355
19207 -238355 -21479 -38471 -369292 102483 -36022 -39228 245944 -188324 256838 -205087
19196H6546P8018b4224k30676p7433a48159j38790B63041e9971k81224B2539i815
19184a27463j48286R384A0562a41414M2749K331L8123A1410L7482d47202a07372
19172E3412g9204J3323A13674E3032a26551n9823J9621e0493D8509c14031B3174
19160a90773j71625A42367c9119k7343C5788J17490c86030B7780Q7599L32823
19150D48202c30207p996B54042a42735k915f964A31907a74827r7458j72437g880
19138C4304b57385A45279J7219d2529l01090a31503E0013L56227a98906D54094
19127e680k20080a2618H0306b11384K7755B9861b96429B88594A0340J5176h0239
19115D9352k567f4043B90950A37266k9767a72302P8216j26395J8104j54085a10184
$$ plain form
19196 86546 164564 -24224 -254900 -332333 -148159 -286949 263041 -59971 -341195 22539 -9815
19184 -127463 -275749 -266365 10562 -141414 -98665 -96334 -58211 11410 48892 -447202 -107372
19172 53412 -79204 -65881 113674 53032 -126551 -186374 -166753 -50493 48509 -314031 23174
19160 -190773 -362398 142367 -39119 -66462 35788 153278 -386030 27780 115379 448202
19150 448202 -330207 -338203 254042 -142735 -145650 -6964 131907 -174827 -272285 -444722 -7880
19138 34304 -257385 145279 162498 -42529 -343619 -131503 50013 406240 -198906 454094
19127 -5680 -225760 -12618 80306 -211384 -183629 29861 -296429 288594 10340 25516 -80239
19115 49352 46785 -64043 290950 137266 107499 -172302 -94086 -220481 -202377 -356462 -110184
19103c68125J52417J03564j46271g2661G3311d4053E6318L9760H783i5716b7467
19091c0116I5416a08029j8001m905j02857m3152a2340l53798a63937J7606A73892
19079a1263B18146A02300K6800E7326k4904A0720e6337j84661b5163H8750b49392
19067b27445j12557A75461b28635F1615B1995d811r9977g51k13523b669A33997
19055A42961a53622b913B3569a25927A57131C1880J51305b67238A25242a63316
19044f845o0921k1954j00231B95830f2794j56184H59d385C86032a55360F708a36022
19031c15626A1507K7324c41998A10278N5599H1213d1983l20762B171K82413g5619
19019h9958B99796I767J37809k8391b00517O7811j30494b4565l27186M2398g6929
$$ plain form
19103 -368125 -215708 -112144 -258415 -72661 73311 -44053 56318 96078 8783 -95716 -27467
19091 -30116 95416 -108029 -126030 -130935 -233792 -276944 -12340 -366138 -163937 -146331 173892
19079 -11263 218146 102300 129100 57326 32422 10720 -56337 -240998 -25163 88750 -249392
19067 -227445 -340002 175461 -228635 61615 21995 -4811 -104788 -751 -214274 -2669 133997
19055 142961 -153622 -2913 23569 -125927 157131 31880 183185 -267238 125242 -163316
19044 -6845 -67766 -89720 -189951 295830 -62794 -218978 859 -4385 386032 -155360 6708 -136022
19031 -315626 11507 38831 -341998 110278 165877 81213 -41983 -362745 2171 284584 -75619
19019 -89958 299796 9767 147576 119185 -200517 -132706 -263200 -24565 -351751 -309353 -76929
19007i160B87021F7207J09681m9396n7563J2729a97101i2796j69226P3227J6245
18996a72550f0777B4697a22953M6869a1212n6540H6181O9191l1683c57854a34934
18984A18431i9763A38896c19750h2653k37369A47355N0520i5876B7370n083R0129
18973A12416b17991a0294A00717N64378O9940C23287O1371A72312a83740B2883
18962C0988J84240a71018G3389b01356d9340l23981J73265q9744M5038J18372
18952a26390j68299c7540k90174e666k27060A86049d2944A2831a04179r0265O9921
18941a24523B50778b78733k0095e5493A0193P8181M4361a86112A65572a12113
18930E0893a50379F6980c2044j8083A49211n3869K16145c07840B52938A16113
$$ plain form
19007 -9160 287021 67207 176888 127492 69929 82658 -197101 -92796 -262022 -188795 -172550
18996 -172550 -60777 24697 -122953 -76084 -11212 -67752 86181 155372 123689 -357854 -134934
18984 118431 -99763 138896 -319750 -82653 -320022 147355 197875 -95876 27370 22287 112416
18973 112416 -217991 -10294 100717 665095 735035 323287 384658 172312 -183740 22883
18962 30988 215228 -171018 73389 -201356 -49340 -373321 -200056 -289800 -244762 -126390
18952 -126390 -294689 -37540 -327714 -5666 -232726 186049 -42944 12831 -104179 -194444 -124523
18941 -124523 250778 -278733 -298828 -55493 10193 88374 132735 -186112 165572 -112113
18930 50893 -150379 66980 -32044 -50127 149211 95342 311487 -307840 252938 116113
18919B52651a41717l3843o6968g7034j04631B6106a84575P9336A06898a31680
18908a15051J2513B34131L14613A91323J23919g2109l1849I1727d512I8349c2172
18896a38103I0197B2374c02095h1220l55747A76758a33194h102A11437j6253c43663
18884a26830j61333e486o8679G5598i9473E8440Q7518h9141l3607e3064r978j60393
18872b23435h1798j36594e7052E4980a01612c3686q5654b7280j33422b3541G6820
18860i5141c8704n27840A48300g3073N392j25486O6952B58255c09924I2261b51415
18848g5232A12002N8343l7503B8640J16619J60127G2606K5324K43239f2363l2236
18837i4599M1793A92772i0340j36349M0030j0466j46346A06976a64988b6857k16329
$$ plain form
18919 252651 -141717 -175560 -242528 -77034 -181665 26106 -184575 -105239 106898 -131680
18908 -115051 -102538 234131 548744 191323 315242 -72109 -103958 91727 -4512 98349 -32172
18896 -138103 90197 22374 -302095 -81220 -436967 176758 -133194 -8102 111437 95184 -343663
18884 -126830 -288163 -5486 -74165 75598 -99473 58440 145958 -89141 -122748 -53064 -63042 -223435
18872 -223435 -81798 -218392 -57052 54980 -101612 -33686 -119340 -27280 -160702 -23541 76820
18860 -95141 -38704 -566544 148300 -73073 -67681 -193167 -126215 258255 -309924 92261 -251415
18848 -75232 112002 170345 132842 28640 145259 305386 72606 97930 341169 -62363 -94599
18837 -94599 -52806 192772 -90340 -226689 -186659 -197125 -343471 106976 -164988 -26857 -243186
18826b43186A17185b70570H4593J53447c24544C318b16481j88901c6A62060c65716
18814i2947B05276n1838c6124J972l45024B83633i9302G4537K32326m3709k0654
18803B42500A21167b60566L4241l6799M6161n4713e1859n9732B08538l0368o1624
18792A16546M765n3891b06657P9884C1310b08895a043A18056B6916a6524B87282
18780g2168A12485D6775h3770H9297e8473A64922b11892J02221E521a43722G27
18768b5202B24916b58437c9715B48032A452J08762J59275C5398a39690B05277
18757A05433D5748a19585f606k80078B8288a91194j05950B88489h0294n7501m5867
18746a83662R792k61260B5418D776K74234a60143j40343j05031B46935b08479
$$ plain form
18826 -243186 117185 -270570 84593 238040 -324544 3318 -216481 -405382 -36 162060 -365716
18814 -92947 205276 153438 -36124 -34152 -379176 283633 -99302 74537 306863 263154 242500
18803 242500 121167 -260566 -226325 -263124 -216963 -271676 -51859 -111591 208538 178170 116546
18792 116546 121311 67420 -206657 -126773 31310 -208895 -1043 118056 26916 -16524 287282
18780 -72168 112485 46775 -83770 89297 -58473 164922 -211892 -109671 5521 -143722 727
18768 -25202 224916 -258437 -39715 248032 1452 110214 269489 35398 -139690 205277
18757 105433 45748 -119585 -6606 -286684 28288 -191194 -297144 288489 -80294 -137795 -183662
18746 -183662 -173870 -435130 25418 4776 279010 -160143 -300486 -405517 246935 -208479
18735A90135q7341g2015q1626d5574j65714A82463c54371A8040J3553b64930G717
18723e79945a86230B55365b426m4933j65026h015A47006b73225i5726K5976j3832
18712h3582k1245a7764E2339a04546j94889F1637a35853m9870A0572a53020e6131
18700h4448j78534C89626C0748A1795a70682R235b5352q2420j87695A10207M915
18689A15122b98504g6263A24049c28836g2230m9568C55332a0170n8819J0064A25162
18677a01947G118J78986a01834k14655a3530B12195E3922b99628P2408A27488
18666a09197j05670A2681L9754H402a06717I2601a46327L9413q6653p5327A25282
18654D7277K96537A09768f6836A5919b5715A86774j8966C5917f7299l8209D8429
$$ plain form
18735 190135 102794 -72015 -153641 -45574 -211288 182463 -354371 18040 31593 -264930 7717
18723 -579945 -186230 255365 -2426 -47359 -212385 -8015 147006 -273225 -95726 -69750 -83582
18712 -83582 -104827 -17764 52339 -104546 -299435 61637 -135853 -185723 10572 -153020 -56131
18700 -84448 -262982 389626 30748 11795 -170682 -161447 -25352 -107772 -295467 110207 115122
18689 115122 -298504 -76263 124049 -328836 -72230 -121798 355332 -10170 -68989 -58925 125162
18677 -101947 7118 186104 -101834 -316489 -13530 212195 53922 -299628 -227220 127488
18666 -109197 -214867 12681 52435 8402 -106717 92601 -146327 -106914 -193567 -268894 125282
18654 47277 343814 109768 -66836 15919 -25715 186774 167808 35917 -67299 -105508 48429
18642A33342b04400a7918N7j91320M9565f3996l5626C265L5136a22360E3168K9563
18630H2731a90790H2410j9154M9335N1264b06370e8273j02351j98277h0027Q507
18619g1520o9698c0718r3623N145A35169a63179B0814f6170E2055b48626K2628
18608b25998O0990k05023a37345E2269b60115f4594k36995D0731R1042b30353
18597b6713B96625a23302M0372j14933B6460K9071L5223B3456J84174b52601b4823
18585A47033h3373F9426a43380e1171j42861a2400r9781n0258C693e2205J7952
18574c4253l63247d9789C3332K33550b00035C9485b22945b5084k71357J02220
18564a94221r0353p6212J52732p8342j88787a07922C2396O1423a19227K7729A7095
$$ plain form
18642 133342 -204400 -17918 -17861 -209181 -159616 -63996 -99622 3265 38401 -122360 53168 82731
18630 82731 -190790 82410 63256 112591 163855 -206370 -58273 -160624 -358901 -80027 -71520
18619 -71520 -141218 -30718 -124341 -119196 135169 -163179 20814 -66170 52055 -248626 -225998
18608 -225998 -165008 -370031 -137345 52269 -260115 -64594 -301589 40731 131773 -230353
18597 -26713 296625 -123302 -82930 -197863 26460 55531 90754 23456 207630 -252601 -24823
18585 147033 -83373 69426 -143380 -51171 -194032 -12400 -112181 -162439 3693 -52205 -34253
18574 -34253 -397500 -49789 33332 266882 -200035 39485 -222945 -25084 -296441 -194221
18564 -194221 -284574 -360786 -208054 -286396 -475183 -107922 32396 93819 -119227 -91498 17095
18552A9932Q9308a77734C2695a36618R067A62444a72938Q4464B71592h2561j09608
18541a92169F8762A485c01842J34222d8453m3190j15795F0068J7430i1338A84607
18529G1978i368j15333e5946H8639K8402j7321a45929D3056c50848A10296o86
18518A09610b55027J6463i7245l52669b1524B37401a64672j7780e1653q8927B51082
18506a7712k59756e1876A18152b18536g4259E09628f4321l01667a75408d6090
18495G0734L8288B5118b55380J1322q4527f7225A65451b46573j78743D44577j63520
18484B81057E5375b52613C1840P9744f7827A94246B6068b54104q0957E2539b08141
18472A2914a88116P4295l30919B60261a21496j4977A11555d22132I3909j5396
$$ plain form
18552 19932 109240 -177734 32695 -136618 -127551 162444 -172938 -88474 271592 -82561 -192169
18541 -192169 68762 1485 -301842 -167620 -48453 -91643 -207438 60068 77498 -91338 184607
18529 71978 -9368 -124701 -55946 88639 117041 99720 -145929 43056 -350848 110296 109610
18518 109610 -255027 -238564 -97245 -449914 -21524 237401 -164672 -182452 -51653 -140580 251082
18506 -17712 -277468 -51876 118152 -218536 -74259 509628 -64321 -365988 -175408 -46090
18495 70734 109022 25118 -255380 -244058 -328585 -67225 165451 -246573 -425316 444577 281057
18484 281057 55375 -252613 31840 111584 -67827 194246 26068 -254104 -335061 52539 -208141
18472 12914 -188116 -113821 -444740 260261 -121496 -136473 111555 -422132 93909 78513
18462G8513e3317r8035C3498N1409K6962a57523C33919H7160f1630n9864L9829
18451h1665H0359J32882a30577n884f4192f803j58272D4964M2552b07831g1641
18439A59768a7018C96486j32102i8514K0576B0145b15718I5120A1783b99991E682
18427A6825R6150a36660L241l9218k96181h5786j68001J6651j12240a13804F4568
18415C11097g3600E6118N0421d4580A24954a44911H8363h4402k68507B3535D092
18403c13938a53213D6634l505M7135j133B8757d9335A87432o6181O1046b05142
18391a50334A37336N4931J81401c45202i3125r1123c1800C6160b02496n1463L8817
18380b15142I0684K04727f879F2225a47012e2917o4152I995K62724a01159A56583
$$ plain form
18462 78513 -53317 -151352 33498 84907 111869 -157523 333919 87160 -61630 -121494 -81665
18451 -81665 80359 213241 -130577 -136461 -64192 -6803 -165075 44964 87516 -207831 -71641
18439 159768 -17018 396486 264384 -98514 -77938 20145 -215718 95120 11783 -299991 5682
18427 16825 112975 -136660 -133419 -172637 -468818 -85786 -253787 -237136 -349376 -113804 64568
18415 311097 -73600 56118 106539 -44580 124954 -144911 88363 -84402 -352909 23535 4092
18403 -313938 -153213 46634 43129 90264 89131 28757 -49335 187432 121251 182297 -205142
18391 -150334 137336 192267 373668 -345202 -93125 -184248 -31800 36160 -202496 -253959 -215142
18380 -215142 90684 295411 -6879 62225 -147012 -52917 -117069 9995 272719 -101159 156583
18368C45696j16979l8059a09602c5106J5713o4573p1161A1395b38781f5604k30033
18357b95637J40796I6527f8380A78817n5288d2180G9402f7237n428B48373j17446
18346A30927e15352A89005G0017a5855q5372A71321b87319a06529j91753A64484
18335g5099I0126a29217G4532b57872a1532D0732a63391A36009j1247f8635H9012
18323A89889B0232K79869I2902a3900A7219e654o6647p3948q328A36311J48578
18312B84889H2308J66808d5127A6660b06181C04522a06691c1096A64688a16910
18301c21334M6109f208E3462A586J18001n8015r623j3366a07038j53416b6738
18289g3960o7479A8618J51595J44445c89902H786a52613A25548e1446F2153a37210
$$ plain form
18368 345696 228717 190658 -109602 -35106 -19393 -83966 -155127 11395 -238781 -65604 -295637
18357 -295637 -154841 96527 -68380 178817 123529 -42180 79402 -67237 -72665 248373 130927
18346 130927 -515352 189005 70017 -15855 -101227 171321 -287319 -106529 -298282 164484
18335 -75099 90126 -129217 74532 -257872 -11532 40732 -163391 136009 124762 -68635 89012
18323 189889 20232 300101 92902 -13900 17219 -5654 -72301 -146249 -154577 136311 284889
18312 284889 82308 249116 -45127 16660 -206181 304522 -106691 -31096 164688 -116910
18301 -321334 -275225 -6208 53462 1586 119587 61572 51949 38583 -107038 -260454 -26738
18289 -73960 -141439 18618 170213 314658 -389902 8786 -152613 125548 -51446 62153 -137210
18277b8448H9019K2461f0506n8381d4520J0714m27829J83974h5586K7179m5188
18266a03595B23299e51976b28758A63452c61466e4495b1756A00407g7324j48567
18256b25891F47689b60094A52225C3006D039K8453R5909l6789a86472o0431J20978
18245a25925A18841c6125C08986a94935n5264a11856F2656J6935b7197A10221
18234b61850b7808G4127b04908O1464A76775B3130L11444i5633j10947a7219j63065
18223a80284k5132A28418a47524M202B156h1016C1054J76879i4890F0772c35895
18211D29783D7743b30932R9101B3927P2072J15537a51800I6772b56477F4590f933
18199c64554a12012B9662K07429d8504k01024F129J12765k8705b94525h7849m3542
$$ plain form
18277 -28448 89019 111480 -60506 -118887 -44520 -33806 -461635 -277661 -85586 -58407 -103595
18266 -103595 223299 -551976 -228758 163452 -361466 -54495 -21756 100407 -77324 -225891
18256 -225891 647689 -260094 152225 33006 4039 32492 128401 91612 -186472 -246903 -125925
18245 -125925 118841 -36125 308986 -194935 -250199 -111856 62656 79591 -27197 110221
18234 -261850 -27808 74127 -204908 -143444 176775 23130 334574 -95633 -206580 -17219 -180284
18223 -180284 -205416 128418 -147524 -143322 2156 -81016 31054 207933 -94890 60772 -335895
18211 429783 47743 -230932 -131831 23927 95999 211536 -151800 96772 -256477 64590 -6933
18199 -364554 -112012 29662 237091 -48504 -249528 6129 118894 90189 -294525 -87849 -131391
18188a31391B18461J12473a04091I1767a9455c139A64255b81987A66276b21F3912
18176B4708a40989o1531C40247b49269J2867A21120C6341E734b57503M8671B88492
18164a9383p5958l8666G819a16691A73471b54899a46B27721o5106C2118j0049
18153B2069b12433r1486M2804A76761i0890m87l21034B44317a20274q2281B14308
18141C937b86105E23a49448e8461A48008a87835d2015B73626A1009b12556o2018
18130b74574A01902O4521a01371c0335A06562L8576a4327j29617B51491d7203
18119A26534b14618A4368c32165J16562L0898I6549b51611H0680a37523B35737
18108c33584o258D4616J47283j1148k4667b93749A72322J1405F9885b30498o9599
$$ plain form
18188 -131391 218461 330934 -104091 91767 -19455 -3139 164255 -281987 166276 -221 63912
18176 24708 -140989 -202520 340247 -249269 -236402 121120 36341 5734 -257503 -208832 288492
18164 -19383 -95341 -134007 7819 -116691 173471 -254899 -146 227721 162615 32118 22069
18153 22069 -212433 -303919 -261115 176761 -90890 -91377 -412411 244317 -120274 -202555 214308
18141 3937 -286105 523 -149448 -58461 148008 -187835 -42015 273626 11009 -212556 -274574
18130 -274574 101902 166423 -101371 -30335 106562 145138 -14327 -143944 251491 -47203
18119 126534 -214618 14368 -332165 -215603 -184705 96549 -251611 80680 -137523 235737
18108 -333584 -339842 44616 191899 180751 156084 -293749 172322 183727 69885 -230498 -300097
18097c00097C8877c62881A19832a07125b0810k61382A1126J52006a14065a4519
18086B15028e46788B00824g052l36371h2578p7580N1799A5851a71336a075B34937
18074A0239J35727a25664l66241A15057P7424n5469B7155g3750j87676B3170K6124
18063D9294a55770A59420a46517k83669A19563Q2322c47468A01320a34524j72090
18053c06614H4208a37754B0877K3569K42035c07103a53310G873K56017D4697g0334
18041a08551K3534j12055d1047j25417A88584k9096a22738A1065B652J2560a03715
18029c4974B10689n2924G6945c5985B14799b00704b335A41101b01298R0944N1285
18018e9069b0908p0821o9105A61979E8045I103d5514a5999B4718K97465a27118
$$ plain form
18097 -300097 38877 -362881 119832 -107125 -20810 -282192 11126 163132 -114065 -14519
18086 215028 -546788 200824 -7052 -343423 -82578 -160158 -108359 15851 -171336 -1075 234937
18074 10239 145966 -125664 -491905 115057 192481 137012 27155 -73750 -261426 23170 49294
18063 49294 -155770 159420 -146517 -430186 119563 201885 -347468 101320 -134524 -306614
18053 -306614 84208 -137754 20877 44446 286481 -307103 -153310 7873 263890 44697 -70334
18041 -108551 -85017 -197072 -41047 -166464 188584 159488 -122738 11065 2652 15212 -103715
18029 -34974 210689 157765 76945 -35985 214799 -200704 -2335 141101 -201298 -110354 -59069
18018 -59069 -20908 -91729 -160834 161979 58045 9103 -45514 -15999 24718 322183 -127118
18006H7814a18966M1504j6017l3383G400a61488A97544a67781C81628l2711A03680
17994i65A18574b9916B9640a46690f4249L1109j9526C051J08629E5826d2249A74323
17981c03935D06001A55913f3479p9666A12615d408o2638A62304G6708b65839A92668
17969a2470j93985M3365n006O9027b2499E9613a43345a3657B59594r6894a20297
17957b85767J40671B6013J94490R4063j09940L4169R1468r7742a02957A87845
17946d7501H9697b20373a04898B12192i9084A85424J20951g57A22096g8026k07796
17935b85822B55576b04981H1732l2877a75936L8628j5810O7565k4902C6063b76775
17923C26904a35033D2988J80562a61900A13636J07980h049k78756D4331J78542
$$ plain form
18006 87814 -118966 -77462 -93479 -126862 7400 -161488 197544 -167781 381628 348917 103680
17994 -965 118574 -29916 29640 -146690 -64249 -33140 -52666 3051 111680 55826 -42249 174323
17981 -303935 406001 155913 -63479 -143145 112615 -4408 -67046 162304 76708 -265839 192668
17969 -12470 -206455 -163090 -168096 -99069 -22499 59613 -143345 -13657 259594 162700 -120297
17957 -285767 -145096 26013 220503 314566 204626 238795 330263 232521 -102957 187845
17946 -47501 89697 -220373 -104898 212192 -99084 185424 306375 -757 122096 -78026 -285822
17935 -285822 255576 -204981 81732 48855 -175936 -137308 -153118 -85553 -110455 36063 -276775
17923 326904 -135033 42988 223550 -161900 113636 221616 -8049 -286805 44331 222873
17913B22873d151F2134a02744p9346C0249f6469k55650a51421e6237H9076k2036
17902F7040B27K27390A4813k101J06719a06717A33279b8757l02273A05223M8467
17891A53690b81007f6319c174A02995f5505A87996k5693M7698D3668K56216J57831
17880D57715D9348N4952g8591B5857c52060A51394c9897I1312d4941q8296B5138
17868I881K26713j3630d1027A60945h2004n2174k84712A39066M11662h9579B76133
17856b0165p0796A61589m9269a4151k95417A50508b72243f0348B17067b34546
17845a12948B73734b0252j13450e9604A4733K6229Q4117n3450c2541A32950N0884
17834A83834G2358d086j84101B80630c6199q5566N3751p9618B34727K45855g6294
$$ plain form
17913 222873 -4151 62134 -102744 -182090 30249 -66469 -322119 -151421 -56237 89076 67040
17902 67040 227 227617 14813 12712 119431 -106717 133279 -28757 -331030 105223 153690
17891 153690 -281007 -66319 -3174 102995 -65505 187996 162303 210001 43668 299884 457715
17880 457715 49348 104300 -78591 25857 -352060 151394 -39897 91312 -44941 -133237 25138
17868 9881 236594 222964 -41027 160945 -82004 -134178 -418890 139066 550728 -89579 276133
17856 -20165 -90961 161589 112320 -14151 -309568 150508 -272243 -60348 217067 -234546
17845 -112948 273734 -20252 -133702 -59604 14733 40962 125079 71629 -32541 132950 183834
17834 183834 72358 -4086 -188187 280630 -36199 -121765 -68014 -147632 234727 480582 -76294
17822H268J16681e0066j64224C19091i4559F3694J71692B5745J43756a23157j18163
17811b41320E531f083j73967A04889P9630b63377J21806A67049a62549E88J31444
17800A32032D164a64211k6241o0615a042m4628j8874C23220a12072B5857a4775
17788C21000j29116G7871a96067a1591r1757D22204j27715a9146L791l8165I2397
17776a80215F2382J11025J82038A14508d04722E57815A43603J61070A13366n5030
17766E8336J07782b55940B64926H9758a7334A48466M3009M5795N1482A12063m9553
17755F2510L20113A55629r617a13678k01272J44900E4577b8945I6314J26279Q52
17744B23445k5943a64669A84638k7989N8437e1240A19703a64748C55449b84940
$$ plain form
17822 8268 124949 -50066 -214290 319091 -94559 63694 235386 25745 169501 -123157 -241320
17811 -241320 5531 -6083 -180050 104889 184519 -263377 -141571 167049 -162549 588 132032
17800 132032 4164 -164211 -190452 -251067 -1042 -45670 -64544 323220 -112072 25857 -14775
17788 321000 191884 77871 -196067 -11591 -103348 422204 294489 -19146 -15355 -53520 92397
17776 -180215 62382 173407 355445 114508 -404722 557815 143603 304673 113366 58336
17766 58336 166118 -255940 264926 89758 -17334 148466 191475 237270 288752 112063 62510
17755 62510 382623 155629 146012 -113678 -314950 -170050 54577 -28945 96314 222593 223445
17744 223445 197502 -164669 184638 156649 215086 -51240 119703 -164748 355449 -284940
17733A26857A7237Q6342a01953E0442A054J43562b8813B8811K6377P1854A9523
17721C2409K10888j03811J05933b58026B57219D0754a66782C9847g3359D57460
17710A61847G3124c7457C03194j47774e1113D9910J1750a87730B90235j21280
17700A68955l1507f6733I9423r453j4216a3969n7087B23093a1544B48038h6044
17688D6633f3866C74662F8430k9408K98320G5307J16945D740a0437B08424a94321
17676B80659I9228g8371D60653a25961B70520B9551a22602I8747J43028G2549
17665i5594B28904J3421r1307b7949d260k18658G1656c048A74643G5804l2154
17654D3650O5053a7195j31296B2658a67925c8795B42690C9518a12849H1551k8822
$$ plain form
17733 126857 17237 103579 -101953 50442 1054 144616 -28813 28811 55188 127042 19523
17721 32409 243297 139486 245419 -258026 257219 40754 -166782 39847 -73359 457460
17710 161847 73124 -37457 303194 155420 -51113 49910 61660 -187730 290235 168955
17700 168955 137448 -66733 99423 89970 75754 -13969 -71056 223093 -11544 248038 -86044
17688 46633 -63866 374662 68430 39022 337342 75307 192252 4740 -10437 208424 -194321
17676 280659 99228 -78371 460653 -125961 270520 29551 -122602 98747 241775 72549
17665 -95594 228904 242325 151018 -27949 -4260 -222918 71656 -3048 174643 75804 43650
17654 43650 108703 -17195 -148491 22658 -167925 -38795 242690 39518 -112849 81551 52729
17643E2729L72365p0412j69852G8978M3208J8912a8025e141I8298J52371o7503
17632A83166a21122D40616a69615C75426j82570C8979n520d9432A52447n8024
17622I4423O4301K07143A37646C4109a67114A76695o3436j4513R8824I0817O3538
17611A54355n5878J10894p8544K35379j45645q6949j5043d736D56893h7258L8479
17600d8779l7720n6527A1566N5403O0366l6804d7942D13246j36417G8445O6228
17589A44673j6458L39251A16J48260J06990I4171d6933A4364a14774k25276b2801
17577I3093L88332F6135K40686C5714L5255c495B6598L77438j86429R7557b34689
17565h0775C36940J72886k47088j17324E8571P8205J42393n2529N466b70266f139
$$ plain form
17643 52729 425094 354682 184830 78978 122186 141098 -18025 -5141 98298 250669 183166
17632 183166 -121122 440616 -169615 375426 192856 38979 33459 -49432 152447 94423
17622 94423 158724 365867 137646 34109 -167114 176695 113259 98746 197570 90817 154355
17611 154355 98477 209371 130827 366206 220561 133612 118569 -4736 456893 -87258 -48779
17600 -48779 -86499 -143026 11566 66969 127335 90531 -47942 413246 276829 78445 144673
17589 144673 128215 467466 116 148376 255366 94171 -46933 14364 -114774 -340050 -22801
17577 93093 481425 66135 306821 35714 70969 -3495 26598 404036 217607 315164 -234689
17565 -80775 336940 509826 262738 145414 58571 136776 279169 226640 232106 -270266 -6139
17553b3875A18943N9193i3960F7614e6892A00435J70663b0268n6514E7184b07425
17541A40897J46271j42443J06892D6080K98522J65302B038K19680q7474N9003
17531A93247b2154F302L4993K84757J90924m0952q0187N11658J70117k18571o0053
17520G98988Q6952k11859C10515j39113K75414J19950A94315J68029q8741M48889
17510G22492K6075M5474j58763M07269j86560m6819k6603J8993k91905B39553
17499E80494j76054j84220P1176K70744B55716P4308O757J63773k23716J83665
17489D60503j59713A41262J26919M3574j47382c9013G4133L2502l6009K77457
17479C48083G6299M73798j73054L336G3097K05348P8368F0866L02124P8023j29243
$$ plain form
17553 -23875 118943 178136 -93960 67614 -56892 100435 271098 -20268 -76782 57184 -207425
17541 140897 287168 144725 251617 46080 344602 509904 2038 221718 134244 193247
17531 193247 -22154 6302 41295 326052 516976 476024 395837 907495 1077612 859041 798988
17520 798988 885940 674081 310515 171402 446816 566766 194315 362344 273603 722492
17510 722492 748567 794041 635278 1042547 855987 809168 782565 801558 509653 239553
17499 580494 404440 220220 291396 562140 255716 330024 336781 500554 276838 460503
17489 460503 300790 141262 268181 311755 164373 -39013 74133 106635 70626 348083
17479 348083 76299 550097 377043 380379 73097 278445 356813 60866 362990 441013 311770
17468C11770j40460A7149L20702k8969C8093M65715A61331L9070K66436j89773
17458B77064L05214j96542O9123k1661B14823M165m8167E8898N26472I9140M25506
17447E24646j17466J32807j8382k09353L56303j79030l2399O5391j44870K24652
17437F02299r1305J68262k44747A61209J90135l9745J40544j10016K21882j43707
17427D20302J03814k48691I2780K73398F8014N05760L4878B98707J47837o3373
17417C83171J67713B58243L871M7787N55201C98707J54643N8903j69093N1372
17407D94532R440B01991n7734k9202J36827j05748J21237A08744l427B6631K98193
17396C24824A00060j1834K23002r8293J05938n7121J02803o554A69787j6041M52163
$$ plain form
17468 311770 171310 17149 337851 308882 38093 503808 161331 200401 466837 277064
17458 277064 582278 385736 454859 433198 214823 218988 170821 58898 585370 99140 524646
17447 524646 407180 539987 521605 312252 668555 489525 457126 522517 377647 602299
17437 602299 510994 679256 434509 161209 351344 311599 452143 342127 564009 420302
17427 420302 524116 275425 92780 366178 68014 573774 608652 298707 446544 383171
17417 383171 550884 258243 262114 309901 865102 398707 553350 612253 443160 494532
17407 494532 503972 201991 144257 115055 251882 146134 267371 108744 105317 26631 324824
17396 324824 100060 88226 311228 212935 318873 261752 364555 358001 169787 153746 605909
17385F05909A39892K41084A55451M17409a3893H2929O9975K19789d1147L812D07601
17373A74449K59391f8601C40010K12454j45796j52836q1307f6373B13617k8377
17363A85240J38963h8567j650A87943K28423C0852J0576M41735r9780a00426F8634
17351C99664j04710a66736F56712A32240J03442r5952J66571q6835J66161I1854
17340D12809A75702Q9274K4622p8774K03288j80322J47944q0714M60696B96488
17329E00693k26239h6622A54781l315M73249c4275D31940A73706J70106R0500
17319D34312k12396L28178k11813j09060h0430D53314m7532a70907D76641j57019
17309C19622N492l1800A36340J97510l3087K01951B34359n706q0114J1230L43268
$$ plain form
17385 605909 139892 380976 155451 572860 -13893 82929 152904 372693 -41147 -37335 407601
17373 174449 433840 -68601 340010 552464 406668 253832 172525 -66373 213617 185240
17363 185240 324203 -88567 -90217 187943 416366 30852 41428 483163 383383 -100426 68634
17351 399664 294954 -166736 656712 132240 235682 139730 306301 219466 385627 91854
17340 412809 175702 264976 289598 210824 414112 233790 381734 301020 761716 296488
17329 500693 274454 -86622 154781 151466 624715 -34275 431940 173706 343812 434312
17319 434312 221916 550094 338281 229221 -80430 453314 405782 -170907 476641 319622
17309 319622 325114 293314 136340 333850 300763 502714 234359 228653 148539 159769 503037
17298E03037A59764E1040L12872C5051J12938J0133J74648A51290l212M0776K20893
17287D09747j44098J5034J20194j82233N9578k2396J93113l4443K13527k37028
17277C90995L9966L57807C93128Q4455j74042A50358K22173I2404K38296j09666
17267B21034J98665A38721M8810O79266C02664l1878A25914L03240j37005q1975
17257B10174K69192B15974P0911K19766B23148j459G9252L85513o9238j13751
17247B81776J34866A67555o9075L0047M8900R7903L66980l09128R7657K76474
17237G07313B40599M4665J33028I5053K19410J32778O6802B42368O5503J92691
17227E00562O8386k21572J52578q3776J91177B72816I1946M83088k58477j3769
$$ plain form
17298 503037 159764 51040 363912 35051 147989 158122 332770 151290 148078 188854 409747
17287 409747 265649 280683 400877 218644 278222 255826 448939 414496 628023 390995
17277 390995 430961 788768 393128 477583 303541 150358 372531 92404 330700 221034
17267 221034 419699 138721 187531 866797 302664 270786 125914 429154 292149 210174
17257 210174 479366 215974 286885 506651 223148 221689 79252 464765 395527 281776
17247 281776 416642 167555 98480 128527 177427 275330 642310 333182 430839 707313
17237 707313 240599 285264 418292 95053 314463 447241 514043 242368 307871 500562
17227 500562 568948 347376 499954 416178 607355 272816 91946 575034 316557 302788
17217C02788n5202L0308A18990J58440R634f2738F36045A35808L13014M6062K53640
17206G48524k24761j65204K21297H2970M07787B38838M1605L29815j87366J68823
17196E91715A31398K44760J42945J59934B34592J8063o5182K50543j32134j0529
17186B95353l7924K25042d5188B69903K2493L77356B58020L90076k28919J88226
17176F07403j67237p2470J15839R0185q4315k721A87526L43303p8241j03855j8526
17165C30207J49000j25635J6612M38143j74377A37601L83240p5877M4832j65883
17155C23913M3451J52018k34226L22730k12710p4379K40350A40178M62742N5631
17145F58551n5954A46594M56025k26072q7682L49628p6263M22445C48782K88875
$$ plain form
17217 302788 247586 277894 118990 277430 287064 -62738 636045 135808 448822 494884 748524
17206 748524 523763 358559 579856 82970 490757 238838 280443 610258 422892 591715
17196 591715 131398 376158 519103 679037 234592 252655 187473 438016 305882 295353
17186 295353 257429 482471 -45188 269903 292396 669752 258020 648096 419177 607403
17176 607403 440166 367696 483535 573720 489405 486684 187526 530829 452588 348733 330207
17165 330207 479207 353572 370184 808327 633950 137601 520841 444964 489796 323913
17155 323913 367364 519382 285156 607886 395176 320797 561147 140178 602920 658551
17145 658551 602597 146594 602619 376547 288865 638493 562230 984675 348782 637657
17135F37657R3561m4509o9276o6716j9515J99194k49989J36417l9800O489R1232
17124F74745l25908M73119C89642K57214j9013k12386L1394p4741K46503j18986
17114D99627m4293K2656L0277K74498l5415k93318Q3955J32038j44670o8631K13178
17103F69902k6831M3303k84296j12318M04136R8944K6091j31066J03036P5090
17093H65991j24139o7456L44405p4135l81973O7189R0814j31636J22641K12356
17083I24057j96483J49382j20068K23159l38714K01673k44711N04575B08269N45483
17073G53752R7701j05967j66309K9827K9570K92903l72731L7125K16269K81059
17063A093199m19585J63982r9661K41076k16057n9545L49602m18569J17048R3040
$$ plain form
17135 637657 731218 686709 617433 550717 531202 730396 480407 616824 577024 583513 674745
17124 674745 348837 821956 389642 646856 627843 415457 446851 372110 618613 499627
17114 499627 455334 477990 508267 782765 747350 454032 537987 670025 525355 456724 669902
17103 669902 643071 686374 402078 289760 693896 792840 818931 687865 790901 865991
17093 865991 741852 674396 1018801 944666 562693 629882 720696 589060 711701 924057
17083 924057 727574 876956 756888 980047 641333 843006 598295 1102870 208269 753752
17073 753752 851453 745486 579177 609004 638574 931477 558746 595871 812140 1093199
17063 1093199 673614 837596 737935 979011 762954 703409 1053011 634442 751490 844530
17053H44530j00645J36374J17416k85691N51439n33542J93582M469q8478K73351
17043A112805p4891l17731M84209j13785k68280k19490M39618Q8096j95484m1982
17033H93085L61448n18429k4757L78944o6652j0222J95873E41994L25712J44678
17023A012384O329L45192k47296J21229K19052n26496M70428m67224O0050J78761
17013A172409l10757J36288J13788J11898m6745P0180j52505N242j58775N00337
17003A441360n90160N23376j17618K26512n8954l81859R6712J58587J7040L56700
16993A671696m43198k2772K2825j44933J39467K30334O5094l52082j00266K45652
16983A311817l474l5317K06176J7345k45871Q7036n3096o4578K52670k69093K65432
$$ plain form
17053 844530 743885 880259 997675 711984 1263423 729881 923463 927932 839454 1112805
17043 1112805 1037914 720183 1204392 1090607 822327 602837 1042455 1130551 935067 893085
17033 893085 1254533 736104 711347 1090291 1023639 1013417 1209290 541994 867706 1012384
17023 1012384 1018713 1363905 1116609 1237838 1456890 930394 1400822 933598 993648 1172409
17013 1172409 861652 997940 1111728 1223626 1176881 1247061 1094556 1099798 941023 1441360
17003 1441360 851200 1374576 1256958 1483470 1424516 1042657 1139369 1297956 1314996 1671696
16993 1671696 1228498 1205726 1228551 1083618 1223085 1453419 1518513 1166431 1066165 1311817
16983 1311817 1308343 1273026 1479202 1496547 1250676 1337712 1284616 1220038 1472708 1203615 1469047
16972A469047J13478k31032L04181m76349L85822J81728m88614R1083m6295L10619
16962A613668l92836J62136K70271o4084J17763l89116L4743J00993k3252J68448
16952A598734J03185k52135N85858m10992L76393r2465n14895K89558J56901Q0315
16942A920457Q780J64036m69024K32126M517J6789J29992K6819l95702Q2665J85844
16931A907299L39900l06653N1281L83896k55512j13057k37179O35128l36123o8432
16921B000548P5700Q4280O8638o1645K21916l069o8528M0125l30607M40902j50316
16910B317944J52278k41491K24169L2338J7125j9083Q9082K53345m09613J31276
16900B547370j17527M27067o6334j43504L89159j30491O2824k90057r8842P27078
$$ plain form
16972 1469047 1582525 1351493 1655674 1179325 1565147 1746875 1258261 1349344 1303049 1613668
16962 1613668 1220832 1382968 1653239 1589155 1706918 1317802 1352545 1453538 1430286 1598734
16952 1598734 1701919 1449784 2035642 1624650 2001043 1908578 1393683 1683241 1840142 1920457
16942 1920457 1929237 2093273 1624249 1856375 1860892 1877681 2007673 2034492 1638790 1721455 1907299
16931 1907299 2247199 1940546 1991827 2375723 2120211 2007154 1769975 2405103 2068980 2000548
16921 2000548 2076248 2160528 2229166 2167521 2389437 2386368 2317840 2357965 2027358 2468260 2317944
16910 2317944 2470222 2228731 2452900 2485238 2502363 2483280 2572362 2825707 2416094 2547370
16900 2547370 2429843 2856910 2790576 2647072 3036231 2905740 2968564 2678507 2579665 3306743
16890C306743K8304k43134o4395J86516k36321N82291l38288m2915N32714n3252
16880C658263l66993m029K58807l566J21004l7450j5611K04136q4501Q9305J54882
16869C974247L37615l36441O2480M1695L36322k99855L11563j6918J7792N8877
16859D487377j53673N68439l29593K25708q5232K3928M25205l31493L23476k0271
16849E133871L11574l1536m93644N11131L92495j92315K47317O6426q8562J99440
16839F056197n9613J34150J58329K78665K2931j78426M61979k07291L19031J03119
16829G089071j69536N07013j90940M45567N7639K01943J04921K26077J09187p2506
16819H308436J06642M34677K17031n7964N48040m25912N73070K63435M2811O180
$$ plain form
16890 3306743 3335047 3091913 3027518 3214034 2977713 3560004 3221716 3178801 3711515 3658263
16880 3658263 3291270 3287241 3546048 3542482 3663486 3626036 3610425 3814561 3730060 3819365 3974247
16869 3974247 4311862 3975421 4037901 4079596 4415918 4116063 4427626 4410708 4428500 4487377
16859 4487377 4333704 4902143 4572550 4798258 4713026 4736954 5162159 4830666 5154142 5133871
16849 5133871 5445445 5413909 4920265 5431396 5823891 5631576 5878893 5945319 5856757 6056197
16839 6056197 5996584 6130734 6289063 6567728 6590659 6412233 6874212 6666921 6985952 7089071
16829 7089071 6919535 7426548 7235608 7681175 7738814 7940757 8045678 8271755 8380942 8308436
16819 8308436 8415078 8849755 9066786 9008822 9556862 9130950 9704020 9967455 10010266 10016446
16809A0016446P66917n2701K47561K80942L99969j65238K76518M12282J87900
16800A2370596L32183K38384O25606r7293M94531M73231Q1656L75931M84257L74924
16790A5754006J58416N54747P73982K40257P44922K77872M70053P37599L02002
16781B0013856N72038O30619N10815P59749N75799P56083P65978J268827M88290
16772B6342054Q70686Q57615P10677Q44646R39935J455346R94850R02939J177301
16763C5096049J619903J027044J654120J025276J507380J861859J857961J915166
16755D7564758J455334J849562J901030J947266K220669K596613K613319K467842
16747F4616393K421930K810965K510644L189018K833256L059129L285245L335976
$$ plain form
16809 10016446 10783363 10730662 10978223 11259165 11659134 11493896 11770414 12182696 12370596
16800 12370596 12702779 12941163 13566769 13469476 13964007 14437238 14518894 14894825 15379082 15754006
16790 15754006 15912422 16467169 17241151 17481408 18226330 18504202 18974255 19711854 20013856
16781 20013856 20585894 21216513 21727328 22487077 23062876 23818959 24584937 25853764 26342054
16772 26342054 27212740 28070355 28781032 29625678 30565613 32020959 33015809 33918748 35096049
16763 35096049 36715952 37742996 39397116 40422392 41929772 43791631 45649592 47564758
16755 47564758 49020092 50869654 52770684 54717950 56938619 59535232 62148551 64616393
16747 64616393 67038323 69849288 72359932 75548950 78382206 81441335 84726580 88062556
16739H8062556L255600L699214L283493L882482L556851L408265L813590L035087
16731A15997138L252448K908639L014560K738545K559272J940105K053512J252202
16723A35716421R25909N09768Q5924l95780q34619j140798j435558j757639k619573
16714A29054055k268756k560817l108330l303161l443228l483404l422544l900706
16706A03563109l264033l573981l669906l349474l368051l540813l312439k895179
16698G6589233l251511k832290k542690k736167k818156k441353k616913k164237
16690E5185916j988396k211560j866900j948770j643860j690675j714145j206096
16682D0915514j785629j476987j247186j355443j259691q99954j518931j128909
$$ plain form
16739 88062556 91318156 95017370 98300863 102183345 105740196 109148461 112962051 115997138
16731 115997138 119249586 122158225 125172785 127911330 130470602 132410707 134464219 135716421
16723 135716421 136642330 137152098 137238022 136842242 136007623 134866825 133431267 131673628 129054055
16714 129054055 126785299 124224482 121116152 117812991 114369763 110886359 107463815 103563109
16706 103563109 100299076 96725095 93055189 89705715 86337664 82796851 79484412 76589233
16698 76589233 73337722 70505432 67962742 65226575 62408419 59967066 57350153 55185916
16690 55185916 53197520 50985960 49119060 47170290 45526430 43835755 42121610 40915514
16682 40915514 39129885 37652898 36405712 35050269 33790578 32890624 31371693 30242784
16674C0242784p47804p60006j099550j135236o71561o75121p56899j195586n83846
16665B2617175m13304q40585n33378q00936n26272o18162j42036q08974k88769
16656A7644759o15633m08220o66128K5877o25018k96150l17586n69985l07732
16647A3864184n27166k93137j23810k31693j57602m92356p08049J90914j2972
16638A1508313m67820j33643m00441k97758k59254j27537n47780J36651m43862
16629H966869r1749R9176m49503J70186n91199k51610Q694Q058j22355k81353
16619G465214k62885l83611O57076r22309M00865m82164p2583k33032N03848l95240
16609F275179p9460l04461N858j13641r2578J23290m79538K6321k49963K76744
$$ plain form
16674 30242784 29494980 28734974 27635424 26500188 25828627 25153506 24396607 23201021 22617175
16665 22617175 22203871 21363286 20829908 20028972 19502700 18884538 18742502 17933528 17644759
16656 17644759 17029126 16620906 15954778 15980655 15355637 15059487 14741901 14171916 13864184
16647 13864184 13337018 13043881 12920071 12688378 12530776 12038420 11330371 11521285 11508313
16638 11508313 11040493 10906850 10506409 10208651 9949397 9821860 9274080 9410731 8966869
16629 8966869 8875120 8974296 8524793 8694979 8103780 7852170 7860864 7868922 7746567 7465214
16619 7465214 7202329 6818718 7475794 6553485 6954350 6472186 6399603 6166571 6670419 6275179
16609 6275179 6195719 5891258 5897116 5783475 5690897 5814187 5334649 5360970 5111007 5387751
16599E387751K3004j68376n59632K87481j78706j25283j67373N00708m21386k36214
16589D341974J07980k8237K205j49129j54918O1130p6917m70877K27975K09470
16579D070656n15748K43852k27016K28173m19543L97604j43800m72350K52712
16570C414540N9018j09680P455J2657j03462l46289J65400q7784K19362l43311
16560B887906O7031K9142k83010J41359k2301J7425m2928J34482l67201O96694
16550C258599p26678K58455l94387M06280m91550L72401j94444n5996p30j41738
16540B290212M31950l24233m12879K48248j03542J32320j24931j24319K13952
16531B226778Q1134L50390l04321o89180K8187J20041l2139J78982j27363l1552
$$ plain form
16599 5387751 5410755 5242379 4682747 4970228 4791522 4666239 4498866 4999574 4578188 4341974
16589 4341974 4449954 4421717 4423922 4274793 4119875 4181005 4104088 3633211 3861186 4070656
16579 4070656 3554908 3798760 3571744 3799917 3380374 3777978 3634178 3161828 3414540
16570 3414540 3473558 3363878 3371333 3383990 3280528 2934239 3099639 3011855 3231217 2887906
16560 2887906 2954937 2984079 2701069 2842428 2820127 2837552 2794624 2929106 2561905 3258599
16550 3258599 2531921 2790376 2395989 2802269 2310719 2683120 2488676 2432680 2431950 2290212
16540 2290212 2722162 2397929 1985050 2233298 2129756 2262076 2137145 2012826 2226778
16531 2226778 2307912 2658302 2353981 1664801 1692988 1813029 1780890 1959872 1832509 1800957
16521A800957k28610N71799k98847J03964m81954K59259p400j51269K97854l32356
16511A533397K20485K91605m53968k85340M12779J75006k61978p2036J75947N5550
16501A791447n6486k43074L5000j07888k86018M34795m13437M60412l62265N27680
16491A780166l61650j93149J45254j96361J38107j03052K46750j10713j53294
16482A192058J78531K17962m51647k52564N47556j32355k31875J61508j3230K07669
16472A423613k63789J09894k02484o403j61129K28499j65893J43267j0655j27243
16462I67677r0706K777J4122L64937o9520k83050K27882k30381L74826n1993l30980
16451H95591Q5743j71412J40024R7586N3352l5117o281o4046j04362L10512l54851
$$ plain form
16521 1800957 1572347 2144146 1845299 1949263 1467309 1726568 1719168 1567899 1865753 1533397
16511 1533397 1753882 2045487 1591519 1306179 1718958 1893964 1631986 1559950 1735897 1791447
16501 1791447 1734961 1491887 1526887 1418999 1132981 1567776 1154339 1614751 1252486 1780166
16491 1780166 1418516 1225367 1370621 1174260 1312367 1209315 1456065 1345352 1192058
16482 1192058 1370589 1588551 1136904 884340 1431896 1299541 1067666 1229174 1215944 1423613
16472 1423613 1159824 1269718 1067234 1060831 899702 1128201 962308 1105575 1094920 967677
16462 967677 876971 879748 893870 1258807 1189287 906237 1134119 903738 1278564 1226571 895591
16451 895591 981334 809922 949946 1047532 1100884 1065767 1059486 995440 891078 1201590 846739
16440H46739J25746j69208r3171l2923K34847J13049k7114j17902l65941M11008
16430I25130k05350L16076j15544k50542R0355j42328M02656k5024J99370E52515
16419H97211k86276J12120J51047J73066L9653n37099K70455J02189l01403J31776
16409G52739j2465O5997q2089r2652J67016j9369Q1737j68694P0538l5282L55649
16398A083125E35433K47136l14579J65717M8814k6343J75045M3854k36543N00
16388F39034o7634l363L13816j95027C28335N36153m12106q707K79241Q4723k54545
16377E53094k1228M99023m45894B62384K05988L38391k93122J74313j08686J6194
16367E95462K4348N3542P8092l17378j28390K48995L14629j18979j64487j74496
$$ plain form
16440 846739 972485 803277 710106 677183 912030 1025079 997965 880063 514122 925130
16430 925130 719780 1035856 920312 669770 760125 617797 1020453 995429 1194799 552515
16419 897211 610935 723055 874102 1047168 1086821 549722 820177 922366 620963 752739
16409 752739 740274 806271 724182 631530 798546 779177 860914 692220 762758 727476 1083125
16398 1083125 535433 782569 467990 633707 682521 656178 831223 875077 638534 639034
16388 639034 571400 568037 881853 686826 328335 864488 452382 443675 722916 807639 553094
16377 553094 531866 1030889 584995 262384 468372 806763 513641 687954 579268 595462
16367 595462 619810 673352 751444 434066 305676 554671 869300 750321 585834 411338
16357D11338o3599M28708k36909k19720O4173K98360J41580j10910B28921L50801
16347E79722q3480R8631j41581K29734E2994L66340J32134J85122C64137N9635
16337D23772J40055k28948A49116L46993K6751K3177q5074O9524j03379K28355
16327F55463l23541j04211J50957A71169M07195n6485R3860G2179L77232j14765
16317C34646A45225L06207K44157B3093K41562L7712Q898N3004K46529A38187
16306C38373j39719K09928O306j37485L1001J74165l7635C7530N9490J93534L4779
16295C25333N17960A41045L13483J33653I1009L7891K98283L4794j12597q9798
16285B59582N3390L8908j26559P0507N8919A69446M36520B69116k4373P0854j43557
$$ plain form
16357 411338 347739 776447 539538 319818 383991 682351 823931 713021 228921 579722
16347 579722 496242 594873 453292 683026 52994 419334 551468 736590 364137 423772
16337 423772 563827 334879 149116 496109 522860 546037 460963 530487 427108 655463
16327 655463 331922 227711 378668 171169 578364 521879 615739 72179 449411 334646
16317 334646 145225 451432 695589 23093 264655 302367 311265 364269 610798 138187
16306 338373 198654 408582 414888 277403 308404 482569 444934 37530 97020 290554 325333
16295 325333 843293 141045 454528 588181 91009 128900 427183 461977 349380 259582
16285 259582 312972 351880 225321 295828 354747 169446 605966 269116 244743 315597 172040
16274A72040K12773j41604K18585L0001A32847L32941j59374j38021N5782L37496
16264E61671A37185L03476J02932A94896N1331r1165K04669J09166M2720j01140
16254D10477j05744K4447K62263j00765F4761h3887B78762l1319L16691A87948
16243A91295B6936M98P1637K78702j7374b94179C70334K4393D1962L37828L0296
16232D10086A90591H6929C2921L74667q143P7904j44040J7096c71412a22882B82313
16220f2853B58207l5787k9207J99307j85548J06719p8966j02182J79787f7791
16209D20855A05602K22488P6537f8367A17849B9529M56087g5012C30337j39776
16199A90561k7455g5114A51255G5538j7357K44881k8649K4345h0981A66201p915
$$ plain form
16274 172040 384813 243209 461794 491795 132847 465788 306414 168393 224175 561671
16264 561671 137185 440661 543593 194896 246227 155062 359731 468897 511617 410477
16254 410477 304733 329180 591443 490678 64761 -83887 278762 247443 564134 187948
16243 191295 26936 27434 99071 377773 360399 -294179 370334 394727 41962 379790 410086
16232 410086 190591 86929 32921 407588 399445 477349 333309 350405 -371412 -122882 282313
16220 -62853 258207 222420 193213 392520 206972 313691 234725 132543 312330 -67791
16209 420855 105602 328090 404627 -68367 117849 29529 485616 -75012 330337 190561
16199 190561 163106 -75114 151255 75538 58181 303062 274413 298758 -80981 166201 158286
16188A58286J96404N9772A12003L5868J60515a27190G5753K0926L20978A68350
16177B93458F6148P2051o4043K75990a89119B8264K59969a06949B03218K4896
16167B28114B5194J41297p6163A6526d6459A46972L03320N8231C0900g2424m03684
16156d76108A53067n6531C3186a20145A21300L9878J8115K3688J81415A16186
16145F7459K79520d300E1788a25921A44653L99088a61120B50614p1017A8112J31655
16134A49767a04549A16159Q0529K3178N9398a28652A73854G1501J03458J94489
16124C69448a11192a9342A89007P9319i5333A39164b35083F9517J98061c57671
16113a20216H4035h7300M2001A59348A3562J25827K92967A41070n5639g3285C17143
$$ plain form
16188 158286 354690 414462 112003 147871 308386 -127190 75753 96679 417657 168350
16177 293458 66148 138199 74156 350146 -189119 28264 288233 -106949 203218 228114
16167 228114 25194 166491 90328 16526 -46459 146972 450292 508523 30900 -72424 -476108
16156 -476108 153067 96536 33186 -120145 121300 161178 179293 202981 384396 116186
16145 67459 346979 -4300 51788 -125921 144653 543741 -161120 250614 179597 18112 149767
16134 149767 -104549 116159 196688 219866 279264 -128652 173854 71501 174959 369448
16124 369448 -111192 -19342 189007 268326 -95333 139164 -235083 69517 267578 -357671
16113 -120216 84035 -87300 -45299 159348 13562 139389 432356 141070 85431 -73285 317143
16101A43299J46980I5776L8955P0063F8907g8885D09203f94H5439b04380n9784
16090b64164G1879J49439K6910d3991B79688b44275B49564C7182J72687c4067
16079A35793b56631B92089a12098A41484J02958q9225a60752D22206a11215A20833
16068c712H1317a75315I5001Q0286k7054h5206K7730A37078C2419R6161d4808
16056D28343j48428o7565b64521E4202c3460k63481A88986a43691A06347f2015
16045h3287D0698N2883A3502R514L501K81897a56101N5613E10843A18342N5280
16034A73622M6840R2153C480d8345q2903C46644j35998l5324b6632k42379C97934
16022A99687o9423g2605C68640A75263k8469m5783a43478B79124a68002C8043
$$ plain form
16101 143299 290279 95776 134731 204794 68907 -78885 409203 -694 85439 -204380 -264164
16090 -264164 71879 221318 248228 -43991 279688 -244275 249564 37182 209869 -34067
16079 135793 -256631 292089 -112098 141484 244442 155217 -160752 422206 -111215 120833
16068 -3712 81317 -175315 95001 175287 148233 -85206 -57476 137078 32419 128580 -44808
16056 428343 279915 212350 -264521 54202 -33460 -296941 188986 -143691 106347 -62015
16045 -83287 40698 93581 13502 23016 26517 308414 -156101 -100488 510843 118342 173622
16034 173622 220462 312615 3480 -48345 -131248 346644 210646 175322 -26632 -269011 397934
16022 199687 130264 -72605 368640 175263 146794 101011 -143478 279124 -168002 38043
16011D7577K88700H1119J8393J493k9644k9020K39379a86213K6955D822L24175
16000C28997A04376K32196b6008k9511B03110a06212B15758h4267B84123E7986
15989a06089C54222B2712L11003J61114M42343J38156J19517M6029m36991l21839
15979D82044L5141H2240b13394C41664a40812h77B13628J76451A81797b45706
15968H1887a38015A31013b7846j61495A78227N9236a8959k2013l3354C6922g5262
15956E3575b49305n3761B2162b0142G3700J352a28221b6263A86392b84893J41668
15945a43225j53780B11454a1077l98436J82485B90265b49957A385a42796O1860
15935h0936l0312K0347r6876K9078D6616b70817P7371r2879F6364f8608j93945
$$ plain form
16011 47577 336277 81119 99512 101005 71361 42341 281720 -186213 -159258 4822 328997
16000 328997 104376 336572 -26008 -55519 203110 -106212 215758 -84267 284123 57986
15989 -106089 354222 22712 333715 494829 937172 1075328 1194845 1240874 803883 482044
15979 482044 517185 82240 -213394 341664 -140812 -877 213628 390079 181797 -245706
15968 81887 -138015 131013 -27846 -189341 178227 237463 -18959 -40972 -74326 36922 -75262
15956 53575 -249305 -303066 22162 -20142 73700 75052 -128221 -26263 186392 -284893 -143225
15945 -143225 -297005 211454 -11077 -409513 -227028 290265 -249957 1385 -142796 -80936
15935 -80936 -111248 -90901 -187777 -158699 46616 -270817 -193446 -286325 66364 -68608 -262553
15924b62553a28546j20658j07762B86004A36616b70229J10702f8392k46104C67158
15913B02817b17010K5807A68736b74797C7699J55933a65703g0060A08753m7661
15903F1092b32666I0075L25958I6025P0195a79171L123E1638J08819J7745a42809
15891A94303b51730h2610N615j0155A02827D9378i1837n754J9754A18391f73B31950
15878a00948f406j65654B81428m0971a13848K9144k73011B31946a54378C79673
15867A25991E1029n314a92864j86231I9038m4082d50402C41009a84410j69018
15857c53428a28192A33194n7512J13413a16520o8359A11550b87588d4322A16347
15846B1711A235J53755D4340b38156j46466J53927j08363f3025A97696c08433
$$ plain form
15924 -262553 -128546 -249204 -356966 286004 136616 -270229 -159527 -68392 -314496 367158
15913 202817 -217010 -191203 168736 -274797 37699 193632 -165703 -70060 108753 61092
15903 61092 -232666 90075 416033 96025 166220 -179171 -176048 51638 160457 178202 -142809
15891 194303 -251730 -82610 -76995 -87150 102827 49378 -91837 -97591 -77837 118391 -673 231950
15878 -100948 -6406 -172060 281428 240457 -113848 -84704 -357715 231946 -154378 379673
15867 125991 51029 45715 -192864 -379095 99038 54956 -450402 341009 -184410 -353428
15857 -353428 -128192 133194 75682 189095 -116520 -184879 111550 -287588 -44322 116347
15846 21711 1235 154990 44340 -238156 -384622 -230695 -339058 -63025 197696 -308433
15835e0611A20016a17154j20827n0715J41987e9334A4597c61759B4247d0296k1092
15824f1388j98143B11993j2009i9769J4064q2021K1353A52925d93053g1019J546
15813f9473E7241h079G8496O6065J26326g8622J1152A52754a15767d810A29947
15801B49298D4116R1303b76797b6561B13523b29940g3793I2188A1371a09338I7931
15789B3900d70675F307b00860A16062a03312d1259A75495p4259b60328a3222I0964
15777a84229c874m7765p5742c0823j20384E28436C8373a50015j408A06630c77445
15765g4498m1781B00308d0529E9036a67054h1603B2408f8828A83274m5382L7048
15754A74940l547p7822k9554a42686d5052B26447G1894B5771N3781C7641K82833
$$ plain form
15835 -50611 120016 -117154 -237981 -288696 -146709 -59334 14597 -361759 24247 -40296 -61388
15824 -61388 -259531 211993 199984 -99769 -85705 -167726 -146373 152925 -493053 -71019 -69473
15813 -69473 57241 -8079 78496 144561 270887 -78622 -67470 152754 -115767 -4810 129947
15801 249298 44116 135419 -276797 -26561 213523 -229940 -73793 92188 11371 -109338 97931
15789 23900 -470675 6307 -200860 116062 -103312 -41259 175495 101236 -260328 -13222 90964
15777 -184229 -3874 -51639 -127381 -30823 -151207 528436 38373 -150015 -151423 106630 -377445
15765 -74498 -116279 200308 -40529 59036 -167054 -81603 22408 -68828 183274 137892 174940
15754 174940 171393 93571 64017 -142686 -45052 226447 71894 25771 79552 37641 320474
15743C20474j42956B6080J03076k5738c23723j17603E5739b12721D19727e9594
15732D5522a31451B15986L7975E8969Q5963i4306A13632c14026B75425h2885A51458
15720A05889d0238q6289G048K36071E2065i9821L8515j28421l8289c8599B41558
15708B7332e8158B31484c6587l04100F7018Q9631q368J56530E2294J01192d02590
15696B4253a08061A23522l776Q4362M783i107j5037n0853I220h1866q1113A8076
15683a26220C06092G1653K40024c23375R7257I6912J87447c32014b3316k96909
15673c20225a46508B24510g185A69566j2463F7011L9639R4333A9178J43498d27811
15661B63860A1203b62300M4052j70865a85474P3797o4546G3328J8594a42351M2199
$$ plain form
15743 320474 177518 26080 129156 103418 -323723 -441326 55739 -212721 419727 -59594
15732 45522 -131451 215986 253961 58969 144932 -94306 113632 -314026 275425 -82885 151458
15720 105889 -40238 -126527 7048 243119 52065 -99821 -61306 -189727 -228016 -38599 241558
15708 27332 -58158 231484 -36587 -340687 67018 156649 148281 304811 52294 153486 -402590
15696 24253 -108061 123522 119746 204108 208891 -9107 -24144 -74997 9220 -81866 -162979 18076
15683 -126220 306092 71653 311677 -323375 -226118 96912 284359 -332014 -23316 -320225
15673 -320225 -146508 224510 -7185 169566 157103 67011 106650 200983 19178 162676 -427811
15661 263860 11203 -262300 -218248 -389113 -185474 -111677 -176223 73328 91922 -142351 -100152
15650a00152j13422A83849c4289j34616A27252J41707B5001b45150C70314a2677
15639D322J28384E7711a52275C6692a9089k22187f4323n9815N3875F5489J21092
15628A86581D8503i5507C9877b16019A36815b31417C6466J49241b82609R4954
15618a87655d4558M221b178j76768a0198o5662C6169N9016a38009a4459j14202
15607a28661k02648J20267p9145E167J0842e6214k88275B3274P6710n160b25085
15595h9269j51940A29780b7543a1708k65899i067A74127A6250K64630b31688c5712
15583B17366D22a13064a7875n5038A34399f4503A74698k3707a93841e1479A51630
15571B9966J3386L17528b21757A45808a06814a2745o8274Q688o3293H7422M8905
$$ plain form
15650 -100152 -213574 183849 -34289 -168905 127252 268959 25001 -245150 370314 -12677
15639 4322 132706 57711 -152275 36692 -19089 -241276 -64323 -124138 -70263 65489 186581
15628 186581 48503 -95507 39877 -216019 136815 -231417 36466 185707 -282609 -187655
15618 -187655 -44558 -40337 -2178 -178946 -10198 -75860 36169 95185 -138009 -14459 -128661
15607 -128661 -331309 -211042 -290187 5167 16009 -56214 -344489 23274 99984 94824 -225085
15595 -89269 -241209 129780 -27543 -11708 -277607 -9067 174127 16250 280880 -231688 -35712
15583 217366 422 -113064 -17875 -72913 134399 -64503 174698 150991 -193841 -51479 151630
15571 29966 43352 360880 -221757 145808 -106814 -12745 -81019 -72331 -135624 87422 136327
15560A36327D0011E051J12470b45693a20236A46529Q1964b63658A22879m5090
15550G7789a76296a7669l7409k99906C94692j52447d5073l27483a54727B07838
15539A21216i3272H9308b00001M9568A63596E2364J95982j1600C95R8658a29663
15527f7506J4440B4051M1520D919L16357A07225J77243A18968a63164j54642B9635
15515B39525m2084I7606e8883A40477m4731C5852a1370E3781J94378A03335a3202
15503A16336O624L22659k01338F9896L2256f4052B53724q8243M1204e4887B79309
15491D65350A52076a3903A83631J7701C0541K65646c672q984j15331C42074A47244
15479b03102d6380r081o6660e8753A11048d3035B24152O05227C08180L9655R5681
$$ plain form
15560 136327 40011 5051 117521 -245693 -120236 146529 228493 -263658 122879 77789
15550 77789 -176296 -17669 -55078 -354984 394692 242245 -45073 -372556 -154727 207838
15539 121216 -93272 89308 -200001 -150433 163596 52364 248346 236746 395 99053 -129663
15527 -67506 -53066 24051 65571 4919 321276 107225 284468 118968 -163164 -317806 29635
15515 239525 197441 97606 -58883 140477 95746 35852 -11370 53781 248159 103335 -13202
15503 116336 122960 445619 244281 69896 102152 -64052 253724 165481 206685 -54887 279309
15491 465350 152076 -13903 183631 201332 30541 296187 -3672 -12656 -127987 342074 147244
15479 -203102 -46380 -55461 -122121 -58753 111048 -43035 224152 829379 308180 347835 443516
15468D43516e57j37571A58763L4783a38945M8241A02444M2780N9604k9480d9900
15456B14008a86713B10599K8199e0322A82309K87227B28560F6288a07005G2946
15445a57q5870B2525J58997K21457f7458H36191J73158k753m20314k56726n9599
15434B69957a30714D38654g1706j89955C7324b51907e5494j12323A30824b93323
15423A76553a30750J3005A50249a54005A59885a26660B88973c73854e8533B2155
15412F7946A4808L29196A3948L70984a15932B44023I9526c92774E4706c39039
15401B26598b7921H1126J5225K54777a57167d8020A23448C5612a3252p6757E0504
15389b70790e9286A88609H8190Q4670F1966J93227E9175J40933N4705b99400C21592
$$ plain form
15468 443516 -557 -138128 158763 193546 -138945 -90704 102444 145224 204828 175348 -49900
15456 214008 -186713 210599 238798 -50322 182309 469536 228560 66288 -107005 72946
15445 -157 -86027 22525 181522 402979 -67458 836191 1009349 1006596 586282 329556 269957
15434 269957 -130714 438654 -71706 -261661 37324 -251907 -55494 -167817 130824 -293323
15423 176553 -130750 -117745 150249 -154005 159885 -126660 288973 -373854 -58533 22155
15412 67946 14808 344004 13948 384932 -115932 244023 99526 -392774 54706 -339039
15401 226598 -27921 81126 96351 351128 -157167 -48020 123448 35612 -13252 -90009 50504
15389 -270790 -59286 188609 88190 172860 61966 255193 59175 200108 254813 -299400 321592
15377C70391A41895J56003e8182D98188k6817j39106O8692j39040K1994A9364
15366b01795B66818I255M015b24410F294J88842a03032C1467J5824a78728A44929
15354d3184A99557j3284J16864C6074J90703C4174K18175j14188L7775J7935p7336
15343A16535J10276C3929K05406G0615J94772P8779j09626L4875B7521d9359A20514
15331A52558K2189M3049j9529L22821k16376j18028K98394G0067a32710I7407
15320A51063J0714c0031a2932F6589K94833A25180J05076K01672G9142K24108
15310C03250j15835f4961B21941B941Q9129m4061a01807M3743j57338H0337B9452
15298c181B06084d7567q4037H8222c55889A90375F9616J69198L5407a35988H1226
$$ plain form
15377 370391 141895 297898 -58182 498188 471371 332265 400957 261917 283911 19364
15366 -201795 266818 9255 13270 -224410 6294 195136 -103032 31467 47291 -178728 144929
15354 -43184 199557 186273 303137 36074 226777 34174 252349 138161 175936 193871 116535
15343 116535 226811 33929 239335 70615 265387 344166 234540 269415 27521 -49359 120514
15331 152558 174747 217796 198267 521088 304712 186684 485078 70067 -132710 97407
15320 151063 161777 -30031 -12932 66589 361422 125180 230256 431928 79142 303250
15310 303250 187415 -64961 221941 2941 92070 48009 -101807 -58064 -215402 80337 29452
15298 -3181 206084 -47567 -131604 88222 -355889 190375 69616 238814 274221 -135988 81226
15286a66937A48572f90k27024C1468a17703M3514F0307J00502i0842A79024p7863
15275A01161k6597F172c83566A41256c14308G8131B6578a0552A57589F9146I063
15263i7326A76782b7298m1474a3725B58017B3081K13643a45917K5325G179a37203
15251g88n5123b5322A5179O5804l3049J98206Q2272L46620M35412O40137l66729
15240A383852M91795o47792C84732j04380f645m8122B54377G7096J67341a2867
15229f9259m3573D1370L08063B9612a7603C17670b6747A4892g3420B285J27068
15218A29353h4362B71359j26579J15231b09436B80824a89986h5538j8389G1539
15207a12233E5125J39460A1072L11047a69026B96301C7656J20779h9703E8351
$$ plain form
15286 -166937 148572 -690 -227714 31468 -117703 -74189 60307 160809 -90842 179024 101161
15275 101161 74564 6172 -383566 141256 -314308 78131 26578 -10552 157589 69146 9063
15263 -97326 176782 -27298 -68772 -13725 258017 23081 236724 -145917 -120592 7179 -137203
15251 -788 -55911 -25322 15179 80983 47934 246140 328412 675032 1110444 1750581 1383852
15240 1383852 1875647 1227855 384732 280352 -6645 -54767 254377 77096 244437 -12867
15229 -69259 -112832 41370 349433 29612 -17603 317670 -26747 14892 -73420 2285 129353
15218 129353 -84362 271359 144780 260011 -209436 280824 -189986 -85538 -103927 71539
15207 -112233 55125 194585 11072 322119 -169026 296301 37656 158435 -89703 58351
15196b56901b5697C95270j95249b05554b230A31157L70847B41134J07462A28910
15185b23673O7184B02912b78979A03480M7855a90000f6957C13530c8409B08495
15174b2060h88B46879J79061H719L68477J3909B4368J01393n0219K97750a11550
15162B76172j15736n4078a9557G6800H072Q2957Q6047a26440C56427A01237K37668
15151C38905e8757F7104L36554b5319k29042A13576K3834M20746I8080b527B2733
15139C22635d6988A66080L59345k19118A20400L7209b43197Q9981C70678j68079
15129B02599J30336b75372A81515R14a38642C38909E6490P4243a38126E947K31909
15118B37856K16986j25816a38045D1367J71373h0852A86673K14558d5727C46160
$$ plain form
15196 -256901 -25697 395270 200021 -205554 -2230 131157 502004 241134 348596 128910
15185 -223673 -156489 202912 -278979 103480 151335 -190000 -66957 313530 -38409 208495
15174 -22060 -888 246879 425940 8719 377196 391105 24368 125761 75542 373292 -111550
15162 276172 160436 106358 -19557 76800 8072 91029 177076 -126440 356427 101237 338905
15151 338905 -58757 67104 403658 -25319 -254361 113576 137410 558156 98080 -2527 22733
15139 322635 -46988 166080 525425 306307 120400 157609 -243197 -153216 370678 202599
15129 202599 332935 -275372 181515 182429 -138642 338909 56490 130733 -138126 5947 237856
15118 237856 454842 329026 -138045 41367 212740 -80852 186673 401231 -45727 346160
15107i8147A44607b6612A22817d48005C79573j64255R6324l8048j05784Q2968
15097B50778J08197A39064R0650N4065N8504c1000k4665B81484b35595E17258
15086B98195A42513C6499q107a66939B02187P2018A01046g3073A51230b90179
15075B93458e8434A28287d2156I4617K0944J21829b8513j32871B16161E1144N66422
15064F17566a95339C11796r6509F7461Q7559J65241j50701j9040J59949o2577
15054B47892M61238l51530e674A54495J01177d6599H7980J01361K01066J31264
15044E21671j64680A02689a2056C54784j17237K29695R3944k01039l478n9820
15034B96849R0605j38132l2511K67000L90808l34030J1315K03493J00587m05203
$$ plain form
15107 -98147 144607 -26612 122817 -448005 379573 215318 311642 273594 167810 250778
15097 250778 358975 139064 229714 283779 342283 -31000 -55665 281484 -235595 517258
15086 298195 142513 36499 28392 -166939 202187 274205 101046 -73073 151230 -290179
15075 293458 -58434 128287 -42156 94617 115561 237390 -28513 -161384 216161 51144 617566
15064 617566 -195339 311796 215287 67461 155020 320261 169560 150520 310469 247892
15054 247892 709130 357600 -5674 154495 255672 -46599 87980 189341 390407 521671
15044 521671 356991 102689 -12056 354784 237547 467242 561186 360147 356669 296849
15034 296849 387454 249322 216811 483811 874619 540589 551904 755397 855984 450781
15024D50781j33159K22194n193C4357L89851j43642L32694M4424l09156j9336
15014C29192j61166L39140B45037r6673J91652r7956N71560l33207L5778k57067
15004B59124A05956J18919M3080M3694L6598K42375B63421K19417M8923k29255
14994C02506o6351K96035j52697q5870A13796M22662j20246J99807m382A82530
14983D55086j5223R8477Q7289K45500j15392L8875p7653k11995q5333K00650j6326
14972F03955J6435j70169O7447M0414j1966l1667k48712r1322J80681j15478J09516
14961C49134j43318M4038P2994K16815B47598K06002j48918J64276j69143r0867
14951B08948J66209j07828K65844j71883G9309M52833L28294k47081J29924J27448
$$ plain form
15024 450781 317622 539816 534623 34357 424208 280566 613260 657684 348528 329192
15014 329192 168026 507166 245037 148364 340016 242060 813620 480413 516191 259124
15004 259124 105956 224875 267955 311649 348247 590622 263421 482838 531761 302506
14994 302506 236155 532190 379493 293623 113796 536458 416212 616019 611637 182530
14983 455086 439863 538340 625629 871129 755737 794612 716959 504964 419631 620281 603955
14972 603955 620390 450221 517668 558082 546116 514449 265737 174415 355096 239618 349134
14961 349134 205816 249854 322848 539663 247598 453600 304682 468958 299815 208948
14951 208948 375157 267329 533173 361290 79309 532142 860436 613355 743279 870727
14941H70727D07857J08617K03313j84487j07002l8550J45534j07772L88863k34349
14931E82024l4848K12676J2452M86220L1471p0441N05379j60100J30229r7125
14921A597937l27617K67858n01695L72806K90598J17228L08986L38335p12835
14912A751601o88774L1587K23982m75363o4431J0423C70761N09283C77026O8433
14902D45459K2396q744J41412j88833K04744B19584J87382Q4587j23240M5745
14892D14058K9362L0636L23520l59707O6581m0957J28493B93154L77832K69987
14882I40973k54381P7841p5253j72410K63003C49553L85969l26983N39135l64851
14872E82823p9606j19509L08298j7669k34733J39308n4300P8916J41741K56796
$$ plain form
14941 870727 407857 516474 719787 535300 428298 389748 535282 427510 816373 582024
14931 582024 547176 759852 772304 1258524 1289995 1219554 1724933 1564833 1695062 1597937
14921 1597937 1270320 1538178 1036483 1409289 1699887 1817115 2126101 2464436 1751601
14912 1751601 1062827 1094414 1318396 843033 778602 789025 370761 880044 377026 445459
14902 445459 467855 459111 600523 411690 616434 219584 406966 491553 368313 414058
14892 414058 443420 474056 797576 437869 504450 463493 591986 293154 670986 940973
14882 940973 686592 764433 689180 516770 779773 349553 735522 408539 947674 582823
14872 582823 503217 383708 692006 674337 439604 578912 524612 603528 745269 1002065
14862A002065j28784l93952Q0875J59507k24238j59747L5018j53346a15967C47446
14851C18550J51041j00486J49691j61738O3872J64635K8514j13955J65299J37483
14841H02906J60227P581K90842k27734J18304M6687E90556N14148l68039J68567
14831I05232l65491K23450k07583j46756L22632k3118J88313r5367C60284N38362
14821H98646l59256Q2987j81124L49336r4852R0265j05691L27400k52550k71746
14811D83415L03707O6747k4980K714D08588J52869K91965l39888K73583M9259
14801H36376l0252M61663n51030n2897j51663J37815p6983M74195m17241k50196
14791C79787J31694J73528k95256J41225K26531j2083K02889l45339m4756K01898
$$ plain form
14862 1002065 873281 479329 560204 719711 495473 335726 370744 217398 -115967 347446
14851 318550 469591 369105 518796 357058 420930 585565 614079 500124 665423 802906
14841 802906 963133 970714 1261556 1033822 1152126 1198813 590556 1104704 736665 905232
14831 905232 539741 763191 555608 408852 731484 708366 896679 801312 360284 898646
14821 898646 539390 622377 441253 790589 695737 786002 680311 1007711 755161 483415
14811 483415 787122 853869 828889 831603 408588 561457 853422 513534 787117 836376
14801 836376 806124 1267787 716757 663860 512197 650012 573029 1047224 629983 379787
14791 379787 511481 685009 389753 530978 757509 745426 948315 602976 558220 760118
14781G60118k68707J94347J2411J88026n4356O8742D09063O81513j56843j01261
14771H32472M6116l2265J81499j37731k64159K24048m9700p089j99131J78055
14761G72115k64646L36014j56971P5966j27726L04247l06623k23084R7101N0871
14751E57264K70540K56599m49696K04090j03807J08612l5516o5830J59101l06616
14741E94741K24946J04765k07372J46911J62551m82197L73604P4859m56146N99699
14731A136361C98745M97471n1904K60717J02957J19051J49375O96452n53568k01335
14721A417961L7737k71758J80240L0706l61765o3738k76859K82141p3812K45929
14711A146782k61141J04753o3610k35358M21616R2106l10243J83201j87746L38884
$$ plain form
14781 760118 491411 685758 698169 886195 831839 900581 409063 1090576 933733 832472
14771 832472 878588 846323 1027822 890091 625932 849980 800280 793191 594060 772115
14761 772115 507469 843483 686512 762478 634752 938999 632376 409292 506393 557264
14751 557264 827804 1084403 634707 838797 734990 843602 808086 742256 901357 594741
14741 594741 819687 924452 717080 863991 1026542 544345 917949 992808 536662 1136361
14731 1136361 398745 896216 844312 1105029 1207986 1327037 1476412 2172864 1619296 1417961
14721 1417961 1455698 1183940 1364180 1394886 1033121 969383 692524 974665 900853 1146782
14711 1146782 885641 990394 926784 691426 1113042 1205148 894905 1078106 890360 1229244
14701A229244J58829k0825K95310J26269m6088o77254L27492k99475R4337q2345
14691A105494m32020L86959j02197j60903M43721k68526j96957j12024N18449
14682A181996j48793J92307j91020j38990J33531l43559L02766m66923J86023
14673G07338J66130L5142L67705K6571m59294J13676k3215N45735o73492J44730
14663I51026L83854n57713J38859L88650F35712N58433R6684m51295J98469P3183
14653A111186J1356K51150K123n7753M3753k2540J0917j8212P2205n3990Q6873
14642A437068k48940m971j4666K66679l96210M2713K26741J7029j63875K59315
14632A420883k75144j94911P52216k07808n51627N11525k04829L53682l77050
$$ plain form
14701 1229244 1388073 1367248 1662558 1788827 1742739 1065485 1392977 1093502 1187839 1105494
14691 1105494 673474 1060433 958236 797333 1241054 972528 775571 663547 1181996
14682 1181996 1033203 1225510 1034490 895500 1029031 685472 988238 521315 707338
14673 707338 873468 908610 1276315 1302886 843592 957268 934053 1479788 806296 951026
14663 951026 1334880 777167 916026 1304676 635712 1194145 1290829 839534 1038003 1111186
14653 1111186 1122542 1373692 1375815 1318062 1361815 1339275 1350192 1331980 1404185 1350195 1437068
14642 1437068 1188128 1183157 1168491 1435170 1038960 1081673 1308414 1325443 1161568 1420883
14632 1420883 1145739 950828 1703044 1495236 943609 1455134 1250305 1603987 1226937
14623A226937K10853l06952L24032K82369j57916j28408P0633o08881L99746J08200
14613A420613r4955N23650m04212J64941J74972k03488J87377k09786K74459p55235
14603A078336M99522M3708k86535L44473J80621J30351l37559j02517L00823J15789
14593A967012k07381p8905k4134J37608m9250M77923j49786m63180J55351K30669
14583A995927Q7783k81265K33233p1826J70459j17455P6844J03292k66077L27767
14573B258682j64450M879K12457K03750j11519k16953J11373L09017o3995j21127
14563B422114j40777M9581L16245n3318K99383m7044J33465J49166M06886q2105
14553C453596K42588L88387P55834P23226J515476L603588P411376J6973555J2913877
$$ plain form
14623 1226937 1437790 1130838 1454870 1737239 1579323 1450915 1521548 912667 1312413 1420613
14613 1420613 1325658 1849308 1445096 1610037 1785009 1581521 1768898 1559112 1833571 1078336
14603 1078336 1577858 1621566 1335031 1679504 1860125 1990476 1652917 1550400 1851223 1967012
14593 1967012 1759631 1680726 1656592 1794200 1744950 2222873 2073087 1609907 1765258 1995927
14583 1995927 2083710 1802445 2035678 1963852 2134311 2016856 2093700 2196992 1930915 2258682
14573 2258682 2094232 2099111 2311568 2515318 2403799 2186846 2298219 2607236 2543241 2422114
14563 2422114 2281337 2330918 2647163 2593845 2893228 2846184 2979649 3128815 3535701 3453596
14553 3453596 3696184 4084571 4840405 5563631 7079107 10682695 18094071 35067626 47981503
14544D7981503k3025149A1838724n115316k839134m50703O10933J588187k104138
14536C528553o97302p01372j9649k26900L24763P8983m4688j62420p1195K57893
14526B266666P8690p3788q1975L95108j61892J39843L49560k17797j58364P8177
14516B614228K12821k79786N31276j75530J09070r0202k44455P74923m89998l2577
14506B929770J59414k38781K50428K17344q9867k23383K08547k01436L82373R3698
14496C488107m15936K10739p0902L87412l4551M8494k96616K08585Q13K34413
14486C760558P0397J02436r4271k4339n773O8332K65013k09835K96643m27007
14476C802154M62013o2998j23789J99592J11150j10302j3003M1597M15456r8277
$$ plain form
14544 47981503 24956354 11838724 6723408 3884274 3433571 4044504 5632691 3528553
14536 3528553 2831251 2129879 2110230 1883330 2208093 2287076 2242388 2079968 2008773 2266666
14526 2266666 2345356 2271568 2189593 2584701 2422809 2562652 2912212 2694415 2536051 2614228
14516 2614228 2827049 2547263 3078539 2903009 3012079 2921877 2677422 3452345 2962347 2929770
14506 2929770 3089184 2850403 3100831 3318175 3228308 3004925 3213472 3012036 3394409 3488107
14496 3488107 3072171 3282910 3212008 3599420 3564869 3613363 3316747 3525332 3526145 3760558
14486 3760558 3830955 3933391 3839120 3814781 3809008 3877340 4142353 3932518 4229161 3802154
14476 3802154 4264167 4201169 4077380 4276972 4388122 4277820 4264817 4306414 4721870 4623593
14466D623593J86302p6009K64563k72031K00840j32134N08520m08346j26538M91639
14456E260399K23029m00242J48355K97695J45051o6001k33908K9335M08922m26221
14446E386414O80721j21153P6456J17596n3233K90253k92227M29881K30877O1373
14436F806958K87349n30289N0007K29575J30917K53478J310J66589j38269K90205
14426G547830q5036L57346k7235M35725j06208N0712L73315j57726M66061K1060
14416H875844N13624J2947j37956O6380k10309K47822K41330J94104K64490k9226
14406A0039050q1145N11139K53487J78063J85838Q848J57578J9952L00121L63423
14396A1936354m7252p5319N63594r758J35743K21400J13570L51408L63749K59033
$$ plain form
14466 4623593 4809895 4733886 4998449 4726418 4927258 4795124 5303644 4895298 4768760 5260399
14456 5260399 5483428 5083186 5231541 5529236 5674287 5608286 5374378 5403713 5812635 5386414
14446 5386414 6067135 5945982 6022438 6140034 6086801 6377054 6084827 6514708 6745585 6806958
14436 6806958 7094307 6564018 6614025 6843600 6974517 7227995 7229305 7395894 7257625 7547830
14426 7547830 7462794 7820140 7792905 8228630 8122422 8173134 8546449 8388723 8854784 8875844
14416 8875844 9389468 9402415 9264459 9330839 9120530 9368352 9609682 9803786 10068276 10039050
14406 10039050 9957905 10469044 10722531 10900594 11086432 11095280 11252858 11272810 11572931 11936354
14396 11936354 11889102 11813783 12377377 12367619 12503362 12724762 12838332 13189740 13553489 13812522
14386A3812522L7408O01722k5854K32282J73367K94689M18259J58242N25699J73048
14376A6401384L01434N01319l87524K67287Q73659j1107K03856M41868M57315
14367A9049491J71768O41635K66394O60917N76668K96984L72599N99193J31782
14358B2767431N48629N70693M84954J065697j65813Q65872P26522N28031O25358
14349B8017374P40320N76279R78705O10783R88800P01860Q06071J193319O88113
14340C5301624J203438J083388J058961P69483J249898J111915J046505J630905
14332D4456117J106733J286937J758429J552014J295990J898373J539972K106520
14324E7001085J991251J810897K172203K063544K685613K201401K807751K577675
$$ plain form
14386 13812522 13849930 14451652 14425798 14658080 14831447 15126136 15544395 15702637 16228336 16401384
14376 16401384 16702818 17204137 16816613 17083900 17957559 17946452 18150308 18592176 19049491
14367 19049491 19221259 19862894 20129288 20790205 21366873 21663857 22036456 22635649 22767431
14358 22767431 23316060 23886753 24371707 25437404 25271591 26137463 26863985 27392016 28017374
14349 28017374 28757694 29333973 30312678 30923461 31912261 32614121 33420192 34613511 35301624
14340 35301624 36505062 37588450 38647411 39416894 40666792 41778707 42825212 44456117
14332 44456117 45562850 46849787 48608216 50160230 51456220 53354593 54894565 57001085
14324 57001085 58992336 60803233 62975436 65038980 67724593 69925994 72733745 75311420
14316G5311420K506172K942975L169396L548990L266380L930225L516296M107219
14308A02299073N117590M141783M753603N459909N710133N474528O226357O746311
14300A45929287O485634P421749P641561Q394471Q656697R181716R740391J0304306
14292B13755812J0742115J1488437J2390479J2409720J3180389J3818353J4223987
14285C02009292J4466355J5110430J5110157J5555954J5555125J5139674J4709032
14278D07656019J4024918J3449054J2216826J0794803Q720957O290578K071771
14271D75224926r84942k102054p02844m392776n639749n847231p605005r978291
14263D37972034j2096462j3620613j4607029j4677144j5191633j5758255j5817528
$$ plain form
14316 75311420 77817592 80760567 83929963 87478953 90745333 94675558 98191854 102299073
14308 102299073 107416663 111558446 116312049 121771958 127482091 132956619 139182976 145929287
14300 145929287 152414921 159836670 167478231 175872702 184529399 193711115 203451506 213755812
14292 213755812 224497927 235986364 248376843 260786563 273966952 287785305 302009292
14285 302009292 316475647 331586077 346696234 362252188 377807313 392946987 407656019
14278 407656019 421680937 435129991 447346817 458141620 466862577 473153155 475224926
14271 475224926 474239984 472137930 471435086 467042310 461402561 455555330 447950325 437972034
14263 437972034 425875572 412254959 397647930 382970786 367779153 352020898 336203370
14256C36203370j5465536j5247059j5146913j4058782j3873458j3296531j2572089
14249B36543002j0440514j0611963j0614549j0403418r091694q658333q232192
14242A68490339p964849p272839p283756o450043n968135n555951n730990n450080
14234A16813696m623986m685605m457966l692016l751161l996016l560689l417863
14226H4628394l543146k903776k410181k905289k525142k212895k252641k373968
14218F3501356k345853j901378j750823k304855j023923j358685j805058j724319
14210D9286462j516378j401873j294655p48029j356248j035533j325893j464690
14202C9143163r46442q91978q92310j051393q30719j111352r19772o40795n43607
$$ plain form
14256 336203370 320737834 305490775 290343862 276285080 262411622 249115091 236543002
14249 236543002 226102488 215490525 204875976 194472558 185380864 176722531 168490339
14242 168490339 160525490 153252651 145968895 139518852 133550717 127994766 122263776 116813696
14234 116813696 112189710 107504105 103046139 99354123 95602962 91606946 88046257 84628394
14226 84628394 81085248 78181472 75771291 72866002 70340860 68127965 65875324 63501356
14218 63501356 61155503 59254125 57503302 55198447 54174524 52815839 51010781 49286462
14210 49286462 47770084 46368211 45073556 44325527 42969279 41933746 40607853 39143163
14202 39143163 38196721 37304743 36412433 35361040 34530321 33418969 32499197 31858402 31314795
14193C1314795o91111p44260r41361p02362p98631o13928k54921j110088l40865
14184B5117268p81362l77358l31271q27440l65260p2010p44668o31518j9886p83180
14174B0183315n14037l31963n30753k32010n42278j69063n56278N8749n44309
14165A6821373k28763m23276o19118l55250K89172n66758J22893m47593o44250
14156A3948430J7368m35796O252N8643o71307j0526Q9277n23967r8548n24726
14146A1855100l30998K17620r9379m74981j11935k99273k07011k16113J60568
14137A0493598l83204j97959j80230J31442j62880l96431K57311m63473L30428
14128I428602n15628j05372J18764j55975n67739L56647k07574l2701k06252J8226
$$ plain form
14193 31314795 30623684 29879424 28938063 28235701 27437070 26823142 26568221 25458133 25117268
14184 25117268 24335906 23958548 23627277 22799837 22434577 22362567 21617899 20986381 20966495 20183315
14174 20183315 19669278 19337315 18806562 18574552 18032274 17863211 17306933 17365682 16821373
14165 16821373 16592610 16169334 15550216 15194966 15484138 14917380 15040273 14592680 13948430
14156 13948430 13965798 13530002 13536254 13594897 12923590 12913064 13002341 12478374 12379826 11855100
14146 11855100 11524102 11741722 11642343 11167362 11055427 10756154 10549143 10333030 10493598
14137 10493598 10110394 9912435 9732205 9863647 9700767 9304336 9561647 9098174 9428602
14128 9428602 8912974 8807602 8926366 8770391 8202652 8559299 8351725 8319024 8112772 8130998
14118H130998l41678m7289j49109q5768o6045r2389K03528K05446o48763m2711
14108G066220k11278J8299M8363j96376J90153j39963m32529k85306j73157O24459
14098F508885p34422L32263j57663P278o3471j82069J79790m61811L63630m44687
14088E347723K31887l04448K13714n43487M61364m08307M32277j54732m30890
14079D845101j3383Q4980j36732K66779m83540L8712r487L8349j49833K16406
14069D697352l60407k5097R9491K4338N4408J75184p7571m64958J53069K83494
14059D559303m20053J14522J15579j91180J2933j90759j80132j25990K13546k00648
14049C707121j63822P8718o2496M8805j4826k87891J00228K06808k04014l4751
$$ plain form
14118 8130998 7789320 7742031 7592922 7507154 7441109 7348720 7552248 7757694 7108931 7066220
14108 7066220 6854942 6873241 6921604 6725228 6915381 6775418 6342889 6057583 5884426 6508885
14098 6508885 5774463 6106726 5949063 5956341 5892870 5710801 5890591 5428780 5792410 5347723
14088 5347723 5579610 5275162 5488876 4945389 5406753 4998446 5430723 5275991 4845101
14079 4845101 4831718 4916698 4779966 5046745 4563205 4601917 4592430 4630779 4480946 4697352
14069 4697352 4336945 4311848 4411339 4435677 4490085 4665269 4587698 4122740 4275809 4559303
14059 4559303 4139250 4253772 4369351 4178171 4191104 4000345 3820213 3694223 3907769 3707121
14049 3707121 3543299 3622017 3559521 3608326 3593500 3305609 3405837 3612645 3408631 3373880
14039C373880J92865l00387O8884k73528K08652k5930J28771k02292j87050N547
14029B989412K0314K6313j53857J10943j93473o0574j5216j53141N11979K44886
14019C327586o47294N289l9474J5907q5631j64006K66039k5137j70306J32973
14009B615946l09206J28921J79247k97682M24811l41133L5601m24483M82304m9234
13999B445092l14705J30346j73868Q4857l44524L79734Q3142m4499o3754O02489
13989B784310N91833K050050N882595J4940853K1121048j5740912j4365975o852499
13981A0411303l220284k017368p25881k35257o52968j63898P5115o25735P1997
13972B917024K38407n35715o7039j07277J07822j11273L16604l53513M7106k90702
$$ plain form
14039 3373880 3566745 3266358 3335242 3061714 3270366 3244436 3373207 3170915 2983865 2989412
14029 2989412 3009726 3036039 2882182 2993125 2799652 2739078 2723862 2570721 3082700 3327586
14019 3327586 2680292 2685581 2646107 2662014 2576383 2412377 2678416 2653279 2482973 2615946
14009 2615946 2306740 2435661 2614908 2317226 2742037 2400904 2436505 2012022 2494326 2445092
13999 2445092 2130387 2260733 2086865 2171722 1827198 2206932 2290074 2245575 2181821 2784310
13989 2784310 3376143 5426193 11308788 26249641 47370689 31629777 17263802 10411303
13981 10411303 7191019 5173651 4447770 4212513 3559545 3395647 3470762 2845027 2917024
13972 2917024 3155431 2619716 2552677 2445400 2553222 2441949 2758553 2405040 2452146 2161444
13962B161444P5640J35046j38935K24k05463N48350m72174n477o928K9256k17518
13951A903465J06433l1143n274L10623n2797k05338p4648R2334r9438Q380j48862
13940A803735n0675K04793k85107J11540J34931Q0852j48313j42244K667L1855
13930A744034K23008n6834N7116j74989l40154L40971l65112K52883J49443k54880
13920A575486K3440L25507m44652Q5154J60430j25118K8024j42342l3948k42485
13910A209496L61762k52922j89636J31835J22267r4587M58015k59395O0524j36940
13900A410419L68225m47284j43070L32821l88897L07855K9488K66325l94434M7454
13890A388902K06240k48786l44489J39464J76379N726p9036J82040Q331l14177
$$ plain form
13962 2161444 2237084 2372130 2233195 2233419 2027956 2576306 2104132 2098655 2091727 2120983 1903465
13951 1903465 2009898 1978755 1973481 2284104 2231307 2025969 1951321 2043655 1944217 1952597 1803735
13940 1803735 1753060 1957853 1672746 1784286 1919217 2000069 1851756 1709512 1712179 1744034
13930 1744034 1967042 1910208 1967324 1792335 1452181 1793152 1428040 1680923 1830366 1575486
13920 1575486 1598926 1924433 1479781 1564935 1725365 1600247 1628271 1485929 1451981 1209496
13910 1209496 1571258 1318336 1128700 1260535 1382802 1288215 1746230 1486835 1547359 1410419
13900 1410419 1778644 1331360 1188290 1521111 1132214 1440069 1469557 1735882 1341448 1388902
13890 1388902 1595142 1346356 1001867 1141331 1317710 1323436 1244400 1426440 1434771 1120594
13880A120594J47786M7041o5642L9823k16800L99310m14678K02809L32231o49563
13870I42911L83701k37275k7825L34909k4398j17973k19921M06970j15244m48404
13860H77451L74168n3498L2978j56583m6753J56959j49414K68528r9148j06839
13850A097849j63714L8515n2746P1371r5495J21530o0123n0874j4843K88583k65288
13839I14765J4058K24405j99j55606k95469L54334J27363p4860j61749j03815
13829H43227R8672O329j19413K43709l5185J03898j87806J4375j386K6539k76533
13818G16426j01258J81170Q9554j0807k1067l88911K06979J97402K86438m18986
13808G36940K03543k74051K22522L41866j17488l46789J50819K5715k15494l3992
$$ plain form
13880 1120594 1268380 1315421 1249779 1289602 1072802 1472112 1057434 1260243 1592474 942911
13870 942911 1326612 1089337 1061512 1396421 1372023 1254050 1034129 1441099 1325855 877451
13860 877451 1251619 1198121 1231099 1074516 1027763 1184722 1035308 1303836 1204688 1097849
13850 1097849 934135 972650 919904 991275 895780 1017310 957187 906313 891470 1180053 914765
13839 914765 928823 1153228 1153029 997423 701954 1056288 1183651 1108791 947042 843227
13829 843227 941899 948228 828815 1072524 1037339 1141237 953431 967806 966420 992959 716426
13818 716426 615168 796338 885892 875085 854018 465107 672086 869488 1155926 736940
13808 736940 940483 666432 888954 1230820 1113332 766543 917362 943077 727583 693591
13798F93591K02569N639L3030k29945j39923L27718m22182J75271O2215J74922
13788H82905N3605m14608K61602J03567j27966M9141j77608K83061k36723r776
13778F67200J52920k24708J11460j34040K79852k83659o8284K04458j75682m1216
13768D88301M14712j61290m7040K7866k77285P4352L69201m6069O1498q9795k61300
13757E53151n5328K59388j54553L4176k52366J53995j94757M27618R114j20961
13747F59477k19493L89668k21043J49490j72357J62949l03316J93998K19666k30487
13737F28552j51812m8017O33899m53133k8818J11115J62248k20688Q2654j74867
13727E41133J66570r8430B16029J63910K71035k75341K00397j9669B76842L05189
$$ plain form
13798 693591 896160 901799 934829 704884 564961 892679 470497 645768 707983 882905
13788 882905 936510 521902 783504 887071 759105 808246 630638 913699 676976 667200
13778 667200 820120 595412 706872 572832 852684 569025 500741 705199 529517 488301
13768 488301 903013 741723 694683 722549 445264 519616 888817 842748 904246 814451 553151
13757 553151 497823 757211 602658 636834 384468 538463 343706 771324 780438 659477
13747 659477 439984 829652 608609 758099 585742 748691 445375 639373 859039 628552
13737 628552 476740 428723 1062622 609489 580671 691786 854034 633346 716000 541133
13727 541133 707703 609273 216029 379939 650974 375633 576030 556361 276842 582031
13717E82031J9839j15209J68117J70332j39016C36309J39887j31658L2556K64650
13707F41744n1788j98744J31733l2208k2173K74966k81346n0281J36047j3156
13697E34794j3471J56890B20011M71606j45024n2237k9080j10593o6779J44337
13687D32241n783j05494j49551L68029J52205J310k81846R2357l0111J8047q7381
13676D04023L72492l52231J90233O182M5721j20976R4814C01477K52029k4177
13666E29329A29248K21129K90719B74195L91273M1115o2560B47590K76209J18668
13656F42467j03621k16973K29521j86934J9966C5590L04837J55128J20184j77416
13646D38323j74353N56063n2316k56820k6256K10630j97848J45020J1086A35153
$$ plain form
13717 582031 601870 486661 654778 825110 686094 336309 476196 344538 377094 641744
13707 641744 589956 391212 522945 490737 468564 743530 462184 411903 547950 534794
13697 534794 521323 678213 220011 691617 546593 494356 465276 354683 287904 432241
13687 432241 426458 320964 171413 539442 691647 692957 411111 503468 473357 491404 404023
13676 404023 776515 424284 614517 620699 666420 545444 640258 301477 553506 529329
13666 529329 129248 350377 641096 274195 665468 706583 644023 247590 523799 642467
13656 642467 538846 321873 551394 364460 384426 35590 340427 495555 615739 438323
13646 438323 263970 820033 767717 510897 484641 695271 497423 642443 653529 135153
13635G79184l07294o8554K53158B74236N07244B09341M54553A88848J3586j8402
13625A84032N46290k13426q4994M0296J42547q5112J6606k60723K06382A00444
13614D63240j45554L8951j44044Q3256K3151L54996k40956K3355l0838l5319j34927
13603B55311o9130K47048J3343A3666N10306j7602j72865l461A6497K82684p1728
13592B27453J99486j79908K47467A82331J07312J53953j31741P9887n1457O4935
13582D05220j79488J26502j14919J59549A56538L05236A28887K02220M8942f7108
13571e1783C55584J04317E2707K54031K39267L8168k52982r855K89070k91019
13561C19387n667L40978B84369N6715Q9439J16538k06192j31874p042N09k1957
$$ plain form
13635 779184 471890 403336 656494 274236 781480 209341 663894 188848 202434 184032
13625 184032 730322 516896 431902 472198 614745 529633 546239 285516 491898 100444
13614 463240 317686 356637 212593 295849 319000 673996 433040 456395 425557 390238 255311
13603 255311 186181 433229 446572 13666 523972 506370 333505 330044 16497 299181 227453
13592 227453 426939 247031 494498 182331 289643 443596 311855 391742 340285 405220
13582 405220 225732 352234 237315 396864 156538 461774 128887 331107 380049 -67108
13571 -51783 355584 459901 52707 306738 546005 584173 331191 321336 610406 319387
13561 319387 313720 654698 284369 341084 430523 547061 340869 208995 201953 202462 180505
13550A80505a42236A03839L69453O4366p3595c5618A23576o0453L37381j79561
13540B20943L37354B31610R8651J25118o3811J51658A77748K8557J33930K62076
13530F02311j74303j07596A1164M47990B11285J33486J5898P7182A35007L70482
13520E05489F7119M20941B06501N0344n676K03164k02489C9965J50486N37994
13510G28445H2587L36209a14002C51580A10451K73238J41995D7188N4192J6472
13500A17852M2016p3728J8696J03087K07893j16459D1452K22223R5111B8707L63119
13489C91826J8591E9468K40259K52543k51444a02073A37633m6306J20650K49507
13479D61484b01336I0401J07509J52888A23293K05781J33569m7023q0079a3796
$$ plain form
13550 180505 -142236 103839 473292 537658 464063 -35618 123576 63123 400504 220943
13540 220943 558297 231610 330261 455379 391568 543226 177748 206305 340235 602311
13530 602311 428008 320412 11164 459154 211285 344771 360669 437851 135007 505489
13520 505489 67119 488060 206501 256845 251169 454333 251844 39965 190451 728445
13510 728445 82587 418796 -114002 351580 110451 383689 525684 47188 101380 117852
13500 117852 159868 86140 104836 207923 415816 299357 41452 263675 358786 28707 391826
13489 391826 410417 59468 299727 552270 300826 -102073 137633 91327 211977 461484
13479 461484 -201336 90401 197910 350798 123293 329074 462643 415620 335541 -13796
13468B53768G0980J51491J43273n9758r4685K59998G3620M4781K48939A74370
13457E19230J417j45883m9490j51612R5133j30451J96843e2795A20571a01349
13446B45578K93513j45773j40303C6032J89659L35076H4529E307J09679L01538
13436D16524j64619o0189Q4304J05213A41981E4031N41236j86543c37789D81025
13425C43234d8613l0059I0896L1721K74621J07304b8292A69241D0679N1304J46706
13414B38689j17781a41454B27749r3919b141k4524A32695L02651A80328Q5220
13404B65548C6346L04037C3098a42924B05557J89330I5416J51497J02673h469
13393e860D96342a70538B69446A20271l0176a72277A40323n2703K13687k345k7353
$$ plain form
13468 253768 70980 222471 365744 305986 211301 471299 73620 118401 367340 174370
13457 519230 520647 374764 325274 173662 268795 138344 335187 -52795 120571 -101349
13446 245578 539091 393318 253015 36032 225691 560767 84529 5307 114986 416524
13436 416524 251905 191716 276020 381233 141981 54031 595267 408724 -337789 481025
13425 343234 -48613 -78672 90896 122617 397238 504542 -28292 169241 40679 91983 238689
13414 238689 120908 -141454 227749 133830 -2141 -26665 132695 435346 180328 265548
13404 265548 36346 340383 33098 -142924 205557 394887 95416 246913 349586 -8469
13393 -5860 496342 -170538 269446 120271 90095 -172277 140323 87620 301307 298962 271609
13382B71609n7242J19845K2489J76875k29091p9110e330B58409j3459N2957F4199
13370B13792J9644N6607B0198M7002a6911C12531N8728A32723P6165C9337N38729
13359E78066k41851a25877B94521P1052c337B89099R7876j90552q1955L29631
13349D44099G4526K98284a2619A2842M72487L9235B04329J71395j32373L12765
13339E56116j82768r6182L62919B35418J92845K5505H3514K07942J07335A79369
13328A47671o6621J0384C2722L58149A83660Q9489B9172L5857K22312R4135I1162
13316A68061J15274L00180A48774J9236K58304A07295J07580J68019O3131B20578
13305G2439Q2260n1957J60677J21182a75758I6148R1772o0052j3241J24698r0931
$$ plain form
13382 271609 214367 334212 356701 533576 304485 225375 -5330 258409 244950 297907 64199
13370 213792 233436 290043 20198 67200 -16911 312531 371259 132723 208888 39337 578066
13359 578066 336215 -125877 294521 365573 -3337 289099 386975 196423 114468 444099
13349 444099 74526 372810 -12619 12842 485329 524564 204329 375724 243351 556116
13339 556116 373348 277166 640085 235418 428263 453768 83514 291456 398791 179369
13328 147671 81050 91434 32722 390871 183660 273149 29172 65029 287341 381476 91162
13316 168061 283335 583515 148774 168010 426314 107295 214875 382894 446025 220578
13305 72439 154699 102742 263419 384601 -175758 96148 187920 127868 114627 239325 148394
13294A48394K40399A92338e6889A8343L56170m8496a40035N7531C84633H7613
13283H5462L7797K48347b89209B22032l310p8445a10372B19617b9094a0744F3571
13271C43921I0264K05738b72779C1417O8936B6653e3784A00667h615A3965R5983
13260A09948M2675D2234a04521A14354D3143J68141C7637J54066K62759a73550
13249a56616C12169f6630C61137A41449i8475C05506j41791J62014j11251D5189
13238D18314j5934f6185A4578J45154C4152J40937N4955I1665L296Q5877J89646
13227C70484k2233n2025G2598L41364c8994A25631J66034J68647i0602o1534C25421
13215C06375j16278J63845E8030Q8276L0729h8357C47342b36009B82420j13448
$$ plain form
13294 148394 388793 192338 -56889 18343 374513 326017 -140035 -82504 384633 87613
13283 85462 123259 371606 -289209 222032 218722 140277 -110372 219617 -29094 -10744 63571
13271 343921 90264 296002 -272779 31417 100353 26653 -53784 100667 -8615 13965 109948
13260 109948 152623 42234 -104521 114354 43143 211284 37637 191703 454462 -173550
13249 -156616 312169 -66630 361137 141449 -98475 305506 163715 325729 214478 45189
13238 418314 402380 -66185 14578 159732 34152 175089 230044 91665 94961 180838 370484
13227 370484 348251 296226 72598 413962 -38994 125631 291665 460312 -90602 -152136 325421
13215 306375 190097 353942 58030 146306 177035 -88357 347342 -236009 282420 168972
13205A68972l6181I561j262J13021a09910m2313B00740B2797a3296j35221E04369
13193b50998B81061J11805a66699g6475C10393L0604A48566R7942q6290G2786
13182A35321J55625q1561A5666b16700j7568J3590c2658A5014h3645A27923J40793
13171B68716P8614L6584a54451B61040d058E5751a59709b2391k7207A59230m325
13160A54905d4544J8047j32168C21876a18723a512k24462A43734a26021p0008
13150a96029A97846K9251G2974Q7963F0816K57045m1652C6255a8354j60130M0555
13139a37929J1324B20416I9353K07069B6733K08055C9897f976C51177B0189J231
13128B1420K9263g4779A19936E9652J45510a48865A88251n0276R3640l8010m9171
$$ plain form
13205 168972 132791 9561 8299 121320 -109910 -152223 200740 22797 -13296 -148517 504369
13193 -250998 281061 392866 -166699 -76475 310393 340997 148566 246508 160218 72786
13182 135321 290946 209385 15666 -216700 -234268 -220678 -32658 15014 -83645 127923 268716
13171 268716 347330 383914 -154451 261040 -4058 55751 -159709 -22391 -49598 159230 154905
13160 154905 -44544 -26497 -158665 321876 -118723 -1512 -225974 143734 -126021 -196029
13150 -196029 197846 227097 72974 160937 60816 317861 276209 36255 -18354 -178484 -137929
13139 -137929 -126605 220416 99353 306422 26733 234788 39897 -6976 351177 20189 21420
13128 21420 50683 -74779 119936 59652 205162 -148865 188251 137975 231615 193605 144434
13117A44434b46073C03932r472j30866b63488D0635J44435a82973b3646E1396
13106f4985k4929j20627B57379a56022A00621K98139G8862J15791a32226A406
13095A33709C6342L23586I6719K0096F842a86207B05196m6956L1231a46909B1783
13083a11071J6523j29505D9431J49384J38524a56156F7741L26096D0779o055R6578
13072A31302L06161B03186l3865o8553f5321b1518k87339A99999J00299q6451
13062B13847b0021o4373B3219J07591e7295j17965C81691j45318q9731J92174
13052C38816c880B0250b91952D13987A97607I2980b34988H9528J7935N9103n8696
13041A07870b4110h186C50767a58745A65786D6294b5599A99655F4645a94213i1834
$$ plain form
13117 144434 -246073 303932 294460 163594 -263488 40635 185070 -182973 -23646 51396
13106 -64985 -89914 -210541 257379 -156022 100621 398760 78862 194653 -132226 1406
13095 133709 36342 359928 96719 116815 6842 -186207 205196 158240 189471 -146909 21783
13083 -111071 -94548 -224053 49431 198815 337339 -156156 67741 393837 40779 34724 131302
13072 131302 437463 203186 169321 100768 -65321 -21518 -308857 199999 300298 213847
13062 213847 -20021 -84394 23219 130810 -57295 -175260 381691 236373 146642 338816
13052 338816 -3880 20250 -291952 413987 197607 92980 -234988 89528 107463 166566 107870
13041 107870 -24110 -8186 350767 -158745 165786 46294 -25599 199655 64645 -194213 -91834
13029b1484D62377a02208l00907J60862A02428b9105A64182c317B33355b23306
13018D8897a5455B00630a04734A91729a42963B16142j3315J04152A8604a27701
13007A8828L0235N2269P11K08542A6980p346K67601B8700a78465A3640O4495J24265
12995B02400b20404C13028j42957Q0220k4202A1329L67650r3310q5064E9141J36485
12984A95626j4031B5695b11863N283A43231a76739b2548c855E4347d7236C2341
12972E219P0233J71161I9730F052a41286A10831O0459a18386e4970a8959A1023
12960a15813N0940C8128O0569K07743j48059a84973l2162m1239B34693b4311A27787
12948E1209M0332b07529e1613q9869H6434d9455E6169L8315J13822J77868j27108
$$ plain form
13029 -21484 462377 -102208 -403115 -242253 102428 -29105 164182 -3317 233355 -223306
13018 48897 -15455 200630 -104734 191729 -142963 216142 202827 306979 18604 -127701
13007 18828 49063 101332 102043 310585 16980 9634 277235 28700 -178465 13640 78135 202400
12995 202400 -220404 313028 170071 250291 226089 11329 378979 285669 200605 59141 195626
12984 195626 181595 25695 -211863 -206580 143231 -176739 -22548 -3855 54347 -47236 32341
12972 5219 75452 246613 99730 6052 -141286 110831 171290 -118386 -54970 -18959 11023
12960 -115813 -64873 38128 98697 306440 158381 -184973 -217135 -258374 234693 -24311 127787
12948 51209 91541 -207529 -51613 -141482 86434 -49455 56169 94484 208306 386174 259066
12937B59066n5135L28678a70382H984M8571Q6800a90163m0555D83256b54511A18331
12925E6726j8054J83556a38420k1709I8065Q0006J46617A48412a8986C59517C7399
12913C8900c95395A3855L2520J63051E1076J185K56924H0370G757K947M6659C251
12900a36878H4630b27765l72258a82822B70258c6240A1949g8390A73994B6397
12889A97824J62083a36565A87555L0717p7658E7578D389J6904K64828a68767j17194
12878b85961a25338l8832B51358H7962j4956b35347B12055A3534b2A86492d2244
12866a56490q2727A55315F5719g8788H4283b80699b2182j45257H629b21409g7103
12854C74090A61930e9064A61521a725B01141r7143M4134a50306A948f2801B28252
$$ plain form
12937 259066 203931 532609 -170382 8984 57555 144355 -190163 -230718 483256 -254511 118331
12925 56726 38672 222228 -138420 -160129 98065 178071 324688 148412 -18986 359517 37399
12913 38900 -395395 13855 46375 209426 51076 52261 309185 80370 7757 10704 57363 3251
12900 -136878 84630 -227765 -600023 -182822 270258 -36240 11949 -78390 173994 26397
12889 197824 359907 -136565 187555 218272 140614 57578 4389 21293 286121 -168767 -285961
12878 -285961 -125338 -164170 251358 87962 73006 -235347 212055 13534 -22 186492 -42244
12866 -156490 -239217 155315 65719 -78788 84283 -280699 -22182 -167439 8629 -221409 -77103
12854 374090 161930 -59064 161521 -1725 201141 103998 148132 -150306 1948 -62801 228252
12842C3742b6970q947j01366H3888B5904b72823O5338D862b4094p4930I8346J04939
12830B03285J17934G662a05085p2610C67841r5775A14587A6497j668J40815k5303
12819A30341b44237B00734i8484A03170m9285O9518R5086j01282J21408o0389
12809A78226c82565a09365A33684l9160h0597B18180i7004A41783a21173M9899
12799g1274k14108a00725A08743L08538A49969b87700A09213K57704a08768B50782
12788b42469d3354B15607a12500G3220a12372B36254G9648h6251J152B16453a6435
12776A7464b6422j26025D8075d3990O471A5182e0407m9633c522o6465I9889C5091
12763b54603b2025B83609q8832a47383c2249j88475R7658K4250b0815D0290e7860
$$ plain form
12842 33742 -26970 -35917 -137283 83888 25904 -272823 -207485 4862 -24094 -99024 98346 203285
12830 203285 321219 7662 -105085 -177695 367841 272066 114587 16497 14829 155644 130341
12819 130341 -244237 200734 -98484 103170 53885 123403 218489 117207 238615 178226
12809 178226 -382565 -109365 133684 94524 -80597 218180 -97004 141783 -121173 -71274
12799 -71274 -285382 -100725 108743 417281 149969 -287700 109213 366917 -108768 250782
12788 -242469 -43354 215607 -112500 73220 -112372 236254 79648 -86251 -85099 216453 -16435
12776 17464 -26422 -152447 48075 -43990 -37519 15182 -50407 -100040 -3522 -69987 99889 35091
12763 -254603 -22025 283609 194777 -147383 -32249 -220724 -123066 -98816 -20815 40290 -57860
12751b4767C2775i0818A04432b28160B1926M7656a72659G8432a35492p017H0285
12739b2168A07780P0149b68243a04873B86323b14889B87851L3667a84909K0812
12729a64097B62193f8180R560D4268J27111J24025a55662k24801L7894A11658
12718c7496B22909a90124H3963a7983j34013A15151j793k8529c16516I0601P2400
12707A63001a2919B73646J83688a7903B72352a1572A01500k1321r265N0103B9620
12695A50784a80992A8993N7081J19031b59282G368M22789b21845N1305k07059
12685c77599C55373a15275A61883J98633G6107E27J55980P1831B3762P0759a38674
12673B18680a89207C10307h137C41651F630a40292e9578A1693c8631C34129A20046
$$ plain form
12751 -24767 32775 -90818 104432 -228160 21926 69582 -172659 78432 -135492 -142509 80285
12739 -22168 107780 177929 -268243 -104873 286323 -214889 287851 321518 -184909 -164097
12729 -164097 262193 -68180 -58620 44268 171379 295404 -155662 -380463 -342569 111658
12718 -37496 222909 -190124 83963 -17983 -151996 115151 113358 84829 -316516 90601 163001
12707 163001 -12919 273646 457334 -17903 272352 -11572 101500 80179 70914 121017 29620
12695 150784 -180992 18993 76074 195105 -259282 7368 430157 -221845 -170540 -377599
12685 -377599 355373 -115275 161883 360516 76107 527 156507 228338 23762 94521 -138674
12673 218680 -189207 310307 -8137 341651 6630 -140292 -59578 11693 -38631 334129 120046
12661D4434k1301O3293J00486G7773N4384N0691Q7276c4524A02524J44100N3088
12650B99712D0340J10494a25851E6625a04311F5969e508A79440F9562P8146a32808
12638C18165C5897K8799J16114G5557K4788K54031j73146K62415a04970A25408
12627b9875A2937L08185A37084J34744b31426A95148l9590i5042B93387I4171
12616B24231K71498c0616C4794b9722k44020B87272H3089b2670A01834o886a49566
12604A96749i3728c3237C43315A65825e7285D23951E3991K72922f2937A96434
12593E84589A858K08635b04101B10484Q8947G125P7498N8933b06224B67230J0737
12582B77967O1304A11830E5419a61511O1207j4453H0732J7303I556a3149B44083
$$ plain form
12661 44434 23133 86426 186912 77773 132157 182848 270124 -34524 102524 246624 299712
12650 299712 40340 150834 -125851 56625 -104311 65969 -5508 179440 69562 147708 -132808
12638 318165 35897 64696 180810 75557 100345 354376 181230 443645 -104970 125408
12627 -29875 12937 321122 137084 271828 -231426 195148 155558 -95042 293387 94171
12616 224231 495729 -30616 34794 -29722 -273742 287272 83089 -22670 101834 94948 -149566
12604 196749 -93728 -33237 343315 165825 -57285 423951 53991 326913 -62937 196434
12593 584589 1858 210493 -204101 210484 299431 7125 84623 143556 -206224 267230 277967
12582 277967 339271 111830 55419 -161511 -100304 -114757 80732 98035 9556 -13149 244083
12570h5530D1847H906K24555a99874H127b47420d6550B00831o5253B9110b5087
12558c01178f7568a2825B17627r5487O5127q4142k1563M0098j2065e9415B52943
12546c06772G2178M8449a19434A22294i3447H1016a09196c9185l17190A38987
12535g6269j67167k07552i201A08905D1175a26694A20951b16749D3896J1735a66045
12523A46905K9843c21355J25112c3769A41523a40583D37252i1049L938c0898B3513
12511E761J51550b77714C8216K06717D958c5464B2635j531J43646f14272a35022
12499I3040a86675M334L1077B3841K152f0740k6042k22584A828K04739L7275e0749
12486I6948d478j70583H2034O291L74849A56322J43172G5453R6756h2471B45474
$$ plain form
12570 -85530 41847 8906 233461 -199874 8127 -247420 -46550 200831 135578 29110 -25087
12558 -301178 -67568 -12825 217627 122140 187267 103125 81562 121660 109595 -59415 252943
12546 -306772 72178 120627 -119434 122294 -93447 81016 -109196 -39185 -356375 138987
12535 -76269 -243436 -450988 -9201 108905 41175 -126694 120951 -216749 43896 55631 -166045
12523 146905 176748 -321355 -196243 -33769 141523 -140583 437252 -91049 -87111 -30898 23513
12511 5761 157311 -277714 38216 244933 4958 -35464 22635 21104 164750 -614272 -135022
12499 93040 -186675 -182341 -151264 23841 25993 -60740 -86782 -309366 1828 206567 243842 -50749
12486 96948 -4478 -175061 82034 88325 463174 156322 299494 75453 172209 -82471 245474
12474a04863M5938r9040L9264d4651C83787a88461f0941l3416D064a50843A87753
12462A5799a82880m4756A4669b39123A28748D1075A2517a25188N9798H8b70020
12450b87907C1401J28215K07894a0864H2232j6090R2111D5087R1370d80613b7691
12438C3047J62404G0877J40385a13797M486A42157J17797a80023O9631G9821C8026
12426b66017M2111A99851B9454f4064l78066b3146N191D57573D2340a27514k29570
12415c57084A88493L36215b95912d2632o5128c8953l7436j18610N0666m9346d6210
12403c60633J05635C8232e7618a3391E3301a6967k7723j07933c6732I4301b473
12391G335a73862A15665i8131J2633C08226q9307P2285A20637K5816k2775m9210
$$ plain form
12474 -104863 -58925 -157965 -118701 -44651 383787 -188461 -60941 -94357 4064 -150843 187753
12462 15799 -182880 -227636 14669 -239123 128748 41075 12517 -125188 -65390 88 -270020
12450 -287907 31401 159616 367510 -10864 82232 66142 158253 45087 136457 -480613 -27691
12438 33047 195451 70877 211262 -113797 -109311 142157 259954 -180023 -110392 79821 38026
12426 -266017 -223906 199851 29454 -64064 -442130 -23146 -17955 457573 42340 -127514 -357084
12415 -357084 188493 524708 -295912 -42632 -107760 -38953 -76389 -194999 -144333 -193679 -46210
12403 -360633 -254998 38232 -57618 -13391 53301 -16967 -44690 -152623 -36732 94301 -2473
12391 7335 -173862 115665 -98131 -85498 308226 218919 291204 120637 146453 123678 74468
12380G4468c9265G8307K21300a08773m7812P0001A71623k5699b7859l1662A07494
12368b56462C43731D7440K79015a34348H3749l9923J32651a5483D07445j10280
12358B97165H3368d6620o6474J2833D7596J05722D8125f5260B11200c64291b0490
12346B68828A15278g8253A43519M0174a49552o3278B12256I7159J42802d81285
12335C61428h1961B6012L41140h9900B23386D4989J95643j19892k2586K0879A1159
12323G6717J89091I2305L10540k6375a34122C96854H2943J95397p1219R661a61902
12311C65648c07431F9112J48633C8839L2931J32715O9375a29446E1904c4422O15
12300c3807r6145B46970r1744n886K20767a37655d0124A48033k8877M09938A95050
$$ plain form
12380 74468 -39265 78307 299607 -108773 -156585 -86584 171623 145924 -27859 -59521 107494
12368 -256462 343731 47440 326455 -134348 83749 43826 176477 -15483 407445 297165
12358 297165 83368 -46620 -113094 -100261 47596 153318 48125 -65260 211200 -364291 -20490
12346 268828 115278 -78253 143519 183693 -149552 -212830 212256 97159 239961 -481285
12335 361428 -81961 26012 367152 -89900 223386 44989 240632 120740 98154 119033 11159
12323 76717 265808 92305 402845 376470 -134122 396854 82943 278340 207121 216782 -161902
12311 365648 -307431 69112 217745 38839 71770 204485 273860 -129446 51904 -34422 -33807
12300 -33807 -129952 246970 155226 149340 370107 -137655 -40124 148033 119156 529094 195050
12288c6096A80913H3987k4084b65464f5093A64485D5435B0614R5165N5571P2705
12277B44055A14630L03173A70799Q1188r0777g7050l3616B63944a23798D95019
12266B16141j01629j8718J34114I5614L64269f4833A98330i6968B83815j15656
12256A68159J29644Q0775a07277B89766I8428K2536h4573K1790B4471O2794a92343
12244G3545j016B3769L09726r8736I572P635K06595B4691O184R6247e321k24608
12232b29929i7334A30377A8631j650K32423b07550D05811E1598J96006o8097L9676
12221B19183D7128L58695j96720N5873N2988J11005m3499A26417J54430F7623
12210a15035M2803B28956H4967K66615g8200B4570J14499P9616k2011g691A60031
$$ plain form
12288 -36096 180913 83987 59903 -265464 -65093 164485 45435 20614 115779 171350 244055
12277 244055 114630 417803 170799 251987 161210 -77050 -110666 263944 -123798 495019
12266 216141 114512 95794 229908 95614 459883 -64833 198330 -96968 283815 168159
12256 168159 297803 378578 -107277 289766 98428 120964 -84573 -62783 24471 87265 -192343
12244 73545 72529 23769 333495 234759 9572 17207 223802 24691 30875 127122 -5321 -229929
12232 -229929 -97334 130377 18631 16981 249404 -207550 405811 51598 247604 179507 219183
12221 219183 47128 405823 209103 264976 317964 428969 385470 126417 280847 67623
12210 -115035 -72232 228956 84967 351582 -78200 24570 139069 218685 196674 -7691 160031
12198I0447K8784J5862d9858C85579k0790j25117J06482J0273l1312A14880A5113
12186D29360A24377k0970Q561d1549D48846A78920J71791A26616J7770E5517J69907
12175B25424K72912A33776D4655J41986R125a09541H4531K84039n2905Q7661I2463
12163A85542k7659L50658m2156I8691O4602K2429L63039D4767K0281b2361C23943
12151d9301B2030M60761a04653A63621f1691D8126J30349b34431a06811D18535
12140B2288J36621i7430M1244A05219d8536J8954B60177j14580c1132F4248b3335
12128d5048H9725C7756f174b133E9459M7421K2454J25803a1265B95450q66C9571
12115E01334f6679A65313l9326c8943j01514E7984K60262j6445g2984E9830J57051
$$ plain form
12198 90447 119231 135093 -49858 385579 364789 239672 346154 356427 325115 114880 15113
12186 429360 124377 103407 111968 -41549 448846 178920 350711 126616 144386 55517 225424
12175 225424 498336 133776 44655 186641 195766 -109541 84531 368570 315665 403326 92463
12163 185542 157883 508541 466385 98691 163293 185722 548761 44767 65048 -22361 323943
12151 -49301 22030 482791 -104653 163621 -61691 48126 178475 -234431 -106811 418535
12140 22288 158909 -97430 -56186 105219 -48536 -29582 260177 145597 -31132 64248 -23335
12128 -45048 89725 37756 -6174 -2133 59459 106880 129334 255137 -11265 295450 294584 39571
12115 501334 -66679 165313 125987 -38943 -140457 57984 318246 301801 -72984 59830 216881
12104B16881E0664b5775D28422q9945j51743b5408B03482G7593L4103b80371G7092
12092D12258d6306A93784o3582R5518n2100K34130B02117E969K61503H2748K02635
12081B85383h0762A32981l7655a3167C53260b17415a8242B82947a99472A40140
12070D8179K38857F171a18946B88635a37701A78111J2404J4419a28846j12581
12060b41427J16695j43791J04717C817c27367a26993A60463g981A28702i8019
12049e9734m0375l3516b1538A19569M9001a76456K9787B58243j13600B3638i8192
12037a10886G5713e0175A72398C6533g6726A4534a0808D2801b01853D2008c59774
12025g2090A16609J6143d15512A17196h8049B85922q1657h7670B70290i7214M5878
$$ plain form
12104 216881 50664 -25775 428422 338477 186734 -25408 203482 77593 111696 -280371 77092
12092 412258 -46306 193784 130202 225720 173620 407750 202117 5969 267472 82748 285383
12081 285383 -80762 132981 95326 -13167 353260 -217415 -18242 282947 -199472 140140
12070 48179 287036 6171 -118946 288635 -137701 178111 190515 204934 -128846 -241427
12060 -241427 -124732 -268523 -163806 3817 -327367 -126993 160463 -7981 128702 -98019
12049 -59734 -100109 -133625 -21538 119569 168570 -176456 -146669 258243 144643 23638 -98192
12037 -110886 75713 -50175 172398 36533 -76726 14534 -10808 42801 -201853 42008 -359774
12025 -72090 116609 132752 -415512 117196 -88049 285922 204265 -87670 270290 -97214 -51336
12014e1336B33347n5254k4764c20984D5483Q5411a17434C62159d09110A11307
12003A46771a71711C1455d93811a6203G6607J9985a61369g8066D6446K49747a28777
11991c61011a17098q0512m4828B10665a47558j40562g1545A82170C8590c6839
11980b12292J05005o2361H9890b47780A57255b1645j23714G901a36306K6987B07586
11968E514O898J22247d75441A39264l4719J10243F9769d49596a0509A4990a33263
11956b86090B2617A318L0835A0754J60024q1772J45239a07315m4712A7059K02532
11945B19591E3388J19749n1835e0590m0234L3367j34476k13379c2340B08385f3603
11933c6370P831k72868i1130b7490k46352e167j28289C05350r5708b62666B3439
$$ plain form
12014 -51336 233347 178093 153329 -320984 45483 130894 -117434 362159 -409110 111307
12003 146771 -171711 31455 -493811 -16203 76607 96592 -161369 -78066 46446 296193 -128777
11991 -361011 -117098 -197610 -242438 210665 -147558 -288120 -71545 182170 38590 -36839
11980 -212292 -107287 -169648 89890 -247780 157255 -21645 -145359 7901 -136306 -109319 207586
11968 5514 12412 134659 -475441 139264 104545 214788 69769 -449596 -10509 14990 -133263
11956 -286090 22617 1318 32153 10754 170778 89006 234245 -107315 -152027 17059 219591
11945 219591 53388 173137 121302 -50590 -90824 -57457 -191933 -405312 -32340 208385 -63603
11933 -36370 -28539 -301407 -91130 -27490 -273842 -5167 -133456 305350 209642 -262666 23439
11921a85224B90423b32875A3712K55327b55127A85494d4289k01115N8533k2729
11911b09600B04059l8742E6542a97495B7353J16046N3462c2117m0048I7165h6032
11899a26512C25556A2237J46310a05534j03687A06173h7400j33308c4900a0033
11888F5605K0475A9029J49330L2128d35362D4641K14607r014A14727D7589i493
11876b05211C73075E2156M272P64a98425j912A99554f1152D5870Q9734a60258
11864E8629e1791A63640d83372B3140f0040j19224A5514R5257c57240I6384c35461
11852e5819k03971b332j83749C4105g2700B22839b3662j27081j66348g0896r5436
11841a66332m0010C62596a17870D4344i8885G7319B384O3646O9306a76389k10080
$$ plain form
11921 -185224 290423 -232875 13712 269039 -255127 185494 -44289 -245404 -186871 -209600
11911 -209600 204059 165317 56542 -197495 27353 143399 196861 -32117 -72165 97165 -86032
11899 -126512 325556 12237 158547 -105534 -209221 106173 -87400 -220708 -34900 -10033
11888 65605 86080 19029 168359 200487 -435362 44641 259248 250234 114727 47589 -9493
11876 -205211 373075 52156 56428 57192 -198425 -200337 199554 -61152 45870 135604 -160258
11864 58629 -51791 163640 -483372 23140 -60040 -179264 15514 110771 -357240 96384 -335461
11852 -55819 -259790 -2332 -186081 34105 -72700 222839 -23662 -150743 -317091 -70896 -166332
11841 -166332 -206342 362596 -117870 44344 -98885 77319 2384 66030 135336 -176389 -386469
11830c86469m333a11672b1366j42427I9812A4562J43370f3152E0987a17638A41486
11818a71831j44000A10937K9019a80053e3178j21141h783m18742h2907b4058j9041
11807d3099k50091G4913f8155b1982k32445Q9000P5836j567e129j08239B8924
11795d2071A51317b6031I70J20685P2841M7901b22493a07618M6400k7580G986
11783d2468o354A95932b36013A57478a22093a5904B38670G2069L1488a41529o9106
11772b10635d188k45543H5673h3064C7516f2609g395k6109k15790B24751c46244
11760d6245H1473a03680G1158a54678B55887A8674e4174k65148D45127j56540
11750B88587a44881j00522F4688g3004C784a66879h836B24471g9254F7038c06240
$$ plain form
11830 -386469 -390802 -111672 -21366 -163793 99812 14562 157932 -63152 50987 -117638 141486
11818 -171831 -315831 110937 139956 -180053 -53178 -174319 -8783 -427525 -82907 -24058 -43099
11807 -43099 -293190 74913 -68155 -21982 -254427 -165427 -89591 -91158 -5129 -113368 28924
11795 -42071 151317 -26031 970 121655 194496 242397 -222493 -107618 -61218 -88798 7986
11783 -42468 -48822 195932 -236013 157478 -122093 -15904 238670 72069 103557 -141529 -210635
11772 -210635 -4188 -249731 85673 -83064 37516 -62609 -7395 -33504 -249294 224751 -346244
11760 -46245 81473 -103680 71158 -154678 255887 18674 -54174 -319322 445127 288587
11750 288587 -144881 -245403 64688 -73004 3784 -166879 -8836 224471 -79254 67038 -306240
11738h6850j86329a34003N7512m7976A91917a15539H8727C6500f0419j99311I5209
11726E6843A295a33048D1894f6845j0109j24868I9264P784I539R3950h115j74510
11714a82625c8791A13404a36061A99092e7062A55809B2484a07551o8756A04062
11703A21808m1041a43066D74706k03574n7443G2501a33765k14421a03311j00804
11693b04115f1392o1091C68423a93443G1411b04533A34948a13675B8158J65568
11683A93726b62538e2800A14332a06381A25824m6452c59430l6058A49789F3921
11672a7491C63701e1841c880C04041A13665C519c24118a1417A81488B2047L86496
11661D08543c4284J1273k47963B05517e3750l02753G7009b9399A97978c1059k45259
$$ plain form
11738 -86850 -273179 -134003 -76491 -124467 191917 -115539 88727 36500 -60419 -259730 95209
11726 56843 1295 -133048 41894 -66845 -76954 -201822 99264 107048 9539 103489 -8115 -182625
11714 -182625 -38791 113404 -136061 199092 -57062 155809 22484 -107551 -176307 104062
11703 121808 80767 -143066 474706 271132 213689 72501 -133765 -348186 -103311 -204115
11693 -204115 -61392 -122483 368423 -193443 71411 -204533 134948 -113675 28158 193726
11683 193726 -262538 -52800 114332 -106381 125824 79372 -359430 -395488 149789 63921
11672 -17491 363701 -51841 -3880 304041 113665 3519 -324118 -11417 181488 22047 408543
11661 408543 -34284 -23011 -270974 205517 -53750 -356503 77009 -29399 197978 -31059 -276318
11650b76318a0043B1479J52205i2920G6584C4388J94657A12533n0420a42528M9654
11639i2874k5521B44551H1566b24227D8692a35820B4839b63724R3411C4369A5044
11627a97953A82316n1512b38686h9606G5079b6197B7081J67132E7121k1508J95972
11616B31585A3058R6915g0477g582A03744j8671b36924B33544A6251J11314c5679
11604A67208a4055k81565J25005A27317l1318D2512a61539c76B23631a28545I329
11592a13732r5558B28766A8953a85083D3256b23591A60071E2889f4720B64484
11581g5675B80904G5100L48672b58778l3596M3531B56619p7942o7613K71285B7031
11569H3759h1766A55835n389G912J54186G3036j9923a27838m6345B36635P7388
$$ plain form
11650 -276318 -10043 21479 173684 -92920 76584 34388 229045 112533 62113 -142528 -92874
11639 -92874 -118395 244551 81566 -224227 48692 -135820 24839 -263724 -170313 34369 15044
11627 -197953 182316 130804 -238686 -89606 75079 -26197 27081 194213 57121 35613 231585
11616 231585 13058 109973 -70477 -7582 103744 85073 -236924 233544 16251 127565 -35679
11604 167208 -14055 -295620 -170615 127317 95999 42512 -161539 -376 223631 -128545 9329
11592 -113732 -209290 228766 18953 -185083 43256 -223591 160071 52889 -64720 264484
11581 -75675 280904 75100 423772 -258778 -292374 -248843 256619 178677 111064 382349 27031
11569 83759 -81766 155835 150446 7912 162098 73036 53113 -127838 -174183 236635 314023
11558C14023I2023j9240J76874g9982C255K07486a182D71173a44390I1647k2299
11547F9348j5019K16464a65965B39153l4566O5521a16788A77482K64298B12791
11536A45502L06653B08693c67740a1476A92935k3880e9452A99955D8809J194J59756
11525B09759G957K54175R9784a07671A83413n9588b07217A50978L9819E7962K41274
11514B99236H6888K53208C0747c34546a22369G2611O4441M2953M11225b64633
11503C25010B8279a46705A34037J07321I3468J76975q7675a18055A95139J88698
11493C83837I2621a27506H53311C3656J81318Q294j10313P1871Q6105I3645K9585
11482A23230Q3059b69769A88210a59239l064C1154J28188K65979A43420J62467
$$ plain form
11558 314023 92023 72783 249657 -79982 3255 210741 -1182 471173 -144390 91647 69348
11547 69348 54329 270793 -165965 239153 204587 270108 -116788 177482 441780 212791
11536 145502 452155 208693 -367740 -11476 192935 169055 -59452 199955 48809 50003 209759
11525 209759 7957 262132 361916 -107671 183413 123825 -207217 150978 190797 57962 299236
11514 299236 86888 340096 30747 -334546 -122369 72611 137052 180005 591230 -264633
11503 325010 28279 -146705 134037 241358 93468 270443 182768 -118055 195139 383837
11493 383837 92621 -127506 853311 33656 214974 223268 112955 184826 270931 93645 123230
11482 123230 206289 -269769 188210 -159239 -162303 31154 159342 425321 143420 305887
11472C05887A18153K11726i8254D39847A90821h1878H3901R0029J67688C2458
11461D56976G9732o004K32456A40691h2003C97684c4585A12001k1339a81781A84806
11449B66741E343c16891C5654J02930F7783k4731K48703B8735M81682d9883o583
11438e6466D2835M0539M10925A10241g5093C90707G9760J16507a07577K1160A40814
11426A62985J62758a72537N841f4026j3533q4778l1276C16371A34939E5808m954
11415E0854b63922F7012j9568a79394g8052B51422p8969d52238C04532j32157
11405A72375a3409B35415A11246b67089I761d69742b1286Q973k2303C1431K1511
11394E2942a55114M3730K4097B20611b94427e6623C70720e9795F9261k4531h0290
$$ plain form
11472 305887 118153 329879 -98254 439847 190821 -81878 83901 173930 341618 32458
11461 456976 79732 73728 306184 140691 -82003 397684 -34585 112001 90662 -181781 184806
11449 266741 5343 -316891 35654 138584 67783 43052 291755 28735 510417 -49883 -56466
11438 -56466 42835 83374 494299 110241 -75093 390707 79760 196267 -107577 -86417 140814
11426 162985 325743 -172537 -166696 -64026 -77559 -162337 -193613 316371 134939 55808 50854
11415 50854 -263922 67012 47444 -179394 -78052 251422 172453 -452238 304532 172375
11405 172375 -13409 235415 111246 -267089 9761 -469742 -21286 -12313 -34616 31431 52942
11394 52942 -155114 -111384 -87287 220611 -294427 -56623 370720 -59795 69261 44730 -80290
11382c09422E6457l810b18304E2555c0944j42771A72888k4883O3525P9809a4154
11370a9953k40921G976J73934b04967d520C7877f1996l7489B89175a90090A11771
11358C2394L8627f3551C03403O2933a41591K6949A64515L1455k9520i1336A66084
11346e4987j19927c455A24273R5059i6536j15868B29111b1357l50544A03092g5798
11334b37426C61571d18357B75282C7574f1095r679B6148b48990C56294b39903
11323A10859c92409a3756O254l15428A03267b31699F7138J55089l5777b38464
11312a85658C47781I5894R6574D4195L3315a58920F2156f6797B64451i8131j4595
11301a12726l46519a09741A18919J35770b74243D3730b49402f3896J8639j77837
$$ plain form
11382 -309422 56457 52647 -218304 52555 -30944 -173715 172888 148005 211530 291339 -14154
11370 -19953 -260874 7976 181910 -204967 -4520 37877 -61996 -99485 289175 -190090 111771
11358 32394 71021 -63551 303403 366336 -141591 -114642 164515 195970 166450 -91336 166084
11346 -54987 -174914 -3455 124273 219332 -96536 -212404 229111 -21357 -371901 103092 -75798
11334 -237426 361571 -418357 275282 37574 -61095 -70774 26148 -248990 356294 -239903
11323 110859 -392409 -13756 -7502 -322930 103267 -231699 67138 222227 186450 -238464
11312 -185658 347781 95894 192468 44195 77510 -158920 62156 -66797 264451 -98131 -112726
11301 -112726 -459245 -109741 118919 254689 -274243 43730 -249402 -63896 -45257 -223094
11291b23094H625b55801f1962B86414A05177b51277A63362d69247B2659G483b52649
11279f810l08571A44985b3610q6556p1876K5780j22881A11574b6533A61350c53512
11267H5956e2027q6053e7497q951k31889e4316j81944h0906C8146e2854j42925
11256a95779A23923a9814B51981f8883g734o5417m8910r9062H6031L4365a33330
11244b29640N4685F229h4771L0643a0649l49034e9626I6598k9322a42568M6456
11233i6112j42326J04656k2407f8725o3147n3699A00088m7657M1875g9049j49666
11222b28715O6609I8924b3370p0098r3272J4220P6782A39282g5779n9000o3315
11211a98094A57398c58058a1164k30948k06509c8229A41543a51283k40117a42314
$$ plain form
11291 -223094 8625 -255801 -61962 286414 105177 -251277 163362 -469247 22659 7483 -252649
11279 -6810 -315381 144985 -23610 -110166 -182042 -156262 -279143 111574 -26533 161350 -353512
11267 85956 -52027 -138080 -57497 -66448 -298337 -54316 -236260 -80906 38146 -52854 -195779
11256 -195779 123923 -19814 251981 -68883 -7734 -73151 -122061 -221123 86031 120396 -133330
11244 -229640 -174955 6229 -84771 -54128 -10649 -359683 -59626 96598 67276 -142568 -96112
11233 -96112 -238438 -133782 -156189 -68725 -131872 -185571 100088 52431 94306 -79049 -228715
11222 -228715 -162106 98924 -23370 -93468 -186740 -172520 -95738 139282 -75779 -134779 -198094
11211 -198094 157398 -358058 -11164 -242112 -448621 -38229 141543 -151283 -391400 -142314
11200C99d37542a27206m912l9484A2535b15605M3198j10027B2174B446H84K69645
11188B70529d47755Q5833J53451F9684R8659L7238b80735b7077r4026O0098j21049
11177a82054c2536B8286h5062l75969A39666L9737e38628B9366a27450j84262
11167c11712f9224I8600a43533k4306l2503e3335p9595j13338d6725J3939J5704
11156a7082j84636B31693a01331C1135a61521G3542H485b20028D75262h7239j11115
11145a98354K5607D33999A67824b3597j3697j38754m5944g3857A53410K7610D0897
11133f2220b6599H1338a5948j09349e6855K3117A63950c0337M560l62921A26019
11121C0322e7266A75961Q3250c96053E9004a98765h0059A75862E9118O066R5225
$$ plain form
11200 399 -437542 -127206 -132118 -171602 12535 -215605 -172407 -282434 22174 2446 884 270529
11188 270529 -447755 -361922 -208471 69684 168343 205581 -280735 -27077 -121103 -61005 -182054
11177 -182054 -32536 28286 -85062 -461031 139666 179403 -538628 29366 -127450 -311712
11167 -311712 -69224 98600 -143533 -167839 -200342 -53335 -132930 -246268 -46725 -32786 -17082
11156 -17082 -201718 231693 -101331 31135 -161521 73542 8485 -220028 475262 -87239 -198354
11145 -198354 -172747 433999 167824 -23597 -37294 -176048 -221992 -73857 153410 181020 40897
11133 -62220 -26599 81338 -15948 -125297 -56855 -33738 163950 -30337 -25777 -388698 126019
11121 30322 -57266 175961 259211 -396053 59004 -198765 -80059 175862 59118 65184 160409
11110A60409R885o0185a85910A89179M6359b04833A90041c6391m6064B36243A13564
11098B07023d3079E46702j18886F7880L61257k6021q142N0238L7733A55756O0472
11087B16228N85813k20915H4783K68985E2484J41143Q2932E7268L39141K22417
11077F18826A56029M064B6866M78185n9606j657J10552J51668l37011A24980K53292
11066C78272k0092A58869K36704M9389J79225k10491J36556K5507J71311k17733
11056E29337K05906J05661D17747P06442m98524J9160L64073K1527k78137L30252
11046A082540D00738M99670K1467L34377J31714o65129Q4243O2316P8462J80261
11036A128119J12176m52150o2981K51001m11006N14047k49581J81054j27726K77690
$$ plain form
11110 160409 170294 110109 -185910 189179 235538 -204833 190041 -36391 -82455 236243 113564
11098 207023 -43079 546702 427816 67880 429137 403116 394974 445212 482945 155756 216228
11087 216228 802041 581126 84783 353768 52484 193627 276559 57268 396409 618826
11077 618826 156029 160093 26866 505051 445445 443788 554340 706008 368997 124980 378272
11066 378272 358180 158869 395573 444962 624187 413696 550252 575759 747070 529337
11056 529337 735243 840904 417747 1124189 625665 644825 1008898 1030425 752288 1082540
11046 1082540 400738 900408 921875 1256252 1387966 722837 807080 869396 947858 1128119
11036 1128119 1240295 788145 725164 976165 565159 1079206 829625 1010679 882953 1160643
11026A160643m01683J92715k12360K29526l13942k6745N4935k5478L3786K52469
11016I43866K63901m10277J67481m62387M04722k38493J88990j68615P1841K72977
11006A034006l6703q5510j13102j26969K74086j56897j09914r0910J11276k2488
10996F76875r1860M4969L66215k47689J86049n1840j32098K30091j01664P7523
10986I56571j149j22838j87998L82884J28421l81725K99557K29443l71250N93583
10976A525499l52844Q86012n09779P27891r2823L76587J70617L1704L24042Q4042
10966C170948N0711J59749j87836k28678j85542q54143p2865k80622L08769K74311
10956B154802m77385j23022l2978K49171M04k33397O0497j39305o06804m02656
$$ plain form
11026 1160643 758960 951675 739315 968841 654899 628154 683089 657611 691397 943866
11016 943866 1207767 797490 964971 502584 907306 668813 857803 689188 761029 1034006
11006 1034006 997303 911793 798691 671722 945808 788911 678997 588087 699363 676875
10996 676875 585015 629984 996199 748510 934559 882719 750621 980712 879048 956571
10986 956571 955422 832584 644586 1027470 1155891 774166 1073723 1303166 931916 1525499
10976 1525499 1172655 2058667 1548888 2276779 2183956 2560543 2731160 2762864 3086906 3170948
10966 3170948 3221659 3381408 3193572 2964894 2779352 1925209 1852344 1571722 1880491 2154802
10956 2154802 1677417 1554395 1521417 1770588 1770992 1537595 1598092 1458787 851983 449327
10946D49327K66231q2350r3102j30953M9645j791c1876A04104M09033A5685K72980
10935B88665L9753k3592a44485A58353I872J79124b12072N7784r9357A97697e1643
10923d2394k49173g5454R676q3073L831c820A80865a77185A6687d5291B32752
10911D61278h1174J2394D12016b11179P0876r2031h4648b7381A854b8480n0991
10900g9471D1637P6634f7063G1502a39739j96777J43459A6907f7050E4978f8601
10888A49923a41136A97586Q6797g3209k37055A51914L01714A63611b62826f2401
10877D2137b21427L1087p6747h2175C3137K4000d03988I3852J680J50099E5849
10865B84088a03268A68177b90283D5756J00349P0205E5136J00087e19395D6078
$$ plain form
10946 449327 715558 633208 540106 409153 458798 457007 -31876 104104 513137 15685 288665
10935 288665 328418 304826 -144485 158353 9872 188996 -212072 -154288 -253645 197697 -51643
10923 -42394 -291567 -75454 -65778 -148851 -145020 -3820 180865 -177185 16687 -45291 232752
10911 461278 -81174 -68780 412016 -211179 -140303 -232334 -84648 -27381 1854 -28480 -79471
10900 -79471 41637 118271 -67063 71502 -139739 -336516 -193057 16907 -67050 54978 -68601
10888 149923 -141136 197586 284383 -73209 -310264 151914 453628 163611 -262826 -62401
10877 42137 -221427 -190340 -267087 -82175 33137 57137 -403988 93852 95532 245631 55849
10865 284088 -103268 168177 -290283 45756 146105 216310 55136 155223 -519395 46078
10854C2455b07913A6971d8171n814j15606n6779C80069b75310C98812e8233q0258
10843a38491A7441J61593b60590d4279B2563d4494k47013A496N8285b96812a22206
10831i4682k35019h2536G0720b7369A20819K04693a57705H5632e541k70914j0133
10820b86588B93305a03869d9912c467j05289H8390b84627i9750a3534j49029B07480
10808b52823b8761j68758J0672N5264i24p0807A29648b15881e1682j52697f3067
10796a83155A27502a46560j55107D2849M5568C3854a41448M0197o8673A32780
10785A45752B3825a52058c8286j89651A26125A8511L59348a02291C3384c7371
10774b7879j73917B8788c1497F0169J15175a65249B03170C2675J60164c18857
$$ plain form
10854 32455 -207913 16971 -48171 -53985 -169591 -226370 380069 -275310 398812 -58233 -138491
10843 -138491 17441 179034 -260590 -44279 22563 -44494 -291507 1496 59781 -296812 -122206
10831 -94682 -329701 -82536 70720 -27369 120819 325512 -157705 85632 -5541 -276455 -286588
10820 -286588 293305 -103869 -49912 -3467 -108756 88390 -284627 -99750 -13534 -162563 207480
10808 -252823 -28761 -197519 -186847 -131583 -924 -71731 129648 -215881 -51682 -204379 -63067
10796 -183155 127502 -146560 -301667 42849 88417 33854 -141448 -101251 -169924 132780
10785 145752 23825 -152058 -38286 -227937 126125 18511 377859 -102291 33384 -37371
10774 -27879 -201796 28788 -31497 60169 175344 -165249 203170 32675 192839 -318857
10763a29031B15107j4145f2908j49590e8878b6858D1112b28822j02522d4479A2984
10751G007a46627k4235H1174B6786c13000A43665f3332E5657K89291d7028A43599
10739B91357A07097g6408o065c6579A0712a29521N7396m3822A57119G5364c91654
10727a16332L6575j21184A59702K87b9089j66821a0558j86903F8481j7292L5651
10716H6840c74567a86404f9811D5160f1219B8932a58604j65291j4886b7022D0434
10704C09081h4897G4960H241O9490a06123G0986g5070A55821G7836c21988a6077
10692D1733A3443a79124A9629a53908B10971G6844A8105b08980M1375q5851j7982
10681b71438J27936A9940C193e43953a37955K1137k66490O8259a4447j52318P509
$$ plain form
10763 -129031 215107 200962 -62908 -212498 -58878 -26858 41112 -228822 -331344 -44479 12984
10751 7007 -146627 -170862 81174 26786 -313000 143665 -63332 55657 344948 -47028 143599
10739 291357 107097 -76408 -82473 -36579 10712 -129521 -72125 -115947 157119 75364 -391654
10727 -116332 -79757 -200941 159702 159989 -29089 -195910 -10558 -197461 68481 51189 86840
10716 86840 -374567 -186404 -69811 45160 -61219 28932 -158604 -323895 -338781 -27022 40434
10704 309081 -84897 74960 8241 77731 -106123 70986 -75070 155821 77836 -321988 -16077
10692 41733 13443 -179124 19629 -153908 210971 76844 18105 -208980 -167605 -253456 -271438
10681 -271438 -143502 19940 3193 -543953 -137955 -116818 -383308 -315049 -14447 -166765 -159256
10670a59256n6456B1670D216b25718D7046L1424l2365b26887D8787O8090n3546
10659F3331f6135A34730b42128N3395P0051o8213A51945a6170l02287J43281d2232
10647B46886B9545a0235q3280l36394a49259F4985N5446b01038F5182e3389I2150
10635A84663d65428h5086E129K0831R5142P681b93383J45381a9780m2022l86693
10624d48495G5472b40613M2500k1832C38421A1550K48298a10521r7189B38668
10613a77912g7395l33237a41768n1259E7238B4073J64004a60196d1284n2233l0948
10602a24465l8281j21142g2280A81624E754K34935a29415N5101G3783b97611J26335
10591a71276j18260B13380H841b69591A53393i8460K8860G2760J31881F3497b47332
$$ plain form
10670 -159256 -215712 21670 4216 -225718 47046 78470 46105 -226887 48787 116877 63331
10659 63331 -66135 134730 -242128 -188733 -118682 -186895 151945 -16170 -318457 -175176 -42232
10647 246886 29545 -10235 -93515 -429909 -149259 64985 120431 -201038 65182 -53389 92150
10635 184663 -465428 -85086 5129 25960 121102 128783 -293383 -148002 -19780 -61802 -448495
10624 -448495 75472 -240613 -198113 -219945 338421 11550 259848 -110521 -207710 238668
10613 -177912 -77395 -410632 -141768 -193027 57238 24073 188077 -160196 -41284 -93517 -124465
10602 -124465 -162746 -283888 -72280 181624 5754 240689 -129415 -74314 73783 -297611 -171276
10591 -171276 -289536 213380 8841 -269591 153393 -98460 -69600 72760 204641 63497 -247332
10579A41785b37558r1596g2017G4795J60701a42275H8570A8500c4164A07880N2113
10568A59993a89485b8981k2017K253j58766B03388f4924k85201I3398K1306a53901
10556H7173b71556J4285A21702c71276h5188j62661C9603i4272A44397g7298a6100
10544g4434B21776d4499a1491p7078c7378E535R3532a22285C68646b95970g8068
10532a71229J4947a7433k8535j90912A20909i8599D3787j654R9900a36421A32879
10520D7036a52844B2467e30243A21911a99032h9036C00202c56772a12916j97371
10510c10287H5773A1743c2819A59685f79D6183J5042d3206q8468k0263j16818
10499b68755g4912k07257a33524e8122I7557C5264J36394a39684H4575j9480e280
$$ plain form
10579 141785 -237558 -329154 -72017 74795 235496 -142275 88570 18500 -34164 107880 159993
10568 159993 -189485 -28981 -50998 -48745 -207511 203388 -64924 -350125 93398 114704 -153901
10556 87173 -271556 -257271 121702 -371276 -85188 -247849 39603 -94272 144397 -77298 -16100
10544 -74434 221776 -44499 -11491 -88569 -37378 5535 99067 -122285 368646 -295970 -78068
10532 -171229 -156282 -17433 -45968 -236880 120909 -98599 43787 42133 142033 -136421 132879
10520 47036 -152844 22467 -530243 121911 -199032 -89036 300202 -356772 -112916 -310287
10510 -310287 85773 11743 -32819 159685 -679 46183 61225 -43206 -131674 -151937 -268755
10499 -268755 -74912 -282169 -133524 -58122 97557 35264 171658 -139684 84575 65095 -5280
10487a1523p0405D6136k811g722l1092k03524J00291M9743A05245E60L08695J44268
10475D53523J16298B62641M1405j36391n3586l9591M1970m4699a4224A8267K6246
10464D4513I026P4809M9464F4803d12446B01998c03508P6416o1769d0155j4723
10453e4878C5129j1435q412a92470a6575k8023j89746B21957H8290e5200j61533
10442b16733a3226k94229A05176b4843k52385N7163Q6477p5949R3411D76573a83220
10430d67399a68933F8170a10743j00785A53210a3701k71284a13400l02170b9988
10419g0197j09619q3891a0408F5554j2625J27958l9011e4610k04232a2076C88040
10407H1044d29758J88057J04112A48584o7338a8064j19894E6891a51766j18809
$$ plain form
10487 -11523 -81928 46136 43325 -7722 -38814 -242338 -142047 -92304 105245 560 309255 453523
10475 453523 569821 262641 304046 167655 114069 74478 116448 71749 -14224 18267 44513
10464 44513 9026 83835 133299 64803 -412446 201998 -303508 -227092 -288861 -40155 -54878
10453 -54878 35129 23694 15282 -192470 -16575 -44598 -234344 221957 88290 -55200 -216733
10442 -216733 -13226 -307455 105176 -24843 -277228 -220065 -133588 -209537 -116126 476573 -183220
10430 -467399 -168933 68170 -110743 -211528 153210 -13701 -284985 -113400 -415570 -29988
10419 -70197 -179816 -263707 -10408 65554 52929 180887 141876 -54610 -258842 -12076 388040
10407 81044 -429758 -241701 -137589 148584 81246 -18064 -137958 56891 -151766 -270575
10397b70575B2700b9593j60989g3785l1317b3209B46089K10253m2405j57718J50733
10386D06952A13970J07970G5927l3800O5996J00632R4496E0588f0156j498D37104
10374A70562K75353j92865K8744K9514P2120J45521j28089R4638B41934O2615
10364C04549M03067k9949q2980k19384L43776k25872k28415j17222J29280A20914
10353A52401O8499K07042j72484J14127N680L85511l3508l27847J9063j41391
10343B77093J21846L45927B80807K83221C8470q91M7692J39545k3363I4726J39567
10332B34293K3409E1325K38574A08174E2642i6017A68747h7080j30514J08424
10322a09170r7747C46012A07113E1709Q9314K41296j07088A10348e6128A20418
$$ plain form
10397 -270575 22700 -29593 -190582 -73785 -105102 -23209 246089 456342 413937 256219 406952
10386 406952 113970 221940 75927 42127 108123 208755 303251 50588 -60156 -61654 437104
10374 170562 445915 253050 281794 311308 383428 528949 400860 495498 241934 304549
10364 304549 707616 677667 594687 375303 719079 493207 264792 147570 276850 120914
10353 152401 220900 427942 255458 369585 375265 760776 727268 399421 418484 277093
10343 277093 398939 744866 280807 564028 38470 37579 85271 224816 201453 94726 234293
10332 234293 257702 51325 289899 108174 52642 -96017 168747 -87080 -217594 -109170
10322 -109170 -206917 346012 107113 51709 141023 382319 275231 110348 -56128 120418
10311a57268r619b5366F9620R9140i4244j86820D8888a28689F2590j0016h2184
10299a03253A65308a94408P1837K2742G886J22334B968b06950B27965j4864b14853
10287b17145R6133c1271a5128G0203J05762h8345F359f6843L1551k9507A00381
10275b75771B59767a22639a0544B09677A4259a57159a3584A19419J08728B6884
10264b17859P5067P0409q064B2068b3093A0507J9948h6180A54957o4152M4666
10253A35471a46138b4316D919O58932e761A76096H3185l4644f187C1465c40644
10241G1428a52398e3131o4268q4980R3179C40877d06872e6867B10306d24152a5981
10229B6276b46838B92373a32947N2976A34848a50422f9295D3287M3823a95581
$$ plain form
10311 -157268 -166887 -25366 69620 168760 -94244 -281064 48888 -128689 62590 52574 -82184
10299 -103253 165308 -194408 -122571 -99829 7886 130220 2968 -206950 227965 213101 -214853
10287 -217145 -121012 -31271 -15128 70203 175965 -88345 6359 -66843 -35292 -64799 100381
10275 -275771 259767 -122639 -10544 209677 14259 -157159 -13584 119419 228147 26884
10264 -217859 -142792 -72383 -80447 22068 -23093 10507 30455 -86180 154957 90805 135471
10253 135471 -146138 -24316 4919 663851 -5761 176096 83185 48541 -6187 31465 -340644
10241 71428 -152398 -53131 -117399 -202379 -109200 340877 -406872 -56867 210306 -424152 -15981
10229 26276 -246838 292373 -132947 -79971 134848 -150422 -69295 43287 87110 -195581
10218D9604g739j19160j4736l10720C2547A5641J9438d90202B7014a78800g1703
10206a42378o2275A17182b91717I688K11946b05794H6202d23936D8104b71983
10195e972A42979c47897J05932F7358e5012A31338n4598a24211N0381J829q1850
10184a53851g2816C00713e4657a5690B20453a22376e4773k99636j30135A56578
10173c80278a28748n3249J2389M1022A0500c80556J36573p6347A92136b02415
10162I6668a49961B1932L45252h6500A33175f1764j17734G272M0979h0837a2642
10150E6996M8534B229J93248b43511A06068a55007f6782r148A10147d88779j6846
10139e05625i3087R505G5034b48823Q1148F3290b16531O7023I8086a63383A7111
$$ plain form
10218 49604 -7739 -126899 -141635 -452355 32547 15641 35079 -490202 27014 -178800 -71703
10206 -142378 -204653 117182 -291717 9688 221634 -205794 86202 -423936 48104 -271983
10195 -5972 142979 -347897 -241965 67358 -55012 131338 76740 -124211 -73830 -72001 -153851
10184 -153851 -72816 300713 -54657 -15690 220453 -122376 -54773 -354409 -484544 156578
10173 -380278 -128748 -181997 -169608 -128586 10500 -380556 -243983 -320330 192136 -202415
10162 96668 -149961 21932 367184 -86500 133175 -61764 -179498 7272 48251 -80837 -12642
10150 56996 105530 2229 195477 -243511 106068 -155007 -66782 -75930 110147 -488779 -505625
10139 -505625 -93087 -83582 75034 -248823 -167675 63290 -216531 -149508 98086 -163383 17111
10127h3677l8510A55443A1862a33422l90598a65000B6643c78988B3315d5862n3271
10116i9133j50829r9705m6303h4557G0257d3810b0505B5926b52883N3818b6942
10104A96235h1541l6715K6551o3838c3531j90722G6517d9092F2934a85169M2151
10093a43018l7592e2339j60805B76187a8093k1693l4143n3094l22159B88584a09821
10081h1016j8034j49132G550J13787b09938A67328e3251E4117a36557B6106A693
10069a68149H5135J19f0756l03911i4780j34759c9722G7753g6770j45431b5812
10057A19323L7624m3382b98289A4134a04076A84981f0607k97668i7151k93905
10047c91056a5983D77215b98881J06683b039I8841b16940a00877o0707a7455j3656
$$ plain form
10127 -83677 -122187 155443 11862 -133422 -524020 -165000 26643 -378988 23315 -45862 -99133
10116 -99133 -249962 -349667 -395970 -84557 70257 -43810 -20505 25926 -252883 -199065 -26942
10104 196235 -81541 -118256 -91705 -155543 -33531 -224253 76517 -49092 62934 -185169 -143018
10093 -143018 -180610 -52339 -213144 276187 -18093 -39786 -73929 -127023 -449182 288584 -109821
10081 -81016 -99050 -248182 7550 121337 -209938 167328 -53251 54117 -136557 26106 1693
10069 -168149 85135 85254 -60756 -364667 -94780 -229539 -39722 77753 -76770 -222201 -25812
10057 119323 156947 113565 -298289 14134 -104076 184981 -60607 -358275 -97151 -391056
10047 -391056 -15983 477215 -298881 -192198 -2039 98841 -216940 -100877 -161584 -17455 -31111
10036c1111A0344b2813H6386N0862a16650r6015g6771j7337h520j07316J6468
10025i9368j77444R5709O8130B17738G5737b06164B48606I9579a80385c866j19040
10014a22906l11120I2481c97300a5381j03095A79409b0013j53874B78977O9530
10004C48507A64888i6903j1990k75755a12245j91168A06883i8695J9910o2586
9994a41371k51458A19018h4699H1401p532e5516D39799C9213K1447J0300C4034
9982a91543B16107c00556d1933n4508r215L2252B33721d25376J48412c0858k45437
9971b76295j5998H7343a2294j04309G637b27021B83398C9045b41329k0276k4459
9960b86064I2021b8146m26305a24949n5598J8133G2021J62378b12299J05407j20541
$$ plain form
10036 -31111 10344 -22813 86386 137248 -116650 -212665 -76771 -94108 -8520 -115836 -99368
10025 -99368 -276812 -181103 -112973 217738 75737 -206164 248606 99579 -180385 -3866 -122906
10014 -122906 -434026 92481 -397300 -15381 -118476 179409 -20013 -173887 278977 348507
10004 348507 164888 -96903 -108893 -384648 -112245 -303413 106883 -98695 -78785 -141371
9994 -141371 -392829 119018 -84699 81401 73869 -55516 439799 39213 60660 70960 34034
9982 -191543 216107 -300556 -41933 -96441 -105656 -73404 233721 -425376 -276964 -30858 -276295
9971 -276295 -292293 87343 -12294 -116603 7637 -227021 283398 39045 -241329 -261605 -286064
9960 -286064 92021 -28146 -454451 -124949 -180547 -162414 72021 234399 -212299 -106892 -227433
9949b27433l48279D19117a33555D32492G8697b17001j16504L1059k07137A7254
9938b66814e4756k65489A51617P6611B5753a06D3248a94888c0415B47643D0189
9926a89024G8103a31172j9459b1186I5314d03226B14358h0134K6334k52422a15260
9914B6180J16156c16753C784i7324k08050d2619j5001j26123I9903l0595J3927
9903H3235a86663l4100j1118a08984j45786B59480c3361C59536a14831o4913A23162
9891g1661j60527Q7686k83736e0237m1136B7790P8880J89954A42420C2905A6212
9879a43864B49953c02606L8464D6763a27036j39041Q7200c8063p8155A08494b19491
9867A18862g2115K9925k07956e9682j7950c765k1306j51958k4180R0462B8008
$$ plain form
9949 -227433 -575712 419117 -133555 432492 78697 -217001 -333505 -302446 -509583 17254
9938 -266814 -54756 -320245 151617 228228 25753 -106 43248 -194888 -30415 247643 40189
9926 -189024 78103 -131172 -150631 -21186 95314 -403226 214358 -80134 -53800 -306222 -115260
9914 26180 142336 -316753 3784 -97324 -305374 -42619 -57620 -183743 99903 69308 83235
9903 83235 -186663 -220763 -231881 -108984 -254770 259480 -33361 359536 -114831 -179744 123162
9891 -71661 -232188 -144502 -428238 -50237 -91373 27790 106670 296624 142420 32905 16212
9879 -143864 249953 -302606 -264142 46763 -127036 -266077 -178877 -38063 -116218 108494 -219491
9867 118862 -72115 -42190 -250146 -59682 -77632 -3765 -25071 -177029 -201209 -110747 28008
9855a59785N9248B50313a21463A9531a58587K3884e7431J0791j62787h9217A00556
9843d5141q1633N3363P127A45914L0333b47835Q7637E0559b39448A2840c7358
9831E2259d978j09452l45313b17684O495R8238F5158g1983j79391F0431b9814
9819a15893r0454A0071J32202Q8105a22155j17331A96151a47716p0590JA7468
9807B56836N4472o9011b23696Q0091l8628j1829j1821f2887F3498K9953b52670
9795b68513i4099j61198p2296B01301k0307p1657g9885J951F0319R0697k4109
9784A26907a93496c4531j46171E508M05844b35063C30498B8265O8814a73088j95129
9773c68217m1630a44372K2070L2400b5008k98041a29355B34932d4920k4928b1954
$$ plain form
9855 -159785 -100537 250313 -121463 19531 -158587 -134703 -57431 -46640 -209427 -89217 100556
9843 -45141 -126774 -73411 -66284 145914 176247 -247835 -160198 50559 -239448 12840 -37358
9831 52259 -4978 -114430 -459743 -217684 -211189 -112951 65158 -71983 -251374 60431 -29814
9819 -115893 -206347 10071 142273 230378 -122155 -239486 196151 -147716 -218306 -218305 17468
9807 256836 311308 242297 -223696 -143605 -182233 -194062 -205883 -62887 63498 93451 -252670
9795 -268513 -94099 -255297 -327593 201301 180994 109337 -79885 -77934 60319 151016 126907
9784 126907 -193496 -34531 -180702 5508 411352 -235063 330498 28265 97079 -173088 -368217
9773 -368217 -409847 -144372 -122302 -89902 -25008 -323049 -129355 234932 -44920 -69848 -21954
9761b71105B1698i4846l8417O3243k876k23129Q6647G4525J5544e4730k01164
9750b55894a17757j08977A16655E2175a91466G0325M5246b85058B2966i5093j05687
9739b00780j59570B39879b18046K4568A26481E5317a69724B37680b50074F3937
9728i2888a4692C34148r8085b68549J21151k485K5623c8802A98659g5673P174
9717f8499A1081a16591j23558a12270K0473I4274O5756c80148b5933E2468c23563
9705E0194j307b17444O7443j12199N6526B4640a0820p4437a4460j82038c4070
9693D9663L00406i3154j80178d1223q79A40524e3271j23899d0461A19726b91926
9681B42243c12673N6067k1304a8114A03021k3750d77747h9089D23a43206j89842
$$ plain form
9761 -271105 21698 -94846 -133263 -70020 -72896 -296025 -209378 74525 90069 -54730 -255894
9750 -255894 -117757 -226734 116655 52175 -191466 70325 115571 -285058 22966 -95093 -200780
9739 -200780 -360350 239879 -218046 -193478 126481 55317 -169724 237680 -250074 63937
9728 -92888 -14692 334148 236063 -268549 -147398 -149883 -124260 -38802 198659 -75673 -68499
9717 -68499 11081 -116591 -240149 -112270 -91797 94274 160030 -380148 -25933 52468 -323563
9705 50194 48887 -217444 -150001 -262200 -205674 24640 -10820 -85257 -14460 -196498 -34070
9693 49663 350069 -93154 -273332 -41223 -42102 140524 -53271 -177170 -40461 119726 -291926
9681 242243 -312673 -256606 -277910 -18114 103021 79271 -477747 -89089 423 -143206 -333048
9670c33048D2768a30097m45618b19318A79777E4959a10192A44773o5131a42977
9659A81564b86542C158a04293d5435j38760F4181c7342J2240l08414B01840m4818
9648A57022a5272A02643a43169A76321B9816L23636b25617f6137A36733h0892
9637B0803a67520N4524G0524a06750A65118q1404g3281r2451b05k42223J06461
9626a35967A74310A98e1948H787c14239p0433D0462d8280j74763r5104G6866f1330
9613a26674k9224A48935C8696a30004j66697A9808N146h3685p918k11749A86163
9601A9751P0084f8772J4132j58698A9171a78561B15880a30924k2071e4977B6046
9589H5702d58574i0823d1722l2393r9763h1664j24725i3673k86192J64953I6014
$$ plain form
9670 -333048 42768 -130097 -575715 -219318 179777 54959 -110192 144773 79642 -142977
9659 181564 -286542 3158 -104293 -45435 -184195 64181 -37342 -25102 -333516 201840 157022
9648 157022 -15272 102643 -143169 176321 29816 353452 -225617 -66137 136733 -80892
9637 20803 -167520 -112996 70524 -106750 165118 83714 -73281 -165732 -205 -242428 -135967
9626 -135967 174310 198 -51948 8787 -314239 -384672 40462 -48280 -223043 -318147 76866 -61330
9613 -126674 -155898 148935 38696 -130004 -296701 19808 24954 -83685 -91603 -303352 186163
9601 19751 89835 -68772 -54640 -213338 19171 -178561 215880 -130924 -152995 -54977 26046
9589 85702 -458574 -90823 -41722 -74115 -173878 -81664 -206389 -93673 -379865 -214912 96014
9577D7286Q7757c68777A35586l1735i3085K5022e179j46261a2524k82107M1142
9566b53489h4761B04457C5459N7143f626l9305o1543A41123a17609o0710k35486
9555d13805e6934I2283J78779a19652k8722c1449B63505j21786C2952p309R3193
9544A18836h9350j25725P4260m4901L9339H7733g6558g776j77625A20577C8113
9532h583B74153A25924b89728i8738q8101F3804c02024g8593F3939d1537r414
9521e0951B87768d8317k70823f4530j13790C39787b15462B63735F891a64166a1266
9509a88377B13874b11754C3845J9258b77801j13038h6736j89503C1229b5218j91542
9498b16760h5105l7751j26310b032j01499A77779a06348M9377A50477c14449h850
$$ plain form
9577 47286 135043 -368777 135586 103851 -93085 -68063 -5179 -151440 -12524 -294631 -253489
9566 -253489 -84761 204457 35459 92602 -6626 -45931 -107474 141123 -117609 -178319 -413805
9555 -413805 -56934 92283 271062 -119652 -148374 -31449 263505 141719 32952 25643 118836
9544 118836 -89350 -215075 -140815 -185716 -146377 87733 -76558 -7776 -185401 120577 38113
9532 -8583 274153 125924 -289728 -98738 -186839 63804 -302024 -78593 63939 -41537 -50951
9521 -50951 287768 -48317 -319140 -64530 -178320 339787 -215462 263735 6891 -164166 -11266
9509 -188377 213874 -211754 33845 53103 -277801 -390839 -86736 -276239 31229 -25218 -216760
9498 -216760 -85105 -122856 -249166 -2032 -103531 177779 -106348 -56971 150477 -314449 -8850
9486d0714I8651c22885f9131A76616b7388m0512l45889K04705O6156B27811a88732
9474D952h4528p8243J4630J786m1893k02149g9035A41975c43702a16796j48503
9463b65299r8880F7215B7104d6402k28018K7429g956k30138I3310d69488A9041
9451A57697a07845k41698a16295A51165d9567F358b41620J889f9452I418g3582
9439b05126K5037L1871p3816a2656I265J07985b60214A14311M2018i5129M2186
9428e2943o9155D8743J14474a88664d138G3882g7787K3926j39225A07187d23438
9416c02162g5232D9562h8699a7639A14809B5562c13120J26449q473B31599a48067
9404G2176a20143k3150B1527c47441J69408j1936B55045N0519B8472f5463r6684
$$ plain form
9486 -40714 98651 -322885 -69131 176616 -27388 -67900 -413789 -209084 -142928 227811 -188732
9474 4952 -84528 -162771 -148141 -146355 -188248 -390397 -79035 141975 -343702 -116796 -265299
9463 -265299 -364179 67215 27104 -46402 -274420 -246991 -7956 -238094 93310 -469488 19041
9451 157697 -107845 -349543 -116295 151165 -49567 6358 -241620 -239731 -69452 9418 -73582
9439 -205126 -180089 -148218 -222034 -12656 9265 117250 -260214 114311 156329 -95129 -52943
9428 -52943 -122098 48743 163217 -188664 -4138 73882 -77787 -53861 -193086 107187 -423438
9416 -302162 -75232 49562 -88699 -17639 114809 25562 -313120 -186671 -195144 231599 -148067
9404 72176 -120143 -143293 21527 -347441 -178033 -189969 255045 305564 28472 -65463 -162147
9393a62147A2275J15716a80894b9167j18089f009j77099A43586j4085b83289J41312
9382a41977j14548E3710b32641g2521I1636b35947n8526A6452b0075A23146b1363
9370i6130l6379K9928j41238o572E0012c11517e3887p2816G0483K67346c88B80176
9357a52446E4135a23851A22975b74573I0614a86932D8602a4329p3099n4109j63871
9346c05408a28822c5027F54493A88040a88255B5749a3299d561C0801K39286h2863
9334a365k97681J11153I3235C6669b16930q7400d5411r2880A56078C1813b8547
9322a54120P2174A45613b66487m1081n5506F4409e93163b04093e7758k7868l35204
9311d20830D8019P8363Q5327E8190L6691m8M262h9787A1043d77159b12877K8669
$$ plain form
9393 -162147 12275 127991 -180894 -29167 -147256 -6009 -183108 143586 129501 -283289 -141977
9382 -141977 -256525 53710 -232641 -72521 91636 -235947 -294473 16452 -20075 123146 -21363
9370 -96130 -132509 -102581 -243819 -250391 50012 -311517 -53887 -126703 70483 337829 -388 280176
9357 -152446 54135 -123851 122975 -274573 90614 -186932 48602 -14329 -87428 -141537 -305408
9346 -305408 -128822 -35027 654493 188040 -188255 25749 -13299 -4561 30801 270087 -82863
9334 -1365 -299046 -187893 93235 36669 -216930 -304330 -45411 -138291 156078 31813 -28547
9322 -154120 -81946 145613 -266487 -307568 -363074 64409 -593163 -204093 -57758 -85626 -420830
9311 -420830 48019 126382 211709 58190 94881 94833 99095 -89787 11043 -477159 -212877 -184208
9299a84208j04724a36799B09125c85604A00047d12150i0624n1645M403A30785
9288h7847B38315a10779A15031l7954b81995q517e5866H6782a48485n7726h0029
9276b81765J33801G2483b32629a02905j03945G6678b6272F2734c85136h9394j82407
9265b71801M9297n305K8230n7502N1889E3073c8010j74036A56827D498b45004
9253b68857L0857J17815c2464j91966M010D60749c77398B6422c6718q576j69207
9242b14501c6205j80903g5840k91578Q3765H5610e1335F2879b66906a25143e2610
9230a58650j88175B80203d6914B08350a47728l2159E3032k2886a00522A32384
9219h7788D5636J87078f7292r0325n2214A27303k6728B7309J94077H170f5868
$$ plain form
9299 -184208 -288932 -136799 209125 -385604 100047 -412150 -90624 -142269 -137866 130785
9288 -87847 238315 -110779 115031 77077 -281995 -290512 -55866 86782 -148485 -206211 -80029
9276 -281765 -147964 72483 -232629 -102905 -206850 76678 -26272 62734 -385136 -89394 -271801
9265 -271801 -222504 -227809 -199579 -257081 -205192 53073 -38010 -212046 156827 4498 -245004
9253 -268857 -238000 -120185 -32464 -224430 -220420 460749 -377398 26422 -36718 -45294 -214501
9242 -214501 -36205 -217108 -75840 -367418 -283653 85610 -51335 62879 -266906 -125143 -52610
9230 -158650 -346825 280203 -46914 208350 -147728 -179887 53032 30146 -100522 132384
9219 -87788 45636 232714 -67292 -157617 -209831 127303 100575 27309 221386 8170 -65868
9207H1068N9793B4414a34138J4599d9819j35264A30129a44074f3959A10559N1433
9196A61992l0360J61851H598b93958J9782B5178L2857d096j36647B98246b33828
9184B01421G7682b91242b4970o9616A66515d6856j15467l32049a47516K4631n4802
9173a77687a7445p0658k3666o1373N9412m0004F1945P3380b71334F7985M3253
9162A11238M7869P7233B8420e9518A78565g1291p9426N5114A37988a84494e7410
9150F2033f9169p4392f4891G2063i7661A17664e9656l23614O6916A03786e8446
9138A14403h825q2201m4129A0637b7935j54345a6837j29780A0149M2984N3145
9127A06278h738k78648I7634c30994f1158j54811A2311b35944N2314E9610J31586
$$ plain form
9207 81068 140861 24414 -134138 -119539 -49819 -185083 130129 -144074 -63959 110559 161992
9196 161992 131632 293483 8598 -293958 -274176 25178 58035 -4096 -140743 298246 -233828
9184 201421 77682 -291242 -24970 -94586 166515 -46856 -162323 -494372 -147516 -122885 -177687
9173 -177687 -17445 -88103 -111769 -173142 -113730 -153734 61945 135325 -271334 67985 111238
9162 111238 159107 236340 28420 -59518 178565 -71291 -150717 -95603 137988 -184494 -57410
9150 62033 -69169 -143561 -64891 72063 -97661 117664 -59656 -383270 -316354 103786 -58446
9138 114403 -8825 -91026 -135155 10637 -27935 -182280 -16837 -146617 10149 53133 106278
9127 106278 -8738 -287386 97634 -330994 -61158 -215969 12311 -235944 -183630 59610 191196
9116A91196g2075o0056J7778k32529F812K63684j26707e3030l7808p6151c5591
9104a63599j36682J44861p5893a8014n9656n0478B35406G6167i5058b4772j20780
9093a45552d1158j72729A87623A8519a45224A75420a64300P5845B3984d8353p6467
9082a24820A60009n8785J2199l2072c19785L7274A49391a20762J620k33928A52650
9070f2672A29594b80993J06838K39K2153a981j20779B1096f7011A56958g0926
9058E142i3166l4780A8601b4749D0029L03748a27677o8407B71932A35529f3615
9046a03804b1834R854A11001b3500m04768H7644a2119j19605A5640R4145d0635
9034f9135k55526I8477B8577a54979B34899b3918A97572F9743c26705g5992C32150
$$ plain form
9116 191196 -72075 -132131 -114353 -346882 6812 270496 143789 -53030 -90838 -166989 -35591
9104 -163599 -300281 -155420 -231313 -18014 -77670 -128148 235406 76167 -95058 -24772 -145552
9093 -145552 -41158 -213887 187623 18519 -145224 175420 -164300 -88455 23984 -48353 -124820
9082 -124820 160009 101224 113423 81351 -319785 -282511 149391 -120762 -119142 -353070 152650
9070 -62672 129594 -280993 -174155 -173916 -151763 -1981 -122760 21096 -67011 156958 -70926
9058 5142 -93166 -127946 18601 -24749 40029 343777 -127677 -196084 271932 135529 -63615
9046 -103804 -21834 -11980 111001 -23500 -428268 87644 -12119 -131724 15640 109785 -40635
9034 -69135 -324661 98477 28577 -154979 234899 -23918 197572 69743 -326705 -75992 332150
9022f1418k98357E3071a02882A59665a457j04806q1857L2593l23594p1351g6149
9010a89207k69503a00512p6711j28109J42425A60211a94221N6028j98842f1553
8999A26708C2798L4072a39781k57326A51710a20983k80468E1825R455d82139B78751
8987c28514B38755a73372j0714i0433I1652c00782j9978a31693A01572b36418
8976A14601m6128a93382h3162j49217j32752I1807a40839A08005a92286g8789
8965A33264o4753K00665b02421j43213d1599E7786j2959A0992a43685O608N4446
8954h2631C1339O8793J07216e4319m47498f7274C33488O4363A05847R3453o7082
8943A32218N685a69855B04316C3283J12090Q2642h8303A06771r271l8547J66867
$$ plain form
9022 -61418 -359775 53071 -102882 159665 -1457 -106263 -188120 -155527 -479121 -550472 -76149
9010 -189207 -458710 -100512 -177223 -305332 -162907 160211 -194221 -138193 -337035 -61553
8999 126708 32798 66870 -139781 -397107 151710 -120983 -401451 51825 61280 -482139 278751
8987 -328514 238755 -173372 -184086 -90433 91652 -300782 -320760 -131693 101572 -236418
8976 114601 68473 -193382 -83162 -232379 -365131 91807 -140839 108005 -192286 -78789
8965 133264 68511 269176 -202421 -345634 -41599 57786 44827 10992 -143685 -137077 -82631
8954 -82631 31339 100132 207348 -54319 -501817 -67274 333488 397851 105847 199300 132218
8943 132218 137903 -169855 204316 33283 145373 228015 -88303 106771 97500 58953 225820
8932B25820P4933a17925n5704a312o7186D36049A48697k1807M0617K11588M05484
8921G84579J330475M850294N430138C910049A680036G95709C02038B8294J11078
8912A39372r706i028A4685c17453f9344D2928J14294R7675m9349a13559l2446
8901a46005k9987j72244I712b8655o2543j11666H1447c63491i9306A20566c8168
8889a8030m2295j92242A18768h6670r7835Q5764C8116A5376c17342C605K52602
8878B56207a14727K3824E4224k0320K4970J71992d08140P4481H5471e2260j62293
$$ plain form
8932 225820 300753 -117925 -173629 -1312 -68498 436049 148697 126890 167507 379095 784579
8921 784579 2115054 6965348 12395486 3910049 1680036 795709 302038 28294 139372
8912 139372 129666 -9028 14685 -317453 -69344 42928 157222 254897 205548 -113559 -146005
8901 -146005 -175992 -348236 9712 -28655 -91198 -202864 81447 -363491 -99306 120566 -38168
8889 -18030 -60325 -252567 118768 -86670 -184505 -98741 38116 15376 -317342 3605 256207
8878 256207 -114727 -90903 54224 33904 58874 230866 -408140 -333659 85471 -52260 -214553
$$ [...]
##END NTUPLES=NMR SPECTRUM
##END=
