
##TITLE=AC1205_HSMAH12053_7160751_hP5IrhI0yX
##JCAMPDX= 6.0         $$ Bruker NMR JCAMP-DX V2.0
##DATA TYPE= NMR SPECTRUM
##DATA CLASS= NTUPLES
##ORIGIN= BRUKER
##OWNER= Administrator
$$ 1.72 TOPSPIN		Version 2.1
$$ 2012-12-01 01:38:50.411 -0500  Administrator@X
$$ Compression mode = diff/dup
##.OBSERVE FREQUENCY= 400.02188249412
##.OBSERVE NUCLEUS= ^1H
##.ACQUISITION MODE= SIMULTANEOUS (DQD)
##.ACQUISITION SCHEME= undefined
##.AVERAGES= 64
##.DIGITISER RES= 22
##SPECTROMETER/DATA SYSTEM= spect
##.PULSE SEQUENCE= noesygpps1d.comp
##.SOLVENT NAME= COFFEE_meoh
##.SHIFT REFERENCE= INTERNAL, COFFEE_meoh, 1, 14.96231
##AUDIT TRAIL= $$ (NUMBER, WHEN, WHO, WHERE, PROCESS, VERSION, WHAT)
$$ ##TITLE= Audit trail, TOPSPIN		Version 2.1
$$ ##JCAMPDX= 5.01
$$ ##ORIGIN= Bruker BioSpin GmbH
$$ ##OWNER= Administrator
$$ $$ E:\/data/COFFEE/nmr/AC1205_HSMAH12053_7160751_hP5IrhI0yX/12/pdata/1/auditp.txt
$$ ##AUDIT TRAIL=  $$ (NUMBER, WHEN, WHO, WHERE, PROCESS, VERSION, WHAT)
(   1,<2012-12-01 01:38:45.125 -0500>,<Administrator>,<X>,<go>,<TOPSPIN 2.1>,
      <created by zg
	started at 2012-12-01 01:27:02.370 -0500,
	POWCHK enabled, PULCHK disabled,
       configuration hash MD5:
       86 BA 57 50 F2 9D 5C 9B 26 00 A9 28 5F 66 2E 89
       data hash MD5: 64K
       FB 34 3C D7 A2 86 07 E0 53 E0 1B E4 E8 93 B8 11>)
(   2,<2012-12-01 01:38:47.920 -0500>,<Administrator>,<X>,<proc1d>,<TOPSPIN 2.1>,
      <Start of raw data processing
       efp LB = 0.3 FT_mod = 6 PKNL = 1 PHC0 = 0 PHC1 = 0 SI = 128K 
       data hash MD5: 128K
       4B 12 02 20 23 8D 41 1C 16 15 0C 4F 44 3A A0 4D>)
(   3,<2012-12-01 01:38:48.875 -0500>,<Administrator>,<X>,<proc1d>,<TOPSPIN 2.1>,
      <pk PHC0 = -80.29907 PHC1 = 0 
       data hash MD5: 128K
       7B EC 4F 19 EC 04 29 4A 5E 9C 77 D7 9D D6 86 05>)
(   4,<2012-12-01 01:38:49.526 -0500>,<Administrator>,<X>,<proc1d>,<TOPSPIN 2.1>,
      <abs ABSG = 1 
       data hash MD5: 128K
       FC 8A F6 AE 48 40 50 AB 0C B4 87 8E D9 F9 C5 6F>)
(   5,<2012-12-01 01:38:49.678 -0500>,<Administrator>,<X>,<proc1d>,<TOPSPIN 2.1>,
      <abs ABSG = 2 
       data hash MD5: 128K
       20 44 F3 B0 25 4F CB 72 BF 0A 64 B7 8C 08 31 1D>)
(   6,<2012-12-01 01:38:49.816 -0500>,<Administrator>,<X>,<proc1d>,<TOPSPIN 2.1>,
      <abs ABSG = 3 
       data hash MD5: 128K
       DD FD C4 BA 94 BC 84 5A D1 97 E3 8E 1B 81 FE 68>)
(   7,<2012-12-01 01:38:49.969 -0500>,<Administrator>,<X>,<proc1d>,<TOPSPIN 2.1>,
      <abs ABSG = 4 
       data hash MD5: 128K
       6B C4 FF D2 5A 0D FD E6 02 74 C3 BC E4 29 96 B3>)
(   8,<2012-12-01 01:38:50.107 -0500>,<Administrator>,<X>,<proc1d>,<TOPSPIN 2.1>,
      <abs ABSG = 5 
       data hash MD5: 128K
       D7 4D DE C2 6C FD 8A 49 18 A5 F5 5C 24 BD 5A 0C>)
$$ ##END=
$$ 
$$ $$ hash MD5
$$ $$ 0B B9 D3 E1 FC 4F 2A DA 13 19 E2 F7 4C 24 8D 1A
##$RELAX= 
##$RELAX= 
##$RELAX= 
##$RELAX= 
##$RELAX= 
##$RELAX= 
##$RELAX= 
##$RELAX= 
$$ Bruker specific parameters
$$ --------------------------
##$DU= <E:\>
##$EXPNO= 12
$$ [...]
##$TP07= 0
##$TPNAME0= <>
##$TPNAME1= <>
##$TPNAME2= <>
##$TPNAME3= <>
##$TPNAME4= <>
##$TPNAME5= <>
##$TPNAME6= <>
##$TPNAME7= <>
##$TPOAL= (0..7)
0.5 0.5 0.5 0.5 0.5 0.5 0.5 0.5
##$TPOFFS= (0..7)
0 0 0 0 0 0 0 0
##$TUNHIN= 0
##$TUNHOUT= 0
##$TUNXOUT= 0
##$USERA1= <user>
##$USERA2= <user>
##$USERA3= <user>
##$USERA4= <user>
##$USERA5= <user>
##$V9= 5
##$VALIST= <valist>
##$VCLIST= <CCCCCCCCCCCCCCC>
##$VD= 0
##$VDLIST= <DDDDDDDDDDDDDDD>
##$VPLIST= <PPPPPPPPPPPPPPP>
##$VTLIST= <TTTTTTTTTTTTTTT>
##$WBST= 1024
##$WBSW= 4
##$XGAIN= (0..3)
0 0 0 0
##$XL= 0
##$YL= 0
##$YMAX_a= 8265891
##$YMIN_a= -17525783
##$ZGOPTNS= <>
##$ZL1= 120
##$ZL2= 120
##$ZL3= 120
##$ZL4= 120
##$ABSF1= 14.96231
##$ABSF2= -5.595872
##$ABSG= 5
##$ABSL= 3
##$ALPHA= 0
##$AQORDER= 0
##$ASSFAC= 0
##$ASSFACI= 0
##$ASSFACX= 0
##$ASSWID= 0
##$AUNMP= <proc_prof1d_extract.lims>
##$AXLEFT= 0
##$AXNAME= <>
##$AXNUC= <1H>
##$AXRIGHT= 0
##$AXTYPE= 0
##$AXUNIT= <>
##$AZFE= 0.1
##$AZFW= 0.1
##$BCFW= 0
##$BC_mod= 0
##$BYTORDP= 0
##$COROFFS= 0
##$CY= 15
##$DATMOD= 1
##$DC= 0
##$DFILT= <>
##$DTYPP= 0
##$F1P= 0
##$F2P= 0
##$FCOR= 0.5
##$FTSIZE= 131072
##$FT_mod= 6
##$GAMMA= 0
##$GB= 0
##$INTBC= 1
##$INTSCL= 1
##$ISEN= 128
##$LB= 0.3
##$LEV0= 0
##$LPBIN= 0
##$MAXI= 10000
##$MC2= 0
##$MEAN= 0
##$ME_mod= 0
##$MI= 0
##$NCOEF= 0
##$NC_proc= -2
##$NLEV= 6
##$NOISF1= 0
##$NOISF2= 0
##$NSP= 0
##$NTH_PI= 0
##$NZP= 0
##$OFFSET= 14.96231
##$PC= 1
##$PHC0= -80.29907
##$PHC1= 0
##$PH_mod= 1
##$PKNL= yes
##$PPARMOD= 0
##$PPDIAG= 0
##$PPIPTYP= 0
##$PPMPNUM= 2147483647
##$PPRESOL= 1
##$PSCAL= 4
##$PSIGN= 0
##$PYNMP= <proc.py>
##$REVERSE= no
##$SF= 400.020009111272
##$SI= 131072
##$SIGF1= 0
##$SIGF2= 0
##$SINO= 400
##$SIOLD= 131072
##$SPECTYP= <>
##$SREGLST= <1H.CDCl3>
##$SSB= 0
##$STSI= 131072
##$STSR= 0
##$SW_p= 8223.68421052631
##$SYMM= 0
##$S_DEV= 0
##$TDeff= 65536
##$TDoff= 0
##$TI= <>
##$TILT= no
##$TM1= 0
##$TM2= 0
##$TOPLEV= 0
##$USERP1= <user>
##$USERP2= <user>
##$USERP3= <user>
##$USERP4= <user>
##$USERP5= <user>
##$WDW= 1
##$XDIM= 131072
##$YMAX_p= 433685326
##$YMIN_p= -14333
##$CURPLOT= <Network HP LaserJet P1505>
##$CURPRIN= <$Network HP LaserJet P1505>
##$DFORMAT= <normdp>
##$LAYOUT= <+/1D_H.xwp>
##$LFORMAT= <normlp>
##$PFORMAT= <normpl>
##$SURQMSG= 1
$$ End of Bruker specific parameters
$$ ---------------------------------
##NTUPLES= NMR SPECTRUM
##VAR_NAME=  FREQUENCY,     SPECTRUM/REAL,   SPECTRUM/IMAG
##SYMBOL=    X,             R,               I
##VAR_TYPE=  INDEPENDENT,   DEPENDENT,       DEPENDENT
##VAR_FORM=  AFFN,          ASDF,            ASDF
##VAR_DIM=   131072,        131072,          131072
##UNITS=     HZ,            ARBITRARY UNITS, ARBITRARY UNITS
##FACTOR=    0.0627417313425164, 1,          1
##FIRST=     8223.62146879497, 1712,         -65208
##LAST=      0,             3507,            -65578
##MIN=       0,             -14333,          0
##MAX=       8223.62146879497, 433685326,    0
$$ Real data points
##PAGE= N=1
##DATA TABLE= (X++(R..R)), XYDATA
$$ [...]
64472 68076 67949 67954 68900 70620 72023 72136 70998 69519 68657 68776 69659 70911 72228 73311 73799 73480 72514
64455 72514 71309 70281 69827 70292 71638 73269 74535 75366 76048 76507 76315 75492 74693 74369 74203 73729 73077
64438 73077 72666 72410 71794 70662 69532 69082 69607 70925 72554 74016 75226 76554 78198 79663 80295 80338
64422 80338 80851 82253 83545 83617 83067 83887 87127 91608 95372 97892 100106 102617 104820 105978 106324 106527
64406 106527 106676 106409 105772 105291 105305 105695 106177 106329 105447 103013 99502 96236 94199 93241 92511 91295 89363
64389 89363 86951 84689 83207 82550 82167 81617 81019 80664 80486 80186 79645 79038 78704 79075 80481 82738 85056
64372 85056 86582 86963 86355 85096 83591 82326 81691 81740 82200 82675 82925 83088 83621 84777 86172 87133 87481
64355 87481 87608 87764 87704 87262 86774 86637 86761 86816 86748 86669 86476 85976 85243 84503 83758 82857 81882 81144 80880 81175
64335 81175 82076 83439 84762 85533 85748 85857 86227 86936 88027 89535 91173 92313 92506 91930 91214 90953 91389
64318 91389 92352 93314 93676 93261 92585 92505 93453 95057 96599 97798 98915 100056 100749 100549 99800 99319 99347 99376
64300 99376 99150 99231 100236 101936 103563 104752 105692 106523 107103 107360 107490 107739 108266 109220 110704 112606 114707
64283 114707 116938 119370 121986 124697 127595 130934 134778 138803 142508 145540 147880 149810 151624 153243
64269 153243 154214 154216 153474 152469 151361 149923 147966 145604 143129 140815 138781 136886 134816 132472 130134
64254 130134 128063 126138 124230 122695 122000 121883 121432 120218 118885 118359 118797 119615 120288 120747 121111 121430 121819
64237 121819 122583 123977 125850 127691 129211 130868 133548 137569 142168 146229 149412 152237 155169 158045
64223 158045 160483 162450 164141 165553 166440 166560 165789 164164 162011 159855 157961 156090 153901 151470 149113
64208 149113 146855 144462 142022 140114 139207 139149 139411 139673 139959 140379 140954 141636 142321 142898 143454 144326 145758
64191 145758 147546 149271 150874 152736 155121 157782 160185 161870 162544 162156 161111 160112 159478 158815 157632
64176 157632 156067 154637 153561 152849 152883 154164 156318 158089 158674 158542 158521 158572 158128 157323 157126 158190 160108
64159 160108 162025 163573 165021 166776 169005 171619 174464 177556 181148 185467 190426 195753 201354 207363
64145 207363 213799 220474 227408 235070 243978 254134 265056 276313 287755 299259 310521 321287
64133 321287 331557 341284 349962 356798 361312 363525 363517 361059 355938 348465 339497 329999 320670 311774 303134
64118 303134 294430 285719 277448 269756 262132 254209 246667 240688 236534 233319 230333 227881 226481 225874
64104 225874 225387 224940 225095 226279 228398 231180 234498 238389 243032 248673 255383 262948 271089 279571 288013
64089 288013 295946 303355 310838 318850 327104 335156 343201 351618 359851 366491 370615 372485 372763 371618
64075 371618 368895 364718 359537 353781 347754 341626 335234 328136 320241 312291 305373 299926 295496 291514
64061 291514 287962 285066 282610 280045 277386 275567 275509 276976 278796 280198 281565 283739 287026 291112 295613
64046 295613 300381 305485 311250 318175 326471 335782 345635 355999 367084 378748 390539 402341 414576
64033 414576 427593 441072 454064 465480 474572 481219 485833 488934 490827 491797 492376 493105 494121 495244
64019 495244 496465 498072 500381 503710 508604 515732 525311 536782 549161 561667 574083 586646 599543
64006 599543 612398 624315 634536 642916 649650 654772 658247 660352 661618 662487 663315 664618 666939 670481
63992 670481 675213 681256 688873 698149 709093 721984 737308 755319 775986 799279 825176 853490
63980 853490 884113 917422 954017 994099 1037503 1084268 1134663 1188711 1246268 1307676 1373754
63969 1373754 1444961 1521226 1602965 1691900 1790534 1901180 2025734 2166165 2325000 2505676
63959 2505676 2712671 2951141 3226409 3544081 3910579 4332803 4816731 5366260 5983128
63950 5983128 6667086 7415647 8224024 9085717 9992984 10936531 11904802 12883353 13854207
63941 13854207 14795642 15683500 16493889 17205553 17801042 18267389 18596422 18783601 18825715
63932 18825715 18720083 18466485 18069376 17537993 16885492 16129215 15290973 14394832 13463248
63923 13463248 12514988 11566013 10630961 9723209 8854108 8032686 7265871 6558745 5914578
63914 5914578 5334445 4816645 4356971 3950319 3592129 3278090 3003053 2761336 2548270
63905 2548270 2360710 2195895 2050613 1921835 1807381 1705474 1614081 1531191 1455406 1385825
63895 1385825 1321656 1262283 1207446 1156889 1109971 1065862 1023895 983497 944019 905024 866541
63884 866541 828766 791699 755357 720118 686519 654881 625474 598794 575152 554065 534524
63873 534524 515941 498367 481741 465514 449388 433969 420164 408026 396685 385462 374668
63862 374668 365122 357180 350489 344503 338949 333833 329307 325618 322971 321303 320341 319953 320254 321261 322671
63847 322671 324242 326221 329051 332682 336483 339882 342796 345284 347051 347517 346296 343411 339097 333535
63833 333535 326732 318620 309372 299706 290644 282717 275503 268136 260261 252206 244245 236105 227465 218705
63819 218705 210830 204616 200045 196546 193518 190534 187329 183912 180663 178056 176177 174550 172529 169867
63805 169867 166923 164344 162544 161488 160906 160572 160234 159452 157847 155625 153563 152282 151681 151257 150727 150038
63789 150038 149033 147620 146240 145627 145890 146212 145725 144436 143048 142077 141456 140924 140466 140236 140182 139868 138737
63772 138737 136598 133783 130803 127999 125691 124446 124637 125699 126346 125877 124938 124620 125092 125560 125449 125111
63756 125111 125284 126259 127726 129164 130126 130385 130121 129945 130490 131776 133073 133579 133277 132985 133494 134849 136628
63739 136628 138713 141398 144758 148340 151697 155011 158943 164000 170173 177162 184793 193207 202605 212850
63725 212850 223540 234655 246840 260587 275228 289285 301835 312926 322521 329724 333513 333707
63713 333707 330706 324774 316225 306078 295764 286127 277114 268418 260020 252099 244809 238157 231878 225576
63699 225576 219249 213452 208609 204370 200076 195648 191536 187985 184925 182375 180326 178260 175501 172169
63685 172169 169203 167382 166871 167732 170156 173988 178732 184297 191083 199001 207146 214965 223139 232724 243904
63670 243904 256194 269362 283302 297280 310134 321222 330482 337572 341695 342468 340311 335643 328189
63657 328189 317522 304085 289337 274933 261901 250462 240351 231252 222969 215277 207879 200736
63645 200736 194393 189632 186642 184682 182722 180372 178110 176718 176544 177240 178128 178831 179610 181068 183523
63630 183523 186712 190127 193568 197316 201815 207220 213354 220047 227466 236034 246008 257231 269281 281847
63616 281847 295009 309294 325415 343711 363745 384625 405874 427811 450847 474510 497308
63605 497308 517488 533754 545467 552664 556031 556599 555166 552106 547795 543023 538681 535068 531683 527737
63591 527737 522702 516352 508533 499104 488064 475605 462018 447672 433087 418853 405375 392787
63579 392787 381198 370913 362240 355077 348836 342873 336954 331234 325875 320814 315986 311703 308568 306883
63565 306883 306225 305916 305928 307043 309973 314750 321238 329849 341090 354521 368924 383749 399813 418182
63551 418182 438879 461184 484834 510147 537065 564694 591891 617684 640931 660181 674537
63540 674537 684546 691906 698298 704634 711288 718632 727214 737445 749090 761003 771449 778871 782347
63527 782347 781331 775188 763251 745268 721595 693027 660746 626375 591707 558101 526154 495987
63515 495987 467624 441070 416320 393548 373108 355106 339114 324552 311300 299689 289929 281865
63503 281865 275314 270305 266772 264237 262053 259898 257891 256306 255423 255575 257034 259614 262551 265089 267303
63488 267303 270204 274895 281678 290102 299767 310803 323517 337881 353512 369917 386504 402564
63476 402564 417582 431418 443805 453670 459446 460283 456718 449964 440835 429552 416332 401758 386640
63463 386640 371791 357896 345291 333819 323156 313336 304802 297839 292210 287502 283593 280498 277889
63450 277889 275207 272397 270109 268868 268329 267816 267438 268050 270010 272662 275361 278436 282592 287844 293754
63435 293754 300429 308526 318372 329827 342982 358139 374947 392418 410174 429004 449803 472547
63423 472547 496823 522686 550409 579839 610608 642555 675275 707555 737893 765323 789123
63412 789123 808060 820771 826891 827205 822800 814734 804441 793591 783252 773593 764376 755134 744883
63399 744883 732453 717439 700225 680915 658879 633829 606839 579734 553726 528982 505286
63388 505286 482675 461542 442398 425583 411118 398829 388531 379885 372279 365331 359586 356177
63376 356177 355582 357095 359709 363140 367772 374010 382051 391954 403569 416578 430880 446734 464305
63363 464305 483363 503735 525801 550183 577010 605784 635720 665873 695019 721755 744860
63352 744860 763505 777248 786032 790137 790003 786204 779605 771331 762364 753280 744407 735922 727605 718777
63338 718777 708759 697188 683699 667628 648518 626913 604248 581843 560112 538770 517611
63327 517611 496955 477419 459371 442751 427406 413411 400867 389637 379552 370703 363085 356130
63315 356130 349221 342627 337315 333755 331547 330366 330383 331400 332457 332938 333360 334338 335409 335820 335863 336360
63299 336360 337142 337230 336439 335646 335299 334723 333285 331292 329259 327103 324665 322454 321207 321014 321276 321257 320443
63282 320443 318832 317186 316481 316751 316942 316344 315566 315493 315843 315612 314647 313836 313783 314161 314532 314988 315654 316232 316547
63263 316547 317113 318612 321019 323590 325563 326627 326953 327158 328085 330189 333131 336259 339450 343108 347365
63248 347365 351774 355998 360446 365915 372760 380659 389075 397678 406487 415906 426660 439381 454149
63235 454149 470521 488010 506387 525645 545966 567656 590791 614891 639313 664054 689722
63224 689722 716519 743632 769993 795310 819971 844243 868084 891524 914606 936949 958018
63213 958018 977971 997661 1017506 1036766 1054160 1068708 1079589 1085700 1086056 1080505 1069516 1053307
63201 1053307 1031726 1005045 974406 941412 907602 874300 842336 811679 781910 753450 727880
63190 727880 706557 689292 675022 663491 655470 651396 650647 652469 656890 664261 674391 686678 700689
63177 700689 716075 732264 748818 765918 783879 802324 820423 837894 855124 872346 889368
63166 889368 906190 923064 939600 954520 966722 976058 982542 985408 983652 977161 966573 952279
63154 952279 934329 913250 890047 865247 838664 810436 781672 753671 727024 701991 679269
63143 679269 659590 642691 627394 612887 599422 587520 577051 567521 558952 551845 546287 541662
63131 541662 537492 534126 532232 531787 531934 531798 531173 530526 530627 532119 535057 538757 542391 545746 549107 552438
63115 552438 555182 557091 558748 560870 563437 565969 568401 571116 574193 577209 579914 582649 585824 589236
63101 589236 592198 594306 595896 597758 600440 603826 607393 610805 614081 617062 619072 619540 618912 618480 619083
63086 619083 620289 621165 621568 622280 623929 626251 628625 630967 633732 637174 641118 645500 650745 657263 664851
63071 664851 672950 681382 690488 700616 711884 724511 738877 754996 772218 789768 807515 826080
63059 826080 846324 868859 893776 920614 948713 977819 1008318 1040784 1075492 1112491 1151923
63048 1151923 1193931 1238306 1284486 1331969 1380678 1430848 1482531 1535068 1587135 1637570 1686244
63037 1686244 1733898 1781106 1827777 1873794 1919621 1965871 2012560 2059211 2105461 2151037 2195096
63026 2195096 2235978 2271663 2300349 2320650 2331513 2331980 2320950 2297441 2261404 2214263 2158397 2096215
63014 2096215 2029828 1961283 1892523 1825018 1759699 1697364 1639005 1585796 1538844 1498807 1465598
63003 1465598 1438637 1417572 1402567 1393747 1390735 1393034 1400521 1413033 1429730 1449437 1471525 1495967
62991 1495967 1522578 1550701 1579623 1608785 1637553 1665300 1691893 1717721 1743051 1767467 1789910
62980 1789910 1809045 1823702 1833250 1837413 1835468 1825998 1807934 1781574 1747963 1707586 1660524 1607756
62968 1607756 1551237 1492452 1431800 1369804 1308090 1248610 1192492 1140148 1091877 1047674 1006844
62957 1006844 968520 932513 899278 869249 842495 818727 797295 777495 759266 743300 730072
62946 730072 719027 709112 699773 690999 682702 674673 667035 660150 654018 648171 642170 635897 629396 622746
62932 622746 616093 609537 603004 596427 589945 583685 577488 571168 564904 559055 553653 548449 543463 539074
62918 539074 535450 532186 528691 524867 521269 518563 516780 515159 512958 510436 508666 508184 508217 507616 506231
62903 506231 504856 503945 503000 501293 498809 496288 494633 494311 495063 496118 496920 497663 498873 500463 501539 501264
62887 501264 499745 497952 496958 497198 498240 499151 499311 498886 498402 497962 497209 496017 494770 493834 493158 492613 492347
62870 492347 492505 492887 493221 493534 493898 493981 493323 491971 490418 488831 486824 484199 481544 479731 478892 478168 476547
62853 476547 473805 470585 467649 465093 462350 458937 455067 451390 448269 445651 443633 442631 442698 442999 442524
62838 442524 441232 440058 439735 440052 440377 440457 440415 440274 439862 439110 438160 437226 436454 435824 435151 434371 433901 434362 435746
62819 435746 437145 437623 437134 436310 435611 435117 434976 435490 436817 438945 441880 445394 448659 450770 451780 452762
62803 452762 454638 457400 460708 464776 470179 477031 484779 492840 501179 510234 520396 531630 543624
62790 543624 556341 570329 586271 604320 624146 645621 669145 695219 724005 755481 789800
62779 789800 827307 868349 913249 962411 1016397 1075900 1141495 1213214 1290475 1372651 1459476
62768 1459476 1550479 1644104 1737928 1829821 1918348 2001923 2078132 2144243 2197969 2237488 2261239
62757 2261239 2268328 2258987 2234257 2195291 2143259 2079717 2006720 1926517 1841307 1753123 1663697 1574425
62745 1574425 1486548 1401272 1319596 1242175 1169432 1101613 1038676 980355 926498 877128 832105
62734 832105 791014 753548 719729 689626 663097 639866 619476 601012 583388 566256 550272
62723 550272 536157 523868 513055 503875 496734 491438 487259 483799 481265 479843 479241 479021 479098 479823 481754
62708 481754 485419 491068 498592 507747 518508 531161 546096 563528 583335 605258 629448 656729
62696 656729 687927 722964 761062 801958 846383 895138 948248 1005340 1066184 1130178 1195719
62685 1195719 1260819 1324130 1384751 1441264 1491771 1534818 1569496 1594540 1608165 1609262 1598326
62674 1598326 1576802 1545899 1506407 1459346 1406233 1348657 1287941 1225333 1162261 1100106 1039680
62663 1039680 981179 924848 871575 822527 778192 738047 701247 667312 636071 607340 580965
62652 580965 556950 535222 515428 497162 480277 464811 450770 438122 426737 416237 406196
62641 406196 396616 387857 379903 372124 364020 355812 347965 340587 333708 327729 323041 319434 316351 313542
62627 313542 311046 308792 306690 304865 303327 301667 299568 297401 295796 294812 294037 293347 293065 293461 294567
62612 294567 296317 298487 300695 302886 305533 308932 312696 316510 321005 327140 334977 343818 353291 363576
62598 363576 374803 387108 401146 417652 436566 457439 480555 506732 536107 568214 603298
62587 603298 642353 685520 731516 778957 827187 875401 922160 966468 1008352 1047451 1081800
62576 1081800 1108893 1127408 1137162 1138071 1130175 1114335 1091909 1063851 1030847 994157 955477 915905
62564 915905 875615 834667 793670 753678 715808 680915 649216 620228 593403 568818 546970
62553 546970 527961 511243 496100 482070 468861 456201 443931 432115 420893 410209 399727
62542 399727 389181 378860 369583 361916 355562 349792 344294 339171 334367 329753 325810 323406 322644 322652 322880
62527 322880 323893 326368 329891 333472 336840 340513 344858 349869 355833 363431 372939 383770 395104 406770
62513 406770 419390 433841 450667 469935 491602 515918 543358 574065 607509 642752 678918
62502 678918 715354 751550 786987 820945 852434 880394 903873 921822 933044 936884 933876 925143
62490 925143 911199 892016 868239 841422 812713 782112 749596 716313 684067 654078 626686
62479 626686 601699 578489 556362 535590 517593 503324 491865 481372 471064 461386 452606 444425
62467 444425 436961 431029 427064 424531 422655 421108 419749 418454 417580 417971 419962 422772 425372 427722 430740
62452 430740 435206 441061 447668 454496 461511 469068 477394 486206 494993 503639 512483 521668 530683 538711
62438 538711 545152 549542 551239 549645 544872 537842 529472 519868 508566 495552 481705 468059 454873
62425 454873 441801 428837 416565 405423 395235 385759 377362 370705 365970 362739 360497 358913 357708
62412 357708 356636 355647 354882 354521 354804 356101 358734 362729 367869 373940 380759 388078 395655 403415 411360
62397 411360 419385 427305 435020 442486 449580 456097 461851 466717 470634 473563 475370 475770 474648 472391
62383 472391 469585 466313 462146 456976 451449 446399 442258 439305 437995 438556 440568 443486 447423 453045
62369 453045 460863 471050 483767 499133 516993 537149 559872 585780 615280 648440 685315 725949
62357 725949 770046 817068 866694 918827 973050 1028316 1083121 1135675 1183958 1226016 1260405
62346 1260405 1286320 1303485 1312214 1313374 1307841 1295956 1277826 1254028 1225541 1192961 1156288 1115753
62334 1115753 1072586 1028819 986445 946659 909599 874768 841913 811456 783811 758479 734270
62323 734270 710422 687114 664932 644375 625867 609599 595109 581584 568915 557975 549454 542937
62311 542937 537652 533651 531541 531253 531856 532592 533420 534384 535143 535494 535766 536121 535856 534046 530719 526771 522777
62294 522777 518545 513890 509167 504736 500519 496490 493051 490433 488274 486407 485554 486374 488202 489746 490908
62279 490908 492828 496059 499886 503834 508655 515046 522273 529104 535608 543066 552332 563122 574811 587218
62265 587218 600611 615573 632924 653311 676794 703206 732837 766422 804448 846801 893076
62254 893076 942942 996196 1052517 1110998 1169719 1226016 1277377 1321951 1358220 1384809 1401000
62243 1401000 1407050 1403597 1391115 1370238 1342108 1307917 1268567 1225207 1179534 1132930 1085850 1038791
62231 1038791 993379 951495 913640 879098 847521 819400 795080 774318 756916 742841 731529
62220 731529 721924 713542 706881 702495 700225 699516 699892 700931 702244 703726 705453 707266 708877 710366 712148
62205 712148 714435 717173 720345 723775 726846 729191 731559 735192 740385 746537 753594 762432 773614 786758
62191 786758 801501 818197 837206 858327 881410 906834 934876 965161 997085 1030078 1062972
62180 1062972 1093850 1121103 1144107 1162535 1175768 1183690 1187436 1188621 1188232 1186913 1185857 1186621 1190248
62167 1190248 1197158 1207686 1222246 1241095 1264324 1291710 1322157 1353605 1383951 1411857 1436354
62156 1436354 1456292 1470871 1480411 1485887 1487840 1486304 1481573 1474304 1464831 1452995 1438775 1422654 1405298
62143 1405298 1387233 1369047 1351591 1335853 1322645 1312348 1304838 1299684 1296513 1295076 1295021 1295885 1297368
62130 1297368 1299365 1301689 1304147 1306942 1310570 1315168 1320497 1326792 1335024 1345876 1358862 1372933 1387596
62117 1387596 1403029 1419496 1437196 1456408 1477258 1499412 1522379 1545962 1570125 1594634 1619172
62106 1619172 1643631 1668079 1692724 1718133 1745062 1773707 1803464 1833793 1864958 1897593 1932008
62095 1932008 1968265 2006254 2045080 2082983 2118739 2152785 2186285 2219604 2252744 2286895 2324103
62084 2324103 2365155 2408744 2453050 2497265 2541294 2584948 2628166 2671504 2715698 2761002 2807294
62073 2807294 2854437 2902072 2949365 2995434 3039999 3083386 3126101 3168656 3211496 3254590 3297117
62062 3297117 3337925 3376424 3412852 3447672 3480862 3511813 3539649 3563561 3582953 3597581 3607654
62051 3607654 3613761 3616536 3616255 3612703 3605415 3594138 3579150 3561113 3540565 3517620 3492426 3465949
62039 3465949 3439902 3415598 3393074 3371672 3351209 3332139 3314787 3299079 3285010 3272761 3262220
62028 3262220 3252950 3244771 3237784 3231649 3225523 3219007 3212528 3206336 3199772 3192128 3183790 3175886 3169092 3163356
62014 3163356 3158473 3154329 3150737 3147594 3145170 3143877 3143900 3145336 3148424 3153249 3159560 3167284 3176895 3188820
62000 3188820 3202796 3218248 3234858 3252108 3268647 3282828 3293623 3300283 3301443 3295520 3281941 3261097
61988 3261097 3233134 3197780 3155560 3108253 3057767 3005279 2951811 2898845 2847705 2798767 2751781
61977 2751781 2706697 2663720 2622902 2584119 2547357 2512671 2479898 2448578 2418189 2388551 2360149
61966 2360149 2333909 2310251 2288412 2267152 2246147 2226154 2207745 2190518 2173853 2157820 2142860
61955 2142860 2128989 2115935 2103806 2093007 2083533 2074971 2067342 2061520 2058460 2058235 2060203 2064090 2070557
61942 2070557 2080461 2093789 2109708 2127667 2147967 2170993 2196255 2222693 2249662 2277130 2304939
61931 2304939 2332496 2359413 2385972 2412546 2438736 2463451 2485899 2506315 2525638 2544588 2563252
61920 2563252 2581715 2600964 2622944 2649742 2683072 2724597 2776173 2839356 2914961 3003602 3106495
61909 3106495 3225264 3361122 3514823 3687465 3880947 4097517 4339401 4609070 4909594
61900 4909594 5244522 5617481 6031742 6489602 6991614 7535811 8116678 8723590 9339278
61891 9339278 9939489 10494269 10970528 11335779 11562999 11635435 11549442 11314381 10950119 10483167
61881 10483167 9942369 9355305 8746352 8136085 7540889 6972470 6438005 5941219 5483681
61872 5483681 5065636 4686386 4344451 4037591 3762943 3517494 3298561 3103797 2930915
61863 2930915 2777713 2642356 2523446 2419845 2330560 2254704 2191347 2139538 2098562 2067968
61853 2067968 2047171 2035336 2031889 2036659 2049047 2067364 2089520 2114091 2140132 2166272 2190691 2211884
61841 2211884 2228777 2240235 2245295 2243903 2236747 2224427 2207646 2188266 2169163 2152601 2139418 2130118
61829 2130118 2125876 2127833 2135966 2149213 2166206 2185242 2203956 2219848 2231232 2237327 2237580 2231325 2218067
61816 2218067 2197798 2170978 2138371 2100964 2060105 2017766 1976379 1937925 1903154 1871989 1844635
61805 1844635 1821847 1804342 1792624 1787417 1789434 1798449 1813313 1833278 1858713 1890184 1927590 1970714
61793 1970714 2019985 2075986 2138705 2207945 2284048 2367556 2458541 2557076 2664174 2781538 2910579
61782 2910579 3052531 3209545 3384797 3581241 3800902 4045784 4319141 4625617 4970571
61773 4970571 5359643 5798867 6294943 6855156 7486686 8195494 8985538 9858675 10814251
61764 10814251 11847203 12945031 14085355 15234919 16349679 17376090 18254843 18927944
61756 18927944 19347821 19485606 19335961 18917105 18266314 17432626 16469290 15427713 14353303
61747 14353303 13282853 12243490 11253407 10323884 9461405 8668929 7946424 7291421 6699928
61738 6699928 6167339 5689005 5260411 4877156 4534882 4229363 3956845 3714287 3498930
61729 3498930 3307588 3136719 2983451 2846241 2724183 2615903 2519447 2432940 2354712 2282804
61719 2282804 2214976 2149470 2085528 2023049 1962116 1902908 1845622 1790182 1736280 1683956 1633964
61708 1633964 1587285 1544348 1504885 1468475 1435081 1405024 1378478 1355027 1333796 1314054 1295522
61697 1295522 1278025 1261123 1244323 1227480 1210678 1193903 1177174 1160872 1145516 1131230 1117706
61686 1117706 1104641 1091902 1079387 1067124 1055442 1044665 1034680 1025080 1015556 1005824 995450 984334
61674 984334 973246 963267 954666 946806 939073 931343 923673 916161 909146 902932 897321 891912 886732 881899
61660 881899 876896 871135 865172 860314 856880 853941 851009 848821 848004 848116 848743 850503 854030 858773 863797
61645 863797 869183 875647 883176 890981 898574 905974 912970 918904 923272 926084 927754 928961 930363 932082
61631 932082 933805 935714 938842 944009 950842 958421 966460 975211 984564 993870 1002377 1009205 1013187 1013386
61617 1013386 1009651 1002206 991089 976611 959957 942545 924962 907197 889649 873026 857365 842046
61605 842046 826921 812702 800054 788920 778868 769632 761075 753064 745567 738665 732408 726853 722141
61592 722141 718288 715027 712143 709793 708238 707486 707484 708380 710189 712487 714916 717738 721530 726575 732930
61577 732930 740666 749521 758763 768072 778267 790522 805090 821426 839187 858357 878682 899875
61565 899875 922276 946476 972339 999098 1026311 1053971 1081772 1109077 1135602 1161410 1186321
61554 1186321 1210093 1233109 1255974 1278402 1299391 1318550 1336411 1353327 1369010 1383255 1396111
61543 1396111 1407074 1415096 1419793 1421755 1421297 1417820 1410839 1400693 1387711 1371677 1352921 1333154 1314275
61530 1314275 1296869 1280592 1265441 1251811 1239836 1229621 1221806 1216972 1214765 1214575 1216960 1223418 1234669
61517 1234669 1250070 1268970 1291801 1319440 1352284 1390541 1434958 1486505 1545618 1612472 1688011
61506 1688011 1774029 1871878 1981625 2103003 2237029 2386035 2551965 2734887 2933177 3144512
61496 3144512 3366200 3594603 3824442 4048461 4257642 4442289 4593762 4705803 4774748 4799324
61486 4799324 4780847 4723254 4632259 4514251 4375908 4224100 4065102 3903710 3743439 3587438
61476 3587438 3438653 3299243 3170479 3053200 2947863 2854284 2772121 2701666 2643567 2597731
61466 2597731 2563257 2539549 2526631 2524124 2530757 2545406 2567869 2598018 2634765 2676548 2722436 2772026
61454 2772026 2824508 2878547 2933098 2987831 3042646 3097064 3150180 3201130 3249734 3296876 3344119
61443 3344119 3392662 3442522 3492629 3541507 3587990 3631690 3672906 3711868 3747953 3779971 3807286
61432 3807286 3830316 3849741 3865546 3877088 3883901 3886146 3884329 3878708 3868979 3854595 3835448 3812080
61420 3812080 3785161 3755142 3722765 3689432 3656412 3623958 3591988 3561469 3534161 3510977 3491520
61409 3491520 3475338 3462519 3452636 3444206 3435934 3427648 3419221 3409355 3396380 3379765 3359970 3337263
61397 3337263 3311782 3284556 3257460 3232022 3209037 3189415 3174725 3166782 3167223 3177576 3199188 3232947
61385 3232947 3279577 3340331 3416964 3510893 3622814 3753231 3902891 4072326 4261251 4468602
61375 4468602 4692821 4931559 5180887 5434794 5685504 5924387 6142863 6332899 6487269
61366 6487269 6600261 6668736 6692668 6674527 6618110 6527742 6407896 6262830 6096313 5911867
61356 5911867 5713196 5504255 5289005 5071444 4855642 4645163 4442101 4246996 4060041
61347 4060041 3882296 3715523 3561046 3419171 3289733 3172620 3067428 2972972 2887865 2811667
61337 2811667 2744927 2687985 2640277 2601155 2570780 2549597 2537350 2533305 2537166 2548952 2567995 2592886
61325 2592886 2622593 2656940 2695707 2737889 2782190 2827717 2873695 2918871 2961693 3001087 3036865
61314 3036865 3069548 3099845 3128051 3153792 3176480 3195965 3212474 3226101 3236846 3244995 3250690 3252978
61302 3252978 3250044 3240786 3225659 3205703 3181412 3152943 3120840 3085887 3048589 3009248 2968219 2925646
61290 2925646 2881339 2835451 2789072 2743692 2700231 2658888 2619664 2582680 2548270 2517151 2490255
61279 2490255 2468028 2450065 2435592 2423955 2414393 2405823 2397303 2388352 2378511 2367121 2354084 2340452
61267 2340452 2327599 2316075 2305774 2296947 2290451 2287155 2287584 2291892 2299615 2309650 2321094 2334103 2349562
61254 2349562 2368197 2390536 2417527 2450534 2490778 2539285 2597223 2665566 2744339 2832619 2929197
61243 2929197 3032593 3140240 3247996 3350521 3441897 3516167 3568016 3593386 3589576 3555358 3491693
61232 3491693 3402306 3292842 3169060 3035851 2897579 2758454 2622139 2491264 2367500 2251853
61222 2251853 2144797 2046343 1956234 1874195 1800186 1734439 1676968 1626879 1582573 1542917 1507784
61211 1507784 1477089 1449897 1425246 1403511 1386009 1373280 1364528 1358847 1356172 1356780 1360538 1367098 1376377
61198 1376377 1388427 1402995 1419478 1437122 1455110 1472562 1488574 1502272 1513038 1520953 1526834 1531431
61186 1531431 1534631 1535791 1534726 1531917 1527753 1522012 1514229 1504241 1492297 1478901 1464604 1449651 1433770
61173 1433770 1416483 1397572 1376979 1354461 1329741 1303018 1274973 1246268 1217331 1188497 1159991
61162 1159991 1131758 1103662 1075793 1048288 1021026 993983 967790 943407 921211 900814 881810
61151 881810 864224 848119 833165 818710 803972 788147 770794 752278 733562 715465 698316
61140 698316 682261 667488 654109 642125 631616 622728 615458 609671 605257 602113 600100 599293 600065
61127 600065 602575 606364 610858 616103 622551 630340 639211 648903 659067 668964 677964 686347 695065 704693
61113 704693 715061 725744 736353 746453 755917 765307 775166 784889 793030 798848 802855 805722 807355
61100 807355 807255 805164 801102 795335 788511 781285 773688 765436 756982 749560 743902 739482 735236 730491
61086 730491 725032 718920 712559 706442 700582 694623 688530 682558 676517 669884 662762 655872 649393 642719
61072 642719 635706 629131 623396 617769 611680 605933 601765 599333 597933 597193 597127 597392 597436 597276 597469 598314
61056 598314 599575 600870 602017 603152 604744 607225 610419 613770 617237 621371 626264 631260 636069 641334
61042 641334 647503 653948 660027 666239 673402 681250 688809 695758 702527 709424 716541 724174 732515 741286
61028 741286 750546 761434 775127 791378 809025 827579 847218 867534 887566 907078 926706 946809
61016 946809 967244 988312 1010771 1034776 1059849 1086128 1114619 1145912 1179678 1215708 1254558
61005 1254558 1296749 1342181 1390610 1441875 1495453 1550881 1609141 1672855 1744809 1827012 1921202
60994 1921202 2028869 2150258 2284636 2432384 2596206 2780280 2990097 3234267 3525274
60985 3525274 3877570 4306276 4828508 5463895 6232511 7155449 8261262 9590567 11189650
60976 11189650 13096115 15323046 17834614 20505916 23094530 25280052 26789205 27535215
60968 27535215 27662589 27462237 27233243 27190564 27436918 27947108 28543482 28915032 28728534
60959 28728534 27785694 26113037 23921562 21485042 19035307 16724217 14632439 12788478
60951 12788478 11185800 9800665 8607014 7581961 6704655 5955983 5319886 4782406 4329074
60942 4329074 3944838 3616517 3333812 3088088 2871886 2679962 2509258 2357158 2220568
60933 2220568 2096952 1985107 1884309 1793417 1711226 1636764 1568479 1503786 1440283 1377283 1315689
60922 1315689 1256658 1200756 1148068 1098443 1051691 1007912 967624 931234 898468 868549 840824
60911 840824 814962 790749 768088 747222 728562 712115 697190 682912 669092 656529 646205
60900 646205 638107 631054 623911 616756 610422 605135 600358 596035 593190 592778 594475 597179 600326 604095
60886 604095 608547 613254 617850 622424 627171 631951 636395 640281 643685 646697 648941 649528 647756 643896
60872 643896 638922 633431 627334 620748 614420 608756 603036 596365 589036 582194 576383 571279 566691 562917
60858 562917 560001 557544 555524 554608 555276 557253 560170 564247 569881 577026 585479 595413 607059 620125
60844 620125 634066 648868 665085 682997 702030 721013 738833 754797 768706 780795 791576
60833 791576 801556 810976 819801 827911 835209 841422 845972 848383 848874 848213 846876 844694 841578 838116 835012
60818 835012 832268 829408 826298 823165 819972 816368 812204 807499 801901 794817 786166 776436 765935 754626
60804 754626 742918 731953 722664 714913 707871 700923 693969 687207 681018 675854 672022 669619 668636 668862
60790 668862 669738 670709 671815 673616 676587 680972 687112 695205 704747 714880 725478 737185 750151 763553
60776 763553 776723 789972 803731 817585 830863 843636 856324 868657 879857 889741 898947 908066
60764 908066 917056 925501 932977 939158 943948 947616 950608 953197 955380 956907 957367 956583 955061 953693 952772
60749 952772 951742 950127 948192 946343 944442 942290 940256 938719 937192 934710 930890 925998 920165 913277
60735 913277 905553 897579 889757 882243 875385 869483 864067 858115 851325 844732 839727 836722 834990 833544
60721 833544 831984 830660 830191 830818 832178 833715 835157 836528 837888 839259 840584 841491 841307 839674 837051
60706 837051 834340 832103 830338 828822 827345 825749 824056 822486 821168 819968 818721 817256 815011 811193
60692 811193 805795 799995 794895 790174 784673 777934 770301 761721 751464 739256 725867 712355 699358
60679 699358 687295 676432 666348 656066 645229 634670 625387 617424 610303 604055 599151 595655 593141
60666 593141 591440 590848 591503 593082 595352 598634 603387 609523 616418 623525 630664 637676 644157 649781 654794
60651 654794 659847 665340 671152 677026 682926 688937 695126 701699 708947 716702 724036 729909 734121 737401
60637 737401 740648 744372 748775 754022 760283 767717 776424 786286 796860 807659 818570 829926 842157
60624 842157 855441 869568 883978 897975 911015 922769 932892 940939 946701 950425 952492 952993 951845
60611 951845 949246 945733 941746 937320 932269 926651 921066 916441 913315 911279 909192 906002 901227 894794
60597 894794 886775 877317 866416 853699 838859 822555 806468 792168 780193 770382 762595 756714
60585 756714 752340 749071 746988 746516 747899 751000 755421 760625 766212 772246 778943 785874 791959 796576
60571 796576 800188 803561 806835 809834 812722 815814 819130 822681 826711 831044 834625 836458 836694 836070 834632
60556 834632 831816 827565 822533 817244 811788 806294 801023 796019 791349 787554 785215 784108 783564 783669 785494
60541 785494 790109 798037 809629 825258 845007 868771 896757 929348 966329 1006590 1048374 1089271
60529 1089271 1126171 1156082 1177142 1188443 1189261 1179421 1160414 1135217 1106812 1077550 1049764 1025806
60517 1025806 1006867 992476 981655 974088 969980 969367 971917 976885 982989 988827 993813 998519 1004059
60504 1004059 1011370 1020933 1032669 1046219 1061788 1080572 1103867 1132130 1165686 1205963 1254904 1313260
60492 1313260 1380599 1457055 1543880 1642034 1751468 1872257 2005571 2153302 2317938 2503345
60482 2503345 2714584 2956080 3230405 3538607 3879613 4247201 4627159 4997668 5332473
60473 5332473 5604819 5791523 5876763 5854099 5726383 5505190 5210103 4865810 4496798 4123104
60463 4123104 3759602 3416802 3100703 2812917 2552788 2319645 2112776 1930333 1769705
60454 1769705 1628676 1505303 1397196 1302093 1218857 1146826 1084459 1029727 981620 940174 904945
60443 904945 874507 847546 823580 802409 783615 766826 751889 738568 726480 715341 704902
60432 704902 694761 684649 674710 665092 655589 646168 637392 629535 621724 612920 603585 595338 588993 583977
60418 583977 579820 577099 576383 577069 577949 578449 578776 579195 579774 580696 582367 585029 588349 591472 593696 595206
60402 595206 597019 599970 603878 607914 611532 614736 617729 620858 624762 629986 636262 642570 648116 653051
60388 653051 658167 664053 670538 676830 682210 686656 690667 694393 697256 698587 698302 696712 694036 690489
60374 690489 686526 682562 678675 674918 671576 668726 665911 662876 660277 659014 659049 659558 660130 661091 662634
60359 662634 664381 666005 667712 669874 672595 675841 679676 684140 689176 694759 700948 707757 715147 723099
60345 723099 731459 739820 747810 755391 762628 769320 775194 780318 784959 789072 792226 793989 794151 792744
60331 792744 790188 787344 785057 783673 783163 783600 785243 788314 792831 798394 803940 808098 810177 810503 809548
60316 809548 807163 803155 798104 792890 787685 782116 776208 770501 765359 760833 757105 754358 752273 750240
60302 750240 748117 746193 744530 742941 741585 740886 740817 740916 741089 741782 743209 745041 746942 748872 750670 751928
60286 751928 752464 752458 751998 751026 749934 749662 750965 753929 758353 764113 770924 778227 785658 793255 800952 808150
60270 808150 814096 818501 821658 824206 826885 830199 834129 838329 842663 847353 852612 858478 865116 873022
60256 873022 882795 894872 909453 926453 945578 966735 990380 1017161 1047289 1080556 1116944 1156872
60244 1156872 1200845 1249281 1302724 1361851 1427143 1498738 1576638 1660845 1751285 1847787 1950010
60233 1950010 2057126 2167675 2279939 2392323 2503172 2610477 2712132 2806249 2890932 2964171
60223 2964171 3024526 3071645 3105543 3125698 3131633 3124193 3105378 3076910 3039809 2995535 2946771 2896716
60211 2896716 2848109 2803015 2762964 2729033 2702276 2684247 2676635 2680278 2695041 2720823 2758139 2807580
60199 2807580 2869242 2942930 3028302 3124413 3229423 3340978 3456553 3573352 3688276 3798161
60189 3798161 3899759 3989564 4064334 4122132 4162461 4185233 4189992 4176303 4144484 4095784 4032277
60178 4032277 3956797 3872614 3782917 3690699 3598995 3510782 3428653 3355015 3292475 3243420 3209143
60167 3209143 3189870 3185630 3196436 3221743 3260623 3312621 3377505 3453646 3537274 3623752 3709108
60156 3709108 3790154 3863999 3928109 3980489 4019496 4044000 4054134 4051368 4037479 4013920 3982503
60145 3982503 3945931 3907113 3868579 3833111 3804297 3785464 3778322 3783381 3801477 3834133 3882594 3947414
60133 3947414 4029225 4129342 4249357 4390562 4553978 4740639 4951510 5187148 5447476 5731798
60123 5731798 6038760 6366146 6710546 7067325 7431019 7795767 8155306 8502783 8831045
60114 8831045 9133341 9403764 9637211 9829134 9975262 10071390 10113771 10100130 10030299 9905761
60104 9905761 9729171 9504994 9240314 8944147 8625849 8294574 7959653 7630189 7313784
60095 7313784 7016286 6742781 6497975 6285314 6106521 5962311 5852967 5778066 5736441 5726753
60085 5726753 5747365 5795330 5866183 5954984 6056816 6166041 6276089 6380720 6474984 6554729
60075 6554729 6616212 6656888 6675870 6672996 6648226 6602602 6538834 6459705 6366253 6258322 6136471
60064 6136471 6002403 5857867 5704230 5543225 5377455 5210066 5044350 4883478 4730074
60055 4730074 4586086 4453366 4334015 4229737 4141178 4068486 4012311 3973801 3953800 3952401 3968991
60044 3968991 4002388 4051375 4115530 4195111 4289570 4396520 4512561 4634540 4759259 4882434
60034 4882434 4998938 5104103 5194287 5266469 5318102 5347421 5353466 5335829 5294787 5231482 5147556
60023 5147556 5044811 4925634 4793587 4653157 4509060 4365836 4227436 4096601 3974965
60014 3974965 3864211 3766649 3684209 3617431 3566111 3530384 3510468 3506042 3516977 3544363 3589720
60003 3589720 3653354 3734463 3832732 3948753 4082631 4232959 4397244 4572434 4754739 4939495
59993 4939495 5121535 5295448 5455727 5597407 5716853 5811633 5879796 5919701 5930333 5911228
59983 5911228 5862333 5784692 5681194 5556103 5413983 5259644 5098755 4937483 4781340 4634875
59973 4634875 4502106 4386239 4288913 4210579 4151721 4112947 4094041 4094014 4112318 4148951 4203032
59962 4203032 4272198 4353856 4446155 4547184 4654047 4763403 4872350 4978215 5078135 5169672
59952 5169672 5251609 5323513 5384684 5434130 5471544 5497891 5515042 5525085 5529992 5531775 5532928 5536708
59940 5536708 5546912 5567455 5602337 5655785 5731984 5834601 5966789 6131514 6331401 6568127
59930 6568127 6842113 7152554 7497202 7871946 8270727 8685468 9105524 9517381 9905634
59921 9905634 10254523 10548610 10773214 10916230 10970751 10935929 10815631 10617181 10351323 10031903
59911 10031903 9674107 9292583 8900631 8509801 8129291 7766049 7425819 7113615 6832856
59902 6832856 6584781 6369505 6187449 6039418 5925812 5846411 5800752 5788240 5808038 5859124
59892 5859124 5940128 6048771 6181724 6335203 6505181 6686553 6872429 7054649 7224543 7372868
59882 7372868 7489805 7566306 7595897 7575183 7503276 7381642 7214379 7007806 6769356 6506938
59872 6506938 6228811 5942959 5656090 5373469 5099664 4838863 4594224 4367412 4159071
59863 4159071 3969476 3798578 3645941 3511106 3393854 3293796 3209796 3140066 3082706 3035872
59853 3035872 2997536 2965447 2937478 2911872 2887145 2862042 2835809 2808505 2780952 2754399 2730166
59842 2730166 2709304 2692288 2678930 2668636 2660668 2653950 2646692 2636554 2621459 2600311 2573055 2540420
59830 2540420 2503791 2465036 2426010 2388078 2352209 2319397 2290642 2266354 2245902 2227956 2211414
59819 2211414 2196152 2183029 2173340 2168330 2169039 2176135 2189520 2208267 2231348 2258404 2289477 2324083
59807 2324083 2361266 2400843 2444000 2492018 2544568 2599636 2654849 2708410 2758825 2804357 2843119
59796 2843119 2873666 2895551 2909455 2916783 2919084 2917901 2915049 2912581 2912278 2915484 2923623 2938474 2961610
59783 2961610 2993997 3036605 3091166 3159859 3244563 3347007 3469459 3614680 3785301 3983803
59773 3983803 4212981 4475562 4772878 5103927 5465221 5850081 6246665 6636224 6993815
59764 6993815 7292061 7506560 7620813 7629146 7537265 7360730 7121595 6843636 6547817 6250122
59754 6250122 5962047 5691838 5444893 5223989 5030100 4863167 4722050 4604670 4509128 4434657
59744 4434657 4380988 4347155 4331551 4332953 4350848 4384949 4435020 4501034 4582966 4680596 4794083
59733 4794083 4924462 5073008 5240430 5427435 5635742 5867723 6125261 6409895 6723934
59724 6723934 7070342 7451415 7868457 8322770 8815819 9347863 9916901 10518905 11148070
59715 11148070 11796451 12454055 13109776 13752181 14370217 14955112 15502908 16015141 16497261
59706 16497261 16957261 17405571 17854217 18314154 18792866 19294004 19817585 20359165 20909193
59697 20909193 21454193 21978695 22466028 22898525 23258928 23532969 23711541 23791661 23776418 23674165
59687 23674165 23497310 23261404 22984426 22685432 22382744 22093012 21831400 21611513 21444649
59678 21444649 21339815 21305079 21348482 21477401 21697778 22014497 22431780 22952142 23574868 24295565
59668 24295565 25106191 25994101 26940395 27918850 28895738 29830291 30676501 31386743 31916252
59659 31916252 32227435 32294150 32105870 31669790 31009371 30160391 29166621 28075434 26932993
59650 26932993 25780213 24651090 23572752 22565123 21639863 20799970 20040560 19349752 18709071
59641 18709071 18094383 17478650 16836705 16150882 15415300 14636588 13830634 13017388 12216337
59632 12216337 11443733 10711414 10026877 9394082 8814181 8285936 7806418 7372181 6980023
59623 6980023 6626840 6309476 6025138 5771610 5546591 5347144 5170272 5013890 4876775
59614 4876775 4757695 4654889 4566272 4489759 4423433 4365617 4314643 4268306 4223770 4178291 4129928
59603 4129928 4077405 4019645 3955892 3886092 3810761 3730591 3646521 3560076 3473194 3387633 3304660
59592 3304660 3225231 3150213 3080393 3016412 2958775 2907899 2864202 2828058 2799502 2778111 2763363
59581 2763363 2754998 2752662 2755332 2761679 2771049 2783583 2799355 2817924 2838835 2861849 2886330 2911006
59569 2911006 2934801 2957574 2979851 3002333 3025983 3052028 3081402 3114524 3151916 3194627 3243683
59558 3243683 3299587 3362751 3434079 3514810 3606159 3709351 3825422 3954714 4097211 4253834
59548 4253834 4426698 4617390 4825442 5049075 5286826 5537666 5799921 6070874 6347138
59539 6347138 6624701 6898872 7165085 7419801 7660310 7883905 8087700 8268701 8423363
59530 8423363 8547756 8639555 8700122 8733906 8745764 8739527 8718942 8688751 8654371 8621237 8594921
59519 8594921 8581311 8586134 8614406 8670314 8756827 8874632 9021278 9191251 9376507 9566730
59509 9566730 9749604 9911735 10040091 10123319 10152491 10121351 10026384 9866952 9645428 9367070
59499 9367070 9039703 8673485 8280482 7873425 7463969 7061735 6674536 6308729 5968857
59490 5968857 5657346 5374970 5121533 4896111 4697277 4523685 4374289 4247751 4142181
59481 4142181 4055933 3988369 3939330 3908205 3894100 3896648 3915992 3952119 4004890 4074778 4162950
59470 4162950 4270343 4396999 4542406 4706169 4888032 5087341 5302525 5530964 5769109
59461 5769109 6012404 6254866 6488924 6706162 6898322 7057494 7175917 7246904 7266713 7235182
59451 7235182 7154354 7027173 6857927 6653050 6420386 6167631 5901797 5629544 5356963 5088786
59441 5088786 4828283 4578027 4340485 4117782 3911067 3720189 3544198 3382520 3235486
59432 3235486 3103270 2984542 2877116 2780006 2693816 2618750 2553334 2495712 2445159 2401527 2364175
59421 2364175 2332487 2306681 2287025 2272843 2263332 2258749 2259639 2265407 2274911 2288078 2305660 2327641
59409 2327641 2353060 2380997 2410121 2437331 2458612 2472005 2478943 2482535 2485719 2491341 2502516 2521735
59397 2521735 2550053 2587511 2633523 2686135 2741686 2796333 2848304 2898738 2950891 3008836 3076375
59386 3076375 3156355 3250686 3360925 3488743 3635922 3804236 3995503 4211661 4454910 4727952
59376 4727952 5033962 5375994 5756327 6176152 6635263 7131525 7660835 8217614 8794598
59367 8794598 9381658 9965668 10532876 11071866 11574555 12035625 12452399 12825037 13155715
59358 13155715 13447298 13703011 13926532 14120870 14286810 14422909 14526645 14594601 14621920 14603039
59348 14603039 14533508 14410684 14233108 14000702 13716086 13384863 13014099 12610892 12182069
59339 12182069 11733937 11271633 10799171 10320433 9839713 9361471 8890318 8431281 7989204
59330 7989204 7567657 7169001 6795454 6449187 6131243 5841200 5578105 5340966 5128367
59321 5128367 4938673 4770951 4624839 4499172 4391661 4300337 4224477 4163598 4116319 4080867
59311 4080867 4056139 4041767 4037549 4043219 4058282 4081601 4111400 4145958 4183979 4224193 4265010 4304777
59299 4304777 4341966 4375067 4402731 4424096 4438560 4445352 4443953 4434901 4419575 4399281 4375283 4349573
59287 4349573 4324605 4302121 4283182 4269511 4263789 4268261 4283878 4311227 4351489 4406086 4476095 4562408
59275 4562408 4665623 4785198 4919059 5064169 5216737 5371641 5522760 5664773 5794408
59266 5794408 5909727 6008829 6089628 6150211 6188855 6204208 6196038 6165680 6115614 6048985 5969506
59255 5969506 5881073 5787066 5690323 5593680 5499731 5409846 5324061 5241967 5162972 5085777 5008777
59244 5008777 4931474 4854640 4778752 4703159 4627263 4551635 4477511 4406080 4338839 4277716 4224089
59233 4224089 4178255 4140556 4112574 4096780 4095597 4111210 4145543 4199902 4275306 4373691 4498168
59222 4498168 4651611 4835647 5051440 5300463 5583605 5900038 6247415 6622137 7018073
59213 7018073 7425189 7830260 8218910 8576733 8889373 9143014 9325582 9427722 9443414 9370566
59203 9370566 9211452 8972740 8665250 8303137 7901943 7476404 7039785 6604460 6181502
59194 6181502 5778969 5401317 5050937 4729562 4437842 4174673 3937962 3725698 3535912
59185 3535912 3366435 3215365 3081214 2962096 2855510 2759610 2674064 2598980 2533543 2476350
59175 2476350 2426518 2383775 2347896 2318551 2295282 2277153 2263026 2252600 2246557 2245274 2248144 2254650
59163 2254650 2265246 2280502 2300180 2323896 2351832 2383996 2419570 2458019 2500240 2547586 2600150
59152 2600150 2656870 2716840 2779624 2844663 2911318 2979273 3048131 3116719 3183290 3246110 3303497
59141 3303497 3353884 3396441 3431104 3457496 3474512 3481565 3479456 3469287 3451379 3426223 3395801 3362879
59129 3362879 3329426 3296626 3265829 3238441 3215289 3197206 3185939 3183474 3190698 3207485 3233835 3270165
59117 3270165 3316855 3374336 3443219 3523512 3614194 3714405 3824647 3945954 4078457 4221753
59107 4221753 4376107 4542072 4719293 4906894 5104722 5312929 5530361 5754420 5982415
59098 5982415 6211825 6439157 6659435 6866727 7054152 7213383 7335478 7412915 7440771 7416517
59088 7416517 7339995 7213911 7043564 6835651 6597392 6336327 6059881 5774769 5486998 5202024
59078 5202024 4924202 4656292 4400114 4157381 3929277 3715759 3516266 3330901 3160036
59069 3160036 3003024 2858323 2724841 2602247 2490031 2387174 2292794 2206339 2127136 2054481
59059 2054481 1988116 1927988 1873599 1824216 1779514 1739300 1702871 1669456 1639066 1612059 1588066
59048 1588066 1566203 1546176 1528202 1511913 1496244 1480398 1464188 1447549 1430513 1413513 1396928
59037 1396928 1380493 1364089 1348919 1336818 1328415 1322892 1319567 1318716 1320746 1325541 1332806 1342246 1353312
59024 1353312 1365583 1379464 1395611 1413499 1431338 1447495 1461250 1472124 1479513 1483361 1484498 1483932
59012 1483932 1482312 1480231 1478424 1477386 1477313 1478577 1481826 1487499 1495593 1505920 1518166 1531730 1545759
58999 1545759 1559179 1570396 1577431 1579023 1575417 1567610 1556179 1541411 1524152 1505693 1487111 1469330
58987 1469330 1453394 1439829 1428079 1417440 1408255 1401365 1396781 1393865 1392456 1392738 1394305 1396477 1399511
58974 1399511 1404414 1411484 1419937 1428977 1438502 1448895 1460887 1475360 1492464 1511180 1530618 1551308
58962 1551308 1574180 1598728 1623391 1647380 1670877 1693739 1715612 1737263 1760265 1785052 1810542
58951 1810542 1835950 1861811 1888965 1917675 1948013 1980106 2013722 2048611 2085476 2125783 2170442
58940 2170442 2219476 2272873 2330781 2392940 2459022 2529558 2605424 2686558 2772320 2863075 2960116
58929 2960116 3064115 3175128 3294325 3424190 3566609 3722042 3891015 4075174 4276402
58920 4276402 4496122 4736043 4998692 5286647 5601995 5946723 6322759 6731553 7174578
58911 7174578 7654224 8172986 8731555 9328664 9962531 10630761 11328375 12046924 12775325
58902 12775325 13499689 14201901 14860206 15452458 15958384 16359429 16639200 16786102 16795341 16668436
58892 16668436 16412440 16040247 15569740 15020771 14412808 13764935 13095763 12421497 11754483
58883 11754483 11104106 10478069 9882113 9319645 8792731 8302831 7850101 7432925 7048903
58874 7048903 6695667 6370481 6070223 5792396 5535319 5296935 5074543 4866175 4671098
58865 4671098 4488528 4317162 4156555 4007573 3870622 3744558 3627987 3520336 3420923 3328453
58855 3328453 3242441 3163850 3093278 3029727 2972293 2921733 2878962 2843034 2812055 2785298 2763185
58844 2763185 2745989 2733935 2727942 2728872 2736379 2749574 2768346 2793003 2823131 2858027 2897995 2944201
58832 2944201 2997397 3057563 3124550 3198287 3278574 3365346 3459114 3560857 3671789 3793322 3926510
58821 3926510 4071302 4227226 4395233 4577964 4777784 4995692 5232862 5492222 5777491
58812 5777491 6091516 6436439 6814697 7228785 7680468 8170983 8701355 9271573 9879667
58803 9879667 10521878 11192738 11883948 12583505 13276346 13945188 14570377 15130229 15603114
58794 15603114 15969895 16215208 16328454 16305283 16148136 15865219 15469522 14978551 14412818
58785 14412818 13792628 13136073 12459658 11778891 11106838 10452910 9823939 9225423 8660861
58776 8660861 8131044 7635472 7173994 6746260 6350505 5984074 5644620 5329874 5036957
58767 5036957 4763096 4506796 4267745 4045992 3841559 3653876 3480954 3319974 3169410
58758 3169410 3029691 2901267 2783198 2674352 2574658 2484048 2401333 2325365 2256366 2194937
58748 2194937 2140553 2092097 2049011 2010793 1976278 1944579 1916031 1891101 1869137 1849196 1831273
58737 1831273 1815596 1801486 1787921 1774436 1760484 1744883 1727046 1707908 1688535 1668728 1648046
58726 1648046 1627179 1606956 1586896 1566081 1544684 1523341 1501746 1479120 1455376 1430639 1404435
58715 1404435 1376540 1347859 1319293 1290644 1261683 1233239 1205855 1178516 1150289 1122269 1096243
58704 1096243 1072292 1049444 1027917 1008861 992330 977192 962740 948932 935443 921913 908695
58693 908695 896058 883201 869381 855391 842547 830843 819503 808673 799054 790542 782773 776387
58681 776387 772205 769786 768390 768664 771645 776707 782225 787810 794087 800750 806691 811743 816527 820788
58667 820788 823589 825023 826080 827026 827386 827330 827530 827880 827752 827146 826110 823493 817889 809563 799949 789766
58651 789766 779192 769282 761257 754765 748735 743678 741186 741386 742892 745320 749841 757054 766157 776539
58637 776539 788571 802399 817411 833158 849715 867063 885276 905217 927910 953428 981480
58626 981480 1012584 1047322 1085087 1125180 1168717 1217817 1273297 1334800 1402655 1477800 1560283
58615 1560283 1649788 1747449 1855448 1975109 2107131 2253076 2414476 2590584 2779044 2978455
58605 2978455 3188030 3404717 3622715 3835763 4037608 4220150 4373629 4489584 4562471 4588871
58595 4588871 4567658 4501612 4396993 4260869 4100021 3921945 3734361 3542953 3351157 3162400
58585 3162400 2980789 2809327 2649187 2501010 2365360 2241846 2129656 2029117 1941081 1864799
58575 1864799 1798266 1740575 1691900 1651147 1615847 1584673 1557919 1535164 1514564 1494940 1476713
58564 1476713 1460422 1446177 1434695 1426788 1421411 1416127 1409675 1402029 1391899 1376697 1355588 1330367
58552 1330367 1302802 1273230 1242269 1211523 1181768 1152499 1123961 1097593 1073817 1051521 1030505
58541 1030505 1012301 997769 985852 975534 966977 959896 952817 944940 936927 929012 920128 909732 898697
58528 898697 887605 875966 863861 852476 842239 832144 821634 811303 801065 789638 776691
58517 776691 763714 751904 740779 729548 718167 706574 694679 683592 674958 668675 663131 657916
58505 657916 654071 651472 648577 645372 643934 645277 648120 651474 655827 660885 665034 668268 672969 680331
58491 680331 688554 696028 703804 713250 723620 733645 743471 753331 762306 769971 777374 784934 791331 795897
58477 795897 800086 805071 809805 812911 814557 815002 813303 809001 803244 796782 788704 778535 767574 756744
58463 756744 745176 732422 720035 709288 699258 688825 678718 669944 662016 654384 647883 643198
58451 643198 639605 636742 635769 637173 639199 640133 640572 642008 644787 648782 654334 661119 667807 674190 682016
58436 682016 692604 705366 719603 735605 752889 769653 785221 800682 815803 827789 834589 837136
58424 837136 836902 833776 827955 821356 815319 809248 803164 799067 798010 798340 798690 800187 803826 808266 812288
58409 812288 816936 823161 829865 836347 844125 854208 865095 875612 886934 899496 910604 917683 921344
58396 921344 922768 920771 914256 905031 895321 884697 872252 859560 848710 839471 830975 823991 819045
58383 819045 814615 809746 806101 804887 804375 803117 802869 805313 808583 810234 811121 813119 815507 816975 818814
58368 818814 822642 827219 830941 835272 842296 851023 859553 868681 879852 891812 902973 914982 930167
58355 930167 947303 963547 978739 994179 1009117 1022208 1034749 1048791 1063596 1077315 1090296
58344 1090296 1103253 1114097 1120252 1122458 1122854 1121195 1116430 1110074 1104433 1099300 1093788 1089323 1087365 1086348
58330 1086348 1084513 1083520 1085631 1089750 1094082 1100210 1110391 1123127 1135591 1148235 1162931 1178902 1194737
58317 1194737 1212075 1232920 1255591 1277598 1300121 1325284 1351506 1376077 1399806 1424376 1447668
58306 1447668 1466571 1481934 1495927 1507154 1513494 1517161 1521645 1526195 1528624 1530927 1536561 1544712 1552847
58293 1552847 1562358 1575867 1591493 1605776 1619810 1636613 1655046 1672562 1691294 1714900 1741834
58282 1741834 1768131 1794326 1823143 1853181 1881824 1911609 1946454 1984246 2020604 2057310 2099171
58271 2099171 2145113 2190524 2236063 2285699 2338098 2388481 2437244 2488239 2540279 2588922 2634964
58260 2634964 2682529 2730609 2775467 2819647 2869303 2924157 2979333 3035585 3098106 3166669 3236776
58249 3236776 3309326 3389338 3476311 3565727 3658683 3759885 3867598 3976118 4086814 4206101
58239 4206101 4333922 4465219 4601170 4747602 4903894 5065255 5234286 5418142 5616084
58230 5616084 5822494 6040291 6278011 6535496 6806431 7093212 7404768 7741548 8097949
58221 8097949 8477850 8891867 9341082 9820161 10334777 10898475 11514307 12178166 12898477
58212 12898477 13693319 14570545 15531787 16593991 17784814 19119542 20607202 22277950
58204 22277950 24179750 26352323 28834779 31698795 35046710 38984437 43636305 49189898
58196 49189898 55894003 64019271 73862928 85784179 100186596 117484997 138167696
58189 138167696 162879535 192306848 226842869 266216844 309095548 352536865 391660398
58182 391660398 420412418 433685326 429583037 410105402 379824561 343794824 306141352
58175 306141352 269672213 236015372 205876075 179352450 156254072 136292399 119140540
58168 119140540 104475098 92026153 81575977 72918677 65852248 60203843 55836839
58161 55836839 52642428 50547427 49517326 49521013 50473878 52172965 54208961 55919754 56537212
58152 56537212 55531623 52886221 49041632 44588464 40010957 35627453 31624332 28075267
58144 28075267 24966543 22253563 19898176 17859677 16087238 14540853 13201351 12049594
58136 12049594 11054642 10190629 9445977 8806673 8247408 7747515 7300098 6898338 6527863
58127 6527863 6179500 5855167 5554555 5269357 4996440 4743334 4514466 4304190 4108675
58118 4108675 3932323 3776722 3634894 3502030 3380792 3270654 3162767 3051138 2939339
58109 2939339 2831293 2725001 2620028 2521651 2432471 2348396 2267269 2193058 2127493 2065994 2005876
58098 2005876 1950395 1900824 1852772 1804268 1759564 1720958 1684508 1647558 1612903 1581750 1550159
58087 1550159 1516293 1483855 1454495 1423992 1389895 1355921 1324837 1293787 1260713 1228859 1200734
58076 1200734 1173693 1145521 1118548 1094413 1070516 1045460 1022539 1004067 987418 970116 953729
58065 953729 939486 925184 909732 895748 884588 873760 862112 852404 845823 839072 829938 820612
58053 820612 812566 803343 791631 780367 771482 762525 751837 742156 735574 729654 722151 715094 710522
58040 710522 706482 700934 695592 692294 689400 685317 681979 681337 681770 681170 680310 680167 679241 676479 673639 672088
58024 672088 670405 667657 665639 665424 665216 664047 663973 666063 667949 668043 668481 671084 673941 674811 674469 674024 672466
58007 672466 669599 667789 667920 667111 663325 658682 655332 651733 646255 640863 637703 635231 631180 626327 621945
57992 621945 616517 608483 599404 590993 581700 569801 557360 547593 540469 534203 528839 525139 522030 518395
57978 518395 515489 514659 514714 514338 514872 517773 521538 524259 527067 531903 537740 542144 544938 547353 549231
57963 549231 549882 550220 551306 552255 551941 551212 551115 550725 548979 546689 544444 540654 534176 526808 520670 515197
57947 515197 509291 504185 501305 499401 496811 494704 495103 497402 499693 501827 504287 505822 505199 503669 502732
57932 502732 501116 496995 491602 487377 483796 478262 470115 460720 450585 439392 428127 418370 410012
57919 410012 402091 395041 389804 385675 381393 377419 374913 373529 372485 372645 375216 379471 384009 389093
57905 389093 395509 402461 408967 416011 424813 434279 442606 450144 458139 466014 472516 478271 484405 489857
57891 489857 492832 493867 494667 494988 493466 490530 487589 484278 479411 473816 469268 465371 460416 454639 449687
57876 449687 445395 440126 433949 428603 424594 421033 418024 416502 415941 414932 413822 414240 416237 418513 421170
57861 421170 425538 431334 436715 441170 445852 450897 454908 457326 459037 460372 460585 459497 457730 455380
57847 455380 452384 449908 449275 449684 449138 447455 446187 445771 445060 443606 442170 440951 439471 438210 438114 438409
57831 438409 437084 433744 429930 426492 422678 417998 412918 407428 400808 393073 384975 376487 367014 357058
57817 357058 347959 340007 332500 325454 319389 313724 307382 300837 295549 291513 287505 283635 281429 281251
57803 281251 281904 283015 285659 290222 295628 301137 307194 314129 321584 329312 336901 342772 345287 344982 343965
57788 343965 343260 342602 342573 344542 348266 351703 353658 354742 355518 355648 355197 354775 353988 351609 347619 343279
57772 343279 338949 333793 327876 322514 318063 313343 307806 302411 297840 293655 289733 286786 284881 283101
57758 283101 281173 279890 279528 279503 279900 281578 284365 286901 288724 290822 293696 296618 299206 302009 305103
57743 305103 307799 310158 313080 316510 319311 321324 323735 327000 330155 332626 334851 336751 337595 337905 339447
57728 339447 342647 345983 348663 351819 356141 360360 363283 365613 368650 372632 377429 383383 390453 397792
57714 397792 405013 412648 420804 428803 436727 445707 456045 466678 477178 488562 501420 515019 529066
57701 529066 544529 561759 579634 597663 617253 639709 664551 691012 719680 751513 786734
57690 786734 825867 870348 920862 976510 1036965 1104160 1180593 1267205 1364235 1472962 1595328
57679 1595328 1732880 1887211 2060324 2253366 2465893 2697109 2946282 3210758 3484890
57670 3484890 3762151 4036961 4303204 4552359 4774499 4959537 5095553 5167427 5160667 5068517
57660 5068517 4896049 4658841 4378640 4078166 3776244 3485258 3212057 2960141 2730811
57651 2730811 2523840 2338633 2174625 2030296 1902979 1790589 1692621 1608662 1536918 1475133
57641 1475133 1422058 1377079 1339373 1308404 1284338 1266974 1255085 1247701 1245151 1247999 1255881 1268342
57629 1268342 1285806 1308797 1337209 1371348 1412655 1462297 1520057 1585728 1660591 1746317 1843419
57618 1843419 1952042 2073286 2208282 2356564 2516531 2686559 2864131 3044375 3220772
57609 3220772 3386767 3535536 3658934 3748567 3798325 3805563 3770717 3696990 3589920 3455940
57599 3455940 3301205 3132000 2955113 2776556 2600384 2429528 2266842 2114244 1971671
57590 1971671 1838335 1714534 1601200 1498289 1404853 1320209 1243820 1174550 1111208 1053466
57580 1053466 1001207 953528 909531 869559 834391 803548 775615 749916 726634 705499 685553
57569 685553 666295 648122 631670 617360 605366 595324 586328 577883 570492 564709 560171 556251 553009
57556 553009 550697 548939 547352 546463 547118 549432 553120 558322 565196 573224 581811 591078 601376 612627
57542 612627 624922 638959 655004 672217 690043 709444 731668 756656 783983 814655 850530
57531 850530 892370 939771 992626 1051494 1116948 1189775 1271444 1363188 1464963 1576283 1697480
57520 1697480 1828867 1969083 2115440 2265232 2415224 2560240 2693759 2809779 2902967 2967723
57510 2967723 2999208 2995772 2959328 2893376 2801889 2689956 2563782 2429294 2291281 2153742
57500 2153742 2020047 1892570 1772914 1662388 1561551 1469646 1385488 1308816 1239999 1178805
57490 1178805 1124372 1076080 1033496 995900 962923 935194 913240 896141 882449 871971 865419
57479 865419 862747 863304 867283 875506 887885 903570 922533 945623 973169 1004992 1041790 1085031
57467 1085031 1135352 1192497 1256932 1330063 1412597 1504080 1604349 1714054 1833285 1960784
57457 1960784 2094741 2232919 2371341 2503859 2623606 2724273 2800021 2845627 2857743 2835718
57447 2835718 2781163 2697496 2589908 2464677 2327857 2184772 2040280 1898369 1761430 1630739
57437 1630739 1507689 1393729 1289325 1194002 1107265 1028553 956698 890713 830955 778160 731521
57426 731521 689176 650498 616256 586388 559318 533828 510077 488308 468042 449063 431763
57415 431763 415936 400599 385645 372313 361328 351831 342794 334129 325698 316671 306925 297870 290761
57402 290761 285124 279817 274706 270208 266018 261514 256868 252688 248972 245368 242132 239969 239097 239087 239431
57387 239431 239794 239980 240044 240149 240112 239557 238758 238676 239765 241253 241953 241330 239555 237172 234988 233666 233049 232411
57369 232411 231510 230753 230182 229213 227689 226312 225547 224956 224113 223395 223291 223618 223975 224346 224756 224955 224953 225197 225719
57350 225719 225745 224738 223238 222108 221544 221367 221717 222776 224199 225418 226227 226677 226705 226320 225828 225586 225779
57333 225779 226504 227654 228663 229004 229042 229766 231507 233676 235875 238381 241268 243947 246113 248328 251147
57318 251147 254377 257719 261441 265813 270430 274698 278610 282616 287065 292016 297192 302046 306468 311412
57304 311412 318045 326193 334516 342326 350155 358325 366240 373625 381320 390166 400133 411200 423971 438580
57290 438580 453990 469362 485298 502838 522044 542531 564652 588990 615193 642329 669993
57279 669993 698238 726849 755491 784204 812947 841021 867569 892142 914070 931874 944151
57268 944151 950703 952106 948571 939936 926343 908261 886316 861642 835876 810121 784510 759391
57256 759391 736159 716037 698784 683564 670476 660114 652165 645628 640104 635833 632802 630942 630941
57243 630941 633718 639146 646282 654672 664410 674899 684672 692664 699051 704893 711587 720456 731873 744760
57229 744760 757750 770870 785351 801900 820048 839165 859137 879804 900609 921223 941931
57218 941931 963079 984633 1006482 1028746 1051523 1074727 1098364 1122727 1148182 1174960 1203051
57207 1203051 1232037 1261091 1289477 1317065 1344240 1371533 1399471 1428314 1457481 1485594 1511668
57196 1511668 1536076 1559910 1583643 1606917 1629425 1651457 1673763 1697291 1722842 1750454 1779290
57185 1779290 1808662 1838957 1871114 1905421 1941320 1978234 2016085 2055141 2095711 2137737 2180313
57174 2180313 2221948 2261748 2300038 2337558 2374651 2411740 2449801 2489345 2529430 2568745 2607374
57163 2607374 2646486 2686431 2726362 2765793 2805400 2845875 2886868 2927589 2967812 3007702 3047015
57152 3047015 3084967 3120847 3154576 3186635 3217443 3246832 3274408 3300556 3326655 3353973 3382716
57141 3382716 3412539 3443438 3475515 3508177 3540294 3570966 3599618 3625594 3648344 3667891 3684515
57130 3684515 3698053 3708102 3714757 3718580 3719978 3719174 3716702 3713473 3710592 3709718 3713353 3724100 3743610
57117 3743610 3772554 3811108 3858698 3913614 3973897 4038664 4108005 4182007 4261031 4347032 4443609
57106 4443609 4554495 4682772 4831822 5006321 5212243 5456880 5749640 6102726 6531146
57097 6531146 7052855 7689085 8463654 9401134 10525211 11857296 13413581 15200942 17215363
57088 17215363 19443781 21863196 24431334 27076047 29701336 32217994 34580245 36795593
57080 36795593 38894396 40881656 42708322 44278996 45483052 46226905 46455535 46160694
57072 46160694 45375295 44157671 42576406 40704282 38617774 36392348 34092116 31762399
57064 31762399 29431715 27120512 24849769 22645246 20536360 18551045 16710399 15026916
57056 15026916 13505938 12147032 10944138 9886426 8960570 8152528 7447914 6832345 6292642
57047 6292642 5817681 5398181 5026171 4694547 4396427 4124765 3873117 3636748 3412637
57038 3412637 3198914 2995146 2802691 2623419 2457826 2305168 2165210 2038594 1925294
57029 1925294 1823870 1732658 1650781 1577692 1512640 1454968 1404130 1358996 1317846 1279523 1244052
57018 1244052 1211922 1183291 1158081 1136187 1117361 1101451 1089007 1081245 1079397 1084427 1097177 1118333
57006 1118333 1148867 1191622 1252273 1337320 1450186 1588229 1740942 1888661 2004795 2064963
56996 2064963 2058784 1994050 1889628 1764751 1633724 1506263 1388552 1283359 1190820 1110034
56986 1110034 1039997 979744 928692 886744 853506 827458 806216 787241 767981 745947 719444
56975 719444 688270 653604 617464 582195 549629 520259 493620 469701 449381 433371 421523
56964 421523 413622 410060 411295 417272 427966 443820 464992 490656 519496 550263 581109 608804
56952 608804 629508 640567 641499 633641 619243 600704 580197 559714 540999 524972 511475 500138
56940 500138 491313 485550 482598 481974 484338 491052 502351 517306 535849 559401 588792 622505 657238
56927 657238 688870 712480 723351 719696 703879 680103 651631 620813 590248 562133 536903 513813
56915 513813 492647 473832 457312 442469 429151 417918 409325 403422 399692 397014 394119 390668 387472
56902 387472 385265 383924 383312 383928 385863 387982 389237 390208 392272 395789 400154 405150 411064 417833 425365
56887 425365 434595 447042 463154 481812 501218 519280 533243 540258 538906 529810 514837 496350
56875 496350 476997 459202 444384 432965 425040 420608 419456 421619 427881 439190 455620 476656
56863 476656 502476 534336 573673 621406 677786 741632 808905 872368 923374 954718 962906 948987
56851 948987 917739 875600 828652 781738 738444 701081 670707 647603 631852 623509 622700 629946
56839 629946 646181 672222 708590 756141 816370 890586 978798 1079064 1186478 1291640 1380953
56828 1380953 1440428 1461011 1441608 1388510 1312539 1225344 1136062 1050004 969988 898271 836870
56817 836870 786771 747893 719787 701815 692999 692596 700920 719179 748580 789974 843852 909528
56805 909528 983629 1059152 1125948 1172773 1190838 1177356 1136400 1076213 1005521 931603 859882
56794 859882 793612 733970 681251 635931 598351 568134 544824 528656 519917 517989 521931 531794
56782 531794 548569 573004 604903 642787 683082 719904 746836 759397 755854 736721 704650 664268
56770 664268 620521 576656 534173 494268 458304 426993 400099 377062 357276 339972 324608
56759 324608 311280 300073 290284 281091 272664 265717 260204 255319 250561 245972 241594 237633 234824 233557
56745 233557 232903 231565 229583 228040 227337 227012 227072 228116 229964 231450 231812 231251 229997 227932 225383 223173
56729 223173 221583 220113 218449 216761 215009 213049 211503 211362 212366 212963 212247 210935 210021 209481 208783 207709
56713 207709 206141 203909 201380 199441 198354 197351 195812 194167 193116 192609 192094 191333 190544 190104 190349 191362
56697 191362 192792 194256 195851 197797 199782 201327 202599 204055 205467 206225 206461 206824 207140 206486 204821
56682 204821 203425 203358 204380 205683 206790 207478 207742 208140 209388 211342 213188 214649 216129 217648 218740
56667 218740 219478 220390 221211 221067 220172 219970 221119 222675 223822 224986 226531 227732 228040 228258 229464 231632
56651 231632 234112 236476 238055 237730 235278 232182 230014 228661 227005 224616 221774 218482 214590 210452
56637 210452 206551 202728 198559 194168 190023 186295 183002 180330 178203 176015 173364 170571 167986 165388
56623 165388 162655 160416 159378 159449 160118 161106 162063 162285 161502 160499 160245 160811 161704 162784 164218 165930 167652
56606 167652 169173 170111 170016 169087 168247 168065 168265 168650 169682 171570 173604 175121 176347 177585 178340 178109 177359
56589 177359 176845 176562 176177 175893 176007 176204 176156 176267 176946 177679 177791 177623 177976 178833 179620 180384 181666 183416
56571 183416 184909 185629 185565 184888 184102 184231 186050 189306 193297 197844 203012 208268 212795 216404 219427 221976
56555 221976 224070 226201 228980 232367 235900 239456 243072 246333 248708 250387 252032 253804 255241 255935
56541 255935 255758 254568 252421 249957 247969 246569 245197 243404 241228 238920 236682 234577 232470 230164
56527 230164 227714 225357 223111 220878 218904 217530 216482 215168 213697 212621 211567 209417 206253 203734
56513 203734 202849 202565 201576 200121 198955 197758 195982 194308 193703 193718 193180 192121 191593 191962 192749 193843 195514
56496 195514 197328 198300 198160 197490 196688 195741 194844 194336 194152 194091 194303 194752 194646 193359 191524 190289 189872 189844
56478 189844 190277 191478 192940 193866 194513 195862 198096 200518 202831 205408 208342 211214 213815 216241 218404
56463 218404 220293 222478 225491 228935 232047 234805 237619 240354 242635 244720 246936 248713 249356 249463 250258
56448 250258 251736 252754 252852 252728 252874 252992 252851 252720 252781 252937 253136 253172 252398 250523 248331 246741 245584 244250
56430 244250 242962 242206 241503 240167 238817 238581 239109 238948 237779 236708 236351 236175 235845 235760 236071 236477 237089
56413 237089 238220 239254 239057 237522 235473 233114 230025 226616 223985 222233 220485 218737 218065 218709 219606
56398 219606 220233 221389 223590 226118 228253 230118 231814 232964 233672 234728 236396 238131 239869 242343 245719
56383 245719 249199 252379 255685 258979 261096 261419 260713 259785 258581 257229 256715 257622 259163 260259 260778 261090
56367 261090 261263 261311 261577 262374 263743 265698 268048 270109 271582 273561 277326 282142 285774 287405 288538
56352 288538 290597 293248 295677 297962 300259 301958 302644 302976 303767 304971 306183 307321 308306 308861 309057 309326
56336 309326 309721 310029 310664 312370 314946 317493 319992 323283 327374 331290 334859 339051 344164 349311 354198
56321 354198 359835 366893 374852 383284 392339 401465 409401 416203 423503 431979 440420 448214 456780 467245
56307 467245 478494 489016 499063 509323 518809 525886 530437 533449 535319 536045 536317 536904 537447 537087
56293 537087 535866 534545 533583 533171 533610 534841 536198 537424 539334 542897 548396 555898 565577 576981 589140
56278 589140 602016 616745 633753 651921 670450 690328 712954 738442 766302 796839 830852
56267 830852 868762 910898 957854 1009983 1067468 1131389 1203517 1284464 1373367 1470052 1576119
56256 1576119 1693145 1821243 1960118 2109839 2269443 2436267 2607862 2783167 2960698
56247 2960698 3136951 3307763 3469802 3619441 3751667 3861823 3947692 4008844 4045181 4057375
56237 4057375 4047616 4018652 3972881 3913079 3842627 3764093 3678924 3589255 3498113 3406634 3313007
56226 3313007 3215678 3115885 3015433 2913809 2809471 2702558 2594294 2484969 2374446 2263747
56216 2263747 2154319 2046586 1940778 1838169 1740000 1646138 1556182 1470799 1390683 1315473
56206 1315473 1245106 1180857 1123546 1072053 1025026 982524 944527 909608 876918 847795 823451
56195 823451 802566 783209 765521 750367 736856 723584 710947 699925 689814 679571 670222 663508
56183 663508 659146 655715 653154 652095 651802 651286 651492 653925 657955 661878 665844 671331 678398 685835 693387
56168 693387 701774 711235 722052 735499 752082 769813 786460 802487 819520 837081 853347 868070
56156 868070 882148 895226 906301 915867 924967 932993 938905 943731 949446 956465 964731 976022 992394
56143 992394 1013518 1038421 1068677 1106828 1153029 1206647 1269986 1346567 1436315 1536008 1643766
56132 1643766 1759059 1878378 1994893 2103052 2200681 2286864 2361374 2426556 2486329 2542402
56122 2542402 2593551 2638184 2674645 2699531 2709447 2705067 2690695 2669689 2642861 2610690 2573320 2527935
56110 2527935 2469594 2395668 2307283 2206730 2096612 1981610 1867852 1759767 1659656 1569869
56100 1569869 1492417 1426559 1369805 1321327 1281717 1249988 1224096 1204087 1191306 1184601 1180605 1177620
56088 1177620 1175921 1174578 1171594 1167117 1162904 1158679 1152510 1144648 1137374 1131211 1124978 1119347 1116373 1115603
56074 1115603 1114618 1113390 1114089 1116763 1119435 1122432 1128139 1136362 1144386 1151934 1161549 1173707 1186064 1197971
56060 1197971 1211202 1225801 1239787 1253426 1269085 1286445 1302705 1318054 1335900 1356935 1378034
56049 1378034 1397793 1418086 1439264 1459182 1478102 1499332 1523683 1548303 1572163 1597541 1624957
56038 1624957 1651903 1677831 1705152 1734152 1762300 1789707 1819730 1853034 1886768 1920715 1958184
56027 1958184 1999590 2041477 2083327 2128881 2179077 2230304 2281504 2336199 2395477 2455826 2516103
56016 2516103 2579702 2647493 2715745 2783593 2855319 2932490 3011070 3089206 3170611 3257285 3346210
56005 3346210 3436175 3530379 3629380 3729364 3830460 3938673 4056344 4179064 4305242 4439924
55995 4439924 4585587 4738297 4896841 5066386 5249201 5441454 5643297 5861815 6099559
55986 6099559 6350916 6614609 6898578 7207283 7536024 7883730 8259311 8669045 9110093
55977 9110093 9583122 10098392 10662345 11271846 11929366 12649874 13445185 14316990 15274041
55968 15274041 16340136 17536179 18872277 20368367 22064992 24004028 26220813 28769588
55960 28769588 31737619 35224942 39339868 44235455 50129056 57273354 65940001 76448618
55952 76448618 89174546 104512060 122887685 144843699 171022661 201930961 237590130
55945 237590130 277175048 318546580 357797351 389493392 408206399 410763474 397624130
55938 397624130 372345442 339731746 304134063 268713511 235432120 205270184 178501335
55931 178501335 155012060 134550078 116818002 101497183 88293557 76966996 67299681
55924 67299681 59063651 52042240 46058128 40958186 36592979 32832572 29584044 26773909
55916 26773909 24327712 22180964 20292637 18630719 17156727 15837075 14655543 13600451
55908 13600451 12650664 11785761 10998183 10283560 9629488 9024642 8468695 7962529 7497779
55899 7497779 7065607 6666669 6302938 5968224 5655722 5366650 5102684 4857735 4625657
55890 4625657 4408551 4209337 4023449 3845794 3678851 3526062 3383904 3248067 3120849
55881 3120849 3004951 2896217 2790020 2688886 2596570 2510352 2426414 2347193 2276129 2210284
55871 2210284 2145318 2082950 2026604 1974304 1922785 1874199 1831834 1793135 1753714 1714713 1679914
55860 1679914 1649003 1619834 1593862 1573028 1554034 1531536 1504456 1474080 1439105 1398168 1354568
55849 1354568 1313013 1273840 1235134 1197896 1164320 1133453 1103306 1074973 1050263 1027779 1005604
55838 1005604 985353 969348 956372 944416 934836 929466 926321 922585 919305 918662 919083 917515 914247
55825 914247 911077 906878 899292 888696 876340 860755 840253 816875 793699 770366 745404 720707
55813 720707 699159 679794 659841 639875 622543 607849 594115 582060 573505 567289 560809 554556
55801 554556 551031 550285 550521 551980 556106 561844 566801 571177 576606 581962 584330 583527 581782 579447 574817
55786 574817 567811 560195 552360 543266 533410 524645 517258 510190 503806 499483 496763 493708 489611 484655
55772 484655 477602 466766 452907 438474 424453 410471 397224 386056 376804 368688 362486 359153
55760 359153 357134 353861 349105 344150 338681 331504 323421 316135 308995 299971 289306 279055 269500 259257
55746 259257 248665 239870 233618 228768 224837 222186 219957 216691 212900 210274 208561 205986 202586 200267
55732 200267 199606 199422 199524 201123 204318 207622 210078 211536 211060 207629 202300 197235 192711 187527 181957
55717 181957 177545 174164 170210 165723 162431 160581 158614 156310 155420 156609 158410 159835 161679 164650
55703 164650 168411 172870 178290 183702 187354 188992 189699 189474 187315 183759 180837 179146 177426 175391 174502
55688 174502 175389 176928 178531 181135 185274 190311 196199 203788 212687 220861 227097 232027 236164 238932
55674 238932 240186 240673 240231 237510 232296 226353 221227 216861 213020 210297 208980 208446 208368 209114 210504 211698
55658 211698 212705 214508 217326 220258 222905 225729 228610 230773 232453 234898 238332 241535 243659 244836
55644 244836 244893 243299 240576 237886 235007 230676 225060 219730 214881 208913 201332 193752 187209 180643 173036
55629 173036 165051 157534 150157 142542 135174 128400 122050 116651 113218 111218 108628 104802 101396 99576
55615 99576 98242 96011 93084 90026 86539 82678 79708 78399 77804 76820 75648 74708 73642 72426 72062
55600 72062 72937 73806 73532 72615 71985 71543 70997 70830 71279 71435 70481 68817 67031 64897 62377 60455 59877
55583 59877 60027 60049 60079 60414 60427 59387 57564 55670 53929 52428 51564 51502 51947 52859 54417 55952 56158 54877
55565 54877 53389 52480 51625 50634 50431 51367 52363 52730 53309 54654 55587 54984 53752 53555 54530 55648 56485 57298
55547 57298 57945 57982 57430 56636 55904 55840 57180 59533 61221 61196 60327 60065 60728 61818 63045 64208 64972 65581
55529 65581 66897 69077 71188 72782 74644 77205 79491 80701 81627 83350 85505 87000 87536 87395 86604
55514 86604 85331 84275 83671 82748 81038 79211 77726 75787 72738 69418 66945 65150 63393 61921 61037
55499 61037 59894 57559 54565 52045 50037 47959 46075 45038 44546 43823 42970 42539 42224 41322 40149 39632
55483 39632 39706 39324 38018 36393 35170 34596 34620 34809 34299 32604 30273 28192 26612 25407 24712 24579 24567
55466 24567 24365 24295 24540 24550 23965 23395 23492 23959 24334 24907 25858 26298 25367 23727 22784 22864 23222 23387 23461 23418 23160
55445 23160 23007 23280 23702 23903 24073 24447 24732 24785 25109 25836 26007 24908 23438 23035 23797 24702 25151 25230 24956
55426 24956 24393 24076 24330 24610 24393 24138 24434 24921 25083 25345 26167 26786 26289 25311 25193 25928 26420 26417 26605 27023
55406 27023 26931 26246 25686 25458 25113 24743 25006 25804 26160 25656 24996 24853 25041 25008 24378 22983 21058 19413 18740
55387 18740 18845 19143 19553 20214 20786 20904 20901 21159 21281 20951 21008 22308 23915 23930 22033 19832 18640 18224 17830
55368 17830 17207 16387 15554 15376 16493 18466 20071 20717 20760 20522 20028 19648 19896 20479 20508 19795 19011 18503 17900
55349 17900 17024 16271 15940 15957 16314 16951 17282 16725 15755 15539 16476 17887 19005 19431 18867 17500 16539 17162
55331 17162 18888 20085 20137 19903 19957 19660 18366 16436 14637 13414 13043 13573 14347 14478 14053 13980 14474 14762
55313 14762 14521 14484 15116 15743 15602 14979 14682 14979 15556 16004 16042 15776 15926 17184 19198 20802 21385 21358 21223
55294 21223 21025 20863 21075 21620 22044 22276 22687 23221 23385 23333 23993 25683 27513 28564 28858 28679 27838 26270
55276 26270 24672 23841 23773 23869 23624 22780 21372 20006 19622 20538 22099 23543 24777 26003 27110 27748 27670
55259 27670 26778 25228 23641 22696 22336 21855 20966 20224 20226 20910 21933 23182 24610 25937 26795 26889 25995 24211
55241 24211 22295 21241 21313 21852 22058 21659 20871 20200 20209 20972 21802 22026 21842 21881 22171 22356 22741 24122 26534
55222 26534 29060 31045 32651 34040 34875 34911 34429 33845 33448 33525 34034 34197 33331 32114 32070 33571 35337 36135
55204 36135 35991 35375 34229 32422 30348 28536 27267 26954 28147 30637 33210 34744 35119 34778 34049 33184
55188 33184 32406 31583 30457 29365 29022 29357 29514 29299 29615 30970 32446 32915 32486 32008 31788 31533 31066 30388
55170 30388 29414 28284 27561 27607 28060 28399 28639 29055 29563 29824 29697 29255 28631 28099 27910 27852 27428 26644 26136
55151 26136 26247 26528 26398 25736 24601 22982 21215 20048 19884 20453 21490 23131 25272 27153 28100 28248
55135 28248 28141 28007 27829 27682 27652 27738 28079 28891 30015 30952 31509 31948 32451 32977 33661 34669 35602 35831 35552
55116 35552 35627 36207 36499 36242 36380 37712 39685 41150 41648 41428 40905 40555 40687 40872 40309 39102 38314 38371
55098 38371 38441 37959 37666 38281 39190 39566 39962 41524 44079 46223 47178 47512 48080 49082 50247 51367 52483
55081 52483 53822 55487 57099 58093 58466 58808 59387 59785 59630 59020 58008 56471 54857 54174 54756 55793 56577
55064 56577 57313 58165 58557 58240 58122 59043 60478 61396 61683 61732 61294 59938 58167 56913 56255 55640 55057 54935
55046 54935 55094 54808 53814 52470 51063 49789 49126 49337 49749 49410 48390 47629 47583 47841 48049 48396 49048 49757
55028 49757 50242 50558 51018 51952 53387 54752 55234 54753 54116 53879 53592 52680 51468 50660 50315 50138 50371 51595
55010 51595 53811 56357 58514 59754 59823 59162 58823 59378 60374 61306 62433 63960 65193 65489 65333 65442 65441 64626
54992 64626 63488 63093 63304 63050 62213 61771 61920 61492 59652 57102 55090 54075 53737 53567 53059 51968 50765
54975 50765 50347 51071 52453 53855 54975 55656 55799 55579 55290 54993 54694 54750 55555 56920 58338 59714 61305
54958 61305 63079 64813 66738 69435 73051 77105 81027 84472 87323 89937 93236 97975 104076 111070
54944 111070 118888 127683 137309 147690 159281 172330 185915 198488 209157 217697 223591 226021 224659
54931 224659 219708 211385 200204 187507 174793 162669 151254 141181 133031 126055 118789 110989 103805
54918 103805 97943 92863 87993 83628 80205 77704 76071 75407 75397 75460 75737 77103 79913 83591 87744 92759
54902 92759 98890 105656 112737 120796 130761 142690 155772 169021 181614 192908 202464 209846 214302
54889 214302 214978 211539 204381 194415 182949 171452 160770 150705 140827 131369 122734 114676 106863
54876 106863 99842 94363 90031 85814 81707 78605 76619 74851 72971 71597 70836 69806 68064 66278
54862 66278 64973 63766 62426 61546 61489 61654 61488 61297 61379 61224 60370 59298 58766 58820 59050 59194 58999 58132 56721
54843 56721 55418 54538 53835 53363 53598 54241 54017 52449 50889 50829 51921 52636 52312 51537 50934 50532 50203 49978
54825 49978 49937 50181 50770 51450 51849 52136 52945 54381 55726 56453 56839 57244 57584 57966 58932 60449 61531 61662
54807 61662 61824 63153 65237 66751 67327 67788 68847 70539 72755 75506 78650 82017 85714 89913 94582
54792 94582 99883 106440 114654 124105 134161 144792 156267 168474 181147 194254 207418 219379
54780 219379 228849 235567 239767 240970 238298 231927 223329 213996 204597 195383 186691 178847 172038 166294
54766 166294 161257 156133 150437 144750 140268 137631 136601 136737 137877 139983 143040 147154 152464 159006
54752 159006 166880 176390 187628 200167 213500 227622 242832 259184 276488 294530 312810 330257
54740 330257 345642 358079 366817 371021 370366 365493 357186 345311 329391 310093 289326 268782 249083
54727 249083 230550 213877 199561 187107 175449 164099 153517 144413 136966 130828 125691 121592
54715 121592 118555 116164 113789 111186 108557 106024 103469 100960 98889 97473 96508 95862 95791 96418 97277 97748
54699 97748 97738 97628 97702 97940 98142 98053 97508 96639 95734 94873 94046 93605 94079 95370 96666 97361 97576 97590 97427 97290
54679 97290 97691 98701 99712 100453 101578 103676 106304 108694 110861 113204 115566 117598 119720 122769 126710
54664 126710 130587 133788 136664 139805 143272 146757 150059 153173 156046 158366 159762 160456 161598 164349
54650 164349 168540 172896 176842 181305 187403 195174 204213 214689 226856 240273 254508 270126 288039
54637 288039 308185 329736 352125 374820 396322 414454 427596 434944 435917 430350 419161 403859
54625 403859 385383 364305 341927 320113 299894 281134 263604 247527 233018 219929 208373
54614 208373 198614 190371 183094 176934 172512 169563 166813 163469 159953 156893 154304 152108 150511 149271
54600 149271 147371 144079 139897 135925 132746 130325 128454 126748 124516 121191 116852 112176 108037 105116
54586 105116 103469 102351 100878 98944 97118 95684 94380 93119 92270 91929 91579 90750 89526 88046 86088
54571 86088 83606 81248 79822 79432 79451 79183 78353 77253 76630 77189 78917 81060 82865 84121 84948 85384 85363
54554 85363 84842 83862 82699 81934 82045 82940 84260 86068 88686 91785 94252 95310 95402 95713 97054 99408
54538 99408 102230 105049 107949 111547 116356 122238 128805 136167 144792 154692 165288 176053 186743 196973
54524 196973 206190 214228 221236 226816 229851 229518 226059 220308 212898 204218 194653 184505 173933 163237
54510 163237 152983 143707 135748 129305 124249 119866 115391 110911 107196 104504 102168 99643 97330 95969
54496 95969 95703 96098 96630 96832 96349 95280 94112 93021 91617 89683 87778 86731 86867 87975 89644 91357
54480 91357 92686 93774 95265 97415 99612 101104 101824 102138 102211 102046 101831 101838 102166 102894 104143 105655 106704
54463 106704 106901 106743 106904 107229 106985 105919 104601 103787 103837 104661 105827 106678 106631 105437 103200 100353 97663
54446 97663 95855 94903 94020 92645 91180 90421 90560 91077 91404 91344 91067 90981 91303 91539 90804 89116 87840 88273
54428 88273 90076 91776 92523 92553 92146 91142 89747 88876 89179 90209 91062 91431 91622 91820 91880 91726 91523 91472
54410 91472 91742 92607 94275 96453 98397 99614 100342 101181 102385 103812 105451 107626 110605 114312 118569
54395 118569 123293 128180 132504 135661 137800 139551 141170 142320 142577 141800 140049 137595 135027 132871 130982
54380 130982 128729 125960 123329 121440 120065 118464 116198 113376 110414 107858 106148 105165 104182 102567 100447
54365 100447 98493 97149 96346 95821 95487 95507 96126 97346 98706 99598 99896 100079 100558 101167 101557 101904 102846 104706
54347 104706 107018 108915 109945 110506 111511 113613 116734 120343 123993 127401 130227 132220 133621 135012
54333 135012 136596 137912 138413 138070 137199 135994 134518 132977 131641 130460 128928 126434 122760 118292 113725
54318 113725 109545 105839 102579 99840 97620 95738 94152 93067 92424 91588 90046 88082 86205 84172 81404
54303 81404 78241 75865 74820 74425 73931 73389 73042 72648 72012 71472 71218 70720 69582 68497 68430 69036 68811 66990
54285 66990 64620 63457 64130 65696 66727 66600 65792 65193 65317 66146 67368 68521 69117 69029 68709 68684 68922 69060
54267 69060 69127 69465 69991 70272 70422 71148 72622 74025 74684 75036 75941 77492 79040 80034 80338 80053 79514 79149
54249 79149 78975 78508 77541 76616 76285 76255 75799 74751 73582 72715 72232 72135 72455 73175 74357 76120 78244 80045
54231 80045 81022 81411 81831 82641 83908 85596 87379 88591 88862 88601 88422 88339 87917 86978 85743 84456 83316
54214 83316 82581 82370 82447 82467 82222 81545 80378 79186 78800 79412 80181 80304 79999 79938 80150 80161 79877 79604 79436 79205
54194 79205 78903 78594 78129 77434 76832 76509 75994 74744 73002 71432 70200 69095 68261 68003 68023 67674 66944 66455
54176 66455 66518 66839 67203 67720 68345 68802 69026 69136 69000 68508 68249 69159 71285 73577 75145 76163 77262 78484
54158 78484 79160 78567 76587 73946 71813 70870 70798 70883 70889 70997 71191 71269 71216 71026 70383 69158 67994 67632 67838
54139 67838 67791 67323 66857 66295 65164 63988 64199 66165 68331 69008 68211 67034 65940 64571 62813 61159
54123 61159 60087 59613 59444 59240 58830 58407 58360 58813 59528 60309 61092 61537 61133 59971 58940 58781 59326 60023
54105 60023 60755 61672 62610 63168 63228 62969 62519 61952 61456 61159 60900 60488 60151 60410 61482 62932 63915 63797 62727
54086 62727 61704 61853 63344 65080 65625 64495 62564 61188 60935 61128 60773 59928 59858 61573 64544 67254
54070 67254 68751 69169 68958 68386 67851 67941 68862 70210 71566 72890 74233 75530 76890 78602 80580 82182
54054 82182 82855 82656 81921 80831 79635 78923 79227 80476 82096 83592 84897 86359 88534 91851 96275 101273
54038 101273 106046 109784 112072 113448 115297 118561 122617 126046 128559 131523 136345 142930 149994 156342
54024 156342 161525 165768 169660 173679 177700 181206 184091 186799 189546 191899 193459 194543 195814 197443
54010 197443 198880 199226 197797 194736 191179 188375 186475 184628 182273 179653 176939 173747 169990 166387
53996 166387 163455 160687 157499 154407 152391 151415 150507 149101 147477 145934 144305 142427 140473 138708 137362
53981 137362 136722 136863 137268 137204 136520 135638 134703 133296 131144 128690 126677 125453 124856 124590 124491 124584 124976 125630
53963 125630 126251 126488 126247 125633 124642 123183 121421 119829 118747 118068 117538 117263 117632 118644 119574 119646 119064
53946 119064 118955 120106 122106 124066 125829 127874 130239 132370 134192 136572 140255 144880 149572 154112
53932 154112 158935 164159 169190 173317 176272 178131 178956 178737 177524 175575 173371 171509 170542 170888 172724
53917 172724 175803 179515 183381 187480 192149 197366 202755 208114 213546 219128 224891 231106 238053 245420
53903 245420 252434 258673 264213 268882 272053 273470 273709 273446 272842 271965 271234 270867 270349 268961 266607 263669
53887 263669 260348 256542 252114 246933 240987 234743 228967 223781 218381 212140 205544 199482 194011 188511
53873 188511 182794 177425 173024 169777 167471 165540 163205 160111 156716 153750 151444 149578 147914 146118
53859 146118 143633 140217 136402 132880 129658 126352 123002 119936 117063 114051 111157 109157 108382 108392 108630
53844 108630 108871 108988 108807 108307 107596 106656 105469 104322 103602 103385 103567 104212 105291 106302 106737 106763 106894 107169
53826 107169 107256 107196 107297 107412 107153 106812 107172 108287 109337 109953 110797 112372 114100 115182 115777 116651 118021
53809 118021 119426 120516 121384 122244 123220 124466 126107 128053 130114 132311 134902 138093 141831 145825 149807
53794 149807 153809 158147 162926 167598 171325 173927 176204 179147 182965 187012 190562 193471 196093 198722
53780 198722 201263 203500 205473 207321 208834 209596 209613 209278 208498 206445 202690 198106 194000 190692 187628
53765 187628 184615 182056 180011 177889 175308 172584 170105 167791 165439 163135 161007 158916 156658 154226
53751 154226 151750 149410 147430 145858 144397 142831 141545 141085 141211 140994 139938 138407 136831 135143 133307
53736 133307 131757 130873 130461 130114 129775 129594 129600 129755 130030 130215 130044 129767 130154 131595 133546 135148 136073 136489
53718 136489 136652 136952 137948 139871 142252 144440 146288 148059 149875 151655 153396 155234 157329 159915 163170
53703 163170 166807 170075 172510 174427 176403 178535 180596 182640 184972 187706 190751 194126 197854 201595
53689 201595 204795 207215 209130 211015 213213 215819 218700 221729 225053 228842 232652 235485 236894 237660
53675 237660 238926 240885 242861 244416 245713 246903 247887 248772 249901 251138 251698 251030 249540 248128 247268
53660 247268 246828 246443 245793 244735 243524 242725 242569 242549 242008 241058 240484 240689 241111 240885 239793 238324 237031
53643 237031 236101 235470 235034 234686 234343 233974 233483 232663 231524 230659 230914 232533 234912 237331 239702 242340 245256
53626 245256 247942 249734 250184 249357 248103 247807 249380 252450 255884 259007 261930 264841 267613 270285 273307
53611 273307 276959 280903 284715 288639 293347 299030 305023 310412 314911 319086 323778 329297 335157 340655
53597 340655 345643 350629 356204 362488 369082 375324 380754 385570 390575 396348 402574 408519 414080 419815
53583 419815 425925 431815 436921 441391 445601 449394 452334 454422 456099 457648 458985 459993 460721 461251 461623
53568 461623 461931 462270 462517 462273 461123 459038 456600 454730 453919 453698 453100 451704 449985 448607 447659 446715
53552 446715 445382 443610 441697 440130 439173 438503 437559 436356 435582 435683 436269 436788 437398 438645 440480 442142
53536 442142 443053 443439 443966 445073 446759 448858 451380 454591 458734 463674 469019 474617 480687 487345 494283
53521 494283 501188 508286 516211 525444 536096 548041 560990 574578 588642 603377 619071 635849
53509 635849 653814 673125 693609 714543 735311 756269 778516 802810 828975 856389 884719
53498 884719 914059 944632 976489 1009377 1042809 1076422 1110267 1144658 1179713 1215217 1250901
53487 1250901 1286692 1322606 1358523 1394152 1429281 1464044 1498957 1534558 1570934 1607719 1644489
53476 1644489 1681003 1716906 1751515 1784204 1814924 1844086 1872020 1898784 1924454 1949260 1973280
53465 1973280 1996160 2017336 2036570 2054250 2071136 2087719 2103763 2118422 2130796 2140301 2146610 2149445
53453 2149445 2148553 2143888 2135816 2125173 2112880 2099224 2083567 2065109 2043880 2020578 1995472 1968048
53441 1968048 1938000 1906062 1873368 1840376 1806838 1772571 1737687 1702167 1665791 1628708 1591804
53430 1591804 1556348 1523232 1492420 1463004 1434012 1405406 1378190 1353374 1331016 1310512 1291569
53419 1291569 1274537 1259963 1248208 1239389 1233309 1229472 1227554 1227837 1230867 1236685 1244761 1254670 1266512
53406 1266512 1280673 1297542 1317468 1340529 1366153 1393308 1421358 1450571 1481656 1514986 1550459
53395 1550459 1587920 1627417 1669061 1712882 1758929 1807478 1858991 1913739 1971478 2031713 2094379
53384 2094379 2160079 2229463 2302476 2378376 2456372 2536068 2617365 2700216 2784409 2869384 2954257
53373 2954257 3038222 3120918 3202340 3282489 3361152 3437763 3511178 3579851 3642677 3699687 3751668
53362 3751668 3799268 3842810 3882685 3919209 3951915 3979460 4000539 4014621 4021801 4022448 4017129 4006284
53350 4006284 3989545 3965676 3933534 3892733 3843116 3784264 3716340 3641227 3561924 3480639 3397986
53339 3397986 3314089 3229694 3145823 3062944 2981082 2900410 2821197 2743342 2666484 2590533 2515689
53328 2515689 2442022 2369526 2298558 2229756 2163440 2099560 2038347 1980554 1926813 1877127 1831229
53317 1831229 1789000 1750308 1714775 1682004 1651663 1623157 1595772 1569525 1545346 1523864 1504599
53306 1504599 1486972 1471478 1458885 1448718 1439762 1431901 1426196 1422976 1421141 1419759 1419174 1419894 1421423
53293 1421423 1423024 1424951 1428110 1433164 1440689 1451583 1466379 1484553 1505356 1528913 1555641 1584985
53281 1584985 1615822 1647941 1682106 1718549 1756297 1794162 1831667 1868873 1906013 1943449 1981280
53270 1981280 2018742 2054623 2088511 2120984 2152309 2181683 2208254 2232291 2254610 2275192 2293064
53259 2293064 2307450 2318398 2326184 2330696 2331687 2329232 2323501 2314202 2300686 2282631 2260360 2234312 2204548
53246 2204548 2171071 2134360 2095169 2053850 2010334 1964787 1917887 1870378 1822827 1775821 1729892
53235 1729892 1685061 1640982 1597779 1556143 1516322 1477621 1439386 1401899 1365706 1330590 1295894
53224 1295894 1261439 1227419 1193761 1160410 1128027 1097531 1069011 1041850 1015918 991878 970233
53213 970233 950736 932847 916076 899790 883322 866600 850185 834465 819164 803769 788077
53202 788077 772223 756502 741241 726507 711967 697306 682652 668240 653898 639397 625121
53191 625121 611665 598896 586079 572858 559386 545572 531087 516242 501936 488461 475166
53180 475166 461713 448853 437471 427454 418007 408628 399321 390290 381841 374221 367275 360605 354267
53167 354267 348772 344225 340027 335699 331336 326832 321440 314769 307745 301833 297537 294150 290717 286758
53153 286758 282368 278086 274512 271670 268991 266153 263484 261202 258802 255787 252499 249550 246784 243609
53139 243609 240092 236937 234434 232195 230014 228207 226960 225937 224838 223805 222996 222147 220991 219833 219306
53124 219306 219593 220180 220419 220153 219682 219233 218735 218143 217689 217491 217031 215591 213275 211139 210052 209805 209622
53107 209622 209146 208490 207677 206606 205517 204885 204809 204970 205312 206358 208530 211402 213944 215496 216267 216874 217650
53090 217650 218573 219699 221233 223122 224918 226308 227441 228413 228738 227878 226092 224169 222293 219821 216307
53075 216307 212168 208112 204452 201244 198608 196519 194626 192604 190462 188322 186181 184044 181939 179641
53061 179641 176822 173635 170707 168362 166284 164184 162250 160666 159225 157742 156305 154781 152748 150363
53047 150363 148607 148045 147928 147248 146120 145275 144664 143560 141860 140279 139256 138475 137554 136480 135287 133941
53031 133941 132700 132020 131964 132111 132089 131741 130852 129286 127459 126154 125735 125871 126023 125843 125210 124406 124133 124788
53013 124788 125753 125993 125297 124307 123354 122064 120301 118697 117781 117186 116208 114799 113601 113235 113837 115013 115999
52996 115999 116171 115659 115242 115485 116192 116824 117093 116983 116525 115822 115048 114250 113372 112616 112490 113308 114862 116652
52978 116652 118192 119022 118868 118095 117629 118093 119139 119904 119988 119766 119907 120811 122419 124422 126616 129003 131437
52961 131437 133398 134511 135239 136466 138290 139876 140812 141981 144479 148058 151368 153588 155160 156896 159005
52946 159005 161188 163210 165128 167248 170078 174033 178937 183948 188169 191251 193345 194729 195654 196341 196819
52931 196819 196853 196232 195076 193660 192042 190109 187944 185800 183695 181411 179010 176984 175683 174890 174249
52916 174249 173767 173532 173245 172588 171849 171621 171876 171983 171683 171399 171391 171286 170801 170332 170277 170239 169557 168414 167797 168380
52896 168380 169860 171349 172098 171945 171443 171507 172570 174083 175090 175246 175001 174904 175048 175193 175129 174870 174648 174691
52878 174691 174948 175141 175116 174914 174504 173867 173469 174073 175654 177058 177215 176273 175034 173857 172858 172639 173707
52861 173707 175357 176233 176087 176008 176749 177829 178571 179066 179579 179839 179544 179020 178778 178879 179228 180016 181286 182501
52843 182501 183179 183689 184781 186516 188301 189835 191408 193154 194519 194755 193749 192194 191028 190791 191420
52828 191420 192639 194340 196375 198178 199112 199384 200146 202278 205285 207755 208748 208521 208084 208314 209317 210291
52812 210291 210178 208687 206561 204609 202731 200273 197092 193715 190533 187441 184393 181704 179510 177362
52798 177362 174793 171991 169468 167205 164629 161448 158043 154939 152310 150215 148866 148250 147758 146717 145203
52783 145203 143869 142962 142000 140446 138217 135413 132124 128841 126432 125247 124601 123657 122481 121683 121340 120921
52767 120921 120097 118930 117311 114939 112014 109358 107645 106915 106924 107447 108038 108009 106979 105244 103427 102018
52751 102018 101274 101149 101136 100571 99310 97852 96651 95632 94488 93153 91817 90721 90055 89755 89378 88551
52735 88551 87617 87363 87952 88594 88530 87817 86921 86018 85210 84967 85739 87221 88505 88960 88677 88098 87538 87064 86616
52716 86616 86154 85725 85321 84753 83865 82910 82346 82124 81554 80156 78400 77271 77230 77846 78338 78272 77796 77431 77613
52697 77613 78377 79478 80743 82123 83475 84594 85480 86238 86706 86548 85816 85091 84910 85327 86114 87060 87976
52680 87976 88808 89818 91333 93198 95015 96940 99673 103408 107421 110977 114018 116543 118044 118251 117915
52665 117915 118031 118592 118821 118412 117754 117020 115888 114295 112709 111339 109635 107011 103810 101175 100038 100390
52649 100390 101379 101907 101214 99154 96192 93165 90867 89540 88773 88037 87319 86946 86929 86862 86558 86335 86519 87081
52631 87081 87894 88935 89970 90547 90635 90853 91657 92641 93044 92715 92112 91591 91056 90209 88856 87189 85923 85771
52613 85771 86522 87065 86732 86214 86677 88309 90225 91497 91770 91159 90111 89270 89035 89328 89964 90928 92044
52596 92044 92882 93453 94435 96151 97834 98593 98582 98454 98231 97694 97428 98240 99651 100255 99670 99038 99375 100440
52578 100440 101597 102812 104347 106247 108568 111410 114308 116323 117217 117925 119388 121497 123629 125619 127610
52563 127610 129433 130768 131641 132331 133003 133809 134986 136469 137710 138248 138196 137933 137668 137575 137859 138309 138250 137460
52545 137460 136730 136937 137934 138980 139966 141455 143564 145557 146719 147065 146989 146656 146136 145804 146176 147348 148804
52528 148804 149892 150395 150523 150406 149837 148636 147111 145894 145376 145546 146282 147437 148646 149441 149706 149708 149645 149500
52510 149500 149388 149553 149832 149615 148655 147552 147056 147222 147564 147745 147731 147553 147353 147490 148259 149537 150944 152162
52492 152162 152872 152759 151935 151114 150917 151195 151464 151806 152784 154542 156522 158146 159351 160326 161111 161548 161406
52475 161406 160550 159250 158336 158622 160090 161879 163167 163836 164267 164772 165320 165573 165176 164243 163554 163947 165459
52458 165459 167374 169098 170493 171285 170804 168842 166373 164803 164570 164916 164991 164668 164237 163812 163326 162823 162439
52441 162439 162231 162229 162557 163326 164469 165825 167261 168542 169231 169039 168303 167837 168170 169086 169989 170550 170856 171138
52423 171138 171517 171938 172183 172005 171383 170545 169669 168723 167750 167091 166998 167115 166737 165629 164289 163316 162832 162669
52405 162669 162748 163040 163442 163981 165010 166833 169242 171718 174017 176171 177938 178742 178418 177680 177417 177692 177862
52388 177862 177688 177817 178970 181025 183256 185232 186983 188412 189185 189399 189857 191212 193136 194796 196012
52373 196012 197401 199361 201472 203152 204441 205753 207110 208152 208853 209775 211427 213727 216305 219038 221912
52358 221912 224565 226528 227990 229801 232384 235078 237009 238326 239963 242291 244719 246813 249057 252010
52344 252010 255205 257567 258801 259759 261431 263944 266682 269027 270823 272374 274123 276269 278618 280844
52330 280844 282858 284845 286972 289195 291334 293222 294817 296243 297650 299048 300413 302007 304335 307650
52316 307650 311684 316027 320550 325297 330224 335360 341057 347768 355693 364832 375227 386789 399095
52303 399095 411727 424723 438452 453110 468575 484584 500785 516852 532924 549704 567692
52292 567692 586479 605268 623898 642796 662008 680930 699095 716683 734096 751456 768634
52281 768634 785399 801378 816234 829953 842669 854229 864342 873097 880841 887548 892771 896276
52269 896276 898134 898224 896318 892907 889239 886107 883085 879386 875019 870654 866628 862584 858032 852979 848060
52254 848060 844113 841497 839829 838578 837854 838220 839842 842439 846101 851504 859051 868378 878982 890742
52240 890742 903515 916772 930116 943646 957370 970731 983239 995159 1007029 1018793 1029888
52229 1029888 1039892 1048581 1055674 1061090 1065232 1068492 1070683 1071436 1070993 1070011 1068670 1066421 1062519 1056407
52215 1056407 1047797 1037044 1025428 1014437 1004449 994420 982974 969673 955219 940764 927147 914598
52203 914598 902992 892261 882447 873436 864995 857198 850482 845047 840514 836385 832520 828912 825377 821820
52189 821820 818521 815762 813473 811588 810412 810170 810473 810702 810706 810656 810498 810092 809635 809377 809030 808092 806635 805173
52171 805173 803755 801835 799132 796131 793546 791619 790036 788221 785720 782594 779402 776528 773735 770708
52157 770708 767779 765542 763904 762123 759741 756887 753703 750136 746385 742892 739687 736303 732509 728600
52143 728600 724783 720887 716960 713569 711066 708982 706613 703959 701656 700134 699104 697781 695425 691841
52129 691841 687534 683245 679218 675106 670615 665995 661802 658485 656263 655120 654711 654547 654430 654565 655170
52114 655170 656266 657943 660515 664235 669087 674998 681929 689696 698090 707393 718353 731349 745865
52101 745865 761151 777082 794002 811967 830728 850398 871593 894655 919026 943634 967771
52090 967771 991464 1015054 1038588 1061596 1083407 1103604 1122244 1139658 1156010 1170932 1183593
52079 1183593 1193264 1199884 1204043 1206363 1207107 1206404 1204557 1201819 1198080 1193065 1186775 1179414 1170973 1161267
52065 1161267 1150415 1138943 1127317 1115673 1104102 1092980 1082825 1074017 1066710 1060887 1056363 1052841
52053 1052841 1050095 1048143 1047256 1047792 1049936 1053549 1058395 1064478 1071853 1080022 1088040 1095542 1103334 1112389
52039 1112389 1122574 1132871 1142657 1152061 1161112 1169261 1176018 1181512 1186139 1190028 1193057 1195045 1195804 1195296
52025 1195296 1193827 1191730 1188805 1184494 1178655 1171622 1163461 1153787 1142577 1130525 1118205 1105407 1091786
52012 1091786 1077701 1063791 1049998 1035542 1019814 1002839 984999 966702 948313 930002 911616
52001 911616 892812 873390 853388 833007 812542 792221 772000 751698 731378 711290 691357
51990 691357 671111 650406 629732 609505 589430 569067 548736 529305 511208 494192 477960
51979 477960 462526 447855 433652 419772 406539 394443 383632 373831 364592 355520 346362 337026
51967 337026 327637 318578 310406 303489 297665 292367 287195 282282 278009 274495 271448 268366 264912 261252
51953 261252 258015 255615 253618 251211 248378 246115 245129 244855 244168 242631 240458 237621 233809 229256 224888
51938 224888 221437 218894 216940 215458 214365 213316 211889 209879 207363 204708 202550 201343 200780 200005 198616
51923 198616 197121 196198 195867 195695 195519 195483 195485 195090 194049 192580 191051 189640 188405 187408 186595 185763 184781 183730
51905 183730 182736 181806 180967 180365 179993 179495 178506 177097 175591 174056 172376 170761 169615 168725 167165 164481
51889 164481 161557 159764 159466 159898 160335 160667 160875 160738 160340 160230 160656 161051 160738 159790 158821 158180 157801 157642
51871 157642 157810 158325 159112 160166 161426 162615 163543 164449 165634 166865 167581 167739 167992 168893 170332 171951
51855 171951 173643 175299 176405 176459 175725 175123 175218 175651 175715 175238 174610 174192 174058 174330 175233 176585 177599 177681
51837 177681 177264 177411 178464 179594 179928 179730 180060 181448 183407 185196 186640 188016 189496 191027 192587
51822 192587 194233 195869 197198 197994 198269 198062 197270 195848 194094 192544 191609 191438 192020 193146 194286 194902
51806 194902 195051 195368 196216 197148 197531 197460 197592 198174 198766 199001 199151 199650 200372 200740 200502 200145 200484 201880 203860
51787 203860 205475 206089 205844 205446 205626 206815 209032 211814 214404 216306 217643 218818 219931 220805 221429 222063
51771 222063 222937 224195 226060 228750 232187 236087 240263 244632 249052 253585 258792 265281 272913 280842
51757 280842 288313 294923 300188 303518 304866 304854 304047 302518 300242 297398 294095 290419 286953 284567 283374
51742 283374 282514 281419 280583 280498 280550 279814 278462 277423 276916 276315 275472 275166 275939 277199 277935 277921 277860 278609 280509
51723 280509 283196 285841 287742 288848 289582 290198 290525 290444 290345 290875 292286 294108 295417 295389 293751 290871 287473
51706 287473 284248 281582 279537 277922 276399 274566 272114 269161 266469 264979 264860 265244 265225 264884 264912 265470
51690 265470 266088 266548 267135 267982 269028 270786 274257 279617 285802 291928 298273 305139 311526 315909 317853
51675 317853 317874 316168 312641 308020 303642 299965 296251 292014 287837 284348 281292 278230 275547 274020 273736
51660 273736 274075 274632 275576 277080 278822 280175 280657 280074 278340 275331 270942 265298 258861 252321 246354
51645 246354 241352 237207 233356 229282 224990 220825 216906 213088 209531 206754 204895 203412 201878 200570
51631 200570 199816 199179 197984 196385 195230 194912 195010 195076 195192 195583 196164 196692 197079 197398 197766 198216 198568 198521 198130
51612 198130 198043 198924 200680 202569 204044 205225 206604 208467 210582 212343 213392 214246 215972 219085 223116
51597 223116 227446 231986 236679 240996 244622 248115 252132 256401 260195 263437 266413 268772 269893 270091
51583 270091 270351 270760 270345 268629 266382 264469 262917 261502 260392 259659 258877 257813 257031 257306 258798 261128
51567 261128 263825 266454 268808 271317 274823 279607 284959 289914 294028 297333 300076 302723 305689 308759
51553 308759 311169 312442 312737 312310 311231 309789 308545 307765 307339 307347 307967 308710 308715 308150 308324 309816 311371 311447
51535 311447 310048 308223 306424 304306 301653 298506 294672 290064 285415 281804 279490 277840 276270 274644
51521 274644 272862 270847 268938 267731 267348 267310 267135 266733 266241 265811 265486 265028 264024 262443 260793 259395
51505 259395 257877 255885 253900 252740 252496 252661 253104 254126 255542 256524 256584 256146 255900 256063 256536 257373 258765
51488 258765 260771 263226 265813 268152 270074 271948 274548 278426 283353 288411 292761 296505 300723 306384
51474 306384 313175 319794 325382 330190 334696 338796 342353 345883 349943 354203 357864 360699 362983 364644
51460 364644 365382 365578 366113 367117 367682 367151 366050 365314 365136 364972 364292 362937 361027 358879 356763 354432
51444 354432 351189 346745 341775 337210 333108 328748 323839 319122 315446 312601 309570 305890 302207 299241
51430 299241 296707 293844 290776 288547 287679 287426 286883 286297 286714 288635 291522 294484 296909 298577 299667
51415 299667 300715 302149 303795 305065 305536 305127 303814 301553 298409 294492 289856 284742 279755 275387 271414
51400 271414 267161 262394 257625 253539 250396 247942 245590 242701 239009 234846 230720 226716 222483 217723
51386 217723 212448 206918 201652 197376 194528 192820 191573 190426 189417 188528 187617 186795 186364 186327 186322 186132 185929
51369 185929 185899 185935 185760 185138 183913 182085 179886 177520 174899 171879 168706 165878 163617 161830 160498 159639
51353 159639 158894 157756 156374 155663 156296 157982 159961 161856 163705 165521 167248 168996 170896 172792 174473
51338 174473 176268 178994 183052 187736 191835 194945 197857 201424 205311 208328 209909 210711 211587 212484 212737
51323 212737 212059 210780 209274 207617 205666 203148 199776 195630 191297 187319 183664 180037 176435 172967
51309 172967 169405 165534 161785 158870 156778 154757 152406 150198 148759 148101 147811 147552 147144 146506 145685 144746
51293 144746 143540 141932 140294 139345 139359 139855 140194 140136 139704 138977 138221 137889 138158 138697 139058 139096 138921 138709 138761
51274 138761 139462 140962 143029 145265 147267 148507 148443 147052 145104 143678 143376 143980 144716 144810 143957 142329
51258 142329 140189 137720 135303 133555 132650 131815 130103 127633 125540 124662 124774 125179 125430 125310 124632 123555
51242 123555 122759 122947 124126 125505 126021 125124 123318 121883 121685 122319 122780 122848 123265 124580 126475 128385 130109
51225 130109 131501 132140 131733 130551 129182 128163 127944 128698 129881 130509 130291 130105 130967 132895 135152 137207
51209 137207 138977 140403 141396 142129 142968 144129 145643 147536 149739 151893 153513 154378 154644 154712 155031 155832
51193 155832 156854 157555 157786 158040 158871 160230 161589 162535 163040 163229 163115 162528 161279 159453 157556 156188
51177 156188 155570 155477 155519 155246 154211 152384 150488 149428 149254 149077 148078 146183 143766 141220 138976 137401
51161 137401 136358 135268 133808 132301 131270 130980 131401 132152 132531 132152 131674 132193 133822 135547 136669 137570
51145 137570 138759 140040 141107 142106 143055 143429 142965 142185 141429 140092 137611 134601 132138 130461 129208 128394
51129 128394 128122 127788 126655 125001 123674 122688 121342 119610 118368 118180 118852 120197 122165 124002 124377 122895
51113 122895 120741 119338 119018 119307 119860 120547 121172 121663 122258 123135 124104 124935 125662 126383 127135 128207 130124
51096 130124 132907 135659 137350 137877 138038 138584 139606 140725 141612 142212 142647 142992 143263 143629 144446 145921 147763
51079 147763 149406 150517 151127 151388 151472 151641 152172 153183 154754 157034 159923 162749 164653 165443 165803 166623
51063 166623 168292 170575 172906 174760 175944 176576 176775 176559 176148 176041 176518 177317 178085 178857 179753 180565 181111
51046 181111 181684 182568 183384 183588 183467 183892 185132 186558 187560 188119 188409 188514 188578 188618 188135 186619 184588 183354
51028 183354 183493 184226 184625 184687 184773 184741 184266 183561 183047 182579 181637 180211 179006 178744 179505 180750 181827 182532
51010 182532 183263 184526 186305 188164 189876 191573 193292 194893 196483 198377 200512 202505 204516 207382
50996 207382 211528 216390 221345 226553 232298 238124 243439 248497 254009 260036 266212 272824 280690 289830
50982 289830 299196 308040 316924 326999 338808 352172 366829 382818 400500 420511 443472 469464
50970 469464 497995 528656 561667 597656 637242 681025 729548 782744 839643 899192 961356
50959 961356 1026857 1095670 1166275 1236602 1305301 1371673 1434784 1493320 1546259 1593073 1633162
50948 1633162 1665680 1690236 1707339 1717690 1721331 1717935 1707912 1692929 1675446 1657807 1641419 1626286
50936 1626286 1611444 1596203 1580858 1565947 1551174 1535654 1518990 1501315 1482233 1460483 1434983
50925 1434983 1405608 1372627 1335953 1295359 1251103 1203864 1154367 1103387 1051840 1000456 949570
50914 949570 899593 851542 806712 765866 728904 695187 663991 634915 608212 584610 564496
50903 564496 547303 531929 517658 504531 492970 483337 475752 470045 465862 462903 461013 459939 459234
50890 459234 458603 458137 457975 457936 457814 457862 458604 460185 462263 464554 467181 470388 474222 478618 483583 489124
50874 489124 495163 501720 509137 517906 528201 539623 551580 563966 577368 592418 609064 626767
50862 626767 645475 666067 689576 716230 745613 777713 813512 854454 901605 955452 1016309
50851 1016309 1084639 1160915 1245407 1338296 1439978 1550989 1671473 1800810 1937912 2081747
50841 2081747 2231387 2385661 2542886 2700787 2856280 3005365 3143621 3267101 3372808
50832 3372808 3458646 3523431 3567036 3590197 3594035 3580053 3550606 3509021 3459055 3404465 3349009
50821 3349009 3296225 3248735 3207849 3173928 3146701 3125018 3106682 3088933 3069017 3044254 3012138
50810 3012138 2970851 2919465 2857358 2783852 2698940 2604146 2501996 2394593 2283131 2168790
50800 2168790 2053690 1940732 1832714 1731652 1638704 1554533 1479674 1414441 1358649 1311810
50790 1311810 1273866 1245399 1226842 1217734 1217086 1224174 1238445 1258787 1283499 1311072 1340507 1370698
50778 1370698 1399887 1426054 1447777 1464621 1476815 1484676 1488183 1487055 1481277 1471491 1458754 1443885
50766 1443885 1427102 1408157 1386752 1362948 1337325 1310667 1283340 1255129 1225869 1196083 1166738
50755 1166738 1138461 1111302 1085211 1060540 1038002 1018254 1001509 987532 976195 968092 964273 965095
50743 965095 969709 977166 987791 1002892 1023202 1048308 1077834 1112551 1153852 1202446 1258116 1320635
50731 1320635 1390409 1468017 1553417 1645803 1744064 1846976 1952871 2059488 2164456 2265821
50721 2265821 2361792 2450178 2528564 2595132 2648811 2688446 2712428 2719643 2710507 2686640 2649823 2601818
50709 2601818 2545159 2483451 2420613 2359894 2303496 2252760 2208548 2171450 2141535 2117901 2098836
50698 2098836 2082677 2068264 2054336 2038879 2019560 1994626 1962978 1923836 1877073 1823794 1765866
50687 1765866 1704810 1641720 1578189 1516491 1458582 1405500 1357975 1317000 1283361 1257114 1238033
50676 1238033 1226312 1222506 1227092 1240469 1263245 1296165 1339766 1394199 1459171 1533861 1617026 1707285
50664 1707285 1803125 1902513 2002683 2100444 2192607 2276324 2349591 2411719 2463059 2504098 2535057
50653 2535057 2556353 2568843 2573279 2569881 2558846 2540910 2517026 2487859 2454099 2417015 2378117 2338393
50641 2338393 2298481 2259562 2223474 2191722 2164845 2143021 2126827 2116910 2113158 2114661 2120551 2130363
50629 2130363 2143341 2157746 2171451 2183318 2193590 2202718 2210230 2215185 2217496 2218203 2218409 2218634 2219480 2222387
50615 2222387 2229198 2241164 2258719 2281895 2310371 2343128 2378476 2414587 2449749 2482109 2509618
50604 2509618 2530487 2543649 2548698 2545555 2534157 2514215 2485126 2446353 2398048 2341115 2276442 2204404
50592 2204404 2125547 2041666 1955588 1869623 1784654 1701030 1619881 1542820 1470589 1402808 1339206
50581 1339206 1280377 1226946 1178651 1134842 1095433 1060657 1030222 1003459 980222 960896 945445
50570 945445 933181 923645 917119 914041 914487 918503 926350 937980 952699 969870 989674 1012712 1039145
50557 1039145 1068720 1101566 1138483 1180414 1227936 1281329 1340795 1406443 1478077 1555132 1636857
50546 1636857 1722534 1811266 1901284 1989655 2073157 2149545 2217730 2276927 2326393 2366330 2398451
50535 2398451 2425185 2448564 2470089 2491016 2512210 2534011 2556775 2581220 2607805 2636218 2666199
50524 2666199 2698617 2735017 2776273 2822395 2873410 2929412 2989597 3052161 3115516 3178853 3241145
50513 3241145 3300345 3354130 3400830 3438982 3466487 3481078 3481551 3468000 3440938 3400797 3348284 3284792
50501 3284792 3212347 3133537 3051446 2969243 2889700 2815354 2749105 2694014 2652116 2623627 2607597
50490 2607597 2603204 2610048 2627209 2652408 2682281 2713361 2742633 2767301 2784354 2790563 2782871 2758825
50478 2758825 2716990 2657384 2581619 2492341 2392388 2284496 2171704 2057441 1944750 1835455
50468 1835455 1730381 1630329 1536495 1449945 1371025 1299513 1235048 1177286 1125849 1080418 1040798
50457 1040798 1006710 977664 953231 933250 917465 905085 895190 887614 883048 882075 884417 889330 896386
50444 896386 905580 916963 930555 946427 964420 983851 1004005 1025019 1047872 1073371 1101393 1131207
50432 1131207 1162116 1193592 1225206 1256881 1289092 1322447 1356993 1392129 1427160 1461817 1496263
50421 1496263 1530776 1565517 1600563 1636088 1672337 1709200 1745899 1781506 1815976 1850413 1886041
50410 1886041 1923170 1961306 1999998 2039097 2078390 2117470 2155962 2193478 2229286 2262405 2292126
50399 2292126 2318051 2339500 2355288 2364367 2366470 2361867 2350668 2332535 2306893 2273198 2231182 2181067
50387 2181067 2123459 2058909 1987884 1911528 1832253 1753090 1676352 1603275 1534889 1472762 1418532
50376 1418532 1373039 1336300 1308207 1288823 1277958 1274823 1278349 1287657 1301921 1319733 1338820 1356432
50364 1356432 1370004 1377504 1377516 1369389 1353356 1330290 1301177 1266855 1228279 1186857 1144270 1101935
50352 1101935 1060698 1020947 982804 946262 911387 878537 848275 820961 796504 774593 755016
50341 755016 737665 722361 708810 696730 685939 676428 668452 662412 658480 656472 656223 657933 661839
50328 661839 667719 675153 684243 695485 708734 722813 736671 750671 766203 784078 803695 823812
50316 823812 843682 863346 883192 903548 924553 946187 968436 991472 1015600 1040863 1066776
50305 1066776 1092523 1117399 1140995 1163068 1183509 1202493 1220445 1237547 1253264 1266566 1276703
50294 1276703 1283595 1287401 1288058 1285549 1280404 1273475 1265160 1255185 1243131 1228687 1211297 1190143 1164904
50281 1164904 1136298 1105553 1073642 1041265 1009237 978414 949355 922311 897284 873799 850997
50270 850997 828460 806729 786553 768008 750889 735608 722846 712448 703584 695999 690223 686348
50258 686348 683467 680734 678256 676527 675565 675047 674759 674531 674227 674136 674749 675736 675811 674196 671605 669078 666431
50241 666431 662683 657631 652059 646592 641225 635897 630693 625428 619774 613952 608670 604308 600684 597662
50227 597662 595313 593438 591614 589857 588606 587888 587256 586827 587589 590163 593838 597493 601039 605237 610332
50212 610332 615574 620092 623769 627158 630890 635139 639325 642350 643379 642415 639927 636107 630874 624546
50198 624546 617918 611486 604999 598096 591033 584355 578048 571585 564862 558551 553271 548783 544422 540069
50184 540069 536166 532922 530019 527197 524534 521946 518932 515258 511554 508709 506826 505188 503154 500710
50170 500710 498214 496020 494381 493328 492620 492074 491914 492444 493384 493928 493531 492245 490167 487071 482889 478128
50154 478128 473362 468436 462691 456051 449553 444534 441406 439422 437669 436057 435179 435345 436147 437052 438033
50139 438033 439324 440868 442407 443963 445792 447938 450210 452634 455514 459006 462958 467266 472045 477338
50125 477338 482960 488772 494855 501244 507711 513937 519748 525164 530367 535596 540872 545885 550434 554870
50111 554870 559593 564234 567918 570535 573116 576576 580568 584052 586691 589175 592320 596320 600836 605456
50097 605456 609951 614286 618481 622543 626653 631373 637331 644580 652516 660540 668536 676631 684882 693387
50083 693387 702344 711729 721202 730647 740489 751220 762930 775617 789565 804985 821705 839741
50071 839741 859905 883190 909742 939064 971155 1006799 1046673 1090840 1139238 1192161 1250077
50060 1250077 1313489 1383239 1460367 1545173 1636534 1732341 1830267 1927740 2021454 2107574 2182782
50049 2182782 2245213 2294576 2331693 2358015 2375421 2386201 2392977 2398336 2404132 2410721 2416577 2418656
50037 2418656 2413425 2397834 2369588 2327002 2269305 2197377 2113838 2022036 1925041 1825681 1727023
50026 1727023 1632138 1543351 1461936 1388402 1322655 1264089 1212038 1166212 1126332 1091487 1060391
50015 1060391 1032378 1007641 986441 968551 953560 941064 930275 919989 909498 899197 889809
50004 889809 881215 872500 862976 852695 842010 831099 820041 809015 798132 787164 775656 763493
49992 763493 751317 740175 730561 721946 713530 705361 698284 692776 688310 684072 679849 675924 672509 669757
49978 669757 668081 667952 669405 672057 675567 679853 684947 690890 697721 705349 713581 722446 732277 743172
49964 743172 754560 765607 776000 786113 796686 808639 822841 839471 857728 876745 896741
49953 896741 918760 943406 970624 1000838 1035503 1076119 1123287 1177222 1238689 1308991 1389409
49942 1389409 1481136 1585254 1701852 1829094 1963560 2101517 2239458 2373660 2500153 2615769
49932 2615769 2719151 2810577 2891083 2962023 3025317 3083631 3139776 3195446 3250193 3301422 3345334
49921 3345334 3377914 3395352 3394229 3372017 3327717 3262144 3177785 3078332 2967860 2849830 2726644
49910 2726644 2600106 2471979 2343863 2216888 2092032 1970692 1854466 1744421 1641019
49901 1641019 1544662 1455700 1373823 1298151 1228304 1164755 1107677 1055940 1008037 963796 924395
49890 924395 890578 861470 835342 811044 788296 767009 746962 728146 710855 695060 679896
49879 679896 664215 647698 631124 615364 600455 585993 572248 560266 550737 543193 536595 530356
49867 530356 524417 518687 512955 507394 502663 499271 497033 495303 493684 492381 491859 492229 493052 493897 494916
49852 494916 496609 498981 501382 503431 505674 508900 513027 517214 520940 524393 527789 530890 533516 536117
49838 536117 539531 544394 550984 559348 569255 580196 591800 604339 618724 635992 656780 681213
49826 681213 709337 741759 779802 824760 877052 936434 1003019 1077578 1160558 1251097 1347247
49815 1347247 1446726 1547022 1645014 1736992 1819209 1888412 1942471 1981372 2007759 2026002 2040331
49804 2040331 2053690 2067915 2084096 2102201 2120471 2135414 2142422 2136699 2114392 2073622 2014698 1939408
49792 1939408 1850306 1750721 1644927 1537569 1432527 1332263 1238087 1150721 1070570 997746
49782 997746 932121 873420 821236 775018 734141 698016 666141 638032 613085 590566 569869
49771 569869 550880 533960 519372 506824 495752 486018 477981 471726 466536 461440 456196 451401 447684
49758 447684 445048 443057 441324 439680 438065 436434 434710 432750 430482 428160 426263 425015 424186 423530 423201
49743 423201 423462 424173 424888 425438 426071 426967 427922 428624 429028 429354 429861 430666 431709 432806 433814 434768 435769
49726 435769 436840 438010 439355 440712 441527 441381 440628 440021 439679 438931 437403 435736 434860 434913 435310 435589 435646
49709 435646 435349 434555 433570 433104 433545 434575 435659 436627 437613 438701 439868 441162 442696 444502 446504 448518
49693 448518 450200 451152 451355 451441 452253 454015 456101 457770 459013 460441 462442 464714 466718 468282 469597
49678 469597 470832 471994 473023 473721 473735 472973 471994 471543 471631 471551 470987 470687 471696 474160 477176 479655 481069
49661 481069 481589 481854 482501 483594 484545 484845 484704 484728 485089 485432 485541 485672 486144 486914 487676 488136 488040 487251 485947
49642 485947 484644 483801 483443 483150 482447 481263 480120 479780 480556 482029 483591 485065 486494 487544 487682 487078
49626 487078 486839 487953 490217 492487 493887 494612 495612 497611 500363 502849 504432 505803 508429 512896 518135
49611 518135 522620 526043 529404 533644 538710 544052 549455 555125 561219 567691 574510 581780 589632 598171
49597 598171 607505 617718 628720 640171 651618 662755 673674 684838 696724 709442 722807 736828
49585 736828 751911 768362 785803 803483 821214 839680 859587 880800 902653 924947 948283
49574 948283 973327 1000042 1027785 1055974 1084557 1113928 1144502 1176280 1208782 1241529 1274600
49563 1274600 1308563 1343819 1380175 1417108 1454229 1491344 1528204 1564420 1599602 1633522 1666158
49552 1666158 1697612 1727837 1756397 1782654 1806264 1827403 1846434 1863459 1878173 1889980 1898241
49541 1898241 1902765 1904162 1903496 1901444 1897982 1892920 1886423 1878852 1870548 1862003 1853873 1846410 1839185 1831781
49527 1831781 1824590 1818569 1814436 1812521 1813071 1816118 1821160 1827495 1834929 1843759 1854219 1866401 1880629
49514 1880629 1897249 1915987 1935992 1956571 1977428 1998238 2018644 2038679 2058482 2077318 2093570
49503 2093570 2106107 2115071 2120980 2123684 2122806 2118628 2111760 2102122 2088938 2071675 2050459 2025606 1997335
49490 1997335 1966043 1932456 1897314 1861080 1823948 1785851 1746454 1705497 1663342 1621056 1579777
49479 1579777 1539940 1501135 1462759 1424857 1388298 1353930 1321696 1290824 1260911 1232314 1205316
49468 1205316 1179385 1153726 1128306 1103944 1081532 1061509 1043842 1028063 1013405 999344 986050
49457 986050 973974 963048 952659 942402 932459 923230 914963 907797 901780 896672 892064 887856 884332
49444 884332 881585 879130 876300 872870 869149 865691 863122 861990 862391 863747 865242 866586 868195 870589
49430 870589 873799 877506 881627 886527 892635 900078 908800 918910 930726 944593 960898 980076 1002075
49417 1002075 1025530 1047773 1066050 1078806 1085963 1088482 1088071 1086972 1087214 1089738 1094360 1100611 1108334
49404 1108334 1117538 1128078 1139686 1152075 1164873 1177712 1190583 1203944 1218241 1233359 1248705
49393 1248705 1263754 1278373 1292662 1306628 1320146 1333167 1345870 1358458 1370824 1382582 1393549
49382 1393549 1404083 1414699 1425430 1435761 1445250 1453984 1462417 1471016 1480181 1490296 1501517 1513562
49370 1513562 1525882 1538143 1550486 1563339 1577005 1591418 1606206 1620997 1635758 1650881 1666894
49359 1666894 1684006 1701921 1720164 1738615 1757660 1777821 1799378 1822386 1846797 1872318 1898406
49348 1898406 1924860 1952381 1982047 2014133 2047890 2082731 2119027 2157299 2197118 2237529 2278392
49337 2278392 2320609 2365038 2411810 2460729 2511632 2564112 2617472 2671383 2726169 2782042 2838415
49326 2838415 2894362 2949513 3004052 3058091 3111470 3164006 3215423 3264994 3311727 3354990 3394731
49315 3394731 3431035 3463781 3492819 3518158 3539755 3557324 3570542 3579360 3584000 3584776 3582012 3576063
49303 3576063 3567265 3555943 3542615 3528076 3513056 3497792 3482149 3466216 3450620 3436076 3422804
49292 3422804 3410601 3399428 3389685 3381890 3376337 3373185 3372637 3374834 3379659 3386818 3395950 3406569 3418148
49279 3418148 3430576 3444413 3460340 3478366 3497786 3517789 3537666 3556518 3573365 3587786 3600005
49268 3600005 3610008 3616899 3619527 3617496 3611169 3600833 3586350 3567563 3544636 3517844 3487325 3453160
49256 3453160 3415583 3375031 3332131 3287624 3242179 3196271 3150358 3105051 3060803 3017433 2974228
49245 2974228 2930657 2886867 2843502 2801170 2760162 2720485 2682127 2645369 2610746 2578423 2547617
49234 2547617 2516987 2485800 2454535 2424283 2395804 2369286 2344591 2321345 2298979 2277174 2256268
49223 2256268 2236895 2219159 2202492 2186475 2171603 2158996 2149392 2142538 2137500 2133488 2130341 2128277
49211 2128277 2127245 2126708 2126083 2125290 2124733 2124857 2125950 2128264 2131984 2136951 2142627 2148541 2154708 2161550 2169512
49196 2169512 2178791 2189236 2200339 2211496 2222513 2233886 2246439 2260644 2276360 2293124 2310513
49185 2310513 2328202 2345937 2363685 2381720 2400371 2419611 2439057 2458459 2478090 2498407 2519337
49174 2519337 2540149 2560184 2579515 2598677 2617897 2636977 2655838 2674665 2693284 2710804 2726302
49163 2726302 2739717 2751752 2763028 2773789 2784488 2796166 2809913 2825981 2843679 2862204 2881483
49152 2881483 2902100 2924407 2947851 2971407 2994633 3018097 3042721 3068933 3096509 3124781 3152667
49141 3152667 3178866 3202600 3224169 3244424 3263788 3282180 3299749 3316975 3333921 3350066 3365280
49130 3365280 3380430 3396499 3413336 3429834 3445246 3459817 3474091 3488055 3501175 3513054 3523796
49119 3523796 3533715 3542831 3550682 3556686 3560686 3563044 3564313 3564896 3565047 3564905 3564535 3564212 3564750 3567188 3571787
49104 3571787 3577550 3583043 3587622 3591628 3595650 3600033 3605100 3611330 3618939 3627420 3635746 3643111 3649509 3655572
49090 3655572 3661836 3668114 3673694 3678150 3681814 3685340 3689035 3692855 3696896 3701546 3707081 3713270 3719482 3725130
49076 3725130 3730123 3734905 3739946 3745082 3749531 3752721 3754928 3756836 3758578 3759523 3758917 3756506 3752576 3747670
49062 3747670 3742200 3736012 3728352 3718567 3706879 3694168 3680988 3667061 3651775 3634769 3615915 3595201
49050 3595201 3572998 3550207 3527788 3506115 3484874 3463515 3441711 3419608 3397865 3377301 3358272
49039 3358272 3340370 3322891 3305570 3288761 3272978 3258466 3245204 3233166 3222454 3213190 3205394 3198992
49027 3198992 3193991 3190566 3188850 3188655 3189460 3190818 3192800 3196051 3201344 3208924 3218216 3228250 3238469 3249022
49013 3249022 3260222 3271948 3283745 3295319 3306629 3317567 3327875 3337449 3346434 3354967 3362969 3370186
49001 3370186 3376236 3380681 3383430 3385111 3386674 3388452 3389909 3390497 3390457 3390498 3390941 3391487 3391758 3391718 3391503 3391029 3389838
48984 3389838 3387289 3382954 3376881 3369428 3360823 3350980 3339758 3327223 3313618 3299250 3284531 3269880
48972 3269880 3255383 3240615 3224992 3208274 3190610 3172194 3152961 3132666 3111269 3089346 3067994
48961 3067994 3048071 3029395 3011022 2992480 2974525 2958512 2945231 2934542 2925915 2918984 2913704 2910313
48949 2910313 2909076 2909869 2912121 2915467 2920304 2927318 2936528 2947262 2959120 2972416 2987423 3003698 3020638
48936 3020638 3038459 3058050 3079909 3103669 3128799 3155308 3183509 3213425 3244795 3277534 3311788
48925 3311788 3347578 3384701 3423058 3462751 3503749 3545828 3589082 3634186 3681758 3731587 3782897
48914 3782897 3835339 3889307 3945273 4003261 4063184 4125289 4189945 4257212 4326907 4399002 4473656
48903 4473656 4550953 4630866 4713350 4798158 4884534 4971462 5058410 5145627 5233500 5321732 5409401
48892 5409401 5495794 5580899 5664908 5747345 5827039 5903007 5975172 6043958 6109329 6170507 6226731
48881 6226731 6277964 6324680 6367068 6404725 6437101 6464001 6485485 6501351 6510986 6513839 6509991 6500066
48869 6500066 6484560 6463455 6436531 6403843 6365738 6322597 6274785 6222688 6166567 6106525 6042907
48858 6042907 5976559 5908218 5837760 5764589 5688913 5612101 5535465 5459029 5381851 5303352 5224024
48847 5224024 5145111 5067903 4993196 4920972 4850605 4781640 4714418 4649853 4588700 4531258 4477615
48836 4477615 4427853 4381915 4339531 4300395 4264341 4231333 4201424 4174739 4151442 4131682 4115643
48825 4115643 4103559 4095629 4091904 4092335 4096838 4105227 4117083 4131800 4148832 4167994 4189542 4213908
48813 4213908 4241151 4270732 4301968 4334696 4369296 4406042 4444704 4484844 4526184 4568512 4611508
48802 4611508 4654938 4698834 4743204 4787713 4831866 4875490 4918850 4962333 5006210 5050638 5095717
48791 5095717 5141486 5187927 5234976 5282569 5330801 5379976 5430327 5481616 5533280 5585002 5636880
48780 5636880 5688950 5740924 5792574 5843984 5895107 5945300 5993634 6039475 6082447 6122039 6157571
48769 6157571 6188462 6214286 6234761 6249949 6260259 6265796 6265843 6259289 6245562 6224887 6197869 6165248
48757 6165248 6127935 6086740 6041892 5993044 5939782 5881928 5819432 5752294 5680662 5604818 5525143
48746 5525143 5442243 5356993 5270256 5182795 5095690 5010480 4928351 4849348 4772897 4699005 4628473
48735 4628473 4562001 4499692 4441408 4387090 4336681 4290282 4248447 4211673 4179448 4150376 4123544
48724 4123544 4099272 4078337 4061001 4047072 4036334 4028452 4022958 4019780 4019424 4022164 4027443 4034617 4043900
48711 4043900 4055844 4069974 4084733 4098936 4112821 4127392 4143185 4159932 4177190 4194902 4213387
48700 4213387 4233086 4254407 4277691 4303152 4330816 4360641 4392704 4427097 4463580 4501643 4541219
48689 4541219 4583122 4628309 4676718 4727291 4779227 4832687 4888086 4945186 5003278 5061922 5121030
48678 5121030 5180350 5239240 5296952 5352936 5406966 5459070 5509165 5556586 5600177 5639036 5673007
48667 5673007 5702315 5726995 5746934 5762104 5772366 5777222 5776162 5769144 5756410 5737996 5713783 5683870
48655 5683870 5648460 5607448 5560615 5508314 5451580 5391422 5328311 5262381 5193766 5122590 5048900
48644 5048900 4972857 4894876 4815559 4735569 4655520 4575749 4496270 4417170 4339010 4262539 4188046
48633 4188046 4115341 4044374 3975463 3908787 3844058 3780878 3719114 3658740 3599698 3542177 3486711
48622 3486711 3433624 3382543 3332756 3283867 3235861 3188763 3142681 3098116 3055763 3015874 2978014
48611 2978014 2941473 2905789 2870948 2837294 2805188 2774533 2744763 2715555 2687395 2661043 2636535
48600 2636535 2613199 2590698 2569496 2550059 2532127 2515155 2499129 2484548 2471871 2461352 2453132
48589 2453132 2446954 2441951 2437243 2432790 2429277 2427164 2426306 2426527 2428042 2431124 2435684 2441420 2448166 2455974
48575 2455974 2465058 2475709 2487973 2501360 2515155 2529114 2543515 2558457 2573601 2588830 2604669
48564 2604669 2621611 2639356 2657094 2674223 2690345 2704884 2717341 2727902 2737239 2745659 2752893 2758805
48552 2758805 2763843 2768599 2773169 2777140 2780009 2781527 2781812 2781331 2780726 2780544 2781063 2782237 2783782 2785432 2787163
48537 2787163 2789029 2790844 2792394 2794032 2796531 2800053 2803720 2806610 2808772 2810711 2812300 2812930 2812533 2811718 2811001
48522 2811001 2810640 2811237 2813698 2818383 2824870 2832657 2841570 2851491 2862443 2875123 2890579 2909029 2929614
48509 2929614 2951590 2975124 3000598 3027892 3056775 3087302 3119310 3152182 3185768 3220888 3258139
48498 3258139 3296657 3334897 3372295 3409384 3446466 3482959 3517917 3550431 3579628 3605110 3627485
48487 3627485 3647856 3666618 3683189 3696896 3707553 3715170 3719703 3721226 3719909 3715761 3708829 3699668 3689039
48474 3689039 3677091 3663358 3647672 3630546 3612560 3593942 3574876 3555500 3535294 3513103 3488282
48463 3488282 3461417 3433515 3404884 3375260 3344474 3312312 3278075 3241160 3202119 3162490 3123393
48452 3123393 3084803 3046381 3008482 2971957 2937293 2904363 2872895 2842794 2814070 2786790 2761168
48441 2761168 2737395 2715251 2694089 2673464 2653647 2635363 2619099 2604856 2592458 2581736 2572347
48430 2572347 2563814 2556036 2549626 2545449 2543837 2544391 2546458 2549579 2553496 2557978 2562828 2568032 2573867 2580751
48416 2580751 2588922 2598253 2608462 2619405 2630882 2642246 2652685 2662103 2671356 2681248 2691599 2701703
48404 2701703 2711402 2721068 2730627 2739344 2746854 2753827 2761166 2768845 2776022 2782158 2787629 2793149 2798865 2804192
48390 2804192 2808468 2811661 2814358 2817096 2819808 2822015 2823397 2823892 2823311 2821256 2817651 2813097 2808328 2803427
48376 2803427 2797933 2791745 2785626 2780623 2777185 2775110 2774146 2774274 2775389 2777126 2779243 2781916 2785385 2789531
48362 2789531 2794149 2799488 2805989 2813501 2821261 2828857 2836735 2845507 2855139 2865184 2875461 2886002 2896548
48349 2896548 2906654 2916347 2926206 2936630 2947286 2957358 2966189 2973655 2980029 2985519 2989862 2992489 2993206
48336 2993206 2992482 2990881 2988465 2985099 2981111 2977068 2972941 2968020 2961780 2954420 2946409 2937950 2929115 2920091
48322 2920091 2910881 2900992 2889914 2877839 2865614 2853883 2842528 2830970 2818891 2806565 2794674 2783887
48310 2783887 2774581 2766763 2760186 2754636 2750201 2747229 2745913 2745959 2746833 2748316 2750593 2753823 2757928 2762907 2768976
48295 2768976 2776090 2783646 2791037 2798359 2806122 2814349 2822374 2829484 2835336 2839637 2841831 2841353 2837970 2831630
48281 2831630 2822137 2809238 2793005 2773961 2752699 2729403 2703834 2675920 2646316 2616174 2586243
48270 2586243 2556356 2525859 2494385 2462092 2429442 2396991 2365218 2334238 2303808 2273802 2244557
48259 2244557 2216494 2189600 2163576 2138302 2113864 2090218 2067186 2044729 2022927 2001812 1981439
48248 1981439 1961991 1943522 1925797 1908676 1892351 1876776 1861243 1845166 1829097 1814239 1801011
48237 1801011 1788812 1777156 1766284 1756459 1747485 1739283 1732275 1726690 1721869 1716717 1710582 1703460 1695725
48224 1695725 1687907 1680413 1673177 1665806 1658231 1650798 1643570 1635930 1627188 1617259 1606559 1595611 1584947
48211 1584947 1574924 1565324 1555497 1545153 1534589 1523868 1512345 1499470 1485623 1471591 1457539 1443076
48199 1443076 1428140 1413221 1398747 1384687 1370808 1357009 1343446 1330501 1318492 1307288 1296458
48188 1296458 1286042 1276809 1269432 1263671 1258800 1254509 1250900 1247819 1244901 1242363 1241186 1242219 1245244 1249062
48174 1249062 1252435 1254976 1257254 1260059 1263605 1267576 1271850 1276744 1282415 1288490 1294533 1300552 1306715 1312922
48160 1312922 1319045 1325248 1331636 1337842 1343438 1348492 1353310 1357872 1362055 1366177 1370742 1375764 1380880 1386049
48146 1386049 1391521 1397126 1402205 1406362 1409833 1412965 1415802 1418384 1421024 1424021 1427308 1430573 1433630 1436593
48132 1436593 1439781 1443424 1447316 1450900 1453954 1457072 1461133 1466355 1472159 1477892 1483375 1488798 1494440 1500540
48118 1500540 1507144 1514080 1521258 1528899 1537256 1546257 1555705 1565592 1575802 1585808 1595224 1604558 1614819
48105 1614819 1626497 1639551 1654400 1672192 1693994 1720430 1752318 1790945 1837270 1891197 1951458
48094 1951458 2014866 2074816 2121628 2146442 2146003 2123928 2087726 2044965 2001522 1961550 1927520 1900045
48082 1900045 1878310 1861231 1848401 1840081 1836443 1836955 1840462 1845764 1852071 1859145 1867169 1876413 1886813
48069 1886813 1897804 1908698 1919249 1929753 1940578 1951745 1962939 1973730 1983686 1992412 1999624 2005249
48057 2005249 2009448 2012511 2014579 2015472 2014930 2013118 2010688 2008152 2005332 2001583 1996365 1989500 1981253 1972497
48043 1972497 1964422 1957454 1950514 1941869 1930761 1917850 1904170 1890163 1875749 1860708 1844775 1827804
48031 1827804 1810144 1792513 1775311 1758293 1741011 1723224 1704790 1685625 1665983 1646368 1626801
48020 1626801 1606527 1584780 1561590 1537530 1512834 1487173 1460246 1432346 1404269 1376755 1349983
48009 1349983 1323591 1297254 1271165 1245834 1221578 1198516 1176884 1156855 1138064 1119857 1102069
47998 1102069 1085061 1068938 1053368 1038401 1024702 1012512 1001049 989531 978304 968255 959534
47987 959534 951641 944471 938367 933165 928123 923002 918435 914877 911786 908358 904661 901489 899302 897813
47973 897813 896585 895581 894981 894758 894658 894441 893997 893258 892190 890838 889200 887027 883942 879963 875679 871754
47957 871754 868320 865072 861764 858304 854484 850035 845009 839827 834862 830197 825682 820890 815198 808482
47943 808482 801788 796666 793622 791707 789827 787863 786259 785206 784725 785002 785993 787168 788270 789939 792921
47928 792921 797001 801472 806338 812183 818996 826036 832945 840164 848037 856256 864470 872775 881250 889531
47914 889531 897240 904432 911316 917820 923643 928353 931359 932328 931871 931158 930455 928595 924438 918368 911693
47899 911693 904923 897426 888660 878987 869150 859499 849956 840259 830110 819482 808970 799495 791456
47886 791456 784449 777961 771976 766713 762089 757849 753958 750530 747551 745134 743901 744546 746859 749712
47872 749712 752333 755276 759708 765907 772923 779743 786405 793772 802387 811740 820603 828041 834144 839843
47858 839843 846037 852930 860117 867012 873032 877656 880733 882624 883704 883771 882405 879788 876616 873082 868615
47843 868615 862901 856538 850160 843453 835692 826971 818202 810051 802511 795469 789018 783078 777255 771285
47829 771285 765258 759379 753918 749442 746566 745237 744694 744295 744013 743945 743888 743761 744036 745232 747130 748872
47813 748872 749787 749859 749539 749400 749880 751011 752351 753309 753565 753142 752287 751372 750760 750537 750476 750384 750395 750744 751455
47794 751455 752404 753493 754597 755566 756582 758286 761261 765475 770479 776036 782210 789030 796515 804956 814722
47779 814722 825708 837368 849395 861952 875095 888426 901593 914813 928492 942569 956629
47768 956629 970521 984407 998148 1011094 1022695 1033071 1042731 1051853 1060067 1066901 1072151 1075707 1077234
47755 1077234 1076369 1073256 1068683 1063458 1057707 1050969 1042991 1034222 1025343 1016447 1006880 995951 983655 970692
47741 970692 957981 946291 936153 927737 920676 914213 907756 901303 895311 890281 886575 884414 883760 884258
47727 884258 885630 888113 892178 897747 904094 910754 918212 927412 938830 952337 967734 984899 1003521
47714 1003521 1023191 1043869 1065792 1088694 1111427 1132639 1151647 1168465 1183177 1195551 1205243
47703 1205243 1212192 1216732 1219251 1219696 1217498 1212231 1204272 1194516 1183433 1170840 1156694 1141549 1125884
47690 1125884 1109485 1092007 1073928 1056301 1039715 1024011 1009033 995087 982588 971730 962599
47679 962599 955150 948920 943223 937966 933936 932017 932408 934798 938902 944440 950948 958122 966257 975927
47665 975927 987284 999999 1013749 1028378 1043561 1058773 1073732 1088612 1103623 1118535 1132713
47654 1132713 1145523 1156664 1166234 1174556 1181896 1188340 1193886 1198492 1201913 1203665 1203350 1200933 1196547 1190206
47640 1190206 1182056 1172767 1163289 1154181 1145416 1136878 1128716 1121157 1114287 1108121 1102639 1097681 1093014 1088597
47626 1088597 1084510 1080522 1076049 1070729 1064893 1059306 1054550 1050683 1047258 1043577 1039190 1034247 1029163 1023876
47612 1023876 1017851 1010994 1004093 997932 992251 986057 978750 970504 961665 952349 942617 932511 921756
47599 921756 909886 896870 883236 869263 854469 838312 821175 804074 787384 770396 752417
47588 752417 733929 716239 700117 685256 671126 657842 645824 634887 624240 613471 603181
47577 603181 594385 587479 581994 577250 572980 569296 566281 563833 561922 560814 560748 561436 562184 562691 563499 565296
47561 565296 568020 571020 573991 577176 580619 583882 586812 590069 594356 599410 604216 608017 610673 612218
47547 612218 612617 612061 611020 609841 608510 606923 605142 603251 601087 598194 594009 588181 580940 573113 565583
47532 565583 558636 551990 545383 538942 532886 527036 520778 513548 505431 497278 490089 484198 479144 474403
47518 474403 470026 466361 463414 460800 458182 455398 452262 448619 444762 441482 439614 439570 441243 444061 447230
47503 447230 450213 453041 456033 459302 462792 466589 470830 475278 479460 483242 486891 490492 493721 496267
47489 496267 498017 498726 498040 496028 493147 489375 484031 477024 469755 463972 459883 456128 451543 446274 441104
47474 441104 436493 432590 429591 427500 425863 424170 422416 420948 419942 419347 419235 419798 421073 422966 425516
47459 425516 428749 432263 435367 437810 440030 442457 444935 447134 449250 451784 454747 457614 460124 462637
47445 462637 465478 468340 470683 472474 474145 475989 477878 479567 481068 482765 485312 489205 494247 499577
47431 499577 504528 509329 514700 520941 527773 534988 542720 551011 559602 568349 577540 587621 598822 611113
47417 611113 624191 637391 650005 661982 674054 686909 700455 714050 727095 739122 749707
47406 749707 758865 767318 775777 783917 790618 795332 798691 801472 803408 803479 801211 797217 792411 787048 780720
47391 780720 773055 764189 754570 744542 734240 723840 713782 704567 696338 688746 681410 674446 668343
47378 668343 663223 658442 653190 647443 642061 637941 635336 633977 633517 633621 633933 634339 635213 637136 640421
47363 640421 644991 650533 656551 662445 667951 673395 679210 685222 690784 695508 699503 702850 705330 706733
47349 706733 707032 706082 703557 699460 694330 688663 682378 675029 666357 656436 645573 634305 623232 612580
47335 612580 602106 591585 581073 570532 559642 548430 537733 528493 520744 513731 506840 499913
47323 499913 492837 485516 478328 472055 467122 463248 459931 456909 454068 451359 448996 447354 446482 446061 445978
47308 445978 446521 447733 449023 449783 450135 450627 451475 452546 453852 455544 457444 459111 460487 461979 463716
47293 463716 465108 465449 464711 463493 462384 461667 461442 461595 461625 460943 459640 458719 459246 461310 464067 466786 469571
47276 469571 472906 476811 480774 484500 488298 492586 497251 501784 506008 510421 515688 521898 528451 534707
47262 534707 540702 547113 554516 562776 571349 580035 589104 598553 607624 615411 621798 627416 632736 637640
47248 637640 641871 645517 648816 651823 654460 656604 657925 657981 656805 655103 653465 651632 648981 645507 641759
47233 641759 637879 633384 628070 622590 617833 614093 610995 607897 604226 599869 595486 592010 589571 587366
47219 587366 584936 583056 582805 584182 586283 588609 591403 594790 598340 601742 605406 610091 616223 623636
47205 623636 631731 639850 647761 655831 664436 673348 682051 690510 699035 707348 714476 719825 723845 727252
47191 727252 729988 731278 730495 727662 723378 718493 713596 708564 702771 696016 689009 682768 677765 673844
47177 673844 670691 668072 665898 664437 664343 666066 669239 672963 676777 681154 687042 695021 704942 716314
47163 716314 728898 742746 757597 772578 786923 800888 815451 831126 847550 864277 881287
47152 881287 898378 914748 929686 943257 955803 967149 976863 984931 991521 996325 998854 999330 998608
47139 998608 997183 994823 991261 986695 981454 975650 969346 962742 955998 949179 942465 936180 930550 925675
47125 925675 921740 918874 916739 914593 911933 908957 906318 904692 904460 905458 907002 908511 910148 912530 915884
47110 915884 919926 924534 929856 935582 940846 945303 949714 954790 959822 963197 964141 963234 961211 958027 953387
47095 953387 947528 940883 933252 923910 912547 899681 886079 872114 857879 843638 829849 816801
47083 816801 804445 792594 781103 769866 758831 748081 737848 728466 720380 714032 709425 705778
47071 705778 702033 697875 694012 691290 689826 689232 689311 690130 691621 693594 696079 699244 702987 707073 711698
47056 711698 717454 724502 732129 739398 745957 751985 757609 762786 767599 772199 776397 779707 782050 784156
47042 784156 786918 790340 793460 795436 796522 797806 800197 803865 808543 813988 820056 826574 833287 839889
47028 839889 846202 852488 859389 867224 875445 883243 890673 898605 907477 916675 925456 933920 942669 951949
47014 951949 961637 971656 981846 991698 1000805 1009436 1018262 1027702 1037852 1048677 1059789 1070442 1080415
47001 1080415 1090464 1101132 1111467 1119891 1126138 1131212 1135507 1138218 1138910 1138480 1137917 1137100 1135494 1133177
46987 1133177 1130371 1126705 1121910 1116756 1112299 1108518 1104618 1100563 1097301 1095451 1094595 1094096 1093891 1094177 1094947
46972 1094947 1096210 1098257 1101303 1105141 1109555 1114795 1121276 1128865 1136896 1144929 1153160 1161914 1170967 1179636
46958 1179636 1187492 1194702 1201720 1208926 1216649 1225097 1233936 1242235 1249239 1255015 1259988 1264081 1266897 1268629
46944 1268629 1270047 1271548 1272886 1273942 1274962 1275666 1274986 1272351 1268708 1265566 1263415 1261711 1259974 1258107
46930 1258107 1255990 1253756 1252419 1253257 1256310 1260150 1263431 1266107 1268963 1272585 1277139 1282608 1288812 1295574
46916 1295574 1303198 1312332 1322933 1333762 1343465 1351995 1360535 1370223 1381397 1393865 1407197 1420631
46904 1420631 1433200 1444312 1454010 1462576 1470131 1476656 1482022 1485782 1487244 1486010 1482274 1476433 1468624
46891 1468624 1458861 1447409 1434685 1421076 1407150 1393904 1382332 1372759 1364981 1358989 1355098 1353375
46879 1353375 1353517 1355517 1359934 1367179 1376951 1388679 1402127 1417153 1433241 1449754 1466420 1483122
46867 1483122 1499505 1515269 1530575 1545555 1559574 1571668 1581710 1590529 1598836 1606590 1613523 1619665
46855 1619665 1625162 1630119 1634881 1640021 1645839 1652250 1659240 1666912 1674945 1682704 1690253 1698701 1709109 1721429
46841 1721429 1734893 1748889 1762934 1776287 1788331 1799169 1809256 1818552 1826569 1833102 1838407 1842705
46829 1842705 1845983 1848200 1849258 1848800 1846525 1842703 1837993 1832744 1826936 1820835 1815177 1810460 1806368 1802243
46815 1802243 1798050 1794702 1793402 1794685 1798098 1802892 1809014 1817173 1827859 1840695 1855058 1870961 1888784
46802 1888784 1908344 1928848 1949729 1970905 1992041 2012203 2030592 2047213 2062389 2075898 2086990
46791 2086990 2095179 2100635 2103811 2104988 2104167 2101136 2095557 2087228 2076459 2064048 2050747 2036811 2022268
46778 2022268 2007457 1992951 1978831 1964467 1949357 1933978 1919360 1905887 1893005 1880169 1867623
46767 1867623 1855991 1845434 1835518 1825626 1815278 1804244 1792722 1781344 1770816 1761541 1753599 1746842
46755 1746842 1740874 1735273 1730037 1725578 1722083 1719175 1716503 1714323 1713226 1713541 1715440 1719277 1725246 1732798
46741 1732798 1740946 1749184 1757710 1766818 1776612 1787347 1799472 1813047 1827428 1841720 1855330 1868045
46729 1868045 1879913 1891198 1902145 1912583 1921991 1930131 1937402 1944286 1950679 1956028 1960078 1963242 1966228
46716 1966228 1969557 1973448 1977918 1982770 1987611 1992223 1997016 2002870 2010350 2019255 2029093 2039701 2051019
46703 2051019 2062437 2072978 2082121 2089961 2096518 2101570 2105251 2108014 2109492 2108059 2102255 2092269 2079346
46690 2079346 2064163 2046510 2026350 2004243 1980615 1955367 1928479 1900490 1872108 1843730 1815435
46679 1815435 1787152 1758713 1730127 1701907 1674836 1649337 1625311 1602607 1581274 1561261 1542187
46668 1542187 1523578 1505190 1487101 1469643 1453147 1437542 1422367 1407441 1393321 1380678 1369405
46657 1369405 1358865 1348930 1340253 1333516 1328869 1326201 1325477 1326706 1329973 1335579 1343820 1354587 1367554
46644 1367554 1382634 1399714 1418026 1436431 1454547 1472990 1492205 1511480 1529349 1544594 1556753
46633 1556753 1566058 1573162 1578641 1582645 1585237 1586904 1588206 1588994 1588711 1587561 1586685 1586978 1588496 1591340 1596347
46618 1596347 1604380 1615498 1629386 1645964 1664996 1685605 1706974 1729186 1752693 1777166 1801582
46607 1801582 1825314 1848367 1870508 1890790 1908085 1921662 1931108 1936080 1936417 1932319 1924263 1912760
46595 1912760 1898207 1880885 1861050 1838985 1814904 1789039 1762093 1735425 1710189 1686220 1662342
46584 1662342 1638024 1614166 1591868 1571029 1550733 1530619 1511207 1493021 1476036 1459941 1444405
46573 1444405 1429072 1413706 1398466 1383652 1369116 1354206 1338511 1322619 1307968 1295779 1285904
46562 1285904 1276820 1267104 1256902 1247542 1239735 1232851 1226144 1219858 1214575 1210184 1206264 1202981 1200664 1198821
46548 1198821 1196562 1194011 1192319 1192155 1192997 1194171 1195805 1198324 1201635 1205391 1209705 1215073 1221647 1228941
46534 1228941 1236271 1243366 1250644 1258897 1268596 1279444 1290676 1301753 1312572 1323218 1333938 1345320
46522 1345320 1357999 1371978 1386550 1401128 1415903 1431526 1448428 1466675 1486254 1507158 1529233
46511 1529233 1552146 1575506 1598915 1622020 1644754 1667545 1691032 1715409 1740048 1763903 1786289
46500 1786289 1807182 1826694 1844458 1859773 1872298 1882344 1890446 1896894 1901752 1905012 1906561 1906316 1904600
46487 1904600 1902139 1899429 1896333 1892544 1888172 1883469 1878193 1871705 1863721 1854606 1844901 1834870 1824497
46474 1824497 1813607 1801924 1789173 1775199 1759901 1743143 1724853 1705068 1683712 1660553 1635646
46463 1635646 1609617 1583133 1556226 1528511 1499941 1470995 1442247 1414202 1387462 1362436 1338843
46452 1338843 1316060 1294186 1274327 1257522 1243759 1232308 1222665 1214875 1209259 1206231 1206133 1208788 1213282
46439 1213282 1218670 1225001 1233241 1243930 1256205 1268567 1280554 1293191 1307515 1322903 1337322 1349182
46427 1349182 1358587 1366676 1374250 1381316 1387555 1392681 1396421 1398595 1399368 1399261 1398856 1398624 1398871 1399699 1401102
46412 1401102 1403264 1406591 1411337 1417472 1425137 1434854 1446927 1460943 1476444 1493805 1513799 1536482
46400 1536482 1561285 1588278 1618422 1652167 1688519 1726114 1764772 1805345 1848297 1893042 1938637
46389 1938637 1984497 2030188 2074917 2117625 2157585 2194680 2229042 2260492 2288458 2312305 2331519
46378 2331519 2345587 2354042 2356815 2354338 2347080 2335226 2319085 2299524 2277609 2253946 2228725 2202247
46366 2202247 2174934 2147003 2118709 2090894 2064663 2040484 2018173 1997919 1980603 1966862 1956457
46355 1956457 1948989 1944717 1944233 1947804 1955629 1968361 1986631 2010226 2038344 2070662 2107564 2149216
46343 2149216 2194974 2243982 2295979 2351210 2409708 2470853 2533480 2596228 2657918 2717744 2775044
46332 2775044 2828732 2877145 2918777 2953117 2980435 3000626 3012619 3015267 3008527 2993303 2970343 2939918
46320 2939918 2902648 2859840 2812583 2761086 2705574 2647467 2588939 2531402 2475055 2419838 2366191
46309 2366191 2314874 2266684 2222493 2182927 2147734 2116065 2087716 2063668 2045095 2032166 2024133
46298 2024133 2020231 2020140 2023935 2032013 2044900 2062724 2084845 2110136 2137578 2166627 2197326 2230189
46286 2230189 2265567 2302927 2341019 2378944 2416641 2454109 2490729 2525844 2559649 2592783 2625196
46275 2625196 2655917 2683857 2708352 2729031 2745756 2758769 2768382 2774347 2775942 2772901 2765893 2755903
46263 2755903 2743408 2728448 2711244 2692402 2672569 2652159 2631530 2611249 2592009 2574261 2557989
46252 2557989 2542944 2529168 2517185 2507581 2500438 2495306 2491765 2489940 2490359 2493285 2498239 2504229 2510474
46239 2510474 2516834 2523469 2530224 2536534 2541915 2546280 2549694 2551998 2552845 2552025 2549564 2545445 2539335 2530751
46225 2530751 2519610 2506522 2492288 2477060 2460335 2441971 2422834 2403910 2385031 2365121 2343821
46214 2343821 2322249 2301861 2283025 2265119 2247638 2230724 2214762 2199947 2186304 2173804 2162328
46203 2162328 2151667 2141684 2132505 2124603 2118620 2114993 2113747 2114807 2118359 2124574 2132993 2142606 2152780
46190 2152780 2163735 2175874 2189006 2202616 2216709 2231924 2248737 2266852 2285423 2303776 2321898
46179 2321898 2340265 2359127 2377937 2395649 2411574 2425779 2438713 2450807 2462567 2474599 2487142
$$ [...]
##END NTUPLES=NMR SPECTRUM
##END=
