
##TITLE=AC1205_HSMAH12053_7154974_VJvyl8NvSL
##JCAMPDX= 6.0         $$ Bruker NMR JCAMP-DX V2.0
##DATA TYPE= NMR SPECTRUM
##DATA CLASS= NTUPLES
##ORIGIN= BRUKER
##OWNER= Administrator
$$ 1.72 TOPSPIN		Version 2.1
$$ 2012-12-01 04:28:17.372 -0500  Administrator@X
$$ Compression mode = diff/dup
##.OBSERVE FREQUENCY= 400.02188249412
##.OBSERVE NUCLEUS= ^1H
##.ACQUISITION MODE= SIMULTANEOUS (DQD)
##.ACQUISITION SCHEME= undefined
##.AVERAGES= 8
##.DIGITISER RES= 22
##SPECTROMETER/DATA SYSTEM= spect
##.PULSE SEQUENCE= zg30
##.SOLVENT NAME= COFFEE_meoh
##.SHIFT REFERENCE= INTERNAL, COFFEE_meoh, 1, 14.98509
##AUDIT TRAIL= $$ (NUMBER, WHEN, WHO, WHERE, PROCESS, VERSION, WHAT)
$$ ##TITLE= Audit trail, TOPSPIN		Version 2.1
$$ ##JCAMPDX= 5.01
$$ ##ORIGIN= Bruker BioSpin GmbH
$$ ##OWNER= Administrator
$$ $$ E:\/data/COFFEE/nmr/AC1205_HSMAH12053_7154974_VJvyl8NvSL/10/pdata/1/auditp.txt
$$ ##AUDIT TRAIL=  $$ (NUMBER, WHEN, WHO, WHERE, PROCESS, VERSION, WHAT)
(   1,<2012-12-01 04:28:08.804 -0500>,<Administrator>,<X>,<go>,<TOPSPIN 2.1>,
      <created by zg
	started at 2012-12-01 04:27:02.586 -0500,
	POWCHK enabled, PULCHK disabled,
       configuration hash MD5:
       86 BA 57 50 F2 9D 5C 9B 26 00 A9 28 5F 66 2E 89
       data hash MD5: 64K
       EF 20 3F 9B A8 80 78 26 D1 A5 9B 19 CE 6B 2C 9E>)
(   2,<2012-12-01 04:28:11.867 -0500>,<Administrator>,<X>,<proc1d>,<TOPSPIN 2.1>,
      <Start of raw data processing
       efp LB = 0 FT_mod = 6 PKNL = 1 PHC0 = 0 PHC1 = 0 SI = 32K 
       data hash MD5: 32K
       1B E8 F2 72 C4 3C 18 30 2D CB D4 C3 4F 5B C9 25>)
(   3,<2012-12-01 04:28:12.342 -0500>,<Administrator>,<X>,<proc1d>,<TOPSPIN 2.1>,
      <pk PHC0 = 97.56409 PHC1 = 0 
       data hash MD5: 32K
       28 63 03 6B E3 01 CA 65 C9 9E BE 82 23 A1 F4 42>)
(   4,<2012-12-01 04:28:12.571 -0500>,<Administrator>,<X>,<proc1d>,<TOPSPIN 2.1>,
      <abs ABSG = 1 
       data hash MD5: 32K
       5B 50 C6 DB A2 26 F3 AD 26 F6 49 63 8D C3 26 23>)
(   5,<2012-12-01 04:28:12.724 -0500>,<Administrator>,<X>,<proc1d>,<TOPSPIN 2.1>,
      <abs ABSG = 2 
       data hash MD5: 32K
       B6 74 45 6B FF E4 D3 96 3B BA 79 A6 4A 77 04 80>)
(   6,<2012-12-01 04:28:12.878 -0500>,<Administrator>,<X>,<proc1d>,<TOPSPIN 2.1>,
      <abs ABSG = 3 
       data hash MD5: 32K
       75 EB 27 F7 0A 77 23 17 51 82 92 0D 82 D2 3B E1>)
(   7,<2012-12-01 04:28:13.015 -0500>,<Administrator>,<X>,<proc1d>,<TOPSPIN 2.1>,
      <abs ABSG = 4 
       data hash MD5: 32K
       E2 3C A3 EA 0D D1 AF 08 F4 E6 63 AC 32 6B 2D 02>)
(   8,<2012-12-01 04:28:13.153 -0500>,<Administrator>,<X>,<proc1d>,<TOPSPIN 2.1>,
      <abs ABSG = 5 
       data hash MD5: 32K
       B1 E0 C3 B0 ED 2B 42 41 71 49 C9 54 6E 99 88 8A>)
$$ ##END=
$$ 
$$ $$ hash MD5
$$ $$ 1F 57 2F A5 F5 A7 18 63 E6 64 3A A9 53 DF 98 79
##$RELAX= 
##$RELAX= 
##$RELAX= 
##$RELAX= 
##$RELAX= 
##$RELAX= 
##$RELAX= 
$$ Bruker specific parameters
$$ --------------------------
##$DU= <E:\>
##$EXPNO= 10
##$NAME= <AC1205_HSMAH12053_7154974_VJvyl8NvSL>
$$ [...]
##$TP= (0..7)
150 150 150 150 150 150 150 150
##$TP07= 0
##$TPNAME0= <>
##$TPNAME1= <>
##$TPNAME2= <>
##$TPNAME3= <>
##$TPNAME4= <>
##$TPNAME5= <>
##$TPNAME6= <>
##$TPNAME7= <>
##$TPOAL= (0..7)
0.5 0.5 0.5 0.5 0.5 0.5 0.5 0.5
##$TPOFFS= (0..7)
0 0 0 0 0 0 0 0
##$TUNHIN= 0
##$TUNHOUT= 0
##$TUNXOUT= 0
##$USERA1= <user>
##$USERA2= <user>
##$USERA3= <user>
##$USERA4= <user>
##$USERA5= <user>
##$V9= 5
##$VALIST= <valist>
##$VCLIST= <CCCCCCCCCCCCCCC>
##$VD= 0
##$VDLIST= <DDDDDDDDDDDDDDD>
##$VPLIST= <PPPPPPPPPPPPPPP>
##$VTLIST= <TTTTTTTTTTTTTTT>
##$WBST= 1024
##$WBSW= 4
##$XGAIN= (0..3)
0 0 0 0
##$XL= 0
##$YL= 0
##$YMAX_a= 624518
##$YMIN_a= -533076
##$ZGOPTNS= <>
##$ZL1= 120
##$ZL2= 120
##$ZL3= 120
##$ZL4= 120
##$ABSF1= 14.98509
##$ABSF2= -5.573092
##$ABSG= 5
##$ABSL= 3
##$ALPHA= 0
##$AQORDER= 0
##$ASSFAC= 0
##$ASSFACI= 0
##$ASSFACX= 0
##$ASSWID= 0
##$AUNMP= <proc_prof1d_extract_pilot.lims>
##$AXLEFT= 0
##$AXNAME= <>
##$AXNUC= <1H>
##$AXRIGHT= 0
##$AXTYPE= 0
##$AXUNIT= <>
##$AZFE= 0.1
##$AZFW= 0.1
##$BCFW= 0
##$BC_mod= 0
##$BYTORDP= 0
##$COROFFS= 0
##$CY= 15
##$DATMOD= 1
##$DC= 0
##$DFILT= <>
##$DTYPP= 0
##$F1P= 0
##$F2P= 0
##$FCOR= 0.5
##$FTSIZE= 32768
##$FT_mod= 6
##$GAMMA= 0
##$GB= 0
##$INTBC= 1
##$INTSCL= 1
##$ISEN= 128
##$LB= 0
##$LEV0= 0
##$LPBIN= 0
##$MAXI= 10000
##$MC2= 0
##$MEAN= 0
##$ME_mod= 0
##$MI= 0
##$NCOEF= 0
##$NC_proc= -8
##$NLEV= 6
##$NOISF1= 0
##$NOISF2= 0
##$NSP= 0
##$NTH_PI= 0
##$NZP= 0
##$OFFSET= 14.98509
##$PC= 1
##$PHC0= 97.56409
##$PHC1= 0
##$PH_mod= 1
##$PKNL= yes
##$PPARMOD= 0
##$PPDIAG= 0
##$PPIPTYP= 0
##$PPMPNUM= 2147483647
##$PPRESOL= 1
##$PSCAL= 4
##$PSIGN= 0
##$PYNMP= <proc.py>
##$REVERSE= no
##$SF= 400.02
##$SI= 32768
##$SIGF1= 0
##$SIGF2= 0
##$SINO= 400
##$SIOLD= 32768
##$SPECTYP= <>
##$SREGLST= <1H.CDCl3>
##$SSB= 0
##$STSI= 32768
##$STSR= 0
##$SW_p= 8223.68421052631
##$SYMM= 0
##$S_DEV= 0
##$TDeff= 65536
##$TDoff= 0
##$TI= <>
##$TILT= no
##$TM1= 0
##$TM2= 0
##$TOPLEV= 0
##$USERP1= <user>
##$USERP2= <user>
##$USERP3= <user>
##$USERP4= <user>
##$USERP5= <user>
##$WDW= 1
##$XDIM= 32768
##$YMAX_p= 472523558
##$YMIN_p= -708112
##$CURPLOT= <Network HP LaserJet P1505>
##$CURPRIN= <$Network HP LaserJet P1505>
##$DFORMAT= <normdp>
##$LAYOUT= <+/1D_H.xwp>
##$LFORMAT= <normlp>
##$PFORMAT= <normpl>
##$SURQMSG= 1
$$ End of Bruker specific parameters
$$ ---------------------------------
##NTUPLES= NMR SPECTRUM
##VAR_NAME=  FREQUENCY,     SPECTRUM/REAL,   SPECTRUM/IMAG
##SYMBOL=    X,             R,               I
##VAR_TYPE=  INDEPENDENT,   DEPENDENT,       DEPENDENT
##VAR_FORM=  AFFN,          ASDF,            ASDF
##VAR_DIM=   32768,         32768,           32768
##UNITS=     HZ,            ARBITRARY UNITS, ARBITRARY UNITS
##FACTOR=    0.250966925370066, 1,           1
##FIRST=     8223.43324360094, -242987,      -48643
##LAST=      0,             -73042,          -90949
##MIN=       0,             -708112,         0
##MAX=       8223.43324360094, 472523558,    0
$$ Real data points
##PAGE= N=1
##DATA TABLE= (X++(R..R)), XYDATA
$$ [...]
$$ plain form
19525 -93578 -113418 -277607 -114807 27408 -131702 -48733 -28285 318036 -287818 112552
19514 -45317 -39961 82787 -7833 -290093 -159490 122843 -63116 269443 -169460 -137834 30448
19502 -270383 -160763 -284275 5717 -19775 32727 -247671 -106951 -91997 -128484 -177154 -75727
19490 -54552 -149823 -72092 -111005 166023 -85134 -48641 -111306 -194992 -389360 -14919 101206
19478 158658 158050 -254181 -280205 182308 -282618 -129747 43350 -217418 146576 -102603
19467 -355073 -235681 159834 -482804 83362 -132530 -29097 -100280 18832 78272 128840 137716
19456 137716 82788 -245937 -100650 19838 202094 34304 -125449 15528 -506828 -92111
19445 -272573 -94525 -293129 -103791 -156143 76268 -216550 -154237 -98130 -109512 -122673 41639
$$ packed form
19525i3578j9840j64189a14807B7408a31702d8733K0448C18036b87818A12552
19514d5317N356H2787g833k82260J30603A22843f3116B69443a69460L1626C0448
19502b70383J09620j23512E717a9775C2727b47671a06951J4954l6487m8670g5727
19490e4552r5271g2092l8913A66023h5134L6493o2665q3686j94368a4919A01206
19478A58658o08b54181k6024A82308b82618a29747D3350b17418A46576a02603
19467c55073J19392A59834d82804H3362a32530b9097p1183A8832N9440N0568Q876
19456A37716n4928b45937a00650A9838J82256C4304a25449A5528e06828i2111
19445b72573i4525j98604a03791n2352G6268b16550O2313N6107j1382j3161D1639
$$ plain form
19433 23202 -130580 -204325 139008 -125312 -45248 -204522 -85518 25576 -122781 154775
19422 61265 -199805 -147402 46968 -136377 -135716 -49988 -202854 86179 28631 -103453 -139375
19411 -139375 -248165 54375 126849 -227005 -240538 118985 -405234 295840 -150464 2301
19400 -49776 -170137 -434767 171527 -122911 -2804 -122126 109589 -286972 -323064 295749
19389 218259 -46532 -298403 -21892 225404 -136171 162053 -181978 -157506 -299835 228477
19378 -107067 -286882 -227067 190693 169945 3875 117845 228751 31838 -371818 -31284 -396278
19367 -396278 57838 99287 185837 20153 33671 -346583 -206057 -312842 -283046 85998 174817
19356 174817 166639 285558 -119422 -53633 -15814 -467920 209929 61859 -119168 -274488
$$ packed form
19433B3202a30580p3745A39008a25312d5248j59274h5518B5576a22781A54775
19422F1265a99805N2403D6968a36377O61d9988j52866H6179B8631a03453l5922
19411a39375j08790E4375P2474b27005j3533A18985d05234B95840a50464B301
19400d9776j20361k64630A71527a22911b804j19322A09589b86972l6092B95749
19389B18259d6532k51871b1892B25404a36171A62053a81978K4472j42329B28477
19378a07067j79815N9815A90693k0748C875J13970J10906C1838c71818c1284l64994
19367c96278E7838M1449Q6550B0153J3518c46583J40526j06785K9796H5998Q8819
19356A74817q178J18919a19422e3633a5814m52106B09929F1859a19168j55320
$$ plain form
19346 -274488 94020 -226737 36832 158896 -8792 -9462 31664 -159159 81130 -216295 -261495
19335 -261495 -226209 331947 61045 -212564 -316812 -364320 -112890 104221 -304583 -145760
19324 -187837 32665 1793 -171638 -107460 153305 -11506 61981 39421 612108 35662 -208818
19312 146148 -393787 -8334 -114504 38218 -148378 -53610 119911 -138742 -149386 -292845
19302 -292845 -56250 -4393 -154009 -185060 213620 255691 48302 289110 -424215 -131431 -336727
19291 -336727 -204219 82690 -274275 -18493 193592 -18696 233475 -86861 324948 373959
19281 373959 -259861 82021 -183291 -243139 -258591 -253371 -104089 -298256 67404 55045 -172759
19269 -28264 -327540 160305 195566 93012 112767 -37785 -361609 -134417 -1618 11970 290348
$$ packed form
19346b74488I4020b26737C6832J22064h792o70C1664a59159H1130b16295m5200
19335b61495L5286C31947F1045b12564j04248m7508a12890A04221c04583a45760
19324a87837C2665A793a71638O4178A53305a1506F1981k2560N72687C5662b08818
19312A46148c93787h334j06170C8218a48378e3610A19911a38742j0644j43459
19302b92845e6250d393j49616l1051B13620M2071D8302K40808d24215a31431k05296
19291c36727J32508H2690b74275a8493A93592a8696B33475h6861C24948M9011
19281C73959b59861H2021a83291n9848j5452N220a04089j94167F7404j2359a72759
19269b8264k99276A60305L5261I3012J9755c7785l23824a34417a618A1970K78378
$$ plain form
19258 290348 34086 -192082 30606 -227357 100358 -206620 13798 -98614 -98421 61015 -62985
19246 -59132 -294274 -218149 -273433 -93119 96273 258944 51 8367 165408 -27412 -92790 30918
19233 -44071 -100029 -76780 373296 -36420 -247087 -92850 222473 190918 -68657 19812 123402
19222 123402 -402784 24921 101423 140792 -152323 232209 -350436 146125 -439533 -9581
19211 -6373 -95110 -63898 82890 6951 71438 -264460 196116 59651 -11234 4597 -55344 -348777
19199 -348777 -16939 29688 -71248 -145889 18231 -144374 -309380 424218 128554 -106799
19188 70988 -96022 -436318 -35015 -409883 -325962 -137290 156463 -477211 -187278 -363310
19178 -363310 231463 35759 224766 -136932 -276812 -198051 -93959 -53915 95671 286445
$$ packed form
19258B90348C4086a92082C0606b27357A00358b06620A3798i8614J93F1015f2985
19246e9132k35142P6125n5284i3119I6273J62671E1Q316J57041b7412o5378C0918
19233d4071n5958K3249C73296c6420k10667i2850B22473l1555f8657A9812J03590
19222A23402d02784B4921P6502L9369a52323B32209c50436A46125d39533i581
19211f373q8737L1212H2890F951O4487b64460A96116E9651a1234D597e5344k93433
19199c48777a6939B9688g1248p4641A8231a44374j65006D24218A28554a06799
19188G0988i6022l40296c5015l74868Q3921a37290A56463d77211a87278j76032
19178c63310B31463C5759J89007a36932j39880P8761i3959M0044I5671J90774
$$ plain form
19168 286445 -367579 16840 -300007 222951 -172768 13409 -24627 73503 -227321 60013
19157 -298743 147074 12409 -188877 -86799 -109113 -201924 -164266 -49470 222097 -182431 -31301
19145 -242764 274969 -227235 100863 -90664 221928 144111 -60736 134810 -276662 -80208
19134 378401 -258086 -142187 -76250 241628 -57295 -74367 -267024 -89909 104620 -189234
19123 137897 -102263 14921 177304 -94949 -203167 120299 -5355 -51095 64193 -130470 142538
19111 90208 153032 123163 103048 -111752 -235188 -182474 -7113 -122838 84004 -67383 -102370
19100 -102370 128824 -281259 131586 -36579 -43493 -272140 19501 -148054 44187 15708 26401
19089 26401 -240098 2120 213777 -270064 81600 86611 -27262 109904 -204974 301402 73024
$$ packed form
19168B86445c67579A6840c00007B22951a72768A3409b4627G3503b27321F0013
19157b98743A47074A2409a88877h6799k2314r2811L7658d9470B22097a82431c1301
19145b42764B74969b27235A00863i0664B21928p7817f0736A34810b76662h0208
19134C78401b58086J15899O5937B41628e7295j7072j92657h9909A04620a89234
19123A37897a02263A4921J62383i4949j08218A20299e355m5740F4193a30470A42538
19111I0208O2824k9869k0115a11752j23436N2714g113j15725H4004f7383l4987
19100a02370A28824b81259A31586c6579o914k28647A9501a48054D4187A5708J0693
19089B6401b40098B120K11657b70064H1600N011b7262A09904b04974C01402G3024
$$ plain form
19077 -614962 -74125 -226473 101869 204474 -231930 149282 -271409 -133967 201266 127837
19067 127837 -344245 -108661 -179704 -45802 -149726 10024 -188390 -10429 -59901 128788
19056 -132881 -210516 40249 -24957 64556 224946 161936 -243336 41584 -58834 -21020 -97420
19045 -97420 -85300 66298 -164527 -65636 67186 92399 49008 188456 33708 -283756 -209396
19034 -209396 -277423 -266218 -124380 71823 149467 235005 -46185 -90227 -154162 20738 -243262
19022 9523 289283 -219866 83234 174257 108727 -171887 125759 -210513 -365110 -141734
19011 -415716 251027 -80598 31875 148596 -3749 -55038 -8260 -154732 -212443 -269326 -65418
18999 117381 -104480 -153216 108889 -184211 111649 -107819 -54459 -194413 -109694 -29856
$$ packed form
19077f14962g4125j52348A01869J02605b31930A49282b71409a33967B01266p3429
19067A27837c44245a08661p1043d5802j03924A0024a88390a0429m9472A28788
19056a32881p7635D0249b4957F4556J60390o3010b43336D1584e8834b1020p6400
19045i7420J2120F6298a64527f5636F7186K5213m3391J39448C3708b83756P4360
19034b09396o8027J1205a24380G1823P7644Q5538d6185m4042o3935B0738b43262
19022I523K79760b19866H3234R1023o5530a71887A25759b10513j54597a41734
19011d15716B51027h0598C1875J16721c749n1289h260j46472n7711n6883f5418
18999A17381a04480m8736A08889a84211A11649a07819N3360j39954Q4719b9856
$$ plain form
18988 232639 79897 -175 -167281 -187315 -232507 -381764 -85066 -250311 62008 -283648 173580
18976 93273 -298406 -88854 7284 223740 25327 125950 -63226 101416 189798 109276 85416
18965 85416 48669 -230146 22768 -280637 83902 -205824 86288 299411 27829 -161159 6656
18953 33503 129356 66960 -25964 -194329 171116 -54084 -82202 -198975 126717 216696 -146927
18941 -113368 -102892 55708 -196026 163746 -170698 -311179 -59354 63639 19939 716 57837
18930 57837 295401 -64152 125870 19442 213939 -108789 -88903 129272 -192267 97182
18919 135973 -97550 -22699 -143406 292360 -59964 171144 65312 284978 118386 -8426 -293154
18908 -293154 -37865 122967 110286 132475 -217945 15433 -193782 252537 20028 -43976 104890
$$ packed form
18988B32639G9897a75j67106k0034m5192j49257h5066j65245F2008b83648A73580
18976I3273b98406h8854G284K16456B5327J00623f3226A01416Q8382q0522k3860
18965H5416l6747b30146B2768b80637H3902b05824H6288K13123B7829a61159F656
18953C3503R5853o2396b5964j68365A71116e4084k8118j16773A26717Q9979a46927
18941a13368J0476E5708a96026A63746a70698j40481e9354F3639A9939G16N7121
18930E7837K37564f4152A25870A9442J94497a08789J9886A29272a92267I7182
18919A35973i7550b2699j20707B92360e9964A71144F5312K19666A18386h426k84728
18908b93154c7865A22967j2681K2189b17945A5433a93782B52537B0028d3976A04890
$$ plain form
18896 41681 22429 -106024 -466284 -329605 -128459 -23234 40439 138391 -271226 117814
18885 17882 -171550 103713 -419691 -453173 362789 215835 118439 -11117 23143 -23152 130582
18873 341773 -119361 -230516 -194094 53559 -324733 158767 -211241 -53724 154780 44735
18862 -179272 129622 -379746 -92665 -59881 -199046 -110193 317057 67343 -198618 313057
18851 105476 -273723 -124753 169447 -376303 -92576 35564 -226139 -135420 186131 -41666
18840 -180642 -75448 126267 -336796 -99885 -131470 -135822 -65716 -193973 207111 156335 -160243
18828 -123276 150666 8731 119361 -201053 103670 -175702 -462028 -57439 22481 175836
18818 175836 261109 30847 224770 -58417 -347898 -209201 -80256 362370 73402 -31742 155577
$$ packed form
18896D1681j9252a06024l60260J36679a28459b3234D0439R7952b71226A17814
18885A7882a71550A03713d19691l3482C62789j46954r7396a1117B3143b3152A30582
18873C41773a19361j11155L6422E3559c24733A58767b11241e3724A54780D4735
18862a79272A29622c79746i2665L2784j39165Q8853C17057F7343a98618C13057
18851A05476b73723a24753A69447c76303i2576C5564b26139R0719A86131d1666
18840a80642g5448A26267c36796i9885l1585m352f5716j28257B07111n0776a60243
18828a23276A50666H731J10630b01053A03670a75702k86326e7439B2481J53355
18818A75836Q5273C0847J93923e8417k89481J38697h0256C62370G3402c1742A55577
$$ plain form
18806 -60987 74889 -278106 -98403 94557 2878 -316232 -121758 214565 111830 -195058 -328347
18795 -328347 -61569 118003 -40443 -46249 -138968 188089 98564 -269013 -219128 -3420 -84909
18784 -84909 -99911 -369526 85861 173462 -114590 -130807 89160 136338 -208367 108615 -375408
18772 12603 -99220 -54736 -954 -297007 -309764 -128709 -413756 -23493 -170549 145601 69075
18760 -391134 -116448 -115502 54883 -224942 -45951 -190630 -325514 39004 10535 22074 -103476
18748 182582 -179458 -69328 136653 -84830 456684 -62686 119322 -432538 87086 -36714
18737 -240156 -91048 -383233 -61016 161031 57856 -184895 -23875 182530 107046 236214
18727 236214 -231659 -40572 75067 177116 -63116 -13834 -54974 -104480 -228482 123873 -43517
$$ packed form
18806f0987G4889b78106i8403I4557B878c16232a21758B14565j02735a95058j33289
18795c28347f1569A18003d0443n806r2719A88089q9525b69013M9885c420q1489
18784h4909j5002k69615H5861Q7601a14590j6217H9160M7178b08367A08615c75408
18772A2603i9220M4484i54k96053j2757a28709k85047b3493j47056A45601F9075
18760c91134a16448R46E4883b24942d5951j44679j34884C9004A0535J1539a03476
18748A82582a79458f9328A36653h4830D56684f2686A19322d32538H7086c6714
18737b40156i1048k92185f1016A61031E7856a84895b3875A82530p5484J29168
18727B36214b31659d0572G5067J02049f3116a3834m1140m9506j24002A23873d3517
$$ plain form
18715 -103505 12004 63032 29979 -40422 27377 46349 -145930 -99295 -103806 23235 182881
18704 182881 -43508 -49887 -61819 -321093 -136405 227516 -497783 36750 78014 -181327 3648
18692 -1723 -42429 -124943 127901 -236518 54738 276509 230704 -69733 -102011 184204 249386
18681 249386 26690 -345389 -220642 97042 -197387 -128187 -183470 -120582 151313 20756 -156070
18669 114884 -113456 -289876 6986 -279266 144996 117239 -96549 220452 70635 -313551
18658 -189423 -242638 -104444 184317 -207632 -2004 144749 -248887 -46034 -454157 -67620
18647 -225348 263078 -72245 68231 -192049 77017 -18378 -521678 102863 294068 -140278
18636 -242588 182957 -110105 81564 -140546 92657 -136507 111906 -154425 -140685 -206270
$$ packed form
18715a03505A2004N1028B9979d0422B7377J8972a45930M6635m511B3235J59646
18704A82881d3508o379j1932k59274a36405B27516d97783C6750M1264a81327C648
18692a723m0706q2514A27901b36518E4738K21771m5805f9733l2278A84204O5182
18681B49386B6690c45389J24747I7042a97387O9200n5283O2888A51313B0756a56070
18669A14884a13456j76420F986b79266A44996k7757i6549B20452G0635c13551
18658a89423n3215a04444A84317b07632b004A44749b48887d6034m08123f7620
18647b25348B63078g2245F8231a92049G7017a8378n03300A02863J91205a40278
18636b42588A82957a10105H1564a40546I2657a36507A11906a54425J3740o5585
$$ plain form
18626 -206270 -167433 2184 -105991 136487 74334 -232650 170466 -359949 118866 -57905
18615 -132733 -236616 306039 304647 -129876 -9154 -186776 443 105562 231603 230621 -310079
18603 -33506 -477494 -298700 -397849 116151 151984 -136083 312449 -190233 293444 -2454
18592 -84618 114720 -212318 -119236 -209364 -125304 133755 101598 62177 209802 174352 -52242
18580 23043 -78283 -230281 245397 371740 -151856 113001 48553 -516809 -23842 -89853
18570 -89853 348288 -233319 -11646 -223240 403376 -70870 30502 -165452 -103266 169027
18559 -46710 -167408 122376 -299131 140062 210934 50049 -20111 -124730 165065 -32305
18548 54932 65427 -168010 -279135 -156677 165954 -186828 -183611 -135581 61862 -247054 -106303
$$ packed form
18626b06270L8837B184a05991A36487o2153b32650A70466c59949A18866e7905
18615a32733j03883C06039j392a29876i154j77622D43J05119J26041r82c10079
18603c3506m43988J78794r9149A16151L5833a36083C12449a90233B93444b454
18592h4618A14720b12318R3082r0128Q4060A33755l2157l9421J47625l5450e2242
18580B3043g8283j51998B45397J26343a51856A13001D8553e16809b3842o6011
18570h9853C48288b33319a1646k11594D03376g0870C0502a65452O2186A69027
18559d6710j20698A22376b99131A40062P0872E0049b0111j04619A65065c2305
18548E4932J0495a68010j11125J22458A65954a86828L217M8030F1862b47054a06303
$$ plain form
18536 -196590 -38563 -282674 -114615 -109356 -203908 -90020 -16955 -10486 -259926 -125598 -406648
18525 -406648 -40626 -159421 222036 168044 -122035 -118878 -157936 -365086 227380 -216162
18514 -268958 -95990 -472041 116191 -207720 -139613 224716 50240 -143971 -136196 13060 -240689
18502 -236721 -222337 199966 24342 -251606 -211879 -62806 -87863 80910 -207898 -171849 -132177
18491 -132177 -112651 -117133 -26807 -73850 -364947 124848 99596 477243 -272525 -71278 432787
18479 74808 -103473 -97225 101947 -332103 -207520 -391560 -226978 116231 -41719 -150785
18469 -150785 -153489 -112273 76315 184221 -257277 94200 306325 -95791 -225494 39381 -151355
18457 -256923 41237 551 349596 -68650 -175781 -215105 66624 -6052 447492 22751 119119
$$ packed form
18536a96590c8563k44111a14615N259r4552i0020a6955O469k49440a25598k81050
18525d06648d0626j18795B22036n3992a22035L157l9058k07150B27380b16162
18514b68958i5990l76051A16191b07720O8107B24716E0240a43971P775A3060b40689
18502b36721J4384A99966B4342b51606L9727f2806k5057H0910b07898L6049L9672
18491a32177J9526m482b6807m7043k91097A24848k5252L77647b72525g1278D32787
18479G4808a03473O248A01947c32103J24583j84040J64582A16231d1719j09066
18469a50785k704M1216G6315J07906b57277I4200K12125i5791j29703C9381a51355
18457b56923D1237E51L49045f8650j07131l9324F6624f052D47492B2751R6368
$$ plain form
18446 119119 -114905 149197 38483 180910 -399079 -112496 -65063 -238783 -213861 71042
18435 -85032 102022 -341323 -270339 -152763 -51835 -14035 -156888 -161105 -84421 -130942 -88403
18424 -88403 -437218 -10655 -116858 69648 197495 172430 -268304 -313811 -91116 15047 -69928
18412 -162505 -93627 198817 -76068 402597 62691 214760 -42223 -157505 28621 86468 -141721
18400 -48917 -108687 36360 -72092 77273 133103 88051 250647 26626 -251686 75639 53997
18389 53997 -20890 24970 167120 137257 118321 -112735 -17436 150306 -196238 -110256 -100470
18378 -100470 -204042 124981 -251028 -230724 -356126 37442 172334 139407 174398 54834
18367 -219523 60280 -26389 84042 150308 -223012 23042 96320 -267004 -115376 218207 -137229
$$ packed form
18446A19119a14905A49197C8483J42427c99079a12496M7433j73720K4922G1042
18435h5032A02022c41323P0984J17576e1835a4035j42853m217P6684m6521M2539
18424h8403l48815a0655j06203F9648J27847k5065b68304m5507i1116A5047f9928
18412a62505O8878A98817g6068D02597F2691J52069d2223j15282B8621N7847a41721
18400d8917n9770C6360g2092G7273N5830m5052J62596B6626b51686G5639k1642
18389E3997b0890B4970J42150k9863j8936a12735a7436A50306a96238Q5982R786
18378a00470j03572A24981b51028K0304j25402C7442J34892l2927L4991E4834
18367b19523F0280b6389H4042O6266b23012B3042P3278b67004a15376B18207a37229
$$ plain form
18355 131088 -36204 404114 -230815 -215966 61482 -226558 398774 -62213 212059 -104325
18344 -24395 -15524 -310195 148026 -198053 -193443 58203 -43148 -372544 -243712 95919 64563
18333 64563 -615707 41292 -180099 -23766 -77619 -59478 -22102 135635 -175779 -327344 -277392
18322 -277392 -157347 132609 28663 165124 -60981 -113325 -25649 98348 173653 -260706 102596
18310 2148 -138398 231799 38608 -26011 -119221 239027 -67556 -126473 76629 -255751 -61495
18298 -17816 236086 -57028 -61186 31123 -194634 316974 237918 128440 -246980 -247505 -39071
18286 -373154 -10921 12712 -269261 413076 4268 -111737 35133 293658 193611 -192505
18275 -226186 -90027 -119325 90804 128800 -308125 110827 -46179 -38366 148118 -126983 20449
$$ packed form
18355A31088c6204D04114b30815J4849F1482b26558C98774f2213B12059a04325
18344b4395Q871k94671A48026a98053M610E8203d3148l29396J28832I5919l1356
18333F4563f15707D1292a80099b3766n3853J8141b2102A35635a75779j51565M9952
18322b77392J20045A32609B8663J36461f0981n2344b5649I8348P5305b60706A02596
18310B148a38398B31799C8608b6011r3210B39027f7556n8917G6629b55751f1495
18298a7816B36086e7028m158C1123a94634C16974p9056j09478b46980n25c9071
18286c73154a0921A2712b69261D13076D268a11737C5133K58525j00047a92505
18275b26186i0027k9298I0804L7996c08125A10827d6179P813A48118a26983B0449
$$ plain form
18263 -378423 -34284 -335183 -179840 86479 -227359 -250004 -174791 -236318 251556 39997 -59994
18251 -67477 203728 -145551 -117890 -25181 27148 -347543 -135226 96960 -103269 -71697 -235625
18240 -235625 48276 -170966 268200 104171 396547 -37498 -30021 -284552 -164313 -10337
18229 -203970 -214449 195012 -123502 104412 -146122 229978 30787 -92865 264389 -39377
18218 108710 117432 -57637 -108142 -186465 223261 93229 -236358 110780 169875 146587 -14926
18206 -167615 156739 -82238 -67602 -248730 -369201 200843 -348700 -127877 -54998 -184580
18196 -184580 -258145 83390 221224 -218042 99854 85314 -229990 -196948 -74918 -58692 -422015
18185 -422015 55169 -175094 -292825 -49659 -97010 -121567 87943 -41815 -19178 223014 176195
$$ packed form
18263c78423c4284l00899J55343H6479b27359k2645P5213o1527B51556C9997e9994
18251f7477B03728a45551K7661b5181B7148c47543a35226I6960a03269L1572j63928
18240b35625D8276a70966B68200A04171K92376c7498P477k54531J20239a0337
18229b03970j0479A95012a23502A04412a46122B29978C0787i2865B64389c9377
18218A08710Q722e7637n0505p8323B23261I3229b36358A10780N9095k3288a4926
18206a67615A56739h2238J4636j81128j20471B00843c48700a27877e4998j29582
18196a84580p3565H3390J37834b18042I9854j4540b29990L3042g4918J6226l63323
18185d22015E5169a75094j17731d9659m7351k4557H7943d1815a9178B23014m6819
$$ plain form
18174 176195 -8086 240668 -11320 -185260 -101796 73957 111938 -400052 147103 110295 -6003
18162 -179138 7510 -172115 10222 21486 -108652 88859 37039 17699 -135156 29469 -217855
18150 -35605 310301 -12486 134456 82264 -275505 -185951 -4226 -191395 -218752 -45829 -72816
18139 -72816 -176630 92385 -249789 -346144 -18664 -144292 314175 268733 80067 -67913 -202337
18128 -202337 12251 -89349 107160 12244 -29445 -253410 -38726 -291079 109695 -241428
18117 93050 -124623 -276933 351352 -31595 196778 -227498 72007 215909 -147671 190180
18106 179592 -14224 -120145 -261092 444296 132725 1056 -7933 -232562 71601 -50103 -318740
18095 -318740 150192 -429110 -220815 -282032 86959 -223478 -10042 -123854 -201063 -114099
$$ packed form
18174A76195h086B40668a1320j73940Q3464G3957L7981d00052A47103l6808f003
18162a79138G510a72115A0222J1264a08652H8859C7039A7699a35156B9469b17855
18150c5605C10301a2486A34456n2192b75505Q9554d226j87169k7357d5829k6987
18139g2816j03814I2385b49789r6355a8664j25628C14175m5442H0067f7913j34424
18128b02337A2251h9349A07160A2244b9445k23965c8726k52353A09695b41428
18117I3050a24623j52310C51352c1595A96778b27498G2007J43902a47671A90180
18106A79592a4224j05921j40947D44296A32725A056g933k24629G1601e0103k68637
18095c18740A50192d29110K08295o1217H6959b23478a0042j13812p7209Q6964
$$ plain form
18085 -114099 -280181 78229 -24500 -218085 221653 -135729 360962 64534 207959 -141320
18074 -223775 -337348 67034 152994 80171 -40688 179978 225986 -198278 267883 -89883 81477
18062 -90918 -230899 156937 218665 111052 7704 66270 -261970 -176950 -233756 90511 33224
18050 45759 88305 239964 -400827 -136553 -1769 -24667 211635 -57408 337218 -2868 -102375
18039 -102375 79407 -68144 -419292 -368325 -248699 182729 -325946 85950 -135820 -171488
18029 -171488 -208641 -45034 35310 -75761 33599 91439 -80636 -80353 -176327 -138926 -135739 14324
18016 26737 99537 300559 -64767 99250 30058 -24871 -282537 8761 -195371 -2743 -103147
18005 -103147 -21834 51378 -163136 53277 -283383 331922 -134169 139001 4097 -71427 -335229
$$ packed form
18085a14099j66082G8229b4500j93585B21653a35729C60962F4534J43425a41320
18074b23775j13573F7034Q5960p2823d0688A79978M6008a98278B67883h9883H1477
18062i0918j39981A56937O1728j07613G704N8566b61970Q5020n6806I0511C3224
18050D5759M2546J51659d00827a36553a769k2898B11635e7408C37218b868r9507
18039a02375G9407f8144l51148N0967J19626A82729c25946H5950a35820l5668
18029a71488l7153d5034C5310g5761C3599N7840h0636K83r5974L7401L187A4324
18016B6737P2800K01022f4767I9250C0058b4871k57666H761a95371b743j00404
18005a03147b1834E1378a63136E3277b83383C31922a34169A39001D097g1427k63802
$$ plain form
17994 -335229 -258855 182273 -58154 63943 -260770 35876 115473 268850 -79806 99059 16112
17982 -239380 53715 -73861 -75910 -91727 41239 224452 -76757 103054 -71473 -365088 26578
17970 197455 -114965 51027 -240668 -17286 124331 113358 11410 -188717 -261531 -107713
17959 -42500 -52861 202362 121191 257796 -49709 -461283 18561 -217174 -142307 -87772 -179184
17948 -179184 -34118 -146200 60520 -241580 63463 178084 -21887 -70947 155765 -68 -90507
17937 -90507 59624 -154462 32385 1944 -208294 -2815 350411 51953 185542 -28922 -127122
17926 -127122 -200217 54085 -11250 -288957 -60277 53588 -192790 -11222 -232548 -350448 -36814
17914 -77764 -172169 -130939 96269 -88018 -39501 -51257 191297 384488 43818 -72469 -200115
$$ packed form
17994c35229P6374A82273e8154F3943b60770C5876P9597J53377g9806I9059A6112
17982b39380E3715g3861k049j5817D1239J83213g6757A03054g1473k93615B6578
17970A97455a14965E1027b40668a7286A24331j0973A1410a88717p2814a07713
17959d2500j0361B02362q1171J36605d9709m11574A8561b17174P4867N4535r1412
17948a79184c4118j12082F0520b41580F3463J14621b1887m9060A55765f8r0439
17937i0507E9624a54462C2385A944b08294b815C50411E1953J33589b8922r8200
17926a27122p3095E4085a1250k77707f0277E3588a92790a1222k21326j17900c6814
17914g7764r4405M1230I6269h8018c9501j1756A91297J93191D3818g2469j27646
$$ plain form
17903 -200115 -605 -330371 -101078 -62545 -334017 189016 -217253 68194 210966 -170642
17892 208364 -72468 -228841 160525 -90381 33207 59573 -128804 164443 17815 -137575
17881 221187 -282569 -91908 161220 166978 60942 254323 31179 8459 231174 120197 97804
17870 97804 -11475 66212 164882 -38473 225767 453920 -446668 56617 -86886 122450 80967
17859 80967 120688 26725 -26438 -226297 -4684 138337 354514 59023 310974 103085 133775
17848 133775 238887 190105 16447 -100039 -331380 147464 -498213 -121153 -158610 -126616
17838 -126616 -256488 -177020 92918 -42734 276836 -153535 -9320 156603 -371787 -79309 166284
17826 -263970 64987 203164 -3218 -336165 91422 166030 -108458 191070 52953 -168333 96900
$$ packed form
17903b00115f05l29766a01078L8533k71472A89016b17253F8194J42772a70642
17892B08364g2468j56373A60525i0381C3207K6366a28804A64443A7815a37575
17881B21187b82569i1908A61220N758F0942J93381C1179H459K22715j10977k2393
17870I7804a1475F6212R8670c8473B25767K28153d46668E6617h6886A22450m1483
17859H0967L9721B6725b6438j99859d684A38337K16177E9023K51951A03085L0690
17848A33775J05112m8782A6447a00039k31341A47464d98213a21153l7457L1994
17838a26616j29872P9468I2918d2734B76836a53535i320A56603c71787g9309A66284
17826b63970F4987J38177c218l32947I1422P4608a08458A91070E2953a68333I6900
$$ plain form
17814 -285673 75438 -138375 381974 -80786 -21478 -444195 145347 303198 430445 157727
17803 -46452 -136678 -214839 418796 117530 152009 109252 203140 -132421 102705 311120 47796
17791 72079 178991 30242 126979 -59133 48421 -292318 159336 -235246 -10035 -234742 249839
17779 13092 235044 -27388 339856 174834 -241626 55453 233572 -194968 -104318 -33136
17768 -268945 -75215 42590 367655 -137355 -408581 27413 -435390 -58795 126241 120567 -231364
17756 -121661 77531 311964 -67083 -126317 8993 -38783 221671 409146 -26016 84622 49620
17745 49620 -66767 -62017 -55452 2644 130280 -194058 70683 289831 78091 288278 72970
17733 -51784 -99197 356273 178930 -52918 143355 -146971 135858 -7054 261947 -136132
$$ packed form
17814b85673G5438a38375C81974h0786b1478m22717A45347J57851J27247A57727
17803d6452r0226p8161D18796A17530L4479m2757R3888a32421A02705K08415D7796
17791G2079J06912C0242R6737e9133D8421b92318A59336b35246a0035k24707B49839
17779A3092K21952b7388C39856j65022b41626E5453J78119a94968R0650c3136
17768b68945g5215D2590L25065a37355k71226B7413d35390e8795A26241n674b31364
17756a21661G7531K34433f7083n9234H993c8783B21671J87475b6016H4622l5002
17745D9620f6767M750O565B644J27636a94058G0683K19148G8091K10187G2970
17733e1784m7413C56273j77343e2918A43355a46971A35858g054B61947a36132
$$ plain form
17722 -81940 177937 -53715 160638 194801 -272182 -27118 71194 92214 -235575 -142221 12891
17710 159792 -54854 86990 138496 101920 138281 1718 84331 309212 -188520 -163847 -102909
17699 -102909 -219767 -61329 14863 -33418 147655 68208 -223979 -25499 -63902 138869 -14309
17687 -6316 130307 -53507 138759 91374 -109536 -56046 -84541 -80078 -32008 -14973 32656
17675 98991 142746 -44726 229001 131310 -211075 24625 -171488 314331 382357 327324 107090
17663 161923 156381 -369345 17859 -61264 -47566 119287 -56858 -360515 216398 263387 -110921
17651 198205 49250 244492 -357270 315387 95419 168915 -351410 238102 89013 -17875
17640 44798 -67403 -124816 259651 298820 -42392 -45446 -126798 -116126 -57922 176810 -208224
$$ packed form
17722h1940A77937e3715A60638L4163b72182b7118G1194K1020b35575R3354A2891
17710A59792e4854H6990N1506l6576L6361A718Q2613K24881a88520K4673O0938
17699a02909j16858f1329A4863c3418A47655F8208b23979b5499l8403A38869a4309
17687f316A30307e3507A38759m7385a09536N3490k8495M463c2008a4973C2656
17675I8991M3755d4726B29001r7691b11075B4625a71488C14331O8026n5033A07090
17663A61923n542c69345A7859f1264J3698A19287e6858l03657B16398M6989a10921
17651A98205D9250J95242c57270C15387I5419P3496c51410B38102H9013a7875
17640D4798f7403n7413B59651L9169d2392l054q1352J0672e7922A76810b08224
$$ plain form
17628 89748 -276999 -19438 221742 176387 -223081 14881 25726 -21240 142794 -149300 318720
17616 -317739 118646 -280318 -17816 101504 -51873 -41874 -95887 -202735 -159962 -79454 207752
17604 272337 -182912 21920 9910 -187763 -104146 98481 5809 168527 -209825 153318 114407
17593 114407 -61855 -23560 -140511 -160691 -279525 102311 190705 143536 -33691 92631 -134348
17581 116602 -250583 -128211 -105103 78337 328504 92782 223427 -10135 205231 62026
17570 248951 281051 -170761 -100750 -22000 69556 306612 87656 -123104 341119 44609 62167
17559 62167 -27565 -101720 79894 362745 38318 -86021 -279580 80923 122183 140416 251564
17548 251564 206273 -176381 232474 261219 155557 254877 165963 -96110 152642 423613
$$ packed form
17628H9748b76999a9438B21742m5355b23081A4881J0845b1240A42794a49300C18720
17616c17739A18646b80318a7816A01504e1873R999n4013j06848M2773g9454B07752
17604B72337a82912B1920I910a87763Q3617I8481E809J62718b09825A53318l8911
17593A14407f1855b3560j16951k0180j18834A02311Q8394m7169c3691I2631a34348
17581A16602b50583J22372K3108G8337K50167I2782J30645a0135B05231F2026
17570B48951L2100a70761P0011b2000F9556K37056H7656a23104C41119D4609J7558
17559F2167b7565p4155G9894K82851C8318h6021j93559H0923M1260J8233J11148
17548B51564m5291a76381B32474K8745j05662R9320q8914i6110A52642K70971
$$ plain form
17538 423613 67703 -174890 29972 -83007 -90470 -215571 -193328 -223804 -111485 -41077 -187162
17527 -187162 -55835 81891 -52946 224839 227979 415347 55931 22162 63977 22616 -33000
17515 -123896 -113491 -107948 516510 74732 270632 5129 -165988 13556 304170 146121 -68104
17503 359569 189538 -9670 -104662 -72251 303360 125112 177109 324839 -83582 15688 123740
17492 123740 -158196 424723 464715 169824 132030 21538 -201733 278881 -76392 -27978
17481 45868 -21045 -124757 76405 21371 16338 -36084 -28403 289371 -153853 80407 80870 134223
17469 134223 283634 267278 18613 -44207 83317 -249919 281371 -60656 -118316 15366 482610
17458 482610 260040 -56633 152064 -80162 143344 111850 445838 -9647 412476 -113804
$$ packed form
17538D23613F7703a74890B9972h3007p463j25101K2243l0476a11485d1077j46085
17527a87162e5835H1891e2946B24839L140J87368E5931B2162M1815B2616c3000
17515a23896J0405N543E16510G4732J95900E129a65988A3556K90614A46121f8104
17503C59569j70031i670r4992L2411C03360A25112N1997J47730h3582A5688J08052
17492A23740a58196D24723L9992A69824l7794B1538b01733B78881g6392b7978
17481D5868b1045j03712G6405B1371n033c6084P681B89371a53853H0407M63N3353
17469A34223J49411j6356A8613d4207H3317b49919B81371f0656n7660A5366M67244
17458D82610k22570e6633A52064h0162A43344l1494L33988i647D12476a13804
$$ plain form
17447 435144 484913 172357 308458 -81587 288336 461072 233686 450949 345234 194536
17437 194536 228948 285328 739525 463254 -76503 234102 462227 182388 90430 226634
17427 226634 219727 414386 333405 151895 148738 268562 602126 151291 8456 170240 311017
17416 311017 394299 139538 163806 292717 224318 -118623 144083 268018 91475 -207174
17405 122387 -132866 139297 -199122 177675 -58624 21268 260996 21890 64868 134232
17395 134232 75334 319047 195465 160870 167550 328940 246013 135842 359216 164443
17384 219309 -173238 -30925 148677 279438 195710 333495 161389 209254 196587 -307411
17373 204076 253871 443455 72566 267377 465042 197190 45752 288007 51749 217809
$$ packed form
17447D35144M9769A72357J36101h1587B88336J72736k27386K17263j05715j50698
17437A94536L4412N6380M54197k76271g6503B34102K28125A82388I0430J36204
17427B26634o907J94659q0981A51895l157J19824L33564A51291H456J61784J40777
17416C11017Q3282A39538K4268J28911o8399a18623A44083J23935I1475b07174
17405A22387a32866A39297a99122A77675e8624B1268K39728B1890M2978O9364
17395A34232n8898K43713j23582l4595O680J61390q2927j10171K23374A64443
17384B19309a73238c0925A48677J30761q3728J37785A61389M7865j2667c07411
17373B04076M9795J89584G2566J94811J97665A97190D5752K42255E1749J66060
$$ plain form
17363 217809 178432 111353 77560 -236851 -254712 41753 259731 -93761 -13123 166367 270442
17352 270442 179993 195818 148093 -111503 -193595 31531 47397 7445 -97841 144864 96996
17341 96996 -85508 -185719 259059 128704 186292 -218215 94518 107276 131001 268785 -50164
17329 -110611 55415 -7600 138768 137794 67915 480313 -89095 -117837 298318 19069 -65048
17317 -75395 -33183 105986 280479 -56410 478082 -123219 -29584 24493 96860 172017 91562
17306 91562 207595 104768 342869 80034 277899 482386 163321 -189431 33209 -27450
17295 163653 -107738 -125559 297851 343981 111233 157155 390498 163847 -6493 348559
17284 337270 133271 -6383 71473 67448 375310 63644 62832 44544 -96400 216186 -53691 359451
$$ packed form
17363B17809l9377o7079l3793b36851j7861D1753K17978i3761a3123A66367J04075
17352B70442r0449J5825m7725a11503q2092C1531J5866G445i7841A44864m7868
17341I6996h5508j00211B59059A28704N7588b18215I4518J2758K3725J37784e0164
17329a10611E5415g600A38768r74F7915M12398h9095k8742B98318A9069f5048
17317g5395c3183A05986J74493e6410D78082a23219b9584B4493P2367P5157q0455
17306I1562J16033j02827K38101H0034J97865K04487A63321a89431C3209b7450
17295A63653a07738j7821B97851M6130A11233M5922K33343A63847f493C48559
17284C37270A33271f383G1473m025L07862F3644q12j8288i6400B16186e3691C59451
$$ plain form
17271 235098 103498 49278 -39452 26602 230714 145527 150997 423020 80321 421774 55171
17259 -186125 116427 -183829 172018 -96283 477041 49214 23461 47432 101978 560418
17249 560418 189993 147200 369068 -184883 114271 157023 524757 276859 -55035 -198200
17239 -198200 279532 -42133 87268 344619 259065 127582 -261317 66882 89240 123674 207125
17228 207125 258945 198937 173773 131886 217414 -49317 50938 489709 252661 364009 -10365
17216 279057 470444 288801 205788 204812 251432 183475 120745 177696 -35201 -52707 76862
17204 194958 47158 62182 127793 144167 460423 -44037 402758 419287 592252 150966 144514
17193 144514 154832 220455 356818 617553 278591 205141 316480 108980 -30909 320797
$$ packed form
17271B35098A03498D9278c9452B6602K04112q5187N470K72023H0321L41453E5171
17259a86125A16427a83829A72018i6283D77041D9214B3461K3971N4546M58440
17249E60418A89993m2793K21868a84883A14271M2752L67734k47898e5035j43165
17239a98200B79532d2133H7268K57351q5554A27582b61317F6882K2358L4434Q3451
17228B07125N1820o0008k5164m1887Q5528d9317E0938M38771k37048J11348a0365
17216B79057J91387j81643q3013r76M6620o7957o2730N6951c5201j7506G6862
17204A94958D7158J5024O5611J6374L16256d4037D02758J6529J72965A50966o452
17193A44514J0318O5623J36363K60735B78591p3450J11339A08980c0909C20797
$$ plain form
17182 -16941 238789 262597 260860 228404 66674 801737 490249 393477 219543 311587 182651
17171 182651 61945 13114 425206 77648 302047 246700 257465 413280 139054 54595 585928
17160 585928 261655 -51724 328010 550372 347460 151136 484814 597523 499084 406313
17150 406313 242874 95888 341226 608239 342036 -27484 238386 176274 348076 261197
17140 261197 288123 221736 400763 241947 382582 211118 319760 50034 378993 448936
17130 448936 71661 469106 372695 307873 271079 272702 437460 304782 442847 832669 207165
17118 145290 326934 352088 433248 348921 291123 431679 479193 419509 343744 225079 157128
17107 157128 389846 370246 440217 436176 178928 415154 -49554 51582 262432 573811 419543
$$ packed form
17182a6941B38789K3808j737l2456F6674P35063l11488r6772j73934R2044j28936
17171A82651F1945A3114M12092G7648K24399n5347J0765J55815A39054E4595N31333
17160E85928B61655e1724C28010K22362k02912A51136L33678J12709r8439r2771
17150D06313j63439I5888K45338K67013k66203b7484B38386o2112J71802q6879
17140B61197K6926o6387J79027j58816J40635j71464J08642E0034L28959O9943
17130D48936G1661L97445r6411o4822l6794J623J64758j32678J38065L89822B07165
17118A45290J81644K5154Q1160q4327n7798J40556M7514n9684p5765j18665o7951
17107A57128K32718j9600O9971m041A78928K36226d9554E1582K10850L11379j54268
$$ plain form
17096 419543 346193 136180 320443 299183 291367 207479 410181 307157 449961 581696
17086 581696 486004 479131 429808 511206 289763 433729 574922 550994 204942 356054 631883
17075 631883 417419 366655 498692 439532 501850 601765 606426 348518 521722 527540 707223
17064 707223 688870 209118 487012 342850 617867 169957 554407 667565 1025916 475563
17053 356547 406729 336825 521828 425302 677504 359897 450122 835114 661354 260401
17042 382153 652262 593857 241623 633676 547554 939773 517565 688400 538153 828930
17032 828930 728190 446355 610519 403043 622795 609498 383778 551119 771099 501012
17022 501012 678304 752954 482289 84575 362832 871618 569229 838743 786737 748520
$$ packed form
17096D19543p3350A36180J84263k1260p816q3888K02702j03024J42804J31735
17086E81696r5692o873m9323Q1398k21443J43966J41193k3928B04942J51112K75829
17075F31883k14464n0764J32037n9160O2318R9915M661k57908J73204N818J79683
17064G07223j8353B09118K77894j44162K75017A69957L84450J13158L58351D75563
17053C56547N0182o9904J85003r6526K52202l17607R0225L84992j73760B60401
17042C82153K70109n8405B41623L92053q6122L92219m22208J70835j50247K90777
17032H28930j00740k81835J64164k07476K19752j3297k25720J67341K19980k70087
17022E01012J77292P4650k70665H4575K78257N08786l02389K69514n2006l8217
$$ plain form
17012 748520 748295 407236 541987 741039 571683 516085 959873 712390 859596 671125
17002 671125 667102 645565 620369 351335 542399 1052876 1018553 633018 758336 1094600
16992 1094600 656737 673490 1208982 785039 751998 315152 982413 736262 852995 775122
16982 775122 733267 627279 909992 625637 665595 814019 610811 731528 622581 859244
16972 859244 679893 982196 1045717 911863 887667 1029039 735875 930076 857932 1018695
16962 1018695 905590 837690 1226309 728359 1340103 859083 1143822 984806 1119195 910459
16952 910459 1211381 897719 1034571 1161586 1181922 1021336 999518 978417 1016455 1133978
16942 1133978 1212837 1269351 1102633 1114684 1142745 1136245 1073781 1217075 894862 1289025 865263
$$ packed form
17012G48520k25l41059J34751J99052j69356n5598M43788k47483J47206j88471
17002F71125m023k1537k5196k69034J91064N10477l4323l85535J25318L36264
16992A094600m37863J6753N35492m23943l3041C15152O67261k46151J16733p7873
16982G75122m1855j05988K82713k84355L9958J48424k03208J20717j08947K36663
16972H59244j79351L02303O3521j33854k4196J41372k93164J94201p2144J60763
16962A018695j13105o7900L88619m97950O11744m81020K84739j59016J34389k08736
16952I10459L00922l13662J36852J27015K0336j60586k1818k1101L8038J17523
16942A133978P8859N6514j66718J2051K8061o500o2464J43294l22213L94163m23762
$$ plain form
16931 865263 1004972 1293838 1178473 1342312 1487054 1399959 1555714 1231204 1235541 1709103
16921 1709103 1398406 1259213 1391906 1231652 1637298 1416222 1221854 1466768 1484862 1304005
16911 1304005 1248350 1400104 1367170 1649149 1246306 1664002 1841541 1868899 1636579 1634128
16901 1634128 1533983 1662308 1757686 1607552 1519338 1572335 1915024 1707001 1857507 1828585
16891 1828585 1843557 2177842 1510953 1903681 1972148 1665414 2429005 2174747 1961508 1753663
16881 1753663 1769351 2305121 2051747 2388549 2355843 2671809 2529846 2300153 2049256 2251627
16871 2251627 2671740 2698741 2368546 2230026 2344396 2675823 2806094 2640664 2668467 2483747
16861 2483747 2699206 2908249 2830884 2609134 2501616 3232193 3000294 3027025 2864594 2904180
$$ packed form
16931H65263J39709K88866j15365J63839J44742q7095J55755l24510M337M73562
16921A709103l10697j39193J32693j60254M05646k21076j94368K44914J8094j80857
16911A304005n5655J51754l2934K81979m02843M17696J77539K7358k32320k451
16901A634128j00145J28325R5378j50134q8214N2997L42689k08023J50506k8922
16891A828585J4972L34285o66889L92728O8467l06734P63591k54258k13239k07845
16881A753663J5688N35770k53374L36802l2706L15966j41963k29693k50897K02371
16871B251627M20113K7001l30195j38520J14370L31427J30271j65430K7803j84720
16861B483747K15459K09043p7365k21750j07518P30577k31899K6731j62431L9586
$$ plain form
16851 2904180 3219946 3043101 3063344 3438271 3360688 3341892 3639381 3253541 3706746 3539288
16841 3539288 3722028 3632280 3657691 4116178 3978682 4174475 4070443 4043345 4356371 3823854
16831 3823854 3989188 4296633 4323181 4634256 5152823 4641875 4499671 4804241 4954442 4943156
16821 4943156 5333434 5285802 5344097 5516918 5646018 5627273 5751937 5540452 6354055 6094229
16811 6094229 6376975 6242903 6570462 6971851 6877243 7068931 7136055 7074204 7298708 7441646
16801 7441646 7897477 7900126 8023860 8553223 8157873 8567190 8866107 9248405 9619295 9546358
16791 9546358 10105189 10405444 10073777 10758266 10910795 11550602 11586545 11649107 12592221 12639069
16781 12639069 12895040 13504474 13635067 14352773 14713170 15134514 15394152 16216401 16884605
$$ packed form
16851B904180L15766j76845K0243L74927p7583j8796K97489l85840M53205j67458
16841C539288J82740q9748K5411M58487j37496J95793j04032k7098L13026n32517
16831C823854J65334L07445K6548L11075N18567n10948j42204L04570J50201j1286
16821D943156L90278m7632N8295J72821J29100j8745J24664k11485Q13603k59826
16811F094229K82746j34072L27559M01389r4608J91688O7124o1851K24504J42938
16801G441646M55831K649J23734N29363l95350M09317K98917L82298L70890p2937
16791I546358N58831L00255l31667O84489J52529O39807L5943O2562R43114M6848
16781A2639069K55971O09434J30593P17706L60397M21344K59638Q22249O68204
$$ plain form
16772 16884605 17304102 17622182 18487957 19228641 19667700 20410614 21251821 22011965 22818972
16763 22818972 23544854 24710120 25498947 26479287 27382922 28571767 29985222 31227296 32900950
16754 32900950 34164129 35409832 37246124 38980944 40815097 43086852 45266763 47401549
16746 47401549 49742689 52547305 55077714 57971314 61394946 65017815 68490487 71897009
16738 71897009 75866109 80761160 85461237 90336516 95502577 100911780 106474915 112567009
16730 112567009 119085774 125282400 131891689 138453219 144792078 150861968 156887806 162172829
16722 162172829 167247399 171527275 175030607 177059556 178499323 178790923 177980524 175861169
16714 175861169 173160346 169072371 164517625 159194356 153268310 147158209 140705537 134183713
$$ packed form
16772A6884605M19497L18080Q65775P40684M39059P42914Q41207P60144Q07007
16763B2818972P25882J165266P88827R80340R03635J188845J413455J242074J673654
16754C2900950J263179J245703J836292J734820J834153K271755K179911K134786
16746D7401549K341140K804616K530409K893600L423632L622869L472672L406522
16738G1897009L969100M895051M700077M875279N166061N409203N563135O092094
16730A12567009O518765O196626O609289O561530O338859O069890O025838N285023
16722A62172829N074570M279876L503332K028949J439767K91600q10399k119355
16714A75861169k700823m087975m554746n323269n926046o110101o452672o521824
$$ plain form
16706 134183713 127306629 121225010 114765646 108791544 102745511 97143445 91769886 86965319
16698 86965319 82121474 77373578 72935348 69415921 65749064 61896621 58899264 55806107
16690 55806107 52680633 50299115 47761512 45407253 42934356 41004316 39385259 37377166
16682 37377166 35903258 34178286 32536733 30823849 29880025 28665955 27130571 26463185
16674 26463185 25182747 24442022 23248152 22649046 21740565 20684536 19891241 19174044 18625141
16665 18625141 17716675 17559526 16596109 16274644 15664669 15169786 14272924 14166245 13620633
16656 13620633 13312949 12964435 12292307 12103938 11773739 11546755 10736494 10964761 10439506
16647 10439506 10377940 9725977 9538161 9372412 9681022 9155443 8896618 8022643 8455153
$$ packed form
16706A34183713o877084o081619o459364n974102o046033n602066n373559m804567
16698H6965319m843845m747896m438230l519427l666857l852443k997357l093157
16690E5806107l125474k381518k537603k354259k472897j930040j619057k008093
16682C7377166j473908j724972j641553j712884r43824j214070j535384o67386
16674B6463185j280438p40725j193870n99106r08481j056029p93295p17197n48903
16665A8625141r08466j57149r63417l21465o09975m94883q96862j06679n45612
16656A3620633l07684l48514o72128j88369l30199k26984q10261K28267n25255
16647A0439506o1566o51963j87816j65749L08610n25579k58825q73975M32510
$$ plain form
16638 8455153 8076857 8041842 7813988 7527262 7391499 7181485 7246868 6955488 6499216 6622601
16628 6622601 6409300 6318799 6028636 5918610 5833427 5705567 5560575 5464033 5442290 5343921
16618 5343921 5128713 5061711 5074952 4858410 4833678 4541265 4637205 4751992 4478177 4113950
16608 4113950 4418098 4077062 4297522 4120238 3988578 4206372 4100106 3597468 3863905
16599 3863905 3909026 3582601 3648942 3502070 3586205 3001933 3364425 3158108 2956877 3116515
16589 3116515 3114464 2917137 3121573 3031836 2981460 2789729 2521413 2871217 2968426 2746674
16579 2746674 2476992 2379911 2816508 2519526 2551259 2449563 2663650 2324443 2319537 2496634
16569 2496634 2355689 2306675 2279385 2255160 2133063 2052226 2569159 1958299 2173001 1858398
$$ packed form
16638H455153l78296l5015k27854k86726j35763k10014O5383k91380m56272J23385
16628F622601k13301r0501k90163j10026q5183j27860j44992r6542k1743r8369
16618E343921k15208o7002J3241k16542k4732k92413R5940J14787k73815l64227
16608D113950L04148l41036K20460j77284j31660K17794j06266n02638K66437
16599C863905M5121l26425O6341j46872Q4135n84272L62492k06317k01231J59638
16589C116515k051j97327K04436q9737n0376j91731k68316L49804R7209k21752
16579B746674k69682r7081M36597k96982L1733j01696K14087l39207m906J77097
16569B496634j40945m9014k7290k4225j22097q0837N16933o10860K14702l14603
$$ plain form
16559 1858398 1858054 2100126 1598526 2016636 2311477 1855469 1795116 1841587 1786335 1686274
16549 1686274 1845753 1711867 1832429 1870115 1466241 1636959 1600010 1532524 1361816 1606989
16539 1606989 1571437 1410247 1750154 1525021 1298272 1464406 1429634 1321119 1370613 1627283
16529 1627283 1503159 1308983 1503691 1652152 1527077 1367359 1063520 1113939 1237921 1423040
16519 1423040 1393314 1108495 1095252 921801 1037860 1122124 1128175 1222052 1109400 1215014
16509 1215014 907400 1191211 1074692 1346906 1009386 1241018 962126 1343791 897976
16500 897976 1186816 1057005 984849 612610 784716 1015635 1022388 979291 1187206 743773
16490 743773 930762 825932 1130309 900906 1008062 1139074 917702 741923 866898 764668
$$ packed form
16559A858398l44K42072n01600M18110K94841m56008o0353M6471n5252j00061
16549A686274J59479j33886J20562L7686m03874J70718l6949o7486j70708K45173
16539A606989l5552j61190L39907k25133k26749J66134l4772j08515M9494K56670
16529A627283j24124j94176J94708J48461j25075j59718l03839N0419J23982J85119
16519A423040k9726k84819j3243j73451J16059Q4264O051R3877j12652J05614
16509A215014l07614K83811j16519K72214l37520K31632k78892L81665m45815
16500H97976K88840j29811p2156l72239J72106K30919O753m3097K07915m43433
16490G43773J86989j04830L04377k29403J07156J31012k21372j75779J24975j02230
$$ plain form
16480 764668 1074695 534031 663900 891867 739662 519711 752154 944006 860566 826646
16470 826646 933948 694356 790136 689540 713089 613874 666598 689424 714465 536871 615458
16459 615458 668143 719096 823739 537959 629082 508988 224952 853323 912517 704399
16449 704399 186589 363615 896049 855988 618938 858993 595304 551641 505589 586381
16439 586381 450323 509348 540685 644047 631703 326559 545847 354902 355119 153632 402856
16428 402856 344625 305143 665850 447512 291140 434124 568723 268913 246915 1030135
16418 1030135 210865 369168 350073 306436 262638 718687 118694 438291 440881 550837
16408 550837 458702 168165 292936 518520 826021 399944 328813 453064 337481 545616
$$ packed form
16480G64668L10027E34031J29869K27967j52205k19951K32443J91852q3440l3920
16470H26646J07302k39592R5780j00596K3549r9215N2724K2826K5041j77594P8587
16459F15458N2685N0953J04643k85780R1123j20094B24952O28371N9194k08118
16449G04399A86589J77026N32434m0061k37050K40055k63689m3663m6052Q0792
16439E86381j36058N9025L1337J03362j2344l05144K19288j90945K17A53632K49224
16428D02856n8231l9482L60707k18338j56372J42984J34599B68913k1998P83220
16418A030135B10865J58303j9095m3637m3798M56049A18694L19597K590J09956
16408E50837r2135A68165J24771K25584L07501C99944p1131J24251j15583K08135
$$ plain form
16398 545616 571073 806789 315184 448961 551756 347991 447984 274834 349135 394402
16388 394402 496610 309890 230793 393436 332158 426004 283524 230299 398635 450337
16378 450337 139857 261652 587004 175119 504217 369931 495500 345897 293326 57871
16367 310795 375138 170265 320135 153957 226346 219020 129699 597351 194140 198658 483151
16356 483151 166801 233778 175503 542144 622385 742574 406282 325200 297588 196686
16346 196686 503618 566207 366581 346795 431012 292502 53927 670509 315974 343686
16336 343686 496933 72705 520314 191684 14645 350964 192102 66912 -2949 347345
16325 393180 176274 419842 -92683 155986 437362 -97506 405507 689527 28803 85120
$$ packed form
16398E45616K5457K35716C15184J33777J02795k03765R9993j73150P4301M5267
16388C94402J02208j86720p9097J62643o1278R3846j42480n3225J68336N1702
16378D50337A39857J21795L25352A75119L29098j34286J25569j49603n2571E7871
16367C10795O4343A70265J49870A53957P2389p326q9321M67652A94140M518K84493
16356D83151A66801O6977n8275L66641Q0241J20189l36292q1082k7612j00902
16346A96686L06932O2589j99626j9786Q4217j38510E3927O16582C15974K7712
16336C43686J53247G2705M47609A91684A4645L36319j58862F6912b949C47345
16325C93180A76274K43568i2683A55986K81376i7506D05507K84020B8803N6317
$$ plain form
16315 85120 200565 120692 66010 -13925 282150 231173 364600 188309 192578 160788 315253
16304 315253 404564 280707 340990 478108 117051 444184 95030 343359 231320 275444
16294 275444 212515 39847 259810 74122 205744 78365 363854 -93427 -81371 327003 396615
16283 396615 393865 -418897 170797 284677 54234 443331 170253 297444 -62164 183244
16272 323233 334540 137614 -148166 -1691 97961 253008 372357 77142 193229 57161 71698
16261 71698 272137 28285 35389 260729 361475 78683 228851 289570 239187 342830 341183
16250 341183 104900 135095 408551 119491 28226 232927 104730 -106200 357255 -118972
16239 207824 207276 82087 158636 98572 -161038 70030 90376 -151574 60513 123919 296263
$$ packed form
16315H5120J15445p9873n4682a3925B82150n0977J33427j76291M269l1790J54465
16304C15253Q9311j23857O0283J37118A17051L27133I5030K48329j12039M4124
16294B75444o2929C9847K19963G4122J31622G8365K85489i3427J2056C27003O9612
16283C96615k750d18897A70797J13880E4234L89097A70253J27191f2164A83244
16272C23233J1307A37614a48166a691I7961J55047J19349G7142J16087E7161J4537
16261G1698K00439B8285P104K25340J00746G8683J50168O0719n0383J03643j647
16250C41183A04900L0195K73456A19491B8226K04701A04730a06200C57255a18972
16239B07824n48H2087P6549o0064a61038G0030K0346a51574F0513O3406J72344
$$ plain form
16228 296263 152385 118566 59221 -91706 289151 -30352 362378 -47532 88262 -137507 9858
16216 -130199 -12114 48999 -89675 242086 106346 -89235 -183179 93914 416991 -209550 -159596
16205 -159596 70087 -261315 -27975 16945 184438 -244286 -12285 178736 177779 369007 37886
16193 55547 67386 -112603 95714 295822 228307 199873 90611 64014 174331 98857 204259
16182 204259 5890 199974 158567 321973 143805 171989 397372 -44040 35180 -296937 -94228
16170 -78238 191073 -136720 298868 288279 294548 -5546 -71892 -145897 415007 138216 35438
16158 -134123 -240998 -70141 188378 112455 238834 -264708 -293700 184103 -43010 -59756
16148 -59756 40919 30773 74097 103473 314556 -360871 -297314 273393 6115 -118509 -146383
$$ packed form
16228B96263j43878l3819E9221i1706B89151c0352C62378d7532H8262a37507I858
16216a30199a2114D8999h9675B42086A06346h9235r3944I3914L23077b09550M9954
16205a59596G0087b61315b7975A6945J67493b44286a2285A78736r57J91228C7886
16193E5547J1839a12603I5714K00108o7515k8434I0611k6597J10317p5474J05402
16182B04259E890J94084m1407J63406A43805K8184K25383d4040C5180b96937i4228
16170g8238A91073a36720B98868j0589O269e546o6346p4005D15007A38216C5438
16158a34123j06875g0141A88378p5923J26379b64708k8992A84103d3010j6746
16148e9756D0919j0146M3324K9376K11083c60871O3557B73393F115a18509k7874
$$ plain form
16137 -146383 -24113 87505 54903 472404 51258 -53022 187384 -72348 98309 -32580 36883
16125 384317 184326 -263903 158877 138307 220520 171178 -82505 98079 217596 21991 -10552
16113 -26370 296236 154151 -100761 167797 143093 92788 -247941 -92094 -92140 124523 106295
16102 106295 -62391 69624 176992 359170 265255 -88979 150959 155781 30146 265243 131595
16090 -58807 87745 39904 24517 -64104 64026 247269 -233383 138679 217875 -356364 13277
16078 -85585 -231336 299871 -216260 -10720 -228766 -168823 390352 -50465 -2093 142130 192423
16067 192423 115317 55353 60256 139278 -161688 118284 -39113 -147665 205129 273074 -246974
16055 367330 -182736 -230323 -31836 -16530 -87202 8277 -79186 -16634 -191388 219111 -280145
$$ packed form
16137a46383b4113H7505l2602M17501E1258e3022A87384g2348I8309c2580C6883
16125C84317A84326b63903A58877k0570Q2213m9342h2505I8079J19517B1991a0552
16113b6370B96236j42085a00761A67797k4704n0305b47941i2094m6A24523j8228
16102A06295f2391F9624J07368J82178r3915h8979A50959M822C0146K35097A31595
16090e8807H7745C9904j5387f4104F4026J83243b33383A38679P9196c56364A3277
16078h5585j45751B99871b16260a0720k18046N9943C90352e0465b093A42130N0293
16067A92423p7106E5353M903P9022a61688A18284c9113j08552B05129O7945b46974
16055C67330a82736m7587c1836J5306p0672H277g9186a6634j74754B19111b80145
$$ plain form
16043 -38252 143853 -170749 -15085 169217 286566 -74688 186570 153234 93021 -42323 274866
16031 -116915 -225315 15581 -284 38109 -9899 34219 129687 -324842 -21554 54501 -240499
16019 -127688 -157345 198347 -42481 -127004 57035 227644 -293338 -146231 -219505 -237809 213098
16007 -125637 38381 21434 -107788 294772 -222734 -56251 50809 -78399 -70483 -116346 69514
15995 -74774 -17487 -93710 -144794 -274351 -248569 -112397 26166 2934 -85374 305494 92505
15983 -55437 -74684 428034 205634 -15044 -130812 15396 -267254 -85902 5068 89469 -209877
15971 -118040 -6905 -151723 253694 252032 -81777 176100 -44896 -147098 192779 -137752 544
15959 42363 41675 65619 79717 -167216 -41703 -177339 14127 46739 -72177 -98252 -117872 -272298
$$ packed form
16043c8252A43853a70749a5085A69217J17349g4688A86570l3336o0213d2323B74866
16031a16915j08400A5581b84C8109i899C4219R5468c24842b1554E4501b40499
16019a27688k9657A98347d2481q4523E7035J70609b93338a46231p3274j8304B13098
16007a25637C8381j6947a07788B94772b22734e6251E0809g8399P916m5863F9514
15995g4774a7487p6223n1084j29557K5782a12397B6166B934h5374C05494I2505
15983e5437j9247D28034B05634a5044j15768A5396b67254h5902E068Q4401b09877
15971a18040f905j44818B53694j662h1777A76100d4896j02202A92779a37752E44
15959D2363o88K3944J4098a67216d1703j35636A4127L2612g2177k6075j9620j54426
$$ plain form
15947 -272298 -201231 -121888 -76487 172512 -206277 -322610 -269251 -25935 -187375 139890
15936 -227442 -42744 -170688 -144739 -332306 43647 10630 -173835 -2226 79814 200305 14996
15924 124003 -386204 -153232 100671 16224 -96162 328304 -90170 -198585 96419 -313413
15913 -124233 -320237 42843 -85959 119351 122421 -305220 167555 -214703 -372277 -15309
15902 108049 -5798 -129012 -199760 -148810 -10679 15726 194764 -96768 -249160 14851 299287
15891 299287 229702 -81292 49659 -74674 49330 194693 -179556 150474 135115 21090 135077
15880 135077 211244 -336891 -107855 -29871 146509 102552 -214434 -87432 99652 -100654
15869 -98057 -41341 -141049 159691 -4795 -373737 62179 2400 -131960 27747 -446732 -258434
$$ packed form
15947b72298P1067P9343M5401A72512b06277j16333N3359b5935j61440A39890
15936b27442d2744j27944K5949j87567D3647A0630a73835b226G9814J20491A4996
15924A24003c86204a53232A00671A6224i6162C28304i0170j08415I6419c13413
15913a24233j96004D2843h5959A19351L070c05220A67555b14703j57574a5309
15902A08049e798j23214p0748N0950a0679A5726J79038i6768j52392A4851K84436
15891B99287o9585h1292D9659g4674D9330J45363a79556A50474j5359B1090J13987
15880A35077P6167c36891a07855b9871A46509m3957b14434h7432I9652a00654
15869i8057d1341r9708A59691d795l68942F2179B400a31960B7747d46732J88298
$$ plain form
15858 -258434 -23564 -296282 -187530 284987 11185 395303 56658 -114595 -274292 111240
15847 -35584 170852 -95760 -130199 13661 -40578 26527 44913 -143676 93455 -58025 31688
15835 -154635 110334 -148312 209801 27901 -102006 41239 24292 317828 -298063 -142155
15824 -176555 95546 -222528 -461816 -109520 260278 -239031 -108563 -160678 41823 -237791
15813 93319 -19446 -172024 -39394 119269 341207 7561 -107704 -30085 255738 -57434 280321
15801 -27052 -98342 -320208 30932 49839 74992 -26248 -217547 222503 109909 -69784 11352
15789 27713 162750 -82651 61822 148443 -61913 -212921 -47943 -33985 281809 264380 52457
15777 -117249 86212 -214012 -183416 -108376 -259861 -356717 79924 -232028 -69037 -72506 117675
$$ packed form
15858b58434b3564k72718J08752B84987A1185L84118E6658a14595j59697A11240
15847c5584A70852i5760l4439A3661d0578B6527J8386a43676I3455e8025C1688
15835a54635A10334a48312B09801B7901a02006D1239j6947K93536b98063a42155
15824a76555I5546b22528k39288a09520B60278b39031a08563n2115D1823b37791
15813I3319a9446j52578c9394A19269K21938G561a07704c0085B55738e7434B80321
15801b7052p1290k21866C0932J8907K5153b6248j91299B22503A09909f9784A1352
15789B7713J35037h2651F1822Q6621f1913j51008d7943J3958B81809j7429E2457
15777a17249H6212b14012L0596P5040j51485r6856G9924b32028f9037l469A17675
$$ plain form
15765 -29969 -252254 61406 276948 55516 -473377 -30356 -27775 301165 140973 281230 -312353
15753 19771 338172 -100202 34956 232209 99787 -164593 60721 20261 64907 -78383 426564
15741 111512 -213795 212555 -305315 -198741 180048 146732 164046 -334676 239183 -100524
15730 8471 -168154 -19895 167716 157125 -310248 -16291 -260317 -133948 -7388 135123 -46904
15718 200473 35328 -318611 -83581 -228445 -188308 107726 -283156 10865 -99320 -95965 -329539
15707 -329539 -6212 29284 93680 -754 -69176 -53080 4213 -371869 -86783 40435 354445 98003
15694 -31343 -174059 -33952 31984 -73135 314399 -56025 -101900 -92792 -157896 -116812 -314647
15683 -314647 -41358 -55779 -169786 -69337 -364848 -4164 -146384 -9423 30235 151583 303608
$$ packed form
15765b9969k22285F1406K15542E5516d73377c0356K581C01165A40973J40257c12353
15753A9771L18401a00202C4956J97253I9787a64593F0721B0261M4646g8383D26564
15741A11512b13795B12555c05315J06574A80048l3316J7314c34676B39183a00524
15730H471a68154a9895A67716j0591c10248a6291k44026J26369g388A35123d6904
15718B00473C5328c18611h3581j44864M0137A07726b83156A0865i9320L355k33574
15707c29539f212B9284O4396g54o8422J6096D213c71869h6783D0435L14010I8003
15694c1343j42716c3952C1984g3135C14399e6025m5875R108o5104M1084j97835
15683c14647d1358j4421j14007f9337k95511d164j42220i423C0235J21348J52025
$$ plain form
15672 303608 67453 -15915 -168174 -307652 162869 183004 541 -104148 -84443 -11144 -17664
15661 -17664 -346675 155452 344766 151445 -268867 20773 -103107 35947 -220338 -156151
15651 -156151 -118390 -80976 -120201 -130278 -792 211318 -109873 -64103 -299492 -137424 -90382
15640 -90382 -48209 44357 -204533 -11352 -159961 60264 -181518 86583 16061 -21920 -364340
15629 -364340 -196646 -374003 318693 29801 380839 -264037 49635 -167664 93311 91357
15619 91357 297932 283493 -46937 214448 198490 -16757 -32726 -148281 -231390 124650 -16399
15607 128005 257465 251060 -376118 -114315 -246203 -27206 86680 -50854 -86202 -21896 -509672
15596 -509672 -269310 94240 -130900 236545 -242522 -165113 123887 116369 214999 296370 -43686
$$ packed form
15672C03608F7453a5915j52259j39478A62869K0135E41a04148J9705a1144o520
15661a7664l29011A55452J89314A51445b68867B0773a03107C5947b20338O4187
15651a56151L7761L7414l9225j0077g92B11318a09873M5770k35389a37424M7042
15640i0382M2173D4357b04533a1352j48609F0264a81518H6583A6061b1920l42420
15629c64340J67694j77357C18693B9801L51038b64037D9635a67664I3311j954
15619I1357K06575j4439d6937B14448j5958a6757j5969j15555q3109A24650a6399
15607A28005J29460o405c76118a14315j31888b7206H6680e0854l5348b1896m87776
15596e09672K40362I4240a30900B36545b42522P7409A23887p518R8630Q1371d3686
$$ plain form
15584 -15860 31789 37571 221089 -112372 117041 27163 -216503 20688 107368 -65613 118868
15572 178950 10955 -276504 17811 -17285 12021 -18373 -111792 -86573 -41345 -39884 -114181
15561 -114181 86245 -47117 -259814 197102 -59477 15041 -50121 262089 76879 -364592 9972
15549 -124568 -137252 -109196 8371 119529 -147858 50148 -175760 -227864 31594 103280 226872
15538 226872 -165408 615 88586 232547 132005 3575 -177359 36029 19877 329952 -222730
15526 -279145 81840 -97965 193402 139016 -84298 272708 -194785 -8434 102994 -270551 -148151
15515 -148151 36263 241646 213482 -94759 -193108 166822 -233612 -118110 -107946 -148435 34662
15503 58632 317818 190694 8872 -62287 -54098 -18263 -203344 142179 -73603 87818 -87756
$$ packed form
15584a5860C1789N782J83518a12372A17041B7163b16503B0688Q6680f5613A18868
15572A78950A0955b76504A7811a7285A2021a8373r3419K5219d1345J461p4297
15561a14181H6245d7117k12697A97102e9477A5041e0121B62089G6879c64592I972
15549a24568j2684K8056H371J11158a47858E0148a75760n2104C1594P1686J23592
15538B26872a65408F15Q7971J43961j00542C575a77359C6029j6152L10075b22730
15526b79145H1840i7965A93402n4386h4298B72708a94785h434A02994b70551J22400
15515a48151C6263K05383k8164i4759r8349A66822b33612J15502J0164m0489C4662
15503E8632K59186j27124H872f2287Q189a8263j85081A42179g3603H7818h7756
$$ plain form
15491 -26272 -159510 129372 -31328 -44847 -139112 -36083 124669 -134437 -338357 221396
15480 415727 -7912 -77170 -266559 -87654 -71681 113970 -167151 -69945 -38668 -237628 -23131
15468 71750 123023 -84174 -155751 82394 904 33276 -15924 273724 147091 11948 -47470 120857
15455 39615 -258 235258 171632 -244586 18728 169118 -119695 -188475 -183474 88347 42705
15443 -127734 -208576 4367 -112596 95086 -176536 -191668 -135986 -217672 86256 123106 -293745
15431 195294 486782 178356 -159183 11417 155577 128353 -103370 -94091 248295 -145285
15420 50585 141491 -7986 -124271 -32977 275657 27793 -65172 -26279 -2381 -20662 71579 200210
15408 200210 50952 -117079 -242939 -279698 -32985 -122671 -290650 -102751 187134 179628 53585
$$ packed form
15491b6272j33238A29372c1328j3519r4265c6083A24669a34437k03920B21396
15480D15727g912o9258j89389h7654J5973A13970a67151f9945L1277j98960b3131
15468G1750N1273h4174p1577H2394I04L2372a5924B73724j26633A1948d7470A20857
15455C9615b58B35258o3626b44586A8728J50390a19695o8780N001H8347D2705
15443a27734q0842D367a12596I5086a76536j5132N5682q1686H6256L6850b93745
15431A95294K91488A78356a59183A1417J44160k7224a03370R279B48295a45285
15420E0585R0906g986j16285c2977B75657B7793f5172b6279b381j8281G1579J28631
15408B00210E0952a17079j25860l6759c2985q9686j67979a02751A87134p506E3585
$$ plain form
15396 12767 -140419 198152 -1627 -44429 -13057 103747 -42580 165905 -124049 -19883 -150650
15385 -150650 -122547 215404 281183 -305810 316781 326094 -127474 180203 56410 -380438
15374 -93913 -98011 45277 237639 41917 -23079 36003 6377 -55909 183771 -38732 -93495 -164772
15362 -164772 226640 70691 -53886 -41531 -192477 28181 324391 -57937 -128176 326879 288956
15351 288956 -165830 103892 120613 115686 259836 -2559 37170 -107347 252327 167630 30985
15339 91455 -145040 -220584 -64159 -63548 -6298 113819 334526 199883 474918 -55009 -42948
15328 -42948 54392 -177286 -26543 16592 -273927 10816 -342467 26030 -42273 -103482 -133322
15317 -133322 -283534 -122120 -158651 42708 -26310 -270342 316408 -124447 -149910 218563
$$ packed form
15396A2767a40419A98152a627m2802a3057A03747d2580A65905a24049a9883j30767
15385a50650K8103B15404O5779c05810C16781R313a27474A80203E6410c80438
15374i3913m098D5277J92362D1917b3079C6003F377e5909A83771c8732n4763p1277
15362a64772B26640G0691e3886J2355j50946B8181K96210e7937p0239C26879l7923
15351B88956a65830A03892J6721m927J44150b559C7170a07347B52327q4697C0985
15339I1455a45040p5544f4159O11f298A13819K20707j34643K75035e5009J2061
15328d2948E4392a77286b6543A6592b73927A0816c42467B6030d2273o1209k9840
15317a33322j50212a22120l6531D2708b6310k44032C16408a24447k5463B18563
$$ plain form
15306 131114 -164860 34898 129122 101423 70037 22009 157891 -83134 156613 -129056 422060
15294 -23972 216 84863 -201822 -235666 307214 84859 -192280 61727 127250 48265 315498
15283 315498 196995 20786 258134 -448415 135014 80502 -118141 -17886 -230425 54514
15272 281786 -33455 916 121706 218663 345820 127685 264717 219449 11453 240242 -18015
15260 -87568 20070 229173 -76949 171718 15177 168248 110382 47305 -71205 474630 483306
15249 483306 1499056 1193218 1032131 1480218 687183 362785 364099 170664 84287 110734
15239 110734 -153585 20863 231993 -187818 96211 84939 -92802 -34534 158979 202128 99804
15227 80552 144622 194577 277601 -201125 259148 206998 357600 -268199 5609 -93624 95762
$$ packed form
15306A31114a64860C4898R4224k7699l1386B2009J35882h3134A56613a29056D22060
15294b3972B16Q4647b01822l3844C07214H4859a92280F1727O5523D8265K67233
15283C15498j18503B0786K37348d48415A35014n4512a18141a7886k12539E4514
15272B81786c3455I16J20790R6957J27157A27685J37032m5268A1453K28789a8015
15260h7568B0070K09103g6949A71718A5177J53071n7866D7305g1205D74630Q676
15249D83306J015750l05838j61087M48087F87183l24398J314A70664H4287K6447
15239A10734a53585B0863K11130a87818I6211j1272i2802c4534A58979M3149I9804
15227H0552O4070M9955Q3024b01125B59148n2150J50602b68199E609i3624I5762
$$ plain form
15215 42703 -43255 101321 106064 79305 53423 -68006 -110087 193729 150464 42881 175095
15204 175095 128027 140317 140460 149648 38209 80601 55920 -76784 181802 517909 -337105
15192 -17177 -131809 211881 -135336 -196929 31909 153504 7647 -4681 12543 -169879 -180376
15181 -180376 -28408 54118 -338053 67954 417361 -67685 4180 259435 265965 413613 -129259
15169 163899 73685 330658 -41504 -177035 73968 -21738 66952 117972 26732 -20028 133834
15157 52924 357612 67583 113501 52035 176636 -12296 -34652 182855 132925 -151629 -208224
15146 -208224 364317 -119063 4167 71897 -181193 392011 374119 168883 -38373 -87820 119457
15134 49595 175373 -179354 127396 135475 66583 90517 -121150 75004 61044 101031 -43749
$$ packed form
15215D2703d3255A01321M743k6759k5882f8006m2081A93729m3265D2881J32214
15204A75095m7068J2290J43R188C8209M2392k4681g6784A81802L36107c37105
15192a7177j14632B11881a35336o1593C1909J21595G647d681A2543a69879j0497
15181a80376b8408E4118c38053F7954L49407f7685D180K55255O530J47648a29259
15169A63899G3685K56973d1504j35531G3968b1738F6952N1020B6732b0028A33834
15157E2924L04688F7583M5918E2035J24601a2296k2356A82855m9930a51629n6595
15146b08224C64317a19063D167O7730a81193C92011j7892A68883c8373m9447A19457
15134D9595J25778a79354A27396Q079F6583K3934a21150G5004j3960L9987d3749
$$ plain form
15122 70757 -140870 -82758 118861 197025 3936 -239629 305494 -242602 26545 121870 242973
15111 242973 -62440 -11034 -109483 38667 -160027 87173 82217 -289420 -47316 267790 326216
15100 326216 25392 260251 352148 303188 147213 251201 219373 202057 184659 -57106 127977
15088 239835 156354 155715 -4984 223141 34890 512641 259727 149569 365567 140781 171645
15077 171645 130548 137783 -42298 144172 356085 -74129 45829 289538 143843 42555 47018
15066 47018 113274 299953 -74842 256238 159251 343360 6449 123929 153286 119219 44646
15054 297690 284667 283295 182693 89329 166158 4622 -18874 59322 -83123 273889 -158034
15042 303674 -377970 287693 -320211 -6988 292918 -252128 125172 33499 356596 -49490
$$ packed form
15122G0757a40870N8112A18861P8164C936b39629C05494b42602B6545R5325J21103
15111B42973f2440a1034r8449C8667a60027H7173m956b89420d7316B67790N8426
15100C26216B5392K34859R1897m8960A47213J03988l1828j7316j7398e7106A27977
15088B39835q3481o39d984B23141C4890M77751k52914j10158K15998A40781L0864
15077A71645m1097P235d2298A44172K11913g4129D5829K43709A43843D2555M463
15066D7018O6256J86679g4842B56238r6987J84109F449J17480K9357l4067D4646
15054B97690j3023j372j00602H9329P6829D622a8874E9322h3123B73889a58034
15042C03674c77970B87693c20211f988B92918b52128A25172C3499L23097d9490
$$ plain form
15031 290202 1206 -20488 419594 354342 -24287 148928 89706 68070 259979 134018 249388
15020 249388 10747 -265375 -104901 309631 252319 185679 101112 642570 73292 243125
15010 243125 440066 227819 119000 338691 467542 196857 115079 -79853 114061 -132398
14999 60980 192145 201888 119045 412361 194154 39947 -22001 83057 -46454 -199680 283929
14987 200314 397639 49034 86392 264988 -2876 266949 38691 197582 140952 214037 -26751
14975 228446 232440 275057 434197 433044 257736 383625 56804 431156 129182 301601 -1331
14963 201043 135190 55045 452573 -96085 276828 396304 228848 433972 145036 210635
14953 210635 -160616 -86986 185444 67826 89635 306469 337064 90260 414738 313095
$$ packed form
15031B90202A206b0488D19594o5252b4287A48928n9222k1636J91909j25961J15370
15020B49388A0747b65375a04901C09631n7312o6640q4567N41458G3292J69833
15010B43125J96941k12247j08819K19691J28851A96857q1778g9853A14061a32398
14999F0980J31165R743q2843K93316A94154C9947b2001H3057d6454j53226B83929
14987B00314J97325D9034L7358J78596b876B66949C8691J58891n6630P3085b6751
14975B28446L994M2617J59140j153j75308J25889E6804L74352A29182J72419a331
14963B01043o5853E5045L97528i6085B76828J19476j67456K05124A45036O5599
14953B10635a60616P3630A85444F7826K1809K16834L0595I0260L24478j01643
$$ plain form
14943 313095 182792 -28781 45623 77115 390084 -10171 536027 118857 417676 187066
14932 406377 569411 383933 -230308 526218 196807 287387 -71654 482594 206919 270596
14922 270596 165314 392127 584560 335011 15598 414056 108665 406855 -6442 454234
14911 622133 116155 292299 350053 28871 -53130 272433 183473 167688 261412 417080 444196
14900 444196 589972 431622 130583 160698 260122 304977 152608 89303 303653 545542
14890 545542 -69207 292273 210942 318327 525693 56551 274878 244514 484109 169492
14879 567695 180473 331773 -2244 78830 40082 390404 227718 754257 221930 250400
14869 250400 254453 129642 100396 137807 503569 353074 486035 418765 401175 363269 408320
$$ packed form
14943C13095j30303b8781D5623L1492L12969a0171E36027A18857K98819A87066
14932D06377J63034j85478b30308E26218A96807R0580g1654D82594B06919O3677
14922B70596j05282K26813J92433k49549A5598L98458A08665K98190f442D54234
14911F22133A16155J76144N7754B8871e3130B72433q8960j5785R3724J55668K7116
14900D44196J45776j58350A30583L0115R9424M4855j52369o3305K14350K41889
14890E45542f9207B92273q1331J07385K07366E6551K18327l0364K39595A69492
14879E67695A80473J51300b244G8830l8748L50322j62686N26539B21930K8470
14869B50400M053j24811k9246L7411L65762j50495J32961o7270j7590l7906M5051
$$ plain form
14858 408320 -9900 480400 466894 52998 618937 567292 297076 657450 438973 502098 342321
14847 342321 89887 327890 21130 232688 130422 259950 490806 340086 450092 730381
14837 730381 304322 401134 375223 504468 715823 690730 565914 89191 230850 406413
14827 406413 266868 486088 438540 243697 255593 397867 267285 128621 189701 182081
14817 182081 382848 343294 574354 689292 366852 533775 577247 593429 65301 763859
14807 763859 510552 275881 252401 529401 465465 620932 202531 591159 827949 495910
14797 495910 341506 606714 362495 448282 169437 802569 519489 498898 490162 187915
14786 469928 517677 395711 568270 265806 425343 557133 244490 800428 825159 604058
$$ packed form
14858D08320i900D80400j3506E2998N65939n1645k70216L60374k18477O3125j59777
14847C42321H9887K38003B1130K11558j02266J29528K30856j50720J10006K80289
14837G30381C04322R6812k5911J29245K11355k5093j24816H9191J41659J75563
14827D06413j39545K19220m7548j94843J1896J42274j30582A28621O1080p620
14817A82081K00767l9554K31060J14938l22440J66923M3472J6182F5301O98558
14807G63859k53307k34671k3480K77000o3936J55467B02531L88628K36790l32039
14797D95910j54404K65208k44219Q5787A69437O33132k83080k0591q736A87915
14786D69928M7749j21966J72559B65806J59537J31790B44490N55938K4731k21101
$$ plain form
14776 604058 621890 381077 631652 400853 202916 431702 412296 504401 632119 450670
14766 450670 688167 670308 757602 841734 617438 767873 713169 774784 498259 589491 196495
14754 427679 409899 468181 684616 790040 573986 847825 708198 509202 303050 810177
14744 810177 719760 443259 730169 512588 836155 933839 733140 892714 757799 773699
14734 773699 668612 522690 409654 543903 466127 826526 715767 775259 912331 390414
14723 523818 787723 507955 586122 397205 807672 786417 895878 547815 432995 957599
14713 957599 623303 591245 536988 607827 813496 802666 627217 602590 851665 618901
14703 618901 632125 805897 899760 896471 516771 1226838 630419 675765 867788 762828
$$ packed form
14776F04058J7832k40813K50575k30799j97937K28786j9406R2105J27718j81449
14766D50670K37497j7859Q7294Q4132k24296J50435n4704O1615k76525R1232A96495
14754D27679j7780N8282K16435J05424k16054K73839j39627j98996k06152N07127
14744H10177r0417k76501K86910k17581L23567R7684k00699J59574j34915J5900
14734G73699j05087j45922j13036J34249p7776L60399j10759N9492J37072C90414
14723E23818K63905k79768P8167j88917M10467k1255J09461l48063j14820N24604
14713I57599l34296l2058n4257P0839K05669j0830j75449k4627K49075k32764
14703F18901J3224J73772R3863l289l79700P10067n96419M5346J92023j04960
$$ plain form
14693 762828 777435 566045 908093 923461 788903 888889 700233 790720 721709 760719 850948
14682 850948 737151 745366 1026971 1146291 940749 758423 770301 638659 756974 1183073
14672 1183073 934041 1042200 670882 1206049 1210604 1316238 1214717 738597 851798 1016026
14662 1016026 668539 873982 847717 742015 1043625 1082545 941347 1041142 935152 941734
14652 941734 828710 823014 809761 979353 737242 1004408 1246017 783907 700566 1262597
14642 1262597 1232861 1039519 1155499 953671 1234654 963575 1167188 1167793 1288941 835728
14632 835728 1089668 1281199 1195584 1127268 999851 1361445 1396295 1164460 996667 1270551
14622 1270551 1547680 1360877 1053951 1531912 1348234 1485858 1376022 1077803 1645932
$$ packed form
14693G62828J4607k11390L42048J5368j34558R9986j88656R0487o9011L9010R0229
14682H50948j13797Q215K81605J19320k05542j82326J1878j31642J18315M26099
14672A183073k49032J08159l71318N35167M555J05634j01521m76120J13201J64228
14662A016026l47487K05443k6265j05702L01610L8920j41198R9795j05990O582
14652I41734j13024n696j3253J69592k42111K67166K41609m62110q3341N62031
14642A262597k9736j93342J15980k01828K80983k71079K03613O05J21148m53213
14632H35728K53940J91531q5615o8316j27417L61594L4850k31835j67793K73884
14622A270551K77129j86803l06926M77961j83678J37624j09836k98219N68129
$$ plain form
14613 1645932 1376218 1642371 1175096 1772100 1420322 1538512 1248969 1771679 1635149
14604 1635149 1182671 1610370 1575798 1552961 1256994 1288409 1374619 1463339 1518078 1322586
14594 1322586 1647414 1574298 1408744 1628705 1826880 2072570 1430518 1859382 2108770 1863036
14584 1863036 1780484 1660101 1599484 1808811 1640441 1812206 2049451 1878205 2072834 1980891
14574 1980891 2003866 1898262 1796953 2003134 2414250 1980166 1941477 2147008 2246465 2117333
14564 2117333 2316130 2429506 2298318 2131363 2576043 2571163 2694000 2714324 2871369 2864158
14554 2864158 3557733 3598691 3911353 4166379 5532837 7162260 11572273 20868377 39728181
14545 39728181 47321511 18937748 6973418 3643990 2915211 2246344 2356237 1747887
$$ packed form
14613A645932k69714K66153m67275N97004l51778J18190k89543N22710j36530
14604A635149m52478M27699l4572k2837k95967L1415Q6210Q8720N4739j95492
14594A322586L24828p3116j65554K19961J98175K45690o42052M28864K49388k45734
14584A863036q2552j20383o0617K09327j68370J71765K37245j71246J94629r1943
14574A980891K2975j05604j01309K06181M11116m34084l8689K05531R9457j29132
14564B117333J98797J13376j31188j66955M44680m880J22837K0324J57045p211
14554B864158O93575M0958L12662K55026J366458J629423M410013R296104J8859804
14545C9728181P593330A8937748F973418l329428p28779o68867J09893o08350
$$ plain form
14537 1747887 1783605 1593867 1771532 1734469 2047461 2030061 2056514 1701814 2067983 2068382 2057038
14526 2057038 2373356 2084426 2287782 2343455 2027416 2106772 2427739 2412849 2072607 2258646
14516 2258646 2254398 2246322 2426188 2369545 2633848 2436342 2414888 2528133 2728265 2943653
14506 2943653 2605429 2667255 2477148 2755050 2474190 2808294 2998473 2826349 2674887 3045959
14496 3045959 2777779 3187968 3158640 3379488 3062507 3074782 3180296 3053605 3173682 3130950
14486 3130950 3442119 3308588 3450058 3529282 3534625 3659070 3285252 3546847 3331594 3754857
14476 3754857 3571865 3360209 3566462 3834063 3910697 4121176 4321674 3971269 3852207 4077116
14466 4077116 3791575 4061382 4027704 4229053 4366618 4276085 4437744 3945556 4471458 4430971
$$ packed form
14537A747887L5718j89738J77665l7063L12992j7400K6453l54700L66169L99j1344
14526B057038L16318k88930K03356N5673l16039P9356L20967j4890l40242J86039
14516B258646m248q076J79866n6643K64303j97506k1454J13245K00132K15388
14506B943653l38224O1826j90107K77902k80860L34104J90179j72124j51462L71072
14496C045959k68180M10189k9328K20848l16981J2275J05514j26691J20077m2732
14486C130950L11169j33531J41470P9224N343J24445l73818K61595k15253M23263
14476C754857j82992k11656K06253K67601P6634K10479K00498l50405j19062K24909
14466D077116k85541K69807l3678K01349J37565r0533J61659m92188N25902m0487
$$ plain form
14456 4430971 4534361 4689600 4853646 4540854 4889485 4894170 5032278 5216383 4854382 5201805
14446 5201805 5120100 4998576 5679457 5518622 5349475 5568691 5546507 5700376 5447674 5606274
14436 5606274 5987670 5988736 6193566 5985735 6029136 6462056 6476828 6622663 6428613 6734950
14426 6734950 6635524 6735752 6713948 6789839 6762966 7528952 7204360 7478896 7438748 7685623
14416 7685623 7676378 8110190 7887650 7945190 7910918 8001453 8615953 8432638 8432459 8789291 8832034
14405 8832034 9209903 8859919 9259585 9385917 9484919 9797909 9869992 9918566 10135254 10127760
14395 10127760 10254839 10799942 10705894 11015131 11167326 11418000 11495051 11880431 11657088 11608704
14385 11608704 12200987 12747599 12775235 12980474 13456525 13434162 13539464 13797721 14230568 14660608
$$ packed form
14456D430971J03390J55239J64046l12792L48631M685J38108J84105l62001L47423
14446E201805q1705j21524O80881j60835j69147K19216k2184J53869k52702J58600
14436E606274L81396J066K04830k07831M3401M32920J4772J45835j94050L06337
14426F734950r9426J00228k1804P5891k6873P65986l24592K74536m0148K46875
14416G685623r245M33812k22540N7540l4272R0535O14500j83315j79L56832M2743
14405H832034L77869l49984L99666J26332R9002L12990P2083M8574K16688p494
14395A0127760J27079N45103r4048L09237J52195K50674P7051L85380k23343m8384
14385A1608704N92283N46612K7636K05239M76051k2363J05302K58257M32847M30040
$$ plain form
14375 14660608 15037850 14935809 15054813 15541314 16034040 15953623 16599713 16853492 17420132
14366 17420132 17775257 18363569 18518546 18840858 19084043 19698706 20250705 20415791 21134611
14357 21134611 21696581 22022750 22653813 23187996 23599086 24251254 24903594 25487172 26061426
14348 26061426 26732098 27353819 27924644 29001110 29689384 29966942 31305635 31815824 32844180
14339 32844180 33776935 34541671 35286249 36349397 37548226 38815634 40089399 40952734 42387850
14330 42387850 43820610 45210393 46603785 47797086 49410280 51011229 52939816 54631548
14322 54631548 56781958 58717120 60783093 62359131 64992598 67619858 70260386 72810947
14314 72810947 75598477 78409617 82104679 85194882 88787923 92808272 97092293 101269879
$$ packed form
14375A4660608L77242j02041J19004M86501M92726q0417O46090K53779N66640
14366A7420132L55125N88312J54977L22312K43185O14663N51999J65086P18820
14357B1134611N61970L26169O31063N34183M11090O52168O52340N83578N74254
14348B6061426O70672O21721N70825J076466O88274K77558J338693N10189J028356
14339C2844180R32755P64736P44578J063148J198829J267408J273765Q63335J435116
14330D2387850J432760J389783J393392J193301J613194J600949J928587J691732
14322E4631548K150410J935162K065973J576038K633467K627260K640528K550561
14314G2810947K787530K811140L695062L090203L593041M020349M284021M177586
$$ plain form
14306 101269879 105597566 110364426 115925217 121030397 127001409 133123662 139704023 146558293
14298 146558293 154290238 161926802 170445900 179843668 189200885 199604707 210094364 221952821
14290 221952821 233987324 246914215 260689128 274622247 289424484 304707109 320898456
14283 320898456 337086771 353602909 370485304 386701971 402850675 418013086 432641211
14276 432641211 445602770 457023841 465941730 471140378 472523558 471554931 470387779 468320424
14268 468320424 466230724 460738512 451213823 439840621 427913830 413833690 398506099
14261 398506099 382003901 365058133 348296544 331622569 315115598 299861970 285017041
14254 285017041 270197615 255787759 242734411 230072794 218076215 206380425 196023679
$$ packed form
14306A01269879M327687M766860N560791N105180N971012O122253O580361O854270
14298A46558293P731945P636564Q519098R397768R357217J0403822J0489657J1858457
14290B21952821J2034503J2926891J3774913J3933119J4802237J5282625J6191347
14283C20898456J6188315J6516138J6882395J6216667J6148704J5162411J4628125
14276D32641211J2961559J1421071Q917889N198648J383180r68627j167152k067355
14268D68320424k089700n492212r524689j1373202j1926791j4080140j5327591
14261C98506099j6502198j6945768j6761589j6673975j6506971j5253628j4844929
14254B85017041j4819426j4409856j3053348j2661617j1996579j1695790j0356746
$$ plain form
14247 196023679 186036005 176275161 167540829 159754673 151863170 144513950 137728363 130870073
14239 130870073 124637490 119392487 114051826 109045716 104297482 99409740 95102975 91684111
14231 91684111 88438610 84606153 81256974 77850311 74795126 71704858 69146483 66692144
14223 66692144 64293676 61919288 59471013 57814826 55764451 54071450 52150450 50107409
14215 50107409 48551978 47180575 46357046 44294998 42679165 41683313 40479764 39301538
14207 39301538 38938076 37659236 36183522 35091039 33769485 32945049 32557863 31876395 30660153
14198 30660153 29661489 28969339 28017678 27543937 26985364 26569649 25555550 25008025 24256202
14189 24256202 23377002 23310872 22809895 22223654 21767858 21116917 20735582 20482734 20021380
$$ packed form
14247A96023679r987674r760844q734332p786156p891503p349220o785587o858290
14239A30870073o232583n245003n340661n006110m748234m887742m306765l418864
14231I1684111l245501l832457l349179l406663l055185l090268k558375k454339
14223F6692144k398468k374388k448275j656187k050375j693001j921000k043041
14215E0107409j555431j371403q23529k062048j615833r95852j203549j178226
14207C9301538l63462j278840j475714j092483j321554q24436l87186o81468j216242
14198C0660153r98664o92150r51661m73741n58573m15715j014099n47525p51823
14189B4256202q79200o6130n00977n86241m55796o50941l81335k52848m61354
$$ plain form
14180 20021380 19357104 19108587 18739895 18160423 17787958 17339871 16770838 16675520 16510220
14171 16510220 16314887 15708520 15728939 15300672 15133588 14679704 14354551 14192567 13855106
14162 13855106 13701717 13203659 13253663 12973719 12725395 12540950 12269214 12061309 11747599
14153 11747599 11577958 11694230 11423332 11153958 10729547 10562184 10462408 10398186 10579436 10252930
14143 10252930 9836550 9501605 9605360 9349410 9391480 9196419 8931370 9191031 8715528
14134 8715528 8603659 8723815 8268119 8208828 8110102 7996948 7818195 7959882 7595251 7519356
14124 7519356 7322582 7358864 7232654 7104485 7078986 7039792 6790220 6744090 6520337 6397370
14114 6397370 6578989 6495430 6529013 6173620 6409859 6081167 6208640 5857223 6140928 5658596
$$ packed form
14180B0021380o64276k48517l68692n79472l72465m48087n69033r5318j65300
14171A6510220j95333o06367K0419m28267j67084m53884l25153j61984l37461
14162A3855106j53389m98058N0004k79944k48324j84445k71736k07905l13710
14153A1747599j69641J16272k70898k69374m24411j67363r9776o4222J81250l26506
14143A0252930m16380l34945J03755k55950M2070j95061k65049K59661m75503
14134H715528j11869J20156m55696n9291r8726j13154j78753J41687l64631p5895
14124G519356j96774L6282j26210j28169k5499l9194k49572m6130k23753j22967
14114F397370J81619q3559L3583l55393K36239l28692J27473l51417K83705m82332
$$ plain form
14104 5658596 5887189 5944951 5679346 5714400 5292865 5184943 5332871 5092017 5147619 4983740
14094 4983740 5256163 5101075 5003000 5204682 4951211 4443363 5010997 4746929 5068348 4883553
14084 4883553 4523181 4522197 4413833 4245306 4450200 4428672 4503958 4051471 4063896 4432659
14074 4432659 4283500 3849187 3992536 3818319 4121255 4123795 3864135 3875434 3896915 3342230
14064 3342230 3779779 3571325 3879459 3522508 3547827 3699565 3723668 3740085 3567416 3178399
14054 3178399 3491801 3449937 3209855 3598512 3569003 3078895 2936164 3006597 2940801 3318935
14044 3318935 2957526 3140267 2958074 3152224 2510441 3182326 2883709 2718792 2882539
14035 2882539 2968236 2814138 2843122 3003345 2409554 2772092 3147723 2794237 2790723 2698863
$$ packed form
14104E658596K28593N7762k65605L5054m21535j07922J47928k40854N5602j63879
14094D983740K72423j55088r8075K01682k53471n07848N67634k64068L21419j84795
14084D883553l60372r84j08364j68527K04894k1528P5286m52487J2425L68763
14074D432659j49159m34313J43349j74217L02936K540k59660J1299K1481n54685
14064C342230M37549k08454L08134l56951K5319J51738K4103J6417j72669l89017
14054C178399L13402m1864k40082L88657k9509m90108j42731P0433o5796L78134
14044C318935l61409J82741j82193J94150o41783O71885k98617j64917J63747
14035B882539Q5697j54098K8984J60223n93791L62538L75631l53486l514r1860
$$ plain form
14025 2698863 2626925 2407178 2210651 2560104 2554142 2379567 2270783 2309552 2016696 2566873
14015 2566873 2373978 2473979 2672569 2346135 2368559 2310848 1976216 2265991 2363562 2295329
14005 2295329 2058142 2068051 2305783 2277133 1995728 1763202 2090804 2177253 1933665 2122923
13995 2122923 1929786 1884993 1517865 1632293 1867027 2433744 3467131 6442369 13535748
13986 13535748 31002025 47384159 25002807 11756395 7233403 5390740 4547525 4136478
13978 4136478 3295601 2747678 2909762 2553242 2904719 2485216 2526028 2227495 2399966 2329651
13968 2329651 2317400 2030339 2156145 1960984 1984955 1784758 2003304 1957181 2050158 2240341
13958 2240341 1804177 1537317 1657701 1694112 1995392 1845190 1823608 1630860 1722618 1701513
$$ packed form
14025B698863p1938k19747j96527L49453n962j74575j08784L8769k92856N50177
14015B566873j92895J00001J98590l26434K2424n7711l34632K89775R7571o8233
14005B295329k37187R909K37732k8650k81405k32526L27602Q6449k43588J89258
13995B122923j93137m4793l67128J14428K34734N66717J033387K975238P093379
13986A3535748J7466277J6382134k2381352A1756395m522992j842663q43215m11047
13978D136478q40877n47923J62084l56520L51477m19503M0812k98533J72471p0315
13968B329651j2251k87061J25806j95161K3971k00197K18546m6123R2977J90183
13958B240341m36164k66860J20384L6411L01280j50202k1582j92748R1758k1105
$$ plain form
13948 1701513 1948369 1645374 1573371 1667876 1579637 1666247 1574316 1611118 1636009 1741802 1541273
13937 1541273 1554477 1453090 1504781 1629521 1326260 1234177 1432102 1650644 1531989 1436146
13927 1436146 1509394 1418979 1209578 1316321 1609126 1705452 1520423 1220081 1531375 1248811
13917 1248811 1244565 1158291 1085797 1687886 1321968 1230785 1572629 1310335 1037335 1322217
13907 1322217 1371608 1256265 1347921 1451652 1495375 1380948 1198479 1118733 1217587 1230792
13897 1230792 911795 1410433 866484 1294946 1164365 1116818 1118351 1039983 921814 1132528
13887 1132528 1344937 1213684 978143 958857 1130217 1075393 1221842 1193299 846916 1344730
13877 1344730 1085182 1160022 1061614 1121104 1073791 1043826 1345975 1133266 1133088 996762 886032
$$ packed form
13948A701513K46856l02995p2003R4505q8239Q6610r1931L6802K4891J05793k00529
13937A541273J3204j01387N1691J24740l03261r2083J97925K18542j18655r5843
13927A436146P3248r0415k09401J06743K92805R6326j85029l00342L11294k82564
13917A248811m246q6274p2494O02089l65918r1183L41844k62294k73000K84882
13907A322217M9391j15343R1656J03731M3723j14427j82469p9746R8854J3205
13897A230792l18997M98638n43949M28462j30581m7547J533p8368j18169K10714
13887A132528K12409j31253k35541j9286J71360n4824J46449k8543l46383M97814
13877A344730k59548P4840r8408N9490m7313k9965L02149k12709j78j36326j10730
$$ plain form
13866 886032 966188 889308 966976 783435 1375264 691876 1251502 925126 1096581 971714
13856 971714 875324 774168 628599 1152426 968865 704106 863795 740394 959830 1013898
13846 1013898 1080907 460394 983008 838695 1008834 912272 1063572 719219 707515 964001
13836 964001 767394 768623 1002617 703822 682429 806087 1052094 839439 721576 627950
13826 627950 820144 541381 814803 743229 696883 756778 717382 670605 663256 779689 785115
13815 785115 754148 944224 660524 931680 491346 753148 1002648 575348 955755 786463
13805 786463 799459 1008585 378744 890492 568468 524995 657034 570589 769813 895899
13795 895899 665116 930593 703865 738073 579881 678163 844245 740175 522059 617166
$$ packed form
13866H86032Q0156p6880P7668j83541N91829o83388N59626l26376J71455j24867
13856I71714r6390j01156j45569N23827j83561k64759J59689j23401K19436N4068
13846A013898O7009D60394N22614j44313J70139r6562J51300l44353j1704K56486
13836I64001j96607J229K33994k98795k1393J23658K46007k12655j17863r3626
13826F27950J92194k78763K73422p1574m6346N9895l9396m6777p349J16433N426
13815G85115l0967J90076k83700K71156m40334K61802K49500m27300L80407j69292
13805G86463J2996K09126C78744N11748l22024m3473J32039q6445J99224J26086
13795H95899k30783K65477k26728L4208j58192R8282J66082j04070k18116R5107
$$ plain form
13785 617166 557978 619475 679368 522984 591997 810011 816963 808829 593726 379295 634300
13774 634300 788453 718727 890515 887071 552772 557876 830389 670959 516250 340948
13764 340948 493508 613886 701857 435337 751498 491514 283989 336892 660765 360649
13754 360649 265376 534401 191264 537317 789044 511512 768196 714988 595981 749987
13744 749987 319748 697486 592032 581167 731629 591168 554046 774723 327858 750852
13734 750852 505272 400020 675453 319453 626507 735776 433118 383213 524124 570562
13724 570562 426427 536392 474633 460040 375345 526444 142976 794848 467010 506517
13714 506517 892934 252776 617318 452166 519425 622513 510805 1055923 763428 564119
$$ packed form
13785F17166n9188O1497N9893j56384O9013K18014O952q134k15103k14431K55005
13774F34300J54153o9726J71788l444l34299N104K72513j59430j54709j75302
13764C40948J52560J20378Q7971k66520L16161k59984k07525N2903L23873l00116
13754C60649r5273K69025A91264L46053K51727k77532K56684n3208j19007J54006
13744G49987C19748L77738j05454j0865J50462j40461l7122K20677C27858M22994
13734G50852k45580j05252K75433C19453L07054J09269l02658m9905J40911M6438
13724E70562j44135J09965o1759j4593q4695J51099A42976O51872l27838L9507
13714E06517L86417B52776L64542j65152O7259J03088j11708N45118k92495j99309
$$ plain form
13704 564119 291559 404113 647353 716832 800764 447656 563599 659877 522928 171179
13693 674958 514703 461283 221111 575294 481490 482336 40755 570081 186884 171647 831519
13682 831519 693220 605249 575034 350299 414683 584846 456722 94234 382589 316687
13672 316687 544713 124630 658223 365946 266789 628994 624935 477558 290589 391536
13662 391536 358228 571710 298066 63060 198654 490947 138268 567924 504295 300924
13652 300924 319623 263946 409550 492177 427141 527782 323319 219416 416472 544890
13642 544890 327936 194150 285647 720741 433514 -22913 558338 239733 209491 559435
13632 559435 480102 429982 543901 372498 444606 226079 369024 409795 351830 486584
$$ packed form
13704E64119k72560J12554K43240O9479Q3932l53108J15943R6278j36949A71179
13693F74958j60255n3420B21111L54183r3804Q46D0755N29326A86884j5237O59872
13682H31519j38299q7971l0215k24735O4384J70163j28124I4234K88355o5902
13672C16687K28026A24630N33593k92277r9157L62205m059j47377j86969J00947
13662C91536l3308K13482k73644F3060J35594K92293A38268M29656o3629k03371
13652C00924J8699n5677J45604Q2627o5036J00641k04463j03903J97056J28418
13642E44890k16954j33786R1497M35094k87227b2913E58338B39733l0242L49944
13632E59435p9333n0120J13919j71403P2108k18527J42945M0771n7965J34754
$$ plain form
13622 486584 314297 344822 390133 243220 38389 491055 114797 183308 436527 593864
13612 593864 362311 383527 661265 371229 107335 411329 511465 477758 -35704 226643
13601 182236 458461 322797 88135 305676 602779 712345 352001 188102 407188 420647
13591 420647 245930 434804 231179 38248 188481 258570 387441 130390 345770 185478
13581 185478 288752 407641 586126 196416 240020 235508 310427 315973 234084 314987 319154
13570 319154 747146 -51749 186057 469891 142168 728405 326056 135360 -18718 98861
13559 311299 -39884 138214 487444 311375 258234 323650 286560 248860 5840 162305 243093
13548 243093 193529 220837 93743 14862 401887 382288 224783 373032 252702 338908 36938
$$ packed form
13622D86584j72287L0525M5311j46913C8389M52666A14797O8511K53219J57337
13612E93864k31553K1216K77738k90036A07335L03994J00136l3707c5704B26643
13601A82236K76225j35664H8135K17541K97103J09566C52001j63899K19086J3459
13591D20647j74717J88874k03625C8248J50233P0089J28871A30390K15380j60292
13581A85478J03274J18889J78485A96416M3604m512P4919N546q1889Q0903M167
13570C19154M27992e1749A86057K83834A42168N86237C26056A35360a8718I8861
13559C11299c9884A38214L49230j76069n3141O5416l7090l7700E840J56465Q0788
13548B43093m9564K7308I3743A4862L87025j9599j57505J48249j20330Q6206C6938
$$ plain form
13536 260857 599540 298827 501535 136854 145330 525257 119530 55424 116657 261560
13526 261560 367239 269225 314770 238688 58206 72183 202530 587406 9036 74351 178319
13515 178319 499902 229226 488210 211008 52805 368942 555404 141725 108931 494569
13505 494569 116316 570945 425394 551824 323604 555354 344429 376052 314235 314215 154864
13493 -10461 112813 12690 117859 132831 792887 90293 -80171 -32946 185595 251406 314646
13482 314646 27382 393762 306953 265489 449256 233727 359292 55959 97047 185099 309638
13471 309638 216781 90925 363484 125932 -184396 432912 153441 288064 -105551 333062
13460 331587 402343 157876 335471 195338 -23466 114721 -142797 328175 575812 94063
$$ packed form
13536B60857L38683B98827K02708A36854Q476L79927A19530E5424O1233J44903
13526B61560J05679r8014M5545p6082E8206J3977J30347L84876I036O5315J03968
13515A78319L21583B29226K58984B11008E2805L16137J86462A41725l2794L85638
13505D94569A16316M54629j45551J26430k28220K31750k10925L1623o1817k0A54864
13493a0461A12813A2690J05169J4972O60056I0293h0171c2946A85595O5811O3240
13482C14646B7382L66380q6809m1464J83767k15529J25565E5959M1088Q8052J24539
13471C09638r2857I0925K72559A25932a84396D32912A53441J34623a05551C33062
13460C31587P0756A57876J77595j40133b3466A14721a42797C28175K47637I4063
$$ plain form
13449 247556 296783 109350 -151165 615524 114025 187218 183311 307054 141164 300932
13439 300932 265112 279772 260110 403429 260644 422062 85556 230789 82710 270204
13429 270204 174120 129122 42756 -276443 219711 349381 194520 374055 151752 77375
13419 77375 100686 332668 63090 102575 45011 165873 69154 454977 237621 110831 77692
13408 77692 200873 22872 213204 327632 -8863 203290 600340 294534 -287804 4536 48143
13397 48143 44644 111667 65809 16617 -61084 24186 -137478 228763 -128790 257346 287408
13386 287408 284731 205290 6590 297687 190699 -54339 582071 115138 179185 258102 -26152
13374 243213 256078 364953 362202 249700 184130 126622 331343 151005 258646 57696 248482
$$ packed form
13449B47556M9227A09350a51165F15524A14025P3193l907J23743A41164J59768
13439C00932l5820J4660j9662J43319j42785J61418H5556J45233H2710J87494
13429B70204r6084m4998D2756b76443B19711J29670j54861J79535A51752p4377
13419G7375K3311K31982F3090L9485D5011J20862F9154L85823k17356A10831l3139
13408G7692J23181B2872J90332J14428h863B03290L97050B94534b87804D536M3607
13397D8143l499O7023m5858A6617f1084B4186a37478B28763a28790B57346L0062
13386B87408k677p9441F590K91097j06988e4339E82071A15138O4047P8917b6152
13374B43213J2865J08875k751j12502o5570n7508K04721A51005J07641E7696J90786
$$ plain form
13363 248482 133542 151734 60918 41956 45411 450412 302628 54829 382941 12268 -2328
13351 106042 199179 -265916 49377 -58308 575527 124025 395190 336663 294523 93371 212490
13340 212490 138069 383351 -19676 269636 97944 145665 226691 362429 -116746 190474
13329 253341 75367 148184 50341 88517 282377 406070 48903 232805 412351 409908 230203
13318 230203 132220 80472 101693 378845 147985 70391 122207 247509 -60762 253582 364976
13307 364976 414304 -49218 325405 174757 -459524 -214029 279087 174610 -108146 192619
13296 341746 314004 -390355 61258 183 27412 15400 281352 208326 237531 59003 158639
13285 158639 -46794 16695 240252 214273 206150 333400 202796 36491 227511 -165710 70680
$$ packed form
13363B48482j14940J8192F0918j8962L455M05001j47784E4829L28112A2268b328
13351A06042R3137b65916D9377e8308E75527A24025K71165n8527m2140I3371J19119
13340B12490p4421K45282a9676B69636I7944M7721Q1026J35738a16746A90474
13329B53341G5367P2817E0341L8176J93860J23693D8903J83902J79546k443j79705
13318B30203r7983n1748K1221K77152A47985G0391N1816J25302f0762B53582J11394
13307C64976M9328d9218C25405j50648d59524b14029B79087j04477a08146A92619
13296C41746k7742c90355F1258A83K7229j2012K65952p3026K9205E9003R9636
13285A58639d6794A6695K23557k5979q123J27250j30604C6491J91020a65710G0680
$$ plain form
13273 -98775 90357 335570 159684 211976 65772 87680 13212 125884 265743 155666 20505
13261 557479 -135879 143479 247872 126231 488738 -177875 275196 47951 197123 118630
13251 118630 -32004 226691 171977 274281 60342 202866 -87085 -206883 256794 66956
13240 113082 10453 107852 -60666 138043 127983 162127 182090 -188933 198229 549906 302930
13229 302930 -121373 38454 8915 154026 4166 260708 246114 -118685 182649 371348 184134
13217 128444 292988 9328 209901 285080 -73593 -9777 -262340 29821 -167325 -84512 -104574
13206 -104574 -179725 102702 -121522 -180760 160615 36789 316043 -176732 60446 238474
13196 238474 -60196 -120734 67641 -5346 195790 68041 -118742 91464 50942 189590 199773
$$ packed form
13273i8775I0357K45213A59684N2292F5772K1908A3212J12672J39859j10077B0505
13261E57479a35879A43479J04393j21641L62507a77875B75196D7951J49172p8493
13251A18630c2004B26691n4714J02304F0342J42524h7085j19798B56794F6956
13240A13082A0453R7399f0666A38043j0060L4144J9963a88933A98229L51677k46976
13229C02930a21373C8454H915J45111D166K56542j4594a18685A82649J88699A84134
13217A28444J64544I328K00573P5179g3593i777k52563B9821a67325Q2813k0062
13206a04574p5151A02702a21522n9238A60615C6789K79254a76732F0446J78028
13196B38474f0196o0538F7641e346A95790F8041a18742I1464m0522J38648J0183
$$ plain form
13185 199773 -229961 69690 146721 144229 82471 113057 -197500 343997 -47047 -224010 289736
13173 41641 -216752 79920 145041 -109302 327447 45380 -149270 -21782 -197795 219854
13162 -224489 129123 96777 111732 -64662 182531 204888 123116 69068 383267 -141114 -228969
13151 -228969 79338 -51323 522908 143620 307875 -91480 196819 -54089 -61517 -208769 -67380
13139 82415 9744 -211165 221688 189862 275316 -68578 -311745 -557958 -29198 -240096 105870
13127 91028 -143708 201686 68471 116591 -187563 -155993 -39624 153215 -83000 -174142 482553
13115 81633 35222 281507 4760 290464 -290924 -95129 87111 -150554 46815 119175 200785
13104 200785 328580 -97687 199754 -91335 36383 -74466 -258690 25494 -16458 44844 50895
$$ packed form
13185A99773b29961F9690P7031k492o1758L0586a97500C43997d7047j76963B89736
13173D1641b16752G9920O5121a09302C27447D5380a49270b1782j76013B19854
13162b24489A29123l2346J4955f4662A82531K2357q1772n4048L14199a41114q7855
13151b28969G9338e1323E22908A43620J64255i1480A96819e4089p428j47252f7380
13139H2415I744b11165B21688l1826Q5454f8578k43167k46213b9198k10898A05870
13127I1028a43708B01686F8471M8120a87563L1570c9624A53215h3000r1142D82553
13115H1633C5222K46285D760K85704b90924i5129H7111a50554D6815P2360Q1610
13104B00785J27795i7687A99754i1335C6383g4466j84224B5494a6458D4844O051
$$ plain form
13093 50895 52658 -152515 -88693 419598 -5423 70874 30201 -27824 88328 -96286 279188
13081 111896 39901 192831 -164991 -42456 90103 -236227 92670 74633 99249 33221 468631
13070 468631 56287 100563 225360 201465 -136575 24917 145828 281448 288634 162238 135278
13059 135278 128898 90609 461654 315545 249395 20601 235694 206064 198339 215257 -233073
13047 56080 -51999 129328 -13178 180069 30684 31194 175052 226101 30971 182185 40635
13035 -285904 -50632 298309 151334 211801 152 25966 -124396 227459 155899 576746 257434
13023 111894 -125086 59021 116476 -95599 14293 398313 168641 21025 30896 61807 -60429
13011 8097 341659 23029 367293 369721 -45830 139590 -244455 270534 31744 -77735 -10185
$$ packed form
13093E0895J763a52515O3822D19598e423G0874C0201b7824H8328i6286B79188
13081A11896C9901J52930a64991d2456I0103b36227I2670j8037K4616C3221M35410
13070D68631E6287M4276J24797k3895a36575B4917J20911J35620P186j26396k6960
13059A35278o380l8289L71045j46109o6150B0601K15093k9630p725J6918b33073
13047E6080e1999A29328a3178A80069C0684N10J43858N1049C0971J51214D0635
13035b85904e0632B98309j46975O0467A52K5814a24396B27459p1560M20847B57434
13023A11894a25086E9021N7455i5599A4293L84020A68641B1025R871L0911f0429
13011H097L33562B3029L44264K428d5830A39590b44455B70534C1744g7735a0185
$$ plain form
12999 11617 -36691 -164566 49236 108375 137770 408384 -4470 -25174 98178 345867 -104881
12987 33542 -74189 155163 -380467 428480 167329 69631 -16902 -1874 -129866 216164 -119904
12975 -170912 -99559 69887 24837 327884 -25301 -91390 -75058 25036 244429 33293 103957
12964 103957 18189 54777 65261 -25557 -93653 -107099 139786 -13239 10645 -89000 -109970
12953 -109970 -198831 80617 59728 28268 -217868 -135198 71953 -91127 36496 146208 206057
12942 206057 341583 -135878 -169778 139321 -181514 90446 131206 -97624 417249 72613
12931 169274 -249304 7976 -10592 -202941 -35670 296409 -214364 90672 -157066 113059
12920 -202698 51838 -295636 -26688 11219 149134 -48841 -32044 100042 139201 -135793 -138275
$$ packed form
12999A1617c6691j27875D9236N9139K9395K70614d470k0704I8178K47689a04881
12987C3542g4189A55163c80467D28480A67329F9631a6902a874j27992B16164a19904
12975a70912P1353F9887B4837L03047b5301o6089J6332B5036K19393C3293P0664
12964A03957A8189L6588J0484b5557o8096j3446A39786a3239A0645h9000k0970
12953a09970q8861H0617k0889B8268b17868Q2670G1953i1127C6496J09712N9849
12942B06057J35526a35878l3900A39321a81514I0446M0760i7624D17249G2613
12931A69274b49304G976a0592j92349c5670B96409b14364I0672a57066A13059
12920b02698E1838b95636b6688A1219J37915d8841J6797A00042L9159a35793k482
$$ plain form
12909 -138275 1989 -28910 109186 -33828 -18621 69132 117687 144248 -86035 316364 -192587
12897 20506 188038 35015 53228 44170 -212488 6833 -140457 -106332 137213 137270 -115997 83534
12884 61819 129093 273799 77004 -72503 286281 -5592 118188 207246 -119127 -173492 -103603
12873 -103603 28821 94821 196222 70539 -449424 -30149 -315055 3404 31776 -349606 288863
12861 -179577 152054 -22294 -3077 64968 33391 53101 92484 78059 -273958 -47593 -190616
12850 -190616 -333546 9818 3772 -127548 53338 -23123 277968 221693 136296 226423 -220605
12838 -19582 213267 194066 -13439 135993 342862 -76721 -2636 257090 -167213 174866 4934
12826 54748 -150688 -19950 86936 133242 -81370 -19072 148157 -25795 211106 -104900 -10838
$$ packed form
12909a38275A989b8910A09186c3828J5207F9132M8555K6561h6035C16364a92587
12897B0506J67532C5015J8213r058b12488F833a40457L4125A37213N7a15997H3534
12884F1819O7274J44706G7004g2503B86281e592A18188Q9058a19127n4365O9889
12873a03603B8821O6000J01401G0539d49424c0149k84906C404K8372c49606B88863
12861a79577A52054b2294c077F4968l1577J9710L9383j4425b73958d7593j43023
12850a90616j42930I818C772a27548E3338b3123B77968n6275q5397R0127b20605
12838a9582B13267j9201a3439A35993K06869g6721b636B57090a67213A74866D934
12826E4748a50688a9950H6936M6306h1370a9072A48157b5795B11106a04900a0838
$$ plain form
12814 84777 497259 256839 299613 298071 166620 -78264 -15338 -122867 1039 527065 -42820
12802 281629 234512 64592 39906 -121401 87399 -227301 -149690 -40279 -163540 167662 -168371
12790 -357210 152488 -93249 -246624 -309301 -82887 -259729 -120794 -137029 -254601 -356165
12780 -356165 128855 -106836 202097 177772 -75997 325298 266805 230721 -22997 -109865 -11663
12768 224996 -66556 65863 113195 217911 55978 10917 -178119 124333 -50509 -615639 -64339
12756 -242249 313898 275439 -118843 29968 -61476 -216922 58178 -133341 -62007 160770
12745 208182 -135880 25214 389732 114092 109930 -45026 41133 163551 54880 126644 112798
12734 112798 108173 97818 67003 126078 -982 107206 124370 6671 5373 77127 -89247 150263
$$ packed form
12814H4777M12482k40420M2774j542j31451g8264a5338j07529A039N26026d2820
12802B81629m7117F4592k4686a21401H7399b27301P7611d0279j23261A67662a68371
12790c57210A52488i3249j53375o2677h2887j76842a20794j6235j17572j01564
12780c56165A28855a06836B02097k4325g5997C25298n8493l6084b2997q6868a1663
12768B24996f6556F5863M7332J04716E5978A0917a78119A24333e0509n65130f4339
12756b42249C13898l8459a18843B9968f1476j55446E8178a33341f2007A60770
12745B08182a35880B5214L64518A14092m162d5026D1133J22418E4880P1764j3846
12734A12798m625j0355l0815N9075i82A07206J7164F671j298P1754h9247A50263
$$ plain form
12721 138173 247185 21692 -31508 -233255 308856 59859 246362 -147110 97473 -32176
12710 -49829 215747 -109868 484665 283324 59280 255315 -83904 30772 -315936 78348
12699 171210 166692 84296 123590 -16107 -25309 38600 78819 269352 11946 237990 -114642
12687 -196156 257203 201347 89789 -370667 298164 -135867 -97476 131260 -169515 45518
12676 -20117 399629 -67108 -7185 80982 133264 20086 83685 136137 -193189 88542 -146547
12664 -70846 197970 45285 69607 286920 136697 429189 222175 138475 223927 88182 -143037
12652 -45078 47962 220201 173118 -34133 131737 95557 114049 -212717 220993 83142 178383
12641 178383 -28174 42408 346085 -53896 44755 262047 305189 195623 167963 74610 93671
$$ packed form
12721A38173J09012B1692c1508k01747C08856E9859J86503a47110I7473c2176
12710d9829B15747a09868D84665k01341E9280J96035h3904C0772c15936G8348
12699A71210m518q2396L9294a6107r202C8600M0219J90533A1946K26044a14642
12687a96156B57203n5856H9789c70667B98164a35867L8391A31260a69515D5518
12676b0117C99629f7108g185H0982N2282B0086O3599N2452a93189H8542a46547
12664g0846A97970D5285K4322K17313A36697K92492k07014q3700Q5452H8182a43037
12652d5078D7962J72239m7083c4133A31737l6180J8492b12717B20993H3142R5241
12641A78383b8174D2408L03677e3896D4755K17292M3142j09566k7660G4610J9061
$$ plain form
12630 93671 -37622 185094 401719 161926 247812 -27075 269428 301542 -15488 -87971 -64770
12619 -64770 32550 47753 148439 -111178 -185916 190744 -299275 -232106 142141 115923 -64048
12607 -151167 173861 171227 282850 47258 50675 94997 202018 31640 176013 -88635 34667
12595 442711 -296120 65674 -92056 42188 332634 68365 85747 233906 -44739 -101020 -177960
12584 -177960 217106 -179383 -71505 131437 401501 138012 23949 -52005 9942 -172290
12573 -69806 296526 -86925 -76295 -136122 372224 112174 308029 -198206 132323 37947
12562 -39171 65698 -216875 338726 -6040 216356 -255589 -284905 105410 -145188 -279571
12552 -279571 86057 -235218 -334741 -318198 -295270 179127 234309 94559 78924 364470 -39419
$$ packed form
12630I3671c7622A85094K16625A61926Q5886b7075B69428L2114a5488p2483K3201
12619f4770C2550J5203J00686a11178p4738A90744b99275O7169A42141k6218f4048
12607a51167A73861k634J11623D7258L417M4322J07021C1640J44373h8635C4667
12595D42711b96120F5674i2056D2188K90446F8365J7382J48159d4739n6281p6940
12584a77960B17106a79383g1505A31437K70064A38012B3949e2005I942a72290
12573f9806B96526h6925J0630n9827C72224A12174J95855a98206A32323C7947
12562c9171F5698b16875C38726f040B16356b55589k9316A05410a45188j34383
12552b79571H6057b35218r9523J6543K2928A79127N5182I4559j5635K85546c9419
$$ plain form
12540 -77931 -94140 -80123 43006 147725 -59331 -209515 -54636 243505 40974 192872 -335667
12528 39763 301817 86531 -136848 36369 221459 -128974 -162182 -108868 339145 160336
12517 -228994 281085 16074 -219002 41634 -153118 -53719 -130833 228776 -112428 213297
12506 161722 33440 -348308 171743 -188965 358865 51897 202259 -313200 -58378 -226063
12496 -226063 -301433 -146474 -291042 33735 389643 63705 229131 -219825 161684 277799
12486 277799 -112778 281750 -171338 -72472 9962 -175673 -72554 253119 273891 -8295 -136094
12475 -136094 -45523 -180176 101103 -187699 -526054 -391060 84460 -219159 -17945 2359
12464 14086 -37926 41143 194181 -46907 141579 -137900 -56589 -66919 -73947 -115648 -70184
$$ packed form
12540g7931j6209J4017D3006J04719e9331j50184e4636B43505D0974J51898c35667
12528C9763K62054H6531a36848C6369J85090a28974l3208N3314C39145A60336
12517b28994B81085A6074b19002D1634a53118e3719p7114B28776a12428B13297
12506A61722C3440c48308A71743a88965C58865E1897J50362c13200e8378j67685
12496b26063p5370a46474j44568C3735L55908F3705J65426b19825A61684J16115
12486B77799a12778B81750a71338g2472I962a75673g2554B53119K0772h295j27799
12475a36094d5523j34653A01103a87699l38355J34994H4460b19159a7945B359
12464A4086c7926D1143J53038d6907A41579a37900e6589j0330p028m1701M5464
$$ plain form
12453 -70184 105066 35142 -117739 -71283 -204290 -57038 -151141 -84484 58737 160347 -232557
12441 -86547 -182990 -167709 314935 -22316 -58087 83211 -41848 68741 -158654 261862 107540
12429 520946 -26859 -100508 -8263 -127986 -380255 -225964 118236 -71237 -49645 205242 92585
12417 -108553 106824 16253 -21324 299150 133505 277775 221710 -53875 -18004 -244455
12407 -244455 66121 -196825 72141 218655 -240247 148739 37270 123420 151579 -37452 257247
12395 -147262 -177450 120829 128551 -9982 -511659 428326 169097 159002 -7581 -18099 201025
12383 800 254794 -50155 121693 -289191 -30632 67217 127766 -136706 -78453 -102900 -78794
12372 -78794 233739 163015 -7179 -749 127523 -26695 -88339 89438 -127329 312286 -127540
$$ packed form
12453g0184A05066C5142a17739M6456j33007e7038r4103O6657E8737J01610b32557
12441h6547r6443J5281C14935b2316l5771H3211d1848F8741a58654B61862A07540
12429E20946b6859p3649h263j19723k52269J54291A18236g1237K1592B05242I2585
12417a08553A06824A6253b1324B99150A33505J44270n6065e3875a8004k26451
12407b44455F6121a96825G2141J46514b40247A48739C7270Q6150K8159c7452B57247
12395a47262l0188A20829P722i982n01677D28326A69097j0095g581j0518B01025
12383H00K53994e0155A21693b89191c0632F7217O0549a36706N8253k4447K4106
12372g8794B33739p0724g179g49A27523b6695o1644H9438a27329C12286a27540
$$ plain form
12360 -236670 301029 202122 -77001 118839 -4689 -5182 -373122 -126606 -452498 271773 234283
12349 234283 -174724 39323 117422 63568 -161157 -57046 8009 70565 359967 -114356 166951
12337 -44388 -337057 -144681 -219648 296715 47251 -61769 -103124 347658 100586 99773 114047
12326 114047 -49882 -363017 -52116 21789 -8395 -300471 -60867 -224376 18097 13027 167404
12315 167404 67126 42274 340393 -57718 134566 -361149 -265868 -116635 -91302 -190894 152629
12303 -299718 -152107 -105710 33362 -220557 128410 203977 353598 77790 -52285 -202811
12293 -202811 -70894 -315014 220676 -70633 -192027 -266725 -189077 -30495 -363264 30943 106961
12282 106961 81029 -43604 -3555 145182 318985 -98813 226897 316517 159615 175985 170534
$$ packed form
12360b36670C01029r8907g7001A18839d689m93l67940a26606l25892B71773l7490
12349B34283a74724C9323P8099n3854a61157e7046H009O2556K89402a14356A66951
12337d4388k92669a44681p4967B96715D7251f1769m1355C47658A00586q13J4274
12326A14047d9882l13135e2116B1789h395k92076f0867j63509A8097n070J54377
12315A67404F7126k4852K98119e7718A34566c61149R5281a16635K5333r9592A52629
12303b99718J47611M6397C3362b20557A28410P5567J49621G7790e2285j50526
12293b02811g0894k44120B20676g0633j21394p4698P7648c0495l32769C0943P6018
12282A06961k5932d3604c555A45182J73803i8813B26897Q9620j56902J6370n451
$$ plain form
12271 170534 145801 2184 -87012 -82025 -8632 255445 -77186 121776 58524 -16338 62275 -42870
12258 131750 205220 167602 -27653 -293110 80253 121699 -331844 -151724 105836 -59936 -313981
12247 -313981 13107 87324 -189751 306430 -55518 101491 168781 153667 6713 91408 430868
12236 430868 114678 -26972 -296 145315 215227 -27978 215436 142077 -84521 -128414 -101227
12225 -101227 -150816 162203 -24155 147881 45130 -171182 471843 369486 320595 125530
12214 -184442 350113 317653 152004 281507 398290 211012 338140 93974 -31681 134245
12203 232679 192603 42413 447107 41547 41139 347860 275709 240371 234280 256830 253124 -52222
12190 193377 59445 419284 188548 232521 -12081 8304 153833 -109700 273344 396181
$$ packed form
12271A70534k4733B184h7012M987h632B55445g7186A21776E8524a6338F2275d2870
12258A31750P3470l7618b7653k65457H0253M1446c31844a51724A05836e9936k54045
12247c13981A3107P4217a89751C06430e5518A01491O7290j5114F713Q4695L39460
12236D30868A14678b6972b96A45315O9912b7978B15436p3359h4521m3893K7187
12225a01227m9589A62203b4155A47881D5130a71182D71843j02357m8891A25530
12214a84442C50113l2460A52004J29503J16783j87278J27128I3974c1681A34245
12203B32679m0076D2413M04694D1547m08L06721p2151l5338o091K2550l706e2222
12190A93377E9445L59839A88548M3973a2081H304J45529a09700B73344J22837
$$ plain form
12180 396181 51775 116905 123827 -99756 50071 50289 499724 -96634 131449 79037 -89971 42499
12167 197802 -27224 -52622 -126314 -90102 71460 210849 7919 -78885 -49689 33075 72852
12156 72852 158410 40229 -113393 81166 14229 24840 -192202 103632 -19251 -58162 101633
12144 -126973 -423507 -13774 361736 288347 38085 171247 263985 -150554 -31923 -118190 -173581
12133 -173581 -8352 -45227 -101535 178876 53210 -36769 55336 141506 -204164 -140989 -81681
12122 -81681 142394 94708 -27177 279788 -45129 -76842 -16553 154244 -411826 -153262 44098
12110 117577 310692 -4138 -17384 224623 -297081 -35708 -57162 -7498 -255108 -32580 -561247
12099 -561247 -369581 -285151 120810 -23244 17689 -3251 139068 -196197 50959 98311 -65258
$$ packed form
12180C96181E1775O5130O922i9756E0071K18M49435i6634A31449n2412h9971D2499
12167A97802b7224k5398p3692L6212G1460J39389G919g8885K9196C3075L9777
12156G2852Q5558D0229a13393H1166A4229J0611a92202A03632a9251l8911A01633
12144a26973k96534a3774C61736p3389C8085J33162R2738a50554c1923q6267n5391
12133a73581h352l6875n6308A78876E3210c6769E5336Q6170b04164O3175N9308
12122h1681A42394m7686b7177B79788d5129l1713a6553A54244d11826a53262D4098
12110A17577J93115d138j3246B24623b97081c5708k1454g498k47610c2580n28667
12099e61247J91666Q4430A20810b3244A7689c251A39068a96197E0959M7352f5258
$$ plain form
12087 -449006 48668 73858 152077 -55576 -368849 67325 117852 23813 135428 57980 199240
12076 199240 506668 409243 1993643 1426903 156209 177984 206640 -7755 -15931 -54527 -42216
12065 -42216 -34063 118958 -190844 -92462 -33483 -172106 218062 178980 109242 -160211 -12862
12053 278741 246971 -232649 -78965 940 250444 30685 -216492 303851 -114684 -149739 143731
12041 116054 143573 261917 26943 -82819 -161499 -314438 69701 -37833 -296982 -186543 -12835
12029 49421 125790 -174857 202616 -83855 -266634 211920 -112981 -444322 207186 119359
12019 119359 -262045 -4266 -23765 -107839 343749 -45326 -35293 -93362 -169243 -348754 167876
12007 -316319 76828 -152295 -170159 -128544 -290610 -58361 105842 -218176 -190867 -109687 -154498
$$ packed form
12087d49006D8668K5190P8219e5576l13273F7325N0527B3813J11615E7980J41260
12076A99240L07428r7425J584400n66740A56209K1775K8656g755q176l8596J2311
12065d2216Q153A18958a90844i2462c3483j38623B18062l9082o9738a60211a2862
12053B78741l1770b32649g8965I40K49504C0685b16492C03851a14684l5055A43731
12041A16054K7519J18344B6943h2819p8680j52939F9701c7833k59149J10439a2835
12029D9421P6369a74857B02616h3855j82779B11920a12981l31341B07186q7827
12019A19359b62045d266j9499q4074C43749d5326J0033n8069p5881j79511A67876
12007c16319G6828a52295j7864M1615j62066e8361A05842b18176K7309Q1180m4811
$$ plain form
11996 -154498 160077 52866 -109819 237137 -449228 -20961 273272 -63660 149896 -30140
11985 198281 122528 118439 -303864 -159019 -11896 -311040 58463 -256779 -233355 225877 -29956
11973 -193062 108354 -71236 -362009 -163887 35757 21316 313649 -88705 105072 222202
11963 222202 -70072 295937 -123302 -213250 -50192 -147461 371555 30807 83087 76536 -41328
11951 -352765 -83046 -106830 182490 -147564 185336 -37902 -215851 -185276 110045 305935
11941 305935 -110016 101471 -130619 173348 229084 -124141 -261104 62441 -200028 72606
11930 -176968 -242930 -163133 -152245 -106798 -107594 -34167 160539 -7025 126846 -136564 -110070
11919 -110070 209767 163834 9720 177015 215194 49656 -170807 -79920 -349780 -94458 350637
$$ packed form
11996a54498A60077E2866a09819B37137d49228b0961B73272f3660A49896c0140
11985A98281p5753m089c03864J44845a1896k99144E8463b56779K3424B25877b9956
11973a93062A08354g1236k90773a63887C5757j4441K92333h8705A05072J17130
11963B22202g0072B95937a23302q9948e0192r7269C71555C0807N2280o551d1328
11951c52765h3046k3784A82490a47564A85336c7902j77949L0575A10045J95890
11941C05935a10016A01471a30619A73348N5736a24141j36963F2441b00028G2606
11930a76968o5962P9797J0888M5447p96c4167A60539g025A26846a36564K6494
11919a10070B09767m5933I720J67295L8179D9656a70807g9920k69860i4458C50637
$$ plain form
11907 3618 -11454 -71842 43901 -38067 104682 136339 -137229 -26461 165693 176754 35123
11895 83795 48052 -206238 -114864 -219602 -134676 162600 85103 -23221 -114706 -3032 -208598
11884 -208598 305115 116774 -39867 73236 -317964 65749 -210986 -9493 -361079 168850
11873 -57661 -3965 222058 -38787 27655 168094 -103640 95145 173825 -46587 -32266 116093
11861 95117 -238936 -177398 319473 159217 -125762 -22146 188297 -10711 -70856 20446 -54246
11849 830 -37123 -44567 -162775 116784 2332 -36957 -149190 23306 -112608 8739 -291290 -31291
11836 -123419 -49192 81662 -230966 -92580 197308 -45683 116940 114736 -356339 -54653 57880
11824 -8265 61866 31351 87360 162621 -79685 -146182 -274770 -230052 -228284 -98852 -75234 -96527
$$ packed form
11907C618a1454o0388D3901c8067A04682L1657a37229b6461A65693J1061C5123
11895H3795l5743b06238R1374j04738Q4926A62600p7497b3221r1485c032k05566
11884b08598C05115A16774c9867G3236c17964F5749b10986i493l51586A68850
11873e7661c965B22058c8787B7655J40439a03640I5145P8680d6587J4321A16093
11861I5117b38936O1538C19473A59217a25762b2146A88297a0711o0145B0446e4246
11849H30c7123p444j18208A16784B332c6957j12233B3306a12608H739b91290c1291
11836a23419d9192H1662b30966i2580A97308d5683A16940k204c56339e4653E7880
11824h265F1866l0515N6009P5261g9685o6497j28588M4718J768i8852K3618k1293
$$ plain form
11812 -96527 -241506 37178 -139518 -243860 52281 -225100 116297 -107259 -58141 3932 139798
11801 139798 3366 -213526 52854 -134482 -156103 64876 44754 -252502 -104045 -205839 176612
11789 457523 -109568 41053 275121 -49718 82791 -120471 393735 12982 153793 -312813
11778 -164240 136909 224541 75141 -69205 -338241 38222 509968 76949 -227422 29227 101314
11767 101314 -46303 69556 -44561 -202189 371852 -6410 16721 -224528 -97006 -18340 71067
11755 -12809 13688 86020 141264 -105772 206498 -201143 -261998 -305704 -44654 -200781 53160
11743 200759 -126562 -13315 342034 244321 -141689 -145980 -139742 140175 300857 -22855 314078
11731 -68346 -149735 -3586 266977 -218041 -117623 96656 -171495 -129762 442995 243345 49723
$$ packed form
11812i6527j44979C7178a39518j04342E2281b25100A16297a07259M9118C932J35866
11801A39798C366b13526E2854a34482k1621F4876k0122b52502a04045j01794A76612
11789D57523a09568D1053K34068d9718H2791a20471C93735A2982J40811c12813
11778a64240A36909Q7632G5141f9205k69036C8222M71746G6949b27422B9227P2087
11767A01314d6303F9556d4561j57628C71852f410A6721b24528i7006a8340G1067
11755a2809A3688P2332N5244a05772B06498b01143o0855m3706d4654j56127E3160
11743B00759a26562a3315C42034r7713a41689m291O238A40175J60682b2855C14078
11731f8346q1389c586B66977b18041J00418I6656a71495M1733D42995j99650D9723
$$ plain form
11719 241361 -109583 81072 -56969 -333639 4054 175089 366692 -69176 -111099 -122883 -176335
11708 -176335 -195639 -359584 -79999 35082 -50230 -163486 167917 -62314 10728 -49155 -13354
11696 26017 102111 390464 -337487 307202 399919 -128623 329413 -199821 -250133 268188
11685 179645 -107238 8382 57407 -44089 126027 -346 97591 38032 140372 -181991 -57658
11673 68823 -37369 -148804 129064 -149761 192266 -79907 -334673 -176690 -335782 -124418
11662 301133 -299442 -136707 -183311 35656 100258 117112 -196322 36457 -204628 125023
11651 133037 -24277 256976 71264 176432 389224 15668 162282 16056 -204691 -7626 171249
11639 -170579 47759 32713 171761 -85397 411569 108042 -79453 -294974 -63605 -375805
$$ packed form
11719B41361a09583H1072e6969k76670D054J71035J91603f9176m1923j1784n3452
11708a76335j9304j63945g9999C5082e0230j13256A67917f2314A0728d9155a3354
11696B6017P6094K88353c37487C07202R2717a28623C29413a99821n0312B68188
11685A79645a07238H382M9025d4089A26027c46I7591C8032J02340a81991e7658
11673F8823c7369j11435A29064a49761A92266g9907k54766J57983j59092a24418
11662C01133b99442a36707m6604C5656O4602J6854a96322C6457b04628A25023
11651A33037b4277B56976G1264J05168K12792A5668J46614A6056b04691g626A71249
11639a70579D7759j5046J39048h5397D11569A08042g9453k15521f3605l12200
$$ plain form
11629 -375805 201472 63994 -15294 268669 -37776 -41124 76064 -157294 85065 -44465 -185094
11618 -185094 123899 41581 -116647 -320304 2250 157922 -51946 -1955 -68176 214465 -114311
11606 -221700 219505 21433 52867 -149807 128931 -46458 391 377361 -48497 -89434 55770
11594 -204040 36621 87698 43199 580290 -118632 -107723 27196 -25347 273464 171710 -244509
11582 168548 -116234 -35914 90074 -323578 -144202 -206686 278848 277330 266673 -59658 83321
11570 222583 138445 23616 36542 276449 -243790 110702 13220 102446 117015 10941 6529
11559 6529 140291 339111 -135154 -55663 53010 -254023 96290 67991 -58713 49487 472168
11548 472168 39966 -133193 364986 -101992 47698 22183 -72122 223376 -51657 -132589 -23578
$$ packed form
11629c75805B01472F3994a5294B68669c7776l348G6064a57294H5065d4465j40629
11618a85094A23899D1581a16647k03657B250J55672e1946a955o6221B14465a14311
11606b21700B19505B1433L1434a49807A28931d6458C91L76970d8497m0937E5770
11594b04040C6621N1077D3199N37091a18632J0909B7196b5347B73464j01754b44509
11582A68548a16234c5914I0074c23578a44202o2484B78848j518j0657e9658H3321
11570B22583q4138B3616J2926K39907b43790A10702A3220Q9226J4569A0941m412
11559F529J33762J98820a35154e5663E3010b54023I6290k8299e8713D9487M22681
11548D72168C9966a33193C64986a01992D7698B2183g2122B23376e1657q0932b3578
$$ plain form
11536 -42733 197184 119300 -19561 -80257 -137267 13457 347728 -4123 -251919 266287 48623
11524 27567 -185229 73573 298867 308914 181557 -71242 166272 142704 264444 266230 -139983
11512 -67455 458911 28586 119814 380166 31148 -133675 296337 428790 156021 -74187
11501 96766 209943 111817 130224 243062 -83944 -85266 -51255 -16243 -141052 302397 105129
11489 10569 113936 119291 270496 431054 209312 85226 22386 295022 290284 156725 -34771
11477 -37007 319101 6164 18443 473799 342974 277316 599536 -21968 204022 177454 131997
11466 131997 52399 5331 -217782 142543 247244 270398 99096 151232 -14224 27846 184750
11455 184750 201968 209082 -70612 231866 260035 -163247 12899 215396 66069 -92846 -35810
$$ packed form
11536d2733A97184p7884a9561o0696n7010A3457L34271d123k47796B66287D8623
11524B7567a85229G3573K25294J0047j27357g1242A66272k3568J21740J786a39983
11512f7455D58911B8586R1228K60352C1148a33675B96337J32453A56021g4187
11501I6766J13177r8126J8407J12838h3944j322L4011a6243j24809C02397A05129
11489A0569J03367N355J51205J60558B09312H5226B2386K72636m738j33559c4771
11477c7007C19101F164J2279M55356j30825o5658L22220b1968B04022k6568m5457
11466A31997E2399E331b17782A42543J04701K3154I9096N2136a4224B7846J56904
11455A84750J7218P114g0612B31866K8169a63247A2899K02497F6069i2846c5810
$$ plain form
11443 57529 84628 -37786 132583 112068 -119264 -123561 464640 -82310 189911 -280977 167868
11431 -86160 -186394 375239 163038 182419 -153023 -37943 418809 -121855 -7905 -210357
11421 -210357 4959 -151856 7336 269360 280888 -55266 -29501 -27505 -28698 47144 -44079 -24273
11409 -24273 -344 -188005 92728 145433 58995 163129 255352 -217493 199744 209687 261288
11398 261288 236379 126311 285897 -2964 94585 -349159 42119 -242675 3521 68944 -5578
11386 -40536 -199980 -142964 254249 -280142 -243181 -124554 83711 -117765 5921 323198 398228
11375 398228 388987 -103484 16212 -85176 214782 26537 -316286 -23314 -16353 -357888 -154587
11363 -41108 -306603 20752 180002 214494 -126479 7749 18779 -213271 -150396 39341 -229246
$$ packed form
11443E7529K7099c7786A32583k0515a19264m297D64640h2310A89911b80977A67868
11431h6160j00234C75239A63038J9381a53023c7943D18809a21855g905k02452
11421b10357D959a51856G336K62024J1528e5266K5765J996j193D7144d4079J9806
11409b4273c44j87661I2728N2705E8995J04134R2223b17493A99744R943N1601
11398B61288k4909j10068J59586b964I4585c49159D2119b42675C521O5423e578
11386d0536j59444N7016B54249b80142L6961J18627H3711a17765E921L17277P5030
11375C98228r241a03484A6212h5176B14782B6537c16286b3314O961l41535a54587
11363d1108k65495B0752J59250L4492a26479G749J1030b13271O2875C9341b29246
$$ plain form
11351 390171 21868 -305655 3347 242323 49315 -18611 -471351 345555 42359 -1703 -11454
11340 -11454 185957 -18505 -123892 -64856 -90053 -37712 -332936 -72545 -131986 -141520 -68800
11328 40691 149161 -108726 126306 -32381 93451 -39928 -85740 -1907 -218378 1154 -42251
11316 76117 -246002 -148891 7085 1676 -275877 171255 -157503 -259062 167051 184547 206909
11305 206909 -90469 -19814 -383618 -222960 73414 -243943 -328284 -144960 -104099 -44366 -92279
11294 -92279 -31981 67669 119321 -31322 416690 -65989 124189 23317 32113 -98697 -196353
11283 -196353 52925 -29006 157035 172606 -78446 -132492 45184 -5617 101396 104729 -83834
11271 169077 -66851 -102905 93036 21034 -182230 -318431 -43457 158484 -34101 -122605 -132871
$$ packed form
11351C90171B1868c05655C347K38976D9315a8611m52740C45555D2359a703r751
11340a1454A85957a8505j05387N9036k5197c7712k95224g2545n9441r534f8800
11328D0691J08470a08726A26306c2381I3451c9928m5812a907k16471A154d2251
11316G6117b46002R7111G085A676b75877A71255a57503j01559A67051J7496K2362
11305B06909i0469a9814l63804J60658G3414b43943q4341a44960M0861d4366m7913
11294i2279c1981F7669N1652c1322D16690f5989A24189B3317Q796i8697r7656
11283a96353E2925b9006A57035J5571g8446n4046D5184e617A01396L333h3834
11271A69077f6851l6054I3036B1034a82230j36201d3457A58484c4101q8504j0266
$$ plain form
11260 -132871 -34922 -80842 -134878 -7 -38924 -452769 292476 225284 34885 -17618 -217253 29289
11247 198210 -225329 -227480 -100185 52593 64710 -288931 73991 162789 -380451 -69008 -162350
11236 -162350 -110424 -407224 -38948 -218345 154445 -123661 -239415 -20783 113435 119514
11226 119514 217081 -55891 291497 -80420 -26395 64273 98767 26707 -369426 19012 159524
11215 159524 177521 -69642 -230678 -130549 57321 -317914 64683 77014 -211774 72860 -141098
11203 -81778 -280083 149856 55355 75397 25432 -215898 -98145 -38504 212892 176254 174845
11192 174845 -74537 288392 28599 -68247 -363818 -152754 -165791 -175971 -64554 -213142 232111
11180 71567 51471 42711 126272 -246444 -46434 36544 207577 -38514 -138202 -116919 79842
$$ packed form
11260a32871c4922m5920n4036gl8917m13845B92476o7192C4885a7618j99635B9289
11247A98210b25329k151a00185E2593J2117b88931G3991Q8798c80451f9008r3342
11236a62350N1926k96800c8948j79397A54445a23661j15754b0783A13435O079
11226A19514R7567e5891B91497h0420b6395F4273L4494B6707c69426A9012J40512
11215A59524J7997f9642j61036J00129E7321c17914F4683J2331b11774G2860a41098
11203h1778j98305A49856E5355K0042B5432b15898i8145c8504B12892l6638j409
11192A74845g4537B88392B8599f8247k95571a52754j3037j0180f4554j48588B32111
11180G1567k0096q760Q3561b46444d6434C6544J71033c8514r9688K1283G9842
$$ plain form
11168 16810 -166512 656586 440342 -258430 271777 -132651 -33875 -198825 -269099 116118
11157 396864 -41762 88784 143863 -211287 240796 73266 -173069 -249827 -67056 72643 -203379
11145 -465497 -23732 96306 115230 -62722 -62022 -79667 44220 199727 72926 283001 -57248
11133 387790 -409981 109740 -92129 188798 30602 143184 -152141 -67679 -142569 269261
11122 164872 154180 70487 12034 142616 55364 -219775 -131147 23172 169707 227640 111248
11110 50970 139711 30239 55030 371819 283683 335242 214812 -319515 -83576 160419 166688
11099 166688 130135 428656 -179374 139489 125757 275015 296754 547393 -48846 -90001
11089 -90001 112002 252277 167305 120792 51038 91343 189313 156516 105909 130684 260507
$$ packed form
11168A6810a66512F56586k16244b58430B71777a32651c3875j64950p0274A16118
11157C96864d1762H8784N5079b11287B40796G3266a73069p6758f7056G2643b03379
11145d65497b3732I6306J8924f2722P00j7645D4220J55507G2926K10075e7248
11133C87790d09981A09740i2129A88798C0602J12582a52141f7679p4890B69261
11122A64872j0692G0487A2034J30582E5364b19775Q8628B3172J46535N7933A11248
11110E0970Q8741C0239K4791L16789q8136N1559j20430c19515h3576A60419O269
11099A66688l6553K98521a79374A39489j3732J49258K1739K50639d8846m1155
11089i0001A12002J40275q4972m6513E1038M0305R7970l2797n0607K4775J29823
$$ plain form
11078 260507 416652 244749 46162 191496 162743 320619 391077 181233 454190 576502
11068 576502 649067 301805 480990 305050 255288 219525 180664 569909 625055 400745
11058 400745 661487 434928 649591 503855 716634 503245 945897 1008780 931041 432435
11047 527275 561138 920165 546546 324566 628364 736974 577214 465919 527517 498085
11037 498085 275746 325395 722183 464689 590865 551643 518308 534356 529453 1014116 735948
11026 735948 844276 513476 669989 707439 584830 547683 449290 364726 625979 499847
11016 499847 638337 666895 346073 378297 181529 410750 624704 509255 860990 559758
11006 559758 621040 628723 702469 506608 537174 257235 481971 431558 618003 466579 554360
$$ packed form
11078B60507J56145j71903D6162J45334k8753J57876P0458A81233K72957J22312
11068E76502P2565C01805J79185j75940m9762l5763l8861L89245N5146k24310
11058D00745K60742k26559K14663j45736K12779k13389M42652O2883p7739D32435
11047E27275L3863L59027l73619k21980L03798J08610j59760j11295O1598k9432
11037D98085k22339M9649L96788k57494J26176l9222l3335J6048m903M84663k78168
11026G35948J08328l30800J56513L7450j22609l7147r8393q4564K61253j26132
11016D99847J38490K8558l20822L2224A81529K29221K13954j15449L51735l01232
11006E59758O1282P683P3746j95861L0566B57235K24736n0413J86445j51424Q7781
$$ plain form
10995 554360 649644 601111 572392 810637 447154 791031 672331 825765 669196 958315
10985 958315 624417 619753 707827 916260 1401388 1102402 1399004 1587286 1515310 1455059
10975 1455059 1328108 1861501 2542745 2677672 2421127 2586678 2321688 2091905 1984442
10966 1984442 1904412 1751764 1518040 1412058 1619002 1599695 1247237 1415112 1419530 1401926
10956 1401926 1459793 1300463 1127450 1039830 1109527 1048099 778158 651090 491425 612933
10946 612933 252081 556023 215625 284645 142359 36944 360486 94918 -100631 144033
10935 22117 239683 -119489 -201439 -213233 -219878 145062 8892 -60755 85005 390129 200947
10924 200947 -283532 92916 99202 30683 -86147 -122953 4480 244535 152566 102201 -331385
$$ packed form
10995E54360R5284m8533k8719K38245l63483L43877j18700J53434j56569K89119
10985I58315l33898m664Q8074K08433M85128k98986K96602J88282p1976o0251
10975A455059j26951N33393O81244J34927k56545J65551k64990k29783j07463
10966A984442q0030j52648k33724j05982K06944j9307l52458J67875M418j7604
10956A401926N7867j59330j73013q7620O9697o1428k69941j27068j59665J21508
10946F12933B52081L03942B15625O9020j42286C6944L23542I4918a00631A44033
10935B2117K17566a19489q1950j1794o645A45062H892f0755H5005L05124j89182
10924B00947b83532I2916O286C0683h6147l6806D480K40055r1969n0365c31385
$$ plain form
10912 299156 53572 199210 95917 52477 24865 -62945 241015 -203577 -13485 -286815 16769
10900 -180962 17262 -308944 32690 -26427 148528 217879 69375 111734 -40402 -153875 -72508
10888 59950 20511 122632 -204706 -435860 -173777 -185062 221150 95649 -155369 8861 26971
10877 26971 -316331 -323870 -152766 100331 388311 234635 12986 -70717 62779 -67645 -128590
10866 -128590 317041 -64499 -21106 105645 -130229 -269490 -220153 68457 1238 27523 94188
10855 94188 122282 -34986 -322310 66062 117371 -82660 -56708 -195651 -41675 -181239 -114115
10844 -114115 132171 326824 -238807 -48644 -326289 -269530 137337 -297678 -304759 4644 -69539
10832 -65302 -166445 100892 -276055 151302 34127 302907 -112577 226152 -42251 -72370
$$ packed form
10912B99156E3572J45638I5917m3440B4865f2945B41015b03577a3485k73330A6769
10900a80962A7262c08944C2690b6427A48528O9351F9375M2359d0402j13473g2508
10888E9950B0511J02121b04706k31154a73777j1285B21150I5649a55369H861J8110
10877B6971c16331p539a52766A00331K87980j53676A2986g0717F2779f7645o0945
10866a28590C17041f4499b1106A05645a30229j39261M9337F8457A238K6285O6665
10855I4188K8094c4986k87324F6062N1309h2660K5952j38943d1675j39564O7124
10844a14115A32171J94653b38807d8644k77645N6759A37337b97678p081D644f9539
10832f5302j01143A00892b76055A51302C4127K68780a12577B26152d2251l0119
$$ plain form
10822 -72370 353665 -113633 -210489 -113408 187906 23066 23428 132092 -73195 270916 39031
10810 32946 -113977 -181733 -121309 -39061 35130 -232759 305882 -124369 60140 239790 106650
10798 169332 -177845 -142541 -152482 46404 46733 -53934 369378 34678 219549 -56081 137980
10786 -46397 125283 78895 -86692 -306232 201167 -178360 -200284 -45795 -352405 -216057
10776 -216057 262810 -338088 -194285 216724 -8263 124781 227652 -34502 133687 24547
10765 7625 277626 -261397 -235037 31821 54780 -122939 -188529 -21806 -37119 -170117 -36564
10753 9874 92926 -283347 -177502 78319 -55127 256783 -2308 153425 236805 142579 -135365
10741 -229098 -305903 -249044 -87947 -142835 -65631 -106858 77534 72883 30275 -140669 -213064
$$ packed form
10822g2370C53665a13633r6856R7081A87906B3066L62J08664g3195B70916C9031
10810C2946a13977o7756O0424c9061C5130b32759C05882a24369F0140J79650A06650
10798A69332a77845L5304r941D6404L29e3934C69378C4678J84871e6081A37980
10786d6397A25283m6388h6692k19540B01167a78360k1924d5795l06610J36348
10776b16057B62810c38088J43803B16724h263A24781J02871c4502A33687B4547
10765G625K70001b61397K6360C1821K2959a22939o5590b1806j5313j32998c6564
10753I874Q3052b83347J05845G8319e5127B56783b308A53425Q3380r4226a35365
10741b29098p6805N6859h7947n4888f5631m1227G7534m651C0275a40669p2395
$$ plain form
10730 -213064 -41636 -124865 -14740 103718 -133618 -148124 7372 -86322 -143289 -205028 -119560
10719 -119560 268386 -135825 -276834 -222472 325322 -226509 37797 69497 -211770 337750
10708 -136048 97734 157457 -70151 118621 354001 -210844 1886 -138069 107179 243004
10698 243004 194058 -39681 -221973 67843 -224154 171760 31616 -29406 -68993 41849 81616
10687 81616 60792 -120454 -31544 143145 -78207 -44986 336182 -90780 -169695 -57535 -160401
10676 -160401 -42657 16077 244453 -193754 -56070 -245823 -5696 26950 -148175 -19963 112099
10664 203125 375262 -233139 55990 -227620 52779 -124039 -19629 -368192 -158448 -51042
10653 -79769 -87748 236392 575 -317987 -28308 -142098 -139677 223816 -146174 199869 52373
$$ packed form
10730b13064d1636q3229a4740A03718a33618j4506G372h6322n6967o1739Q5468
10719a19560B68386a35825j41009N4362C25322b26509C7797L1700b11770C37750
10708a36048I7734N9723g0151A18621K35380b10844A886a38069A07179J35825
10698B43004m8946c9681j82292F7843b24154A71760C1616b9406l9587D1849L9767
10687H1616k0824a20454c1544A43145g8207L3221C36182i0780p8915e7535j02866
10676a60401d2657A6077K28376a93754e6070j89753e696B6950a48175a9963A12099
10664B03125J72137b33139E5990b27620E2779a24039a9629l48563a58448e1042
10653g9769p979B36392E75c17987b8308j13790K421B23816a46174A99869E2373
$$ plain form
10641 145933 167528 -376989 -149078 -55303 -123314 51659 29401 -76019 63782 279022 15634
10629 -292186 253160 -26256 -36522 -122817 -14238 -169499 74471 -55012 248904 -311417 -49230
10617 -139071 82657 -206932 48044 65546 244211 -256415 -262662 -265286 186638 -402462 -341455
10606 -341455 -99810 -42730 129894 160247 -69400 -56903 122233 121239 -183433 -33019 -26861
10595 -26861 -218968 -163657 46249 61819 -151111 -25611 -31719 9888 -279451 59157 -124181
10583 -351695 -33818 -301426 305860 -54051 -65153 24319 -108667 -153346 -81839 -187731 101668
10571 -7189 -207831 -140361 -55602 -47331 37127 -72828 -111390 174871 -168953 -363800 -47844
10559 147147 -71483 -260468 -55433 149020 195283 -15206 316955 -221193 48666 -163136
$$ packed form
10641A45933K1595c76989a49078e5303o8011E1659k2258g6019F3782K15240A5634
10629b92186B53160b6256j0266q6295a4238j55261G4471e5012B48904c11417d9230
10617a39071H2657b06932D8044J7502J78665b56415o247k624A86638d02462O1007
10606c41455i9810d2730A29894L0353f9400J2497A22233r94a83433c3019O158
10595b6861j92107N5311D6249J5570a51111b5611o108I888b79451E9157a24181
10583c51695c3818k67608C05860e4051j1102B4319a08667m4679P1507j05892A01668
10571g189k00642O7470e5602Q271C7127g2828l8562A74871a68953j94847d7844
10559A47147g1483j88985e5433A49020M6263a5206C16955b21193D8666a63136
$$ plain form
10548 -200436 212594 130931 -45263 -141815 -7625 76028 374836 84262 -121000 -231475 -327535
10537 -327535 47413 2067 -219604 78999 32698 4574 27170 -130633 -133577 -143383 15622 98236
10525 98236 -347566 59938 -295470 -139193 109203 248065 -186251 -100629 -86125 -84285 -169875
10514 -169875 -167937 96404 130593 80869 -76698 -17965 53401 -32980 -235659 -52537 -40096
10503 -40096 75584 84682 12721 -73321 -30444 51062 18068 112807 -110372 -430750 101256
10491 -479399 75471 -254688 -225528 124831 -132754 -133274 -2804 168072 106793 266637 227610
10480 227610 413093 319560 16550 -124007 125825 -94457 132361 -171948 -68035 256925
10469 298153 -190768 18720 -73712 -57432 -22313 57054 214087 200535 211269 -110478 253924
$$ packed form
10548b00436B12594q1663d5263r6552g625G6028K98808H4262a21000j10475r6060
10537c27535D7413B067b19604G8999C2698D574K2596a30633k944r806A5622Q2614
10525I8236c47566E9938b95470a39193A09203J38862a86251Q5622J4504J840q5590
10514a69875J938I6404L4189m9724g6698a7965E3401c2980k02679e2537J2441
10503d0096G5584R098A2721g3321c0444E1062A8068R4739a10372l20378A01256
10491d79399G5471b54688K9160A24831a32754n20b804A68072o1279J59844l9027
10480B27610J85483r3533A6550a24007A25825i4457A32361a71948f8035B56925
10469B98153a90768A8720g3712J6280b2313E7054J57033j3552J0734a10478B53924
$$ plain form
10457 82626 -309712 280814 883 -182397 77251 -161409 -91632 248672 146683 139195 210003
10446 210003 -161687 -389257 -74333 108998 -49093 -46334 -97245 107350 -2884 56772 -7942
10434 212505 185048 -224475 64636 2704 116525 274257 -8176 5312 120205 -248074 -294294
10423 -294294 -88545 38264 -70424 -41426 50736 23289 -57731 254798 -269077 127878 122767
10412 122767 67009 -57098 178469 241241 -213632 44781 -139196 44654 51928 32249 -80759
10400 -101781 -165494 215046 -166178 -3313 58624 52121 412887 57674 86400 172474 81047
10388 -20627 418857 9893 81708 426245 -72817 177754 146807 335030 63068 290452 139832
10376 137644 49842 6418 174109 144422 230474 81052 401430 351039 310332 298642 280985
$$ packed form
10457H2626c09712B80814H83a82397G7251a61409O9777B48672j01989p488P0808
10446B10003a61687k27570g4333A08998d9093K759n0911A07350b884E6772g942
10434B12505k7457b24475F4636B704J13821J57732h176E312J14893b48074m6220
10423b94294h8545C8264g0424K8998E0736B3289e7731B54798b69077A27878n111
10412A22767n5758e7098A78469O2772b13632D4781a39196D4654P274j9679h0759
10400a01781o3713B15046a66178c313E8624o503L60766E7674K8726Q6074H1047
10388b0627D18857I893P1815L44537g2817A77754l0947J88223F3068K27384A39832
10376A37644D9842F418J67691k9687Q6052H1052L20378n0391m0707j1690j7657
$$ plain form
10365 280985 174538 537614 429158 69719 435110 92852 144028 510532 149532 -7955
10354 446502 217784 74579 250106 633133 412185 347877 448126 656592 328617 588452
10344 588452 273658 403821 730125 353964 95684 293488 16743 -27012 53800 -167364
10333 342130 132559 217762 13083 78270 -24595 -154841 -73950 85115 15636 135140 76789
10322 76789 -39539 64293 247912 265799 522567 201136 -143961 238940 115615 289045
10312 289045 -376548 127869 -47472 266949 117979 -17222 213968 -148445 -196422 -96352
10301 167806 -105874 -90543 142266 41427 5659 48430 392442 -79611 54555 -242907 -106936
10289 -5013 -282315 66935 -203319 -335738 -100728 93632 -171273 67967 -54655 197143 -100776
$$ packed form
10365B80985j06447L63076j08456F9719L65391I2852N1176L66504A49532g955
10354D46502B17784G4579J75527L83027k20948o4308J00249K08466l27975K59835
10344E88452B73658J30163L26304C53964I5684J97804A6743b7012E3800a67364
10333C42130A32559Q5203A3083O5187b4595j30246g3950H5115A5636J19504n8351
10322G6789c9539F4293J83619J7887K56768B01136a43961B38940A15615J73430
10312B89045c76548A27869d7472B66949A17979a7222B13968a48445m7977i6352
10301A67806a05874J5331A42266D1427E659M2771L44012g9611E4555b42907a06936
10289e013k77302F6935b03319j32419a00728I3632a71273F7967e4655A97143a00776
$$ plain form
10277 -31933 7416 192946 169328 -28182 -118018 109423 108023 -318300 62406 28428 -86064
10265 -163438 -186716 234989 -23413 370127 39964 130665 146366 302591 222364 -14118 246905
10253 272745 147158 -256024 156990 -17271 -5725 -26535 172452 -277256 -265802 -378196
10243 -378196 -253687 -85542 -78 -207272 105977 -215076 -202924 -153296 -351481 -172909 -246142
10232 -246142 236545 -408507 55481 -90538 -9380 -56361 -230097 160160 -194911 285726
10221 -95824 37237 -33587 -212692 -89099 163849 -224145 -61928 76640 -25016 -375956 134248
10209 105546 147421 -68261 -12740 187802 -58318 -137197 -143545 -116184 -111011 -256884 -389047
10198 -389047 177083 -89 15696 259101 -184350 83618 -32233 313645 -204874 -14303 65937
$$ packed form
10277c1933G416J85530k3618b8182q9836A09423j400c18300F2406B8428h6064
10265a63438k3278B34989b3413C70127C9964R0701J5701J56225q0227a4118B46905
10253B72745j25587b56024A56990a7271e725k0810A72452b77256J1454j12394
10243c78196J24509h5542g8k07194A05977b15076J2152M9628j98185a72909p3233
10232b46142B36545d08507E5481i0538i380m6981j73736A60160a94911B85726
10221i5824C7237c3587j79105h9099A63849b24145f1928G6640b5016l50940A34248
10209A05546M1875f8261a2740A87802e8318p8879o348K7361N173j45873j32163
10198c89047A77083h9A5696K43405a84350H3618c2233C13645b04874a4303F5937
$$ plain form
10186 88236 -181513 127727 -242931 -76962 313119 -163185 -403744 -218946 -433420 11829
10175 184766 -165854 -62289 16097 116720 -112754 155011 -154347 92005 -148153 -191148
10165 -191148 -138628 -126874 -87845 -358103 120594 -145159 4611 44214 -101118 -324888 -143564
10153 -18652 -28969 -151484 -166890 253844 -79228 -11557 -41467 21781 172312 8765 -166258
10141 -163143 103756 -61611 -177248 18197 -271972 -99030 -23410 99738 82928 39006 155436
10130 155436 93162 -315731 1028 -237133 140390 74844 -78664 -102262 -162574 72108 -52942
10118 -413917 -160254 47006 -92948 -67679 9451 -216678 -147703 -64781 -133126 -4496 245961
10106 -156855 -241065 4319 -17861 -174931 -182408 820 111140 -68551 -461521 11509 -77722 -511
$$ packed form
10186H8236a81513A27727b42931g6962C13119a63185k40559J84798k14474A1829
10175A84766a65854f2289A6097J00623a12754A55011a54347I2005a48153m2995
10165a91148N2520J1754L9029k70258A20594a45159D611L9603a01118k23770a43564
10153a8652j0317j22515j5406B53844g9228a1557k9910B1781J50531H765a66258
10141a63143A03756f1611j15637A8197b71972i9030b3410I9738j6810C9006J16430
10130A55436o2274c15731A028b37133A40390o5546g8664k3598o0312G2108e2942
10118d13917a60254D7006i2948K5269I451b16678O8975f4781o8345d496B45961
10106a56855q4210D319a7861j57070p477H20J10320f8551l92970A1509g7722e11
$$ plain form
10093 -158034 220750 -266186 -40801 -460333 -194564 -260126 195524 -283598 -116503 -57426
10082 114064 -64074 94314 -386057 -19808 97596 -136032 -168861 -135747 -191627 33342 -51968
10070 234928 65592 114219 -181812 16613 -114906 -55965 88332 -165672 -168347 -122961 289817
10058 -177535 -79864 -157510 34494 -98624 -465579 -316498 -108456 49655 -21623 -313590 -116392
10046 -138466 128490 203818 -255347 -124802 -6073 -468085 20171 38176 78234 -347870 -170030
10034 50969 112338 -193497 -180265 -399355 -64489 -54009 -288024 144940 -229884 -270884 245513
10022 111025 -398632 -154373 -119539 -11642 -209824 141811 170417 28793 68375 176463
10012 176463 -49092 187269 198772 -252455 21124 -259823 -239918 58174 -168190 252306
$$ packed form
10093a58034B20750b66186d0801m19532a94564o5562A95524b83598a16503e7426
10082A14064f4074I4314c86057a9808I7596a36032l2829L3114n5880C3342e1968
10070B34928F5592M8627a81812A6613a14906e5965H8332a65672k675M5386B89817
10058a77535g9864p7646C4494i8624l66955J49081a08456D9655b1623k91967a16392
10046a38466A28490P5328b55347a24802f073m62012B0171J8005M0058c47870a70030
10034E0969O1369a93497J3232k19090f4489J0480k34015A44940b29884m1000B45513
10022A11025c98632a54373L4834a1642j98182A41811K8606B8793L9582J08088
10012A76463d9092A87269J1503b52455B1124b59823J9905E8174a68190B52306
$$ plain form
10001 -287510 -103537 175697 117807 4247 -136492 173910 31278 64362 -285237 146515
9990 -255687 -434495 -5811 -246870 147312 88707 -17607 -240030 -20113 83265 -8249 -9054 -401498
9978 -401498 22300 -292017 140397 111294 108387 -304491 -95887 223561 -56501 -98856 -20908
9966 -465390 231 -20660 -87848 -35702 -69239 244861 -552855 -143530 -235622 260047 -155984
9954 -135711 241387 -1425 -168822 -297785 152780 -130304 -294051 45981 319784 61836
9943 -105189 -8224 94292 40870 -288327 49501 23608 -186085 -161288 3105 -13539 -109033 -205834
9931 -205834 -139271 310627 82771 284632 -58322 -107114 -9713 -241046 -106250 108723 -195728
9919 -43854 -68803 -236702 -184006 -83558 -223167 -247228 35940 -142849 -188792 291643 -110174
$$ packed form
10001b87510a03537A75697n7890D247a36492A73910C1278L3084b85237A46515
9990b55687j78808e811k41059A47312n8605a7607k22423b0113H3265h249q05l92444
9978d01498B2300b92017A40397k9103k907c04491i5887B23561e6501m2355b0908
9966d65390B31b0660o7188c5702l3537B44861e52855a43530r2092B60047a55984
9954a35711B41387a425j67397j28963A52780a30304j63747D5981K73803F1836
9943a05189h224I4292D0870b88327D9501B3608a86085K4797C105a3539r5494r6801
9931b05834O6563C10627H2771K01861e8322m8792i713k31333a06250A08723a95728
9919d3854k4949j67899N2696h3558j39609k4061C5940a42849m5943B91643a10174
$$ plain form
9907 -45450 271232 -56284 -113737 -336358 -66586 147202 -339861 98670 -222057 -329093 306684
9895 -107542 30914 -423610 193444 72820 -12270 317086 -159444 219824 -120744 -383731
9885 -383731 -445 163223 -25368 -75128 -25394 -205886 246449 272090 19900 -158085 -315468
9874 -315468 58908 -86822 -133743 164393 -44883 -183823 -25571 143276 -142205 -133290 -135170
9863 -135170 178329 -223233 39493 -316755 -414250 76494 101756 -376912 -25061 -229600 -291505
9852 -291505 -393363 72655 -3394 243250 -2031 130453 -176462 -299653 -182990 -121392 -134403
9841 -134403 39205 -293396 85110 139301 -28928 -181174 -96128 -122406 -71943 -128889 104505
9829 -103759 12149 37713 21323 29062 312657 27966 -138314 -133453 147181 -292377 -170664
$$ packed form
9907d5450B71232e6284n7453k22621f6586A47202c39861I8670b22057j07036C06684
9895a07542C0914d23610A93444G2820a2270C17086a59444B19824a20744k62987
9885c83731d45A63223b5368m9760b5394j80492B46449K5641A9900a58085j57383
9874c15468E8908h6822m6921A64393d4883j38940b5571A43276a42205Q915j880
9863a35170A78329b23233C9493c16755r7495G6494K5262c76912b5061k04539o1905
9852b91505j01858G2655c394B43250b031A30453a76462j23191J16663O1598j3011
9841a34403C9205b93396H5110N4191b8928j52246Q5046k6278N0463n6946A04505
9829a03759A2149K5564j6390P739K83595B7966a38314M861A47181b92377J21713
$$ plain form
9818 -170664 -86636 -322184 -81878 363815 68623 24240 289079 -95281 -38254 -322483 42184
9806 -81640 -20217 -184220 -208180 58706 88239 -186023 -106386 7378 176088 72985 -19325
9794 -211541 147133 -3732 -189900 72247 -262507 -378644 -195546 -195447 60469 145044 -259156
9782 -174655 10074 -180219 -249669 -175766 90722 -166348 -240139 -117973 -162036 -291893 -273861
9771 -273861 230786 -337636 551025 -316593 254118 342357 119989 190819 261 -189780 182353
9759 378013 -289553 -4590 68907 -174607 -66769 86124 -2229 -69160 -133034 -160370 522 -13065
9746 -37634 163876 -247132 -249465 27632 -206428 -260063 -148270 166239 280206 111037 -380441
9734 126156 -227753 19947 -123991 60228 -29223 -90611 -195511 -270507 -48690 -253278 -475647
$$ packed form
9818a70664Q4028k35548h1878C63815F8623B4240K64839i5281c8254k84229D2184
9806h1640b0217j64003k3960E8706K9533a86023P9637G378J68710G2985a9325
9794b11541A47133c732j86168G2247b62507j16137J83098R9F0469Q4575b59156
9782a74655A0074a80219o9450P3903I0722a66348p3791a17973m4063j29857J8032
9771b73861B30786c37636E51025c16593B54118Q8239A19989P0830B61a89780A82353
9759C78013b89553d590F8907a74607f6769H6124b229o6931o3874k7336E22a3065
9746c7634A63876b47132k333B7632b06428n3635J11793A66239J13967A11037c80441
9734A26156b27753A9947a23991F0228b9223o1388j04900p4996d8690k04588k22369
$$ plain form
9723 -475647 -68596 167987 -160829 -272951 65116 93122 179616 -191205 -306215 -167851
9713 -167851 -107146 232100 60934 -303804 -119194 29888 -139867 71934 -65002 -137891 186151
9701 31202 -54280 -197665 -225854 -34405 -228972 117966 -142320 46280 -188492 35276 -245344
9689 -164316 55350 66995 162228 -253055 -293598 -28292 -177984 -95694 -350126 43413 2358
9677 -200913 190000 123412 -249696 109997 17734 62185 -285657 56517 -140991 100061
9666 74188 -129864 89107 -134485 -269008 53173 -263675 123828 243074 -107515 -19125
9655 -19561 -161107 -147960 -40110 -34616 -43537 -115726 10923 141830 105759 -288239 -49063 -39068
9643 -39068 134380 224921 71099 125593 -26232 -226960 -4774 -178844 -132599 -497 -69411 -109626
$$ packed form
9723d75647f8596A67987a60829j12122F5116K8006Q6494a91205j15010J38364
9713a67851O0705B32100F0934c03804a19194B9888a39867G1934f5002p2889A86151
9701C1202e4280j43385k8189c4405j94567A17966a42320D6280a88492C5276b45344
9689a64316E5350J1645R5233b53055m0543b8292j49692Q2290k54432D3413B358
9677b00913A90000o6588b49696A09997A7734M4451b85657E6517a40991A00061
9666G4188a29864H9107a34485j34523E3173b63675A23828J19246a07515a9125
9655a9561j41546J3147d0110N494q921p2189A0923J30907l6071b88239d9063R995
9643c9068A34380R0541G1099N4494b6232k00728d774j74070M6245d97o8914m0215
$$ plain form
9631 -109626 150286 240581 9925 175784 -20734 23623 13123 -312055 63087 -341972 -102696
9619 -49766 -22796 -106626 -37112 -137204 -414818 38216 183129 -150070 242005 -145451 -309003
9608 -309003 -259502 -246069 -88175 -271594 -242874 -287504 -263658 -447851 -167390 62563 19963
9596 104325 -210447 -176870 -25098 -51991 23767 -174895 -76298 215008 -96914 -335768 -57436
9584 14578 134925 -34367 -263316 5156 -120388 175033 -68862 -92565 -304266 13182 50047
9573 50047 95846 -129492 -88823 200274 70550 257053 19924 -124919 -20853 84598 170665
9562 170665 -257459 -20760 -39558 25661 -183248 46865 20806 -54234 -7756 -418365 110318
9550 -152687 -317272 266807 -53820 -35874 -291978 37353 164084 69005 149504 10240 164543
$$ packed form
9631a09626A50286R0295I925J65859b0734B3623j0500c12055F3087c41972a02696
9619d9766b2796q3830c7112j00092k77614C8216J44913a50070B42005a45451j63552
9608c09003M9501J3433h8175j83419K8720m4630K3846j84193a67390F2563A9963
9596A04325b10447L3577b5098k6893B3767a74895g6298B15008i6914k38854e7436
9584A4578J20347c4367k28949E156a20388A75033f8862k3703k11701A3182L6865
9573E0047M5799a29492M0669B00274G0550J86503A9924a24919b0853H4598Q6067
9562A70665b57459b0760j8798B5661a83248D6865B0806e4234g756m10609A10318
9550a52687j64585B66807e3820J7946k56104C7353J26731F9005Q0499A0240J54303
$$ plain form
9539 164543 45212 108319 93808 -334114 61682 10091 292471 193519 -139726 334649 -209975
9527 -325115 -40210 -112850 -159625 -263753 -165020 136984 -186752 -82239 -66469 121499 -316177
9515 120394 -113145 15401 -33483 -210901 -130026 -290728 -121025 -341491 11717 10433 -105106
9503 -64541 -262135 -350249 -497077 -297079 -176816 -240497 -56016 -111187 -331040 -103377 77445
9491 -141298 -151702 -19059 -239641 112675 -229180 128254 54290 -105920 97584 -562809
9480 -37277 75318 -112345 -118078 -211494 -41890 -223900 -330250 152044 -338204 -177190 99438
9468 -388949 114200 -267852 -222592 412211 -4756 94285 -127148 374305 -150006 -4530 1823
9456 -248613 339100 82319 132828 130822 -56648 63839 -350197 -152462 26704 -171840 -136231
$$ packed form
9539A64543D5212O3107j4511c34114F1682A0091K82380r8952a39726C34649b09975
9527c25115d0210p2640m6775j04128R8733A36984a86752h2239J5770A21499c16177
9515A20394a13145A5401c3483j77418Q0875j60702a21025k20466A1717j284a05106
9503f4541j97594q8114j46828J99998J20263o3681e6016n5171k19853a03377G7445
9491a41298j0404a9059k20582A12675b29180A28254E4290a05920I7584e62809
9480c7277G5318a12345n733r3416d1890j82010j06350A52044c38204J61014I9438
9468c88949A14200b67852M5260D12211d756I4285a27148C74305a50006d530A823
9456b48613C39100H2319N0509k006e6648F3839c50197a52462B6704a71840L5609
$$ plain form
9445 -136231 -96414 -23214 -372651 -286954 59956 -35937 -39867 65757 -251812 170353 4549
9433 -172236 172335 82234 133557 150338 -157231 -109427 269516 -265535 30149 -117941 -300342
9422 -300342 -104359 93213 -71740 243504 13692 12201 38248 198873 95869 -235565 -47676
9410 -113318 124337 -184503 -219883 213562 158414 63585 -94734 -84290 -445101 1243 115356
9399 115356 27861 206698 -21017 -30376 -181266 74670 -314309 -429920 -101652 28172 110961
9388 110961 -93561 226976 -236222 -176403 25198 130538 -45085 12386 -160108 -173984 -31301
9376 -235280 -74045 -8018 18476 -109039 -55466 -126666 -150890 -191554 -164290 -181174 175325
9364 -154301 -118410 -182410 -25832 160117 -412364 -80724 99327 -207422 -217298 -188915 -5129
$$ packed form
9445a36231L9817b3214l49437Q5697E9956c5937l930F5757b51812A70353D549
9433a72236A72335H2234N1323J6781a57231M7804B69516b65535C0149a17941j82401
9422c00342a04359I3213g1740B43504A3692j491K6047J60625I5869b35565d7676
9410a13318A24337a84503l5380B13562n5148F3585i4734J0444l60811A243J14113
9399A15356B7861J78837b1017r359j50890G4670c14309j15611a01652B8172Q2789
9388A10961i3561B26976b36222N9819B5198J05340d5085A2386a60108j3876c1301
9376b35280g4045h018A8476a09039N3573p1200k4224m0664K7264j6884A75325
9364a54301L5891o4000b5832A60117d12364h0724I9327b07422r876K8383e129
$$ plain form
9352 -283553 -114076 121450 -249979 -284143 -288832 -179259 197246 -201422 -137461 -81195 -257697
9341 -257697 -88014 -212045 158614 -192442 86811 10251 190010 109902 -69361 -53697 -191772
9330 -191772 -46222 -118623 24364 -510543 -121788 191493 -13498 -61391 142909 45043 -147269
9318 52957 -104637 -155929 -84639 23964 105646 -69859 -195564 -212899 -221455 246758 13691
9306 321312 -55766 -175459 120381 -191330 235640 -164074 -207557 36956 38455 -217421 -135460
9295 -135460 104699 -254647 56624 -96986 -9554 -237088 50460 -183062 -65087 -178991 -363088
9284 -363088 -344136 -88533 111031 101481 -428812 -327984 -116844 -193840 107543 67535 -148186
9272 -50436 223093 23380 -117628 98867 -16588 -361381 449727 -446313 -22084 122570 -182250
$$ packed form
9352b83553a14076A21450b49979l4164m689J09573A97246b01422O3961N6266j76502
9341b57697h8014j24031A58614a92442H6811A0251J79759q0108f9361J5664j38075
9330a91772d6222p2401B4364e10543a21788A91493a3498m7893A42909D5043a47269
9318E2957a04637n1292P1290B3964Q1682f9859j25705j7335q556B46758A3691
9306C21312e5766j19693A20381a91330B35640a64074m3483C6956J499b17421Q1961
9295a35460A04699b54647E6624i6986i554k27534E0460a83062f5087j13904j84097
9284c63088J8952h8533A11031r550d28812J00828a16844p6996A07543m0008a48186
9272e0436B23093B3380a17628I8867a6588l44793D49727d46313b2084A22570a82250
$$ plain form
9260 -283427 132636 -140757 215939 -201087 -157088 128489 -97768 -237632 89031 52881
9250 52881 -430471 -8747 -162639 -41125 36900 -127238 -485288 -169349 15556 107720 157432
9239 157432 92509 -273308 244678 119812 172376 -173350 -140106 -36734 -317028 -97816 -92413
9228 -92413 -70145 60618 -403908 124432 225583 189882 -319389 -55669 -40901 109724 -271374
9216 -71804 -159952 -77405 61012 44720 -54226 275944 -385899 21465 -301980 -267812 252231
9204 -291840 -441112 -211278 -72890 170187 19497 -9133 -42917 -229169 -170350 196820 35596
9192 69004 34198 -158847 -285104 -319591 111192 -114978 -86472 217992 -23208 -112537 -76624
9181 -76624 325347 -539380 99489 -137704 -140786 -148606 -10592 41260 164305 -392231 -87039
$$ packed form
9260b83427A32636a40757B15939b01087M3999A28489i7768j39864H9031l6150
9250E2881d30471h747j53892d1125C6900a27238l58050a69349A5556R2164M9712
9239A57432o4923b73308B44678A19812N2564a73350L3244c6734k80294i7816N403
9228i2413K2268F0618d03908A24432J01151l5701c19389e5669J4768A09724b71374
9216g1804q8148g7405F1012j6292e4226B75944c85899B1465c01980L4168B52231
9204b91840j49272b11278g2890A70187A9497i133l3784j86252N8819A96820C5596
9192F9004C4198a58847j26257l4487A11192a14978K8506B17992b3208q9329L5913
9181g6624C25347e39380I9489a37704l082p820a0592D1260J23045c92231h7039
$$ plain form
9169 -215688 261679 -288418 -198289 9711 35328 107495 139115 92008 -90191 120432 114365
9158 114365 368489 202239 -213598 75069 53342 -98973 73688 243225 155385 -70931 317209
9146 472019 -235147 -93799 -125657 -56005 106396 -151086 121145 -12742 -218280 190896
9135 -547443 183245 -295252 -40242 -41939 197877 -106494 94498 114937 -54478 192758 26425
9123 172954 62014 -271183 -184590 -249354 168915 -31130 -190403 -13397 107363 -4190 -202483
9112 -202483 152330 141111 -36252 -198182 83504 -130945 -75988 99394 48498 18242 27884
9101 27884 116828 8782 -205936 -138844 -441723 3762 56397 -134110 -119505 -80335 -57247 -236024
9089 -236024 211046 -451993 -291120 -80326 113377 22702 -311641 86857 -196792 11303
$$ packed form
9169b15688B61679b88418R0129I711K5617P2167L1620m7107i0191A20432o067
9158A14365K54124j66250b13598G5069k1727i8973G3688J69537q7840g0931C17209
9146D72019b35147i3799l1858e6005A06396a51086A21145a2742k05538A90896
9135e47443A83245b95252d0242j697A97877a06494I4498K0439e4478A92758B6425
9123A72954F2014b71183Q6593o4764A68915c1130j59273a3397A07363d190j98293
9112b02483A52330j1219c6252j61930H3504a30945N4957I9394D8498A8242R642
9101B7884Q8944H782b05936O7092l02879C762N2635a34110J4605L9170K3088j78777
9089b36024B11046d51993J60873h0326A13377B2702c11641H6857a96792A1303
$$ plain form
9078 -125827 -206348 -53056 -46775 -27159 80704 -100312 40878 -16065 22166 -80061 -286868
9067 -286868 -88143 102963 -28873 160893 -345185 -110761 -106093 -221586 -9656 -158930 110285
9055 -14487 -24423 156034 49262 -14342 53603 -136459 -132492 -72761 194747 -1365 -98340 -84985
9043 -84985 -75273 -92930 -95874 -186920 67734 -433818 -221386 75693 -230400 -123202 -205819
9032 -205819 -203338 -234166 -318711 -54960 -395939 21565 104399 -57393 -246583 -106826 174763
9020 -140927 -69232 16189 -214138 -93250 318785 -153170 24537 -272246 116493 -65865 -105389
9009 -105389 -151075 -13918 261263 89314 162738 -118043 85099 -308883 -367186 -173515 209741
8997 27198 -60461 -102037 59564 -278940 -282928 -126769 -96579 264679 -63345 69963 -69509
$$ packed form
9078a25827q0521e3056O281J9616H0704a00312D0878a6065B2166h0061k06807
9067b86868h8143A02963b8873A60893c45185a10761M668j15493i656j49274A10285
9055a4487r936A56034D9262a4342E3603a36459L967N9731A94747a365r6975J3355
9043h4985R712j7657k944r1046F7734d33818K12432G5693b30400J07198q2617
9032b05819K481l0828q4545e4960l40979B1565Q2834e7393j89190a06826A74763
9020a40927f9232A6189b14138i3250C18785a53170B4537b72246A16493f5865l9524
9009a05389m5686a3918B61263H9314P3424a18043H5099c08883n8303a73515B09741
8997B7198f0461m1576E9564b78940l988a26769L0190B64679f3345F9963f9509
$$ plain form
8985 -43069 -18497 -65215 -31613 -17719 49102 -357763 56959 -196645 -224738 29786 -29010
8973 113795 -176923 204747 -246066 200156 208675 317331 59449 52834 -155232 -178609 -171965
8962 -171965 -95823 131713 -542953 -30023 -435777 -242836 6299 113563 -23997 20344 -355136
8950 460902 58147 -38237 83876 -40679 -14704 31007 186068 -262794 -132748 -97872 134702
8938 -50186 -206102 225766 1443 182433 -56375 -458460 -263749 -159674 -237809 -249830 100322
8926 7055 41502 729604 1434921 2804160 10722451 11559174 1823500 458112 384718 266145
8916 266145 138061 46765 -301168 -293668 -5984 -18909 -84510 302739 264854 -22182 123134
8904 20969 -104413 199991 -418852 -3401 -103319 -84308 316680 153964 -88450 282342 25591
$$ packed form
8985d3069a8497m6718c1613J3894D9102c57763E6959a96645k8093B9786b9010
8973A13795a76923B04747b46066B00156Q519J08656E9449o615a55232k3377O644
8962a71965P6142A31713e42953c0023m05754J92941F299J07264b3997B0344c55136
8950D60902E8147c8237H3876d0679a4704C1007J55061b62794J30046L4876A34702
8938e0186j55916B25766A443J80990e6375m02085J94711J04075p8135j2021A00322
8926G055L4447O88102P05317J369239P918291Q36723A823500D58112p3394j18573
8916B66145j28084D6765c01168P500e984j2925o5601C02739l7885b2182A23134
8904B0969a04413A99991d18852c401r9918J9011C16680A53964h8450B82342B5591
$$ plain form
8892 -34824 -264510 13861 359016 316525 223139 -173332 155584 -346081 -246737 -309803 -264143
8881 -264143 -5839 94239 -63450 311077 63073 -231206 -218058 -156379 291226 -61942 41531
8869 87585 -59367 250110 -184150 -6691 55318 -21518 -64532 246760 -397596 -8806 -424807
8858 -424807 -132306 -39766 96351 -84229 144675 108832 -206888 -11629 -72808 -24336 -218858
$$ packed form
8892c4824k29686A3861L45155m2491r3386a73332A55584c46081R9344o3066M5660
8881b64143e839I4239f3450C11077F3073b31206J3148O1679B91226f1942D1531
8869H7585e9367B50110a84150f691E5318b1518m3014B46760c97596h806m16001
8858d24807a32306c9766I6351h4229A44675l5843b06888a1629o1179b4336j94522
$$ [...]
##END NTUPLES=NMR SPECTRUM
##END=
