
##TITLE=AC1205_HSMAH12053_7154974_VJvyl8NvSL
##JCAMPDX= 6.0         $$ Bruker NMR JCAMP-DX V2.0
##DATA TYPE= NMR SPECTRUM
##DATA CLASS= NTUPLES
##ORIGIN= BRUKER
##OWNER= Administrator
$$ 1.72 TOPSPIN		Version 2.1
$$ 2012-12-01 04:41:18.687 -0500  Administrator@X
$$ Compression mode = diff/dup
##.OBSERVE FREQUENCY= 400.02188249412
##.OBSERVE NUCLEUS= ^1H
##.ACQUISITION MODE= SIMULTANEOUS (DQD)
##.ACQUISITION SCHEME= undefined
##.AVERAGES= 64
##.DIGITISER RES= 22
##SPECTROMETER/DATA SYSTEM= spect
##.PULSE SEQUENCE= noesygpps1d.comp
##.SOLVENT NAME= COFFEE_meoh
##.SHIFT REFERENCE= INTERNAL, COFFEE_meoh, 1, 14.96087
##AUDIT TRAIL= $$ (NUMBER, WHEN, WHO, WHERE, PROCESS, VERSION, WHAT)
$$ ##TITLE= Audit trail, TOPSPIN		Version 2.1
$$ ##JCAMPDX= 5.01
$$ ##ORIGIN= Bruker BioSpin GmbH
$$ ##OWNER= Administrator
$$ $$ E:\/data/COFFEE/nmr/AC1205_HSMAH12053_7154974_VJvyl8NvSL/12/pdata/1/auditp.txt
$$ ##AUDIT TRAIL=  $$ (NUMBER, WHEN, WHO, WHERE, PROCESS, VERSION, WHAT)
(   1,<2012-12-01 04:41:12.357 -0500>,<Administrator>,<X>,<go>,<TOPSPIN 2.1>,
      <created by zg
	started at 2012-12-01 04:29:44.210 -0500,
	POWCHK enabled, PULCHK disabled,
       configuration hash MD5:
       86 BA 57 50 F2 9D 5C 9B 26 00 A9 28 5F 66 2E 89
       data hash MD5: 64K
       75 A3 91 CC 80 B9 D3 50 A6 A6 29 2F 66 90 EA BF>)
(   2,<2012-12-01 04:41:15.592 -0500>,<Administrator>,<X>,<proc1d>,<TOPSPIN 2.1>,
      <Start of raw data processing
       efp LB = 0.3 FT_mod = 6 PKNL = 1 PHC0 = 0 PHC1 = 0 SI = 128K 
       data hash MD5: 128K
       55 1B 9F 2A EC 2C 96 69 F7 2C 50 5D A7 7D 60 4F>)
(   3,<2012-12-01 04:41:16.789 -0500>,<Administrator>,<X>,<proc1d>,<TOPSPIN 2.1>,
      <pk PHC0 = -80.21667 PHC1 = 0 
       data hash MD5: 128K
       DC FD 1D 2F D2 EB A7 CD AF D0 EA FB AB 81 85 52>)
(   4,<2012-12-01 04:41:17.524 -0500>,<Administrator>,<X>,<proc1d>,<TOPSPIN 2.1>,
      <abs ABSG = 1 
       data hash MD5: 128K
       C5 06 49 08 8B 40 3A B1 F9 6B 9D A2 9B E0 72 06>)
(   5,<2012-12-01 04:41:17.763 -0500>,<Administrator>,<X>,<proc1d>,<TOPSPIN 2.1>,
      <abs ABSG = 2 
       data hash MD5: 128K
       E5 DC B7 64 22 B3 74 A9 8E 35 19 93 39 82 36 5B>)
(   6,<2012-12-01 04:41:17.934 -0500>,<Administrator>,<X>,<proc1d>,<TOPSPIN 2.1>,
      <abs ABSG = 3 
       data hash MD5: 128K
       FF 4F ED F9 6E 26 FE 6F 06 83 5F 98 E2 CF 37 2C>)
(   7,<2012-12-01 04:41:18.157 -0500>,<Administrator>,<X>,<proc1d>,<TOPSPIN 2.1>,
      <abs ABSG = 4 
       data hash MD5: 128K
       F1 60 0B 0C E7 A5 37 A9 D2 EE FE AB 70 F9 AC AE>)
(   8,<2012-12-01 04:41:18.328 -0500>,<Administrator>,<X>,<proc1d>,<TOPSPIN 2.1>,
      <abs ABSG = 5 
       data hash MD5: 128K
       82 C5 5D 42 14 CC BE 99 5D 3A 0A CA 1B 12 D1 C8>)
$$ ##END=
$$ 
$$ $$ hash MD5
$$ $$ CF 8A C2 22 6A 1E 64 DC C2 7E 12 C7 89 42 A1 6F
##$RELAX= 
##$RELAX= 
##$RELAX= 
##$RELAX= 
##$RELAX= 
##$RELAX= 
##$RELAX= 
##$RELAX= 
$$ Bruker specific parameters
$$ --------------------------
##$DU= <E:\>
##$EXPNO= 12
$$ [...]
##$TP07= 0
##$TPNAME0= <>
##$TPNAME1= <>
##$TPNAME2= <>
##$TPNAME3= <>
##$TPNAME4= <>
##$TPNAME5= <>
##$TPNAME6= <>
##$TPNAME7= <>
##$TPOAL= (0..7)
0.5 0.5 0.5 0.5 0.5 0.5 0.5 0.5
##$TPOFFS= (0..7)
0 0 0 0 0 0 0 0
##$TUNHIN= 0
##$TUNHOUT= 0
##$TUNXOUT= 0
##$USERA1= <user>
##$USERA2= <user>
##$USERA3= <user>
##$USERA4= <user>
##$USERA5= <user>
##$V9= 5
##$VALIST= <valist>
##$VCLIST= <CCCCCCCCCCCCCCC>
##$VD= 0
##$VDLIST= <DDDDDDDDDDDDDDD>
##$VPLIST= <PPPPPPPPPPPPPPP>
##$VTLIST= <TTTTTTTTTTTTTTT>
##$WBST= 1024
##$WBSW= 4
##$XGAIN= (0..3)
0 0 0 0
##$XL= 0
##$YL= 0
##$YMAX_a= 5937955
##$YMIN_a= -11186616
##$ZGOPTNS= <>
##$ZL1= 120
##$ZL2= 120
##$ZL3= 120
##$ZL4= 120
##$ABSF1= 14.96087
##$ABSF2= -5.597312
##$ABSG= 5
##$ABSL= 3
##$ALPHA= 0
##$AQORDER= 0
##$ASSFAC= 0
##$ASSFACI= 0
##$ASSFACX= 0
##$ASSWID= 0
##$AUNMP= <proc_prof1d_extract.lims>
##$AXLEFT= 0
##$AXNAME= <>
##$AXNUC= <1H>
##$AXRIGHT= 0
##$AXTYPE= 0
##$AXUNIT= <>
##$AZFE= 0.1
##$AZFW= 0.1
##$BCFW= 0
##$BC_mod= 0
##$BYTORDP= 0
##$COROFFS= 0
##$CY= 15
##$DATMOD= 1
##$DC= 0
##$DFILT= <>
##$DTYPP= 0
##$F1P= 0
##$F2P= 0
##$FCOR= 0.5
##$FTSIZE= 131072
##$FT_mod= 6
##$GAMMA= 0
##$GB= 0
##$INTBC= 1
##$INTSCL= 1
##$ISEN= 128
##$LB= 0.3
##$LEV0= 0
##$LPBIN= 0
##$MAXI= 10000
##$MC2= 0
##$MEAN= 0
##$ME_mod= 0
##$MI= 0
##$NCOEF= 0
##$NC_proc= -2
##$NLEV= 6
##$NOISF1= 0
##$NOISF2= 0
##$NSP= 0
##$NTH_PI= 0
##$NZP= 0
##$OFFSET= 14.96087
##$PC= 1
##$PHC0= -80.21667
##$PHC1= 0
##$PH_mod= 1
##$PKNL= yes
##$PPARMOD= 0
##$PPDIAG= 0
##$PPIPTYP= 0
##$PPMPNUM= 2147483647
##$PPRESOL= 1
##$PSCAL= 4
##$PSIGN= 0
##$PYNMP= <proc.py>
##$REVERSE= no
##$SF= 400.020009690653
##$SI= 131072
##$SIGF1= 0
##$SIGF2= 0
##$SINO= 400
##$SIOLD= 131072
##$SPECTYP= <>
##$SREGLST= <1H.CDCl3>
##$SSB= 0
##$STSI= 131072
##$STSR= 0
##$SW_p= 8223.68421052631
##$SYMM= 0
##$S_DEV= 0
##$TDeff= 65536
##$TDoff= 0
##$TI= <>
##$TILT= no
##$TM1= 0
##$TM2= 0
##$TOPLEV= 0
##$USERP1= <user>
##$USERP2= <user>
##$USERP3= <user>
##$USERP4= <user>
##$USERP5= <user>
##$WDW= 1
##$XDIM= 131072
##$YMAX_p= 433331399
##$YMIN_p= -38462
##$CURPLOT= <Network HP LaserJet P1505>
##$CURPRIN= <$Network HP LaserJet P1505>
##$DFORMAT= <normdp>
##$LAYOUT= <+/1D_H.xwp>
##$LFORMAT= <normlp>
##$PFORMAT= <normpl>
##$SURQMSG= 1
$$ End of Bruker specific parameters
$$ ---------------------------------
##NTUPLES= NMR SPECTRUM
##VAR_NAME=  FREQUENCY,     SPECTRUM/REAL,   SPECTRUM/IMAG
##SYMBOL=    X,             R,               I
##VAR_TYPE=  INDEPENDENT,   DEPENDENT,       DEPENDENT
##VAR_FORM=  AFFN,          ASDF,            ASDF
##VAR_DIM=   131072,        131072,          131072
##UNITS=     HZ,            ARBITRARY UNITS, ARBITRARY UNITS
##FACTOR=    0.0627417313425164, 1,          1
##FIRST=     8223.62146879497, 2480,         -54984
##LAST=      0,             4259,            -54939
##MIN=       0,             -38462,          0
##MAX=       8223.62146879497, 433331399,    0
$$ Real data points
##PAGE= N=1
##DATA TABLE= (X++(R..R)), XYDATA
$$ [...]
63964D22957J3933J5436J6594J7223J7915J9662K2727K6446L0197L4047L8330
63953F75467M3236M9002N6075O4732P4797Q5938R7918J10382J22710J34404J45432
63942A660093J55941J65601J73474J78576J80588J79913J76856J70797J60480
63933C202319J45270J25767J03042P7755N0418K1971o632l5120o3385r0404j14579
63922C416422j35140j52382j66243j75578j79420j78372j74187j68222j60786
63913A926092j51734j41183j29668j17805j05901r3907q1988p0978o1863n4669
63903I16396m8356m2017l5778l0373k6145k2842k0009j7311j4709j2572j1452
63892F34832j1407j1727j1475j0268q521p072o519o579o159m449j910L30K041
$$ plain form
63964 422957 436890 452326 468920 486143 504058 523720 546447 572893 603090 637137 675467
63953 675467 718703 767705 823780 888512 963309 1049247 1147165 1257547 1380257 1514661 1660093
63942 1660093 1816034 1981635 2155109 2333685 2514273 2694186 2871042 3041839 3202319
63933 3202319 3347589 3473356 3576398 3654153 3704571 3726542 3719910 3684790 3621405 3531001 3416422
63922 3416422 3281282 3128900 2962657 2787079 2607659 2429287 2255100 2086878 1926092
63913 1926092 1774358 1633175 1503507 1385702 1279801 1185894 1103906 1032928 971065 916396
63903 916396 868040 826023 790245 759872 733727 710885 690876 673565 658856 646284 634832
63892 634832 623425 611698 600223 589955 581434 574362 567843 561264 555105 550656 548746 549076 551117
63879E51117M076O871R698J1891J3946J6556J9259K1040K1917K2868K4320K5726
63867G49285K6710K7607K8521K8731K7618K5598K3560K1674J9329J6083J2213
63856A006929Q351M811J407k237o217j0168j3669j6667j9458k2194k4677k6676
63844H79535k8189k9342l0254l1001l1562l1721l1296l0491k9723k9038k8032
63833E48886k6517k4829k3238k1481j9299j7189j5952j5600j5269j4319j2980
63822C42213j1773j0841j0086r524r052q267p000n805n316n294m969m244l812
63809B46230l878l609k408j068q36j644k205j860j440j879k835l242k843k375
63795B14108k366k438k064j440j264j793k565k951k787k354j955j643j292p77
$$ plain form
63879 551117 555193 562064 571762 583653 597599 614155 633414 654454 676371 699239 723559 749285
63867 749285 775995 803602 832123 860854 888472 914070 937630 959304 978633 994716 1006929
63856 1006929 1015280 1020091 1021498 1019261 1013044 1002876 989207 972540 953082 930888 906211 879535
63844 879535 851346 822004 791750 760749 729187 697466 666170 635679 605956 576918 548886
63833 548886 522369 497540 474302 452821 433522 416333 400381 384781 369512 355193 342213
63822 342213 330440 319599 309513 299989 290937 282670 275670 269865 264549 259255 254286 250042 246230
63809 246230 242352 238743 236335 235267 234431 232787 230582 228722 227282 225403 222568 219326 216483 214108
63795 214108 211742 209304 207240 205800 204536 202743 200178 197227 194440 192086 190131 188488 187196 186419
63781A86419j71K17M1o57j275j185m61J07o3n93n93K59J338J796J420P15L17M00
63763A88031N64L16l15o70j93P79J227N48p60j685j733j244p84n31k81J48O32
63746A84049R31J011J122J453J885K147K140J961J705J474J450J688J899J769
63732B06684J521J732K488L141L165K859K822L080L204L126L236L676M032L856
63718B48622L188K371J680J233R78O24j59j299k331k990l437l726l439k286p93
63703B38236J51L26K35K30J61L6L49J321K315K504J939J472J692K387K969L106
63687B59429K883K652K655K672K178J140L51M08O59o8j656k584j937o57k02o24
63671B67299q49l03O18J509K362L027L120K702K294J991J178m72k297l376l603
$$ plain form
63781 186419 186248 186465 186506 185849 184574 183389 182928 183035 182972 182379 181786 182045 183383 185179 186599 187314 187631 188031
63763 188031 188595 188911 188596 187926 187733 188512 189739 190287 189527 187842 186109 184865 184081 183550 183269 183417 184049
63746 184049 184980 185991 187113 188566 190451 192598 194738 196699 198404 199878 201328 203016 204915 206684
63732 206684 208205 209937 212425 215566 218731 221590 224412 227492 230696 233822 237058 240734 244766 248622
63718 248622 251810 254181 255861 257094 258072 258696 258537 257238 254907 251917 248480 244754 241315 239029 238236
63703 238236 238387 238713 238948 239178 239339 239375 239724 241045 243360 245864 247803 249275 250967 253354 256323 259429
63687 259429 262312 264964 267619 270291 272469 273609 273960 274368 275027 274959 273303 270719 268782 268125 267923 267299
63671 267299 266450 266147 266765 268274 270636 273663 276783 279485 281779 283770 284948 284476 282179 278803 275200
63656B75200l567l763m272m971n546n490m531l048j707q09k24J50K76K63L52N70
63640B38883P00O74O88Q15Q58P50Q81J659K893L882M248M369M834N598O024N822
63624B83578N619O299P905R564J0556J1109J1927J3219J4587J5706J6788J8206
63612D25063J9983K1810K3425K4792K5946K6818K7244K6968K5587K2601J7829
63601F88066J1832N802Q16k854n558p552q637q627p861p023o577o695p645r838
63587F27649j3246j7071k0273k2365k3433k3535k2508k0490j8149j6077j4178
63576D16324j2012r575p322n501l817j937O2J828L100L814M121M478N347O643
63562D05553P649P822P486P539Q539J0360J2529J4635J6480J8098J9625K1139
$$ plain form
63656 275200 271633 267870 263598 258627 253081 247591 243060 240012 238305 237496 237272 237422 237698 237961 238313 238883
63640 238883 239583 240257 240945 241760 242618 243368 244249 245908 248801 252683 256931 261300 266134 271732 277756 283578
63624 283578 289197 295496 303401 312965 323521 334630 346557 359776 374363 390069 406857 425063
63612 425063 445046 466856 490281 515073 541019 567837 595081 622049 647636 670237 688066
63601 688066 699898 705700 706516 703662 698104 690552 681915 673288 665427 658404 651827 645132 637487 627649
63587 627649 614403 597332 577059 554694 531261 507726 485218 464728 446579 430502 416324
63576 416324 404312 394737 387415 381914 378097 376160 376222 378050 381150 384964 389085 393563 398910 405553
63562 405553 413202 421024 428510 436049 444588 454948 467477 482112 498592 516690 536315 557454
63550E57454K2764K5038K8662L3483L7925L9924L8325L3121K4720J3875K333p426
63538H50198j3729j6733j7577j6932j4777j1354p671m962l862m270n766q114j1348
63525G13103j5517k0267k4767k8079k9671k9664k8623k7139k5507k3789k2031
63514D38049k0269j8387j6236j4043j2399j1543j0940r834q192o650n662n014
63502B98880m260l338k639k564l040l421l090k188j506j410j280m72O24J124R88
63487B72408J049J740K577K996K981K693K252K026K455L247L504L067K854L366
63473C09215L645K598P36m28m66m51j329k782l975m643n028n243n160m748m128
63458B77813l379k527j676j032o79l69L52J644L044L920M228M549N307O334P390
$$ plain form
63550 557454 580218 605256 633918 667401 705326 745250 783575 816696 841416 855291 857624 850198
63538 850198 836469 819736 802159 785227 770450 759096 751425 746463 742601 738331 732565 724451 713103
63525 713103 697586 677319 652552 624473 594802 565138 536515 509376 483869 460080 438049
63514 438049 417780 399393 383157 369114 356715 345172 334232 324398 316206 309556 303894 298880
63502 298880 294620 291282 288643 286079 283039 279618 276528 274340 272834 271424 270144 269672 270296 271420 272408
63487 272408 273457 275197 277774 280770 283751 286444 288696 290722 293177 296424 299928 302995 305849 309215
63473 309215 312860 315458 316194 315766 315300 314849 313520 310738 306763 302120 297092 291849 286689 281941 277813
63458 277813 274434 271907 270231 269199 268520 268151 268503 270147 273191 277111 281339 285888 291195 297529 304919
63443C04919Q680J0561J2985J5636J8303K0838K3048K5054K7362K9997L1670L0494
63431E59547K5690J8324J0361L447j512m246m940l940j413K585P652J3048J8246
63418F42849K3210K7888L1706L3822L3809L1869K8370K3424J6996R374J479n352
63406H99444r894j1665j1257j0102r537r785j0081j0020j0512j2963j7590k3109
63394G52929k8014l1557l3439l3378l1481k8573k5640k3152k1181j9679j8315
63383D58520j6530j4257j2150j0626r094o745l763j120N82J527K196L132M883
63370C96555P460J0003J1681J2728J3943J5378J6519J7603J9600K2661K5554K7186
63358E96871K7901K8715K9914L1035L1601L1303K9663K6204K0927J4379P344P00
$$ plain form
63443 304919 313599 324160 337145 352781 371084 391922 414970 440024 467386 497383 529053 559547
63431 559547 585237 603561 613922 617369 615857 611611 606671 602731 601318 603903 611555 624603 642849
63418 642849 666059 693947 725653 759475 793284 825153 853523 876947 893943 903317 904796 899444
63406 899444 889550 877885 866628 856526 846989 837204 827123 817103 806591 793628 776038 752929
63394 752929 724915 693358 659919 626541 595060 566487 540847 517695 496514 476835 458520
63383 458520 441990 427733 415583 404957 395863 389118 385355 384235 384817 386344 388540 391672 396555
63370 396555 404015 414018 425699 438427 452370 467748 484267 501870 521470 544131 569685 596871
63358 596871 624772 653487 683401 714436 746037 777340 807003 833207 854134 868513 875857 876557
63346H76557m686q278j0057j0389r834r111q870r372j0584j2598j5500j8886k2052
63333G26340k4766k7213k9048k9239k7381k4517k1991j9895j7302j3707r503n242
63321D76536j255J830K907J122l318r114j4560j8360k0199k0555j9956j8500j6204
63308C40374j3461j0721q067n499l467k498k366k282k009k094k788l376l096k267
63294B76383j890k313k917l038k647k039j322n89j78l63r13j248j102p29m97m60
63278B54138m67m73n21n43l52J39P93J335J530J246N49k09m52K21J562K734L022
63261B64252K449J633J036P44Q65J650K939L958M153L978M284N141N890O257O646
63246C15875P270P785Q012Q330Q983R688J0377J1569J3491J5483J6946J8218J9735
$$ plain form
63346 876557 871871 863593 853536 843147 833313 824202 815332 805960 795376 782778 767278 748392 726340
63333 726340 701574 674361 645313 616074 588693 564176 542185 522290 504988 491281 481778 476536
63321 476536 475281 477111 480018 481140 477822 468708 454148 435788 415589 395034 375078 356578 340374
63308 340374 326913 316192 308125 302626 299159 296661 294295 292013 290004 287910 285122 281746 278650 276383
63294 276383 274493 272180 269263 266225 263578 261539 260217 259628 259450 259087 258174 256926 255824 255095 254598 254138
63278 254138 253671 253198 252677 252134 251782 251921 252714 254049 255579 256825 257374 257165 256713 256934 258496 261230 264252
63261 264252 266701 268334 269370 270114 270979 272629 275568 279526 283679 287657 291941 297082 302972 309229 315875
63246 315875 323145 330930 338942 347272 356255 365943 376320 387889 401380 416863 433809 452027 471762
63233D71762K0960K1167K0851K1160K2143K2729K2392K1711K1122K0349J9393
63222G05739J8962J9329J9765J9726J9766K0475K1218K0805J8985J6465J3795
63211I15030J0949P756M001o97o403j2372j7654k2119k6201k9752l1927l2350
63199G58261l1631l0431k8607k5757k2118j8347j4681j0961p375m507k387q8L217
63186E64588P098J0316J2315J3647J4870J5774J6101J6358J7201J8302J8631J7809
63174G43010J6513J5510J4947J4683J4693J4753J4201J2422R400N686J917j553
63162H76182m891q671j3143j7696k1440k4240k6604k8602k9672k9679k9304k8934
63150F13306k7920k5582k2382j9455j7329j5732j4337j2966j1352r328p277n830
$$ plain form
63233 471762 492722 513889 534740 555900 578043 600772 623164 644875 665997 686346 705739
63222 705739 724701 744030 763795 783521 803287 823762 844980 865785 884770 901235 915030
63211 915030 925979 933735 937736 937039 930636 918264 900610 878491 852290 822538 790611 758261
63199 758261 726630 696199 667592 641835 619717 601370 586689 575728 568353 563846 561459 561371 564588
63186 564588 571686 582002 594317 607964 622834 638608 654709 671067 688268 706570 725201 743010
63174 743010 759523 775033 789980 804663 819356 834109 848310 860732 870132 875818 877735 876182
63162 876182 871291 862620 849477 831781 810341 786101 759497 730895 701223 671544 642240 613306
63150 613306 585386 559804 537422 517967 500638 484906 470569 457603 446251 436923 429646 423816
63138D23816n190n114n296n369m799l466k207k023k703k915j901l63N99Q75J197
63123C85141J993K980L707L953L573K557J426J124J976L016K976J921J234J798
63109D19375K866L248K987L011L503L663L054K218J734J427R33L32j35m72p10
63094D47034p28n94n45m37J28R15J041K52m73j79R14J990K670K907K631K247K769
63077D62542M504O174O368N410M788N121N787O350P153Q456J0000J1527J2990
63064E57170J4179J4964J5860J7579J9943K2082K3724K5491K7842L0614L3681
63053H03129L7178M0841M3998M6461M8691N0821N2299N2760N2556N2079N1319
63042A332132N0361M9617M9218M8778M8100M7498M7136M6757M6299M5996M5485
$$ plain form
63138 423816 418626 413512 408216 402847 398048 394582 392375 390352 387649 384734 382833 382470 383069 383944 385141
63123 385141 387134 390114 393821 397774 401347 403904 405330 406454 408430 411446 414422 416343 417577 419375
63109 419375 422241 425489 428476 431487 434990 438653 441707 443925 445659 447086 448019 448351 448216 447744 447034
63094 447034 446306 445712 445167 444730 444858 445773 446814 447066 446593 446414 447328 449318 451988 454895 457526 459773 462542
63077 462542 467046 473220 479588 484998 489786 494907 500694 507044 514197 522653 532653 544180 557170
63064 557170 571349 586313 602173 619752 639695 661777 685501 710992 738834 769448 803129
63053 803129 840307 881148 925146 971607 1020298 1071119 1123418 1176178 1228734 1280813 1332132
63042 1332132 1382493 1432110 1481328 1530106 1578206 1625704 1672840 1719597 1765896 1811892 1857377
63031A857377M3618L9654L3937K6921J8322P878l727j5443k6794l7631m7469n5829
63019A840814o2695o7941p0816p0825o8692o5547o1527n6063m9300m2173l5161
63008A190074k7958k0499j3392p013j017M946J0590J5448J9489K2923K5795K8094
62996A247480K9919L1279L1973L1905L1284L0377K9310K8251K7395K6530K5000
62985A570703K2401J9020J5201J0563M371l365j1757j9983k7926l5617m2512m7869
62973A453230n1632n4444n6698n8040n8002n6682n4480n1454m7465m2824l8290
62962H83219l4293l0598k6973k3776k1574k0356j9520j8604j7662j6878j6137
62951F36848j5210j4215j3579j3514j3705j3697j3391j2957j2367j1346r893q518
$$ plain form
63031 1857377 1900995 1940649 1974586 2001507 2019829 2027707 2023980 2008537 1981743 1944112 1896643 1840814
63019 1840814 1778119 1710178 1639362 1568537 1499845 1434298 1372771 1316708 1267408 1225235 1190074
63008 1190074 1162116 1141617 1128225 1121212 1120195 1125141 1135731 1151179 1170668 1193591 1219386 1247480
62996 1247480 1277399 1308678 1340651 1372556 1403840 1434217 1463527 1491778 1519173 1545703 1570703
62985 1570703 1593104 1612124 1627325 1637888 1642259 1638894 1627137 1607154 1579228 1543611 1501099 1453230
62973 1453230 1401598 1347154 1290456 1232416 1174414 1117732 1063252 1011798 964333 921509 883219
62962 883219 848926 818328 791355 767579 746005 725649 706129 687525 669863 652985 636848
62951 636848 621638 607423 593844 580330 566625 552928 539537 526580 514213 502867 492974 484456
62939D84456p742p519p321o697n645m541l857l749l833l540k739j819j120o35
62925D23699l37l43n31n58m78p76j380j421o14q6q90k279k663j863j091r44q87
62908D06558p68j215k125k230r97K72J94q76j670j810j689j369o76J9K41K45N59
62891C92663J008J060Q31P65O87J07o10n25M52J310J317Q14M68M38N57P78J090
62874D03210J380J531J428Q99l9j019j722k239k667k656j921r04k68L1L95O31
62858C96070K51l73j91R90K149K521K535K870L330L257K465J285R0p81j035p59
62842D14674m56m27m67l73l38n80r47j185j240j049m77K68O11K69l75q11r27p77
62824D05393k86M60J128J613K182K825L050K712K461K826L413L613L657M140M911
$$ plain form
62939 484456 476714 469195 461874 455177 449532 444991 441134 437385 433552 430012 427273 425454 424334 423699
62925 423699 423362 423019 422488 421930 421452 420676 419296 417875 417261 417175 416285 414006 411343 409480 408389 407445 406558
62908 406558 405790 404575 402450 400220 399223 399495 399689 398813 397143 395333 393644 392275 391599 391618 391859 392104 392663
62891 392663 393671 394731 395562 396327 397014 397121 396511 395986 396438 397748 399065 399879 400347 400785 401342 402120 403210
62874 403210 404590 406121 407549 408448 408409 407390 405668 403429 400762 398106 396185 395281 395013 395044 395439 396070
62858 396070 396321 395948 395757 396747 398896 401417 403952 406822 410152 413409 415874 417159 417249 416468 415433 414674
62842 414674 414218 413791 413324 412951 412613 412033 411086 409901 408661 407612 407135 407403 408014 408283 407908 407097 406170 405393
62824 405393 405107 405567 406695 408308 410490 413315 416365 419077 421538 424364 427777 431390 435047 439187 444098
62809D44098N282N198N292N803O245O238O037O026O281O790P597Q571R382R958
62795E38798J0596J1569J2934J4725J6978J9516K2101K4886K8245L2166L6275
62784G68789M0612M5723N1726N7791O3021O7518P2130P7262Q2315Q6249Q8424
62773A501560Q8853Q7730Q4769P9136P0295N8792M5823L1995J7058R95j5195l0240
62761B021571m3644n5513o5641p3432p8639q1663q3069q3179q2178q0241p7408
62750A216964p3581o8786o3340n7791n2739m8505m4809m0994l6825l2828k9498
62739F67268k6471k3058j9425j6566j4923j3763j2137j0005p996o485n344m352
62727E06743l433k576j839j323r53m36L77J270K031K804L856N149O457P771R284
$$ plain form
62809 444098 449380 454578 459870 465673 471918 478156 484193 490219 496500 503290 510887 519458 528840 538798
62795 538798 549394 560963 573897 588622 605600 625116 647217 672103 700348 732514 768789
62784 768789 809401 855124 906850 964641 1027662 1095180 1167310 1244572 1326887 1413136 1501560
62773 1501560 1590413 1678143 1762912 1842048 1912343 1971135 2016958 2048953 2066011 2067006 2051811 2021571
62761 2021571 1977927 1922414 1856773 1783341 1704702 1623039 1539970 1456791 1374613 1294372 1216964
62750 1216964 1143383 1074597 1011257 953466 900727 852222 807413 766419 729594 696766 667268
62739 667268 640797 617739 598314 581748 566825 553062 540925 530920 522924 516439 511095 506743
62727 506743 503310 500734 498895 497572 496619 496183 496560 497830 499861 502665 506521 511670 518127 525898 535182
62712E35182J1004J2656J4014J5190J6675J9060K2528K6450K9833L2420L5062
62701G70074L8725M3364M8147N2477N6307N9625O2279O4276O5721O6394O5760
62690A393149O3461N9314N2965M4157L3448K1959J0230k090j5046k7597l8541
62679A595409m7736n5684o2318o6925o9148o9351o8045o5537o2272n8793n5148
62668I14452n0841m5816m0994l7345l4634l1675k7864k3944k1114j9726j9051
62657E61448j8097j6398j4164j2011j0491r626q900p942p067o844p139p084o170
62644D29515m934m258m266m301l774k664j349k94J73R5j37k58m22p95j118j101
62628D00112r38j035j315j371j116p54k26O99J780K431K494K374K324K286K439
$$ plain form
62712 535182 546186 558842 572856 588046 604721 623781 646309 672759 702592 735012 770074
62701 770074 808799 852163 900310 952787 1009094 1068719 1130998 1195274 1260995 1327389 1393149
62690 1393149 1456610 1515924 1568889 1613046 1646494 1668453 1678683 1676593 1661547 1633950 1595409
62679 1595409 1547673 1491989 1429671 1362746 1293598 1224247 1156202 1090665 1028393 969600 914452
62668 914452 863611 817795 776801 739456 704822 673147 645283 621339 600225 580499 561448
62657 561448 543351 526953 512789 500778 490287 480661 471761 463819 456752 449908 442769 435685 429515
62644 429515 424581 420323 416057 411756 407982 405318 403969 403675 403848 403943 403806 403548 403126 402331 401213 400112
62628 400112 399174 398139 396824 395453 394337 393583 393357 394056 395836 398267 400761 403135 405459 407745 410184
62613D10184L172M327N216N590N924O497O989P351Q221R932J1849J3289J4505
62600E13046J6139J8330K0976K4260K8116L1742L4475L6723L9182M1534M2810
62589H47333M2763M1858M0088L6785L1699K5401J8513J1213L551m368j2546k0760
62577A061530k8177l3876l7768m0344m1664m1466m0144l8610l7018l4626l1298
62566F56539k8181k6358k5545k4683k3183k1075j8528j5831j3520j1862j0462
62555D37311q840p092n684m853m523m501m426l864k815j856j429j302j057p18
62541C84351m31N0R63J791J676N77n18o75Q8J089J801K145K319K589L178M175
62525D05168N516P121Q967J0962J2819J4284J5553J7326K0178K3801K7201K9733
$$ plain form
62613 410184 413356 417683 422899 428489 434413 440910 447899 455250 463471 473403 485252 498541 513046
62600 513046 529185 547515 568491 592751 620867 652609 687084 723807 762989 804523 847333
62589 847333 890096 931954 972042 1008827 1040526 1065927 1084440 1095653 1099204 1094836 1082290 1061530
62577 1061530 1033353 999477 961709 921365 879701 838235 798091 759481 722463 687837 656539
62566 656539 628358 602000 576455 551772 528589 507514 488986 473155 459635 447773 437311
62555 437311 428471 421379 415695 410842 406319 401818 397392 393528 390713 388857 387428 386126 385069 384351
62541 384351 383920 383970 384933 386724 388400 388977 388459 387784 387872 388961 390762 392907 395226 397815 400993 405168
62525 405168 410684 417805 426772 437734 450553 464837 480390 497716 517894 541695 568896 598629
62513E98629L1686L3687L5782L7453L8296L8289L7445L5678L2953K9232K4279
62502I73409J7935J0670L468k951q542j3584j8171k2112k5045k6629k6810k5833
62490H35805k3860k0872j7185j3569j0376o932k589K032N783Q709J1830J5191
62478G83967J7511J8012J7386J6306J4245J0584N957J430k831p176j1404j5180
62466H48807j8933k3191k7316l0011l1015l1221l1263l0888k9774k7984k5529
62455E41682k2358j8991j6298j4424j2603j0308p966o265n317m774m191l116j336
62442D13735O06J714J738J645K507M230N752O207N524M155K623J285J73r20k115
62427D48859l310m430n627p021q369r203r263q699p887p105o297n217l849k606
$$ plain form
62513 598629 630315 664002 699784 737237 775533 813822 851267 886945 919898 949130 973409
62502 973409 991344 1002014 1005482 1002531 993989 980405 962234 940122 915077 888448 861638 835805
62490 835805 811945 791073 773888 760319 749943 743011 740422 742454 748237 756946 768776 783967
62478 783967 801478 819490 836876 853182 867427 878011 883968 885398 882567 875391 863987 848807
62466 848807 829874 806683 779367 749356 718341 687120 655857 624969 595195 567211 541682
62455 541682 519324 500333 484035 469611 457008 446700 438734 432469 427152 422378 418187 415071 413735
62442 413735 414341 416055 417793 419438 421945 426175 431927 438134 443658 447813 450436 451721 451894 450974 448859
62427 448859 445549 441119 435492 428471 420102 410899 401636 392937 385050 377945 371648 366431 362582 359976
62413C59976j971k027k496l074l492l407k682j773j382j650j986j837j229m96
62399C30474K09Q23J170J196J215J621K329K721K218Q98l77n96M37J816K467K377
62383C50998K504L426M548N014M876M850N164N371N288N469O382P691Q767R563
62369D29911J0446J1347J1839J2116J3213J5761J9028K1808K3945K6285K9274
62358F24973L2453L5479L8769M2544M5925M7726M7831M6935M5128M1508L5461
62347A084732K7599J9210J1225M055k131p508j2698j8168k3524k7891l1012l3510
62335I90379l5825l7354l7119l5104l2343k9661k6909k3709k0401j7671j5652
62324F78631j4044j2895j2500j2584j2474j2258j2850j4507j6094j6501j6056
$$ plain form
62413 359976 358005 355978 353482 350408 346916 343509 340827 339054 337672 336022 334036 332199 330970 330474
62399 330474 330683 331506 332676 333872 335087 336708 339037 341758 343976 344874 344497 343901 344338 346154 348621 350998
62383 350998 353502 356928 361476 366490 371366 376216 381380 386751 392039 397508 403890 411581 420348 429911
62369 429911 440357 451704 463543 475659 488872 504633 523661 545469 569414 595699 624973
62358 624973 657426 692905 731674 774218 820143 867869 915700 962635 1007763 1049271 1084732
62347 1084732 1112331 1131541 1142766 1146821 1144690 1137182 1124484 1106316 1082792 1054901 1023889 990379
62335 990379 954554 917200 880081 844977 812634 782973 756064 732355 711954 694283 678631
62324 678631 664587 651692 639192 626608 614134 601876 589026 574519 558425 541924 525868
62313E25868j5755j5645j4935j3380j1581j0021q691p664p212p109o655n598m510
62300C97112l937l700l283k463j415n14j70l38k85O38J924K371J796J382K021
62285C91139L119L644L618L733L985L720K798J882J506J626K103L023M291N483
62271D35670O336P077Q023R177J0345J1458J2635J4108J6170J8987K2410K6175
62259E98571L0276L4884L9824M4551M8679N2268N5317N7373N7899N6802N4166
62248A130610M9739M3237L5090K6352J7735R187O57p345j4363k0753k7225l3870
62236A209051m0119m5550n0059n3303n4674n4022n1860m8729m4864m0638l6694
62225F88539l3239k9871k6377k3145k0425j7878j5412j3660j2922j2306j0888
$$ plain form
62313 525868 510113 494468 479533 466153 454572 444551 435860 428196 420984 413875 407220 401622 397112
62300 397112 393175 389475 386192 383729 382314 381800 381630 381292 381007 381645 383569 385940 387736 389118 391139
62285 391139 394258 397902 401520 405253 409238 412958 415756 417638 419144 420770 422873 425896 430187 435670
62271 435670 442006 449083 457106 466283 476628 488086 500721 514829 530999 549986 572396 598571
62259 598571 628847 663731 703555 748106 796785 849053 904370 961743 1019642 1076444 1130610
62248 1130610 1180349 1223586 1258676 1285028 1302763 1311950 1312607 1305262 1290899 1270146 1242921 1209051
62236 1209051 1168932 1123382 1073323 1020020 965346 911324 859464 810735 765871 725233 688539
62225 688539 655300 625429 599052 575907 555482 537604 522192 508532 495610 483304 472416
62214D72416r168q298q231p925p044o175n398m135k610j963k373k404j065O54
62200D06281J285R71R70J719K611L309M123N198O222O989P651Q343R058R747J0210
62185D84687J0165R778R764J0414J0999J0675R596Q440P319N946M553L676L353
62172E89365L415M408P028J0764J4210J6931J9915K3918K8398L2510L6006L8520
62160H25388L9032L6923L2931K8183K2839J6551R781L601j641o471j1088j4909
62148I81120j7629j9973k2906k6399k9382l0827l0624k9448k7871k5796k2775
62137F97490j8864j4755j1044p678m467j758j14N45J012J959L431N181P045Q836
62123F66819J0259J1162J1760J2363J2951J3154J2451J0459P262L652Q30m83o47
$$ plain form
62214 472416 463248 454950 446719 438794 431750 425575 420177 416042 413432 411469 409096 406692 405627 406281
62200 406281 407566 408537 409507 411226 413837 417146 421269 426467 432689 439678 447329 455672 464730 474477 484687
62185 484687 494852 504630 514394 524808 535807 546482 556078 564518 571837 577783 582336 586012 589365
62172 589365 592780 597188 604216 614980 629190 646121 666036 689954 718352 750862 786868 825388
62160 825388 864420 901343 934274 962457 985296 1001847 1011628 1015229 1013588 1007117 996029 981120
62148 981120 963491 943518 920612 894213 864831 834004 803380 773932 746061 720265 697490
62137 697490 678626 663871 652827 645149 640682 638924 638810 639355 640367 642326 645757 650938 657983 666819
62123 666819 677078 688240 700000 712363 725314 738468 750919 761378 768640 772292 773122 772639 771992
62110G71992p86j853m066p023j0151j2960j5051j6064j5822j4568j2881j1153
62098F49614r122o266k703O13K812M008M951N961O647O649O203N848N786N835
62084F86836N757N552N502O040P334Q929J0143J0960J2198J4377J6795J8211J8359
62071H26993J8199J8624J9475K0047K0069J9796J9454J9111J8987J9456K0548
62060A040759K1633K1714K0106J6858J2663Q267M007n7l718o610q719j0595j2887
62047A103421j5847j9408k3374k7301l0418l2216l3017l3502l3759l3181l1488
62036G89910k9356k7754k6882k6081k4630k2429j9967j7806j6189j4907j3536
62025E50373j1824r941q338p396p179p496q105q798r319r355q717p670o872o816
$$ plain form
62110 771992 771206 769353 765287 758264 748113 735153 720102 704038 688216 673648 660767 649614
62098 649614 640492 634226 631523 632136 634948 638956 643907 649868 656515 663164 669367 675215 681001 686836
62084 686836 692593 698145 703647 709687 717021 725950 736093 747053 759251 773628 790423 808634 826993
62071 826993 845192 863816 883291 903338 923407 943203 962657 981768 1000755 1020211 1040759
62060 1040759 1062392 1084106 1104212 1121070 1133733 1142000 1146007 1145950 1142232 1135622 1126903 1116308 1103421
62047 1103421 1087574 1068166 1044792 1017491 987073 954857 921840 888338 854579 821398 789910
62036 789910 760554 732800 705918 679837 655207 632778 612811 595005 578816 563909 550373
62025 550373 538549 528608 520270 512874 505695 498199 490094 481296 471977 462622 453905 446235 439363 432547
62011D32547p234p188n906l561j172K84O91Q01J403K531L539L867L670L537L755
61996D31564M034L933L395K634J782P90k62j130j759k445l441m532n321n755o046
61981D17441o129n727n029m727n043n235m614l600l114l185l023k378j948k197
61967C61492k569k351j692j210j060r28o16j49M40J012J215R63P15Q74J235J479
61951C58850J887K892M218N198N812O612P676Q463Q886R697J1414J3557J5372
61938D60534J6790J8149J9397K0102K0038J9320J8148J6772J5550J4657J3832
61927F53289J2658J1032R114O952M426J499j666m750p284q767r067q632q051p406
61913F43347o196l909o27K974O158Q753J1195J3796J6087J7180J6835J5662J4124
$$ plain form
62011 432547 425313 418125 412219 408658 407486 407770 408461 409262 410665 413196 416735 420602 424272 427809 431564
61996 431564 435598 439531 442926 445560 447342 448132 447870 446740 444981 442536 439095 434563 429242 423487 417441
61981 417441 411312 405585 400556 395829 390786 385551 380937 377337 374223 371038 368015 365637 363689 361492
61967 361492 358923 356572 354880 353670 352610 351682 351066 350917 351357 352369 353584 354547 355262 356136 357371 358850
61951 358850 360737 363629 367847 373045 378857 385469 393145 401608 410494 420191 431605 445162 460534
61938 460534 477324 495473 514870 534972 555010 574330 592478 609250 624800 639457 653289
61927 653289 665947 676979 686093 693045 697471 698970 697304 692554 685270 676503 667436 658804 650753 643347
61913 643347 637151 633242 632615 635589 641747 650500 661695 675491 691578 708758 725593 741255 755379
61900G55379J1778Q037L334j065m422p261j0486j4110j7086j8371j8021j7095
61888F70611j6518j6227j5669j4876j4450j4413j3864j2255j0454r750j0157j0476
61876E11502j0030r418r351r506r017p599n684l782k181j063m23O9Q27J937L179
61861D49460M405N655P005Q540J0395J2607J4960J7252J9621K2359K5364K8037
61849F25660K9835L0752L1128L1198L0915L0114K8663K6465K3421J9426J4457
61838I22034Q704K670k969p709j1368j3879j5086j4903j3572j1507q769m955J18
61825H28809N769J0703J3982J5541J5804J5108J3528J0890O734O30p022j4693
61813I15783k0769k4926k8061l0852l2895l3452l2582l1071k9525k7897k5783
$$ plain form
61900 755379 767157 775194 778528 777463 773041 765780 755294 741184 724098 705727 687706 670611
61888 670611 654093 637866 622197 607321 592871 578458 564594 552339 541885 532135 521978 511502
61876 511502 501472 492054 482703 473197 464180 456581 450897 447115 444934 443871 443448 443517 444344 446281 449460
61861 449460 453865 459520 466525 475065 485460 498067 513027 530279 549900 572259 597623 625660
61849 625660 655495 686247 717375 748573 779488 809602 838265 864730 888151 907577 922034
61838 922034 930738 933408 930439 922730 911362 897483 882397 867494 853922 842415 833646 828691 828809
61825 828809 834578 845281 859263 874804 890608 905716 919244 930134 936868 937498 930476 915783
61813 915783 895014 870088 842027 811175 778280 744828 712246 681175 651650 623753 597970
61802E97970k2901j9429j6151j4013j3148j2520j1013q773o925o097n786n335
61790D55879m784m449m227l813l275k932k828k842l031l404l537l016k179j798
61776D09764j971j919j161l13k87j084j911k241k241k195k096j850j474q97OR32
61760C89062J063n2j660k386j679k89P88J344J674J768J412Q18M81L74o0r62j720
61743C89976j845j684j759j871j426l93O26J172J281J125P89L99R9j04j49K84
61727C86520J291K288K554K255K197K622K956K843K632K560K263J599J193J567
61713D17340K259K498K221J746R41l82j625j962j706k019l227m299m393m025m135
61698C99232m676m845m330l597l093k757k491k499k910l327l102k149j167r34
$$ plain form
61802 597970 575069 555640 539489 525476 512328 499808 488795 480022 473097 467000 461214 455879
61790 455879 451095 446646 442419 438606 435331 432399 429571 426729 423698 420294 416757 413741 411562 409764
61776 409764 407793 405874 404713 404400 404113 403029 401118 398877 396636 394441 392345 390495 389021 388124 388130 389062
61760 389062 390125 390073 388413 386027 384348 384059 384847 386191 387865 389633 391045 391863 392344 392718 392658 391696 389976
61743 389976 388131 386447 384688 382817 381391 380998 381624 382796 384077 385202 385991 386390 386489 386385 386236 386520
61727 386520 387811 390099 392653 394908 397105 399727 402683 405526 408158 410718 412981 414580 415773 417340
61713 417340 419599 422097 424318 426064 427005 426623 424998 423036 421330 419311 416084 411785 407392 403367 399232
61698 399232 394556 389711 385381 381784 378691 375934 373443 370944 368034 364707 361605 359456 358289 357355
61684C57355j435j927j896j628j696k154k561k676k680k759k822k708k395j980
61670C26038j595j446j578j708j498j033p19o89o16k67J54L37K97K37K18J77J23
61653C16432J61M46J100K046K833K941K394J846J900K544L342L937M188M029L489
61638C53628K693J748P46j8k76l74j191l001m757n164m310l573l801m316m016
61623C24018k888j828j353j151q59n90m75k14M66J218J375Q28J08l54p12j346
61607C16243k402l809n350o469o408n041l296k336k379k781l077l328l447k934
61593B63186j730p14p91j689k264j939j309j184j507j563j051n30o64j354j826
61578B43071j528o71J42N71O61N65L78J58q7l54n34m55j82m3j59k12J3J96n1n05
$$ plain form
61684 357355 355920 353993 352097 350469 348773 346619 344058 341382 338702 335943 333121 330413 328018 326038
61670 326038 324443 322997 321419 319711 318213 317180 316461 315772 315156 314889 315043 315380 315677 315914 316132 316309 316432
61653 316432 316593 317039 318139 320185 323018 325959 328353 330199 332099 334643 337985 341922 346110 350139 353628
61638 353628 356321 358069 358815 358797 358521 358147 356956 353955 349198 344034 339724 336151 332350 328034 324018
61623 324018 321130 319302 317949 316798 315939 315349 314874 314660 315126 316344 317719 318547 318655 318301 317589 316243
61607 316243 313841 310032 304682 298213 291805 286764 283468 281132 278753 275972 272895 269567 266120 263186
61593 263186 261456 260742 259951 258262 255998 254059 252750 251566 250059 248496 247445 246915 246251 244897 243071
61578 243071 241543 240872 241014 241585 242246 242811 243189 243347 243260 242906 242372 241917 241735 241692 241533 241321 241334 241530 241479 240974
61558B40974o38m20j90L5N11J083J317J343J753K469K594J784R15Q28J164J104
61542B56626P01N94Q88J139J223J383J544J358R02O75Q54J147J346J451J296O27
61526B73754l18q97q90p47r06j281j532j473j118o45l30k42p7L35N89K47l56n07
61508B63606k05n4k06k57j94m35p84m97K61K35r57j910j440m50n03j328j300k2
61490B53560J181J308Q35N20L70K21K34L21L0n37n71J42P62P68Q26J488K012J513
61472B64983M95N3J41l4l82j03O12O63m1k46N41J071L06q48q77J44R13Q51N32
61453B68774M27M20N14R44J470J400O07j85l00K51J154K162K922L033K594K163
61437B88350K036K003J956K112K463K651K624K791L104K785J506J88n8O37J269
$$ plain form
61558 240974 240336 239916 239726 239761 240272 241355 242672 244015 245768 248237 250831 252615 253530 254358 255522 256626
61542 256626 257327 257921 258809 259948 261171 262554 264098 265456 266358 267033 267887 269034 270380 271831 273127 273754
61526 273754 273436 272539 271649 270902 269996 268715 267183 265710 264592 263947 263617 263375 263298 263633 264222 264469 264113 263606
61508 263606 263401 263347 263141 262884 262690 262255 261471 260974 261235 261470 260513 258603 257163 256713 256210 254882 253582 253560
61490 253560 254741 256049 256884 257404 257774 257995 258229 258550 258580 258043 257472 257614 258376 259144 259970 261458 263470 264983
61472 264983 265478 265531 265672 265638 265256 265153 265765 266428 266387 266141 266682 267753 268059 267211 266334 266478 267391 268242 268774
61453 268774 269201 269621 270135 271079 272549 273949 274556 274371 274071 274322 275476 277638 280560 283593 286187 288350
61437 288350 290386 292389 294345 296457 298920 301571 304195 306986 310090 312875 314381 314569 314511 315148 316417
61422C16417J395J369J405J279R62Q47J110J457J558J371R64M64J32M8k38j184
61406C29356k385k882k434j874j921k371k723k936l067k749j727n52k5j64k65
61391C01281qJ89j05p25j248j476j404j017l73K71O38O45M20K22L53R36J699K170
61373C02468K141J864J656J542J321R52O33N91Q76J345J865K439L098L631L601
61358C30023K881K072K013K880L983M672N054N622O486P352P964Q189P760O492
61344D03443M780L464L048L371M066M862N317M884L603K347J855J847J539P64
61330D49190m5p27j575k651l593m212m691m996m696l700k596j862j213k50P15
61315D13098J070R74J255K233L358M145M872N998P361Q468R295J0252J1282J1546
$$ plain form
61422 316417 317812 319181 320586 321865 322827 323674 324784 326241 327799 329170 330134 330598 330730 330778 330540 329356
61406 329356 326971 324089 321655 319781 317860 315489 312766 309830 306763 304014 302287 301735 301710 301546 301281
61391 301281 301273 301462 301357 300632 299384 297908 296504 295487 295114 295385 296023 296668 297088 297310 297663 298599 300298 302468
61373 302468 304609 306473 308129 309671 310992 311944 312577 313168 314044 315389 317254 319693 322791 326422 330023
61358 330023 332904 334976 336989 339869 343852 348524 353578 359200 365686 373038 381002 389191 396951 403443
61344 403443 408223 411687 414735 418106 422172 427034 432351 437235 440838 443185 445040 446887 448426 449190
61330 449190 449145 448418 446843 444192 440599 436387 431696 426700 422004 418304 415708 413846 412633 412383 413098
61315 413098 414168 415142 416397 418630 421988 426133 431005 437003 444364 452832 462127 472379 483661 495207
61301D95207J0295P826N226L282J930P46l62j183j669k122k906m142n588o738
61287D99802p195p049o780o649o350n547m490l727l348k908k098j044K5J027J844
61272D45513K315K482K551K594K608K833L487M218M379L982L780M235N057N932
61258D95966O993Q137Q650Q086O974O044N292M419L556K871J938M76q49j281j353
61243E55919k228l859n004n151n168n687o040n454m353l630l262k559j415n10
61229E01599k66l50k16K48Q43J486K269L137L703L605L114L026L717M600N010
61214E35525N262O084P111O914M918K410J088J161J606J824K180L058M183N087
61200E88411N715O300P023P993R352J1067J2746J3849J4153J3903J3405J2582
$$ plain form
61301 495207 505502 513328 518554 521836 523766 524512 524150 522967 521298 519176 516270 512128 506540 499802
61287 499802 492607 485558 478778 472129 465779 460232 455742 452015 448667 445759 443661 442617 442642 443669 445513
61272 445513 447828 450310 452861 455455 458063 460896 464383 468601 472980 476962 480742 484977 490034 495966
61258 495966 502959 511096 519746 527832 534806 540850 546142 550561 554117 556988 558926 559402 558553 557272 555919
61243 555919 553691 549832 544828 539677 534509 528822 522782 517328 512975 509345 506083 503524 502109 501599
61229 501599 501333 500983 500767 501015 501858 503344 505613 508750 512453 516058 519172 522198 525915 530515 535525
61214 535525 540787 546871 553982 560896 565814 568224 569312 570473 572079 573903 576083 579141 583324 588411
61200 588411 594126 600426 607449 615442 624794 635861 648607 662456 676609 690512 703917 716499
61188G16499J1117R002O774N037L929L197K579J902J000o9r03j302j795l128n143
61173G48696o735p141o811o734p242p859q094p995p953q221q770r554j0681j2136
61159F32770j3346j3480j2416j1044j0154r419q039o082m430l414k438j107J6
61146E37417J26r16k680m600o108o870p174p551p790p047n183l273k291j942j319
61131D72799j35J276K692M020N018N628O282P353Q641R905J1451J3585J5914J7847
61117E82276J9432K0928K1998K2193K1988K2371K3402K4049K3578K2350K1132
61106H25697K0245J9540J8629J6918J4068J0539P276M604J934j333n012q420j1110
61093I13575j3118j4784j6439j8076j9302j9836j9941k0105k0447k0725k0678
$$ plain form
61188 716499 727616 736618 743392 748429 752358 755555 758134 760036 761036 760967 760064 758762 756967 753839 748696
61173 748696 741961 734820 728009 721275 714033 706174 698080 690085 682132 673911 665141 655587 644906 632770
61159 632770 619424 605944 593528 582484 572330 562911 554872 548790 544360 540946 538508 537401 537417
61146 537417 537543 536627 533947 529347 523239 516369 509195 501644 493854 486807 481624 478351 476060 474118 472799
61131 472799 472664 473940 476632 480652 485670 491298 497580 504933 513574 523479 534930 548515 564429 582276
61117 582276 601708 622636 644634 666827 688815 711186 734588 758637 782215 804565 825697
61106 825697 845942 865482 884111 901029 915097 925636 932912 937516 939450 938117 933105 924685 913575
61093 913575 900457 885673 869234 851158 831856 812020 792079 771974 751527 730802 710124
61082G10124j9991j8215j5443j2820j1601j1641j1519j0244q166o137m558l487
61070E76302k896k396j362J88J364J561J385J845L020M187N059O104P619R046
61056F11026R577R181Q727R092J0390J2074J3649J5026J6237J7268J8334J9964
61044G70545K2363K4906K6750K7863K8997L0664L2682L4720L6771L8859M0758
61033A115878M2281M3643M5250M7222M9161N0394N0619N0539N1530N4418N8907
61022A659842O4554P1756Q0940R1276J01405J11531J23821J40697J63797J94718
61012B804337K35349K86832L49188M22561N07745O05243P15802Q43433R96422
61003G766912J182723J402512J640985J859542J988530J939307J649771J141822
$$ plain form
61082 710124 690133 671918 656475 643655 632054 620413 608894 598650 590484 584347 579789 576302
61070 576302 573406 571010 569648 569836 571200 572761 574146 575991 579011 583198 588257 594361 601980 611026
61056 611026 620603 629784 638511 647603 657993 670067 683716 698742 714979 732247 750581 770545
61044 770545 792908 817814 844564 872427 901424 932088 964770 999490 1036261 1075120 1115878
61033 1115878 1158159 1201802 1247052 1294274 1343435 1393829 1444448 1494987 1546517 1600935 1659842
61022 1659842 1724396 1796152 1877092 1968368 2069773 2181304 2305125 2445822 2609619 2804337
61012 2804337 3039686 3326518 3675706 4098267 4606012 5211255 5927057 6770490 7766912
61003 7766912 8949635 10352147 11993132 13852674 15841204 17780511 19430282 20572104
60995B0572104N38180R119l15105l96559k78117m5244J93268L11969K01962j67376
60985B0624201p12633j273485j700155j920592j944834j826496j625653j392505
60977H227848j163193r58270p84586o41382n25556m33066l59089k99455k51696
60968B811555k14179j84976j62119j44133j29697j17415j06405r6549q7689p9108
60958A489285p0280o1633n4041m7798m2666l8645l6114l5104l4851l4307l2968
60947A000878l1072k9003k6717k4034k1380j9705j9324j9369j8830j7858j7359
60936G56227j7564j7786j7592j7383j7545j7736j7416j6573j5518j4390j3240
60925E73484j2299j1637j0872r573p963o762o376o463o308n528m414l574l178
$$ plain form
60995 20572104 21110284 21119403 20804298 20407739 20129622 20084378 20277646 20589615 20791577 20624201
60985 20624201 19911568 18638083 16937928 15017336 13072502 11246006 9620353 8227848
60977 8227848 7064655 6106385 5321799 4680417 4154861 3721795 3362706 3063251 2811555
60968 2811555 2597376 2412400 2250281 2106148 1976451 1859036 1752631 1656082 1568393 1489285
60958 1489285 1419005 1357372 1303331 1255533 1212867 1174222 1138108 1103004 1068153 1033846 1000878
60947 1000878 969806 940803 914086 890052 868672 848967 829643 810274 791444 773586 756227
60936 756227 738663 720877 703285 685902 668357 650621 633205 616632 601114 586724 573484
60925 573484 561185 549548 538676 529103 521140 514378 508002 501539 495231 489703 485289 481715 478537
60912D78537k681j526m1Q39P59M54P95J809K895L667M057L891K956J487K16k55
60896D97859k8K07j96j186j945j657n08L80J29j002k184l151m264n644o787p198
60880D62825p000o694o555o441o136n652n246n119n106m787m046l370l329l742
60866C89602l744k779j272n5O19J148J698J709O37j022j923j279K50J346J503
60851C86438J244J062P11j06r37j020k59O89J244J330J015K62p51j556j851j834
60835C85681j767j540r63l35k41p90j337j192m30J84O1n36p95l38K62J56o67j285
60817C74128j030l73k91r18j412j228r63j549k885l826l541k489j830k160l052
60802C46581l731l798l296k457j678j506k235l401m001l467k306j577j772k364
$$ plain form
60912 478537 475856 474330 474289 475128 475887 476341 477136 478945 481840 485507 489564 493455 496411 497898 498114 497859
60896 497859 497831 498038 497842 496656 494711 493054 492546 492926 493055 492053 489869 486718 482454 476810 470023 462825
60880 462825 455825 449131 442576 436135 429999 424347 419101 413982 408876 404089 400043 396673 393344 389602
60866 389602 385858 383079 381807 381752 382371 383519 385217 386926 387563 386541 384618 383339 383589 384935 386438
60851 386438 387682 388744 389455 389349 388412 387392 387133 387822 389066 390396 391411 391673 390922 389366 387515 385681
60835 385681 383914 382374 381411 381076 380835 380045 378708 377516 377086 377270 377331 376795 376000 375662 375924 376080 375413 374128
60817 374128 373098 372725 372434 371516 370104 368876 367913 366364 363479 359653 356112 353623 351793 349633 346581
60802 346581 342850 339052 335756 333299 331621 330115 327880 324479 320478 317011 314705 313128 311356 308992
60788C08992k478j795q24l30n99j163j287p65j14M5k67n15l80KM83J186K134L007
60770C05332L454L471L177K537J692J222J622K565L241L334L211L132K904K452
60756C43346K082J851J238r3j596k477k608k319j597k88J101J645J203O05L98
60741C42491P8r91k482l564m043m394m881n268n394n368n128m406l358k747l050
60726B87495l715l721k795j614r13p70q99j177j580j793j388m42L29L30j64l09
60710B66874K74J057J286Q95M82M94P37P57N01L91P53J377J722J528J147J131
60694B81406J610K199K608K993L575M103M133L754L531L640L535K841K124K228
60680C24280L012L420K838J819J193J015Q15M68K62K36L2n36j185j641j993k416
$$ plain form
60788 308992 306514 304719 303895 303565 302966 301803 300516 299751 299637 299682 299415 298900 298520 298522 299005 300191 302325 305332
60770 305332 308786 312257 315434 317971 319663 320885 322507 325072 328313 331647 334858 337990 340894 343346
60756 343346 345428 347279 348517 348424 346828 344351 341743 339424 337827 337539 338640 340285 341488 342093 342491
60741 342491 342569 341578 339096 335532 331489 327095 322214 316946 311552 306184 301056 296650 293292 290545 287495
60726 287495 283780 280059 277264 275650 274737 273967 273068 271891 270311 268518 267130 266688 267017 267347 267183 266874
60710 266874 267148 268205 269491 270386 270868 271362 272099 272856 273357 273748 274501 275878 277600 279128 280275 281406
60694 281406 283016 285215 287823 290816 294391 298494 302627 306381 309912 313552 317087 319928 322052 324280
60680 324280 327292 330712 333550 335369 336562 337577 338392 338860 339122 339358 339390 338854 337669 336028 334035 331619
60664C31619k849l211l668m307m728m364l202j866q90k29L91R85J393J719K267
60649C09060L033L531L304K486J715J426J356Q63l03j693k703l314l973m823n320
60634C04645m827l401j722m40K06K86L1j77m5L39O80R45J262J397Q70j27n31L67
60616B99758J832K448J847R83P04P59M92j48o84q43p02l33K20O96P92O02N41P75
60598C09739R72Q14M77L76N71O41K31m62q63o80k00R1L9j51k70l07l22l00j68
60579C10228J50O66J233J651J965K560L688N002N851N968N689N561O088P622R948
60564C73870J2002J2578J1482R536P381M941K165m61k586m452o172p122o736n344
60550D01082l653j863k7J326J859K346L800N849P098P093O869P395Q529R872J1479
$$ plain form
60664 331619 328770 325559 321891 317584 312856 308492 305290 303424 302534 302305 302696 303681 305074 306793 309060
60649 309060 312093 315624 318928 321414 323129 324555 325911 326774 326471 324778 322075 318761 314788 309965 304645
60634 304645 299818 296417 294695 294255 294461 294747 294778 294601 294556 294895 295575 296520 297782 299179 300049 299922 299391 299758
60616 299758 301590 304038 305885 306868 307572 308331 308823 308675 307991 307148 306446 306113 306333 307029 307821 308423 308964 309739
60598 309739 310711 311525 312002 312378 312949 313590 313821 313359 312496 311816 311616 311707 311746 311595 311325 311018 310696 310396 310228
60579 310228 310378 311044 312277 313928 315893 318453 322141 327143 332994 338962 344651 350212 356300 363922 373870
60564 373870 385872 398450 409932 419468 426849 431790 433955 433494 430908 426456 420284 413162 406426 401082
60550 401082 397429 395566 395539 396865 398724 401070 404870 410719 417817 424910 431779 439174 447703 457575 469054
60535D69054J3205J4159J3588J1662Q893N435J577j737l749m836n865o901p286
60522E07199o827o065n405m646l554k358j519j237j311j233n17Q42K254L115L459
60507D82197L851M753O236Q156J0361J2787J5575J8955K2845K6741L0232L3398
60495F76087L6449L9203M1123M1689M0436L6956L1241K3724J4692M050p855j9600
60483I58195k9582l7268m2910m6330m6933m4911m1454l7562l3359k8928k4974
60472E43984k2195k0495j9259j7987j6355j4196j1865j0143r333q836q019p022
60460C78279o256n536m473l318k706k670k637k325j966j711j523j637k373l265
60446C35883l276k212j247j414k212k347j447k22P22J406J804J623R31L54K24
$$ plain form
60535 469054 482259 496418 510006 521668 530561 535996 537573 535836 532087 527251 521386 514485 507199
60522 507199 500372 494307 488902 484256 480702 478344 476825 475588 474277 473044 472527 473369 475623 478738 482197
60507 482197 486048 490801 497037 505193 515554 528341 543916 562871 585716 612457 642689 676087
60495 676087 712536 751739 792862 834551 874987 911943 943184 966908 981600 985650 977795 958195
60483 958195 928613 891345 848435 802105 755172 710261 668807 631245 597886 568958 543984
60472 543984 521789 501294 482035 464048 447693 433497 421632 411489 402156 393320 385301 378279
60460 378279 372023 366487 362014 358696 355990 353320 350683 348358 346392 344681 343158 341521 339148 335883
60446 335883 332607 330395 329148 327734 325522 323175 321728 321506 322228 323634 325438 327061 327992 328346 328570
60431C28570R5n03j287j596j266o82k33j34m70r60r03O0J269J674J168O74Q67
60414C26343J410J678J628J588J574J322Q01L36K43N86J169J615J636J363J219
60399C44511J322J314R52N78O44J057J412J640J989K447K643K361J834J449J439
60384C67592J799K288K506K257J842J739J967K106J923J662J656J927K305K676
60370C96245K984L185L291L309L058K311J269O16R10J988L186M007M421M596M669
60355D40045M790N252O336P971R578J0381J0025Q901P744O803N574L434M36k744
60341E24526n509p724r324r969r462q301p345o861o303n218l927l021k527k086
60327D36949j763k012k840l552l567l094k704k585k482k095j281k5J524L041M337
$$ plain form
60431 328570 328665 328162 326875 325279 324013 323331 323098 322964 322494 321534 320631 320691 321960 323634 324802 325476 326343
60414 326343 327753 329431 331059 332647 334221 335543 336344 336680 336923 337509 338678 340293 341929 343292 344511
60399 344511 345833 347147 348099 348677 349321 350378 351790 353430 355419 357866 360509 362870 364704 366153 367592
60384 367592 369391 371679 374185 376442 378284 380023 381990 384096 386019 387681 389337 391264 393569 396245
60370 396245 399229 402414 405705 409014 412072 414383 415652 416268 417178 419166 422352 426359 430780 435376 440045
60355 440045 444835 450087 456423 464394 473972 484353 494378 503279 511023 517826 523400 526834 527270 524526
60341 524526 519017 511293 501969 492000 482538 474237 466892 460031 453728 448510 444583 441562 439035 436949
60327 436949 435186 433174 430334 426782 423215 420121 417417 414832 412350 410255 408974 408949 410473 413514 417851
60312D17851N593P278R742J2892J6015J8105J8680J8328J8069J8146J7814J6338
60300E94851J3631R810M804j174p226j2443j6686k0239k2906k3980k3044k0434
60288D74964j6997j3624j0878q795p088n588m319l153j924r22o99j125j327r87
60274C97538q66j504k192k092j670j943k737k941k282j641j529j363n70M91J097
60259C75796R57K58n39p90j64Q05J221R18M66K00k2j09L08J064J447J196P56L89
60241C84157l3k61K61J227J419L47r60j420j171p70j15R70J834J826J378J371
60225C90060J807K052J998J949J748R90j8m80j56N32J373K452L464L884L848M024
60209D19527M495M642M327M337N155O046N995N102M408M505M898M762L970L136
$$ plain form
60312 417851 423444 430722 440464 453356 469371 487476 506156 524484 542553 560699 578513 594851
60300 594851 608482 618292 623096 621922 614696 602253 585567 565328 542422 518442 495398 474964
60288 474964 457967 444343 433465 424670 417582 411994 407675 404522 402598 401676 400977 399852 398525 397538
60274 397538 396672 395168 392976 390884 389214 387271 384534 381593 379311 377670 376141 374778 374208 374699 375796
60259 375796 376753 377011 376472 375682 375518 376323 377544 378462 378928 379128 379106 378997 379305 380369 381816 383012 383768 384157
60241 384157 384124 383863 384124 385351 386770 387117 386157 384737 383566 382796 382681 383651 385485 387311 388689 390060
60225 390060 391867 393919 395917 397866 399614 400604 400586 400106 399950 400482 401855 404307 407771 411655 415503 419527
60209 419527 424022 428664 432991 437328 442483 448529 454524 459626 464034 468539 473437 478199 482169 485305
60195D85305K789K724K341J484O61L13K05j25o32q65p34o70j022j649k267k865
60179D84993l581m355m875m898m506m034l679l245k433j379o41n79r69j334j394
60164D43091j143p85p60j372k146k058p69P63J445J392J475J951K304K321K374
60149D48083K531K272J426O69N89P95N90J66M08J638L148M093M405M539M729M850
60133D84931M826M781M738M518M008L271K283Q69q04j955j880q09K90P04M76m
60117E10243m48o47m79r8J95L24L70J66n38j465j905j615j112r02r74j252j897
60100D97966k779l235k866k060j353p51j68M8l20p45n71J06P60J243J624J605
60084D88504R32J11l8M99J016J079P47K3j080k007k088j553j376j996k923l736
$$ plain form
60195 485305 488094 490818 493159 494643 495304 495617 495822 495697 495065 494200 493466 492796 491774 490125 487858 484993
60179 484993 481412 477057 472182 467284 462778 458744 455065 451820 449387 448008 447367 446788 445819 444485 443091
60164 443091 441948 441163 440403 439031 436885 434827 434058 434821 436266 437658 439133 441084 443388 445709 448083
60149 448083 450614 452886 454312 454981 455570 456365 456955 457121 457529 459167 462315 466408 470813 475352 480081 484931
60133 484931 489757 494538 499276 503794 507802 511073 513356 514225 513421 511466 509586 508777 509067 509771 510247 510243
60117 510243 509795 509148 508669 508571 508766 509090 509460 509626 509088 507623 505718 504103 502991 502089 501115 499863 497966
60100 497966 495187 491952 489086 487026 485673 484922 484754 484802 484482 483737 483166 483272 484032 485275 486899 488504
60084 488504 489436 489547 489509 490008 491024 492103 492850 492873 491793 489786 487698 486145 484769 482773 479850 476114
60068D76114m598n532o007n730n210n057n158n027m581m126l805l524l242l081
60054D11436l099l100k681j540O3J315J628J371J415J999K482K343J929J976K740
60039D20277L807M566M629L982K915J825J011O02M67J30q60k245l099k938k489
60024D32580k795l866m822n180n280n456n589n638n854o220o243n614m668l934
60010C61421l593l585l781l838l343k338j367q29n79l43p2K35O76J138J174N21
59994C41497m62j074q54J55J526K698L351L555L420K822J795R18P64J088J122
59979C62321O70K50J29o7o21j247j638j866j994j826j342r04p37o10k71K00O83
59962C51130J194J623J766J771K018K386K238J394N32L15O25R57J019O46k68j393
$$ plain form
60068 476114 471516 465984 459977 454247 449037 443980 438822 433795 429214 425088 421283 417759 414517 411436
60054 411436 408337 405237 402556 401016 401079 402394 404022 405393 406808 408807 411289 413632 415561 417537 420277
60039 420277 424084 428650 433279 437261 440176 442001 443012 443614 444081 444211 443351 441106 438007 435069 432580
60024 432580 429785 425919 421097 415917 410637 405181 399592 393954 388100 381880 375637 370023 365355 361421
60010 361421 357828 354243 350462 346624 343281 340943 339576 338747 338168 337825 337753 337988 338664 339802 340976 341497
59994 341497 341035 339961 339107 339262 340788 343486 346837 350392 353812 356634 358429 359347 360111 361199 362321
59979 362321 362991 363241 363370 363303 362682 361435 359797 357931 355937 354111 352769 351865 351128 350518 350247 350447 351130
59962 351130 352324 353947 355713 357484 359502 361888 364126 365520 366052 366367 366992 367949 368968 369614 369346 367953
59946C67953k041j961j548j084m57R3j66j274k148j974j334j145j262j025n66
59931C50061m46m36J75J286K035K132K134K431K846L306L938M425M182L357K815
59916C84241K769K375J118j70m16J79N31K25j03J66Q69J572K224K988L715L959
59900D06242L483K453J249K58j64J54R41J699K222K681L043K918K297J982K657
59885D34115L847M518M481M384M433M194L742L873M691N030L992K269J110O58
59871D85337J12r60k328l682m689m863m162l379l144k956j997n79L77R08J961
59856D55956L663M946N133M890N181O158P463Q767R388Q241N033J161j381j904
59842E22695j376j017j097j100p34m97j259l261n602o984o994o375n975n758n108
$$ plain form
59946 367953 365912 363951 362403 361319 360862 360955 360789 359515 357367 355393 354059 352914 351652 350627 350061
59931 350061 349615 349179 349354 350640 352675 354807 356941 359372 362218 365524 369462 373887 378069 381426 384241
59916 384241 387010 389385 390503 390333 389917 390096 390627 390852 390749 390915 391784 393356 395580 398568 402283 406242
59900 406242 409725 412178 413427 413685 413521 413675 414616 416315 418537 421218 424261 427179 429476 431458 434115
59885 434115 437962 442480 446961 451345 455778 459972 463714 467587 472278 477308 481300 483569 484679 485337
59871 485337 485449 484489 482161 478479 473790 468927 464765 461386 458242 455286 453289 452710 453087 453995 455956
59856 455956 459619 464565 469698 474588 479769 485927 493390 502157 511545 519786 524819 525980 524599 522695
59842 522695 521319 520302 519205 518105 517371 516874 515615 512354 506752 499768 492774 486399 480424 474666 469558
59827D69558l833k533j934k150k661k921k846k642k384k029j781j980k469k559
59813D34836k018j654k381l911m972m795l747k557j561q78o64q55j009p89k91
59798D02754K35P61J237J331P56k82j254j855k104k014j486o23R6K70O8M1L18
59781C98249L21m17j445j826j352p37n70o08l95K9M69J054J802K102J427K91j70
59764C98224M13J373K042K403K637K781L020L675M523M711L788K525K193L150
59750D37458M507N136M795M205M247N099O197O906O974O380N119L466K136J670
59736E04295J785J712J112K78n13j294k074k637k823k653k125j322o56n70r28
59721D91587j145j027r28j013r36n80n56j376k487k700j603o4P44N60L1k35l15
$$ plain form
59827 469558 465725 463192 461258 459108 456447 453526 450680 448038 445654 443625 441844 439864 437395 434836
59813 434836 432818 431164 428783 424872 419900 415105 411358 408801 407240 406362 405698 404843 403834 403045 402754
59798 402754 402989 403750 404987 406318 407074 406792 405538 403683 401579 399565 398079 397456 397552 397822 397890 397931 398249
59781 398249 398570 398153 396708 394882 393530 392793 392223 391615 391220 391249 391718 392772 394574 396676 398103 398394 398224
59764 398224 398637 400010 402052 404455 407092 409873 412893 416568 421091 425802 429590 432115 434308 437458
59750 437458 441965 447101 451896 456101 460348 465447 471644 478550 485524 491904 497023 500489 502625 504295
59736 504295 506080 507792 508904 509182 508669 507375 505301 502664 499841 497188 495063 493741 493085 492515 491587
59721 491587 490442 489415 488487 487474 486538 485958 485402 484026 481539 478839 477236 477172 477916 478476 478507 478272 477957
59704D77957n64r03q80m43j36k88m64j16N60R15P90N93N11K95k10p69j200j573
59686D74075j908k003j761j291p27k19j32p26j683k332k494k585k885l277l740
59671D46312m475n268n374m446l122k304k217k512k885l122k901k067r84k25P7
59656D04487K81P49J508K344K943L058K699K151J700J359R28K63m98r22o48Q9
59640D22491M64n9j021j546j444j174q75j84Q24J357R58K42J8J51j05r59j888
59623D17250k440k637k600k264j657j197j390k265l144l233k498j812j918k414
59609C85781k206r60M86J269J509J835K397K778K665K152J590J369J712K362K657
59594D07396K200J350Q25R48J411J715J586J151P75O92O98L45n24j619k509k889
$$ plain form
59704 477957 477393 476490 475610 475167 475031 474743 474279 474163 474723 475638 476428 477021 477532 477827 477617 476848 475648 474075
59686 474075 472167 470164 468403 467112 466385 466166 466034 465308 463625 461293 458799 456214 453329 450052 446312
59671 446312 441837 436569 431195 426749 423627 421323 419106 416594 413709 410587 407686 405619 404635 404410 404487
59656 404487 404768 405517 407025 409369 412312 415370 418069 420220 421920 423279 424207 424470 423972 423050 422402 422491
59640 422491 422955 422896 421875 420329 418885 417711 416836 416652 417476 418833 419791 420033 420051 420202 420097 419138 417250
59623 417250 414810 412173 409573 407309 405652 404455 403065 400800 397656 394423 391925 390113 388195 385781
59609 385781 383575 382615 383101 384370 385879 387714 390111 392889 395554 397706 399296 400665 402377 404739 407396
59594 407396 409596 410946 411771 412719 414130 415845 417431 418582 419357 420049 420747 421092 420568 418949 416440 413551
59578D13551k655k018j530j606j981k056j679j216q46m29n3l8k43o8N14P18J13
59561C98478n98n92q7J32j01l26k90j05J96O83J175J415J531J880K576L462M331
59544D13760M944N110N181O059Q212J1097J3991J6907J9865K1592K0057J4478
59532E61253O266k119q662j2314j2973j1450r067o781m848l184j717l05J222K703
59518D98024L640L675K923J737L43j247l101n128o888p775p690p290p278p521
59504D56424p317o442n459m933m783m554m041l425k970k669k198j257r0N79L92
59489D07257j45k95k7J23k1j02J55O53J329K313L496M459N031N489O027O385O258
59472D48385N768N245M750M085L076J699J33j172j638j049J99J433K236K588K697
$$ plain form
59578 413551 410896 408878 407348 405742 403761 401705 400026 398810 397964 397535 397482 397444 397201 397133 397647 398365 398478
59561 398478 397880 397288 397201 397333 397232 396906 396616 396511 396707 397390 398565 399980 401511 403391 405967 409429 413760
59544 413760 418704 423814 428995 435054 443266 454363 468354 485261 505126 526718 546775 561253
59532 561253 567519 565400 556738 544424 531451 520001 510934 504153 499305 496121 494404 494099 495321 498024
59518 498024 501664 505339 508262 509999 510342 509095 505994 500866 493978 486203 478513 471223 463945 456424
59504 456424 449107 442665 437206 432273 427490 422936 418895 415470 412500 409831 407633 406376 406286 406865 407257
59489 407257 407112 406817 406790 406913 406892 406790 406945 407598 408927 411240 414736 419195 424226 429715 435742 442127 448385
59472 448385 454153 459398 464148 468233 471309 473008 473141 471969 470331 469282 469481 470914 473150 475738 478435
59457D78435K872L392M339N588O953Q214R000Q933Q085P067O439O100N427M001
59443E64845K000j53k282m451o496p914q322p946p390o914o219n039l643k553
59429D97523j909j393o61L59J561K785L909N091O827R442J2485J4963J6371J7302
59415E84655J8809K1336K4451K7408K9475K9541K5976J7656N501p344j7236k2174
59403G38054k2390j9313j4336q261j474N342J0387J0960N425m731j5369k2734
59391F61560k5834k5882k4225k1442j7893j4166j0780p965n804m334l405k755
59379D97075k265j954j773j491q53K77J699K805K953K175J284J031J391J869K238
59364E06461K636L106L481L613L525L361L418M015N096O209P080P996R312J0811
$$ plain form
59457 478435 481307 484699 489038 494626 501579 509793 518793 527726 535811 542878 549317 555417 560844 564845
59443 564845 566845 566692 564410 559959 553463 545549 537227 529281 521891 514977 508758 503719 500076 497523
59429 497523 495614 494221 493560 493919 495480 498265 502174 507265 514092 523534 536019 550982 567353 584655
59415 584655 603464 624800 649251 676659 706134 735675 761651 779307 784808 777464 760228 738054
59403 738054 715664 696351 682015 673754 672280 677622 688009 698969 704394 699663 684294 661560
59391 661560 635726 609844 585619 564177 546284 532118 521338 513373 507569 503235 499830 497075
59379 497075 494810 492856 491083 489592 488739 489016 490715 493520 496473 498648 499932 500963 502354 504223 506461
59364 506461 509097 512203 515684 519297 522822 526183 529601 533616 538712 544921 552001 559997 569309 580120
59350E80120J1926J2391J2398J2320J2599J3549J4848J5490J4787J3240J1890
59339G25558J0934R543P007L524j91l531o192q122r527j0750j2084j3704j5510
59326F76955j6819j6688j5097j3391j2907j3297j3044j1508r556q112p015n762
59314E33759m584m007l869l424k294p62P89K341M079O111Q365J0597J2362J2977
59300E72440J1599P596J180o256j2703j6718j8065j7309j5170j2449j0134q921
59288D75090q481p646n696l257j495n77M45K070L448L676L333L750N020N872N670
59273D81222N411O249Q026R838J1258J2220J2462J1924J1214J0779J0082Q422
59261E99107O149M134K370J84k418m619o005o943p684q047q020p869p510o573
$$ plain form
59350 580120 592046 604437 616835 629155 641754 655303 670151 685641 700428 713668 725558
59339 725558 736492 746035 753042 756566 756375 752844 746652 738530 729003 718253 706169 692465 676955
59326 676955 660136 643448 628351 614960 602053 588756 575712 564204 554648 546536 539521 533759
59314 533759 529175 525168 521299 517875 515581 514819 515608 517949 522028 528139 536504 547101 559463 572440
59300 572440 584039 591635 592815 586559 573856 557138 539073 521764 506594 494145 484011 475090
59288 475090 466609 458963 453267 450010 448515 447938 448383 450453 453901 457577 460910 464660 469680 475552 481222
59273 481222 486633 492882 500908 510746 522004 534224 546686 558610 569824 580603 590685 599107
59261 599107 605256 609390 611760 611944 609526 604907 598902 591959 584275 576228 568208 560339 552829 546256
59247E46256n202m019l184k264j127j31O74J661K803L550L876M447N450O136O000
59232E64926N545N309M938L924K586J531O42o53k452m410o394q418j0122j0929
59218E46023j0697r788q645p622p058p005o968o321n027l731l127l339l825l797
59204D59073k943j747r92q92r94q63m76J44R99J727J684Q15m6j76J31J76j5K77
59186D55882J402K810L660L576K872K228K177K698L286L500L369L236L378L821
59172D97895M341M592M458M293M572N291N943O193O196O145N816M854L316J691
59158E65596M64k58q13j709l203n027o587p464p661p568p724q309q719q059o381
59143D86578m938m731n272n447n166n209n737o010n621n004m479l749k644j581
$$ plain form
59247 546256 541054 537035 533851 531587 530460 530329 531003 532664 535467 539017 542893 547340 552790 558926 564926
59232 564926 570471 575780 580718 584642 587228 588759 589401 588748 586296 581886 575492 567074 556952 546023
59218 546023 535326 525538 516893 509271 502213 495208 488240 481919 476892 473161 470034 466695 462870 459073
59204 459073 456130 454383 453391 452499 451505 450642 450166 450310 451309 453036 454720 455535 455489 455313 455444 455620 455605 455882
59186 455882 457284 460094 463754 467330 470202 472430 474607 477305 480591 484091 487460 490696 494074 497895
59172 497895 502236 506828 511286 515579 520151 525442 531385 537578 543774 549919 555735 560589 563905 565596
59158 565596 566060 565802 564989 563280 560077 555050 548463 540999 533338 525770 518046 509737 501018 492959 486578
59143 486578 481640 476909 471637 466190 461024 455815 450078 444068 438447 433443 428964 425215 422571 420990
59129D20990r25n26j72J44O18J625L053M301N113N787O447O871P172P764Q466
59114D76728Q653Q521R052J0270J0825R952Q699Q228Q054P166N933N449N616N277
59100E88423M080K824K052J430O60m8n94j253k055k548k421j917j439j187j211
59085E84796j441j686j843k076k539l114l755m722o062p159p388o953o557o433
59071E23068o248n796n229m674m165l917m166m716n035m786m001k874j701r06
59057D64854o74p19o32m23l44m68o64q71j056j113j005p81l07N71J413J346K68
59040D59395p17o34R9M10P5k53k17n0P2K18L09K57N28J807M024O228P624Q315
59022D87490Q929R824J0751J1146J0711R845R205Q808P925O087L728J488n10k250
$$ plain form
59129 420990 420065 419539 419367 419511 420129 421754 424807 429108 434221 440008 446455 453326 460498 468262 476728
59114 476728 485381 493902 502954 513224 524049 534001 542700 550928 558982 566148 572081 577530 583146 588423
59100 588423 592503 595327 597379 598809 599469 599421 598827 597574 595519 592971 590550 588633 587194 586007 584796
59085 584796 583355 581669 579826 577750 575211 572097 568342 563620 557558 550399 543011 536058 529501 523068
59071 523068 516820 511024 505795 501121 496956 493039 488873 484157 479122 474336 470335 467461 465760 464854
59057 464854 464180 463461 462829 462406 462062 461594 460930 460059 459003 457890 456885 456104 455797 456368 457781 459127 459395
59040 459395 458678 458044 458143 458553 458628 458375 458158 458108 458180 458398 458707 458964 459492 461299 465323 471551 479175 487490
59022 487490 496419 506243 516994 528140 538851 548696 557901 566709 574634 580721 584449 585937 585427 583177
59008E83177l295l319k767k353k158j842j310n91N67K271L929M871N211N417N403
58993E93211M780L691K608J579M63l77n23m47j028k259l279l640l601l315k591
58978E85272j500l59R46K703M471N344N297N309O008P113Q403J0132J2037J2933
58964F64109J2083J0265Q836Q192P832P472P321P317O749M876J670k156n749q668
58950G30149j0875j2368j3154j3531j3958j4403j4255j3220j1793j0470q973o949
58938E86200m900l724l575l922m453n124n504n058l993l060k504k014j641j826
58924E34902k463k741k249j449q95o06m29m67q08j278j580j403m90R30K056K428
58908E23458K664L588M925N776O228P313R326J1267J2284J2633J2806J2632J1794
$$ plain form
59008 583177 579882 576563 573796 571443 569285 567443 566133 565542 566109 568380 572309 577180 582391 587808 593211
58993 593211 597991 601682 604290 605869 606332 605955 605432 604985 603957 601698 598419 594779 591178 587863 585272
58978 585272 583772 583413 584359 587062 591533 596877 602174 607483 613491 620604 629007 639139 651176 664109
58964 664109 676192 686457 695293 703485 711317 718789 726110 733427 740176 745052 746722 744566 738817 730149
58950 730149 719274 706906 693752 680221 666263 651860 637605 624385 612592 602122 593149 586200
58938 586200 581300 577576 574001 570079 565626 560502 554998 549940 545947 542887 540383 538369 536728 534902
58924 534902 532439 529698 527449 526000 525105 524499 524070 523603 522795 521517 519937 518534 518044 518974 521030 523458
58908 523458 526122 529710 534635 540411 546639 553952 563278 574545 586829 599462 612268 624900 636694
58895F36694J0629R856R876J0623J1748J2805J3665J4730J6275J7724J8219J7755
58883H00599J7000J6055J4345J1685Q581N386K032j290m173o824r846j2990j5231
58870H25329j6278j6893j7373j6926j5111j2780j0927r545q287p327o836o460
58858F80586o061o202p152q218q748r041r478r593q885p872p296o935o150n143
58844E73812m644m744m957n152n503n781n613n297n424n848n845n293m812m703
58830E00196m531l898k947j957r78r9M59O77Q27J049J243J428J900K827L914M683
58814E04793M931M786M498M212L880L354K599J834J354J130P00l99j970l136l209
58799E29357k555k230k755l726m677n653o560o657n438l651k575k505k662k421
$$ plain form
58895 636694 647323 657179 667055 677678 689426 702231 715896 730626 746901 764625 782844 800599
58883 800599 817599 833654 847999 859684 868265 873651 875683 874393 870220 863396 853550 840560 825329
58870 825329 809051 792158 774785 757859 742748 729968 719041 709496 701209 693882 687046 680586
58858 680586 674525 668323 661171 652953 644205 635164 625686 616093 607208 599336 592040 585105 578955 573812
58844 573812 569168 564424 559467 554315 548812 543031 537418 532121 526697 520849 515004 509711 504899 500196
58830 500196 495665 491767 488820 486863 485885 485786 486245 486922 487749 488798 490041 491469 493369 496196 500110 504793
58814 504793 509724 514510 519008 523220 527100 530454 533053 534887 536241 537371 538071 537672 535702 532566 529357
58799 529357 526802 524572 521817 518091 513414 507761 501201 494544 489106 485455 482880 480375 477713 475292
58785D75292j838j102k38O36J392K163K938L162K487J695J816K496K368J032m42
58770D93857j280k054l508n273o385o411n619m536l665l153k641j860j256j240
58756D44976j179j15J632K836L224L621M147L875K678J822J993K247J797J382
58742D74936J867K714L009L037L552M363M793M898N173N587N809N845N692N056
58728E36331M167M058N149O342O395N480M450L478K473K024K643L695M272M618
58714E95575N519O742P365P259O990O515N209L126J093m51j847l501n523p939
58700F26132j0496j2467j3376j3753j4407j5278j5706j5485j4830j3636j1678
58689D75020r381p504o213n154m223l602l242k989l010l413l749l507k855k262
$$ plain form
58785 475292 473454 472352 472114 472750 474142 476305 479243 482405 484892 486587 488403 490899 493267 494299 493857
58770 493857 492577 490523 487015 481742 475357 468946 463327 458791 455126 451973 449332 447472 446216 444976
58756 444976 443797 443682 445314 448150 451374 454995 459142 463017 465695 467517 469510 471757 473554 474936
58742 474936 476803 479517 482526 485563 489115 493478 498271 503169 508342 513929 519738 525583 531275 536331
58728 536331 540498 544556 549705 556047 562442 567922 572372 575850 578323 580347 582990 586685 590957 595575
58714 595575 601094 607836 615201 622460 629450 635965 641174 644300 645393 644942 643095 639594 634071 626132
58700 626132 615636 603169 589793 576040 561633 546355 530649 515164 500334 486698 475020
58689 475020 465639 458135 451922 446768 442545 438943 435701 432712 429702 426289 422540 419033 416178 413916
58675D13916j787j247o88nJ262L088M527M955N082N891P202Q387R672J1456J2930
58660D84641J2829J1209R039O357K473k000n139o109o206o840p708p709o736n670
58646D72431n132m930m566l885l249l169l667m132m064l641l284k991k621k424
58632D20676k632k886k775k709l503n161o818p804q177q141p442n413j416M405
58618C60204J0677J5585J8482K0112K0944K0189J7292J3381J0206Q183O541M864
58606E26660L360K015O80k98n37n03q96j488j590j397j740k687l438l546l222
58591E11373k615j670o81L5Q26K221L901N071N643O168O847P458Q016Q506Q376
58576E69475P302O155O018O547O569O073O243P544R087J0101J0832J1730J2818
$$ plain form
58675 413916 412129 410882 410194 410189 411451 414539 419066 424021 429103 434994 442196 450583 460255 471711 484641
58660 484641 497470 508679 517718 524075 526548 524548 519409 513300 507094 500254 492546 484837 478101 472431
58646 472431 467299 462369 457803 453918 450669 447500 443833 439701 435637 431996 428712 425721 423100 420676
58632 420676 418044 415158 412383 409674 406171 401010 394192 386388 378211 370070 362628 357215 355799 360204
58618 360204 370881 386466 404948 425060 446004 466193 483485 496866 507072 515255 521796 526660
58606 526660 530020 532035 532715 532417 531880 531377 530481 528993 527403 526006 524266 521579 518141 514595 511373
58591 511373 508758 507088 506407 506442 507268 509489 513390 518461 524104 530272 537119 544577 552593 561099 569475
58576 569475 576777 582932 588950 595497 602066 608139 614382 621926 631013 641114 651946 663676 676494
58563F76494J4133J5824J7633J8997J9801K0264K0197J9097J6948J4059J0431
58552H63878O131K066p60k574m338o047o748o232n527n475n926o544p482q951
58538H05471j0778j2608j4048j4734j4806j4963j5372j4980j2811r475o473m422
58526F60001k990k060j713j422o09K74L50k52p30r83j441j949k160k543l607m521
58510F33645m110k889k434k971l280k891k620k873l060k842k539k176j536j043
58496E96381j238j548j076l35n04j250j170k38K65K11Q40K350L428L614M079N463
58480F09272O907P832Q814J0086J0930J1194J1626J2104J1278Q679N522K712j96
58467G16760l345n610o251o026n898n810n449m857l776j727P84K567L536M754
$$ plain form
58563 676494 690627 706451 724084 743081 762882 783146 803343 822440 839388 853447 863878
58552 863878 870009 872075 871315 868741 864403 858356 851608 845376 839849 834374 828448 821904 814422 805471
58538 805471 794693 782085 768037 753303 738497 723534 708162 693182 680371 670896 664423 660001
58526 660001 657011 654951 653238 651816 651207 651481 651831 651579 650849 649866 648425 646476 644316 641773 638166 633645
58510 633645 629535 626646 624212 621241 617961 615070 612450 609577 606517 603675 601136 598960 597424 596381
58496 596381 595143 593595 592519 592184 591680 590430 589260 589022 589287 589498 590338 592688 596116 599730 603809 609272
58480 609272 616179 624011 632825 642911 653841 665035 676661 688765 700043 708722 714244 716956 716760
58467 716760 713415 707805 701554 695528 689630 683820 678371 673514 669738 668011 668795 671362 674898 679652
58453F79652O400P434P509P420P288O213M235K541J266q11l659n359m972l959
58439G11198l601l132j670m0O90Q79J193J380J285J599K533L240L521M465O415
58424G29955Q014Q300Q106Q235P967O528M437K281j58k545l623l374l701n601
58410G64821p484p694o975o865p282p272o703n737m035j854n27n18m60N96J623
58395G03634J677J720K808M071M270L891L941L929K944J614J186J499J452R00
58381G39536O97J461L210N527P447Q176Q302R113J0385J0488R149Q096Q362Q980
58367H38929R095R178R286Q539P296P444R237J0412R740Q949R525J0230R572Q238
58353I65670P167N663L399J954K251K742K141J700K654L808L941M282O156Q372
$$ plain form
58453 679652 686052 693486 700995 708415 715703 721916 726151 728692 729958 729147 725488 720129 715157 711198
58439 711198 707597 704465 702795 702755 703445 704324 705517 706897 708182 709781 712314 715554 719075 723540 729955
58424 729955 737969 746269 754375 762610 770577 777105 781542 783823 783665 781120 777497 774123 770422 764821
58410 764821 757337 749643 742668 735803 728521 721249 714546 708809 704774 702920 702393 701875 701415 702011 703634
58395 703634 705311 707031 709839 713910 718180 722071 726012 729941 732885 734499 735685 737184 738636 739536
58381 739536 740233 741694 744904 750431 757878 766054 774356 783469 793854 804342 813491 821587 829949 838929
58367 838929 848024 857202 866488 875027 882323 889767 899004 909416 919156 928105 937630 947860 957432 965670
58353 965670 972837 978500 981899 983853 986104 988846 990987 992687 995341 999149 1003090 1007372 1013528 1021900
58339A021900R342R732J0670J1424J1287J1569J3331J5191J5754J5969J6743J6665
58327A179577J4693J2637J2139J1624R272O531N503N181L630J857J917L144L689
58314A271394M090N828Q021R022R658J1544J3642J3921J3051J3176J4376J5392
58302A403115J6390J8005J9232J9151J8998J9737J9718J7784J6267J7477J9662
58291A605536K0123J9878K1256K3191K3265K2366K2938K4330K4296K3448K4004
58280A854631K5621K6532K7237K9051L0793L0973L1314L3906L7023L8061L8394
58269B203536M0713M3840M5073M5515M7971N1549N3510N4505N6859N9644O0707
58258B763422O1512O4622O8453O9964P0422P2838P6063P7251P7870Q1195Q6088
$$ plain form
58339 1021900 1031242 1040974 1051644 1063068 1074355 1085924 1099255 1114446 1130200 1146169 1162912 1179577
58327 1179577 1194270 1206907 1219046 1230670 1239942 1246473 1251976 1257157 1260787 1262644 1264561 1267705 1271394
58314 1271394 1275484 1281312 1289333 1298355 1308013 1319557 1333199 1347120 1360171 1373347 1387723 1403115
58302 1403115 1419505 1437510 1456742 1475893 1494891 1514628 1534346 1552130 1568397 1585874 1605536
58291 1605536 1625659 1645537 1666793 1689984 1713249 1735615 1758553 1782883 1807179 1830627 1854631
58280 1854631 1880252 1906784 1934021 1963072 1993865 2024838 2056152 2090058 2127081 2165142 2203536
58269 2203536 2244249 2288089 2333162 2378677 2426648 2478197 2531707 2586212 2643071 2702715 2763422
58258 2763422 2824934 2889556 2958009 3027973 3098395 3171233 3247296 3324547 3402417 3483612 3569700
58247C569700Q9492R2626R8293J04612J08293J11494J18341J27141J33529J38721
58237D692242J46892J56912J64845J72154J83027J96010K06994K17996K33863
58228F370935K52759K69472K85682L07121L32909L57991L83665M15046M50705
58219I426285M86068N24348N72405O28555O86862P50455Q27529R17548J015633
58210A5835688J126922J261229J417371J589852J787734K029592K324878K680798
58202C0054064L123209L688202M397456N266759O332777P639867R201616J1007144
58194H0711094J3064241J5403608J8049991K1039630K4462693K8405258L2768494
58187B33905009L7083929M0391719M1198270L7718105K8669812J4364555k838627
$$ plain form
58247 3569700 3659192 3751818 3850111 3954723 4063016 4174510 4292851 4419992 4553521 4692242
58237 4692242 4839134 4996046 5160891 5333045 5516072 5712082 5919076 6137072 6370935
58228 6370935 6623694 6893166 7178848 7485969 7818878 8176869 8560534 8975580 9426285
58219 9426285 9912353 10436701 11009106 11637661 12324523 13074978 13902507 14820055 15835688
58210 15835688 16962610 18223839 19641210 21231062 23018796 25048388 27373266 30054064
58202 30054064 33177273 36865475 41262931 46529690 52862467 60502334 69703950 80711094
58194 80711094 93775335 109178943 127228934 148268564 172731257 201136515 233905009
58187 233905009 270988938 311380657 352578927 390297032 418966844 433331399 430492772
58180D30492772j9388749l2206728l9874508m2632118m1616176l8161206l3469477
58173A83143810k8472688k3757318j9599339j6087582j3215159j0906750r052049
58166F2052925p558030o361392n401208m614143l958985l418271k972368k594057
58158B5174471k268455j994991j767027j568613j392375j241855j114385r98745
58150A2828025q91331p98513p21145o51368n86306n30856m85299m43389m04367
58141G315451l74229l53130l33389l11786k92665k77185k60405k41026k23828
58132D647808k10321j96494j81609j69963j62057j52882j40949j30588j23500
58123C179445j16134j07333j00713r7364r3503q7377q1688p7548p2591o6614o2587
$$ plain form
58180 430492772 411104023 378897295 339022787 296390669 254774493 216613287 183143810
58173 183143810 154671122 130913804 111314465 95226883 82011724 71104974 62052925
58166 62052925 54494895 48133503 42732295 38118152 34159167 30740896 27768528 25174471
58158 25174471 22906016 20911025 19143998 17575385 16183010 14941155 13826770 12828025
58150 12828025 11936694 11138181 10417036 9765668 9179362 8648506 8163207 7719818 7315451
58141 7315451 6941222 6588092 6254703 5942917 5650252 5373067 5112662 4871636 4647808
58132 4647808 4437487 4240993 4059384 3889421 3727364 3574482 3433533 3302945 3179445
58123 3179445 3063311 2955978 2855265 2757901 2664398 2577021 2495333 2417785 2345194 2278580 2215993
58112B215993o0741n7901n3911n2296n3344n2971m9843m7384m7123m6206m3190
58101A651083m0545l9560l8242l5933l4776l5115l4365l1940l0344l0186k9141
58090A270936k6892k6010k6678k5750k2455j9995j9912j9891j8721j8538k0229
58079A025865k1308k0343j9272j9486j9574j8683j8122j8161j7163j5263j4900
58068H23590j6335j6639j4591j2514j1848j0972r023p836q273q504p639p439q636
58055F83341r255q394q063r440j0702j0450r927j0004r293p107n216m817m713
58042E75960m148m406n931o926o505o264p098p435o364n500o016o692o643p106
58028D88926q761j0027r807r246r189q614p243o729p579p747o172m808n174n735
$$ plain form
58112 2215993 2155252 2097351 2043440 1991144 1937800 1884829 1834986 1787602 1740479 1694273 1651083
58101 1651083 1610538 1570978 1532736 1496803 1462027 1426912 1392547 1360607 1330263 1300077 1270936
58090 1270936 1244044 1218034 1191356 1165606 1143151 1123156 1103244 1083353 1064632 1046094 1025865
58079 1025865 1004557 984214 964942 945456 925882 907199 889077 870916 853753 838490 823590
58068 823590 807255 790616 776025 763511 751663 740691 731668 723832 715559 707055 699416 691977 683341
58055 683341 674086 665692 657629 648189 637487 627037 617110 607106 597813 590706 585490 580673 575960
58042 575960 571812 567406 561475 554549 548044 541780 534682 527247 520883 515383 509367 502675 496032 488926
58028 488926 480165 470138 460331 451085 441896 433282 426039 419310 411731 403984 397812 393004 387830 382095
58014C82095m849l571l314l232k307j620k185k725j952j028j430k252j983j184
58000C48463j170j516j063k6Q20J729L070M022L812K991K255J396N02M79J231
57985C66995J199q9r77n39k62j434l007l709m210n286n894n079l980l922m138
57970C25668l363k170j744j794j562j485j997k083q37P75J445J480J588J266J03
57955C15290p36k29N25o9j648k776l083k940k184q55k1k76n57R8R80J321J947
57938C04787L556N001N168N131O325P935Q268P542P098O798N486L207R66j138
57924C76130l548n700o724p107p863q710q755q281q096p829o644m969l763k763
57910B85378j276O7K56o1N22J769K300J993J898K069J557M52r1J55K72L0K21R86
$$ plain form
58014 382095 377246 373675 370361 367129 364822 363202 361017 358292 356340 355312 353882 351630 349647 348463
58000 348463 347293 345777 344714 344688 345508 347237 350307 354329 358141 361132 363387 364783 365285 365764 366995
57985 366995 368194 368105 367128 366589 366327 364893 361886 358177 353967 348681 342787 337708 333728 329806 325668
57970 325668 322305 320135 318391 316597 315035 313550 311553 309470 308633 309408 310853 312333 313921 315187 315290
57955 315290 314554 314325 314850 314781 313133 310357 307274 304334 302150 301295 301274 300998 300441 300539 301519 302840 304787
57938 304787 308343 313344 318512 323643 329968 337903 346171 353713 360811 367609 373095 376302 377268 376130
57924 376130 372582 366882 360158 353051 345188 336478 327723 319442 311346 303517 296873 291904 288141 285378
57910 285378 284102 284169 284425 284364 284886 286655 288955 290948 292846 294915 296472 296924 296833 296988 297260 297290 297511 298497
57892B98497J478J425J496J867J785R46M8m39r30j820k715k958k460j790j811
57877B92619k957m545n293m885m326m286m131l350k791l296m100l977l088k268
57863B39326j217Q49L329M647M428L806L728M212N099O206O867O535N790N628
57849B99233N878N458M035K338R86k9p50j150j529k161k731k923l164l934m810
57834B94747n100m964m916m774m123l375l113k920k095j096q58j036m40Q99J595
57819B58431J009J69J83Q00R40j07k246m748o727p879q635r243r140p889o130
57804A98788m832m007l023j826r47o37p81j303j887j806q42J27L17J74M33P60
57788A78708M81O7N46J833K942L561M173M846N126N055N140N390N363N105N047
$$ plain form
57892 298497 299975 301400 302896 304763 306548 307494 307542 307103 306173 304353 301638 298680 296220 294430 292619
57877 292619 289662 285117 279824 274939 270613 266327 262196 258846 256055 252759 248659 244682 241594 239326
57863 239326 238109 238958 242287 246934 251362 255168 258896 263108 268207 274413 281280 287815 293605 299233
57849 299233 305111 310569 314604 316942 317928 317899 317149 315999 314470 312309 309578 306655 303491 299557 294747
57834 294747 289647 284683 279767 274993 270870 267495 264382 261462 259367 258271 257413 256377 255937 256836 258431
57819 258431 259440 259609 259792 260592 261532 261425 259179 254431 247704 239825 231190 221947 212807 204918 198788
57804 198788 193956 189949 186926 185100 184153 183516 182735 181432 179545 177739 176897 177024 177341 177515 177948 178708
57788 178708 179189 179256 179802 181635 184577 188138 192311 197157 202283 207338 212478 217868 223231 228336 233383
57773B33383N128M927M516M237L906L102J992J026N1j320k779l625l737l464k891
57758B44452k087j515j322p50Q65L081N292P886J1302J4670J6656J7033J6065
57745C31628J3143P740J206m091p279r146j0183j0157r446q956q597p350n058
57732B73454k780j282m46j70n01r34q29m58m54m39L33J338J376O44M17P46L75
57715B70390r10j820j840k078l155m066l952l494l663m282m722m948n101m998
57701B21361m600m197l738k878j908j536j606j274p19j219l057m708m828l813
57687A81280k782k151j884k002k101j406J5J132J686K874N542Q778J1252J3098
57673B13331J5460J8912K3262K8370L4200M0429M6560N1991N5267N3696M4631
$$ plain form
57773 233383 238511 243438 247954 252191 256097 259199 261191 262217 262268 260948 258169 254544 250807 247343 244452
57758 244452 242365 240850 239528 238778 239643 242724 248016 255902 267204 281874 298530 315563 331628
57745 331628 344771 352511 353717 349626 342347 333201 323018 312861 303415 294459 285862 278512 273454
57732 273454 270674 269392 268946 268776 268275 267341 266512 266054 265600 265161 265494 266832 268208 268852 269269 270015 270390
57715 270390 269480 267660 265820 263742 260587 256521 252569 249075 245412 241130 236408 231460 226359 221361
57701 221361 216761 212564 208826 205948 204040 202504 200898 199624 198905 197686 194629 189921 185093 181280
57687 181280 178498 176347 174463 172461 170360 168954 168969 170101 171787 174661 180203 188981 200233 213331
57673 213331 228791 247703 270965 299335 333535 373964 420524 472515 527782 581478 626109
57662F26109K7467M585j9295l8981n1151n5695n4697n0267m3721l6316k9498k4016
57650B54524j9673j6130j3248j0665q064o007n419n946n914m334k041l91K16J62
57636A57070j35k64Q8O02N49j93r13j094r30p48p00j054j921k643k516k041k243
57619A40914k807k380r30j29q71j988k208j859j693j446p01m2j18m43k38K65L92
57602A23718J56j41p03j663k353k202j837k281l374l996l584k710k244k532l280
57587I0974l829l724l192k762k440j845j148j032j527j806j470j046r29p59l79
57572F3086l98j133j895j969j573j244j012p41n66m69j29L56M08nj85L9J0m39
57554E2141n16L7K57l95r63n38K58M37K26L32N67M48L71R08J623J801J823K481
$$ plain form
57662 626109 653576 658161 638866 599885 548734 493039 438342 388075 344354 308038 278540 254524
57650 254524 234851 218721 205473 194808 186744 180737 175318 169372 163458 159124 157083 156692 156908 157070
57636 157070 156935 156671 156759 157361 157910 157717 156804 155710 154780 154032 153332 152278 150357 147714 145198 143157 140914
57619 140914 138107 135727 134797 134668 133797 131809 129601 127742 126049 124603 123902 123860 123742 123299 123061 123326 123718
57602 123718 123874 123733 123030 121367 119014 116812 114975 112694 109320 105324 101740 99030 96786 94254 90974
57587 90974 87145 83421 80229 77467 75027 73182 72034 71002 69475 67669 66199 65153 64224 63465 63086
57572 63086 62688 61555 59660 57691 56118 54874 53862 53121 52555 52086 51957 52313 52721 52716 52531 52570 52580 52141
57554 52141 51625 51662 51919 51524 50561 50023 50281 50718 50944 51276 51843 52291 52662 53570 55193 56994 58817 61298
57536F1298L435L606K774J720R77M87K46L49N07L75J68L31Q63J562K469L484M028
57519H8679L855L659M143M933N131M543L586K480J263J74o84j615k659l209k942
57504A11337k444k296k209j876j813k422l035k960k854l744n285o160n919n224
57490F3096m566l870l202k815k509j877j095p58j057j761k661l377l140j663J45
57475B8890J144J297J312J350J075O24N42Q45R93O68P9m22m95M8P78Q55J11o41
57457C9053q73r98j248r29K72J286J086K54m0J74K07J43L28J69r30k050j821o05
57439C3478L6k90n89m09l22n20n94p05j457k517k778k027j131m97J75O96L95m58
57421B0486p85m50m19r02r82m11k16q17j147m39M29L92j25k7O78J021M63n90j407
$$ plain form
57536 61298 64733 68339 71113 72833 73810 74297 74543 74892 75399 75774 75942 76273 77136 78698 81167 84651 88679
57519 88679 92534 96193 100336 105269 110400 114943 118529 121009 122272 122446 121762 120147 117488 114279 111337
57504 111337 108893 106597 104388 102512 100699 98277 95242 92282 89428 85684 80399 74239 68320 63096
57490 63096 58530 54660 51458 48643 46134 44257 43162 42404 41347 39586 36925 33548 30408 28745 28890
57475 28890 30034 31331 32643 33993 35068 35692 36234 37079 38072 38740 38819 38397 37902 37950 38728 39583 39694 39053
57457 39053 38180 37182 35934 35005 35277 36563 37649 37903 37863 38037 38244 38387 38715 38884 37954 35904 34083 33478
57439 33478 33514 33224 32635 32226 31904 31384 30790 30085 28628 26111 23333 21306 20175 19678 19853 20549 20944 20486
57421 20486 19701 19251 18832 17930 16948 16537 16321 15504 14357 13918 14347 14739 14614 14587 15265 16286 16749 16159 14752
57402A4752j568j152o52m00j82K88O67N11J91M38J039J056L52k06j68n1k27l54
57384A4334k22j65l09k97r5j20k85K2P44R55L17l17k42Q4k8m56p63r63j182j185
57364I827p79j86M28J104J587J348N27K4K55N12J06o51j051r79p11l34R5K96J86
57345A1604R2K62M82M91L11N3j24J31R09J371M91j410k732k509j406n19j26q8
57327G283m99j286j889A686E6a234q50m50n87j212j522j135o99p83j029r83r90
57310a1474j446j889j688j106p93p61o20m91q35j558k076k079j683j068m26j49
57294c0142m86j164j662j772j575j137n24R4N84R13R40O19M38J109K511L555L536
57277b4163L059L171L996M761d257C86M401M352M274L817K962K207K004K069J660
$$ plain form
57402 14752 13184 12032 11380 10980 10798 11086 11753 12264 12455 12893 13932 14988 15340 15134 14966 14915 14688 14334
57384 14334 14112 13947 13638 13341 13246 13126 12841 12863 13607 14562 14879 14562 14320 14404 14376 13920 13157 12194 11012 9827
57364 9827 9048 8862 9290 10394 11981 13329 13856 13880 14135 14647 14753 14102 13051 12072 11361 11027 11122 11418 11604
57345 11604 11696 11958 12440 12931 13242 13295 13171 13302 14211 15582 16073 14663 11931 9422 8016 7497 7371 7283
57327 7283 6784 5498 3609 1686 56 -1234 -2084 -2534 -3121 -4333 -5855 -6990 -7689 -8472 -9501 -10484 -11474
57310 -11474 -12920 -14809 -16497 -17603 -18396 -19157 -19777 -20268 -21103 -22661 -24737 -26816 -28499 -29567 -29993 -30142
57294 -30142 -30628 -31792 -33454 -35226 -36801 -37938 -38462 -38368 -37784 -36871 -35931 -35312 -34874 -33765 -31254 -27699 -24163
57277 -24163 -21104 -17933 -13937 -9176 -4257 386 4787 9139 13413 17230 20192 22399 24403 26472 28132
57262B8132N96m56q45o35l64m81j119k001k512k296j740j447j418j296j176j445
57246I497j938k128k008A462c97j305o73p55j354j473j008r41j567j950j605j315
57230a4343j596j762j300q63r90j040m41J20j16o16n45k65n16r64q07k46j9J8
57212b6291M69J023P94j84r84j263j478j699j370l52O99J237J349J194O79j41
57196b6318q49j079q12k11N30J209J742K183K453K309J774J259R77O68J25m82
57180a4522j027j624k098j915j089m29l84l29M14J464K052K148K202K212J892
57165a1033J380J031Q14M81po13j357j880j440j4J263J467J052R66J262J482J846
57148c300c06D538O541P457P538O944O070N580N791O227O356O420O980Q016R060
$$ plain form
57262 28132 28728 28272 27427 26792 26428 25947 24828 22827 20315 18019 16279 14832 13414 12118 10942 9497
57246 9497 7559 5431 3423 1462 -397 -1702 -2375 -3130 -4484 -5957 -6965 -7906 -9473 -11423 -13028 -14343
57230 -14343 -15939 -17701 -19001 -19864 -20854 -21894 -22335 -22215 -22331 -22947 -23492 -23757 -24273 -25237 -26044 -26290 -26309 -26291
57212 -26291 -25822 -24799 -24005 -24189 -25173 -26436 -27914 -29613 -30983 -31335 -30636 -29399 -28050 -26856 -26177 -26318
57196 -26318 -27167 -28246 -29058 -29269 -28739 -27530 -25788 -23605 -21152 -18843 -17069 -15810 -14833 -14165 -14040 -14522
57180 -14522 -15549 -17173 -19271 -21186 -22275 -22704 -23088 -23417 -23003 -21539 -19487 -17339 -15137 -12925 -11033
57165 -11033 -9653 -8622 -7808 -7327 -7334 -7947 -9304 -11184 -12624 -12638 -11375 -9908 -8856 -7890 -6628 -5146 -3300
57148 -3300 -306 4538 11079 18536 26074 33018 39088 44668 50459 56686 63042 69462 76442 84458 93518
57133I3518R834J0291J0473J0696J1340J2081J2110J1529J1535J2642J3835J4367
57121B34251J5183J7421K0618K3715K6969L1294L6303M0604M3647M6012M8156
57110E84173N0233N2769N6323O0683O5589P1919Q1060R3599J09724J30540J57771
57099A514383J92524K35387K87017L47260M14134M84647N55839O23828O83147
57090E338166P28851P58869P73294P73026P60567P39690P11444O73149O26006
57081A1883062N81920N56417N53602N62828N69921N63507N26413M29940K49412
57072A6477022j0996l12569o02331q38459j001017j088697j111704j085648j026304
57063I399297r46544q56324p63685o74696n93090n20718m58084m04466l58376
$$ plain form
57133 93518 103352 113643 124116 134812 146152 158233 170343 181872 193407 206049 219884 234251
57121 234251 249434 266855 287473 311188 338157 369451 405754 446358 490005 536017 584173
57110 584173 634406 687175 743498 804181 869770 941689 1022749 1116348 1226072 1356612 1514383
57099 1514383 1706907 1942294 2229311 2576571 2990705 3475352 4031191 4655019 5338166
57090 5338166 6067017 6825886 7599180 8372206 9132773 9872463 10583907 11257056 11883062
57081 11883062 12464982 13021399 13575001 14137829 14707750 15271257 15797670 16227610 16477022
57072 16477022 16466026 16153457 15551126 14712667 13711650 12622953 11511249 10425601 9399297
57063 9399297 8452753 7596429 6832744 6158048 5564958 5044240 4586156 4181690 3823314
57054C823314l18457k83610k52444k23550j96677j72839j52767j35736j20398
57045A966836j06206r3436q2133p1822o2224n3624m6202l9407l2489k5459j8894
57034A334940j2769o023K303J1993K1760K9501L1801K4495N893k0148m5641o3753
57022A314352p2489p3673p0004o3617n6115m8506m1226l4739k9709k6176k3282
57011G74816k0376j7818j6144j4979j3595j2093j1136j0838j0583r951r130q478
56999F19695q085p718o918n281l065j294q79j647k566k803k326j565p97J67J715
56984E76633L831N762O537N827L967J132k950q212j3527j7229j8265j6878j4370
56971E12258j2203j1001j0216q947o999m857k872j024O92K300M259P043J0192
$$ plain form
57054 3823314 3504857 3221247 2968803 2745253 2548576 2375737 2222970 2087234 1966836
57045 1966836 1860630 1767194 1685061 1613239 1551015 1497391 1451189 1411782 1379293 1353834 1334940
57034 1334940 1322171 1316148 1318451 1330444 1352204 1381705 1413506 1438001 1443894 1423746 1378105 1314352
57022 1314352 1241863 1168190 1098186 1034569 978454 929948 888722 853983 824274 798098 774816
57011 774816 754440 736622 720478 705499 691904 679811 668675 657837 647254 637303 628173 619695
56999 619695 611610 603892 596974 591693 588628 587334 586455 584808 582242 579439 577113 575548 574751 574918 576633
56984 576633 580464 586226 592763 598590 602557 603689 600739 592527 579000 561771 543506 526628 512258
56971 512258 500055 489054 478838 469891 462892 458035 455163 454139 454831 457131 461390 468433 478625
56958D78625J2594J3892J4757J5313J4153R635J864p144j4886j9722k1420k0979
56946D76682j9729j8101j5524j1694p497m212k153n66J300L479N628P751J0334
56933D25698J3766J7672K1085K3223K3750K2001J6756P600l824j4706k3129k8595
56921E01297l1059l0657k8312k5306k2057j8311j4601j2217j1369j0730r358p929
56909B79391p331p143o457n334m504m215m154m011l506k431j214p77j258j609
56895B25447j008J41J294K888N441Q364J0752J2832J5509J8759K1506K2840K2419
56882C67184J9920J5087Q514J721l771p189q569q460p408n467k472J153M417O865
56868C81525R088J1838J5270J9347K4118K9236L3981L8336M3072M8001N0915M9024
$$ plain form
56958 478625 491219 505111 519868 535181 549334 558969 560833 553689 538803 519081 497661 476682
56946 476682 456953 438852 423328 411634 404137 399925 397772 397206 398506 401985 407613 415364 425698
56933 425698 439464 457136 478221 501444 525194 547195 563951 571551 567727 553021 529892 501297
56921 501297 470238 439581 411269 385963 363906 345595 330994 318777 307408 296678 287320 279391
56909 279391 272060 264917 258460 253126 248622 244407 240253 236242 232736 230305 229091 228314 227056 225447
56895 225447 224439 224580 225874 228762 234203 242567 253319 266151 281660 300419 321925 344765 367184
56882 367184 387104 402191 410705 412426 408655 401466 392897 384437 377029 371562 369090 370243 374660 381525
56868 381525 390613 402451 417721 437068 461186 490422 524403 562739 605811 653812 704727 753751
56856G53751M0904K6790Q255j1421k7873l8190m2570m2777l9878l4454k7758k0886
56844E43893j3515n011L736J1278J7983K5647L4811M4201N2908O1405O9989P7472
56832I24797Q1669P9895O9048M7176J6239j7554m7104o8002p9235q1922p8201
56821H46806p0454o0532m9593l8579k8227j8562r181k11P750J4746K1711K9363
56809F45037L7514M5635N3105N8428N8943N2048L6809J4643j0834l4709n2749
56798I03870o3298o7189o5907o0522n2268m3010l4422k7153k1013j5436r687l357
56786D40608K984Q268J2314J6154K0645K5348K8955L0107K7579K0522R342l994
56774F38832j7030k7997l5942m0412m1479l9774l6133l1448k6758k2808j9387
$$ plain form
56856 753751 794655 821445 829700 818279 790406 752216 709646 666869 626991 592537 564779 543893
56844 543893 530378 525367 529103 540381 558364 584011 618822 663023 715931 777336 847325 924797
56832 924797 1006466 1086361 1155409 1202585 1218824 1201270 1154166 1086164 1006929 925007 846806
56821 846806 776352 715820 666227 627648 599421 580859 571678 571467 579217 593963 615674 645037
56809 645037 682551 728186 781291 839719 898662 950710 987519 1002162 991328 956619 903870
56798 903870 840572 773383 707476 646954 594686 551676 517254 490101 469088 453652 443965 440608
56786 440608 443592 451860 464174 480328 500973 526321 555276 585383 612962 633484 642826 638832
56774 638832 621802 593805 557863 517451 475972 436198 400065 368617 341859 319051 299664
56763B99664j5822j2321r996r165q630p279n663n049n468n730n110m060l224k619
56749A99528k046j684j863k529l181l250k512j292k86n5n90j424k102k424k338
56734A71952j805q60K21J007J199R04N25L81M15L39n2o36j011p60J50J212J810
56717A74991J800J495J131O59J10k60l31k86k66k40k85n16o38j63P42J261J089
56700A80293Q18Q40P03R9m03l65l60q84j239o43K39J98m70l65P98J777J759J394
56682A84189J503J896J915J285J90p79p47N89K138K416J417M12l4o13j527j703
56666A92547m44J246J918J466Q13M92L03k1m81q70p74M9J004J018l2r52p68l4
56648A96480O1o53j283j179n50jO7l61r05j007m18N86J574K292K667K760K798
$$ plain form
56763 299664 283842 271521 261525 252360 243730 236451 230788 225739 220271 214541 209431 205371 202147 199528
56749 199528 197482 195798 193935 191406 188225 184975 182463 181171 180885 180830 180240 178816 176714 174290 171952
56734 171952 170147 169287 169508 170515 171714 172618 173143 173524 173939 174278 174226 173590 172579 171819 171969 173181 174991
56717 174991 176791 178286 179417 180076 180186 179926 179595 179309 179043 178803 178518 178002 177364 177201 177943 179204 180293
56700 180293 181111 181951 182654 182753 182350 181985 181625 180741 179502 178859 179098 179296 178826 178461 179259 181036 182795 184189
56682 184189 185692 187588 189503 190788 190978 190199 189452 190041 192179 194595 196012 196424 196390 195777 194250 192547
56666 192547 192103 193349 195267 196733 197546 198038 198341 198320 197839 196969 196195 196244 197248 198266 198234 197282 196514 196480
56648 196480 196541 195888 194605 193426 192876 192875 192942 192581 191676 190669 190251 190837 192411 194703 197370 200130 202928
56631B02928K898K696J713J92q95q64J1R18J208O99k31p92n36J0j0n75q93o50
56613B07827l63l60l31j50k61q59j385j325q89n12k78j76l51p09p98m85k07k77
56595A98111m13k72O3L85N89M46k49j073j205n23K12M83N61O60M57j72p19q48
56577A96493q46q84n86J61P33O78L17O5j00J4R78K605L605L226K420K466L269
56560B14614L930M260M568M566L647K015N04m66r68r31l79N2k38q28q34k38J86
56543B33460J26MP5M8l14q94j520j975j889j122j85K86L47M67O72N72J33k95n72
56524B27424q54j109j129r25o19j11O71J299J234O00ol66p68j317j683j571j030
56507B19740k65M99J007J169J200J270J199P27j9p03j167j330j028l14L60N88
$$ plain form
56631 202928 205826 208522 210235 210427 209532 208668 208679 209597 210805 211504 211273 210481 209945 209955 209945 209370 208477 207827
56613 207827 207464 207104 206773 206623 206362 205503 204118 202793 201904 201392 201114 200938 200587 199878 199080 198595 198388 198111
56595 198111 197698 197426 197489 197874 198463 198909 198660 197587 196382 195859 196071 196554 197115 197775 198232 198060 197341 196493
56577 196493 195647 194763 194177 194338 195071 195749 196066 196131 196031 196045 197023 199628 203233 206459 208879 211345 214614
56560 214614 218544 222804 227372 231938 235585 237600 238104 237638 236670 235739 235360 235412 235174 234346 233512 233274 233460
56543 233460 233586 233590 233665 233713 233399 232505 230985 229010 227121 225999 225814 226100 226447 226914 227586 228158 228291 227996 227424
56524 227424 226570 225461 224332 223407 222788 222677 223348 224647 225881 226481 226475 226109 225341 224024 222341 220770 219740
56507 219740 219475 219974 220981 222150 223350 224620 225819 226546 226527 225824 224657 223327 222299 221985 222345 222933
56491B22933M55K11j35m96m63R0N37K20n86j051r12o27n54o07o75q08r43q38l92
56472B15359K71R69J477J512J015M01K08N41R12P53J8o27m03N74J240R23L70O50
56454B26163J364J119k56j310j144o10o90r46n68N4J3o07r88r16p73o03k09J80
56436B19273J49j51k52j19P0M87J281J947J814R42p5q43j172q15P8P19N56M6j09
56417B23826L5M3n6l3p2l08l39O0K43m01j333j578j057m33o5J2m01j258j847j683
56397B13355j339j561k131k492k809l335l560l165l122m429o312p219p018o744
56383A58119o525n461l302o39K550O839J1745J5632J7503J7612J6309J3701J0586
56370B54669Q271P087O229N252M491L914K876J372K98J36L93O56J084J588J597
$$ plain form
56491 222933 223388 223599 223464 222968 222505 222595 223132 223352 222766 221715 220803 220176 219622 219015 218340 217532 216589 215751 215359
56472 215359 215630 216599 218076 219588 220603 221004 221212 221753 222665 223418 223436 222809 222406 222980 224220 225143 225513 226163
56454 226163 227527 228646 228390 227080 225936 225326 224636 223690 223122 223176 223189 222582 221594 220678 219905 219302 219093 219273
56436 219273 219422 219271 219019 218900 218970 219457 220738 222685 224499 225441 225366 224523 223351 222536 222614 223333 223889 223935 223826
56417 223826 223861 223904 223848 223815 223743 223435 223096 223156 223399 222998 221665 220087 219030 218597 218532 218544 218143 216885 215038 213355
56397 213355 212016 210455 208324 205832 203023 199688 196128 192963 189841 185412 179100 171881 164863 158119
56383 158119 151594 146133 142831 142192 144742 151581 163326 178958 196461 214073 230382 244083 254669
56370 254669 262940 270027 276256 281508 285999 289913 292789 294161 294459 294595 294988 295644 296728 298316 299913
56355B99913R75K24l43p48o77J82J201J328O52J44n0o29j409j213Q9J042P24K
56337C01407%N90J163J669K151K235J858J608J722J681J272J105J462J708J469
56322C23100J434K137K920K886K148J393Q33L60J58M14Q10Q49M41j49n12j76R39
56305C39985K087K404K151K468L748N137N809N807N391M517L362K515K216K149
56291C89746K228K780L710M333M327M123M094M199M550N467O695P453P455P110
56277D58270O659O059N749O456Q064R711J1032J2314J3431J3895J4066J4936J6554
56264E97196J7970J8932K0201K1962K3480K4768K7047L0981L5785M0732M6168
56253I05222N2472N9299O6411P3996Q1691Q8639R4944J01655J08729J14533J17964
$$ plain form
56355 299913 300888 301112 300769 300021 299344 299526 300727 302055 302707 302851 302801 302172 300763 299550 299639 300681 301405 301407
56337 301407 301407 301997 303160 304829 306980 309215 311073 312681 314403 316084 317356 318461 319923 321631 323100
56322 323100 324534 326671 329591 332477 334625 336018 336851 337211 337369 337783 338593 339442 339883 339734 339222 339046 339985
56305 339985 342072 344476 346627 349095 352843 357980 363789 369596 374987 379504 382866 385381 387597 389746
56291 389746 391974 394754 398464 402797 407124 411247 415341 419540 424090 429557 436252 443705 451160 458270
56277 458270 464929 470988 476737 483193 491257 500968 512000 524314 537745 551640 565706 580642 597196
56264 597196 615166 634098 654299 676261 699741 724509 751556 782537 818322 859054 905222
56253 905222 957694 1016993 1083404 1157400 1239091 1327730 1422674 1524329 1633058 1747591 1865555
56242A865555J19565J19849J18138J13753J06804R6998Q3275O5665M5976K5725
56232B761303M900j6311l6283n3691o8956q2583r3558j00802j05053j07740j09043
56221A992183j08328j05639j01508r6151q9937q3751p8039p2386o6715o1687n7259
56210A070783n2323m6716m1906l8671l5748l2070k8567k6288k4345k1513j8420
56199G04216j6358j5139j3831j2469j1379r981p982o560o623o999o156m630l850
56186E82259l691l085k163j740j478n49N81Q96O98R15J224P54p4k19N0j92n53
56169E73633O8J472K554L203M021M722M679M532N288O379O575O372P339R409J0994
56154F51240J1656J2554J4150J5516J6226J7225J9372K2583K6659L1701L7564
$$ plain form
56242 1865555 1985120 2104969 2223107 2336860 2443664 2540662 2623937 2689602 2735578 2761303
56232 2761303 2766203 2749892 2713609 2659918 2590962 2508379 2414821 2314019 2208966 2101226 1992183
56221 1992183 1883855 1778216 1676708 1580557 1490620 1406869 1328830 1256444 1189729 1128042 1070783
56210 1070783 1018460 971744 929838 891167 855419 823349 794782 768494 744149 722636 704216
56199 704216 687858 672719 658888 646419 635040 625059 617077 610517 603894 596895 590739 586109 582259
56186 582259 578568 575483 573320 571580 570102 569553 570134 571030 571728 572643 573867 574621 574547 574328 574378 574186 573633
56169 573633 573701 575173 577727 580930 584951 589673 594352 598884 604172 610551 617126 623498 630837 640246 651240
56154 651240 662896 675450 689600 705116 721342 738567 757939 780522 807181 838882 876446
56143H76446M4055N1623O0661P0296P8951Q5887R0979R3338R1464Q4775P4133
56132A702608O1301M8767L9261L4061L2103L1445L0651K8044K1488J0852n88r211
56120B030782j4636j8660k2164k5510l0660l9771n1936o3906p3725q1277q5697
56109A522840q5171p9694p1566o2710n3436m4043l5625k8753k3105j8642j5547
56098A004548j3070j0023o632m208l055k165r95Q4R48J898K751L151L564M586
56084I81382N741O296O655P522Q441Q694Q798R423R839R326R006J0169J1790J2034
56070A105116J1295J1389J2551J3629J4430J5411J5890J5119J4336J5162J6792
56059A261120J7323J6984J7259J7851J7443J6544J6533J6764J5856J4853J5692
$$ plain form
56143 876446 920501 972124 1032785 1103081 1182032 1267919 1358898 1452236 1543700 1628475 1702608
56132 1702608 1763909 1812676 1851937 1885998 1918101 1949546 1980197 2008241 2029729 2040581 2039993 2030782
56120 2030782 2016146 1997486 1975322 1949812 1919152 1879381 1827445 1763539 1689814 1608537 1522840
56109 1522840 1437669 1357975 1286409 1223699 1170263 1126220 1090595 1061842 1038737 1020095 1004548
56098 1004548 991478 981455 974823 970615 967560 965395 964400 964484 965432 967330 970081 973232 976796 981382
56084 981382 987123 993419 1000074 1007596 1016037 1024731 1033529 1042952 1052791 1062117 1071123 1081292 1093082 1105116
56070 1105116 1116411 1127800 1140351 1153980 1168410 1183821 1199711 1214830 1229166 1244328 1261120
56059 1261120 1278443 1295427 1312686 1330537 1347980 1364524 1381057 1397821 1413677 1428530 1444222
56048A444222J7502J7995J7751J9132K1623K2408K1314K1026K2360K3441K3754
56037A672528K4951K7223K8784K9414L0821L3082L4432L4911L6491L9254M1156
56026B033047M1833M2882M4228M4166M3195M3775M6024M7745M8858N1572N5863
56015B543188N9276O1471O4628O9030P2725P5772Q0109Q5096Q8161R0075R4368
56004C383899J01189J07127J11460J16933J23944J29829J34516J40782J48241
55995D497920J53450J56811J62750J72128J81312J89825K01648K17498K33357
55986F166699K48329K66386K88528L11034L33441L60129L91951M24702M58125
55977I249324M97566N44375N94075O46654P08851P83342Q66219R58355J068309
$$ plain form
56048 1444222 1461724 1479719 1497470 1516602 1538225 1560633 1581947 1602973 1625333 1648774 1672528
56037 1672528 1697479 1724702 1753486 1782900 1813721 1846803 1881235 1916146 1952637 1991891 2033047
56026 2033047 2074880 2117762 2161990 2206156 2249351 2293126 2339150 2386895 2435753 2487325 2543188
56015 2543188 2602464 2663935 2728563 2797593 2870318 2946090 3026199 3111295 3199456 3289531 3383899
56004 3383899 3485088 3592215 3703675 3820608 3944552 4074381 4208897 4349679 4497920
55995 4497920 4651370 4808181 4970931 5143059 5324371 5514196 5715844 5933342 6166699
55986 6166699 6415028 6681414 6969942 7280976 7614417 7974546 8366497 8791199 9249324
55977 9249324 9746890 10291265 10885340 11531994 12240845 13024187 13890406 14848761 15917070
55968A5917070J200500J352457J527993J741020K002547K317730K700725L178133
55960C1938175L773093M502205N392774O482325P791417R316119J1056919J3035535
55952I3288562J5278622J7817752K0718010K4053464K7777540L1556259L4648674
55945B65138883L5869087L3747090K7081657J5793012J452766j3142592k5212192
55938C40727711l3131751l6715854l6737292l4306155l0499583k6198311k2002451
55931A21136314j8229809j5001818j2334275j0177683q443753p046644n924711
55924D3977621n025541m294299l687945l184007k765505k410635k103672j841332
55916A8664685j620116j428847j259567j113974r92560q87739p93425p11463o43110
$$ plain form
55968 15917070 17117570 18470027 19998020 21739040 23741587 26059317 28760042 31938175
55960 31938175 35711268 40213473 45606247 52088572 59879989 69196108 80253027 93288562
55952 93288562 108567184 126384936 147102946 171156410 198933950 230490209 265138883
55945 265138883 301007970 334755060 361836717 377629729 379082495 365939903 340727711
55938 340727711 307595960 270880106 234142814 199836659 169337076 143138765 121136314
55931 121136314 102906505 87904687 75570412 65392729 56948976 49902332 43977621
55924 43977621 38952080 34657781 30969836 27785829 25020324 22609689 20506017 18664685
55916 18664685 17044569 15615722 14356155 13242181 12249621 11361882 10568457 9856994 9213884
55907I213884n83215n28060m80386m41642m07204l73798l44083l19651k96784
55898E439061k73257k52233k35504k19655k02761j88081j77279j66483j52973
55889C570835j39684j29257j19666j09562j02062r9195r7962r5695r4111r4352
55879B489289r3235q8385q2277p7465p2463o6077o1026n9311n8285n5392n2629
55868A722744n2320n2360m9854m5955m3049m0360l6391l2829l1950l2631l2544
55857A272501l2073l2621l3250l2293l0339k8705k6908k4373k2588k2807k3588
55846I62956k3195k2422k2591k2850k1984k0833k0429j9799j8035j6526j6579
55835G37713j6811j5458j3389j2285j1694j0484r400r554r907q923p362o884p227
$$ plain form
55907 9213884 8630669 8102609 7622223 7180581 6773377 6399579 6055496 5735845 5439061
55898 5439061 5165804 4913571 4678067 4458412 4255651 4067570 3890291 3723808 3570835
55889 3570835 3431151 3301894 3182228 3072666 2970604 2871409 2773447 2677752 2583641 2489289
55879 2489289 2396054 2307669 2225392 2147927 2075464 2009387 1948361 1889050 1830765 1775373 1722744
55868 1722744 1670424 1618064 1568210 1522255 1479206 1438846 1402455 1369626 1337676 1305045 1272501
55857 1272501 1240428 1207807 1174557 1142264 1111925 1083220 1056312 1031939 1009351 986544 962956
55846 962956 939761 917339 894748 871898 849914 829081 808652 788853 770818 754292 737713
55835 737713 720902 705444 692055 679770 668076 657592 648192 638638 628731 619808 612446 605562 598335
55822E98335p125o848p467q680r513j0175j1138j1615j0853r823r637r491q178
55809D77792o389n515n239m366k982j811m64J663L746M733N288O575P989Q054
55795D89074O849N590M415K566K69j369k150k942m149n275n808n646n083n055
55781D71286o584r188j0811j0223q362o358l613R16O702J2306J6930J9824J9257
55768D92082J3768M111p150j7359k4365k6761k4949k1212j7576j4362j1440r461
55756C35326q625p680n632l437k528k753l118l483m045m252l769l499m070m310
55742B74125k897o05P70R96J125J271M64j607m134o258p380o940n056l024k138
55727B38712k473l490m944o272o334m970l667l366k819o92J900K947K679L109
$$ plain form
55822 598335 591210 584362 576895 568215 558702 548527 537389 525774 514921 505098 495461 485970 477792
55809 477792 471403 465888 460649 456283 453301 451490 451026 452689 456435 461168 466456 473031 481020 489074
55795 489074 495923 501513 505928 508494 508763 507394 505244 502302 498153 492878 487070 481424 476341 471286
55781 471286 464702 455514 444703 434480 426118 419760 416147 417063 423765 436071 453001 472825 492082
55768 492082 505850 509961 502811 485452 461087 434326 409377 388165 370589 356227 344787 335326
55756 335326 326701 319021 313389 309952 307424 304671 301553 298070 294025 289773 286004 282505 278435 274125
55742 274125 271228 270623 271393 272389 273514 274785 275249 273642 269508 263250 255870 248930 243874 240850 238712
55727 238712 236239 232749 227805 221533 215199 210229 206562 203196 200377 199685 201585 204532 207211 210320
55713B10320M949O914P850P764O872N172K997Q00j439l652n036n090m684m907
55699B28830n525n803o071o971p860p618o513n701n291m508l368k574k035j058
55685A57934J34O26M63O57J618K736L483L795L563K838K228K071J691N50n24n31
55669A83332m2k91j085j289r08r64j547j661r58r7N63J176J500J162P33J124K047
55652A82795K479K435K735L262L122K414K205K572K379J167k30j251k274l438
55638B00372m273m811n778p245q253q162p285o035m563l382l102l327k983j905
55624A29268r97p14n60k73k18l99k55J87J34p18j741k404k669k328j098L95Q99
55607A16509Q3j198k197k790k725j750o05n48j538k191j767r46l63J97P69P41
$$ plain form
55713 210320 215269 222183 230033 237797 244669 249841 252838 253638 252199 248547 243511 238421 233737 228830
55699 228830 223305 217502 211431 204460 196600 188982 182469 176768 171477 166969 163601 161027 158992 157934
55685 157934 158068 158694 159157 159814 161432 164168 167651 171446 175009 177847 180075 182146 183837 184387 183863 183332
55669 183332 183290 182999 181914 180625 179717 178753 177206 175545 174587 174490 175053 176229 177729 178891 179624 180748 182795
55652 182795 185274 187709 190444 193706 196828 199242 201447 204019 206398 207565 207335 206084 203810 200372
55638 200372 196099 191288 185510 178265 170012 161850 154565 148530 143967 140585 137483 134156 131173 129268
55624 129268 128271 127557 126997 126724 126506 126107 125852 126039 126173 125455 123714 121310 118641 116313 115215 115610 116509
55607 116509 116592 115394 113197 110407 107682 105932 105327 104779 103241 101050 99283 98337 97974 98171 98940 99681
55591I9681N2m25k78j39l54k39O06J409J434J082J034J166J104J039J315J788
55575A10275K276K992M050N102N848O387O668O300N231L971K816J522j0j397k397
55560A59634l219l981m510m805n020n013m614m305m679n277n011l826k812k512
55546A00050k310j681r76n74l87m31q56j157n24Q39J830K144K511L031K733J272
55530A05514l59j355j979k373k017j038n56r10r82k18K80k43o16L87J982K770
55514I8287L075M122N781O976P752R108J0942J1872J1123R232O739L455n82m443
55500A83439p106q325q514q138p438o465n370m565m344m292l693k644k061k241
55486A08243k318j654q70q36j368j752j814j742j429q85o77j110j482j048k57
$$ plain form
55591 99681 99733 99308 99030 98891 98537 98298 98904 100313 101747 102829 103863 105029 106133 107172 108487 110275
55575 110275 112551 115543 119593 124695 130543 136930 143598 149898 155129 159100 161916 163438 163428 162031 159634
55560 159634 156415 152434 147924 143119 138099 133086 128472 124167 119488 114211 109200 105374 102562 100050
55546 100050 97740 96059 95083 94509 94122 93691 92835 91678 91154 91993 93823 95967 98478 101509 104242 105514
55530 105514 105155 103800 101821 99448 97431 96393 95837 94927 93945 93727 94007 93764 93148 93535 95517 98287
55514 98287 101362 105484 111265 118241 125993 135101 146043 157915 169038 178270 185009 188464 187882 183439
55500 183439 176333 168008 159494 151356 143918 137453 132083 127518 123174 118882 115189 112545 110484 108243
55486 108243 105925 104271 103401 102565 101197 99445 97631 95889 94460 93575 92898 91788 90306 89258 89001
55471H9001q3n51q40n83j41J61L35L95L45L15K63r9o28n93K17R22P80K86K47M26
55451I0175J41l95m83k60m26r28j054p03m36m36l72k22k27j11O22J562J696Q69
55433H9012M0j16Q2K48O17J408K153K178J339J14o99m19Q81K226K697K554K801
55416A07116L724M584M715M214L419K376J110j62j350k518l515l956l799l424
55402A12534l120k885k779k988l340l307k650j719r13k61K80N60M28K1l97o54
55386H8810p21o82o83p03m93J9L63lr21j608j574j059n57k48k1K37N23P42P15
55367H2136L45k55q17j076q62k16M48O42L12q7k30k07j12J46L15k57j532k226
55349G6467j227P45J831J293J96k41j4K72M34N79N08n2q22j170q78l17J45N39
$$ plain form
55471 89001 88918 88367 87527 86944 86803 86964 87299 87694 88039 88354 88617 88518 87890 87297 87514 88436 89216 89502 89749 90175
55451 90175 90316 89921 89438 89178 88752 87824 86770 86067 85631 85195 84823 84601 84374 84263 84885 86447 88143 89012
55433 89012 89052 88936 89018 89266 89883 91291 93444 95622 96961 97075 96376 95957 96838 99064 101761 104315 107116
55416 107116 110840 115424 120139 124353 127772 130148 131258 131096 129746 127228 123713 119757 115958 112534
55402 112534 109414 106529 103750 100762 97422 94115 91465 89746 88833 88572 88852 89412 89840 89861 89464 88810
55386 88810 88089 87407 86724 86021 85528 85547 85910 85907 84986 83378 81804 80745 80188 79940 79919 80156 80679 81421 82136
55367 82136 82481 82226 81409 80333 79471 79255 79703 80345 80657 80570 80340 80133 80021 80167 80482 80225 78693 76467
55349 76467 75240 75985 77816 79109 79305 79064 79050 79322 79756 80335 80843 80791 79969 78799 77921 77604 77749 78288
55331G8288R93J309J146O06L36Q17J670J932J091l95j623k052j738j043l27K01
55315H1211N09O00L97n0l96m17m36q56j297r20K50J070P07l13r97j202j372j486
55297G5002j072q1R68J668J978J885J348O19J76K49N91P44L65m77j265j425r65
55280H0308m30j33J42N13O41L69J71M51Q57Q40N27M40O52P89P35P35Q82R23N70
55261H9982k29j182j758j642j203j052j077o34K34N98J18l09L4M79J34o10p80
55244H1103m17l34o89r27q54o95l35M04J020Q75L55M31J107J469J168P75O14L29
55226H5399j56k74K16P75R09P39M91N6o24j229j404j020k16M93M30l33o53K99
55208H3898J648J838Q06l5J31O57P55M55m2q05j538j517o68J74M07L15K20p9n55
$$ plain form
55331 78288 79281 80590 81736 82342 82678 83495 85165 87097 88188 87793 86170 84118 82380 81337 81010 81211
55315 81211 81720 82320 82717 82667 82271 81854 81418 80562 79265 78345 78595 79665 80372 80059 79062 77860 76488 75002
55297 75002 73930 73849 74817 76485 78463 80348 81696 82315 82491 82740 83331 84075 84440 83963 82698 81273 80308
55280 80308 79878 79745 79887 80400 81041 81410 81581 82032 82889 83729 84256 84696 85348 86137 86872 87607 88489 89412 89982
55261 89982 89753 88571 86813 85171 83968 82916 81839 81205 81439 82037 82155 81846 81880 82359 82493 81883 81103
55244 81103 80686 80352 79663 78736 77882 77187 76852 77256 78276 79151 79506 79937 81044 82513 83681 84456 85070 85399
55226 85399 85243 84969 85185 85960 86869 87608 88099 88155 87531 86302 84898 83878 83662 84155 84585 84252 83599 83898
55208 83898 85546 87384 88190 88155 88286 88943 89698 90153 90111 89306 87768 86251 85583 85757 86164 86479 86699 86620 86065
55189H6065o07n1L98J79k21q6M91R16R30O18Q5m39n66k68kj0jJ82K50O6n5k8k81
55166H7565r24j265p68P7L78j5m88m17L88J578K340K000Q68l2k90n16j131j567
55148H7781j163j97N98J008J170R70L47j93j05L62M76J2n35p01n21l24l72o48
55130H7965q20n54Q2P12J175J539J623J059L0o66n44L0M54N55L46k22r52j280
55112I0532r49l61k8Np0j26J0M51Q47O60L1k85l3K36J79J43L09K68k0J05Q36J332
55090I4072J009N15N44O49K08l49l87l81r97j483o03J124J758O10q52j142n33
55073I3762q8MK57P03P75K32l96m28R4L50l38j565k090j196M97J773K024J467
55055I5837N82j89n09l65m7L09P86J101O26n03j037j54J195J440M96l17k21K35
$$ plain form
55189 86065 85458 85407 85805 85984 85763 85677 86168 87084 88014 88632 88717 88278 87712 87444 87442 87432 87431 87613 87863 87929 87874 87846 87565
55166 87565 86641 85376 84608 84685 85063 85048 84560 84143 84531 86109 88449 90449 91317 91285 90995 90479 89348 87781
55148 87781 86618 86421 87019 88027 89197 90167 90514 90321 90216 90578 91054 91066 90531 89830 89309 88985 88613 87965
55130 87965 87145 86591 86673 87385 88560 90099 91722 92781 92811 92145 91601 91631 92085 92640 92986 92764 91812 90532
55112 90532 89583 89222 89194 89199 89129 89003 89013 89464 90311 90971 91002 90717 90684 90920 91099 91242 91551 91819 91799 91904 92740 94072
55090 94072 95081 95596 96140 96789 96997 96648 96261 95880 94883 93400 92797 93921 95679 96289 95437 94295 93762
55073 93762 93674 93678 93935 94638 95413 95645 95249 94821 94915 95265 94927 93362 91272 90076 90573 92346 94370 95837
55055 95837 96419 96230 95721 95356 95309 95618 96404 97505 98131 97628 96591 96437 97632 99072 99568 99251 99030 99265
55037I9265K87j58q51j578j925j475n00J64J66l4k5%k13m39l28J43P73J311J369
55018I5952P21j67l67M30J478J882J581J075N89m0p65j150q98l00J17K46M75J004
55000A01863J347R27j5n98m26p6k29p67j114j072q85p52o11k67M49J428K004J513
54982A02719K85m41l0P38Q34L67Q3J11L0j92k45j96l14l59J01Q05J060Q08O22
54963A06786P14P27N91O64R73J003M67l54j095j520j315l75O86J019O78M54O33
54946A10736O50J91l19n25p31j156j413j142n79q7L51P68Q46M11j32k37K15R85
54928A08832J782K277K199J712J356J457J939K705L702M541M735M517M754N671
54914A52179O331N724L921J686m82k466m144n404o256o565o066m923l866l336
$$ plain form
55037 99265 99552 99394 98543 96965 95040 93565 93065 93229 93395 93361 93336 93336 93123 92684 92356 92499 93272 94583 95952
55018 95952 96673 96506 96139 96569 98047 99929 101510 102585 103174 103134 102369 101219 100321 100021 100138 100384 100859 101863
55000 101863 103210 104137 104122 103524 103098 103022 102793 102026 100912 99840 98955 98203 97592 97325 97774 99202 101206 102719
54982 102719 103004 102563 102533 103271 104105 104472 104555 104666 104696 104504 104259 104063 103749 103390 103491 104296 105356 106164 106786
54963 106786 107500 108227 108818 109482 110455 111458 111925 111571 110476 108956 107641 107266 107952 108971 109649 110103 110736
54946 110736 111386 111577 111258 110733 110002 108846 107433 106291 105712 105625 105976 106744 107590 108001 107869 107632 107847 108832
54928 108832 110614 112891 115090 116802 118158 119615 121554 124259 127961 132502 137237 141754 146508 152179
54914 152179 158510 164234 168155 169841 169359 166893 162749 157345 151089 144524 138458 133535 129669 126333
54900A26333k992k433j883j641j403p68q4J5l46m31l0L10K28N0J54M09N54P07
54882A16749J178J986K835L476L855M015L996L922L997M330M695M631L900K747
54868A66312J556K86j387l358m873n286m830m360m341m391l879k757j681j240
54854A25771j300j258q85o04q62j516k072k297k277k102j790j442j098o19k4K50
54838A05875j48q54j163r30o11m85m28l87m67m26J83J152J614J220P20R11J477
54821A07253J494P25j27l69j4M04L90j17o72p04j05N83P54L71p8j65R3L54L38
54802A10408J13RK16N58P60P73O64M17J09M8L34M65j19j140j649j140%J084J666
54783A13576J523P50n2k67n6r4m24l46M02J097J126R15J218K090L063L905M585
$$ plain form
54900 126333 123341 120908 119025 117384 115981 115213 115129 115144 114798 114367 114337 114647 114875 114925 115079 115488 116042 116749
54882 116749 117927 119913 122748 126224 130079 134094 138090 142012 146009 150339 155034 159665 163565 166312
54868 166312 167868 168154 166767 163409 158536 153250 148420 144060 139719 135328 131449 128692 127011 125771
54854 125771 124471 123213 122328 121724 120862 119346 117274 114977 112700 110598 108808 107366 106268 105649 105625 105875
54838 105875 105727 104873 103710 102780 102169 101684 101256 100869 100402 99976 100159 101311 102925 104145 104865 105776 107253
54821 107253 108747 109472 109345 108976 108962 109366 109756 109639 108967 108263 108158 108741 109495 109866 109788 109623 109716 110070 110408
54802 110408 110521 110530 110746 111304 112064 112837 113501 113918 114027 114075 114409 114874 114755 113615 111966 110826 110826 111910 113576
54783 113576 115099 115849 115797 115530 115474 115380 114956 114610 115012 116109 117235 118150 119368 121458 124521 128426 133011
54766A33011M970N119N564O619P664P692O449M541K595Q01q46k338l736n098o222
54751A66785o717o383n381m120l068k550k512k583k408j881j129m72l35q49j529
54736A24868j714j329q03l65M4K42n4m58j33R54J847K001K044K643L463L964M389
54719A41603N080N518M996L826K849K077Q29r89k666l752m418m777m684m302m088
54704A37102m105l982l602l204k752j914p71J11M76N65M52j18r50j274p86k05
54688A15043k90q10j013p55n55o91q51p15m61m99q38r32k54R96J885J653N57m35
54670A11035p08m69j80L9K98N52O58N83M06J71n1j28p2j17l69m31K17J401K140
54651A14975J640K40j020j596j769j790j361l82M64M93L5q9J69K21R0M49J294
$$ plain form
54766 133011 137981 143100 148664 155283 162947 170639 177088 181629 184224 185025 184179 181841 178105 173007 166785
54751 166785 160068 153685 148304 144184 141116 138566 136054 133471 131063 129182 128053 127581 127246 126397 124868
54736 124868 123154 121825 121022 120657 120701 120943 120889 120431 120298 121252 123099 125100 127144 129787 133250 137214 141603
54719 141603 146683 152201 157197 161023 163872 165949 166778 165789 163123 159371 154953 150176 145492 141190 137102
54704 137102 132997 129015 125413 122209 119457 117543 116772 116883 117359 117924 118376 118258 117308 116034 115248 115043
54688 115043 114753 113943 112930 112175 111620 110929 110078 109363 108902 108403 107565 106633 106379 107375 109260 110913 111470 111035
54670 111035 110327 109858 109678 109717 110015 110567 111225 111808 112214 112385 112334 112206 112134 112017 111648 111217 111434 112835 114975
54651 114975 116615 116855 115835 114239 112470 110680 109319 108937 109401 109894 109929 109840 110009 110230 110320 110769 112063
54634A12063J673J187P10R64J269O71l69n24M68J471J486O95j29n22n36n07p30
54617A19340j089j171r85j130j805k108j160M98J471J348R27P15L03n55j220j101
54601A12278n38k16k30k63k37k65k17J09O20R86J033Q11M04q9n08p25o89l91J13
54582A11986O11Q57P98N41J72j70k03J82N61L84k39n79k17L94N08p4q72j246r14
54563A12480j98L05L16J89M01Q78J126R12M94J93J30K70M50L64p8m81m04MK47
54544A17598K90N24J005J280J131Q83Q28P95N77L20K05J12j23m05n76o93q88j130
54526A21733j296j279r94m78N1M11O99J040J199Q77K79p9q0j6M6L12O42N42%l55
54506A23254j73Q8j07n96q86q72p64o76o26o76p07l89L36R68R83M54p6j59K43
$$ plain form
54634 112063 113736 114923 115633 116597 117866 118537 118168 117644 118112 119583 121069 121764 121635 121113 120577 120070 119340
54617 119340 118251 117080 116095 114965 113160 111052 109892 110390 111861 113209 114136 114851 115154 114599 113379 112278
54601 112278 111740 111524 111294 111031 110794 110529 110312 110421 111041 112027 113060 113871 114275 114186 113678 112953 112264 111873 111986
54582 111986 112597 113454 114252 114793 114965 114795 114592 114774 115335 115719 115480 114901 114684 115078 115586 115512 114640 113394 112480
54563 112480 112282 112587 112903 113092 113493 114371 115497 116409 116903 117096 117226 117496 117946 118310 118232 117751 117347 117351 117598
54544 117598 117888 118412 119417 120697 121828 122711 123539 124334 124911 125231 125436 125548 125425 125020 124444 123751 122863 121733
54526 121733 120437 119158 118164 117686 117737 118148 118847 119887 121086 121963 122242 122163 122083 122067 122113 122425 123067 123609 123609 123254
54506 123254 123081 123169 123062 122466 121580 120708 119944 119268 118642 117966 117259 116870 117206 118174 119157 119611 119535 119376 119619
54487A19619P57Q38K76m06n12p9J96J9j54k2N6j86l69k06j50o23j091p05M27J345
54467A19030J448R74M11Q2K43R10J597J692J207O52K13l38r22r63k17P42J195
54450A27956J050O06r8j129k032j997r15K43N25J78J50N55M39n88j398p86O59
54433A23418J226M94j75K94J248J555J174P42K92n15j367j602j289j025p70L9
54417A23739J177J496N08p74j116n33J59O45J201J763J770J042J85j65j6K77O61
54400A32019J283J937K103J630J001P63R28J088R51N06j04o23p79o40o88j174
54384A40201j583j157Q6J384K174K469K300J508L05n52n89j90M3N4O0J9j51j28
54366A46253M17J166J441J158R47J341K172K911L284L456L701L982L810K680P27
$$ plain form
54487 119619 120376 121214 121490 121084 120572 120493 120689 120708 120554 120532 120588 120402 120033 119827 119677 119054 117963 117258 117685 119030
54467 119030 120478 121452 121863 121945 122188 123098 124695 126387 127594 128246 128459 128121 127199 126236 126019 126761 127956
54450 127956 129006 129612 129514 128385 126353 124356 123441 123684 124209 124387 124537 125092 125531 124943 123545 122759 123418
54433 123418 124644 125138 124963 125257 126505 128060 129234 129976 130268 129753 128386 126784 125495 124470 123700 123739
54417 123739 124916 126412 126920 126146 125030 124497 124656 125301 126502 128265 130035 131077 131262 131097 131081 131358 132019
54400 132019 133302 135239 137342 138972 139973 140736 141664 142752 143703 144209 144105 143482 142703 142063 141375 140201
54384 140201 138618 137461 137547 138931 141105 143574 145874 147382 147687 147135 146546 146356 146399 146453 146513 146532 146381 146253
54366 146253 146670 147836 149277 150435 151382 152723 154895 157806 161090 164546 168247 172229 176039 178719 179446
54351A79446j274k658l432l934m282m364m146l700l062k337j689j058j82Q07J201
54336A45336N71m96j029q92q04j202j646j481o88J67N87N62M69O02Q49Q34M44
54319A42183L5N3N83J297J670J235k9j429k066j844j590j905k351k149j271l43
54303A32079J94L14O3m42q54r20q01o79k72O68J553J497N51k29j59L07L66n9l96
54284A32781k50J95M03O7m92n48K50J355J861J479P04J65J16M16O68M88J0p1O13
54265A40210J412J391O30J29M08R29J009O98M21L57M59P24J075J263J136Q15M34
54248A53500Km01n47m14l33n71r69j117p88k10P2l25j000r50K41J624J794N84
54230A50192q26j379j109o05k21q1k53n50n65j99K11M14M62L01k84j135j677j639
$$ plain form
54351 179446 178172 175514 172082 168148 163866 159502 155356 151656 148594 146257 144568 143510 143328 144135 145336
54336 145336 145907 145411 144382 143490 142686 141484 139838 138357 137669 137836 138423 138985 139454 140056 140905 141739 142183
54319 142183 142218 142271 142854 144151 145821 147056 147027 145598 143532 141688 140098 138193 135842 133693 132422 132079
54303 132079 132273 132587 132650 132208 131354 130434 129633 128954 128682 129350 130903 132400 132951 132722 132563 132870 133236 133177 132781
54284 132781 132531 132726 133129 133196 132704 132156 132406 133761 135622 137101 137805 137970 138086 138502 139170 139658 139668 139597 140210
54265 140210 141622 143013 143643 143772 144180 145109 146118 146816 147237 147594 148053 148777 149852 151115 152251 153066 153500
54248 153500 153502 153101 152554 152140 151807 151236 150267 149150 148362 148152 148224 147899 146899 145949 146190 147814 149608 150192
54230 150192 149366 147987 146878 146273 146052 145971 145718 145168 144603 144404 144615 145029 145491 145792 145508 144373 142696 141057
54212A41057j348j076p17l30k93n71n88k43k69r22j190k51J043J216K78m31k75
54195A35090M3n3j24K83Q07R53Q52Q20P20L50p0k69m32p85j031p31m3L98K85m5
54175A37018o4M81J400K153K165J404M86j4k00n23r61j009m33L13N88K18m63r76
54157A41583j049q08o53p83r12o97l05j96l26j34O07J394J727J681J477R43Mp44
54139A42809o39M6M37L17L54R17J365Q67m82j682j748m97J300K458K346J436N83
54122A50187K3m66o46QJ126J453N07n68n27L27P57L68j50j66K37O54P64M54N0
54103A54392J73Q87J375J045M69N08R25Q98N66R24K195L449L990M112M223M272
54087A84403M360M993O188P171P442P399P329O478L895j90m420p477q815q609
$$ plain form
54212 141057 139709 138633 137916 137586 137293 136722 136134 135891 135622 134700 133510 133259 134302 135518 135796 135365 135090
54195 135090 135133 135080 134956 135239 136046 136999 137851 138671 139391 139741 139671 139402 138970 138185 137154 136423 136380 136778 137063 137018
54175 137018 136954 137435 138835 140988 143153 144557 145043 145029 144829 144306 143345 142336 141903 142216 142804 143022 142559 141583
54157 141583 140534 139726 139073 138290 137378 136681 136376 136180 135854 135720 136327 137721 139448 141129 142606 143549 143553 142809
54139 142809 142170 142216 142653 142970 143324 144241 145606 146473 145991 144309 142561 142064 143364 145822 148168 149604 150187
54122 150187 150210 149744 149098 149106 150232 151685 152192 151624 151097 151424 152181 152549 152399 152233 152470 153124 153888 154342 154392
54103 154392 154565 155452 156827 157872 158341 158849 159774 160672 161238 162162 164357 167806 171796 175908 180131 184403
54087 184403 188763 193756 199944 207115 214557 221956 229285 235763 239658 239468 235048 227571 218756 210147
54073B10147p493o135m782l357k059j378j389j564j537j452j294o19O15J549J406
54058A80658M72m12q45q64m21M23J212J611J918K442K824K602K149K275L123M154
54042B03321N067O012P002P855Q643R524J0093R610P991O005M387L238K375J705
54028B92828J147N67n1o86j494k556l412l431k678j974j909k204k245j891j567
54013B68444j753k554l569m221m387m598n323o168o214n108l451k101j564j945
53999B15488k972l915l986l131k074j433j146r55j045j734k726l093k183m44P90
53984A85441N31p98j775j563p24k33j08K89R40J023J79q68j251q96k04N21R72
53967A81476O92l01j200j212m85K74P82J243J669J853J966K517L527M274M179
$$ plain form
54073 210147 202654 196519 191737 188380 186321 184943 183554 181990 180453 179001 177707 177088 177703 179252 180658
54058 180658 181130 180718 179873 179009 178588 179011 180223 181834 183752 186194 189018 191620 193769 196044 199167 203321
54042 203321 208388 214400 221402 229257 237900 247424 257517 267127 275118 281123 285510 288748 291123 292828
54028 292828 293975 294542 294491 293805 292311 289755 286343 282912 280234 278260 276351 274147 271902 270011 268444
54013 268444 266691 264137 260568 256347 251960 247362 242039 235871 229657 224549 221098 218997 217433 215488
53999 215488 212516 208601 204615 201484 199410 197977 196831 195876 194831 193097 190371 187278 185095 184651 185441
53984 185441 185972 185174 183399 181836 181112 180879 180771 181060 182000 183023 183202 182334 181083 180187 179983 180504 181476
53967 181476 182168 181867 180667 179455 178970 179244 180026 181269 182938 184791 186757 189274 192801 197075 201254
53952B01254L603L483M398O215Q420J0477J1983J2761J2908J2563J1618R755O815
53939C16253L014j086m733p129p752o750m941l229k030j293q41m60J88J297K591
53924B83099L566M147M651N098N048M424L988M470N549O299O457O590P000P160
53910C57546O488N160L811K729J714M92r75k499l731m319m269m021l980m062l965
53895C46119l773l985m819n805o303o283o276o560o734o275n300m498m366m797
53881B70345n351n680n629n227m716m332m033l625l220l164l412l424k920k354
53867B13258k236k353k137j576j206j264j385j138n55n4j21r67k218l021k798
53852A90229j844q78k31J40J33m16j146j336p85LN85R63J088O79j80q06p28l42
$$ plain form
53952 201254 204857 208340 212738 218953 227373 237850 249833 262594 275502 288065 299683 309438 316253
53939 316253 319267 318181 313448 306319 298567 291817 286876 283647 281617 280324 279483 279023 279211 280508 283099
53924 283099 286665 290812 295463 300561 305609 310033 314021 318491 324040 330339 336796 343386 350386 357546
53910 357546 364034 369194 373005 375734 377448 377940 376965 374466 370735 366416 362147 358126 354146 350084 346119
53895 346119 342346 338361 333542 327737 321434 315151 308875 302315 295581 289306 284006 279508 275142 270345
53881 270345 264994 259314 253685 248458 243742 239410 235377 231752 228532 225368 221956 218532 215612 213258
53867 213258 211022 208669 206532 204956 203750 202486 201101 199963 199408 199354 199233 198266 196048 193027 190229
53852 190229 188385 187507 187276 187416 187549 187133 185987 184651 183866 183869 184454 185417 186505 187184 187004 186198 185470 185128
53834A85128k77n08n62l04k1K08N95J119J332R23K28o4L81J210J810J962J945
53817A95105K003J910J305L44l40l13L35J357K636L938M730M660M011L456L425
53802B28562L858M486N096N550N728N514M916M212L833L893L884L171J837O67
53788B85207K50L77M71L00ol97r96j904l060m290n313n863n918n683n279m649
53772B43247l908l441l417l424k993k333k114k561l124l255l063k924k725k041
53758B01924j031n91j191k002j800o08K69J7o38o18o5j5p95j604j666j103m76
53741A88007j03jm5K2M39J105J683K000K025J566N10o45j077n95J81O62P82O24
53723A97140K89K29R71K181K760K228J350J024J207J442J676J954J897J309P89
$$ plain form
53834 185128 184851 184343 183781 183477 183456 183664 184259 185378 186710 187633 187861 187797 188178 189388 191198 193160 195105
53817 195105 197108 199018 200323 200667 200327 200014 200349 201706 204342 208280 213010 217670 221681 225137 228562
53802 228562 232420 236906 242002 247552 253280 258794 263710 267922 271755 275648 279532 282703 284540 285207
53788 285207 285457 285834 286305 286605 286599 286202 285206 283302 280242 275952 270639 264776 258858 253175 247896 243247
53772 243247 239339 235898 232481 229057 226064 223731 221617 219056 215932 212677 209614 206690 203965 201924
53758 201924 200893 200302 199111 197109 195309 194701 194970 194987 194349 193731 193666 193651 192856 191252 189586 188483 188007
53741 188007 187904 187903 187858 187880 188319 189424 191107 193107 195132 196698 197208 196563 195486 194891 195072 195734 196516 197140
53723 197140 197429 197658 198629 200810 203570 205798 207148 208172 209379 210821 212497 214451 216348 217657 218446
53708B18446R82J574J825J685J623J699J639J661K292L397M175M227L992L946
53694B53163L989L779L232K552K014J722J413O88l56j072j170j198j596j841j316
53679B64003n09l76q27r67o85p97j433j569o05O06R68N78K84L89M65J38n34j183
53661B57946j371r48l71k84o86r11o18k19q6L5M59Q97Q61L55j98m39j72N73J345
53642B56168J511J026N63O59J173J752K276K491J952Q52K53Q51J973K433K002
53627B77935J359J018J114J864L385N102O135O333O331O550O756O626O165N437
53613C42110M369L024J757R54P66J055J435J450J019N03K46K64O12J503K635K991
53597C66693J999N28o7L71Q71Q88P67P29M25k63q64j125j369j740j835j463j111
$$ plain form
53708 218446 219428 221002 222827 224512 226135 227834 229473 231134 233426 236823 240998 245225 249217 253163
53694 253163 257152 260931 264163 266715 268729 270451 271864 272552 272196 271124 269954 268756 267160 265319 264003
53679 264003 263494 263118 262291 261324 260639 259842 258409 256840 256235 256841 257809 258387 258671 259060 259525 259663 259129 257946
53661 257946 256575 255627 255256 254972 254286 253375 252757 252538 252452 252487 252946 253843 254704 255059 254861 254422 254250 254823 256168
53642 256168 257679 258705 259268 259927 261100 262852 265128 267619 269571 270423 270676 271527 273500 275933 277935
53627 277935 279294 280312 281426 283290 286675 291777 297912 304245 310576 317126 323882 330508 336673 342110
53613 342110 346479 349503 351260 352214 352980 354035 355470 356920 357939 358442 358688 358952 359564 361067 363702 366693
53597 366693 368692 369220 369153 369524 370395 371283 372050 372779 373204 372941 372077 370952 369583 367843 366008 364545 363434
53580C63434j173j368j397j566k148k671k525j905j426j139n92K31P54O01P8l13
53564C46875l81j89J55N41Q25Q83N90j41j145j879j777p76O08J699K170K073J606
53547C51737Q21j91r31o48P87K408L077K848K760L323L923L997L949M397N107
53532C87364N424N404N739O726P976R035R738R964R695R325R485J0360J1500J2391
53518E10126J2898J3228J3703J4539J5558J6320J6805J7673J9350K1106K1766
53507F93072K1268K0745K0984K1497K1464K0890K0411K0377K0637K0848K0638
53496I22831J9698J8157J6679J5884J5779J5971J6249J6608J6921J6914J6509
53485A108200J5951J5566J5529J5817J6247J6584J6658J6349J5508J4072J2236
$$ plain form
53580 363434 362261 360893 359496 357930 355782 353111 350586 348681 347255 346116 345524 345755 346509 347110 347188 346875
53564 346875 346494 346305 346460 347001 347826 348709 349299 349158 348013 346134 344357 343581 344189 345888 348058 350131 351737
53547 351737 352558 352367 351436 350788 351575 353983 357060 359908 362668 365991 369914 373911 377860 382257 387364
53532 387364 392788 398192 403931 410657 418633 427668 437406 447370 457065 466390 475875 486235 497735 510126
53518 510126 523024 536252 549955 564494 580052 596372 613177 630850 650200 671306 693072
53507 693072 714340 735085 756069 777566 799030 819920 840331 860708 881345 902193 922831
53496 922831 942529 960686 977365 993249 1009028 1024999 1041248 1057856 1074777 1091691 1108200
53485 1108200 1124151 1139717 1155246 1171063 1187310 1203894 1220552 1236901 1252409 1266481 1278717
53474A278717J0281Q258O038L754J807L20j153l108n534q016j0178j1874j3095
53461A256217j3880j4181j3828j2899j2111j2341j3650j5212j6416j7475j8599
53450A095625j9264j8948j8099j7546j7287j6753j6046j5843j5953j5066j2556
53439I12264r587p690o843n846m240k818k155j683o51O03J160R84J195K691N026
53424H82410O972P904Q300Q970J0187J1626J2878J3895J4972J6433J8196J9747
53412A032490K0647K1110K1857K3316K5197K6942K8379K9750L1256L2851L4411
53401A328206L5970L7729L9857M2201M4261M5623M6405M7103M7983M8855M9431
53390A813624M9590M9301M8609M7844M7361M6960M5997M4295M2413M0658L8510
$$ plain form
53474 1278717 1288998 1297256 1303294 1307048 1308855 1309175 1308022 1304914 1299380 1291364 1281186 1269312 1256217
53461 1256217 1242337 1228156 1214328 1201429 1189318 1176977 1163327 1148115 1131699 1114224 1095625
53450 1095625 1076361 1057413 1039314 1021768 1004481 987728 971682 955839 939886 924820 912264
53439 912264 902677 894987 888144 882298 878058 875240 873085 871402 870751 871354 872514 873498 874693 877384 882410
53424 882410 889382 897286 905586 914556 924743 936369 949247 963142 978114 994547 1012743 1032490
53412 1032490 1053137 1074247 1096104 1119420 1144617 1171559 1199938 1229688 1260944 1293795 1328206
53401 1328206 1364176 1401905 1441762 1483963 1528224 1573847 1620252 1667355 1715338 1764193 1813624
53390 1813624 1863214 1912515 1961124 2008968 2056329 2103289 2149286 2193581 2235994 2276652 2315162
53379B315162L5586L2580L0337K8329K5084K0206J5020J0897P651M013q70o861
53367B517134j3276j9502k5303l0889l6491m1768m5833m8061m8703m8524m8152
53356B110632m7833m7534m7005m5888m4018m1615l9187l7369l6667l6970l7351
53345A649195l6905l5869l5363l5773l6018l4866l2493l0106k8388k6954k5203
53334A291257k3013k0556j7999j5559j3454j1653j0022q812q618r618j1230j2751
53322A127972j3992j4992j5396j4665j2897j0915r415q361p354o216m882l125
53310A005762r16J140K278K524K659L174L862M576N702P439R217J0490J1628J3334
53296A082869J5458J7208J8474J9991K2117K4158K5260K5364K4978K4493K3933
$$ plain form
53379 2315162 2350748 2383328 2413665 2441994 2467078 2487284 2502304 2513201 2520852 2524865 2523995 2517134
53367 2517134 2503858 2484356 2459053 2428164 2391673 2349905 2304072 2256011 2207308 2158784 2110632
53356 2110632 2062799 2015265 1968260 1922372 1878354 1836739 1797552 1760183 1723516 1686546 1649195
53345 1649195 1612290 1576421 1541058 1505285 1469267 1434401 1401908 1371802 1343414 1316460 1291257
53334 1291257 1268244 1247688 1229689 1214130 1200676 1189023 1179001 1170189 1161571 1151953 1140723 1127972
53322 1127972 1113980 1098988 1083592 1068927 1056030 1045115 1035700 1027339 1019985 1013769 1008887 1005762
53310 1005762 1004846 1005986 1008264 1010788 1013447 1016621 1020483 1025059 1030761 1038200 1047417 1057907 1069535 1082869
53296 1082869 1098327 1115535 1134009 1154000 1176117 1200275 1225535 1250899 1275877 1300370 1324303
53285A324303K3065K1559J9381J7162J5657J4734J3426J1146Q248N191J877j671
53273A474078m687o517p706r488j2257j5182j7361j8864k0469k2648k4985k6499
53261A287415k6683k6138k5936k6363k6708k6420k5898k5755k5815k5395k4294
53250A002010k2997k2019k1486k1251k1047k0759k0685k1297k2431k3103k2536
53239G62399k1062j9549j8322j7151j5941j4811j3685j2354j0816r140p324n768
53227E96476n349o292p423p514p033p454q961j0183j0373j0491j1521j2880j3385
53214D77617j2979j2515j2218j1463r925q228p205o998p010o590n716n041n182
53201C66547n938o521o569o522o847p360p569p321o783o042n146m292l665l251
$$ plain form
53285 1324303 1347368 1368927 1388308 1405470 1421127 1435861 1449287 1460433 1468681 1473872 1475749 1474078
53273 1474078 1469391 1462874 1455168 1445680 1433423 1418241 1400880 1382016 1361547 1338899 1313914 1287415
53261 1287415 1260732 1234594 1208658 1182295 1155587 1129167 1103269 1077514 1051699 1026304 1002010
53250 1002010 979013 956994 935508 914257 893210 872451 851766 830469 808038 784935 762399
53239 762399 741337 721788 703466 686315 670374 655563 641878 629524 618708 609568 602244 596476
53227 596476 591127 584835 577412 569898 562865 555411 546450 536267 525894 515403 503882 491002 477617
53214 477617 464638 452123 439905 428442 418517 410289 403084 396086 389076 382486 376770 371729 366547
53201 366547 360609 354088 347519 340997 334150 326790 319221 311900 305117 299075 293929 289637 285972 282721
53187B82721l010k994l071k920k536k415k824l217k894j971j144p21m72l99q55
53172B51278j795k503k491k130k047k254k312k141k059k132j982j415p90m55j79
53157B24593M65J245J346M09q51j348q24n0N5o25j432j658j164l47L45P06O51
53140B21516J35o44j128q88j65L92N86Q17J325J737J634J141O96M93N28P86J054
53123B30015Q60J13m54n9J086J952J840R28j76r52j127q56o58q40j049q33m76
53106B29314o61j489k356k774k663j965p29M08O13o8o94p25o27q96j174q20J61
53089B12855J188J755J705J204O88N26N82M30O7j28j25l09o62o53k21n0m68q84
53071B17500p99o42r50j424j505j268j008n37K91Q56M82m57j024r70p24m63r1
$$ plain form
53187 282721 279711 276717 273646 270726 268190 265775 262951 259734 256840 254869 253725 253004 252532 252133 251278
53172 251278 249483 246980 244489 242359 240312 238058 235746 233605 231546 229414 227432 226017 225227 224772 224593
53157 224593 225058 226303 227649 228058 227207 225859 225035 224985 225040 224415 222983 221325 220161 219814 220159 220865 221516
53140 221516 221651 221007 219879 218991 218826 219218 219804 220621 221946 223683 225317 226458 227154 227647 228175 228961 230015
53123 230015 230875 230988 230534 230475 231561 233513 235353 236281 236105 235153 234026 233170 232512 231672 230623 229790 229314
53106 229314 228653 227164 224808 222034 219371 217406 216677 217085 217698 217630 216936 216211 215584 214688 213514 212694 212855
53089 212855 214043 215798 217503 218707 219395 219921 220503 220933 221000 220872 220747 220438 219776 219123 218902 218852 218384 217500
53071 217500 216701 216059 215109 213685 212180 210912 209904 209367 209658 210514 210996 210539 209515 208545 207821 207358 207267
53054B07267J46l5k40J17P34Q60O42R26J701J880R65j36m67j74J20L10M50J95
53036B15261o22j350j295p77o47r46q53L0J033J295P89J81r0k04m49o25k57O25
53018B11099J306J202O20K79L38L35P2j17j7J33J96M76J083J484J189N49K92M88
53000B21007M70j89j102j526j107j41O50O07k72j211j369o90J81P62J127J446
52984B18643J564J344J048J032J169R61K81l41k93L65R40P91k2q05q59j40P67
52967B26445J283J324J148R19P16P94J316J828J501J96j135j511j048o02o37r71
52951B31566j458k192k990l352l082k447j582l50R96J665J253L73j13k2L05O91
52935B19261J082J181P44N1m03o08r03j252j201o35q1m4l87n49k49J64J06n33
$$ plain form
53054 207267 207413 207378 207138 207255 207989 208849 209491 210417 212118 213998 214963 214827 214360 214186 214306 214616 215066 215261
53036 215261 214639 213289 211994 211217 210570 209624 208771 208801 209834 211129 211918 212099 212009 211805 211356 210731 210474 211099
53018 211099 212405 213607 214227 214506 214844 215179 215251 215134 215117 215250 215446 215922 217005 218489 219678 220227 220519 221007
53000 221007 221477 221288 220186 218660 217553 217412 218062 218669 218397 217186 215817 215127 215308 216070 217197 218643
52984 218643 220207 221551 222599 223631 224800 225761 226042 225701 225408 225773 226713 227504 227482 226677 225818 225678 226445
52967 226445 227728 229052 230200 231119 231835 232629 233945 235773 237274 237470 236335 234824 233776 233174 232537 231566
52951 231566 230108 227916 224926 221574 218492 216045 214463 214113 215109 216774 218027 218400 218287 218265 218570 219261
52935 219261 220343 221524 222268 222319 221916 221308 220405 219153 217952 217317 217236 217192 216805 216256 216007 216171 216277 215744
52917B15744j150j029k01O13Q85P55N41K91N2J00M49N79O0q50j627k153k441k168
52899B08450j120J50Q11P37M66L64M66Q48J443J668J076K52K11R17J291Q11J73
52882B19014O1K32K56K82N50P16L78j90l95j15L94J015J710K169K032J370N87
52865B30066m3m80p34p80o41l74j08q3m03p28o20k61l42j123k084k740l203l584
52847B11735l478k596j485r21q64o72j78J54Q4l4O4R7k45p04p45k58K79L66M3
52828B00642j73J49Q24J184P54k57j139j300o71L08J009J019M21k29l07M32J671
52811B04337K762L179K861K117J245L49m58j054j529k105k588k342j232j66j10
52796B05266q05j179q43l92j98R0O25Q12K53m53m87M6L72K01O4N46J516K206J895
$$ plain form
52917 215744 214594 213565 213364 213977 214862 215617 216158 216449 216501 216601 217050 217629 217689 216839 215212 213059 210618 208450
52899 208450 207330 207480 208291 209028 209494 209858 210324 211172 212615 214283 215359 215611 215822 216739 218030 218841 219014
52882 219014 219075 219307 219563 219845 220395 221111 221489 221299 220904 220789 221183 222198 223908 226077 228109 229479 230066
52865 230066 230023 229543 228809 228029 227388 227014 226906 226823 226420 225692 225072 224811 224469 223346 221262 218522 215319 211735
52847 211735 208257 205661 204176 203255 202391 201719 201541 201695 201779 201745 201809 201906 201661 200957 200212 199954 200233 200599 200642
52828 200642 200469 200618 201442 202626 203380 203123 201984 200684 200013 200321 201330 202349 202770 202541 202234 202666 204337
52811 204337 207099 210278 213139 215256 216501 216850 216392 215338 213809 211704 209116 206774 205542 205376 205266
52796 205266 204461 203282 202439 202047 201849 201939 202564 203376 203629 203176 202689 202735 203107 203308 203372 203918 205434 207640 209535
52777B09535O90m49o96l25k75p65j006m29M26P23L76r6l98o20q97j284j669j637
52759B01204q54K64P69M52J65M83Q22M58k08k81K85Q53J244J758K321K428J978
52742B14141J376R23O61P10J035J120N64j48k09L43P91R27J157J504J499J200
52726B27594J204J519J346M30l94m82m05r67j880k268k012j811k054k318j988
52711B15514r41L28J033O74m33j323j378r73q61j159j273p80Q0P80J108J266J486
52694B13148J755J886J740J265M71m26q55l21Q52J603J294M48o8k09n17j045j251
52677B19770r26m41k9M32P48L54p24j485j095J11J141J500J422J304J328J388
52661B24798J133L66m48m56M86J475J652J213R52J212J713K015J697M88j255k560
$$ plain form
52777 209535 210225 209776 209080 208755 208480 207715 206709 206280 206706 207429 207805 207709 207311 206691 205794 204510 202841 201204
52759 201204 200350 200614 201383 201835 202000 202483 203305 203763 203555 203274 203559 204412 205656 207414 209735 212163 214141
52742 214141 215517 216440 217101 217811 218846 219966 220530 220382 220173 220516 221307 222234 223391 224895 226394 227594
52726 227594 228798 230317 231663 232093 231699 231217 230812 229845 227965 225697 223685 221874 219820 217502 215514
52711 215514 214573 214901 215934 216608 216175 214852 213474 212501 211640 210481 209208 208428 208508 209288 210396 211662 213148
52694 213148 214903 216789 218529 219794 220265 219839 218984 218663 219515 221118 222412 222860 222792 222583 222066 221021 219770
52677 219770 218844 218403 218374 218806 219554 219908 219184 217699 216604 216715 217856 219356 220778 222082 223410 224798
52661 224798 225931 226297 225849 225393 225879 227354 229006 230219 231171 232383 234096 236111 237808 238296 237041 234481
52645B34481k841k566k389k084j098K18Q66O09J58l2k45n60m22M14J263J432J155
52628B28359J073J231J214R38O53L89Nl28k96l4j6l61p00q56j076j495j754j492
52610B25454p88K7P02J005P48J59j37J35M95M23J94M43J186J799J878J511Q09
52593B36043j39p93m42P22J478R81k25r81r07m30Q6O18J063J162Q70L86q0l47
52575B39065k49Q8J35l64r16q70l18J56L09L06J26l44p92q08o87j096j863j991
52557B29887j125j56L5l08m92m27m13l71o5K78K33j23l55l64l76l68p4M28O28
52538B26472K67k53l26J78P92R97Q04O98R50J164Q42K78L03J068J639J159r6j216
52520B35720j785j929j678r08J11Q04R74R91J246J741K239K488K306J708R65M15
$$ plain form
52645 234481 231640 229074 226685 224601 223503 223721 224587 225196 225354 225322 225077 224517 224095 224509 225772 227204 228359
52628 228359 229432 230663 231877 232815 233468 233857 233862 233534 233238 233204 233188 232827 232127 231271 230195 228700 226946 225454
52610 225454 224666 224693 225395 226400 227148 227307 227170 227305 227800 228223 228417 228860 230046 231845 233723 235234 236043
52593 236043 235904 235111 234669 235391 236869 237850 237625 236644 235737 235307 235393 236011 237074 238236 239106 239492 239412 239065
52575 239065 238816 238904 239039 238675 237759 236889 236571 236727 237036 237342 237468 237124 236332 235524 234837 233741 231878 229887
52557 229887 228762 228606 228641 228333 227841 227414 227001 226630 226565 226843 227076 226953 226598 226234 225858 225490 225416 225844 226472
52538 226472 226739 226486 226160 226338 227130 228127 228931 229629 230579 231743 232585 232863 233166 234234 235873 237032 236936 235720
52520 235720 233935 232006 230328 229420 229531 230335 231309 232300 233546 235287 237526 240014 242320 244028 244993 245408
52504B45408J87K37M41M88mr62j670j528q27l94o22j275j978k368j935m85J217
52487B33930J936J379N16K80N17N50K61L9Po5k22j80K13P18J027J023P40K41k75
52468B42635m87k38K28M89M36M18Q46J670K399K643K435K038J543Q35j27j150
52452B56613j918k248k213k103k125k169j976j588j330j247q90NQ96R70K38m28
52436B38487m17j02k12q86j632j942j634q36J7L09j37o59l47P94J758J782J335
52419B35678J426K226K951L054K916L164L787M309M491M505M690N432P043R208
52405B94880J0800J0762R087O548L654M38k873n751p972r611j0331r515p383n196
52391B77537l872l039j937o35K43M41J09n48j085q27K80J264J343J019J197J728
$$ plain form
52504 245408 245595 245832 246273 246761 246757 245795 244125 242597 241770 241376 240754 239479 237501 235133 233198 232713 233930
52487 233930 235866 237245 237761 238041 238558 239108 239369 239408 239415 239350 239128 238948 239161 239879 240906 241929 242669 242910 242635
52468 242635 242148 241910 242138 242627 243063 243481 244327 245997 248396 251039 253474 255512 257055 257890 257763 256613
52452 256613 254695 252447 250234 248131 246006 243837 241861 240273 238943 237696 236806 236811 237707 238677 238915 238487
52436 238487 238070 237968 237756 236870 235238 233296 231662 230826 230843 231152 231015 230356 230009 230803 232561 234343 235678
52419 235678 237104 239330 242281 245335 248251 251415 255202 259511 264002 268507 273197 278629 285672 294880
52405 294880 305680 316442 325529 332077 335731 336169 333296 327545 319573 309962 299631 290116 282733 277537
52391 277537 273665 270626 268689 268054 268297 268738 268847 268299 267214 266387 266667 267931 269274 270293 271490 273218
52375B73218J847J623J805K371K578K399K663L498L903L326K569K440K506J949
52361C08695R36K56J31J82J86J88J15k1J24P15J272J358J398K114L249L753L225
52344C27876K478K405K906L332L569M087N019N728N570M907M935O326Q352R724
52330C97214J0158J0532J1526J2681J3223J3246J3570J4636J6068J7326J8319
52319E48499J9281K0244K0839K0618J9599J8335J7353J6575J5570J4320J3313
52308G44546J2862J2756J2746J2864J3027J2764J1706J0083Q400O962N891N231
52296H69838M693L643J781m81k619m578o388p668q129q132q208q254p873p160
52282H10465o455n454l552j006J080K198L093M593O417P618P852P749Q183R518
$$ plain form
52375 273218 275065 276688 278493 280864 283442 285841 288504 292002 295905 299231 301800 304240 306746 308695
52361 308695 309631 309887 310018 310200 310386 310574 310689 310668 310792 311507 312779 314137 315535 317649 320898 324651 327876
52344 327876 330354 332759 335665 338997 342566 346653 351672 357400 362970 367877 372812 379138 387490 397214
52330 397214 407372 417904 429430 442111 455334 468580 482150 496786 512854 530180 548499
52319 548499 567780 588024 608863 629481 649080 667415 684768 701343 716913 731233 744546
52308 744546 757408 770164 782910 795774 808801 821565 833271 843354 851754 858716 864607 869838
52296 869838 874531 878174 879955 879474 876855 872277 865889 858221 850092 841960 833752 825498 817625 810465
52282 810465 804010 798556 795004 793998 795078 797276 800369 804962 811379 818997 826849 834598 842781 852299
52268H52299J1413J3114J3964J3766J2753J1406J0338J0096J0673J1368J1537
52257I82727J1277J1069J0903J0370R443Q501P518N971L740J479k96j927m004
52244A056771o412q437r614j0132j0526j1139j1775j1869j1194j0402j0381j1075
52232I33815j1470j0935r964r263q695p703o389n468n189m897l827k031l78L30
52218H47936J76M9O29J671K579L437M804O468P285O663N430M669M280L480K271
52203I01827J489J564K079K571L013L416L569L419L231L188L218L345L739M209
52189I43877M073K859R35p75j575j498j249j715l273n409p141p860p691p131o594
52174H99833o247n983n524m733l769k805j825r16m62n20l60O61J927K114J125
$$ plain form
52268 852299 863712 876826 890790 904556 917309 928715 939053 949149 959822 971190 982727
52257 982727 994004 1005073 1015976 1026346 1035789 1044290 1051808 1057779 1061519 1062998 1062702 1060775 1056771
52244 1056771 1050359 1041922 1032308 1022176 1011650 1000511 988736 976867 965673 955271 944890 933815
52232 933815 922345 911410 901446 892183 883488 875785 869396 863928 858739 853842 850015 847984 847606 847936
52218 847936 848112 848161 848790 850461 853040 856477 861281 867749 875034 881697 887127 891796 896076 899556 901827
52203 901827 903316 904880 906959 909530 912543 915959 919528 922947 926178 929366 932584 935929 939668 943877
52189 943877 947950 950809 951744 950969 949394 947896 946647 944932 941659 936250 929109 921249 913558 906427 899833
52174 899833 893586 887603 882079 877346 873577 870772 868947 868031 867569 867049 866689 867350 869277 871391 872516
52159H72516M46J202K635L243K790K322K459K653K182J174L56K68Q66J653K012
52144H98777J704J140R57J266J592J583J427J422J495J490J665K514M102N878
52130I27012P335Q593J0168J2305J4693J6865J8650K0216K1767K3343K4830K6067
52118A131844K6895K7186K6890K6077K4956K3755K2525K1020J8975J6466J3838
52107A380427J1296Q785O426M624L504K525J079o57j983k697l372m534o057p608
52093A391758r207j1027j2959j4715j6197j7391j8032j7729j6474j4734j2919
52082A230374j0944q488n600k876q27P85K692N129P435Q907R716J0595J1869J3277
52068A272044J4578J5709J6356J6083J5039J3927J3062J2095J0881R922R432Q763
$$ plain form
52159 872516 872962 874164 876799 880042 882832 885154 887613 890266 892448 893622 893978 894246 895112 896765 898777
52144 898777 900481 901621 902578 903844 905436 907019 908446 909868 911363 912853 914518 917032 921134 927012
52130 927012 934347 942940 953108 965413 980106 996971 1015621 1035837 1057604 1080947 1105777 1131844
52118 1131844 1158739 1185925 1212815 1238892 1263848 1287603 1310128 1331148 1350123 1366589 1380427
52107 1380427 1391723 1400508 1406934 1411558 1415062 1417587 1418666 1418009 1416026 1413329 1409957 1405423 1399366 1391758
52093 1391758 1382551 1371524 1358565 1343850 1327653 1310262 1292230 1274501 1258027 1243293 1230374
52082 1230374 1219430 1210942 1205342 1202466 1201639 1202424 1205116 1210245 1217680 1226587 1236303 1246898 1258767 1272044
52068 1272044 1286622 1302331 1318687 1334770 1349809 1363736 1376798 1388893 1399774 1409696 1419128 1427891
52056A427891P290N406L875K676J217o39k601m676p097r616j1736j3619j5876
52043A382495j8376k0145k0667k0487k0192j9646j8677j7737j7174j6396j4651
52032A178347j2373j0917j0990j1905j2548j2503j2139j2000j2383j3182j3883
52021A043524j3881j3071j2008j1292j0900j0294r229q135p689q120r100j0112
52009I19693j0785j0978j0827j0727j0997j1577j2218j2940j3963j5136j5902
51998G83643j5888j5200j3935j1963r524p544o847p284q134r003r778j0108r671
51985F48764q900q651r122r751j0225j0799j1532j1911j1632j1062j0575r915
51973E24689q711p136n682m504l446k352j116L38J844L062L976M931N913O255
$$ plain form
52056 1427891 1435181 1440587 1444462 1447138 1448355 1447716 1445115 1440439 1433342 1423726 1411990 1398371 1382495
52043 1382495 1364119 1343974 1323307 1302820 1282628 1262982 1244305 1226568 1209394 1192998 1178347
52032 1178347 1165974 1155057 1144067 1132162 1119614 1107111 1094972 1082972 1070589 1057407 1043524
52021 1043524 1029643 1016572 1004564 993272 982372 972078 962849 954714 947025 938905 929805 919693
52009 919693 908908 897930 887103 876376 865379 853802 841584 828644 814681 799545 783643
51998 783643 767755 752555 738620 726657 717133 709589 702742 695458 687324 678321 668543 658435 648764
51985 648764 639864 631213 622091 612340 602115 591316 579784 567873 556241 545179 534604 524689
51973 524689 515978 508842 503160 498656 495210 492858 491742 492080 493924 496986 500962 505893 511806 518061
51959E18061N478M049K749J652K19j674l477m718n524o224o737o566n346l357
$$ plain form
51959 518061 523539 527588 530337 531989 532208 530534 527057 522339 516815 510591 503854 497288 491942 488585
$$ [...]
##END NTUPLES=NMR SPECTRUM
##END=
