
##TITLE=AC1206_HPAAH12049_7160619_fPfpgWeFnK
##JCAMPDX= 6.0         $$ Bruker NMR JCAMP-DX V2.0
##DATA TYPE= NMR SPECTRUM
##DATA CLASS= NTUPLES
##ORIGIN= BRUKER
##OWNER= Administrator
$$ 1.72 TOPSPIN		Version 2.1
$$ 2012-12-01 00:11:38.183 -0500  Administrator@X
$$ Compression mode = diff/dup
##.OBSERVE FREQUENCY= 400.02188249412
##.OBSERVE NUCLEUS= ^1H
##.ACQUISITION MODE= SIMULTANEOUS (DQD)
##.ACQUISITION SCHEME= undefined
##.AVERAGES= 8
##.DIGITISER RES= 22
##SPECTROMETER/DATA SYSTEM= spect
##.PULSE SEQUENCE= zg30
##.SOLVENT NAME= COFFEE_meoh
##.SHIFT REFERENCE= INTERNAL, COFFEE_meoh, 1, 14.98509
##AUDIT TRAIL= $$ (NUMBER, WHEN, WHO, WHERE, PROCESS, VERSION, WHAT)
$$ ##TITLE= Audit trail, TOPSPIN		Version 2.1
$$ ##JCAMPDX= 5.01
$$ ##ORIGIN= Bruker BioSpin GmbH
$$ ##OWNER= Administrator
$$ $$ E:\/data/COFFEE/nmr/AC1206_HPAAH12049_7160619_fPfpgWeFnK/10/pdata/1/auditp.txt
$$ ##AUDIT TRAIL=  $$ (NUMBER, WHEN, WHO, WHERE, PROCESS, VERSION, WHAT)
(   1,<2012-12-01 00:11:29.674 -0500>,<Administrator>,<X>,<go>,<TOPSPIN 2.1>,
      <created by zg
	started at 2012-12-01 00:10:23.303 -0500,
	POWCHK enabled, PULCHK disabled,
       configuration hash MD5:
       86 BA 57 50 F2 9D 5C 9B 26 00 A9 28 5F 66 2E 89
       data hash MD5: 64K
       4A 3A A2 F9 C9 CB 2E E9 4A AC D7 DF 20 E9 E2 8B>)
(   2,<2012-12-01 00:11:32.752 -0500>,<Administrator>,<X>,<proc1d>,<TOPSPIN 2.1>,
      <Start of raw data processing
       efp LB = 0 FT_mod = 6 PKNL = 1 PHC0 = 0 PHC1 = 0 SI = 32K 
       data hash MD5: 32K
       78 12 3A 99 84 84 5B F4 D4 9C 36 E4 4B FA B0 F7>)
(   3,<2012-12-01 00:11:33.216 -0500>,<Administrator>,<X>,<proc1d>,<TOPSPIN 2.1>,
      <pk PHC0 = 98.03101 PHC1 = 0 
       data hash MD5: 32K
       08 08 AD 97 3F DE C8 E7 0C 85 46 84 07 FA 28 C8>)
(   4,<2012-12-01 00:11:33.479 -0500>,<Administrator>,<X>,<proc1d>,<TOPSPIN 2.1>,
      <abs ABSG = 1 
       data hash MD5: 32K
       81 30 72 2C 56 69 A1 BE 66 4A 4B 51 E4 E1 2B 64>)
(   5,<2012-12-01 00:11:33.634 -0500>,<Administrator>,<X>,<proc1d>,<TOPSPIN 2.1>,
      <abs ABSG = 2 
       data hash MD5: 32K
       67 FE DE 8C C5 E9 56 95 E3 17 E7 1B 28 D4 EC B8>)
(   6,<2012-12-01 00:11:33.804 -0500>,<Administrator>,<X>,<proc1d>,<TOPSPIN 2.1>,
      <abs ABSG = 3 
       data hash MD5: 32K
       A9 44 5A 73 7E 12 DB F6 AA 01 7C D6 5B 4A 64 E7>)
(   7,<2012-12-01 00:11:33.974 -0500>,<Administrator>,<X>,<proc1d>,<TOPSPIN 2.1>,
      <abs ABSG = 4 
       data hash MD5: 32K
       C9 6F 55 71 6E BF CF 38 2A 4F CA 5C EA D4 C9 52>)
(   8,<2012-12-01 00:11:34.144 -0500>,<Administrator>,<X>,<proc1d>,<TOPSPIN 2.1>,
      <abs ABSG = 5 
       data hash MD5: 32K
       8C 1C 4F FB F9 4E 39 BA 08 F0 1A 35 24 69 FE 79>)
$$ ##END=
$$ 
$$ $$ hash MD5
$$ $$ A0 11 C2 59 DD 15 A0 D1 70 1B 87 C6 BD DE 5F A2
##$RELAX= 
##$RELAX= 
##$RELAX= 
##$RELAX= 
##$RELAX= 
##$RELAX= 
##$RELAX= 
$$ Bruker specific parameters
$$ --------------------------
##$DU= <E:\>
##$EXPNO= 10
##$NAME= <AC1206_HPAAH12049_7160619_fPfpgWeFnK>
$$ [...]
150 150 150 150 150 150 150 150
##$TP07= 0
##$TPNAME0= <>
##$TPNAME1= <>
##$TPNAME2= <>
##$TPNAME3= <>
##$TPNAME4= <>
##$TPNAME5= <>
##$TPNAME6= <>
##$TPNAME7= <>
##$TPOAL= (0..7)
0.5 0.5 0.5 0.5 0.5 0.5 0.5 0.5
##$TPOFFS= (0..7)
0 0 0 0 0 0 0 0
##$TUNHIN= 0
##$TUNHOUT= 0
##$TUNXOUT= 0
##$USERA1= <user>
##$USERA2= <user>
##$USERA3= <user>
##$USERA4= <user>
##$USERA5= <user>
##$V9= 5
##$VALIST= <valist>
##$VCLIST= <CCCCCCCCCCCCCCC>
##$VD= 0
##$VDLIST= <DDDDDDDDDDDDDDD>
##$VPLIST= <PPPPPPPPPPPPPPP>
##$VTLIST= <TTTTTTTTTTTTTTT>
##$WBST= 1024
##$WBSW= 4
##$XGAIN= (0..3)
0 0 0 0
##$XL= 0
##$YL= 0
##$YMAX_a= 610816
##$YMIN_a= -516423
##$ZGOPTNS= <>
##$ZL1= 120
##$ZL2= 120
##$ZL3= 120
##$ZL4= 120
##$ABSF1= 14.98509
##$ABSF2= -5.573092
##$ABSG= 5
##$ABSL= 3
##$ALPHA= 0
##$AQORDER= 0
##$ASSFAC= 0
##$ASSFACI= 0
##$ASSFACX= 0
##$ASSWID= 0
##$AUNMP= <proc_prof1d_extract_pilot.lims>
##$AXLEFT= 0
##$AXNAME= <>
##$AXNUC= <1H>
##$AXRIGHT= 0
##$AXTYPE= 0
##$AXUNIT= <>
##$AZFE= 0.1
##$AZFW= 0.1
##$BCFW= 0
##$BC_mod= 0
##$BYTORDP= 0
##$COROFFS= 0
##$CY= 15
##$DATMOD= 1
##$DC= 0
##$DFILT= <>
##$DTYPP= 0
##$F1P= 0
##$F2P= 0
##$FCOR= 0.5
##$FTSIZE= 32768
##$FT_mod= 6
##$GAMMA= 0
##$GB= 0
##$INTBC= 1
##$INTSCL= 1
##$ISEN= 128
##$LB= 0
##$LEV0= 0
##$LPBIN= 0
##$MAXI= 10000
##$MC2= 0
##$MEAN= 0
##$ME_mod= 0
##$MI= 0
##$NCOEF= 0
##$NC_proc= -8
##$NLEV= 6
##$NOISF1= 0
##$NOISF2= 0
##$NSP= 0
##$NTH_PI= 0
##$NZP= 0
##$OFFSET= 14.98509
##$PC= 1
##$PHC0= 98.03101
##$PHC1= 0
##$PH_mod= 1
##$PKNL= yes
##$PPARMOD= 0
##$PPDIAG= 0
##$PPIPTYP= 0
##$PPMPNUM= 2147483647
##$PPRESOL= 1
##$PSCAL= 4
##$PSIGN= 0
##$PYNMP= <proc.py>
##$REVERSE= no
##$SF= 400.02
##$SI= 32768
##$SIGF1= 0
##$SIGF2= 0
##$SINO= 400
##$SIOLD= 32768
##$SPECTYP= <>
##$SREGLST= <1H.CDCl3>
##$SSB= 0
##$STSI= 32768
##$STSR= 0
##$SW_p= 8223.68421052631
##$SYMM= 0
##$S_DEV= 0
##$TDeff= 65536
##$TDoff= 0
##$TI= <>
##$TILT= no
##$TM1= 0
##$TM2= 0
##$TOPLEV= 0
##$USERP1= <user>
##$USERP2= <user>
##$USERP3= <user>
##$USERP4= <user>
##$USERP5= <user>
##$WDW= 1
##$XDIM= 32768
##$YMAX_p= 463034821
##$YMIN_p= -688566
##$CURPLOT= <Network HP LaserJet P1505>
##$CURPRIN= <$Network HP LaserJet P1505>
##$DFORMAT= <normdp>
##$LAYOUT= <+/1D_H.xwp>
##$LFORMAT= <normlp>
##$PFORMAT= <normpl>
##$SURQMSG= 1
$$ End of Bruker specific parameters
$$ ---------------------------------
##NTUPLES= NMR SPECTRUM
##VAR_NAME=  FREQUENCY,     SPECTRUM/REAL,   SPECTRUM/IMAG
##SYMBOL=    X,             R,               I
##VAR_TYPE=  INDEPENDENT,   DEPENDENT,       DEPENDENT
##VAR_FORM=  AFFN,          ASDF,            ASDF
##VAR_DIM=   32768,         32768,           32768
##UNITS=     HZ,            ARBITRARY UNITS, ARBITRARY UNITS
##FACTOR=    0.250966925370066, 1,           1
##FIRST=     8223.43324360094, -38988,       -70962
##LAST=      0,             69030,           -233052
##MIN=       0,             -688566,         0
##MAX=       8223.43324360094, 463034821,    0
$$ Real data points
##PAGE= N=1
##DATA TABLE= (X++(R..R)), XYDATA
$$ [...]
$$ plain form
19506 1278 -201246 7114 78906 -111812 -111877 -2496 83656 -108045 222599 -35694 -128943 -151514
19494 -151514 82950 -280847 -195666 -37605 -169804 126232 -102109 241077 -36094 -104208
19484 -104208 62807 180518 13622 -248619 -479399 -327054 28530 -122216 -416224 -171746
19473 -7788 -218369 133205 -61604 -191228 199573 -168954 -281438 -87060 -225596 -304049
19463 -304049 -130449 -272597 53588 -14683 -103802 -86880 -115754 -96041 -87406 -159601 -261942
19452 -261942 -171980 81113 -75341 -375985 -330712 -153968 129172 144951 -104049 -8847 168377
19440 -307599 -143994 -102230 27194 128629 -274622 10425 -15933 -93292 270889 -177021
19429 -68081 -364842 -199939 9183 44133 -334671 103248 -199585 -64596 -264440 -86877 276997
$$ packed form
19506A278b01246G114P1792a11812o5b496H3656a08045B22599c5694r3249k2571
19494a51514H2950b80847Q5181c7605j32199A26232a02109B41077c6094o8114
19484a04208F2807J17711A3622b48619k30780J52345B8530a22216k94008a71746
19473g788k10581A33205f1604j29624A99573a68954j12484h7060j38536p8453
19463c04049a30449j42148E3588a4683q9119J6922k8874J9713Q635p2195j02341
19452b61942Q9962H1113g5341l00644M5273a53968A29172J5779a04049h847A68377
19440c07599a43994M1764B7194J01435b74622A0425a5933p7359B70889a77021
19429f8081k96761J64903I183L4950c34671A03248a99585f4596j99844h6877B76997
$$ plain form
19417 86464 -181013 -198664 3192 -571 -355489 -846 53191 -150945 -260290 6217 44183 89406
19405 89406 78211 -281148 15999 -137378 -93797 82660 313886 -375878 125458 137090 -7146
19393 -109644 216434 -171127 18810 -116028 -95782 252818 91732 201981 -191649 -240325
19383 -240325 -287310 -8675 -55585 27966 234309 2818 -86093 -111341 -234913 -124722 278085
19371 28935 316737 177501 33545 -11446 -71918 -379973 37893 -152477 38176 99985 142370
19360 142370 -597981 -97541 83553 -117580 -264336 -149037 80783 35590 -278925 -303743
19350 -303743 -26968 23980 -336388 -111337 7525 -166307 -42114 -358191 165337 192328 73429
19338 -51606 -235022 -377078 -201010 59122 -18324 -85595 301990 -158692 -285282 -2161 43845
$$ packed form
19417H6464a81013j7651C192e71l54918h46E3191a50945j09345F217L7966M5223
19405H9406j1195b81148A5999a37378M3581H2660K31226c75878A25458J1632g146
19393a09644B16434a71127A8810a16028K0246B52818I1732J10249a91649m8676
19383b40325m6985h675m6910B7966K06343B818h6093k5248j23572J10191B78085
19371B8935K87802j39236C3545a1446o0472l08055C7893a52477C8176O1809M2385
19360A42370e97981i7541H3553a17580j46756J15299H0783C5590b78925k4818
19350c03743b6968B3980c36388a11337G525a66307d2114l16077A65337K6991G3429
19338e1606j83416j42056J76068E9122a8324o7271C01990a58692j26590b161D3845
$$ plain form
19326 -128438 -65330 -69278 -205431 -8627 -98790 -13419 52686 -130172 16864 163965 -53971
19314 -344331 -170444 -137048 -122952 -58295 -35902 132235 14660 14174 12907 -482173 -223671
19302 -41697 -110980 -59861 -158948 259500 141960 -192385 582 -195144 -120968 -224170 -270708
19291 -270708 19551 -138607 151248 -65456 108251 -220930 267874 -75648 -252976 169803
19280 -14154 -403331 254160 -16812 125950 -176645 44170 -63504 -232734 -104175 64622
19269 -222121 -85439 33593 -44000 90604 -87075 -28569 -44964 -177839 56098 -326191 -62231
19257 -183458 -328711 -29965 -69317 -70150 -21022 48016 -144773 -27161 -16187 37917 -159825
19245 -115343 211938 -112712 -117414 -230238 182858 -37597 -194428 131620 -350222 45616
$$ packed form
19326a28438O3108l948j36153h627r0163a3419E2686a30172A6864J47101e3971
19314c44331a70444L3396J4096e8295K2393A32235A4660m86j267d82173b23671
19302d1697o9283N1119r9087B59500j17540a92385E82a95144P4176j03202m6538
19291b70708A9551a38607A51248f5456A08251b20930B67874g5648j77328A69803
19280a4154l89177B54160a6812A25950a76645D4170f3504j69230a04175F4622
19269b22121h5439C3593d4000I0604h7075b8569j6395j32875E6098c26191f2231
19257a83458j45253b9965l9352q33b1022D8016a44773b7161J0974C7917a59825
19245a15343B11938a12712m702j12824A82858c7597j56831A31620c50222D5616
$$ plain form
19234 66194 122735 413377 112889 36008 -446377 -166921 -67738 -109747 18191 142192 -38341
19222 4592 72494 -46580 -259619 -184826 220464 -147681 -119987 -220887 254992 142028 8590
19210 276252 -44678 -240905 94111 -142067 -12071 -386138 38625 117537 -80911 -278109 86287
19198 -202447 -27537 58144 234728 -150812 -59614 199902 -300034 -107763 -208569 -51091
19187 -165509 -463654 -220762 -196338 417043 16959 -61690 176807 9619 -188685 18968 -404718
19175 -1834 -78163 198102 350498 -207222 116272 -505167 -100898 4107 -61453 146972 74640
19164 74640 -249953 -199222 132816 376917 77186 -45354 74923 133811 291510 -84405 212824
19152 -10585 -85724 -48720 -63158 32631 220784 -15145 -42703 -397961 53736 -156035 31160
$$ packed form
19234F6194N6541K90642A12889C6008d46377a66921f7738m2009A8191J24001c8341
19222D592O7902d6580k13039P4793B20464a47681K7694j00900B54992j12964H590
19210B76252d4678j96227I4111a42067a2071l74067C8625P8912h0911j97198H6287
19198b02447b7537E8144J76584a50812e9614A99902c00034a07763j00806e1091
19187a65509k98145b20762K4424D17043A6959f1690A76807I619a88685A8968d04718
19175a834p6329A98102J52396b07222A16272e05167a00898D107f1453A46972p2332
19164G4640b49953N0731A32816K44101G7186d5354G4923N8888J57699h4405B12824
19152a0585p5139L7004j4438C2631J88153a5145k7558l55258E3736a56035C1160
$$ plain form
19140 3782 77662 -40090 -37757 -122009 -383528 306 -27866 -114241 -23805 112772 -207713 -82934
19127 121269 -27991 -36385 351217 -17242 218919 60630 -72826 -65469 76223 -455145 -368506
19116 -368506 -63705 -264877 -7146 -243770 120743 -29743 -124008 -84241 98807 -313481 97740
19104 -87534 -112599 -117704 77726 -232719 -119593 -39003 199954 -261497 -8538 -142383 154344
19092 -118255 93954 -144827 168278 70904 -162227 514267 -79925 66035 75882 -126999 -80636
19081 -80636 -299796 175169 -302285 31135 122797 -160436 18521 -75842 60170 61951 193542
19070 193542 -152554 250206 162208 -15011 -39568 -73036 -42088 -267459 -151547 93327 -7211
19058 -317222 -261967 -305528 31207 -206695 -17368 -278842 166726 -196325 94475 -217108
$$ packed form
19140C782P3880d0090K333q4252k61519C06b7866q6375b3805A12772b07713h2934
19127A21269b7991q394C51217a7242B18919F0630g2826P357G6223d55145Q6639
19116c68506f3705k01172g146k36624A20743b9743r4265L9767I8807c13481I7740
19104h7534k5065n105G7726b32719J13126c9003A99954b61497h538j33845A54344
19092a18255I3954a44827A68278G0904a62227E14267g9925F6035R847a26999M6363
19081h0636k19160A75169c02285C1135R1662a60436A8521g5842F0170J781J31591
19070A93542a52554B50206q7998a5011k4557l3468L0948k25371J15912I3327g211
19058c17222N5255m3561C1207b06695a7368k61474A66726a96325I4475b17108
$$ plain form
19047 -283185 -18233 116397 200088 115843 -69358 -194184 -41296 115870 -183466 -69804 -298048
19036 -298048 -35413 -97231 -50490 -63109 38218 167427 149610 176389 111622 106098 93032
19025 93032 -29575 -429384 94280 12128 96544 279901 138211 -63014 -249171 110843 77340
19014 77340 -65833 -114877 -128509 -266982 -133202 -122043 -27204 -78273 112940 -155094 66097
19002 -63533 248768 -54053 -157522 -199066 -157460 -158542 285444 -92275 193482 245772 -179645
18990 -118660 -123265 27301 -79771 20793 338548 -286583 32799 74910 143310 29225 158575
18979 158575 126497 -96584 180960 -129489 -110945 388439 -142263 408047 559540 738203
18969 738203 252110 -113825 -2816 -69775 -81550 70043 230185 -363059 -429250 196658 212753
$$ packed form
19047b83185a8233A16397Q3691q4245f9358j24826d1296A15870a83466f9804k28244
19036b98048c5413o1818M6741j2619C8218J29209j7817K6779o4767n524j3066
19025I3032b9575l99809I4280A2128Q4416J83357A38211f3014j86157A10843l3503
19014G7340f5833m9044j3632j38473a33202J1159b7204n1069A12940a55094F6097
19002f3533B48768e4053j03469m1544M1606j082B85444i2275A93482N2290a79645
18990a18660m605B7301g9771B0793L17755b86583C2799M2111O8400B9225J29350
18979A58575l2078i6584A80960a29489J8544C88439a42263D08047J51493J78663
18969G38203B52110a13825b816o6959j1775G0043J60142c63059o6191A96658J6095
$$ plain form
18958 212753 -51069 23144 -102396 27042 33196 -4522 -80578 34787 64693 171292 -132197
18946 20429 -344707 -71782 282588 185636 -179568 54192 -118956 -172754 -132155 -239797 -212970
18935 -212970 -52056 -41070 -142087 4174 -90100 122262 -48598 -232936 -135887 -283637 41335
18923 -37080 194300 -232563 73228 -465850 112862 -411875 -52406 -55593 -78200 -159958 11668
18911 -44009 -88479 226962 67127 174690 445539 308324 15564 40551 156955 55517 229883
18900 229883 -34350 -195092 66345 44560 -54114 -111638 -135344 -121395 283108 297081 199638
18889 199638 73050 52794 -162281 -188563 -257950 -263023 150595 137009 -71622 114979 98751
18878 98751 -272267 -129453 -49632 21388 -99920 103471 -239857 -64258 -232183 -120075
$$ packed form
18958B12753e1069B3144a02396B7042O154d522p6056C4787K9906J06599a32197
18946B0429c44707g1782B82588r6952a79568E4192a18956n3798M0599j07642K6827
18935b12970e2056J0986j01017D174i0100A22262d8598j84338R7049j47750D1335
18923c7080A94300b32563G3228d65850A12862d11875e2406l187k2607q1758A1668
18911d4009m4470B26962F7127J07563K70849j37215A5564K4987J16404E5517J74366
18900B29883c4350j60742F6345k1785e4114n7524k3706J3949B83108J3973r7443
18889A99638G3050k0256a62281k6282o9387n073A50595j3586g1622A14979j6228
18878I8751b72267a29453d9632B1388i9920A03471b39857f4258j67925J12108
$$ plain form
18868 -120075 -133636 35016 -415052 122823 -266620 -190975 -15479 203839 17167 -79738 -4167
18856 143510 -126822 -274177 13277 -218943 145544 -235790 254833 -258565 -118641 -160331
18846 -160331 -114294 -489858 82983 14503 -44915 -303903 74463 -97504 63685 17028 171813
18835 171813 25563 144768 -26269 87470 91497 -302828 -374153 -219404 -59496 85179 -172463
18823 -143880 184440 -6358 -51014 -60323 -255252 -18392 90405 234183 -331207 -308991 58486
18811 367884 372891 107876 293263 279970 -323270 221108 -65121 -18925 54930 47222 -479776
18799 21526 237314 -410151 194685 103427 208184 -110247 -284306 -54327 -252903 -210774
18789 -210774 40800 -384909 -50893 80312 6846 -29570 16779 -348082 -66906 -197919 106276
$$ packed form
18868a20075j3561C5016d15052A22823b66620P5645a5479B03839A7167g9738d167
18856A43510a26822j47355A3277b18943A45544b35790B54833b58565a18641m1690
18846a60331M6037l75564H2983A4503d4915k58988G4463i7504F3685A7028J54785
18835A71813B5563J19205b6269H7470M027c02828p1325J54749e9496H5179a72463
18823a43880A84440f358m4656r309j94929a8392I0405J43778c31207K2216E8486
18811C67884N007A07876J85387j3293c23270B21108f5121a8925E4930p708d79776
18799B1526K15788d10151A94685r1258J04757a10247j74059e4327j98576M2129
18789b10774D0800c84909e0893H0312F846b9570A6779c48082f6906j31013A06276
$$ plain form
18777 -46973 -131943 -102787 -64620 -99531 -410557 -84959 126599 -187242 -2510 27546 178920
18766 178920 -66877 190014 -70822 -150591 -115738 -146035 126734 -262992 -195234 357144 -26463
18754 149465 -263462 897 129955 -24963 -71375 196604 -68150 89951 4871 170404 110001
18743 110001 235792 -24553 -213470 -330927 -44700 -310663 -8203 432 76631 -38365 -43284
18732 -43284 -142652 -164185 -34880 -14193 279139 -80011 -255047 -318356 -338926 -169117 -128037
18721 -128037 -308993 -22028 -374758 27921 81371 -181768 63554 -98113 -303600 174761
18710 -256657 -81642 -165155 -8718 -54153 122108 -86855 23905 -130680 9292 -52956 156231
18698 -60559 -230842 185878 -60894 -71760 -67606 -138069 120571 -200325 121586 -35594 78698
$$ packed form
18777d6973q4970K9156L8167l4911l11026h4959A26599a87242b510B7546J51374
18766A78920f6877A90014g0822p9769L4853l0297A26734b62992O7758C57144b6463
18754A49465b63462H97J29058b4963m6412A96604f8150H9951D871J65533o0403
18743A10001J25791b4553j88917j17457d4700k65963h203D32P6199c8365m919
18732d3284r9368k1533c4880a4193B79139h0011j75036o3309k0570a69117M1080
18721a28037j80956b2028l52730B7921N3450a81768F3554i8113k05487A74761
18710b56657h1642q3513h718m5435A22108h6855B3905a30680I292e2956A56231
18698f0559j70283A85878f0894j0866M154p0463A20571b00325A21586c5594G8698
$$ plain form
18686 22202 -53484 -151138 -85104 406450 33357 -142076 120765 235196 -103126 310478
18675 -49458 -140058 -318993 -297565 -326463 -222842 -252552 -422017 -17244 -337213 -167039 -93891
18664 -93891 -146860 11187 178789 -46190 -78832 -304077 -358066 -154268 46973 94641 199751
18653 199751 -155758 1490 92554 -9732 171512 147461 -89586 48420 -118921 -296425 -164579
18642 -164579 70631 53715 -237204 -69864 -80948 -253339 53312 -229673 175840 -47843 195322
18630 -154122 -214491 -43635 -547019 67873 141674 -83971 -225414 -27977 -262757 70593 20407
18618 -8466 -248036 -212843 157961 -297652 -170886 75902 208176 16880 -310296 -7218 -245084
18607 -245084 -174749 94962 112986 191742 8813 51204 -26859 -33731 -220938 -86094 -94074 -50094
$$ packed form
18686B2202e3484r7654O6034D06450C3357a42076A20765J14431a03126C10478
18675d9458r0600j78935K1428k8898J03621k9710j69465a7244l19969a67039P3148
18664i3891n2969A1187J67602d6190l2642k25245n3989a54268D6973M7668J05110
18653A99751a55758A490R1064i732A71512k4051h9586D8420a18921j77504J31846
18642a64579G0631j6916b37204f9864j1084j72391E3312b29673A75840d7843A95322
18630a54122o0369d3635n03384F7873P3801h3971j41443b7977k34780G0593B0407
18618h466k39570L5193A57961b97652J26766G5902J32274A6880c10296g218k37866
18607b45084P0335I4962J8024P8756H813M2391b6859o872j87207h6094p980M3980
$$ plain form
18595 -50094 -6087 334158 233904 -175981 -38933 -43525 -114308 -356724 -346694 -284614 145896
18583 -32993 -271587 6587 -329832 -74208 91265 -64827 -137451 -35463 -147230 -105608 -3129
18571 -111900 -68663 -110902 -19746 133502 39893 -247457 -105195 -273332 -190767 74212 216258
18560 216258 -11018 -277428 -33049 63927 -243343 -462740 -129645 -29571 78641 -227957
18549 27174 -54288 302269 -138326 197977 -15929 -67224 -138803 80183 261684 -45756 -168247
18538 -168247 -2258 157268 112612 -9720 -65013 239192 128577 13098 -316659 -168022 -39684
18526 71642 -235745 -353671 -129429 151623 -154573 -183171 -16577 -66201 23598 -119200
18515 -89542 -237166 -341823 -142901 -315203 96388 89725 -136896 -77929 -167781 -46533 -340100
$$ packed form
18595e0094f087C34158j00254a75981c8933m592p0783k42416J0030O2080A45896
18583c2993k38594F587c29832g4208I1265f4827p2624c5463j11767M1622c129
18571a11900M3237m2239a9746A33502C9893b47457a05195j68137Q2565G4212J42046
18560B16258a1018k66410c3049F3927b43343k19397a29645b9571G8641b27957
18549B7174e4288C02269a38326A97977a5929n1295p1579H0183J81501d5756j22491
18538a68247b258A57268m4656i720n5293B39192j10615A3098c16659J48637c9684
18526G1642b35745j17926a29429A51623a54573k8598a6577m9624B3598a19200
18515h9542j47624j04657a42901j72302I6388o663a36896N8967q9852d6533k93567
$$ plain form
18504 -340100 -151390 -93062 -103440 -19118 -182063 -201551 70615 -200400 -339122 -134397
18493 -253595 -19842 -298640 190515 50901 12141 85910 43315 207429 -2401 -316598 52804
18481 -86590 78746 75235 255269 -67509 -23932 -105768 -63256 -99962 -70822 171422 -213029
18469 -177955 -24637 222152 65674 29231 -147198 141435 -65392 -118876 36037 238259 33013
18457 65475 -326962 115895 188763 60894 -181795 -371065 99648 -30491 -77163 -323011 -22732
18445 -81642 -70225 -267912 -38746 -40877 95700 -232208 -283495 -89680 -80346 66186 -179471
18433 -70994 -328045 3276 96781 -49160 -126343 152155 51608 176900 -383682 282227 -205193
18421 -207693 188586 120704 -367357 28928 108837 -170502 167764 -43980 12610 -139899
$$ packed form
18504c40100a51390N8328j0378a9118j62945j9488G0615b00400j38722a34397
18493b53595a9842k78798A90515E0901A2141P3769m2595J64114b401l14197E2804
18481h6590G8746l511J80034f7509b3932q1836M2512l6706K9140A71422b13029
18469a77955b4637B22152F5674B9231a47198A41435f5392n3484C6037K02222C3013
18457F5475c26962A15895P2868F0894a81795j89270I9648c0491m6672k45848b2732
18445h1642J1417j97687c8746k131I5700b32208n1287h9680R334F6186a79471
18433g0994k57051C276R3505d9160p7183A52155E1608J25292c83682B82227b05193
18421b07693A88586o7882c67357B8928P9909a70502A67764d3980A2610a39899
$$ plain form
18410 84734 164623 370190 -179386 -74291 124060 355521 -80935 202121 -200393 1494 205238
18399 205238 119788 -34029 -252546 -106595 106400 -223906 154152 48633 60409 79393
18389 79393 206954 -114509 158259 -52841 -113514 -3606 -233453 65167 44405 80006 29430
18377 -64151 69180 -207331 -158129 9464 -357317 -131538 -241507 -291017 -7976 -48496 147311
18365 -6561 104744 116738 -159907 -187279 192917 52593 151070 -159594 196987 -139353 53528
18353 177863 -108209 -29578 -66593 233550 -38918 -154473 -455943 223430 55771 -34749
18342 -71363 -24015 -300974 -38224 -203859 -169900 -10119 -161724 299350 96721 291758 93670
18330 -40988 -239815 -108808 -184881 -301016 -214199 160609 -31282 14007 150621 -95825 -197241
$$ packed form
18410H4734P9889K05567a79386g4291A24060K31461h0935B02121b00393A494K03744
18399B05238q5450c4029k18517a06595A06400b23906A54152D8633J1776J8984
18389G9393J27561a14509A58259e2841o0673c606k29847F5167k0762L5601B9430
18377f4151F9180b07331M9202I464c57317a31538j09969m9510g976m0520A47311
18365f561A04744J1994a59907k7372A92917E2593R8477a59594A96987a39353E3528
18353A77863a08209b9578l7015B33550c8918j15555l01470B23430E5771c4749
18342g1363b4015k76959c8224j65635L3959a0119j51605B99350I6721J95037I3670
18330d0988j98827a08808p6073j16135Q6817A60609c1282A4007J36614i5825j01416
$$ plain form
18319 -197241 -140806 -256819 -233971 5716 -62303 -198180 -269611 -87719 240272 176687 192369
18308 192369 -21260 -82407 93648 -190722 -187683 29140 -314653 -36303 84442 -235144 -126119
18297 -126119 -6623 -90730 28386 -29044 -159489 181084 -280118 -207153 21346 -75331 23869
18285 271206 77174 84881 -220556 -74112 60657 -208325 20755 40018 237413 204682 -207215
18273 -107604 371961 -133434 374987 162807 -41834 229632 -12456 183832 135962 159130
18263 159130 74144 -129443 -32691 -207958 -189558 -36067 -411373 209774 65779 -183809
18252 -269359 -148138 -156629 229311 -279682 -241900 213468 247615 145067 -266801 -361627
18242 -361627 9642 141076 -153848 141811 16444 -229106 -204884 110977 168824 239079 38631
$$ packed form
18319a97241N6435j16013K2848E716f2303j35877p1431h7719B40272o3585J5682
18308A92369b1260o1147I3648a90722L039B9140c14653c6303H4442b35144J09025
18297a26119f623q4107B8386b9044j30445A81084b80118P2965B1346g5331B3869
18285B71206G7174P707b20556g4112F0657b08325B0755J9263J97395l2731b07215
18273a07604C71961a33434C74987A62807d1834B29632a2456A83832m7870K3168
18263A59130G4144a29443c2691j75267J8400c6067l75306B09774F5779a83809
18252b69359J21221q491B29311b79682L7782B13468L4147j02548b66801r4826
18242c61627I642J31434a53848A41811A6444b29106K4222A10977N7847P0255C8631
$$ plain form
18230 -179792 -45992 161983 -11354 -213183 -97685 -146176 32380 -332042 -39255 -360690 -113314
18218 -349950 -249415 -6471 183809 23300 -283359 -230987 -49980 -55849 -209220 -17935 201984
18206 141411 -38830 -253532 -327060 -293463 -109588 20150 -91982 94428 -104240 44628 135993
18195 135993 -59067 -241351 73015 60820 -60349 254589 -196988 273573 -86723 40143 -143798
18183 165839 -133148 -53550 186125 -209108 -292533 104999 -80639 31143 -93891 105205
18172 -10739 -32529 -18985 -21655 -78585 318453 -283596 -162249 308574 50211 -23515 -69472
18161 -69472 133133 9920 -189434 -216055 -76035 -46177 55148 -178227 138538 205390 43547
18149 -5602 -112277 20788 -300703 15779 -128331 304050 -111201 162292 -271718 -206133
$$ packed form
18230a79792d5992A61983a1354k01829i7685m8491C2380c32042c9255l21435a13314
18218c49950J00535f471A83809B3300b83359N2372d9980n869j53371a7935B01984
18206A41411c8830k14702p3528L3597a09588B0150i1982I4428a04240D4628R1365
18195A35993e9067j82284G3015j2195f0349B54589a96988B73573h6723D0143a43798
18183A65839a33148e3550A86125b09108q3425A04999h0639C1143i3891A05205
18172a0739k1790J3544k670n6930C18453b83596J21347C08574E0211b3515m5957
18161f9472A33133I920a89434k6621g6035K9858E5148a78227A38538O6852D3547
18149e602j06675B0788c00703A5779a28331C04050a11201A62292b71718O5585
$$ plain form
18139 -206133 -15793 -74661 99729 371004 -70467 -265410 -170564 -232484 -302519 491250 -143474
18127 33593 -118462 -10088 30031 -72787 77493 204329 25376 195720 131753 -82154 -60298
18116 -60298 -142618 -110362 -97949 441550 -39423 84659 160023 198763 -63372 -264972 -263543
18105 -263543 518577 -304860 -147699 -139789 -2169 -324806 209630 -222694 28394 -19820 26262
18093 -50937 36397 -180449 243226 7843 255369 -79402 11344 -151128 60056 100406 9887
18081 28498 -66565 45521 11450 336922 199343 -2032 36339 186594 -62724 92796 -87884
18069 -110917 -26251 -110917 169608 -18174 -72695 -38646 -176337 434513 55498 -218878 -122418
18058 -122418 140282 96849 113475 -353079 12242 17246 -125089 -371764 -195591 39924 120442
$$ packed form
18139b06133a5793n8868I9729K71275g0467j94943R4846o1920p0035D91250a43474
18127C3593a18462a0088C0031g2787G7493J26836B5376J70344o3967h2154K1856
18116f0298q2320L2256J2413D41550c9423H4659P5364L8740f3372k01600J429
18105b63543E18577c04860a47699P910b169l22637B09630b22694B8394a9820B6262
18093e0937C6397a80449B43226G843K47526g9402A1344a51128F0056M0350I887
18081B8498f6565D5521A1450L25472j37579b032C6339J50255f2724I2796h7884
18069a10917b6251q4666A69608a8174n4521L4049j37691D34513E5498b18878R6460
18058a22418A40282m3433J6626c53079A2242N004a25089k46675J76173C9924Q0518
$$ plain form
18047 120442 114821 27123 -22564 -216911 94311 -449847 101805 177950 36937 -236076 -189107
18036 -189107 8574 216230 -169862 6614 -76628 -215701 -106049 193069 76034 86497 -412003
18024 -150570 308822 151082 107804 -206440 163874 -107625 -179226 247757 -5755 283969
18013 211723 -435104 179214 272291 108609 -207246 291398 59995 -22159 93050 170513
18003 170513 -349769 367254 -80850 95389 240044 -126622 45414 39429 -273860 291732
17992 -53782 36624 -141198 -238077 141088 -27594 -10677 -76662 297789 -66568 71968 -206469
17980 -180541 229759 72179 -241086 80055 -57864 1450 6451 -78922 123792 -335868 77547
17968 263514 71797 -334404 33764 -126690 -22382 241696 -421699 -235411 -139797 139193
$$ packed form
18047A20442n621B7123b2564j94347I4311d49847A01805P6145C6937b36076M6969
18036a89107H574K07656a69862F614g6628j39073a06049A93069G6034J0463d12003
18024a50570C08822A51082m3278b06440A63874a07625p1601B47757e755B83969
18013B11723d35104A79214R3077A08609b07246B91398E9995b2159I3050P7463
18003A70513c49769C67254h0850I5389J44655a26622D5414n985b73860B91732
17992e3782C6624a41198r6879A41088b7594a0677o5985B97789f6568G1968b06469
17980a80541B29759G2179b41086H0055e7864A450N001g8922A23792c35868G7547
17968B63514G1797c34404C3764a26690b2382B41696d21699J86288R5614A39193
$$ plain form
17957 45100 -231003 -351288 55048 244207 110193 -149828 -705 -405172 236131 -222421
17946 251528 -149894 -166174 -13719 -198955 26138 -222253 72152 83695 -85395 -182836 -230354
17935 -230354 227711 13087 -121415 70407 281013 232538 402154 71403 31218 80616 -40992
17923 -230336 -37245 302189 191917 -5593 -135701 202309 70273 556725 -184530 -234421
17913 -234421 206955 -278808 174556 21966 -92957 189859 27122 -157587 -160080 -51890 -120942
17902 -120942 244772 116423 67067 -159232 149829 -168168 170629 -33113 -219390 83060
17891 -121693 460914 -235198 -142324 76795 265410 124891 234490 370608 -463083 130653
17880 -37063 69572 -167853 88475 -307886 29377 20318 299776 -135560 -180009 88837 82523
$$ packed form
17957D5100b31003j20285E5048J89159A10193a49828g05m04467B36131b22421
17946B51528a49894j6280a3719j85236B6138b22253G2152J1543h5395r7441m7518
17935b30354B27711A3087a21415G0407K10606m8475J69616G1403C1218M9398d0992
17923b30336c7245C02189j10272e593j30108B02309G0273M86452a84530m9891
17913b34421B06955b78808A74556B1966i2957A89859B7122a57587k493e1890o9052
17902a20942B44772A16423m9356a59232A49829a68168A70629c3113j86277H3060
17891a21693D60914b35198R2874G6795J88615A24891J09599J36118d63083A30653
17880c7063F9572a67853H8475c07886B9377r059K79458a35560m4449H8837o314
$$ plain form
17869 82523 -208692 138881 368386 17899 -124857 116896 -133435 111124 -254198 1400
17858 57328 -226873 89829 94761 -117968 -66052 -100860 -121478 -107484 44355 -195722 33804
17846 243090 84268 21175 206204 16640 -119998 -116164 -148391 86479 269420 -76727 87489
17834 79695 284176 77318 18365 -7515 229106 -227740 120847 36668 225196 328725 116648
17822 -87437 -125109 30052 -120302 -30365 -10253 -37615 63403 26189 -54899 -222870 128326
17810 32800 -88103 -204438 18154 -52759 -160219 343779 600621 123581 209479 269306 -102228
17798 -57254 239569 58781 -49008 32062 -181765 96123 -87543 180210 -56241 134461 -10094
17786 -253511 254823 169367 48045 110402 -282750 94881 238711 82563 169993 -203062 -185126
$$ packed form
17869H2523b08692A38881K29505A7899a24857A16896a33435A11124b54198A400
17858E7328b26873H9829M932a17968N1916l4808k0618J3994D4355a95722C3804
17846B43090H4268B1175J85029A6640a19998L834l2227H6479J82941g6727H7489
17834G9695K04481G7318A8365g515B29106b27740A20847C6668J88528J03529A16648
17822h7437l7672C0052a20302c0365a0253k7362F3403B6189e4899j67971A28326
17810C2800h8103j16335A8154e2759j07460C43779K56842A23581Q5898N9827a02228
17798e7254B39569E8781d9008C2062a81765I6123h7543A80210e6241A34461a0094
17786b53511B54823q5456D8045O2357b82750I4881J43830H2563Q7430b03062J7936
$$ plain form
17775 -185126 91299 -77603 58169 103084 178273 56347 69565 100993 66138 43428 94232
17764 94232 -174110 57067 218421 106901 325012 10172 64361 -127875 -106611 232046
17753 -411580 -250666 143136 187025 255874 -17172 266051 -52849 262343 -21692 -18409 127983
17741 277395 417146 -144324 117776 -140014 244532 331901 130619 116320 204137 -224230
17730 34341 171959 4631 -7769 -266130 275271 141803 -146527 -386329 -127711 188473
17719 150683 -92029 80074 57766 -92847 170434 14045 -248133 11401 44126 390358 -198140
17707 220293 18806 -360 -157531 104466 27906 53939 232854 174993 259583 -88479 -15423
17695 265448 112595 116145 29335 -4769 -56901 122323 -131883 115184 -108239 -304747 337665
$$ packed form
17775a85126I1299g7603E8169M4915P5189E6347J3218L1428l4855k2710N0804
17764I4232a74110E7067J61354A06901K18111A0172N4189a27875K1264B32046
17753d11580J60914A43136M3889O8849a7172B66051e2849B62343b1692L283A27983
17741B77395J39751a44324A17776a40014B44532Q7369A30619j4299Q7817b24230
17730C4341J37618D631g769k58361B75271j33468a46527k39802a27711A88473
17719A50683i2029H0074k2308i2847A70434A4045b48133A1401L2725L46232a98140
17707B20293A8806c60j57171A04466B7906K6033J78915n7861Q4590h8479a5423
17695B65448A12595L550B9335d769n2132A22323a31883A15184a08239j96508C37665
$$ plain form
17683 363605 -51118 169115 159528 381096 128840 -426988 38310 22693 -174205 -390733
17673 -390733 -209604 -109744 164330 238207 339039 -72759 177258 258551 4653 256011 -3733
17661 110378 -97413 125832 -85364 265538 94047 141812 -233641 302344 230573 94382 337855
17650 337855 -38093 18303 195464 73531 -37295 117192 218520 659 139049 -348625 123602
17638 141113 167004 -28934 -139075 -241180 130926 273432 172059 249722 83264 -58708
17627 -173031 72962 278261 -16058 -200378 -126569 266709 120410 132497 80774 -275969
17616 -32557 42490 50025 122737 -46136 -92763 81918 162890 33662 102306 123038 285030 76304
17603 126498 71431 198489 226966 251028 72506 -208358 37835 159114 117888 319231 -130878
$$ packed form
17683C63605e1118A69115r587K21568A28840d26988C8310j5617a74205k16528
17673c90733J81129R9860A64330P3877J00832g2759A77258Q1293D653K51358c733
17661A10378i7413A25832h5364B65538I4047M7765b33641C02344p1771I4382K43473
17650C37855c8093A8303J77161G3531c7295A17192J01328F59J38390c48625A23602
17638A41113K5891b8934j10141j02105A30926J42506j01373P7663H3264e8708
17627a73031G2962K05299a6058j84320P3809B66709A20410J2087n1723b75969
17616c2557D2490P535P2712d6136m6627H1918Q0972C3662O8644K0732J61992G6304
17603A26498n5067J27058K8477K4062G2506b08358C7835J21279m1226K01343a30878
$$ plain form
17591 154047 187258 -143933 504822 203994 319936 268161 192780 -48474 120324 -207430
17580 193968 -89347 132998 65528 267149 392845 56417 55266 139205 -150827 376435 38936
17568 -169151 190275 -101097 142080 52225 246655 174412 11774 -320603 -45228 235964
17557 -7778 152907 26945 417500 -1085 323023 136690 197882 231867 74743 151635 450394
17546 450394 89874 133448 247513 96247 623986 571964 66589 40096 249209 -299205 274629
17534 292900 427773 117307 304419 421300 194957 152155 386416 337928 97339 167770
17524 167770 284404 832263 648798 1070914 902699 213837 377369 236461 260770 256203
17514 256203 21656 159160 297530 290617 284025 576673 680813 744178 886698 782390 625836
$$ packed form
17591A54047L3211a43933E04822B03994J15942n1775p5381d8474A20324b07430
17580A93968h9347A32998F5528K01621J25696E6417j151Q3939a50827C76435C8936
17568a69151A90275a01097A42080E2225J94430p2243A1774c20603d5228B35964
17557g778A52907B6945L90555a085C23023A36690O1192L3985G4743P6892K98759
17546D50394H9874M3574J14065I6247N27739n2022F6589k6493K09113b99205B74629
17534B92900J34873A17307J87112J16881A94957m2802K34261m8488I7339P0431
17524A67770J16634N47859j83465M22116j68215B13837J63532j40908K4309m567
17514B56203B1656J37504J38370o913o592K92648J04140O3365J42520j04308j56554
$$ plain form
17503 625836 542865 222418 63460 78024 219020 436739 94615 1696 333075 -144476 2773
17491 131520 267320 265365 290979 279264 13831 346451 -85388 254734 221000 38862 256800
17480 256800 203087 254349 361502 182800 75469 44714 326233 236341 256114 88362 346637
17469 346637 270802 223939 81532 -97660 343923 129483 73616 179860 80317 416498 136943
17457 78638 604992 194433 341467 116246 23402 268730 69755 570547 423464 193112
17446 472002 346648 291009 296667 415437 257003 522347 107744 283353 43375 -219205
17435 306202 206751 452687 253502 379638 286849 539434 303814 10283 292959 720154
17425 720154 247573 -112757 303787 99174 245581 91492 359425 143369 644225 273113
$$ packed form
17503F25836q2971B22418F3460J4564J40996K17719I4615A696L31379a44476B773
17491A31520J35800j955K5614j1715A3831L32620h5388B54734l3734C8862K17938
17480B56800n3713N1262J07153j78702G5469l0755K81519q9892J9773H8362K58275
17469C46637p5835m6863H1532i7660C43923A29483n5867J06244H0317L36181A36943
17457G8638N26354A94433J47034A16246B3402K45328F9755N00792j47083A93112
17446D72002j25354n5639N658J18770j58434K65344A07744J75609D3375b19205
17435C06202r9451K45936j99185J26136r2789K52585k35620A0283K82676M27195
17425G20154B47573a12757C03787I9174J46407I1492K67933A43369N00856B73113
$$ plain form
17414 496811 279564 414118 309713 403008 21290 372898 246251 326368 6046 117077
17404 117077 -37013 104087 119693 465094 350246 109400 165961 138643 265290 300958
17394 300958 150411 410409 463495 284694 189393 479470 222745 225697 246206 163397 -7654
17382 254381 413368 295438 205997 288797 108046 536586 166975 52724 279054 176948
17372 176948 307667 32531 170830 211859 363437 -48575 76064 408233 272569 -23259
17361 10388 220786 185719 211594 56109 -96341 -66413 405472 364847 241683 254280 66978
17349 -177955 376037 148540 35836 463669 244851 45429 142162 357508 395379 634216
17339 634216 100665 440926 237440 198958 -97764 83616 183126 332810 343617 160974
$$ packed form
17414D96811k17247J34554j04405R3295B1290L51608j26647Q0117F046J11031
17404A17077c7013A04087J5606L45401j14848A09400N6561k7318J26647L5668
17394C00958A50411K59998N3086j78801r5301K90077B22745K952K0509q2809g654
17382B54381J58987j17930q9441Q2800A08046M28540A66975E2724K26330j02106
17372A76948J30719C2531J38299M1029J51578d8575G6064L32169j35664b3259
17361A0388K10398l5067K5875E6109i6341K9928D05472m0625j23164J2597F6978
17349a77955C76037A48540C5836M27833k18818D5429R6733K15346L7871K38837
17339F34216A00665L40261k03486l8482i7764H3616R9510J49684J0807A60974
$$ plain form
17328 100643 25018 236628 427556 84602 153363 66789 163844 80589 -58941 102184 97643
17317 97643 17741 302822 284173 131024 -25171 151166 -185148 101246 186220 160290 91377
17306 91377 114449 114481 171619 45351 214005 35295 467425 234800 32367 272498 379458
17295 379458 659727 -112999 324035 254555 117264 240929 482898 406796 108976 260502
17285 260502 92429 583258 -27933 384671 287778 297187 215935 311629 224095 153546 202225
17274 202225 8647 413798 174732 200260 93729 160425 -80639 338178 40563 394313 48845
17262 265365 266908 489062 515178 65473 263861 422748 217963 458238 261776 380870
17252 380870 99398 540645 298057 422073 216438 36266 546803 -173786 -42989 103556
$$ packed form
17328A00643B5018K11610J90928H4602O8761F6789R7055H0589e8941A02184m541
17317I7643A7741K85081j8649A31024b5171A51166a85148A01246Q4974k5930o8913
17306I1377K3072L2N7138D5351J68654C5295M32130k32625C2367K40131J06960
17295C79458K80269a12999C24035o9480A17264J23665K41969p6102A08976J51526
17285B60502I2429M90829b7933C84671r6893R409q1252R5694q7534p0549M8679
17274B02225H647M05151A74732K5528I3729O6696h0639C38178D0563L53750D8845
17262B65365J543K22154K6116F5473J98388J58887k04785K40275j96462J19094
17252C80870I9398M41247k42588J24016k05635C6266N10537a73786d2989A03556
$$ plain form
17241 209559 216189 357045 438509 273484 179891 281996 483510 81660 268256 527009
17231 527009 508040 -9137 -15061 86623 531798 223420 471734 393431 400991 535263 349853
17220 349853 186415 -86749 330884 303495 400965 545994 596350 244296 537477 509344
17210 509344 390295 449790 246910 94579 327504 202756 335725 510938 399370 371342
17200 371342 117674 35907 386979 384345 152390 832555 257391 10037 460309 64856
17189 349421 360686 286845 421986 152181 311197 536665 264182 494796 770277 -30709
17178 438534 422152 267121 201221 74195 442660 591803 630715 242957 100652 606720
17168 606720 312993 230231 339614 524186 281945 576200 515179 429090 584316 238670
$$ packed form
17241B09559O630J40856Q1464j65025r3593J02105K01514H1660J86596K58753
17231E27009j8969i137n924H6623M45175B23420K48314p8303P560J34272j85410
17220C49853j63438h6749C30884k7389R7470J45029N0356B44296K93181k8133
17210E09344j19049N9495k02880I4579K32925j24748J32969J75213j11568k8028
17200C71342A17674C5907L51072k634A52390O80165B57391A0037M50272F4856
17189C49421J1265p3841J35141A52181J59016K25468B64182K30614K75481c0709
17178D38534j6382j55031o5900G4195L68465J49143L8912B42957A00652N06068
17168F06720k93727q2762J09383J84572k42241K94255o1021q6089J55226B38670
$$ plain form
17157 279804 438427 449814 397135 253780 569756 638629 358608 454464 506638 275230
17147 275230 553759 195468 415540 540634 339836 318453 142670 522284 955110 228442
17136 590477 381023 344990 321958 167314 236942 533494 214595 533628 239344 392994
17126 392994 393112 235096 471221 261548 747327 628675 451579 309474 561106 400669
17116 400669 544376 655330 515462 788965 305253 542758 416220 374758 152839 521338
17106 521338 577441 379732 735284 394004 433198 689073 424684 348000 552797 402317
17096 402317 574274 770055 762579 459421 580590 637741 533781 748618 630726 484076
17086 484076 665880 364069 700235 824318 424996 395534 416411 747021 730575 713732
$$ packed form
17157B79804J58623J1387n2679j43355L15976O8873k80021R5856N2174k31408
17147B75230K78529A95468K20072J25094k00798k1383A42670L79614M32826B28442
17136E90477k09454l6033k3032j54644O9628K96552B14595L19033B39344J53650
17126C92994J18j58016K36125k09673M85779j18652j77096j42105K51632j60437
17116D00669J43707J10954j39868K73503C05253K37505j26538m1462A52839L68499
17106E21338N6103j97709L55552l41280L9194K55875k64389p6684K04797j50480
17096D02317J71957J95781p476l03158J21169N7151j03960K14837j17892j46650
17086D84076J81804l01811L36166J24083l99322k9462K0877L30610j6446j6843
$$ plain form
17076 713732 686641 303272 745217 442025 594937 669365 650013 273805 736455 392708
17066 392708 785529 562133 462532 139015 527149 793295 383429 810266 387516 629724
17056 629724 515612 610009 574668 982792 544595 784737 624579 741661 715472 626936
17046 626936 561847 524892 816024 780242 879431 808300 715168 854321 1088194 1113191 614582
17035 614582 855886 892077 771741 637889 661166 610306 674990 747623 1150307 757763
17025 757763 984787 966050 770562 769196 853873 1104236 937226 603116 887737 741389
17015 741389 1092013 933117 959272 773562 822101 837994 870887 965381 977030 878705 668825
17004 668825 859270 767970 1116186 973599 1001895 854221 898812 975952 938519 790644
$$ packed form
17076G13732k7091C03272M41945l03192J52912P4428j9352B73805M62650l43747
17066C92708L92821k23396r9601A39015L88134K66146C83429M26837C87516K42208
17056F29724j14112R4397l5341M08124m38197K40142j60158J17082k6189q8536
17046F26936o5089l6955K91132l5782R9189p1131r3132J39153K33873K4997m98609
17035F14582K41304L6191j20336j33852K3277n0860O4684P2633M02684l92544
17025G57763K27024j8737j95488j366Q4677K50363j67010l34110K84621j46348
17015G41389L50624j58896K6155j85710M8539J5893L2893R4494J1649r8325k09880
17004F68825J90445r1300L48216j42587K8296j47674M4591P7140l7433j47875
$$ plain form
16994 790644 1083818 1018542 1328268 812011 1099986 836340 1083845 1432078 1215555 1010340
16984 1010340 644368 1053775 1254602 1184870 1060787 1256855 1007379 1180998 912130 1062154
16974 1062154 1303530 1148317 868778 1253601 732609 1310989 1389578 1091163 1383093 1114810
16964 1114810 1073221 1219260 1307229 1332618 1136064 1206688 1651209 1082950 1351264 1401541
16954 1401541 1241737 1251193 1386574 1483207 1235291 1422784 1462765 1587840 1300763 1497213
16944 1497213 1558739 1299600 1445738 1520007 1627322 1571120 1296735 1596556 1432521 1491645
16934 1491645 1303553 1808598 1503696 1427198 1630550 1492408 1844865 1599965 1966677 1699761
16924 1699761 1540325 1928515 1946863 1940658 1982644 1629822 1726216 1898261 2126295 2006630
$$ packed form
16994G90644K93174o5276L09726n16257K87975k63646K47505L48233k16523k05215
16984A010340l65972M09407K00827o9732j24083J96068k49476J73619k68868J50024
16974A062154K41376j55213k79539L84823n20992N78380P8589k98415K91930k68283
16964A114810m1589J46039Q7969K5389j96554P0624M44521n68259K68314N0277
16954A401541j59804R456J35381R6633k47916J87493L9981J25075k87077J96450
16944A497213O1526k59139J46138P4269J07315n6202k74385K99821j64035N9124
16934A491645j88092N05045l04902p6498K03352j38142L52457k44900L66712k66916
16924A699761j59436L88190J8348o205M1986l52822R6394J72045K28034j19665
$$ plain form
16914 2006630 1578517 1959768 1321122 2263793 2139626 2296324 2047275 1936278 2187227
16905 2187227 2317209 2182916 2192906 2138823 2046782 2071653 2046573 2082773 2231091 2401556 2382127
16894 2382127 2469638 2526341 2459747 2572650 2784899 2390563 2605241 2382800 2775623 2756157
16884 2756157 2764637 2748441 2717763 3083702 2939537 2940859 3030918 2882957 3012986 3029725 2742989
16873 2742989 2764853 3253618 3131584 3356927 3569718 3197384 3352397 3227403 3361650 3395312
16863 3395312 3266728 3478430 3570787 3525679 3537719 3733723 3584681 3846590 4266869 4135779
16853 4135779 4160650 4158001 4283392 4395102 4078092 4239194 4380458 4376774 4570479 4484977
16843 4484977 4791426 4701035 5010520 5096963 4963236 4994849 5540530 5019019 5381790 5480247
$$ packed form
16914B006630m28113L81251o38646R42671j24167J56698k49049j10997K50949
16905B187227J29982j34293R990n4083r2041K4871k5080L6200J48318J70465j9429
16894B382127Q7511N6703o6594J12903K12249l94336K14678k22441L92823j9466
16884B756157Q480j6196l0678L65939j44165J322R0059j47961J30029J6739k86736
16873B742989K1864M88765j22034K25343K12791l72334J55013j24994J34247L3662
16863C395312j28584K11702R2357m5108J2040J96004j49042K61909M20279j31090
16853D135779K4871k649J25391J11710l17010J61102J41264l684J93705q5502
16843D484977L06449r0391L09485Q6443j33727L1613N45681n21511L62771R8457
$$ plain form
16833 5480247 5696144 5655997 5712466 5736510 5727336 5818107 6230084 6028312 6300121 6590855
16823 6590855 6094947 6490335 6815422 7036221 7093011 7208277 7411972 7691998 7419163 8024174
16813 8024174 8000202 7858870 8187523 8323658 8483229 8714551 8171773 9219144 9314713 9529962
16803 9529962 9807690 9993219 9997907 10325190 10497827 10765406 11057272 11604034 11592470 11735407
16793 11735407 11838811 12959795 12931016 13707182 13476353 13947428 14359993 14990703 15152384
16784 15152384 15574225 15612748 16433182 16754925 17306159 17479154 18279059 18977514 19390324
16775 19390324 19899011 20383118 20889408 22309715 22450730 23131518 24241707 24936842 25657717
16766 25657717 26591296 27350947 28370250 29407789 30243207 31483655 32634417 33850018
$$ packed form
16833E480247K15897m0147N6469K4044r174R0771M11977k01772K71809K90734
16823F590855m95908L95388L25087K20799N6790J15266K03695K80026k72835O05011
16813H024174k3972j41332L28653J36135J59571K31322n42778J047371R5569K15249
16803I529962K77728J85529M688L27283J72637K67579K91866N46762j1564J42937
16793A1735407J03404J120984k8779P76166k30829M71075M12565O30710J61681
16784A5152384M21841L8523Q20434L21743N51234J72995P99905O98455M12810
16775A9390324N08687M84107N06290J420307J41015O80788J110189O95135P20875
16766B5657717R33579P59651J019303J037539Q35418J240448J150762J215601
$$ plain form
16758 33850018 35474243 36839581 38140571 39397189 40879339 42807968 44509652 46220862
16750 46220862 47732835 49876872 51656269 54010958 56652525 59111468 61538758 64014434
16742 64014434 66488356 69772847 72527585 75749611 78871460 81984521 85637575 88845841
16734 88845841 92267990 96009325 99624473 102929533 106372634 110010875 113027938 116004724
16726 116004724 118838995 121439207 123919838 125864902 127245140 128737047 129478501 129386857
16718 129386857 129380695 128886576 127791490 126316087 124630005 122606852 120225972 116967075
16710 116967075 114194522 111175369 107659881 104073883 100763953 97405877 93497529 89891394
16702 89891394 86617846 83360332 80114662 76675708 73175223 70722320 67373032 64861952
$$ packed form
16758C3850018J624225J365338J300990J256618J482150J928629J701684J711210
16750D6220862J511973K144037J779397K354689K641567K458943K427290K475676
16742F4014434K473922L284491K754738L222026L121849L113061L653054L208266
16734H8845841L422149L741335L615148L305060L443101L638241L017063K976786
16726A16004724K834271K600212K480631J945064J380238J491907P41454r1644
16718A29386857o162m94119j095086j475403j686082k023153k380880l258897
16710A16967075k772553l019153l515488l585998l309930l358076l908348l606135
16702H9891394l273548l257514l245670l438954l500485k452903l349288k511080
$$ plain form
16694 64861952 61836235 59531692 57049277 54857591 52206288 49773929 48296344 46395134
16686 46395134 44246758 42667311 41025850 39612842 37901836 36287088 35082797 33608594
16678 33608594 32582177 31401122 30261230 28934836 28475849 27149384 26031796 25174985
16670 25174985 24588245 23732172 23019039 21829164 21642474 20933512 20242525 19611058 19076846
16661 19076846 18321629 17800404 17410066 16864104 16263494 15681601 15591228 15427054 14360706
16652 14360706 14210141 14250560 13748807 13240219 12798497 12327442 11683044 11883599 11453076
16643 11453076 11211392 11058984 10688501 10491454 10173817 9960615 9932520 9871956 9630645 9064223
16633 9064223 8870190 9074828 8873494 8426029 8479277 8229908 7755391 7944391 7728628 7406522
$$ packed form
16694F4861952l025717k304543k482415k191686k651303k432359j477585j901210
16686D6395134k148376j579447j641461j413008j711006j614748j204291j474203
16678C3608594j026417j181055j139892j326394m58987j326465j117588q56811
16670B5174985n86740q56073p13133j189875j86690p08962o90987o31467n34212
16661A9076846p55217n21225l90338n45962o00610n81893r0373j64174j066348
16652A4360706j50565M0419n01753n08588m41722m71055o44398K00555m30523
16643A1453076k41684j52408l70483j97047l17637k13202k8095o0564k41311n66422
16633I064223j94033K04638k01334m47465N3248k49369m74517J89000k15763l22106
$$ plain form
16623 7406522 7292942 7088705 6913665 6918014 6674200 6538170 6768879 6310955 6150962 6205623
16613 6205623 6083784 5952662 5803480 5857180 5436646 5553004 5649349 5263144 5295899 4971767
16603 4971767 5203866 4827151 4884694 4558485 4615721 4613117 4564795 4181275 4386577 4451900
16593 4451900 4330903 3981722 3845234 3935059 4108197 3803548 3907377 3912766 3845406 3655362
16583 3655362 3425712 3447656 3413499 3486421 3473845 3048784 3281619 3340375 3317531 3331420 3390643
16572 3390643 2813621 2929430 3143729 3216934 3185677 2848477 2780048 2745533 2672804 2862673
16562 2862673 2314966 2094704 2593857 3106189 2502724 2509828 2695547 2693651 2373861 2476753
16552 2476753 2585667 2466103 2106653 2178010 2037575 2155951 2473803 2412671 2160630 2439284
$$ packed form
16623G406522j13580k04237j75040M349k43814j36030K30709m57924j59993N4661
16613F205623j21839j31122j49182N3700m20534J16358R6345l86205L2755l24132
16603D971767K32099l76715N7543l26209N7236k604m8322l83520K05302O5323
16593D451900j20997l49181j36488Q9825J73138l04649J03829N389o7360j90044
16583C655362k29650K1944l4157P2922j2576m25061K32835N8756k2844J3889N9223
16572C390643n77022J15809K14299P3205l1257l37200o8429l4515p2729J89869
16562B862673n47707k20262M99153N12332o03465P104J85719j896l19790J02892
16552B476753J08914j19564l59450P1357j40435J18376L17852o1132k52041K78654
$$ plain form
16542 2439284 2061489 1934609 2195859 1916983 2176629 1959022 1971631 2035555 2221075 1958948
16532 1958948 2107645 1750573 1845491 1660996 1868204 1457334 1797529 1651261 1884728 1592471
16522 1592471 1886276 1438013 1316740 1586017 1940605 1469964 1436427 1628796 1872745 1450823
16512 1450823 1471825 1511931 1346400 1582575 1511246 1567912 1415609 1481048 1108970 1269320
16502 1269320 1496366 1328707 1598527 1348339 1361943 1386302 1302705 1306366 1372535 1166620
16492 1166620 1547749 1304283 1297346 1273408 1109253 1145878 1201893 1235606 1038799 969661 1116043
16481 1116043 736300 1287696 1203801 1123464 1327815 1458554 1370907 1190993 1110460 1109824 1044880
16470 1044880 1035403 1204550 1071194 971852 1074323 1274544 1153795 896525 1096628 1143678
$$ packed form
16542B439284l77795j26880K61250k78876K59646k17607J2609O3924J85520k62127
16532A958948J48697l57072R4918j84495K07208m10870L40195j46268K33467k92257
16522A592471K93805m48263j21273K69277L54588m70641l3537J92369K43949m21922
16512A450823K1002M0106j65531K36175p1329N6666j52303O5439l72078J60350
16502A269320K27046j67659K69820k50188J3604K4359q3597L661O6169k05915
16492A166620L81129k43466o937k3938j64155L6625N6015L3713j96807o9138J46382
16481A116043l79743N51396q3895q0337K04351J30739q7647j79914q0533o36o4944
16470A044880r477J69147j33356r9342J02471K00221j20749k57270K00103M7050
$$ plain form
16460 1143678 1127228 890914 1328455 1025141 800017 1055192 1009032 1189731 727424 933595
16450 933595 776572 1443549 532532 1004204 981761 899216 1091876 1336705 1010435 894908
16440 894908 990879 1018273 765060 1215371 1043014 1204607 781011 666862 1092054 773391
16430 773391 677655 841107 933323 1170189 544880 752041 875111 1082791 886097 587687
16420 587687 537308 1009222 731605 436788 753804 1006659 650137 918183 717767 823790
16410 823790 693011 929055 844857 495187 595630 676190 811198 792159 743146 673991
16400 673991 645052 1239793 414468 486691 591517 663301 822139 883826 832148 631767
16390 631767 797729 762486 631288 753774 785773 1118517 378057 433572 755131 364839
$$ packed form
16460A143678j6450k36314M37541l03314k25124K55175m6160J80699m62307K06171
16450I33595j57023O66977E32532M71672k2443q2545J92660K44829l26270j15527
16440H94908R5971K7394k53213M50311j72357J61593m23596j14149M25192l18663
16430G73391r5736J63452R2216K36866E44880K07161J23070K07680j96694k98410
16420E87687n0379M71914k77617k94817L17016K52855l56522K68046k00416J06023
16410H23790j30779K36044q4198l49670J00443Q0560J35008j9039m9013o9155
16400F73991k8939N94741D14468P2223J04826P1784J58838O1687n1678k00381
16390F31767J65962l5243j31198J22486L1999L32744C78057N5515L21559C64839
$$ plain form
16379 675617 474632 564120 775857 411248 571537 359128 448506 301633 563333 375705
16369 375705 831974 548928 426709 311460 331618 385965 916637 366743 364425 663473
16359 663473 688166 522735 174834 520257 257523 547964 727491 656246 195299 473871
16349 473871 535137 370793 446634 502939 429441 556481 569260 689118 125308 544286
16339 544286 471998 496509 291662 465956 326017 395650 376686 223492 722029 413927
16329 413927 392793 408095 671189 264228 520376 645422 568583 609939 421083 119631
16318 340486 598233 326136 264405 421678 354262 682369 371816 297622 403151 313504
16308 313504 253877 653909 96412 424957 352584 435503 257008 265961 458670 427424 380262
$$ packed form
16379F75617k00985Q9488K11737l64609J60289k12409Q9378j46873K61700j87628
16369C75705M56269k83046j22219j15249K0158N4347N30672C66743k318K99048
16359F63473K4693j65431A74834L45423B57523K90441J79527p1245A95299K78572
16349D73871O1266j64344P5841N6305p3498J27040J2779J19858A25308M18978
16339E44286p2288K4511k04847J74294j39939O9633j8964j53194M98537l08102
16329D13927k1134J5302K63094B64228K56148J25046p6839M1356j88856A19631
16318C40486K57747k72097o1731J57273o7416L28107l10553p4194J05529q9647
16308C13504n9627M00032I6412L28545p2373Q2919j78495Q953J92709l1246m7162
$$ plain form
16297 380262 95921 269394 803816 585600 546561 454668 273216 194881 541120 281609
16287 281609 600904 318352 403274 240315 363374 432767 197608 400360 228191 192025
16277 192025 529508 369523 394369 149892 530541 587388 345555 174346 241795 233674
16267 233674 552303 -67396 77818 302908 380472 73237 510708 317246 378664 524002
16257 524002 199419 749756 133142 6996 434484 340465 254096 146840 176098 219202 623345
16246 623345 306189 126195 164931 333088 244775 176697 176736 182936 158150 301561 430265
16235 430265 219942 267814 229523 337895 603127 -53567 238377 208291 519275 416693
16225 416693 230214 -116085 294381 371498 239079 86635 -152125 145051 141520 -36131
$$ packed form
16297C80262I5921J73473N34422k18216l9039r1893j81452p8335L46239k59511
16287B81609L19295k82552Q4922j62959J23059O9393A97608K02752j72169l6166
16277A92025L37483j59985K4846A49892L80649N6847k41833j71209O7449q121
16267B33674L18629f7396G7818K25090P7564G3237M37471j93462O1418J45338
16257E24002A99419N50337A33142F996M27488r4019q6369j07256K9258M3104M04143
16246F23345C06189A26195L8736J68157q8313o8078L9O200k4786J43411J28704
16235D30265k10323M7872l8291J08372K65232e3567B38377l0086L10984j02582
16225D16693j86479a16085B94381P7117j32419H6635a52125A45051l531c6131
$$ plain form
16214 267816 443517 149620 389014 -23065 171884 195780 338811 348533 218378 271857
16204 271857 -104660 295320 354572 362181 301559 -63644 421226 173838 246199 132197 167148
16193 167148 110032 175060 -100204 37358 185371 201424 403126 99422 34515 -60263 310421
16181 110876 37798 -210896 412003 154651 10304 289550 306621 137280 229370 304829
16171 304829 231663 142085 370631 156426 924332 110149 317569 -56215 197446 63921
16160 817 -49666 168422 183826 -64812 98111 321491 -209564 97050 228364 81885 131732
16149 131732 307757 315149 271928 167416 254698 -43337 178598 94729 26400 349952 338989
16138 338989 -106370 11629 142463 -23624 322724 195452 73862 -281086 165644 -51025
$$ packed form
16214B67816J75701A49620K39394b3065A71884K3896J43031R722j30155N3479
16204B71857a04660B95320N9252P609o0622f3644D21226A73838P2361j14002L4951
16193A67148n7116O5028a00204C7358J48013J6053K01702I9422C4515f0263C10421
16181A10876C7798b10896D12003A54651A0304K79246J7071A37280R2090P5459
16171C04829p3166q9578K28546A56426P67906A10149K07420e6215A97446F3921
16160H17d9666A68422J5404f4812I8111K23380b09564I7050J31314H1885M9847
16149A31732J76025P392m3221j04512Q7282d3337A78598q3869B6400L23552j0963
16138C38989a06370A1629J30834b3624C22724j27272G3862b81086A65644e1025
$$ plain form
16127 117470 -8273 32418 -36810 251313 147478 -182356 -47341 152303 6216 -44912 110497
16115 422850 -11769 213079 196631 300602 289534 283413 111591 325321 160795 71474 -33354
16103 163861 285771 -183426 -151164 84438 19553 164482 373658 59273 22063 -189398
16092 129284 173146 83516 23192 290065 63542 327559 -118827 -54948 -15807 -123726 190862
16080 261284 -40598 -19065 214526 305969 -15825 -118150 237345 100164 346781 129373
16069 -192990 53267 -201 390945 554563 157100 -41000 -312335 -105883 -44561 244208 -210848
16057 -159891 186839 -165746 331352 82914 257358 182838 265171 285681 -23218 89508 106655
16046 106655 109057 48451 207249 -176530 -274449 304953 -81487 7042 -24772 -30969 -119150
$$ packed form
16127A17470h273C2418c6810B51313j03835a82356d7341A52303F216d4912A10497
16115D22850a1769B13079j6448J03971j1068o121A11591K13730A60795G1474c3354
16103A63861J21910a83426L2262H4438A9553J44929K09176E9273B2063a89398
16092A29284M3862H3516B3192K66873F3542K64017a18827e4948a5807j07919A90862
16080B61284d0598a9065B14526R1443a5825j02325B37345A00164K46617A29373
16069a92990E3267b01C90945J63618A57100d1000k71335a05883d4561B44208b10848
16057a59891A86839a65746C31352H2914J74444p4520Q2333K0510b3218H9508J7147
16046A06655K402D8451J58798a76530r7919C04953h1487G042b4772o197q8181
$$ plain form
16035 -119150 100902 11879 210753 38290 28800 409518 -18727 152761 -239169 24802 -133493
16023 47283 584 -47994 -107462 39262 219885 219252 -255427 62168 35743 247685 -149020 643855
16010 -229454 -123260 -125112 200478 32786 123221 -66053 186653 53992 -233562 462868 -246764
15998 103324 -114569 -269061 -45638 17378 94398 153851 47956 132299 -183912 124902 202640
15987 202640 207264 977867 1115828 1158463 831525 911544 521367 338063 27157 98911 518289
15976 518289 41091 35735 160953 75574 -109665 -10850 -118398 -47213 -114902 -265669 -48033
15964 166172 149109 55929 -91916 23651 265714 -7616 132659 -94454 -101550 -180609 -240685
15953 -240685 -108442 2887 -80347 -179283 326296 152934 -97834 -27137 -241874 58978 -1920
$$ packed form
16035a19150A00902A1879J98874C8290r490L80718a8727A52761b39169B4802a33493
16023D7283E84d7994n9468C9262J80623o33b55427F2168k6425K11942a49020F43855
16010b29454J06194j852B00478C2786R0435f6053A86653E3992b33562D62868b46764
15998A03324a14569j54492d5638A7378P7020N9453D7956Q4343a83912A24902P7738
15987B02640M624P70603J37961M2635l26938Q0019l90177j83304B7157P1754M19378
15976E18289D1091n356J25218G5574a09665a0850j07548d7213o7689j50767d8033
15964A66172j7063E5929i1916B3651K42063g616A32659i4454p096p9059o0076
15953b40685a08442B887h0347r8936C26296A52934i7834b7137k14737E8978a920
$$ plain form
15941 -194734 19623 -221035 -100045 232752 -257149 -176003 72905 -164462 -46734 -139212
15931 -139212 182894 38579 -169987 8552 154276 -138495 217283 4885 13091 -89236 -176943
15920 -176943 244214 -224679 -28232 -76330 -134224 12459 -197384 69154 -8469 -261029 -83414
15908 -86521 -10268 213356 122297 -37319 42007 150446 -213927 224043 -18237 85461 1033
15896 17773 266717 -13698 209829 -35779 -201230 -17970 13488 28904 -264254 -82912 -140941
15885 -140941 131294 114905 -12036 -177707 146301 8801 113107 148569 92193 -67246 -128307
15874 -128307 -231070 -187650 48027 -49782 -366488 -210837 -149974 -244584 -300617 -43830 279827
15862 -97874 -276651 -8484 -208247 74083 23717 72030 158824 -185246 -93235 -315327 239791
$$ packed form
15941a94734A9623b21035a00045B32752b57149Q1146G2905a64462d6734r2478
15931a39212A82894C8579a69987H552J45724a38495B17283D885Q206h9236q7707
15920a76943B44214b24679b8232m8098n7894A2459a97384F9154h469k52560h3414
15908h6521a0268B13356r1059c7319D2007J08439b13927B24043a8237H5461A033
15896A7773K48944a3698B09829c5779j65451a7970A3488J5416b64254h2912n8029
15885a40941A31294j6389a2036j65671A46301H801J04306L5462n6376f7246o1061
15874a28307j02763M3420D8027d9782l16706J55651O0863r4610n6033d3830B79827
15862i7874j78777h484j99763G4083B3717M8313Q6794a85246R2011k22092B39791
$$ plain form
15850 14128 73653 146690 -35429 -827 -27674 180002 31613 82697 -86517 86272 -70844 73090
15837 161937 -76637 -20890 222609 -116885 84978 -105242 304753 229933 171481 -18425 220556
15825 -314950 47357 66490 75022 -33157 16807 -141186 -83137 -124282 -78713 86076 -229227
15813 -100521 -268089 47999 -87493 366247 -261500 -49474 29194 9964 -45315 -55095 -164184
15802 -164184 -73700 241337 -21187 -129102 -224185 -102482 -132811 -169931 162937 241030 -130156
15790 19399 -143215 -83215 57055 -318303 79152 210337 -402135 41962 32059 155574 -195975
15778 53095 -96474 -217716 -242793 74780 -243613 -373786 332381 -24924 -184567 -356029
15768 -356029 22559 116664 -190451 -338 12171 145155 56607 121668 -173549 -119926 -4242
$$ packed form
15850A4128N9525P3037c5429h27k6847A80002C1613N1084h6517H6272g0844G3090
15837A61937g6637b0890B22609a16885H4978a05242C04753p4820n8452a8425B20556
15825c14950D7357J9133Q532c3157A6807a41186N8049m1145M5569H6076b29227
15813a00521j67568D7999h7493C66247b61500d9474B9194I964d5315r780j09089
15802a64184g3700B41337b1187j07915r5083a02482l0329l7120A62937P8093a30156
15790A9399a43215O0000E7055c18303G9152J31185d02135D1962r903J23515a95975
15778E3095i6474j21242k5077G4780b43613j30173C32381b4924j59643j71462
15768c56029B2559R4105a90451c38A2171J32984E6607O5061a73549N3623d242
$$ plain form
15756 57256 26241 -4897 222226 67047 265317 99953 -281238 -61218 -341239 178450 63248
15744 152912 198020 -80748 81321 289584 -275137 76512 135870 -37040 -396342 -33868 287732
15732 195379 -52097 309092 -324145 -206481 79418 -44324 145008 -355497 -128667 -138225
15722 -138225 13349 57348 195761 50742 63565 -187444 -60656 -221869 44419 -202567 179239
15710 279633 44397 154888 140798 -133360 -107697 -344395 -195280 109181 156328 -19605
15699 -222963 -148163 -89421 -342504 -154492 72902 -143714 -224795 70985 314987 25389 172912
15688 172912 143328 34492 -59813 145814 -123944 109969 2270 -241672 189900 -139466
15677 42913 22552 91960 -383 -54437 -53335 312791 -221544 -67167 55697 -15570 -29321 -61778
$$ packed form
15756E7256B6241d897B22226F7047J98270I9953b81238f1218k80021A78450F3248
15744A52912M5108h0748H1321K08263b75137G6512N9358c7040l59302c3868B87732
15732A95379e2097C09092c24145J17664G9418d4324A45008c55497a28667r558
15722a38225A3349M3999J38413E0742J2823a87444f0656j61213D4419b02567A79239
15710B79633D4397J10491j4090a33360K5663k36698J49115A09181M7147a9605
15699b22963P4800N8742k53083a54492G2902a43714q1081G0985K44002B5389J47523
15688A72912k9584C4492e9813A45814a23944A09969B270b41672A89900a39466
15677D2913k0361O9408c83n4054J102C12791b21544f7167E5697a5570j3751l2457
$$ plain form
15665 -61778 -97600 -8589 170118 -53230 -360873 97949 396989 -21531 110172 -250675 -228790
15654 -228790 -220456 340898 -200328 141023 254489 -461015 -72800 -153832 -91524 330953
15643 -224279 68591 15505 88046 -624341 -209903 -3955 94212 -271114 229694 31038 -429730
15631 40138 -189918 3709 -476785 -126281 -412116 -189797 51595 10910 325134 -149150
15620 -42065 95156 -126155 102335 -203723 -393959 -95318 -165591 86153 131198 121931 -419072
15608 -6201 -22952 -125382 -311715 -248730 44967 -61217 104237 -238573 -293732 -85345 15928
15596 107522 -223140 -194282 -132545 -40872 -319373 191514 153537 107045 -249435 -145001
15586 -145001 417889 41778 82536 59013 -48002 63101 79473 -148083 -36393 -154612 67738
$$ packed form
15665f1778l5822h589A70118e3230l07643I7949K99040b1531A10172b50675K1885
15654b28790Q334C40898b00328A41023J13466d61015g2800q1032O2308C30953
15643b24279F8591A5505P2541f24341b09903c955I4212b71114B29694C1038d29730
15631D0138a89918C709d76785a26281k85835a89797E1595A0910L14224a49150
15620d2065I5156a26155A02335b03723j90236i5318p0273H6153M5045r267d19072
15608f201j6751j02430j86333O2985D4967f1217A04237b38573n5159h5345A5928
15596A07522b23140K8858O1737d0872k78501A91514l7977m6492b49435J04434
15586a45001D17889D1778M0758k3523d8002F3101J6372a48083c6393j18219F7738
$$ plain form
15574 23799 -117896 -30197 -15164 114316 -92192 -91160 19811 -156662 -89511 -76976 60503
15562 76050 -17178 144950 -493455 78144 35855 -59451 -150503 -41798 -126778 -107832 -188298
15551 -188298 -111671 75578 -83368 -31600 -149244 42763 15329 217386 140347 156946 163022
15540 163022 194540 79524 -90122 25764 318089 -37818 -24733 -148549 -23251 75950 196350
15529 196350 -116973 50329 52686 180296 68239 4746 164989 252340 48243 -378527 81232
15517 7115 -192287 112499 287955 78844 38447 104611 -86179 -197428 -153515 -168358 -264423
15506 -264423 371934 272990 366949 147799 164988 54544 29020 -33715 -238732 241629 188718
15495 188718 33486 383219 31011 -296200 -136579 254412 158605 85450 368753 293476
$$ packed form
15574B3799a17896c0197J5033A14316i2192J032A9811a56662O7151J2535F0503
15562G6050a7178A44950d93455G8144C5855e9451r1052d1798q4980J8946q0466
15551a88298P6627G5578h3368c1600j17644D2763A5329K02057p7039J6599O076
15540A63022L1518G9524i0122B5764K92325c7818J3085j23816b3251G5950J20400
15529A96350a16973E0329K357J27610F8239D746J60243Q7351D8243c78527H1232
15517G115a92287A12499J75456G8844C8447O6164h6179j11249M3913j4843r6065
15506b64423C71934r8944R3959A47799J7189E4544k5524c3715k05017B41629n2911
15495A88718C3486L49733C1011b96200a36579B54412r5807p3155K83303p5277
$$ plain form
15485 293476 231337 67833 237194 108651 206779 142178 -79577 213936 -131076 104251
15474 312086 420799 596029 576445 632126 547181 131179 94162 184918 17081 -440898 452943
15462 14023 -195485 -164894 303632 140919 -62308 301638 254240 -30498 86487 9139 211237
15451 211237 -196806 -315775 367314 31353 -164428 119556 -227601 432567 295155 -28360
15440 191742 654053 749524 681648 702641 483492 173833 53605 707692 37745 266366
15430 266366 -102721 -121164 -14031 -20730 197881 -261492 171645 -168948 -61033 116533
15419 72533 -134148 225751 -19405 -20437 20665 -204401 -197204 253221 54310 71777 111575
15408 111575 220906 -236791 -49789 33038 -487661 -269532 281327 -200626 -82634 -126530
$$ packed form
15485B93476o2139F7833J69361A08651R8128o4601g9577B13936a31076A04251
15474C12086J08713J75230j9584N5681q4945A31179l7017R0756A7081d40898D52943
15462A4023a95485L0591C03632A40919f2308C01638m7398c0498H6487I139K02098
15451B11237a96806j18969C67314C1353a64428A19556b27601D32567j37412b8360
15440A91742M62311R5471o7876K0993k19149A73833E3605O54087C7745K28621
15430B66366a02721j8443a4031o699A97881b61492A71645a68948f1033A16533
15419G2533a34148B25751a9405j032B0665b04401P197B53221E4310J7467L9798
15408A11575J09331b36791d9789C3038d87661K18129B81327b00626h2634m3896
$$ plain form
15398 -126530 -416891 17038 -153594 -402321 -160557 100332 -233666 367341 -290310 -84069
15387 -59305 -101754 -250224 128780 -56541 47947 227119 121364 24826 201008 -43140 -67610
15376 -67610 -90678 247641 76588 272928 168255 267019 74664 127228 -87419 201086 -142038
15364 70541 -1795 230555 255752 331441 231994 162298 402650 92904 446005 88948 143894
15353 143894 16678 164472 123215 204963 258457 322545 -81443 125096 -154707 32524 156932
15342 156932 89990 30177 15959 204134 378132 -12983 177256 442092 49887 193672
15332 193672 94571 170063 -72288 122115 222926 269562 247180 201779 76288 77564 150601
15321 150601 34464 54245 112880 20384 189483 85092 -111954 122271 96320 169867 -136556
$$ packed form
15398a26530k90361A7038a53594k48727a60557A00332b33666C67341b90310h4069
15387e9305m2449j48470A28780e6541D7947J79172j05755B4826J76182d3140k4470
15376f7610k3068B47641G6588J96340j04673R8764G4664N2564h7419B01086a42038
15364G0541a795B30555K5197P5689r9447o9696K40352I2904L53101H8948N4946
15353A43894A6678J47794m1257Q1748N3494O4088h1443A25096a54707C2524J24408
15342A56932o6942C0177j4218J88175J73998a2983A77256K64836D9887J43785
15332A93672I4571P5492g2288A22115J00811M6636k2382m5401G6288J276P3037
15321A50601C4464J9781N8635B0384J69099H5092a11954A22271k5951P3547a36556
$$ plain form
15309 18812 -49919 157918 105399 -276137 182573 -139835 111097 -237437 111958 -354615
15298 -272516 78027 -100256 185 -367691 276998 -174554 194922 127946 -245704 -141858
15288 -141858 -37041 -66779 78894 -134898 -172762 254317 7917 77718 -63927 78941 317136
15277 317136 -53774 -128060 -191350 -101781 40839 -155375 17193 -79161 -176824 366717 -14013
15265 244238 -76520 198002 75171 -179394 -267610 -296 -224301 360787 4570 54889 2975
15253 90894 436254 -142139 -83358 154006 -72675 -117606 34157 70435 511779 624362 1218640
15242 1218640 1542186 1281116 1753868 778365 59043 -79587 23090 -33889 -22622 33081
15231 488152 64985 40204 362330 87662 -259582 355139 81999 -159667 -144571 274548
$$ packed form
15309A8812d9919A57918n2519b76137A82573a39835A11097b37437A11958c54615
15298b72516G8027a00256A85c67691B76998a74554A94922o6976b45704J03846
15288a41858c7041k9738G8894a34898l7864B54317G917O9801f3927G8941K38195
15277C17136e3774p4286o3290Q9569D0839a55375A7193g9161r7663C66717a4013
15265B44238g6520A98002G5171a79394q8216b96k24005C60787D570N0319B975
15253I0894L45360a42139N8781A54006g2675m4931C4157L6278M41344J12583N94278
15242A218640L23546k61070M72752G78365E9043g9587B3090c3889J1267C3081
15231D88152F4985k4781L22126H7662b59582C55139H1999a59667J5096B74548
$$ plain form
15220 33236 -80195 43789 -55496 540230 206523 334283 -151637 148057 -114130 282510
15209 111476 113367 -351992 -74705 173436 123052 68904 239360 16237 319218 -294651 352234
15197 173317 140164 240573 -116187 119860 -269514 300060 35795 306756 188497 -24613
15186 147797 -319243 159124 185740 -193227 168223 -75873 -93236 -206802 -86871 263495
15175 126781 240195 140145 -409039 -16853 175859 146859 -125499 171048 397960 208022
15165 208022 278237 167909 -111635 -137078 418863 -72318 -137352 101283 189090 -16919 155654
15153 -140083 -4736 185345 54397 399299 131123 -113953 -174329 329094 368935 378512 94423
15141 352085 -7303 204194 193819 11889 14502 490611 237896 -52181 161272 79808 93437
$$ packed form
15220C3236h0195D3789e5496E40230B06523J27760a51637A48057a14130B82510
15209A11476J891c51992g4705A73436n0384n4148J70456A6237L02981b94651C52234
15197A73317l3153J00409a16187A19860b69514C00060C5795K70961j18259b4613
15186A47797c19243A59124K6616a93227A68223g5873j7363j13566h6871B63495
15175A26781J13414j00050d09039a6853A75859k9000a25499A71048K26912j89938
15165B08022P0215j10328a11635k5443D18863g2318o5034A01283Q7807a6919A55654
15153a40083d736A85345E4397L44902A31123a13953o0376C29094L9841R577I4423
15141C52085g303B04194j0375A1889K613M76109B37896e2181A61272G9808J3629
$$ plain form
15130 93437 239111 -152551 33891 146685 96914 189502 222219 -229128 -60315 -12295 468111
15118 550128 702641 -12571 44064 274151 35615 -313210 -157638 422664 218750 -60218
15107 112247 265363 120266 64379 -279146 -218495 486218 270596 235607 -188958 103291
15096 244734 157127 330685 217202 138975 -51248 -123290 135409 -224984 -35233 200650
15085 -85588 267904 46286 420551 130511 326503 131510 143183 43800 -175597 -57542
15074 76212 -15387 18641 136400 59919 288134 168100 115293 148220 -104530 -70575 15130
15062 347080 94068 90046 240111 -13137 279759 480657 307082 174693 201575 304791
15052 304791 686625 310437 311061 274801 191661 336712 -118330 290191 223326 340978 411398
$$ packed form
15130I3437J45674a52551C3891J12794m9771R2588L2717b29128f0315a2295D68111
15118E50128J52513a2571D4064K30087C5615c13210J55572D22664k03914f0218
15107A12247J53116A20266n5887b79146O0651D86218k15622l4989a88958A03291
15096B44734q7607J73558j13483p8227e1248p2042A35409b24984c5233B00650
15085h5588B67904D6286L74265A30511J95992A31510J1673D3800a75597e7542
15074G6212a5387A8641J17759E9919K28215j20034n2807L2927a04530L3955A5130
15062C47080I4068m022J50065a3137B79759K00898j73575j32389K6882J03216
15052C04791L81834C10437O24l6260q3140J45051a18330B90191o6865J17652P0420
$$ plain form
15041 411398 19720 336075 154334 -21254 268027 353018 131254 161544 370187 374750 392077
15030 392077 296214 500674 351408 312905 326139 860879 398235 300983 326469 245228 28279
15018 505398 787348 22569 348711 395177 96925 248427 331116 76159 716114 175781
15007 56713 436632 431827 233309 314826 107958 -35614 400081 277245 264395 187666 14547
14995 283776 402161 185234 262053 357782 192873 571049 324894 621029 535376 367656
14985 367656 399289 447110 309009 413139 571682 843972 509920 890122 517281 442201
14975 442201 458107 199981 656324 88066 531247 321408 801032 741665 408934 80409
14964 57677 507730 355957 238665 55681 331550 219790 315953 276270 570758 165407
$$ packed form
15041D11398A9720L16355A54334b1254B68027Q4991A31254L0290K08643M563J7327
15030C92077r5863K04460j49266l8503J3234N34740C98235r7252K5486q1241B8279
15018E05398K81950B2569L26142M6466I6925J51502Q2689G6159O39955A75781
15007E6713L79919m805j98518Q1517A07958c5614D00081j22836j2850p6729A4547
14995B83776J18385A85234P6819R5729j64909L78176k46155K96135q5653j67720
14985C67656L1633M7821j38101J04130J58543K72290l34052L80202l72841p5080
14975D42201J5906A99981M56343H8066M43181k09839M79624n9367l32731H0409
14964E7677M50053j51773j17292E5681K75869j11760R6163l9683K94488A65407
$$ plain form
14953 185958 147509 382311 496937 168500 -86768 237937 216259 234001 689333 363490
14943 363490 243381 456565 857322 437623 298421 674391 321943 380098 189732 308606
14933 308606 583968 331203 694822 502552 644490 799273 938669 1029506 1044845 1118271
14923 1118271 1253753 1082772 1502895 1400704 1087671 1225300 1319904 1518609 1808544 1678461
14913 1678461 1757709 1359467 897662 878038 1120655 858300 591852 477002 484749 380476
14903 380476 50863 522117 422038 665606 278412 389701 230812 423183 209262 621934
14893 621934 266881 349052 265909 199668 578371 436531 159616 271471 563248 81845
14882 558536 513762 554923 596243 768864 624939 687019 761192 436317 606825 492145
$$ packed form
14953A85958l8449K34802J14626A68500h6768B37937k1678J7742M55332l25843
14943C63490j20109K13184M00757m19699j39202L75970C21943N8155A89732J18874
14933C08606K75362k52765L63619j92270J41938J54783J39396R0837J5339P3426
14923A118271J35482j70981M20123j02191l13033J37629R4604J98705K89935j30083
14913A678461P9248l98242m61805j9624K42617k62355k66448j14850P747j04273
14903C80476E0863M71254j00079K43568B78412J11289j58889J92371B09262M12672
14893F21934B66881Q2171q3143o6241L78703j41840A59616J11855K91777H1845
14882E58536m4774M1161M1320J72621j43925O2080P4173l24875J70508j14680
$$ plain form
14872 492145 350938 95985 283110 333012 502095 490099 858823 553801 73799 621556
14862 621556 785136 615848 837076 612188 185270 408593 333239 410296 630225 84749
14851 577930 690163 288123 419541 360557 680658 392419 636686 576253 606312 800856
14841 800856 1043553 742581 1097800 885368 1030547 978348 658528 822759 854193 843944
14831 843944 512388 320802 462476 444643 425634 666711 459380 182927 715160 420293
14821 420293 611155 771446 695481 707072 888434 407317 821178 814126 689672 453834
14811 453834 962400 705002 395950 506997 420315 389020 282126 366922 695974 831375
14801 831375 526155 792135 835663 472922 623757 618086 512866 178386 199762 465474
$$ packed form
14872D92145j41207I5985J87125M9902J69083j1996L68724l05022G3799N47757
14862F21556J63580j69288K21228k24888A85270K23323p5354P7057K19929H4749
14851E77930J12233B88123J31418n8984L20101k88239K44267o0433L0059J94544
14841H00856K42697l00972L55219k12432J45179n2199l19820J64231L1434j0249
14831H43944l31556j91586J41674j7833j9009K41077k07331A82927N32233k94867
14821D20293J90862J60291p5965J1591J81362D07317M13861p052j24454k35838
14811D53834N08566k57398l09052J11047q6682l1295j06894Q4796L29052J35401
14801H31375l05220K65980M3528l62741J50835n671j05220A78386K1376K65712
$$ plain form
14791 465474 688408 600188 687850 305827 396883 377296 1122072 425873 832518 501621
14781 501621 608744 674258 392088 589873 757030 670513 776633 784531 932258 573440
14771 573440 683359 1006945 871853 442038 615840 675908 524550 584567 778297 326736
14760 936503 338972 506576 564251 480694 570842 523650 557266 540058 619299 542251 757468
14749 757468 600108 719180 809049 780273 463851 580361 727965 336505 386286 606366
14739 606366 444525 562935 759847 796124 670267 957087 723325 628780 563404 1024247
14729 1024247 821410 701646 970227 1198751 1344904 1135327 1369094 1323347 1010402 1263433
14719 1263433 954874 692807 882117 919901 800935 810345 836496 399838 423415 1057334
$$ packed form
14791D65474K22934q8220Q7662C05827R1056j9587P44776D25873M06645l30897
14781E01621J07123O5514k82170J97785J67157q6517J06120P898J47727l58818
14771E73440J09919L23586j35092m29815J73802O0068j51358O0017J93730C26736
14760I36503C38972J67604N7675q3557R0148m7192L3616j7208P9241p7048K15217
14749G57468j57360J19072Q9869k8776l16422J16510J47604C36505M9781K20080
14739F06366j61841J18410J96912L6277j25857K86820k33762r4545o5376M60843
14729A024247k02837j19764K68581K28524J46153k09577K33767m5747l12945K53031
14719A263433l08559k62067J89310L7784j18966R410K6151C99838K3577O33919
$$ plain form
14709 1057334 889013 1081068 911921 976274 852626 794787 1179410 896338 1214783 1520956
14699 1520956 1371616 1421393 1467062 1422308 1162126 1103679 863999 933374 1169250 553364
14688 707813 1108993 404098 860666 735620 756162 860783 935368 737206 1123921 815528
14678 815528 863261 486018 951652 1005524 957150 895293 900035 801440 569050 1047957 728854
14667 728854 1042211 633782 950205 939982 1065620 887630 969322 823340 892589 1125419
14657 1125419 992064 1075516 1121101 931867 753190 1103450 1245484 958631 1395049 1245440
14647 1245440 1183427 948923 1233182 1095598 1094574 779625 791691 1224037 1365430 1125449
14637 1125449 1133995 1017069 899768 1015462 1106341 1049576 930100 1158119 1157258 1038629 1125126
$$ packed form
14709A057334j68321J92055j69147O4353j23648n7839L84623k83072L18445L06173
14699A520956j49340M9777M5669m4754k60182n8447k39680O9375K35876E53364
14688G07813M01180D04098M56568j25046K0542J04621P4585j98162L86715l08393
14678H15528M7733l77243M65634N3872m8374o1857M742r8595k32390M78907l19103
14667G28854L13357m08429L16423j0223J25638j77990Q1692j45982O9249K32830
14657A125419j33355Q3452M5585j89234j78677L50260J42034k86853M36418j49609
14647A245440o2013k34504K84259j37584j024l14949J2066M32346J41393k39981
14637A125449Q546j16926j17301J15694R0879n6765j19476K28019q61j18629Q6497
$$ plain form
14626 1125126 927921 793467 1414354 1077198 1229039 1056508 1014653 1645047 1110031 1142091
14616 1142091 1147214 1249345 1210153 1426743 1187118 1385167 1464896 1331315 866508 1244561
14606 1244561 1329661 1443305 1311279 1381348 1587671 1436861 1434739 1419025 1535360 1361124
14596 1361124 1419406 1440671 1319275 1666133 1360159 1526139 1202518 1725735 1684122 1317591
14586 1317591 1564271 1587067 1613290 1799051 1735876 1437177 1768403 1744929 1983412 1910414
14576 1910414 2020491 1893646 1868064 1929682 1940365 1870891 1662200 1866088 1976401 2022505
14566 2022505 1782565 2095351 2085673 2326816 1995781 2235137 2363434 2355097 2399412 2724801
14556 2724801 2417191 2775645 2926316 3247107 3225849 3615971 4080539 5973261 9435798
$$ packed form
14626A125126j97205j34454O20887l37156J51841j72531m1855O30394n35016L2060
14616A142091N123J02131l9192K16590k39625J98049P9729j33581m64807L78053
14606A244561Q5100J13644j32026P0069K06323j50810k122j5714J16335j74236
14596A361124N8282K1265j21396L46858l05974J65980l23621N23217m1613l66531
14586A317591K46680K2796K6223J85761o3175k98699L31226k3474K38483p2998
14576A910414J10077j26845k5582O1618J0683o9474k08691K03888J10313M6104
14566B022505k39940L12786r678K41143l31035K39356J28297q337M4315L25389
14556B724801l07610L58454J50671L20791k1258L90122M64568J892722L462537
$$ plain form
14547 9435798 17248607 31888882 44027382 24318584 9776936 4607358 3568837 3259731
14539 3259731 4304410 4418626 2234165 1597372 1668050 1836820 1637269 1720078 1782518 1913291
14529 1913291 1806509 1973048 2054736 1476708 1974599 1966379 2154051 2126386 1988765 1980341
14519 1980341 2206965 2364394 2358321 1984640 2397908 2419062 2284651 2213959 2430720 2200914
14509 2200914 2537615 2158982 2288302 2742155 2540886 2112361 2429841 2812122 2276338
14500 2276338 2752732 2658840 2676978 3116739 2699058 2744227 3037857 3050264 2949163 3097029
14490 3097029 2727838 3177248 2927367 3364388 3201144 3320983 3605562 3211773 3045908
14481 3045908 2859201 3373539 3434245 3297349 3610227 3408928 3282097 3529547 3943113 3592738
$$ packed form
14547I435798P812809J4640275J2138500j9708798I776936D607358j038521l09106
14539C259731J044679J14216k184461o36793P0678J68770j99551Q2809O2440J30773
14529A913291j06782J66539Q1688n78028M97891q220J87672k7665j37621q424
14519A980341K26624J57429o073l73681M13268K1154j34411p0692K16761k29806
14509B200914L36701l78633J29320M53853k01269m28525L17480L82281n35784
14500B276338M76394r3892J8138M39761m17681M5169K93630J2407j01101J47866
14490C097029l69191M49410k49881M37021j63244J19839K84579l93789j65865
14481C045908j86707N14338O0706j36896L12878k01299j26831K47450M13566l50375
$$ plain form
14471 3592738 3608107 3816387 3730093 3625928 3903129 4192042 3753062 3622594 3733970 4091828
14461 4091828 3981617 4306678 3866645 4296670 4052985 4230642 4248940 4548437 4317882 4856935
14451 4856935 4638376 4710180 4420667 4630857 5154659 4865339 5157666 4552109 5144246 4985766
14441 4985766 5271586 5109877 5024877 5312420 5014792 5447369 5419592 5738194 5817952 5793806
14431 5793806 5921571 6195348 6003839 5570618 6363475 6424322 6426866 6295187 6605508 6691938
14421 6691938 6695415 6742727 7214093 7389114 7507448 7652381 7440836 7547243 7880955 7472897
14411 7472897 8024411 7865970 8159344 8039205 8072128 8244480 8662821 8604526 8765580 8861638
14401 8861638 9302138 9373584 9537797 9758821 9634334 10252691 10013790 10094532 10310551 10493055
$$ packed form
14471C592738J5369K08280q6294j04165K77201K88913m38980j30468J11376L57858
14461D091828j10211L25061m40033M30025k43685J77657J8298K99497k30555N39053
14451D856935k18559P1804k89513K10190N23802k89320K92327o05557N92137j58480
14441D985766K85820j61709q5000K87543k97628M32577k7777L18602P9758k4146
14431E793806J27765K73777j91509m33221P92857O0847K544j31679L10321Q6430
14421F691938L477M7312M71366J75021J18334J44933k11545J06407L33712m08058
14411G472897N51514j58441K93374j20139L2923J72352M18341n8295J61054R6058
14401H861638M40500P1446J64213K21024j24487O18357k38901Q0742K16019J82504
$$ plain form
14391 10493055 10443718 10867866 10702183 10766941 11223673 11487690 11741292 11854765 11965028 12167782
14381 12167782 12692402 12832214 13023354 13346692 13735685 14169080 13977811 14471684 14276945
14372 14276945 14797268 15308547 15756530 15770745 16101356 16018847 16608727 17330270 17661582 18037549
14362 18037549 18479200 19032025 18944528 19285184 19836526 20009777 20077302 20977093 21675536 22122693
14352 22122693 22798199 22856067 24136626 24490581 24736512 25575221 26072070 27026449 27766256
14343 27766256 28218086 28862399 29895257 30883395 31511225 32463531 33818102 34336615 34958586
14334 34958586 36494823 37522350 38680272 39570291 41349233 41779784 44050661 45228196
14326 45228196 46755189 48458661 49774332 51826737 53663680 55309824 57127760 59353336
$$ packed form
14391A0493055m9337M24148j65683O4758M56732K64017K53602J13473J10263K02754
14381A2167782N24620J39812J91140L23338L88993M33395j91269M93873j94739
14372A4276945N20323N11279M47983J4215L30611q2509N89880P21543L31312L75967
14362A8037549M41651N52825q7497L40656N51342J73251O7525Q99791O98443M47157
14352B2122693O75506N7868J280559L53955K45931Q38709M96849R54379P39807
14343B7766256M51830O44313J032858R88138O27830R52306J354571N18513O21971
14334C4958586J536237J027527J157922Q90019J778942M30551K270877J177535
14326D5228196J526993J703472J315671K052405J836943J646144J817936K225576
$$ plain form
14318 59353336 61596411 63967330 66531432 68945407 71430540 74071948 77203949 80647851
14310 80647851 84355351 87495087 91369418 95452293 99467267 104308784 108961652 114026813
14302 114026813 119100162 125124361 131351049 137928375 145283770 152552169 160474074 168699589
14294 168699589 177961397 187757331 197731737 208923896 220301535 232662623 245627988
14287 245627988 259069676 273257099 288174268 303519861 319221370 335625642 352208386
14280 352208386 368600763 384861228 400878428 415717561 429787937 442217598 452522177
14273 452522177 460207465 463034821 460212584 457519906 458136919 457187829 452518534 445375094
14265 445375094 435832269 423886843 410887258 396560262 381797093 365496402 348953931
$$ packed form
14318E9353336K243075K370919K564102K413975K485133K641408L132001L443902
14310H0647851L707500L139736L874331M082875M014974M841517M652868N065161
14302A14026813N073349O024199O226688O577326P355395P268399P921905Q225515
14294A68699589R261808R795934R974406J1192159J1377639J2361088J2965365
14287B45627988J3441688J4187423J4917169J5345593J5701509J6404272J6582744
14280C52208386J6392377J6260465J6017200J4839133J4070376J2429661J0304579
14273D52522177P685288K827356k822237k692678O17013r49090m669295p143440
14265D45375094r542825j1945426j2999585j4326996j4763169j6300691j6542471
$$ plain form
14258 348953931 332181175 315685620 299904297 284432582 269537954 255309029 241394513
14251 241394513 228875791 216814183 206366859 195663387 185182900 175916687 166964350
14244 166964350 158202584 150819028 143042173 136158424 129576356 123424996 117716422 112758120
14236 112758120 107810790 102506469 97899745 93770969 90067799 86671039 82981019 79423123
14228 79423123 76107443 73093023 70158858 67578575 65124341 62768268 60621700 58660269
14220 58660269 56047266 54621226 52652251 50672292 49068931 47408605 46102280 44969566
14212 44969566 43514880 41933671 40628395 39174288 38385121 38111074 37144389 35537287
14204 35537287 34003524 33542901 32702195 31743388 31317384 29991261 29515086 28650537 27779386
$$ packed form
14258C48953931j6772756j6495555j5781323j5471715j4894628j4228925j3914516
14251B41394513j2518722j2061608j0447324j0703472j0480487r266213q952337
14244A66964350q761766p383556p776855o883749o582068o151360n708574m958302
14236A12758120m947330n304321m606724m128776l703170l396760l690020l557896
14228G9423123l315680l014420k934165k580283k454234k356073k146568j961431
14220E8660269k613003j426040j968975j979959j603361j660326j306325j132714
14212D4969566j454686j581209j305276j454107p89167k74047r66685j607102
14204C5537287j533763m60623q40706r58807m26004j326123m76175q64549q71151
$$ plain form
14195 27779386 27212397 26367956 25644919 25174912 24830068 24068946 23256226 22731735 22552654
14186 22552654 21642471 21418019 20894389 20529956 19856239 19114052 19274180 18544390 18126545
14177 18126545 18052977 17673893 16834230 16544582 16488159 15852195 15658729 15579540 15193353 15267820
14167 15267820 14827217 14326473 14235530 13672727 13520793 13550412 12799280 12968107 12379526 12645379
14157 12645379 11928387 12106654 11489705 11158519 11200046 11038969 10888893 10586758 10708032
14148 10708032 10707721 10366349 10172714 9783415 9810355 9427824 9571511 9479064 9299898 9029973
14138 9029973 9062526 8854342 8525647 8326053 8546698 8282286 7656417 8175693 7971192 7882227
14128 7882227 8040997 7709523 7796304 7355544 7246592 7425955 7312630 6904046 7027447 6869537
$$ packed form
14195B7779386n66989q44441p23037m70007l44844p61122q12720n24491j79081
14186B2552654r10183k24452n23630l64433o73717p42187J60128p29790m17845
14177A8126545p3568l79084q39663k89648n6423o35964j93466p9189l86187P4467
14167A5267820m40603n00744r0943n62803j51934K9619p51132J68827n88581K65853
14157A2645379p16992J78267o16949l31186M1527j61077j50076l02135J21274
14148A0708032l11l41372j93635l89299K6940l82531J43687r2447j79166k69925
14138I029973L2553k08184l28695j99594K20645k64412o25869N19276k04501q8965
14128G882227J58770l31474Q6781m40760j08952J79363j13325m08584J23401j57910
$$ plain form
14118 6869537 6797437 6966928 6673871 6286795 6421182 6661874 6307127 6177388 6040482 6160717
14108 6160717 5902705 6192141 5692695 5995868 5485859 5687985 5372494 5482937 5390826 4925769
14098 4925769 4988389 5060440 5041232 5046317 4800119 5131484 4615789 4753863 4899914 4831913
14088 4831913 4789484 4337241 4538805 4470514 4415632 4846594 4542720 4334713 4403275 4297521
14078 4297521 4003860 4239708 4084070 3997892 4033733 4010960 3825273 3872391 4024034 4247061
14068 4247061 3765394 3781118 3735209 3503264 3604949 3405019 3658700 3805033 3819429 3833189
14058 3833189 3553971 3647537 3649445 3477430 3185113 3540417 3420629 3333205 3287296 3401131
14048 3401131 3086001 3052849 3120275 3068740 3060912 3129295 2750567 2874919 2651685 2533672
$$ packed form
14118F869537p2100J69491k93057l87076J34387K40692l54747j29739j36906J20235
14108F160717k58012K89436m99446L03173n10009K02126l15491J10443r2111m65057
14098D925769O2620P2051j9208N085k46198L31365n15695J38074J46051o8001
14088D831913m2429m52243K01564o8291n4882M30962l03874k08007O8562j05754
14078D297521k93661K35848j55638q6178L5841k2773j85687M7118J51643K23027
14068D247061m81667J5724m5909k31945J01685j99930K53681J46333J4396J3760
14058C833189k79218R3566J908j72015k92317L55304j19788q7424m5909J13835
14048C401131l15130l3152O7426n1535p828O8383l78728J24352k23234j18013
$$ plain form
14038 2533672 2782453 2821807 2831432 2745065 2818666 2588473 2970000 2747784 2582203 2726268
14028 2726268 2567177 2644227 2541452 2269213 2573458 2263979 2351133 2410087 2191125 2215363
14018 2215363 2412985 2101161 2295955 2198849 2033737 2224141 2055001 2081374 2340703 2108214
14008 2108214 1863368 2077436 1835833 1637039 1874757 2016153 1762537 1801419 2100510 1816825
13998 1816825 1726497 1957072 1926021 1872718 1761557 1861777 1501436 1990257 2271001 2970042
13988 2970042 4841933 11033029 25246188 43447706 30713274 14915314 8406601 5878516
13980 5878516 4470819 3667906 3460056 2759718 2996064 2832946 2417197 2370238 2616671
13971 2616671 2207765 2187804 1864099 2297235 2125714 1824500 2259353 2099741 1689931 1369431
$$ packed form
14038B533672K48781L9354R625q6367P3601k30193L81527k22216j65581J44065
14028B726268j59091P7050j02775k72239L04245l09479Q7154N8954k18962K4238
14018B215363J97622l11824J94794r7106j65112J90404j69140K6373K59329k32489
14008B108214k44846K14068k41603j98794K37718J41396k53616L8882K99091k83685
13998A816825r0328K30575l1051n3303j11161J00220l60341M88821K80744O99041
13988B970042J871891O191096J4213159J8201518j2734432A4915314o508713k528085
13980E878516j407697q02913k07850p00338K36346j63118m15749m6959K46433
13971B616671m08906j9961l23705M33136j71521l01214M34853j59612m09810l20500
$$ plain form
13961 1369431 1909221 1745456 1977686 1970696 2216790 1759743 1952636 1424672 1866013 1714434
13951 1714434 1691563 1663335 1693042 1886039 1455584 1571222 1735206 1789530 1567080 1715141
13941 1715141 1433055 1647943 1389107 1698521 1444672 1597872 1427807 1497236 1629989 1640689
13931 1640689 1431196 1364213 1520773 1226282 1697046 1339381 1465889 1281968 1161527 1385585
13921 1385585 1210763 1606397 1364084 1189345 1363901 1632608 1285808 1150435 1099951 933852
13911 933852 1305391 1205235 749384 1253288 1192360 1302438 1202418 1043439 1219550 1408284
13901 1408284 1158131 1221289 1317430 1099791 1125174 1246873 1264510 1262009 1247629 1277074 933708
13890 933708 963994 1096400 915255 1150640 931587 711883 997450 1189034 688727 1233852
$$ packed form
13961A369431N39790j63765K32230o990K46094m57047J92893n27964M41341j51579
13951A714434k2871k8228K9707J92997m30455J15638J63984N4324k22450J48061
13941A715141k82086K14888k58836L09414k53849J53200j70065O9429J32753J0700
13931A640689k09493o6983J56560k94491M70764l57665J26508j83921j20441K24058
13921A385585j74822L95634k42313j74739J74556K68707l46800j35373n0484j66099
13911I33852L71539j00156m55851N03904o0928J10078j00020j58979J76111J88734
13901A408284k50153O3158R6141k17639K5383J21699J7637k501j4380K9445l43366
13890I33708L0286J32406j81145K35385k19053k19704K85567J91584n00307N45125
$$ plain form
13880 1233852 1230727 652514 1075072 980621 1136254 874207 731027 721584 1157526 966983
13870 966983 990196 1362479 1148420 808175 703175 1008983 1052079 1175814 1014523 824062
13860 824062 817562 1342527 1073473 1098467 688595 1086708 942617 1011676 905047 884197
13850 884197 619801 873953 709879 863142 932935 762570 827511 666386 971681 584975
13840 584975 669700 866408 940513 869550 666851 1022390 1117421 866281 476364 888553
13830 888553 889535 1146236 779746 546988 1016409 775833 1041405 656126 757873 722677
13820 722677 475971 704701 935929 631752 551167 876368 757950 1055929 903062 612607
13810 612607 704082 645859 472068 710567 695661 790634 743585 629734 676595 628798 653254
$$ packed form
13880A233852l125n78213M22558r4451J55633k62047j43180r443M35942j90543
13870I66983K3213L72283k14059l40245j05000L05808M3096J23735j61291j90461
13860H24062o500N24965k69054K4994m09872L98113j44091O9059j06629k0850
13850H84197k64396K54152j64074J53263O9793j70365O4941j61125L05295l86706
13840E84975Q4725J96708P4105p0963k02699L55539R5031k51140l89917M12189
13830H88553R82K56701l66490k32758M69421k40576K65572l85279J01747l5196
13820G22677k46706K28730K31228l04177q0585L25201j18418K97979j52867k90455
13810F12607R1475n8223j73791K38499j4906R4973m7049j13851M6861m7797K4456
$$ plain form
13799 653254 824856 525351 740817 498080 960517 603138 550488 816652 495129 676713
13789 676713 707210 411133 765972 437072 676355 1048899 597216 236405 760040 657690
13779 657690 778048 775884 482459 353429 754680 226532 740576 579748 740965 651516
13769 651516 889784 518317 351441 666581 453375 604029 602000 644970 596561 506254
13759 506254 428559 552291 477169 495225 760001 309450 419211 384615 642540 522421
13749 522421 499207 496450 587414 389983 556902 873039 518682 430346 498648 411274 929882
13738 929882 383688 488101 568389 408235 777671 583034 286384 429779 358003 299623
13728 299623 375644 771169 705639 876704 765995 304181 928611 614824 372257 349466
$$ packed form
13799F53254J71602k99505K15466k42737M62437l57379n2650K66164l21523J81584
13789F76713L0497k96077L54839l28900K39283L72544m51683B36405N23635j02350
13779F57690J20358k164k93425j29030M01251B26532N14044j60828J61217q9449
13769F51516K38268l71467j66876L15140k13206J50654k029M2970m8409r0307
13759E06254p7695J23732p5122J8056K64776C09450J09761l4596K57925j20119
13749E22421k3214k757R0964j97431J66919L16137l54357q8336O8302q7374N18608
13738I29882C83688J04413Q0288j60154L69436j94637B86384J43395p1776n8380
13728B99623P6021L95525o5530J71065j10709C04181O24430l13787k42567k2791
$$ plain form
13718 349466 369191 390591 469970 351703 521510 254159 248715 596564 276948 892020
13708 892020 688300 343009 298863 204938 600384 534708 541581 377304 581369 369632
13698 369632 477712 548128 464092 931026 570887 403287 407963 740522 367085 296065
13688 296065 358964 418931 553510 759039 603571 239594 406499 405331 308004 477743
13678 477743 612470 552342 341175 332284 294881 456970 527498 718035 167387 139361 742045
13667 742045 446840 419742 446983 547434 424932 437575 344037 442095 312946 294812 196413
13656 196413 555352 367026 493181 383544 526017 349256 180147 565999 528070 289960
13646 289960 312744 246495 245494 333521 584114 180840 539278 364902 546027 283902
$$ packed form
13718C49466J9725K1400P9379j18267J69807B54159n444L47849B76948O15072
13708H92020k03720C43009m4146r3925L95446o5676O873j64277K04065k11737
13698C69632J08080P0416q4036M66934l60139j67600M676L32559C67085p1020
13688B96065O2899N9967J34579K05529j55468B39594J66905j168r7327J69739
13678D77743J34727o0128k11167q891l7403J62089P0528J90537A67387k8026O02684
13667G42045k95205k7098K7241J00451j22502J2643r3538R8058j29149j8134r8399
13656A96413L58939j88326J26155j09637J42473j76761j69109L85852l7929k38110
13646B89960K2784o6249j001Q8027K50593A80840L58438j74376J81125k62125
$$ plain form
13636 283902 212469 449659 -214156 474844 377464 689406 228937 349269 417063 320080
13626 320080 225881 292938 348266 273526 557984 406815 133747 180934 502694 -70819 186777
13614 731414 401891 590238 514008 381216 567903 370822 251355 344505 275607 462663
13604 462663 155795 229640 -55676 51707 384221 522612 310857 307667 180933 110999 370486
13593 370486 523570 300745 253210 15234 299843 328329 401301 -44193 126564 192036 303995
13582 303995 357473 196049 172459 462642 420579 254762 160656 74851 -181523 551021
13571 288720 472441 67829 331367 410479 305362 294585 354160 221404 -8281 408708 209422
13560 209422 510677 542618 44057 113320 303797 120604 370441 179993 114348 -27452
$$ packed form
13636B83902p1433K37190b14156D74844r7380L11942B28937J20332O7794r6983
13626C20080r4199O7057N5328p4740K84458j51169A33747M7187L21760g0819A86777
13614G31414l29523J88347p6230j32792J86687j97081j19467R3150o8898J87056
13604D62663A55795P3845e5676E1707L32514J38391k11755l190j26734o9934K59487
13593C70486J53084k22825m7535A5234K84609K8486P2972d4193A26564O5472J11959
13582C03995N3478j61424k3590K90183m2063j65817r4106G4851a81523E51021
13571B88720J83721F7829K63538P9112j05117j0777N9575j32756h281D08708j99286
13560B09422L01255L1941D4057O9263J90477A20604K49837A79993o5645b7452
$$ plain form
13549 255430 343407 53764 216713 117831 340884 293928 139410 142184 108611 451200 415419
13538 415419 175285 69576 145590 462978 259626 214952 129106 -10861 75546 209837 182852
13527 182852 351465 211339 -38534 104375 -23352 185804 108859 299806 -58010 320506
13516 213087 285055 423091 149308 607733 19744 176953 120418 85471 160392 188607 -3443
13504 253263 156222 304872 684702 342502 218766 456551 98649 133891 138442 -21728 317943
13492 374577 543983 345049 49725 535907 461862 -3459 449584 289122 69965 230080
13482 230080 133343 181050 419159 317851 142576 -81858 -173109 104221 70918 288284
13472 288284 497788 54150 257058 -107514 -11388 593175 189686 274458 111998 249656
$$ packed form
13549B55430Q7977E3764J62949r8882K23053m6956A39410K774l3573L42589l5781
13538D15419A75285F9576P6014L17388k03352m4674q5846a0861G5546J34291k6985
13527A82852J68613j40126c8534A04375b3352A85804p6945J90947e8010C20506
13516B13087P1968J38036A49308M58425A9744J57209n6535l4947P4921K8215c443
13504B53263r7041J48650L79830l42200j23736K37785I8649L5242M551b1728C17943
13492C74577J69406j98934D9725M86182p4045c459D49584j60462F9965J60115
13482B30080r6737M7707K38109j01308A42576h1858r1251A04221l3303K17366
13472B88284K09504E4150K02908a07514a1388E93175A89686Q4772A11998J37658
$$ plain form
13462 249656 378394 -158005 -113052 224807 115124 200190 340503 330582 132408 314236
13452 314236 57721 356796 118401 224324 47730 147425 4806 57858 324456 -185666 297211
13440 360520 174829 157238 2344 356384 255588 355093 36838 128814 193902 256849 244362
13429 244362 464643 475545 375843 110773 275093 138162 -7222 267557 231181 -25023 175296
13417 6341 253493 163306 71450 81064 17445 375129 117203 -162730 208938 145084 274516
13406 274516 -76924 193055 -9475 362815 430698 -58553 382716 322316 -64161 158482 -23784
13394 132122 193985 208706 -281337 230037 326542 -28702 -95961 500795 132933 208787 162986
13383 162986 210033 13683 300241 224362 -66500 12152 79252 140445 65425 -44257 142469
$$ packed form
13462B49656J28738a58005M4953B24807j09683Q5066J40313r921A32408J81828
13452C14236E7721K99075A18401J05923D7730R9695D806N3052K66598a85666B97211
13440C60520A74829j7591B344L54040j00796R9505C6838R1976O5088O2947j2487
13429B44362K20281J0902r9702A10773J64320j36931g222B67557l6376b5023A75296
13417F341K47152r0187G1450R614A7445L57684A17203a62730B08938o3854J29432
13406B74516g6924A93055i475C62815O7883e8553C82716o0400f4161A58482b3784
13394A32122O1863J4721b81337B30037R6505b8702o7259E00795A32933P5854m5801
13383A62986M7047A3683K86558p5879f6500A2152O7100O1193F5425d4257A42469
$$ plain form
13371 359759 274960 -2410 136888 273862 168225 42644 45606 202640 238166 -96802 -296787
13360 -296787 233792 300297 138664 35781 345711 298254 304181 123137 116998 500249 301872
13349 301872 -73086 -4625 43090 432488 507798 116784 209312 335256 402332 538750 304737
13338 304737 408189 48203 114292 149335 189664 166244 -168162 414882 99492 -32388 337106
13326 -83487 180789 554072 117066 16973 663113 186930 276823 285868 271396 254696 57831
13314 251015 245424 33064 -134260 261255 143737 389872 119227 379353 187333 -20078
13303 165855 -58775 12831 207671 13930 359559 163373 477300 94556 -90462 164015
13292 346106 193984 351980 51668 34493 -72490 300279 220541 271635 13799 -24903 -1536
$$ packed form
13371C59759q4799b410A36888J36974j05637D2644K962J57034L5526i6802j99985
13360b96787B33792O6505A38664C5781L09930m7457N927A23137o139L83251j98377
13349C01872g3086d625D3090L89398P5310A16784R2528J25944O7076J36418k34013
13338C04737J03452D8203O6089L5043M0329k3420a68162D14882I9492c2388C37106
13326h3487A80789L73283A17066A6973O46140A86930Q9893R045j4472j6700E7831
13314B51015n591C3064a34260B61255j17518K46135A19227K60126A87333b0078
13303A65855e8775A2831J94840A3930L45629A63373L13927I4556i0462A64015
13292C46106j52122J57996E1668j7175g2490C00279p9738N1094A3799b4903a536
$$ plain form
13280 68358 541536 131217 3016 -8445 145538 -232381 127715 243585 -48315 121966 -2439
13268 -19741 275059 50490 181779 -24260 28144 211070 -175698 366172 -290025 -8487 37417
13256 -2769 127702 225720 -96761 210149 178351 252560 332587 300697 -75134 258419 -245353
13244 269283 435346 -123874 9101 42177 347872 121214 20348 -44115 -277237 179429
13233 146960 141782 -40794 81706 113056 -159368 73295 -43444 75183 129261 259560 -83862
13221 -392297 73698 61006 171525 128080 -317267 -211827 365296 224921 134327 240302
13211 240302 76019 242173 50583 -11219 -95332 -211281 -45344 156374 248659 289247 -198683
13199 113408 223259 241642 -16391 172828 -54561 -7121 10517 164162 -27881 -86820 88455
$$ packed form
13280F8358M73178A31217C016h445A45538b32381A27715J15870d8315A21966b439
13268a9741B75059E0490J31289b4260B8144J82926a75698C66172b90025h487C7417
13256b769A27702R8018i6761B10149l1798P4209Q0027l1890g5134B58419b45353
13244B69283J66063a23874I101L3076L05695A21214B0348d4115k33122A79429
13233A46960n178d0794H1706L1350a59368G3295d3444G5183N4078J30299h3862
13221c92297G3698j2692J10519m3445c17267J05440C65296j40375r0594J05975
13211B40302G6019J66154E0583a1219q4113j15949d5344A56374R2285M0588a98683
13199A13408J09851J8383a6391A72828e4561g121A0517J53645b7881n8939H8455
$$ plain form
13187 19406 503623 139713 9128 -90797 116062 36601 -195757 78523 82930 304606 432701
13176 432701 192335 186444 5251 53472 -95008 212367 214888 -149294 213990 215447 -103910
13164 119909 -96452 -89955 -169985 -200981 84282 -294899 8211 168079 136181 85537 -132969
13152 -19958 75379 106057 -177125 -154265 62331 -206692 236043 9246 197590 -75040 -33188
13140 58790 -139383 -75180 -203240 318931 190278 139108 -352577 -132067 78520 264508
13130 264508 31554 -78000 -92093 -64989 -228051 136218 217649 -184532 -38650 382971 463333
13119 463333 194096 337082 101373 -45281 -119353 -265291 205025 187950 -62129 186720
13108 186320 284174 68794 -61827 -84364 -113986 6119 146109 29923 10463 -88612 -352068
$$ packed form
13187A9406M84217A39713I128i0797A16062C6601a95757G8523M407K21676J28095
13176D32701A92335n891E251M8221i5008B12367K521a49294B13990J457a03910
13164A19909i6452O497q0030l0996H4282b94899H211J59868l1898n0644a32969
13152a9958G5379L0678a77125K2860F2331b06692B36043I246J88344g5040c3188
13140E8790a39383O4203j28060C18931j28653n1170c52577a32067G8520J85988
13130B64508C1554g8000j4093K7104j63062A36218Q1431a84532c8650C82971Q0362
13119D63333A94096J42986A01373d5281p4072j45938B05025j7075f2129A86720
13108A86320R7854F8794f1827k2537k9622F119J39990B9923A0463h8612k63456
$$ plain form
13097 -352068 47109 -90808 162088 136511 108582 135054 62607 550088 -58578 -130901 -62959
13085 -42305 -120428 132661 -247022 -106651 134790 253916 -116126 756282 76056 -286031
13074 -62703 534762 79152 50609 -152797 234448 188064 307739 54722 -42969 392203 161617
13062 24850 32803 147262 109425 263634 -135882 -52938 215079 67848 234576 77684 165763
13051 165763 35040 334908 152005 -149240 359052 -74170 202235 135738 90956 215498
13041 215498 379935 -16036 -166821 -196035 450984 -185106 -22107 79637 -162260 -68157
13030 270042 417129 -83555 -75436 306563 -310615 -52839 90852 38494 -452194 174221 -303581
13018 3401 294066 117034 -316849 209975 -4517 -7584 -60924 48824 320517 121283 59488
$$ packed form
13097c52068D7109i0808A62088k5577k7929K6472F2607M87481e8578p2323f2959
13085d2305p8123A32661b47022a06651A34790J19126a16126G56282G6056b86031
13074f2703E34762G9152k8543a52797B34448m6384J19675E4722d2969C92203A61617
13062B4850P953J14459l7837J54209a35882e2938B15079F7848J66728G7684Q8079
13051A65763C5040K99868A52005a49240C59052g4170B02235o6497m4782J24542
13041B15498J64437a6036j50785k9214D50984a85106b2107G9637a62260f8157
13030B70042J47087h3555Q119C06563c10615e2839I0852C8494d52194A74221c03581
13018C401K90665A17034c16849B09975d517l067n3340D8824K71693A21283E9488
$$ plain form
13006 229153 -152030 51222 -146926 208415 -51782 53556 188202 -28898 -40468 -49488 18885
12994 -119922 -244375 -94595 -73472 316369 -113328 -226339 -101452 200690 -144651 9461
12983 -35236 173142 125591 -13307 -183329 332 -143133 125337 33336 -85008 119886 63759
12972 63759 -206805 92597 28998 -177578 129459 161520 277069 109528 -229965 -85111
12961 -30257 -162043 -277586 7481 50842 112867 204029 -70910 -31119 20009 142869 120939
12950 120939 146213 99482 143885 313095 111274 104551 -45613 130830 116128 271661 71551
12938 157248 114945 -35424 -83660 263602 190942 15524 193934 -166996 99478 -295692 19836
12926 -4521 4328 -79536 227385 -62 8299 -127285 -3363 -2889 323214 -247278 142823 -283529
$$ packed form
13006B29153a52030E1222a46926B08415e1782E3556J34646b8898j1570r020A8885
12994a19922j24453i4595K1123C16369a13328j13011a01452B00690a44651I461
12983c5236A73142m7551a3307j70022C32a43133A25337C3336h5008A19886n6127
12972F3759b06805I2597B8998a77578A29459L2061J15549A09528b29965h5111
12961c0257j31786j15543G481M3361O2025R1162g0910c1119B0009J22860k1930
12950A20939K5274m6731M4403J69210A11274o723d5613A30830j4702J55533G1551
12938A57248m2303c5424m8236B63602p2660A5524J78410a66996I9478b95692A9836
12926d521D328g9536B27385f2H299a27285c363M74C23214b47278A42823b83529
$$ plain form
12913 145672 -218643 -129439 124241 72574 -153901 104049 85607 134030 -252312 28259
12902 173580 -214747 19690 187072 174865 -99800 -92149 125992 29418 -29030 -279475 6202
12890 244793 -203677 -383922 -189904 -127913 51017 -167999 290464 -8239 326969 -46137
12879 -164325 -66867 -120850 325947 -34902 25897 1770 22578 -79463 -213961 101010 -26241
12867 393670 -360157 129586 -39759 -242308 -3732 190295 -215340 183615 60778 97178
12857 97178 -10083 108247 84480 216236 -194230 -181883 137183 40659 116743 -25286 101184
12845 -52363 -164434 -152450 220686 199147 417092 51060 103324 222268 373064 179959
12834 -165544 58900 -146072 -45084 245329 40562 95382 -24216 -7227 -135987 -136051 116615
$$ packed form
12913A45672b18643Q9204A24241n1667a53901A04049j8442M8423b52312B8259
12902A73580b14747A9690J67382j2207i9800P651A25992B9418b9030k50445F202
12890B44793b03677j80245a89904O1991E1017a67999B90464h239C26969d6137
12879a64325f6867n3983C25947c4902B5897A770K0808g9463j34498A01010b6241
12867C93670c60157A29586c9759k02549c732A90295b15340A83615F0778L6400
12857I7178a0083A08247k3767J31756a94230J2347A37183D0659P6084b5286A01184
12845e2363j12071J1984B20686k1539K17945E1060N2264J18944J50796A79959
12834a65544E8900a46072d5084B45329D0562N4820b4216g227j28760o4A16615
$$ plain form
12822 -377121 -31712 -266872 98691 112229 -4720 -133432 29586 142087 -44977 35695 -19531
12810 61418 -59172 268455 -245097 -156003 -129497 246834 -56091 59811 157392 -24713 17807
12798 -118603 -291004 -217532 40042 215449 578056 77611 -198037 302896 6054 -170314
12787 -140619 62145 52893 -11582 55051 78720 56534 -162597 -96098 -84710 266747 -4071
12775 -311717 14823 -100487 -62845 -264980 294215 -351693 -86840 112302 229209 1594
12764 158456 -71989 224748 448884 11363 35694 203846 -56319 414101 411675 -88980 -945
12752 176277 218348 80774 -164877 -71122 152689 148310 -19759 150438 42675 -77637 -98928
12741 -98928 472943 124787 -92017 185043 287590 183355 30815 132836 -60140 -65322 163399
$$ packed form
12822c77121c1712k35160I8691J3538d720j28712B9586J12501d4977C5695a9531
12810F1418e9172B68455b45097Q9094K6506B46834e6091E9811R7581b4713A7807
12798a18603j72401P3472D0042J75407L62607G7611a98037C02896F054a70314
12787a40619F2145r252a1582E5051K3669k2186a62597O6499J1388B66747d071
12775c11717A4823a00487L7642k02135B94215c51693h6840A12302J16907A594
12764A58456g1989B24748K24136A1363K4331J68152e6319D14101k426h8980i45
12752A76277M2071H0774a64877g1122A52689m379a9759A50438D2675g7637k1291
12741i8928D72943A24787i2017A85043J02547j04235C0815J02021f0140n182A63399
$$ plain form
12729 100873 221175 311027 87203 -31598 29209 -282175 -345988 -21203 183592 340993 -120140
12717 254115 -58437 119605 138334 318987 43295 -37862 -97251 250216 43754 195582 138876
12706 138876 120332 445796 -138311 -12614 120184 -13748 -17776 81562 305222 145305 84816
12695 84816 -280118 160920 -123291 -68776 -229404 46548 -51035 -78245 -399119 100926
12684 384408 -140007 -102635 -11115 191578 322903 368741 225061 58997 115570 170026 257182
12673 257182 255946 222389 46909 125036 -277470 164113 316090 301257 227388 -120602 -30423
12661 -210288 -267625 316785 170250 220414 98299 95212 82629 50399 -37710 54850 -81017
12649 173971 171130 332147 247786 -91972 -198002 71031 -221649 111507 -21677 -189336 -42002
$$ packed form
12729A00873J20302Q9852H7203c1598B9209b82175o3813b1203A83592J57401a20140
12717B54115e8437A19605J8729J80653D3295c7862n9389B50216D3754J51828n6706
12706A38876j8544L25464a38311a2614A20184a3748m028H1562K23660A45305o0489
12695H4816b80118A60920a23291N4515j60628D6548e1035k7210l20874A00926
12684C84408a40007L7372a1115A91578J31325M5838j43680E8997N6573N4456Q7156
12673B57182j236l3557D6909P8127b77470A64113J51977j4833p3869a20602c0423
12661b10288n7337C16785j46535N0164I8299l087j2583l2230c7710E4850h1017
12649A73971k841J61017q4361i1972j06030G1031b21649A11507b1677j67659d2002
$$ plain form
12637 131407 56944 -134513 -91307 32546 52503 27527 163569 -181629 -42419 188476 -37585
12625 299712 75185 434623 -80011 350639 -152545 138401 131889 -94745 116693 214675 275607
12614 275607 -229625 75350 3029 -139718 -43780 -259314 100988 -92702 102795 -76611 -278634
12603 -278634 159137 -404811 57955 -344080 138299 89374 51660 -216416 -194373 -158287
12593 -158287 62700 -24366 -188496 16073 -218125 175357 -384324 57630 12354 -517462
12582 -113137 30473 -153958 84338 161343 -57117 340948 -28503 -32007 76276 -37191 262261
12570 -148210 58008 1242 -173592 -143829 216449 98108 221047 46048 -220761 -169735 -117660
12559 -117660 224755 -60343 -97318 -145822 43746 -31475 150916 213435 -44754 -9109 145806
$$ packed form
12637A31407E6944a34513M3206C2546J9957k4976J36042a81629d2419A88476c7585
12625B99712G5185L59438h0011C50639a52545A38401o512i4745A16693R7982O0932
12614B75607b29625G5350C029a39718d3780k15534A00988i2702A02795g6611k02023
12603b78634A59137d04811E7955c44080A38299m8925l7714b16416K2043L6086
12593a58287F2700b4366j64130A6073b18125A75357c84324E7630A2354e17462
12582a13137C0473a53958H4338P7005e7117C40948b8503l504G6276c7191B62261
12570a48210E8008A242a73592K9763B16449I8108J22939D6048b20761N1026N2075
12559a17660B24755f0343l6975m8504D3746c1475A50916O2519d4754i109A45806
$$ plain form
12547 229013 -86254 155420 -66164 -113239 17975 337421 -473856 135277 123320 -245029
12536 65560 -80502 -72214 304194 -50608 -15390 208514 54009 -44791 -253439 -77588 -52428
12525 -52428 76196 -332522 5967 69527 -22773 139064 27 -352109 87536 -242303 245123
12513 36094 283940 -212738 155191 -277789 55849 -22584 -29482 197382 -147087 268465
12502 -58923 154383 64170 -59734 -31995 -50727 -213670 -127745 145522 101515 -69376 -148802
12491 -148802 167641 82644 357747 258251 492334 -80680 -13400 153865 -206384 58577
12480 -117144 75712 -145871 163883 -54759 69263 142287 -172268 -141109 193952 -139585
12469 18293 -15321 -85857 37325 -157303 -295529 -214603 -279737 66930 -165480 92997 -149669
$$ packed form
12547B29013h6254A55420f6164m7075A7975L19446d73856A35277j1957b45029
12536F5560h0502Q288C04194e0608a5390B08514E4009d4791k08648g7588K5160
12525e2428G6196c32522E967O3560b2773A39064B7c52109H7536b42303B45123
12513C6094K47846b12738A55191b77789E5849b2584o898A97382a47087B68465
12502e8923A54383F4170e9734K7739j8732j62943Q5925A45522m4007f9376p9426
12491a48802A67641H2644K75103r9496K34083h0680a3400A53865b06384E8577
12480a17144G5712a45871A63883e4759F9263P3024a72268L1159A93952a39585
12469A8293a5321p0536C7325a57303j38226Q0926o5134F6930a65480I2997a49669
$$ plain form
12457 219160 -368960 78053 3025 163689 117946 9188 -288457 184255 -18344 177635 -143008
12445 3490 -73054 113884 -94626 -34560 203802 217179 63018 -414870 -137244 -32878 24042
12433 -122201 5647 145170 134848 -145369 176156 -327916 -306663 89794 -198995 -151062 -262359
12422 -262359 131375 223157 -73506 -134398 -16328 -176728 -72590 -97334 -331720 -116184 -58259
12411 -58259 4616 194529 3588 -108534 269347 117994 -248703 -110507 -247884 79724 116407
12400 116407 299366 -61220 -160110 -16538 -38853 46727 160162 106248 325480 24198 -229800
12388 -145165 27225 -47074 388335 205215 -57704 -141925 -114395 170486 162210 152065 41788
12376 -169427 163156 114528 -136844 -126900 -214050 8854 190245 396161 101094 -46038 -96437
$$ packed form
12457B19160c68960G8053C025J60664m5743I188b88457A84255a8344A77635a43008
12445C490g3054A13884i4626c4560B03802J3377F3018d14870a37244c2878B4042
12433a22201E647J39523j0322a45369A76156c27916K1253H9794a98995M7933j11297
12422b62359A31375R1782g3506o0892a6328j60400g2590k4744k34386a16184N7925
12411e8259D616J89913C588a08534B69347A17994b48703a10507j37377G9724L6683
12400A16407J82959f1220r8890a6538k2315D6727J13435n3914K19232B4198b29800
12388a45165B7225d7074C88335j83120e7704q4221K7530A70486q276j0145D1788
12376a69427A63156m8628a36844R944q7150H854J81391K05916A01094d6038n0399
$$ plain form
12365 -96437 49781 168439 -146864 -404171 -122253 -34148 -212800 390588 174628 -79471
12354 -175122 -225387 -81976 138985 -109166 -128568 38308 90139 28345 184606 243599 367009
12343 367009 93768 163335 259887 82413 128465 216401 81124 -112903 256424 -12112 -2931
12331 -17673 55047 450059 279900 34793 -23775 -66965 57010 -25371 -114660 235895 -300281
12319 -118804 418943 269465 347005 259952 -63470 168382 -9035 141868 4558 14750 331127
12308 331127 54061 -65777 -224352 113608 124739 -57440 -143270 103342 -101886 13355 -276090
12296 57831 -286437 105625 148152 149124 158207 -259186 282300 -408193 114526 -315655 -160178
12285 -160178 172742 -52938 49493 -70095 5397 237033 63204 -36096 -150466 134425 118230
$$ packed form
12365i6437D9781J18658a46864k57307a22253c4148j78652C90588A74628g9471
12354a75122n0265h1976A38985a09166j9402C8308N1831B8345J56261N8993J23410
12343C67009I3768O9567R6552H2413M6052Q7936H1124a12903B56424a2112b931
12331a7673E5047L95012j70159C4793b3775m3190E7010b5371q9289B35895c00281
12319a18804D18943j49478P7540q7053f3470A68382i035A41868D558J0192L16377
12308C31127E4061f5777j58575A13608J1131e7440q5830A03342a01886A3355b76090
12296E7831b86437A05625M2527R72R083b59186B82300d08193A14526c15655J55477
12285a60178A72742e2938D9493g0095E397K31636F3204c6096j14370A34425j6195
$$ plain form
12274 118230 457722 116411 29988 115423 192202 13643 191658 -3208 468095 -61150 94248
12262 193903 117851 -181053 98614 -120609 249196 107085 211594 512024 24911 -68765
12251 98949 22778 -7086 245642 63110 -234846 138518 262831 231272 361396 -192512 149294
12239 376559 -97475 -10546 21650 -16843 -226907 -116021 186667 15225 78207 155299 403951
12228 403951 305515 -221823 129175 -43096 -44968 74878 237823 12356 299161 656502 168349
12216 258254 124498 446077 194919 -99673 200886 -5469 294997 261952 277684 -28679 -2394
12204 409218 280401 -70790 -88063 32986 155418 177777 176877 152426 523467 187638 203168
12193 203168 181078 564882 191923 315589 228019 162758 254433 379034 -21335 83054 -12356
$$ packed form
12274A18230L39492A16411B9988Q5435P6779A3643J78015c208D68095f1150I4248
12262A93903p6052a81053I8614a20609B49196A07085J04509L00430B4911f8765
12251I8949B2778g086B45642F3110b34846A38518J24313l1559J30124a92512A49294
12239C76559i7475a0546B1650a6843k10064J10886A86667A5225O2982P7092K48652
12228D03951r8436b21823A29175d3096j872G4878J62945A2356K86805L57341A68349
12216B58254A24498L21579A94919i9673B00886e469B94997l3045J5732b8679b394
12204D09218j28817g0790j7273C2986J22432K2359r00k4451L71041A87638J5530
12193B03168k2090L83804A91923J23666q7570o5261R1675J24601b1335H3054a2356
$$ plain form
12181 -99818 116338 -159440 261078 -46145 5915 200851 210945 123506 368510 117985 -216169
12169 203294 317767 198227 111075 310265 -89679 110915 132526 7796 179516 74714 361210
12158 361210 324254 265250 238271 -3460 416043 -110246 -181312 216809 33630 -212582 -128728
12147 -128728 133851 117573 281417 50629 158493 98583 95861 8316 414591 -159958 161761
12135 271301 -27963 -114131 -87018 -344062 134367 21845 84069 224817 -20499 -249356 110749
12123 55921 -78205 49378 117095 -121999 526608 73390 233363 58430 3378 180400 -190345
12111 -115757 401420 8076 -102127 -38667 -81481 -115615 -100409 -100250 58272 28251 -159414
12099 1811 -31083 -239546 317916 312563 48127 157281 25339 40972 118090 -117560 56052
$$ packed form
12181i9818A16338a59440B61078d6145E915J94936J0094q7439K45004A17985b16169
12169B03294J14473j19540q7152J99190h9679A10915K1611G796J71720G4714K86496
12158C61210l6956n9004k6979c460D16043a10246p1066B16809C3630b12582Q3854
12147a28728A33851j6278J63844E0629J07864n9910k722H316M06275a59958A61761
12135B71301b7963q6168K7113k57044A34367B1845O2224J40748b0499k28857A10749
12123E5921g8205D9378O7717a21999E26608G3390J59973E8430C378J77022a90345
12111a15757D01420H076a02127c8667m2814l4134J5206J59E8272B8251a59414
12099A811c1083k08463C17916n353D8127J09154B5339J5633P7118a17560E6052
$$ plain form
12087 253852 -99128 -84532 -186367 -45558 -243848 111494 76106 -9131 213933 46434 175651
12076 175651 -107924 354864 160970 -129019 285770 -72475 259370 160991 180659 230786
12066 230786 -200026 108473 24440 276958 -16999 120087 56475 399611 -251039 -63128
12055 261360 -124962 -2261 -74520 100055 128331 171756 -160523 176487 -138973 -147530 117194
12043 303410 -50944 -111125 301645 -102332 -192967 -132831 -532357 -75549 55206 100166 182345
12032 182345 150341 130246 386762 45283 190600 -208773 -264373 -80290 -13712 59147 -234493
12020 -44409 -52279 -288471 109760 210617 261490 -107666 277123 -150709 59226 -270115
12009 16458 148080 -49822 179990 46425 -87914 -311375 261731 -138209 252040 51552
$$ packed form
12087B53852i9128J4596j01835d5558j98290A11494l5388i131B13933D6434J29217
12076A75651a07924C54864A60970a29019B85770g2475B59370r8379J9668N0127
12066B30786b00026A08473B4440K52518a6999A20087E6475L43136b51039f3128
12055B61360a24962b261p2259A00055K8276M3425a60523A76487a38973q557A17194
12043C03410e0944o0181C01645a02332r0635O0136l99526g5549E5206M4960Q2179
12032A82345l2004k0095K56516D5283J45317b08773n5600h0290a3712E9147b34493
12020d4409p870k36192A09760J00857N0873a07666B77123a50709E9226b70115
12009A6458J31622d9822A79990D6425h7914k23461B61731a38209B52040E1552
$$ plain form
11998 163629 77055 -176267 -51208 99468 -328753 -187752 176120 -157968 -43711 -166145
11988 -166145 -38779 -108683 -109864 -24097 -45397 -27770 192854 -2781 162380 330107 -5877
11976 18095 335617 26822 -80922 98258 -159617 205398 19944 51991 -32730 319335 -61624
11964 -356802 -352780 59609 -190513 -136253 301869 -117247 -69860 -32794 24854 179295 -154992
11952 -131308 23429 -72660 -141530 50360 303886 -52988 -245559 -131439 42786 -86322 -60583
11941 -60583 163386 -178475 -326733 -28134 64959 7345 -75635 -126568 280668 171790 -31884
11929 73719 -166754 321817 -36866 254853 109184 70899 13145 4835 -161279 185679 41780
11917 71905 -196471 -308872 -306631 -159417 326334 -56042 -13885 308833 49120 29850 -296325
$$ packed form
11998A63629G7055a76267e1208I9468c28753J41001A76120a57968d3711j22434
11988a66145c8779o9904j181b4097k1300J7627A92854b781A62380J67727e877
11976A8095L17522B6822h0922I8258a59617B05398A9944L2047c2730C19335f1624
11964c56802M022E9609a90513N4260C01869a17247M7387c2794B4854J54441a54992
11952a31308B3429g2660o8870E0360K53526e2988j92571J14120D2786h6322K5739
11941f0583A63386a78475j48258b8134F4959G345g5635n0933B80668j08878c1884
11929G3719a66754C21817c6866B54853A09184l8285A3145D835a61279A85679D1780
11917G1905a96471j12401K241J47214C26334e6042a3885C08833D9120j9270b96325
$$ plain form
11905 -119467 34170 35648 -33387 -147886 76831 45588 -45071 -22209 89087 82118 -179035
11893 -20620 -240780 109593 47643 275513 129853 -240789 -164422 -144074 -199752 -399873
11883 -399873 -10880 39167 -31047 -293272 158984 138282 -24716 -142364 118942 -56641 52793
11871 -83866 -228525 89646 -381988 -48055 -17872 -160472 324246 -694 -185397 9084 -269926
11859 -57230 5392 -180848 66284 -113852 361215 190120 -95366 193078 -101688 -357106
11849 -357106 -61057 -292822 -21603 73520 -36722 -130765 -37674 -37441 127659 209092 -74792
11837 276618 -35976 -309305 -160606 -42678 -36675 -318983 -88687 303832 -351150 -206858
11827 -206858 -105067 -149797 -432092 103471 -53280 304849 -283641 306994 -78439 -155713
$$ packed form
11905a19467C4170J478c3387j14499G6831l1243d5071b2209H9087o969a79035
11893b0620k20160A09593D7643K27870A29853b40789P6367K0348n5678k00121
11883c99873a0880C9167c1047k62225A58984k0702b4716j17648A18942e6641E2793
11871h3866j44659H9646c81988d8055a7872j42600C24246f94j84703I084b69926
11859e7230E392a80848F6284a13852C61215j71095i5366A93078a01688k55418
11849c57106f1057k31765b1603G3520c6722r4043c7674K33A27659Q1433g4792
11837B76618c5976k73329J48699d2678O003k82308h8687C03832c51150J44292
11827b06858J01791m4730k82295A03471e3280C04849b83641C06994g8439p7274
$$ plain form
11817 -155713 -219842 265653 -124869 -135631 703 -58443 -381033 116605 -1294 311601 -119980
11805 -38323 71347 44360 13631 -325874 -272407 -429391 151761 -76435 -102219 -42899 82422
11793 -678003 25877 47619 85390 -237241 -248930 -18184 -35472 136976 -65796 -7950 -165952
11782 -165952 -95861 -184631 -119235 -99949 57609 -16307 -138299 -26639 -24572 -51136 -37320
11771 -37320 -224723 314517 -82585 -300137 -116944 -294680 -16069 134533 -115217 59887
11760 -335405 211781 43573 -54158 -157812 33436 324609 136218 193161 -142392 360603
11749 -127473 -71164 6247 245038 -166 129831 -244376 -199424 -426596 -192498 -195330 -87110
11737 140098 105616 -202290 16583 -107204 224870 201928 4919 197615 -2531 147665 81241
$$ packed form
11817a55713o4129B65653a24869j0762G03e8443l22590A16605a294C11601a19980
11805c8323G1347k6987A3631c25874N3467j56984A51761g6435k5784d2899H2422
11793f78003B5877K1742L7771b37241j1689a8184j7288A36976f5796g950j58002
11782a65952P0091q8770O5396J9286E7609a6307j21992b6639K067k6564J3816
11771c7320j87403C14517h2585k17552a16944j77736a6069A34533a15217E9887
11760c35405B11781D3573e4158j03654C3436K91173A36218N6943a42392C60603
11749a27473N6309F247K38791a66A29831b44376M4952k27172a92498k832h7110
11737A40098l4482b02290A6583a07204B24870k2942D919J92696b531A47665o6424
$$ plain form
11726 81241 -128308 -267653 96732 6094 63582 -60244 148227 304009 10015 -97234 223763
11714 416946 -249711 -56221 -157612 123939 128876 -143459 -80960 -86182 287940 39741 -279556
11702 -43648 -165121 233003 -269415 -331666 71393 217450 23794 339832 -23588 -232159
11692 -232159 119593 12440 61849 -171488 -27419 77282 257960 235280 135174 -149353
11681 228051 -437446 115432 -281658 -59908 338119 248104 -148097 -9600 47631 -105601
11670 77629 -108082 74915 -74492 -34268 165542 -164472 211793 -294961 247470 -108937
11659 391991 77968 95580 20628 -65429 101551 -42256 59219 -101101 220487 30598 -18188
11647 98544 -136043 -37981 -24839 -137146 91102 180026 -89304 -410490 93111 82167 104874
$$ packed form
11726H1241a28308j39345I6732F094N7488f0244A48227J55782A0015i7234B23763
11714D16946b49711e6221j01391A23939M937a43459O2499n222B87940C9741b79556
11702d3648j21473B33003b69415o2251G1393J46057B3794L16038b3588k08571
11692b32159A19593A2440M9409a71488b7419G7282J80678k2680j00106a49353
11681B28051d37446A15432b81658e9908C38119r0015a48097i600D7631a05601
11670G7629a08082G4915g4492c4268A65542a64472B11793b94961B47470a08937
11659C91991G7968J7612B0628f5429A01551d2256E9219a01101B20487C0598a8188
11647I8544a36043c7981J3142j12307I1102Q8924h9304l21186I3111j0944K2707
$$ plain form
11636 104874 -69642 261 131409 358589 -174991 119458 11428 -423925 -138250 172472
11625 70199 -232186 209661 -177667 281202 339590 -2321 -147400 -213753 -142626 -204613 58956
11613 -90185 531253 -42176 101200 27920 130181 123647 31894 127421 -145947 13800 182215
11602 182215 24650 -74726 -58545 384522 -299237 189582 172617 54790 42684 -105215 47230
11590 -144667 -77588 -8336 -62905 214007 -82600 -42458 -217529 208406 59800 122879 -42834
11578 25737 -34597 152780 -294767 231809 -86077 76551 -13751 -17362 142644 -291714 -100992
11566 168010 133025 270763 267183 -139399 -101959 -39536 3177 107508 41627 -98700 -90239
11555 -90239 221387 12300 51357 291642 165326 47460 -35347 -178708 117848 439177
$$ packed form
11636A04874f9642B61J31148K27180a74991A19458A1428d23925a38250A72472
11625G0199b32186B09661a77667B81202N8388b321j45079o6353P1127o1987E8956
11613i0185E31253d2176A01200B7920J02261o534C1894R5527a45947A3800J68415
11602A82215B4650g4726J6181C84522b99237A89582j6965E4790j2106a05215D7230
11590a44667O7079h336n4569B14007h2600M0142j75071B08406E9800O3079d2834
11578B5737c4597A52780b94767B31809h6077G6551a3751l611A42644b91714a00992
11566A68010l4985J37738l580a39399L7440c9536C177J04331D1627i8700Q461
11555i0239B21387A2300L9057K40285j26316D7460c5347j43361A17848L21329
$$ plain form
11545 439177 7170 -176743 72752 -2568 -250455 244758 38655 311072 180329 495399 -14539
11533 -169447 161617 58599 35999 194470 -46355 -21816 -127336 142580 -116566 279020
11522 126949 111748 -336929 278146 181996 -125361 101503 95673 -209719 -115104 174325
11511 30098 153266 64518 120428 66864 13131 204183 210270 -3294 -91473 64322 -5523 230985
11498 103342 208462 175760 167116 -202555 105982 325635 245128 -15216 186129 59798 60405
11487 60405 4690 409647 175304 327467 161778 -68859 84991 3513 -160103 71488 -188240
11475 152365 -220264 296141 94190 133713 265282 238364 26291 -100321 14795 303716
11465 303716 17166 86639 -124703 6192 -177059 404242 -19197 39578 -48099 23729 -149522
$$ packed form
11545D39177G170a76743G2752b568k47887B44758C8655K72417j30743L15070a4539
11533a69447A61617E8599k2600J58471d6355b1816j05520A42580a16566B79020
11522A26949j5201c36929B78146r6150a25361A01503n830b09719R4615A74325
11511C0098J23168F4518N5910n3564A3131J91052O087c294q8179F4322e523B30985
11498A03342J05120l2702q644b02555A05982K19653q0507a5216A86129E9798O07
11487F0405D690M04957A75304J52163A61778f8859H4991C513a60103G1488a88240
11475A52365b20264B96141I4190L9523J31569k6918B6291a00321A4795K88921
11465C03716A7166O9473a24703F192a77059D04242a9197C9578d8099B3729a49522
$$ plain form
11453 -95588 72763 47456 -68552 201473 -121169 401616 -11142 184219 96500 99893 31083
11441 171052 494904 -153383 58396 155011 59319 -176257 112377 208776 -251599 -267124
11431 -267124 137478 -53520 136906 -297794 274633 -56581 -189959 255622 137893 87441
11421 87441 67472 129331 -62653 -185891 -66224 -210690 244717 -217985 -34629 148558 -140520
11409 1407 174162 -19689 32545 -67783 306242 -14152 21934 19887 361603 322837 74735
11397 -144099 -247979 -50625 45782 195268 208654 177741 -37344 -254401 -103402 106935
11386 20941 113220 -213854 2218 132381 66823 -393428 203008 -261386 215353 316112
11376 316112 77068 -55436 -250404 -145519 -31741 -211408 85619 -215961 -96031 -87908 238111
$$ packed form
11453i5588G2763k5307f8552B01473a21169D01616a1142A84219q7719L393C1083
11441A71052L23852a53383E8396R6615E9319a76257A12377R6399b51599j5525
11431b67124A37478e3520A36906b97794B74633e6581j33378B55622j17729n0452
11421H7441j9969O1859f2653j23238f6224j44466B44717b17985c4629A48558a40520
11409A407J72755a9689C2545f7783C06242a4152B1934k047L41716l8766G4735
11397a44099j03880e0625D5782J49486J3386l0913c7344k17057a03402A06935
11386B0941R2279b13854B218J30163o5558c93428B03008b61386B15353J00759
11376C16112G7068e5436j94968J04885c1741j79667H5619b15961i6031Q123B38111
$$ plain form
11364 -141534 156718 -158933 -65944 -165721 -138211 -80095 -61431 -195232 -13255 -32049 -9722
11352 5112 98361 -41367 -15519 174106 -299479 -224136 178453 50664 -86750 -266442 24264
11340 113119 100175 -46706 14768 156935 -123472 -15544 52428 154175 470458 -75538 -129433
11329 -129433 -269281 -25220 -192697 -81056 -104547 -170015 224105 31669 29244 -103593 -216467
11318 -216467 -221615 73371 286587 -392444 -174692 78208 -139238 81183 90374 408121 -156066
11306 218537 -59557 -85610 -268569 -42097 200312 424061 100696 -138875 253829 -44940
11295 140489 285779 -307578 49482 -3206 -222172 -44327 -268394 225890 -55510 174500
11284 -3877 -305436 -417749 112996 354604 73495 179507 -302758 -100353 78114 292984
$$ packed form
11364a41534A56718a58933f5944r9777K7510N8116J8664j33801a3255j8794i722
11352E112R3249d1367a5519A74106b99479P5343A78453E0664h6750j79692B4264
11340A13119j2944d6706A4768J42167a23472a5544E2428J01747L16283g5538n3895
11329a29433j39848b5220j67477h1056k3491o5468B24105C1669k425a03593j12874
11318b16467n148G3371K13216c92444a74692G8208a39238H1183R191L17747a56066
11306B18537e9557k6053j82959d2097B00312K23749A00696a38875B53829d4940
11295A40489J45290c07578D9482c206k18966d4327k24067B25890e5510A74500
11284c877l01559j12313A12996K41608G3495J06012c02758a00353G8114K14870
$$ plain form
11274 292984 35468 -82820 145151 -351975 91151 250807 -224879 -471 56589 -361685 -86471
11262 -223134 -185930 -113664 -20668 -184823 78420 -74312 114537 -157092 -232417 -111572 -7473
11250 162800 186405 292540 -30456 -344936 -51232 166078 -90485 -12913 -74301 7270 157912
11239 157912 -29420 -118733 -129589 40988 -8706 -136632 81841 -62485 -74034 -199710 -484170
11228 -484170 -341094 -62207 -179700 -299773 57505 -214618 105183 -263970 -205876 136484
11217 -456284 -441259 84930 -14115 1152 88498 -70951 -24255 3826 -53299 -93253 -4221 -126165
11205 -126165 -434077 182154 -61619 -202756 -258199 -69981 -189625 87008 20778 33930 -258285
11193 -8871 -266109 29158 259797 -358412 163673 6509 123713 269958 -125113 -95151 128934
$$ packed form
11274B92984C5468h2820A45151c51975I1151J59656b24879d71E6589c61685h6471
11262b23134L7204P2266b0668j64155G8420g4312A14537a57092p5325a11572g473
11250A62800K3605J06135c0456l14480e1232A66078i0485a2913o1388G270J50642
11239A57912b9420q9313j0856D0988h706j27926H1841f2485j1549j25676k84460
11228d84170J43076f2207j17493j20073E7505b14618A05183b63970N8094A36484
11217d56284J5025H4930a4115A152Q7346g0951b4255C826e3299l9954d221j21944
11205a26165l07912A82154f1619j41137n5443f9981j19644H7008B0778J3152b58285
11193h871k57238B9158K30639c58412A63673F509J17204J46245a25113K9962A28934
$$ plain form
11181 -138270 32223 -107584 -264583 -127830 -347735 -299617 193175 35187 -137541 -12857
11170 27672 -147255 99136 -239549 -91126 313640 246194 133563 -2672 204027 94209 -173587
11158 -106120 -63987 -226692 365471 156430 48708 -23501 147908 -61707 -135163 -177346 -104902
11147 -104902 47403 71033 -63511 -259510 -26036 128375 -152322 220387 182215 311505
11137 311505 -24132 -355230 -167232 -201543 128864 -77086 -240579 63525 98312 298671
11127 298671 -34038 10842 217991 134989 19171 138666 21148 107606 -124598 -73785 -72598
11116 -72598 -169245 -88911 252928 13243 141296 253482 -138288 55637 -130258 -538 68793
11104 -344813 199562 132285 83616 -209485 212083 -7025 63857 -127714 131036 -25827 241849
$$ packed form
11181a38270C2223a07584j56999a27830k19905M8118A93175C5187a37541a2857
11170B7672a47255I9136b39549i1126C13640o7446j12631b672B04027I4209a73587
11158a06120M2133j62705C65471A56430D8708b3501A47908f1707p3456m2183P2444
11147a04902D7403K3630f3511j95999b6036A28375a52322B20387l8172J29290
11137C11505b4132l31098a67232l4311A28864g7086j63493F3525L4787K00359
11127B98671c4038A0842K07149q3002A9171J19495B1148Q6458a24598N0813J187
11116g2598r6647Q0334B52928A3243J28053J12186a38288E5637a30258e38F8793
11104c44813A99562o7277m8669b09485B12083g025F3857a27714A31036b5827B41849
$$ plain form
11092 35178 139392 -52234 343427 282717 -125133 106 197505 263262 -4058 -186547 322633
11080 241695 -31818 422415 405270 -152562 109618 29252 -29989 172384 221359 2807 -51168
11068 60765 218692 74543 -28544 273109 294529 314469 218690 671361 625905 398365 600594
11057 600594 549996 651181 363490 220131 412377 927388 678433 472322 624928 608576
11047 608576 812470 797041 637048 1072762 354742 418581 393919 494490 923874 709150
11037 709150 718180 505788 284220 712107 641660 349515 821409 713640 810607 455110
11027 455110 788522 639094 591243 994921 598084 1050739 462605 455961 562291 416692
11017 416692 334861 484065 550038 745306 453371 848403 401117 498997 645960 529466
$$ packed form
11092C5178J04214e2234C43427o0710a25133A06J97399O5757d058j82489C22633
11080B41695c1818D22415j7145a52562A09618B9252b9989A72384M8975B807e1168
11068F0765J57927G4543b8544B73109K1420J9940r5779M52671m5456k27540K02229
11057F00594n0598J01185k87691j43359J92246N15011k48955k06111J52606j6352
11047F08576K03894j5429j59993M35714C54742O3839k4662J00571M29384k14724
11037G09150R030k12392k21568M27887p0447k92145M71894j07769R6967l55497
11027D55110L33412j49428m7851M03678l96837M52655D62605o644J06330j45599
11017D16692q1831J49204O5973J95268k91935L95032D01117R7880J46963j16494
$$ plain form
11007 529466 351710 389680 706873 549377 575764 487419 493325 779549 238040 325807 330946
10996 330946 569261 636883 977242 519501 475929 780083 307215 679613 351189 471714
10986 471714 530751 999307 666909 713193 907814 937021 684283 780840 980897 1111213
10976 1111213 751132 1643279 1203378 1556398 1791433 2101486 2309252 2083783 2187378
10967 2187378 2542738 2369521 2034891 2097315 2101305 1859897 1728465 1433063 1382313 1664987
10957 1664987 1155628 1227438 1429217 1646889 1542187 1222017 1247158 1165357 1223819 809546
10947 809546 750693 595084 318893 491309 405082 553898 538367 131505 183990 16753
10936 144841 19100 404133 353144 125231 190967 88751 32264 -74456 -85026 -285298 -8097
$$ packed form
11007E29466j77756L7970L17193j57496K6387q8345N906K86224B38040Q7767N139
10996C30946K38315O7622L40359m57741m3572L04154C07215L72398l28424J20525
10986D71714N9037M68556l32398M6284J94621K9207k52738R6557K00057J30316
10976A111213l60081Q92147m39901L53020K35035L10053K07766k25469J03595
10967B187378L55360j73217l34630O2424L990k41408j31432k95402n0750K82674
10957A664987n09359P1810K01779K17672j04702l20170K5141q1801N8462m14273
10947H09546n8853j55609k76191J72416q6227J48816j5531A31505N2485A6753
10936A44841A9100L85033n0989A25231O5736H8751C2264g4456j0570k00272h097
$$ plain form
10924 87039 399448 323748 127996 106668 -7538 -121859 143886 96678 -100725 -371868 482993
10912 -269170 -179994 -70615 -138548 -167257 -70501 -6878 -26614 -39508 -207975 141863 -296656
10900 -164394 94194 318509 303491 129754 -327948 -238411 -85603 -64716 -282568 -53635 -107910
10889 -107910 -112064 161603 -3431 -325373 -86571 -83158 234575 -30635 217572 -330306 -78338
10877 -352200 -233515 -1791 -174077 163 -922 193924 -226020 96931 117154 -84090 91904 -31324
10864 -86686 52716 -242148 314019 -148606 -99876 -233158 -322092 324211 -158397 -153455 52469
10852 -31594 -81266 -70866 -85892 -343965 33028 -102431 -290378 -237452 -227065 127648 -130798
10840 -70438 81921 -17923 -137268 -192850 95481 -8724 318695 -164158 -17022 -293048 101275
$$ packed form
10924H7039L12409p5700A27996k1328g538j14321A43886m7208a00725k71143D82993
10912b69170Q9176g0615o7933k8709g0501f878j9736j2894j68467A41863b96656
10900a64394I4194K24315j5018A29754c27948Q9537h5603K0887k17852e3635n4275
10889a07910m154A61603c431l21942h6571L413B34575c0635B17572c30306g8338
10877c52200J18685a791j72286A63i22A93924b26020I6931K0223h4090I1904c1324
10864h6686E2716b42148C14019a48606M8730j33282q8934C24211a58397M942E2469
10852c1594m9672J0400j5026k58073C3028a02431j87947N2926J0387A27648a30798
10840g0438H1921a7923j19345n5582I5481h724C18695a64158a7022k76026A01275
$$ plain form
10828 418036 -405121 244232 -262107 77197 -128240 -411177 122041 -135342 -245036 -137153
10818 -137153 -123546 -146923 -243691 103150 -147065 -101083 -227495 172557 -59939 -154679 28106
10806 -123114 102720 36989 8017 -106822 -199937 -77332 -209191 -267852 -340470 42933 140715
10795 140715 15827 -56565 -166719 -43703 126925 113215 -235889 -179866 -123500 -74646 120062
10783 -252316 158440 67372 128115 94064 -85539 -175126 -217901 -99901 158641 -3212 -181357
10772 -181357 -261045 -27265 -43648 -157511 -335180 189040 -187942 -77702 286096 -274038
10761 -163460 -43371 -23780 -225120 -9819 -479274 141962 -190944 -147219 185765 153212 117821
10750 117821 -22258 31453 -199371 -142682 2665 -70291 149077 12459 32434 -125498 -123201
$$ packed form
10828D18036d05121B44232b62107G7197a28240k82937A22041a35342j09694J07883
10818a37153J3607k3377r6768A03150a47065M5982j26412A72557e9939r4740B8106
10806a23114A02720C6989H017a06822r3115g7332j31859n8661p2618D2933R7782
10795A40715A5827e6565j10154d3703A26925j3710b35889N6023N6366M8854A20062
10783b52316A58440F7372O0743l4051h5539q9587m2775i9901A58641c212j78145
10772a81357p9688b7265j6383j13863j77669A89040a87942g7702B86096b74038
10761a63460d3371J9591k01340i819m69455A41962a90944M3725A85765l2553l5391
10750A17821b2258C1453a99371N6689B665g0291A49077A2459J9975a25498K297
$$ plain form
10739 -123201 85230 -442449 -109618 -33994 -35161 -137164 -124589 -227756 234065 -421544
10728 -302461 -65787 136589 260003 68520 -318558 202899 173816 -76398 96428 220586
10718 220586 17941 40762 -96565 -10099 -49358 36891 -179698 -210111 -271205 -320457 11103
10706 -29178 -189496 189602 148918 116780 -49145 153437 -11813 195252 -344389 97223 -18187
10694 -93565 159747 -134014 -408429 -242853 -227644 -83678 64778 -237357 76089 -98846 -133922
10683 -133922 -419192 -197473 222335 192385 -106670 -233560 89873 114849 -155488 -351440
10673 -351440 -301748 103126 -319294 -377999 -138461 -30969 -182103 133565 -241131 -101634
10662 -188778 228621 -213909 205437 105407 -41601 -32332 -5564 -86547 153132 11592 1901
$$ packed form
10739a23201H5230d42449a09618c3994j167j02003J2575j03167B34065d21544
10728c02461f5787A36589J23414F8520c18558B02899k9083g6398I6428J24158
10718B20586A7941K2821i6565a0099l9259C6891a79698l0413o1094m9252A1103
10706b9178j60318A89602m0684l2138d9145A53437a1813A95252c44389I7223a8187
10694i3565A59747a34014k74415J65576J5209h3678F4778b37357G6089i8846l5076
10683a33922k85270a97473B22335k9950a06670j26890H9873K4976a55488j95952
10673c51440M9692A03126c19294n8705a38461c0969j51134A33565b41131a01634
10662a88778B28621b13909B05437j00030d1601R269e564q0983A53132A1592A901
$$ plain form
10650 -498356 -12086 -135688 -51922 -200839 -125759 -208248 -76366 -175229 1647 82496 -85302
10638 -60886 -251424 -176768 -322395 -39948 -120984 8998 -333018 46702 -129744 -182986 143782
10626 5846 -408618 32721 -113306 85817 -236199 -410897 -8545 258577 48431 63760 49654
10615 49654 -218147 489723 186659 -248957 43739 62801 -73003 -36601 11882 -155823 -427510
10604 -427510 86789 -45182 -34936 223277 -334987 -122293 -32409 -30903 18271 141509 183968
10593 183968 -261386 128042 -45220 -308759 124501 -51805 -29476 -65780 263155 250383
10583 250383 -34848 -338380 136295 152742 6210 105502 48839 190955 -13577 172244 -207910
10571 207889 -6196 -98954 -333309 -252514 86248 -142243 -116714 -14700 -148791 -68221 93612
$$ packed form
10650d98356a2086j23602e1922j48917P5080q2489g6366r8863A647Q0849h5302
10638f0886j90538P4656j45627c9948q1036H998c33018D6702a29744n3242A43782
10626E846d08618C2721a13306H5817b36199j74698h545B58577D8431J5329j4106
10615D9654b18147D89723A86659b48957D3739J9062g3003L6402A1882a55823k71687
10604d27510H6789d5182J0246B23277c34987a22293c2409J506A8271J23238M2459
10593A83968b61386A28042d5220k63539A24501e1805K2329l6304B63155j2772
10583B50383c4848l03532A36295J6447F210R9292D8839J42116a3577A72244b07910
10571B07889f196r2758k34355Q0795H6248a42243K5529a4700j34091f8221I3612
$$ plain form
10559 34644 -22470 65322 158581 -155132 -360348 -43293 -215724 -330339 -79623 183320 -358201
10547 -119544 -37523 -391044 -273132 -31463 179602 31573 72202 -148129 254125 -234771
10536 298043 -7371 -90637 -159957 1390 -83810 -127637 231742 164783 -249984 17797 -44304
10524 -88503 90639 -172794 248335 -356650 -128368 78635 -71108 -94570 -209746 124336
10513 -47651 -285122 149716 -2204 152663 -190828 66463 1477 -144878 -182868 72176 311400
10502 311400 -42017 -85226 213682 384706 105426 -64262 318783 -108996 -303130 -150097
10491 141272 -214584 -180801 -56986 -125659 -271636 -231668 -496841 -191913 17024 368552
10481 368552 28753 -161686 111556 203672 258683 748743 406796 259408 93973 221772
$$ packed form
10559C4644b2470F5322R3259a55132k05216d3293j72431j14615g9623A83320c58201
10547a19544c7523l53521J17912c1463A79602C1573M0629a48129B54125b34771
10536B98043g371q3266o9320A390h3810m3827B31742o6959b49984A7797d4304
10524h8503I0639a72794B48335c56650a28368G8635g1108k3462j15176A24336
10513d7651k37471A49716b204A52663a90828F6463A477a44878l7990G2176K39224
10502C11400d2017m3209B13682J71024A05426f4262C18783a08996j94134a50097
10491A41272b14584L3783e6986o8673j45977L9968k65173a91913A7024L51528
10481C68552B8753a61686A11556R2116N5011M90060l41947j47388I3973J27799
$$ plain form
10471 221772 159969 -21556 155845 130791 -79882 -205448 65329 122993 231275 123445 -48195
10459 -139848 -10781 -376414 97717 76041 -182664 -57174 160756 -130617 -259315 -209091
10449 -209091 52915 233745 351717 91697 -81157 231325 -213305 -207257 239226 -43782 -584284
10438 -584284 -137485 -99961 207 -40660 524262 -425 -184460 -82306 -21853 6421 -74499 -190688
10426 -190688 126252 -184108 -351207 72153 -4774 -475893 -148990 69014 -91227 -195244
10416 -195244 57400 14375 -11669 -281191 116454 -33744 134954 -78068 -172041 -47655 -148798
10405 -148798 4186 136139 -174745 -227848 149563 -47621 -442790 -144924 242593 -6027 53153
10393 184924 -19747 -259828 100409 152098 206913 -68239 332909 173608 14451 223268
$$ packed form
10471B21772o1803b1556A55845k5054g9882j25566F5329N7664J08282j07830d8195
10459a39848a0781l65633I7717k1676a82664e7174A60756a30617j28698N0224
10449b09091E2915J80830J17972I1697h1157B31325b13305O048B39226d3782n40502
10438e84284a37485L7524B07d0660E24262d25j84035h2306b1853F421g4499j16189
10426a90688A26252a84108j67099G2153d774m71119a48990F9014i1227j04017
10416a95244E7400A4375a1669k69522A16454c3744A34954g8068r3973d7655j01143
10405a48798D186J31953a74745n3103A49563d7621l95169a44924B42593f027E3153
10393A84924a9747k40081A00409N1689N4815f8239C32909j59301A4451K08817
$$ plain form
10383 223268 17464 396251 -57724 308901 150500 258922 246826 170646 370616 389428
10373 389428 -186521 386255 346481 -246951 -75670 297152 170154 201533 96080 184296
10363 184296 354578 267539 323437 170340 73075 -166855 525250 240254 -2457 385381
10352 7088 55166 232497 17718 239653 371679 183011 462955 303780 127096 568732
10342 568732 404617 556259 204929 285604 140005 385146 350810 -68522 663708 -84315
10331 287161 -169899 -227529 213104 -83758 273113 -86565 299471 2943 225820 -143981
10320 94240 275039 589731 8728 302236 203658 182202 -156731 -36196 147567 -26193 -9743
10308 -117767 177047 -249184 151027 -50815 227568 213660 271910 40921 55569 -142749
$$ packed form
10383B23268A7464L78787e7724C08901A50500J08422j2096p6180J99970J8812
10373C89428a86521C86255l9774b46951g5670B97152j26998L1379I6080Q8216
10363A84296J70282q7039N5898j53097G3075a66855E25250B40254b457C85381
10352G088M8078J77331A7718K21935J32026A83011K79944j59175A27096M41636
10342E68732j64115J51642B04929Q0675A40005K45141l4336f8522F63708h4315
10331B87161a69899n7630B13104h3758B73113h6565B99471B943K22877a43981
10320I4240J80799L14692H728K93508r8578k1456a56731c6196A47567b6193i743
10308a17767A77047b49184A51027e0815B27568j3908N8250D0921J4648a42749
$$ plain form
10297 66645 -53764 -104636 -72439 -939 194019 -38430 -193945 -226697 250845 -34190 234508
10285 144835 126224 53578 115146 -82676 -331034 -126516 312058 93912 136641 -198071 -117044
10274 -117044 -328903 34821 -254789 -277945 -97561 -198518 18921 -199723 -130323 -150879 178352
10262 -334259 72019 -64535 294543 -67371 -301283 411321 102850 -139012 -50435 181920
10251 218221 -109900 337432 180698 149798 349820 -499516 62453 22266 -256557 153091
10240 -193547 -93187 -136284 -18527 194042 256932 -109798 87542 74734 -107995 -85013 -191996
10229 -191996 14058 190720 70663 -57764 91120 151183 426591 -329773 -17674 16651 -118498
10217 72959 74104 -107666 211441 40543 93564 -244686 -217967 127793 -24272 11171 -315426
$$ packed form
10297F6645e3764n0872L2197i39A94019c8430j55515l2752B50845c4190B34508
10285A44835j8611E3578O1568h2676k48358a26516C12058I3912M2729a98071Q1027
10274a17044k11859C4821b54789k3156i7561j00957A8921a99723O9400k0556A78352
10262c34259G2019f4535B94543f7371k33912D11321A02850a39012e0435A81920
10251B18221a09900C37432j56734l0900K00022d99516F2453B2266b56557A53091
10240a93547i3187m3097a8527A94042O2890a09798H7542j2808a07995K2982j06983
10229a91996A4058J76662G0663e7764I1120O0063K75408c29773a7674A6651a18498
10217G2959J145a07666B11441D0543N3021b44686K6719A27793b4272A1171c15426
$$ plain form
10205 191347 -128751 102337 -149132 -177311 12342 -35599 -278315 -85264 132877 -100516
10194 -207674 -185023 25767 -13061 -25861 -132039 -199621 176254 -73666 -137908 -45006 -270535
10183 -270535 -175568 -201222 -226107 -322848 -125962 -89253 -222181 132771 276656 115029
10172 -142210 -166568 223895 -1512 26910 67884 -226334 -158889 17070 -77064 13519 -124949
10160 192013 -107210 192321 -495503 34106 72735 -52914 -153868 -136714 17277 162350
10150 162350 -303494 -142577 -139102 -104382 -35910 91584 221643 -417481 -125122 -106968 51486
10138 -134117 136129 151546 31100 119442 -276607 59401 97732 -75857 -92196 2799 -233319
10126 -163086 76764 -540094 -128683 189751 152818 -39488 -23867 -27146 -198524 11210 -257456
$$ packed form
10205A91347a28751A02337a49132k8179A2342c5599k42716h5264A32877a00516
10194b07674K2651B5767a3061j2800j06178o7582A76254g3666o4242d5006k25529
10183b70535R4967k5654k4885r6741a25962L6709j32928A32771J43885A15029
10172a42210k4358B23895a512B6910M0974b26334O7445A7070g7064A3519a24949
10160A92013a07210A92321d95503C4106L8629e2914j00954J7154A7277J45073
10150A62350c03494a42577L475L4720c5910I1584J30059d17481a25122J8154E1486
10138a34117A36129J5417C1100Q8342b76607E9401L8331g5857j6339B799b33319
10126a63086G6764e40094a28683A89751l6933c9488J5621l279j71378A1210b57456
$$ plain form
10114 125694 29109 152721 -259356 376117 -120958 -58707 419960 -72800 -311327 31706
10103 31177 131690 51254 -339445 -118200 -492532 -165600 -203577 167439 -126160 128107
10092 20170 -188947 -224709 -4938 -211936 109465 38478 145419 -74848 -222014 291639 286346
10081 286346 236214 -96056 -212304 21211 131451 37598 -43463 -47876 3105 122846 110800
10070 110800 -91941 -40627 -497813 59844 -188772 45548 -73706 -83666 -51242 34485 -103081
10058 -266580 -109050 -439182 -60865 21737 -251334 59146 -122847 -275841 -416282 -219784
10048 -219784 -231394 -213292 152745 -160750 429098 -46835 -88697 -83764 -170983 612504 19774
10036 70327 -225052 157390 -187147 -154381 337771 -124672 -457744 -444037 -59002 -18896
$$ packed form
10114A25694B9109J23612b59356C76117a20958e8707D19960g2800k38527C1706
10103C1177J00513E1254c39445a18200l74332a65600l7977A67439a26160A28107
10092B0170a88947l5762d938k06998A09465C8478J06941g4848j47166B91639n293
10081B86346n0132i6056j16248B1211J10240C7598d3463m413C105J19741j2046
10070A10800i1941d0627m57186E9844a88772D5548g3706r960L2424C4485a03081
10058b66580a09050l30132f0865B1737b51334E9146a22847j52994j40441J96498
10048b19784j1610J8102A52745a60750D29098d6835m1862M933q7219F12504A9774
10036G0327b25052A57390a87147L2766C37771a24672l33072J3707e9002a8896
$$ plain form
10025 37676 -5268 -87973 -65773 -46264 -69104 -319895 -239178 -98956 81179 -89222 -45404 125700
10012 -349927 -7859 98345 -120067 -285644 -95177 -194809 -3184 -49884 -937 92435 -149591 7920
9999 179445 127454 -22364 -224781 -207119 -256003 27504 -306473 115172 -14043 -152563 97073
9987 169593 -36256 -92390 181196 22608 115359 -46890 -107493 -57349 164626 -43394 117323
9975 -188751 -98756 -18824 347077 15060 -299689 -356419 162716 -55156 -173329 -107715 2904
9963 -167261 97670 73516 -44685 137642 -139287 93169 -156225 -92612 144631 40797 166475
9952 166475 201889 -238644 26916 270146 23565 -140707 173872 -61057 -126106 280699 -157519
9940 52031 -212662 -80805 -59811 -158955 124352 -51401 185989 63545 -358205 -126353 -258311
$$ packed form
10025C7676e268q2705K2200J9509k2840k50791Q0717i8956H1179h9222M3818A25700
10012c49927g859I8345a20067j65577i5177r9632c184m6700i37I2435a49591G920
9999A79445n1991b2364k02417J7662m8884B7504c06473A15172a4043j38520I7073
9987A69593c6256n6134A81196B2608R2751d6890o0603N0144A64626d3394A17323
9975a88751Q9995a8824C47077A5060b99689n6730A62716e5156j18173O5614B904
9963a67261I7670k4154d4685A37642a39287I3169a56225O3613A44631D0797J25678
9952A66475L5414b38644B6916K43230B3565a40707A73872f1057o5049B80699a57519
9940E2031b12662h0805K0994r9144A24352e1401A85989F3545c58205a26353j31958
$$ plain form
9929 -258311 -80311 67243 195160 -126257 -137670 -65443 -135564 -129215 12722 147066 -229757
9917 -36069 -160722 -182370 17132 -28122 31032 119401 -16249 28813 -295850 -69709 -262101
9906 -262101 242345 -127341 -362026 -73105 1555 42118 22549 28265 -106737 257396 -317570
9894 -30651 175909 76613 -140346 -238764 201100 -159315 -235142 -193268 -34117 -152163 -291543
9883 -291543 -28692 -20018 -85028 -2614 67594 -74867 10195 -179411 -267599 192239 342749
9872 342749 228491 130871 -170469 -121670 207808 -483331 -309772 -109131 -192504 -299587
9862 -299587 -316914 15350 -96580 91937 230479 62148 -33778 -90381 -390219 -169799 16534
9850 -54790 64377 181022 133449 -34679 260033 118281 189365 -342056 347972 -472112 -332433
$$ packed form
9929b58311h0311F7243J27917a26257j1413f5443p0121O349A2722J34344b29757
9917c6069j24653k1648A7132b8122C1032Q8369a6249B8813b95850f9709j92392
9906b62101B42345a27341k34685g3105A555M0563j9569N716a06737B57396c17570
9894c0651A75909G6613a40346r8418B01100a59315p5827M1874c4117j18046j39380
9883b91543b8692Q674o5010b614F7594g4867A0195a79411q8188A92239J50510
9872C42749j14258r7620a70469M8799B07808d83331J73559a09131q3373j07083
9862b99587j7327A5350i6580I1937J38542F2148c3778n6603k99838a69799A6534
9850e4790F4377J16645m7573c4679B60033A18281P1084c42056C47972d72112J39679
$$ plain form
9839 -332433 130398 102197 326697 -27782 -118837 48023 -336780 -276556 504738 -65191 -125733
9828 -125733 -210373 -175950 -37536 46559 8455 -176964 -156118 -94846 139840 -138839 55980
9816 -95922 -98668 235641 62253 -157652 -144153 -140880 -144119 68120 -319227 -182234 -250043 52071
9803 185966 -231921 325080 -35167 -213511 -353565 -89956 -318120 113465 145001 72159
9792 -74234 -308713 188719 -266027 -56388 -66901 -262787 186880 -128329 -174836 -231741 -154292
9781 -154292 -56261 123528 -155246 -168212 -119319 160751 -29572 -1817 -130895 -573533 170661
9769 -108407 311672 -82799 55832 120254 -102098 -266152 -97926 -70701 23222 -28001 -5474
9757 -32526 -57542 -189512 -77734 -196229 128067 -10958 -69208 -105572 -311659 132387 -24878
$$ packed form
9839c32433A30398k8201K24500b7782r1055D8023c36780O0224E04738f5191o0542
9828a25733q4640L4423c7536D6559H455a76964K0846O1272A39840a38839E5980
9816i5922k746B35641F2253a57652J3499L273l239F8120c19227J36993o7809E2071
9803A85966b31921C25080c5167j78344j40054h9956k28164A13465L1536G2159
9792g4234k34479A88719b66027e6388j0513j95886A86880a28329m6507n6905P7449
9781a54292e6261A23528a55246j2966M8893A60751b9572a817j29078m42638A70661
9769a08407C11672h2799E5832O4422a02098j64054i7926K7225B3222b8001e474
9757c2526k5016j31970g7734j18495A28067a0958n8250l6364k06087A32387b4878
$$ plain form
9745 -160009 -229056 -269156 18890 -22419 223224 -15062 -660821 -52570 97981 -158343 -195738
9734 -195738 -269715 -93387 -228355 212576 -378545 1728 -186895 -177948 -80041 -377108 -55069
9722 -41264 -244281 -31182 180807 110098 -196072 117705 -46648 -30914 8041 -80179 -307701
9711 -307701 -31373 -258382 175643 -50369 96421 -15374 108698 110330 -126168 167728 -324564
9699 155258 -298207 67825 -291036 -171321 24166 135642 245787 -270131 54631 -277366
9688 170066 -63798 -82659 -119814 -122292 161659 -322136 -41280 -105760 62143 -282978 -14714
9676 -42299 3108 -24087 -69970 48365 -537287 109735 -203296 208220 -96995 184138 126857
9665 126857 126244 -160317 -102484 -233746 262211 34721 -197605 301048 -72342 288419 105571
$$ packed form
9745a60009o9047m0100A8890b2419B23224a5062o45759e2570I7981a58343l7395
9734a95738p3977i3387j34968B12576c78545A728a86895Q947h0041k97067e5069
9722d1264k03017c1182A80807p0709a96072A17705d6648J5734H041h0179k27522
9711c07701c1373k27009A75643e0369I6421a5374A08698J632a26168A67728c24564
9699A55258b98207F7825b91036J19715B4166J11476J10145b70131E4631b77366
9688A70066f3798j8861l7155k478A61659c22136d1280o4480F2143b82978a4714
9676d2299C108b4087m5883D8365e37287A09735b03296B08220i6995A84138n7281
9665A26857o13a60317N7833j31262B62211C4721a97605C01048g2342B88419A05571
$$ plain form
9653 -277144 -144694 -402791 236114 -74359 -73115 46596 -106293 101993 -399260 -204503
9643 -204503 -148188 24401 102829 -61756 -254334 -10629 -25326 58627 165469 171204 -78671
9631 116302 -173639 -217928 -131513 158143 71151 184930 -286952 -169251 59593 -249247
9620 -129177 -170959 120889 91230 -373810 92794 76866 -312942 -69266 -168487 -83531 84615
9608 -89904 16254 199932 22623 46880 148447 -49781 -196466 -236745 -41748 -62523 228840
9596 -40806 298894 -99466 137834 -203325 -49893 129973 -295204 -182485 -387307 -359321
9586 -359321 -233658 18135 -112237 -126193 -70387 -127871 59583 178818 64328 58747 -160896
9574 126170 -343748 -101724 136126 -299302 -176966 -296763 194843 142581 282000 29711
$$ packed form
9653b77144J32450k58097B36114g4359J244D6596a06293A01993c99260J94757
9643b04503N6315B4401P8428f1756j92578a0629j4697E8627J06842N735g8671
9631A16302a73639m4289Q6415A58143G1151J13779b86952J17701E9593b49247
9620a29177m1782A20889k9659c73810I2794j5928c12942f9266r9221h3531H4615
9608h9904A6254J83678B2623K4257J01567d9781j46685m0279d1748k0775B28840
9596d0806B98894i9466A37834b03325d9893A29973b95204J12719k04822K7986
9586c59321J25663A8135a12237j3956N5806n7484E9583J19235F4328n581a60896
9574A26170c43748a01724A36126b99302J22336j19797A94843n2262J39419B9711
$$ plain form
9563 95481 -208482 -18536 57942 -112612 -101873 -234487 -171352 -24272 -73989 -269225 -258520
9552 -258520 1566 107686 -224332 -129041 -311969 -121294 -91788 -83452 -77620 318306 -314403
9540 -137485 -272005 -83092 340360 -120188 -292369 102508 23132 -186658 -46470 155780
9529 -222745 -88329 -108556 115478 -62550 -182986 -465387 -245042 -94667 -210722 -212873 -210743
9518 -210743 246439 69549 -99394 -283461 31262 -352562 36319 -497368 -115977 14833 -185138
9506 1535 -432014 103573 51779 47512 -149136 45058 -26962 195786 -81773 334199 -331894
9494 -112485 -414238 42175 -240798 -10130 -215992 53359 -43910 -66455 188551 156561 40008
9482 -82412 -294392 -188153 252942 -130623 280952 -60231 -232151 88207 -12045 -399891
$$ packed form
9563I5481b08482a8536E7942a12612J0739j32614O3135b4272m9717j95236J0705
9552b58520A566J06120b24332R5291j82928a21294K9506Q336N832C18306c14403
9540a37485j34520h3092C40360a20188j72181A02508B3132a86658d6470A55780
9529b22745h8329k0227A15478f2550j20436k82401K20345i4667j16055k151K130
9518b10743B46439F9549i9394j84067C1262c52562C6319d97368a15977A4833a85138
9506A535d32014A03573E1779m267a49136D5058b6962A95786h1773C34199c31894
9494a12485l01753D2175b40798a0130k05862E3359d3910k2545A88551l1990D0008
9482h2412k11980J06239B52942a30623B80952f0231j71920H8207a2045l87846
$$ plain form
9472 -399891 -59290 -282864 211622 -1955 -82305 128212 247576 -175585 -184139 -192119 86798
9460 39736 142706 -104000 -43211 -312388 21509 -67416 24280 151639 -177574 -104787 -11858
9448 22206 -248008 81052 -12502 267372 55416 -208061 156372 25935 -58229 18676 -452304
9436 -328783 -301770 -232352 -42150 3305 59967 -196412 -85217 -217674 -195155 -6871 64315 321694
9424 321694 -424742 2323 -217965 -78747 14489 72714 -6821 -157932 -161909 208960 -324251
9412 7797 49763 -96232 -286704 79161 20051 207966 -136039 5062 194995 -371991 -148290
9400 31109 -370940 227477 -64305 -223623 -238586 -54351 216466 -218768 -125388 -90157 204088
9388 -152615 -151016 -75239 205215 -222804 -127517 -163895 46694 -187006 259429 51647 30984
$$ packed form
9472c99891e9290k23574B11622a955q0350A28212J19364a75585q554p980H6798
9460C9736J02970a04000d3211k69177B1509f7416B4280J27359a77574P2787a1858
9448B2206b48008H1052a2502B67372E5416b08061A56372B5935e8229A8676d52304
9436c28783K7013O9418d2150C305N6662a96412h5217j32457K2519f871F4315K57379
9424C21694d24742B323b17965g8747A4489N8225f821j51111l977B08960c24251
9412G797M1966i6232j90472G9161B0051J87915a36039E062J89933c71991a48290
9400C1109c70940B27477f4305j59318j4963e4351B16466b18768R3380L5231B04088
9388a52615J599g5239B05215b22804R5287l6378D6694a87006B59429E1647k0663
$$ plain form
9377 30984 99105 -184236 111545 -41683 -162920 -135547 -171586 18031 -159006 -42801 186962
9365 -31736 -126954 -190984 150875 -293435 -23696 -224080 70777 -146678 94488 -347264 -41045
9353 -70811 -275712 48539 -195352 -40862 -65177 -122404 -175929 279543 228944 -93423 -199058
9342 -199058 -239514 -112 72813 53051 -25776 23774 -96220 -162188 -10764 19409 -90349 -66718
9330 -66718 44830 -148938 -168375 -154945 -218148 -185750 281088 -99825 -111610 153404 -109054
9318 62107 69666 -328194 -87407 -350161 -64872 -302693 -391609 -41717 -106208 283391 -19030
9306 316377 -243897 139000 -122225 -271468 -82915 -402506 382914 134790 -120632 -85787
9296 -85787 149747 21649 108758 -68581 60449 27179 -35163 169692 -36274 -210594 -202884
$$ packed form
9377C0984O8121a84236A11545d1683j21237K7373l6039A8031a59006d2801A86962
9365c1736r5218o4030A50875b93435b3696k00384G0777a46678I4488c47264d1045
9353g0811k04901D8539a95352d0862k4315n7227n3525B79543n0599i3423j05635
9342a99058m0456a12G2813j9762b5776B3774i6220o5968a0764A9409i0349K3631
9330f6718D4830a48938j9437J3430o3203L2398B81088i9825j1785A53404a09054
9318F2107P559c28194h7407k62754f4872k37821q8916d1717o4491B83391a9030
9306C16377b43897A39000a22225j49243h2915l19591C82914A34790a20632L4845
9296h5787A49747B1649Q7109f8581F0449B7179c5163A69692c6274j74320P710
$$ plain form
9285 -202884 99642 94967 -171074 -267400 255147 154623 -11878 68296 -396914 -249318 -46621
9273 203041 41718 411801 -107078 67372 -432422 -298613 -155245 82383 -6439 97895 162658
9262 162658 282752 -164128 -255531 300691 250581 -46191 -59502 -68384 -123261 41265 -442634
9250 -143219 -261916 135429 -20290 259229 -114155 26280 -140285 -103821 78920 -250678
9239 -169923 170743 -130963 70078 74827 -39720 11281 -19121 -29464 -306626 33358 51157
9228 51157 182483 -100827 -162085 70805 -278370 -145907 86883 142203 35367 -359905 -137659
9216 -132592 62438 243045 -263160 55822 -94190 188116 -89129 260002 215658 93222 -380328
9204 44156 -302332 -176007 268224 96413 137408 -123671 174884 -133476 93415 -4937 -93172
$$ packed form
9285b02884I9642m675a71074r6326B55147j00524a1878F8296c96914J47596d6621
9273B03041D1718L70083a07078F7372d32422J33809J43368H2383f439I7895O4763
9262A62658J20094a64128r1403C00691n0110d6191j3311q882n4877D1265d42634
9250a43219j18697A35429b0290B59229a14155B6280a40285L6464G8920b50678
9239a69923A70743a30963G0078M749c9720A1281a9121j0343k77162C3358J7799
9228E1157J31326a00827o1258G0805b78370J32463H6883N5320C5367c59905a37659
9216a32592F2438J80607b63160E5822i4190A88116h9129B60002m4344I3222c80328
9204D4156c02332J26325B68224I6413M0995a23671A74884a33476I3415d937q8235
$$ plain form
9193 -93172 -46214 266356 52859 -358788 66533 50447 -234727 -121476 24533 -10814 -274532
9182 -274532 -184787 -173688 47753 -226394 -240133 -136347 60948 -30439 -184407 176502 -180336
9170 -67584 -12373 -187070 178347 240619 -276044 48131 -114511 -220167 -110863 -96809 -19342
9158 115755 -141966 22287 -281578 -27321 -176501 -104984 62494 27680 -245018 -214509 -100234
9146 -158052 61695 -505069 -62241 -450409 -289849 -195921 -176193 -68737 590 -255035 115829
9134 -140735 -264833 -51717 288563 384463 27431 -240048 -61440 -126757 140202 51823 124085
9123 124085 -307751 -292795 -220622 126644 -86412 -212924 72342 140543 -40023 -96385 3230
9111 -152889 -173917 -131205 34639 126482 -391124 -76746 -77327 -46030 24861 -159801 -156010 -226003
$$ packed form
9193i3172d6214B66356E2859c58788F6533j6086b34727J13251B4533a0814k63718
9182b74532Q9745J1099D7753b26394j3739J03786F0948c0439j53968A76502a80336
9170f7584a2373j74697A78347O2272b76044D8131a14511j05656J09304J4054a9342
9158A15755a41966B2287b81578b7321j49180P1517F2494B7680b45018L0509a00234
9146a58052F1695e05069f2241l88168J60560R3928J9728f8737E90b55035A15829
9134a40735j24098e1717B88563R5900B7431b40048f1440o5317A40202E1823P2262
9123A24085c07751J4956P2173A26644h6412j26512G2342O8201d0023n6362C230
9111a52889k1028M2712C4639R1843c91124g6746n81L1297B4861a59801L791o9993
$$ plain form
9099 -226003 -108974 100136 204129 -42989 -251066 114595 -129231 -325467 -41167 -64154
9089 -64154 -76730 -97488 -129256 144791 53848 -247950 12126 -70761 -21752 -48028 125380
9077 97736 -308748 120596 -189137 -11771 -98714 -290505 -135759 -264434 -60884 70399 -31999
9065 -58943 -48614 -240556 -74953 -295184 159664 42184 18348 -292248 314444 166245 -33735
9053 -70091 189684 6617 -189360 -172171 99391 -93711 94649 -27165 -88761 -86196 -10590 77643
9040 -126401 -118793 78334 -146042 18166 -48873 -114516 -456880 -137824 286100 126533 14076
9028 -171248 53182 -61842 -115133 18782 -112163 -12931 7791 -61552 14389 -156111 -57387
9016 77190 -265513 -96964 -40081 166751 -129353 -189272 -102123 247782 -384831 26592 -90147
$$ packed form
9099b26003a08974A00136J03993d2989k08077A14595a29231j96236d1167k2987
9089f4154j2576k0758l1768A44791E3848b47950A2126g0761b1752k6276A25380
9077I7736c08748A20596a89137a1771q6943j91791a35759j28675f0884G0399c1999
9065e8943J0329j91942g4953k20231A59664D2184A8348b92248C14444j48199c3735
9053g0091A89684F617a89360J7189I9391i3711I4649b7165o1596K565a0590G7643
9040a26401P608G8334a46042A8166d8873o5643l42364a37824B86100A26533A4076
9028a71248E3182f1842n3291A8782a12163a2931G791f1552A4389a56111e7387
9016G7190b65513i6964d0081A66751a29353n9919Q7149B47782c84831B6592i0147
$$ plain form
9004 179182 -243444 -147122 52573 -36981 -74984 -48360 -154580 -63163 -268415 -87623 -135778
8993 -135778 7206 -1440 -238669 215017 -165375 355491 -59288 108844 -283221 181009 -179102
8981 26943 -13100 240452 32923 -93833 -333938 32955 226770 -329163 -136420 -181511 -122873
8970 -122873 -48081 145226 220970 -91539 -91423 37399 -154055 18674 -33459 -97388 -257979
8959 -257979 -140535 -192342 -423516 -356951 47411 -325352 -17642 -155141 -68337 84719 197503
8948 197503 -61100 71298 74120 68008 -78696 -267876 -74313 -59053 162919 223359 -86931 -259720
8936 -259720 -63976 -40584 115725 229458 434123 -106202 -169339 -59427 26477 -51222 151169
8924 -18991 229388 357003 370861 2173422 7425868 11876671 3263380 1352146 600614
$$ packed form
9004A79182b43444R6322E2573c6981l8003K6624j06220f3163k05252h7623m8155
8993a35778G206a440k37229B15017a65375C55491e9288A08844b83221A81009a79102
8981B6943a3100B40452C2923i3833k40105C2955J93815c29163a36420m5091N8638
8970a22873d8081A45226P5744i1539J16C7399a54055A8674c3459o3929j60591
8959b57979J17444n1807k31174O6565D7411c25352a7642j37499f8337H4719J12784
8948A97503f1100G1298K822o112g8696j89180g4313J5260A62919O0440h6931j72789
8936b59720f3976K3392A15725J13733K04665a06202o3137e9427B6477e1222A51169
8924a8991B29388J27615J3858J802561N252446M450803C263380A352146F00614
$$ plain form
8914 507410 47149 188222 97287 -237422 -14660 -209770 284678 96540 339675 135050
8903 56473 109662 164626 -444090 -302553 -257622 -318575 -189387 -136591 -174442 278244 20155
8891 -31664 221758 -66645 -104911 67457 118216 -42537 -60481 286850 -76016 96301 -477961
8879 120939 -20645 -185153 203205 277950 -360292 89980 -104211 97571 -296667 14024 -133787
8867 235654 -96029 -256408 -27830 -188846 -146019 234958 -178283 -204311 -210253 -82301 -220624
8856 -220624 -39154 -41960 -62095 -146107 -178270 -126841 -75516 -124820 2107 101600 13268 -308201
$$ packed form
8914E07410D7149J41073r0935b37422a4660j95110B84678I6540K43135A35050
8903E6473N3189N4964d44090J41537M4931o0953J29188N2796l7851B78244B0155
8891c1664B21758f6645l8266F7457N0759d2537j7944B86850g6016I6301d77961
8879A20939b0645j64508B03205P4745c60292H9980a04211I7571b96667A4024a33787
8867B35654i6029j60379b7830j61016M2827B34958a78283k6028n942h2301j38323
8856b20624c9154k806k0135q4012l2163N1429N1325m9304B107R9493A3268c08201
$$ [...]
##END NTUPLES=NMR SPECTRUM
##END=
