
##TITLE=AC1207_MCiAH12041_5946565_neomnvGzdM
##JCAMPDX= 6.0         $$ Bruker NMR JCAMP-DX V2.0
##DATA TYPE= NMR SPECTRUM
##DATA CLASS= NTUPLES
##ORIGIN= BRUKER
##OWNER= Administrator
$$ 1.72 TOPSPIN		Version 2.1
$$ 2012-04-11 03:15:36.656 -0500  Administrator@TOPSPIN
$$ Compression mode = diff/dup
##.OBSERVE FREQUENCY= 400.13188235
##.OBSERVE NUCLEUS= ^1H
##.ACQUISITION MODE= SIMULTANEOUS (DQD)
##.ACQUISITION SCHEME= undefined
##.AVERAGES= 64
##.DIGITISER RES= 22
##SPECTROMETER/DATA SYSTEM= spect
##.PULSE SEQUENCE= noesygpps1d.comp
##.SOLVENT NAME= COFFEE_meoh
##.SHIFT REFERENCE= INTERNAL, COFFEE_meoh, 1, 14.9686
##AUDIT TRAIL= $$ (NUMBER, WHEN, WHO, WHERE, PROCESS, VERSION, WHAT)
$$ ##TITLE= Audit trail, TOPSPIN		Version 2.1
$$ ##JCAMPDX= 5.01
$$ ##ORIGIN= Bruker BioSpin GmbH
$$ ##OWNER= Administrator
$$ $$ C:\Bruker\TOPSPIN/data/COFFEE/nmr/AC1207_MCiAH12041_5946565_neomnvGzdM/12/pdata/1/auditp.txt
$$ ##AUDIT TRAIL=  $$ (NUMBER, WHEN, WHO, WHERE, PROCESS, VERSION, WHAT)
(   1,<2012-04-11 03:15:31.921 -0500>,<Administrator>,<TOPSPIN>,<go>,<TOPSPIN 2.1>,
      <created by zg
	started at 2012-04-11 03:04:00.328 -0500,
	POWCHK enabled, PULCHK disabled,
       configuration hash MD5:
       1A 1E CE 29 27 FD 77 03 67 4E F0 E3 C4 B2 CB 90
       data hash MD5: 64K
       7B 63 D0 3D 2F 96 4F 09 27 01 24 30 7D 6A 34 E5>)
(   2,<2012-04-11 03:15:34.671 -0500>,<Administrator>,<TOPSPIN>,<proc1d>,<TOPSPIN 2.1>,
      <Start of raw data processing
       efp LB = 0.3 FT_mod = 6 PKNL = 1 PHC0 = 0 PHC1 = 0 SI = 128K 
       data hash MD5: 128K
       5E 72 B0 A6 74 A0 24 F7 8B 84 9D 00 01 A4 4D 37>)
(   3,<2012-04-11 03:15:35.906 -0500>,<Administrator>,<TOPSPIN>,<proc1d>,<TOPSPIN 2.1>,
      <pk PHC0 = 31.96472 PHC1 = 0 
       data hash MD5: 128K
       27 B5 E9 4F 96 BD 98 A5 30 52 BF 10 57 50 BF F4>)
(   4,<2012-04-11 03:15:36.140 -0500>,<Administrator>,<TOPSPIN>,<proc1d>,<TOPSPIN 2.1>,
      <abs ABSG = 1 
       data hash MD5: 128K
       25 DB 78 77 26 B0 20 49 55 9A 48 D3 9A B0 84 6E>)
(   5,<2012-04-11 03:15:36.218 -0500>,<Administrator>,<TOPSPIN>,<proc1d>,<TOPSPIN 2.1>,
      <abs ABSG = 2 
       data hash MD5: 128K
       58 DA 4A 10 85 D5 31 FC 79 11 25 24 12 51 46 C8>)
(   6,<2012-04-11 03:15:36.265 -0500>,<Administrator>,<TOPSPIN>,<proc1d>,<TOPSPIN 2.1>,
      <abs ABSG = 3 
       data hash MD5: 128K
       63 BC 55 D3 19 AD AA 9A E1 BD AB 46 9B E0 61 28>)
(   7,<2012-04-11 03:15:36.515 -0500>,<Administrator>,<TOPSPIN>,<proc1d>,<TOPSPIN 2.1>,
      <abs ABSG = 4 
       data hash MD5: 128K
       F6 42 C3 06 0C 82 E2 63 BB 44 BF 2E C6 34 B6 5A>)
(   8,<2012-04-11 03:15:36.562 -0500>,<Administrator>,<TOPSPIN>,<proc1d>,<TOPSPIN 2.1>,
      <abs ABSG = 5 
       data hash MD5: 128K
       2B C8 2B C2 EC 24 B7 05 59 20 C6 66 E8 4C A2 39>)
$$ ##END=
$$ 
$$ $$ hash MD5
$$ $$ 61 9E 4C FE B1 E7 20 E3 36 C0 F9 26 DC 97 25 4B
##$RELAX= 
##$RELAX= 
##$RELAX= 
##$RELAX= 
##$RELAX= 
##$RELAX= 
##$RELAX= 
##$RELAX= 
$$ Bruker specific parameters
$$ [...]
##$TP07= 0
##$TPNAME0= <>
##$TPNAME1= <>
##$TPNAME2= <>
##$TPNAME3= <>
##$TPNAME4= <>
##$TPNAME5= <>
##$TPNAME6= <>
##$TPNAME7= <>
##$TPOAL= (0..7)
0.5 0.5 0.5 0.5 0.5 0.5 0.5 0.5
##$TPOFFS= (0..7)
0 0 0 0 0 0 0 0
##$TUNHIN= 0
##$TUNHOUT= 0
##$TUNXOUT= 0
##$USERA1= <user>
##$USERA2= <user>
##$USERA3= <user>
##$USERA4= <user>
##$USERA5= <user>
##$V9= 5
##$VALIST= <valist>
##$VCLIST= <CCCCCCCCCCCCCCC>
##$VD= 0
##$VDLIST= <DDDDDDDDDDDDDDD>
##$VPLIST= <PPPPPPPPPPPPPPP>
##$VTLIST= <TTTTTTTTTTTTTTT>
##$WBST= 1024
##$WBSW= 4
##$XGAIN= (0..3)
0 0 0 0
##$XL= 0
##$YL= 0
##$YMAX_a= 13302802
##$YMIN_a= -5726745
##$ZGOPTNS= <>
##$ZL1= 120
##$ZL2= 120
##$ZL3= 120
##$ZL4= 120
##$ABSF1= 14.9686
##$ABSF2= -5.58393
##$ABSG= 5
##$ABSL= 3
##$ALPHA= 0
##$AQORDER= 0
##$ASSFAC= 0
##$ASSFACI= 0
##$ASSFACX= 0
##$ASSWID= 0
##$AUNMP= <proc_prof1d_extract.lims>
##$AXLEFT= 0
##$AXNAME= <>
##$AXNUC= <1H>
##$AXRIGHT= 0
##$AXTYPE= 0
##$AXUNIT= <>
##$AZFE= 0.1
##$AZFW= 0.1
##$BCFW= 0
##$BC_mod= 0
##$BYTORDP= 0
##$COROFFS= 0
##$CY= 15
##$DATMOD= 1
##$DC= 0
##$DFILT= <>
##$DTYPP= 0
##$F1P= 0
##$F2P= 0
##$FCOR= 0.5
##$FTSIZE= 131072
##$FT_mod= 6
##$GAMMA= 0
##$GB= 0
##$INTBC= 1
##$INTSCL= 1
##$ISEN= 128
##$LB= 0.3
##$LEV0= 0
##$LPBIN= 0
##$MAXI= 10000
##$MC2= 0
##$MEAN= 0
##$ME_mod= 0
##$MI= 0
##$NCOEF= 0
##$NC_proc= -3
##$NLEV= 6
##$NOISF1= 0
##$NOISF2= 0
##$NSP= 0
##$NTH_PI= 0
##$NZP= 0
##$OFFSET= 14.9686
##$PC= 1
##$PHC0= 31.96472
##$PHC1= 0
##$PH_mod= 1
##$PKNL= yes
##$PPARMOD= 0
##$PPDIAG= 0
##$PPIPTYP= 0
##$PPMPNUM= 2147483647
##$PPRESOL= 1
##$PSCAL= 4
##$PSIGN= 0
##$PYNMP= <proc.py>
##$REVERSE= no
##$SF= 400.130004804765
##$SI= 131072
##$SIGF1= 0
##$SIGF2= 0
##$SINO= 400
##$SIOLD= 131072
##$SPECTYP= <>
##$SREGLST= <1H.CDCl3>
##$SSB= 0
##$STSI= 131072
##$STSR= 0
##$SW_p= 8223.68421052632
##$SYMM= 0
##$S_DEV= 0
##$TDeff= 65536
##$TDoff= 0
##$TI= <>
##$TILT= no
##$TM1= 0
##$TM2= 0
##$TOPLEV= 0
##$USERP1= <user>
##$USERP2= <user>
##$USERP3= <user>
##$USERP4= <user>
##$USERP5= <user>
##$WDW= 1
##$XDIM= 131072
##$YMAX_p= 513272056
##$YMIN_p= -410026668
##$CURPLOT= <Network HP LaserJet P1505>
##$CURPRIN= <$Network HP LaserJet P1505>
##$DFORMAT= <normdp>
##$LAYOUT= <+/1D_H.xwp>
##$LFORMAT= <normlp>
##$PFORMAT= <normpl>
##$SURQMSG= 1
$$ End of Bruker specific parameters
$$ ---------------------------------
##NTUPLES= NMR SPECTRUM
##VAR_NAME=  FREQUENCY,     SPECTRUM/REAL,   SPECTRUM/IMAG
##SYMBOL=    X,             R,               I
##VAR_TYPE=  INDEPENDENT,   DEPENDENT,       DEPENDENT
##VAR_FORM=  AFFN,          ASDF,            ASDF
##VAR_DIM=   131072,        131072,          131072
##UNITS=     HZ,            ARBITRARY UNITS, ARBITRARY UNITS
##FACTOR=    0.0627417313425165, 1,          1
##FIRST=     8223.62146879498, -3193,        -90690
##LAST=      0,             -1961,           -92046
##MIN=       0,             -410026668,      0
##MAX=       8223.62146879498, 513272056,    0
$$ Real data points
##PAGE= N=1
##DATA TABLE= (X++(R..R)), XYDATA
$$ [...]
60711A452313K3620K4327K3651K2304K1199K0530K0101J9384J7381J3760J0025
60700A668595Q217Q447Q990Q828Q561Q666Q411P231N908N539O045O420N950M756
60686A770564L477K635K044Q76j195l196l925l751m404o680r269j0443j0233j0242
60672A716258j1595j3878j6050j7689j8875j9316j8395j6145j3503j1346r726
60661A549740q365p194o049m516k884k395l666n447o064n493m856m504m163m407
60647A479737o112q541r798r209p620n454k512K81J293P44O64J731K529K433K626
60632A442792L198K039j685n593p536q722j1172j4292j6539j8520k1446k3982
60620A318542k3879k1888k0917k1749k2511k2224k1881k1687k0088j6419j2235
$$ y = [1452313, 1475933, 1500260, 1523911, 1546215, 1567414, 1587944, 1608045, 1627429, 1644810, 1658570, 1668595, 1676812, 1685259, 1694249, 1703077, 1711638, 1720304, 1728715, 1735946, 1741854, 1747393, 1753438, 1759858, 1765808, 1770564, 1774041, 1776676, 1778720, 1779596, 1778401, 1775205, 1771280, 1767529, 1763125, 1756445, 1747176, 1736733, 1726500, 1716258, 1704663, 1690785, 1674735, 1657046, 1638171, 1618855, 1600460, 1584315, 1570812, 1559466, 1549740, 1541375, 1534181, 1528132, 1523616, 1520732, 1518337, 1514671, 1509224, 1503160, 1497667, 1492811, 1488307, 1484144, 1479737, 1473625, 1465084, 1455286, 1446077, 1438457, 1433003, 1430491, 1430772, 1432065, 1432809, 1433473, 1435204, 1437733, 1440166, 1442792, 1445990, 1448029, 1446344, 1440751, 1433215, 1424493, 1413321, 1399029, 1382490, 1363970, 1342524, 1318542, 1294663, 1272775, 1251858, 1230109, 1207598, 1185374, 1163493, 1141806, 1121718, 1105299, 1093064]
60609A093064r046o533l968j758m98J76P68Q82%j329j903j132N61K269L294L556
60593A078403L516L576L687L780M218N320O672P459P288O345N081M076L900M637
60579A147958N892P360Q932J0161J0593J0866J2330J5024J7223J7773J7708J8629
60567A300449K0674K3184K6071K9145L1195L1407L0949L1450L2504L2351L0509
60556A619888K8004K5311K1967J8257J5441J3750J1700P994L233r25l634n481
60544A755505p673j0835j4382j7145j8700j9756k1011k2320k3351k4188k4660
60533A551484k3926k1657j8912j6854j5268j3308j1051r225p925o630n085l311
60521A398332j253O90J500Q28k35o85r69j715k106j051P95J916K261K982M266
$$ y = [1093064, 1084018, 1077485, 1073517, 1071759, 1071261, 1071437, 1072205, 1073087, 1073087, 1071758, 1069855, 1068723, 1069284, 1071553, 1074847, 1078403, 1081919, 1085495, 1089182, 1092962, 1097180, 1102500, 1109172, 1116631, 1123919, 1130264, 1135345, 1139421, 1143321, 1147958, 1153850, 1161210, 1170142, 1180303, 1190896, 1201762, 1214092, 1229116, 1246339, 1264112, 1281820, 1300449, 1321123, 1344307, 1370378, 1399523, 1430718, 1462125, 1493074, 1524524, 1557028, 1589379, 1619888, 1647892, 1673203, 1695170, 1713427, 1728868, 1742618, 1754318, 1762312, 1765545, 1764620, 1760986, 1755505, 1747832, 1736997, 1722615, 1705470, 1686770, 1667014, 1646003, 1623683, 1600332, 1576144, 1551484, 1527558, 1505901, 1486989, 1470135, 1454867, 1441559, 1430508, 1421283, 1413358, 1406728, 1401643, 1398332, 1397079, 1397769, 1399269, 1400097, 1399862, 1399177, 1398208, 1396493, 1394387, 1393336, 1394131, 1396047, 1398308, 1401290, 1405556]
60506A405556N230N840P091R143J0932J1856J2330J2278J0680P312L777J900J764
60493A505689K016J642R45R33K117M011N892P763J0022J2391J4138J5598J8235
60480A601392K2723K8168L3909M0575M8216N4825N8262N8660N7436N4753M9420
60469B108339M0658K8555J3800j638j4515k2906k8069l2103l4600l3579k8829
60458A995113k2142j4788p010L56O261J1305J6899K2545K6277K7840K9006L0515
60446B122177L1414L1987L4536M0003M6335N1756N7595O5975P6484Q7262R8246
60435B743770J11041J26138J42303J58669J75787J94138K12883K30799K47902
60426D343430K65562K85239L07437L31916L58447L86668M14667M37555M47561
$$ y = [1405556, 1410786, 1416626, 1423717, 1432860, 1443792, 1455648, 1467978, 1480256, 1490936, 1498248, 1502025, 1503925, 1505689, 1507705, 1509347, 1510292, 1511225, 1513342, 1517353, 1523245, 1531008, 1541030, 1553421, 1567559, 1583157, 1601392, 1624115, 1652283, 1686192, 1726767, 1774983, 1829808, 1888070, 1946730, 2004166, 2058919, 2108339, 2148997, 2177552, 2191352, 2189714, 2175199, 2152293, 2124224, 2092121, 2057521, 2023942, 1995113, 1972971, 1958183, 1951173, 1951529, 1957790, 1969095, 1985994, 2008539, 2034816, 2062656, 2091662, 2122177, 2153591, 2185578, 2220114, 2260117, 2306452, 2358208, 2415803, 2481778, 2558262, 2645524, 2743770, 2854811, 2980949, 3123252, 3281921, 3457708, 3651846, 3864729, 4095528, 4343430, 4608992, 4894231, 5201668, 5533584, 5892031, 6278699, 6693366, 7130921, 7578482]
60417G578482M35856L95312L23238K22788J01944k9054j59415k78274l75895m46115
60407G768867m87622n02890m96903m76639m49308m19029l86091l50405l14366
60398C885614k80949k50715k22766j97520j76251j58526j42453j27260j13754
60389B215420j02376r2656q4310p7166p0281o2953n6245n1648m8565m5126m1212
60378A482882l8391l6990l5523l3303l1352l0252k9031k6685k3196j8856j4439
60367A164864j1842j2390j4154j3460r694o209n606o476o184m663l614l459k982
60354A064131j345R63K840L485K990K408K689L541M037M066M080L841L005K559
60340A103290L719N545N814M487L948N339P087P797Q211R050R339Q427P740Q668
$$ y = [7578482, 8014338, 8409650, 8732888, 8955676, 9057620, 9028566, 8869151, 8590877, 8214982, 7768867, 7281245, 6778355, 6281452, 5804813, 5355505, 4936476, 4550385, 4199980, 3885614, 3604665, 3353950, 3131184, 2933664, 2757413, 2598887, 2456434, 2329174, 2215420, 2113044, 2020388, 1936078, 1858912, 1788631, 1725678, 1669433, 1617785, 1569220, 1524094, 1482882, 1444491, 1407501, 1371978, 1338675, 1307323, 1277071, 1248040, 1221355, 1198159, 1179303, 1164864, 1153022, 1140632, 1126478, 1113018, 1103324, 1097115, 1091509, 1085033, 1078849, 1074186, 1070572, 1067113, 1064131, 1062786, 1063749, 1066589, 1070074, 1073064, 1075472, 1078161, 1081702, 1085739, 1089805, 1093885, 1097726, 1100731, 1103290, 1107009, 1112554, 1118368, 1122855, 1126803, 1132142, 1139229, 1147026, 1155237, 1164287, 1173626, 1182053, 1189793, 1198461]
60326A198461J0164J0232Q499N843K615j025m004n252n236n175n255m814l815
60313A201238k981k642k416j904j152n16k70j06Q31K748M380M396L406L219M192
60298A212423M885M518M073M537N621O710P610P945P411P022Q346J0948J2444
60285A304493J1713J0206R362Q873Q433Q908J0332J0788Q918N880L263Q80j574
60272A400475k612r32K018L822M499N897Q400J0459J1126J0988J0523R210O619
60259A480492L173l27l221n122o274p500r222j0924j2006j2492j2407j1382r556
60246A383232p910o968o073m731l658l545l802l394k086pK909O008P630O915N145
60231A369665M113M059M189M266M465M554M404M586N441O247O292N949N867O027
$$ y = [1198461, 1208625, 1218857, 1227356, 1233199, 1235814, 1234789, 1230785, 1225533, 1220297, 1215122, 1209867, 1205053, 1201238, 1198257, 1195615, 1193199, 1191295, 1190143, 1189627, 1189357, 1189251, 1190082, 1192830, 1197210, 1201606, 1205012, 1208231, 1212423, 1217308, 1221826, 1225899, 1230436, 1236057, 1242767, 1250377, 1258322, 1265733, 1272755, 1281101, 1292049, 1304493, 1316206, 1326412, 1335774, 1344647, 1353080, 1361988, 1372320, 1383108, 1392026, 1397906, 1401169, 1402049, 1400475, 1397863, 1396931, 1398949, 1402771, 1407270, 1413167, 1421567, 1432026, 1443152, 1454140, 1464663, 1473873, 1480492, 1483665, 1483338, 1480117, 1474995, 1468721, 1461221, 1451999, 1441075, 1429069, 1416577, 1404170, 1392788, 1383232, 1375322, 1368354, 1362281, 1357550, 1353892, 1350347, 1346545, 1343151, 1341065, 1341058, 1343967, 1349975, 1357605, 1364520, 1369665, 1373778, 1377837, 1382026, 1386292, 1390757, 1395311, 1399715, 1404301, 1409742, 1415989, 1422281, 1428230, 1434097, 1440124]
60217A440124O511P951J0185J1766J2007J2295J3926J5910J6542J6127J6395J8038
60205A597777K0470K3309K6445K9327L1740L4681L8936M3475M6859M9586N3322
60194A995927N8365O3516O8194P2990P8477Q4827R2299J00656J08551J15042J21306
60183B960150J29300J39062J48779J57059J63536J67681J68877J67595J64734
60174D366773J59774J51245J39198J25588J11852R7555Q1799O4709M7085K9587
60164E375165J2787k636j5997k6542l3633l7546l9544m0200l8324l2703k4236
60153E096591j4922n138O400K0121L4748M9141O3480P8263R3374J08550J23684
60142E654292J38128J50473J59372J64131J64521J60702J53239J42445J27959
$$ y = [1440124, 1446635, 1454586, 1464771, 1476537, 1488544, 1500839, 1514765, 1530675, 1547217, 1563344, 1579739, 1597777, 1618247, 1641556, 1668001, 1697328, 1729068, 1763749, 1802685, 1846160, 1893019, 1942605, 1995927, 2054292, 2117808, 2186002, 2258992, 2337469, 2422296, 2514595, 2615251, 2723802, 2838844, 2960150, 3089450, 3228512, 3377291, 3534350, 3697886, 3865567, 4034444, 4202039, 4366773, 4526547, 4677792, 4816990, 4942578, 5054430, 5151985, 5233784, 5298493, 5345578, 5375165, 5387952, 5385316, 5369319, 5342777, 5309144, 5271598, 5232054, 5191854, 5153530, 5120827, 5096591, 5081669, 5076531, 5082931, 5103052, 5137800, 5186941, 5250421, 5328684, 5422058, 5530608, 5654292, 5792420, 5942893, 6102265, 6266396, 6430917, 6591619, 6744858, 6887303, 7015262]
60133G015262J09708Q9070O7996M7041K5141J436k3460m7841o9860q8192j02456
60122G023845j12900j19376j21110j17955j10932j00729q6703o8602m8297k8165
60112F109076q468J1964L2833N2083O8419Q2352R4583J04882J12701J17374J17612
60101F895411J12438J02987R1748P9563O4963M7123K7947J0259m763j7213k6579
60090G383884l1654l1898k7792j9938q649N681K2483M1525O3058Q7257J13555
60079G597512J40804J68112J95552K23885K53639K84656L16431L48413L79898
60070I908902M10099M38391M64045M85815N02415N13296N18026N14994N02077
60061A4258060M78963M47466M09006L63268L10213K51787J90239J25974N8639
$$ y = [7015262, 7124970, 7214040, 7282036, 7329077, 7354218, 7355654, 7332194, 7284353, 7214493, 7126301, 7023845, 6910945, 6791569, 6670459, 6552504, 6441572, 6340843, 6254140, 6185538, 6137241, 6109076, 6100608, 6112572, 6145405, 6197488, 6265907, 6348259, 6442842, 6547724, 6660425, 6777799, 6895411, 7007849, 7110836, 7202584, 7282147, 7347110, 7394233, 7422180, 7432439, 7427676, 7410463, 7383884, 7352230, 7320332, 7292540, 7272602, 7263953, 7269634, 7292117, 7333642, 7396700, 7483957, 7597512, 7738316, 7906428, 8101980, 8325865, 8579504, 8864160, 9180591, 9529004, 9908902, 10319001, 10757392, 11221437, 11707252, 12209667, 12722963, 13240989, 13755983, 14258060, 14737023, 15184489, 15593495, 15956763, 16266976, 16518763, 16709002, 16834976, 16893615]
60052A6893615j0554p9108j45164k07726k65570l17203l61331l96260m19808m31226
60042A4259665m32276m24847m08522l82397l48420l10588k71199k30031j87032
60033A1264353j43428j00117n7341j6460K0065N1308P8548J02430J21080J31955
60023A1452393J34168J27879J12951Q9760O0707K9362j913l2754o3365r3060j20507
60012A1695621j45040j67207j87671k05797k19996k29631k35840k40111k42707
60003I821621k42842k39408k31146k17301j99046j79076j58713j36602j11529
59994H105958q5140o0143l6835j3458J0803L5228N9371Q3070J04887J22684J35933
59983H462358J45563J51506J52349J47439J37382J22267J01425P5402M6414J6311
$$ y = [16893615, 16883061, 16803953, 16658789, 16451063, 16185493, 15868290, 15506959, 15110699, 14690891, 14259665, 13827389, 13402542, 12994020, 12611623, 12263203, 11952615, 11681416, 11451385, 11264353, 11120925, 11020808, 10963467, 10947007, 10967072, 11018380, 11096928, 11199358, 11320438, 11452393, 11586561, 11714440, 11827391, 11917151, 11977858, 12007220, 12005307, 11972553, 11909188, 11816128, 11695621, 11550581, 11383374, 11195703, 10989906, 10769910, 10540279, 10304439, 10064328, 9821621, 9578779, 9339371, 9108225, 8890924, 8691878, 8512802, 8354089, 8217487, 8105958, 8020818, 7960675, 7923840, 7910382, 7921185, 7956413, 8015784, 8098854, 8203741, 8326425, 8462358, 8607921, 8759427, 8911776, 9059215, 9196597, 9318864, 9420289, 9495691, 9542105, 9558416]
59973I558416j4299m4711p3799j01310j27673j51936j71748j85851j94791j98588
59963H293710j95852j86336j72421j56725j39677j20763j00638q0311n9395l6813
59953G044779j2800J1208L4324N6824P9313J02203J25678J49241J71435J90692
59943G952897K06528K19348K29070K34222K32626K23112K06584J85036J59559
59934I848982J29974R6620O1320K5761r957m5925q0629j12092j39879j63985j82482
59923I427708j92725j94870j91762j85026j73644j57037j37108j15995r3719o9478
59913G916344m3775j7854P708L2557N5736P6584R5650J13603J29907J43412J53498
59902H663370J59823J61821J59418J53536J45027J33820J20013J05040R0657P7299
$$ y = [9558416, 9544117, 9499406, 9425607, 9324297, 9196624, 9044688, 8872940, 8687089, 8492298, 8293710, 8097858, 7911522, 7739101, 7582376, 7442699, 7321936, 7221298, 7140987, 7081592, 7044779, 7031979, 7043187, 7077511, 7134335, 7213648, 7315851, 7441529, 7590770, 7762205, 7952897, 8159425, 8378773, 8607843, 8842065, 9074691, 9297803, 9504387, 9689423, 9848982, 9978956, 10075576, 10136896, 10162657, 10152700, 10106775, 10026146, 9914054, 9774175, 9610190, 9427708, 9234983, 9040113, 8848351, 8663325, 8489681, 8332644, 8195536, 8079541, 7985822, 7916344, 7872569, 7854715, 7862423, 7894980, 7950716, 8027300, 8122950, 8236553, 8366460, 8509872, 8663370, 8823193, 8985014, 9144432, 9297968, 9442995, 9576815, 9696828, 9801868, 9892525, 9969824]
59892I969824O4583N3145M4750M0457L9644M1358M6230N6387P3332R6310J23213
59881A0649233J52849J85488K21175K58795K97586L38204L80847M23150M61530
59872A3368857M94162N20791N39887N47812N41060N17723M76645M16916L39037
59863A7762890K45510J40007K7038q7417j96593k94927l78769m45414m93145n22532
59853A5756648n36055n35746n22484m97925m65397m27883l86427l41411k94319
59844A1749001k47138k00873j55525j11048o7559k5238J5409N3433Q8000J18727
59834A1217189J45419J67745J84965J95428J96724J87143J66700J36094R5429
59825A2692836M4991j3368p6798j42456k06590k63897l10344l46242l74325l95009
$$ y = [9969824, 10034407, 10087552, 10132302, 10172759, 10212403, 10253761, 10299991, 10356378, 10429710, 10526020, 10649233, 10802082, 10987570, 11208745, 11467540, 11765126, 12103330, 12484177, 12907327, 13368857, 13863019, 14383810, 14923697, 15471509, 16012569, 16530292, 17006937, 17423853, 17762890, 18008400, 18148407, 18175445, 18088028, 17891435, 17596508, 17217739, 16772325, 16279180, 15756648, 15220593, 14684847, 14162363, 13664438, 13199041, 12771158, 12384731, 12043320, 11749001, 11501863, 11300990, 11145465, 11034417, 10966858, 10941620, 10957029, 11010462, 11098462, 11217189, 11362608, 11530353, 11715318, 11910746, 12107470, 12294613, 12461313, 12597407, 12692836, 12737827, 12724459, 12647661, 12505205, 12298615, 12034718, 11724374, 11378132, 11003807, 10608798]
59815A0608798m05968m06237l98078l84404l66797l46482l24761l01614k76165
59806G398292k49332k23909k01235j79919j58733j38657j21261j07168r6987r1329
59796E829762q8901q6738q3667q1308q0482p8989p4626o8146o1418n4557m6852
59785E024078l8992l2420k7709k5169k5610k9000l3702l8456m3721m9730n4918
59774D624651n7877n9148n9456n7775n3082m6542l9945l3312k5862j7964j0153
59763D163535j548Q645J9174K8455L7110M6552N5919O2823O6755O9684P3469P8479
59751D709052Q4374R0512R5592R8241R7741R3489Q4685P1849N7646M4812L3992
59740E561985K4873J8187J4912J4576J6169J9922K6420L4892M4270N5178O8918
$$ y = [10608798, 10202830, 9796593, 9398515, 9014111, 8647314, 8300832, 7976071, 7674457, 7398292, 7148960, 6925051, 6723816, 6543897, 6385164, 6246507, 6125246, 6018078, 5921091, 5829762, 5740861, 5654123, 5570456, 5489148, 5408666, 5329677, 5255051, 5186905, 5125487, 5070930, 5024078, 4985086, 4952666, 4924957, 4899788, 4874178, 4845178, 4811476, 4773020, 4729299, 4679569, 4624651, 4566774, 4507626, 4448170, 4390395, 4337313, 4290771, 4250826, 4217514, 4191652, 4173688, 4163535, 4161987, 4170632, 4189806, 4218261, 4255371, 4301923, 4357842, 4420665, 4487420, 4557104, 4630573, 4709052, 4793426, 4883938, 4979530, 5077771, 5175512, 5269001, 5353686, 5425535, 5483181, 5527993, 5561985, 5586858, 5605045, 5619957, 5634533, 5650702, 5670624, 5697044, 5731936, 5776206, 5831384, 5900302]
59729E900302Q5202J02900J22367J44848J69958J95905K22106K49653K79335L10915
59719G783491L44168L78710M12653M42999M67114M81943M81736M58555M06100
59710A1657469L23037K13874Q8769l7763j50928k40744l03940l41808l57521l55015
59700A0495430l38420l11520k77907k41182k04010j67256j30986r5932o2942l1641
59690H633634j073K8637N6632Q3140J09462J36111J62252J87283K11994K37842
59680I845914K65703K95350L25703L55905L86645M19896M56843M96729N38333
59671A3387021N81520O26457O72424P18704P65698Q13530Q60137R02318R38141
59662B0265950R66814R86547R94287R87818R67210R34538Q93374Q48414Q04467
$$ y = [5900302, 5985504, 6088404, 6210771, 6355619, 6525577, 6721482, 6943588, 7193241, 7472576, 7783491, 8127659, 8506369, 8919022, 9362021, 9829135, 10311078, 10792814, 11251369, 11657469, 11980506, 12194380, 12283149, 12245386, 12094458, 11853714, 11549774, 11207966, 10850445, 10495430, 10157010, 9845490, 9567583, 9326401, 9122391, 8955135, 8824149, 8728217, 8665275, 8633634, 8632561, 8661198, 8717830, 8800970, 8910432, 9046543, 9208795, 9396078, 9608072, 9845914, 10111617, 10406967, 10732670, 11088575, 11475220, 11895116, 12351959, 12848688, 13387021, 13968541, 14594998, 15267422, 15986126, 16751824, 17565354, 18425491, 19327809, 20265950, 21232764, 22219311, 23213598, 24201416, 25168626, 26103164, 26996538, 27844952, 28649419]
59653B8649419P65645P35750P18346P15176P24852P44074P69516P97668Q23713
59644C5444159Q42001Q47345Q35288Q02358P47562O72779N80474M72056L50253
59635D1594275K22239R8364j2389j04763j76223k25608k52530k56583k37237j95528
59625D0454017j35135o0470K5754J22053K26438L36716M51517N69229O86756Q00912
59615D3477787R09878J011014J098114J162897J198405J198466J154957J059009
59607E2270527R05784O96440M36478J35721j89527n17646q27392j102216j330055
59598E0478114j502373j615505j671886j678720j645700j583375j501910j410673
59590C7867972j319624j240296j183405j155011j155617j181464j224116j269822
$$ y = [28649419, 29415064, 30150814, 30869160, 31584336, 32309188, 33053262, 33822778, 34620446, 35444159, 36286160, 37133505, 37968793, 38771151, 39518713, 40191492, 40771966, 41244022, 41594275, 41816514, 41914878, 41902489, 41797726, 41621503, 41395895, 41143365, 40886782, 40649545, 40454017, 40318882, 40258412, 40284166, 40406219, 40632657, 40969373, 41420890, 41990119, 42676875, 43477787, 44387665, 45398679, 46496793, 47659690, 48858095, 50056561, 51211518, 52270527, 53176311, 53872751, 54309229, 54444950, 54255423, 53737777, 52910385, 51808169, 50478114, 48975741, 47360236, 45688350, 44009630, 42363930, 40780555, 39278645, 37867972, 36548348, 35308052, 34124647, 32969636, 31814019, 30632555, 29408439, 28138617]
59582B8138617j303750j317245j309917j284563j242687j185864j118475j046376
59574A8329740r73624r01858q31892p64465p00151o39678n83939n33027m85950
59565A1915156m41976m01609l65509l33093l02941k74213k47151k22422k00502
59556I125740j81511j65335j51790j40673j31900j25941j23792j25706j30040
59547G849052j34570j39059j44908j51853j56999j58340j57230j55743j53361
59538F496989j48357j40922j32510j23341j12938j02134r1900q1171o8536n5313
59528E439867m3986l4236k3680j2270k588M457J0877J8010K4771L0397L5905M1631
59516E489155M5945M7895M8935N0782N3488N6708O0933O6282P1947P7989Q6001
$$ y = [28138617, 26834867, 25517622, 24207705, 22923142, 21680455, 20494591, 19376116, 18329740, 17356116, 16454258, 15622366, 14857901, 14157750, 13518072, 12934133, 12401106, 11915156, 11473180, 11071571, 10706062, 10372969, 10070028, 9795815, 9548664, 9326242, 9125740, 8944229, 8778894, 8627104, 8486431, 8354531, 8228590, 8104798, 7979092, 7849052, 7714482, 7575423, 7430515, 7278662, 7121663, 6963323, 6806093, 6650350, 6496989, 6348632, 6207710, 6075200, 5951859, 5838921, 5736787, 5644887, 5563716, 5495180, 5439867, 5395881, 5361645, 5337965, 5325695, 5323107, 5327564, 5338441, 5356451, 5381222, 5411619, 5447524, 5489155, 5535100, 5582995, 5631930, 5682712, 5736200, 5792908, 5853841, 5920123, 5992070, 6070059, 6156060]
59505F156060R6937J09822J23409J37393J51282J64132J76479J90686K08050K27203
59495G741453K46496K66269K87498L09705L31619L52641L72335L89659M03856
59486A0701531M15088M23109M26432M23890M16145M04612L89756L71388L49768
59477A4321719L25360K97881K66506K31137J93538J57481J27071J03815Q5844
59468A6110352P1079O0423N6281N8885O6481P8489R5512J15890J35120J49356
59458A6997868J56852J55325J40965J11693O9102J5692m7617j19671j96947k75110
59448A7008152l51091m22047m83908n32910n67656n88552n96488n93094n80570
59439A2291836n59884n30663m94180m54749m16375l79417l42231l04749k68615
$$ y = [6156060, 6252997, 6362819, 6486228, 6623621, 6774903, 6939035, 7115514, 7306200, 7514250, 7741453, 7987949, 8254218, 8541716, 8851421, 9183040, 9535681, 9908016, 10297675, 10701531, 11116619, 11539728, 11966160, 12390050, 12806195, 13210807, 13600563, 13971951, 14321719, 14647079, 14944960, 15211466, 15442603, 15636141, 15793622, 15920693, 16024508, 16110352, 16181431, 16241854, 16298135, 16357020, 16423501, 16501990, 16597502, 16713392, 16848512, 16997868, 17154720, 17310045, 17451010, 17562703, 17631805, 17647497, 17599880, 17480209, 17283262, 17008152, 16657061, 16235014, 15751106, 15218196, 14650540, 14061988, 13465500, 12872406, 12291836, 11731952, 11201289, 10707109, 10252360, 9835985, 9456568, 9114337, 8809588, 8540973]
59430H540973k34783k02908j72551j43546j15694q9165o4544m1471j8282O065
59420G464094L0690N4528P8128J02519J27317J51419J74763J98075K21411K43946
59410H846890K64685K82613K96941L07716L15061L17156L10364K92410K64163
59401A1497999K27394J82244J28332O7151J898o4264j28721j89105k43764k91791
59391A1187373l31811l61918l81626l92618l96476l93120l82741l67731l50988
59382G828344l33289l13978k93228k71988k50547k28814k07545j87854j70033
59373E571068j53929j39718j27047j14379j00652q6880p4643o3688n2653m1329
59363D616150l0555k0339j0002M0Q373J4688K0186K5675L0807L5796M2396N1814
$$ y = [8540973, 8306190, 8103282, 7930731, 7787185, 7671491, 7582326, 7517782, 7476311, 7458029, 7464094, 7494784, 7549312, 7627440, 7729959, 7857276, 8008695, 8183458, 8381533, 8602944, 8846890, 9111575, 9394188, 9691129, 9998845, 10313906, 10631062, 10941426, 11233836, 11497999, 11725393, 11907637, 12035969, 12103120, 12105018, 12040754, 11912033, 11722928, 11479164, 11187373, 10855562, 10493644, 10112018, 9719400, 9322924, 8929804, 8547063, 8179332, 7828344, 7495055, 7181077, 6887849, 6615861, 6365314, 6136500, 5928955, 5741101, 5571068, 5417139, 5277421, 5150374, 5035995, 4935343, 4848463, 4773820, 4710132, 4657479, 4616150, 4585595, 4565256, 4555254, 4555294, 4563667, 4578355, 4598541, 4624216, 4655023, 4690819, 4733215, 4785029]
59351D785029O2029O8579O8563O3561N8179N6020N7794O3014P1882Q4525R9789
59340E538964J16380J34177J52504J68030J77175J80860J84496J92784K06646
59331G052016K25438K49317K78129L10346L44772L81593M20585M60290N00424
59322A0222910N43112N89785O38290O84814P27278P64997P96161Q17606Q26476
59313A6611429Q20738P99113P62215P13094O55431N91856N24956M58533L96024
59304B2333389L38298K84229K32591J82190J31144P7788K1934l5995r6513j60431
59294B3308624k26887k92878l54647m09188m55117m92610n22097n43158n55745
59285A9456297n62297n66963n72386n78637n85215n91749n96478n96699n91656
$$ y = [4785029, 4847058, 4915637, 4984200, 5047761, 5105940, 5161960, 5219754, 5282768, 5354650, 5439175, 5538964, 5655344, 5789521, 5942025, 6110055, 6287230, 6468090, 6652586, 6845370, 7052016, 7277454, 7526771, 7804900, 8115246, 8460018, 8841611, 9262196, 9722486, 10222910, 10766022, 11355807, 11994097, 12678911, 13406189, 14171186, 14967347, 15784953, 16611429, 17432167, 18231280, 18993495, 19706589, 20362020, 20953876, 21478832, 21937365, 22333389, 22671687, 22955916, 23188507, 23370697, 23501841, 23579629, 23601563, 23565568, 23469055, 23308624, 23081737, 22788859, 22434212, 22025024, 21569907, 21077297, 20555200, 20012042, 19456297, 18894000, 18327037, 17754651, 17176014, 16590799, 15999050, 15402572, 14805873, 14214217]
59276A4214217n82638n69386n49485n22797m93411m64895m36246m05130l72512
59267I817717l40994l10523k79281k47683k18166j91547j66455j42015j18706
59258G802347r6848p6360n7717m1124k5237q481Q887K5673M1807N7534P1571Q2336
59246G784388R0486R8013J05167J10240J11981J10428J05751R8196Q8804P8431
59236H781885O6480N2375L7752K5200J5180O145k569r657j3577j3662r634j525
59224H934393R830K3340L8515N5016P2076Q9361J07364J25720J42293J55281J64965
59213I918154J71719J73726J69036J58838J46223J31992J13865Q9559N8796K2838
59203A1154746j5650n2297q2604j04381j17723j23118j21196j13845j03816r2903
$$ y = [14214217, 13631579, 13062193, 12512708, 11989911, 11496500, 11031605, 10595359, 10190229, 9817717, 9476723, 9166200, 8886919, 8639236, 8421070, 8229523, 8063068, 7921053, 7802347, 7705499, 7629139, 7571422, 7530298, 7505061, 7496580, 7505467, 7531140, 7572947, 7630481, 7702052, 7784388, 7874874, 7972887, 8078054, 8188294, 8300275, 8410703, 8516454, 8614650, 8703454, 8781885, 8848365, 8900740, 8938492, 8963692, 8978872, 8985017, 8982448, 8972791, 8959214, 8945552, 8935918, 8934393, 8944223, 8967563, 9006078, 9061094, 9133170, 9222531, 9329895, 9455615, 9597908, 9753189, 9918154, 10089873, 10263599, 10432635, 10591473, 10737696, 10869688, 10983553, 11073112, 11131908, 11154746, 11139096, 11086799, 11004195, 10899814, 10782091, 10658973, 10537777, 10423932, 10320116, 10227213]
59193A0227213q1446o9383n7004m5163l5445k9292k6256k4355k2920k3450k6591
59182I785908l0235l2169l2595l2092k9076k1564r781N402K4808M9055P6081J03717
59170I857459J33384J67989K07094K47356K86879L25931L63808L98260M27583
59161A2415743M50010M61243M55970M32212L91582L35412K63594J77334Q0084
59152A5463184k4659j33741k42207l43506m32558n06677n63626o01518o21080
59143A1993612o25486o17414n98304n70473n37338n01127m62641m23651l87021
59134G270157l53895l23070k93570k65837k40010k15336j91958j71217j53683
59125E061581j38631j25594j14497j04210r3143q1499p0808o1237n1738m2752
$$ y = [10227213, 10145767, 10076384, 10019380, 9974217, 9938772, 9909480, 9883224, 9858869, 9835949, 9812499, 9785908, 9755673, 9723504, 9690909, 9658817, 9629741, 9608177, 9598396, 9603798, 9628606, 9677661, 9753742, 9857459, 9990843, 10158832, 10365926, 10613282, 10900161, 11226092, 11589900, 11988160, 12415743, 12865753, 13326996, 13782966, 14215178, 14606760, 14942172, 15205766, 15383100, 15463184, 15438525, 15304784, 15062577, 14719071, 14286513, 13779836, 13216210, 12614692, 11993612, 11368126, 10750712, 10152408, 9581935, 9044597, 8543470, 8080829, 7657178, 7270157, 6916262, 6593192, 6299622, 6033785, 5793775, 5578439, 5386481, 5215264, 5061581, 4922950, 4797356, 4682859, 4578649, 4485506, 4404007, 4333199, 4271962, 4220224, 4177472]
59115D177472l5952l0857k4559j5785o624Q73P504J4955K3064L0584L7303M3957
59103D221935N0923N7867O4188O9564P4579Q0579Q7979R5388J01600J07603J14905
59092E127110J22737J28966J33155J36457J39197J40820J41614J41804J39480
59083F351340J32262J20941J08500R5730Q0832O3523M6236L0653J6088K156r840
59072G038421j9172k6740l2692l5318l3444k7879j9722r110L599J7443L2286M8741
59060F936413O6227Q3146R9454J16863J36054J55768J75102J94496K14003K32746
59050H410272K50492K67562K82804K94006L00617L03705L02902K95855K80971
59041A0989186K58080K26186J83734J32147P6313K0420l4425q7738j37516j81701
$$ y = [4177472, 4141520, 4110663, 4086104, 4070319, 4063695, 4064568, 4072072, 4087027, 4110091, 4140675, 4177978, 4221935, 4272858, 4330725, 4394913, 4464477, 4539056, 4619635, 4707614, 4803002, 4904602, 5012205, 5127110, 5249847, 5378813, 5511968, 5648425, 5787622, 5928442, 6070056, 6211860, 6351340, 6483602, 6604543, 6713043, 6808773, 6889605, 6953128, 6999364, 7030017, 7046105, 7048261, 7038421, 7019249, 6992509, 6959817, 6924499, 6891055, 6863176, 6843454, 6834344, 6837943, 6855386, 6887672, 6936413, 7002640, 7085786, 7185240, 7302103, 7438157, 7593925, 7769027, 7963523, 8177526, 8410272, 8660764, 8928326, 9211130, 9505136, 9805753, 10109458, 10412360, 10708215, 10989186, 11247266, 11473452, 11657186, 11789333, 11865646, 11886066, 11851641, 11763903, 11626387, 11444686]
59031A1444686k19527k50470k74014k91299l04810l15689l23398l28230l31688
59022H805561l33930l33599l30573l26089l19799l09987k97424k85581k75780
59013E992799k65473k52702k39027k26350k13971k00849j88058j76889j66725
59004D062755j56603j46825j37566j28132j18878j11431j05564r8591q9573q1470
58994B888122p7079p5115p2464o8191o3379n8789n4699n1584m9321m6997m4473
58983B226031m2471m0415l6485l0769k5895k3300k1254j8007j4394j1826r947
58972A951268p945o027m226j786J120L294M942P584J0569J0842P722M690M531
58959A986578N620N223L647K743K741K911L402M351N040N530P009R278J0428J0321
$$ y = [11444686, 11225159, 10974689, 10700675, 10409376, 10104566, 9788877, 9465479, 9137249, 8805561, 8471631, 8138032, 7807459, 7481370, 7161571, 6851584, 6554160, 6268579, 5992799, 5727326, 5474624, 5235597, 5009247, 4795276, 4594427, 4406369, 4229480, 4062755, 3906152, 3759327, 3621761, 3493629, 3374751, 3263320, 3157756, 3059165, 2969592, 2888122, 2811043, 2735928, 2663464, 2595273, 2531894, 2473105, 2418406, 2366822, 2317501, 2270504, 2226031, 2183560, 2143145, 2106660, 2075891, 2049996, 2026696, 2005442, 1987435, 1973041, 1961215, 1951268, 1943323, 1937296, 1933070, 1931284, 1932404, 1935698, 1940640, 1948224, 1958793, 1969635, 1977357, 1982047, 1986578, 1992198, 1997421, 2001068, 2003811, 2006552, 2009463, 2012865, 2017216, 2022256, 2027786, 2034795, 2044073, 2054501, 2064822]
58945B064822J1334J4096J5754J4528J2633J2419J2808J2089J1086J0763R833
58934B202165P778P269J0303J4584J6926J7635J8377J8506J7101J6090J7535J9936
58922B384205K0930K1517K3736K6247K6464K5481K6556K9743L2153L2825L3454
58911B683311L4851L6329L8235M1701M6059M9486N1897N4495N7037N8394N9228
58900C211023O1231O4214O6717O8889P1978P5501P7843P9345Q2069Q6790R2620
58889D038220R9241J06994J15170J22811J30726J40360J50961J60481J68984J78690
58879E412638J90640K03695K16866K30464K44901K60131K76499K94615L14527
58870G644976L36241L60466L87472M16040M45144M75797N09609N46319N84546
$$ y = [2064822, 2076156, 2090252, 2106006, 2120534, 2133167, 2145586, 2158394, 2170483, 2181569, 2192332, 2202165, 2209943, 2217212, 2227515, 2242099, 2259025, 2276660, 2295037, 2313543, 2330644, 2346734, 2364269, 2384205, 2405135, 2426652, 2450388, 2476635, 2503099, 2528580, 2555136, 2584879, 2617032, 2649857, 2683311, 2718162, 2754491, 2792726, 2834427, 2880486, 2929972, 2981869, 3036364, 3093401, 3151795, 3211023, 3272254, 3336468, 3403185, 3472074, 3544052, 3619553, 3697396, 3776741, 3858810, 3945600, 4038220, 4137461, 4244455, 4359625, 4482436, 4613162, 4753522, 4904483, 5064964, 5233948, 5412638, 5603278, 5806973, 6023839, 6254303, 6499204, 6759335, 7035834, 7330449, 7644976, 7981217, 8341683, 8729155, 9145195, 9590339, 10066136, 10575745, 11122064, 11706610]
58861A1706610O24277O66633P11690P58047Q04202Q48985Q91095R29262R62265
58852A8903066R87931J002957J004123R88403R51612Q89161P99268O83712N44943
58843B6755176L85001K08375K3076j62550l41574n06279o48335p63665q54013
58834B4095212r21446r64896r84658r86146r75114r52372r17412q74212q28592
58825A5690364p82010p32769o81837o32895n87768n46021n07998m74227m42874
58816A0301965m11874l82683l58003l36716l15174k92830k72451k55052k38519
58807G438663k21192k03477j86007j69195j54209j41582j29549j16484j03700
58798F013268r2931q2714p0747n8224m7805l8750k8379j7101p386J348J1991K4266
$$ y = [11706610, 12330887, 12997520, 13709210, 14467257, 15271459, 16120444, 17011539, 17940801, 18903066, 19890997, 20893954, 21898077, 22886480, 23838092, 24727253, 25526521, 26210233, 26755176, 27140177, 27348552, 27371628, 27209078, 26867504, 26361225, 25712890, 24949225, 24095212, 23173766, 22208870, 21224212, 20238066, 19262952, 18310580, 17393168, 16518956, 15690364, 14908354, 14175585, 13493748, 12860853, 12273085, 11727064, 11219066, 10744839, 10301965, 9890091, 9507408, 9149405, 8812689, 8497515, 8204685, 7932234, 7677182, 7438663, 7217471, 7013994, 6827987, 6658792, 6504583, 6363001, 6233452, 6116968, 6013268, 5920337, 5837623, 5766876, 5708652, 5660847, 5622097, 5593718, 5576617, 5569231, 5570579, 5582570, 5606836]
58786E606836L4966M3705N3682O6202P8978R0722J03132J17098J30753J42647
58776F468721J53706J65091J77081J90801K07955K27891K47617K65606K83282
58767H387751L02378L23229L45926L70720L97128M24824M55211M89888N28092
58758A2025147N68067O10042O55168P02308P48918P94215Q38211Q78491R11339
58749A8731906R35257R49676R50894R33120Q93039Q29755P41169O25061M83730
58740B6073607L23411J49285l4563k20287l96386n54098o90172q03042q90517
58731B2957238r52220r90506j007733j005684r88144r60427r25510q83794q36934
58722A4406286p88356p39701o90578o42419n98580n59771n23186m87372m54370
$$ y = [5606836, 5641802, 5685507, 5739189, 5805391, 5884369, 5975091, 6078223, 6195321, 6326074, 6468721, 6622427, 6787518, 6964599, 7155400, 7363355, 7591246, 7838863, 8104469, 8387751, 8690129, 9013358, 9359284, 9730004, 10127132, 10551956, 11007167, 11497055, 12025147, 12593214, 13203256, 13858424, 14560732, 15309650, 16103865, 16942076, 17820567, 18731906, 19667163, 20616839, 21567733, 22500853, 23393892, 24223647, 24964816, 25589877, 26073607, 26397018, 26546303, 26511740, 26291453, 25895067, 25340969, 24650797, 23847755, 22957238, 22005018, 21014512, 20006779, 19001095, 18012951, 17052524, 16127014, 15243220, 14406286, 13617930, 12878229, 12187651, 11545232, 10946652, 10386881, 9863695, 9376323, 8921953]
58713H921953m25859m00527l76629l54229l33704l14559k96502k79487k62511
58704E877946k44823k27939k13590k00372j85805j70949j58893j49254j38639
58695D187682j26481j15620j06856r7835q8128q0575p6339p2995o8742o4383o0082
58684C229646n4554m8751m5848m6021m5405m1921l8015l6013l4804l3057l1856
58673B773401l2063l2454l2175l2046l2135l1384l0643l2390l6375l9331l9990
58662B402415m0437m1574m1673m0687m1326m4102m5855m5101m4287m4684m3748
58651A928941m0219l7223l7254l8109l6917l4556l2807l0574k6423k2085k0186
58640A572588k0508k1159k1384k1215k0454j9673j9960k0549j9381j6916j5996
$$ y = [8921953, 8496094, 8095567, 7718938, 7364709, 7031005, 6716446, 6419944, 6140457, 5877946, 5633123, 5405184, 5191594, 4991222, 4805417, 4634468, 4475575, 4326321, 4187682, 4061201, 3945581, 3838725, 3740890, 3652762, 3572187, 3495848, 3422853, 3354111, 3289728, 3229646, 3175092, 3126341, 3080493, 3034472, 2989067, 2947146, 2909131, 2873118, 2838314, 2805257, 2773401, 2741338, 2708884, 2676709, 2644663, 2612528, 2581144, 2550501, 2518111, 2481736, 2442405, 2402415, 2361978, 2320404, 2278731, 2238044, 2196718, 2152616, 2106761, 2061660, 2017373, 1972689, 1928941, 1888722, 1851499, 1814245, 1776136, 1739219, 1704663, 1671856, 1641282, 1614859, 1592774, 1572588, 1552080, 1530921, 1509537, 1488322, 1467868, 1448195, 1428235, 1407686, 1388305, 1371389, 1355393]
58629A355393j6811j5931j1862p624n768m811k849q92j31O08K013K200N9k352
58615A291242l098l149l702l855l016k580l196l373k601k456k905j237L254P250
58601A266578Q315P951P661O036K524J07J139L936O425R551J4101J7691J8355
58588A370370J8029J9206K1115K2233K3673K6844L0474L2972L5360L9053M3126
58577A682455M6318M9274N2638N5554N8128O2453O9186P6148Q2145Q8832R6997
58566B420128J04959J12561J22507J35358J47672J57920J69630J85373K02258
58557C758366K17114K31719K48533K65179K77799K86408K92279K92894K84110
58548F154401K64987K36520J98063J49037R2152L1533l0230r0348j44070j88037
$$ y = [1355393, 1338582, 1322651, 1310789, 1303165, 1297397, 1292586, 1289737, 1288845, 1288714, 1289322, 1291335, 1293535, 1293594, 1291242, 1288144, 1284995, 1281293, 1277438, 1274422, 1271842, 1268646, 1265273, 1262672, 1260216, 1257311, 1256074, 1259328, 1266578, 1274893, 1282844, 1290505, 1296541, 1299065, 1299172, 1300311, 1304247, 1310672, 1320223, 1334324, 1352015, 1370370, 1388399, 1407605, 1428720, 1450953, 1474626, 1501470, 1531944, 1564916, 1600276, 1639329, 1682455, 1728773, 1778047, 1830685, 1886239, 1944367, 2006820, 2076006, 2152154, 2234299, 2323131, 2420128, 2525087, 2637648, 2760155, 2895513, 3043185, 3201105, 3370735, 3556108, 3758366, 3975480, 4207199, 4455732, 4720911, 4998710, 5285118, 5577397, 5870291, 6154401, 6419388, 6655908, 6853971, 7003008, 7095160, 7126693, 7096463, 7006115, 6862045, 6674008]
58538F674008k22825k49245k65286k69957k66926k60591k51458k38737k24308
58529D424675k10200j95046j77134j58509j42408j28909j16331j04502r3718q3246
58519C014672p3601o7164o3865o0014n4254n0422n1049n2630n1464m9685n0600
58508B389924n2266n1035m7993m6437m5956m4308m2406m2314m2765m1630m0397
58497A892417m1364m2883m2030l9622l7894l5811l1533k7040k5349k5370k4207
58486A519314k2243k1390k0702j8381j5819j5012j4467j2300j0626j2009j4051
58475A342314j2776r034o504n539m051k364k210k832k788l455o103q018o472l999
58461A266169m719p722r305r403j0510j2542j3909j5534j8495k0056j7390j3101
$$ y = [6674008, 6451183, 6201938, 5936652, 5666695, 5399769, 5139178, 4887720, 4648983, 4424675, 4214475, 4019429, 3842295, 3683786, 3541378, 3412469, 3296138, 3191636, 3097918, 3014672, 2941071, 2873907, 2810042, 2750028, 2695774, 2645352, 2594303, 2541673, 2490209, 2440524, 2389924, 2337658, 2286623, 2238630, 2192193, 2146237, 2101929, 2059523, 2017209, 1974444, 1932814, 1892417, 1851053, 1808170, 1766140, 1726518, 1688624, 1652813, 1621280, 1594240, 1568891, 1543521, 1519314, 1497071, 1475681, 1454979, 1436598, 1420779, 1405767, 1391300, 1379000, 1368374, 1356365, 1342314, 1329538, 1320504, 1314000, 1308461, 1304410, 1302046, 1299836, 1297004, 1294216, 1290761, 1284658, 1276640, 1270168, 1266169, 1261450, 1253728, 1244423, 1235020, 1224510, 1211968, 1198059, 1182525, 1164030, 1143974, 1126584, 1113483]
58449A113483j1642j2485j2224j1065j1462j2335j0636p144n167m919m304l563
58437A006537m095m556l196j995l455n627n318l698l419l142o28J725O04j775
58423I67962j327N32j98k434k197k94o10k626k686j094j053j991q63J342J175
58408I53638m78J77K882M329M587N989P371O184M555O320R696J0028Q027P861
58394A031166Q832O736K159n31j325l890p682q778p844r330j3106j4719j3492
58381I68196j2804j2782j0537p219o858q455p174l232j588k841k606j49M70j512
58367H90909k208n36L55k50K60J694J229k30J027M224N046L660M376P538R311
58352I26405R284J0571J2761J2675J1563J3348J6312J5168J1108J0741J4932J7801
$$ y = [1113483, 1101841, 1089356, 1077132, 1066067, 1054605, 1042270, 1031634, 1024490, 1019323, 1014404, 1010100, 1006537, 1002442, 997886, 994690, 992695, 989240, 983613, 978295, 974597, 971178, 968036, 967408, 969133, 969737, 967962, 966635, 967167, 966969, 964535, 962338, 962044, 961434, 958808, 956122, 955028, 953975, 951984, 951121, 952463, 953638, 953160, 953337, 956219, 960548, 965135, 971124, 978495, 984679, 989234, 995554, 1005250, 1015278, 1023305, 1031166, 1039998, 1046734, 1048893, 1048362, 1047037, 1043147, 1035465, 1026687, 1018843, 1009513, 996407, 981688, 968196, 955392, 942610, 932073, 924854, 917996, 909541, 902367, 899135, 897547, 894706, 892100, 891951, 892421, 890909, 888701, 888165, 888520, 888270, 888530, 890224, 891453, 891223, 892250, 896474, 901520, 905180, 909556, 917094, 926405, 935689, 946260, 959021, 971696, 983259, 996607, 1012919, 1028087, 1039195, 1049936, 1064868, 1082669]
58340A082669J7127J6730J7902J7367J4589J2435J0223M834j144j687J948K367
58328A195360j770m454l769m253o775o595l314k613n901q009p137p448r755r373
58314A114194n410k539j689J393O550Q324O583P599J2354J4278J1143Q702R658
58301A191140R606O953O367Q950R333N956M235O066O352L229J709L773M883L569
58287A272121M304P743Q486N626M975P787Q264N256N060R171J1073Q863R057J3727
58273A381513J6069J3425J2484J6420J8914J6517J5029J7898J9866J8040J7769
58262A563944K1643K3811K1205J9408K1728K3389K1930K2049K4991K4802K0456
58251A809356J9564K4588K7556K4266K1282K3070K4717K3282K3581K6769K6297
$$ y = [1082669, 1099796, 1116526, 1134428, 1151795, 1166384, 1178819, 1189042, 1193876, 1192732, 1191045, 1192993, 1195360, 1193590, 1189136, 1185367, 1181114, 1174339, 1167744, 1164430, 1161817, 1155916, 1147907, 1140770, 1133322, 1123567, 1114194, 1108784, 1106245, 1104556, 1105949, 1112499, 1120823, 1127406, 1135005, 1147359, 1161637, 1172780, 1181482, 1191140, 1200746, 1207699, 1214066, 1223016, 1232349, 1238305, 1242540, 1248606, 1254958, 1258187, 1259896, 1263669, 1268552, 1272121, 1276425, 1284168, 1292654, 1298280, 1303255, 1311042, 1319306, 1324562, 1329622, 1338793, 1349866, 1358729, 1367786, 1381513, 1397582, 1411007, 1423491, 1439911, 1458825, 1475342, 1490371, 1508269, 1528135, 1546175, 1563944, 1585587, 1609398, 1630603, 1650011, 1671739, 1695128, 1717058, 1739107, 1764098, 1788900, 1809356, 1828920, 1853508, 1881064, 1905330, 1926612, 1949682, 1974399, 1997681, 2021262, 2048031, 2074328]
58240B074328K1238K0244K6154L0468K9250L0075L6466M0504L8266L7633M2898
58229B427524M6652M4954M5273N1088N4130N0586M9202N4527N8294N6619N8704
58218B997553O8550P5352P3043P2108Q0368Q9174R0933R3233J02706J11523J12994
58207C967537J14212J20463J23914J20664J21600J32817J42892J43334J43746
58198E131179J52545J61302J63082J67460J81708J96033K03313K14019K35219
58189F805860K54878K64107K74402K95089L14882L24438L35464L57771L79605
58180I606496L91305M05689M33334M61127M78364N00229N40706N85868O19715
58171A4022833O52707O98327P45795P83747Q26270Q86548R49616J000735J054963
$$ y = [2074328, 2095566, 2115810, 2141964, 2172432, 2201682, 2231757, 2268223, 2308727, 2346993, 2384626, 2427524, 2474176, 2519130, 2564403, 2615491, 2669621, 2720207, 2769409, 2823936, 2882230, 2938849, 2997553, 3066103, 3141455, 3214498, 3286606, 3366974, 3456148, 3547081, 3640314, 3743020, 3854543, 3967537, 4081749, 4202212, 4326126, 4446790, 4568390, 4701207, 4844099, 4987433, 5131179, 5283724, 5445026, 5608108, 5775568, 5957276, 6153309, 6356622, 6570641, 6805860, 7060738, 7324845, 7599247, 7894336, 8209218, 8533656, 8869120, 9226891, 9606496, 9997801, 10403490, 10836824, 11297951, 11776315, 12276544, 12817250, 13403118, 14022833, 14675540, 15373867, 16119662, 16903409, 17729679, 18616227, 19565843, 20566578, 21621541]
58162B1621541J128258J206606J275754J352725J453755J561058J657495J763179
58154C3020371J899653K050673K198771K365487K571460K793813L010937L251535
58146E3162700L549534L892741M270705M727001N302480N975827O728070P612946
58138I5222004Q689481R944635J1364023J3004006J4889507J6918402J8988232
58131A89020290K1139159K3470880K6093454K9326399L3553783L8176932M0651066
58124D01431963L7424265K6713729J0463796o739063k0734869k9830339l4458248
58117C84271234l5770168l4829142l2542175k9647893k6594378k3578037k0716953
58110A80592488j8104916j5758309j3644073j1764610j0145255q758952p535943
$$ y = [21621541, 22749799, 23956405, 25232159, 26584884, 28038639, 29599697, 31257192, 33020371, 34920024, 36970697, 39169468, 41534955, 44106415, 46900228, 49911165, 53162700, 56712234, 60604975, 64875680, 69602681, 74905161, 80880988, 87609058, 95222004, 103911485, 113856120, 125220143, 138224149, 153113656, 170032058, 189020290, 210159449, 233630329, 259723783, 289050182, 322603965, 360780897, 401431963, 438856228, 465569957, 476033753, 469294690, 448559821, 418729482, 384271234, 348501066, 313671924, 281129749, 251481856, 224887478, 201309441, 180592488, 162487572, 146729263, 133085190, 121320580, 111175325, 102416373, 94880430]
58103I4880430o438859n470226m614823l830356l097791k435975j855278j328280
58095F5808842q18808l07500K48171R60068J919925K964714L558576L079383J369093
58086G8782464j019573l213355m656626n339597n512407n364443m999663m534516
58078D4142284m075273l647817l234824k850648k522989k239599j973064j732082
58070B1865988j538642j379604j227373j086756r78478q95822q17582p46363o96536
58061A2498832o60226o20173n81319n56639n36303n02773m62883m34368m13515
58052G730633l85556l54680l34758l21545l01939k80267k68736k61873k46551
58043D974728k27601k18061k13174j99036j78637j65197j57391j44686j29576
$$ y = [94880430, 88441571, 82971345, 78356522, 74526166, 71428375, 68992400, 67137122, 65808842, 64990034, 64682534, 64930705, 65890773, 67810698, 70775412, 74333988, 77413371, 78782464, 77762891, 74549536, 69892910, 64553313, 59040906, 53676463, 48676800, 44142284, 40067011, 36419194, 33184370, 30333722, 27810733, 25571134, 23598070, 21865988, 20327346, 18947742, 17720369, 16633613, 15655135, 14759313, 13941731, 13195368, 12498832, 11838606, 11218433, 10637114, 10080475, 9544172, 9041399, 8578516, 8144148, 7730633, 7345077, 6990397, 6655639, 6334094, 6032155, 5751888, 5483152, 5221279, 4974728, 4747127, 4529066, 4315892, 4116856, 3938219, 3773022, 3615631, 3470945, 3341369]
58034C341369j21869j18001j08126r6611r3959r5431q9133p8474p5233p6856p2044
58023B315632o2897o0210o1955n7570m9037m7116n0443m8541m2218m1348m5277
58012A749020m4494l9400l8780m1821l9682l3200l1468l4225l2585k6131k2927
58001A364307k3617k1284j6082j4805j6904j5606j1733j2015j5238j4388j0880
57990A191755j2248j7092j6804j1116p788p893n494r52n19l303k365J638J364
57977A109183k988l710K52K115L02O7K023J368j405j004J562K22m152m793j716
57962A097326j415m246m245j370j742n651p324o736r471j4515j4623r698p559
57949A008731j0291j1800j0215j0663j3968j4477j1243r882j1147r087l079k99
$$ y = [3341369, 3219500, 3101499, 2993373, 2896762, 2802803, 2707372, 2618239, 2539765, 2464532, 2387676, 2315632, 2252735, 2192525, 2130570, 2073000, 2023963, 1976847, 1926404, 1877863, 1835645, 1794297, 1749020, 1704526, 1665126, 1626346, 1584525, 1544843, 1511643, 1480175, 1445950, 1413365, 1387234, 1364307, 1340690, 1319406, 1303324, 1288519, 1271615, 1256009, 1244276, 1232261, 1217023, 1202635, 1191755, 1179507, 1162415, 1145611, 1134495, 1126707, 1118814, 1113320, 1112368, 1111849, 1108546, 1106181, 1107819, 1109183, 1106195, 1102485, 1102737, 1104852, 1105154, 1105221, 1107244, 1108612, 1107207, 1106203, 1107765, 1107987, 1103835, 1099042, 1097326, 1095911, 1091665, 1087420, 1086050, 1084308, 1078657, 1071333, 1064597, 1055126, 1040611, 1025988, 1016290, 1008731, 998440, 986640, 976425, 965762, 951794, 937317, 926074, 916192, 905045, 895958, 892879, 892580]
57937H92580l227n455l321j314k438l064j120j87j778k114J36J130k61PK902L741
57921H76217N87k422k641k307k301k39L170L554O31r22R6j51k404k861j410k781
57905H63816p499j0164q900q222j0118j0631p907n577n498m959l581n000r136
57892G66624j0771q427o735p395o171j771P79q10j858O21K906K185J593L388M359
57877G38517K332L86L95q42m869p688o900o143q120r643q154o835q491j0301r384
57862F54260p929q009p004l102n5j159l270k003J360L171L744N520Q078R508R992
57847F63102J0443J0256R334R316J0264R503O120K951J902J272j37o10L70Q8k596
57832G31578m763m485m140n912q093q662q503q645q142p018p202q398p498m086
$$ y = [892580, 889353, 883898, 880577, 879263, 876825, 873761, 872641, 872454, 870676, 868562, 868698, 869828, 869567, 869574, 872476, 876217, 876804, 874382, 871741, 869434, 867133, 866894, 870064, 873618, 874249, 873327, 873423, 873272, 870868, 868007, 866597, 863816, 856317, 846153, 837253, 829031, 818913, 808282, 800375, 794798, 789300, 784341, 780760, 775760, 766624, 755853, 747426, 740691, 733296, 727125, 725354, 726133, 725323, 723465, 724086, 726992, 729177, 730770, 734158, 738517, 740849, 741235, 741630, 740788, 735919, 728231, 721331, 715188, 707068, 697425, 689271, 682436, 673945, 663644, 654260, 646331, 638322, 631318, 628216, 628161, 627002, 623732, 621729, 623089, 626260, 630004, 635524, 643602, 653110, 663102, 673545, 683801, 693135, 702451, 712715, 722218, 728338, 731289, 733191, 734463, 734326, 733716, 734086, 734174, 731578, 726815, 722330, 718190, 712278, 704185, 695523, 687020, 678375, 670233, 663215, 656013, 647615, 640117, 636031]
57818F36031j941k842l809k775j836k294j768P31K100Q57M96L685P821R840J0813
57803F55109J2296J2764J1250J0092J0483R631N914K387J639J452q08l791n627
57790G22791p395r661j0029p772o438q170j0032r691r700j2003j3289j0636p139
57777F00836o716p648o592m988n842p735p662o760p710r255q702p394q325j0407
57763D95100j0368q481p667q405q955r034r291q805o878n373n766o107m474k821
57749C92675l627n345n219m079m084m249k610n62n50j457n80J724L400M730O871
57734C77038Q547Q433Q642J1374J4058J2597P920M677M623N507N463M404K230
57721D75513o24k034j099n78k973o093o395m733m602o402p770q072q235p626n326
$$ y = [636031, 634090, 631248, 627439, 624664, 622828, 620534, 618766, 619497, 621597, 622454, 622950, 626635, 634456, 644296, 655109, 667405, 680169, 691419, 701511, 711994, 721625, 727539, 729926, 731565, 733017, 732209, 728418, 722791, 715396, 705735, 695706, 687934, 681496, 673326, 663294, 653603, 643903, 631900, 618611, 607975, 600836, 594120, 586472, 579880, 574892, 569050, 561315, 553653, 546893, 539183, 529928, 521226, 513832, 505507, 495100, 484732, 476251, 468584, 460179, 451224, 442190, 432899, 424094, 417216, 411843, 406077, 399970, 395496, 392675, 389048, 383703, 378484, 374405, 370321, 366072, 363462, 362900, 362350, 360893, 360313, 362037, 365437, 370167, 377038, 385585, 394018, 402660, 414034, 428092, 440689, 448609, 453286, 457909, 463416, 468879, 473283, 475513, 474889, 472855, 471756, 471178, 468205, 462112, 455717, 450984, 446382, 439980, 432210, 424138, 415903, 408277, 402951]
57706D02951l187l323l954k003J557L340L175L414L931K730Q62J696N389Q443
57692D25021Q951Q335P945P604P475P933P901O409N095N931P558P424O308O809
57678E26699Q584R213Q850R568J0877J0432Q597P971Q683Q616P898Q703J0704
57665F45395J1337J0743J1899J5365J8251J8986J9088J9623J9973K0695K3415
57654H34770K7124K8617K7616K7544L0107L2915L3910L4532L6762M0114M3302
57643A197313M6396M9881N3582N7568O2325O7445P2074P6726Q2515Q8821R4270
57632A948916R9798J07917J18951J30825J42550J55058J68570J82145J95928K10909
57622C461567K26349K40107K51226K59144K60932K53018K35598K11650J81787
$$ y = [402951, 399764, 396441, 392487, 390484, 392041, 395381, 398556, 401970, 405901, 408631, 409493, 411189, 416578, 425021, 433972, 442307, 450252, 457856, 465331, 473264, 481165, 487574, 492669, 498600, 506158, 513582, 519890, 526699, 535283, 544496, 553346, 562914, 573791, 584223, 592820, 600791, 609474, 618090, 625988, 634691, 645395, 656732, 667475, 679374, 694739, 712990, 731976, 751064, 770687, 790660, 811355, 834770, 861894, 890511, 918127, 945671, 975778, 1008693, 1042603, 1077135, 1113897, 1154011, 1197313, 1243709, 1293590, 1347172, 1404740, 1467065, 1534510, 1606584, 1683310, 1765825, 1854646, 1948916, 2048714, 2156631, 2275582, 2406407, 2548957, 2704015, 2872585, 3054730, 3250658, 3461567, 3687916, 3928023, 4179249, 4438393, 4699325, 4952343, 5187941, 5399591, 5581378]
57613E581378J44389J01324N9069K2893o535l0257m9280o7280r0526j22053j58394
57602E384728j93653k23969k46524k58048k57355k47290k31828k12905j91657
57593C321499j70338j50797j32651j14864r7943q3030p0235n9087m9407m0718
57583B352429l2022k3063j4678p259p0P499J5377K3616L2294M0634M8030N5852
57571B498639O6116P8274Q9562R8861J07986J18683J30512J42281J53640J64583
57561C649137J74813J83745J89725J89729J81730J66704J46139J18672Q2265L8961
57551E121620o044m9707r1888j30908j62713j85442k01088k11350k15324k12626
57541C654530k05510j96178j84938j72431j60788j50903j41150j30462j20300
$$ y = [5581378, 5725767, 5827091, 5886160, 5909053, 5902518, 5872261, 5822981, 5755701, 5665175, 5543122, 5384728, 5191075, 4967106, 4720582, 4462534, 4205179, 3957889, 3726061, 3513156, 3321499, 3151161, 3000364, 2867713, 2752849, 2654906, 2571876, 2501641, 2442554, 2393147, 2352429, 2320407, 2297344, 2282666, 2275407, 2275337, 2282836, 2298213, 2321829, 2354123, 2394757, 2442787, 2498639, 2564755, 2643029, 2732591, 2831452, 2939438, 3058121, 3188633, 3330914, 3484554, 3649137, 3823950, 4007695, 4197420, 4387149, 4568879, 4735583, 4881722, 5000394, 5082659, 5121620, 5115576, 5065869, 4973981, 4843073, 4680360, 4494918, 4293830, 4082480, 3867156, 3654530, 3449020, 3252842, 3067904, 2895473, 2734685, 2583782, 2442632, 2312170, 2191870]
57532B191870j12087j04911r7262q9069q0882p3003o6183o1123n6823n1723m6653
57521A352151m3884m2975m0949l7069l3766l1999k9643k5764k2490k0855j8731
57510A004026j5055j2253j1914j1669r308o599n779n271k527J294L110K794K880
57497I33729M616P219R934J2436J4124J5131J6952K0303K3729K5959K7897L0562
57485A142591L3106L4885L7517M2444M8240N2626N5786N9453O4238O9899P6736
57474A717521Q4642R2274R9143J06934J16777J26919J35152J41650J47158J50360
57464B918530J49627J45664J39539J29386J12073Q7236N7255K4214j0530m4693
57454C708301p5659j02370j24568j40934j50121j53050j52105j48561j42455j34315
$$ y = [2191870, 2079783, 1974872, 1877610, 1788541, 1707659, 1634656, 1568473, 1507350, 1450527, 1398804, 1352151, 1308267, 1265292, 1224343, 1187274, 1153508, 1121509, 1091866, 1066102, 1043612, 1022757, 1004026, 988971, 976718, 964804, 953135, 943827, 937228, 931449, 926178, 923651, 924945, 928055, 930849, 933729, 938345, 945564, 955498, 967934, 982058, 997189, 1014141, 1034444, 1058173, 1084132, 1112029, 1142591, 1175697, 1210582, 1248099, 1290543, 1338783, 1391409, 1447195, 1506648, 1570886, 1640785, 1717521, 1802163, 1894437, 1993580, 2100514, 2217291, 2344210, 2479362, 2621012, 2768170, 2918530, 3068157, 3213821, 3353360, 3482746, 3594819, 3682055, 3739310, 3763524, 3752994, 3708301, 3632642, 3530272, 3405704, 3264770, 3114649, 2961599, 2809494, 2660933, 2518478, 2384163]
57444B384163j25188j15552j05742r6691q8794q0974p2234o3151n4691m6888l9932
57433A494326l4786l1171k6763k0321j3812r431o298k339K355O646J1164J7121
57421A386691K3542K8517L2410L7185M3215M9226N4801O0601O6713P2915Q0002
57410A935818Q8732R8003J06072J13004J19990J26933J32369J35074J34046J27706
57400C117747J14767R5159O9087L6743K92l5730o7956r6488j22034j42897j57029
57389B811661j64919j67976j66150j59933j52354j45840j38894j29247j18268
57380A468080j08699j00036r0321q0893p4705p0910o5754n8539n2153m7817m3819
57369F74434l9790l7698l7596l6520l2923k8838k6305k4736k3140k1998k1598
$$ y = [2384163, 2258975, 2143423, 2037681, 1940990, 1852196, 1771222, 1698988, 1635837, 1581146, 1534258, 1494326, 1459540, 1428369, 1401606, 1381285, 1367473, 1358042, 1351744, 1349405, 1351760, 1358406, 1369570, 1386691, 1410233, 1438750, 1471160, 1508345, 1551560, 1600786, 1655587, 1716188, 1782901, 1855816, 1935818, 2024550, 2122553, 2228625, 2341629, 2461619, 2588552, 2720921, 2855995, 2990041, 3117747, 3232514, 3327673, 3396760, 3433503, 3433795, 3398065, 3330109, 3233621, 3111587, 2968690, 2811661, 2646742, 2478766, 2312616, 2152683, 2000329, 1854489, 1715595, 1586348, 1468080, 1359381, 1259345, 1169024, 1088131, 1013426, 942516, 876762, 818223, 766070, 718253, 674434, 634644, 596946, 559350, 522830, 489907, 461069, 434764, 410028, 386888, 364890, 343292]
57358C43292k0840j9118j7386j6466j5957j5293j4263j2512j0334r575j1479j4038
57346A66031j4146j1938j0222r976r659q832q940r942r675p466n423n166n895
57333D8751o520p045p095n792l851l314m442n276E70c668m020l336k249k163l040
57318a8476k970j366o6l71j370k015k401k388j497o59j415k864k414j26R68k41
57302c9671j225j80J266J414J319K239L109K913L133N526R175H30J2589J2044
57288B5463J0954J0411J1509J3748J5236J5320J5360J6384J7890J9379K0912K1720
57276B14286K0643J8399J6849J5777J3382J0190Q949R926J0081Q178O868P977
57264C61505R456R112P913P402P005O326O999R693J2131J2571J2537J3706J4843
$$ y = [343292, 322452, 303334, 285948, 269482, 253525, 238232, 223969, 211457, 201123, 191548, 180069, 166031, 151885, 139947, 129725, 119749, 110090, 101258, 92318, 82376, 72701, 65235, 59812, 54646, 48751, 42231, 35186, 28091, 22299, 18448, 15134, 10692, 5416, 570, -3668, -7688, -11024, -13273, -15436, -18476, -21446, -22812, -22878, -23249, -24619, -26634, -29035, -31423, -32920, -33579, -34994, -37858, -40272, -40398, -39430, -39671, -40896, -41076, -39810, -38396, -37077, -34838, -31729, -28816, -25683, -20157, -10982, 830, 13419, 25463, 36417, 46828, 58337, 72085, 87321, 102641, 118001, 134385, 152275, 171654, 192566, 214286, 234929, 253328, 270177, 285954, 299336, 309526, 318475, 328401, 338482, 346660, 353528, 361505, 370961, 380073, 387986, 395388, 402393, 408719, 415718, 425411, 437542, 450113, 462650, 476356, 491199]
57251D91199J4386J3461J3623J4035J3515J3015J3589J4102J3459J2796J3158
57240F40338J3436J2878J3113J5175J7246J7938J8941K1657K4139K4559K4839
57229H44259K7317L0442L1635L2018L4303L7780L9508L8989L8008L7191L6189
57218A227639L5950L7272L8324L6828L3345K9346K3690J4714M276m044r683j4577
57206A453080j9106k2120k3865k5247k5217k2432j8531j6185j4936j2498r221
57195A243722p374o835n378k744p24M22K080M287O075Q174J1844J5705J7473J8241
57181A304968K1027K5432K7998K7923K8302L1111L4786L7547L9590M1116M1295
57170A661095M0180L9105L8468L7389L5893L5185L5722L7066L9308M2402M4721
$$ y = [491199, 505585, 519046, 532669, 546704, 560219, 573234, 586823, 600925, 614384, 627180, 640338, 653774, 666652, 679765, 694940, 712186, 730124, 749065, 770722, 794861, 819420, 844259, 871576, 902018, 933653, 965671, 999974, 1037754, 1077262, 1116251, 1154259, 1191450, 1227639, 1263589, 1300861, 1339185, 1376013, 1409358, 1438704, 1462394, 1477108, 1481384, 1477340, 1467657, 1453080, 1433974, 1411854, 1387989, 1362742, 1337525, 1315093, 1296562, 1280377, 1265441, 1252943, 1243722, 1236348, 1229513, 1224135, 1221391, 1220667, 1221089, 1223169, 1227456, 1233531, 1241705, 1253549, 1269254, 1286727, 1304968, 1325995, 1351427, 1379425, 1407348, 1435650, 1466761, 1501547, 1539094, 1578684, 1619800, 1661095, 1701275, 1740380, 1778848, 1816237, 1852130, 1887315, 1923037, 1960103, 1999411, 2041813, 2086534]
57159B086534M4815M3892M4037M4875M4739M3918M3791M3884M3153M2930M5072
57148B571640M8276N0151N1724N5646O0935O4040O4515O5000O5905O4894O1699
57137C224425N8646N6187N2547M8180M5975M6267M6107M4297M2911M2900M2346
57126C750788M0124L7466L5085L2335K9791K8900K8697K6729K3441K1668K1643
57115D076667K0879J9164J8977K0533K1075J9717J8333J7124J4126R811P247O851
57103D270504N790L417K120J974j54m923r185j1703j5034k0312k5310k9314l4835
57090D133035m2768n0570n6734o2485o7943p1494p3938p8307q4833r1133r7610
57079C355220j06964j18357j28528j38795j53698j72394j89194k03601k21693
$$ y = [2086534, 2131349, 2175241, 2219278, 2264153, 2308892, 2352810, 2396601, 2440485, 2483638, 2526568, 2571640, 2619916, 2670067, 2721791, 2777437, 2838372, 2902412, 2966927, 3031927, 3097832, 3162726, 3224425, 3283071, 3339258, 3391805, 3439985, 3485960, 3532227, 3578334, 3622631, 3665542, 3708442, 3750788, 3790912, 3828378, 3863463, 3895798, 3925589, 3954489, 3983186, 4009915, 4033356, 4055024, 4076667, 4097546, 4116710, 4135687, 4156220, 4177295, 4197012, 4215345, 4232469, 4246595, 4256406, 4263653, 4270504, 4276294, 4279711, 4281831, 4283805, 4283651, 4278728, 4269543, 4257840, 4242806, 4222494, 4197184, 4167870, 4133035, 4090267, 4039697, 3982963, 3920478, 3852535, 3781041, 3707103, 3628796, 3543963, 3452830, 3355220, 3248256, 3129899, 3001371, 2862576, 2708878, 2536484, 2347290, 2143689, 1921996]
57070A921996k46136k73150l00938l32601l68830f185m46751m94888n50868o08602
57060b107294o67259p32955q06949q83287r61127j047913j146838j253311j367623
57051a0974556j498384j649015j814518j996676k208173k455917k735491l048570
57043b8381300l409700l828858m305359m848852n489404o257690p172760q256057
57035g1949980r531693j0996516j2608851j4319193j6092843j7896291j9682461
57028a73077828k1373867k2805505k3713790k3933117k3679164k3467099k3500296
57021c35550666k3128650k1142141j6769578j0362060l073573M003636J0317408
57014c95705624J5681878J9945967K2938864K4609657K5097519K4679376K3683678
$$ y = [1921996, 1675860, 1402710, 1101772, 769171, 400341, -6185, -452936, -947824, -1498692, -2107294, -2774553, -3507508, -4314457, -5197744, -6158871, -7206784, -8353622, -9606933, -10974556, -12472940, -14121955, -15936473, -17933149, -20141322, -22597239, -25332730, -28381300, -31791000, -35619858, -39925217, -44774069, -50263473, -56521163, -63693923, -71949980, -81481673, -92478189, -105087040, -119406233, -135499076, -153395367, -173077828, -194451695, -217257200, -240970990, -264904107, -288583271, -312050370, -335550666, -358679316, -379821457, -396591035, -406953095, -410026668, -406023032, -395705624, -380023746, -360077779, -337138915, -312529258, -287431739, -262752363, -239068685]
57007b39068685K2405850K1034841J9641498J8240320J6847757J5482442J4149426
57000a11266551J2854254J1617766J0458811R376450Q364548P430149O582615
56993d4581958N816739N120902M492193L931358L432345K988796K602873K276738
56985a3920014K001852J765507J561211J384919J228910J088021R65439Q64269
56977c059886P79300P03845O38273c53884A84851M95372M54399M16458L77577
56968A928657L35081K93256K56580K22604J87959J56032J31730J13360R6468Q1429
56958C803156P0551O1442N0010L6686K3637Q981j0204l1893n1758o9149q5481
56947C805978r9516j09434j16965j24458j30120j30409j24628j13706r7688p7456
$$ y = [-239068685, -216662835, -195627994, -175986496, -157746176, -140898419, -125415977, -111266551, -98412297, -86794531, -76335720, -66959270, -58594722, -51164573, -44581958, -38765219, -33644317, -29152124, -25220766, -21788421, -18799625, -16196752, -13920014, -11918162, -10152655, -8591444, -7206525, -5977615, -4889594, -3924155, -3059886, -2280586, -1576741, -938468, -353884, 184851, 680223, 1134622, 1551080, 1928657, 2263738, 2556994, 2813574, 3036178, 3224137, 3380169, 3511899, 3625259, 3721727, 3803156, 3873707, 3935149, 3985159, 4021845, 4045482, 4054463, 4044259, 4012366, 3960608, 3891459, 3805978, 3706462, 3597028, 3480063, 3355605, 3225485, 3095076, 2970448, 2856742, 2759054, 2681598]
56937B681598n4180k3786K0431P2214J05475R3661L5420m5336j22124j81460k19927
56926B361986k37931k39526k30997k16036j95802j73833j55568j42263j30305
56917F39725j17524j05644r5785q6292p6206o6784C3080a6564m0365l2311k5875
56906a15115j9570j3151p738k568M446J2406J7749J9818K2075K6331b5765B592
56893B5924J6924J0067L029k787o255q118r396r666q248n638k622O98L987O284
56879A4183P489Q884J1315J4130J6616J9227K2676K6925L1474L5449L7116L4534
56867B80018K7300J6721M555p301j6525k1792k4357k6234k7082k5132k1083j8086
56855A41002j7242j5977j2215p578m797l988l499k824k597k623j960n66N51P92
$$ y = [2681598, 2627418, 2603632, 2624063, 2696277, 2801752, 2895413, 2930833, 2885497, 2763373, 2581913, 2361986, 2124055, 1884529, 1653532, 1437496, 1241694, 1067861, 912293, 770030, 639725, 522201, 416557, 320772, 234480, 158274, 91490, 33080, -16564, -56929, -89240, -115115, -134685, -147836, -155574, -158142, -153696, -141290, -123541, -103723, -81648, -55317, -25765, 2592, 25924, 42848, 52915, 55944, 53157, 46902, 38784, 29388, 19722, 11474, 5836, 3214, 3912, 7899, 14183, 21672, 30556, 41871, 56001, 72617, 91844, 114520, 141445, 172919, 208368, 245484, 280018, 307318, 324039, 328594, 321293, 304768, 282976, 258619, 232385, 205303, 180171, 159088, 141002, 123760, 107783, 95568, 87990, 83193, 79205, 75706, 72882, 70285, 67662, 65702, 65136, 65687, 66479]
56841F6479N27L03K29J22OL91J978M775P811J0275J2387J4506J6192J7429J9802
56826A73212K4521K9626L1326K8333K2962J7776J3261R150N821L392J238n43q20
56813C59255N98K225L095M048N911Q107J0192J3190J7871K3123K7581L1680L6489
56800E43365M1509M5133M6468M4993L9236K7878J2385k910j3991j9858k2116k2553
56788G19539k1412j7902j2167o052j106L538R829J7487K4020K8438L2890L9500
56776H16602M7443N4705O0876O6128O8490O4554N2705L4211J1641j2043l3172
56765A232140m8364n6521n8964n7511n3321m7377m0754l3946k6835j9427j2092
56754G77028n040J824Q545J5168K1842K8445L4418L9359M3025M4035L9599K7969
$$ y = [66479, 67006, 67309, 67538, 67660, 67666, 68057, 70035, 74810, 82621, 92896, 105283, 119789, 135981, 153410, 173212, 197733, 227359, 258685, 287018, 309980, 327756, 341017, 350167, 355988, 359380, 360618, 360075, 359255, 359853, 362078, 365173, 369221, 375132, 383239, 393431, 406621, 424492, 447615, 475196, 506876, 543365, 584874, 630007, 676475, 721468, 760704, 788582, 800967, 798057, 784066, 764208, 742092, 719539, 698127, 680225, 668058, 662006, 660900, 664438, 674267, 691754, 715774, 744212, 777102, 816602, 864045, 918750, 979626, 1045754, 1114244, 1178798, 1231503, 1265714, 1277355, 1265312, 1232140, 1183776, 1127255, 1068291, 1010780, 957459, 910082, 869328, 835382, 808547, 789120, 777028, 771988, 773812, 782357, 797525, 819367, 847812, 882230, 921589, 964614, 1008649, 1048248, 1076217]
56742A076217J0901p353k3172l4897m2032m4936m5128m4284m2484l8677l2874
56731G31281k6656k1322j6756j2475q478m552Q0N681J1254J5533J8185J9511J9421
56718G30707J7149J1848L440o772j6432k3683k8310l1079l2342l2055l0564k8310
56706E33597k5055k0714j6615j4387j3549j1981r127o931o814p469o951n432m397
56693C84175m174l936l485l263l003k071j052j356k894l783k952j766k075l669
56679C44696m867n037n136n692n592l623m93J591J231r47l309m734m989m371l489
56664B95239k941k748k437k040k332l507m318l457j426P5L05j01o39j325j498
56649B66850m1K389L038M18l116l797j060J978K659J704J383K053J958M1k405
$$ y = [1076217, 1087118, 1079765, 1056593, 1021696, 979664, 934728, 889600, 845316, 802832, 764155, 731281, 704625, 683303, 666547, 654072, 645594, 641042, 641122, 646803, 658057, 673590, 691775, 711286, 730707, 747856, 759704, 763144, 756372, 739940, 716257, 687947, 656868, 624526, 592471, 561907, 533597, 508542, 487828, 471213, 456826, 443277, 431296, 422169, 415238, 408424, 400955, 394004, 388572, 384175, 380001, 376065, 372580, 369317, 366314, 364243, 363191, 361835, 358941, 355158, 352206, 350440, 348365, 344696, 339829, 334792, 329656, 323964, 318372, 314749, 314256, 315847, 317078, 316131, 312822, 308088, 303099, 298728, 295239, 292298, 289550, 287113, 285073, 282741, 279234, 274916, 271459, 270033, 270108, 270413, 270312, 269673, 268348, 266850, 266809, 269198, 272236, 272654, 269538, 265741, 264681, 266659, 269318, 271022, 272405, 274458, 276416, 276457, 274052]
56634B74052l469l108k966l879m697m019k227q07k24M10J580K559K611K056J537
56619B59409J101N53J33K45Q84J833K942L872M044L349K455J994J832J538J155
56604B87339J012J227J743K452K909K524J436O45P27J104J164J384K443L725L888
56589C15722K713J310M06n19k056l659m218l479k235j220l05R06K061K229J238
56574C08894K50L46R69N93j101k704k937k175j708k191l258m134m166l210j859
56559B81609r45o14l07L43J097J617J718J215K90j13O97J891K063J391J412K528
56543B95892L434L394L201L239K576J034K17J087K227K158J761K577M038M404
56529C31239L434K246J394R02J298K704L688K957J414P57Q93P66P85K053L805
$$ y = [274052, 270583, 267475, 264509, 260630, 255933, 251914, 249687, 248880, 248656, 249066, 250646, 253205, 255816, 257872, 259409, 260510, 261063, 261196, 261441, 262325, 264158, 267100, 270972, 275016, 278365, 280820, 282814, 284646, 286184, 287339, 288351, 289578, 291321, 293773, 296682, 299206, 300642, 301287, 302014, 303118, 304282, 305666, 308109, 311834, 315722, 318435, 319745, 320151, 319632, 317576, 313917, 309699, 306220, 303985, 302765, 302460, 303366, 305427, 307656, 308894, 309144, 309490, 310459, 311052, 309951, 307247, 304310, 302135, 300427, 298236, 294978, 290844, 286678, 283468, 281609, 280664, 280050, 279743, 280086, 281183, 282800, 284518, 285733, 286023, 285910, 286607, 288498, 290561, 291952, 293364, 295892, 299326, 302720, 305921, 309160, 311736, 312770, 312987, 314074, 316301, 318459, 320220, 322797, 326835, 331239, 334673, 336919, 338313, 339215, 340513, 343217, 346905, 349862, 351276, 352033, 352926, 353692, 354477, 356530, 360335]
56514C60335M205L462L660N430P164P774P976Q517R124R628J0367J1132J1410
56501D60184J1736J3020J4529J4470J2791J1388J1369J1873J1919J1378R989P378
56489F02024M453K803K405J844Q50L23k68k762o936r811r517p571o383o596p955
56474E56903j0318j2579j2750j0708q969r259j0164r582p741o217n650n921p049
56461D39996q369q322o528m746m441m862m853m809n321n552m730l802l798l893
56447C65970k962j766j640k017j324M05J639J567O46n71j715k189j658o27L16
56432C54074J103J429O09r63j576m82Q78J156J140K115L637M495M638M554L912
56417C80719K612K035L403N675O874O756O571O850P066O943O616O046N420N559
$$ y = [360335, 364540, 368002, 371662, 377092, 384256, 392030, 400006, 408523, 417647, 427275, 437642, 448774, 460184, 471920, 484940, 499469, 513939, 526730, 538118, 549487, 561360, 573279, 584657, 594646, 602024, 606477, 609280, 611685, 613529, 614379, 614702, 614434, 611672, 604736, 594925, 585408, 577837, 571454, 564858, 556903, 546585, 534006, 521256, 510548, 501579, 492320, 482156, 472574, 464833, 458616, 452966, 447045, 439996, 431627, 423305, 416777, 412031, 407590, 402728, 397875, 393066, 387745, 382193, 377463, 373661, 369863, 365970, 363008, 361242, 359602, 357585, 356261, 356666, 358305, 359872, 360518, 359947, 358232, 356043, 354385, 353758, 354074, 355177, 356606, 357215, 356252, 354676, 354194, 355072, 356228, 357368, 359483, 363120, 367615, 372253, 376807, 380719, 383331, 385366, 388769, 394444, 401318, 408074, 414645, 421495, 428561, 435504, 442120, 448166, 453586, 459145]
56403D59145O754Q011Q499Q742R273R286P983O130M980M629M713N366O196N733
56389E55440L561J617J577K246J356j220l911n817o628n551k652k09l76k160k946
56374E34327k251j745k201k881l507m613n891o236n434m306l406k998l711n622
56360D79525p198o906n424m658m944m870l575j821r79j876m136n929n440l288
56346D18481k095k832l536k773k047k890l940l224j370K3J213K837L529K091L91
56331D03858Q94K714L366L071L843N386N538M098K807K161J512J473K878M071
56317D47670K895O99P03K755L666K530J713K477L468L988M989O195N763L631K001
56302D95143J809J776J394J635K267J754M55O85K837M569M553M008L902L694L422
$$ y = [459145, 465899, 473910, 482409, 491151, 500424, 509710, 517693, 523823, 528803, 533432, 538145, 543511, 549707, 555440, 559001, 560618, 562195, 564441, 565797, 564577, 560666, 554849, 548221, 542670, 540018, 539809, 539433, 537273, 534327, 532076, 530331, 528130, 525249, 521742, 517129, 511238, 505002, 499568, 495262, 491856, 488858, 485147, 479525, 472327, 465421, 459997, 455339, 450395, 445525, 441950, 440129, 439150, 437274, 433138, 427209, 421769, 418481, 416386, 413554, 410018, 407245, 405198, 402308, 398368, 395144, 393774, 393797, 395010, 397847, 401376, 403467, 403858, 404752, 407466, 410832, 413903, 417746, 423132, 428670, 432768, 435575, 437736, 439248, 440721, 443599, 447670, 450565, 451264, 451967, 454722, 458388, 460918, 462631, 465108, 468576, 472564, 477553, 483748, 489511, 493142, 495143, 496952, 498728, 500122, 501757, 504024, 505778, 506233, 506918, 509755, 514324, 518877, 522885, 526787, 530481, 533903]
56287E33903L936M532L625K262L366O745Q484O539L449K142K475L371N007P070
56273E96906P812O821O173P245Q771R371R484R509Q739P493P694R784J1652J2057
56259G19511J2549J4416J6294J6529J5615J4587J3104J0841Q945Q510R104R781
56247H69786J0092R433P308M827L882M422M719M482N079O489P015O572P072Q866
56233I60044J0003R911J0535J2786J5162J7017J9706K3237K5384K5742K7065L0726
56221A187318L4354L6090L7778M1354M5278M7486M9235N3008N8608O4079O8934
56210A723522P4056P9720Q5836R2978J01584J11147J21238J32055J43280J54159
56200B819575J65198J77882J92088K05929K18551K30633K41783K50101K54872
$$ y = [533903, 537839, 542371, 545996, 548258, 551624, 558369, 566853, 573392, 576841, 578983, 581458, 584829, 589836, 596906, 604718, 611539, 617712, 624957, 633728, 643099, 652583, 662092, 670831, 678324, 686018, 695802, 707454, 719511, 732060, 746476, 762770, 779299, 794914, 809501, 822605, 833446, 842391, 850901, 860005, 869786, 879878, 889311, 896619, 901446, 905328, 909750, 914469, 918951, 924030, 930519, 937534, 944106, 951178, 960044, 970047, 979958, 990493, 1003279, 1018441, 1035458, 1055164, 1078401, 1103785, 1129527, 1156592, 1187318, 1221672, 1257762, 1295540, 1336894, 1382172, 1429658, 1478893, 1531901, 1590509, 1654588, 1723522, 1797578, 1877298, 1963134, 2056112, 2157696, 2268843, 2390081, 2522136, 2665416, 2819575, 2984773, 3162655, 3354743, 3560672, 3779223, 4009856, 4251639, 4501740, 4756612]
56191D756612K56848K55551K49257K38045K23496K04934J79573J47224J11283
56182F622823P4383L6723o35l4979o5380r2798j15900j31504j40419j47882j56292
56171E848140j62382j63734j63073j63461j63975j63203j62623j63227j62937
56162D379525j60524j58326j57981j57241j54144j50567j48453j46172j41816
56153C004301j36596j31851j26225j18816j11611j05768r9117r0358q2039p6356
56143A925564p1678o6173o0984n6820n1653m5046m0436l9494l8563l4406k9220
56132A391091k6089k3842k0717j8641j9222j9539j6713j2817j0636q419l907K69
56120A210818O41r58o02J390K424L068N338Q195R615J0657J3041J5341J5985J6948
$$ y = [4756612, 5013460, 5269011, 5518268, 5756313, 5979809, 6184743, 6364316, 6511540, 6622823, 6697206, 6733929, 6733294, 6698315, 6632935, 6540137, 6424237, 6292733, 6152314, 6004432, 5848140, 5685758, 5522024, 5358951, 5195490, 5031515, 4868312, 4705689, 4542462, 4379525, 4219001, 4060675, 3902694, 3745453, 3591309, 3440742, 3292289, 3146117, 3004301, 2867705, 2735854, 2609629, 2490813, 2379202, 2273434, 2174317, 2083959, 2001920, 1925564, 1853886, 1787713, 1726729, 1669909, 1618256, 1573210, 1532774, 1493280, 1454717, 1420311, 1391091, 1365002, 1341160, 1320443, 1301802, 1282580, 1263041, 1246328, 1233511, 1222875, 1214456, 1210549, 1210818, 1211459, 1210501, 1209899, 1211289, 1213713, 1216781, 1222119, 1230314, 1239929, 1250586, 1263627, 1278968, 1294953, 1311901]
56106A311901K0004K2494K1505J9043J8292J8088J6088J3943J4018J4297J2118
56095A501791R830J1060J4186J5260J4743J5716J8078K0081K3065K8882L5082
56084A707774L8411M0795M6263N4265O1558O8456P7560Q8436R9056J10405J24441
56073B517420J39442J52336J62937J71089J72836J65125J51599J38267J26195
56064C897246J13743J02276R3407Q3632O8185M7782K5987L173k0731m1156n3472
56053D320072o0103o6760p4635q2421r2297j06613j21600j31589j36722j39986
56043C307346j39886j33452j23191j13592j03744r0794p7489o8468o2213n4536
56033B339981m6949m3492m2356l8843l3772l0829k8676k3877j8405j5929j4131
$$ y = [1311901, 1331905, 1354399, 1375904, 1394947, 1413239, 1431327, 1447415, 1461358, 1475376, 1489673, 1501791, 1511621, 1522681, 1536867, 1552127, 1566870, 1582586, 1600664, 1620745, 1643810, 1672692, 1707774, 1746185, 1786980, 1833243, 1887508, 1949066, 2017522, 2095082, 2183518, 2282574, 2392979, 2517420, 2656862, 2809198, 2972135, 3143224, 3316060, 3481185, 3632784, 3771051, 3897246, 4010989, 4113265, 4206672, 4290304, 4358489, 4406271, 4432258, 4435431, 4414700, 4373544, 4320072, 4259969, 4193209, 4118574, 4036153, 3943856, 3837243, 3715643, 3584054, 3447332, 3307346, 3167460, 3034008, 2910817, 2797225, 2693481, 2602687, 2525198, 2456730, 2394517, 2339981, 2293032, 2249540, 2207184, 2168341, 2134569, 2103740, 2075064, 2051187, 2032782, 2016853, 2002722]
56022B002722r266m496m526n975k793K554L700K464N332J1144J3617J3409J6117
56009B044003K0447K0170J6180J5149J7614J8500J7889J9910K2731K1173J7731
55998B251497J9255K4352K6005K4949K7916L4083L6239L4567L6143M1279M3393
55987B599678M2256M4383N0172N3465N3842N6726O1488O2346O0823O4113P1413
55976C220705P5179P5519P9774Q8053R3241R5251J01195J11275J18505J22211
55966D180908J27847J34146J35110J33770J38824J48518J53437J53960J58715
55957E465235J67306J71858J74268J83716J98290K07841K13984K27565K47274
55948G257337K61367K69918K84031L03388L16968L26032L42973L66948L84800
$$ y = [2002722, 1993456, 1988960, 1984434, 1978459, 1975666, 1978220, 1981920, 1984384, 1989716, 2000860, 2014477, 2027886, 2044003, 2064450, 2084620, 2100800, 2115949, 2133563, 2152063, 2169952, 2189862, 2212593, 2233766, 2251497, 2270752, 2295104, 2321109, 2346058, 2373974, 2408057, 2444296, 2478863, 2515006, 2556285, 2599678, 2641934, 2686317, 2736489, 2789954, 2843796, 2900522, 2962010, 3024356, 3085179, 3149292, 3220705, 3295884, 3371403, 3451177, 3539230, 3632471, 3727722, 3828917, 3940192, 4058697, 4180908, 4308755, 4442901, 4578011, 4711781, 4850605, 4999123, 5152560, 5306520, 5465235, 5632541, 5804399, 5978667, 6162383, 6360673, 6568514, 6782498, 7010063, 7257337, 7518704, 7788622, 8072653, 8376041, 8693009, 9019041, 9362014, 9728962, 10113762]
55939A0113762L97086M18116M48776M75351M97170N28400N69756O06298O36517
55930A4691232O75259P24353P69684Q10895Q63112R25469R80326J028314J090333
55921B2558977J169610J247156J320357J408719J514974J619930J723307J848576
55913C4411606J999450K154929K315557K507917K734356K968843L213594L506768
55905E5813020L863575M268434M737035N320638O033936O849317P778426Q879921
55897A03544302J0168623J1608248J3217192J5080184J7233476J9661824K2430863
55890B12944712K5657490K9307040L3213163L7279119M1160383M3369733M1152909
55883D64084549L2206234J6981273r67843j7208328k9007205l5984910l9030848
$$ y = [10113762, 10510848, 10928964, 11377740, 11853091, 12350261, 12878661, 13448417, 14054715, 14691232, 15366491, 16090844, 16860528, 17671423, 18534535, 19460004, 20440330, 21468644, 22558977, 23728587, 24975743, 26296100, 27704819, 29219793, 30839723, 32563030, 34411606, 36411056, 38565985, 40881542, 43389459, 46123815, 49092658, 52306252, 55813020, 59676595, 63945029, 68682064, 74002702, 80036638, 86885955, 94664381, 103544302, 113712925, 125321173, 138538365, 153618549, 170852025, 190513849, 212944712, 238602202, 267909242, 301122405, 338401524, 379561907, 422931640, 464084549, 496290783, 513272056, 512304213, 495095885, 466088680, 430103770, 391072922]
55876C91072922l9204622l7450831l4620639l1342381k7946661k4613160k1496726
55869A74397902j8683768j6166872j3939436j2039633j0467805r147234q007860
55862H5945294p040100o237005n553539m957410m460504m067034l740108l445768
55854D6443826l183389k949511k717511k477293k254470k067775j903444j749217
55846B7141216j616403j509501j408916j302759j204605j123204j044946r61875
55838A6969007q87561q29696p74940p15715o65047o30363n98396n60174n26239
55829A0780876n03385m80096m48620m18868l97571l75426l47260l23533l09815
55820G176302k95565k75076k59082k53720k47948k34003k21189k17304k14581
$$ y = [391072922, 351868300, 314417469, 279796830, 248454449, 220507788, 195894628, 174397902, 155714134, 139547262, 125607826, 113568193, 103100388, 93953154, 85945294, 78905194, 72668189, 67114650, 62157240, 57696736, 53629702, 49889594, 46443826, 43260437, 40310926, 37593415, 35116122, 32861652, 30793877, 28890433, 27141216, 25524813, 24015312, 22606396, 21303637, 20099032, 18975828, 17930882, 16969007, 16081446, 15251750, 14476810, 13761095, 13096048, 12465685, 11867289, 11307115, 10780876, 10277491, 9797395, 9348775, 8929907, 8532336, 8156910, 7809650, 7486117, 7176302, 6880737, 6605661, 6346579, 6092859, 5844911, 5610908, 5389719, 5172415, 4957834]
55811D957834k05928j97745j94972j90251j78983j69024j64810j57910j43532
55802C354679j30354j23794j15614j00469q6765q0359p3164n9117m6454m2489
55792B496100m0541l3746k8430l1997l9753m4867m9652n6466n9158n4113m8556
55781B008821m7896m5850l6946k7722k5401k6094k4052k2373k4836k7157k5850
55770A674644k6090l1677l6778l6520l5919l9470m1863l8279l4125l4926l6013
55759A282984l1794k6347k5187k5124k1808j8990k0624k1912j7733j2397j1688
55748A049380j2499r662n920n822o333k728K275L787L327M150M078O40k763l317
55734A018593n009j0996j6365j6045j3401j3443j4098j2049j0485j2920j5541
$$ y = [4957834, 4751906, 4554161, 4359189, 4168938, 3989955, 3820931, 3656121, 3498211, 3354679, 3224325, 3100531, 2984917, 2884448, 2797683, 2717324, 2644160, 2585043, 2538589, 2496100, 2455559, 2421813, 2393383, 2361386, 2321633, 2276766, 2227114, 2170648, 2111490, 2057377, 2008821, 1960925, 1915075, 1878129, 1850407, 1825006, 1798912, 1774860, 1752487, 1727651, 1700494, 1674644, 1648554, 1616877, 1580099, 1543579, 1507660, 1468190, 1426327, 1388048, 1353923, 1318997, 1282984, 1251190, 1224843, 1199656, 1174532, 1152724, 1133734, 1113110, 1091198, 1073465, 1061068, 1049380, 1036881, 1027219, 1021299, 1015477, 1009144, 1006416, 1008691, 1012478, 1015805, 1019955, 1024033, 1024673, 1021910, 1018593, 1013584, 1002588, 986223, 970178, 956777, 943334, 929236, 917187, 906702, 893782, 878241]
55723H78241j3828j0863j1082j1717q460l914k560k923k485m353j1093j7623j8522
55710G58818j6926j8154k0153j8565j5804j6201j7011j3268p337n045o096o412
55698E97846o240p957r592q421p205r362j1810j0276p658r164j3085j4442j4068
55685D68566j5678j7408j4908j0112q475r619q831n834m368m784m377l393l663
55672C57116l238O94N350N729K637P27L88j562m737n684m336l566l422j799L15
55657C44612J26j648k215j940k892l837k270L85J031N82J971M306M614L612M161
55642C50598N628N300L832L932N058M691L414L695N118N623N697O642O731M045
55628D20004J062J355L722M420L216K279J449l98j593k77J566J431Q26J654J552
$$ y = [878241, 864413, 853550, 842468, 830751, 822291, 818377, 815817, 812894, 810409, 806056, 794963, 777340, 758818, 741892, 723738, 703585, 685020, 669216, 653015, 636004, 622736, 615399, 610354, 604258, 597846, 591606, 583649, 574057, 565636, 558431, 549069, 537259, 526983, 519325, 510161, 497076, 482634, 468566, 452888, 435480, 420572, 410460, 401985, 392366, 383535, 377701, 373333, 368549, 364172, 360779, 357116, 353878, 354572, 359922, 365651, 368288, 369015, 369403, 367841, 363104, 357420, 353084, 349518, 346096, 344297, 344612, 344738, 343090, 340875, 338935, 336043, 332206, 329936, 330321, 331352, 331934, 333905, 338211, 342825, 346437, 350598, 356226, 361526, 365358, 369290, 374348, 379039, 382453, 386148, 391266, 396889, 402586, 409228, 415959, 420004, 421066, 422421, 426143, 430563, 433779, 436058, 437507, 437109, 435516, 435239, 436805, 438236, 439062, 440716, 442268]
55613D42268j495l600n55M336N060K656K646N002M757J243j093o82l24q46j82
55598D59191J235P03j004l78K187K637L40r75J47R76j80k092m374q037j1935j3392
55582D25049j2660j2395j2899j2376j1357j2064j3806j3787j2082j1117j0912
55571B89594r615q035q500r938r271p114o731p787o677k885K81J244J290M36k500
55556B13792n718n701k868j010j183j247j134k956n720n726k824r10j484j956
55542A73355j023m77p76K8J834J914p5j194l89k9j228k059j599j440k099j978
55526A62765q59n13r94k50J910L308L355L538L751K302l8l63J488K726K697L701
55510A88524O114P303O399N865P146Q740R515J0132J0292Q394M648J084j856n035
$$ y = [442268, 440773, 437173, 436618, 440954, 446014, 448670, 451316, 456318, 461075, 462318, 461225, 460543, 460219, 459373, 459191, 460426, 461129, 460125, 459747, 461934, 464571, 464911, 463936, 464083, 465059, 464879, 462787, 458413, 450376, 438441, 425049, 412389, 399994, 387095, 374719, 363362, 351298, 337492, 323705, 311623, 300506, 289594, 279979, 271944, 263444, 253506, 244235, 237121, 230390, 222603, 215926, 213041, 213322, 214566, 215856, 216292, 213792, 208074, 202373, 199505, 198495, 197312, 196065, 194931, 191975, 186255, 180529, 177705, 176795, 175311, 173355, 172332, 171855, 171079, 171107, 172941, 174855, 174780, 173586, 173197, 173168, 171940, 169881, 168282, 166842, 164743, 162765, 161906, 161393, 160399, 160149, 162059, 165367, 168722, 172260, 176011, 178313, 178275, 177912, 179400, 182126, 184823, 188524, 194638, 201941, 208340, 214205, 221351, 230091, 239606, 249738, 260030, 268424, 273072, 274156, 272300, 267265]
55496B67265p227o414m357n045q243r505p223m687m254m445m046m170m806l909
55482A88934j554o33j932k690j438k1M89J580L518M207L371L612N606O477M836
55467B14362L243L615M093K736Q01M5j12q96k220l733n237n507l725k201l954
55452B01310p484q327o089m972o558p517o055n113o745q330p282n184m277l785
55438A13592k559j786k281k396j196m85j458k472k293k201k916k934j950k218
55424H4447m284n095k864k23J19o28m22j09j097k292k285j875j895j263L56Q91
55408F1481o63j976j184Ll69r95m2J303J079L1j25J89k02o90k79K47n8m13q1j11
55388E7145j222k052j461n49l66R1J655K964K837K433K899L065J705p6q82j498
$$ y = [267265, 260038, 253624, 249267, 244222, 235979, 226474, 219251, 214564, 210310, 205865, 201819, 197649, 192843, 188934, 187380, 186747, 184815, 182125, 180687, 180666, 181155, 182735, 186253, 190460, 193831, 197443, 203049, 209526, 214362, 217605, 221220, 225313, 228049, 228850, 228895, 228783, 227887, 225667, 221934, 216697, 211190, 207465, 205264, 201310, 193826, 185499, 179410, 174438, 167880, 160363, 154308, 149195, 142450, 134120, 126838, 121654, 117377, 113592, 111033, 109247, 106966, 104570, 103374, 102889, 101431, 98959, 96666, 94465, 91549, 88615, 86665, 84447, 80163, 75068, 72204, 71981, 72100, 71472, 71050, 70941, 69844, 67552, 65267, 63392, 61497, 60234, 60590, 61481, 60818, 58842, 57658, 57661, 57292, 56297, 56255, 57558, 58637, 58668, 58543, 58732, 58530, 57840, 57561, 57808, 57750, 57337, 57256, 57145, 55923, 53871, 52410, 51861, 51495, 51586, 53241, 56205, 59042, 61475, 64374, 67439, 69144, 69068, 68186, 66688]
55372F6688k999m296l833k123o14M83J500K021J915K035K517K092L25j334j854
55357F2523j896j847r75M72Q94K13M73K307L689L480L153L529K977O68j477j943
55341G6240j808j906j058R21J679J64j145k97R04L23q91r48q28k077l564l475
55325F2234k420j928j785j299j087j437j104J88N50o89j220L43J721P68j011j549
55309E0275j796l144m024k712r13j043k084j778p99j142k028j229Q95K156K269
55294C2903K580K992K214M31r11j307j158m71N14P28q8n66j7L76J06N70K093K555
55276D3544J038q1Q35J656L05j508j572j121j969k595j042R11O60m14M76K129
55260D1252J302j390k327q40K12m70j142p29l58p99j329j364r75j4J249J359k12
$$ y = [66688, 63689, 59393, 55560, 53437, 52823, 53306, 54806, 56827, 58742, 60777, 63294, 65386, 65711, 64377, 62523, 60627, 58780, 57805, 58277, 59171, 59384, 59857, 62164, 65853, 69333, 72486, 76015, 78992, 79660, 78183, 76240, 74432, 72526, 71468, 72389, 74068, 74232, 73087, 72790, 73694, 74017, 73126, 72178, 71350, 69273, 65709, 62234, 59814, 57886, 56101, 54802, 53715, 52278, 51174, 51362, 51912, 51223, 50003, 50346, 52067, 52835, 51824, 50275, 48479, 45335, 41311, 38599, 37686, 36643, 34559, 32781, 31982, 30840, 28812, 27583, 28478, 30634, 32903, 35483, 38475, 40689, 41120, 40209, 38902, 37744, 37273, 37787, 38515, 38427, 37861, 37844, 38220, 38326, 38896, 40989, 43544, 44582, 44501, 45336, 46992, 47297, 45789, 44217, 43096, 41127, 38532, 37490, 38401, 39061, 38647, 39123, 41252, 42554, 41164, 38837, 37997, 38209, 37739, 36597, 35868, 35510, 34711, 33382, 32018, 31043, 31029, 32278, 33637, 33425]
55243C3425j397k48J900K426J287K87p0l63j54J127K456K776K836L153K169p85
55227E0825k923j702Q71J221l57r18M9P15P36J044R03r28k926k531l46Q36M22
55210D4991n8k90r08q25J311L830L942K106R62P86j03j422j387m96o94j390l89
55193D9966J658J910R9j386j840k606l371k412l69L63Q9J236L368L330P38j233
55177D9540j217j231j961j121J852L735K260m73j361k97Q35P77o71k660l107p45
55161D4155K417L261J982J323J712J002r25j484j04N84o23j651j313j389k798
55146D6149l434j850J46O83O35J244J699J173P21J080R75m07j444m58J783L588
55130E2283M476M421K953N45r62p51j82m88j080j239j464j967j705j62J471J925
$$ y = [33425, 32028, 31780, 33680, 36106, 37393, 37680, 37610, 37247, 37093, 38220, 40676, 43452, 46288, 49441, 51610, 50825, 47902, 46200, 47071, 48292, 47935, 47017, 47066, 47781, 48517, 49561, 50464, 49536, 46610, 44079, 43733, 44569, 44991, 44933, 44643, 43735, 42910, 44221, 48051, 51993, 54099, 55061, 55847, 55744, 54322, 52935, 52439, 51745, 50355, 49966, 51624, 53534, 53633, 52247, 50407, 47801, 44430, 42018, 41649, 42012, 42101, 43337, 46705, 50035, 50773, 49540, 48323, 47092, 45131, 44010, 45862, 49597, 51857, 51384, 50023, 49726, 50561, 51338, 50667, 48007, 44900, 44155, 46572, 49833, 51815, 53138, 54850, 55852, 54927, 53443, 53339, 53923, 53300, 51649, 50336, 48947, 46149, 42715, 40865, 41011, 41694, 42329, 43573, 45272, 46445, 47166, 48246, 49221, 48814, 47370, 46912, 48695, 52283, 56759, 61180, 64133, 64678, 63716, 62965, 62783, 62295, 61215, 59976, 58512, 56545, 54840, 54678, 56149, 58074]
55114E8074J192l24k334l833l650k362j704j852j450n27o61j891k250j140k39
55099C5049j83O23K668L814K664Q09J04J35%J11O14L69p56r06O71J840P86j008
55081D7404j095L95J589J723J245M10m85n06O54J837J986J504J161R68J005J785
55065F1580K878K691P13j477k303j887r56K05J034P72J06P72K683L549K294P10
55049G3364N12R40P79O07J308K114J952J280J053J040O03m7n20r87j277o00R58
55032H3079K059K026J568J015k60j851j909RJ746J519L18l4N13R84J114J047P11
55015I3654N65J449K779K737J118m2K78N10n10j347n44P66Q07n2n06o49j221j831
54997I7961j821j565j432p82M81R31k14j493j474j054j657k653k545j481n40L30
$$ y = [58074, 59266, 58942, 56608, 52775, 49125, 46763, 45059, 43207, 41757, 41230, 40569, 38678, 36428, 35288, 35049, 34866, 35489, 38157, 41971, 44635, 45444, 45548, 45683, 45683, 45794, 46408, 46777, 46021, 45115, 45786, 47626, 48412, 47404, 46309, 46704, 48293, 50016, 51261, 51671, 51186, 50680, 51334, 53171, 55157, 56661, 57822, 58790, 59795, 61580, 64458, 67149, 67862, 66385, 64082, 62195, 61239, 61444, 62478, 63250, 63356, 64128, 66811, 70360, 72654, 73364, 73876, 74816, 75595, 76202, 77510, 79624, 81576, 82856, 83909, 84949, 85552, 85505, 84985, 83998, 82721, 82121, 83079, 85138, 87164, 88732, 89747, 89487, 87636, 85727, 85736, 87482, 89001, 89319, 89285, 89798, 90782, 91896, 92943, 93654, 94219, 95668, 98447, 101184, 102302, 102260, 102538, 103048, 102538, 101191, 100647, 101413, 102220, 102168, 101662, 101013, 99792, 97961, 96140, 94575, 93143, 92361, 92842, 93773, 93559, 92066, 90592, 89538, 87881, 85228, 82683, 81202, 80662, 80992]
54981H0992J648K687K388J357J052J497J438M38n31l13J355L572M604L367R35
54966A06486n15n59p58j833k606k376j989j616RK829M493L849K941L509L908K018
54950A17790q29j764p00N5m16j040j224j537k156k574k538j977o19J007J333j18
54934A02693j564j434o84r40j705j447k98N49J117K238L460L424J847l42k218
54919A04696k892j538J121K622J818Q24K007M390N294M252K848J668K48o70L57
54904A27045K810M618N164N589O149N752M462M116N711P991R382R870J0236J0750
54890B19645J1378J2333J3668J4894J5405J5021J4024J2766J1119Q339M030q19
54878C51803m693p504j0366j3216j4439j3577j2532j2949j4030j4263j3632j2624
$$ y = [80992, 82640, 85327, 87715, 89072, 90124, 91621, 93059, 93497, 92966, 92653, 94008, 97580, 102184, 105551, 106486, 105971, 105412, 104654, 102821, 100215, 97839, 95850, 94234, 94243, 97072, 101565, 105414, 108355, 111864, 115772, 117790, 116961, 115197, 114497, 114552, 114136, 113096, 111872, 110335, 108179, 105605, 103067, 101090, 100471, 101478, 102811, 102693, 101129, 99695, 99011, 98071, 96366, 94919, 94621, 95170, 96287, 98525, 101985, 105409, 107256, 106914, 104696, 101804, 100266, 101387, 104009, 105827, 106651, 108658, 113048, 118342, 122594, 125442, 127110, 127358, 126688, 127045, 129855, 134473, 139637, 145226, 151375, 157127, 161589, 165705, 171416, 179407, 188789, 198659, 208895, 219645, 231023, 243356, 257024, 271918, 287323, 302344, 316368, 329134, 340253, 348592, 352622, 351803, 347110, 339606, 329240, 316024, 301585, 288008, 275476, 262527, 248497, 234234, 220602, 207978]
54866B07978j0733p792n300m491m287l122j557j027j152n22P55J580K132L331
54852A75793M579M500L669M297P049J0231J2278J3372J4225J4843J4909J4363
54840B94108J3337J2087J0746Q598M366j958q373j2911j5479j6796j6751j5218
54828B55756j3364j2510j2429j2166j1644j1148j0276q797p549p036o302m574
54816A37961k747j640l24J965L700L135J142l47j500l549n671n788l967k322j826
54801A18222j651j422j660k176k224k114k469k307j59L113M932M372K686Q04j387
54786A16560l420m279m158l964l237r65J691K153J78j682j791j149r00o38l9J16
54770I4476m67q96q31j072j550p07K013M673N149L688K091J391J263J016L42m51
$$ y = [207978, 197245, 189453, 184153, 179662, 175375, 172253, 170696, 169669, 168517, 167995, 168750, 170330, 172462, 175793, 180372, 184872, 188541, 192838, 199887, 210118, 222396, 235768, 249993, 264836, 279745, 294108, 307445, 319532, 330278, 338876, 343242, 341284, 332911, 320000, 304521, 287725, 270974, 255756, 242392, 229882, 217453, 205287, 193643, 182495, 172219, 163422, 155873, 148837, 142535, 137961, 135214, 133574, 133250, 135215, 138915, 142050, 143192, 142845, 141345, 137796, 132125, 126337, 122370, 120048, 118222, 116571, 115149, 113489, 111313, 109089, 106975, 104506, 102199, 102040, 105153, 110085, 114457, 117143, 117947, 116560, 113140, 108861, 104703, 100739, 97502, 96537, 98228, 100381, 100559, 98877, 97086, 95937, 95037, 94399, 94360, 94476, 94009, 93113, 92282, 91210, 89660, 88953, 90966, 95639, 100788, 104476, 106567, 107958, 109221, 110237, 110579, 110128]
54754A10128n83L12J498J989J872K035K879M261O223Q510R839R080P028N611N663
54739A76345O656Q204J0283J2332J3697J4753J6134J7270J7242J6596J6394J5938
54727C41844J3500R158M924J908p41l898p263j0245j2536j3597j3147j2025j1203
54714B86679j0229q234o002n164n632n880n468n126m602k783j12J454J252O36
54700B30789P14J363K715N317Q377R951R548Q872R508J1427J3816J5781J6221
54687C44399J4953J3778J4410J5523J4208J0229O177L242j65m954r422j1901j3001
54674C97476j4014j5188j6538j8291j9597j8797j5972j3290j2005j1063r539q310
54662B24872q257q770r037r081q607o825m227k625k455k079o29O40P20M21M09
$$ y = [110128, 109545, 109857, 111355, 113344, 115216, 117251, 120130, 124391, 130614, 139124, 148963, 158043, 165071, 170682, 176345, 183001, 191205, 201488, 213820, 227517, 242270, 258404, 275674, 292916, 309512, 325906, 341844, 355344, 364502, 369426, 371334, 370593, 366695, 359432, 349187, 336651, 323054, 309907, 297882, 286679, 276450, 268216, 262214, 257050, 251418, 245538, 240070, 234944, 230342, 227559, 227447, 228901, 230153, 230789, 231503, 232866, 235581, 240898, 249275, 259226, 268774, 277646, 287154, 298581, 312397, 328178, 344399, 359352, 373130, 387540, 403063, 417271, 427500, 433677, 436919, 436754, 431800, 422378, 410477, 397476, 383462, 368274, 351736, 333445, 313848, 295051, 279079, 265789, 253784, 242721, 233182, 224872, 216615, 207845, 198808, 189727, 181120, 174295, 170068, 167443, 164988, 162909, 162280, 162920, 163640, 164061, 164470]
54647A64470j12j392j976r71M15R02Q33N63n29k020j614J554M730M753K025n98
54631A71033j467r22K71J254J060r7m62P41J659L85j992k828j546K9M78J88K16
54614A68000J070K540L834M129L544L119L439L992M092L588K592J619J884L858
54600B11300N691N174L302L233N259N930L368K80k59Q91J366J399K497L868L471
54585B56770J635O97J560L019M016M554M831N358P139J0018J1744J0688Q510P990
54571C38529R044R265P783N977M513K193j827o623j0689j3179j3808j2942j1878
54558C06358j1740j2059j1577j0192q835p671n898l378j079K18O50O12K85k05
54544B35489q33j700k430k185r97l42j288k838l331k819k660l280l812l784l750
$$ y = [164470, 164358, 162966, 160990, 160019, 160434, 161336, 162169, 162732, 162203, 160183, 158569, 160123, 164853, 169606, 171631, 171033, 169566, 168644, 168915, 170169, 171229, 171132, 170670, 171411, 173070, 173455, 171463, 168635, 167089, 167118, 167596, 167784, 168000, 169070, 171610, 175444, 179573, 183117, 186236, 189675, 193667, 197759, 201347, 203939, 205558, 207442, 211300, 216991, 222165, 225467, 228700, 233959, 239889, 243257, 243537, 243278, 244169, 245535, 246934, 249431, 253299, 256770, 258405, 259102, 260662, 263681, 267697, 272251, 277082, 282440, 289579, 299597, 311341, 322029, 330539, 338529, 347573, 356838, 364621, 370598, 375111, 377304, 375477, 368854, 358165, 344986, 331178, 318236, 306358, 294618, 282559, 270982, 260790, 251955, 244284, 238386, 235008, 233929, 234147, 234797, 235409, 235694, 235489, 234656, 232956, 230526, 228341, 227344, 227002, 225714, 222876, 219545, 216726, 214066, 210786, 206974, 203190, 199440]
54529A99440m150m595m438l439k075j574k948n428o703n662l884l338l680l240
54515A44286j864r98j353k141k534k572k557k590k712k743k308j627j657k599
54501A14031l164k290p81N1M21J264K167J821K70r53q72K2Q69J327J400J284J213
54484A18080R56J26n05O69L419M817K810o41k026q45O26J357K557M748O587P153
54468A49888P164P203O759N791N415O071O429N173K743N09q93j708k393l386m862
54453A89903o325p047o968o479n537m081l097l807n685o737o112m908l982k646
54439A16492l98J538J738O45n1M72J717K867L283K465O88o22j80J469K496J962
54423A36581O97j80o15j029j163m45P49J233O55J46P45J805J933J040M33R01J796
$$ y = [199440, 195290, 190695, 186257, 182818, 180743, 179169, 176221, 170793, 164090, 158428, 154544, 151206, 147526, 144286, 142422, 141424, 140071, 137930, 135396, 132824, 130267, 127677, 124965, 122222, 119914, 118287, 116630, 114031, 110867, 108577, 107796, 107847, 108268, 109532, 111699, 113520, 113790, 112837, 111965, 111987, 112856, 114183, 115583, 116867, 118080, 119036, 119162, 118657, 119326, 122745, 127562, 130372, 129731, 127705, 126860, 127486, 128843, 131400, 136148, 142735, 149888, 157052, 164255, 171014, 176805, 182220, 188291, 194720, 199893, 202636, 203145, 202252, 200544, 198151, 194765, 189903, 183578, 176531, 169563, 163084, 157547, 153466, 150369, 146562, 140877, 134140, 128028, 123120, 119138, 116492, 116094, 117632, 119370, 120015, 119964, 120436, 122153, 125020, 128303, 130768, 131456, 130834, 130654, 132123, 134619, 136581, 137278, 137098, 136483, 135454, 134291, 133846, 134595, 135828, 136483, 136629, 137374, 139179, 141112, 142152, 142585, 143486, 145282]
54406A45282K327K615K874K480P89j557l013k737j362k47k62j090j583j041j22
54391A43353o9j120k373l062l080k283m98J438J997R36j92j81K29k48j482k335
54375A31030k321j811j211p29m49K3J321L163M175L466J666j09j439k215k214
54360A32346j703j417j237j77J575K192Q34o78k22J807L548M284M440M089L212
54345A52893K618K876L036K135J183J948M209O007O292N726N272N349O073O895
54331B12512O538M548K392J634J799J463N13l33j265k728l853l606k891l233m030
54316B09460l536k073j652k474k598j407p18j726l163l525l130k894k809k658
54302A75097k782l255l447l163k938k750j763J6J211J016L96O39J702K721L246
$$ y = [145282, 147609, 150224, 153098, 155578, 156367, 154810, 151797, 149060, 147698, 147451, 147189, 146099, 144516, 143475, 143353, 143284, 142164, 139791, 136729, 133649, 131366, 130868, 132306, 134303, 135239, 135047, 134866, 135095, 134847, 133365, 131030, 128709, 126898, 125687, 124958, 124509, 124532, 125853, 129016, 133191, 136657, 138323, 138214, 136775, 134560, 132346, 130643, 129226, 127989, 127812, 129387, 131579, 132413, 131735, 131513, 133320, 136868, 141152, 145592, 149681, 152893, 155511, 158387, 161423, 163558, 164741, 166689, 170898, 176905, 183197, 188923, 194195, 199544, 205617, 212512, 219050, 223598, 225990, 227624, 229423, 230886, 231399, 231066, 229801, 227073, 223220, 219614, 216723, 213490, 209460, 205924, 203851, 202199, 199725, 197127, 195720, 195002, 193276, 190113, 186588, 183458, 180564, 177755, 175097, 172315, 169060, 165613, 162450, 159512, 156762, 154999, 155015, 156226, 157242, 157638, 158277, 159979, 162700, 165946]
54287A65946L309K947K186J131Jm70Q06L775O442O948N924N301N232M302K500
54272B16280J635K285K727J666L5r32j642k919m386n328n872o246n932m673l357
54257A83341k928l220l697m364n186n561n297n180n727o180n577m105k678j786
54243A21855j435j494j499q96pK8j091k105j788n12M77N98J37m24n81M9J123J642
54225A14077J128J93m31p24q82p80m69m55q92j184r28n63n17l98L14J350K016
54208A10855K020J491O31k08n67l53R0N72J110J274L72j234j877l01K737N083
54192A21695N073K650p37l034l014j404j63l40j137j312q56n92o75k58J122K518
54176A19536K353L86j631j777k90P95L37o93j146j466k407l217k676j186j72J74
$$ y = [165946, 169255, 172202, 174388, 175519, 175520, 175050, 175856, 179631, 186073, 193021, 198945, 204246, 209478, 213780, 216280, 217915, 220200, 222927, 224593, 224628, 223696, 222054, 219135, 214749, 209421, 203549, 197303, 191371, 186698, 183341, 180413, 177193, 173496, 169132, 163946, 158385, 153088, 147908, 142181, 136001, 130424, 126319, 123641, 121855, 120420, 118926, 117427, 116531, 116524, 116552, 115461, 113356, 111568, 111056, 111533, 112131, 112268, 111844, 111263, 111312, 112435, 114077, 115205, 115398, 114967, 114243, 113361, 112581, 112112, 111657, 110765, 109581, 108653, 108090, 107573, 107175, 107489, 108839, 110855, 112875, 114366, 114997, 114789, 114222, 113869, 113959, 114531, 115641, 116915, 117287, 116053, 114176, 113875, 116612, 121695, 126768, 129418, 128681, 125647, 122633, 121229, 121066, 120726, 119589, 118277, 117421, 116829, 116154, 115896, 117018, 119536, 121889, 122275, 120644, 118867, 118577, 119372, 119709, 119016, 117870, 116404, 113997, 110780, 108104, 106918, 106746, 106920]
54160A06920P77J602J544M76m00m96n89j224j805j721j128k31R61J957K089J832
54144A10564K349L477L596K007o3j346k035k653k863k311j488q07O7J147J357
54129A10998N5j512j399O12K745L175J728k65j339j103k29N37R76R17J5j400k064
54112A12447j399n58p86j431j063J85R93J102J301J489Q09m32r12m37j05k58j86
54095A10759J18j1j12R63K590K760J251k8l47j143k906l863l008j825j435n47
54079A03216J897M188M102K057J09p63p03K29J456J412o09l106m338m525m597
54064A00025m144k296L34K200K508J364o06j873q13J781K794Q45j531j618l18
54049I8652m5n64O0J646K189J405J059J826K559K837L603M702M122R20k815m158
$$ y = [106920, 107697, 109299, 110843, 111319, 110919, 110423, 109834, 108610, 106805, 105084, 103956, 103725, 104686, 106643, 108732, 110564, 112913, 116390, 119986, 121993, 121930, 120584, 118549, 115896, 113033, 110722, 109234, 108427, 108494, 109641, 110998, 111053, 109541, 108142, 108754, 111499, 114674, 116402, 116137, 114798, 113695, 113466, 114003, 114979, 115896, 115911, 114511, 112447, 111048, 110490, 109704, 108273, 107210, 107395, 108388, 109490, 110791, 112280, 113089, 112657, 111745, 111308, 111203, 110945, 110759, 110877, 110866, 110754, 111717, 114307, 117067, 118318, 118290, 117943, 116800, 113894, 110031, 107023, 105198, 103763, 103216, 105113, 109301, 113403, 115460, 115569, 114806, 114103, 114332, 115788, 117200, 116591, 113485, 109147, 104622, 100025, 95881, 93585, 93919, 96119, 98627, 99991, 99385, 97512, 96699, 98480, 101274, 102119, 100588, 98970, 98652, 98607, 98043, 98103, 99749, 101938, 103343, 104402, 106228, 108787, 111624, 115227, 119929, 124051, 124971, 122156, 117998]
54033A17998k630l84L32o97j866j662j98J268K011K236J975Q94m82q57r5L33m13
54016A17763j287j290j013j134j071m13r8n66n29P32J707J260R64K305L449K004
54000A22783n16o31J498K376R60R1J364K529J578K28R87L124M092L463L044L866
53984A50836N019N299M513L200K086J896K861M337N341N516N297N212N377N700
53970B12490O398P835R638J0462R386P383O319O448O313N437N365P021Q769Q747
53956C18011P739P618P987O804L971J817J718K370K077R40p4q07j577k209k337
53941C54048k161k136k268k238k070k208k991m139m934n045n035n565o311o418
53927C00529n906n581n336m056j715j50p39k652m364n584o428o141m296k188j274
$$ y = [117998, 115368, 114984, 115316, 114619, 112753, 111091, 110893, 112161, 114172, 116408, 118383, 119277, 118795, 117938, 117843, 118176, 117763, 116476, 115186, 114173, 113039, 111968, 111555, 111457, 110891, 110362, 111094, 112801, 114061, 115025, 117330, 120779, 122783, 122267, 121636, 123134, 125510, 126470, 126561, 127925, 130454, 132032, 132260, 133247, 136371, 140463, 143926, 146970, 150836, 155855, 161154, 165667, 168867, 170953, 172849, 175710, 180047, 185388, 190904, 196201, 201413, 206790, 212490, 218888, 226723, 236361, 246823, 256209, 263592, 269911, 276359, 282672, 288109, 293474, 300495, 309264, 318011, 325750, 333368, 341355, 348159, 352130, 353947, 355665, 358035, 360112, 361052, 360978, 360171, 358594, 356385, 354048, 351887, 349751, 347483, 345245, 343175, 340967, 337976, 333837, 328903, 323858, 318823, 313258, 306947, 300529, 294623, 289042, 283706, 279650, 277935, 277785, 277046, 274394, 270030, 264446, 258018, 251877, 247581, 245393, 244119]
53912B44119j169p06j17l78j268j860k147k296j200J954N303N988M017K150J886
53897B54276J898Q04p14j310o70Q32K756M286M598L950L393L344L563M340O051
53882B91397P660P466N600M052L840L981L779M277O349Q743R406Q023O241N663
53868C76477O296O816O127M520L099K051M51j820l218k577q19P07K284M534O317
53853D11245O152M978M960O062O354N556N499O856Q142Q533R085J0154J0058P674
53839E11308M510K717K436K312J451j18j958l379l919m078m708n570n821n792
53825D89391o585p857p947o741o247p627r545j0431j0571j0816j0897j0306r474
53812C74347q825p863o388n486o164p776q870q854q103p152o421o052n651m998
$$ y = [244119, 242950, 242244, 242127, 241749, 240481, 238621, 236474, 234178, 232978, 234932, 240235, 246223, 250240, 252390, 254276, 256174, 256978, 256264, 254954, 254284, 255116, 257872, 262158, 266756, 270706, 274099, 277443, 281006, 285346, 291397, 299057, 306523, 312123, 316175, 320015, 323996, 327775, 332052, 338401, 347144, 356550, 364573, 370814, 376477, 382773, 389589, 395716, 400236, 403335, 405386, 405837, 404017, 400799, 398222, 397403, 398110, 400394, 404928, 411245, 417397, 422375, 427335, 433397, 439751, 445307, 450806, 457662, 465804, 474337, 483422, 493576, 503634, 511308, 515818, 518535, 520971, 523283, 524734, 524616, 522658, 519279, 515360, 511282, 506574, 501004, 495183, 489391, 482806, 474949, 467002, 460261, 454014, 446387, 436842, 426411, 415840, 405024, 394127, 383821, 374347, 365522, 357659, 351271, 345785, 339621, 331845, 322975, 314121, 306018, 298866, 292445, 286393, 280742, 275744]
53798B75744m908o282q205q599p017n206m537m568m490m245l652k346j226j957
53784B08506m185n292m024k309k163k763k219n12J048J864J936R93o71j715j523
53769A86971j271j886k423j894j128j059p06J051L055L482K836L002L956L789
53755A97775J719r20k632k908j715N31K535L205L004L010L168K934K901L972N336
53740B21915N308M039L407M173N171N600O165P365Q347Q204P144N860M927N183
53726C02808P149R498R657O915L682K518L052L129K073J182J326J740J387K61
53712C56377j138k631m012m678m406m013m436n421n933n633m993m082k482o46
53698C01873k6j130k637l218l214l477l780l596l471l973m232l256j862j324r44
$$ y = [275744, 270836, 264554, 256349, 247750, 240733, 235527, 230990, 226422, 221932, 217687, 214035, 211689, 210463, 208506, 204321, 199029, 195005, 192696, 190533, 187770, 185551, 185039, 186087, 187951, 189887, 190880, 190209, 188494, 186971, 185700, 183814, 181391, 179497, 178369, 177310, 176604, 177655, 180710, 184192, 187028, 190030, 193986, 197775, 199494, 198574, 195942, 193034, 191319, 191850, 194385, 197590, 200594, 203604, 206772, 209706, 212607, 216579, 221915, 227223, 231262, 234669, 238842, 244013, 249613, 255778, 263143, 271490, 279694, 286838, 292698, 297625, 302808, 309957, 319455, 329112, 336027, 339709, 342227, 345279, 348408, 350481, 351663, 352989, 354729, 356116, 356377, 355239, 352608, 348596, 343918, 339512, 335499, 331063, 325642, 319709, 314076, 309083, 305001, 302519, 301873, 301847, 300717, 298080, 294862, 291648, 288171, 284391, 280795, 277324, 273351, 269119, 265863, 264001, 262677, 261733]
53683B61733O29K279J617p60j523L12J821R18n31k55O32J0j382j316J09R33P49
53666B65975J010K347L786M456M230L009J011o05r89j001j852l005l137k479k274
53651B70482k397j727n60l97j240j350j19Q94M92l89m63m6j23n74m63N54J946
53634B64520K986L156K427J603J856L360M831M891L617K363K252L144M017M148
53620C09171L829L844M409N011N296N460N583N301M514L736L180K258O94n88o01
53605C61097K98J060J408J574J110o68l162m634m184k669j466j120j367j930k828
53590C42519m177n711o491n551l250j369j225k079k163r12O38J435J391Q66R4
53575C14015o14p22M9J278K024J550N1j303j449o07J67M98R69J840K598L181M290
$$ y = [261733, 262362, 264641, 266258, 265498, 263975, 264287, 266108, 267026, 266495, 266240, 266872, 266882, 265500, 264184, 264293, 265226, 265975, 266985, 269332, 273118, 277574, 281804, 284813, 285824, 285219, 284230, 283229, 281377, 278372, 275235, 272756, 270482, 268085, 266358, 265798, 265401, 264161, 262811, 262692, 263586, 264078, 263689, 263226, 263180, 263057, 262483, 262020, 262574, 264520, 267506, 270662, 273089, 274692, 276548, 279908, 284739, 289630, 293247, 295610, 297862, 301006, 305023, 309171, 313000, 316844, 321253, 326264, 331560, 337020, 342603, 347904, 352418, 356154, 359334, 361592, 362286, 361698, 361097, 361395, 362455, 363863, 365437, 366547, 365879, 362717, 358083, 353899, 351230, 349764, 348644, 347277, 345347, 342519, 338342, 332631, 326140, 320589, 317339, 315970, 314745, 312666, 310503, 309591, 310229, 311664, 313055, 313921, 314015, 313401, 312679, 312728, 314006, 316030, 317580, 317631, 316328, 314879, 314272, 314439, 314937, 315906, 317746, 320344, 323525, 327815]
53558C27815N801O120M365K130J697L105M401M354L578L126L321L971M740N135
53544C83659M871M355M274M812N663O514P097P170O886O625O232N181L879L577
53530D60795M420M884M106L334L776M462L921K805K749L531L562K646K076K283
53516E09350K547K898M015N135M441K052M51J146K690L048K255J637J773K251
53502E45689K570K394J748J507K588M175M127J909j57K82K690M756N493N720O110
53487E91601O346O137N706N118M244L759N019Q192J1294J2049J0542R046R200
53474F88253J0380J1181J1429J1702J1729J0801R471R155R878J0128R497R565
53462H13169J1206J2790J2605J1588J1764J3168J4401J5320J6803J8349J8521
$$ y = [327815, 333616, 339736, 344101, 346231, 347928, 351033, 355434, 359788, 363366, 366492, 369813, 373784, 378524, 383659, 388530, 392885, 397159, 401971, 407634, 414148, 421245, 428415, 435301, 441926, 448158, 453339, 457218, 460795, 465215, 470099, 474205, 477539, 481315, 485777, 489698, 492503, 495252, 498783, 502345, 504991, 507067, 509350, 511897, 514795, 518810, 523945, 528386, 530438, 530889, 532035, 534725, 537773, 540028, 541665, 543438, 545689, 548259, 550653, 552401, 553908, 556496, 560671, 564798, 566707, 566550, 566832, 569522, 574278, 579771, 585491, 591601, 597947, 604084, 609790, 614908, 619152, 622911, 627930, 636122, 647416, 659465, 670007, 679053, 688253, 698633, 709814, 721243, 732945, 744674, 755475, 764946, 774101, 783979, 794107, 803604, 813169, 824375, 837165, 849770, 861358, 873122, 886290, 900691, 916011, 932814, 951163, 969684]
53451I69684J7766J8276K0492K2201K2015K1600K3023K5666K7466K8052K8819
53440A225060L0546L2594L4205L5274L5855L5951L6035L6844L8420L9936M0679
53429A621399M0767M0671M0510M0155L9832L9981M0549M0846M0413L9638L9175
53418B063936L9040L8899L8861L9128L9169L8363L7474L8038L9801M0251L7686
53407B490646L3510L0374K8956K7931K6363K4556K2799K0642J7531J3420Q780
53396B745508M565J687j13k234n463r007j1999j4904j8233k1000k1990k1920k2612
53383B602285k4542k6769k8818l0962l2924l3956l4191l4367l4402l3678l2577
53372B255099l2174l2554l2967l3349l3983l3818l1218k6641k2674k0772j9682
$$ y = [969684, 987450, 1005726, 1026218, 1048419, 1070434, 1092034, 1115057, 1140723, 1168189, 1196241, 1225060, 1255606, 1288200, 1322405, 1357679, 1393534, 1429485, 1465520, 1502364, 1540784, 1580720, 1621399, 1662166, 1702837, 1743347, 1783502, 1823334, 1863315, 1903864, 1944710, 1985123, 2024761, 2063936, 2102976, 2141875, 2180736, 2219864, 2259033, 2297396, 2334870, 2372908, 2412709, 2452960, 2490646, 2524156, 2554530, 2583486, 2611417, 2637780, 2662336, 2685135, 2705777, 2723308, 2736728, 2745508, 2750073, 2751760, 2751647, 2749413, 2743950, 2734943, 2722944, 2708040, 2689807, 2668807, 2646817, 2624897, 2602285, 2577743, 2550974, 2522156, 2491194, 2458270, 2424314, 2390123, 2355756, 2321354, 2287676, 2255099, 2222925, 2190371, 2157404, 2124055, 2090072, 2056254, 2025036, 1998395, 1975721, 1954949, 1935267]
53361A935267j7620j4570j1747j0049r583r660q855o167k380P59K711M272N853
53348A858231P207Q871J1855J5554J8014J8881K0167K3196K6618K8631K9617L1195
53336B098037L3929L7280M0811M4171M6678M8140M9588N2175N5796N9446O2541
53325B628592O5201O7596O9576P0777P0957P0479P0308P0961P1808P2131P2299
53314C400685P2769P2555P0450O7419O5704O5371O3949N9949N4707M9912M5321
53303D088791M0056L4424K9050K3612J7675J1677N995J54o059j1928j7128k2527
53291D193792k8576l4267l8797m2947m7604n2151n5673n8583o1513o3634o3795
53280C646252o2567o1539o1162o0793o0346o0348o0515n9804n7891n5545n3625
$$ y = [1935267, 1917647, 1903077, 1891330, 1881281, 1871698, 1862038, 1853183, 1847016, 1844636, 1845395, 1848106, 1852378, 1858231, 1865438, 1874309, 1886164, 1901718, 1919732, 1938613, 1958780, 1981976, 2008594, 2037225, 2066842, 2098037, 2131966, 2169246, 2210057, 2254228, 2300906, 2349046, 2398634, 2450809, 2506605, 2566051, 2628592, 2693793, 2761389, 2830965, 2901742, 2972699, 3043178, 3113486, 3184447, 3256255, 3328386, 3400685, 3473454, 3546009, 3616459, 3683878, 3749582, 3814953, 3878902, 3938851, 3993558, 4043470, 4088791, 4128847, 4163271, 4192321, 4215933, 4233608, 4245285, 4251280, 4251434, 4245375, 4233447, 4216319, 4193792, 4165216, 4130949, 4092152, 4049205, 4001601, 3949450, 3893777, 3835194, 3773681, 3710047, 3646252, 3583685, 3522146, 3460984, 3400191, 3339845, 3279497, 3218982, 3159178, 3101287, 3045742, 2992117]
53269B992117n2561n2497n3041n3159n2193n0667m9200m7252m4075m0486l8268
53258B458718l7797l7559l6143l3626l0716k7687k4824k2987k2815k3609k3870
53247B137085k3034k1979k1562k1149j9377j6097j2639j0055q058o157m690l789
53235A968499k359N32L961O309P711R756J3042J6665J9960K3047K5585K6887K7548
53222B147143K9174L2095L4956L6967L8682M0066L9803L7590L5295L4560L4586
53211B540917L3514L0777K7055K3146J9903J8175J7576J6325J3238R027M972J408
53199B756033j751m310o468q953j1692j3655j4890j7054k0879k4687k6914k8509
53187B576271l1161l4304l5893l5428l4370l3969l4190l4452l4256l3210l1506
$$ y = [2992117, 2939556, 2887059, 2834018, 2780859, 2728666, 2677999, 2628799, 2581547, 2537472, 2496986, 2458718, 2420921, 2383362, 2347219, 2313593, 2282877, 2255190, 2230366, 2207379, 2184564, 2160955, 2137085, 2114051, 2092072, 2070510, 2049361, 2029984, 2013887, 2001248, 1991193, 1983135, 1976978, 1972288, 1968499, 1966140, 1966672, 1970633, 1976942, 1984653, 1994409, 2007451, 2024116, 2044076, 2067123, 2092708, 2119595, 2147143, 2176317, 2208412, 2243368, 2280335, 2319017, 2359083, 2398886, 2436476, 2471771, 2506331, 2540917, 2574431, 2605208, 2632263, 2655409, 2675312, 2693487, 2711063, 2727388, 2740626, 2749653, 2754625, 2756033, 2754282, 2749972, 2743504, 2734551, 2722859, 2709204, 2694314, 2677260, 2656381, 2631694, 2604780, 2576271, 2545110, 2510806, 2474913, 2439485, 2405115, 2371146, 2336956, 2302504, 2268248, 2235038, 2203532]
53176B203532l0066k9552k9621k9688k9627k9267k8175k6666k5946k6350k6503
53165A892071k5090k2591k0538j9943k0962k2849k3739k1924j8078j4725j2970
53154A668662j1539r784r137j0261j1158j0027q012p113p297p770r144j1802j3902
53141A541716j3761j2870j3705j5676j6234j5129j4410j4687j4435j3085j2071
53130A385653j2460j3755j5332j7156j8927k0215k1361k2642k3045k1697j9973
53119A179090k0085k1866k3191k3229k3061k3185k2774k1571k0490k0051j9931
53108I39656k0057k0469k0365j9100j7794j7940j8883j8816j7799j7366j7489
53097G33578j6741j5409j5503j7262j8389j7457j5574j4012j2640j1374j0785
$$ y = [2203532, 2173466, 2143914, 2114293, 2084605, 2054978, 2025711, 1997536, 1970870, 1944924, 1918574, 1892071, 1866981, 1844390, 1823852, 1803909, 1782947, 1760098, 1736359, 1714435, 1696357, 1681632, 1668662, 1657123, 1647339, 1638202, 1627941, 1616783, 1606756, 1598744, 1591631, 1584334, 1576564, 1567420, 1555618, 1541716, 1527955, 1515085, 1501380, 1485704, 1469470, 1454341, 1439931, 1425244, 1410809, 1397724, 1385653, 1373193, 1359438, 1344106, 1326950, 1308023, 1287808, 1266447, 1243805, 1220760, 1199063, 1179090, 1159005, 1137139, 1113948, 1090719, 1067658, 1044473, 1021699, 1000128, 979638, 959587, 939656, 919599, 899130, 878765, 859665, 841871, 823931, 805048, 786232, 768433, 751067, 733578, 716837, 701428, 685925, 668663, 650274, 632817, 617243, 603231, 590591, 579217, 568432]
53086E68432j0466r076o858n812o580p459p288o909o890o368n298n237o439o739
53072D71013m953l038k993l953m363m748n833o034l839j132j019l152m264k880
53058D18812o18J053K324K896J313k258m859m088j251N68O08P18K004L143K661
53043D23026J270O78Q83K91j623l355l659l382m071n810p561q774r338q710o713
53028C63152m684m202m864m914l978l455m143n146n437m992m071k846k123k901
53014C05396m693n695n067l769k766j920j241j554l038m421m508l468k013n53
53000B60690K37n06k316l287k519j443j653k539k407r43P14J765K280K251J328
52985B51652m28k200l001k499j369p27q99j005l04N10L29o93j725k912m661n650
$$ y = [568432, 557966, 548890, 542032, 536220, 529640, 522181, 514893, 507984, 501094, 494726, 489428, 484191, 477752, 471013, 466060, 463022, 460029, 456076, 451713, 446965, 441132, 435098, 431259, 430127, 429108, 425956, 421692, 418812, 418194, 419247, 421571, 424467, 425780, 423522, 418663, 414575, 413324, 413892, 414500, 415218, 417222, 420365, 423026, 424296, 424974, 425857, 426148, 424525, 421170, 417511, 414129, 410058, 404248, 396687, 387913, 378575, 369865, 363152, 358468, 354266, 349402, 344488, 340510, 337055, 332912, 327766, 322329, 317337, 313266, 310420, 308297, 305396, 300703, 295008, 289941, 286172, 283406, 281486, 280245, 278691, 275653, 271232, 266724, 263256, 261243, 260690, 260927, 260421, 258105, 254818, 252299, 250856, 249203, 246664, 244257, 243314, 244028, 245793, 248073, 250324, 251652, 251224, 249024, 246023, 243524, 242155, 241428, 240529, 239524, 239220, 239730, 240059, 239366, 237641, 234729, 230068, 224418]
52969B24418l933k99J903J004r85j644j169q32m85N49J615J688J140R07P65J6
52953B24658r08j014l41K75M71L48j33o97m94O92J753J738J107N88q4j096j402
52936B25461k30J245J285Pj050j123n28N58K023L068L055K762L196L686K727M72
52920B46614j249j320k96R11J903K353K210K261L203M149L520J563L84J187K908
52905B70301M121M892N956P256Q226Q710Q681P710N685L636K931L659M422L875
52891C50061K050nj512k504l180l260k439j284r15j668k605k689k001j324j085
52876C25640j183j553k193k709k524j659q67p47r16m72O67J263R7k197l443k428
52860C04776l35Q85P35r6j339k946l853k769k36J758K379K402K008L10k174k966
$$ y = [224418, 220485, 220186, 222089, 223093, 222108, 220464, 219295, 218463, 217978, 218527, 220142, 221830, 222970, 223877, 224642, 224658, 223750, 222736, 222395, 222670, 223141, 223489, 223356, 222659, 222165, 222857, 224610, 226348, 227455, 228043, 227959, 226863, 225461, 225231, 226476, 227761, 227768, 226718, 225595, 225067, 225625, 227648, 230716, 233771, 236533, 239729, 243415, 246142, 246614, 245365, 244045, 243749, 244660, 246563, 248916, 251126, 253387, 256590, 260739, 264259, 265822, 266206, 267393, 270301, 274422, 279314, 285270, 292526, 300752, 309462, 318143, 325853, 331538, 335174, 338105, 341764, 346186, 350061, 352111, 352106, 350594, 348090, 344910, 341650, 339211, 337927, 337012, 335344, 332739, 330050, 328049, 326725, 325640, 324457, 322904, 320711, 318002, 315478, 313819, 312952, 312205, 311289, 310817, 311484, 312747, 312844, 310647, 307204, 304776, 304441, 305326, 306061, 305965, 304626, 301680, 297827, 295058, 294822, 296580, 298959, 301361, 303369, 303679, 301505, 298539]
52844B98539j003J277J218k02P0K564M613M120J960K38l24n01j072j951k504k204
52828C04838j041O06K204L055K462O72o57N5K349M338N161N381M944K775p84l168
52812C33190k622n13P96R75R60O05p64k249k083k86J258J434J060J231J792J868
52796C36652J063o2l89P04K458L441L416L452L829L378J874J299L056N418N764
52781C75353M318L453M036M944N558O255O487M969K244O74J120J600K15k286l855
52766D15085l716k713k096k775m805o963p647o710n601n387n522n020l844k680
52752C49606k157k655m064n310n106l485j923j560k120k855l592m281m458l802
52738C02238k843k510l234m720o172o590n440l288j444p95j138j608j316m1J293
$$ y = [298539, 297536, 298813, 300031, 299829, 299899, 302463, 307076, 311196, 313156, 313394, 313070, 312569, 311497, 309546, 307042, 304838, 303797, 304403, 306607, 309662, 312124, 312796, 312139, 312194, 314543, 318881, 324042, 329423, 334367, 337142, 336358, 333190, 330568, 330055, 330851, 331826, 332786, 333391, 332627, 330378, 328295, 328009, 329267, 330701, 331761, 332992, 334784, 336652, 337715, 337653, 337264, 337968, 340426, 343867, 347283, 350735, 354564, 357942, 359816, 361115, 364171, 369589, 375353, 379671, 383124, 387160, 392104, 397662, 403917, 410404, 415373, 417617, 418291, 419411, 421011, 421226, 418940, 415085, 411369, 408656, 406560, 403785, 398980, 392017, 384370, 377660, 372059, 366672, 361150, 356130, 352286, 349606, 347449, 344794, 340730, 335420, 330314, 326829, 324906, 323346, 321226, 318371, 314779, 310498, 306040, 302238, 299395, 296885, 293651, 288931, 282759, 276169, 270729, 267441, 265997, 265202, 264064, 262456, 261140, 261099, 262392]
52723B62392J217m79k131k247j637k115l648m397l590k525k312k272j397p5O51
52708B35435N61M3q12k029l190l850m148m525n125n777o121n588l899j797o28
52693A88550q59j724k441k944l117k511j384r57j716k357j585j89o6j504k860
52678A62336k917k240j940k109k170j979j746j359o46o4k36p70n16O22J101j63
52662A45204j900j924j62J272J096M05N59J113R63L53L05P65Q26K97l32j145k414
52645A45281l185k000O61K464K321J851K763M152L901J963N55J230L066M197M118
52630A73338L786M005M472M453L828L165K955L058K887K026P19k29k83J7n14k095
52614B05588l339k935j591j246k517m035m483m110l795l749l714l539l015j943
$$ y = [262392, 263609, 263130, 260999, 258752, 257115, 255000, 251352, 246955, 243365, 240840, 238528, 236256, 234859, 234784, 235435, 235996, 236039, 235227, 233198, 230008, 226158, 222010, 217485, 212360, 206583, 200462, 194874, 190975, 189178, 188550, 187691, 185967, 183526, 180582, 177465, 174954, 173570, 172613, 170897, 168540, 166955, 166766, 166700, 165196, 162336, 159419, 157179, 155239, 153130, 150960, 148981, 147235, 145876, 145230, 145166, 144930, 144160, 143644, 144266, 145367, 145204, 143304, 141380, 141218, 142490, 143586, 143991, 144550, 145663, 146626, 146979, 147284, 148049, 148875, 149172, 148840, 147695, 145281, 142096, 140096, 140757, 143221, 145542, 147393, 150156, 154308, 158209, 160172, 160727, 161957, 165023, 169220, 173338, 177124, 181129, 185601, 190054, 193882, 197047, 200002, 203060, 205947, 207973, 208692, 208463, 208180, 208197, 207683, 205588, 202249, 199314, 197723, 196477, 193960, 189925, 185442, 181332, 177537, 173788, 170074, 166535, 163520, 161577]
52600A61577r22j033k262l200k926k106j485o30R08K320K646K093J223j46k026
52585A54031l369l446l030k882k290o61P01M34l56K76J862K223R77j45k51j10
52569A43964m0N56J296P93q80j950j702j445k025k469j927j048m29N24K053L001
52553A38272K476J245K90p02k145k989j847Q70L154L510K215P18K35P69J317J280
52537A48668J127J264J030Nn70O01K363K402P94n8Q29J819J800J790K421K346
52521A68631Q03l95O82L233N125N683N373M058J655m62p89Q1L41k70k55J274L381
52504A98149M486L895K208R22J257K812L806L143J626O55O17J113J743J970J269
52489B29671K67N75K468L946L308J585R53J706K394K245J788J518J428J711K498
$$ y = [161577, 160655, 159622, 157360, 154160, 151234, 149128, 147643, 147013, 147921, 150241, 152887, 154980, 156203, 156057, 154031, 150662, 147216, 144186, 141304, 139014, 138353, 139054, 139488, 139132, 139408, 141270, 143493, 144470, 144325, 144074, 143964, 143924, 144480, 145776, 146569, 145689, 143739, 142037, 140592, 138567, 136098, 134171, 133123, 132694, 133218, 135271, 138272, 140748, 141993, 142283, 141581, 139436, 136447, 134600, 135470, 138624, 142134, 144349, 145067, 145302, 146071, 147388, 148668, 149795, 151059, 152089, 152094, 151524, 152125, 154488, 156890, 157684, 157626, 158455, 160274, 162074, 163864, 166285, 168631, 169434, 169039, 169721, 172954, 178079, 183762, 189135, 193193, 194848, 194386, 193597, 193678, 194019, 193749, 193494, 194768, 198149, 202635, 206530, 208738, 209660, 210917, 213729, 217535, 220678, 222304, 222959, 223576, 224689, 226432, 228402, 229671, 229938, 230513, 232981, 236927, 240235, 241820, 242773, 244479, 246873, 249118, 250906, 252424, 253852, 255563, 258061]
52474B58061L043K404R48R9N92J858K970L399K968J914R23N52Q09J558K587K994
52458B87679J625r79k294p16K196L766L538K925K398J224l88j095p38q07j985
52443B96349k871j977K18K100K768K253P88j158k667l062k659k348k594l071k995
52428B79074j714O20K677K824Q34j511k050m15J716K454J461j11r55o50M06J522
52412B86182K131K021J511J103Q64M65K6L04J477K438K162J359J583K928L845
52397C10399L346K168J344Q23M9q40j209p85R1P79P36Q1l10J92J015J226R38R02
52379C20945J022O82K76P34J521J068m43p86J073L350M006L180J933M84r56j273
52363C36816j54P45J04q39k47J229J394j18j401r31R36K930L983L673K723K679
$$ y = [258061, 261104, 263508, 264456, 264555, 265147, 267005, 269975, 273374, 276342, 278256, 279179, 279731, 280540, 282098, 284685, 287679, 289304, 288325, 286031, 285315, 287511, 291277, 294815, 297740, 300138, 301362, 300974, 299879, 299141, 298334, 296349, 293478, 291501, 291719, 293819, 296587, 298840, 299628, 298470, 295803, 292741, 290082, 287734, 285140, 282069, 279074, 277360, 277980, 280657, 283481, 284315, 282804, 280754, 280339, 282055, 284509, 285970, 285859, 284904, 284254, 284660, 286182, 288313, 290334, 291845, 292948, 293812, 294277, 294303, 294607, 296084, 298522, 300684, 302043, 303626, 306554, 310399, 313745, 315913, 317257, 318080, 318129, 317289, 316080, 315295, 315386, 316165, 316901, 316982, 316672, 316864, 317879, 319105, 320043, 320945, 321967, 322649, 322925, 323659, 325180, 326248, 325805, 325019, 326092, 329442, 333448, 336628, 338561, 339045, 338089, 336816, 336662, 337407, 337511, 336672, 336425, 337654, 339048, 338930, 337529, 336598, 337534, 340464, 344447, 348120, 350843, 353522]
52347C53522L989N048M359K737J990K203K114J479J104Q30m02k349l192j942J85
52332C71675J368J017k07j379j928j968k114k529k463j458m11m76j379j932j818
52317C53998j707j753j275J53K127L953N003M832L728K756K462K106J065L30J323
52302C79101L779O036P078P021O047M194K070N75%K22J332L187M923N986O881
52287D38432P852P823O205M669N207P054P631O164M287L368L313L909N225O377
52273E17516N952M136K774K995M207N483O387O384N234M000M009M724M549L771
52259E82121M417O869Q946R129Q519Q612R134R272R304R664R910R889J0681J3023
52245G09490J5869J7643J8166J8320J8593J8818J8747J8216J7337J6858J7572
$$ y = [353522, 357511, 362559, 366918, 369655, 371645, 373848, 375962, 377441, 378545, 379375, 378973, 376624, 373432, 371490, 371675, 373043, 374060, 373853, 372474, 370546, 368578, 366464, 363935, 361472, 360014, 359603, 359127, 357748, 355816, 353998, 352291, 350538, 349263, 349416, 351543, 355496, 360499, 365331, 369059, 371815, 374277, 376383, 377448, 377778, 379101, 382880, 388916, 395994, 403015, 409062, 413256, 415326, 415901, 415901, 416123, 417455, 420642, 425565, 431551, 438432, 446284, 454107, 460312, 464981, 470188, 477242, 484873, 491037, 495324, 498692, 502005, 505914, 511139, 517516, 523468, 527604, 530378, 533373, 537580, 543063, 549450, 555834, 561068, 565068, 569077, 573801, 578350, 582121, 586538, 593407, 602353, 611482, 620001, 628613, 637747, 647019, 656323, 665987, 675897, 685786, 696467, 709490, 725359, 743002, 761168, 779488, 798081, 816899, 835646, 853862, 871199, 888057, 905629]
52234I05629J9094K0289K0975K2012K3443K4126K3680K3241K3568K3937K3722
52223A153716K3685K4593K5759K6094K5646K5205K5113K5268K5389K4859K3325
52212A428652K1746K1624K2619K2545K0356J7607J6127J5823J5844J6130J6502
52201A635575J5775J3464J1020R757Q864P206N823O463Q461R367Q411P157O708
52188A754051O328N304M435M694N635O109O048O533Q124R726R768Q425P911R843
52174A852934J2993J4857J4953J4899J5335J4979J3435J2620J4000J6146J6860
52163B014011J6189J5491J4770J3158J1265J0625J1037J0596Q505O098M730M146
52151B140621L306J666o88l237n202o303p205q483r518r534r313j0465j3048j5187
$$ y = [905629, 924723, 945012, 965987, 987999, 1011442, 1035568, 1059248, 1082489, 1106057, 1129994, 1153716, 1177401, 1201994, 1227753, 1253847, 1279493, 1304698, 1329811, 1355079, 1380468, 1405327, 1428652, 1450398, 1472022, 1494641, 1517186, 1537542, 1555149, 1571276, 1587099, 1602943, 1619073, 1635575, 1651350, 1664814, 1675834, 1685591, 1694455, 1701661, 1707484, 1713947, 1722408, 1731775, 1740186, 1747343, 1754051, 1760379, 1765683, 1770118, 1774812, 1780447, 1786556, 1792604, 1799137, 1807261, 1816987, 1826755, 1835180, 1843091, 1852934, 1865927, 1880784, 1895737, 1910636, 1925971, 1940950, 1954385, 1967005, 1981005, 1997151, 2014011, 2030200, 2045691, 2060461, 2073619, 2084884, 2095509, 2106546, 2117142, 2125647, 2131745, 2136475, 2140621, 2143927, 2145593, 2144905, 2141668, 2136466, 2130163, 2122958, 2114475, 2104957, 2095423, 2086110, 2075645, 2062597, 2047410]
52137B047410j5155j2802r149n843m836o874j0014j1131r391p025o186o474o297
52124A936233n405m824n033n296m750l449k402k731m521o443p064o523o243o777
52110A864772o928n526l278k105l016n303p524q640q494p653o896o528o292n992
52096A780597n878o143o438o294n737n072m297l248k315k348l617n193n805n262
52082A712950m575m618n010m757l766l118l578m529m837m385m018m145m296m203
52068A653115m395n223n890n414m233m000n503p549q442q051p779q497r216q201
52054A560722n237k290j643l329m796l468M08M017N143M408L967M793O221P663
52040A576579R346J1338J3095J4487J6198J8580K1110K3474K6108K8964L0853
$$ y = [2047410, 2032255, 2019453, 2010304, 2004461, 1999625, 1992751, 1982737, 1971606, 1962215, 1955190, 1949004, 1942530, 1936233, 1930828, 1926004, 1920971, 1915675, 1910925, 1907476, 1905074, 1902343, 1897822, 1891379, 1884315, 1877792, 1871549, 1864772, 1857844, 1852318, 1849040, 1846935, 1843919, 1838616, 1831092, 1822452, 1813958, 1806305, 1799409, 1792881, 1786589, 1780597, 1774719, 1768576, 1762138, 1755844, 1750107, 1745035, 1740738, 1737490, 1735175, 1732827, 1729210, 1724017, 1718212, 1712950, 1708375, 1703757, 1698747, 1693990, 1690224, 1687106, 1683528, 1678999, 1674162, 1669777, 1665759, 1661614, 1657318, 1653115, 1648720, 1643497, 1637607, 1632193, 1627960, 1623960, 1618457, 1610908, 1602466, 1594415, 1586636, 1578139, 1568923, 1560722, 1555485, 1553195, 1551552, 1548223, 1543427, 1539959, 1540367, 1544384, 1549527, 1553935, 1557902, 1562695, 1568916, 1576579, 1585925, 1597263, 1610358, 1624845, 1641043, 1659623, 1680733, 1704207, 1730315, 1759279, 1790132]
52029A790132L1089L0778L1304L2363L2707L2118L1285L0387K9338K8850K9544
52018B129895L0338K9535K7372K5787K5528K5241K3650K0958J7815J4500J1587
52007B382206R752Q377N996K703L94j15l84j856l826n181o401q199r667r624q879
51992B355296r175j0465j0999r829p835o420o414p877r760j0142q074m927k785
51979B250594j880r32L60Q62J30p23p12k86j86j47M33J228J338N61m39j163j721
51962B247317k064j549K2J253J53l328o653p531o665o524p921r464j0286j1361
51948B175399j3490j5752j7094j8046j9550k1190k2112k2894k4879k8062l1002
51937A941328l2814l4011l5356l6825l7942l8414l8437l8709l9997m2283m4556
$$ y = [1790132, 1821221, 1851999, 1883303, 1915666, 1948373, 1980491, 2011776, 2042163, 2071501, 2100351, 2129895, 2160233, 2189768, 2217140, 2242927, 2268455, 2293696, 2317346, 2338304, 2356119, 2370619, 2382206, 2391958, 2400335, 2406331, 2409034, 2409428, 2409313, 2408929, 2407073, 2403247, 2398066, 2391665, 2383466, 2373799, 2364175, 2355296, 2346121, 2335656, 2324657, 2314828, 2306993, 2300573, 2294159, 2286282, 2276522, 2266380, 2258306, 2253379, 2250594, 2248714, 2247782, 2248142, 2249004, 2249134, 2248411, 2247699, 2247413, 2247227, 2247080, 2247513, 2248741, 2250079, 2250640, 2250201, 2249038, 2247317, 2245253, 2243704, 2243726, 2244979, 2245132, 2241804, 2235151, 2227620, 2220955, 2214431, 2206510, 2197046, 2186760, 2175399, 2161909, 2146157, 2129063, 2111017, 2091467, 2070277, 2048165, 2025271, 2000392, 1972330, 1941328, 1908514, 1874503, 1839147, 1802322, 1764380, 1725966, 1687529, 1648820, 1608823, 1566540, 1521984]
51926A521984m5790m5735m4584m2598m0448l9053l8514l7966l7005l6292l6057
51915A077942l5247l3179l0926k9709k8881k7092k4685k3179k2826k2413k1420
51904G78385k0647k0572k0532j9915j8919j7821j6513j5027j3737j2825j2214
51893E89663j2042j2343j2349j1130q984p311o948p449q054q487q626q129o794
51880D71017m939l292k678l413m663m945l875k815l002l729l473k229j441j904
51866D24619l067m192m859m462k703o64j25j381k871l174k420j584j517k720m864
51851C84016o375n751l633k291k745l631l462k570k030j990k104k606l743m881
51837C36204n321n384n593n261l297k97J568J118l97j056o13l74j096k018k121
$$ y = [1521984, 1476194, 1430459, 1385875, 1343277, 1302829, 1263776, 1225262, 1187296, 1150291, 1113999, 1077942, 1042695, 1009516, 978590, 948881, 920000, 892908, 868223, 845044, 822218, 799805, 778385, 757738, 737166, 716634, 696719, 677800, 659979, 643466, 628439, 614702, 601877, 589663, 577621, 565278, 552929, 541799, 532815, 525504, 518556, 511107, 503053, 494566, 485940, 477811, 471017, 466078, 462786, 460108, 456695, 452032, 447087, 443212, 440397, 437395, 433666, 430193, 427964, 426523, 424619, 421552, 417360, 412501, 408039, 405336, 404672, 404547, 403166, 400295, 397121, 394701, 393117, 391600, 388880, 384016, 377641, 371890, 368257, 365966, 363221, 359590, 356128, 353558, 351528, 349538, 347434, 344828, 341085, 336204, 330883, 325499, 319906, 314645, 311348, 311051, 312619, 313737, 313340, 312284, 311671, 311297, 310201, 308183, 306062]
51822C06062j623j642k742m271n130m757l379j748o66l95n29o60j035k005l005
51807B72475k937j634j15P92J212J422J228O27J71K43O20J138J857K280J595K33
51791B81207j10J235K882L476L334L033K020J79q11L46K193K508J745K161M037
51776C09435N272M614L010J570L62m96n37k71r87k545l111j745K03J027O16j86
51760C16231r29j473j576j286j120j370j894k588l210k847p73K062L693L520K783
51745C09223K554K556K312J999J619N62j219k622k624j482k61J46n13j559j558
51730C09133K79K838M257M076L258K389J277J67l97q20j872k825k100n2J071M70
51714C21149lJ062K403K234R67K63N66R82R20O47N99R32J394J553J563K434M411
$$ y = [306062, 304439, 302797, 300055, 295784, 290654, 285897, 282518, 280770, 280104, 279709, 279180, 278520, 277485, 275480, 272475, 269538, 267904, 267789, 268581, 269793, 271215, 272443, 273070, 273241, 273484, 274104, 275242, 277099, 279379, 280974, 281207, 281097, 282332, 285214, 288690, 292024, 295057, 297077, 297256, 296445, 296791, 298984, 301492, 303237, 305398, 309435, 314707, 319321, 322331, 323901, 324263, 323767, 323230, 322959, 321972, 319427, 316316, 314571, 314774, 315801, 316417, 316231, 315302, 313829, 312253, 310967, 309847, 308477, 306583, 303995, 300785, 297938, 297165, 299227, 302920, 306440, 309223, 311777, 314333, 316645, 318644, 320263, 320825, 319606, 316984, 314360, 312878, 312617, 312763, 312250, 310691, 309133, 309412, 312250, 316507, 320583, 323841, 326230, 327507, 327674, 327277, 326457, 324585, 321760, 319660, 319608, 320679, 321149, 321146, 322208, 324611, 326845, 327812, 328075, 328641, 329623, 330543, 331190, 331789, 332721, 334115, 335668, 337231, 339665, 344076]
51697C44076N729M683K545K228M075N434M734L313K489J764J021J659L842N314
51683C92906M839M328N485O912O922O709P809Q711P437N738O808R957J1471J0365
51669D96397R346R959J0481R516Q318Q160Q215P480O637O394N809L803J044r76
51655E90583j626r15J223M240O481O572M859K719J046N3k49j34k33q30j354j068
51639F11367l9R39J089J78j244j996j189Q37K810L857M079L919L685L828M784
51624F36904O117O491N239L536L313N056P254Q107P200N225K620o59m038o139
51610F86226o347n865o142o770o186m230k511j941j609o48K54L60M23J394K601
51595F49009K699J744P83m6j422l158m281m843o065q296j0148j0310r279q600
$$ y = [344076, 349805, 354488, 357033, 359261, 363336, 368770, 373504, 376817, 379306, 381070, 382091, 383750, 387592, 392906, 397745, 402073, 407558, 414470, 421392, 428101, 435910, 444621, 452058, 457796, 464604, 474561, 486032, 496397, 505743, 515702, 526183, 535699, 544017, 552177, 560392, 567872, 574509, 580903, 586712, 590515, 591559, 590583, 588957, 588042, 589265, 593505, 599986, 606558, 611417, 614136, 615182, 615235, 614986, 614852, 614619, 613789, 612435, 611367, 611328, 612267, 613356, 613534, 612290, 610294, 609105, 609942, 612752, 616609, 620688, 624607, 628292, 632120, 636904, 643021, 649512, 654751, 658287, 661600, 666656, 673910, 682017, 689217, 694442, 697062, 696403, 692365, 686226, 679879, 674014, 667872, 661102, 654916, 650686, 648175, 646234, 644625, 643977, 644231, 644591, 645014, 646408, 649009, 651708, 653452, 654235, 654189, 652767, 649609, 645328, 640485, 634420, 626124, 615976, 605666, 596387, 587787]
51581E87787r022j0014j0712j0787j0477j0079r549q608p261o011n418n619o311
51568D77919o975p183p000o961p186o836n320l736l881n688p107o887n900n200
51554C92059m431l236k535k893l050j827m35r18k975m305l719k142p75m8k67j553
51538C56950k916k818j106P34J380Q99J34j38M09J289J479Q21O17J863L642M586
51522C67825N057O247P795Q412Q513R774J1978J2704J0895Q551P783P988P228
51509D80750N204L322K587K611K356J159p84k625l794m609n488n948n384m452
51495D64905m312m645m041k447j411j475j152N93K582L348L401M102N306N751
51481D70505N229M915N612O832P740Q126Q322Q574Q748Q500P580N945L555N63
$$ y = [587787, 578765, 568751, 558039, 547252, 536775, 526696, 517147, 508539, 501278, 495267, 489849, 484230, 477919, 470944, 463761, 456761, 449800, 442614, 435778, 430458, 426722, 422841, 417153, 410046, 403159, 397259, 392059, 387628, 384392, 381857, 378964, 375914, 374087, 373652, 372734, 369759, 365454, 361735, 359593, 358818, 358770, 358503, 356950, 354034, 351216, 350110, 350844, 352224, 353123, 353257, 353119, 353528, 354817, 356296, 357117, 357734, 359597, 363239, 367825, 372882, 379129, 386924, 395336, 403849, 413623, 425601, 438305, 449200, 457751, 465534, 473522, 480750, 485954, 489276, 491863, 494474, 496830, 497989, 497205, 494580, 490786, 486177, 480689, 474741, 469357, 464905, 460593, 455948, 451907, 449460, 448049, 446574, 445422, 446015, 448597, 451945, 455346, 459448, 464754, 470505, 475734, 480649, 486261, 493093, 500833, 508959, 517281, 525855, 534603, 543103, 550683, 556628, 560183, 560746]
51467E60746k017k600r48P80K38k125l649k956j185K86J396K050J333o80j935
51452E48734q09J588K931K612J648O34n13j234p23M24M28j364l638m979n456n909
51436E34374o452o411n392l942l216m081o262q366q965p865o114m773l946l162
51422D55427k402k273k940l347k181K58J956J501Nj63J855M718O727P291O694
51407D73126N626N224O410Q678J0382J0701J0404J0380J0440J0269J0464J1618
51395E83722J3118J3864J3688J3147J2376J1220J0090R640R625R060P517N544
51383G12611L747K309J368J188J628K025J874J237M52k03l88J17J032J787K292
51368G33076K924L586L484K375J403J759K887L051J721J66o77j691l968o780q464
$$ y = [560746, 558729, 556129, 555181, 555961, 556199, 554074, 550425, 547469, 546284, 546570, 547966, 550016, 551349, 550669, 548734, 547925, 549513, 552444, 555056, 556704, 557338, 556825, 555591, 554868, 555292, 555720, 554356, 550718, 545739, 540283, 534374, 527922, 521511, 516119, 512177, 508961, 504880, 498618, 490252, 481287, 473422, 467308, 462535, 458589, 455427, 453025, 450752, 447812, 444465, 442284, 442542, 444498, 445999, 446004, 445841, 447696, 452414, 459141, 466432, 473126, 478752, 483976, 490386, 499064, 509446, 520147, 530551, 540931, 551371, 561640, 572104, 583722, 596840, 610704, 624392, 637539, 649915, 661135, 671225, 680865, 690490, 699550, 707067, 712611, 716358, 718667, 720035, 721223, 722851, 724876, 726750, 727987, 728439, 728236, 727848, 727965, 728997, 730784, 733076, 736000, 739586, 743070, 745445, 746848, 748607, 751494, 754545, 756266, 756432, 755755, 754064, 750096, 743316, 734852]
51353G34852q767q771q800q109o817o313p139q082q160p946p975p523o227n400
51339F28823n936o333m952l035k985m334m226j771Q17J808K006K479K740K389
51325F07490K359L040L003J232q86j470r21j042k377m028n473o978q572j0022
51311E75355j1544j3384j4919j5262j4570j3753j3159j2519j1883j1574j1368
51300D31420j0679r560q654q143p568o694n892n556n675o008o266o112n460m675
51286C34478m185l888l353k500j775j674k149k508k002q33l21j493l577m645l871
51271B95704k273j077m25o5j61o18n16P77K409K848J529p97k816l281j658J159
51255B90739L398M284M672N273N353M273L211L831N765P124P282P491Q509R227
$$ y = [734852, 726085, 717314, 708514, 700405, 693588, 687275, 680136, 672054, 663894, 655948, 647973, 640450, 634223, 628823, 622887, 616554, 611602, 608567, 605582, 601248, 597022, 595251, 596068, 597876, 599882, 602361, 605101, 607490, 609849, 612889, 615892, 617124, 616238, 614768, 613847, 612805, 610428, 606400, 600927, 593949, 585377, 575355, 563811, 550427, 535508, 520246, 505676, 491923, 478764, 466245, 454362, 442788, 431420, 420741, 411181, 402527, 394384, 386816, 380122, 374230, 368674, 362999, 356991, 350725, 344613, 339153, 334478, 330293, 326405, 323052, 320552, 318777, 317103, 314954, 312446, 310444, 309611, 309290, 307797, 304220, 299575, 295704, 293431, 292354, 291929, 291864, 291703, 291085, 290569, 291346, 293755, 296603, 298132, 297335, 294519, 291238, 289580, 290739, 294137, 298421, 303093, 308366, 313719, 317992, 321203, 325034, 330799, 337923, 345205, 352696, 361205, 370432]
51241C70432Q336O270M665M379M804M851M072K788J328m78k850n180o329o026
51227C91062n341n328n811o128o379p004p620p366o274n316n083n245n361n392
51213C07414n312m914m278l828l720l698l675l915m465m877m730m061l184k356
51199B50401j829j797k114k330k250k224k624l116k771j135J008K313K326J833
51185B35691J556J214M54NQ35K368K934K044R83Q16J122J201J331J917K491K522
51169B59484K305K111J314n30k479l265k887k159j257l4Q80P09n4j94M13Q70R05
51152B56132J088J441J276O01L93J002J448Q67l62j401k028k431k572k306j696
51137B51452r01j06L46L79O54J795L083K898Q99j229j805j150q32j524k625l605
$$ y = [370432, 378768, 385038, 389703, 394082, 398886, 403737, 407809, 410597, 411925, 411447, 408597, 403417, 397088, 391062, 385721, 380393, 374582, 368454, 362075, 355071, 347451, 340085, 333811, 328495, 323412, 318167, 312806, 307414, 302102, 297188, 292910, 289082, 285362, 281664, 277989, 274074, 269609, 264732, 260002, 255941, 252757, 250401, 248572, 246775, 244661, 242331, 240081, 237857, 235233, 232117, 229346, 228211, 229219, 231532, 233858, 235691, 237247, 238461, 238915, 238920, 239755, 242123, 245057, 247101, 248084, 248900, 250022, 251223, 252554, 254471, 256962, 259484, 261789, 263900, 265214, 264684, 262205, 258940, 256053, 253894, 252637, 252603, 253483, 254192, 254138, 253944, 254357, 255227, 256132, 257220, 258661, 259937, 260538, 260931, 261933, 263381, 264248, 263886, 262485, 260457, 258026, 255454, 253148, 251452, 250551, 250445, 250791, 251170, 251824, 253619, 256702, 259600, 260499, 259270, 257465, 256315, 255483, 253959, 251334, 247729]
51121B47729m583n327m780k356P16K253J502p7p51n43n95j141j346j063j244k152
51105B26242k541j531j23K68j4M73K020L432L718K904J464Q3k30Q88K143J812
51089B41008K5j401j514j304j906l067l890m110l916l485l171l320l352k047M87
51074B05037K129J145j248k029N2L056M280L301K093K467L944M506L102R99K57
51059B33091J287K565K749K330K722M179N308M781L053J872K107K618J724n30
51045B69856k409k709k065j723j961k322k567k635k297j641j292j260m00J870
51031B46445M055M204K639J400J421J874K306L329M713M747K553l18j707j203
51017B76458J44J402J973J235p24k518k643r97J327L200L815K800Q89k80j9M82
$$ y = [247729, 243146, 237819, 233039, 230683, 231399, 233652, 235154, 235077, 234326, 233783, 233188, 232047, 230701, 229638, 228394, 226242, 223701, 222170, 222047, 222315, 222301, 222774, 224794, 228226, 231944, 234848, 236312, 236395, 236165, 237053, 239196, 241008, 241033, 239632, 238118, 236814, 234908, 231841, 227951, 223841, 219925, 216440, 213269, 209949, 206597, 204550, 205037, 207166, 208311, 207063, 205034, 205086, 208142, 212422, 215723, 217816, 220283, 224227, 228733, 231835, 232834, 233091, 234378, 236943, 239692, 242022, 244744, 248923, 254231, 259012, 262065, 263937, 266044, 268662, 270386, 269856, 267447, 264738, 262673, 260950, 258989, 256667, 254100, 251465, 249168, 247527, 246235, 244975, 244575, 246445, 250500, 254704, 257343, 258743, 260164, 262038, 264344, 267673, 272386, 277133, 279686, 279368, 277661, 276458, 276602, 278004, 279977, 281212, 280488, 277970, 275327, 274330, 275657, 278857, 282672, 285472, 286361, 286081, 286062, 286544]
51001B86544pp82n44J34m64k160k650p95J590K123P07j017j955k143j718n93J046
50984B77316K739M080M571L645J639J18K32J197J576J692L100N727P374O770N367
50969C27143M968M993L724J228q16j637j950k075j347L76K048K785K786K584K445
50954C47255K789L982N423N916N357M824M736M309L378L179M484O253P169P329
50940D16383P410P356O998O933P536Q120Q203Q585J0027J1837J3155J4550J6872
50927E43965J9411K0826K1053K0852K0365J9867K0871K4429K8961L1903L3040
50916H05543L4187L6083L7929L9697M2455M6285N0198N4206N9242O4830O9252
50905A339907P2448P6328Q1504Q6230Q9393R2113R5117R6827R5709R2677Q9486
$$ y = [286544, 286537, 285755, 285211, 285345, 284881, 282721, 280071, 279276, 280866, 282989, 283696, 282679, 280724, 278581, 276863, 276270, 277316, 280055, 284135, 288706, 292351, 293990, 294108, 294340, 295537, 297113, 298805, 301905, 307632, 315006, 321776, 327143, 332111, 337104, 340828, 342056, 341240, 339603, 337653, 335578, 334231, 334607, 336655, 339440, 342226, 344810, 347255, 350044, 354026, 359449, 365365, 370722, 375546, 380282, 384591, 387969, 391148, 395632, 401885, 409054, 416383, 423793, 431149, 438147, 445080, 452616, 460736, 468939, 477524, 487551, 499388, 512543, 527093, 543965, 563376, 584202, 605255, 626107, 646472, 666339, 687210, 711639, 740600, 772503, 805543, 839730, 875813, 913742, 953439, 995894, 1042179, 1092377, 1146583, 1205825, 1270655, 1339907, 1412355, 1488683, 1570187, 1656417, 1745810, 1837923, 1933040, 2029867, 2125576, 2218253, 2307739]
50894B307739Q6253Q2088P6840P0756O3593N5501M7661M0888L4674K8627K3404
50883B918024J9077J4279Q692M797M975P855R752R021O937M737J953k233p857
50870C000009j4802k3168l2673m2606n2450o1777o9757p5834q0714q5641r0676
50859B369911r4632r6670r7099r6466r4673r1221q5989p9757p3923o9278o4928
50848A425275n9305n2470m6352m2124l8651l4552l0423k7539k5358k2188j7830
50837A028483j3845j1310r816q641p429n742l291p68P51J317J911K769L184L072
50823I80645L510N266P866J0455J2705J4533J5860J6962J8360K0098K1657K2738
50811A150655K3496K4096K4863K6697L0357L5176L9484M2470M4832M7484N0631
$$ y = [2307739, 2393992, 2476080, 2552920, 2623676, 2687269, 2742770, 2790431, 2831319, 2865993, 2894620, 2918024, 2937101, 2951380, 2960072, 2964869, 2969844, 2977699, 2987451, 2996472, 3003409, 3008146, 3010099, 3007866, 3000009, 2985207, 2962039, 2929366, 2886760, 2834310, 2772533, 2702776, 2626942, 2546228, 2460587, 2369911, 2275279, 2178609, 2081510, 1985044, 1890371, 1799150, 1713161, 1633404, 1559481, 1490203, 1425275, 1365970, 1313500, 1267148, 1225024, 1186373, 1151821, 1121398, 1093859, 1068501, 1046313, 1028483, 1014638, 1003328, 993512, 984871, 977442, 971700, 968409, 967641, 968392, 969709, 971620, 974389, 977573, 980645, 984155, 989421, 997287, 1007742, 1020447, 1034980, 1050840, 1067802, 1086162, 1106260, 1127917, 1150655, 1174151, 1198247, 1223110, 1249807, 1280164, 1315340, 1354824, 1397294, 1442126, 1489610, 1540241]
50800A540241N4367N9174O5317P2453Q0185Q8421R6969J05467J13912J22652J31761
50789B530919J41174J51393J63011J75224J85922J93694J98950K02707K05165
50780D148159K05951K04684K00649J92835J81037J66202J49118J29765J08836
50771E687236Q8566P0750N4707L8918K4160J3074O776L804K906M883J0486J7900
50759F024166K3860K6520K5742K1142J1512l569k2905m4836o8334r2589j16579
50748E784130j39673j61913j83040k01751k16569k26877k32572k33423k29607
50739C958705k22343k12988k01873j88940j75122j61872j49447j36844j23558
50730B385718j10363r8270q7723p8845p1411o4412n6834m9108m2607l7544l2736
$$ y = [1540241, 1594608, 1653782, 1719099, 1791552, 1871737, 1960158, 2057127, 2162594, 2276506, 2399158, 2530919, 2672093, 2823486, 2986497, 3161721, 3347643, 3541337, 3740287, 3942994, 4148159, 4354110, 4558794, 4759443, 4952278, 5133315, 5299517, 5448635, 5578400, 5687236, 5775802, 5846552, 5901259, 5940177, 5964337, 5977411, 5984187, 5987991, 5990897, 5995780, 6006266, 6024166, 6048026, 6074546, 6100288, 6121430, 6132942, 6129373, 6106468, 6061632, 5993298, 5900709, 5784130, 5644457, 5482544, 5299504, 5097753, 4881184, 4654307, 4421735, 4188312, 3958705, 3736362, 3523374, 3321501, 3132561, 2957439, 2795567, 2646120, 2509276, 2385718, 2275355, 2177085, 2089362, 2010517, 1939106, 1874694, 1817860, 1768752, 1726145, 1688601, 1655865]
50719A655865k7876k4286k2680k1829k0496j9156j8377j7094j4316j1390j0407
50708A447958j0987j0837r186p575p198p405p286o914o440n440l815k241j042
50695A361592L04K109M089O485J0328J5744K1037K4461K6251K8062L1031L5101
50683A566594L9694M4150M7878N0910N4175N8621O4258P0435P6804Q3467R0417
50672B247403R7318J03811J09691J15003J20054J24985J29013J30600J28942J24919
50662C431739J19855J13570J04430R1577P6310O0780M5727L0214J3658k611j6229
50651D069020k5869l1741l4330l3600k9945k4991k0473j6508j1910o279r98K016
50639C834392J808j702q611j9095l2894m9149o6744q4371j00448j13548j23171
$$ y = [1655865, 1627989, 1603703, 1581023, 1559194, 1538698, 1519542, 1501165, 1484071, 1469755, 1458365, 1447958, 1436971, 1426134, 1416948, 1409373, 1402175, 1394770, 1387484, 1380570, 1374130, 1368690, 1364875, 1362634, 1361592, 1361896, 1364005, 1368094, 1374579, 1384907, 1400651, 1421688, 1446149, 1472400, 1500462, 1531493, 1566594, 1606288, 1650438, 1698316, 1749226, 1803401, 1862022, 1926280, 1996715, 2073519, 2156986, 2247403, 2344721, 2448532, 2558223, 2673226, 2793280, 2918265, 3047278, 3177878, 3306820, 3431739, 3551594, 3665164, 3769594, 3861171, 3937481, 3998261, 4043988, 4074202, 4087860, 4085249, 4069020, 4043151, 4011410, 3977080, 3943480, 3913535, 3888544, 3868071, 3851563, 3839653, 3833374, 3832376, 3834392, 3836200, 3834498, 3825887, 3806792, 3773898, 3724749, 3658005, 3573634, 3473186, 3359638, 3236467]
50628C236467j29847j34230j36121j34670j29646j22272j14510j07498j00864
50619B126809r3602q5263p6221o7215n8912n1632m5207l9225l3713k9090k5111
50608A521618k0370j3748o223k71K950M913P627J0808J2414J1993J2009J4835
50596A558555J9258K1806K1555K1685K5154L0533L4062L5014L6416M0365M5194
50585A889597M8412N0399N3310N7556O1529O4343O6944P0315P4001P6909P8662
50574B591977P9602P9961P9332P7051P3159O8817O5051O1022N4680M5664L6269
50563C312585K8648K2299J5644Q847L245j152n364q938j0065q332n265j816K559
50550C352895P551J0882J0938R013P459O695N358K504j715o997j3199k0140k8015
$$ y = [3236467, 3106620, 2972390, 2836269, 2701599, 2571953, 2449681, 2335171, 2227673, 2126809, 2033207, 1947944, 1871723, 1804508, 1745596, 1693964, 1648757, 1609532, 1575819, 1546729, 1521618, 1501248, 1487500, 1481277, 1481006, 1483956, 1488869, 1496496, 1507304, 1519718, 1531711, 1543720, 1558555, 1577813, 1599619, 1621174, 1642859, 1668013, 1698546, 1732608, 1767622, 1804038, 1844403, 1889597, 1938009, 1988408, 2041718, 2099274, 2160803, 2225146, 2292090, 2362405, 2436406, 2513315, 2591977, 2671579, 2751540, 2830872, 2907923, 2981082, 3049899, 3114950, 3175972, 3230652, 3276316, 3312585, 3341233, 3363532, 3379176, 3388023, 3391268, 3390116, 3384752, 3375814, 3365749, 3357417, 3352152, 3350336, 3352895, 3360446, 3371328, 3382266, 3391279, 3398738, 3405433, 3410791, 3413295, 3411580, 3404583, 3391384, 3371244, 3343229]
50537C343229l7513m8518n9274o7939p4670q0994q7420r2870r6320r7727r7186
50526B502798r4435q9830q4796q0529p6833p2779o8066o3062n7882n2304m6510
50515A715772m1111l6163l0884k4798j8742j4081j1107q801o171l162j66K803
50503A523389O045R687J3594J7462K0817K3303K5244K7407K9991L2293L3852L5304
50491A798388L7554M0491M3215M5222M6720M8052M9423N0982N2578N3601N3703
50480B319929N3476N3856N5136N7060N9433O2052O4505O6920P0423P5855Q2390
50469C021035Q8521R4126J00383J07885J16105J24553J33020J40558J45792J48758
50459D220736J51009J53217J53733J50290J42170J30193J15524R9179Q1815O3117
$$ y = [3343229, 3305716, 3257198, 3197924, 3129985, 3055315, 2974321, 2886901, 2794031, 2697711, 2599984, 2502798, 2408363, 2318533, 2233737, 2153208, 2076375, 2003596, 1935530, 1872468, 1814586, 1762282, 1715772, 1674661, 1638498, 1607614, 1582816, 1564074, 1549993, 1538886, 1530085, 1523914, 1520752, 1520586, 1523389, 1529434, 1539121, 1552715, 1570177, 1590994, 1614297, 1639541, 1666948, 1696939, 1729232, 1763084, 1798388, 1835942, 1876433, 1919648, 1964870, 2011590, 2059642, 2109065, 2160047, 2212625, 2266226, 2319929, 2373405, 2427261, 2482397, 2539457, 2598890, 2660942, 2725447, 2792367, 2862790, 2938645, 3021035, 3109556, 3203682, 3304065, 3411950, 3528055, 3652608, 3785628, 3926186, 4071978, 4220736, 4371745, 4524962, 4678695, 4828985, 4971155, 5101348, 5216872, 5316051, 5397866, 5460983]
50449E460983M2190J9269l706k4831m3985o2072p9290r4834j07652j16691j20977
50438D868404j20398j16072j09101r9460q6807p2014n6776m1909k6962j1651L068
50427D130322J5515K4248K8478K8056K3344J4657J729j5791l6997n9238p9599
50416D074724r6966j12284j26383j37996j44755j46114j44277j41550j37818j31712
50406B754869j23606j15538j08192r9941q9801p9718p2327o7248o1411n3101m4126
50395A839860l7346l2997k8561k2096j4585q453m459j048L178P569J0768J3032
50383A724862J6046K0655K5811K9815L1796L2115L2160L3616L7026M0982M3699
50372B068583M5080M6278M7397M7320M5920M4654M4245M3368M0685L6861L3512
$$ y = [5460983, 5503173, 5522442, 5518736, 5493905, 5449920, 5387848, 5308558, 5213724, 5106072, 4989381, 4868404, 4748006, 4631934, 4522833, 4423373, 4336566, 4264552, 4207776, 4165867, 4138905, 4127254, 4130322, 4145837, 4170085, 4198563, 4226619, 4249963, 4264620, 4266349, 4250558, 4213561, 4154323, 4074724, 3977758, 3865474, 3739091, 3601095, 3456340, 3310226, 3165949, 3024399, 2886581, 2754869, 2631263, 2515725, 2407533, 2307592, 2217791, 2138073, 2065746, 1998498, 1937087, 1883986, 1839860, 1802514, 1769517, 1740956, 1718860, 1704275, 1695822, 1691363, 1690315, 1693493, 1701062, 1711830, 1724862, 1740908, 1761563, 1787374, 1817189, 1848985, 1881100, 1913260, 1946876, 1983902, 2024884, 2068583, 2113663, 2159941, 2207338, 2254658, 2300578, 2345232, 2389477, 2432845, 2473530, 2510391, 2543903]
50361B543903L1167K9535K8709K8675K8336K6576K4037K2634K3354K5600K8552
50350B841078L2095L6319M0954M5522M9463N2167N3469N3986N4276N3758N1189
50339C364276M6252M0035L3598K6657J8100P597l807j4941k6045l8445n2401o5973
50327C334903p6803q4691r1256r7137j00827j00656r6792r0514q2592p3187o2708
50316B377740n1855m1229l1460k3080j5639p795R20Q999J4461J6773J6402J3267
50304B277504P057j325j0074j8295k6374l4496m1905m7880n2349n5215n5979n4682
50292A885987n2487n0530m8673m6047m2729l9972l8502l7233l4405k9766k4967
50281A440676k1613j9765j8671j7967j7340j5843j2873r431p053n683m068j929
$$ y = [2543903, 2575070, 2604605, 2633314, 2661989, 2690325, 2716901, 2740938, 2763572, 2786926, 2812526, 2841078, 2873173, 2909492, 2950446, 2995968, 3045431, 3097598, 3151067, 3205053, 3259329, 3313087, 3364276, 3410528, 3450563, 3484161, 3510818, 3528918, 3536515, 3532708, 3517767, 3491722, 3453277, 3400876, 3334903, 3258100, 3173409, 3082153, 2985016, 2884189, 2783533, 2686741, 2596227, 2513635, 2440448, 2377740, 2325885, 2284656, 2253196, 2230116, 2214477, 2206682, 2207602, 2216601, 2231062, 2247835, 2264237, 2277504, 2284561, 2283236, 2273162, 2254867, 2228493, 2193997, 2152092, 2104212, 2051863, 1996648, 1940669, 1885987, 1833500, 1782970, 1734297, 1688250, 1645521, 1605549, 1567047, 1529814, 1495409, 1465643, 1440676, 1419063, 1399298, 1380627, 1362660, 1345320, 1329477, 1316604, 1307173, 1300120, 1294437, 1290369, 1288440]
50269A288440n0J931N607J0945J5421J7199J7522J8521K0148K1013K1132K1808
50257A459637K3467K5294K6708K7694K8083K7926K8125K9367L0706L0639K9163
50246A766809K7449K5850K3825K1507J9644J7907J5026J0824O670L525Q99j745
50234A938190l950n161n723o369p501r310j1845j4620j6958j8874k0811k2441
50222A794627k2831k2029k1328k1547k2047k2041k1829k2023k2358k2200k1772
50211A552622k2064k3598k5722k6981k6133k3171j9554j7034j6070j5723j4967
50200A321605j3552j1550q949o068l618j899m10J251K633L061K817L032M416O417
50186A299186P836Q173Q199Q954J0280J0814R711P814O619O394O040M611K230
$$ y = [1288440, 1288390, 1290321, 1295928, 1306873, 1322294, 1339493, 1357015, 1375536, 1395684, 1416697, 1437829, 1459637, 1483104, 1508398, 1535106, 1562800, 1590883, 1618809, 1646934, 1676301, 1707007, 1737646, 1766809, 1794258, 1820108, 1843933, 1865440, 1885084, 1902991, 1918017, 1928841, 1935511, 1939036, 1939935, 1938190, 1934240, 1929079, 1923356, 1916987, 1909486, 1900176, 1888331, 1873711, 1856753, 1837879, 1817068, 1794627, 1771796, 1749767, 1728439, 1706892, 1684845, 1662804, 1640975, 1618952, 1596594, 1574394, 1552622, 1530558, 1506960, 1481238, 1454257, 1428124, 1404953, 1385399, 1368365, 1352295, 1336572, 1321605, 1308053, 1296503, 1287554, 1281486, 1277868, 1275969, 1275559, 1276810, 1279443, 1282504, 1285321, 1288353, 1292769, 1299186, 1307022, 1315195, 1323394, 1332348, 1342628, 1353442, 1363153, 1370967, 1377586, 1383980, 1390020, 1394631, 1396861]
50173A396861l76k598m137n073n783o485o959p198p940r758j1838j2546j1329
50160A304841r295p753o913o191n012l204j149J90J23o73n66J112L201M165L909
50145A276785L587M025M884N325M958M000K812J564K78j104k798n038p498r155
50131A282625r363q929r350j0877j2243j2553j2511j3221j4772j6652j8588k0082
50119A123484k0100j8424j6609j6241j6710j6071j3717j0953r091q389q675r555
50107I58949r862q354n450l156k812l709m366m388m512n315o311o374n155m005
50093H85180m696o922q202p040n043m495n091m962m101m284n875p116o970o314
50079H04069n781m687l038k431l544m494l279n90J407K034K264K692K936K829
$$ y = [1396861, 1396485, 1393887, 1389750, 1384677, 1378894, 1372409, 1365450, 1358252, 1350312, 1340554, 1328716, 1316170, 1304841, 1295546, 1287793, 1280880, 1274689, 1269677, 1266473, 1265324, 1265514, 1265637, 1264964, 1264398, 1265510, 1268711, 1272876, 1276785, 1280372, 1284397, 1289281, 1294606, 1299564, 1303564, 1306376, 1307940, 1308218, 1307114, 1304316, 1299278, 1291780, 1282625, 1273262, 1264333, 1254983, 1244106, 1231863, 1219310, 1206799, 1193578, 1178806, 1162154, 1143566, 1123484, 1103384, 1084960, 1068351, 1052110, 1035400, 1019329, 1005612, 994659, 985568, 977179, 968504, 958949, 949087, 940733, 935283, 932127, 929315, 925606, 921240, 916852, 912340, 907025, 900714, 894340, 889185, 885180, 880484, 873562, 865360, 858320, 853277, 848782, 843691, 838729, 834628, 830344, 824469, 817353, 810383, 804069, 798288, 793601, 790563, 788132, 784588, 780094, 776815, 776225, 777632, 779666, 781930, 784622, 787558, 790387]
50065G90387K951L863N518P342Q610R125R729J1444J3829J5108J4361J2706J1672
50052I16645J1415J1259J1019J0827J0440R710R118Q958Q597P426N994N189M789
50039A031386L825K049J86j007j214l50J299K980M178N185O382P334P462P299
50025A076994Q048R904J1684J2381J2352J2583J3295J3844J3809J3649J4011J4789
50013A227343J5260J5181J5061J5277J5545J5719J6344J7687J8828J8774J7922
50002A408941J7357J7130J6580J6124J7061J9340K1047K0667J8804J7224J7117
49991A607392J8472K0100K0143J7850J5002J4094J4946J4886J2718J0387R729
49980A775719R616P919M754J950K84j086l039n767r002j1932j3595j4247j5423
$$ y = [790387, 793338, 797201, 802719, 810061, 818671, 827796, 837525, 848969, 862798, 877906, 892267, 904973, 916645, 928060, 939319, 950338, 961165, 971605, 981315, 990433, 999391, 1007988, 1015414, 1021408, 1026597, 1031386, 1035211, 1037260, 1037446, 1036439, 1035225, 1034875, 1036174, 1039154, 1043332, 1048517, 1054899, 1062233, 1069695, 1076994, 1085042, 1094946, 1106630, 1119011, 1131363, 1143946, 1157241, 1171085, 1184894, 1198543, 1212554, 1227343, 1242603, 1257784, 1272845, 1288122, 1303667, 1319386, 1335730, 1353417, 1372245, 1391019, 1408941, 1426298, 1443428, 1460008, 1476132, 1493193, 1512533, 1533580, 1554247, 1573051, 1590275, 1607392, 1625864, 1645964, 1666107, 1683957, 1698959, 1713053, 1727999, 1742885, 1755603, 1765990, 1775719, 1785335, 1793254, 1798008, 1799958, 1800242, 1799156, 1796117, 1790350, 1781348, 1769416, 1755821, 1741574, 1726151]
49967A726151j7555j8775j7539j5289j4736j6191j7407j6717j4597j2328j0617
49956A554400r514q500o756m253k184j394j048l0J240J879K524M449P211R180
49942A547204J0078J0891J1436J0327P699N734N714O422O310N566M996M393L292
49929A640062K157J574J127O8j531l231n082p218r197j0579j1521j2121j1885
49916A572623j0688r576r484r783r270q271q422j0328j2802j4771j6966k0744
49904A431518k5915l0524l2783l2674l1601l0878l0739l0609l0003k9041k8055
49893A098696k6900k5041k2470k0209j9413j9946k0359j9479j7682j6258j5868
49882H75071j5984j5677j4595j3260j2620j3076j3805j3477j1878j0281r715r522
$$ y = [1726151, 1708596, 1689821, 1672282, 1656993, 1642257, 1626066, 1608659, 1591942, 1577345, 1565017, 1554400, 1544886, 1536386, 1529630, 1525377, 1523193, 1521799, 1520751, 1520721, 1521961, 1523840, 1526364, 1530813, 1538024, 1547204, 1557282, 1568173, 1579609, 1589936, 1597635, 1603369, 1609083, 1615505, 1621815, 1627381, 1632377, 1636770, 1640062, 1642219, 1643793, 1644920, 1644988, 1643457, 1640226, 1635144, 1627926, 1618729, 1608150, 1596629, 1584508, 1572623, 1561935, 1552359, 1542875, 1533092, 1523822, 1515551, 1507129, 1496801, 1483999, 1469228, 1452262, 1431518, 1405603, 1375079, 1342296, 1309622, 1278021, 1247143, 1216404, 1185795, 1155792, 1126751, 1098696, 1071796, 1046755, 1024285, 1004076, 984663, 964717, 944358, 924879, 907197, 890939, 875071, 859087, 843410, 828815, 815555, 802935, 789859, 776054, 762577, 750699, 740418, 730703, 721181]
$$ [...]
##END NTUPLES=NMR SPECTRUM
##END=
