
##TITLE=AC1208_HCOAH12050_5973738_VScUvUcbtA
##JCAMPDX= 6.0         $$ Bruker NMR JCAMP-DX V2.0
##DATA TYPE= NMR SPECTRUM
##DATA CLASS= NTUPLES
##ORIGIN= BRUKER
##OWNER= Administrator
$$ 1.72 TOPSPIN		Version 2.1
$$ 2012-04-16 19:10:30.437 -0500  Administrator@TOPSPIN
$$ Compression mode = diff/dup
##.OBSERVE FREQUENCY= 400.13188235
##.OBSERVE NUCLEUS= ^1H
##.ACQUISITION MODE= SIMULTANEOUS (DQD)
##.ACQUISITION SCHEME= undefined
##.AVERAGES= 8
##.DIGITISER RES= 22
##SPECTROMETER/DATA SYSTEM= spect
##.PULSE SEQUENCE= zg30
##.SOLVENT NAME= COFFEE_meoh
##.SHIFT REFERENCE= INTERNAL, COFFEE_meoh, 1, 14.98061
##AUDIT TRAIL= $$ (NUMBER, WHEN, WHO, WHERE, PROCESS, VERSION, WHAT)
$$ ##TITLE= Audit trail, TOPSPIN		Version 2.1
$$ ##JCAMPDX= 5.01
$$ ##ORIGIN= Bruker BioSpin GmbH
$$ ##OWNER= Administrator
$$ $$ C:\Bruker\TOPSPIN/data/COFFEE/nmr/AC1208_HCOAH12050_5973738_VScUvUcbtA/10/pdata/1/auditp.txt
$$ ##AUDIT TRAIL=  $$ (NUMBER, WHEN, WHO, WHERE, PROCESS, VERSION, WHAT)
(   1,<2012-04-15 20:35:35.296 -0500>,<Administrator>,<TOPSPIN>,<go>,<TOPSPIN 2.1>,
      <created by zg
	started at 2012-04-15 20:34:28.078 -0500,
	POWCHK enabled, PULCHK disabled,
       configuration hash MD5:
       1A 1E CE 29 27 FD 77 03 67 4E F0 E3 C4 B2 CB 90
       data hash MD5: 64K
       C3 67 AB 35 48 79 F0 CC E5 59 39 F3 C0 37 D5 A0>)
(   2,<2012-04-15 20:35:38.062 -0500>,<Administrator>,<TOPSPIN>,<proc1d>,<TOPSPIN 2.1>,
      <Start of raw data processing
       efp LB = 0 FT_mod = 6 PKNL = 1 PHC0 = 0 PHC1 = 0 SI = 32K 
       data hash MD5: 32K
       3D FF 1C AB 99 9D 34 32 F9 EC 4A C3 71 57 31 F6>)
(   3,<2012-04-15 20:35:38.406 -0500>,<Administrator>,<TOPSPIN>,<proc1d>,<TOPSPIN 2.1>,
      <pk PHC0 = 208.9435 PHC1 = 0 
       data hash MD5: 32K
       33 1D BD F6 70 79 42 D8 DC A2 E9 0E C5 1F DB 9E>)
(   4,<2012-04-15 20:35:38.453 -0500>,<Administrator>,<TOPSPIN>,<proc1d>,<TOPSPIN 2.1>,
      <abs ABSG = 1 
       data hash MD5: 32K
       49 88 7C 5E 30 D5 54 58 B7 3D 4C D2 A6 75 03 E2>)
(   5,<2012-04-15 20:35:38.484 -0500>,<Administrator>,<TOPSPIN>,<proc1d>,<TOPSPIN 2.1>,
      <abs ABSG = 2 
       data hash MD5: 32K
       85 9F D7 0B 53 C3 BE 60 C4 D3 06 88 95 6A F7 B3>)
(   6,<2012-04-15 20:35:38.515 -0500>,<Administrator>,<TOPSPIN>,<proc1d>,<TOPSPIN 2.1>,
      <abs ABSG = 3 
       data hash MD5: 32K
       F0 29 8F E3 88 F0 23 B0 40 1B D7 67 A7 7C AA 46>)
(   7,<2012-04-15 20:35:38.546 -0500>,<Administrator>,<TOPSPIN>,<proc1d>,<TOPSPIN 2.1>,
      <abs ABSG = 4 
       data hash MD5: 32K
       C8 27 54 35 36 C1 02 3C A9 2F 7D 61 0A 45 5B 7F>)
(   8,<2012-04-15 20:35:38.578 -0500>,<Administrator>,<TOPSPIN>,<proc1d>,<TOPSPIN 2.1>,
      <abs ABSG = 5 
       data hash MD5: 32K
       BB C5 9D 54 2A 63 9A 02 19 11 D0 36 CE 8A FF 87>)
(   9,<2012-04-15 20:35:42.437 -0500>,<Administrator>,<TOPSPIN>,<audit>,<TOPSPIN 2.1>,
      <user comment:
       ICON-NMR User ID: COFFEE
       data hash MD5: 32K
       BB C5 9D 54 2A 63 9A 02 19 11 D0 36 CE 8A FF 87>)
$$ ##END=
$$ [...]
150 150 150 150 150 150 150 150
##$TP07= 0
##$TPNAME0= <>
##$TPNAME1= <>
##$TPNAME2= <>
##$TPNAME3= <>
##$TPNAME4= <>
##$TPNAME5= <>
##$TPNAME6= <>
##$TPNAME7= <>
##$TPOAL= (0..7)
0.5 0.5 0.5 0.5 0.5 0.5 0.5 0.5
##$TPOFFS= (0..7)
0 0 0 0 0 0 0 0
##$TUNHIN= 0
##$TUNHOUT= 0
##$TUNXOUT= 0
##$USERA1= <user>
##$USERA2= <user>
##$USERA3= <user>
##$USERA4= <user>
##$USERA5= <user>
##$V9= 5
##$VALIST= <valist>
##$VCLIST= <CCCCCCCCCCCCCCC>
##$VD= 0
##$VDLIST= <DDDDDDDDDDDDDDD>
##$VPLIST= <PPPPPPPPPPPPPPP>
##$VTLIST= <TTTTTTTTTTTTTTT>
##$WBST= 2048
##$WBSW= 25
##$XGAIN= (0..3)
0 0 0 0
##$XL= 0
##$YL= 0
##$YMAX_a= 489456
##$YMIN_a= -609821
##$ZGOPTNS= <>
##$ZL1= 120
##$ZL2= 120
##$ZL3= 120
##$ZL4= 120
##$ABSF1= 14.98061
##$ABSF2= -5.57192
##$ABSG= 5
##$ABSL= 3
##$ALPHA= 0
##$AQORDER= 0
##$ASSFAC= 0
##$ASSFACI= 0
##$ASSFACX= 0
##$ASSWID= 0
##$AUNMP= <proc_prof1d_extract_pilot.lims>
##$AXLEFT= 0
##$AXNAME= <>
##$AXNUC= <1H>
##$AXRIGHT= 0
##$AXTYPE= 0
##$AXUNIT= <>
##$AZFE= 0.1
##$AZFW= 0.1
##$BCFW= 0
##$BC_mod= 0
##$BYTORDP= 0
##$COROFFS= 0
##$CY= 15
##$DATMOD= 1
##$DC= 0
##$DFILT= <>
##$DTYPP= 0
##$F1P= 0
##$F2P= 0
##$FCOR= 0.5
##$FTSIZE= 32768
##$FT_mod= 6
##$GAMMA= 0
##$GB= 0
##$INTBC= 1
##$INTSCL= 1
##$ISEN= 128
##$LB= 0
##$LEV0= 0
##$LPBIN= 0
##$MAXI= 10000
##$MC2= 0
##$MEAN= 0
##$ME_mod= 0
##$MI= 0
##$NCOEF= 0
##$NC_proc= -8
##$NLEV= 6
##$NOISF1= 0
##$NOISF2= 0
##$NSP= 0
##$NTH_PI= 0
##$NZP= 0
##$OFFSET= 14.98061
##$PC= 1
##$PHC0= 208.9435
##$PHC1= 0
##$PH_mod= 1
##$PKNL= yes
##$PPARMOD= 0
##$PPDIAG= 0
##$PPIPTYP= 0
##$PPMPNUM= 2147483647
##$PPRESOL= 1
##$PSCAL= 4
##$PSIGN= 0
##$PYNMP= <proc.py>
##$REVERSE= no
##$SF= 400.13
##$SI= 32768
##$SIGF1= 0
##$SIGF2= 0
##$SINO= 400
##$SIOLD= 32768
##$SPECTYP= <>
##$SREGLST= <1H.CDCl3>
##$SSB= 0
##$STSI= 32768
##$STSR= 0
##$SW_p= 8223.68421052632
##$SYMM= 0
##$S_DEV= 0
##$TDeff= 65536
##$TDoff= 0
##$TI= <>
##$TILT= no
##$TM1= 0
##$TM2= 0
##$TOPLEV= 0
##$USERP1= <user>
##$USERP2= <user>
##$USERP3= <user>
##$USERP4= <user>
##$USERP5= <user>
##$WDW= 1
##$XDIM= 32768
##$YMAX_p= 456408345
##$YMIN_p= -704247
##$CURPLOT= <Network HP LaserJet P1505>
##$CURPRIN= <$Network HP LaserJet P1505>
##$DFORMAT= <normdp>
##$LAYOUT= <+/1D_H.xwp>
##$LFORMAT= <normlp>
##$PFORMAT= <normpl>
##$SURQMSG= 1
$$ End of Bruker specific parameters
$$ ---------------------------------
##NTUPLES= NMR SPECTRUM
##VAR_NAME=  FREQUENCY,     SPECTRUM/REAL,   SPECTRUM/IMAG
##SYMBOL=    X,             R,               I
##VAR_TYPE=  INDEPENDENT,   DEPENDENT,       DEPENDENT
##VAR_FORM=  AFFN,          ASDF,            ASDF
##VAR_DIM=   32768,         32768,           32768
##UNITS=     HZ,            ARBITRARY UNITS, ARBITRARY UNITS
##FACTOR=    0.250966925370066, 1,           1
##FIRST=     8223.43324360095, 86070,        -110608
##LAST=      0,             -151605,         -24898
##MIN=       0,             -704247,         0
##MAX=       8223.43324360095, 456408345,    0
$$ Real data points
##PAGE= N=1
##DATA TABLE= (X++(R..R)), XYDATA
$$ [...]
19475a29958A73066D8029b37661H5884C0401b78894a00122l72593J57541E9959
19464i8681H3049a72988p1290K2364j17168Q6371G4974a82873I8062O9383a36256
19452b16269b2244B08726a2313k35557F6540d28628e1129j68921E4261a30879
19441B5293J41497a62507A03638c88774J91540A5900b4186B15028b23326J7016
19431b06310h9836k91137i6154M3252m3374j85012b1347B51703j20245e3981G97
19419b08972K4608Q8574D7017b20542a377k58975d3749j11285j31732a1845A05448
19407c73848k934J39470N3851O51A30088n9180O2761d1504k45181J01010O2686
19396a22989b1160A53054b36858m3287g6823j07519a9043H480a53783h806K9q5285
$$ y = [-129958, 173066, 48029, -237661, 85884, 30401, -278894, -100122, -472715, -315174, 59959, -98681, 83049, -172988, -244278, -221914, -339082, -252711, 74974, -182873, 98062, 167445, -136256, -216269, -22244, 208726, -12313, -247870, 66540, -428628, -51129, -220050, 54261, -130879, 25293, 166790, -162507, 103638, -388774, -197234, 15900, -24186, 215028, -223326, -206310, -89836, -380973, -96154, -52902, -96276, -281288, -21347, 251703, 131458, -53981, 797, -208972, -184364, -95790, 47017, -220542, -1377, -260352, -43749, -155034, -286766, -11845, 105448, -373848, -376782, -237312, -183461, -182810, 130088, 70908, 133669, -41504, -286685, -185675, -122989, -21160, 153054, -236858, -280145, -76823, -184342, -19043, 8480, -153783, -8806, -8777, -94062]
19384i4062C59010d14591e2102B08060E2084j9583I946i076B92395a76111A27431
19372h1497K9008k4188j06732k6962A79059C6673j6716e9817o9314A81741c8797
19360E3193a14932j09376e2474j04018N7470k01551A12242b24674G9821b51221
19349A70344a97760j87858a74342A624d8365k65142j3785B1513N3602b0277D4519
19337B9263a04809m9214l329c1832A91586b41692P9008j99622J73869A0956M3461
19326E4417e7545l5152B48899h019k4227A97908c21045d9525n7205j0593D48539
19314A31196b38748c9377n6182M1191q7212O1185j338k40960i4345E0692L3893
19303H4585a01938k0638C94938i1593A95113H1459c27531A72966c24040a18523
$$ y = [-94062, 359010, -414591, -52102, 208060, 52084, 32501, 9946, -9076, 292395, -176111, 127431, -81497, -52489, -76677, -183409, -210371, 179059, 36673, 19957, -59817, -129131, 181741, -38797, 53193, -114932, -224308, -52474, -156492, -99022, -300573, 112242, -224674, 79821, -251221, 170344, -197760, -385618, -174342, 1624, -48365, -313507, -327292, 21513, 75115, -20277, 44519, 29263, -104809, -154023, -157352, -31832, 191586, -241692, -162684, -362306, -188437, 10956, 54417, -57545, -92697, 248899, -8019, -32246, 197908, -321045, -49525, -106730, -117323, 448539, 131196, -238748, -39377, -95559, -54368, -141580, -80395, -81733, -322693, -94345, 50692, 84585, -101938, -122576, 394938, -91593, 195113, 81459, -327531, 172966, -324040, -118523]
19292b09764a5896j69307m7622A87617l050c76939c3527A10544a36778f6123k99189
19281c65312A28224j5899c07005a1995C0868K71825e7267A17326c34745a54749
19270a7210l21857M6821e80A32857g9575l8999G412i4859M2105A17799a57991
19258A95427E0279b12232h2641l1503F6612f3069c0821A02578B6534R0371c77398
19246a37448J2391A56950b72083I8143a80473J7672m3076j3540O341G050b1062
19234c64725a10746j872l272K2387A6339d634C57235C3659J01198a93041g6228
19222a44241m09758A679a4908q6023l0157d3925q6340M3571E6505b15954B7004
19210A55789a65753j42958A43979p074h444j37626n4716d829D4295b05561a2880
$$ y = [-209764, -15896, -185203, -232825, 187617, 184567, -376939, -33527, 110544, -136778, -66123, -365312, 128224, 112325, -307005, -11995, 30868, 302693, -57267, 117326, -334745, -154749, -17210, -339067, -292246, -580, 132857, -79575, -118574, 7412, -94859, -52754, 117799, -157991, 195427, 50279, -212232, -82641, -114144, 66612, -63069, -30821, 102578, 26534, 116905, -377398, -137448, -125057, 156950, -272083, 98143, -180473, -162801, -205877, -219417, -213076, 7050, -21062, -364725, -110746, -112618, -115890, -93503, 16339, -4634, 357235, 33659, 134857, -193041, -76228, -144241, -553999, 1679, -14908, -100931, -131088, -43925, -130265, -86694, 56505, -215954, 27004, 155789, -165753, -308711, 143979, 136905, -8444, -146070, -200786, -4829, 44295, -205561, -12880]
19198d12949D1664o834M6660D725K50204C408R0270h8436J9524E7258K32291b95334
19185b0790E8187r440Q0263L07087c9391B1043M716g3529k0457p5906b0725A4524
19172c7397j40965h556r5494K5530q7074j5718l181M8130j2963k05373a03182
19160C3749b57034C4872i5972C14116d1169o9824A38917a32175j78040B34432
19149a05773m0270k057p1449B5389c44879F1583a87251C1970a42914o3753b6111
19137a13728n1875e0905K3532l702I7771R3577g8305j24930A40936a08744A17437
19125c13348B81580b84016C16192b7670q8188A11370J88241c17596a35905A60684
19114A2589a48964j5599j7769j34780O8117b5638A17632K39266a36773f2294B6328
$$ y = [-412949, 41664, 34830, 81490, 4725, 254929, 3408, 93678, -88436, -68912, 57258, 289549, -295334, -20790, 58187, 48747, 129010, 436097, -39391, 21043, 25759, -73529, -93986, -169892, -20725, 14524, -37397, -178362, -8556, -104050, -78520, -165594, -181312, -184493, -136363, -149326, -354699, -103182, 33749, -257034, 34872, -95972, 314116, -41169, -110993, 138917, -132175, -310215, 234432, -105773, -146043, -148100, -219549, 25389, -344879, 61583, -187251, 31970, -142914, -206667, -26111, -113728, -165603, -50905, -27373, -31075, 97771, 191348, -78305, -203235, 140936, -108744, 117437, -313348, 281580, -284016, 316192, -27670, -115858, 111370, 299611, -317596, -135905, 160684, 12589, -148964, -164563, -182332, -317112, -248995, -25638, 117632, 356898, -136773, -62294, 26328]
19102C947A468J1305a95097f8895k8052j0995j11933r7097a45958j32312B28241
19090H7548b24623D1562a33648e1370E6577g5384o878A279b41410a05525l6251
19079a41776g736G8875c6497k99690C870a80914E4730a00698L2006n5677C39616
19067h2162j5069M8074j14879B092a73621P6159F4474J74933B1935a40156a1866
19055A14923i376B42014D1386f1349H646a6585j3511A94340A5872b04549A37274
19043B13627a06822m8147L9945k19639A99202A1530b6834b372k34865N8438N0081
19032a28718j61193G4596K6853b39820H2824B6806a65451a4365m30233f6288m62650
19021e28938b19892M214O8429k13777B07038b30397A5888R4645a43363A58949
$$ y = [3947, 1468, 12773, -195097, -68895, -96947, -107942, -219875, -316972, -145958, -278270, 228241, 87548, -224623, 41562, -133648, -51370, 56577, -75384, -82262, 1279, -241410, -105525, -141776, -7736, 78875, -36497, -336187, 3870, -180914, 54730, -100698, -68692, -124369, 339616, -82162, -97231, -49157, -164036, 2092, -173621, -97462, 64474, 239407, 21935, -140156, -11866, 114923, -9376, 242014, 41386, -61349, 8646, -16585, -30096, 194340, 15872, -204549, 137274, 213627, -106822, -154969, -115024, -334663, 199202, 11530, -26834, -2372, -237237, -178799, -128718, -289911, 74596, 101449, -239820, 82824, 26806, -165451, -14365, -444598, -66288, -528938, -219892, -215678, -147249, -361026, 207038, -230397, 15888, 110533, -143363, 158949]
19010a43211F1405j995e7099a0787n95782a07696B35472e2833l3559j88637J33172
18999a41857j69778j68735D9979c4849j52619f0440a9401l839C71951j68600b43037
18987A47253k9130E855d2782q9892r0285A59538K58496A04812c1339D8842c01850
18975g400k01275E9106J85222F5238a59283B7751b50820E0669K16480f03j07123
18964a07726p4513B9525N335c83649B24177q4727J36613J81995A78401K54983
18954D33384H6545K54352j24490b2586A56630a97512a3437B17922I4699h3335
18943b32324h3678k25022a42227j80709E2752d9281C4471a01924C0987R0291c1516
18931a34655d3612F2667J07862a70925D31635a17497B2918e7273j16660e0029
$$ y = [-143211, 61405, 59410, -57099, -10787, -606569, -107696, 235472, -52833, -86392, -275029, -141857, -311635, -480370, 49979, -34849, -187468, -60440, -19401, -23240, 371951, 203351, -243037, 147253, 118123, 5855, -42782, -132674, -222959, 159538, 418034, 104812, -31339, 48842, -301850, -7400, -208675, 59106, 244328, 65238, -159283, 27751, -250820, 50669, 267149, -603, -107726, -182239, 29525, 34860, -383649, 224177, 139450, 276063, 458058, 178401, 433384, 86545, 340897, 216407, -22586, 156630, -197512, -13437, 217922, 94699, -83335, -232324, -83678, -308700, -142227, -322936, 52752, -49281, 34471, -101924, 30987, 121278, -31516, -134655, -43612, 62667, 170529, -170925, 431635, -117497, 22918, -57273, -173933, -50029]
18920a15184C34908a33025A11663n0218a27789B10291a59885k06535d9003m5974
18910i4977k32418A0092a08966d1288C5322f5679l24682a28458M8090B92416a71457
18898b30499a8473A79029J75624J79722j17679L44488B10124D3238b25424e9119
18887d57112A2566a58997A23824m143b58396D3750a44757B0140N3620j2004f5582
18875b8034p1419A80021C7058b55782a7085r5245J9694J4951C6143a35730N3334
18864h2396B43121a1178j17929H1534c06898A81571A370f8881A51224D9999a00431
18852C44722d32134a61185n7662g3475k23087F3581J05550b73619k12075c9557
18841a8050j06666a3567l3103r6784A14934D9002a28674f1894F536a27289A55418
$$ y = [-115184, 334908, -133025, 111663, 61445, -127789, 210291, -159885, -366420, -49003, -94977, -327395, 10092, -108966, -41288, 35322, -65679, -390361, -128458, -80368, 292416, -171457, -230499, -18473, 179029, 354653, 534375, 416696, 761184, 210124, 43238, -225424, -59119, -457112, 12566, -158997, 123824, 119681, -258396, 43750, -144757, 20140, 73760, 61756, -65582, -28034, -99453, 180021, 37058, -255782, -17085, -112330, -92636, -77685, 36143, -135730, -82396, 243121, -11178, -129107, 81534, -306898, 181571, 1370, -68881, 151224, 49999, -100431, 344722, -432134, -161185, -218847, -73475, -296562, 63581, 169131, -273619, -485694, -39557, -18050, -124716, -13567, -46670, -143454, 114934, 49002, -128674, -61894, 6536, -127289, 155418]
18829G1200A4193b03682A1156d7831B34931e2254j31198L9717D8031b6509m01667
18818d28176J76900a09672k86129J66541j56584C0065J22213f950A42694D2433
18807A44093f5268A40525D802h3457B24619B9781h8439B34465G2200h0152j24373
18796b04525A78996J67446A46426M7764l2877a00588a9375j99281A19712a53008
18785E1170K06988a77643A1733b95237G2927K31540a3728D2835a62579K9335D5340
18773a53800d6495l84523c8613I4727a57073e1759B53294a10167j2340d9045r929
18762e8974J1259C8483g4505A34139b63570d8970A21984a6084j21586l3249L3061
18751a37858m5373e2963N625j50799A16145N1934J69826c25494A32561L0146a32613
$$ y = [71200, 14193, -203682, 11156, -47831, 234931, -52254, -183452, -143735, 48031, -26509, -428176, -251276, -109672, -395801, -229260, -385844, 30065, 152278, -6950, 142694, 42433, 144093, -65268, 140525, 4802, -83457, 224619, 29781, -88439, 234465, 72200, -80152, -204525, 178996, 346442, 146426, 194190, 161313, -100588, -19375, -218656, 119712, -153008, 51170, 258158, -177643, 11733, -295237, 72927, 304467, -13728, 42835, -162579, -133244, 45340, -153800, -46495, -431018, -38613, 94727, -157073, -51759, 253294, -110167, -122507, -49045, -58974, -47715, 38483, -74505, 134139, -263570, -48970, 121984, -16084, -137670, -170919, -137858, -183231, -52963, -47338, -198137, 116145, 168079, 337905, -325494, 132561, 162707, -132613]
18739D7571o33g9538n3924K7877k85862J8184h5756C3746a21891m1578B158a52723
18726C2658K3926k5262h7533j26305j71740R4993j13032C43913b22141d2733q9171
18715a31904b3220k10271A10882O9363b71234K4482l9121B99813a84300C6674
18704A77899p5397a07696F5848a8826k6465p0570L9244j53651N7830b3730n1893
18693g5623l97328g7010A43626F4234M8239n05f7527k19942I6159b06808G9289
18681b32321F3607c1428B96021j24029h9468j47993a07884A00677e32048a00176
18670d3532B15370q2170a69622G4277J89210c2421G7668g4729j95111i8860j20764
18659b19624d9958j71978I9261J32868G5256M4170B9358b66011o4986A55862f9863
$$ y = [47571, 46938, -79538, -133462, -105585, -391447, -373263, -85756, 33746, -121891, -163469, 2158, -152723, 32658, 56584, 31322, -87533, -213838, -385578, -290585, -403617, 343913, -222141, -42733, -131904, -23220, -233491, 110882, 180245, -271234, -246752, -285873, 299813, -184300, 36674, 177899, 102502, -107696, 65848, -18826, -45291, -115861, -76617, -230268, -172438, -23730, -75623, -472951, -77010, 143626, 64234, 112473, 111968, -67527, -287469, 96159, -206808, 79289, -232321, 63607, -31428, 296021, 171992, -89468, -237461, -107884, 100677, -532048, -100176, -43532, 215370, 133200, -169622, 74277, 263487, -32421, 77668, -74729, -269840, -98860, -219624, -49958, -221936, 99261, 232129, 75256, 119426, 29358, -266011, -330997, 155862, -69863]
18647a34083E2642a15857j4763m1075A90063a86720R494C5352b28103A0624d4488
18635a12979k28811B15019G6638J74226a65833F181a91515A81281i5207d3517
18624B88643F2203h5600L4826j07208o9236Q3405F9037B0932M5096a2005C1845
18612b61044A41117a64953A34397c0381B2932g541j05055k06285C0099a33017
18601A52429b07978O0673A12001a01536I0039a69088l4269G1740b83822h7747
18590b79081H4386a35661C53512b03908J6415B71387i4864E6830g6021B35809
18579A47311e7757B73095g6644o1508C06804c5458p3917d7383B84727a38562D0850
18567e8663A50788b09596b1659A83935L062a24072E2985b01770Q5992j3767r9103
$$ y = [-134083, 52642, -115857, -130620, -171695, 190063, -186720, -177226, 35352, -228103, 10624, -44488, -112979, -341790, 215019, 76638, 250864, -165833, 6181, -191515, 181281, -95207, -43517, 288643, 62203, -85600, -50774, -157982, -227218, -143813, 69037, 20932, 66028, -12005, 31845, -261044, 141117, -164953, 134397, -30381, 22932, -7541, -112596, -318881, 30099, -133017, 152429, -207978, -147305, 112001, -101536, 90039, -169088, -203357, 71740, -283822, -87747, -279081, 84386, -135661, 353512, -203908, -187493, 271387, -94864, 56830, -76021, 235809, 147311, -57757, 273095, -76644, -138152, 306804, -35458, -109375, -47383, 284727, -138562, 40850, -58663, 150788, -209596, -21659, 183935, 186997, -124072, 52985, -201770, -115778, -129545, -228648]
18556b28648A06388J9839d5947i344k42657j8478N1335C02277G0822a49298H6001
18544C2985a07395q258A9269b14658A26040c68562a33310E0571M5553a48578a0577
18532g0733j02523A23413n5120c2378H3245a97348L7886R796R109j22271A41537
18520h3521c0856D0953a60794j47106G7463A8395a53417H8253e1022J1770n2228
18509i1480j15440B15476a02823F239K508d6941j2614j05635M8575j01776B19624
18497B21529J21994F7161a05931k7610B2547I261K56919c2206j55725N2519b7094
18485F9312a17002B86410b81877H750P6817b65615a12892l3781L8417A50995n0258
18474A00737a16991d4901l58327a77475C400b43992J20458j42246R1805k74267
$$ y = [-228648, 106388, 126227, -45947, -9344, -252001, -270479, -219144, 302277, 70822, -149298, 86001, 32985, -107395, -115653, 19269, -214658, 126040, -368562, -133310, 50571, 96124, -148578, -10577, -70733, -173256, 123413, 68293, -32378, 83245, -197348, -159462, -149666, -140557, -262828, 141537, -83521, -30856, 40953, -160794, -307900, 77463, 18395, -153417, 88253, -51022, -39252, -91480, -206920, 215476, -102823, 6239, 8747, -46941, -59555, -165190, -116615, -218391, 219624, 221529, 343523, 67161, -105931, -133541, 22547, 9261, 266180, -32206, -187931, -135412, -27094, 69312, -117002, 286410, -281877, 8750, 85567, -265615, -112892, -146673, -108256, 150995, 100737, -116991, -44901, -403228, -177475, 3400, -243992, -123534, -265780, -173975, -448242]
18464d48242d0560E2479d20896B00062c286l5982j6081j74117A90704d16470f6207
18452B69258G3505a79590n3J9381C34713f66764b8229j74985g2777A49918a09200
18440A49478b10971j0782H945b43986I8034d48697G3569J8400a80833n0513n8454
18429b89800a43484A31351k5620A2962f9718p1413e009D37088B2805M847L9333
18418F6985c25302B99777d3030G83J72171a71006C6110c36115B30513j00278O0839
18407A91074f1709l3089k6152j97729E6035Q4416E8631B8002K5118g8688q7615
18396a66303e2443l13748A95188O8083g4576j6426c8005J0199C01670H8478g373
18384B04774a24526A47877a91528I3869g625j60048Q1560b5128F8700O9239L37150
$$ y = [-448242, -40560, 52479, -420896, 200062, -3286, -39268, -55349, -229466, 190704, -416470, -66207, 269258, 73505, -179590, -179643, -160262, 334713, -666764, -28229, -203214, -72777, 149918, -109200, 149478, -210971, -221753, 8945, -243986, 98034, -448697, 73569, 91969, -180833, -231346, -289800, -143484, 131351, 105731, 12962, -69718, -141131, -5009, 437088, 22805, 27652, 66985, -325302, 299777, -43030, 783, 172954, -171006, 36110, -336115, 230513, 130235, 191074, -61709, -94798, -120950, -318679, 56035, 140451, 58631, 28002, 53120, -78688, -166303, -52443, -366191, 195188, 263271, -74576, -91002, -38005, -27806, 301670, 88478, -7373, 204774, -124526, 147877, -191528, 93869, -7625, -167673, -86113, -25128, 68700, 137939, 475089]
18373D75089e1304q277B45925i8619K0191L758k998h39j58532A01576C9456c567
18360c73476a19090A28289D9988a41760F1685J75413n6755L979D4466b31311A76978
18348b36769k0249B5536J29141c8185A46132c55989C601a30429I2873D6343a17815
18336C0105K6072b12674H269Q3264b72377A90532h1313k46379b170k5647k345
18325c0162E2466D603K1687b24829f5452j219l8852G1542a26584A4697M7118h6657
18312a53821A39209N2471d6223j12716d9267j43k15955p9979h1104I0849b94346
18300c7302k97348I777b71110A66246f1027D3253C324h8687r800a8372q6183A79831
18287D7211b31112C23181a06399E2184J9982J06542J16178M8974d11678D7165
$$ y = [475089, -51304, -59581, 245925, -98619, -78428, -74670, -77668, -839, -159371, 101576, 39456, -3567, -373476, -119090, 128289, 49988, -141760, 61685, 237098, 180343, 184322, 44466, -231311, 176978, -236769, -257018, 25536, 154677, -38185, 146132, -355989, 3601, -130429, 92873, 46343, -117815, 30105, 56177, -212674, 8269, 91533, -272377, 190532, -81313, -327692, -2170, -27817, -30162, 52466, 4603, 26290, -224829, -65452, -66671, -105523, 71542, -126584, 14697, 61815, -86657, -153821, 139209, 191680, -46223, -158939, -49267, -49410, -265365, -345344, -81104, 90849, -294346, -37302, -334650, 9777, -271110, 166246, -61027, 43253, 3324, -88687, -98487, -18372, -104555, 179831, 47211, -231112, 323181, -106399, 52184, 72166, 178708, 294886, 343860, -411678, 47165]
18276c38154J47868A7688J40346A2206g6240L2825k28649J24624c3577e466j91349
18265a96815A65392b30655A97575J31360j61546A0212J53936e1636j3965A0893
18254c35473a61919n3287B5972M0198a89012A36555f8231j14196j5416i3242A63578
18242f0992A0528O852J40317b24831C5971n841a79660j143m843A95598L678I3815
18229a21513e2065J1000p4935B20477o6376a73428g3291J5633E7138b06810A04199
18217a47930L5418D7312i1060j46818C8251N4896j3484R3222N51a7482j29774
18206a47256D2912J02941c32826p6920J08247A00253a01485l8168N3959o2016
18196a47710A70170C8766O6125f9203I2605N5501b88452A72834b41815B56878
$$ y = [-338154, -190286, 17688, 158034, 12206, -76240, -43415, -272064, -147440, -33577, -5466, -196815, 165392, -230655, 197575, 328935, 167389, 10212, 164148, -51636, -65601, 10893, -335473, -161919, -215206, 25972, 66170, -189012, 136555, -68231, -182427, -197843, -93242, 163578, -60992, 10528, 17380, 157697, -224831, 35971, 30130, -179660, -180803, -185646, 195598, 199276, 93815, -121513, -52065, -41065, -116000, 220477, 154101, -173428, -73291, -57658, 57138, -206810, 104199, -147930, -112512, 47312, -91060, -237878, 38251, 93147, 79663, 172885, 173436, -17482, -147256, 42912, 145853, -332826, -409746, -301499, 100253, -101485, -139653, -85694, -147710, 170170, 38766, 104891, -69203, 92605, 148106, -288452, 172834, -241815, 256878]
18185E8857N6453a0716D35567g6509A24057l6276a17373l51029c2902j29314L1095
18174a31121j28442g7324b3738j07891C8828g2003j27506b0229l3779D1029b42553
18162D75953c2895n434j23105l5435P8174I3102a92310j31084a23436a4537A46510
18150b941r5865f016j2613B9512b49642B6593J20255a41373d6579r4976F2342
18138a44941j07132e3460l83020g1847I510Q0125J59185b13327A890a48087j13470
18127b61557c9787E1882a20670n5493A89970a74375A01473e4899A63547B9878
18116e4195C09948e9194p6801C1675a8922l2227A29008b46169J12598A11195c78977
18104c00914C66487b22238A82822n2202c22322B34111b27735Q1403A76847C4074
$$ y = [58857, 115310, -10716, 435567, -76509, 124057, 87781, -117373, -468402, -32902, -162216, -131121, -259563, -77324, -23738, -131629, 38828, -72003, -199509, -20229, -54008, 41029, -242553, 475953, -32895, -38329, -161434, -196869, -118695, 93102, -192310, -323394, -123436, -14537, 146510, -2941, -98806, -6016, -18629, 29512, -249642, 26593, 146848, -141373, -46579, -141555, 62342, -144941, -252073, -53460, -436480, -71847, 9510, 89635, 248820, -213327, 1890, -148087, -261557, -39787, 51882, -120670, -176163, 189970, -174375, 101473, -54899, 163547, 29878, -54195, 309948, -59194, -135995, 31675, -18922, -51149, 129008, -246169, -133571, 111195, -378977, -300914, 366487, -222238, 182822, 130620, -322322, 234111, -227735, -146332, 176847, 34074]
18093a96203d5593A63370G061i9677l35356a82889J4661m90A26369a00036j41511
18082b41547f709q1901C78698A58534a56422A55411L0447a73118a771k10483k9721
18071b41975b062B76267a1243A78733J12811I8069A4081E506J2617K0971J80528
18060B19622b9749k33320E782c8497F991K2232J37032J37620c37233e4126G9971
18048a22689C08485b0861B65680A8274a74932p976B60420j20861P3498n6737a63966
18036a39667A06384M603c39385H7158b02601A12194a45514f2284j03360E7989
18025A26319e1953j76296B15284B6103a13722B16503d6951n63453G077c1076l834
18014c4910A07758c9696I3496b24724n4939F2876P4859i7530D2133b18929D610
$$ y = [-196203, -45593, 163370, 7061, -99677, -435033, -182889, -168228, -168718, 126369, -100036, -241547, -6709, -88610, 378698, 158534, -156422, 155411, 185858, -173118, -1771, -212254, -241975, -2062, 276267, -11243, 178733, 291544, 98069, 14081, 5506, 18123, 39094, 219622, -29749, -263069, 5782, -38497, 6991, 29223, 166255, 303875, -337233, -54126, 79971, -122689, 308485, -20861, 265680, 18274, -174932, -182908, 260420, 139559, 213057, 156320, -163966, -139667, 106384, 110987, -339385, 87158, -202601, 112194, -145514, -62284, -165644, 57989, 126319, -51953, -228249, 215284, 26103, -113722, 216503, -46951, -610404, 7077, -31076, -34910, 107758, -39696, 93496, -224724, -279663, 62876, 137735, -97530, 42133, -218929, 4610]
18002A3131c0527D24116b3347A2334K23582G6579l2316b09546a7348A85448A1487
17990B59796a24625B74669b48225D2166N5431P7647a7309B2931g4706A78963h861
17978A22462k9224m2463J63812i9504B59225b12663i823D3900h0617L1476H2850
17966B22919d96687C2077M9230a9324l4027C91282g9070B42332Q2941G9554R3612
17955A73166b03327j74999A21988J10882b60595B30674b53919R6038B26962a34107
17944a2438k78498D25994c0959E3813O9727d293A73745d5743j94743B72443O0765
17933C33208A06008b73034d7180j01118A62857b9390A44341c139k02711k9726
17923b35576g3663k3096A62193b37041B04734g8685k06191a4054j68303c9668
$$ y = [13131, -30527, 424116, -23347, 12334, 235916, 76579, 44263, -209546, -17348, 185448, 11487, 259796, -124625, 274669, -248225, 42166, 97597, 175244, -17309, 22931, -74706, 178963, -8861, 122462, 93238, 50775, 214587, -99504, 259225, -212663, -9823, 43900, -80617, -49141, 82850, 222919, -496687, 32077, 81307, -19324, -53351, 391282, -79070, 242332, 325273, 79554, 173166, -203327, -378326, 121988, 232870, -260595, 230674, -253919, -157881, 226962, -134107, -12438, -290936, 425994, -30959, 53813, 123540, -4293, 173745, -45743, -240486, 272443, 333208, 106008, -273034, -47180, -148298, 162857, -29390, 144341, -3139, -205850, -235576, -73663, -96759, 162193, -237041, 204734, -78685, -284876, -14054, -182357, -39668]
17912a09805B51763G3550J39448a02418k42593a48585B0797c9036m6217C77957
17901g6573j72571A04303n0878M7100J8226E6480F977N4826B4122e2387I1383
17889a46622H4671L90a24762a0580k7897A51875C2982c5135D9127A5543K24426
17878B39969a49098A8764a8499j09793M6726B23545D6584J47579m3634B0748a57288
17866C35885a09870A0716a68056j35178A52618J6304g0447A5898Q3358g8402m42810
17855e21212C1809P4075b94072B62229o5080a27051l4128k30231D7879b1386k21318
17844b42704H8174M1579b62306A0138c20614D8027g7744j02247c7652C72997b00355
17832e12992B99237A17199b36304L5118B90083P552b58026k6496h7913E2697a25466
$$ y = [-109805, 251763, 73550, 212998, -102418, -345011, -148585, 20797, -39036, -85253, 377957, -76573, -249144, 104303, 53425, 100525, 118751, 56480, 6977, 61803, 24122, -52387, 91383, -146622, 84671, 85061, -124762, -10580, -38477, 151875, 32982, -35135, 49127, 15543, 239969, -149098, 18764, -18499, -128292, -81566, 223545, 46584, 194163, 150529, 20748, -157288, 335885, -109870, 10716, -168056, -303234, 152618, 168922, -70447, 15898, 99256, -78402, -521212, 31809, 105884, -294072, 262229, 197149, -127051, -161179, -391410, 47879, -21386, -242704, 88174, 129753, -262306, 10138, -320614, 48027, -77744, -179991, -37652, 372997, -200355, -512992, 299237, 117199, -236304, -201186, 290083, 297635, -258026, -284522, -87913, 52697, -125466]
17820A26115K01820b01696E0739N317a2271p8251D5683p647i2255A84869i2891
17808A00866e9026J8355A04613k0566J79227P7571a44879M9368k59401J57919
17798a96993A81084a53318A69994O1468a02704N05D3066a07398j24268D0909Q2450
17787A23359g1152H1562a21207A05156D9301e0876B44452l2252b34688f2798A25198
17775C20266p3114J78130k01687j6520H3244N6642d7261C0299i5625A18831O1726
17764A80557e1872A57446a2414o7933a1131B95738j05538K7582F1044K27216A32288
17752a61070D4177K15483d36C3413f2694A31818g218k97697f7937l51312E5835
17740b6380k29646A37671M1441b1006D8601J0806e8429B03252J27133H9078b52400
$$ y = [126115, 327935, -201696, 50739, 56056, -12271, -90522, 45683, 38036, -92255, 184869, -92891, 100866, -59026, -40671, 104613, 84047, 263274, 340845, -144879, -95511, -354912, -196993, 181084, -153318, 169994, 231462, -102704, -102199, 43066, -107398, -231666, 40909, 123359, -71152, 81562, -121207, 105156, 49301, -50876, 244452, 212200, -234688, -62798, 125198, 320266, 247152, 425282, 223595, 207075, 83244, 139886, -47261, 30299, -95625, 118831, 180557, -51872, 157446, -12414, -80347, -11131, 295738, 190200, 217782, 61044, 288260, 132288, -161070, 44177, 259660, -436, 33413, -62694, 131818, -7218, -304915, -67937, -419249, 55835, -26380, -256026, 137671, 179112, -21006, 48601, 59407, -58429, 203252, 330385, 89078, -252400]
17728a38021L6583b5724d593A96343M7604P5166B7499a6329C3073b71841D12128
17716b097k2793A84644J16883D9657R2453E5463K8071K18991G5710a24086A27098
17704C4919a51259B91264A37934J75936q78A13213l2703J02869Q5825o6224F4251
17692E9982B9782O4203O2578k7018D4210i4467j09195e1503j47774D65304a10872
17680B28621B8066b7810C96533A77643O825H010L52723d5122k88414A46698A7721
17668B95871j00793j7501n7015J01318o1260E4558J03052f7883j33997C32038
17657d47809a32906H6388K68517h192I1271B3144J36189D9710J30967l8255c03152
17645D3750N7969J1780E0671c1911p0061D9817a10217H3274h7216D4909Q3515
$$ y = [-138021, -101438, -25724, -4593, 196343, 243947, 319113, 27499, -16329, 33073, -271841, 412128, -2097, -24890, 184644, 301527, 49657, 142110, 55463, 83534, 302525, 75710, -124086, 127098, 34919, -151259, 291264, 137934, 313870, 312992, 113213, 80510, 183379, 269204, 202980, 64251, 59982, 29782, 93985, 156563, 129545, 44210, -94467, -203662, -51503, -199277, 465304, -110872, 228621, 28066, -27810, 396533, 177643, 184468, 8010, 360733, -45122, -333536, 146698, 17721, 295871, 195078, 177577, 120562, 221880, 160620, 54558, 157610, -67883, -201880, 332038, -447809, -132906, 86388, 354905, -8192, 91271, 23144, 159333, 49710, 180677, 142422, -303152, 43750, 101719, 113499, 50671, -31911, -101972, 49817, -110217, 83274, -87216, 44909, 128424]
17634A28424l4855k1659K97054A08559P0256a03998B1463J85885a58592e0653
17623h8447B40245I8032h6701B40366a82018B05294F8050J60205b28378C73849
17612A04320K4759J22022H6891b7178D6970M2996J4712E704J36874c30192e3661
17600b40492D1480Q028J11949E8450d3229C72670A20499h9868k96579E1958i7856
17588A13411m6602a25527B65743C0470L82028A52750J4560D6304j3340K59454
17578B92418G7292L08134n2047q6381J5371d6775f971A29937L9570K80312j49299
17567C00520n1559i0573E0077h085l9596A33286R847J39048m0334r7338L7047
17556A81556a6725C6059J99744A12203C3715J05017N1789o5263J17483Q350J21854
$$ y = [128424, 93569, 71910, 368964, 108559, 178815, -103998, 21463, 207348, -158592, -50653, -88447, 240245, 98032, -86701, 240366, -182018, 205294, 68050, 228255, -228378, 373849, 104320, 129079, 251101, 86891, -27178, 46970, 89966, 104678, 5704, 142578, -330192, -53661, -240492, 41480, 49508, 161457, 58450, -43229, 372670, 120499, -89868, -386447, 51958, -97856, 113411, 66809, -125527, 265743, 30470, 412498, 152750, 167310, 46304, 32964, 292418, 77292, 385426, 333379, 246998, 262369, -46775, -6971, 129937, 169507, 449819, 300520, 248961, -90573, 50077, -8085, -47681, 133286, 143133, 282181, 241847, 144509, 181556, -16725, 36059, 235803, 112203, 33715, 138732, 190521, 125258, 242741, 251091, 372945]
17545C72945a56930C85101o1039A55672L62258B3181g3244D34713a61969m8128
17535b10097B70862a06719A27235a4474A11862J20201F6983K74048I4028O5278
17525A59306J1420b41415A15050D3398a20395C359M4549P89K43608k3836K87932
17514E56401B6518N10724B64604K71318L94247K5195l00107R7002k78146L68596
17504H42709C23015N5843j27926L85763l6226B92033M32522j13109j58230J42254
17494E95470L27479j5815k11644o7359P8270l19881L5431l8341H9363M47077p201
17483E29239p8877A8458N0145K06818d1170E80274B46915n8028j3044J66284L33968
17472F76095A56790J53691A51335n8694P4113k0723J23799a8943B1372J27078
$$ y = [372945, -156930, 385101, 324062, 155672, 517930, 23181, -73244, 434713, -161969, -210097, 270862, -106719, 127235, -14474, 111862, 232063, 66983, 341031, 94028, 159306, 170726, -241415, 115050, 43398, -120395, 3359, 47908, 48697, 292305, 268469, 556401, 26518, 537242, 264604, 535922, 930169, 955364, 655257, 752259, 474113, 842709, 323015, 378858, 250932, 636695, 600469, 292033, 724555, 611446, 453216, 595470, 922949, 907134, 695490, 628131, 706401, 386520, 421951, 383610, 89363, 536440, 529239, 450362, 18458, 68603, 275421, -41170, 580274, 246915, 188887, 175843, 342127, 676095, 156790, 310481, 151335, 92641, 166754, 146031, 269830, -18943, 21372, 148450]
17462A48450J57661l5556L6362j26386l2908D5667J64123d6435B26948J76597
17452D03545j54798a36857B0932K0026K57003N1261e0577C07588j08100A6045
17441H4908J71404L51627B75193n0705m3399H8788J9704J30775L30860j48662
17431D21465A17528a4179B58795K53962p7041r0604L13207B24532R3185j40583
17421A77134M6530k1622K91664B21512j0281f6078D99000B05330P3971F9598J71911
17410B41509k2214p9947M50096Q0564C18916K18222B11573a01075C20035j44944
17400A75091K53240J27060k04592j32460Q5445A42435L08787k1383A78742M2395
17390B21137l5779K32354L1146k3203m9832L6118O8775k05688N6993d1132A37564
$$ y = [148450, 306111, 270555, 306917, 180531, 147623, 45667, 209790, -46435, 226948, 403545, 248747, -136857, 20932, 40958, 297961, 349222, -50577, 307588, 199488, 16045, 84908, 256312, 607939, 275193, 224488, 181089, 88788, 108492, 239267, 570127, 421465, 117528, -14179, 258795, 512757, 435716, 345112, 658319, 224532, 317717, 177134, 223664, 202042, 493706, 221512, 211231, -66078, 499000, 205330, 279301, 69598, 241509, 219295, 139348, 589444, 670008, 318916, 537138, 211573, -101075, 320035, 175091, 428331, 555391, 350799, 218339, 303784, 142435, 451222, 429839, 178742, 221137, 185358, 417712, 448858, 425655, 375823, 411941, 480716, 275028, 332021, -41132, 137564]
17378A46998J69794c7762a3678H7855J28192L34189D5438M37502F8036K54393
17368C22429c51715B24230M6849l8560M2131K3049n9146L4425a6820C41868j19770
17357B22098D3662J60353I6127L4386k2198J61956E4946a63304p873A9980O9486
17346H9466B4937M263M55884M4780A62321L67874A41093L1003Q02E2467K05011
17335B57478J06556L3445P4453A46502J49670K30820j88871K389O6386k2977K34303
17324F18222g3045B0427J29167F6278N9141R3495b58636A07084J88567g2575D7045
17312C36014j5471l7609J18861j92884b42462B80699n3569m3327J44051j06455
17302B21399r2068K62470a85717A09273c3640C26384A17834J90066K17669A08744
$$ y = [146998, 316792, -37762, -13678, 87855, 216047, 550236, 45438, 482940, 68036, 322429, -351715, 224230, 271079, 232519, 274650, 297699, 238553, 272978, -16820, 341868, 222098, 43662, 204015, 96127, 130513, 108315, 270271, 54946, -163304, -171177, 19980, 89466, 24937, 29200, 485084, 529864, 162321, 530195, 141093, 172096, 172898, 52467, 257478, 364034, 397479, 471932, 146502, 296172, 526992, 338121, 340510, 406896, 383919, 618222, -73045, 20427, 149594, 66278, 125419, 218914, -258636, 107084, 295651, -72575, 47045, 336014, 320543, 282934, 401795, 208911, -242462, 280699, 227130, 183803, 327854, 221399, 129331, 391801, -185717, 109273, -33640, 326384, 117834, 307900, 525569, 108744]
17291A34363M1207p2705P784L82506A27361J14702P3640O1376I340L47656n1546
17280C05450K1690p8207O0051K61087n3032n9412j6852j53370r1083o1294J09618
17269B44646J06473h722B37801M154o9311J65154A43603k091O6826p7163J83185
17258C14360n0015J79147j00566K46441B50681K16658k21096L82853i2090L9929
17248e2161B69017H1661J89258Q2246J52550k6644A12641n4417K35154N2922o4538
17237B81762R8579J66599j09141D0616J08219N1920A2627K31914J0116e3861B50756
17225D22689K9109L7066r2170d6116A31991J55894J07333A31035J35161l1780
17215B34416K53773j61989K5488A72553J87966k9317R0260A51704J10786J00655
$$ y = [134363, 175570, 102865, 110649, 493155, 127361, 242063, 315703, 377079, 9340, 356996, 305450, 327140, 248933, 308984, 570071, 517039, 457627, 440775, 287405, 196322, 135028, 244646, 351119, -8722, 237801, 241955, 172644, 337798, 143603, 141512, 208338, 131175, 314360, 264345, 443492, 342926, 589367, 250681, 467339, 246243, 629096, -92090, -52161, 269017, 81661, 270919, 353165, 505715, 479071, 112641, 58224, 293378, 346300, 281762, 380341, 546940, 437799, 40616, 148835, 200755, 12627, 244541, 254657, -53861, 250756, 422689, 451798, 488864, 396694, -46116, 131991, 287885, 395218, 131035, 266196, 234416, 488189, 326200, 351688, 172553, 360519, 331202, 421462, 151704, 262490, 363145]
17205C63145R2062k04309b6161B69145J68098m0371j82490K72340K6677B28864
17194B13876J81932N154J25416J0939j40079J22958I4503M29425A51940K57195
17184D09135L9133q8430K3539a11941B07265H9506l0026K45651j05271K98894
17174D98754Q138d015E92507o8544n503j35287J48391p3041q8956J19714J69630
17163F58911O386C10968J67248j26047M9165K09091q2899j53661M6080P2270j21770
17152C70445l026k8766q5084M38225A60960O30334B19244L27247k53439A35945
17141F03293k58971o1341M8570J08525k8563L94632C75201L279J04098L405j77232
17130C08751q0648k3922O54539l28507N4754k36715P7216j35951M82642m5451
$$ y = [363145, 455207, 250898, -26161, 269145, 437243, 396872, 214382, 486722, 513399, 228864, 213876, 395808, 400962, 526378, 537317, 397238, 520196, 94503, 523928, 151940, 409135, 448268, 359838, 383377, -111941, 207265, 89506, 59480, 305131, 199860, 498754, 506892, -4015, 592507, 523963, 518460, 383173, 531564, 458523, 369567, 489281, 658911, 665297, 310968, 478216, 352169, 401334, 610425, 527526, 373865, 419945, 492215, 370445, 367419, 338653, 253569, 691794, 160960, 791294, 219244, 546491, 293052, 135945, 603293, 344322, 282981, 331551, 440076, 411513, 806145, 375201, 378480, 482578, 485983, 308751, 228103, 204181, 858720, 530213, 584967, 348252, 425468, 289517, 772159, 726708]
17120G26708l56281A62629L57779r4191j47947M03498o0196j07392K97665l47452
17110D64393K76532l32391q4613J12464k9862J22854j87840L79436P1068l64119
17100D27922K84714R665j82013A31097K99791j7438K1926L79889M0833J61588
17090A017686C97919K65363J11574l46243j02854N6038J95751M8271K92677C87927
17079F87013J03971k66279J38826M6863o8873j13899j24627K4129J63416J18066
17069G08606j09623K93293k57802k57596L72446n9365K93123j85775M6089j06409
17059G36987K28832l61376n7716J06373n0841j39921l727M12509k34023P8502
17049G15599K56974l96404K20097l3333J002M6097K81203j80464l22691J76851
$$ y = [726708, 370427, 162629, 520408, 426217, 278270, 681768, 621572, 514180, 811845, 464393, 740925, 408534, 323921, 436385, 406523, 529377, 341537, 720973, 792041, 427922, 712636, 722301, 540288, 131097, 430888, 413450, 435376, 815265, 856098, 1017686, 397919, 663282, 774856, 428613, 325759, 381797, 577548, 625819, 918496, 387927, 687013, 790984, 524705, 663531, 710394, 641521, 527622, 402995, 427124, 590540, 708606, 598983, 892276, 634474, 376878, 749324, 689959, 983082, 797307, 843396, 736987, 965819, 604443, 546727, 653100, 602259, 462338, 458611, 871120, 637097, 715599, 972573, 576169, 796266, 762933, 763935, 810032, 1091235, 910771, 588080, 764931]
17039G64931j07127L33870m53758m0557L06913J23611J54311j8744j12571m58860
17029D92019L71640l14253K70455K52362k25283j90449K94703D05068K51974j09211
17019E47831M70165K2781n6446J25730j73363K23624j25683l98529K84774J8840
17009I39724J01631N5525j53421j37889K55351l38561M31651N6828E96090K22790
16999H18880J19782P5934m7879J17973R4339L2782l39759J08994J25720j15296
16989I91470Q2341l67373J78160q2750J00231L88623m45831N8454L63252k63434
16979A003143Q4405Q0517L73740m25502M9692P7652R4060j41492p3847P6796n5724
16968A143440J6413J83832j46065P4153J92534k25278K59882k90813L34476j61542
$$ y = [764931, 657804, 991674, 537916, 497359, 804272, 927883, 1082194, 1063450, 950879, 492019, 863659, 549406, 819861, 1072223, 846940, 656491, 951194, 405068, 657042, 547831, 1017996, 1040777, 984331, 1110061, 936698, 1160322, 1034639, 636110, 920884, 939724, 1041355, 1096880, 943459, 805570, 1060921, 722360, 1154011, 1210839, 596090, 818880, 938662, 1014596, 966717, 1084690, 1179029, 1211811, 872052, 981046, 1106766, 991470, 1073811, 706438, 884598, 801848, 902079, 1290702, 844871, 903325, 1266577, 1003143, 1087548, 1168065, 1541805, 1116303, 1165995, 1243647, 1337707, 1196215, 1122368, 1199164, 1143440, 1159853, 1343685, 1197620, 1271773, 1464307, 1239029, 1498911, 1208098, 1542574, 1381032]
16958A381032R2401k58493N6391P267K64885l85055K93023l37384p6458K88323
16948A325932R7115K82167m7453k06632j35775J75176j49164L55676l14565M48518
16938A830995m1133l59224J35994J00012k7653j30024k00727N24918K10855k82834
16928A761179o0172j24494j1428M58364q0387n15637L36590K19829j61358r9839
16918A722647L12709k31226L1538N4773l2137k21920M87225l09435L8346N3022
16908A905542j02236L42375K50883k47144J39918J02723l02379J20085J48044
16899B357811J30608j04167q5889L19574m1299r8871P0200K01000m72973J60839
16889B436833N32456m71154M48555o0868J93751j83640q3272q8314J49654l024
$$ y = [1381032, 1473433, 1214940, 1271331, 1278598, 1543483, 1158428, 1451451, 1114067, 1037609, 1325932, 1423047, 1705214, 1657761, 1451129, 1315354, 1490530, 1341366, 1697042, 1382477, 1830995, 1789862, 1430638, 1566632, 1666644, 1638991, 1508967, 1308240, 1833158, 2044013, 1761179, 1701007, 1576513, 1565085, 2023449, 1943062, 1427425, 1764015, 1983844, 1822486, 1722647, 2035356, 1804130, 1835668, 1890441, 1858304, 1636384, 2123609, 1814174, 1852520, 1905542, 1803306, 2145681, 2396564, 2149420, 2289338, 2392061, 2089682, 2209767, 2357811, 2488419, 2384252, 2298363, 2617937, 2576638, 2477767, 2547967, 2748967, 2275994, 2436833, 2969289, 2498135, 2946690, 2885822, 3079573, 2895933, 2812661, 2724347, 2874001, 2870977]
16879B870977J73455J59052l46031L00873l53436K01283n13746N75707J02079
16870C170213Q6215J92723n51198L36099J64156k90142N85525Q6856j90030J04763
16860C695180o3537L12305l60143L43228k77937J88744K43583n4234Q7263q988
16850D105464m0277J95529k23398R7776J86695Q7652k64091L30509J00213j70
16840D575902n5017J71361J77531K21768k24029N1979R656q3949L61664j33091
16830E073775N94650k67106K12228j63835L51076p7877J4182P03220k10409k00909
16820F028995N44221J19877J03039k0445K60741K78550k09384J44091j12749M45163
16810G582099J04115L05513j00885Q7949J23036L21738k8375K20504o8638O88849
$$ y = [2870977, 3044432, 3203484, 2857453, 3158326, 2804890, 3006173, 2492427, 3068134, 3170213, 3256428, 3449151, 2897953, 3234052, 3398208, 3108066, 3693591, 3780447, 3590417, 3695180, 3631643, 3943948, 3583805, 3927033, 3649096, 3837840, 4081423, 4027189, 4114452, 4105464, 4065187, 4260716, 4037318, 4135094, 4321789, 4409441, 4145350, 4475859, 4576072, 4575902, 4520885, 4692246, 4869777, 5091545, 4867516, 4919495, 4929151, 4845202, 5206866, 5073775, 5668425, 5401319, 5613547, 5449712, 5800788, 5722911, 5737093, 6440313, 6229904, 6028995, 6573216, 6693093, 6796132, 6775687, 7036428, 7314978, 7105594, 7249685, 7136936, 7582099, 7686214, 7991727, 7890842, 7978791, 8101827, 8423565, 8395190, 8615694, 8547056, 9235905]
16800I235905K96298k31019K27354L07654l7206N32031L07034P7323L12001j20750
16790A0906625N66766J20053K15656M20927N63959j31457P41755Q2672N53933
16781A4040889J11727M15729k5400P69446J75298P50783J43450N19654N67619
16772A7469195K47850Q61404K80620O25228O3625J019787M61165N19733Q97709
16763B2446316L93985J057492N31663N48610J185855O41535R20327J068275O80623
16754B9474681Q91021P99417R69170J795779J138891J112851J196657J215846
16746C8594313J445443J327454J642939J380748K079325J643978J248981K089435
16738E1452616K328586J554874K393853K261378J657158K424106K513962K549749
$$ y = [9235905, 9532203, 9301184, 9528538, 9836192, 9798986, 10331017, 10638051, 10715374, 11027375, 10906625, 11473391, 11593444, 11809100, 12230027, 12793986, 12662529, 13404284, 13486956, 14040889, 14152616, 14568345, 14542945, 15312391, 15487689, 16238472, 16381922, 16901576, 17469195, 17717045, 18578449, 18859069, 19484297, 19547922, 20567709, 21028874, 21548607, 22446316, 22840301, 23897793, 24429456, 24978066, 26163921, 26805456, 27725783, 28794058, 29474681, 30365702, 31165119, 32134289, 33930068, 35068959, 36181810, 37378467, 38594313, 40039756, 41367210, 43010149, 44390897, 46470222, 48114200, 49363181, 51452616, 53781202, 55336076, 57729929, 59991307, 61648465, 64072571, 66586533, 69136282]
16730F9136282K511350K315580L054470K719292K582647K796572K402074L443949
16722I0962216K713482K256281K912165K660196K202300K482448J920975K197960
16714A10308023J627996J510203J375545J283651N66298L21189L62303n99500
16706A16755708j75706q25046q51541j438123j756372j781069k198052j937732
16698A05792067k448245k508670k425516k726537k827572l083967k738949k585287
16690H4447324k934408k675812k867311k891819k430863k550646k133702k877185
16682F3085578k191442k050071k372671j616958k382291k034749j749124j745736
16674D6942536j820091j534830j523932j458188j114322j630736j358409j045567
$$ y = [69136282, 71647632, 73963212, 77017682, 79736974, 82319621, 85116193, 87518267, 90962216, 93675698, 95931979, 98844144, 101504340, 103706640, 106189088, 108110063, 110308023, 111936019, 113446222, 114821767, 116105418, 116671716, 116992905, 117355208, 116755708, 116580002, 115754956, 114903415, 113465292, 111708920, 109927851, 107729799, 105792067, 103343822, 100835152, 98409636, 95683099, 92855527, 89771560, 87032611, 84447324, 81512916, 78837104, 75969793, 73077974, 70647111, 68096465, 65962763, 63085578, 60894136, 58844065, 56471394, 54854436, 52472145, 50437396, 48688272, 46942536, 45122445, 43587615, 42063683, 40605495, 39491173, 37860437, 36502028, 35456461]
16666C5456461j108817j556662p96114j015617j208831j199637p45163o61811
16658B7163809j131727o85396r92167l64759p13325j087511p78907m43830k81874
16649B0684313n95673n23041n81392l49154r37935l84096k88310p78266l59171
16640A5887275j0604n84832n79593k23650m18723j45773k72768m02908n10839
16631A2737585j92686k15513j09497n09748m18969r2073j94819m53458L2209L6132
16621A0619163m72956l47005J5632k37748m22302l59652j36884N9876J20627n20587
16611H318164j05363j42392n2423k77600J0352n33527r6407K93799l41024J07876
16601G181455o9079k12118l62049J55738k61993k56698J19008k07657j23322O4529
$$ y = [35456461, 34347644, 32790982, 31994868, 30979251, 29770420, 28570783, 27825620, 27163809, 26032082, 25346686, 24354519, 23989760, 23276435, 22188924, 21410017, 20966187, 20684313, 20088640, 19565599, 18984207, 18635053, 17697118, 17313022, 17024712, 16246446, 15887275, 15876671, 15291839, 14712246, 14488596, 14069873, 13924100, 13651332, 13248424, 12737585, 12544899, 12329386, 12219889, 11710141, 11291172, 11199099, 11004280, 10550822, 10583031, 10619163, 10146207, 9799202, 9814834, 9577086, 9154784, 8795132, 8658248, 8718124, 8838751, 8318164, 8212801, 8070409, 8017986, 7740386, 7750738, 7217211, 7120804, 7414603, 7073579, 7181455, 7112376, 6900258, 6538209, 6693947, 6431954, 6175256, 6294264, 6086607, 5963285, 6027814]
16591F027814o5171m07015k55845K61295o4500l19969J21426j40361J91869k39117
16581E110426l5545k26746j23736M86289k04582l25723R1630J51846o51933M6118
16571D318044l53281J75114j80784L90592j29116m80465L83474j18314R8166l43126
16561C760304j62466N3465L67310o29856N5729K96512l9020l60886R4638k01122
16551C234608K63085J40437k69904j03916k78417M32979j96229l39467j06584
16542B776592L99263k20125r8981J00526k18903n6386L46619l02670J82465l6817
16532B871583k14201k35251O60358n99793K8309L1584j37359q9321K0268J98250
16522B534427o4416p7224k95797K74902K51205r7455m38977k46786K66208J97194
$$ y = [6027814, 5962643, 5555628, 5299783, 5561078, 5496578, 5176609, 5298035, 5157674, 5349543, 5110426, 5074881, 4848135, 4724399, 5210688, 5006106, 4680383, 4772013, 4923859, 4271926, 4318044, 3964763, 4139877, 3959093, 4349685, 4220569, 3740104, 4123578, 4005264, 4103430, 3760304, 3597838, 3651303, 4018613, 3388757, 3444486, 3740998, 3701978, 3341092, 3435730, 3234608, 3497693, 3638130, 3368226, 3264310, 2985893, 3418872, 3222643, 2883176, 2776592, 3175855, 2955730, 2856749, 2957275, 2738372, 2681986, 3028605, 2725935, 2908400, 2871583, 2657382, 2422131, 3082489, 2482696, 2511005, 2542589, 2405230, 2315909, 2336177, 2534427, 2470011, 2392787, 2096990, 2371892, 2623097, 2525642, 2086665, 1839879, 2106087, 2303281]
16512B303281j80047j39435N93975n95685J83790k39257K01107R2401k68948n3256
16502A897926J00428j29619j6967L35110k39889j1933m58414M72251j53805L49556
16492B144644l41426j60325N4585K00588m82112P23712k23162k29186k60261L8849
16482A465906J77163l30169L01243l58208K31480J41858k0936k64875J82436n123
16472A520775j15187O5306q0748L3478k37200N23455j85793j81780j38449m2649
16462A161208J67270K43248J32299k77339k01968Q9884P1736j08977J73573k4439
16452A426495o6920m9052O1528q8745m0129P9997J10416j98278j76114K72295
16442A331493L2340j7353l35562r9602L17613M0122q2668O0134l37196K33094
$$ y = [2303281, 2123234, 1983799, 2577774, 1982089, 2165879, 1926622, 2127729, 2220130, 1951182, 1897926, 1998354, 1868735, 1851768, 2186878, 1946989, 1935056, 1476642, 1948893, 1795088, 2144644, 1803218, 1642893, 1697478, 1898066, 1415954, 2139666, 1916504, 1687318, 1427057, 1465906, 1643069, 1312900, 1614143, 1255935, 1487415, 1629273, 1608337, 1343462, 1525898, 1520775, 1405588, 1470894, 1390146, 1423624, 1186424, 1709879, 1524086, 1342306, 1203857, 1161208, 1328478, 1571726, 1704025, 1426686, 1224718, 1314602, 1386338, 1277361, 1450934, 1426495, 1359575, 1310523, 1372051, 1283306, 1243177, 1323174, 1433590, 1235312, 1059198, 1331493, 1363833, 1346480, 1010918, 911316, 1228929, 1269051, 1186383, 1246517, 909321, 1142415]
16432A142415J20479L7741l46338J18327K29377l68930L3302L46091m10440J67954
16422A069978L4182n3370N382O4610r8765J06372M22629n24142K2185K33599P6639
16411A359299n45942n6133M50258k76559P7133j03612l06704L16795R9549m66913
16401E47171M20634K2676k38435j3631L87936l13450l13580N71811k31652q8943
16391G50537n8702L03128l75042K73246j29036L04147j22420J46891k47308J17637
16381I63078m20916K21002p0551j53526N7866M17950q5904j56663K1231J56171
16371I49738j24720k84190M5011K90894L4485k7835l80810N64314D50098K62304
16361G12402j51063J70348k6384j38796J25700j58500J27697l5167K66871M1547
$$ y = [1142415, 1262894, 1300635, 954297, 1072624, 1302001, 933071, 966373, 1312464, 902024, 1069978, 1104160, 1050790, 1056172, 1120782, 1022017, 1128389, 1551018, 1026876, 1049061, 1282660, 1359299, 813357, 757224, 1207482, 930923, 1008056, 904444, 597740, 914535, 1014084, 547171, 967805, 990481, 752046, 738415, 1126351, 812901, 499321, 1071132, 839480, 750537, 691835, 994963, 619921, 893167, 764131, 1068278, 945858, 1092749, 845441, 963078, 542162, 763164, 692613, 539087, 596953, 1014903, 928999, 772336, 793567, 949738, 825018, 540828, 585839, 876733, 911218, 883383, 502573, 1066887, 450098, 712402, 561339, 731687, 705303, 566507, 692207, 533707, 661404, 626237, 893108, 934655]
16351I34655D63591L20036K40038l70264k9067P5821j69132N8920k64914M06651
16341G31680l552q1097k28629K93449m2537J61114n5875l27570K96605k36133
16331E07455J28120j13095r4952J21124K51674l09135K03908R0329p8372j51242
16321E55814P2528J28179q7414q8629M2952K6882B53945J31003K81193C01996
16310E89383q213J04504K7921j47729O0548C06558K50347j28678J07979k04800
16300C31406K75080j12100k4076N037j85081J56638J81824k01506K57038j10499
16290E73761k06248R8508Q5562J64253C38894J45230B13615J77959K80307L5794
16280G07675j91717k52996J19706p9990k9450K82960K54501k85686J24217J18644
$$ y = [934655, 463591, 783627, 1023665, 653401, 624334, 700155, 531023, 589943, 325029, 731680, 728128, 647031, 418402, 711851, 669314, 830428, 774553, 446983, 743588, 507455, 635575, 522480, 427528, 548652, 800326, 491191, 695099, 785428, 707056, 555814, 628342, 756521, 669107, 580478, 623430, 650312, 253945, 384948, 666141, 301996, 589383, 581170, 685674, 713595, 565866, 626414, 306558, 556905, 428227, 536206, 331406, 606486, 494386, 470310, 475347, 290266, 446904, 628728, 427222, 684260, 573761, 367513, 466021, 551583, 715836, 338894, 484124, 213615, 391574, 671881, 707675, 515958, 262962, 382668, 302678, 273228, 556188, 810689, 525003, 649220, 767864]
16270G67864r8902A53993K75657J69279j45754j74980m6818K57905C8612K13106
16260B51718K89113p6208B11928J62305L09674A33659A6565K65716K84948N7801
16250F25030j59120k23024J96521J31241k69549J50030J97574l10033Q1882A47768
16239A71311L07523L4662B54324J46312Q540O0722M8838j1653j80359j6570j12079
16228A98075n9291J84625J94139j26140A36881J2669K29439J7627j08524A19648
16217A39195K37304P968j83369O1520A2055L08106l9756f4227D50070J38990a35887
16205D65206n9444j18302k967o3465K219K08239k4402J49304A93597J53336A45762
16193A47736M28067k14651j2548j5262j22707K64638j26632J3375j21621m065
$$ y = [767864, 668962, 153993, 429650, 598929, 453175, 278195, 231377, 489282, 38612, 251718, 540831, 464623, 211928, 374233, 683907, 133659, 16565, 282281, 567229, 625030, 465910, 242886, 439407, 570648, 301099, 451129, 648703, 338670, 420552, 147768, 171311, 478834, 513496, 254324, 400636, 409176, 469898, 518736, 507083, 326724, 310154, 198075, 138784, 323409, 517548, 391408, 136881, 149550, 378989, 396616, 288092, 119648, 139195, 376499, 384467, 201098, 262618, 12055, 320161, 280405, -64227, 450070, 589060, -135887, 465206, 405762, 287460, 284493, 221028, 223247, 431486, 407084, 556388, 193597, 346933, 145762, 147736, 575803, 361152, 348604, 333342, 210635, 475273, 348641, 362016, 240395, 236330]
16183B36330B9701M14775A84087Q7263n9761J46636A35319J93809J04527j24180
16173C09475j32097K73329B01364D6609J50572m4073i9410C45873A37933N30684
16163F68617h269C74709A27281M4567J80661q1516g2094B67957A22319K69264
16153C91583p5828L7518A40277K1198K0465L28126H9912d2739H7577O2699p448
16142A42828R6351M7379j14482P2582J55158j14981J22157A67610K75681B19482
16131B80738K3831r7546n9042J9156o8847J74873H8803J67291j2305G4083o80
16120G3403a66399A90325J32726i1736A63655F5270h1975A67885C1951L61606
16110C93557A9367J43844L1435l0268f1239C9714N2812K03599r4005C7927K03190
$$ y = [236330, 29701, 444476, 184087, 271350, 211589, 358225, 135319, 329128, 433655, 309475, 177378, 450707, 201364, 46609, 197181, 153108, -99410, 345873, 137933, 668617, -8269, 374709, 127281, 171848, 352509, 270993, -72094, 267957, 122319, 391583, 315755, 353273, 140277, 161475, 181940, 510066, 89912, -42739, 87577, 150276, 142828, 239179, 286558, 172076, 244658, 399816, 284835, 406992, 167610, 443291, 219482, 280738, 304569, 207023, 147981, 167137, 98290, 273163, 88803, 256094, 243789, 74083, 73403, -166399, 190325, 323051, -91736, 163655, 65270, -81975, 167885, 31951, 393557, 19367, 163211, 194646, 164378, -61239, 39714, 92526, 296125, 202120, 37927, 241117]
16099B41117l8013G3056P3402J87405B9687P9295L05031d3261A9817L76183G4821
16087D03045i6639A16183K893a5837A11315J24050K61238B09265p5874J49925
16077B83316a78317O6645D85709A58615K23655j11515H7342b00696R9965n5055
16067a55786j45853A5380f9292F6771P7795a80717B18355L14846A94955A6052
16056D5428J07861J7428F754c86132a63203C44705j53355b3450E82132B67635
16045D5449N3560c6517I3649L085k8029h8146K0902c2147I2053M2614e5262B68914
16032B45940n2805i8159l2333c4095A68362K757g142A94122C1353J19298o0610
16021I0041K22846j36431f2793k16776B26262a19027A43964k9604a59094A04614
$$ y = [241117, 203104, 73056, 146458, 333863, 29687, 108982, 414013, -43261, 19817, 396000, 74821, 403045, -96639, 116183, 119076, -15837, 111315, 235365, 496603, 209265, 133391, 283316, -178317, -111672, 485709, 158615, 382270, 270755, 87342, -200696, -100731, -155786, -301639, 15380, -69292, 66771, 144566, -180717, 218355, 533201, 194955, 16052, 45428, 153289, 170717, 6754, -386132, -163203, 344705, 191350, -23450, 582132, 267635, 45449, 99009, -36517, 93649, 96734, 68705, -88146, -67244, -32147, 92053, 134667, -55262, 268914, 245940, 193135, -98159, -130492, -34095, 168362, 171119, -7142, 194122, 31353, 150651, 90041, 312887, 176456, -62793, -279569, 226262, -119027, 143964, 114360, -159094, 104614]
16010B99143b48589A69927b45789A87819m9342J23890q2649a64582A29919K4423
16000A54342b9361E3211a37678A04859p637O8170E2294R4010h4302q7397B40353
15988a27371A27911K13737A10609m4249L66547c79765f052l4046A76803C2544
15977A06335g8042K0141B58799Q6302K47496K15100J43116J75614l43627j81002
15967F01798K2191m3234j54473c0344A24344J28922a34909C47990j56929p2153
15957A18908a02047B81106L7623f7464k20496J39261J7733H2647K8472d4151p3894
15946a18045I7522B118L06286a04334A37965c09443J0359I4846a13229B0509a44251
15934B42169I1632N4417n7189K8795L47399D2885M5108J093e330j3303F3145A4614
$$ y = [299143, -248589, 169927, -245789, 187819, 138477, 262367, 179718, -164582, 129919, 154342, -29361, 53211, -137678, 104859, 97222, 165392, 52294, 146304, -84302, -171699, 240353, -127371, 127911, 341648, 110609, 66360, 432907, -379765, -6052, -40098, 176803, 32544, 106335, -78042, -57901, 258799, 345101, 592597, 807697, 950813, 1126427, 782800, 601798, 623989, 580755, 426282, -30344, 124344, 253266, -134909, 347990, 191061, 118908, -102047, 281106, 318729, -67464, -287960, -148699, -130966, 82647, 111119, -44151, -118045, 97522, 2118, 308404, -104334, 137965, -309443, -299084, 94846, -113229, 20509, -144251, 242169, 91632, 146049, 88860, 117655, 465054, 42885, 87993, 89086, -5330, -18633, 63145, 14614]
15921b11953F4196l721b63188B62227c47176B23828c09432A80860J13106a42817
15910a36574c6878A82229a27605C5472f4887F0184c42614a665j85915E6860K42990
15899B99850h199A18760D2959a49478f1467k36084B41165d5048A23647a19079
15888A06117l8565k7609i2147l0296A63370i5990A62637a77264o876K7770a2430
15876a39310A43767b91532C49336A55021n2216A5275L14635b9192H6516b39970
15865b50196c1069A20313J07240a198F3442O778e3400A37751R3858j04665k534
15854A24410l3887f182A15470g4848j91838a26j82203B2785a21944F2250J23187
15843A85437i4932B12230I0480O6776F3986g3031e139n4825A08261c1277j14809
$$ y = [-211953, 64196, 60475, -263188, 262227, -347176, 223828, -309432, 180860, 293966, -142817, -136574, -36878, 182229, -127605, 35472, -64887, 60184, -342614, -1665, -187580, 56860, 299850, -8199, 118760, 42959, -149478, -61467, -297551, 241165, -45048, 123647, -119079, 106117, 67552, 39943, -92147, -122443, 163370, -95990, 162637, -177264, -184140, -156370, -12430, -139310, 143767, -291532, 349336, 155021, 102805, 15275, 329910, -29192, 86516, -239970, -250196, -31069, 120313, 227553, -1198, 63442, 70220, -53400, 137751, 231609, 126944, 124410, 90523, -6182, 115470, -74848, -266686, -126, -182329, 22785, -121944, 62250, 185437, -94932, 212230, 90480, 157256, 63986, -73031, -5139, -59964, 108261, -31277, -146086]
15832a46086A03557b72331E9325J9884a19035j13283a13019K0712C5301a2200
15821B04103i3596B24837c96823A21759D3711k1167K26772d34723a35043b4100
15810G8259h4229A40180L0314a20228B27982e12514a6550H412b68856A34373e7860
15798d8374A2870d32675a07973N739B26603q4192F9367N5915a10299a7441k69100
15787b86541A03131g0447b4819l7605l2894A33818C5404b05980b5793m6216o4457
15776a36466K17f3971j14999h4848j58519B52466A05337a0831j59008A54293i4351
15764a37151o9148G6154C73a5318G8107a57666r0331O5938j22050M4155B5254
15752f8953c3961C87698a28248A03496a53151A72150C7579J88421j08735k2987
$$ y = [-146086, 103557, -272331, 59325, 79209, -119035, -232318, -113019, -92307, 35301, -12200, 204103, -93596, 224837, -396823, 121759, 43711, 22544, 249316, -434723, -135043, -24100, 78259, -84229, 140180, 170494, -120228, 227982, -512514, -16550, 8412, -268856, 134373, -57860, -48374, 12870, -432675, -107973, -102234, 226603, 142411, 69367, 125282, -110299, -17441, -286541, 103131, -70447, -24819, -62424, -95318, 133818, 35404, -205980, -25793, -72009, -136466, -136249, -63971, -178970, -84848, -243367, 252466, 105337, -10831, -169839, 154293, -94351, -137151, -206299, 76154, 373, -15318, 78107, -157666, -247997, -182059, -304109, -259954, 25254, -68953, -33961, 387698, -128248, 103496, -153151, 172150, 37579, 226000, 117265, 94278]
15742I4278J71716o2153J7114a88570I3368c8368A79695D6937K1274J06668b1725
15730A44099M8369b5421n1422A40406J45484e5284j12427B5342N0826a76476p4029
15719b50505L3206I441a90544d0702K356B68195a48896e7500B45846b90772D7189
15707b8854o3924q1561C3405a35498A31144b5799a788F2801a14557j56298K401
15696b68454G6039d669l4075G7936a47920K8446D9706b5448I3494a81448C9024
15684e7954o7179E9881J9238B0598a974q7596b2513j3377q3992A8475M9913K34063
15672C02451g8952J1241Q136k0673j97437J3269E8823c2953n08581B77292i1457
15660A9387a57162O8765J6301E3199a16195m7865A55347J79828i5568d6944C6349
$$ y = [94278, 265994, 203841, 220955, -188570, 93368, -38368, 179695, 46937, 68211, 174879, -21725, 144099, 192468, -25421, -76843, 140406, 285890, -55284, -167711, 25342, 76168, -176476, -250505, -217299, 9441, -190544, -40702, -38346, 268195, -148896, -57500, 245846, -290772, 47189, -28854, -92778, -174339, 33405, -135498, 131144, -25799, -1788, 62801, -114557, -270855, -268454, 76039, -4669, -38744, 77936, -147920, -119474, 49706, -25448, 93494, -181448, 39024, -57954, -125133, 59881, 79119, 20598, -1974, -89570, -22513, -35890, -119882, 18475, 68388, 302451, -78952, -67711, -59575, -80248, -277685, -264416, 58823, -32953, -541534, 277292, -91457, 19387, -157162, -88397, -72096, 53199, -116195, -164060, 155347, 335175, -95568, -46944, 36349]
15648a21922k28748b0839p7207A8331L25039b23019a08861b2290l33563D4714
15637b91695K2924g2447q135E8839J32172b0351k67404A35377i8271B2685f865
15625C3378J52503o8562J46759a22876d4217n7539J4034l4155j87004h9708r2069
15614a81777d5098A10993K5745L8241n2914a3856p8182K5647q5064A15635b67595
15602h6348D05512d09927a50964j02240P0463j34152J10858C4051K0936a48843
15591a48463C64130H6443f3382J3410B9263a80259b7591k52797j6834A13527O6655
15580A80182h3946J4506r3960P0042A18831J34781G6424J31088b9715A05355g89
15568a95021h2771G9244M6081J23259a5640j47346B18136B1076g6298o1705F867
$$ y = [-121922, -350670, -20839, -98046, 18331, 343370, -223019, -108861, -22290, -355853, 44714, -291695, -268771, -72447, -80582, 58839, 191011, -20351, -287755, 135377, -98271, 22685, -6865, 33378, 185881, 117319, 264078, -122876, -44217, -101756, -87722, -121877, -308881, -89708, -181777, -45098, 110993, 136738, 174979, 122065, -13856, -92038, -66391, -151455, 115635, -267595, -86348, 405512, -409927, -150964, -253204, -182741, -316893, -206035, 34051, 54987, -148843, -148463, 364130, 86443, -63382, -49972, 29263, -180259, -27591, -280388, -297222, 113527, 180182, -83946, -69440, -163400, -93358, 118831, 253612, 76424, 207512, -29715, 105355, -789, -195021, -82771, 79244, 125325, 248584, -15640, -162986, 218136, 21076, -76298, -138003, 6867]
15556A15249b3041m3402F8019P2455j8725a47217I7340J26689J48186A53409a17370
15544d5900K0274A4227b13305j09921a32878L9313J1169B66b22389C07336j6475
15533B90861a11237a5637j45633a9585B40939j8710l0529b60885F8029a01504
15522b93632a20994A32488a99786g9965B5994c0178n6131l8320k566D37849a16007
15510B77386A34883a16577A03735a8930A00421K5500J38769m5488a65551K4370
15500a41181J7635H5602a35576B46558J4661l4661O9782p7053H8975L12445C4126
15488B41886r5861J65270I3305J2410J04533D7285a39627F8816K06302J33103
15478D08221A32014b0862A61384b15477a6002j02148D02b0908C0543L54872c483
$$ y = [115249, -23041, -66443, 68019, 140474, 121749, -147217, 97340, 224029, 372215, 153409, -117370, -45900, -25626, 14227, -213305, -323226, -132878, -93565, -82396, 266, -222389, 307336, 290861, -111237, -15637, -161270, -19585, 240939, 222229, 191700, -260885, 68029, -101504, -293632, -120994, 132488, -199786, -79965, 25994, -30178, -86309, -124629, -127195, 437849, -116007, 277386, 134883, -116577, 103735, -18930, 100421, 125921, 264690, 219202, -165551, -141181, -123546, 85602, -135576, 246558, 261219, 226558, 296340, 219287, 88975, 401420, 34126, 241886, 146025, 311295, 93305, 105715, 210248, 47285, -139627, 68816, 275118, 408221, 132014, -20862, 161384, -215477, -16002, -118150, 402, -20908, 30543, 385415, -3483]
15466A4785J50740b50691B10935a01941G7157J29310o6782K76911k6136H469N18738
15455E27207q1913e0538j7030A10512M0886a18175j72679B22394d9841A55491
15444a68779o2892a534j7020D3720a23664E2197k035L9236a21894A82923e3733
15432A1275J63341J23159A24685F2146K94691K14259O91982P258n09448k36967
15422E23921j60338p8574D6159a10880C31831F3604g169k39367A91104B3903J89961
15411B13864p2941F4765a3198m6196K9420A51144c39091B36136a21109E728a68441
15399d06303A63100F045J06091a61571o4796A01247j4431N5914B3841J10203R3939
15388B27983L756J40264A46176J62894a95778B66798a7499A14197K20371H8067
$$ y = [14785, 165525, -250691, 210935, -101941, 77157, 206467, 139685, 416596, 390460, 8469, 527207, 445294, -50538, -67568, 110512, 151398, -118175, -290854, 222394, -49841, 155491, -168779, -231671, -1534, -18554, 43720, -123664, 52197, 50162, 89398, -121894, 182923, -53733, 11275, 174616, 297775, 124685, 62146, 356837, 571096, 1263078, 1270336, 760888, 523921, 363583, 285009, 46159, -110880, 331831, 63604, -7169, -246536, 191104, 23903, 213864, 140923, 64765, -13198, -59394, -29974, 151144, -339091, 236136, -121109, 5728, -168441, -406303, 163100, 6045, 112136, -161571, -226367, 101247, 86816, 142730, 23841, 134044, 227983, 231739, 372003, 146176, 309070, -195778, 266798, -17499, 114197, 334568, 88067]
15377a48742j3189B47991A17851c25870A54409f025A24990J06966a49537I9340
15366C15962c93556K3503D4336h8575d0954j48425B43150A05612a03837A37307
15355f817B31514J2811J00687F3826b2157E2252a52748H1066J56463E9306j8193
15344D1113L02196G7402q15e3481A77291L875a17934E847K9754K53680M2661e4699
15331A21131g6356e921C43628J9409A21705L8406D4607N7747C4825L90663d5899
15319B20701b03482P2043L3485j4342b3502C55L86850j67821a53327D17102e5258
15307A09623M0582Q4260m1617K6601F8697F926L64129j13491p9235d6764A74271
15295B0623a64544C4295a40723B14936a93076d3658j67085N4820I4472h1193J1756
$$ y = [-148742, -161931, 247991, 117851, -325870, 154409, -6025, 124990, 231956, -149537, 99340, 315962, -393556, -370053, 44336, -88575, -40954, -189379, 243150, 105612, -103837, 137307, -6817, 231514, 244325, 345012, 63826, -22157, 52252, -152748, 81066, 237529, 59306, 41113, 343309, 77402, 76587, -53481, 177291, 181166, -117934, 5847, 35601, 289281, 331942, -54699, 121131, -76356, -5921, 343628, 363037, 121705, 160111, 44607, 102354, 34825, 425488, -45899, 220701, -203482, -131439, -97954, -112296, -23502, 355, 387205, 219384, -153327, 417102, -55258, 109623, 150205, 234465, 192848, 219449, 68697, 6926, 371055, 257564, 178329, -46764, 174271, 20623, -164544, 34295, -140723, 214936, -193076, -43658, -210743, -155923, 94472, -81193, -69437]
15284f9437j36988A0868J18356D8321L01638d75683D8321J07318f0697G6728J84428
15273B61156c5420G5277P9196h1507G7349i3452B45046a05041D5456A0701c6152
15261i1183b6716B06163C472K53895c57110A25665a41986E8194J40323a05600
15250D8704b29146D7834L9485b2183j12290A84749A8683K70951A4937k358L06444
15239C19023l568A18131C6736J20316E5200K54542h5B98968j6990K12824J76514
15228F71316K76253N14018l23677p9985M6031l56470A21222l0261J70525F0953
15217f8945C705e8686A41308l5123a86176i306F3826M4982K65638A48910c49529
15205D0678M0405J69252A14312N4353j4171p1169C894O1609B571b95726a2684
$$ y = [-69437, -206425, 10868, 129224, 48321, 349959, -475683, 48321, 155639, -60697, 76728, 261156, -35420, 75277, 154473, -81507, 77349, -93452, 245046, -105041, 45456, 10701, -36152, -91183, -26716, 206163, 3472, 257367, -357110, 125665, -141986, 58194, 198517, -105600, 48704, -229146, 47834, 87319, -22183, -134473, 184749, 18683, 289634, 14937, 12579, 319023, 315455, 118131, 36736, 157052, 55200, 309742, -85, 298968, 281978, 494802, 671316, 947569, 1461587, 1137910, 1057925, 1103956, 747486, 121222, 90961, 261486, 60953, -68945, 3705, -58686, 141308, 106185, -186176, -9306, 63826, 108808, 374446, 148910, -349529, 40678, 81083, 250335, 114312, 168665, 154494, 83325, 3894, 65503, 2571, -295726, -12684]
15193f2509B19647c522B1022P1291j4037P287P5992J62600j30574g5636j68426
15182b44062C69253E5638K13782a69951E3378J52838J90272f8986j43856A74642
15171a33857A13577M1471b61244C3621f7114A81170q28a16482B83499B9760Q853
15160C8613K40784b46287A14532a30838e8744B47817M8106b81804f7466j3236
15150h0702E891M56609A58387c8809B08970C8991M802a7098B91673e307E51766
15138D4368J48215c1703m3018A29286M9206j7751a81239B62718b26494Q5443A84468
15126B70802A22545B9883K41086E3978J3194J34416J0453b74073B77101C436R2443
15115I5879a48778b0479A24655J28941e7062c034A12675J40605A7466N4966L74634
$$ y = [-62509, 219647, -3522, 21022, 92313, 78276, 85563, 161555, 324155, 193581, -75636, -244062, 369253, 55638, 269420, -169951, 53378, 206216, 396488, -68986, -212842, 174642, -133857, 113577, 155048, -261244, 33621, -67114, 181170, 180342, -116482, 283499, 29760, 38613, 279397, -246287, 114532, -130838, -58744, 247817, 295923, -281804, -67466, -80702, 5891, 462500, 158387, -38809, 208970, 38991, 43793, -17098, 291673, -5307, 551766, 44368, 192583, -31703, -74721, 129286, 178492, 160741, -181239, 262718, -226494, -141051, 184468, 270802, 122545, 29883, 270969, 53978, 67172, 201588, 212041, -274073, 277101, 3436, 95879, -148778, -20479, 124655, 253596, -57062, -3034, 112675, 253280, 17466, 72432, 447066]
15104D47066F9654M36957j59818P9844F6240J15751a18409B92560A32334P3410
15094B05744A00210J15590Q7335r7539J415B3462K56643q5140a57177O4289C31128
15082A24952L69714A32007a05954B90188d816A7255K49437j28293j5160J67189
15072B90428a49151B4475K43397C9059K2557O2836K90548c8005A14624K98416
15062D13040A19731J41738c3526B3148f2405j87217B19024a88915C23268h5395
15051i6863I170M37537f5073H369e9387b8299A04057a38365B1326L51456K5925
15040C98707j60230M6053j18760J83478F7699J47904N1184r2194J78871Q572H8717
15028b9998C01802J41271j08275L9888n1099q2724o4012M3939n6640K14504j20761
$$ y = [447066, 69654, 506611, 346793, 426637, 66240, 181991, -118409, 292560, 132334, 205744, 100210, 215800, 303135, 205596, 207011, 23462, 280105, 194965, -157177, -92888, 331128, 124952, 494666, 132007, -105954, 290188, -4816, 17255, 266692, 138399, 123239, 290428, -149151, 24475, 267872, 39059, 61616, 124452, 415000, -38005, 114624, 413040, 119731, 261469, -33526, 23148, -62405, -249622, 219024, -188915, 323268, -85395, -96863, 9170, 446707, -65073, 8369, -59387, -28299, 104057, -138365, 21326, 372782, 398707, 238477, 284530, 165770, 349248, 67699, 215603, 266787, 174593, 353464, 362036, 88717, -29998, 301802, 443073, 334798, 374686, 323587, 240863, 176851, 220790, 164150, 378654, 257893]
15017B57893R9991Q8357m8203P6365j20384J78021n8647K46439k39669j96978
15007B83185O074K57489o1453B07558K35202J47132o4920B45631N0516A32550
14996D73353k22658L11076i224A14735K52063N7688j75542r8333a14823B88236
14985A37360J94970K4815O6567G7817K23261K1642q6387I0483K92587j14089K73059
14974E42040j15529j50428N59086k34047B82676K36361K7502J25912r243J41447
14964H04655l1437l27718q380j30503J95655j42673L97719l06200q6252K26176
14954E91042j32267k00408L24440m487o150A37473L89135J7288A67089K41271
14944D08360j68945r1820K6423R803J56996j47597P1204N5495q2274P3745B4271
$$ y = [257893, 357884, 446241, 398038, 474403, 354019, 532040, 473393, 719832, 480163, 283185, 289259, 546748, 485295, 207558, 442760, 589892, 524972, 245631, 296147, 132550, 473353, 250695, 561771, -9224, 114735, 366798, 424486, 248944, 150611, -114823, 288236, 137360, 332330, 357145, 423712, 77817, 301078, 322720, 236333, 90483, 383070, 268981, 542040, 426511, 276083, 835169, 601122, 282676, 519037, 546539, 672451, 663208, 804655, 773218, 445500, 437120, 306617, 502272, 359599, 757318, 451118, 364866, 591042, 458775, 258367, 582807, 578320, 572170, 137473, 526608, 543896, 167089, 408360, 239415, 147595, 174018, 183821, 340817, 193220, 264424, 319919, 237645, 311390, 24271]
14932B70115j5370N3256j8966o6420K28722R1604j50817J45002J69639q0387B14963
14920F07530B88295I8473L09454M94479M8391m29445M85387M9390J60346R0682
14910A307157K40071R1525k07387l395N3588o5244P940J5106Q0578O37511l03839
14899A853611o80091L62599m23183k52610J97995k67439l10399q3638J26281J53002
14889F76128k13402k01598J5946K18924a647B49031j15875P1302K99915k18663
14879B85710P4663l0462N8913M6206L43997C73139N8307J04329M1919K73974l51066
14868E00602q6246K10309L02274l8306q3002j81371k8085k14544J32467k19631
14858B94467N02112B99559L87626J83436j03539k46568k52862J88229J00198k5061
$$ y = [270115, 254745, 308001, 289035, 222615, 451337, 542941, 392124, 537126, 706765, 626378, 214963, 607530, 288295, 98473, 407927, 902406, 950797, 521352, 1006739, 1056129, 1216475, 1307157, 1547228, 1638753, 1431366, 1427971, 1481559, 1416315, 1424255, 1439361, 1519939, 2157450, 1853611, 1173520, 1536119, 1112936, 860326, 1058321, 790882, 480483, 396845, 523126, 676128, 462726, 261128, 277074, 495998, -1647, 249031, 133156, 204458, 504373, 285710, 360373, 329911, 388824, 435030, 779027, 373139, 431446, 535775, 577694, 851668, 500602, 414356, 624665, 926939, 888633, 805631, 624260, 596175, 381631, 514098, 294467, 796579, 299559, 687185, 870621, 767082, 520514, 267652, 455881, 556079, 531018]
14848E31018K76922k76704o2926m0270Q1453r2352A81146J95240d9588D69351
14837D28792o2399I9878J82408M17282J65924C32088J00225L13530j00678r8818
14827E46347J25790L63811k53664M2493K33540j05640O3995p3513j34153n7990
14817G51016j65917j53132J22908J30260J06163j98689j39624k20613N74494l89987
14807D16879L33420B91939J15355J38415l6311J28821N4415k317k66461Q6551
14797E10407A88474N6692J024049m53347k40282j61352N23762j02134J7426r6819
14787G56469o204j30268j71986J85727C10746K53558L60720B11217J48016j52436
14777B06797M48105C2912K94955A22897N79574J08709k6884R4138l28378J29760
$$ y = [531018, 807940, 531236, 468310, 428040, 509493, 417141, 181146, 376386, -49588, 469351, 428792, 366393, 99878, 282286, 699568, 865492, 332088, 432313, 745843, 645165, 546347, 672137, 1035948, 782284, 824777, 1058317, 952677, 1016672, 943159, 809006, 751016, 585099, 431967, 554875, 685135, 791298, 592609, 452985, 232372, 806866, 416879, 750299, 291939, 407294, 545709, 509398, 638219, 692634, 690317, 423856, 510407, 188474, 245166, 1269215, 815868, 575586, 414234, 937996, 835862, 853288, 756469, 750265, 619997, 448011, 633738, 310746, 564304, 925024, 211217, 359233, 206797, 654902, 32912, 327867, 122897, 702471, 811180, 784296, 878434, 550056, 679816]
14767F79816J9479n4582M8912l31117M21510j13852k59192N60794l55621q1071
14757E35076J16371m4980L36325R7780j79818l81636J22372j87491M6932J94877
14747F55808j82328R6338J17098m8931j44355j49258K52663k56187r9777K24247
14737D65318j11531l6261L86590l7409K35248j44553l47602J20641L3419J3316
14727E77176K82387O3819l50206L27417m38698K02787j42768L13076p187k59211
14717E68592P5234L73793m3866L87791m8174m6147L7641J65273j31052l4649j63996
14706A140440j57918o0581N8497j40282k88458L41483j99161J0174L2186N5827
14696G92207o6703j75768q1040L65255K50115j41337J14899k52689K19816M46558
$$ y = [679816, 699295, 644713, 693625, 362508, 784018, 670166, 410974, 971768, 616147, 535076, 651447, 606467, 942792, 1040572, 860754, 479118, 601490, 413999, 460931, 655808, 473480, 569818, 686916, 637985, 493630, 344372, 597035, 340848, 241071, 465318, 353787, 317526, 704116, 666707, 901955, 757402, 409800, 530441, 563860, 577176, 859563, 923382, 573176, 900593, 461895, 664682, 521914, 834990, 827803, 568592, 643826, 1017619, 973753, 1361544, 1313370, 1267223, 1304864, 1470137, 1339085, 1304436, 1140440, 982522, 921941, 980438, 840156, 551698, 893181, 694020, 704194, 736380, 792207, 725504, 549736, 468696, 833951, 1084066, 942729, 1057628, 804939, 1024755, 1471313]
14686A471313J28595j24113k48875L69642k63983j19975k03982L0064l67338K37976
14676I09324J01294k3353j26235l07448P11152n04137j41516K90628k31939R0146
14666G67916o0988L64059j02749r1564M001J4913J6232j0848k80739j67770M71646
14655I24109L40937l35792q9612N383j06495J63780k65233N78146m35186j1799
14645G68238l8127j85542P69930j96652P2907k4056J87585k86015j24434O51458
14635A595292m59136M4558k40593l0050K21331L8506k28014L24693l2407J40410
14625A374590n10254J50667M1978j07593P1563j66437K42967k12492J19888J14260
14615A119137K32055m75935K92695k73386K69262q2643J17579J87927k8526o9063
$$ y = [1471313, 1599908, 1475795, 1226920, 1596562, 1332579, 1212604, 1008622, 1038686, 671348, 909324, 1010618, 987265, 861030, 553582, 1264734, 760597, 619081, 909709, 677770, 767916, 706928, 1070987, 968238, 876674, 880675, 895588, 911820, 900972, 620233, 452463, 924109, 1265046, 929254, 839642, 845025, 738530, 902310, 637077, 1215223, 780037, 768238, 730111, 544569, 1314499, 1117847, 1190754, 1166698, 1354283, 1068268, 943834, 1595292, 1136156, 1180714, 940121, 910071, 1131402, 1169908, 941894, 1266587, 1234180, 1374590, 864336, 1015003, 1056981, 949388, 1020951, 854514, 1097481, 884989, 1004877, 1119137, 1351192, 875257, 1167952, 894566, 1163828, 1081185, 1198764, 1386691, 1358165, 1289102]
14605A289102j25623J48025l92670N04294K7754j95960L53365m20185J42360l14128
14595A016334o4207K83426J56993l4276k55070k281N51664k19876J2735k69242
14585A176200K24273O4229Q1374k61398J59843K02800n4557j13672M7596J46440
14575A673128j86282k30109N85845k71537k27708L36681J02089K7092m31874N38221
14565A915546M668j08519K14759n58346M47336k16362M2252K70842l7678l95199
14555A579299K93980J15458L2632J12531J94768m78784P4721N24465j25989p459
14545B315622O80864k93028j20933K44148j07256O93078L63262J54831L76619
14536D307207R66383J388435K559499L137232O144448J0058388K301678j2624461
$$ y = [1289102, 1163479, 1311504, 918834, 1423128, 1450882, 1254922, 1608287, 1188102, 1330462, 1016334, 952127, 1235553, 1392546, 1358270, 1103200, 1100919, 1652583, 1432707, 1445442, 1176200, 1400473, 1464702, 1546076, 1284678, 1444521, 1647321, 1592764, 1479092, 1526688, 1673128, 1486846, 1256737, 1842582, 1571045, 1343337, 1680018, 1782107, 1809199, 1377325, 1915546, 1920214, 1811695, 2026454, 1468108, 1915444, 1699082, 1741334, 2012176, 1974498, 1579299, 1873279, 1988737, 2021369, 2133900, 2328668, 1849884, 1924605, 2449070, 2323081, 2315622, 2996486, 2703458, 2582525, 2826673, 2719417, 3412495, 3775757, 3930588, 4307207, 5273590, 6662025, 9221524, 12358756, 18503204, 28561592, 30863270, 18238809]
14528A8238809q060532l933137j661866o20074r9437J122235j361270o86692n52272
14519B385764j82380L1732M8251k79004l67202N08199k68374n3839L50896o7306
14509B106737p7333r7410L72663j67309J26626l9997k41327L94536k92482l3037
14499B051667L96741M6974n52366N33210k8988j43763o484J00735k13917L43683
14489B527492j25147J54861O0931M80648j37157n04505K86028j9319j03462K91280
14479B911650k14188L64417k955M8657j86074p9011K48172q0977J28246K23200
14469C361137j24292J94270j98821J65101J78862j91778P5193j47018K53996N2983
14459C619633Q781J33915m4954k1523R7488r2411j96390J39318L36576K5745p7656
$$ y = [18238809, 10178277, 6245140, 4583274, 3963200, 3863763, 4985998, 3624728, 2938036, 2385764, 2203384, 2235116, 2283367, 2004363, 1637161, 2145360, 1876986, 1823147, 2174043, 2106737, 2029404, 1931994, 2304657, 2137348, 2263974, 2223977, 1982650, 2377186, 2084704, 2051667, 2448408, 2495382, 1943016, 2476226, 2447238, 2303475, 2296991, 2397726, 2183809, 2527492, 2402345, 2557206, 2618137, 3098785, 2961628, 2457123, 2743151, 2723832, 2620370, 2911650, 2697462, 3061879, 3058924, 3107581, 2921507, 2842496, 3090668, 3009691, 3137937, 3361137, 3236845, 3431115, 3232294, 3397395, 3576257, 3384479, 3459672, 3312654, 3566650, 3619633, 3628414, 3762329, 3717375, 3695852, 3793340, 3700929, 3504539, 3643857, 3980433, 4006178, 3928522]
14448C928522L98240p3357q5637k34516M81265m13263M48978k72931J78677K31161
14438D587139K56180k42002K37928n49074K00446O03045j43113l9150O0008K23420
14428E194827Q6753l3049j27504L49295q5749J43644j56482L73325j95507K71301
14418E820854O8043J73373K68367R1129k12912K52734r9968J43671j69948O59600
14408F994943j49590j47998N97478l0057Q1842K20264J87678J4300j18293M6846
14398G697413R9217L4011J52355K22780L08104N1659r1439R8998J82931P71852
14388I527881m58006L44631K24641q3118L58511o2215J92481o8681J52214K74984
14378A0403323K99785j91124L82971K15497k2005K64089M45113J49592P1175M68825
$$ y = [3928522, 4326762, 4253405, 4167768, 3933252, 4414517, 4001254, 4450232, 4177301, 4355978, 4587139, 4843319, 4601317, 4839245, 4290171, 4490617, 5093662, 4950549, 4911399, 4971407, 5194827, 5281580, 5248531, 5121027, 5470322, 5384573, 5528217, 5371735, 5745060, 5549553, 5820854, 5888897, 6062270, 6330637, 6421766, 6208854, 6461588, 6361620, 6505291, 6335343, 6994943, 6845353, 6697355, 7294833, 7264776, 7346618, 7566882, 7754560, 7768860, 7650567, 7697413, 7796630, 7830641, 7982996, 8205776, 8513880, 8565539, 8474100, 8573098, 8756029, 9527881, 9069875, 9414506, 9639147, 9556029, 9914540, 9852325, 10044806, 9976125, 10128339, 10403323, 10703108, 10511984, 10894955, 11110452, 11088447, 11352536, 11797649, 11947241, 12018416, 12487241]
14368A2487241J54118J87615J10814K86306K45725J77846P06836M5805K61554
14359A4663860M00894J28639L80058R8263O14249L04566K13728K44928N16553
14350A7565738M21715O12680J02392N05645J54767Q04597J01122O76782L38907
14341B1284345L73659N40335N69706N23432P33111M01513P61765L96965O81579
14332B6266410R47299Q27045K63605J046848Q86091O14094O35723J306924R03400
14323C3697439R29930Q76107Q77915J270257J228195R04737J327136J373880J470169
14314D3955765J089897J596046J906183J764176J519520J931797K066056J504698
14306E7334138K598132K033322K373058K619327K380706K344339L285104L180238
$$ y = [12487241, 12641359, 12828974, 12939788, 13226094, 13471819, 13649665, 14356501, 14402306, 14663860, 15064754, 15193393, 15573451, 15671714, 16285963, 16590529, 16804257, 17049185, 17565738, 17987453, 18600133, 18702525, 19208170, 19362937, 20167534, 20268656, 20945438, 21284345, 21658004, 22198339, 22768045, 23291477, 24024588, 24426101, 25187866, 25584831, 26266410, 27213709, 28040754, 28304359, 29351207, 30237298, 30851392, 31487115, 32794039, 33697439, 34627369, 35503476, 36381391, 37651648, 38879843, 39784580, 41111716, 42485596, 43955765, 45045662, 46641708, 48547891, 50312067, 51831587, 53763384, 55829440, 57334138, 59932270, 61965592, 64338650, 66957977, 69338683, 71683022, 74968126, 78148364]
14298G8148364L263188L485529L678273L969774M291119M220495M771121M857969
14290A10685832N226773O203247N855760O485409P238430O986637P712113Q019984
14282A64414185R130389R169433J0225440J0295479J1091069J2151917J2213741
14275B38691653J2794755J3771610J3643008J4159995J4925722J4702553J4642817
14268C37332113J5069881J4708010J4418149J3252064J2362553J1532610J0387361
14261D29062741R359219Q450136N852254J660255R68332O18911M36497k792185
14253D53616160p836596o609285r563444j2292080j3882559j3807146j4855064
14246C74769986j4775986j5013730j4807929j4854687j5159352j4020363j3816506
$$ y = [78148364, 81411552, 84897081, 88575354, 92545128, 96836247, 101056742, 105827863, 110685832, 115912605, 122115852, 127971612, 134457021, 141695451, 148682088, 156394201, 164414185, 173544574, 182714007, 192939447, 203234926, 214325995, 226477912, 238691653, 251486408, 265258018, 278901026, 293061021, 307986743, 322689296, 337332113, 352401994, 367110004, 381528153, 394780217, 407142770, 418675380, 429062741, 438421960, 446872096, 452724350, 454384605, 455352937, 455971848, 456408345, 453616160, 445779564, 439170279, 429606835, 417314755, 403432196, 389625050, 374769986, 359994000, 344980270, 330172341, 315317654, 300158302, 286137939, 272321433]
14239B72321433j3323975j2488687j2031751j2487983j2403207j1172290j0124953
14232A88288587r946852r763259q582759p678238p897779o742773p110786o341151
14224A24224990n676276n220473n195688m918189m464442m441712m087362l746697
14216H6474151l043543l447686l569216k597394k772662l171756k385183k380014
14208F3106697k617305j810951k204292k168041j202897j860859j796730j824588
14200D7621034j508960j254055j250466j503012j401635j004692j297481q08471
14192C7592262p28503j124007j162991j118247j234264r02295k30063q62540q46968
14183B9382384p31991r66275p32680q34830k96576n76479q62682o13572k52716
$$ y = [272321433, 258997458, 246508771, 234477020, 221989037, 209585830, 198413540, 188288587, 178341735, 168578476, 159995717, 152317479, 144419700, 137676927, 130566141, 124224990, 118548714, 113328241, 108132553, 103214364, 98749922, 94308210, 90220848, 86474151, 83430608, 79982922, 76413706, 73816312, 71043650, 67871894, 65486711, 63106697, 60489392, 58678441, 56474149, 54306108, 53103211, 51242352, 49445622, 47621034, 46112074, 44858019, 43607553, 42104541, 40702906, 39698214, 38400733, 37592262, 36863759, 35739752, 34576761, 33458514, 32224250, 31321955, 31091892, 30229352, 29382384, 28650393, 27684118, 26951438, 26116608, 25820032, 25243553, 24380871, 23767299, 23514583]
14174B3514583n10940q69308Q5084j275997k20189l47154p66050J23768m58221
14165A9275576q42954k2583q30912J24100o43072m35199j12885j14349m97128
14156A5900594l72074l98910n0518o47890j06892k12571k31316m92057j94798
14147A3193568j41639k45782k51880o3184k30078J1088n69742j45747j08834J45424
14137A1593194m51702r3641o31365K56961m20447j09772r6025j86373r1975j98746
14127I570109J52933m45321j11329k25066j01075K76153q29105P34462n23770
14118H497991k61105o4616o4996L621k03972Q0188k37207j00180k04670k20837
14108G224217j24917R9531o5722j05281j04058l61347K03182K5570n54801n7612
$$ y = [23514583, 23003643, 22134335, 22219419, 20943422, 20723233, 20376079, 19610029, 19733797, 19275576, 18432622, 18410039, 17579127, 17703227, 17060155, 16624956, 16512071, 16397722, 15900594, 15528520, 15129610, 15079092, 14431202, 14324310, 14111739, 13880423, 13388366, 13193568, 13051929, 12806147, 12554267, 12491083, 12261005, 12272093, 11702351, 11556604, 11447770, 11593194, 11141492, 11047851, 10416486, 10673447, 10253000, 10143228, 10047203, 9860830, 9768855, 9570109, 9723042, 9277721, 9166392, 8941326, 8840251, 9116404, 8287299, 9021761, 8497991, 8236886, 8172270, 8107274, 8110895, 7906923, 7987111, 7749904, 7649724, 7445054, 7224217, 7099300, 7198831, 7133109, 7027828, 6923770, 6562423, 6765605, 6791175, 6236374, 6178762]
14098F178762K31523r8105m40721K57988k32588j96012K4653K09752l40188J69240
14088E764304m2539l10739L54609o89776Q9542n0469P4253l56178O49756m64817
14078E017946k79927J95404o3562K00371j76984k82946j34090J3741M48196n55426
14068D382723Q8624k88842M78360l38958J6476l28624P4686j35628M2806o885
14058C984738K28075l58806K71842q0950q7522J67532n41950j5534k0707J0081
14048C556799K94592l79958M00576K1646k96227L09165k05325j35680q8479p3550
14038C403559M997p7893k46706N81942o11061K04679j05249o2439K55295k99777
14028C047347J0350m98257N08940m15063J76531L4369o5330K19232l18105p0675
$$ y = [6178762, 6410285, 6312180, 5871459, 6129447, 5896859, 5700847, 5725500, 5935252, 5595064, 5764304, 5721765, 5411026, 5765635, 5075859, 5165401, 5114932, 5189185, 4833007, 5482763, 5017946, 4738019, 4933423, 4869861, 5070232, 4893248, 4610302, 4476212, 4489953, 4938149, 4382723, 4471347, 4182505, 4660865, 4321907, 4338383, 4009759, 4084445, 3948817, 3991623, 3984738, 4212813, 3854007, 4125849, 4044899, 3957377, 4124909, 3582959, 3567425, 3546718, 3556799, 3851391, 3471433, 3872009, 3893655, 3597428, 3906593, 3701268, 3565588, 3477109, 3403559, 3408556, 3330663, 3083957, 3665899, 3054838, 3259517, 3154268, 3091829, 3347124, 3047347, 3057697, 2559440, 3068380, 2653317, 2829848, 2864217, 2798887, 3018119, 2700014, 2629339]
14018B629339J85803j076m2955q5283K34710j73475j3206k75266L5507K43942
14008B738040j02899l63304K64394k29492J39585K40309n80122J15226j31082
13999B090655L3176K34560j7791j30159j51771M1826L0115O6565k96968J30942
13989B031150Q2857j36735K56166j47888Q6864J02412J10984l13354q4130j42263
13979A846063N50356L81650j45048P63218N19408J931954L008607M731851R951185
13970B3539244Q802156j0088783q127330n088648k913277j067319m90839p76402
13962C788802j47850o45347M4405N5704n22633q5177J59419n26760j69817L12700
13952B263446J39346l3789j27330k6923j28977j32892j91037J21492J07502K7554
$$ y = [2629339, 2815142, 2814066, 2771111, 2685828, 2920538, 2747063, 2733857, 2458591, 2494098, 2738040, 2635141, 2271837, 2536231, 2306739, 2446324, 2686633, 2106511, 2221737, 2090655, 2123831, 2358391, 2340600, 2210441, 2058670, 2100496, 2130611, 2197176, 1900208, 2031150, 2114007, 1977272, 2233438, 2085550, 2172414, 2274826, 2385810, 2072456, 1988326, 1846063, 2396419, 2778069, 2633021, 3396239, 3915647, 5847601, 8856208, 13588059, 23539244, 32341400, 22252617, 14125287, 9036639, 6123362, 5056043, 4565204, 3788802, 3640952, 2995605, 3040010, 3095714, 2573081, 2487904, 2647323, 2120563, 1950746, 2263446, 2402792, 2369003, 2241673, 2214750, 2085773, 1952881, 1761844, 1883336, 1990838, 2018392]
13942B018392j98183J67888j80051k63196J10520K60160r3126N300N3247j93493
13932A687458k40206M41669k07980O8321q2351j90078J89797M2920o4906M9484
13922A694128J83030l82416K87061q8389q5808k02373Q8833n4601N9687k76880
13912A222272L48669N6841n01062N29257l41719K38752m42528L35657k35856j96378
13902A013905L75931L9128k77220K23173j73711O1126Q794P7192m00160M17429
13892A365587l75061P8527j1206Q8871K62047l23824j01548L84877O7391k44675
13882A190986M28976n30187L4165M5804p7381P6990O8202k59072j4065r9256K02908
13871A068070j8383j17791j20261R3922J24436p6675J67416j28947K52635k30143
$$ y = [2018392, 1820209, 1988097, 1808046, 1544850, 1655370, 1915530, 1822404, 1827704, 1880951, 1687458, 1447252, 1888921, 1680941, 1749262, 1666911, 1476833, 1666630, 1709550, 1644644, 1694128, 1877158, 1494742, 1781803, 1693414, 1607606, 1405233, 1494066, 1439465, 1499152, 1222272, 1570941, 1627782, 1126720, 1655977, 1314258, 1553010, 1110482, 1446139, 1210283, 1013905, 1389836, 1428964, 1151744, 1374917, 1201206, 1262332, 1271126, 1348318, 948158, 1365587, 990526, 1069053, 1057847, 1146718, 1408765, 1084941, 983393, 1368270, 1435661, 1190986, 1619962, 1089775, 1123940, 1169744, 1092363, 1169353, 1237555, 978483, 964418, 865162, 1068070, 1049687, 931896, 811635, 905557, 1029993, 953318, 1120734, 991787, 1244422, 1014279]
13861A014279K1042N08163l86221k22855k9193j6865L23306j73564j84830O2876
13851I16138K33450l10652K23656R6336k1715n4941j43113L9705j62811J70000
13841I86053J55565l31295Q9715K7664K38143J2009l12379j5954J58882r1028
13831I17375p0801N7616J09895N1299j75243K9502l59753L18046k73990K78701
13821H82647R0401k22871R4508k39647J55996p7953J80728r3833K40588l79367
13811F31197k05226M08619K658C14920K79520L90164l83447J82428j64412K61763
13801H80936j72863K47082j46259r8508n6677L37946D31597K09413j52681K84113
13791G72442l37568M46039m747l6213j51267j11559M0320j40079K32892l190J68440
$$ y = [1014279, 1035321, 1543484, 1157263, 934408, 905215, 888350, 1211656, 1038092, 853262, 916138, 1149588, 838936, 1062592, 1158928, 1137213, 1082272, 939159, 978864, 816053, 986053, 1141618, 810323, 900038, 927702, 1165845, 1177854, 865475, 849521, 1008403, 917375, 846574, 904190, 1014085, 1065384, 890141, 919643, 559890, 877936, 603946, 882647, 973048, 750177, 844685, 605038, 761034, 683081, 863809, 769976, 1010564, 631197, 425971, 834590, 837248, 314920, 594440, 984604, 601157, 783585, 619173, 880936, 708073, 955155, 808896, 710388, 653711, 991657, 431597, 641010, 488329, 772442, 434874, 880913, 876166, 839953, 688686, 577127, 617447, 477368, 710260, 707070, 875510]
13780H75510P0264l14530K72285q6884k27419K69040r2612K928j24578J49601
13770G93605j71351K44665j85335o3957N92884o03846K29572r0175k5241l10173
13760D10648K41244q6488P5984k22406N48470k94392j65976K24297j6638r5703
13750F19040l7011l078J33121J2022j30780O240K30602M6775j87433k8578k68220
13739C92700q7330L68673J05472j8365m3553j83302j31434K88413j67139L24312
13729H48447C88414k3528N46940C24878J91196r8537J72422K04361j43516A86880
13718E29508J70283B88068K49758k12590q1574L13189L5510P0853k68429J21001
13708E15786j38409K01004n8330n9616q2401J0960o8921J41199P9886m4918j82169
$$ y = [875510, 945774, 631244, 903529, 816645, 589226, 858266, 765654, 768582, 644004, 793605, 622254, 866919, 681584, 617627, 1210511, 606665, 836237, 746062, 720821, 410648, 651892, 565404, 641388, 418982, 967452, 673060, 507084, 731381, 714743, 619040, 582029, 578951, 712072, 724094, 593314, 599554, 830156, 876931, 689498, 660920, 392700, 305370, 674043, 779515, 761150, 717597, 534295, 402861, 691274, 524135, 848447, 388414, 364886, 911826, 324878, 516074, 417537, 589959, 794320, 650804, 186880, 529508, 699791, 288068, 537826, 325236, 243662, 556851, 592361, 663214, 394785, 515786, 377377, 578381, 520051, 460435, 378034, 388994, 320073, 461272, 541158, 496240, 314071]
13697C14071M31711N2761k97718n1128K09532k49229j841J78280n5838j5706J11410
13686F26305j71810A58567M40645B68502O5576J84367k14226j2677K89778r7587
13676D83733L5880j32915n0379K87423J29211j17612C03618j15522K23261o9116
13666C42241J58706p0387K9769J2734m6806A01969N47831j08630J4078k37101
13656C18147R9960L00679q8714O7171l05823p6970A01924L52062j1301A54294
13645B72120J58139j70511K28540J13718B19621q5095N55057n9864k91345j09713
13635B28661J39115r47j9036M0236j9209A35528L79337j62965m4628j09539K38141
13624D35874B06579L67548n3419j53284F494L55456J7141K16165L3889j91848
$$ y = [314071, 745782, 798543, 500825, 449697, 659229, 410000, 408159, 586439, 530601, 514895, 626305, 454495, 158567, 599212, 268502, 334078, 518445, 304219, 291542, 581320, 483733, 519613, 386698, 336319, 623742, 752953, 635341, 303618, 188096, 411357, 342241, 500947, 430560, 460329, 473063, 426257, 101969, 649800, 541170, 555248, 318147, 418107, 718786, 630072, 697243, 391420, 314450, 101924, 453986, 442685, 154294, 272120, 430259, 259748, 488288, 602006, 219621, 134526, 689583, 629719, 338374, 228661, 367776, 366829, 347793, 388029, 368820, 135528, 514865, 351900, 307272, 197733, 435874, 206579, 574127, 520708, 367424, 6494, 361950, 379091, 595256, 629145, 437297]
13614D37297L25351j77756B61409n5392J40588j29635K74502r904A55049K81895
13604D36944I3347B7363L91583O9694J00204j72859j02464R3209r6999K02257
13594E11988j11147Q1047j19396R8663k20430K07377j88831J41237A24093J62236
13584B86329k2897o7998K11248j9125n8882J10934N1980n8813j05818m111J53940
13573D76787j89927n5488J0726l3226Q6897O8704A66568J48543L38432I8440K23794
13562C22234j08015A3719K19145Q0688r7018L83972B62558l5254M8088J59453
13552D34845h5289D77907A07831J2692E1304J43279a8560B73234J37439K49515
13542F60188A13771K1701J06259l8559L37307A59012Q2107K30354k32253j9707
$$ y = [437297, 762648, 584892, 261409, 206017, 346605, 216970, 491472, 481568, 155049, 436944, 93347, 27363, 418946, 488640, 588844, 415985, 313521, 406730, 309731, 511988, 400841, 481888, 362492, 461155, 240725, 448102, 259271, 400508, 124093, 286329, 263432, 195434, 406682, 387557, 328675, 439609, 491589, 432776, 326958, 322847, 476787, 286860, 231372, 242098, 208872, 295769, 364473, 166568, 315111, 653543, 98440, 322234, 214219, 13719, 232864, 313552, 216534, 600506, 262558, 227304, 275392, 434845, -85289, 477907, 107831, 120523, 51304, 194583, -18560, 273234, 410673, 660188, 113771, 135472, 241731, 203172, 540479, 159012, 241119, 471473, 239220, 219513]
13532B19513R4722A36386O25202B12917M9410C8205i0356C63132m9379Q9589n2182
13521C51160A06934Q5773o1091K15159A34690J79169j39263J87462A52951J66363
13511C19314A34030a38040A06752a6147B35169R9183l605F1677P1818M05602P8855
13500F17952k94417m1409l0216m5905N8633H1304J65295j5014J54467I6643c23111
13488B49817p3016L31138j30132e274B51690K5554q0184K71662j50302r3997j6817
13477B07606O8274R7723j1523j62799J81202j40487J2723K46q7796M49479C03852
13465I1716M16796g4989B26978a006A38897J2811c5118B47566k0476J92000j54127
13454B64963m3367H0828P0322F5432J76656Q1175P9715b1853B5743J39832e3047
$$ y = [219513, 314235, 136386, 761588, 212917, 262327, 38205, -90356, 363132, 313753, 403342, 351160, 106934, 192707, 131616, 346775, 134690, 313859, 174596, 362058, 152951, 319314, 134030, -138040, 106752, -16147, 235169, 334352, 330747, 61677, 133495, 539097, 617952, 323535, 282126, 251910, 206005, 264638, 81304, 246599, 231585, 386052, 96643, -323111, 249817, 176801, 507939, 377807, -5274, 251690, 277244, 197060, 468722, 318420, 224423, 207606, 275880, 373603, 362080, 199281, 380483, 239996, 252719, 252965, 165169, 614648, 303852, 91716, 508512, -74989, 226978, -1006, 138897, 151708, -35118, 247566, 227090, 419090, 264963, 221596, 80828, 151150, 65432, 242088, 323263, 402978, -21853, 25743, 165575, -53047]
13442A85442K622C0165J7087O1245J79112o2987J43359b8341A05723A2426J69283
13431A81709F8843B1756N9310Q762L57928G8913C8479K90238j44157Q1516J16598
13420C82674B218O9112K22578A28158J3821J96441B9382M4751K05929g3175A68621
13408A38285D4288N11350A86919N7545q4891Q0335J02192J26386l2860A80354
13397B0859a48998G843Q6234M4310C3342J14234J37521m3439b27949c740j45888
13386a49628C45978o4327E5200g3365B53225A08103K4918a08364q1496D80717
13375I0718O0814g2319E4291K73651j42994a07137B62820b3638A57912R6477p2144
13364A82245q843l2722O831J2672m3199L0695l8059o289J54513J99341A49142
$$ y = [185442, 188064, 30165, 47252, 108497, 287609, 224622, 367981, -28341, 105723, 12426, 181709, 68843, 21756, 81066, 89828, 447756, 78913, 38479, 328717, 184560, 266076, 382674, 2218, 71330, 293908, 128158, 141979, 338420, 29382, 74133, 280062, -73175, 168621, 138285, 44288, 555638, 186919, 244464, 159573, 239908, 342100, 468486, 435626, 180354, 20859, -148998, 7843, 94077, 138387, 33342, 147576, 285097, 241658, -227949, -3740, -149628, 345978, 281651, 55200, -73365, 253225, 108103, 133021, -108364, -189860, 480717, 90718, 151532, -72319, 54291, 327942, 184948, -107137, 262820, -23638, 157912, 254389, 182245, 173402, 140680, 147511, 160183, 116984, 147679, 109620, 103331, 257844, 457185, 149142]
13352F7539R9449Q3132J39396E8623K04839H1015J76223A1159L00309a47513E606
13340C50510j74985C0043K64254g7634A88518J64010r9010r6581k765K61026K7229
13329D42427j73079J8623E0590L31467P6576B24091O9493H3621K29967C2925N6831
13318H9756P9752a71849E49789B72535Q3246j56121k4109M70716a40218B57530
13307I0313J29638j8983q2412f530B63317K02316q8802j22077E5834a53660B37615
13295A20896o753L7961a34369A48898o3665b7390C77768R25E216a61718j53755
13284c15473H0316K00698p4241p6149c40121C23498j47874J26190o6635c87227
13273A05325K98188I4888J60367J30497j28867k6629J32881h1263B82771A14482
$$ y = [67539, 166988, 250120, 389516, 58623, 263462, 81015, 257238, 11159, 311468, -147513, 5606, 350510, 175525, 30043, 294297, -77634, 188518, 352528, 253518, 156937, 154172, 415198, 442427, 269348, 287971, 50590, 382057, 458633, 224091, 293584, 83621, 313588, 32925, 89756, 169508, -171849, 549789, 272535, 355781, 199660, 175551, 646267, -140218, 257530, 90313, 219951, 200968, 118556, -6530, 263317, 465633, 376831, 254754, 55834, -153660, 237615, 120896, 114143, 152104, -134369, 148898, 85233, -27390, 377768, 378693, 5216, -161718, -315473, 80316, 281014, 206773, 130624, -340121, 323498, 175624, 301814, 235179, -387227, 105325, 403513, 94888, 255255, 385752, 256885, 230256, 363137, -81263, 282771, 114482]
13262A41642K23987a8021C00426F7019K31844c5057E480J37639J0733J17358a87868
13250A34458j634A4171a74076B29749N8785a16450a5249o235C40507a8495B23539
13238A90617n0695l9983Q0272C3679O5019M5879Q4092r3194g8858n3647M3239
13227h9266B22570i4779A04428K9869a78089A9913K45650G1002K60024n8112l5487
13216B37427c2626k4769a3217n3269B39146f4835B37942C1021J03688d8174A49913
13204G4957i1121A55119B7339P8938j869K74443A08763D3952L9776N4518r917
13193A28329q926n4994A4298K21812m4311F5395e8854B59998j02531B3684K67248
13182B90932A17400i5724A56013g4790C13099d2760D53444a80311c7787A8911
$$ y = [141642, 365629, -18021, 300426, 67019, 298863, -35057, 5480, 143119, 153852, 271210, -187868, 134458, 132824, 14171, -174076, 229749, 288534, -116450, -15249, -21484, 340507, -18495, 223539, 190617, 139922, 99939, 180211, 33679, 98698, 144577, 228669, 135475, -78858, -132505, -89266, 222570, -94779, 104428, 134297, -178089, 19913, 265563, 71002, 331026, 272914, 237427, -32626, -57395, -13217, -66486, 239146, -64835, 237942, 31021, 134709, -48174, 149913, 74957, -91121, 155119, 27339, 106277, 104408, 378851, 108763, 43952, 83728, 138246, 128329, 119403, 64409, 14298, 236110, 191799, 65395, -58854, 259998, 157467, 23684, 290932, 117400, -95724, 156013, -74790, 313099, -42760, 453444, -180311, -37787, 18911]
13171E6333K4783J31415I2612K33906C3003N9420K38550H9423a5319D28705D7120
13159f2584D59302k28163G0820J6493K59767b13330A18089e7888B84582a93415
13148h4359j10996j93964J66045A50397L6650h3301j12875c3000n2309j2880e627
13136b14903B26909B9266A0899d6597E5503a60982A86733k6829m2361j3428b6644
13124B69197C5713J5824p993a86890A26293M4208a25900C33703b20488g0619j53793
13113b24412N5104C28304a84689a5094C84884o7084i7530A43184n0495D1133g9023
13101F1911N2799a0207A09196J55791b49273J09894B880N0989c1798B53287b53477
13089B57291E5876d0670F0541a12000a5029j2717B5200O7150L06035A46885J16160
$$ y = [56333, 81116, 212531, 92612, 326518, 33003, 92423, 330973, 89423, -15319, 428705, 47120, -62584, 459302, 231139, 70820, 87313, 347080, -213330, 118089, -57888, 284582, -193415, -84359, -195355, -389319, -223274, 150397, 187047, -83301, -196176, -33000, -85309, -98189, -5627, -214903, 226909, 29266, 10899, -46597, 55503, -160982, 186733, 159904, 117543, 104115, -26644, 269197, 35713, 51537, 43544, -186890, 126293, 170501, -125900, 333703, -220488, -70619, -224412, -169308, 328304, -184689, -15094, 384884, 317800, -97530, 143184, 92689, 41133, -79023, 61911, 114710, -10207, 109196, 264987, -249273, -139379, 2880, 53869, -31798, 253287, -253477, 257291, 55876, -40670, 60541, -112000, -15029, -27746, 25200, 92350, 398385, 146885, 263045]
13078B63045a91510C0245b25389B78960I4289K15058A50641b98213A37109e6845
13067b71833D56033A93596a25114e2053A06771n1098a65773B05926N5690O2082
13057C23698a78397C31768j46245m0871J5350K65146A24070e2669j6455D98724
13046C8544b32146n0344c9449B10168l1638f6681B52155a4546j00712k55151c125
13034A08219L5533a0658C17721p8490r2175c21479i6700B31247a84226B79365
13023d1549p1032B4266R9293Q3442q0120a05059A17862B1626J20607o5038K31453
13012C08648j51338J36006G7477J51632b82624B32668o037n8819J51981J1816
13002C31609g3572A03049j8949J83822j02715D1360A5229M4370J1380l4798M8725
$$ y = [263045, -191510, 30245, -225389, 278960, 94289, 309347, 150641, -298213, 137109, -56845, -271833, 456033, 193596, -125114, -52053, 106771, 55673, -165773, 205926, 261616, 323698, -178397, 331768, 185523, 144652, 160002, 425148, 124070, -52669, -69124, 498724, 38544, -232146, -282490, -39449, 210168, 178530, -66681, 252155, -14546, -115258, -370409, -3125, 108219, 143752, -10658, 317721, 239231, 147056, -321479, -96700, 231247, -184226, 279365, -41549, -112581, 24266, 123559, 207001, 126881, -105059, 117862, 21626, 142233, 77195, 308648, 157310, 293316, 77477, 229109, -282624, 232668, 226631, 167812, 319793, 331609, -73572, 103049, 84100, 267922, 165207, 41360, 15229, 59599, 70979, 36181, 84906]
12991H4906b15698h8467j68881f5213K2359k07381J8472e8223A54075P1435J3245
12980B38755b18067R0624i433A10443a05721l40511D23134l7250b6453j84499
12970b10952M1610G2966B8327b5063C00326k1310A21660a53663A12870C5356N4590
12959H9946J22304A1871i2047E7620J937c1547A65740a49557j25362A40192g3073
12947A24695b3720B08576D3225K81384a25441C45253a44173J8121I1774c25014
12936a6714C0351R107O4742b5087c959C16438a2274j61095A24408M2606G6153
12924A5867g3149C3029h8356B72955a10765j49558Q5354B4861I431a19834q1435
12913b01269b8841k98821B83730g2463q6345B25200J9735a2971j8831r0061r871
$$ y = [84906, -215698, -88467, -257348, -65213, -42854, -250235, -231763, -58223, 154075, 225510, 238755, -218067, -127443, -9433, 110443, -105721, -446232, 423134, 385884, -26453, -210952, -169342, 72966, 28327, -25063, 300326, 279016, 121660, -153663, 112870, 35356, 89946, 212250, 11871, -92047, 57620, 59557, -31547, 165740, -149557, -274919, 140192, -73073, 124695, -23720, 208576, 43225, 324609, -125441, 345253, -144173, -126052, 91774, -325014, -16714, 30351, 39458, 104200, -25087, -3959, 316438, -12274, -173369, 124408, 167014, 76153, 15867, -73149, 33029, -88356, 272955, -110765, -260323, -174969, 24861, 9431, -119834, -201269, -28841, -327662, 283730, -72463, -158808, 225200, 244935, -12971, -31802, -121863, -131734]
12902a31734o643C239a05930b881n5619H3510c42771A50428K40254b43417B7349
12890B15202e0373C7055b2496A93566r3095J03284g6156B23504o9572i0560j01207
12879a91767J839B36439p9393a42222I4176a88166k7766Q5401a078C6865c69246
12867E46487b24539D31476d8629C88191a14702r5790h0248c4682A18868j0147
12857A08721K18073h3046c5907m52906C07956I2506I115J28139a3117G4033b05847
12845D5976a9348j12668A6171b59998A08340Q5752D3377h1104B98497G2324J60023
12834B32347l4538B2386L7865K1360R9523H2518a99264d8009k37889b0189j35083
12823a55272A61068E4426a21785O172A97675j3292G0755M7395g8914A84107b31626
$$ y = [-131734, -138377, 3239, -105930, -2881, -58500, 83510, -342771, 150428, 390682, -243417, 27349, 215202, -50373, 37055, -22496, 193566, 100471, 203755, -76156, 223504, 153932, -90560, -191767, -189928, 236439, 157046, -142222, 94176, -188166, -215932, -130531, -1078, 36865, -369246, 546487, -224539, 431476, -48629, 388191, -114702, -210492, -80248, -34682, 118868, 108721, 326794, -83046, -35907, -488813, 307956, 92506, 9115, 137254, -13117, 74033, -205847, 45976, -19348, -132016, 16171, -259998, 108340, 194092, 43377, -81104, 298497, 72324, 232347, 197809, 22386, 60251, 81611, 181134, 82518, -199264, -48009, -285898, -20189, -155272, 161068, 54426, -121785, -115613, 197675, 184383, 70755, 118150, -78914, 184107, -231626]
12811c4482l537A68731i3551C66521A06833a62950j53963B46926a0430j7912j33463
12800a61805M0754l4572D36949B6554b88861C32898a23068A51082F8375a04056
12789c69662H7903l9794b93170h4262l1739K4046H1388J22327P4930q8172l9492
12778A50981Q835e2065m45911A72070a46805C30680b23787A38994b14591A04749
12767a06751K0293B71958h3531B32935C6284a93156c9423g625n154l5060i983
12755a83544p1020e6680J1560C7327M5877a81946j32469a22418q1138J01523C00419
12743A75814b15574j99263b04485Q7727j59035C52616A57879g64k88844L6727
12733b52881B16157j5592b24285B28749a87922G403K6711K10944q6342c709A76337
$$ y = [-34482, -38019, 168731, -93551, 366521, 106833, -162950, -316913, 246926, -10430, -28342, -161805, -121051, -155623, 436949, 26554, -288861, 332898, -123068, 151082, 68375, -104056, -369662, 87903, 48109, -293170, -84262, -116001, -91955, 81388, 203715, 278645, 190473, 150981, 159816, -52065, -497976, 172070, -146805, 330680, -223787, 138994, -214591, 104749, -106751, -86458, 271958, -83531, 232935, 36284, -193156, -39423, -7625, -12779, -47839, -9983, -183544, -254564, -56680, -45120, 37327, 83204, -181946, -314415, -122418, -203556, -102033, 300419, 175814, -215574, -414837, -204485, -116758, -275793, 352616, 157879, -764, -289608, -252881, 216157, 200565, -224285, 228749, -187922, 7403, 34114, 245058, 158716, -3709, 176337]
12721A55875K63771j80556P3714j38708F1902b60770E1445c8739B6345K3413A1028
12709E0415b07009C992e4268j83503c5154G4054a33642j39677B80161k5443b1616
12697A6672b0685B63107I3212e0866B31668e9204B57587d9253B25628A3983a6748
12685F5576d3628j25573B0531Q7804l5334b39213L9014A7996K57298m6682q4760
12674A43852p0960a40564a2516A25068b07279r9002a03739k1050j15459F8185
12663C2050K11222B754J81096a11771G3855g0882a6698B11243b64655P2536C52275
12651A53582c37904a21343E0748K51960A10115c96919C2297J26541b96365A09302
12640A97107C6991i0155A06769C5703g7092D5255N2365a87547P2975D26207A52825
$$ y = [155875, 419646, 239090, 312804, 174096, 61902, -260770, 51445, -38739, 26345, 49758, 11028, 50415, -207009, 3992, -54268, -237771, -35154, 74054, -133642, -273319, 280161, 254718, -21616, 16672, -20685, 263107, 93212, -50866, 231668, -59204, 257587, -49253, 225628, 13983, -16748, 65576, -43628, -169201, 20531, 108335, 73001, -239213, -200199, 17996, 275294, 228612, 143852, 72892, -140564, -12516, 125068, -207279, -306281, -103739, -124789, -240248, 68185, 32050, 243272, 2754, 183850, -111771, 73855, -70882, -16698, 211243, -264655, -192119, 352275, 153582, -337904, -121343, 50748, 302708, 110115, -396919, 32297, 158838, -296365, 109302, 197107, 36991, -90155, 106769, 35703, -77092, 45255, 97620, -187547, -114572, 426207, 152825]
12628e8429a6190C9853a1340j09282A46300c9778j57217j09873B74797j27096
12618A47701a91652n0258R1396C10773a21565A18575L74448I6967H45b35738G2474
12606a6304p6319h634I2840A6480P8413a52145A42245M817B8639J34341m000g3375
12593a50022A38800a6797q9339A04269d0646E8665K04294j3490j0723A12715j9600
12582I3115i0966k68017J50239J1267j5166d8434j8354A00354K89660A26549h21
12570a03813B18983c07761A94958r1405M9261F8709o790A0353b1314o3911B0914
12558C4688J87626b58597B00133l2621J37646J02520j67897F0449J27318B0080
12547A31267a24676j415A82837N4694J9001i9519C0158p7N18164A73740i2746
$$ y = [-58429, -16190, 39853, -11340, -120622, 146300, -39778, -196995, -306868, 274797, 147701, -191652, -241910, -150514, 310773, -121565, 118575, 493023, 96967, 845, -235738, 72474, -16304, -92623, -8634, 92840, 16480, 94893, -152145, 142245, 147062, 28639, 162980, 158980, -73375, -150022, 138800, -16797, -106136, 104269, -40646, 58665, 262959, 249469, 238746, 112715, 93115, -90966, -358983, -208744, -197477, -212643, -48434, -66788, 100354, 390014, 126549, -821, -103813, 218983, -307761, 194958, 103553, 152814, 68709, 61919, 10353, -21314, -85225, 20914, 34688, 222314, -258597, 200133, 167512, 305158, 407678, 239781, 60449, 187767, 20080, 131267, -124676, -126091, 182837, 237531, 256532, -99519, 30158, 30081, 548245, 173740, -92746]
12535c9585j30455A9352c18269J44235G9853a3064B14935a24348j92599a4583
12524c0569B60683D2674a98728A69460a58692B07159R1314a20559k26580L9357
12514c07782A16200m5747G95K53101a71692e5565A16145a58530e5761j3490G8180
12502B7813a87815n3706A09455b23525D91a58857e121A78811h6481H4904j2242
12491G2662g7858C59858F6885O6092n4757l3870a07287j2772A01237a76314d5854
12479b1822l25924E4461d2294B22380o2483a76136C9301h9083I7967a37449A39493
12467a31190l66610e1034A51070E3893b94853j11092a39161I6004J9797a8497
12456A28910a13630l6767a2492q2258k450i297j74315B1950L34229j15289A4100
$$ y = [-39585, -170040, 19352, -318269, -174034, 79853, -13064, 214935, -124348, -316947, -14583, -30569, 260683, 42674, -198728, 169460, -158692, 207159, 298473, -120559, -347139, -307782, 116200, 70453, 795, 253896, -171692, -55565, 116145, -158530, -55761, -69251, 78180, 27813, -187815, -241521, 109455, -223525, 491, -158857, -5121, 178811, -86481, 84904, 72662, -77858, 359858, 66885, 132977, 78220, 44350, -107287, -120059, 101237, -176314, -45854, -21822, -347746, 54461, -42294, 222380, 159897, -176136, 39301, -89083, 97967, -137449, 139493, -131190, -497800, -51034, 151070, 53893, -294853, -405945, -139161, 96004, 115801, -18497, 128910, -113630, -150397, -12492, -94750, -97200, -9297, -183612, 21950, 356179, 240890, 14100]
12444E879a94362e8480B25326a25497j92961K7353f62j51068O6691b7014N705
12433b1309A49070a32128e3804B30292b29415Q8283D4552a97400B6230a36116
12422a06874k98063d4849j47183j39786c6618O762r7189B03263a67411A03633
12411A60417i6956A61427a7561j04150a095m261G6059c47785I7603Q1709c00252
12399A34003A0365i3529A40278b8813o903q4500A74902B7829a62852A23187b80745
12387B1617K46282r7979H177g61k37725A35131m7382a54796A60810J67795a06526
12375h6719B50723a57373K2186j94132A73244o7682i9417m2043f8827F5830a89814
12363A41543a7173D86669c9384C8963J22574a80984J8856O9971B91779B526c7907
$$ y = [5879, -194362, -58480, 225326, -125497, -318458, -291105, -662, -151730, -85039, -27014, -21309, 149070, -132128, -53804, 230292, -229415, -141132, 44552, -197400, 26230, -136116, -106874, -404937, -44849, -192032, -331818, -36618, -29856, -127045, 203263, -167411, 103633, 160417, -96956, 161427, -17561, -121711, -1095, -5356, 76059, -347785, 97603, 179312, -300252, 134003, 10365, -93529, 140278, -28813, -35716, -120216, 174902, 27829, -162852, 123187, -280745, 21617, 267899, 169920, 8177, -761, -238486, 135131, 87749, -154796, 160810, 328605, -106526, -86719, 250723, -157373, -135187, -329319, 173244, 105562, -99417, -141460, -68827, 65830, -189814, 141543, -17173, 486669, -39384, 38963, 161537, -180984, -162128, -92157, 291779, 2526, -37907]
12351b94445D9377b73325E3085J88232E7490a41436A73488c27022F4612a06261
12340A18218a58238A24301D3384R581i4851c886A97255m7249a06439N0047A24241
12328c0007A01778a82050c8413j17739H1194f8786l8832I0646K6276J09564g0797
12316c0459G9812l3417a38495I8842J77081M2188D5658i8806j23942e7011H4773
12304a9444B29909J06938E9151K40552b3770A69600L85761j13059A94089r822
12294A84267C1367K67705h8531D5184a14251j27G2093J7760J73908G0935K5020
12283I5955B6829J91732O0317C7196J1486a26203A57419m3359a03372F748J97722
12272B04470O8092p0602O0075D0905e6524E4115N4787a54977j97589B29240E0101
$$ y = [-294445, 49377, -273325, 53085, 241317, 57490, -141436, 173488, -327022, 64612, -106261, 118218, -158238, 124301, 43384, 52965, -94851, -3886, 197255, 150006, -106439, -56392, 124241, -30007, 101778, -182050, -38413, -156152, 81194, -68786, -107618, 90646, 116922, 226486, -70797, -30459, 79812, 46395, -138495, 98842, 275923, 318111, 45658, -98806, -222748, -57011, 84773, -19444, 229909, 336847, 59151, 299703, -23770, 169600, 555361, 442302, 194089, 184267, 31367, 299072, -88531, 45184, -114251, -114378, 72093, 89853, 263761, 70935, 95955, 26829, 218561, 278878, 37196, 48682, -126203, 157419, 114060, -103372, 6748, 204470, 272562, 201960, 262035, 40905, -56524, 54115, 108902, -154977, -352566, 229240, 50101]
12260A73387a5709k9206A5370N254c61B03528A5968J32801h6843A49983F0457
12248A06339a88765C66950j60807c4428H2446K77471A46966b81717A24563b38605
12237D32281h5572A22875k2360d09094A02643J94424l3696O1474A7145J01465
12227A18610N3435a94118B43534k347q7661a09166D9665J90022a73438M5722l6444
12216a64160B78258H1105C1342J27119a35473J8188A63328K6649l180K65189A63329
12204B03616l6522F0927B8265O9334c6091D00632J10301f9351A83458b78411B82529
12192B24683B1837J80736a1579j10467C02525j21428F4386a13771H5887G592K00792
12181B08384K1127M3012J95556j60849P688F4596k994K37446H395J70687H6146
$$ y = [173387, -15709, -44915, 15370, 20624, -361, 203528, 15968, 148769, -86843, 149983, 60457, 106339, -188765, 366950, 206143, -34428, 82446, 359917, 146966, -281717, 124563, -238605, 432281, -85572, 122875, 100515, -409094, 102643, 297067, 263371, 324845, 17145, 118610, 172045, -194118, 243534, 241187, 153526, -109166, 49665, 239687, -173438, -127716, -164160, 278258, 81105, 31342, 158461, -135473, -117285, 163328, 189977, 186797, 451986, 163329, 203616, 167094, 60927, 28265, 97599, -36091, 400632, 510933, -69351, 183458, -278411, 282529, 224683, 21837, 202573, -11579, -122046, 302525, 181097, 64386, -113771, 85887, 7592, 208384, 229511, 272523, 468079, 307230, 314918, 64596, 61602, 299048, 8395, 179082, 86146]
12169a38788L5396r0498J1150B36212r0270o0473K65568j60133R799F3314g845
12157B18079J99677j94182J75967A10713K9918J5109Q6074J3825A20991J01679
12147B22670e1260D1473J96409D7318J36666N1724a7431p5034B34192A1283L4292
12136D5575J04198J56239b70716P4160C02166A17232d5043l3169c3090C91825
12125a49080c543B23890a13524B46772b38290e6264A43897p0795j0472P8989a79717
12113B02288H9230Q540L2935K42126b7905I1868a95595G7090K55690K9709p6922
12102B85567C4701J30630D6987j677L7659a9085A51746e8744A33798O2327E7429
12090A54883c6023q622j12631a2775o9528A39802b19956b0831l450A11736J17184
$$ y = [-138788, -103392, -193890, -182740, 236212, 145942, 85469, 351037, 190904, 200703, 63314, -7845, 218079, 417756, 223574, 399541, 110713, 140631, 155740, 241814, 255639, 120991, 222670, -51260, 41473, 237882, 47318, 183984, 235708, -17431, -92465, 234192, 11283, 45575, 149773, 306012, -270716, -196556, 302166, 117232, -45043, -78212, -33090, 391825, -149080, -3543, 223890, -113524, 246772, -238290, -56264, 143897, 73102, 62630, 141619, -179717, 202288, 89230, 97770, 130705, 372831, -27905, 91868, -195595, 77090, 332780, 362489, 285567, 34701, 165331, 46987, 45310, 82969, -19085, 151746, -58744, 133798, 196125, 57429, 154883, -36023, -44645, -157276, -12775, -82303, 139802, -219956, -20831, -24281, 111736, 228920]
12079B28920a14422D3964b58012c3429j32090F6289h1904k19040B38385e8842
12068B60514a791C30147e9283A16811K55407J2861A76044c7643A64539C07M102
12057D409b86964A12729J31436j13511c92768C02277d2088B96484d5659B60427
12046g515A86121F144J03155K55700A38112D5932h3218j10050B28628a0564j8719
12035b9283D09309A84045G6446J60439a70682l6017J00124C00171c26552B49457
12024d91655A36134F1013J281c97990A51221E1012J06993a56071A13672J12704
12014B26376j02077m8722J16300H302J73217b27859B1370J63452B0323J4403K5674
12003F0400J4626J84096A23569J44584F8988a77232H7587P7488M3290e5881k23379
$$ y = [228920, -114422, 43964, -258012, -33429, -165519, 66289, -81904, -300944, 238385, -58842, 260514, -1791, 330147, -59283, 116811, 372218, 385079, 176044, -37643, 164539, 307, 4409, -286964, 112729, 244165, 130654, -392768, 302277, -42088, 296484, -45659, 260427, -7515, 186121, 6144, 109299, 364999, 138112, 45932, -83218, -193268, 228628, -10564, -29283, 409309, 184045, 76446, 236885, -170682, -206699, -106575, 300171, -326552, 249457, -491655, 136134, 61013, 62294, -397990, 151221, 51012, 158005, -156071, 113672, 226376, 124299, 75577, 191877, 8302, 181519, -227859, 21370, 184822, 20323, 34726, 60400, 75026, 259122, 123569, 268153, 68988, -177232, 87587, 165075, 208365, -55881, -279260]
11992b79260g4077N294A9728a73832f1020D46608B0478g289j06759j66614e781
11980B58841E4534d8708l2500B63188h6524L999D68588C6373K48577J06862a4868
11968G3806a70198F9357a71353m7210f7071F9025c2430A77245B1636N4896a20483
11956a99221b84B7082a38739O7975o1746F0052b14089p0820J07165e4968F147
11944A42517C6842k082a2478I6471c8569b452k20781E9224a93537B40299g8624
11932d4251j70094B62179l5244I1513J95840a17842K1877b1627k7440l95274E8861
11920C1830c85239a78261E95578a2808r7750m9991m0845I5991O6784a59544L9767
11909a19777d1203A87049N9178a1959k76926J43377H1174k7842d2057j4321j0880
$$ y = [-279260, -74077, -68783, 19728, -173832, -61020, 446608, 20478, -7289, -114048, -280662, -5781, 258841, 54534, -48708, -81208, 263188, -86524, -82525, 468588, 36373, 284950, 391812, -14868, 73806, -170198, 69357, -171353, -218563, -67071, 69025, -32430, 177245, 21636, 76532, -120483, -199221, -284, 27082, -138739, -70764, -132510, 60052, -214089, -284909, -177744, -54968, 6147, 142517, 36842, 34760, -12478, 96471, -38569, -2452, -223233, 59224, -193537, 240299, -78624, -44251, -214345, 262179, 226935, 91513, 287353, -117842, -95965, -21627, -49067, -444341, 58861, 31830, -385239, -178261, 595578, -12808, -110558, -160549, -201394, 95991, 162775, -159544, -119777, -41203, 187049, 246227, -11959, -288885, -145508, 81174, 53332, -42057, -56378, -67258]
11898f7258G1254h6535F643J9318a23452e2205a3247l13489F2853J49962l9329
11887A73486m3692b42786e0013G4418a51150N5172j5892a2387B1836J69503a56748
11875B10961a52499f5872k91k32835D27614A64520E0433J39856a50071j28943
11865b79014I5734J2216a2933B01877C1763J4359k1534i9215R599j4254m1528
11854a45398a4749A37427d1551B60016a16344j1136n9038c8654A99394m7865a76084
11842a3270j51858G05b1485j12373A99570b51167d799E7851e0644B8113K56724
11831B84837G9516b82916F325c72191d8370a9659I1855b47519A71558h3624m49
11820h4073A11702P0721H4419a37949k2276A82345k4886a34861N9708B3892G204
$$ y = [-67258, 71254, -86535, 6643, 25961, -123452, -52205, -13247, -326736, 62853, 212815, 173486, 129794, -242786, -50013, 74418, -151150, -95978, -111870, -12387, 21836, 191339, -156748, 210961, -152499, -65872, -66163, -298998, 427614, 164520, 50433, 190289, -150071, -279014, 95734, 107950, -12933, 201877, 31763, 46122, 24588, -99215, -89616, -103870, -145398, -14749, 137427, -41551, 260016, -116344, -127480, -186518, -38654, 199394, 151529, -176084, -13270, -165128, 705, -21485, -133858, 199570, -251167, -4799, 57851, -50644, 28113, 284837, 79516, -282916, 6325, -372191, -48370, -19659, 91855, -247519, 171558, -83624, -84073, 111702, 182423, 84419, -137949, -160225, 182345, 157459, -134861, -75153, 23892, 7204]
11808b08898A9460b34380C07395g9992j84525C07324f7796b0020j18234C02385
11797C010a88914P5044g354B45255p7842a34155J1283d8379m7117q2056e9126
11785b97936F0440c6472I8185D1725a41594j42282a14270d8025F9597K7231b3416
11773a3305A37454c31881P0871B01950n2629a536m4100j18101K0730q8602Q5538
11762a46071A54290a09260A91060a18594I534f4494b7101j35537A0272O6687J08609
11751A85568p5202b91926D9384b48863N8502D16603a25328A2366M85327a60920
11740A66514d7521F1223j5637K0156K5252J15314b34226J12903j23973e3671A317
11728A40686m7145h2236D6507L1804M17519e3357I1563d59383e804A12028d3697
$$ y = [-208898, 19460, -234380, 307395, -79992, -264517, 307324, -67796, -20020, -138254, 302385, 3010, -188914, -113870, -7354, 245255, 167413, -134155, -122872, -48379, -95496, -177552, -59126, -297936, 60440, -36472, 98185, 41725, -141594, -283876, -114270, -48025, 69597, 96828, -23416, -13305, 137454, -331881, -261010, 201950, 149321, -1536, -45636, -163737, -143007, -231609, -146071, 154290, -109260, 191060, -118594, 9534, -64494, -27101, -162638, 10272, 76959, 185568, 110366, -291926, 49384, -248863, -190361, 416603, -125328, 12366, 497693, -160920, 166514, -47521, 61223, 45586, 65742, 90994, 206308, -234226, -121323, -245296, -53671, 1317, 140686, 93541, -82236, 46507, 78311, 495830, -53357, 91563, -459383, -5804, 112028, -43697]
11716a13313K0123d4671F7179L12332b61572B48387c11764f6981B39759n6826
11706A82933c55364J76249B35251h9051B4384J79480a68091k21951F1658A3797
11695a11318A59082a04138C75397I2219C7757O3496J75202A7917K1609i8864n9058
11684a57922j50391a1853B23130b31629E9918b15780A00857c1440A93993A3245
11673H0359J05628E9664Q2714J21325E5520k0869K5985b85920a3331k36279B5047
11661I5871b1114B80881b73819A99797C1669J24647P5173B7906h8918j73546A71691
11649b93136A20916k4058a01062E6270j8035d9416j64276I6560J66453o2772D6966
11637b1084E1249b7404E837J69287K7169e5953J8036A95704i2103n9958A64a22000
$$ y = [-113313, -93190, -44671, 67179, 379511, -261572, 248387, -311764, -66981, 239759, 182933, -355364, -179115, 235251, -89051, 24384, 203864, -168091, -390042, 61658, 13797, -111318, 159082, -104138, 375397, 92219, 37757, 101253, 276455, 17917, 39526, -98864, -157922, -308313, -11853, 223130, -231629, 59918, -215780, 100857, -31440, 193993, 13245, 80359, 185987, 59664, 142378, 263703, 55520, 34651, 60636, -285920, -13331, -249610, 25047, 95871, -21114, 280881, -273819, 199797, 31669, 156316, 231489, 27906, -88918, -262464, 171691, -293136, 120916, 96858, -101062, 56270, 38235, -49416, -213692, 96560, 263013, 200241, 46966, -21084, 51249, -27404, 5837, 175124, 202293, -55953, -37917, 195704, -92103, -152061, 164, -122000]
11624a9470j3055M121k7526l9350E0524g2197a1302I6810e9290B08690I2814l037
11612H9777a65810B74857r6495K03286f9845E8962N6124b4589D0946K65322e557
11600H2515J84604B8032b5884A17098c5912g857m3128C68449c82239i3894b6984
11588A91167c12257F2933K0648b73830Q7408a2745p4628G5295J92320a10434F5152
11576A68714a23580K1582B94268a2925D2500M8880b42480e7474B90875p7268a42860
11564A66224M0462C3171A4534e32388C32184H5445J50096m4432R1824m4027K32679
11553D71585E0118F510J73390a85451D385c03312a3769K073D92963B21093B1381
11541i6695A88461C8637L5910O0987J98840g4056j41968B54085B4456b20146D5882
$$ y = [-19470, -32525, -28404, -55930, -95280, 50524, -72197, -11302, 96810, -59290, 208690, 92814, 89777, -165810, 274857, 178362, 381648, -69845, 58962, 115086, -24589, 40946, 306268, -5557, 82515, 267119, 28032, -25884, 117098, -35912, -7857, -50985, 368449, -382239, -93894, -26984, 191167, -312257, 62933, 83581, -273830, -186422, -12745, -87373, 75295, 267615, -110434, 65152, 168714, -123580, -101998, 294268, -12925, 42500, 91380, -242480, -57474, 290875, 213607, -142860, 166224, 206686, 33171, 14534, -532388, 332184, 85445, 235541, 191109, 282933, 238906, 471585, 50118, 6510, 179900, -185451, 4385, -303312, -13769, -11696, 492963, 221093, 21381, -96695, 188461, 38637, 74547, 135534, 334374, -74056, -216024, 254085, 24456, -220146, 45882]
11529a29304L3221k4615F0691I609i4159B48339H6831j6650b53844C6907L2237
11518F9144J6060J00349F2490k0451K52366j33766D8468K29944c0696A13326d9101
11506A58285a55805n674B53365J86888a18359d3629F8590M258K84197a98311j85950
11495c84261C85400b3682k3825C36689D2051P0865d6627F9276O6865e3868o1778
11484a15646A31728E4686j6749b34489A23793C0351K44603q1070j4768J76654
11474C55770I7446Q1627N175l2186E032J39367A5867b13833B19668A08859K96549
11463D05408a16814d2730B8545a12903A84951F4784M7117J28149C5889f7349B76797
11451b04396C10692a21446A36008Q0945b40989C05299j20023c9985K674l628B20175
$$ y = [-129304, -96083, -120698, 60691, 9609, -94159, 248339, 86831, 70181, -253844, 36907, 69144, 85204, 185553, 62490, 42039, 294405, 160639, 48468, 278412, -30696, 113326, -49101, 158285, -155805, -161479, 253365, 440253, -118359, -43629, 68590, 72848, 357045, -198311, -384261, 385400, -23682, -47507, 336689, 42051, 112916, -46627, 69276, 136141, -53868, -115646, 131728, 54686, 37937, -234489, 123793, 30351, 274954, 193884, 179116, 355770, 97446, 179073, 184248, 152062, 5032, 144399, 15867, -213833, 219668, 108859, 405408, -116814, -42730, 28545, -112903, 184951, 64784, 111901, 240050, 35889, -67349, 276797, -204396, 310692, -121446, 136008, 216953, -240989, 305299, 185276, -39985, -37311, -40939, 220175]
11439a22710M7328j34475A1101J47889n4729a83725k5130C32958A49745D0747
11428f2762I0814a8072j24826K6620A70045L8414a6116H4495C6613a07547B95240
11416C26213B383J51808a74377n2978D41675F476b26921A12055b14413B2461N6879
11405G9340e7608k46996h119B12381a01490j64760a00551c5099A11912g2286A41387
11393a00726k01995a33102A2826c03531a48231C015b61607g3326B46740c54064
11382g3587B18962J01858J99886a03557k92024B6328O3268i5415j09697H2712
11371d2243B23811C2048c17494J45686P6858E7442B0306M1894K9920c36285P9248
11360b57037F5204L08087j60498o9463K1469a306m9603r1330A43373b9489D4428
$$ y = [-122710, -75382, -209857, 11101, 158990, 104261, -183725, -208855, 332958, 149745, 40747, -62762, 90814, -18072, -142898, -116278, 170045, 208459, -16116, 84495, 36613, -107547, 295240, 326213, 2383, 154191, -174377, -227355, 441675, 6476, -226921, 112055, -214413, 22461, 79340, -57608, -304604, -8119, 212381, -101490, -266250, -100551, -35099, 111912, -72286, 141387, -100726, -302721, -133102, 12826, -303531, -148231, 3015, -261607, -73326, 246740, -354064, -73587, 218962, 320820, 520706, -103557, -395581, 26328, 89596, -95415, -205112, 82712, -42243, 223811, 32048, -317494, -171808, -94950, 57442, 20306, 62200, 92120, -336285, -257037, 65204, 373291, 212793, 143330, 164799, -1306, -50909, -142239, 143373, -29489, 44428]
11348C73505D8074b9220q2620M6782C326i9226j05900L7159A91125C7b19162O7924
11336a51238M797A7482h8545B42331A7840h3243A62718F6153g4765O868l80394
11325d48291a6164J614g016j72353h1737a660B12058a52370a4731j32104k3018
11314a69853I7852j0585b5689m9224o0109o8775b1692p8428B37291i1562A0154
11302D58996B3680J64355b556j65361D4903h2699A79186j0111b07969a01266j6393
11291a17659j17527M9259I1875J23888a11993I8707C3797b38860A41604n0899
11281I0705b26080h6534A54135a49102K8572j68259J39027H9989c19634B46526
11270A71872b3239l63650g1440D7923a53211m8232j31872A58689i1564b8668C1639
$$ y = [373505, 48074, -29220, -111840, -65058, 3326, -99226, -205126, -167967, 191125, 37, -219162, -151238, -146441, 17482, -88545, 242331, 17840, -83243, 162718, 66153, -74765, -67897, -448291, -16164, -14550, -7016, -179369, -81737, -1660, 212058, -152370, -14731, -146835, -169853, 97852, 87267, -25689, -74913, -135022, -203797, -21692, -100120, 237291, -91562, 10154, 458996, 23680, 188035, -2556, -167917, 44903, -82699, 179186, 169075, -207969, -101266, -117659, -235186, -185927, 91875, 215763, -111993, 98707, 33797, -238860, 141604, 90705, -226080, -86534, 154135, -149102, -120530, -288789, -149762, 89989, -319634, 246526, 171872, -23239, -386889, -71440, 47923, -153211, -201443, -333315, 158689, -91564, -28668, 31639]
11258c71617J47217G2439a19950A72735n259b73229R8968b9209q026l68269A32390
11246C895d60094A06326e0063n8921A90669a2622k96497G2183i4829o5395L2016
11235a28208A08970j7890c195j90912n7753C172f4676C1060J7905a86028g3987
11223b43176i4251e75B77508d18889K01380D4930a0685r0924d6258j58619B7849
11211B47802J63552F9210L1828D3327g2633j22359k0726A00331a05549k7713C88837
11199a14893r1968C7905h7936q3381L6709f5022A15810a2374B63054a99577l9988
11188b39565a4057m8640A01430D5448O2584a66201D7186d20091C7870c09180C16431
11176a49448k18117E6065a45339l50173B26316r3821b71273c8889I524d358k0815
$$ y = [-371617, -224400, 72439, -119950, 172735, 167476, -273229, -174261, -29209, -37235, -405504, 132390, 3895, -460094, 106326, -50063, -108984, 190669, -12622, -309119, 72183, -94829, -160224, -128208, 108970, 91080, -3195, -194107, -251860, 3172, -64676, 31060, 48965, -186028, -73987, -243176, -94251, -575, 277508, -418889, -217509, 44930, -10685, -101609, -46258, -204877, 27849, 247802, 411354, 69210, 101038, 43327, -72633, -194992, -215718, 100331, -105549, -133262, 388837, -114893, -206861, 37905, -87936, -171317, -134608, -65022, 115810, -12374, 263054, -199577, -239565, -14057, -62697, 101430, 45448, 108032, -166201, 47186, -420091, 37870, -309180, 316431, -149448, -367565, 56065, -145339, -495512, 226316, 132495, -271273, -38889, 9524, -4358, -25173]
11165b5173k80748a09677j13391A16050a0476A98452F7853c31693B1658c34500
11154b16546c9533o2693K6741H8322M03992A32342c91378i2819A86898o4b0138
11142a12631a4982D9423K44856F7302o639b20670q338f9599A15347D8807b17184
11130b155k02706A46538n8518k2534f4728B96667a35606j11134g7186C9777b7664
11118C1886R6875L0526a32298b7732j07489M3448k08524g2629l6565B96048h1047
11106c1191A53054D6732j3587M991a30531a5112A27350e5578E7671B1154p957
11095A3197a49951j96130A00916Q279E242J44851h3147G9286l38B7915J49868
11084A77783a34786B6191J08155K0405b25247H9919J98816B299a00364n6945B36438
$$ y = [-25173, -305921, -109677, -223068, 116050, -10476, 198452, 67853, -331693, 21658, -334500, -216546, -39533, -102226, -75485, 88322, 492314, 132342, -391378, -92819, 186898, 186834, -20138, -112631, -14982, 49423, 294279, 67302, 60663, -220670, -229008, -69599, 115347, 48807, -217184, -2155, -204861, 146538, 88020, 65486, -64728, 296667, -135606, -246740, -77186, 39777, -27664, 31886, 128761, 159287, -132298, -27732, -135221, -91773, -300297, -72629, -109194, 296048, -81047, -31191, 153054, 46732, 33145, 38136, -130531, -15112, 127350, -55578, 57671, 21154, 13197, -149951, -346081, 100916, 109195, 5242, 150093, -83147, 79286, 78948, 27915, 177783, -134786, 26191, 134346, 154751, -225247, 89919, 288735, 2299, -100364, -157309, 236438]
11072F7159f3562D20936C9507J04566E8466L4305L9557o2244K98241j15792C6542
11060A06354e2416B89031Q6183R9074A29339K55052P4248B24152l3915l8497L5277
11049A87017C646f837A74563R063N12286C15952K55396B14883n2850K37280J24147
11038E23460K46061C05736K19979j30956K66918C22458K21374B49199L81755k35218
11028C95736L33131k07976P9392j19668J43572q2932J60410j66532J55512C39633
11017H32909m07310J34593L6679r688Q4435j22443R3999B95821K58466k41741
11007C12546M88792m8574M0494j50801j95009K02579k02770J17708B80274L65988
10997F46262B46667K00969A43409N25940l21128N76072m18520j08115L8641N8572
$$ y = [67159, -63562, 420936, 39507, 144073, 58466, 92771, 132328, 70084, 368325, 252533, 36542, 106354, -52416, 289031, 375214, 474288, 129339, 384391, 458639, 224152, 190237, 151740, 187017, 3646, -6837, 174563, 183626, 695912, 315952, 571348, 214883, 162033, 399313, 523460, 769521, 305736, 525715, 394759, 661677, 322458, 543832, 249199, 630954, 395736, 728867, 520891, 600283, 480615, 624187, 541255, 701665, 535133, 690645, 339633, 832909, 425599, 560192, 596871, 587183, 671618, 549175, 643174, 295821, 554287, 312546, 801338, 752764, 793258, 642457, 447448, 650027, 447257, 564965, 280274, 646262, 246667, 447636, 143409, 669349, 348221, 924293, 505773, 397658, 436299, 494871]
10987D94871L313q6319K23190k88110J39407l7362K90553B68136K1834l4822L46095
10976F01243J55854C2022P28311K563j58234q5757N5095p341L9195J36215l3774
10965G08295K715J35154k31810L97098J64949k72265J19250L41002N0000j17458
10955A296930L02789J73137j34976J84871J06149L35631o16088P4400p082j68179
10945A547582j92187P7656P6435j06274m8274q4450M48427m0751j75067J12917
10935A616014j72042R0962m10698l8950r6848k45208J74239m25250j12271J59621
10925E39569j44361A30015K49035A07854k4491h9698A1091d0817B4308N5328L7638
10914A17274a72324d7365B54063a5033l1827A99850I0886a40147E8942J70849
$$ y = [494871, 498184, 411865, 635055, 346945, 486352, 448990, 739543, 268136, 289970, 255148, 601243, 757097, 32022, 760333, 762896, 604662, 518905, 574000, 566659, 605854, 742069, 708295, 711010, 846164, 614354, 1011452, 1176401, 904136, 1023386, 1364388, 1414388, 1296930, 1599719, 1772856, 1637880, 1822751, 1928900, 2264531, 1648443, 1722843, 1715761, 1547582, 1355395, 1433051, 1509486, 1403212, 1354938, 1270488, 1718915, 1678164, 1503097, 1616014, 1443972, 1534934, 1124236, 1085286, 988438, 743230, 917469, 492219, 379948, 539569, 395208, 130015, 379050, 107854, 83363, -89698, 11091, -40817, 24308, 79636, 117274, -172324, -47365, 254063, -15033, -46860, 199850, 90886, -140147, 58942, 229791]
10904B29791b38416A47894J697b36814d6147m0299j81370A80551e4378l2956B72195
10892B34363a06218c0729k02470A38514J84690j05331C9997L42231j55667A08225
10881f0508B81614d2066k75032E5841R6023h481j27810j6622a3854q8061A00868
10869G587h0956l7561q1249B14781g7277A9396a66384C0702J13824a21516r0346
10858b11862i9575l037K6879A95128F6485e0850l53691a89068k8435i292D2333
10846B36525a47983D0769g2364j37742d1244C75371b21702D10755A31671e0324
10835b95089G5888c2662A96326a49465k38333g6055l66388a1583A11211e4325
10824b84154J33013C55O2166J44325o6479a87535a4789A8700a53732I821J58140
$$ y = [229791, -238416, 147894, 149591, -236814, -46147, -86446, -267816, 180551, -54378, -87334, 272195, 234363, -106218, -30729, -233199, 138514, 323204, 217873, 39997, 382228, 226561, 108225, -60508, 281614, -42066, -317098, 55841, 151864, -8481, -136291, -152913, -13854, -101915, 100868, 7587, -80956, -118517, -199766, 214781, -77277, 19396, -166384, 30702, 144526, -121516, -211862, -99575, -102612, -75733, 195128, 66485, -50850, -404541, -189068, -217503, -9292, 42333, 236525, -147983, 40769, -72364, -210106, -41244, 375371, -221702, 410755, 131671, -50324, -295089, 75888, -32662, 196326, -149465, -387798, -76055, -442443, -11583, 111211, -54325, -284154, -151141, 355, 62521, 206846, 140367, -187535, -14789, 18700, -153732, 9821, 167961]
10813A67961c1062o2041I5425j084c22463F1303B412J43239M5105g1683o2049
10802a33732j26794P1948j89048a7496l0115a9403A12319i9526A39667a57149
10791i8707d5591m7527M5877D9457a61600P3798k31040A33928b94519J5972P9529
10780a99018H3801b94924J37308A9577Q629i8608k0992A70520a50302l5911j11999
10769b98212A9959b4150j05036e3653A9053e1033a8511H3336e82540a01607j32651
10758b34258A10500a40266B29919b40011L9008j34440H4372C0183a83568h653
10747A53103k1371b76955g8356l38137h8538r0941j26417N3948j0883B8535c40153
10735a91663G5691b51897B70633j34583f3522B9864b86419Q8629c7863n9147j38372
$$ y = [167961, -31062, -93103, 95425, 94341, -322463, 61303, 2412, 145651, 190756, -71683, -133732, -260526, -188578, -377626, -17496, -47611, -19403, 112319, -99526, 139667, -157149, -98707, -45591, -93118, -47241, 49457, -161600, -87802, -318842, 133928, -294519, -278547, -199018, 83801, -294924, -157616, 19577, 28206, -98608, -119600, 170520, -150302, -186213, -298212, 19959, -24150, -129186, -53653, 19053, -51033, -18511, 83336, -582540, -101607, -234258, 110500, -140266, 229919, -240011, -201003, -335443, 84372, 30183, -183568, -8653, 153103, 131732, -276955, -78356, -416493, -88538, -179479, -305896, -251948, -262831, 28535, -340153, -191663, 75691, -251897, 270633, 136050, -63522, 29864, -286419, -197790, -37863, -97010, -235382]
10724b35382J9775j98066H526f4183I6168j7138K77791B3128J98608c5733k34480
10713b70213P18I6708b09267d0169j04036k0572B19243b18663O1995E3298n155
10702D8143b54177A32066F1660b78632E5734g2431a0770D1863a84991j08684J37106
10691a56569O024L8576N296a2691A15134J01854d1814A9902g3495q5452j12908
10680b71855F1316b36339a95p0200E6357a83904n1060I9281J4286J8241k1298
10669A10510J04442i2942j06012A33417a9634G3159k9823b8505j92093I9424A304
10657g4630k29740m2295F2402b8852l39066b7594k03122J2673a0981A93062G4009
10645G7368f4373A62770m0070J3319g1564B8240b514k48156D82929f2222n2076
$$ y = [-235382, -215607, -413673, 8526, -64183, 96168, 79030, 356821, 23128, 221736, -35733, -270213, -269495, 96708, -209267, -40169, -144205, -164777, 219243, -218663, -156668, 53298, 48143, -254177, 132066, 61660, -278632, 55734, -72431, -10770, 41863, -184991, -293675, -156569, -150545, -111969, -106673, -12691, 115134, 216988, -41814, 19902, -73495, -158947, -271855, 61316, -236339, -195, -70395, 56357, -183904, -234964, 99281, 113567, 131808, 110510, 214952, -92942, -198954, 133417, -19634, 73159, 43336, -28505, -220598, 99424, 1304, -74630, -304370, -346665, 62402, -28852, -367918, -27594, -230716, -218043, -10981, 193062, 74009, 77368, -64373, 162770, 122700, 136019, -71564, 28240, -2514, -250670, 482929, -62222, -114298]
10634a14298N4631j43372A6247c57932A73931a83224a5003B46612b07194L2388
10624a74806N6122N4268D7777K02726f545p7758m0316n6060A19288d380A1228
10612C8791K55999R659c3596k46617h2835r8640C16426A21926a94132D13a37897
10600A82729a11116j52771A60032a58723E5091J57215c05617f7992B16610e5819
10589G7249a45872k61479J40270K1932m9501C221b51991B48618c18328a758m5563
10578d7321k19478R8572O7230d0796a9015r2431o9571C96436A31900C4038b09142
10566f9857a7019m8008b9133h663l09942A08059k1291c0083A96771a2137h36E8718
10553E3460J78734A08341a67401C13572c4913n113B66524d1421k55572J12663
$$ y = [-114298, -59667, -203039, 16247, -357932, 173931, -183224, -15003, 246612, -207194, -174806, -118684, -64416, 47777, 250503, -6545, -84303, -124619, -180679, 119288, -4380, 11228, 38791, 294790, 304449, -33596, -280213, -82835, -181475, 316426, 121926, -194132, 413, -137897, 182729, -111116, -263887, 160032, -158723, 55091, 212306, -305617, -67992, 216610, -55819, 77249, -145872, -407351, -267081, -245149, -294650, 3221, -251991, 248618, -318328, -1758, -47321, -266799, -168227, -100997, -40796, -19015, -111446, -181017, 396436, 131900, 34038, -209142, -69857, -17019, -65027, -29133, -8663, -318605, 108059, 86768, -30083, 196771, -12137, -836, 58718, 53460, 232194, 108341, -167401, 313572, -34913, -40026, 266524, -41421, -296993, -184330]
10543a84330q4910m096b0118C6160m685h7745M2043D6295J07259d39057a46421
10531a43004A53970b22424a0482A31848J1935a44117B29641n412a14097c5450
10520d10699g2532B53032c43060b5383k94112I5338b64054h8063P648B0040g4146
10508c195j56341O6149o5274I0955a99092F335g4990k01697M6795O0148C43665
10496e45350g7667B2970b18094J4608F3293q0b59038i1365A82465a06422b9344
10484e2017B18804c0209j06667B5032f6546B06377E3797G719a28380l5902N3692
10473a10590j3289C76659b5955k51550Q4719B94234E7875Q6596a66847e6630B43606
10461B73087g7903B06021L1135J72168D2391j1547L07207A53593a35513A08771
$$ y = [-184330, -269240, -273336, -20118, 36160, 31475, -87745, -45702, 46295, 153554, -439057, -146421, -143004, 153970, -222424, -10482, 131848, 143783, -144117, 229641, 224229, -114097, -35450, -410699, -72532, 253032, -343060, -25383, -319495, 95338, -264054, -88063, -80415, 20040, -74146, -3195, -159536, -93387, -158661, 90955, -199092, 6335, -74990, -276687, -229892, -169744, 343665, -545350, -77667, 22970, -218094, -203486, 63293, 63213, -259038, -91365, 182465, -106422, -29344, -52017, 218804, -30209, -136876, 25032, -66546, 206377, 53797, 7719, -128380, -164282, -110590, -123879, 376659, -25955, -277505, -192786, 294234, 57875, 144471, -166847, -56630, 243606, 273087, -77903, 206021, 237156, 409324, 42391, 30844, 338051, 153593, -135513, 108771]
10450A96924i3607C0367a00953I2898J9096b09165d6865k1068k15951n9372J60370
10439a82886B40900r7583C8356i8562o4722O5562j12986h8615m88067b16150E6640
10427a61302d5914l07348a3409l0386l8861B7951K29029b4209j81832o7681d1665
10415b69251J18311M0252e2319G6378a16180B5398L1177M3596a11080j9040J2953
10404a17167A57983O691a41662d4883B9795I505b79726B68163a26934A12079a07715
10392a08041b3989A3778L7264d8125l38073B50670F8182a82077O2477I2567b53091
10380A93499b58881F7249J89937r2953J12633a32756A33809B6991K4241j4349
10370C6883L4153n112c1337J4520j04960N8487A70929a09211B41635j15935o0549
$$ y = [196924, -93607, 30367, -100953, 92898, 111994, -209165, -46865, -67933, -283884, -343256, -182886, 240900, 143317, 38356, -98562, -163284, -97722, -210708, -88615, -576682, -216150, 56640, -161302, -45914, -353262, -13409, -43795, -82656, 27951, 256980, -24209, -206041, -273722, -41665, -269251, -150940, -110688, -52319, 76378, -116180, 25398, 56575, 100171, -111080, -130120, -117167, 157983, 164674, -141662, -44883, 29795, 9505, -279726, 268163, -126934, 112079, -107715, -108041, -23989, 13778, 51042, -48125, -386198, 250670, 68182, -182077, -119600, 92567, -253091, 193499, -258881, 67249, 257186, 164233, 276866, -132756, 133809, 26991, 51232, 36883, 71036, 65924, -31337, -16817, -121777, -63290, 170929, -109211, 241635, 125700, 65151]
10359F5151a65086C89986I6445D2563J27634J51486K07940d6145C26162m6781
10349B79381o5885M34432A57443a5334q5290C66943J25581B12697K08568C8967
10338B50576J08483l8257E6330d1923A45945K0857n2973k0797L31760j22568r0545
10327B11679k5978K41670D3927K72500A31520a63250B19883j181r0657p966L09295
10316D29374j00713I3841a26903B18866a40973D7912J08139n0062C9974c4550
10305A39232m7736M14521A35769l534a7482l2315A65179a11320A1390a2858G5406
10293b28865A87325p6707E3164H377b12546G8215k0523J21014q7344l4605h5154
10281B29402B6197O9910b94072E062b68477N7348D7425a08602C0687c3787l01951
$$ y = [65151, -165086, 389986, 96445, 42563, 170197, 321683, 529623, -46145, 326162, 279381, 213496, 647928, 157443, -15334, -100624, 366943, 492524, 212697, 421265, 38967, 250576, 359059, 320802, 56330, -41923, 145945, 166802, 113829, 93032, 424792, 302224, 211679, 185701, 427371, 43927, 316427, 131520, -163250, 219883, 218702, 128045, 120079, 429374, 328661, 93841, -126903, 218866, -140973, 47912, 156051, 105989, 39974, -34550, 139232, 91496, 506017, 135769, 132235, -17482, -49797, 165179, -111320, 11390, -12858, 75406, -228865, 187325, 110618, 53164, 8377, -212546, 78215, 57692, 178706, 91362, 56757, -85154, 229402, 26197, 96107, -294072, 5062, -268477, -211129, 47425, -108602, 30687, -33787, -335738]
10270c35738r588e4108o1094j89435B20147q9613b88289D2644i1607A06795J09020
10259B15815k3767o4234b73632C53724A46250d1908J1415j72676B48030J06331
10249C54361A09680a94347A20952b78237a12983J7470A45419A5254J28547L65225
10239E09026A76052J85388j33916K4430l8990J5710d8531B37997K6302i388l2162
10228d1550m1228c690A03512b43724a11331K0436I1069b15170O3220r3300A26708
10216a59202G2315c3775l66154C24178b18602G6249a56418f2920r9171B376a09703
10204B74142C8399j6998b17736g2081k36761h2161j51725K9129A118b07067d3573
10192A15164b36995j27370B11983J37256D4741a89866j11086E3741b28037I0915
$$ y = [-335738, -345326, -54108, -115202, -304637, 220147, 130534, -288289, 42644, -91607, 106795, 215815, 192048, 127814, -273632, 353724, 146250, -41908, -30493, -203169, 248030, 354361, 109680, -194347, 120952, -278237, -112983, -95513, 145419, 15254, 143801, 509026, 176052, 361440, 227524, 251954, 212964, 228674, -48531, 237997, 264299, -9388, -41550, -82778, -3690, 103512, -243724, -111331, -90895, 91069, -215170, -151950, -245250, 126708, -159202, 72315, -33775, -399929, 324178, -218602, 76249, -156418, -62920, -162091, 2376, -109703, 274142, 38399, 21401, -217736, -72081, -308842, -82161, -233886, -204757, 1118, -207067, -43573, 115164, -236995, -364365, 211983, 349239, 44741, -189866, -300952, 53741, -228037, 90915]
10181A29466C3715J02481b13691j35813J18637a11963j45337A9572e9641B26636
10170B827J97359H6713J6512J16101q0847B4225e5893A33225b16196k30898B15070
10158b31829I939c41845D1600a8025j917k15444d7129A44877P8195c2271j85271
10147b17542G4631a49839M3613I9804K2607b29979a0867A88921k739L2764A1496
10135a37341j90888b2659k5090h152k10507H8960L7706a41432C37445O6126B5973
10123H6546b2633m96405h4680j38925d9344C4686K3482J12683b80165n6664J38861
10112a97968F5494J2474a10792N3832J7796k46695p3379J0715a60482D82829d206
10100a02378j33329r1746a03525M3301H2628K84242b64839D41362d3289k55917
$$ y = [129466, 33715, 136196, -213691, -349504, -230867, -111963, -257300, 19572, -59641, 226636, 2827, 200186, 86713, 103225, 219326, 138479, 24225, -55893, 133225, -216196, -447094, 215070, -231829, 9939, -341845, 41600, -18025, -19942, -235386, -47129, 144877, 223072, -32271, -217542, 74631, -149839, -106226, 99804, 122411, -229979, -10867, 188921, 186182, 218946, 11496, -137341, -328229, -22659, -47749, -8152, -218659, 88960, 126666, -141432, 337445, 403571, 25973, 86546, -22633, -519038, -84680, -223605, -49344, 34686, 58168, 170851, -280165, -336829, -197968, 65494, 77968, -110792, -56960, -39164, -285859, -359238, -348523, -160482, 482829, -4206, -102378, -235707, -327453, -103525, -60224, 82628, 366870, -264839, 441362, -43289, -299206]
10090b99206J28107B1659i6763k07651g9295F2670e2931A69860b66011d8679q629
10079e7308J1805j90712B5909a67462b485j80732B1052L7962d7249l1026A52075
10067B0535e2830l8258o0678B52423i8239L2499C2837A2986h4227B6187b38645
10055a56736A79808a34949m6645l9167A8559a71419A35437D8895a89580M5589
10045a43991G9534i3764F1937f9207Q683I5297i1694D8780d9098k9173g394j87005
10033a94399j46820J4649H2490b89506a20022o6848r5964k46617C0185h0352D6388
10021A9340J50353P8437j02156c03682D1836J9277f7681A26504a20452F4890J75629
10010B40519k9865a82260A9198P7068A8383a91242p0169j77888a56998n4932j69449
$$ y = [-299206, -171099, 21659, -96763, -304414, -79295, 62670, -52931, 169860, -266011, -48679, -57308, -45503, -236215, 25909, -167462, -2485, -183217, 21052, 59014, -47249, -78275, 152075, 20535, -52830, -91088, -151766, 252423, -98239, -65740, 32837, 12986, -84227, 26187, -238645, -156736, 179808, -134949, -181594, -220761, 18559, -171419, 135437, 48895, -189580, -143991, 79534, -93764, 61937, -69207, -60524, 95297, -91694, 48780, -49098, -78271, -7394, -194399, -341219, -326570, 82490, -289506, -120022, -186870, -282834, -529451, 30185, -80352, 46388, 19340, 169693, 248130, 145974, -303682, 41836, 61113, -67681, 126504, -120452, 64890, 240519, 210654, -182260, 19198, 96266, 18383, -191242, -261411, -439299, -156998, -211930, -381379]
9999c81379J89245j89618A22645K49385a7222A67410a02659R80A06201G606a71794
9987G98b87661C2609b2392j35049B46107e7220r7402B04715i3616I0883l3501
9976E7382b69159e6087K1121G9211J91964a65834o2594c4504o2792h886A40950
9964d414k08173B9214i1820p6296h078k55868A31682c0481j12580j82145I3152
9952B53223a2862B18247j01642a6659k47356J29959j72868A73715b5790k57167
9942b82957f7540A71832H1513a90816A20399a48259B6850K86819D9651c13531
9931a33123j97945B0565d44887a50279m494A97921g7771k27704J09782B0193L93
9920B0586K7804b02820f8183a6436p0672k43342J43436p5036J1626B37862B0195
$$ y = [-381379, -192134, -381752, 122645, 372030, -17222, 167410, -102659, -101679, 106201, 7606, -171794, 798, -287661, 32609, -22392, -157441, 246107, -57220, -154622, 204715, -93616, 90883, 57382, -269159, -56087, -34966, 79211, 271175, -165834, -228428, -34504, -97296, -8886, 140950, -4414, -212587, 29214, -91820, -168116, -8078, -263946, 131682, -30481, -143061, -325206, 93152, 253223, -12862, 218247, 116605, -16659, -264015, -134056, -306924, 173715, -25790, -282957, -67540, 171832, 81513, -190816, 120399, -148259, 26850, 313669, 49651, -313531, -133123, -331068, 20565, -444887, -150279, -154773, 197921, -77771, -305475, -195693, 20193, 20586, 48390, -202820, -68183, -16436, -87108, -330450, -187014, -262050, -250424, 237862, 20195]
9908H9871a25032L1420J9138B53877a18478N3440j58229A52781c23066m167d1051
9896i8901m8215a6617j98723k6010a8440D8363b9186j62496N65G4523j1994A7467
9883B42249a1698q6358B41387a29589n40J3620A77579a25218K4002K8045B62308
9871F5060h0252C5121a16184l2060A58155h4554j3522K845K3596B2438b93038
9859i0237j37443g8655A50765c5152l4508J9100k04902B31650h2247B65771A12113
9847C4417H904a21660e4241k3461I3293B2691L2647c23869B06237a89891B9593
9835A86033A7558d4216l19602j1471c1062r8601E3693Q3887J7966f2677k6894
9824h9571D9919a99443R5447j53734F7697a06896C0129O3486a15085j45263i0092
$$ y = [89871, -125032, -93612, -74474, 253877, -118478, -65038, -223267, 152781, -323066, -327233, -41051, -98901, -147116, -16617, -215340, -241350, -18440, 48363, -29186, -191682, -191117, 74523, 62529, 17467, 242249, -11698, -98056, 241387, -129589, -130129, -116509, 177579, -125218, -101216, -73171, 262308, 65060, -80252, 35121, -116184, -148244, 158155, -84554, -98076, -95231, -71635, 22438, -293038, -90237, -227680, -78655, 150765, -35152, -69660, -50560, -255462, 231650, -82247, 265771, 112113, 34417, 8904, -121660, -54241, -77702, 93293, 22691, 55338, -323869, 206237, -189891, 29593, 186033, 17558, -44216, -363818, -375289, -31062, -129663, 53693, 137580, 155546, -62677, -89571, 49919, -199443, -103996, -257730, 67697, -106896, 30129, 93615, -115085, -260348, -90092]
9812c55961h368p9949B63033b24104q4974N3103B89292a19129B57307a24556A14092
9800g1641m3954m872D1766a41677D37963f182D4885c12215J42290O8939B19527
9788B08700p5690a73413c9670o0238p7275A57814h9108k6921m0786B63685b02143
9776H8806a94788N5574p62M3739A62535i6471c1403k00768F531N8215e51795g1787
9763b02263p1560C6819e0216k85544J27590g0411J9980q1154N872m20880O4678
9752d81915d50A62136C2797J0112a57965H1480a31210D3452i0164j16329n1026
9741b57519L4578H4428a24058A14618a13598d6489k4219l08937Q6488k5895c3408
9729b75803j4968a7713B19250j07529f8147k02451f3224r6367d4795r6014L6899
$$ y = [-355961, -8368, -88317, 263033, -224104, -309078, -255975, 289292, -119129, 257307, -124556, 114092, -71641, -115595, -120467, 41766, -141677, 437963, -6182, 44885, -312215, -169925, -100986, 219527, 208700, 133010, -173413, -39670, -99908, -177183, 157814, -89108, -116029, -156815, 263685, -202143, 88806, -194788, -139214, -139976, -96237, 162535, -96471, -31403, -232171, 6531, 64746, -551795, -71787, -202263, -273823, 36819, -50216, -335760, -208170, -70411, -50431, -131585, -125713, -546593, -481915, -450, 162136, 32797, 42909, -157965, 81480, -131210, 43452, -90164, -206493, -257519, -222941, 84428, -124058, 114618, -113598, -46489, -70708, -379645, -293157, -319052, -33408, -275803, -290771, -17713, 219250, 111721, -68147, -270598, -63224, -159591, -44795, -140809, -103910]
9718a03910j49351q853J7138B9164c683o6297b2020j68193k15187d9794A41090
9706b92594L0319Q4294B69425p1246C41R3848c8421A51329N7815a10965B70149
9694c02434c9907j04196e2423B53021g7259k99342f0620C0646g3459l4878j04628
9683b12965A00601a58235A2302N4486c12741B8301a36596J5517l95198a51553
9672c73806A964d2095j36830f8106q9288k1365F2923O4383c36039C35355C5163
9660B4258c14161i6089E1399a3071j56798d034l17643r2572A77515f7229q4681
9649a51910A24300i2407m6598P390o7414C783P7688J94141b88050D928f6726l60261
9637d26987B78523b64932P2071q727A60149b28022F9782a68293A50564n3970h9564
$$ y = [-103910, -253261, -262114, -244976, 29164, -3683, -69980, -22020, -190213, -405400, -49794, 141090, -292594, -262275, -177981, 269425, 198179, 341, 94189, -38421, 151329, 209144, -110965, 270149, -302434, -39907, -144103, -52423, 253021, -77259, -376601, -60620, 30646, -73459, -108337, -212965, 100601, -158235, 12302, 66788, -312741, 28301, -136596, -121079, -516277, -151553, -373806, 1964, -42095, -178925, -68106, -157394, -178759, 62923, 127306, -336039, 335355, 35163, 24258, -314161, -96089, 51399, -13071, -169869, -4034, -321677, -414249, 177515, -67229, -151910, 124300, -92407, -139005, -131615, -199029, 3783, 81471, 275612, -288050, 4928, -66726, -426987, 278523, -264932, -192861, -201588, 160149, -228022, 69782, -168293, 150564, 96594, -89564]
9625b46223a2402I1229K234h4428A18980e4586k09464p5163F9480B9298g1541
9613b26116N6357B32338a86192L0103b6891C4615e8222B42440f9792j39270c7024
9601a54167N6342j07566K4810B37431d2742j0215A38492b32493A50888c3718j77314
9590b11032J9782j5573F3621R537M6421h6965B56478K3075c58947I550J3192a82657
9577E4111c8266B39006A15856c87834J1655J37915A32207B9144Q5471j5457R8586
9566A97744c75639D4696Q8784o2542h1694G0544Q4512i0614B1186e1003p5473
9555a26476a5951A35194e3684l10219d4127k13553B45413a79573o0323R2810O6965
9544h0121k02595j06221i9923l8756C1372j5404P2702a26499j7915j19747A34940
$$ y = [-246223, -12402, 91229, 93463, -84428, 118980, -54586, -264050, -339213, 69480, 29298, -71541, -226116, -169759, 232338, -186192, -156089, -26891, 34615, -58222, 242440, -69792, -209062, -37024, -154167, -97825, -205391, -180581, 237431, -42742, -52957, 138492, -232493, 150888, -33718, -211032, -191250, -206823, 63621, 73158, 119579, -86965, 256478, 279553, -358947, 9550, 22742, -182657, 54111, -38266, 239006, 115856, -387834, -376179, -238264, 132207, 29144, 114615, 99158, 197744, -375639, 44696, 133480, 70938, -81694, 70544, 155056, -90614, 21186, -51003, -126476, -15951, 135194, -53684, -363903, -44127, -257680, 245413, -179573, -239896, -147086, -80121, -282716, -388937, -99923, -138679, 31372, 15968, 88670, -126499, -144414, -264161, 134940]
9532B2912d4646j90481b5413D18552k03385b27472I2880a20941A47250J11868
9522B59118g2049C6707J0420M5611l0715L58347C3278b70442I309J08011b39119
9510A25720a92019A7944M00g8631j25211f01l12300a24999E1488a29561m1642
9499a71203l7672Q6687F3220h1807c5269J2506q024A10302a77982E9206B5963
9487c9215r8630B89254a88171B23693A8752J62693b09264I009b84241a00428A55642
9475C16125g4316A7580c42921A02702N5474o3489b96126e7436B10399b01562J6994
9464a84568f4783E3982j6217P7286O3551a49454A49990a33484j06111K7369P2976
9453a39250H3221b89870Q8651A14832a45676c8155A20437i6704j16214g8276n4600
$$ y = [22912, -44646, -235127, -25413, 418552, 215167, -227472, 92880, -120941, 147250, 259118, -72049, 36707, 47127, 92738, 62023, 420370, 33278, -270442, 9309, 117320, -239119, 125720, -192019, 17944, 18344, -78631, -203842, -601, -312901, -124999, 51488, -129561, -171203, -208875, -122188, 63220, -81807, -35269, -22763, -30787, 110302, -177982, 59206, 25963, -39215, -137845, 289254, -188171, 223693, 18752, 181445, -209264, 9009, -284241, -100428, 155642, 316125, -74316, 17580, -342921, 102702, 158176, 94687, -296126, -57436, 210399, -201562, -184568, -64783, 53982, 37765, 115051, 178602, -149454, 149990, -133484, -239595, -212226, -139250, 83221, -289870, -201219, 114832, -145676, -38155, 120437, -96704, -212918, -78276, -132876]
9442a32876j7896N2088A34555J03292b94171d0083A33341b96989J07635D7841
9431e5442j40068A02148c61326a79358Q5059B3409a44052j80964f2493q0446m5950
9420a88889A8291K00420E4460b19498P2500H5854j1972e5916k50945d2644G3432
9408B62591H4557a6891A26061f7305k1291b1478B40537Q8110A53584f4115c005
9396C7421f523j43290j8891m4894G4274J19806b64247O4720H2505a75516I5046
9384A84091a0285A13090b70368R0632F6612a90513j66573e8419A14864i8016K8735
9373f9281l06030A18402b650A84282a65656G6354j0942e2850C10999j22373a81986
9361b36658r2221B12124D2331b9008I3386c77433g2810A12560B1624a5799D1653
$$ y = [-132876, -150772, -98684, 134555, 237847, -294171, -40083, 133341, -296989, -189354, 47841, -55442, -195510, 102148, -361326, -179358, -94299, 23409, -144052, -325016, -62493, -142939, -188889, 18291, 218711, 54460, -219498, -146998, 85854, 73882, -55916, -306861, -42644, 73432, 262591, 84557, -16891, 126061, -67305, -88596, -21478, 240537, 328647, 153584, -64115, -3005, 37421, -6523, -149813, -168704, -213598, 74274, 194080, -264247, -199527, 82505, -175516, 95046, 184091, -10285, 113090, -270368, -179736, 66612, -190513, -357086, -58419, 114864, -98016, -69281, -375311, 118402, -2650, 184282, -165656, 76354, 65412, -52850, 310999, 188626, -181986, -236658, -328879, 212124, 42331, -29008, 93386, -377433, -72810, 112560, 21624, -15799, 41653]
9349D1175b3966G6880f4124j19973C54264a55267O6898A33259j8709J09323n8041
9338A65832c8461b668l62139J25569b4098B0124i6m3756A01495c27692J59509
9327a68183d3314F4847b85571A65226O9449i3638b572k16984J2485D1295a88766
9315a39467a9141Q098B0566e3581A02767J7708I554K45851b08213h8097j66760
9304b54857D7558P082a94054A5096K79987c18039A29704B4502a44635A01954a66416
9292B582J87347a260k45143A13261a16712j10203e2967k45501r3847B73275a93163
9280b22674j70703d0100j07315i418A45204E5219i7429J0569j4389J1462p3954
9269a63741j29745A92317L4145q7005b91958A40798a49661k11037A44424L9584
$$ y = [41175, -23966, 76880, -64124, -184097, 354264, -155267, -88369, 133259, 114550, 223873, 165832, -38461, -2668, -364807, -239238, -24098, 20124, -96, -43852, 101495, -327692, -168183, -43314, 64847, -285571, 165226, 234675, -93638, -2572, -219556, -207071, 41295, -188766, -139467, -19141, -11043, 20566, -53581, 102767, 120475, 9554, 255405, -208213, -88097, -254857, 47558, 54640, -194054, 15096, 295083, -318039, 129704, 24502, -144635, 101954, -166416, 2582, 189929, -1260, -246403, 113261, -116712, -226915, -52967, -298468, -392315, 273275, -193163, -222674, -393377, -40100, -147415, -9418, 145204, 55219, -97429, -86860, -101249, -89787, -163741, -293486, 192317, 226462, 139457, -291958, 140798, -149661, -360698, 144424, 184008]
9259A84008a99219h8522A7106J4332d04363i9931D3359b18726A59846A245L04514
9248C05759A14995a53327D1174b08962b8577k0163k84207A14988d5215A58351
9237f1255n7005c0591G1206b08419h2105j12231a3156L004r9315j09000I3283
9225i1364B40264G6053b27784C97378a35202I875d3637l97309E9412g2437o695
9214g9132m9729j95293H4310R0047J22959I0592B6980b04364G4787e7886p9344
9203a37230A43442b96405C6084M4933d7922k30530q3976c1881n6671j14949c2780
9191A2525J09780a48752q1763l0056h8932B04062a45666A97006m985B2443a44464
9179a95073b4005j10165j76370B1121O4180a83773o5233J18424A74464A6829N1926
$$ y = [184008, -199219, -88522, 17106, 31438, -404363, -99931, 43359, -218726, 159846, 1245, 305759, 114995, -153327, 41174, -208962, -28577, -48740, -332947, 114988, -45215, 158351, -61255, -118260, -30591, 71206, -208419, -82105, -194336, -13156, -10152, -109467, -218467, 93283, -91364, 240264, 76053, -227784, 397378, -135202, 9875, -43637, -440946, 59412, -72437, -79132, -128861, -324154, 84310, 174357, 297316, 90592, 26980, -204364, 74787, -57886, -137230, 143442, -296405, 36084, 81017, -47922, -278452, -362428, -31881, -88552, -203501, -32780, 12525, 122305, -148752, -230515, -260571, -88932, 204062, -145666, 197006, 192021, 22443, -144464, -195073, -24005, -134170, -310540, 21121, 85301, -183773, -249006, -130582, 174464, 16829, 68755]
9168F8755B5449K2395L39834A72374m6948c6549k34850A1820J19321f020A21219
9156F3094b77757J18667A51777g6950H9587i4761h964m53602E8037f5355K3752
9145d1603n0548j07497N5747B18231A0736Q3198a70309B922M322a88036l385k3811
9133b15232P3990O6269n8303C12123b95839c3251k35173R3930K3824p2810r6230
9122c19710A79293b96253C21483a31282M3401J2606F8454e0473B20960c15764
9111b75530A95347a31864j65365J26736H7919b83338a39657E8607a59567LC28303
9099B37745c62486J2177H6500b41783A21826h560k12818g3968j16092j57669G8754
9087b35331g2618j96239B10703j7565c8222E600f2655B78941a07341b6187a2520
$$ y = [68755, 25449, 47844, 387678, 172374, 125426, -36549, -271399, 11820, 131141, -6020, 121219, 63094, -277757, -159090, 151777, -76950, 89587, -94761, -8964, -462566, 58037, -65355, -41603, -92151, -199648, -143901, 218231, 10736, 93934, -170309, 2922, 7244, -188036, -191421, -215232, -141242, -74973, -133276, 312123, -295839, -33251, -268424, -174494, -150670, -223480, -319710, 179293, -296253, 321483, -131282, -87881, -75275, 68454, -50473, 220960, -315764, -275530, 195347, -131864, -297229, -170493, 87919, -283338, -139657, 58607, -159567, -159564, 328303, 237745, -362486, -350309, 86500, -241783, 121826, -8560, -221378, -73968, -190060, -347729, 78754, -235331, -72618, -268857, 210703, 193138, -38222, 5600, -62655, 278941, -107341, -26187, -12520]
9075b73714D2302a04318j29100b58k94800a35021j45876D1088J5014J76759r0591
9064A42270B6942R3200b11047A15808O82g0066G1416J07991b71888a32205j29265
9053b61470B13746a47847d6909k07265g9006a7232j11106B6744a06446j71966
9043b78412B44214b63922d9701A93471a39013R955A49984A2251P3040P3614E5896
9031d2621j0857K1571k43881a16001j64265A20685N1969b40891j7407G7704d52174
9019B49361A00313A7793J15253J83854A07208i9910E268M4965g314A8369a11902
9007d52648F1968L0993g0756k20107R8203f3122A66907a18964e241j76897e8369
8995b70884m2795b048o8778A63986F6491c626A72132p5719J16891C5082a41434
$$ y = [-273714, 42302, -104318, -233418, -258, -295058, -135021, -280897, 41088, 56102, 232861, 142270, 26942, 120142, -211047, 115808, 116490, -70066, 71416, 179407, -271888, -132205, -261470, 213746, -147847, -46909, -254174, -79006, -17232, -128338, 26744, -106446, -278412, 244214, -263922, -49701, 193471, -139013, -129058, 149984, 12251, 85291, 158905, 55896, -42621, -53478, -31907, -275788, -116001, -280266, 120685, 172654, -240891, -258298, 77704, -452174, 249361, 100313, 17793, 133046, 316900, 107208, -99910, 5268, 50233, -7314, 18369, -111902, -452648, 61968, 92961, -70756, -290863, -192660, -63122, 166907, -118964, -5241, -182138, -58369, -270884, -313679, -2048, -70826, 163986, 66491, -3626, 172132, 96413, 213304, 35082, -141434]
8983H9966g123k63016f5084m11098I314e670p9529C51173d5019k14582J22655
8972a36946m449c2562B7531K39088b8875j53061d1946j11812C788L5769J44661
8961A84218E0469L144a79403R664B60268c15792Q0216m486E5219a95448B8713
8949C0477e6004p4264B91252j448c92952a02622E5560a02930j6168l20428a43357
8937f266F3573J12903c3965k07575M8154B42429b70398g6718r75H2178b37271
8925H9660R4770a9013k09967B9284a03545f183D1435K7533j3024J31737B0516
8913B09906p3046k6488R5033i7069I0410Q6968L42639J91886K58977J227571K719411
8902D917862j027647A724620G23731C25318K74616c16743c4591o4764C1618R4213
$$ y = [89966, -7123, -270139, -65084, -476182, 9314, -5670, -85199, 351173, -45019, -259601, -136946, -141395, -32562, 27531, 266619, -28875, -181936, -41946, -153758, 3788, 39557, 184218, 50469, 53613, -179403, -169739, 260268, -315792, -235576, -240062, 55219, -195448, 28713, 30477, -56004, -130268, 291252, 289804, -392952, -102622, 55560, -102930, -119098, -439526, -143357, -6266, 63573, 176476, -33965, -241540, -193386, 242429, -270398, -76718, -77693, 82178, -237271, 89660, 184430, -19013, -228980, 29284, -103545, -6183, 41435, 68968, 55944, 187681, 20516, 209906, 136860, 110372, 205405, -97069, 90410, 177378, 520017, 711903, 970880, 2198451, 4917862, 3890215, 1724620, 723731, 325318, 599934, -316743, -34591, -99355, 31618, 125831]
8892A25831N3394G9283O1237h1775A4703M5821a58376d9227B29773h6513b8234
8880B06793p1362B1040I994e114k96289a49818D2827i8011E3306N992b07111o7551
8868b74662c1584C1335J97385b13545q4692J49111j38937H6161N7904M0185b60961
8856a1773N521D6051M4307a19938N6032A36491c7991B02784b71733D83589a67401
8844b09175R2324n1602k50146f3546G2443j2353Q2425J2829D4117a62078D9585
$$ y = [125831, 179225, 79283, 140520, -81775, 14703, 60524, -158376, -49227, 229773, -86513, -28234, 206793, 135431, 21040, 9994, -5114, -301403, -149818, 42827, -98011, 53306, 59298, -207111, -274662, -31584, 31335, 228720, -213545, -298237, -149126, -288063, 86161, 144065, 184250, -260961, -11773, -6252, 46051, 90358, -119938, -63906, 136491, -37991, 202784, -271733, 483589, -167401, -209175, -116851, -168453, -418599, -63546, 72443, 60090, 142515, 155344, 44117, -162078, 49585]
$$ [...]
##END NTUPLES=NMR SPECTRUM
##END=
