
##TITLE=AC1208_HCOAH12050_5973738_VScUvUcbtA
##JCAMPDX= 6.0         $$ Bruker NMR JCAMP-DX V2.0
##DATA TYPE= NMR SPECTRUM
##DATA CLASS= NTUPLES
##ORIGIN= BRUKER
##OWNER= Administrator
$$ 1.72 TOPSPIN		Version 2.1
$$ 2012-04-16 19:10:38.312 -0500  Administrator@TOPSPIN
$$ Compression mode = diff/dup
##.OBSERVE FREQUENCY= 400.13188235
##.OBSERVE NUCLEUS= ^1H
##.ACQUISITION MODE= SIMULTANEOUS (DQD)
##.ACQUISITION SCHEME= undefined
##.AVERAGES= 64
##.DIGITISER RES= 22
##SPECTROMETER/DATA SYSTEM= spect
##.PULSE SEQUENCE= noesygpps1d.comp
##.SOLVENT NAME= COFFEE_meoh
##.SHIFT REFERENCE= INTERNAL, COFFEE_meoh, 1, 14.96863
##AUDIT TRAIL= $$ (NUMBER, WHEN, WHO, WHERE, PROCESS, VERSION, WHAT)
$$ ##TITLE= Audit trail, TOPSPIN		Version 2.1
$$ ##JCAMPDX= 5.01
$$ ##ORIGIN= Bruker BioSpin GmbH
$$ ##OWNER= Administrator
$$ $$ C:\Bruker\TOPSPIN/data/COFFEE/nmr/AC1208_HCOAH12050_5973738_VScUvUcbtA/12/pdata/1/auditp.txt
$$ ##AUDIT TRAIL=  $$ (NUMBER, WHEN, WHO, WHERE, PROCESS, VERSION, WHAT)
(   1,<2012-04-15 20:49:12.515 -0500>,<Administrator>,<TOPSPIN>,<go>,<TOPSPIN 2.1>,
      <created by zg
	started at 2012-04-15 20:37:40.734 -0500,
	POWCHK enabled, PULCHK disabled,
       configuration hash MD5:
       1A 1E CE 29 27 FD 77 03 67 4E F0 E3 C4 B2 CB 90
       data hash MD5: 64K
       F9 87 7F 88 3E B3 D3 AF 5E 98 2C 6E C6 80 9B 64>)
(   2,<2012-04-15 20:49:15.265 -0500>,<Administrator>,<TOPSPIN>,<proc1d>,<TOPSPIN 2.1>,
      <Start of raw data processing
       efp LB = 0.3 FT_mod = 6 PKNL = 1 PHC0 = 0 PHC1 = 0 SI = 128K 
       data hash MD5: 128K
       F1 E7 F4 DD FB 08 4B 84 8A 55 7C 26 14 30 FF 14>)
(   3,<2012-04-15 20:49:16.437 -0500>,<Administrator>,<TOPSPIN>,<proc1d>,<TOPSPIN 2.1>,
      <pk PHC0 = 32.20093 PHC1 = 0 
       data hash MD5: 128K
       33 B7 5D 60 77 B7 EC 6B 56 46 9A 84 25 CE 89 63>)
(   4,<2012-04-15 20:49:16.671 -0500>,<Administrator>,<TOPSPIN>,<proc1d>,<TOPSPIN 2.1>,
      <abs ABSG = 1 
       data hash MD5: 128K
       CE 95 DB F6 54 A9 6B C0 0D 04 DE 17 9F C0 5C AC>)
(   5,<2012-04-15 20:49:16.750 -0500>,<Administrator>,<TOPSPIN>,<proc1d>,<TOPSPIN 2.1>,
      <abs ABSG = 2 
       data hash MD5: 128K
       0A C3 B9 98 08 AB 0C 80 F2 B8 41 36 79 6D AE 9A>)
(   6,<2012-04-15 20:49:16.890 -0500>,<Administrator>,<TOPSPIN>,<proc1d>,<TOPSPIN 2.1>,
      <abs ABSG = 3 
       data hash MD5: 128K
       34 61 4E BB 91 B9 96 B9 2B 47 44 2D 63 F1 E3 33>)
(   7,<2012-04-15 20:49:17.078 -0500>,<Administrator>,<TOPSPIN>,<proc1d>,<TOPSPIN 2.1>,
      <abs ABSG = 4 
       data hash MD5: 128K
       7B BC 7F FB C9 FF 05 FB AC 45 FC 21 82 7B 9D AC>)
(   8,<2012-04-15 20:49:17.125 -0500>,<Administrator>,<TOPSPIN>,<proc1d>,<TOPSPIN 2.1>,
      <abs ABSG = 5 
       data hash MD5: 128K
       55 92 52 DC 15 5A BF 7E 6F CD 01 DB 8E 71 A7 FD>)
(   9,<2012-04-15 20:49:17.359 -0500>,<Administrator>,<TOPSPIN>,<audit>,<TOPSPIN 2.1>,
      <user comment:
       ICON-NMR User ID: COFFEE
       data hash MD5: 128K
$$ [...]
##$TP07= 0
##$TPNAME0= <>
##$TPNAME1= <>
##$TPNAME2= <>
##$TPNAME3= <>
##$TPNAME4= <>
##$TPNAME5= <>
##$TPNAME6= <>
##$TPNAME7= <>
##$TPOAL= (0..7)
0.5 0.5 0.5 0.5 0.5 0.5 0.5 0.5
##$TPOFFS= (0..7)
0 0 0 0 0 0 0 0
##$TUNHIN= 0
##$TUNHOUT= 0
##$TUNXOUT= 0
##$USERA1= <user>
##$USERA2= <user>
##$USERA3= <user>
##$USERA4= <user>
##$USERA5= <user>
##$V9= 5
##$VALIST= <valist>
##$VCLIST= <CCCCCCCCCCCCCCC>
##$VD= 0
##$VDLIST= <DDDDDDDDDDDDDDD>
##$VPLIST= <PPPPPPPPPPPPPPP>
##$VTLIST= <TTTTTTTTTTTTTTT>
##$WBST= 2048
##$WBSW= 25
##$XGAIN= (0..3)
0 0 0 0
##$XL= 0
##$YL= 0
##$YMAX_a= 11698803
##$YMIN_a= -6426001
##$ZGOPTNS= <>
##$ZL1= 120
##$ZL2= 120
##$ZL3= 120
##$ZL4= 120
##$ABSF1= 14.96863
##$ABSF2= -5.5839
##$ABSG= 5
##$ABSL= 3
##$ALPHA= 0
##$AQORDER= 0
##$ASSFAC= 0
##$ASSFACI= 0
##$ASSFACX= 0
##$ASSWID= 0
##$AUNMP= <proc_prof1d_extract.lims>
##$AXLEFT= 0
##$AXNAME= <>
##$AXNUC= <1H>
##$AXRIGHT= 0
##$AXTYPE= 0
##$AXUNIT= <>
##$AZFE= 0.1
##$AZFW= 0.1
##$BCFW= 0
##$BC_mod= 0
##$BYTORDP= 0
##$COROFFS= 0
##$CY= 15
##$DATMOD= 1
##$DC= 0
##$DFILT= <>
##$DTYPP= 0
##$F1P= 0
##$F2P= 0
##$FCOR= 0.5
##$FTSIZE= 131072
##$FT_mod= 6
##$GAMMA= 0
##$GB= 0
##$INTBC= 1
##$INTSCL= 1
##$ISEN= 128
##$LB= 0.3
##$LEV0= 0
##$LPBIN= 0
##$MAXI= 10000
##$MC2= 0
##$MEAN= 0
##$ME_mod= 0
##$MI= 0
##$NCOEF= 0
##$NC_proc= -2
##$NLEV= 6
##$NOISF1= 0
##$NOISF2= 0
##$NSP= 0
##$NTH_PI= 0
##$NZP= 0
##$OFFSET= 14.96863
##$PC= 1
##$PHC0= 32.20093
##$PHC1= 0
##$PH_mod= 1
##$PKNL= yes
##$PPARMOD= 0
##$PPDIAG= 0
##$PPIPTYP= 0
##$PPMPNUM= 2147483647
##$PPRESOL= 1
##$PSCAL= 4
##$PSIGN= 0
##$PYNMP= <proc.py>
##$REVERSE= no
##$SF= 400.130004795451
##$SI= 131072
##$SIGF1= 0
##$SIGF2= 0
##$SINO= 400
##$SIOLD= 131072
##$SPECTYP= <>
##$SREGLST= <1H.CDCl3>
##$SSB= 0
##$STSI= 131072
##$STSR= 0
##$SW_p= 8223.68421052632
##$SYMM= 0
##$S_DEV= 0
##$TDeff= 65536
##$TDoff= 0
##$TI= <>
##$TILT= no
##$TM1= 0
##$TM2= 0
##$TOPLEV= 0
##$USERP1= <user>
##$USERP2= <user>
##$USERP3= <user>
##$USERP4= <user>
##$USERP5= <user>
##$WDW= 1
##$XDIM= 131072
##$YMAX_p= 244820104
##$YMIN_p= -323102139
##$CURPLOT= <Network HP LaserJet P1505>
##$CURPRIN= <$Network HP LaserJet P1505>
##$DFORMAT= <normdp>
##$LAYOUT= <+/1D_H.xwp>
##$LFORMAT= <normlp>
##$PFORMAT= <normpl>
##$SURQMSG= 1
$$ End of Bruker specific parameters
$$ ---------------------------------
##NTUPLES= NMR SPECTRUM
##VAR_NAME=  FREQUENCY,     SPECTRUM/REAL,   SPECTRUM/IMAG
##SYMBOL=    X,             R,               I
##VAR_TYPE=  INDEPENDENT,   DEPENDENT,       DEPENDENT
##VAR_FORM=  AFFN,          ASDF,            ASDF
##VAR_DIM=   131072,        131072,          131072
##UNITS=     HZ,            ARBITRARY UNITS, ARBITRARY UNITS
##FACTOR=    0.0627417313425165, 1,          1
##FIRST=     8223.62146879498, 313,          -43110
##LAST=      0,             1853,            -42665
##MIN=       0,             -323102139,      0
##MAX=       8223.62146879498, 244820104,    0
$$ Real data points
##PAGE= N=1
##DATA TABLE= (X++(R..R)), XYDATA
$$ [...]
62042A433487K5741K6923K8244K9720L1263L2536L3336L3858L4345L4679L4576
$$ 1433487 1459228 1486151 1514395 1544115 1575378 1607914 1641250 1675108 1709453 1744132 1778708
62031A778708L4002L3169L2253L1369L0796L0916L1816L3076L4014L4186L3598
$$ 1778708 1812710 1845879 1878132 1909501 1940297 1971213 2003029 2036105 2070119 2104305 2137903
62020B137903L2517L1246L0093K9390K9320K9764L0361L0829L1134L1430L1817
$$ 2137903 2170420 2201666 2231759 2261149 2290469 2320233 2350594 2381423 2412557 2443987 2475804
62009B475804L2245L2646L3154L4131L5701L7252L7740L6693L4712L2744L1109
$$ 2475804 2508049 2540695 2573849 2607980 2643681 2680933 2718673 2755366 2790078 2822822 2853931
61998B853931K9566K7971K6372K4581K2268J9556J6983J4791J2721J0606Q631
$$ 2853931 2883497 2911468 2937840 2962421 2984689 3004245 3021228 3036019 3048740 3059346 3067977
61987C067977O827M884K843J431J271J967K518K380J855J484J425J361Q14l47
$$ 3067977 3074804 3079688 3082531 3083962 3085233 3087200 3089718 3092098 3093953 3095437 3096862 3098223 3099037 3098690
61973C098690j670k566l027l592m485n330n931o693p780q422p861o687o296p010
$$ 3098690 3097020 3094454 3091427 3087835 3083350 3078020 3072089 3065396 3057616 3049194 3041333 3034646 3028350 3021340
61959C021340p627p112n988n474n725n679m620l226k697l148l390k367m32J153
$$ 3021340 3013713 3006601 3000613 2995139 2989414 2983735 2979115 2975889 2973192 2970044 2966654 2964287 2963855 2965008
61945B965008J740J848K253L071L919M451M402L510J914K94q94k165m383p420
$$ 2965008 2966748 2968596 2970849 2973920 2977839 2982290 2986692 2990202 2992116 2992410 2991516 2989351 2984968 2977548
61931B977548j0049j1349j1765j2528j4290j6630j8727k0214k1246k2015k2442
$$ 2977548 2967499 2956150 2944385 2931857 2917567 2900937 2882210 2861996 2840750 2818735 2796293
61920B796293k2513k2631k3242k4115k4511k4192k3841k4060k4458k4324k3834
$$ 2796293 2773780 2751149 2727907 2703792 2679281 2655089 2631248 2607188 2582730 2558406 2534572
61909B534572k3832k4465k4783k3987k2434k1125k0566k0460k0209j9399j8002
$$ 2534572 2510740 2486275 2461492 2437505 2415071 2393946 2373380 2352920 2332711 2313312 2295310
61898B295310j6448j5369j5032j4998j4555j3456j2062j0839r804q593p019n481
$$ 2295310 2278862 2263493 2248461 2233463 2218908 2205452 2193390 2182551 2172747 2164154 2157135 2151654
61886B151654m594m416m238l346j774o9J524L280N379P478Q958R541R641J0256
$$ 2151654 2147060 2142644 2138406 2135060 2133286 2133217 2134741 2138021 2143400 2150878 2159836 2169377 2179018 2189274
61872B189274J2297J5681J9263K1992K4075K6551K9916L3823L8109M3235M9330
$$ 2189274 2201571 2217252 2236515 2258507 2282582 2309133 2339049 2372872 2410981 2454216 2503546
61861B503546N5541O1103O6591P3334Q1800R1251J01040J11542J23605J37619
$$ 2503546 2559087 2620190 2686781 2760115 2841915 2933166 3034206 3145748 3269353 3406972
61851C406972J53454J70954J90030K10402K31642K53647K76823L01547L27368
$$ 3406972 3560426 3731380 3921410 4131812 4363454 4617101 4893924 5195471 5522839
61842E522839L52859L76392L96794M12856M22084M20329M02994L66642L09767
$$ 5522839 5875698 6252090 6648884 7061740 7483824 7904153 8307147 8673789 8983556
61833H983556K32989J39584L5867o9754j68982k55593l26021l79037m15199m36207
$$ 8983556 9216545 9356129 9391996 9322242 9153260 8897667 8571646 8192609 7777410 7341203
61823G341203m44159m41141m29256m10670l87423l61319l34039l07009k81015
$$ 7341203 6897044 6455903 6026647 5615977 5228554 4867235 4533196 4226187 3945172
61814C945172k56249k32925k11548j92386j74979j58723j43694j30358j18645
$$ 3945172 3688923 3455998 3244450 3052064 2877085 2718362 2574668 2444310 2325665
61805B325665j07878r7749q8649q0859p3920o7319o1269n6187n1698m6881m1534
$$ 2325665 2217787 2120038 2031389 1950530 1876610 1809291 1748022 1691835 1640137 1593256 1551722
61794A551722l6525l2688k9867k7355k4801k2274j9783j7265j4898j2939j1245
$$ 1551722 1515197 1482509 1452642 1425287 1400486 1378212 1358429 1341164 1326266 1313327 1302082
61783A302082r414p549o414o457o972o639m877k363k25R30J225J093J018J456
$$ 1302082 1292668 1285119 1278705 1272248 1265276 1258637 1253760 1251397 1251172 1252102 1253327 1254420 1255438 1256894
61769A256894K663M448O205P333P685P683P960Q806R955J1031J2087J3456J5105
$$ 1256894 1259557 1264005 1270210 1277543 1285228 1292911 1300871 1309677 1319632 1330663 1342750 1356206 1371311
61756A371311J6606J7982J9971K2956K6051K8082K9324L1334L4913L9150M2873
$$ 1371311 1387917 1405899 1425870 1448826 1474877 1502959 1532283 1563617 1598530 1637680 1680553
61745A680553M6174M9805N3768N7490O1059O5277P0528P6402Q2441Q8578R4754
$$ 1680553 1726727 1776532 1830300 1887790 1948849 2014126 2084654 2161056 2243497 2332075 2426829
61734B426829J00911J07537J15431J24698J34654J45043J56664J70299J85677
$$ 2426829 2527740 2635277 2750708 2875406 3010060 3155103 3311767 3482066 3667743
61725C667743K02156K19901K39670K61790K86150L12956L42632L75000M09328
$$ 3667743 3869899 4089800 4329470 4591260 4877410 5190366 5532998 5907998 6317326
61716F317326M45394M83789N24816N67651O10927O53464O93698P28604P53749
$$ 6317326 6762720 7246509 7771325 8338976 8949903 9603367 10297065 11025669 11779418
61707A1779418P64272P55138P20496O54060N51601M13921K47791O4443j22819
$$ 11779418 12543690 13298828 14019324 14673384 15224985 15638906 15886697 15951140 15828321
61698A5828321l00664m57667n86053o82415p47018p82599p93530p85041p61970
$$ 15828321 15527657 15069990 14483937 13801522 13054504 12271905 11478375 10693334 9931364
61689I931364p27967o85986o39165n90636n42569m96070m51959m10990l73286
$$ 9931364 9203397 8517411 7878246 7287610 6745041 6248971 5797012 5386022 5012736
61680E012736l38402l06314k77665k52624k30171k09159j89602j72236j57162
$$ 5012736 4674334 4368020 4090355 3837731 3607560 3398401 3208799 3036563 2879401
61671B879401j43633j31041j19391j08840r9341r0900q3607p7315p1596o6170
$$ 2879401 2735768 2604727 2485336 2376496 2277155 2186255 2102648 2025333 1953737 1887567
61661A887567o1124n6625n2713m9343m6339m3315m0013l6786l4346l2891l1723
$$ 1887567 1826443 1769818 1717105 1667762 1621423 1578108 1538095 1501309 1466963 1434072 1402349
61650A402349k9971k7529k5145k3618k3022k2670k1895k0840k0265k0456k0661
$$ 1402349 1372378 1344849 1319704 1296086 1273064 1250394 1228499 1207659 1187394 1166938 1146277
61639A146277k0009j8686j7731j7640j7785j7396j6566j5933j5692j5375j4512
$$ 1146277 1126268 1107582 1089851 1072211 1054426 1037030 1020464 1004531 988839 973464 958952
61628I58952j3172j1830j0919j0538j0456j0302r828r069q240p537o978o427n781
$$ 958952 945780 933950 923031 912493 902037 891735 881907 872838 864598 857061 850083 843656 837875
61615H37875n127m665m491m523m641m809m884m626l983l340l217l695m309m482
$$ 837875 832748 828083 823592 819069 814428 809619 804735 800109 796126 792786 789569 785874 781565 777083
61601G77083m060l380k953l018l437l954m478m876m726l683k180j232j387k144
$$ 777083 773023 769643 766690 763672 760235 756281 751803 746927 742201 738518 736338 735106 733719 731575
61587G31575k656k601k105j319m82rN0K72J018J662J352L65r6N73J724K425K395
$$ 731575 728919 726318 724213 722894 722412 722403 722453 722725 723743 725405 726757 727122 727026 727599 729323 731748 734143
61570G34143J951J579J778K702L774M158L746L188K838K361J538P68L99J49l75
$$ 734143 736094 737673 739451 742153 745927 750085 753831 757019 759857 762218 763756 764524 764923 765072 764697
61555G64697j118j940l006m313n299n435m920m353m060m166m787n655n944n201
$$ 764697 763579 761639 758633 754320 749021 743586 738666 734313 730253 726087 721300 715645 709701 704500
61541G04500m117l758m217m687m644m227l547k515j404p84p01m92K77J233J871
$$ 704500 700383 696625 692408 687721 683077 678850 675303 672788 671384 670600 669899 669407 669684 670917 672788
61526F72788K266K852L859N278O968Q570R617J0141J0766J1923J3220J4054J4536
$$ 672788 675054 677906 681765 687043 694011 702581 712198 722339 733105 745028 758248 772302 786838
61513G86838J5295J6508J7663J8369J8901J9758K0964K2059K2599K2519K2095
$$ 786838 802133 818641 836304 854673 873574 893332 914296 936355 958954 981473 1003568
61502A003568K1661K1333K0910K0156J9178J8440J8197J8095J7499J6212J4702
$$ 1003568 1025229 1046562 1067472 1087628 1106806 1125246 1143443 1161538 1179037 1195249 1209951
61491A209951J3506J2607J1530R967Q107O329M789L400K027N59j142l088m974
$$ 1209951 1223457 1236064 1247594 1257561 1265668 1271997 1276786 1280186 1282213 1282772 1281630 1278542 1273568
61478A273568o344p029p250p165o627n533m281l441k987k172l64K192M672O554
$$ 1273568 1267224 1260195 1252945 1245780 1239153 1233620 1229339 1225898 1222911 1220739 1220375 1222567 1227239 1233793
61464A233793Q088R956J2664J6161J9840K3048K5763K8750L2860L8213M4220N0273
$$ 1233793 1241881 1251837 1264501 1280662 1300502 1323550 1349313 1378063 1410923 1449136 1493356 1543629
61452A543629N6115O1669O6997P2515P8810Q6069R3992J02398J11496J21309J31178
$$ 1543629 1599744 1661413 1728410 1800925 1879735 1965804 2059796 2162194 2273690 2394999 2526177
61441B526177J40166J47716J53622J57639J59470J58746J54599J45494J30168
$$ 2526177 2666343 2814059 2967681 3125320 3284790 3443536 3598135 3743629 3873797
61432C873797J08821Q3042N4704K5299l809l1108n5246p5327r0933j02174j09618
$$ 3873797 3982618 4065660 4120364 4145663 4141854 4110746 4055500 3980173 3889240 3787066 3677448
61421C677448j13766j14655j12385j07875j02411r6377q9134q0362p0868o1717
$$ 3677448 3563682 3449027 3336642 3228767 3126356 3029979 2940845 2860483 2789615 2727898
61411B727898n3166m4856l6530k8077j9370j0650k730L816R412J4896K0394K5289
$$ 2727898 2674732 2629876 2593346 2565269 2545899 2535249 2532519 2536335 2545747 2560643 2581037 2606326
61399B606326K9185L2250L4653L6278L7150L7600L7843L7733L7127L6184L5137
$$ 2606326 2635511 2667761 2702414 2738692 2775842 2813442 2851285 2889018 2926145 2962329 2997466
61388B997466L4031L2916L2048L1744L2068L2717L3186L3106L2575L2060L1739
$$ 2997466 3031497 3064413 3096461 3128205 3160273 3192990 3226176 3259282 3291857 3323917 3355656
61377C355656L1030K9129K6034K2608J9556J6653J3286R329N177J044l276p960
$$ 3355656 3386686 3415815 3441849 3464457 3484013 3500666 3513952 3523281 3528458 3529502 3526226 3518266
61365C518266j2722j6956k0198k2428k4002k5254k6068k5888k4344k1846j9347
$$ 3518266 3505544 3488588 3468390 3445962 3421960 3396706 3370638 3344750 3320406 3298560 3279213
61354C279213j7389j5562j3081r810o501m027k587j674o92M82J380J291q8k247
$$ 3279213 3261824 3246262 3233181 3223371 3216870 3212843 3210256 3208582 3207890 3208372 3209752 3211043 3210955 3208708
61340C208708m210n359n738n517m463k253R91M898R525J5303K2306L0090L8382
$$ 3208708 3204498 3199139 3193401 3187884 3183421 3181168 3182159 3187057 3196582 3211885 3234191 3264281 3302663
61327C302663M7498N7810O9143Q0971R2939J04929J16821J28474J39739J50197
$$ 3302663 3350161 3407971 3477114 3558085 3651024 3755953 3872774 4001248 4140987 4291184
61317D291184J59087J65770J70021J71519J69170J61481J47651J28049J03689
$$ 4291184 4450271 4616041 4786062 4957581 5126751 5288232 5435883 5563932 5667621
61308E667621P5694M5386J4453j5365m2859o7617q9839j09860j27677j42888j55143
$$ 5667621 5743315 5788701 5803154 5787789 5744930 5677313 5587474 5477614 5349937 5207049 5051906
61297E051906j64531j71300j75271j76000j73598j69053j63482j57269j50224
$$ 5051906 4887375 4716075 4540804 4364804 4191206 4022153 3858671 3701402 3551178
61288C551178j42299j33744j24668j14928j04614r4234q4152p4178o4075n4262
$$ 3551178 3408879 3275135 3150467 3035539 2930925 2836691 2752539 2678361 2614286 2560024
61278B560024m5463l7699l0165k2331j4648p796j690M229R989J5047J9226K2974
$$ 2560024 2514561 2476862 2446697 2424366 2409718 2401922 2400232 2404461 2414450 2429497 2448723 2471697
61266B471697K6550K9532L1494L2650L3404L3630L2865L1074K8776K6548K4694
$$ 2471697 2498247 2527779 2559273 2591923 2625327 2658957 2691822 2722896 2751672 2778220 2802914
61255B802914K3245K1909K0183J7864J5398J3336J1539R376O657L813R62k535
$$ 2802914 2826159 2848068 2868251 2886115 2901513 2914849 2926388 2935764 2942421 2946234 2947196 2944661
61243B944661p219j2502j7068k0231k2513k4868k7684l0653l3332l5505l7144
$$ 2944661 2937442 2924940 2907872 2887641 2865128 2840260 2812576 2781923 2748591 2713086 2675942
61232B675942l8216l8663l8447l7628l6477l5410l4558l3419l1188k7677k3716
$$ 2675942 2637726 2599063 2560616 2522988 2486511 2451101 2416543 2383124 2351936 2324259 2300543
61221B300543k0374j7911j5804j3693j1781j0319r167q217p844q449r695j0670
$$ 2300543 2280169 2262258 2246454 2232761 2220980 2210661 2201494 2193277 2185433 2176984 2167289 2156619
61209B156619j0888j0733j0758j0801j0061q031n117k292j99J303K891N221Q660
$$ 2156619 2145731 2134998 2124240 2113439 2103378 2095347 2090230 2087938 2087739 2089042 2091933 2097154 2105814
61196B105814J3263J8780K4752L0846L7029M3390M9835N6176O2324O8045P2668
$$ 2105814 2119077 2137857 2162609 2193455 2230484 2273874 2323709 2379885 2442209 2510254 2582922
61185B582922P5332P5619P3562O9051O1593N0772L6577J9326k51k0651l9948n6975
$$ 2582922 2658254 2733873 2807435 2876486 2938079 2988851 3025428 3044754 3044503 3023852 2983904 2926929
61173B926929p1777q4543r4564j00810j03294j03114j01220r7737r2588q6233
$$ 2926929 2855152 2770609 2676045 2575235 2471941 2368827 2267607 2169870 2077282 1991049
61163A991049p9492p2988o7011o1636n6684n1719m6426m1057l6328l2643k9531
$$ 1991049 1911557 1838569 1771558 1709922 1653238 1601519 1555093 1514036 1477708 1445065 1415534
61152A415534k6112k2185j8557j5995j4127j1869q822n579k633K90L415O144P752
$$ 1415534 1389422 1367237 1348680 1332685 1318558 1306689 1297867 1292288 1289655 1289945 1293360 1299504 1307256
61139A307256Q356Q549Q461P892P132O781O682N859L759R89j435l151m492n856
$$ 1307256 1315612 1324161 1332622 1340514 1347646 1354427 1361109 1366968 1370727 1371716 1370281 1367130 1362638 1356782
61125A356782p379q967j0489j2016j3849j6008j7763j8195j7373j6491j6560j7345
$$ 1356782 1349403 1340436 1329947 1317931 1304082 1288074 1270311 1252116 1234743 1218252 1201692 1184347
61113A184347j7962j8088j8032j7901j7466j6963j7315j9019k1123k2014k1281
$$ 1184347 1166385 1148297 1130265 1112364 1094898 1077935 1060620 1041601 1020478 998464 977183
61102I77183k0219k0176k0843k0750j9231j7198j5861j5329j4910j4277j3828
$$ 977183 956964 936788 915945 895195 875964 858766 842905 827576 812666 798389 784561
61091G84561j4109j5266j6878j8055j7974j6771j5518j4961j4544j3281j1244
$$ 784561 770452 755186 738308 720253 702279 685508 669990 655029 640485 627204 615960
61080F15960r440q398p673o814n909n032l910k557j527j052n59M87J761K695L515
$$ 615960 606520 598122 590449 583635 577726 572694 568784 566227 564700 563648 563089 563576 565337 568032 571547
61065E71547M888O727Q074Q255P641P043O837O846O887P074P649Q562R373R635
$$ 571547 576435 583162 591236 599491 607132 614175 621012 627858 634745 641819 649468 658030 667403 677038
61051F77038R357Q952Q669Q310P586O550N384M005K247L68j027j680j947k223
$$ 677038 686395 695347 704016 712326 719912 726462 731846 735851 738098 738466 737439 735759 733812 731589
61037G31589k397k239k071k547l742m844n121m812m708n015n225n095n107n646
$$ 731589 729192 726953 724882 722335 718593 713749 708628 703816 699108 694093 688868 683773 678666 673020
61023F73020o259o282n944o113p030p874p780o843n813n181m865m596m254l843
$$ 673020 666761 660479 654535 648422 641392 633518 625738 618895 613082 607901 603036 598440 594186 590343
61009E90343l404k975k580k257k088k103k064j552m32Q54J683J935K091K555L141
$$ 590343 586939 583964 581384 579127 577039 574936 572872 571320 570888 571742 573425 575360 577451 580006 583147
60994E83147L445L531L868M555N091N137N152N797O951P787P805P279O743O592
$$ 583147 586592 590123 593991 598546 603637 608774 613926 619723 626674 634461 642266 649545 656288 662880
60980F62880P148Q437R793J0329J0106J0173J1090J2140J2553J2760J3646J5119
$$ 662880 670028 678465 688258 698587 708693 718866 729956 742096 754649 767409 781055 796174
60968G96174J6357J7237J8421K0181K1916K3061K3729K4308K4994K5886K7019
$$ 796174 812531 829768 848189 868370 890286 913347 937076 961384 986378 1012264 1039283
60957A039283K8237K9444L1020L3483L6694L9912M2700M5325M8218N1575N5566
$$ 1039283 1067520 1096964 1127984 1161467 1198161 1238073 1280773 1326098 1374316 1425891 1481457
60946A481457O0377O5835P1369P6498Q1179Q5718R0589R6345J03301J11496J21137
$$ 1481457 1541834 1607669 1679038 1755536 1836715 1922433 2013022 2109367 2212668 2324164 2445301
60935B445301J32798J46748J62578J79992J99416K21284K45404K71981L02437
$$ 2445301 2578099 2724847 2887425 3067417 3266833 3488117 3733521 4005502 4307939
60926D307939L37950L78051M22350M72976N33132O03876O85087P79208Q90029
$$ 4307939 4645889 5023940 5446290 5919266 6452398 7056274 7741361 8520569 9410598
60917I410598J017332J157523J309503J468081J599386J629035J479045J137187
$$ 9410598 10427930 11585453 12894956 14363037 15962423 17591458 19070503 20207690
60909B0207690O90296K77161R22j15783j04207n736J29973K20812J65411r0960
$$ 20207690 20897986 21175147 21176069 21060286 20956079 20950343 21080316 21301128 21466539 21375579
60899B1375579n01721r40854j285203j479781j538200j502395j411198j293639
$$ 21375579 20873858 19933004 18647801 17168020 15629820 14127425 12716227 11422588
60891A1422588j170482j052405r40495q32984p30991o37458n53658m79171m14009
$$ 11422588 10252106 9199701 8259206 7426222 6695231 6057773 5504115 5024944 4610935
60882D610935l58870l13703k77120k47076k21719k00004j81716j66568j53380
$$ 4610935 4252065 3938362 3661242 3414166 3192447 2992443 2810727 2644159 2490779
60873B490779j40834j28858j18320j09345j01069r3199q6574q1681p7731p3822
$$ 2490779 2349945 2221087 2102767 1993422 1892353 1799154 1712580 1630899 1553168 1479346
60863A479346p0090o6965o4077o0756n7016n3267m9542m5731m2185l9309l6775
$$ 1479346 1409256 1342291 1278214 1217458 1160442 1107175 1057633 1011902 969717 930408 893633
60852H93633l3918l0735k7877k5715k4028k2509k1081j9667j8153j6624j5312
$$ 893633 859715 828980 801103 775388 751360 728851 707770 688103 669950 653326 638014
60841F38014j4192j3004j1695j0548r770r184q451p381o011m582l479k987k946
$$ 638014 623822 610818 599123 588575 578805 569621 561170 553789 547778 543196 539717 536730 533784
60828E33784k775j988o52P27J657J966J805J577J718K348L026L121K451J461O82
$$ 533784 531009 529021 528369 529096 530753 532719 534524 536101 537819 540167 543193 546314 548765 550226 550908
60813E50908K89K29M57P09M05p37k204l251l843m467n079n038m151l071k393j983
$$ 550908 551197 551426 551883 552592 552997 552260 550056 546805 542962 538495 533416 528378 524227 521156 518763 516780
60797E16780j544j170r12m00N73J622K443L377M694N849O227O138O312O757P017
$$ 516780 515236 514066 513154 512754 513327 514949 517392 520769 525463 531312 537539 543677 549989 556746 563763
60782E63763P190P750Q502Q733Q397Q131Q083P676O817O334O696P116O567N146
$$ 563763 570953 578703 587205 595938 604335 612466 620549 628225 635042 641376 648072 655188 661755 666901
60768F66901L871L430L566L512K735J463N81P32J477J796J449J255J734K164J483
$$ 666901 670772 674202 677768 681280 684015 685478 686059 686791 688268 690064 691513 692768 694502 696666 698149
60753F98149k87k060k926k914k639k616k966l556m308n309o532p585q034p910
$$ 698149 697862 695802 692876 689962 687323 684707 681741 678185 673877 668568 662036 654451 646417 638507
60739F38507p619p318o813o087n517n359n373n143m494l447k129q48L3M70P71
$$ 638507 630888 623570 616757 610670 605153 599794 594421 589278 584784 581337 579208 578360 578393 578863 579634
60724E79634J150J589K144L022M139N057N578O029O688P307P511P423P514P987
$$ 579634 580784 582373 584517 587539 591678 596735 602313 608342 615030 622337 629848 637271 644785 652772
60710F52772Q586Q885Q626P900P116O635O389O110N855N947O256O127N208L996
$$ 652772 661358 670243 678869 686769 693885 700520 706909 713019 718874 724821 731077 737204 742412 746408
60696G46408L161K789K571K432K490K600K401J771R58L44K33O69J226J175K32
$$ 746408 749569 752358 754929 757361 759851 762451 764852 766623 767581 767925 768158 768827 770053 771228 771460
60681G71460j047j939k420l012l878m560m684m488m459m692m918n052n343n894
$$ 771460 770413 768474 766054 763042 759164 754604 749920 745432 740973 736281 731363 726311 720968 715074
60667G15074o246n817m734l869l852m297m297l488k276j178m13p5k27o83j071
$$ 715074 708828 703011 698277 694408 690556 686259 681962 678474 676198 675020 674607 674532 674305 673622 672551
60652F72551j224j276j342j434j619j920k118k097k279l135m239m541l761k760
$$ 672551 671327 670051 668709 667275 665656 663736 661618 659521 657242 654107 649868 645327 641566 638806
60638F38806k221j784r44r4J02j75k52j28l70r78j219p82m00j000k620m516n982
$$ 638806 636585 634801 633857 633763 633865 633690 633438 633310 632940 631962 630743 629961 629561 628561 625941 621425 615443
60621F15443o823p203p346p409p503p738q110q295p825o606n214m378m212m102
$$ 615443 608620 601417 594071 586662 579159 571421 563311 555016 547191 540585 535371 530993 526781 522679
60607E22679l484k446j495q42j63Q22J806K168J796J231Q98O34K97L32J127K137
$$ 522679 519195 516749 515254 514412 514249 515071 516877 519045 520841 522072 522970 523604 523901 524233 525360 527497
60591E27497K423K000J786K171K472K147J652J567J601J196O51Q53K024L410M153
$$ 527497 529920 531920 533706 535877 538349 540496 542148 543715 545316 546512 547163 548016 550040 553450 557603
60576E57603L986L218K462K341K973L796M278M701N782P609R364J0248J0283J0072
$$ 557603 561589 564807 567269 569610 572583 576379 580657 585358 591140 598749 608113 618361 628644 638716
60562F38716J0048J0169J0240J0285J0507J0881J0972J0438R598R172R353R460
$$ 638716 648764 658933 669173 679458 689965 700846 711818 722256 731854 741026 750379 759839
60550G59839Q737P184N390L805K414J000n21j950l007l839n131p298r636j0883
$$ 759839 768576 775760 781150 784955 787369 788369 787848 785898 782891 779052 773921 766623 756987 746104
60536G46104j0746j0173r951r777r134q272p655p047n945m502l259k253j212l72
$$ 746104 735358 725185 715234 705457 696323 688051 680396 673349 667404 662902 659643 657390 656178 655806
60522F55806k24o01p74n28l83o99j142j204p09K15J212J668J155pr42j055l40
$$ 655806 655582 654981 654207 653679 653296 652597 651455 650251 649542 649757 650969 652637 653792 653785 652843 651788 651448
60505F51448R35K380L447L847M004M524N255N499N136M852N036N197M787M053
$$ 651448 652383 654763 658210 662057 666061 670585 675840 681339 686475 691327 696363 701560 706347 710400
60491G10400L650L824M361N042N807O684P793R283J1075J2871J4556J6377J8612
$$ 710400 714050 717874 722235 727277 733084 739768 747561 756844 767919 780790 795346 811723 830335
60478H30335K1190K3710K5660K6679K6826K6435K5387K2742J7698J0836L763k526
$$ 830335 851525 875235 900895 927574 954400 980835 1006222 1028964 1046662 1057498 1061261 1058735
60466A058735q196j3272j6755j7659j6406j4408j2489j0328p448m015o12K445
$$ 1058735 1050539 1037267 1020512 1002853 986447 972039 959550 949222 941774 937759 937147 939592
60454I39592N230P828J0048J1605J2674J3991J6143J8709K0633K1624K2727K5163
$$ 939592 944822 952650 962698 974303 986977 1000968 1017111 1035820 1056453 1078077 1100804 1125967
60442A125967K8916L3054L7182M1920M7815N4489O1295O8403P6630Q6176R6026
$$ 1125967 1154883 1187937 1225119 1267039 1314854 1369343 1430638 1499041 1575671 1661847 1757873
60431A757873J04949J12770J20373J28595J37554J47109J57497J69151J82061
$$ 1757873 1862822 1975592 2095965 2224560 2362114 2509223 2666720 2835871 3017932
60422C017932J95418K07414K14942K13692J99556J70527J27448P3150J1464n2835
$$ 3017932 3213350 3420764 3635706 3849398 4048954 4219481 4346929 4420079 4431543 4378708
60412D378708j13959j66102k05297k30473k42990k45298k39974k29363k15418
$$ 4378708 4264749 4098647 3893350 3662877 3419887 3174589 2934615 2705252 2489834
60403B489834j99457j82210j64353j46914j30922j16706j03889r2164q1656p2459
$$ 2489834 2290377 2108167 1943814 1796900 1665978 1549272 1445383 1353219 1271563 1199104
60393A199104o4267n6793n0225m4891m0726l7362l4503l1878k9145k6323k4000
$$ 1199104 1134837 1078044 1027819 982928 942202 904840 870337 838459 809314 782991 758991
60382G58991k2582k1527j9924j7665j5523j4051j3118j2439j1870j1113r835q328
$$ 758991 736409 714882 694958 677293 661770 647719 634601 622162 610292 599179 589344 581016
60370E81016p437p504p868p742p043o087m940l624k494j932j776j557j117o78
$$ 581016 573579 566075 558207 550465 543422 537335 532395 528771 526277 524345 522569 521012 519895 519217
60356E19217l81q2L59Q78J237J206Q10M50O16J373K281K853K958K764K590K805
$$ 519217 518836 518754 519113 519991 521228 522434 523244 523694 524310 525683 527964 530817 533775 536539 539129 541934
60340E41934L487M082L900L049K441K603L003K958K689K873L514L928L787L457
$$ 541934 545421 549503 553403 556452 558893 561496 564499 567457 570146 573019 576533 580461 584248 587705
60326E87705L283L122K739K175J485N14p19j724k033j834j765k051k209j759r04
$$ 587705 590988 594110 596849 599024 600509 601023 600304 598580 596547 594713 592948 590897 588688 586929 586025
60311E86025k71j13j48j06l1J30P13J808K838L204L071L088L406L589L400L133
$$ 586025 585754 585641 585493 585387 585356 585486 586199 588007 590845 594049 597120 600208 603614 607203 610603 613736
60295F13736L040L026L109L551M295M868N174N782O890P609O993N433M285M221
$$ 613736 616776 619802 622911 626462 630757 635625 640799 646581 653471 661080 668073 673506 677791 682012
60281F82012M668M873M704M320L678K731J668O77k01p60n80M08J606K339K549
$$ 682012 686680 691553 696257 700577 704255 706986 708654 709331 709130 708370 707790 708198 709804 712143 714692
60266G14692K634K723K563K013J297O71J74k57o62j188k094l402m748n713o230
$$ 714692 717326 720049 722612 724625 725922 726593 726767 726510 725848 724660 722566 719164 714416 708703 702473
60251G02473o367n941m762l247k291k258k417j772l10R89J335R53O29P25Q84O20
$$ 702473 696106 690165 685403 682156 679865 677607 675190 673418 673108 674097 675432 676385 677014 677739 678623 679243
60235F79243rl53J60J327K253K257J608J182J453K055K359K279K298K848L761
$$ 679243 679234 678881 679041 680368 682621 684878 686486 687668 689121 691176 693535 695814 698112 700960 704721
60220G04721M391M307L786L499L745M177M406M568N068N937O902P854Q891R887
$$ 704721 709112 713419 717205 720704 724449 728626 733032 737600 742668 748605 755507 763361 772252 782139
60206G82139J0493J0684J0965J1863J3411J5235J6885J8065J8839J9675K1058
$$ 782139 792632 803316 814281 826144 839555 854790 871675 889740 908579 928254 949312
60195I49312K3013K5251K7732L0686L3986L7020L9482M1904M5055M9060N3408
$$ 949312 972325 997576 1025308 1055994 1089980 1127000 1166482 1208386 1253441 1302501 1355909
60184A355909N7625O1588O5372O9121P2990P6883Q0310Q2786Q4387Q5580Q6378
$$ 1355909 1413534 1475122 1540494 1609615 1682605 1759488 1839798 1922584 2006971 2092551 2178929
60173B178929Q5944Q3278P8235P1682O4609N7245M9204M0346L1258K2694J4881
$$ 2178929 2264873 2348151 2426386 2498068 2562677 2619922 2669126 2709472 2740730 2763424 2778305
60162B778305P518L40o548j2705j7511k0404k1395k1198k0447j8817j5444j0179
$$ 2778305 2785823 2786163 2779615 2766910 2749399 2728995 2707600 2686402 2665955 2647138 2631694 2621515
60150B621515l941K457R290J7362K6643L5946M3990N0597N6698O3229P0037P6028
$$ 2621515 2617574 2620031 2629321 2646683 2673326 2709272 2753262 2803859 2860557 2923786 2993823 3069851
60138C069851Q0287Q2735Q3514Q2235P8392P2244O4636N5909M5682L3836K1099
$$ 3069851 3150138 3232873 3316387 3398622 3477014 3549258 3613894 3669803 3715485 3749321 3770420
60127C770420Q441l644j5017k5612l5451m4501n2216n7694o0518o0992n9364n5460
$$ 3770420 3778861 3775217 3760200 3734588 3699137 3654636 3602420 3544726 3484208 3423216 3363852 3308392
60115C308392m9426m2168l4423k5931j6164n507N041J5066K4813L4166M2324M8668
$$ 3308392 3258966 3216798 3182375 3156444 3140280 3134773 3139814 3154880 3179693 3213859 3256183 3304851
60103C304851N3394N7010N9521O0246N8363N3624M6780L9167L1699K4287J6528
$$ 3304851 3358245 3415255 3474776 3535022 3593385 3647009 3693789 3732956 3764655 3788942 3805470
60092C805470Q757K023k861n849p221o920m553J28O818J4750K3316L2587M3080
$$ 3805470 3814227 3816250 3813389 3807540 3800319 3793399 3788846 3788974 3795792 3810542 3833858 3866445 3909525
60079C909525N5000O7920Q1369R5301J09812J24729J39842J55265J71141J87158
$$ 3909525 3964525 4032445 4113814 4209115 4318927 4443656 4583498 4738763 4909904 5097062
60069E097062K02709K17333K30679K42202K51353K57967K61994K62910K59739
$$ 5097062 5299771 5517104 5747783 5989985 6241338 6499305 6761299 7024209 7283948
60060G283948K51714K38706K21087J99481J74566J46812J16358Q3336M8383J2605
$$ 7283948 7535662 7774368 7995455 8194936 8369502 8516314 8632672 8716008 8764391 8776996
60050H776996k2929n7578r1137j23403j53498j79594j99825k13702k22198k26158
$$ 8776996 8754067 8696489 8605352 8481949 8328451 8148857 7949032 7735330 7513132 7286974
60040G286974k25181k18508k06512j90644j72268j52150j30814j08592q5579o2199
$$ 7286974 7061793 6843285 6636773 6446129 6273861 6121711 5990897 5882305 5796726 5734527
60030E734527l9689j9211p24J6443L1883M4053N1996N6202N7384N5347M9670M0734
$$ 5734527 5694838 5675627 5674903 5691346 5723229 5767282 5819278 5875480 5932864 5988211 6037881 6078615
60018F078615K9421J6309J848j3133k7747m1714n5203o8212q0523r1951j02188
$$ 6078615 6108036 6124345 6126193 6113060 6085313 6043599 5988396 5920184 5839661 5747710 5645522
60007E645522j10643j16945j21472j24819j26904j27044j24863j20611j14613
$$ 5645522 5534879 5417934 5296462 5171643 5044739 4917695 4792832 4672221 4557608
59998D557608j07001r7998q7947p6901o4694n1692l8917k6977j5238k579J1184
$$ 4557608 4450607 4352609 4264662 4187761 4123067 4071375 4032458 4005481 3990243 3987664 3998848
59987C998848K5122L8237N0142O0588O9017P4982P8667Q0531Q0493P7848P1954
$$ 3998848 4023970 4062207 4112349 4172937 4241954 4316936 4395603 4476134 4556627 4634475 4706429
59976D706429O2801N1010L7517K3155Q232p467k3934m0294n5260o8169p9140q8137
$$ 4706429 4769230 4820240 4857757 4880912 4889144 4881677 4857743 4817449 4762189 4694020 4614880 4526743
59964D526743r4499r7693r8086r6508r3283q8152q0979p2086o1931n0875l9297
$$ 4526743 4432244 4334551 4236465 4139957 4046674 3958522 3877543 3805457 3743526 3692651 3653354
59953C653354k7662j6174m592P462J9986L2477M4484N6194O8239Q0761R2889J03415
$$ 3653354 3625692 3609518 3604926 3612388 3632374 3664851 3709335 3765529 3833768 3914529 4007418 4110833
59941D110833J11769J17957J21803J22812J20821J16025J08305R7199Q2881O6504
$$ 4110833 4222602 4340559 4462362 4585174 4705995 4822020 4930325 5027524 5110405 5176909
59931E176909M9175L1179J2609n906k3720m0803n7092p1661q3361r1952r7757
$$ 5176909 5226084 5257263 5269872 5263966 5240246 5199443 5142351 5070690 4987329 4895377 4797620
59920D797620j00439r9212r4167q6475p7041o5873n3075l9576k6335j3377k40
$$ 4797620 4697181 4597969 4503802 4417327 4340286 4274413 4221338 4181762 4155427 4142050 4141810
59909D141810J3007K5733L7458M8076N7396O4950P0458P4258P7000P8891P9441
$$ 4141810 4154817 4180550 4218008 4266084 4323480 4388430 4458888 4533146 4610146 4689037 4768478
59898D768478P8125P5115P1007O5947N9663N2453M5455L9546L4573L0233K7129
$$ 4768478 4846603 4921718 4992725 5058672 5118335 5170788 5216243 5255789 5290362 5320595 5347724
59887E347724K6119K7050K9143L2465L8095M6820N8540P2982Q9987J08859J28346
$$ 5347724 5373843 5400893 5430036 5462501 5500596 5547416 5605956 5678938 5768925 5877784 6006130
59876F006130J47873J68053J89431K11166K31488K48982K62988K73030K78388
$$ 6006130 6154003 6322056 6511487 6722653 6954141 7203123 7466111 7739141 8017529
59867H017529K77958K70182K53390K26699J90607J46623R6533M2259j3908o9308
$$ 8017529 8295487 8565669 8819059 9045758 9236365 9382988 9479521 9521780 9507872 9438564
59857I438564j21279j67452k06075k36242k57813k70944k75938k73474k64736
$$ 9438564 9317285 9149833 8943758 8707516 8449703 8178759 7902821 7629347 7364611
59848G364611k51080k33662k13461j91394j68243j44529j20481r6108p1493m7181
$$ 7364611 7113531 6879869 6666408 6475014 6306771 6162242 6041761 5945653 5874160 5826979
59838E826979k4075k631J7630L7259N5733P1694Q4270R3507R9375J01108R7800
$$ 5826979 5802904 5800273 5817903 5855162 5910895 5982589 6066859 6160366 6259741 6360849 6458649
59827F458649Q9121P5088N5650L1024K129k9542o2326r4447j24126j50060j71776
$$ 6458649 6547770 6622858 6678508 6709532 6711661 6682119 6619793 6525346 6401220 6251160 6079384
59816F079384j89332k02714k11604k15580k14612k09501k01633j92021j80760
$$ 6079384 5890052 5687338 5475734 5260154 5045542 4836041 4634408 4442387 4261627
59807D261627j67878j54308j41266j28782j15848j02254q9351p8518o9719o2116
$$ 4261627 4093749 3939441 3798175 3669393 3553545 3451291 3361940 3283422 3213703 3151587
59797C151587n5506n0389m7040m5143m4129m3332m2055m0047l7679l5289l2568
$$ 3151587 3096081 3045692 2998652 2953509 2909380 2866048 2823993 2783946 2746267 2710978 2678410
59786B678410k8988k4697k0568j7446j5582j4728j4548j5075j6791k0012k4149
$$ 2678410 2649422 2624725 2604157 2586711 2571129 2556401 2541853 2526778 2509987 2489975 2465826
59775B465826k7963l0613l2032l2257l1146k8933k6287k3392j9646j4834r881
$$ 2465826 2437863 2407250 2375218 2342961 2311815 2282882 2256595 2233203 2213557 2198723 2188842
59764B188842n787k390J015M428P439J0326J3824J7912K1830K5348K9079L3352
$$ 2188842 2183055 2180665 2181680 2186108 2193547 2203873 2217697 2235609 2257439 2282787 2311866 2345218
59752B345218L7541M0833M3054M4450M5134M5025M3976M1792L8471L4523L0695
$$ 2345218 2382759 2423592 2466646 2511096 2556230 2601255 2645231 2687023 2725494 2760017 2790712
59741B790712K7294K4106K1053J8429J6431J4961J4228J5023J7921K2492K7864
$$ 2790712 2818006 2842112 2863165 2881594 2898025 2912986 2927214 2942237 2960158 2982650 3010514
59730C010514L3948M1568N1201O2093P3102Q4079R5829J08749J22291J36120J51072
$$ 3010514 3044462 3086030 3137231 3199324 3272426 3356505 3452334 3561083 3683374 3819494 3970566
59719C970566J68069J86401K04155K20231K34844K47480K55282K54027K40134
$$ 3970566 4138635 4325036 4529191 4749422 4984266 5231746 5487028 5741055 5981189
59710E981189K11540J68040J12327N0369j0593o4970j09756j43397j65199j75881
$$ 5981189 6192729 6360769 6473096 6523465 6512872 6447902 6338146 6194749 6029550 5853669
59700E853669j77567j72545j62406j48420j32000j14340r6070p7587n9351m1671
$$ 5853669 5676102 5503557 5341151 5192731 5060731 4946391 4850321 4772734 4713383 4671712
59690D671712k4625q371O886K1404L5927N0818O5559P9526R2933J06610J21011
$$ 4671712 4647087 4638716 4645602 4667006 4702933 4753751 4819310 4898836 4991769 5098379 5219390
59679E219390J35999J51475J67782J85205K03436K21884K40515K60087K81400
$$ 5219390 5355389 5506864 5674646 5859851 6063287 6285171 6525686 6785773 7067173
59670G067173L04404L28281L52339L76541M01085M25736M49755M72181M91888
$$ 7067173 7371577 7699858 8052197 8428738 8829823 9255559 9705314 10177495 10669383
59661A0669383N07499N17627N21306N18175N08453M93014M73360M51437M29472
$$ 10669383 11176882 11694509 12215815 12733990 13242443 13735457 14208817 14660254 15089726
59652A5089726M09930L95112L86254L83152L84869L90625L99567M09897M18779
$$ 15089726 15499656 15894768 16281022 16664174 17049043 17439668 17839235 18249132 18667911
59643A8667911M23316M21346M11259L91550L61007L19570K68928K12129J52403
$$ 18667911 19091227 19512573 19923832 20315382 20676389 20995959 21264887 21477016 21629419
59634B1629419R2333L4318j8531o2726r5927j17593j27891j26634j13843r0728
$$ 21629419 21721752 21756070 21737539 21674813 21578886 21461293 21333402 21206768 21092925 21002197
59624B1002197n9131k0295K5025P5553J29590J86152K45044L05523L65731M23711
$$ 21002197 20943066 20922771 20947796 21023349 21152939 21339091 21584135 21889658 22255389 22679100
59614B2679100M78056N26947N67180N94833O06493N99202N69550N13911M30073
$$ 22679100 23157156 23684103 24251283 24846116 25452609 26051811 26621361 27135272 27565345
59605B7565345L18728J83656L1099j30831k92766m45125n79544o90110p73808
$$ 27565345 27884073 28067729 28098828 27967997 27675231 27230106 26650562 25960452 25186644
59596B5186644q30168q60579q67750q55348q27652p89295p45247p00753o61108
$$ 25186644 24356476 23495897 22628147 21772799 20945147 20155852 19410605 18709852 18048744
59587A8048744o31271o15130o14122o25850o44277o62166o74066o77416o71622
$$ 18048744 17417473 16802343 16188221 15562371 14918094 14255928 13581862 12904446 12232824
59578A2232824o56960o34355o05410n72033n36001m98906m62073m26288l91731
$$ 12232824 11575864 10941509 10336099 9764066 9228065 8729159 8267086 7840798 7449067
59569G449067l58410l26602k96861k69636k45021k22717k02245j83196j65363
$$ 7449067 7090657 6764055 6467194 6197558 5952537 5729820 5527575 5344379 5179016
59560E179016j48674j33206j19260j07147r6734q7420p8814p1270o5514o1963
$$ 5179016 5030342 4897136 4777876 4670729 4573995 4486575 4407761 4336491 4270977 4209014
59550D209014o0550o0885o2301o4103o6124o8737p1912p4712p6317p7098p7789
$$ 4209014 4148464 4087579 4025278 3961175 3895051 3826314 3754402 3679690 3603373 3526275 3448486
59539C448486p7897p6100p2221o7718o3718n9594n4151m7490m0871l5108k9942
$$ 3448486 3370589 3294489 3222268 3154550 3090832 3031238 2977087 2929597 2888726 2853618 2823676
59528B823676k4786j9467j4110q834l693J296O095J0546J4330J7203J9211K0641
$$ 2823676 2798890 2779423 2765313 2756479 2752786 2754082 2760177 2770723 2785053 2802256 2821467 2842108
59516B842108K1929K3546K5714K8084K9998L1268L2506L4511L7615M1718M6670
$$ 2842108 2864037 2887583 2913297 2941381 2971379 3002647 3035153 3069664 3107279 3148997 3195667
59505C195667N2282N8200O4163P0294P6880Q3975R1469R9362J07767J16695J26117
$$ 3195667 3247949 3306149 3370312 3440606 3517486 3601461 3692930 3792292 3900059 4016754 4142871
59494D142871J36163J46986J58370J69721J80437J90153J98628K05614K10895
$$ 4142871 4279034 4426020 4584390 4754111 4934548 5124701 5323329 5528943 5739838
59485E739838K14289K15556K14383K10577K04213J95561J84961J72832J59613
$$ 5739838 5954127 6169683 6384066 6594643 6798856 6994417 7179378 7352210 7511823
59476G511823J45355J29470J11373R1744P2797N6721M3941L3432K4717J8680J6189
$$ 7511823 7657178 7786648 7898021 7989765 8062562 8119283 8163224 8196656 8221373 8240053 8256242
59465H256242J6755J9377K4117L1787M2157N3351O3213P0486P4426P3916O7552
$$ 8256242 8272997 8292374 8316491 8348278 8390435 8443786 8506999 8577485 8651911 8725827 8793379
59454H793379N4404L4461Q570k1983n6025r2688j30801j68202k02297k31465k55466
$$ 8793379 8847783 8882244 8890814 8868831 8812806 8720118 8589317 8421115 8218818 7987353 7731887
59443G731887k74298k87319k93867k94210k89345k80119k67143k51233k33364
$$ 7731887 7457589 7170270 6876403 6582193 6292848 6012729 5745586 5494353 5260989
59434E260989k14120j93819j73161j53319j35055j18054j01471q5005o9122n4195
$$ 5260989 5046869 4853050 4679889 4526570 4391515 4273461 4171990 4086985 4017863 3963668
59424C963668l9786k5170j0430L562J6371K8719M1498N4517O6983P8873R0901
$$ 3963668 3923882 3898712 3888282 3891844 3908215 3936934 3978432 4032949 4099932 4178805 4269706
59413D269706J03117J14616J24998J35008J44978J53475J58535J59772J58136
$$ 4269706 4372823 4487439 4612437 4747445 4892423 5045898 5204433 5364205 5522341
59404E522341J53796J45394J31650J12660Q9276O2044L1421j519l5251o8438r9925
$$ 5522341 5676137 5821531 5953181 6065841 6155117 6217161 6248582 6247063 6211812 6143374 6043449
59393F043449j28457j52928j72797j87946j98337k04233k06430k05569k01455
$$ 6043449 5914992 5762064 5589267 5401321 5202984 4998751 4792321 4586752 4385297
59384D385297j93800j83594j72845j62755j52926j42682j32237j21975j11471
$$ 4385297 4191497 4007903 3835058 3672303 3519377 3376695 3244458 3122483 3011012
59375C011012j00323q9372p9940p2083o4588n6786m9187m2284l5839k9680k4212
$$ 3011012 2910689 2821317 2741377 2669294 2604706 2547920 2498733 2456449 2420610 2390930 2366718
59364B366718j9537j4979j0086n417j568J872N708R960J4007J7465K0410K3137
$$ 2366718 2347181 2332202 2322116 2316699 2315131 2317003 2322711 2332671 2346678 2364143 2384553 2407690
59352B407690K6226L0032L3543L4618L2428K8985K7160K7750K9746L2771L7560
$$ 2407690 2433916 2463948 2497491 2532109 2564537 2593522 2620682 2648432 2678178 2710949 2748509
59341B748509M4165N1566N9255O7594P6146Q3227Q8005R1746R6239J02145J09746
$$ 2748509 2792674 2844240 2903495 2971089 3047235 3130462 3218467 3310213 3406452 3508597 3618343
59330C618343J19975J33428J49099J65471J82326K00453K20026K40475K61581
$$ 3618343 3738318 3871746 4020845 4186316 4368642 4569095 4789121 5029596 5291177
59321E291177K83520L05921L28003L49538L70586L90028M05482M15007M18181
$$ 5291177 5574697 5880618 6208621 6558159 6928745 7318773 7724255 8139262 8557443
59312H557443M15150M05555L89090L66493L39348L09186K77338K45318K14530
$$ 8557443 8972593 9378148 9767238 10133731 10473079 10782265 11059603 11304921 11519451
59303A1519451J85397J57287J29458J01786P4376M6822J8179j2309m4682p8386
$$ 11519451 11704848 11862135 11991593 12093379 12167755 12214577 12232756 12220447 12175765 12097379
59293A2097379j12585j46265j78325k07843k34252k57175k76307k91658l03826
$$ 12097379 11984794 11838529 11660204 11452361 11218109 10960934 10684627 10392969 10089143
59284A0089143l13674l21730l28022l32477l35213l36360l35717l32671l26559
$$ 10089143 9775469 9453739 9125717 8793240 8458027 8121667 7785950 7453279 7126720
59275G126720l17212l05237k91616k76940k61184k44252k26474k08445j90654
$$ 7126720 6809508 6504271 6212655 5935715 5674531 5430279 5203805 4995360 4804706
59266D804706j73488j57247j41878j27022j12615r9052q6488p4506o2953n2494
$$ 4804706 4631218 4473971 4332093 4205071 4092456 3993404 3906916 3832410 3769457 3716963
59256C716963m3617l5620k7443j9166j1618m791K251R748J6775K2620K7696L2605
$$ 3716963 3673346 3637726 3610283 3591117 3579499 3574708 3576959 3586707 3603482 3626102 3653798 3686403
59244C686403L7187M1028M4188M6924M9134N0544N1031N0514M8955M6622M3780
$$ 3686403 3723590 3764618 3808806 3855730 3904864 3955408 4006439 4056953 4105908 4152530 4196310
59233D196310M0138L5366L0259K6406K4352K3084K1812K1285K2570K5421K8855
$$ 4196310 4236448 4271814 4302073 4328479 4352831 4375915 4397727 4419012 4441582 4467003 4495858
59222D495858L2778L8008M4887N2672O0217O6688P1844P6060P9802Q2637Q3099
$$ 4495858 4528636 4566644 4611531 4664203 4724420 4791108 4862952 4939012 5018814 5101451 5184550
59211E184550P9934P3068O2936M9567L3152J5052k723j8926l3362m5925n6206
$$ 5184550 5264484 5337552 5400488 5450055 5483207 5498259 5495536 5476610 5443248 5397323 5341117
59200E341117o3978o9363p2373p2795p0638o6295o0235n2910m4982l7177k9869
$$ 5341117 5277139 5207776 5135403 5062608 4991970 4925675 4865440 4812530 4767548 4730371 4700502
59189D700502k3091j6952j1744p637m487k020m0J583L038M659O792R524J2679
$$ 4700502 4677411 4660459 4648715 4641078 4636591 4634571 4634531 4636114 4639152 4643811 4650603 4660127 4672806
59176D672806J6361K1223K7811L5958M5380N6655P0558Q6490J02642J18120J33935
$$ 4672806 4689167 4710390 4738201 4774159 4819539 4876194 4946752 5033242 5135884 5254004 5387939
59165E387939J51243J69595J87388K03236K16016K24337K26939K23234K12663
$$ 5387939 5539182 5708777 5896165 6099401 6315417 6539754 6766693 6989927 7202590
59156G202590J94094J66669J30926Q8390M0527j1096o4128j15898j64499k08640
$$ 7202590 7396684 7563353 7694279 7782669 7823196 7812100 7747972 7632074 7467575 7258935
59146G258935k46704k76818k97874l09953l13988l11420l03883k92549k77924
$$ 7258935 7012231 6735413 6437539 6127586 5813598 5502178 5198295 4905746 4627822
59137D627822k60681k42185k23637k05330j87352j70423j55102j40806j26732
$$ 4627822 4367141 4124956 3901319 3695989 3508637 3338214 3183112 3042306 2915574
59128B915574j13381j01989r2677q4302p6111o8427o1679n5750n0411m5504m0629
$$ 2915574 2802193 2700204 2607527 2523225 2447114 2378687 2317008 2261258 2210847 2165343 2124714
59117B124714l5473l0415k6043k2156j8148j4268j1397r477p255l862K57M315
$$ 2124714 2089241 2058826 2032783 2010627 1992479 1978211 1966814 1957337 1950082 1946220 1946477 1950792
59105A950792Q188J2103J6019J9708K2940K5448K7262K9124L1867L5375L8787
$$ 1950792 1958980 1971083 1987102 2006810 2029750 2055198 2082460 2111584 2143451 2178826 2217613
59094B217613M1783M4845M8143N1120N3410N5333N7203N8877O0290O1597O2498
$$ 2217613 2259396 2304241 2352384 2403504 2456914 2512247 2569450 2628327 2688617 2750214 2812712
59083B812712O2241O0640N8380N5912N2724M8112M2082L5103K7715K0741J5149
$$ 2812712 2874953 2935593 2993973 3049885 3102609 3150721 3192803 3227906 3255621 3276362 3291511
59072C291511J1037P343L180r13l531l874k290K91L102O082J0004J5752K3223
$$ 3291511 3302548 3309891 3313071 3312158 3308627 3304753 3302463 3302754 3305856 3311938 3321942 3337694 3360917
59059C360917L1321L9224M7173N5728O4848P4053Q3047R1658R9663J07113J14504
$$ 3360917 3392238 3431462 3478635 3534363 3599211 3673264 3756311 3847969 3947632 4054745 4169249
59048D169249J22137J29530J35867J40810J44349J46045J44835J39668J30188
$$ 4169249 4291386 4420916 4556783 4697593 4841942 4987987 5132822 5272490 5402678
59039E402678J16768R9953P9875N6341K9692J444k6286n1991p5115r5499j13044
$$ 5402678 5519446 5619399 5699274 5755615 5785307 5786751 5760465 5708474 5633359 5537860 5424816
59028E424816j27872j40167j49688j56026j59461j61080j61784j61676j60567
$$ 5424816 5296944 5156777 5007089 4851063 4691602 4530522 4368738 4207062 4046495
59019D046495j58522j55688j52053j47729j43056j38252j33251j28017j22585
$$ 4046495 3887973 3732285 3580232 3432503 3289447 3151195 3017944 2889927 2767342
59010B767342j16729j10117j03047r6507r1200q6824q2470p7387p1309o4604n8273
$$ 2767342 2650613 2540496 2437449 2340942 2249742 2162918 2080448 2003061 1931752 1867148 1808875
58999A808875n3305m9681m6464m2943l9283l5886l2819l0087k7893k6218k4722
$$ 1808875 1755570 1705889 1659425 1616482 1577199 1541313 1508494 1478407 1450514 1424296 1399574
58988A399574k3360k2628k2789k3357k3771k4031k4278k4184k3318k1822k0178
$$ 1399574 1376214 1353586 1330797 1307440 1283669 1259638 1235360 1211176 1187858 1166036 1145858
58977A145858j8600j7019j5475j4094j2862j1695j0503q996o795m103j895r42
$$ 1145858 1127258 1110239 1094764 1080670 1067808 1056113 1045610 1036614 1029819 1025716 1023821 1022879
58965A022879q53n32N24J795K491K381J833J343J143J163J254J396J623J862K019
$$ 1022879 1022026 1021494 1022018 1023813 1026304 1028685 1030518 1031861 1033004 1034167 1035421 1036817 1038440 1040302 1042321
58950A042321K196K540K989L348L672M271N309O520P349P357O672O091O343P049
$$ 1042321 1044517 1047057 1050046 1053394 1057066 1061337 1066646 1073166 1080515 1087872 1094544 1100635 1106978 1114027
58936A114027O973N651M166L723M089M336M491N284O532P239P315P835R212J0391
$$ 1114027 1121000 1126651 1130817 1134540 1138629 1142965 1147456 1152740 1159272 1166511 1173826 1181661 1190873 1201264
58922A201264J0493J0183J0616J1807J2929J3668J4466J5626J6859J7718J8156
$$ 1201264 1211757 1221940 1232556 1244363 1257292 1270960 1285426 1301052 1317911 1335629 1353785
58911A353785J8631J9711K1368K2859K3656K4295K5733K7970L0071L1371L2046
$$ 1353785 1372416 1392127 1413495 1436354 1460010 1484305 1510038 1538008 1568079 1599450 1631496
58900A631496L2524L3156L4343L6024L7172L6881L5995L6423L8639M1134M2742
$$ 1631496 1664020 1697176 1731519 1767543 1804715 1841596 1877591 1914014 1952653 1993787 2036529
58889B036529M4134M6435M9653N3292N7336O1670O5493O8470P1697P6616Q3373
$$ 2036529 2080663 2127098 2176751 2230043 2287379 2349049 2414542 2483012 2554709 2631325 2714698
58878B714698R0986R8545J05557J11866J18064J25399J34486J44593J54879J65645
$$ 2714698 2805684 2904229 3009786 3121652 3239716 3365115 3499601 3644194 3799073 3964718
58868C964718J77665J90910K04842K19398K34889K51383K68971K88126L09019
$$ 3964718 4142383 4333293 4538135 4757533 4992422 5243805 5512776 5800902 6109921
58859F109921L30903L52927L75047L97425M19491M40372M59846M77928M93769
$$ 6109921 6440824 6793751 7168798 7566223 7985714 8426086 8885932 9363860 9857629
58850I857629N05622N11533N09650M98233M76085M42523L96744L38050K67285
$$ 9857629 10363251 10874784 11384434 11882667 12358752 12801275 13198019 13536069 13803354
58841A3803354J87209J00771J0088q2032j70856k51663l22313l82615m31897m68809
$$ 13803354 13990563 14091334 14101422 14019390 13848534 13596871 13274558 12891943 12460046 11991237
58831A1991237m93184n06404n09937n04897m93006m76412m56325m32953m07076
$$ 11991237 11498053 10991649 10481712 9976815 9483809 9007397 8551072 8118119 7711043
58822G711043l80495l54613l29614l05470k82834k62419k44187k27608k12291
$$ 7711043 7330548 6975935 6646321 6340851 6058017 5795598 5551411 5323803 5111512
58813E111512j98107j85135j73658j63743j54711j45487j35567j25330j15467
$$ 5111512 4913405 4728270 4554612 4390869 4236158 4090671 3955104 3829774 3714307
58804C714307j06411r8239r0640q3077p5378o7966o1196n4790m8354m2111l6510
$$ 3714307 3607896 3509657 3419017 3335940 3260562 3192596 3131400 3076610 3028256 2986145 2949635
58793B949635l1401k6202k0664j4907r008l081K499P573J2622J8165K4085L0069
$$ 2949635 2918234 2892032 2871368 2856461 2847453 2844372 2846871 2854444 2867066 2885231 2909316 2939385
58781B939385L6249M2770M9231N5271O1275O7751P4415Q0814Q7315R4616J02649
$$ 2939385 2975634 3018404 3067635 3122906 3184181 3251932 3326347 3407161 3494476 3589092 3691741
58770C691741J10921J19623J29344J39971J50870J61996J73892J86734K00362
$$ 3691741 3802662 3922285 4051629 4191600 4342470 4504466 4678358 4865092 5065454
58761E065454K14956K30847K47812K65607K84833L06187L29038L51927L74352
$$ 5065454 5280410 5511257 5759069 6024676 6309509 6615696 6944734 7296661 7671013
58752G671013L96845M19265M40273M58546M73403M83893M88345M84999M72308
$$ 7671013 8067858 8487123 8927396 9385942 9859345 10343238 10831583 11316582 11788890
58743A1788890M48536M12131L62799L01476K29297J47632N9217l1881j21795k07547
$$ 11788890 12237426 12649557 13012356 13313832 13543129 13690761 13749978 13718097 13596302 13388755
58733A3388755k86295l55050m11747m55890m87875n08361n18378n19259n12253
$$ 13388755 13102460 12747410 12335663 11879773 11391898 10883537 10365159 9845900 9333647
58724I333647m98775m80923m60719m38851m15189l90524l66589l44051l21856
$$ 9333647 8834872 8353949 7893230 7454379 7039190 6648666 6282077 5938026 5616170
58715E616170k99207k77086k57128k39778k24301k09977j96575j84023j72246
$$ 5616170 5316963 5039877 4782749 4542971 4318670 4108693 3912118 3728095 3555849
58706C555849j61206j50818j40977j31698j22983j14651j06643r9264r2639q6232
$$ 3555849 3394643 3243825 3102848 2971150 2848167 2733516 2626873 2527609 2434970 2348738
58696B348738p9504p2751o6560o0886n5488n0866m7576m5035m2243l9339l7074
$$ 2348738 2269234 2196483 2129923 2069037 2013549 1962683 1915107 1870072 1827829 1788490 1751416
58685A751416l5011l1930k8045k5049k3657k2792k1612k0649k0285j9801j8859
$$ 1751416 1716405 1684475 1656430 1631381 1607724 1584932 1563320 1542671 1522386 1502585 1483726
58674A483726j8357j8786j9109j8434j7545j7526j7978j7935j7651j8043j9052
$$ 1483726 1465369 1446583 1427474 1409040 1391495 1373969 1355991 1338056 1320405 1302362 1283310
58663A283310j9960k0788k2073k3519k4176k3950k3757k4097k4356k3759k2323
$$ 1283310 1263350 1242562 1220489 1196970 1172794 1148844 1125087 1100990 1076634 1052875 1030552
58652A030552k0700j9521j9015j8933j8784j8305j7632j6967j6298j5569j4787
$$ 1030552 1009852 990331 971316 952383 933599 915294 897662 880695 864397 848828 834041
58641H34041j3932j3063j2494j2391j2251j1409j0127r388r471r551q982q138
$$ 834041 820109 807046 794552 782161 769910 758501 748374 738986 729515 719964 710982 702844
58629G02844p575p118o343n330m415l612k760j834q51J31P95Q67P11Q97J122M60
$$ 702844 695269 688151 681808 676478 672063 668451 665691 663857 663006 663137 663932 664799 665510 666407 667529 667989
58613F67989j141k493k746k330j939j596j234j284j941k588k561j909q59O34K201
$$ 667989 666848 664355 661609 659279 657340 655744 654510 653226 651285 648697 646136 644227 643368 644002 646203
58598F46203K838K121R86N42P87J218J922L233M861O317P738R421J0929J1545
$$ 646203 649041 651162 652148 652690 653477 654695 656617 659850 664711 671028 678766 688187 699116 710661
58584G10661J1437J1554J2462J3864J5231J6425J7759J9713K2416K5295K7610
$$ 710661 722098 733652 746114 759978 775209 791634 809393 829106 851522 876817 904427
58573I04427K9374L1266L3570L5939L8315M1192M4624M7995N1203N5183O0541
$$ 904427 933801 965067 998637 1034576 1072891 1114083 1158707 1206702 1257905 1313088 1373629
58562A373629O6582P2381P8076Q4281R0994R7932J05319J13408J21686J29295
$$ 1373629 1440211 1512592 1590668 1674949 1765943 1863875 1969194 2082602 2204288 2333583
58552B333583J35881J41299J44942J46067J44275J39052J29348J14403R4569P0684
$$ 2333583 2469464 2610763 2755705 2901772 3046047 3185099 3314447 3428850 3523419 3594103
58542C594103M3298J3288j7296m6045p1602r3564j11347j24172j31971j35562
$$ 3594103 3637401 3650689 3633393 3587348 3515746 3422182 3310835 3186663 3054692 2919130
58532B919130j35885j33630j29478j24062j17700j10593j03089r5464q7644p9470
$$ 2919130 2783245 2649615 2520137 2396075 2278375 2167782 2064693 1969229 1881585 1802115
58522A802115p1086o2817n5093m8607m3957m0823l8043l4925l1896k9587k7972
$$ 1802115 1731029 1668212 1613119 1564512 1520555 1479732 1441689 1406764 1374868 1345281 1317309
58511A317309k6829k6262k6134k5682k4407k2880k1994k1863k1963k1938k1709
$$ 1317309 1290480 1264218 1238084 1212402 1187995 1165115 1143121 1121258 1099295 1077357 1055648
58500A055648k1297k0959k1083k1567k1827k1685k1567k1546k0996j9636j8052
$$ 1055648 1034351 1013392 992309 970742 948915 927230 905663 884117 863121 843485 825433
58489H25433j6697j5316j3877j3078j3184j3328j2698j1595j0580r530q371p742
$$ 825433 808736 793420 779543 766465 753281 739953 727255 715660 705080 695550 687179 679437
58477F79437p944q072p245n902m955m445m003l816m029l968l125k236k245k847
$$ 679437 671493 663421 656176 650274 645319 640874 636871 633055 629026 625058 621933 619697 617452 614605
58463F14605l207l439m104m874n084n073n664o583o767o031n300n259n806o573
$$ 614605 611398 607959 603855 598981 593897 588824 583160 576577 569810 563779 558479 553220 547414 540841
58449E40841p085o701n421m431m773n827o038m928l360k128j273o38j52L28P30
$$ 540841 533756 527055 521634 517203 512430 506603 500565 495637 492277 490149 488876 488238 488086 488414 489144
58434D89144N68k93j153j403j385j553j463o53J98Q8q10j586j988k265k160j302
$$ 489144 489712 489419 488266 486863 485478 483925 482462 481809 482007 482095 481285 479699 477711 475446 473286 471984
58418D71984k26J91O9J73N31M79j72j009j747k169j808o67K40J05m27k91L41O09
$$ 471984 471758 471949 472018 472191 472722 473201 473029 472020 470273 468104 466296 465629 465869 465974 465547 465256 465597 466206
58400D66206N46Q15J287J360J254J650K313K409J926J540J259N42m93j160j357
$$ 466206 466752 467567 468854 470214 471468 473118 475431 477840 479766 481306 482565 483107 482614 481454 480097
58385D80097j477j515j325j446k450l790m492m574m610m466l735k968k951l172
$$ 480097 478620 477105 475780 474334 471884 468094 463602 459028 454418 449952 446217 443249 440298 437126
58371D37126k521j130o9N04J290K165K158J137N5m48n11k08N27J269J571J846
$$ 437126 434605 433475 433406 433910 435200 437365 439523 440660 440715 440267 439756 439548 440075 441344 442915 444761
58355D44761K686L753M424M999N905O423N754M711M670N333N390M895N061N966
$$ 444761 447447 451200 455624 460623 466528 472951 478705 483416 488086 493419 498809 503704 508765 514731
58341E14731O410N960N284M591L509K413K154K381J913O80k42m56m47k11O40J627
$$ 514731 521141 527101 532385 536976 540485 542898 545052 547433 549346 550026 549784 549328 548881 548670 549310 550937
58325E50937J882J581J291N39j153k461j861l69k24j235j197K55J139O82M61J393
$$ 550937 552819 554400 555691 556230 555077 552616 550755 550386 550162 548927 547730 547985 549124 549806 550267 551660
58309E51660K300K364K483L253L801L595L391L590L501K992K980L571L623K771
$$ 551660 553960 556324 558807 562060 565861 569456 572847 576437 579938 582930 585910 589481 593104 595875
58295E95875K037J891J585R45R13J706K315K304K358K584K284J710K011L027L251
$$ 595875 597912 599803 601388 602333 603246 604952 607267 609571 611929 614513 616797 618507 620518 623545 626796
58280F26796K446K074K706L242L314M088N935P536Q025Q026P966P481P001P645
$$ 626796 629242 631316 634022 637264 640578 644666 650601 658137 666162 674188 682154 689635 696636 704281
58266G04281R029R496R003R301J0703J1371J0577R925J0381J0729J0093R490R691
$$ 704281 713310 722806 731809 741110 751813 763184 773761 783686 794067 804796 814889 824379 834070
58253H34070R873R533R484R957R919R206R057R729R946R431R545J0677J1526J1661
$$ 834070 843943 853476 862960 872917 882836 892042 901099 910828 920774 930205 939750 950427 961953 973614
58239I73614J2198J3351J4101J4709J6525J8809J9163J7728J7319J8650J9307
$$ 973614 985812 999163 1013264 1027973 1044498 1063307 1082470 1100198 1117517 1136167 1155474
58228A155474J8504J8713K1032K3094K3462K4098K6309K8206K8478K8989L1198
$$ 1155474 1173978 1192691 1213723 1236817 1260279 1284377 1310686 1338892 1367370 1396359 1427557
58217A427557L3558L4881L6781M0291M3484M4920M6123M8235M9682M9564M9840
$$ 1427557 1461115 1495996 1532777 1573068 1616552 1661472 1707595 1755830 1805512 1855076 1904916
58206A904916N1772N3724N4864N7240O1798O6186O9023P2274P6881Q0424Q1945
$$ 1904916 1956688 2010412 2065276 2122516 2184314 2250500 2319523 2391797 2468678 2549102 2631047
58195B631047Q4504Q9778R4734R7061R9353J04253J10069J14997J20978J29329
$$ 2631047 2715551 2805329 2900063 2997124 3096477 3200730 3310799 3425796 3546774 3676103
58185C676103J37171J42447J47890J55830J63905J70275J77990J89375K01286
$$ 3676103 3813274 3955721 4103611 4259441 4423346 4593621 4771611 4960986 5162272
58176E162272K11073K22022K37444K54572K70104K86480L06700L28141L47905
$$ 5162272 5373345 5595367 5832811 6087383 6357487 6643967 6950667 7278808 7626713
58167G626713L68922L94217M20497M44267M68835M98296N30294N62094N97731
$$ 7626713 7995635 8389852 8810349 9254616 9723451 10221747 10752041 11314135 11911866
58158A1911866O41201O88760P36322P88090Q49127R16124R84858J059688J145967
$$ 11911866 12553067 13241827 13978149 14766239 15615366 16531490 17516348 18576036 19722003
58149A9722003J240942J343050J462176J609413J785476J990878K236166K527175
$$ 19722003 20962945 22305995 23768171 25377584 27163060 29153938 31390104 33917279
58141C3917279K851611L197417L573906L998991M481848N039242N708784O513043
$$ 33917279 36768890 39966307 43540213 47539204 52021052 57060294 62769078 69282121
58133F9282121P421812Q378933R355153J0362867J1476292J2879650J4762197
$$ 69282121 76703933 85082866 94438019 104800886 116277178 129156828 143919025
58126A43919025J6917792J8380079J7703326J3941565P495693k9396o824661j1789674
$$ 143919025 160836817 179216896 196920222 210861787 218357480 218328084 211503423 199713749
58118A99713749j4710250j5906707j5878722j5130057j4059788j2887023j1682821
$$ 199713749 185003499 169096792 153218070 138088013 124028225 111141202 99458381
58111I9458381j0474428r296432q170038p097916o095313n192053m395750l683112
$$ 99458381 88983953 79687521 71517483 64419567 58324254 53132201 48736451 45053339
58103D5053339l034980k452454j932875j461563j039410o85392l89487r7027K13216
$$ 45053339 42018359 39565905 37633030 36171467 35132057 34446665 34057178 33960151 34173367
58094C4173367M41239M06159O957o63814j377589j931650k251361k365949k332863
$$ 34173367 34614606 35020765 35027722 34363908 32986319 31054669 28803308 26437359 24104496
58085B4104496k200984k015304j817044j629328j454980j292157j143887j012040
$$ 24104496 21903512 19888208 18071164 16441836 14986856 13694699 12550812 11538772
58077A1538772q93210p85419o91789o13800n47320m88894m40038m01689l70003
$$ 11538772 10645562 9860143 9168354 8554554 8007234 7518340 7078302 6676613 6306610
58068F306610l41656l18197l01038k86658k70983k54583k39567k25067k09676
$$ 6306610 5964954 5646757 5345719 5059061 4788078 4533495 4293928 4068861 3859185
58059C859185j95026j83004j72367j61509j51663j44108j37222j29537j22686
$$ 3859185 3664159 3481155 3308788 3147279 2995616 2851508 2714286 2584749 2462063
58050B462063j18029j13413j06659r9287r3406q7812q0724p3632o8707o4881o0152
$$ 2462063 2344034 2230621 2123962 2024675 1931269 1843457 1762733 1689101 1620394 1555513 1495361
58039A495361n5381n2207m9497m5566m1703l9795l8483l5483l1864l0208l0089
$$ 1495361 1439980 1387773 1338276 1292710 1251007 1211212 1172729 1137246 1105382 1075174 1045085
58028A045085k9221k7642k7033k7002k5807k3845k2968k3062k2563k1608k1566
$$ 1045085 1015864 988222 961189 934187 908380 884535 861567 838505 815942 794334 772768
58017G72768k2041k1425j9767j8380j7210j5394j3626j3208j3414j2572j1065
$$ 772768 750727 729302 709535 691155 673945 658551 644925 631717 618303 605731 594666
58006E94666j0530j0719r883p949o571o415o658o922p395p538o838o287p002q069
$$ 594666 584136 573417 563534 555585 549014 542599 535941 529019 521624 514086 507248 500961 493959 485890
57992D85890p896o844o270n910m704l345l316m004l540k047j334j693j696r72
$$ 485890 477994 471150 464880 458970 454266 450921 447605 443601 440061 438014 436680 434987 433291 432319
57978D32319n74o54k67M52L73l09j87Q60J510J412J545J983J577J42j073j437
$$ 432319 431745 431091 430824 431276 431649 431340 431153 432013 433523 434935 436480 438463 440040 440182 439109 437672
57962D37672j651k122k408k444k696k986k807k636l309m256m199l425l412m326
$$ 437672 436021 433899 431491 429047 426351 423365 420558 417922 414613 410357 406158 402733 399321 394995
57948C94995m882m667m567m853m757m185l930m038l713k972k613k558k017j280
$$ 394995 390113 385446 380879 376026 371269 367084 363154 359116 355403 352431 349818 347260 345243 343963
57934C43963j412k119k034j198j153k286l238l334l484m083m106k971j523n08
$$ 343963 342551 340432 338398 337200 336047 333761 330523 327189 323705 319622 315516 312545 311022 310514
57920C10514K15M56m19j821k067r16j16o53j344j110q08j518k657l061k772k446
$$ 310514 310729 311185 310766 308945 306878 305962 305846 305193 303849 302739 301931 300413 297756 294695 291923 289477
57904B89477k066j402r21j191j991k740l161l115k619k288k786l582l444k379
$$ 289477 287411 286009 285088 283897 281906 279166 276005 272890 270271 267983 265197 261615 258171 255792
57890B55792j734j963j893p90L94P43Q37J492K217K078J182K57l57n24J5Q32O39
$$ 255792 254058 252095 250202 249412 249806 250549 251386 252878 255095 257173 258355 258612 258255 257731 257746 258578 259217
57873B59217j096l050l536k557j562j651k705l890m377l896k918k077j375n82
$$ 259217 258121 255071 251535 248978 247416 245765 243060 239170 234793 230897 227979 225902 224527 223945
57859B23945j78q66k054k086l80J823L207L784M083M128L929L925M241M357M092
$$ 223945 223767 222901 220847 218761 218381 220204 223411 227195 231278 235406 239335 243260 247501 251858 255950
57844B55950L945M010L609K579J822J844J852J031k41j275k097k825l006k536
$$ 255950 259895 263905 267514 270093 271915 273759 275611 276642 276401 275126 273029 270204 267198 264662
57830B64662k296k925l750l891l593l601l924m167m296m236l404j696j72J72k78
$$ 264662 262366 259441 255691 251800 248207 244606 240682 236515 232219 227983 224579 222883 222711 222883 222605
57815B22605n30l93j80K66J131J840J805J554J992K970L549L401K998K668K403
$$ 222605 222075 221682 221502 221768 222899 224739 226544 228098 230090 233060 236609 240010 243008 245676 248079
57800B48079K321K490K450J734O38j90o75j142j555j706j863k446l286l851m045
$$ 248079 250400 252890 255340 257074 257712 257522 256847 255705 254150 252444 250581 248135 244849 240998 236953
57785B36953m182m389m547m540m180l317k459k580l780m792m598l764l369l308
$$ 236953 232771 228382 223835 219295 215115 211798 209339 206759 202979 198187 193589 189825 186456 183148
57771A83148k787j922j561j860k231k517l033l591l645l403l649m334m473l710
$$ 183148 180361 178439 176878 175018 172787 170270 167237 163646 160001 156598 152949 148615 144142 140432
57757A40432k920k848l052k791k278k347l130l714l124j463J20O19K94L25J332
$$ 140432 137512 134664 131612 128821 126543 124196 121066 117352 114228 112765 112885 113504 113798 114123 115455
57742A15455K675L346L078K243J309R03J696L470M766M378K894J879J817J794
$$ 115455 118130 121476 124554 126797 128106 129009 130705 134175 138941 143319 146213 148092 149909 151703
57728A51703J168M28K16L80M28L35L84N77N93J84n16j094j320j467j980k671k736
$$ 151703 152871 153299 153515 153895 154323 154658 155042 155619 156212 156396 155880 154786 153466 151999 150019 147348 144612
57711A44612j895j043j197k105k542j853o07K57M18K08K7p9l25p03p15Q8J342
$$ 144612 142717 141674 140477 138372 135830 133977 133370 133627 134045 134253 134280 134201 133876 133173 132458 132546 133888
57694A33888K165K262K117K036J791J478J759K692L265K874K420L000M166M632
$$ 133888 136053 138315 140432 142468 144259 145737 147496 150188 153453 156327 158747 161747 165913 170545
57680A70545M134L551L515L955M712N596O021N607M915M765N024N037M881N208
$$ 170545 174679 178230 181745 185700 190412 196008 202029 207636 212551 217316 222340 227377 232258 237466
57666B37466O023O703P069P425P704P635P651Q445R705J0407J0425J0642J1447
$$ 237466 243489 250192 257261 264686 272390 280025 287676 296121 305826 316233 326658 337300 348747
57653C48747J2340J3184J4524J6270J7390J7438J7396J8317K0028K1727K3117
$$ 348747 361087 374271 388795 405065 422455 439893 457289 475606 495634 517361 540478
57642E40478K4362K5615K7116K9203L1830L4550L7243M0190M3344M6252M9020
$$ 540478 564840 590455 617571 646774 678604 713154 750397 790587 833931 880183 929203
57631I29203N2543N7365O3001O8747P4588Q0902Q7857R5294J02768J09537J15163
$$ 929203 981746 1039111 1102112 1170859 1245447 1326349 1414206 1509500 1612268 1721805 1836968
57620A836968J20080J24764J28298J28708J24868J17160J06106R1696P4440N5976
$$ 1836968 1957048 2081812 2210110 2338818 2463686 2580846 2686952 2778648 2853088 2909064
57610B909064L8019K1575P370m506j6155l1449n2507p7105j00512j19113j31497
$$ 2909064 2947083 2968658 2976028 2971522 2955367 2923918 2871411 2794306 2693794 2574681 2443184
57599B443184j37339j37129j32591j25784j17553j07774r6909q6230p6546o7632
$$ 2443184 2305845 2168716 2036125 1910341 1792788 1685014 1588105 1501875 1425329 1357697
57589A357697n9047n0758m2944l5813k9679k4628k0142j5547j0796o310k159K062
$$ 1357697 1298650 1247892 1204948 1169135 1139456 1114828 1094686 1079139 1068343 1062033 1059874 1061936
57577A061936O588J1162J5319J8846K2060K5808L0773L6552M1936M6452N0988
$$ 1061936 1068524 1079686 1095005 1113851 1135911 1161719 1192492 1229044 1270980 1317432 1368420
57566A368420N6384O2151O7323P2021P7143Q2819Q8079R1870R3555R2532Q8239
$$ 1368420 1424804 1486955 1554278 1626299 1703442 1786261 1874340 1966210 2059765 2152297 2240536
57555B240536Q0634P0011N6320L9245J9031l152k5569m6333o3893p7789q8731
$$ 2240536 2321170 2391181 2447501 2486746 2505777 2502625 2477056 2430723 2366830 2289041 2200310
57544B200310r7386j03381j06082j05920j04093j01196r7047r1790q6153q0559
$$ 2200310 2102924 1999543 1893461 1787541 1683448 1582252 1485205 1393415 1307262 1226703
57534A226703p4816o8870o3132n7934n3241m9005m5171m1351l7184l3135l0185
$$ 1226703 1151887 1083017 1019885 961951 908710 859705 814534 773183 735999 702864 672679
57523F72679k8533k7215k5280k2836k0650j9147j8020j6611j4577j2417j1098
$$ 672679 644146 616931 591651 568815 548165 529018 510998 494387 479810 467393 456295
57512D56295j0800j0418q921o846n573n253m618k960j162l29k75k2Q46J956K873
$$ 456295 445495 435077 426156 419310 413737 408484 403866 400906 399744 399415 399140 399118 399964 401920 404793
57497D04793L525M149N097O455P734Q376Q588R143J0224J1186J1725J2457J3891
$$ 404793 408318 412467 417564 424019 431753 440129 448717 457860 468084 479270 490995 503452 517343
57484E17343J5555J6820J7988J9798K2241K4731K7166L0022L3394L6657L9383
$$ 517343 532898 549718 567706 587504 609745 634476 661642 691664 725058 761715 801098
57473H01098M1982M5182M9159N3443N7462O0947O3889O6365O8424O9939P0365
$$ 801098 843080 888262 937421 990864 1048326 1109273 1173162 1239527 1307951 1377890 1448255
57462A448255O8792O4557N7811M9152L8671K5866J0822n065k0124l3764m6088
$$ 1448255 1517047 1581604 1639415 1688567 1727238 1753104 1763926 1758861 1738737 1704973 1658885
57451A658885n6581o4182o8669p0992p1906p1128o8348o4286o0155n6492n3023
$$ 1658885 1602304 1538122 1469453 1398461 1326555 1255427 1187079 1122793 1062638 1006146 953123
57440I53123m9325m5156m0464l5532l0893k6827k3198k0051j7805j6386j4680
$$ 953123 903798 858642 818178 782646 751753 724926 701728 681677 663872 647486 632806
57429F32806j1587p439l692j229L99K055M015O078Q241J0709J3532J6502J9522
$$ 632806 621219 613780 610088 608859 609258 611313 615328 621406 629647 640356 653888 670390 689912
57416F89912K2743K6317L0071L3652L6909M0031M3251M6673N0386N4514N8886
$$ 689912 712655 738972 769043 802695 839604 879635 922886 969559 1019945 1074459 1133345
57405A133345O2857O5673O6868O6164O3275N8138N1011M1909L0200J5468j371
$$ 1133345 1196202 1261875 1328743 1394907 1458182 1516320 1567331 1609240 1639440 1654908 1653537
57394A653537j8417l4248m8427o0687p0445p7388q1757q3801q3536q1397p8416
$$ 1653537 1635120 1600872 1552445 1491758 1421313 1343925 1262168 1178367 1094831 1013434 935018
57383I35018p5350p2042o8073o3516n8754n4046m9631m5812m2453l8934l5047
$$ 935018 859668 787626 719553 656037 597283 543237 493606 447794 405341 366407 331360
57372C31360l1422k8607k6252k3844k1723k0535j9982j8987j7132j5208j4232
$$ 331360 299938 271331 245079 221235 199512 178977 158995 140008 122876 107668 93436
57361I3436j4304j4577j3989j2147r845q563r025F79a0097r787q021o444n419
$$ 93436 79132 64555 50566 38419 28574 20011 10986 679 -10097 -19884 -27905 -34349 -39768
57348c9768m919m902n211n497n523n367n214n110n037n020n028m938m675m268
$$ -39768 -44687 -49589 -54800 -60297 -65820 -71187 -76401 -81511 -86548 -91568 -96596 -101534 -106209 -110477
57334a10477l717k972k117j506j505k069k643k684k269k045k413k976l057k559
$$ -110477 -114194 -117166 -119283 -120789 -122294 -124363 -127006 -129690 -131959 -134004 -136417 -139393 -142450 -145009
57320a45009k001j834k094k633l247l611l546l353l415l518l157k543k521l350
$$ -145009 -147010 -148844 -150938 -153571 -156818 -160429 -163975 -167328 -170743 -174261 -177418 -179961 -182482 -185832
57306a85832m253m571m556m661m669m217l568l224l088k739k246k079k301k423
$$ -185832 -190085 -194656 -199212 -203873 -208542 -212759 -216327 -219551 -222639 -225378 -227624 -229703 -232004 -234427
57292b34427j990j016M0M84j02j270j960j680j048q45j014j087j054j178j356
$$ -234427 -236417 -237433 -237393 -236909 -237011 -238281 -240241 -241921 -242969 -243814 -244828 -245915 -246969 -248147 -249503
57277b49503j332j248j336j336r20m31m80j000j369j371j325j275q57pP45R40
$$ -249503 -250835 -252083 -253419 -254755 -255675 -256106 -256586 -257586 -258955 -260326 -261651 -262926 -263783 -263790 -263045 -262105
57261b62105O40J76k08l75k99j26l9k9M5L14R76K134L358L843L440L051L488M347
$$ -262105 -261465 -261289 -261497 -261872 -262171 -262297 -262336 -262365 -262320 -262006 -261030 -258896 -255538 -251695 -248255 -245204 -241716 -237369
57243b37369M641M217L816M014M792N982P354Q381Q647Q537Q904J0015J1358J2424
$$ -237369 -232728 -228511 -224695 -220681 -215889 -209907 -202553 -194172 -185525 -176988 -168084 -158069 -146711 -134287
57229a34287J3208J3934J4790J5904J7074J7664J7187h528F434J4517J4332J3695
$$ -134287 -121079 -107145 -92355 -76451 -59377 -41713 -24526 -8528 6434 20951 35283 48978
57217D8978J1850Q419M015J9k816n216q275j1982j5517A1008i832k2383k2802
$$ 48978 60828 69247 73262 73281 70465 65249 56974 44992 29475 11008 -9832 -32215 -55017
57204e5017k2564k2309k1856k0760j9519j8992j8841j7878j5991j4301j3275j2102
$$ -55017 -77581 -99890 -121746 -142506 -162025 -181017 -199858 -217736 -233727 -248028 -261303 -273405
57192b73405j0367r014q887r409r495q971q305p584o538n206l987l216k962l011
$$ -273405 -283772 -292786 -301673 -311082 -320577 -329548 -337853 -345437 -351975 -357181 -361168 -364384 -367346 -370357
57178c70357k875k228j364q61p19l63N25J692K845L910M739N216N572O158O859
$$ -370357 -373232 -375460 -376824 -377685 -378404 -378767 -378242 -376550 -373705 -369795 -365056 -359840 -354268 -348110 -341251
57163c41251P472Q304R748J1451J2744J3744J5015J6354J7037J7194J7752J8896
$$ -341251 -333779 -325475 -315727 -304276 -291532 -277788 -262773 -246419 -229382 -212188 -194436 -175540
57151a75540J9818K0141K0455K1178K1987K2668K3429a791B2170K3097K2277K1902
$$ -175540 -155722 -135581 -115126 -93948 -71961 -49293 -25864 -1791 22170 45267 67544 89446
57139H9446K1619K1410K1790K2632K2964K2366K1458K0722J9945J9236J9216J9792
$$ 89446 111065 132475 154265 176897 199861 222227 243685 264407 284352 303588 322804 342596
57127C42596J9957J9304J8602J8377J8199J7821J7650J7525J6466J4391J2658
$$ 342596 362553 381857 400459 418836 437035 454856 472506 490031 506497 520888 533546
57116E33546J2155J2084J1422J0296R169P963O855O541O881O597N286M264M449
$$ 533546 545701 557785 569207 579503 588672 596635 603490 610031 616912 623509 628795 633059 637508
57103F37508M780L859J807o50l556o927r898j2007j4254j7621k1729k6015l0959
$$ 637508 642288 646147 647954 647304 643748 636821 626923 614916 600662 583041 561312 535297 504338
57090E04338l6882m2834m8000n3004n8475o3793o8715E7852b5507r3521j03537
$$ 504338 467456 424622 376622 323618 265143 201350 132635 57852 -25507 -119028 -222565
57079b22565j13429j24252j36035j48244j61305j75868j91420k07165k23360k40318
$$ -222565 -335994 -460246 -596281 -744525 -905830 -1081698 -1273118 -1480283 -1703643 -1943961
57069a943961k57297k73983k91853l12483l35764l61408l90594m24279m61368
$$ -1943961 -2201258 -2475241 -2767094 -3079577 -3415341 -3776749 -4167343 -4591622 -5052990
57060e052990n00708n43533n91822o45699p04600p69639q42500r23500j013035
$$ -5052990 -5553698 -6097231 -6689053 -7334752 -8039352 -8808991 -9651491 -10574991 -11588026
57051a1588026j113480j227343j355154j497405j656795j836407k038194k265987
$$ -11588026 -12701506 -13928849 -15284003 -16781408 -18438203 -20274610 -22312804 -24578791
57043b4578791k527590k831080l182060l588153m063184m623036n279938o043433
$$ -24578791 -27106381 -29937461 -33119521 -36707674 -40770858 -45393894 -50673832 -56717265
57035e6717265o921426p914389r011581j0195719j1443599j2717413j3966952
$$ -56717265 -63638691 -71553080 -80564661 -90760380 -102203979 -114921392 -128888344
57028a28888344j5147532j6215183j7085444j7630063j7779914j7642715j7442523
$$ -128888344 -144035876 -160251059 -177336503 -194966566 -212746480 -230389195 -247831718
57021b47831718j7254278j6784836j5470237j2848624q889105m023341J083964
$$ -247831718 -265085996 -281870832 -297341069 -310189693 -319078798 -323102139 -322018175
57014c22018175N816212R783756J2870498J5174459J6883357J8149200J9027392
$$ -322018175 -316201963 -306418207 -293547709 -278373250 -261489893 -243340693 -224313301
57007b24313301J9497300J9524436J9112010J8315612J7225068J5934854J4525651
$$ -224313301 -204816001 -185291565 -166179555 -147863943 -130638875 -114704021 -100178370
57000a00178370J3063710J1606426J0202162Q886731P683909O608311N665412
$$ -100178370 -87114660 -75508234 -65306072 -56419341 -48735432 -42127121 -36461709
56993c6461709M850644M152602L558231L054740K629122K269229J965476J709942
$$ -36461709 -31611065 -27458463 -23900232 -20845492 -18216370 -15947141 -13981665 -12271723
56985a2271723J494430J310969J153639J018393R01605Q00078P11795O35283N68631
$$ -12271723 -10777293 -9466324 -8312685 -7294292 -6392687 -5592609 -4880814 -4245531 -3676900
56976c676900N09953M58249M12940L73168L38225L07779K81034K56619K33989
$$ -3676900 -3166947 -2708698 -2295758 -1922590 -1584365 -1276586 -995552 -738933 -504944
56967e04944K13869i4514H6456J66107J52207J39527J27158J14261J01359Q9221
$$ -504944 -291075 -94514 86456 252563 404770 544297 671455 785716 887075 976296
56957I76296P7469O5411N3414M2240L1759K1239J0108k463j7538l4506m9781n8796
$$ 976296 1053765 1119176 1172590 1214830 1246589 1267828 1277936 1275473 1257935 1223429 1173648 1114852
56945A114852n9432n3145m3208l2066j9607m075J3735K6929K5751O448k4036n3479
$$ 1114852 1055420 1002275 959067 927001 907394 903319 917054 943983 969734 976182 952146 898667
56933H98667p3526q2816q3856p9982p4520o9658o5214n9857n3544m7436m1926
$$ 898667 825141 742325 658469 578487 503967 434309 369095 309238 255694 208258 166332
56922A66332l6483l1363k7614k5227B2649B160a6424j7586j6230j3412r677o230
$$ 166332 129849 98486 70872 45645 22649 2160 -16424 -34010 -50240 -63652 -73329 -79559
56910g9559l317l31L055O475R327J1269J2457J3417a2710B830J6341J7083J7960
$$ -79559 -82876 -83207 -80152 -73677 -64350 -53081 -40624 -27207 -12710 2830 19171 36254 54214
56897E4214J8581J8397J7370J5620J2821Q691L938j76l050m903o036o676p283
$$ 54214 72795 91192 108562 124182 137003 145694 149632 149456 146406 141503 135467 128791 121508
56884A21508q058q376p605o321n637n508m718k655k7K321M308O187Q031R921J1850
$$ 121508 113450 105074 97469 91148 85511 80003 75285 72630 72603 74924 79232 85419 93450 103371 115221
56869A15221J3254J3232J1303P444J799m796j0301j2885j2951j2617j3064j3567
$$ 115221 128475 141707 153010 160454 162253 157457 147156 134271 121320 108703 95639 82072
56857H2072j3245j2309j1132r515p584o181n542m727l144j588q33k76Q86K121
$$ 82072 68827 56518 45386 35871 28287 22106 16564 11837 8693 7105 6272 5996 6882 9003
56843I003K462K283K774M041N076N399N535N887O268O696P667R383J1373J3218
$$ 9003 11465 13748 16522 20563 25639 31038 36573 42460 48728 55424 63091 72474 83847 97065
56829I7065J4974J6811J8710K0661K2653K4418K5495K5504K4095K0868J6048J0987
$$ 97065 112039 128850 147560 168221 190874 215292 240787 266291 290386 311254 327302 338289
56817C38289P273N243L922K407O95q44k001k569k265j156L18J870L548N278O808
$$ 338289 345562 350805 354727 357134 357829 356985 354984 352415 350150 348994 349312 351182 354730 360008 366816
56802C66816Q323J0522J3759J7414K0259K1025J8595J2544M076m159r850j2583
$$ 366816 375139 385661 399420 416834 437093 458118 476713 489257 493333 489174 479324 466741
56790D66741j3375j3256j2714j1972j0946r108o190k886j58K098M888Q561J2271
$$ 466741 453366 440110 427396 415424 404478 395370 389180 386294 386136 388234 393122 401683 413954
56777D13954J5354J8387K2264K6742L0544L2476L1689K7306J8956P937k986j1571
$$ 413954 429308 447695 469959 496701 527245 559721 591410 618716 637672 645609 642623 631052
56765F31052j7445k1321k3543k4043k3179k1768k0218j8300j5863j3203j0549
$$ 631052 613607 592286 568743 544700 521521 499753 479535 461235 445372 432169 421620
56754D21620p655m188j98L975P987J1488J4168J6051J7351J7762J6262J2114N905
$$ 421620 413965 409777 409579 413554 421541 433029 447197 463248 480599 498361 514623 526737 532642
56741E32642q46o979j2207j6524j9658k1300k1464k0399j8387j5761j2884r994
$$ 532642 531796 524817 512610 496086 476428 455128 433664 413265 394878 379117 366233 356239
56729C56239p148m419j978L2J638L015M442O139Q041R728J0698J0556Q903N436
$$ 356239 349091 344672 342694 342726 344364 347379 351821 357960 366001 375729 386427 396983 405886 411322
56715D11322N07m677q969j2193j4693j6261j6365j5353j4388j3892j2989j1038
$$ 411322 411829 407152 398183 385990 371297 355036 338671 323318 308930 295038 282049 271011
56703B71011q805p359o520n459m346m091m603m578l332j804j185j436j763j910
$$ 271011 262206 254847 248327 242868 238522 234431 229828 225250 221918 220114 218929 217493 215730 213820
56689B13820k105k184j662o42J08J29k44m88n55o63q53j038j190j240j022n99
$$ 213820 211715 209531 207869 207227 207335 207464 207220 206732 206177 205514 204661 203623 202433 201193 200171 199572
56673A99572l91o68j069j063p45o99j053j236q98n00o13j071j340j390j534j627
$$ 199572 199181 198513 197444 196381 195636 194937 193884 192648 191750 191250 190637 189566 188226 186836 185302 183675
56657A83675j188m00j74r37j985k445k388k389k467k105j219m18k76o98j157j205
$$ 183675 182487 182087 181913 180976 178991 176546 174158 171769 169302 167197 165978 165560 165284 164586 163429 162224
56641A62224p23M3O47Q26P52P32P62O32L93L25M60N15M68Q24J954L366L982L297
$$ 162224 161501 161544 162191 163017 163769 164501 165263 165895 166288 166613 167073 167588 168056 168880 170834 174200 178182 181479
56623A81479J978J171J256J559J319O63L34O68J282J701J837J751J394Q28K91
$$ 181479 183457 184628 185884 187443 188762 189425 189759 190427 191709 193410 195247 196998 198392 199220 199511
56608A99511j47o38j032q57j36L27O1k23M07J623K197J672Q05K72j47p94j339
$$ 199511 199364 198726 197694 196837 196701 197028 197089 196866 197273 198896 201093 202765 203570 203842 203695 202901 201562
56591B01562j333j028j113j790k519k644k067j342j241k055l315m223m395m039
$$ 201562 200229 199201 198088 196298 193779 191135 189068 187726 186485 184430 181115 176892 172497 168458
56577A68458l552l103k621j988j287q61r36j085m98Q88K002J925J141Q22J172
$$ 168458 164906 161803 159182 157194 155907 155046 154110 153025 152527 153415 155417 157342 158483 159305 160477
56562A60477J410J197J099J404J519R33Q6k35J34Q17J486J934J919J418Q08M66
$$ 160477 161887 163084 164183 165587 167106 168039 168125 167890 168024 168841 170327 172261 174180 175598 176406 176872
56546A76872L67K11j41n31o04j13O67R83M88j20O8Q60J240R00N88P56Q79N38L05
$$ 176872 177239 177450 177309 176778 176174 176061 176728 177711 178199 178079 178147 179007 180247 181147 181735 182491 183370 183908 184213
56527A84213Q73J917K519K341J804J454J540J892J903J065j78o43K02J516K207
$$ 184213 185086 187003 189522 191863 193667 195121 196661 198553 200456 201521 201343 200700 200902 202418 204625
56512B04625K165J929J722J448J221J258J491J789K317L202M174M896N338N446
$$ 204625 206790 208719 210441 211889 213110 214368 215859 217648 219965 223167 227341 232237 237575 243021
56498B43021M892L670K510K228K867L831M506M474L635K474J771J669J551J084
$$ 243021 247913 251583 254093 256321 259188 263019 267525 271999 275634 278108 279879 281548 283099 284183
56484B84183O76N43K03n50j050r57j130k338l853m421m047l699l712l666l492
$$ 284183 284859 285402 285605 285055 284005 283048 281918 279580 275727 271306 267259 263560 259848 256182 252690
56469B52690l473l383k798k073j898k028j673r78r42j757k481k506k262k210k196
$$ 252690 249217 245834 243036 240963 239065 237037 235364 234386 233444 231687 229206 226700 224438 222228 220032
56454B20032k109k205k438k293j628r12m11J14O36O79J80k38k07o6j76m25o71
$$ 220032 217923 215718 213280 210987 209359 208447 208036 208150 208786 209465 209645 209407 209200 209134 208958 208533 207862
56437B07862r24q30Q8J427J962J189K9m53k95r6k3L2m8k68j99L96J033J147Q55
$$ 207862 206938 206108 206196 207623 209585 210774 210803 210350 210055 209959 209936 209968 209920 209652 209453 209849 210882 212029 212884
56418B12884N79L48M7l3M64J281J836J982K005K014J880J665J643J811J884J838
$$ 212884 213463 213811 213858 213825 214289 215570 217406 219388 221393 223407 225287 226952 228595 230406 232290 234128
56402B34128K038K724L563L979L834L533L454L441L089K367J645J122P02M64O83
$$ 234128 236166 238890 242453 246432 250266 253799 257253 260694 263783 266150 267795 268917 269619 270083 270766
56387B70766J152J093L02l39j50Q5p94k350k920j971q98j113k339l340l493k969
$$ 270766 271918 273011 273313 272974 272824 272909 272115 269765 266845 264874 263976 262863 260524 257184 253691 250722
56371B50722k055r89k30j88p33j344j578j326p55k31q8l50p86j207j458j246m83
$$ 250722 248667 247678 247448 247260 246527 245183 243605 242279 241524 241293 241205 240855 240069 238862 237404 236158 235675
56354B35675K95L11m74j258j410j110q12n69j71L38O42N69K99J81L78O65O85M48
$$ 235675 235970 236281 235807 234549 233139 232029 231217 230648 230477 230815 231457 232026 232325 232506 232884 233549 234234 234682
56336B34682L22M38N28N41Q77J602K032J626Q61N01M66K42k8J72O80Q57O78O10
$$ 234682 235004 235442 235970 236511 237388 238990 241022 242648 243509 244010 244476 244718 244690 244862 245542 246399 247077 247687
56318B47687O15K91q6K25J123J654J479J240J332J328R49O36P48R94J044R88R25
$$ 247687 248302 248593 248507 248732 249855 251509 252988 254228 255560 256888 257837 258473 259221 260215 261259 262247 263172
56301B63172Q00P25Q29Q12M00J05N64J249J091K88J51R66J591J445J370J896K180
$$ 263172 263972 264697 265526 266338 266738 266843 267407 268656 269747 270035 270186 271152 272743 274188 275558 277454 279634
56284B79634J523O52M80P24P50P69J213J826K343L214M607N526N007L624K774
$$ 279634 281157 281809 282289 283013 283763 284532 285745 287571 289914 293128 297735 303261 308268 311892 314666
56269C14666K990L801M753N556N765N272M807N105N876O285O168O049O256O629
$$ 314666 317656 321457 326210 331766 337531 342803 347610 352715 358591 364876 371044 377093 383349 389978
56255C89978O897O828O283N515N032M927M774M407M142L968L364K311J624J793
$$ 389978 396875 403703 409986 415501 420533 425460 430234 434641 438783 442751 446115 448426 450050 451843
56241D51843K324K777L444M362M723M132L556L983M943N417N513O078P191Q183
$$ 451843 454167 456944 460388 464750 469473 473605 477161 481144 486087 491504 497017 503095 510286 518469
56227E18469Q885R758J0980J2244J3374J4445J5471J6450J7474J8421J9079J9920
$$ 518469 527354 537112 548092 560336 573710 588155 603626 620076 637550 655971 675050 694970
56215F94970K1987K5383K8715L0883L2580L5087L8372M1539M4609M8485N3390
$$ 694970 716957 742340 771055 801938 834518 869605 907977 949516 994125 1042610 1096000
56204A096000N8515O3345O8315P3985Q0225Q6400R2050R7346J02970J09240J15285
$$ 1096000 1154515 1217860 1286175 1360160 1440385 1526785 1618835 1716181 1819151 1928391 2043676
56193B043676J19738J22365J24118J25178J24035J19298J11482J01997R1118P8094
$$ 2043676 2163414 2285779 2409897 2535075 2659110 2778408 2889890 2991887 3083005 3161099
56183C161099O2741M5850K8332J0883n720k0888l4536m6567n6392o3667o9060
$$ 3161099 3223840 3269690 3298022 3308905 3303185 3282297 3247761 3201194 3144802 3081135 3012075
56172C012075p3516p7095p9201p9716p9253p8664p8644p9504q0836q1864q2405
$$ 3012075 2938559 2861464 2782263 2702547 2623294 2544630 2465986 2386482 2305646 2223782 2141377
56161B141377q2907q3304q2729q0858p8567p6681p4959p2908p0601o8060o4825
$$ 2141377 2058470 1975166 1892437 1811579 1733012 1656331 1581372 1508464 1437863 1369803 1304978
56150A304978o0926n7286n4325n1214m7275m3106l9433l5949l2320k9150k6869
$$ 1304978 1244052 1186766 1132441 1081227 1033952 990846 951413 915464 883144 853994 827125
56139H27125k4773k2312k0224j9131j8157j6288j4063j2443j1131r454p909p162
$$ 827125 802352 780040 759816 740685 722528 706240 692177 679734 668603 659149 651240 644078
56127F44078o562n324m268m419m762l509j053N25N79N08J251K156K623L095M036
$$ 644078 637516 632192 627924 623505 618743 615234 614181 614706 615285 615793 617044 619200 621823 624918 628954
56112F28954N145O004O566O905P221P922R014R771R807R770J0176J0318R407P915
$$ 628954 634099 640103 646669 653574 660795 668717 677731 687502 697309 707079 717255 727573 736980 744895
56098G44895O690N640M571M303N486P184Q206Q914J0161J1463J2061J2874J5345
$$ 744895 751585 757225 761796 766099 771585 778769 786975 795889 806050 817513 829574 842448 857793
56085H57793J8995K2106K4398K7028L0395L3867L7405M1650M6638N2038N8201
$$ 857793 876788 898894 923292 950320 980715 1014582 1051987 1093637 1140275 1192313 1250514
56074A250514O5232P1581P5304P6191P4987P1397O4962N7216N0620M5724M1451
$$ 1250514 1315746 1387327 1462631 1538822 1613809 1685206 1750168 1807384 1858004 1903728 1945179
56063A945179L7574L4468L0772K4019J3795K279q459j7680k4812k9424l2626l6469
$$ 1945179 1982753 2017221 2047993 2072012 2085807 2088086 2079627 2061947 2037135 2007711 1975085 1938616
56051A938616m1720m7731n4166o0891o6482o9043o8487o6240o2961n8455n3300
$$ 1938616 1896896 1849165 1794999 1734108 1667626 1598583 1530096 1463856 1400895 1342440 1289140
56040A289140m8313m2877l6063k9034k3915k0716j7837j5182j4015j3927j2912
$$ 1289140 1240827 1197950 1161887 1132853 1108938 1088222 1070385 1055203 1041188 1027261 1014349
56029A014349j0644q967q891r497r938j0059r051o116k559o80m95r6R08J124N11
$$ 1014349 1003705 994738 985847 976350 966412 956353 947302 941186 938627 937947 937452 937356 938264 939388 939899
56014I39899P46K099K875K453K192K865L745M601O106P978R146R830J1054J2261
$$ 939899 940645 942744 945619 948072 950264 953129 956874 961475 967581 975559 984705 994535 1005589 1017850
56000A017850J2156J1529J2299J4072J4825J4679J5561J7331J7949J7419J7767
$$ 1017850 1030006 1041535 1053834 1067906 1082731 1097410 1112971 1130302 1148251 1165670 1183437
55989A183437J9060J9386J8951K0072K2699K4206K4215K5236K7762K9221K8905
$$ 1183437 1202497 1221883 1240834 1260906 1283605 1307811 1332026 1357262 1385024 1414245 1443150
55978A443150K9604L2793L6384L8725M0884M3445M5012M5423M6733M9512N1815
$$ 1443150 1472754 1505547 1541931 1580656 1621540 1664985 1709997 1755420 1802153 1851665 1903480
55967A903480N3077N5243N8800O1720O3514O6372P0923P4980P7652Q0639Q4333
$$ 1903480 1956557 2011800 2070600 2132320 2195834 2262206 2333129 2408109 2485761 2566400 2650733
55956B650733Q6975Q8722R2038R6998J00877J03467J07704J13984J19276J23177
$$ 2650733 2737708 2826430 2918468 3015466 3116343 3219810 3327514 3441498 3560774 3683951
55946C683951J29081J37705J45386J50753J57143J66235J75220J82733J91624
$$ 3683951 3813032 3950737 4096123 4246876 4404019 4570254 4745474 4928207 5119831
55937E119831K03381K15630K27616K42082K59376K75969K91218L09072L30737
$$ 5119831 5323212 5538842 5766458 6008540 6267916 6543885 6835103 7144175 7474912
55928G474912L52455L72931L95639M21346M46221M70055M98113N31821N66347
$$ 7474912 7827367 8200298 8595937 9017283 9463504 9933559 10431672 10963493 11529840
55919A1529840O00578O40333O88169P39659P93443Q54817R25308R99530J076748
$$ 11529840 12130418 12770751 13458920 14198579 14992022 15846839 16772147 17771677 18848425
55910A8848425J164264J265213J375701J498921J648456J832409K048853K301587
$$ 18848425 20012689 21277902 22653603 24152524 25800980 27633389 29682242 31983829
55902C1983829K602433K950853L330911L737730M187938M697135N272727N939808
$$ 31983829 34586262 37537115 40868026 44605756 48793694 53490829 58763556 64703364
55894F4703364O744346P714235Q846030J0143599J1630851J3309601J5151092
$$ 64703364 71447710 79161945 88007975 98151574 109782425 123092026 138243118
55887A38243118J7118316J9037142K0302336J9829106J6624001J0635343L030742
$$ 138243118 155361434 174398576 194700912 214530018 231154019 241789362 244820104
55880B44820104m454344j0486526j4582956j6893009j7796974j7696351j6952328
$$ 244820104 240365760 229879234 215296278 198403269 180606295 162909944 145957616
55873A45957616j5835792j4509766j3081480j1649520j0288073r024473p863825
$$ 145957616 130121824 115612058 102530578 90881058 80592985 71568512 63704687
55866F3704687o819158n901829n104726m415172l830124l344452k938668k592181
$$ 63704687 56885529 50983700 45878974 41463802 37633678 34289226 31350558 28758377
55858B8758377k297205k049141j835566j645677j479760j339315j217266j106542
$$ 28758377 26461172 24412031 22576465 20930788 19451028 18111713 16894447 15787905
55850A5787905j008770r26067q52922p84053p22080o69999o23632n78476n36648
$$ 15787905 14779135 13853068 13000146 12216093 11494013 10824014 10200382 9621906 9085258
55841I085258n00539m66696m32248m00682l75081l52065l28137l05775k87671
$$ 9085258 8584719 8118023 7685775 7285093 6910012 6557947 6229810 5924035 5636364
55832E636364k71054k53312k37212k25120k13715k00007j87041j78204j71047
$$ 5636364 5365310 5111998 4874786 4649666 4435951 4235944 4048903 3870699 3699652
55823C699652j62166j53304j47115j41513j33785j26099j21626j18870j14894
$$ 3699652 3537486 3384182 3237067 3095554 2961769 2835670 2714044 2595174 2480280
55814B480280j10574j07806j04855r9202r1937q5063p7562o8387o0174n5602n2874
$$ 2480280 2369706 2261900 2157045 2057843 1965906 1880843 1803281 1734894 1674720 1619118 1566244
55803A566244m8920m4400m1416l8975l4935l0236k7216k5632k3941k2646k3030
$$ 1566244 1517324 1472924 1431508 1392533 1357598 1327362 1300146 1274514 1250573 1227927 1204897
55792A204897k4260k4777k4866k5207k4910k3456k2376k2500k1932j9265j6273
$$ 1204897 1180637 1155860 1130994 1105787 1080877 1057421 1035045 1012545 990613 971348 955075
55781I55075j4856j3895j1955j0414j0868j1905j1564j0775j1231j2091j1848
$$ 955075 940219 926324 914369 903955 893087 881182 869618 858843 847612 835521 823673
55770H23673j1467j2446j3709j3567j2986j3783j5220j5512j5233j6102j7638
$$ 823673 812206 799760 786051 772484 759498 745715 730495 714983 699750 683648 666010
55759F66010j8002j7154j6375j5615j3965j1970j1014j1047j0933j0310r416p995
$$ 666010 648008 630854 614479 598864 584899 572929 561915 550868 539935 529625 520209 512214
55747E12214o088m629l834k365L31K530K730J882J410R21k39j090q48p67k036
$$ 512214 506126 501497 497663 495298 495629 498159 500889 502771 504181 505102 504863 503773 502925 502158 500122
55732E00122l512l745l504m083m848m823m914o103p093o359m998m920n571n131
$$ 500122 496610 492865 489361 485278 480430 475607 470693 464590 457497 451138 446140 441220 435649 430518
55718D30518l729k843k583k221k440m407p363r392r981r819r045p728o958p322
$$ 430518 426789 423946 421363 419142 416702 412295 404932 395540 385559 375740 366695 358967 352009 344687
55704C44687p366n765l834l624m772n534n815o575p375p181o647p015p553o833
$$ 344687 337321 331556 327722 324098 319326 313792 307977 301402 294027 286846 280199 273184 265631 258798
55690B58798n673n996p403p878p419p869r275r497p766n854n044m434l041j504
$$ 258798 253125 247129 239726 231848 224429 216560 207285 197788 190022 184168 179124 174690 171649 170145
55676A70145p44n71l89j10J39L21K93J42L75R96R84k09j460j638j541k522m032
$$ 170145 169401 168830 168441 168331 168470 168791 169084 169226 169601 170597 171581 171372 169912 168274 166733 164211 160179
55659A60179m381l345k201j618j312j271j484j070N57K108K003R84J047K266K927
$$ 160179 155798 152453 150252 148634 147322 146051 144567 143497 144054 146162 148165 149149 150196 152462 155389
55644A55389K546K393K971L231K643K005J811J575J170J164J563J701J589J888
$$ 155389 157935 160328 163299 166530 169173 171178 172989 174564 175734 176898 178461 180162 181751 183639
55630A83639K439K384J850J909K756L414L381L059K443J079n47j169o27j12k59
$$ 183639 186078 188462 190312 192221 194977 198391 201772 204831 207274 208353 207806 206637 206010 205898 205639
55615B05639m89m36n04o23p9J017J455P16k37m55j54J07L64Q14J287J573J618
$$ 205639 205150 204714 204210 203587 203508 204525 205980 206696 206459 206004 205850 205957 206321 207135 208422 209995 211613
55598B11613J280N83J59O02J515K031K120K297K397J735M03p67j427j910k330
$$ 211613 212893 213476 213635 214237 215752 217783 219903 222200 224597 226332 226735 225968 224541 222631 220301
55583B20301k620l209m531o010o696o631o532o433n959n466n435n221l976k596
$$ 220301 217681 214472 209941 203931 197235 190604 184072 177639 171680 166214 160779 155558 151582 148986
55569A48986k788m373n387m951m177l942l650k785j967j802j993k190k501k751
$$ 148986 146198 141825 136438 131487 127310 123368 119718 116933 114966 113164 111171 108981 106480 103729
55555A03729k425j748j560j849j733j077p28q49n80K45N88L4m12m7L57o4r30j477
$$ 103729 101304 99556 97996 96147 94414 93337 92609 91760 91180 91425 92013 92047 91635 91588 91945 91881 90951 89474
55537H9474j632j509q86N1M43l6n80n27k63k46j24M86J160J352J189R55N22j62
$$ 89474 87842 86333 85447 85498 85941 85905 85325 84798 84535 84289 84165 84651 85811 87163 88352 89307 89829 89667
55519H9667o77p25n09j65M81J225J424R70N58O61J007J368J929K599K888K814
$$ 89667 88990 88265 87756 87591 88072 89297 90721 91691 92249 92910 93917 95285 97214 99813 102701 105515
55503A05515K950L215K713J284Rl85n43j170j830j917j881k425l189l276k609
$$ 105515 108465 111680 114393 115677 115686 115301 114758 113588 111758 109841 107960 105535 102346 99070 96461
55488I6461j858j435j306j436j646j382l38Q77J380J130Q33R29J141J040O56M11
$$ 96461 94603 93168 91862 90426 88780 87398 87060 87937 89317 90447 91280 92209 93350 94390 95046 95457
55472I5457O39J205J672J900K229K741K796J851M90j44J78O40O63M41J68l72j188
$$ 95457 96096 97301 98973 100873 103102 105843 108639 110490 110980 110836 111014 111654 112317 112758 112926 112554 111366
55455A11366j861k211k559l107l603l804l756l532l207l018l027k818k176j798
$$ 111366 109505 107294 104735 101628 98025 94221 90465 86933 83726 80708 77681 74863 72687 70889
55441G0889k368l262l212k196j434j544j890j909j813j670j083j87J65k90p62
$$ 70889 68521 65259 62047 59851 58417 56873 54983 53074 51261 49591 48508 48321 48486 48196 47434
55426D7434o89m81n50o44o40r35j531j708j167n92m80l78J25N50L57j38l91m25
$$ 47434 46745 46264 45714 45070 44430 43495 41964 40256 39089 38497 38017 37639 37764 38314 38671 38533 38142 37717
55408C7717m77m49k70j50p7K76P77Q32M10J87L46K52k21k49M79R87N30j75k12
$$ 37717 37240 36791 36521 36371 36294 36570 37347 38179 38589 38776 39122 39374 39153 38904 39383 40370 40900 40725 40513
55389D0513N2k51r39j129o23LL17K76o2m19l33J09J32n88j271j151n73k86k62
$$ 40513 40565 40314 39375 38246 37623 37626 37943 38219 38157 37738 37405 37514 37646 37058 35787 34636 34063 33777 33515
55370C3515k4L43L87P7k17l04j39L82J100J445J115M71j8k55j47M71J198J165
$$ 33515 33491 33834 34221 34298 34081 33777 33638 34020 35120 36565 37680 38151 38133 37878 37731 38202 39400 40565
55352D0565K49o25q70j003j399j382m06Q05J337J499K007K453J865L87q35j206
$$ 40565 40814 40189 39319 38316 36917 35535 35129 35934 37271 38770 40777 43230 45095 45482 44647 43441
55336D3441j122r82p37k90L09R99J425R57m28j671j831j265r20r14o92j42L31
$$ 43441 42319 41337 40600 40310 40619 41618 43043 44000 43572 41901 40070 38805 37885 36971 36279 36137 36468
55319C6468N20L87l05j423j972j170K45Q35L16l91p59j093j477j476j085q85j030
$$ 36468 36988 37375 37070 35647 33675 32505 32750 33585 33901 33510 32751 31658 30181 28705 27620 26735 25705
55302B5705r92n37r0K03Q04J796K316J638K47p51q86n29o4N27J218J565J050k28
$$ 25705 24713 24176 24086 24289 25093 26889 29205 30843 31090 30339 29453 28924 28860 29387 30605 32170 33220 32992
55284C2992j402j614r27j69J53L69R20J523J521P83j71q11r47o47j97k3l13p36
$$ 32992 31590 29976 29049 28880 29033 29402 30322 31845 33366 34149 33978 33167 32220 31573 31376 31353 31040 30304
55266C0304q33n92l54k45o2L09O18M74k06r18q74J16J164J148Q4q40p37K5N82
$$ 30304 29471 28879 28525 28280 28218 28527 29145 29619 29413 28495 27621 27737 28901 30049 30133 29293 28556 28581 29163
55247B9163O90O95Q37R74P87n2j454k524k165m67J081J235L55l52l71k2M75J191
$$ 29163 29853 30548 31385 32359 33146 33094 31640 29116 26951 26484 27565 28800 29155 28803 28432 28410 28885 30076
55229C0076J876J946J205K33j35M64J570K190J628K23r98j457j467j422j214p55
$$ 30076 31952 33898 35103 35336 35201 35665 37235 39425 41053 41276 40278 38821 37354 35932 34718 33963
55213C3963n20q90j355j019J53J168J178M40q2J01N03M60J67L55R28P90m65j539
$$ 33963 33443 32553 31198 30179 30332 31500 32678 33118 33036 33137 33640 34100 34267 34622 35550 36340 35875 34336
55195C4336j074L02Q64K66l15k70j81k98r3K78k06j499k045j093l5k46r96p55
$$ 34336 33262 33564 34428 34694 34379 34109 33928 33630 33537 33815 33609 32110 30065 28972 28937 28691 27695 26940
55177B6940M72J407J361O73q8l64K52J280J608J111J021J854K278J166m76j062
$$ 26940 27412 28819 30180 30853 30765 30401 30653 31933 33541 34652 35673 37527 39805 40971 40495 39433
55161C9433p77p60r64n82N1q0p80r71n89n51r93j094o21j34K44Q42J351J095L36
$$ 39433 38656 37896 36932 36350 36401 36321 35541 34570 33981 33430 32437 31343 30722 30588 30832 31674 33025 34120 34456
55142C4456k2L5j98o17m48R9q4j046j452o04N27Q04L02k97o03m31L20J273J788
$$ 34456 34434 34469 34271 33654 33206 33305 33221 32175 30723 30119 30646 31450 31752 31455 30852 30421 30741 32014 33802
55123C3802J789J636J236J79j143j624q72K78P98L73p04j745j949j267p46j080
$$ 33802 35591 37227 38463 38642 37499 35875 35003 35281 36079 36452 35748 34003 32054 30787 30041 28961
55107B8961j308k29J379J609K94p94p07l86n64m77L96J069N98l71o97l98j37N9
$$ 28961 27653 27424 28803 30412 30706 29912 29205 28819 28255 27778 28174 29243 29841 29470 28773 28375 28238 28297
55089B8297M90R18R42P51O78M71k55j202j683j420o19L54J023J000M93K17M71
$$ 28297 28787 29705 30647 31398 32076 32547 32292 31090 29407 27987 27368 27722 28745 29745 30238 30455 30926
55072C0926Q19Q72P57O29L56M1J17O23R59P94N46O19Q19Q72R34J151J283J121
$$ 30926 31745 32617 33374 34003 34359 34400 34517 35140 36099 36893 37439 38058 38877 39749 40683 41834 43117 44238
55054D4238Q15M74l1n71o29jQ29J281J223Q10K91R0N13J211J500J246Q70N10l0
$$ 44238 45053 45527 45496 44925 44296 44295 45124 46405 47628 48438 48729 48819 49332 50543 52043 53289 54159 54669 54639
55035E4639n93p16n14n37p31m56K74O32L35J25N05J017J166J130J100Q08K14k16
$$ 54639 54046 53330 52816 52279 51548 51092 51366 51998 52333 52458 52963 53980 55146 56276 57376 58184 58398 58182
55017E8182l71p15j231j082M5J174J295O00j12n03n51j41N11O89J26m76m13Q8
$$ 58182 57811 57096 55865 54783 54828 56002 57297 57897 57785 57282 56731 56590 57101 57790 57916 57440 57027 57115
54999E7115M10L43m4o80j192j099o99q98j713j911p55Q90J821J920J614R22m7
$$ 57115 57525 57868 57824 57144 55952 54853 54154 53256 51543 49632 48877 49767 51588 53508 55122 56044 55997
54982E5997n70k45K51K36N5J92K01m03r98p63j18o1n64p97n43j98K56J087J829
$$ 55997 55427 55182 55433 55669 55724 55916 56117 55714 54716 53953 53835 53774 53210 52413 51870 51672 51928 53015 54844
54963E4844J659O98o9j62OR5K89P37J234J560J593J211N14PL1K78L69M68P84R05
$$ 54844 56503 57201 57132 56970 56976 57071 57360 58097 59331 60891 62484 63695 64209 64216 64247 64525 64894 65362 66146 67051
54943F7051L82l73o16l82k91n43q50j132j479j621j245o97n66o96m03L66Q77O73
$$ 67051 67433 67060 66444 66062 65771 65228 64378 63246 61767 60146 58901 58204 57638 56942 56539 56905 57782 58455
54925E8455J36q9K23P80R93M67m17p04lR73J400J322J122P21K9l80KO18O02R3
$$ 58455 58591 58502 58725 59505 60498 60965 60548 59844 59841 60814 62214 63536 64658 65379 65408 65028 65030 65648 66250 66343
54905F6343p0K82O68R96J539K074K176K227K975M118M580M266M277N074N705N461
$$ 66343 66273 66555 67223 68219 69758 71832 74008 76235 79210 83328 87908 92174 96451 101525 107230 112691
54889A12691N152N971P729R135R348Q634P696O890O036M653K496j02k497m401
$$ 112691 117843 123814 131543 140678 150026 158660 166356 173246 179282 183935 186431 186329 183832 179431
54875A79431n988p366q297q526q149p512o887o316n615m714l939l718l921l926
$$ 179431 173443 166077 157780 149254 141105 133593 126706 120390 114775 110061 106122 102404 98483 94557
54861I4557l515l146l023k550j310O6P55R62J413K157K755L268M033M658M466
$$ 94557 91042 87896 84873 82323 81013 81079 81834 82796 84209 86366 89121 92389 96422 101080 105546
54846A05546L821L919N141O661P746Q423Q668Q018O401M420K469L34j937l686
$$ 105546 109367 113286 118427 125088 132834 141257 149925 157943 164344 168764 171233 171567 169630 165944
54832A65944m617n338o342p176p215o686o276o152n954n525n075m816m728m618
$$ 165944 161327 155989 149647 142471 135256 128570 122294 116142 110188 104663 99588 94772 90044 85426
54818H5426m148l077j663n98l29o57j072j249j150r70j015j389j712j594j260
$$ 85426 81278 78201 76538 75940 75611 74954 73882 72633 71483 70513 69498 68109 66397 64803 63543
54803F3543j248j438j082j2Q49N80n64j458j359m64M77P88L10m76q42m88J80N10
$$ 63543 62295 60857 59775 59763 60612 61192 60628 59170 57811 57347 57824 58612 58922 58446 57604 57116 57296 57806
54785E7806J82o17j398j751j605j160n41K03O90L22q07j629j346n28j99k72J21
$$ 57806 57988 57371 55973 54222 52617 51457 50916 51119 51809 52131 51324 49695 48349 47821 47622 47350 47471
54768D7471R70J325R50P72J256J544Q73p0j53O14J329J573J599J517J246J069
$$ 47471 48441 49766 50716 51488 52744 54288 55161 55091 54938 55552 56881 58454 60053 61570 62816 63885
54752F3885J406K023K183J743J415J771K493K901K833K666K721L032L578M307
$$ 63885 65291 67314 69497 71240 72655 74426 76919 79820 82653 85319 88040 91072 94650 98957
54738I8957M924M987M522M244M803N868O470O327O225O807P555P533O670N564
$$ 98957 103881 108868 113390 117634 122437 128305 134775 141102 147327 154134 161689 169222 175892 181456
54724A81456M324K556L91j414k661m036n809p012o638n127l920l717l926l742
$$ 181456 185780 188336 188727 187313 184652 180616 174807 167795 161157 156030 152110 148393 144467 140725
54710A40725l164k738k711k731k296j331k83L70N86O85Q54J083J480K329L597
$$ 140725 137561 134823 132112 129381 127085 125754 125471 125841 126427 127112 127966 129049 130529 132858 136455
54695A36455M749N335N610O217P340Q578R567J0370J1093J1484J1292J0716J0079
$$ 136455 141204 146539 152149 158366 165706 174284 183851 194221 205314 216798 228090 238806 248885
54682B48885R109P141M208J300q32k634m852p142q430q503q344q739r472j0057
$$ 248885 257994 265135 269343 270643 269811 267177 262325 255183 246753 238250 229906 221167 211695 201638
54668B01638j0458j0616j0166r100q041p357o688n800n127m895m575l895l491
$$ 201638 191180 180564 170398 161298 153257 145900 139212 133412 128285 123390 118815 114920 111429
54655A11429l694l617k600j624j913k768k518j163l23o14q62k44N42P28O82Q57
$$ 111429 107735 104118 101518 99894 97981 95213 92695 91532 91209 90595 89733 89489 90031 90759 91441 92298
54639I2298Q39K76k83l12k02m41o34k20M86Q28Q51J032J296J081K58o91j279j394
$$ 92298 93137 93413 93130 92818 92616 92175 91541 91321 91807 92635 93486 94518 95814 96895 97153 96462 95183 93789
54621I3789j159p55l46P3O14J273J881K296K408K061J362R69J493K602L292L083
$$ 93789 92630 91875 91529 91602 92216 93489 95370 97666 100074 102135 103497 104466 105959 108561 111853 114936
54605A14936K433J971J834J856J811J529J229J553K709L763L667K736K160K261
$$ 114936 117369 119340 121174 123030 124841 126370 127599 129152 131861 135624 139291 142027 144187 146448
54591A46448K342K156K193K436K264J847K145L133L573L166L330M913O646P120
$$ 146448 148790 150946 153139 155575 157839 159686 161831 164964 168537 171703 175033 179946 186592 193712
54577A93712O964P640R091J0113J0353J0466J0692J0621J0045Q957O996L985O23
$$ 193712 200676 208316 217407 227520 237873 248339 259031 269652 279697 288654 295650 299635 300258
54564C00258k287m888p607r989j1307j1847j2396j2754j2101j0592r313q646p892
$$ 300258 297971 293083 285476 275487 264180 252333 239937 227183 215082 204490 195177 186531 178639
54551A78639o643n418m715m357l998l549k936k152j585j620j961k002j833k083
$$ 178639 171996 166578 161863 157506 153508 149959 147023 144871 143286 141666 139705 137703 135870 133787
54537A33787k850l541l716l415k719j850j482k076k955l026k355k048k568l203
$$ 133787 130937 127396 123680 120265 117546 115696 114214 112138 109183 106157 103802 101754 99186 95983
54523I5983l346l202k984k473j782j527j804j824j108k81r4m17p18q88r94q43
$$ 95983 92637 89435 86451 83978 82196 80669 78865 77041 75933 75652 75558 75141 74423 73535 72541 71698
54507G1698m28l27r65j824j946j089J22R79J243J090Q51P16N41M0o83j073p55
$$ 71698 71270 70943 69978 68154 66208 65119 65241 66220 67463 68553 69404 70120 70661 70701 70018 68945 68190
54490F8190L1P72J162J200J069J078J359J568J263O41M50R67J542J490J050J054
$$ 68190 68221 68993 70155 71355 72424 73502 74861 76429 77692 78333 78783 79750 81292 82782 83832 84886
54474H4886J853K920L494L394L199L597M547N285N305N037N230N837O158N810
$$ 84886 86739 89659 93153 96547 99746 103343 107890 113175 118480 123517 128747 134584 140742 146552
54460A46552M985L839K423J143M68M9j013k795m311m952n276n832o162n732n090
$$ 146552 151537 155376 157799 158942 159410 159459 158446 155651 151340 146388 141112 135280 129118 123386 118296
54445A18296n098n525n408m500l443k599j749r21o74j274k218k875l036k732j999
$$ 118296 113198 107673 102265 97765 94322 91723 89974 89053 88379 87105 84887 82012 78976 76244 74245
54430G4245j086m78l84n04m56j83K58R03J601J843J294L24l09k48J98N52O53O72
$$ 74245 73159 72681 72297 71793 71337 71154 71412 72315 73916 75759 77053 77377 77068 76820 77018 77570 78223 78895
54412G8895Q43J256J746J941J532O27k74o80m35K57R80J191M81r32k090k049q45
$$ 78895 79738 80994 82740 84681 86213 86840 86566 85886 85451 85708 86688 87879 88360 87428 85338 83289 82444
54395H2444M99R74M15o19j449j599r96r3L92K27j07j51j74o62j462j917j817j572
$$ 82444 82943 83917 84332 83713 82264 80665 79669 79576 79968 80195 80088 79937 79763 79101 77639 75722 73905 72333
54377G2333j428j090l74L30N15J95k52n54o31m61j12J77K21Q5j8N8L26O48P47
$$ 72333 70905 69815 69441 69771 70286 70481 70229 69675 69044 68583 68471 68648 68869 68954 68936 68994 69320 69968 70715
54358G0715N21L28O07J130J163N46R0M33J035R07L8o33n31K9O43J369K239K909
$$ 70715 71236 71564 72171 73301 74464 75010 75100 75533 76568 77475 77513 76880 76349 76378 77021 78390 80629 83538
54340H3538L148L236L401L354K836K238K111K314K341K241K507L040L076K369
$$ 83538 86686 89922 93323 96677 99513 101751 103862 106176 108517 110758 113265 116305 119381 121750
54326A21750J639J438J242L54q61j500j529j821k738l600l722l304k918k692k457
$$ 121750 123389 124827 126069 126423 125562 124062 122533 120712 117974 114374 110652 107348 104430 101738 99281
54311I9281k290k388k614k541j922r53j67j30r56k021k408j833q44m5M47O74N42
$$ 99281 96991 94603 91989 89448 87526 86573 86406 86276 85320 83299 80891 79058 78214 78169 78616 79290 79832
54294G9832J86J29N99J121J258J335J799K310K195J602J336J632J896J779J694
$$ 79832 80018 80147 80746 81867 83125 84460 86259 88569 90764 92366 93702 95334 97230 99009 100703
54279A00703K022K463K507K083J466R14O42P63R90P76k8j019j831k498k957k824
$$ 100703 102725 105188 107695 109778 111244 112158 112800 113563 114553 115329 115301 114282 112451 109953 106996 104172
54263A04172k017j183j025j449j842j904j809j716j666j764j970j907j364q80
$$ 104172 102155 100972 99947 98498 96656 94752 92943 91227 89561 87797 85827 83920 82556 81676
54249H1676j189k084k488j837p78k25k38l42l64m22m11k01j68q12j796k139j564
$$ 81676 80487 78403 75915 74078 73300 73075 72837 72495 72131 71709 71298 71097 70929 70117 68321 66182 64618
54232F4618r42j004j326j141o37n95j071j355j184j065j211j016q9Q85R86L06
$$ 64618 63676 62672 61346 60205 59568 58973 57902 56547 55363 54298 53087 52071 51982 52867 53853 54159
54216E4159k30j32K53M69M99M99M99N29P15J026J169R32M72Q8j50l53m27m5Q27
$$ 54159 53929 53797 54050 54519 55018 55517 56016 56545 57260 58286 59455 60387 60859 60947 60797 60444 60017 59972 60799
54197F0799J554J387M35l06j43M52N29n7o23o61l20J37O37R83Q74M82L46N21M23
$$ 60799 62353 63740 64175 63869 63726 64178 64707 64650 64027 63366 63046 63183 63820 64803 65677 66159 66505 67026 67449
54178F7449j77p18p85p86j067j083k42Q98J218N29k97n75m21j40K10N87P74O39
$$ 67449 67272 66554 65769 64983 63916 62833 62591 63489 64707 65236 64939 64364 63943 63803 64013 64600 65374 66013
54160F6013K12m47j119j364r34j28O19J217J597J363M03n04m70K73P51O30L82
$$ 66013 66225 65778 64659 63295 62361 62233 62852 64069 65666 67029 67432 66928 66458 66731 67482 68112 68494
54143F8494J92k86r58j107n08J14J54p8m6J29O0k16l52k15J35O38J070J074O21
$$ 68494 68686 68400 67442 66335 65827 65941 66095 66017 65971 66100 66160 65944 65592 65377 65512 66150 67220 68294 68915
54124F8915J38m9j05k55l86l83m60p94j130j102p69m31j73J11L16J47m08q89p74
$$ 68915 69053 69004 68899 68644 68258 67875 67415 66621 65491 64389 63620 63189 63016 63127 63443 63590 63182 62293 61519
54105F1519r4N03M44o0k51J29M38L5p98j278j139o91j66L60N90K66k33l08q5k42
$$ 61519 61425 61928 62372 62312 62061 62190 62628 62663 61865 60587 59448 58757 58591 58951 59541 59807 59574 59266 59181 58939
54085E8939q85j343j239r41p91n92j53L25O98J038J174P59J7k78O6L69K09N5K70
$$ 58939 58054 56711 55472 54531 53740 53148 52995 53320 54018 55056 56230 56989 57006 56728 56794 57163 57372 57427 57697
54066E7697L87Ql20KN10L01n97j366j575j443j111m87L09Q93J101R62M56k84o79
$$ 57697 58084 58092 57772 57774 58284 58585 57988 56622 55047 53604 52493 52006 52315 53208 54309 55271 55727 55443 54764
54047E4764k51O21J096R07N37L66K34o2l87n11m52l64l13k43k4M40J006J249Q31
$$ 54764 54513 55134 56230 57137 57674 58040 58274 58212 57825 57314 56862 56498 56185 55942 55918 56358 57364 58613 59444
54028E9444q8r51j308j116p20n58q03j145j112o54j98j03k97n21o32m69J62J154
$$ 59444 59356 58405 57097 55981 55261 54703 53900 52755 51643 50989 50791 50688 50391 49870 49238 48769 48931 50085
54010E0085J995K213J764R43J62j38J97O97O91J65k24m8M39R22J382J647J354
$$ 50085 52080 54293 56057 57000 57162 57024 57221 57918 58609 58774 58550 58502 58941 59863 61245 62892 64246
53993F4246P37O75J407J944J495P73R76J969K528K168J657J698K060K228K169
$$ 64246 64983 65658 67065 69009 70504 71277 72253 74222 76750 78918 80575 82273 84333 86561 88730
53978H8730K126K099J925J618J432J669K407L264L676L554L456L796M236M225
$$ 88730 90856 92955 94880 96498 97930 99599 102006 105270 108946 112500 115956 119752 123988 128213
53964A28213L858L644L668L590L351L227L178K762J881J155J230J983K616K470
$$ 128213 132071 135715 139383 142973 146324 149551 152729 155491 157372 158527 159757 161740 164356 166826
53950A66826J690J047J064J343J045M8q46j044r25j157j685k056k264k601k928
$$ 166826 168516 169563 170627 171970 173015 173063 172217 171173 170248 169091 167406 165350 163086 160485 157557
53935A57557k833k453k389k714k738k030j158j051j925l086l675l438k787k264
$$ 157557 154724 152271 149882 147168 144430 142400 141242 140191 138266 135180 131505 128067 125280 123016
53921A23016j963j576r55l53o8j10l60p58j127j108n24L61J103J384J066K77m69
$$ 123016 121053 119477 118522 118169 118101 117991 117631 116873 115746 114638 114114 114475 115578 116962 118028 118305 117836
53904A17836o53l91k25j73L25J303J894J517P51M23N57P56J022J422J557J198
$$ 117836 117183 116792 116567 116394 116719 118022 119916 121433 122184 122607 123164 123920 124942 126364 127921 129119
53888A29119R13J198J482R36r8n57k13K59N43R77J603J979K045K245K687K962
$$ 129119 130032 131230 132712 133648 133550 132993 132780 133039 133582 134559 136162 138141 140186 142431 145118 148080
53872A48080K984L204L818M431M615M266L303J717k9j186j387p46M99J910K727
$$ 148080 151064 154268 158086 162517 167132 171398 174701 176418 176389 175203 173816 173070 173569 175479 178206
53857A78206K597K152K178K442K265J835J917K463K752K784L250M096M423M013
$$ 178206 180803 182955 185133 187575 189840 191675 193592 196055 198807 201591 204841 208937 213360 217373
53843B17373L605L411K742J553R38J351J662Q42m95j171j101r04p44n67q07j797
$$ 217373 220978 224389 227131 228684 229622 230973 232635 233477 232982 231811 230710 229806 229062 228495 227688 225891
53827B25891l058l999m752n480n539m468l262l378m737n798n572m511l411k531
$$ 225891 222833 218834 214082 208602 203063 198595 195333 191955 187218 181420 175848 171337 167926 165395
53813A65395k024k257l195m072m194l711l293l215l087k475j594j241j944l233
$$ 165395 163371 161114 157919 153847 149653 145942 142649 139434 136347 133872 132278 131037 129093 125860
53799A25860m071l972l331k620j831j021p71j485k552k919k307j390q48p90j050
$$ 125860 121789 117817 114486 111866 110035 109014 108243 106758 104206 101287 98980 97590 96742 95952 94902
53784I4902j477j818j713j059k52J20j87p85q95r9J101J623R50k97j001o84J30
$$ 94902 93425 91607 89894 88835 88583 88703 88516 87731 86836 86737 87838 89461 90411 90114 89113 88429 88559
53767H8559N74K71l61n69p1O62J025R60P78N25N1m27m71j45L1n6O1N66J009J163
$$ 88559 89133 89404 89043 88474 88403 89065 90090 91050 91828 92353 92404 91977 91506 91361 91392 91336 91397 91963 92972 94135
53747I4135J446K107K605K444K065K175K614K597J979J582K150L434M478M625
$$ 94135 95581 97688 100293 102737 104802 106977 109591 112188 114167 115749 117899 121333 125811 130436
53733A30436M169L916M108M037L100J946J729K343K360J098k57l08O45J224Q64
$$ 130436 134605 138521 142629 146666 149766 151712 153441 155784 158144 159242 158985 158677 159322 160546 161410
53718A61410J92j62j86p8o4m74j332j951j654q31n95j362k416k931k826k474k095
$$ 161410 161602 161440 161254 161176 161112 160638 159306 157355 155701 154870 154275 152913 150497 147566 144740 142266 140171
53701A40171j724j380j097r61j093j396j463j054n00k15o2L59Q76R09L99o0j70
$$ 140171 138447 137067 135970 135009 133916 132520 131057 130003 129503 129288 129226 129585 130461 131370 131769 131709 131539
53684A31539l27q19j166p90K6L50k21j104j501j270q42n66m03k36r8%J14J20l06
$$ 131539 131212 130393 129227 128437 128463 128813 128592 127488 125987 124717 123875 123309 122906 122670 122572 122572 122686 122806 122500
53665A22500j109j653j460r16o65o67m82k60m93q72m24Q95J826J509O56L89P06
$$ 122500 121391 119738 118278 117362 116697 116030 115548 115288 114795 113923 113499 114394 116220 117729 118385 118774 119480
53648A19480R18Q86R35R64O21R5l6L60R02J323J552J461J071P96R10J049Q00M69
$$ 119480 120398 121284 122219 123183 123804 123899 123863 124223 125125 126448 128000 129461 130532 131328 132238 133287 134087 134556
53630A34556O00J062J337J456J824K317K411K102J902J908J728J359J356J893
$$ 134556 135156 136218 137555 139011 140835 143152 145563 147665 149567 151475 153203 154562 155918 157811
53616A57811K388K309J795J281R18O28L32L4j71j29O5J7m26q52r11q91j095j129
$$ 157811 160199 162508 164303 165584 166502 167130 167462 167496 167325 167196 167261 167278 166852 166000 165089 164198 163103 161974
53598A61974n67L1k18j105j559j336j288j811k134j596o32N5M34P22O95J13o41
$$ 161974 161407 161438 161220 160115 158556 157220 155932 154121 151987 150391 149759 149814 150248 150970 151665 151778 151137
53581A51137r79p81k63M47J160J460J188P81P32R14Q42L43k98o09j66J094K505
$$ 151137 150158 149377 149114 149561 150721 152181 153369 154150 154882 155796 156638 156981 156683 156074 155908 157002 159507
53564A59507L010K254J081O22J145J988K456K342J859J362J117J142J309J534
$$ 159507 162517 164771 165852 166474 167619 169607 172063 174405 176264 177626 178743 179885 181194 182728
53550A82728J677J380M60m66l43J103K884L757L406K456J771J964L089M433M938
$$ 182728 184405 185785 186245 185779 185436 186539 189423 193180 196586 199042 200813 202777 205866 210299 215237
53535B15237M265L178K601K603K621K336J892J507J334J507J925K142J866J398
$$ 215237 219502 222680 225281 227884 230505 232841 234733 236240 237574 239081 241006 243148 245014 246412
53521B46412J235J346J241O98O5k00O9P27J484K024K159J972J653J321J057R46
$$ 246412 247647 248993 250234 250932 250997 250797 250866 251593 253077 255101 257260 259232 260885 262206 263263 264209
53505B64209R31P59L52J05M94J331J776J225R5m72K30J694K661K374J331O97J051
$$ 264209 265140 265899 266251 266356 266850 268181 269957 271182 271277 270805 271035 272729 275390 277764 279095 279792 280843
53488B80843J889K335K126J755J739K027K169J978J779J867J999J747J296J339
$$ 280843 282732 285067 287193 288948 290687 292714 294883 296861 298640 300507 302506 304253 305549 306888
53474C06888K087K940L406L807M549N220N128M439L939L860L715L352L318L967
$$ 306888 308975 311915 315321 319128 323677 328897 334025 338464 342403 346263 349978 353330 356648 360615
53460C60615M941N820O666P619Q451Q891Q940Q640Q026P548P941R310J0797J1533
$$ 360615 365556 371376 378042 385661 394112 403003 411943 420583 428609 436157 444098 453408 464205 475738
53446D75738J1544J1410J1488J1830J2445J3202J3797J4200J4749J5543J6141
$$ 475738 487282 498692 510180 522010 534455 547657 561454 575654 590403 605946 622087
53435F22087J6267J6307J6696J7222J7502J7678J8075J8476J8434J8017J7628
$$ 622087 638354 654661 671357 688579 706081 723759 741834 760310 778744 796761 814389
53424H14389J7284J6758J6257J6203J6467J6501J6273J6314J6719J6833J6223
$$ 814389 831673 848431 864688 880891 897358 913859 930132 946446 963165 979998 996221
53413I96221J5422J5250J5771J6310J6248J5494J4314J3070J2071J1480J1244
$$ 996221 1011643 1026893 1042664 1058974 1075222 1090716 1105030 1118100 1130171 1141651 1152895
53402A152895J1190J1074J0620R581P892N755L604J861O13n56k166m166n902o897
$$ 1152895 1164085 1175159 1185779 1195360 1203252 1209007 1212611 1214472 1215085 1214529 1212363 1208197 1202295 1195398
53388A195398p439q094q891r390r421r327r489r970j0695j1608j2516j3146j3475
$$ 1195398 1187959 1179865 1170974 1161584 1152163 1142836 1133347 1123377 1112682 1101074 1088558 1075412 1061937
53375A061937j3783j4226j4580j4513j3967j3102j2070j1036j0319j0199j0500
$$ 1061937 1048154 1033928 1019348 1004835 990868 977766 965696 954660 944341 934142 923642
53364I23642j0541r663p898n950m490l524k612j636r50p88p50k42Q12J933K690
$$ 923642 913101 903438 895540 889590 885100 881576 878964 877328 876378 875590 874840 874598 875410 877343 880033
53349H80033L079L375L877M804O173P704R023J0075J1153J2461J3809J4821J5404
$$ 880033 883112 886487 890364 895168 901341 909045 918068 928143 939296 951757 965566 980387 995791
53336I95791J5814J6352J7106J8055J9249K0738K2389K3928K5259K6518K7750
$$ 995791 1011605 1027957 1045063 1063118 1082367 1103105 1125494 1149422 1174681 1201199 1228949
53325A228949K8698K9216K9648L0483L1635L2536L2952L3292L3884L4350L4095
$$ 1228949 1257647 1286863 1316511 1346994 1378629 1411165 1444117 1477409 1511293 1545643 1579738
53314A579738L3180L2317L2045L2164L2019L1100K9370K7188K4970K2933K1122
$$ 1579738 1612918 1645235 1677280 1709444 1741463 1772563 1801933 1829121 1854091 1877024 1898146
53303A898146J9547J8056J6192J3563J0473P744N640L378J00l981p827j0855j3341
$$ 1898146 1917693 1935749 1951941 1965504 1975977 1983721 1989361 1992739 1992839 1988858 1981031 1970176 1956835
53290A956835j5652j7682j9188k0303k1372k2520k3633k4625k5508k6336k7150
$$ 1956835 1941183 1923501 1904313 1884010 1862638 1840118 1816485 1791860 1766352 1740016 1712866
53279A712866k7870k8138k7532k6167k4846k4346k4554k4705k4410k4087k4173
$$ 1712866 1684996 1656858 1629326 1603159 1578313 1553967 1529413 1504708 1480298 1456211 1432038
53268A432038k4391k4183k3611k3248k3231k2995k2099k0791j9478j8059j6296
$$ 1432038 1407647 1383464 1359853 1336605 1313374 1290379 1268280 1247489 1228011 1209952 1193656
53257A193656j4434j2983j2039j1328j0799j0576j0498j0274j0162j0765j1985
$$ 1193656 1179222 1166239 1154200 1142872 1132073 1121497 1110999 1100725 1090563 1079798 1067813
53246A067813j2779j2330j1000r719q841q047p061n992m991m038l120k346j771
$$ 1067813 1055034 1042704 1031704 1021985 1013144 1005097 998036 992044 987053 983015 979895 977549 975778
53233I75778j220m09P28J795K268K212K501L932O213Q252R415J0065J0766J1533
$$ 975778 974558 974149 974877 976672 978940 981152 983653 987585 993798 1002050 1011465 1021530 1032296 1043829
53219A043829J2139J2663J3335J4099J4686J4891J4629J3949J3180J2684J2277
$$ 1043829 1055968 1068631 1081966 1096065 1110751 1125642 1140271 1154220 1167400 1180084 1192361
53208A192361J1320R602P758O441N518M478L241K054Q76o10k391m020n059n432
$$ 1192361 1203681 1213283 1221041 1227482 1233000 1237478 1240719 1242773 1243649 1243039 1240648 1236628 1231569 1226137
53194A226137n463n766o876q677j0429j1601j2378j3111j3720j4054j4344j4766
$$ 1226137 1220674 1214908 1208032 1199355 1188926 1177325 1164947 1151836 1138116 1124062 1109718 1094952
53182A094952j4909j4336j3410j2917j3035j3299j3466j3663j3768j3448j2848
$$ 1094952 1080043 1065707 1052297 1039380 1026345 1013046 999580 985917 972149 958701 945853
53171I45853j2603j2898j3174j2932j2388j2027j1988j2081j2021j1485j0387
$$ 945853 933250 920352 907178 894246 881858 869831 857843 845762 833741 822256 811869
53160H11869r263q854r102r019p963o545n824n907n989n605n275n668o662p504
$$ 811869 802606 793752 784650 775631 767668 761123 755299 749392 743403 737798 732523 726855 720193 712689
53146G12689p784p861q265q944r358r301r237r634j0263j0483j0114r608r342
$$ 712689 704905 697044 688779 679835 670477 661176 651939 642305 632042 621559 611445 601837 592495
53133E92495r176q854q518q475q671q717q443q169q321q968r837j0643j1198j1286
$$ 592495 583319 574465 565947 557472 548801 540084 531641 523472 515151 506183 496346 485703 474505 463219
53119D63219j0736r764q913q491q276q014p940q332q808q663p833o959o411n996
$$ 463219 452483 442719 433806 425315 417039 409025 401085 392753 383945 375282 367449 360490 354079 348083
53105C48083n697n950o770p314o889n900n217n045n013n013n180n339n164m772
$$ 348083 342386 336436 329666 322352 315463 309563 304346 299301 294288 289275 284095 278756 273592 268820
53091B68820m574m577m399l882l188k405j608j203j579k476l177l386l404l450
$$ 268820 264246 259669 255270 251388 248200 245795 244187 242984 241405 238929 235752 232366 228962 225512
53077B25512l360k999k466j892j375j165j429j934k291k474k580k358j516m90
$$ 225512 222152 219153 216687 214795 213420 212255 210826 208892 206601 204127 201547 199189 197673 197183
53063A97183j34n82j069j013p29q13j346j889j919j133J82J117R38j7o79n72j41
$$ 197183 197049 196467 195398 194385 193656 192843 191497 189608 187689 186556 186738 187855 188793 188776 188097 187525 187384
53046A87384K04O78J465K166K217J484K11j155j899j455j87P12M94l90j053j224
$$ 187384 187588 188266 189731 191897 194114 195598 195809 194654 192755 191300 191113 191825 192319 191929 190876 189652
53030A89652j223j353j785k600l503l807l121j904j014q97j433k273k958l045
$$ 189652 188429 187076 185291 182691 179188 175381 172260 170356 169342 168445 167012 164739 161781 158736
53016A58736k491j802j506j648j904k020j925j693j526j592j704j520j098r33
$$ 158736 156245 154443 152937 151289 149385 147365 145440 143747 142221 140629 138925 137405 136307 135374
53002A35374j291j818j988j621q60p3J46n94j805k386j793o02L76R33J167R34
$$ 135374 134083 132265 130277 128656 127796 127723 127869 127275 125470 123084 121291 120689 121065 121998 123165 124099
52986A24099J38q48j544j872j907j557r43o55j051j558j324l90L85M69J67m6j69
$$ 124099 124237 123389 121845 119973 118066 116509 115566 114911 113860 112302 110978 110588 110973 111442 111609 111563 111394
52969A11394m75r67j234q52N1P17N11k42n76j26M52N00J99Nj68o19j116j196r16
$$ 111394 110919 109952 108718 107866 107917 108634 109145 108903 108327 108201 108653 109153 109352 109357 109189 108570 107454 106258 105342
52950A05342o91n68k66J39K58K4k25k99l04k07J80P81J225J350J313J142O14k23
$$ 105342 104651 104083 103817 103956 104214 104238 104013 103714 103410 103203 103383 104164 105389 106739 108052 109194 109808 109585
52932A09585q57q17k61K22K66J17L00R13J342R45l3o71n27j34J2L21J324K535
$$ 109585 108728 107911 107650 107872 108138 108255 108555 109468 110810 111755 111722 111051 110524 110390 110402 110723 112047 114582
52914A14582K846K023R84N98Q39J223J503J672J784J971K340K642K435J731J185
$$ 114582 117428 119451 120435 121033 121872 123095 124598 126270 128054 130025 132365 135007 137442 139173 140358
52899A40358J375K139K774K820K439K115K127K322K420K411K474K537K280J712
$$ 140358 141733 143872 146646 149466 151905 154020 156147 158469 160889 163300 165774 168311 170591 172303
52885A72303J338J405J370O36n15j267j380j344j496j609j487j326j290j190q83
$$ 172303 173641 175046 176416 177052 176537 175270 173890 172546 171050 169441 167954 166628 165338 164148 163265
52870A63265n86n53o70o20l25j5Ol52q38j089j037j001j146j158p50k32n9k6L54
$$ 163265 162679 162126 161456 160836 160511 160496 160502 160150 159312 158223 157186 156185 155039 153881 153131 152899 152840 152814 153168
52851A53168Q32N56n41j305p70N60J360J078K96k38l82l96l99l07j37j40m55p10
$$ 153168 154000 154556 154015 152710 151940 152500 153860 154938 155234 154996 154614 154218 153819 153512 153375 153235 152780 152070
52833A52070l18N82J001L62l92J62J865K934K331J151R83J656J692N38p53j097
$$ 152070 151752 152334 153335 153697 153305 153467 155332 158266 160597 161748 162731 164387 166079 166617 165864 164767
52817A64767o04k1K68K76R0m5K54R33J289Q25J01J26R91J701J402L52n85r39q13
$$ 164767 164163 164142 164410 164686 164776 164731 164985 165918 167207 168032 168133 168259 169250 170951 172353 172705 172120 171181 170368
52798A70368l72L36J145J719J853J599J050K78m59p25l30L70P59N72J92L09J262
$$ 170368 169996 170332 171477 173196 175049 176648 177698 177976 177517 176792 176462 176832 177591 178163 178355 178664 179926
52781A79926K567L276K966K222J888J986J888J424J162J410J658J439J134J234
$$ 179926 182493 185769 188735 190957 192845 194831 196719 198143 199305 200715 202373 203812 204946 206180
52767B06180J351P50l50r38o76l73q01j727k454k706k604k235j814j846k597l543
$$ 206180 207531 208281 207931 206993 206317 205944 205143 203416 200962 198256 195652 193417 191603 189757 187160 183617
52751A83617l813l196k290j729j628j799k059k143j712p90rlo56j280j579j940
$$ 183617 179804 176608 174318 172589 170961 169162 167103 164960 163248 162458 162449 162446 161790 160510 158931 156991
52735A56991k558k791j941m70K84l23j467j960j604j075r23j141j486j749j758
$$ 156991 154433 151642 149701 149231 149515 149192 147725 145765 144161 143086 142163 141022 139536 137787 136029
52720A36029j521j321j354j377j082o06m16o62j076j423j747k118k433k518k225
$$ 136029 134508 133187 131833 130456 129374 128768 128352 127690 126614 125191 123444 121326 118893 116375 114150
52705A14150j561q80p26j206j673j471q04m46p06j141j327j343j472j814k270
$$ 114150 112589 111709 110983 109777 108104 106633 105829 105383 104677 103536 102209 100866 99394 97580 95310
52690I5310k573k369j644r71q48r55o26L5L09J07J08M22J80j000k041j828q88
$$ 95310 92737 90368 88724 87753 86905 85950 85324 85359 85668 85775 85883 86305 86485 85485 83444 81616 80728
52673H0728n82j037j036l8R49Q62Q3k97j11j42p31j196q93k12ol34m27J45Q24
$$ 80728 80146 79109 78073 78035 78984 79846 79929 79632 79521 79379 78648 77452 76559 76347 76341 76007 75580 75725 76549
52654G6549Q29J74m92p31o57n40n03n55n91m23l5K73K72J35R5O7K5L80J354K224
$$ 76549 77378 77552 77060 76329 75672 75132 74629 74074 73483 73060 73025 73298 73570 73705 73800 73867 73892 74272 75626 77850
52634G7850K130J421J228J644J502L88m09L11J817K497K037J424J251J220J198
$$ 77850 79980 81401 82629 84273 85775 86163 85754 86065 87882 90379 92416 93840 95091 96311 97509
52619I7509J507K005J945J151M53M58N90Kj077j677j508j322j765k453k586k097
$$ 97509 99016 101021 102966 104117 104570 105028 105618 105620 104543 102866 101358 100036 98271 95818 93232 91135
52603I1135j753k039k471k212j192k09N3l44r34j397j586j371q79n04m41l92r9
$$ 91135 89382 87343 84872 82660 81468 81259 81312 80968 80034 78637 77051 75680 74801 74297 73856 73464 73365
52586G3365J54J8k79l02k17m74q44n72L60R66N98j71n03m96o64p45l4J279K018
$$ 73365 73519 73537 73258 72956 72739 72265 71421 70849 71209 72175 72773 72602 72099 71603 70939 70194 70160 71439 73457
52567G3457J569O80L25M09K03m26q80q00m90l43l89n28p89j107j177q45l94k05
$$ 73457 75026 75706 76031 76440 76643 76217 75337 74537 74047 73704 73315 72787 71998 70891 69714 68869 68475 68270
52549F8270l11m87n62m67j01N11J053J137P05R6k14R7R54J775J863J158L22o9
$$ 68270 67959 67472 66910 66443 66342 66853 67906 69043 69748 69844 69630 69727 70681 72456 74319 75477 75799 75730
52531G5730j18q4K15R30J462J031j37q81n03N62J525K062K134J694R67N34P25
$$ 75730 75612 75528 75743 76673 78135 79166 79029 78148 77645 78207 79732 81794 83928 85622 86589 87123 87848
52514H7848J241J624J758J678J335Q81P86J217J636J388M67o21j398j567r74J12
$$ 87848 89089 90713 92471 94149 95484 96365 97151 98368 100004 101392 101859 101238 99840 98273 97299 97411
52498I7411R83J177R84Q91Q33M70k3j24K28N58N96O03Q03J009J016R73J145J522
$$ 97411 98394 99571 100555 101446 102279 102749 102726 102602 102830 103388 103984 104587 105390 106399 107415 108388 109533 111055
52480A11055J856K012K080K160K134J818J313J103J472J941J693O49k86l14K76
$$ 111055 112911 114923 117003 119163 121297 123115 124428 125531 127003 128944 130637 131286 131000 130686 130962
52465A30962O05L37j38m50o03p23q08q10o95m06l3J50M7K5N03J351K002K077J568
$$ 130962 131567 131904 131766 131316 130713 129990 129182 128372 127677 127271 127238 127388 127435 127460 127963 129314 131316 133393 134961
52446A34961O13n47j431j649j306p56n3R25J828J900Q64o50j731j965j498o57
$$ 134961 135574 135027 133596 131947 130641 129885 129832 130757 132585 134485 135349 134699 132968 131003 129505 128848
52430A28848K30Q97J204J115O24j56q36r78n56L1M41P00R72J192J094N12l25p92
$$ 128848 129078 129975 131179 132294 132918 132762 131926 130948 130392 130423 130864 131564 132536 133728 134822 135334 135009 134217
52412A34217l14R34K009K085J324N60K95L94O21R81J403J529J169O48M95Q26J272
$$ 134217 133903 134837 136846 138931 140255 140815 141110 141504 142125 143106 144509 146038 147207 147855 148350 149176 150448
52395A50448J417J201Q79O64M94K66J55M03P68O52j6m75p8Q34J443J474J194O83
$$ 150448 151865 153066 153945 154609 155103 155369 155524 155927 156695 157347 157331 156856 156778 157612 159055 160529 161723 162406
52377A62406j47r57j173q02l44L3N54J005P06l77j242r99O1R55J108O42N8n8N87
$$ 162406 162259 161302 160129 159327 158983 159016 159570 160575 161281 160904 159662 158663 158724 159679 160787 161429 161487 161429 162016
52358A62016J542J926J475Q13M95K63k73q46r62o79k84L69J441K332K148R52j50
$$ 162016 163558 165484 166959 167772 168267 168530 168257 167411 166449 165770 165486 165855 167296 169628 171776 172728 172578
52341A72578l58OJ84l8l09l54k90l48n28n58k77M9j8m70p89p02n97r04j321j152
$$ 172578 172220 172226 172410 172372 172063 171709 171419 171071 170543 169985 169708 169757 169739 169269 168480 167778 167181 166277 164956 163804
52321A63804k51Q21J520J750J602J118M06k43n35l39K94J070J558J515J120P52
$$ 163804 163553 164374 165894 167644 169246 170364 170770 170527 169992 169653 169947 171017 172575 174090 175210 175962
52305A75962O51R13J472J888J550M74m16l19N05J334K153L334M413M274K747J085
$$ 175962 176613 177526 178998 180886 182436 182910 182494 182175 182680 184014 186167 189501 193914 198188 200935 202020
52289B02020M35O88J164J665K220K545K466K347K531K755K760K887L374L609L000
$$ 202020 202455 203143 204307 205972 208192 210737 213203 215550 218081 220836 223596 226483 229857 233466 236466
52274B36466K196K271K987L087K337J947K599L297K932J993J755K453L233L550
$$ 236466 238662 240933 243920 247007 249344 251291 253890 257187 260119 262112 263867 266320 269553 273103
52260B73103L694M044M585N171N637N714N376N202N783O772P162O607N870N784
$$ 273103 276797 280841 285426 290597 296234 301948 307324 312526 318309 325081 332243 338850 344720 350504
52246C50504O356P131P877Q590R176R570R903J0296J0672J1043J1680J2731J3823
$$ 350504 356860 363991 371868 380458 389634 399204 409107 419403 430075 441118 452798 465529 479352
52233D79352J4386J4271J3942J4011J4681J5519J5798J5337J4825J5028J5723
$$ 479352 493738 508009 521951 535962 550643 566162 581960 597297 612122 627150 642873
52222F42873J5917J5277J4617J4634J4819J4218J2813J1470J0809J0763J1028
$$ 642873 658790 674067 688684 703318 718137 732355 745168 756638 767447 778210 789238
52211G89238J1256J0875R529P733O492O052N695M829L709K786K009J195O17O08
$$ 789238 800494 811369 820898 828631 835123 841175 846870 851699 855408 858194 860203 861398 862015 862623
52197H62623Q91Q00J58n48p85m81R9P16J283J808K318K778L155L538M120M994
$$ 862623 863514 864314 864472 863924 863139 862658 862757 863473 864756 866564 868882 871660 874815 878353 882473 887467
52181H87467O025O965P602P859P881Q011Q519R309J0016J0333J0166R574Q797
$$ 887467 893492 900457 908059 915918 923799 931810 940329 949638 959654 969987 980153 989727 998524
52168I98524Q279Q229Q217P590O417N436M979M445L286J934J139P26k30k031l888
$$ 998524 1006803 1015032 1023249 1030839 1037256 1042692 1047671 1052116 1055402 1057336 1058475 1059201 1058971 1056940 1053052
52153A053052m932n219n402n896o648p483q262q853r230r570j0070j0625j0912
$$ 1053052 1048120 1042901 1037499 1031603 1024955 1017472 1009210 1000357 991127 981557 971487 960862 949950
52140I49950j0761j0334r912r583r181q521p639o866o527o574o514n863m644l383
$$ 949950 939189 928855 918943 909360 900179 891658 884019 877153 870626 864052 857538 851675 847031 843648
52126H43648k601k399k478k462k166j783j837k696l999m746m280l063k164k104
$$ 843648 841047 838648 836170 833708 831542 829759 827922 825226 821227 816481 812201 809138 806974 804870
52112H04870k545k964l177l079k531j773j483j980k730l088l162l455l879l853
$$ 804870 802325 799361 796184 793105 790574 788801 787318 785338 782608 779520 776358 772903 769024 765171
52098G65171l250k632k424k467k507k619k878l106l131l001k718k112j230m98
$$ 765171 761921 759289 756865 754398 751891 749272 746394 743288 740157 737156 734438 732326 731096 730598
52084G30598k65n24j162k142l097l347k670j822j742k408k942k757k165j793j830
$$ 730598 730333 729809 728647 726505 723408 720061 717391 715569 713827 711419 708477 705720 703555 701762 699932
52069F99932j935j741j257q31p59r36j020r31r85j423j975k153j761j041m10j75
$$ 699932 697997 696256 694999 694168 693409 692473 691453 690522 689537 688114 686139 683986 682225 681184 680774 680599
52053F80599k84k59M25J681K819L393L754M527N816P200Q272Q877R107R361J0186
$$ 680599 680315 680056 680481 682162 684981 688374 692128 696655 702471 709671 717943 726820 735927 745288 755474
52038G55474J1613J2958J3748J4448J5708J7198J7994J8009J8101J8672J9163
$$ 755474 767087 780045 793793 808241 823949 841147 859141 877150 895251 913923 933086
52027I33086J9194J9314K0002K0643K0272J8870J7181J5620J4099J2771J2002
$$ 933086 952280 971594 991596 1012239 1032511 1051381 1068562 1084182 1098281 1111052 1123054
52016A123054J1560J0625Q854O865N331M084K551P16q59j839k533l410m540n574
$$ 1123054 1134614 1145239 1154093 1160958 1166289 1170373 1172924 1173640 1172781 1170942 1168409 1164999 1160459 1154885
52002A154885o184o391o536o934p558q110q340q230p814p050n973m866m033l426
$$ 1154885 1148701 1142310 1135774 1128840 1121282 1113172 1104832 1096602 1088788 1081738 1075765 1070899 1066866 1063440
51988A063440k744j870j037n13k72q3K33P35J430K315L313M294N065N393N140
$$ 1063440 1060696 1058826 1057789 1057276 1057004 1056921 1057154 1057889 1059319 1061634 1064947 1069241 1074306 1079699 1084839
51973A084839M518M079M257M819M943M025K433J229J057J387J127n3j354j971
$$ 1084839 1089357 1093436 1097693 1102512 1107455 1111480 1113913 1115142 1116199 1117586 1118713 1118660 1117306 1115335
51959A115335k184k891m299n716o618p331q338r434j0086j0307j0691j1655j3030
$$ 1115335 1113151 1110260 1105961 1100245 1093627 1086296 1077958 1068524 1058438 1048131 1037440 1025785 1012755
51946A012755j4334j5209j5646j5986j6626j7533j8274j8698j9233k0147k0922
$$ 1012755 998421 983212 967566 951580 934954 917421 899147 880449 861216 841069 820147
51935H20147k0929k0484k0501k1119k1424k0716j9448j8564j8463j8897j9497
$$ 820147 799218 778734 758233 737114 715690 694974 675526 656962 638499 619602 600105
51924F00105j9959j9951j9240j7898j6250j4720j3698j3280j3135j2902j2658
$$ 600105 580146 560195 540955 523057 506807 492087 478389 465109 451974 439072 426414
51913D26414j2656j2652j2095j1053j0291j0158j0070r409q425p700p270o838
$$ 426414 413758 401106 389011 377958 367667 357509 347439 338030 329605 321905 314635 307797
51901C07797o460o360o342o015n433m981m740m490m200m018l859l522l227l437
$$ 307797 301337 294977 288635 282620 277187 272206 267466 262976 258776 254758 250899 247377 244150 240713
51887B40713m106m593m409l699k915k395k304k581k838k672k136j654j457j522
$$ 240713 236607 232014 227605 223906 220991 218596 216292 213711 210873 208201 206065 204411 202954 201432
51873B01432j934k739l379k940j374O1J04j005j835j459l74K89K9p35j313j437
$$ 201432 199498 196759 193380 190440 189066 189127 189231 188226 186391 184932 184558 184847 184876 184141 182828 181391
51857A81391j332j370j677j979j819r85J18O99L19o13j273j344j293j687k455
$$ 181391 180059 178689 177012 175033 173214 172229 172347 173046 173365 172752 171479 170135 168842 167155 164700
51842A64700l011k853j966p92mm4o98j257j285j087j230j794k390k641k409j678
$$ 164700 161689 158836 156870 156078 156074 156030 155332 154075 152790 151703 150473 148679 146289 143648 141239 139561
51826A39561n86M78J113J235J037O76K20k60p17j150j428j300p86l31k34k19M4
$$ 139561 138975 139453 140566 141801 142838 143514 143734 143474 142757 141607 140179 138879 138093 137762 137528 137309 137353
51809A37353K71o0q41j462j686j794j829j383l86M79N69R5j43L06J189J964K326
$$ 137353 137624 137564 136723 135261 133575 131781 129952 128569 128183 128662 129231 129326 129183 129489 130678 132642 134968
51792A34968K405K511K636K370J495N42K84P51J184J061O73M88M76L84K85L98
$$ 134968 137373 139884 142520 144890 146385 146927 147211 147962 149146 150207 150880 151368 151844 152228 152513 152911
51776A52911N99N78L00m3m23r03j243r84j19O87P64J76m48p53r98j474j883j630
$$ 152911 153510 154088 154388 154345 153922 153019 151776 150792 150673 151360 152124 152300 151852 151099 150101 148627 146744 145114
51758A45114o53M32J048J194J115Q57M63K80N75J005R60L87j65k79q4J38L36N25
$$ 145114 144461 144893 145941 147135 148250 149107 149570 149850 150425 151430 152390 152777 152612 152333 152249 152387 152723 153248
51740A53248N77L58p7n32p70o39k72m9k03m97o18o20p45q65o40q9M28P51R60R57
$$ 153248 153825 154183 154106 153574 152804 152165 151893 151844 151641 151144 150526 149906 149161 148296 147656 147567 147995 148746 149706 150663
51720A50663N86J83L90J244K025K170J813J258N61j00k65J73O19M98n6n55q25
$$ 150663 151249 151432 151822 153066 155091 157261 159074 160332 160893 160793 160528 160701 161320 161818 161762 161207 160382
51703A60382q89n93J21Q86J263J297J307J379J413J454J623J901K290K904L545
$$ 160382 159493 158900 159021 159907 161170 162467 163774 165153 166566 168020 169643 171544 173834 176738 180283
51688A80283L539K470R69K13P12J895K836L066K780K581K947L714M244M296M453
$$ 180283 183822 186292 187261 187474 188186 190081 192917 195983 198763 201344 204291 208005 212249 216545 220998
51673B20998N275O353O745O193N317M628L956K955J691M67m83r36o77J14P54O74
$$ 220998 226273 232626 239371 245564 250881 255509 259465 262420 264111 264578 264095 263159 262482 262596 263350 264024
51657B64024M4m64m99l57n08j023j565j817j705j277o76k69m99j264j737j194
$$ 264024 264068 263604 263105 262748 262240 261217 259652 257835 256130 254853 254177 253908 253409 252145 250408 249214
51641B49214M1R69J123R17P15L00m32r28o52O3M48L17Q6Q8L05O84J144J412J334
$$ 249214 249255 250224 251347 252264 252979 253279 252847 251919 251267 251330 251778 252095 252181 252269 252574 253258 254402 255814 257148
51622B57148J218J453J860J951J747J663J613R53m70j809k140j512p10l30l97
$$ 257148 258366 259819 261679 263630 265377 267040 268653 269606 269136 267327 265187 263675 262965 262635 262238
51607B62238o76r32r85p67l73O8N28R86J286J258R36N75M60O89J101J427J454
$$ 262238 261562 260630 259645 258878 258505 258573 259101 260087 261373 262631 263567 264142 264602 265291 266392 267819 269273
51590B69273J013q7j822l640m699m704m250m035l978l593l039l126m116n135n156
$$ 269273 270286 270199 268377 264737 260038 255334 251084 247049 243071 239478 236439 233313 229197 224062 218906
51575B18906m213l208k719k461k003j515j579k329l175l435l107k701k454k061
$$ 218906 214693 211485 208766 206305 204302 202787 201208 198879 195704 192269 189162 186461 184007 181946
51561A81946j311n87l92o48q50q08p87r44j043q48m38j9L05M02N1o92j346j433
$$ 181946 180635 180048 179656 179008 178158 177350 176563 175619 174576 173728 173290 173271 173576 173978 174029 173337 171991 170558
51543A70558j009m91j02K84P20R55P75L92K14L02K74j01n18m74R6P78J187J309
$$ 170558 169549 169058 168956 169240 169960 170915 171690 172082 172296 172598 172872 172771 172253 171779 171875 172653 173840 175149
51525A75149J318J336J388J412J327J265J647K661L735L994L367K741K789L132
$$ 175149 176467 177803 179191 180603 181930 183195 184842 187503 191238 195232 198599 201340 204129 207261
51511B07261L043K463J859J438J045O57L60l1p87j680k104j808j152o18m07n26
$$ 207261 210304 212767 214626 216064 217109 217766 218126 218095 217308 215628 213524 211716 210564 209946 209539 209013
51495B09013q42j042q69m24k3K44M88O66O25M57L99M51M67O34J285K254K933L122
$$ 209013 208171 207129 206260 205836 205813 206057 206545 207211 207836 208293 208692 209143 209610 210244 211529 213783 216716 219838
51477B19838L260L638L882L557K836K178J633R98L82K37P13J357J586J217N18
$$ 219838 223098 226736 230618 234175 237011 239189 240822 241820 242202 242439 243152 244509 246095 247312 247830
51462B47830j62o51q48n87J46R42J220Q80M21K25J37n6j20J51L79J26k52n0N91
$$ 247830 247668 247017 246169 245582 245728 246670 247890 248770 249191 249416 249553 249497 249377 249528 249907 250033 249781 249731 250322
51443B50322O88k38j522k286k458k526k794l187l446l259k539j650j149j144j321
$$ 250322 251010 250772 249250 246964 244506 241980 239186 235999 232553 229294 226755 225105 223956 222812 221491
51428B21491j553j963k294j971r89j33L1k03l45l73k64L66J558K485K359J506
$$ 221491 219938 217975 215681 213710 212721 212588 212619 212416 212071 211698 211434 211800 213358 215843 218202 219708
51412B19708Q76Q40J096J477K055K594K709K505K502K877L313L573L718L790L775
$$ 219708 220584 221424 222520 223997 226052 228646 231355 233860 236362 239239 242552 246125 249843 253633 257408
51397B57408L827M036M060L556K926K982L777M413M223L552L080K878K553J908
$$ 257408 261235 265271 269331 272887 275813 278795 282572 286985 291208 294760 297840 300718 303271 305179
51383C05179J091K89l60o62n20j36L8l22j074j584j201J8J205J565J280J114J237
$$ 305179 306270 306559 306199 305537 305017 304881 304919 304597 303523 301939 300738 300756 301961 303526 304806 305920 307157
51366C07157R99qj224j804j575j007n12k98o57j831l420m386m007k716j792k057
$$ 307157 308156 308148 306924 305120 303545 302538 302026 301728 301071 299240 295820 291434 287427 284711 282919 280862
51350B80862l041l618l383l053l382m083m276l695k886k232j549p37k21l14o56
$$ 280862 277821 274203 270820 267767 264385 260302 256026 252331 249445 247213 245664 244927 244706 244392 243736
51335B43736p56p09q50j078j084j070j429j834j390O2J453J765J266R42J083J050
$$ 243736 242980 242271 241421 240343 239259 238189 236760 234926 233536 233598 235051 236816 238082 239024 240107 241157
51319B41157L73o42j501k223l049l852m241m158l960l955m100m244m374m532m644
$$ 241157 241530 240888 239387 237164 234115 230263 226022 221864 217904 213949 209849 205605 201231 196699 192055
51304A92055m647m557m367l989l516l304l515l688l135j867p81p15j577k556l008
$$ 192055 187408 182851 178484 174495 170979 167675 164160 160472 157337 155470 154689 153974 152397 149841 146833
51289A46833k852k347j777j403j339j434j420j260j119r94o29K2N60N71J21l77
$$ 146833 143981 141634 139857 138454 137115 135681 134261 133001 131882 130888 130259 130281 130841 131412 131533 131156
51273A31156o70p20m03L98J346J718J200L61J7K53L92K5l68o0Q63J453J079K73
$$ 131156 130486 129766 129363 129761 131107 132825 134025 134386 134403 134656 135048 135073 134705 134645 135508 136961 138040 138313
51255A38313J29R81K066K477K060J323Q47J030J951L087L498K835J942J862K406
$$ 138313 138442 139423 141489 143966 146026 147349 148196 149226 151177 154264 157762 160597 162539 164401 166807
51240A66807K440J552O06L59L83j34j076j628j439r58p76j105j757k216k003j349
$$ 166807 169247 170799 171405 171764 172147 172013 170937 169309 167870 166912 166136 165031 163274 161058 159055 157706
51224A57706j249k308l796m383l678k421j384p43m52n23p40p82p27r88j607k126
$$ 157706 156457 154149 150353 145970 142292 139871 138487 137744 137292 136769 136029 135247 134520 133532 131925 129799
51208A29799k213j987j637j273j160j526k024k037j605j341j337r92j84K89o0
$$ 129799 127586 125599 123962 122689 121529 120003 117979 115942 114337 112996 111659 110667 110483 110772 110712
51193A10712o08o29l47k81k27J67M29p5q23n83Q28K232K642K253J758J408J111
$$ 110712 110104 109475 109128 108847 108620 108787 109216 109141 108318 107735 108563 110795 113437 115690 117448 118856 119967
51176A19967Q26N02j7o83j130j067n31K52R98J326J049N69N87J186J597J091q5
$$ 119967 120793 121295 121278 120595 119465 118398 117867 118119 119117 120443 121492 122061 122648 123834 125431 126522 126437
51159A26437j016j106n39J28N79Q91J186J354J177P03K08j90o06r21o70K77J287
$$ 126437 125421 124315 123776 123904 124483 125374 126560 127914 129091 129794 130002 129812 129206 128285 127615 127892 129179
51142A29179J633J337R16N20n8o82r17p80p82j050j045m46L14O83O88N86L01l28
$$ 129179 130812 132149 133065 133585 133527 132845 131928 131148 130366 129316 128271 127825 128139 128822 129510 130096 130397 130069
51124A30069r91j190r51p72q80r98q46n64m45m91m96m12m07m82l04L20R11P02
$$ 130069 129078 127888 126937 126165 125285 124287 123441 122877 122432 121941 121445 121033 120626 120144 119840 120160 121071 121773
51106A21773l60j353j381n71K16L97j6p53j408j379m24P18J002L79j73j29p2n56
$$ 121773 121413 120060 118679 118108 118324 118721 118705 117952 116544 115165 114741 115459 116461 116840 116667 116538 116466 115910
51088A15910j145j233j137j473j907j537l98L53nq21j045n89j81k15l10l3M42
$$ 115910 114765 113532 112395 110922 109015 107478 107080 107433 107428 106607 105562 104973 104792 104577 104267 104234 104676
51071A04676N82L07J95P36J555J745J047L00M33J256J754J412Q14Q03J478K209
$$ 104676 105258 105565 105760 106496 108051 109796 110843 111143 111576 112832 114586 115998 116812 117615 119093 121302
51055A21302K344J722O83j97m92k35J75M05M32L09n4o53j135j108o88m30n59o78
$$ 121302 123646 125368 126051 125854 125362 125127 125302 125707 126139 126448 126394 125741 124606 123498 122810 122380 121821 121143
51037A21143l44K00L40o5n34o88o99p43m63N23J807K491K290J811J601J409Q07
$$ 121143 120799 120999 121339 121274 120740 120052 119353 118610 118147 118670 120477 122968 125258 127069 128670 130079 130886
51020A30886R8K7P41J520J614R70Q6n82q43p16l08K53Q81J506J982K121J855J292
$$ 130886 130984 131011 131752 133272 134886 135856 135942 135360 134517 133801 133493 133746 134627 136133 138115 140236 142091 143383
51002A43383O51J47j26l13p00j284j565j099k00K79K9l24j35L03K53l02n69n9
$$ 143383 144034 144181 144055 143742 143042 141758 140193 139094 138894 139173 139202 138878 138743 139046 139299 138997 138428 138369
50984A38369Q38J525J937K257K351J958J266P83O85P30P75J014J582K275K764
$$ 138369 139207 140732 142669 144926 147277 149235 150501 151284 151969 152699 153474 154488 156070 158345 161109
50969A61109K856K482J757J165J234J791J936J090k12r84j018r35j076j000k72
$$ 161109 163965 166447 168204 169369 170603 172394 174330 175420 175208 174224 173206 172271 171195 170195 169923
50954A69923P75J436J569J674K166K910L461L537L177K694K557L076L986M511
$$ 169923 170698 172134 173703 175377 177543 180453 183914 187451 190628 193322 195879 198955 202941 207452
50940B07452M119L218K804L411M605N611O148O468O820P189P513P829Q213Q763
$$ 207452 211571 214789 217593 221004 225609 231220 237368 243836 250656 257845 265358 273187 281400 290163
50926B90163R582J0558J1305J1645J2058J3161J4758J5918J6250J6500J7597J9562
$$ 290163 299745 310303 321608 333253 345311 358472 373230 389148 405398 421898 439495 459057
50914D59057K1813K4113K6644K9310L1720L3820L6058L8729M1548M4034M6079
$$ 459057 480870 504983 531627 560937 592657 626477 662535 701264 742812 786846 832925
50903H32925M7978N0011N2055N3596N4212N4079N3776N3448N2430M9976M6061
$$ 832925 880903 930914 982969 1036565 1090777 1144856 1198632 1252080 1304510 1354486 1400547
50892A400547M1192L5825L0350K5251K0611J5775J0273M869P97k070n181r108
$$ 1400547 1441739 1477564 1507914 1533165 1553776 1569551 1579824 1584693 1585490 1583420 1578239 1569131
50880A569131j2512j3926j3775j3644j4133j4484j4203j3987j4748j6475j8485
$$ 1569131 1556619 1542693 1528918 1515274 1501141 1486657 1472454 1458467 1443719 1427244 1408759
50869A408759k0422k2523k5075k7937l0671l3097l5573l8500m1573m3793m4527
$$ 1408759 1388337 1365814 1340739 1312802 1282131 1249034 1213461 1174961 1133388 1089595 1045068
50858A045068m4265m3903m3507m2299l9912l7041l4623l2833l1149k9114k6602
$$ 1045068 1000803 956900 913393 871094 831182 794141 759518 726685 695536 666422 639820
50847F39820k3706k0762j8325j6647j5197j3235j0856q907p791o893n520l880
$$ 639820 616114 595352 577027 560380 545183 531948 521092 512185 504394 497501 491981 488101
50835D88101k668k113j950k011k131j748m14J335K447K795L282M367N363N637
$$ 488101 485433 483320 481370 479359 477228 475480 475066 476401 478848 481643 484925 489292 494655 500292
50821E00292N627N983O524O878P459Q835J0548J1658J2170J2885J3991J4895J5440
$$ 500292 505919 511902 518426 525304 532763 541598 552146 563804 575974 588859 602850 617745 633185
50808F33185J6160J7241J8265J9331K1283K4437K7940L0978L3730L6625L9497
$$ 633185 649345 666586 684851 704182 725465 749902 777842 808820 842550 879175 918672
50797I18672M2234M5521N0048N5459O0967O6576P2832P9638Q6135R1822R7011
$$ 918672 960906 1006427 1056475 1111934 1172901 1239477 1312309 1391947 1478082 1569904 1666915
50786A666915J02194J07414J12380J16662J19788J21439J21571J20113J16700
$$ 1666915 1769109 1876523 1988903 2105565 2225353 2346792 2468363 2588476 2705176
50777B705176J11006J03059R2917Q0463O6001N0742L6019K2160Q831l725j4596
$$ 2705176 2816182 2919241 3012158 3092621 3158622 3209364 3245383 3267543 3276374 3272649 3258053
50766C258053k3297l0123l5200l8008l8220l6463l3727l0579k7358k4806k3887
$$ 3258053 3234756 3204633 3169433 3131425 3093205 3056742 3023015 2992436 2965078 2940272 2916385
50755B916385k5098k8300l3138l9266m6312n3937o2026p0474p8806q6208r2103
$$ 2916385 2891287 2862987 2829849 2790583 2744271 2690334 2628308 2557834 2479028 2392820 2300717
50744B300717r6558r9995j02527j03723j03058j00453r6298r1099q5225p9018
$$ 2300717 2204159 2104164 2001637 1897914 1794856 1694403 1598105 1507006 1421781 1342763
50734A342763p2836o6867o1030n5196m9446m4008l9066l4637l0633k6979k3737
$$ 1342763 1269927 1203060 1142030 1086834 1037388 993380 954314 919677 889044 862065 838328
50723H38328k1068j8946j6995j4883j2803j1197r984q629p019n784n332n111m424
$$ 838328 817260 798314 781319 766436 753633 742436 732452 723823 716804 711020 705688 700577 696153
50710F96153l493l140l554m109m322m274m006l241k015j066j065j620j538p2K315
$$ 696153 692660 689520 685966 681857 677535 673261 669255 666014 663999 662933 661868 660248 658710 658638 660953
50695F60953M481N700O176O560P274Q373R925J2053J4605J7153J9448K1643K3851
$$ 660953 665434 671134 677310 683870 691144 699517 709442 721495 736100 753253 772701 794344 818195
50682H18195K5882K7700K9740L2411L5536L8729M2080M5932N0136N4084N7539
$$ 818195 844077 871777 901517 933928 969464 1008193 1050273 1096205 1146341 1200425 1257964
50671A257964O0911O4660O8693P2433P5194P6561P6656P5894P4203P0760O5030
$$ 1257964 1318875 1383535 1452228 1524661 1599855 1676416 1753072 1828966 1903169 1973929 2038959
50660B038959N7793N0368M2853L3990K3021J0903p43j1180k0470k8414l4398l8147
$$ 2038959 2096752 2147120 2189973 2223963 2246984 2257887 2257144 2245964 2225494 2197080 2162682 2124535
50648B124535l9944m0074l8598l5781l2333k8922k5800k3059k1055k0199k0463
$$ 2124535 2084591 2044517 2005919 1970138 1937805 1908883 1883083 1860024 1838969 1818770 1798307
$$ [...]
##END NTUPLES=NMR SPECTRUM
##END=
