
##TITLE=AC1211_MCiAH12042_7165471_DYK4JUfp71
##JCAMPDX= 6.0         $$ Bruker NMR JCAMP-DX V2.0
##DATA TYPE= NMR SPECTRUM
##DATA CLASS= NTUPLES
##ORIGIN= BRUKER
##OWNER= Administrator
$$ 1.72 TOPSPIN		Version 2.1
$$ 2012-12-02 04:07:50.428 -0500  Administrator@X
$$ Compression mode = diff/dup
##.OBSERVE FREQUENCY= 400.02188249412
##.OBSERVE NUCLEUS= ^1H
##.ACQUISITION MODE= SIMULTANEOUS (DQD)
##.ACQUISITION SCHEME= undefined
##.AVERAGES= 64
##.DIGITISER RES= 22
##SPECTROMETER/DATA SYSTEM= spect
##.PULSE SEQUENCE= noesygpps1d.comp
##.SOLVENT NAME= COFFEE_meoh
##.SHIFT REFERENCE= INTERNAL, COFFEE_meoh, 1, 14.96259
##AUDIT TRAIL= $$ (NUMBER, WHEN, WHO, WHERE, PROCESS, VERSION, WHAT)
$$ ##TITLE= Audit trail, TOPSPIN		Version 2.1
$$ ##JCAMPDX= 5.01
$$ ##ORIGIN= Bruker BioSpin GmbH
$$ ##OWNER= Administrator
$$ $$ E:\/data/COFFEE/nmr/AC1211_MCiAH12042_7165471_DYK4JUfp71/12/pdata/1/auditp.txt
$$ ##AUDIT TRAIL=  $$ (NUMBER, WHEN, WHO, WHERE, PROCESS, VERSION, WHAT)
(   1,<2012-12-02 04:07:44.460 -0500>,<Administrator>,<X>,<go>,<TOPSPIN 2.1>,
      <created by zg
	started at 2012-12-02 03:56:14.303 -0500,
	POWCHK enabled, PULCHK disabled,
       configuration hash MD5:
       86 BA 57 50 F2 9D 5C 9B 26 00 A9 28 5F 66 2E 89
       data hash MD5: 64K
       92 D3 AE 65 65 09 F2 C7 55 24 57 ED D9 8A 70 D2>)
(   2,<2012-12-02 04:07:47.600 -0500>,<Administrator>,<X>,<proc1d>,<TOPSPIN 2.1>,
      <Start of raw data processing
       efp LB = 0.3 FT_mod = 6 PKNL = 1 PHC0 = 0 PHC1 = 0 SI = 128K 
       data hash MD5: 128K
       63 F6 F6 0A A5 4A 62 AE 0D 24 D4 A8 FD F8 78 D2>)
(   3,<2012-12-02 04:07:48.663 -0500>,<Administrator>,<X>,<proc1d>,<TOPSPIN 2.1>,
      <pk PHC0 = -82.2052 PHC1 = 0 
       data hash MD5: 128K
       8A 99 54 C3 12 E7 74 0F 83 B3 AF 30 34 97 15 17>)
(   4,<2012-12-02 04:07:49.366 -0500>,<Administrator>,<X>,<proc1d>,<TOPSPIN 2.1>,
      <abs ABSG = 1 
       data hash MD5: 128K
       FA AA 54 6E 81 B6 8D 1B 23 B4 CE 65 F6 23 4F B3>)
(   5,<2012-12-02 04:07:49.553 -0500>,<Administrator>,<X>,<proc1d>,<TOPSPIN 2.1>,
      <abs ABSG = 2 
       data hash MD5: 128K
       70 6D 89 CC 77 C9 C6 44 D6 67 E6 AE 78 59 B0 14>)
(   6,<2012-12-02 04:07:49.725 -0500>,<Administrator>,<X>,<proc1d>,<TOPSPIN 2.1>,
      <abs ABSG = 3 
       data hash MD5: 128K
       0C 2F 3B 8D B0 48 9A F8 7F C2 E0 0A 8E D3 8C 23>)
(   7,<2012-12-02 04:07:49.913 -0500>,<Administrator>,<X>,<proc1d>,<TOPSPIN 2.1>,
      <abs ABSG = 4 
       data hash MD5: 128K
       00 2E 07 BC 8E 72 72 2B A4 2C 62 09 04 FD 88 05>)
(   8,<2012-12-02 04:07:50.100 -0500>,<Administrator>,<X>,<proc1d>,<TOPSPIN 2.1>,
      <abs ABSG = 5 
       data hash MD5: 128K
       27 F5 59 16 3B F9 94 32 D5 AB 85 31 3B 55 85 1B>)
$$ ##END=
$$ 
$$ $$ hash MD5
$$ $$ 84 39 4B FA FE 15 A2 69 3C 64 9B E2 43 FE F3 A7
##$RELAX= 
##$RELAX= 
##$RELAX= 
##$RELAX= 
##$RELAX= 
##$RELAX= 
##$RELAX= 
##$RELAX= 
$$ Bruker specific parameters
$$ --------------------------
##$DU= <E:\>
##$EXPNO= 12
$$ [...]
150 150 150 150 150 150 150 150
##$TP07= 0
##$TPNAME0= <>
##$TPNAME1= <>
##$TPNAME2= <>
##$TPNAME3= <>
##$TPNAME4= <>
##$TPNAME5= <>
##$TPNAME6= <>
##$TPNAME7= <>
##$TPOAL= (0..7)
0.5 0.5 0.5 0.5 0.5 0.5 0.5 0.5
##$TPOFFS= (0..7)
0 0 0 0 0 0 0 0
##$TUNHIN= 0
##$TUNHOUT= 0
##$TUNXOUT= 0
##$USERA1= <user>
##$USERA2= <user>
##$USERA3= <user>
##$USERA4= <user>
##$USERA5= <user>
##$V9= 5
##$VALIST= <valist>
##$VCLIST= <CCCCCCCCCCCCCCC>
##$VD= 0
##$VDLIST= <DDDDDDDDDDDDDDD>
##$VPLIST= <PPPPPPPPPPPPPPP>
##$VTLIST= <TTTTTTTTTTTTTTT>
##$WBST= 1024
##$WBSW= 4
##$XGAIN= (0..3)
0 0 0 0
##$XL= 0
##$YL= 0
##$YMAX_a= 7328740
##$YMIN_a= -15847199
##$ZGOPTNS= <>
##$ZL1= 120
##$ZL2= 120
##$ZL3= 120
##$ZL4= 120
##$ABSF1= 14.96259
##$ABSF2= -5.595592
##$ABSG= 5
##$ABSL= 3
##$ALPHA= 0
##$AQORDER= 0
##$ASSFAC= 0
##$ASSFACI= 0
##$ASSFACX= 0
##$ASSWID= 0
##$AUNMP= <proc_prof1d_extract.lims>
##$AXLEFT= 0
##$AXNAME= <>
##$AXNUC= <1H>
##$AXRIGHT= 0
##$AXTYPE= 0
##$AXUNIT= <>
##$AZFE= 0.1
##$AZFW= 0.1
##$BCFW= 0
##$BC_mod= 0
##$BYTORDP= 0
##$COROFFS= 0
##$CY= 15
##$DATMOD= 1
##$DC= 0
##$DFILT= <>
##$DTYPP= 0
##$F1P= 0
##$F2P= 0
##$FCOR= 0.5
##$FTSIZE= 131072
##$FT_mod= 6
##$GAMMA= 0
##$GB= 0
##$INTBC= 1
##$INTSCL= 1
##$ISEN= 128
##$LB= 0.3
##$LEV0= 0
##$LPBIN= 0
##$MAXI= 10000
##$MC2= 0
##$MEAN= 0
##$ME_mod= 0
##$MI= 0
##$NCOEF= 0
##$NC_proc= -2
##$NLEV= 6
##$NOISF1= 0
##$NOISF2= 0
##$NSP= 0
##$NTH_PI= 0
##$NZP= 0
##$OFFSET= 14.96259
##$PC= 1
##$PHC0= -82.2052
##$PHC1= 0
##$PH_mod= 1
##$PKNL= yes
##$PPARMOD= 0
##$PPDIAG= 0
##$PPIPTYP= 0
##$PPMPNUM= 2147483647
##$PPRESOL= 1
##$PSCAL= 4
##$PSIGN= 0
##$PYNMP= <proc.py>
##$REVERSE= no
##$SF= 400.020008999513
##$SI= 131072
##$SIGF1= 0
##$SIGF2= 0
##$SINO= 400
##$SIOLD= 131072
##$SPECTYP= <>
##$SREGLST= <1H.CDCl3>
##$SSB= 0
##$STSI= 131072
##$STSR= 0
##$SW_p= 8223.68421052631
##$SYMM= 0
##$S_DEV= 0
##$TDeff= 65536
##$TDoff= 0
##$TI= <>
##$TILT= no
##$TM1= 0
##$TM2= 0
##$TOPLEV= 0
##$USERP1= <user>
##$USERP2= <user>
##$USERP3= <user>
##$USERP4= <user>
##$USERP5= <user>
##$WDW= 1
##$XDIM= 131072
##$YMAX_p= 388709236
##$YMIN_p= -11709
##$CURPLOT= <Network HP LaserJet P1505>
##$CURPRIN= <$Network HP LaserJet P1505>
##$DFORMAT= <normdp>
##$LAYOUT= <+/1D_H.xwp>
##$LFORMAT= <normlp>
##$PFORMAT= <normpl>
##$SURQMSG= 1
$$ End of Bruker specific parameters
$$ ---------------------------------
##NTUPLES= NMR SPECTRUM
##VAR_NAME=  FREQUENCY,     SPECTRUM/REAL,   SPECTRUM/IMAG
##SYMBOL=    X,             R,               I
##VAR_TYPE=  INDEPENDENT,   DEPENDENT,       DEPENDENT
##VAR_FORM=  AFFN,          ASDF,            ASDF
##VAR_DIM=   131072,        131072,          131072
##UNITS=     HZ,            ARBITRARY UNITS, ARBITRARY UNITS
##FACTOR=    0.0627417313425164, 1,          1
##FIRST=     8223.62146879497, 832,          -55668
##LAST=      0,             2797,            -55820
##MIN=       0,             -11709,          0
##MAX=       8223.62146879497, 388709236,    0
$$ Real data points
##PAGE= N=1
##DATA TABLE= (X++(R..R)), XYDATA
$$ [...]
$$ plain form
63274 275657 276764 278239 279591 280594 281421 282019 282155 282203 283150 285403 288108 290024 290830 291248 292144 293853
63258 293853 296208 298805 301233 303333 305400 307951 311177 314666 317865 320788 324086 328264 333053 337842
63244 337842 342609 347947 354147 360777 367482 374740 383329 393301 404016 415144 427161 440831 456497
63231 456497 473942 492598 511895 531703 552526 575014 599242 624544 649935 674415 697106
63220 697106 717670 736746 755556 774833 794321 813379 831717 849347 866125 881654 895571
63209 895571 907720 918070 926476 932404 934892 932928 925984 914079 897468 876556 852178 825555
63197 825555 797742 769310 740690 712567 685718 660625 637564 616944 599297 584940 573911
63186 573911 566296 562397 562377 565712 571120 577269 583757 591367 601202 613513 627511 642292 657608 673599
$$ packed form
63274B75657J107J475J352J003Q27N98J36M8R47K253K705J916Q06M18Q96J709
63258B93853K355K597K428K100K067K551L226L489L199K923L298M178M789M789
63244C37842M767N338O200O630O705P258Q589R972J0715J1128J2017J3670J5666
63231D56497J7445J8656J9297J9808K0823K2488K4228K5302K5391K4480K2691
63220F97106K0564J9076J8810J9277J9488J9058J8338J7630J6778J5529J3917
63209H95571J2149J0350Q406N928K488j964o944j1905j6611k0912k4378k6623
63197H25555k7813k8432k8620k8123k6849k5093k3061k0620j7647j4357j1029
63186E73911p615l899k0L335N408O149O488P610R835J2311J3998J4781J5316J5991
$$ plain form
63172 673599 690096 706596 722884 739268 756036 772919 789247 804490 818442 831018 842116
63161 842116 851621 859176 863905 864703 861102 853640 843104 829627 812933 793386 772186 750402 728268
63148 728268 705675 682971 660918 640125 620878 603240 587016 571814 557553 544703 533686
63137 533686 524275 516034 509077 503738 499608 495679 491578 487975 485527 484085 483341 483628 485402 488262 491176
63122 491176 493639 496032 498813 501815 504581 507097 509929 513650 518211 522909 527039 530581 534083 537873
63108 537873 541700 545336 549173 553733 558802 563607 567826 571827 575725 578843 580617 581683 583420 586446
63094 586446 590050 593110 595130 596186 596352 595614 594196 592571 591094 589796 588574 587475 586741 586689 587478 588912
63078 588912 590561 592143 593777 595795 598466 602052 606916 613275 620865 629170 637996 647619 658400 670541
$$ packed form
63172F73599J6497J6500J6288J6384J6768J6883J6328J5243J3952J2576J1098
63161H42116R505P555M729P98l601p462j0536j3477j6694j9547k1200k1784k2134
63148G28268k2593k2704k2053k0793j9247j7638j6224j5202j4261j2850j1017
63137E33686r411q241o957n339m130l929m101l603k448j442p44K87J774K860K914
63122D91176K463K393K781L002K766K516K832L721M561M698M130L542L502L790
63108E37873L827L636L837M560N069M805M219M001L898L118J774J066J737L026
63094E86446L604L060K020J056J66p38j418j625j477j298j222j099p34n2P89J434
63078E88912J649J582J634K018K671L586M864O359P590Q305Q826R623J0781J2141
$$ plain form
63064 670541 684180 699275 715286 731360 747182 763489 781522 802143 825530 851396 879237
63053 879237 908580 939357 971940 1006635 1043297 1081674 1121841 1163877 1207224 1250810 1293902
63042 1293902 1336569 1379281 1422298 1465451 1508180 1549662 1589221 1626900 1663596 1700463 1738111
63031 1738111 1776320 1814431 1851845 1888089 1922420 1953615 1980386 2001895 2017536 2026190 2026152 2016127
63019 2016127 1996073 1966847 1929309 1884136 1832341 1775456 1715155 1653054 1590879 1530503 1473558
63008 1473558 1421087 1373632 1331615 1295585 1266165 1243677 1227856 1218067 1213789 1214672 1220144 1229384
62996 1229384 1241906 1257706 1276546 1297526 1319814 1343458 1368844 1395553 1422386 1448475 1473813
62985 1473813 1498717 1523241 1547061 1569334 1588664 1603810 1614578 1621457 1624241 1621613 1612357 1596384
$$ packed form
63064F70541J3639J5095J6011J6074J5822J6307J8033K0621K3387K5866K7841
63053H79237K9343L0777L2583L4695L6662L8377M0167M2036M3347M3586M3092
63042A293902M2667M2712M3017M3153M2729M1482L9559L7679L6696L6867L7648
63031A738111L8209L8111L7414L6244L4331L1195K6771K1509J5641Q654l8j0025
63019B016127k0054k9226l7538m5173n1795n6885o0301o2101o2175o0376n6945
63008A473558n2471m7455m2017l6030k9420k2488j5821r789m278Q83N472R240
62996A229384J2522J5800J8840K0980K2288K3644K5386K6709K6833K6089K5338
62985A473813K4904K4524K3820K2273J9330J5146J0768O879K784k628r256j5973
$$ plain form
62973 1596384 1574224 1546066 1511881 1472158 1427881 1379871 1328697 1275316 1221382 1168631 1118002
62962 1118002 1069493 1022910 978686 937834 901069 868204 838535 811537 786979 764697 744739
62951 744739 727525 713231 701066 689842 679387 670731 664610 660332 656492 652302 647872 643629 640024
62938 640024 637412 635628 633769 630890 626868 622274 617549 612737 607906 603297 598893 594190 588695 582553
62924 582553 576562 571525 567620 564383 561349 558548 556196 554023 551336 547840 544002 540391 536987 533462
62910 533462 529797 526219 522724 519104 515391 511890 508767 505949 503409 501261 499510 497968 496543 495402
62896 495402 494726 494450 494301 494075 493812 493724 493883 493922 493146 491105 488017 484484 480873 477107 473077 469077 465772
62879 465772 463788 463271 463740 464351 464413 463797 462884 462247 462321 463220 464695 466308 467740 468924 469904 470686 471348 472120
$$ packed form
62973A596384k2160k8158l4185l9723m4277m8010n1174n3381n3934n2751n0629
62962A118002m8509m6583m4224m0852l6765l2865k9669k6998k4558k2282j9958
62951G44739j7214j4294j2165j1224j0455q656o121m278l840m190m430m243l605
62938F40024k612j784j859k879m022m594m725m812m831m609m404m703n495o142
62924E82553n991n037l905l237l034k801k352k173k687l496l838l611l404l525
62910E33462l665l578l495l620l713l501l123k818k540k148j751j542j425j141
62896D95402o76k76j49k26k63q8J59L9p76k041l088l533l611l766m030m000l305
62879D65772j984n17M69O11O2o16r13o37P4Q99J475J613J432J184R80P82O62P72
$$ plain form
62861 472120 473101 473903 473786 472344 469971 467556 465766 464680 464012 463497 463039 462684 462618 463052 463894 464653 464924
62844 464924 464936 465377 466619 468391 470214 471826 473107 474011 474783 475823 477092 478013 478320 478586 479500 480959
62828 480959 482449 483920 485645 487409 488630 489265 489849 490596 491135 491261 491239 491138 490533 489171 487385 485495
62812 485495 483347 480826 478321 476265 474620 473237 472405 472574 473732 475429 477286 479183 481109 483115 485348
62797 485348 488025 491526 496430 503049 510835 518764 526555 535114 545502 557838 571481 585903 601064
62784 601064 617343 635464 656209 679894 706415 736007 769520 807619 850160 896742 947417
62773 947417 1002388 1061512 1124681 1192315 1264734 1341145 1419731 1498589 1576081 1650521 1720124
62762 1720124 1783197 1837933 1882219 1914274 1933482 1940126 1934320 1915655 1883896 1839646 1784406 1720436
$$ packed form
62861D72120R81Q02j17j442k373k415j790j086o68n15m58l55o6M34Q42P59K71
62844D64924J2M41J242J772J823J612J281R04P72J040J269R21L07K66R14J459
62828D80959J490J471J725J764J221O35N84P47N39J26k2j01o05j362j786j890
62812D85495k148k521k505k056j645j383q32J69J158J697J857J897J926K006K233
62797D85348K677L501M904O619P786P929P791Q559J0388J2336J3643J4422J5161
62784F01064J6279J8121K0745K3685K6521K9592L3513L8099M2541M6582N0675
62773I47417N4971N9124O3169O7634P2419P6411P8586P8858P7492P4440O9603
62762A720124O3073N4736M4286L2055J9208O644n806j8665l1759m4250n5240o3970
$$ plain form
62750 1720436 1650490 1577111 1501953 1425959 1350054 1275334 1202712 1132861 1066492 1004291 946596
62739 946596 893435 844822 800627 760324 723369 689802 659964 633530 609349 586505 565213
62728 565213 546400 530603 517419 505933 495523 486170 477980 470584 463415 456557 450729 446175 442133
62715 442133 437906 433971 431354 430305 430306 431171 433278 436800 441501 447370 454716 463595 473832 485734 499979
62700 499979 516629 535044 555097 577717 603717 632711 663835 697103 733386 773280 816531
62689 816531 862540 910914 961437 1013742 1067016 1119909 1170751 1217967 1260265 1296533 1325767
62678 1325767 1347120 1359740 1362614 1355001 1337234 1310771 1277200 1237453 1192168 1142504 1090202 1036936
62666 1036936 983787 931277 879683 829419 781283 736293 695135 657754 623552 591913 562577
$$ packed form
62750A720436o9946p3379p5158p5994p5905p4720p2622o9851o6369o2201n7695
62739I46596n3161m8613m4195m0303l6955l3567k9838k6434k4181k2844k1292
62728E65213j8813j5797j3184j1486j0410r353q190p396p169o858n828m554m042
62715D42133m227l935k617j049JQ65K107L522M701N869P346Q879J0237J1902J4245
62700D99979J6650J8415K0053K2620K6000K8994L1124L3268L6283L9894M3251
62689H16531M6009M8374N0523N2305N3274N2893N0842M7216M2298L6268K9234
62678A325767K1353J2620K874p613j7767k6463l3571l9747m5285m9664n2302n3266
62666A036936n3149n2510n1594n0264m8136m4990m1158l7381l4202l1639k9336
$$ plain form
62655 562577 535653 511395 489832 470574 452982 436563 421189 407072 394620 384150 375435 367573
62643 367573 359609 351335 343326 336195 330022 324484 319236 314063 308873 303731 298819 294342 290421 286960
62629 286960 283561 279814 275875 272562 270591 269811 269407 268678 267421 265823 264336 263451 263178 262935 262366 261994
62613 261994 262576 264089 266006 268372 271768 276206 280955 285663 290837 296881 303385 309859 316550 324040
62599 324040 332524 342035 352920 365488 379473 394547 411240 430780 453917 480311 509163 540162
62587 540162 573659 610014 648847 689004 729339 769452 809422 848818 886280 920081 948835
62576 948835 971587 987612 996409 997704 991409 977764 957563 931976 902139 869198 834595 799650
62564 799650 764733 729452 693962 659550 627582 598371 571509 546826 524436 504157 485524
$$ packed form
62655E62577k6924k4258k1563j9258j7592j6419j5374j4117j2452j0470q715p862
62643C67573p964q274q009p131o173n538n248n173n190n142m912m477l921l461
62629B86960l399l747l939l313j971p80m04p29j257j598j487q85k73k43n69l72
62613B61994N82J513J917K366L396M438M749M708N174O044O504O474O691P490
62599C24040Q484R511J0885J2568J3985J5074J6693J9540K3137K6394K8852L0999
62587E40162L3497L6355L8833M0157M0335M0113L9970L9396L7462L3801K8754
62576I48835K2752J6025Q797J295o295j3645k0201k5587k9837l2941l4603l4945
62564G99650l4917l5281l5490l4412l1968k9211k6862k4683k2390k0279j8633
$$ plain form
62553 485524 468294 452498 438123 425101 413467 403062 393223 383180 372739 362205 351806 341638
62541 341638 332201 324381 318575 314073 309600 304456 298996 293997 289738 285902 282426 280101 279890 281726
62527 281726 284389 286724 288620 290701 293586 297708 303353 310324 317860 325403 333363 342688 353758 366156
62513 366156 379444 393757 409529 427016 446217 467086 489667 514131 540688 569348 599786
62502 599786 631465 663718 695637 726084 754059 778928 800092 816665 827790 833177 832956 827106
62490 827106 815469 798428 777188 753153 727227 699860 671536 642922 614637 587207 561299
62479 561299 537746 517055 498929 482520 467327 453724 442436 433555 426255 419510 412961 407045
62467 407045 402396 399168 396921 395097 393526 392315 391425 390749 390704 392206 395662 400321 405140 409986 415424
$$ packed form
62553D85524j7230j5796j4375j3022j1634j0405r839j0043j0441j0534j0399j0168
62541C41638r437p820n806m502m473n144n460m999m259l836l476k325k11J836
62527B81726K663K335J896K081K885M122N645O971P536P543P960R325J1070J2398
62513C66156J3288J4313J5772J7487J9201K0869K2581K4464K6557K8660L0438
62502E99786L1679L2253L1919L0447K7975K4869K1164J6573J1125N387k21n850
62490H27106j1637j7041k1240k4035k5926k7367k8324k8614k8285k7430k5908
62479E61299k3553k0691j8126j6409j5193j3603j1288q881p300o745o549n916
62467D07045m649l228k247j824j571j211q90o76m5J502L456M659M819M846N438
$$ plain form
62452 415424 421568 427989 434707 442410 451437 461252 471249 481412 491747 501654 510485 518268 525278 531122
62438 531122 534826 535798 534218 530468 524427 515462 503128 488013 471837 456320 441883 427814 413731
62425 413731 400265 388096 377040 366620 357039 348999 342828 338309 335068 332672 330684 329167 328883
62412 328883 330451 333500 337187 341268 346072 351577 357231 362679 368093 373762 379853 386574 394002 401702
62398 401702 409014 415814 422505 429149 435104 439731 442997 445081 445780 444699 441896 438009 433728 429301
62384 429301 424575 419448 414218 409479 405688 402899 400847 399143 397542 396395 396839 400089 406313 414586
62370 414586 424151 435241 448434 463851 481580 502347 526944 555230 586478 620593 658187 699476
62358 699476 743865 790781 840139 891635 944139 996162 1046466 1093806 1136436 1172353 1200058
$$ packed form
62452D15424O144O421O718P703R027R815R997J0163J0335R907Q831P783P010N844
62438E31122L704R72j580l750o041q965j2334j5115j6176j5517j4437j4069j4083
62425D13731j3466j2169j1056j0420r581q040o171m519l241k396j988j517k84
62412C28883J568L049L687M081M804N505N654N448N414N669O091O721P428P700
62398D01702P312O800O691O644N955M627L266K084O99j081k803l887m281m427
62384D29301m726n127n230m739l791k789k052j704j601j147M44L250O224Q273
62370D14586R565J1090J3193J5417J7729K0767K4597K8286L1248L4115L7594M1289
62358F99476M4389M6916M9358N1496N2504N2023N0304M7340M2630L5917K7705
$$ plain form
62347 1200058 1218964 1229254 1231506 1226284 1213987 1195186 1170992 1142724 1111096 1076087 1037805 997249
62335 997249 956018 915472 876379 839159 804146 771569 741449 713658 688069 664679 643522
62324 643522 624460 607061 590711 574815 558983 543271 528368 515337 504962 497333 492005 488321
62312 488321 485521 482966 480550 478691 477662 477163 476773 476475 476393 476251 475477 473633 470518 466179 461230 456762
62296 456762 453357 450422 447061 443404 440396 438404 436822 435100 433480 432560 432709 434081 436657 440021 443628
62281 443628 447477 452170 458073 464843 471870 478710 484988 490502 495760 501941 509933 519676 530695 542801
62267 542801 555958 569967 584827 601177 619875 641323 665624 693221 724831 760686 800309
62256 800309 843130 888995 937822 988956 1041011 1092278 1141085 1185836 1224874 1256527 1279398
$$ packed form
62347A200058J8906J0290K252n222j2297j8801k4194k8268l1628l5009l8282m0556
62335I97249m1231m0546l9093l7220l5013l2577l0120k7791k5589k3390k1157
62324F43522j9062j7399j6350j5896j5832j5712j4903j3031j0375p629n328l684
62312D88321k800k555k416j859j029m99l90k98q2j42p74j844l115m339m949m468
62296D56762l405k935l361l657l008j992j582j722j620r20J49J372K576L364L607
62281D43628L849M693N903O770P027O840O278N514N258O181P992R743J1019J2106
62267E42801J3157J4009J4860J6350J8698K1448K4301K7597L1610L5855L9623
62256H00309M2821M5865M8827N1134N2055N1267M8807M4751L9038L1653K2871
$$ plain form
62245 1279398 1292688 1296367 1291112 1277945 1257724 1230923 1198043 1160143 1118696 1074911 1029636 983999
62233 983999 939598 897665 858399 821602 787621 757130 730276 706758 686647 670403 657969
62222 657969 648520 641296 636138 632907 630891 629130 627076 624723 622395 620583 619681 619599 619834 620038 620256 620494
62206 620494 620457 619946 619236 618805 618899 619621 621277 624341 629103 635475 643096 651576 660748 670813 682235 695511
62190 695511 711034 728973 749074 770705 793372 817090 842005 867721 893367 918212 941799
62179 941799 963475 982241 997257 1008357 1016123 1021711 1026477 1031328 1036521 1042447 1050396 1061867 1077152
62166 1077152 1095364 1116026 1139796 1167158 1197013 1227205 1256044 1282787 1306966 1327952 1345148
62155 1345148 1358142 1366553 1370098 1368844 1363236 1353878 1341413 1326487 1309559 1290740 1270064 1248034
$$ packed form
62245A279398J3290L679n255j3167k0221k6801l2880l7900m1447m3785m5275m5637
62233I83999m4401m1933l9266l6797l3981l0491k6854k3518k0111j6244j2434
62222F57969r449p224n158l231k016j761k054k353k328j812r02q2K35K04K18K38
62206F20494l7n11p10m31R4P22J656L064M762O372P621Q480R172J0065J1422J3276
62190F95511J5523J7939K0101K1631K2667K3718K4915K5716K5646K4845K3587
62179I41799K1676J8766J5016J1100P766N588M766M851N193N926P949J1471J5285
62166A077152J8212K0662K3770K7362K9855L0192K8839K6743K4179K0986J7196
62155A345148J2994Q411L545j254n608r358j2465j4926j6928j8819k0676k2030
$$ plain form
62143 1248034 1225844 1204987 1186582 1171040 1158285 1148197 1140615 1134962 1130261 1125841 1121827 1118591
62131 1118591 1115925 1113218 1110376 1108108 1107257 1108187 1110923 1115459 1121758 1129681 1139058 1149703 1161402 1174096
62117 1174096 1188074 1203680 1220829 1238985 1257621 1276615 1296322 1317351 1339995 1363696 1387496
62106 1387496 1411297 1436149 1462822 1490700 1518758 1547089 1576526 1607195 1638571 1670748 1704436
62095 1704436 1739761 1776246 1814011 1853731 1895123 1936735 1977611 2017961 2057759 2096061 2132521
62084 2132521 2168437 2205347 2243523 2282749 2323565 2366459 2410417 2453501 2494609 2533870 2571716
62073 2571716 2608523 2644867 2681278 2717872 2754861 2793033 2833022 2874500 2916909 2960593 3006286
62062 3006286 3053723 3101594 3148711 3194415 3237986 3278519 3315409 3348349 3376978 3401194 3421682
$$ packed form
62143A248034k2190k0857j8405j5542j2755j0088p582n653m701m420m014l236
62131A118591k666k707k842k268q51R30K736M536O299P923R377J0645J1699J2694
62117A174096J3978J5606J7149J8156J8636J8994J9707K1029K2644K3701K3800
62106A387496K3801K4852K6673K7878K8058K8331K9437L0669L1376L2177L3688
62095A704436L5325L6485L7765L9720M1392M1612M0876M0350L9798L8302L6460
62084B132521L5916L6910L8176L9226M0816M2894M3958M3084M1108L9261L7846
62073B571716L6807L6344L6411L6594L6989L8172L9989M1478M2409M3684M5693
62062C006286M7437M7871M7117M5704M3571M0533L6890L2940K8629K4216K0488
$$ plain form
62051 3421682 3439454 3454848 3467463 3476786 3482336 3483580 3480578 3474525 3466818 3457666 3446405 3433001 3418364
62038 3418364 3403246 3387799 3372356 3357673 3344115 3331273 3318666 3306238 3294058 3282138 3270700
62027 3270700 3259973 3249601 3238866 3227630 3216367 3205102 3193130 3180200 3167343 3155968 3146505
62016 3146505 3138300 3130555 3123032 3116168 3110851 3107917 3107608 3109581 3113474 3119306 3127370 3138036 3151612 3168054
62002 3168054 3186793 3207107 3228561 3250729 3272712 3293448 3312413 3329467 3344028 3354904 3360903
61991 3360903 3361083 3354548 3340771 3320224 3294059 3263013 3227328 3187820 3146175 3103792 3060976 3017682
61979 3017682 2974431 2932070 2891053 2851366 2812724 2774532 2736193 2697904 2660726 2625400 2591523
61968 2591523 2558364 2526071 2495471 2466940 2440067 2414342 2389657 2366046 2343336 2321173 2299340
$$ packed form
62051C421682J7772J5394J2615R323N550J244l002o053p707r152j1261j3404j4637
62038C418364j5118j5447j5443j4683j3558j2842j2607j2428j2180j1920j1438
62027C270700j0727j0372j0735j1236j1263j1265j1972j2930j2857j1375r463
62016C146505q205p745p523o864n317k934l09J973L893N832Q064J0666J3576J6442
62002C168054J8739K0314K1454K2168K1983K0736J8965J7054J4561J0876N999
61991C360903J80o535j3777k0547k6165l1046l5685l9508m1645m2383m2816m3294
61979C017682m3251m2361m1017l9687l8642l8192l8339l8289l7178l5326l3877
61968B591523l3159l2293l0600k8531k6873k5725k4685k3611k2710k2163k1833
$$ plain form
61957 2299340 2278115 2258310 2240727 2225419 2211677 2198813 2186703 2175523 2165436 2156744 2149930 2145255
61945 2145255 2142697 2142490 2145209 2150845 2158314 2166562 2175875 2187373 2201214 2215971 2229932 2242585 2254659
61932 2254659 2267133 2280468 2294535 2308938 2323436 2338160 2353438 2369343 2385510 2401506 2417453
61921 2417453 2434322 2453539 2476269 2503252 2535477 2574804 2623478 2682997 2753910 2836884 2933555
61910 2933555 3046071 3176260 3325740 3496669 3691838 3914033 4165796 4449949 4770030
61901 4770030 5129887 5532800 5980786 6474105 7010539 7584308 8184981 8796958 9399681
61892 9399681 9968379 10475172 10890987 11188715 11347092 11353822 11207009 10915183 10496405 9976235
61882 9976235 9384334 8750535 8101733 7460156 6842728 6261130 5722507 5230554 4786461
$$ packed form
61957B299340k1225j9805j7583j5308j3742j2864j2110j1180j0087q692o814m675
61945B145255k558k07K719N636P469Q248R313J1498J3841J4757J3961J2653J2074
61932B254659J2474J3335J4067J4403J4498J4724J5278J5905J6167J5996J5947
61921B417453J6869J9217K2730K6983L2225L9327M8674N9519P0913Q2974R6671
61910B933555J12516J30189J49480J70929J95169K22195K51763K84153L20081
61901D770030L59857M02913M47986M93319N36434N73769O00673O11977O02723
61892I399681N68698N06793M15815K97728J58377O730j46813k91826m18778n20170
61882I976235n91901o33799o48802o41577o17428n81598n38623m91953m44093
$$ plain form
61873 4786461 4389408 4036822 3724789 3448808 3204708 2989226 2799824 2633980 2488728
61864 2488728 2360949 2248012 2148053 2059823 1982465 1915405 1858122 1809839 1769551 1736583 1711005
61853 1711005 1693187 1682849 1678757 1679499 1684296 1692772 1704107 1716926 1730046 1742878 1754830 1764711
61841 1764711 1771138 1773418 1771757 1766806 1759286 1750000 1739790 1729408 1719563 1711087 1704873 1701662 1701955 1705958
61827 1705958 1713395 1723465 1735181 1747618 1759638 1769617 1775839 1777180 1773234 1764007 1749937 1732105
61815 1732105 1711895 1690262 1667541 1643987 1620216 1597219 1576321 1559054 1546549 1538883 1535430 1536028
61803 1536028 1541402 1552308 1568686 1589986 1616032 1647175 1683815 1726080 1773878 1827018 1885401
61792 1885401 1949359 2019783 2097646 2183408 2277022 2378586 2488989 2609998 2743867 2892784
$$ packed form
61873D786461l97053l52586l12033k75981k44100k15482j89402j65844j45252
61864B488728j27779j12937r9959q8230p7358o7060n7283m8283m0288l2968k5578
61853A711005j7818j0338m092P42M797Q476J1335J2819J3120J2832J1952R881
61841A764711O427K280j661m951p520r286j0210j0382r845q476o214l211K93M003
61827A705958P437J0070J1716J2437J2020R979O222J341l946r227j4070j7832
61815A732105k0210k1633k2721k3554k3771k2997k0898j7267j2505p666l453N98
61803A536028N374J0906J6378K1300K6046L1143L6640M2265M7798N3140N8383
61792A885401O3958P0424P7863Q5762R3614J01564J10403J21009J33869J48917
$$ plain form
61782 2892784 3058593 3243038 3448406 3677931 3935551 4225328 4551303 4918139 5331930
61773 5331930 5800182 6330764 6930776 7606273 8362345 9202330 10126043 11128054 12196553
61764 12196553 13312152 14446473 15561738 16612279 17547518 18315832 18869657 19171574 19199483
61755 19199483 18949298 18435628 17691064 16762861 15706028 14575201 13419033 12277908 11182995
61746 11182995 10155664 9208235 8346114 7569779 6875933 6258834 5711991 5228969 4803066
61737 4803066 4427340 4095506 3802371 3543243 3313559 3109459 2928070 2766825 2623093
61728 2623093 2494909 2381390 2281741 2194172 2116324 2046383 1983149 1925341 1871557 1820883 1772940
61717 1772940 1727268 1683044 1639507 1596399 1554036 1513110 1474351 1438089 1404182 1372380 1342558
$$ packed form
61782B892784J65809J84445K05368K29525K57620K89777L25975L66836M13791
61773E331930M68252N30582O00012O75497P56072Q39985R23713J002011J068499
61764A2196553J115599J134321J115265J050541R35239P68314N53825L01917K7909
61755A9199483k50185n13670p44564r28203j056833j130827j156168j141125j094913
61746A1182995j027331r47429q62121p76335o93846o17099n46843m83022m25903
61737D803066l75726l31834k93135k59128k29684k04100j81389j61245j43732
61728B623093j28184j13519r9649q7569p7848o9941o3234n7808n3784n0674m7943
61717A772940m5672m4224m3537m3108m2363m0926l8759l6262l3907l1802k9822
$$ plain form
61706 1342558 1314503 1287783 1262193 1238063 1215848 1195570 1176874 1159411 1142824 1126554 1110096
61695 1110096 1093497 1077337 1062171 1048093 1034786 1021831 1009016 996434 984271 972487 960908
61684 960908 949667 939277 930152 922218 915069 908262 901338 893940 886190 878784 872452 867378 863243 859659
61670 859659 856410 853431 850625 847653 843955 839276 834129 829368 825167 820773 815349 808776 801560 794380
61656 794380 787889 782512 778185 774538 771515 769482 768624 768676 769445 771124 773866 777455 781638 786327 791192
61641 791192 795602 799308 802699 805975 808583 810000 810672 811669 813795 817503 823210 830961 840092 849857 860164
61626 860164 871152 882381 893215 903704 914158 923816 930871 934102 933836 930995 925852 918186 908203
61613 908203 896705 884446 871680 858362 844461 829985 814910 799363 783990 769852 757625
$$ packed form
61706A342558k8055k6720k5590k4130k2215k0278j8696j7463j6587j6270j6458
61695A110096j6599j6160j5166j4078j3307j2955j2815j2582j2163j1784j1579
61684I60908j1241j0390r125p934p149o807o924p398p750p406o332n074m135l584
61670H59659l249k979k806k972l698m679n147m761m201m394n424o573p216p180
61656G94380o491n377m327l647l023k033q58N2P69J679K742L589M183M689M865
61641G91192M410L706L391L276K608J417O72R97K126L708N707P751R131R765J0307
61626H60164J0988J1229J0834J0489J0454R658P055L231k66k841n143p666r983
61613I08203j1498j2259j2766j3318j3901j4476j5075j5547j5373j4138j2227
$$ plain form
61602 757625 746920 736736 726633 717088 708608 700968 693562 686134 678838 672035 666292 662192 659590
61589 659590 657471 655091 653035 652634 654496 658105 662665 667771 673368 679605 686753 694827 703378 712029
61575 712029 721137 731529 743724 757874 774195 792782 813061 834075 855512 877956 901990 927520
61563 927520 954059 981237 1008793 1036394 1063654 1090192 1115671 1140012 1163439 1186000 1207205
61552 1207205 1226607 1244585 1261956 1278796 1294265 1307813 1319928 1331271 1341505 1349449 1354277 1356194
61540 1356194 1355936 1353730 1348839 1340205 1327621 1312120 1295022 1276813 1257341 1236975 1217001 1198758
61528 1198758 1182778 1168990 1157399 1148239 1141606 1137245 1134818 1134431 1136838 1142937 1153014 1166730 1183973
61515 1183973 1205338 1231450 1262257 1297636 1338475 1386445 1442723 1507530 1581039 1664068 1757701
$$ packed form
61602G57625j0705j0184j0103r545q480p640p406p428p296o803n743m100k602
61589F59590k119k380k056m01J862L609M560N106N597O237P148Q074Q551Q651
61575G12029R108J0392J2195J4150J6321J8587K0279K1014K1437K2444K4034K5530
61563I27520K6539K7178K7556K7601K7260K6538K5479K4341K3427K2561K1205
61552A207205J9402J7978J7371J6840J5469J3548J2115J1343J0234P944M828J917
61540A356194k58k206m891q634j2584j5501j7098j8209j9472k0366j9974j8243
61528A198758j5980j3788j1591r160o633m361k427l87K407O099J0077J3716J7243
61515A183973K1365K6112L0807L5379M0839M7970N6278O4807P3509Q3029R3633
$$ plain form
61504 1757701 1862781 1980167 2111118 2257035 2418861 2596751 2789952 2996736 3214410
61495 3214410 3439255 3666138 3888247 4097661 4286345 4446615 4571282 4654548 4693399 4688039
61485 4688039 4641059 4556754 4441128 4301489 4145124 3978378 3806948 3636214 3470554 3312682
61475 3312682 3164287 3027125 2903001 2792893 2696690 2613793 2543629 2485761 2440020 2406544
61465 2406544 2385218 2375026 2374434 2382504 2399178 2424282 2456666 2494660 2537049 2583182 2632331 2683519
61453 2683519 2736002 2789413 2843182 2896223 2947578 2997127 3045280 3092194 3137824 3182638 3227507
61442 3227507 3272558 3316744 3359080 3399930 3440417 3480706 3519513 3555377 3587866 3617263 3643517
61431 3643517 3665905 3683670 3696653 3705178 3709374 3708743 3702490 3690238 3672279 3649171 3621384 3589546
$$ packed form
61504A757701J05080J17386J30951J45917J61826J77890J93201K06784K17674
61495C214410K24845K26883K22109K09414J88684J60270J24667Q3266L8851n360
61485D688039m6980q4305j15626j39639j56365j66746j71430j70734j65660j57872
61475C312682j48395j37162j24124j10108r6203q2897p0164n7868m5741l3476
61465B406544k1326j0192n92Q070J6674K5104L2384L7994M2389M6133M9149N1188
61453B683519N2483N3411N3769N3041N1355M9549M8153M6914M5630M4814M4869
61442C227507M5051M4186M2336M0850M0487M0289L8807L5864L2489K9397K6254
61431C643517K2388J7765J2983Q525M196o31o253j2252j7959k3108k7787l1838
$$ plain form
61419 3589546 3554768 3518448 3481732 3445346 3409840 3375869 3344273 3315965 3291587 3271291 3254993
61408 3254993 3242809 3234787 3230110 3227064 3224101 3220604 3216321 3210592 3202549 3191651 3177496 3159594 3138003
61395 3138003 3113983 3089388 3065690 3044208 3026896 3015993 3012955 3018553 3034016 3061249 3101894 3157033
61383 3157033 3227920 3316160 3422879 3548470 3693408 3858461 4043617 4247369 4467357 4700932
61373 4700932 4944546 5193209 5441051 5681778 5907943 6110518 6280353 6410462 6496845 6537838
61363 6537838 6533639 6486450 6400276 6280142 6131470 5959772 5770100 5566453 5351957 5129812
61353 5129812 4903962 4678808 4458262 4244989 4040401 3845405 3661132 3488799 3328971
61344 3328971 3181451 3046074 2923235 2813264 2715639 2629294 2553572 2488459 2433950 2389677
$$ packed form
61419C589546l4778l6320l6716l6386l5506l3971l1596k8308k4378k0296j6298
61408C254993j2184q022m677l046k963l497m283n729q043j0898j4155j7902k1591
61395C138003k4020k4595k3698k1482j7312j0903l038N598J5463K7233M0645N5139
61383C157033P0887Q8240J06719J25591J44938J65053J85156K03752K19988K33575
61373D700932K43614K48663K47842K40727K26165K02575J69835J30109Q6383M0993
61363F537838m199m7189q6174j20134j48672j71698j89672k03647k14496k22145
61353E129812k25850k25154k20546k13273k04588j94996j84273j72333j59828
61344C328971j47520j35377j22839j09971r7625q6345p5722o5113n4509m4273
$$ plain form
61334 2389677 2355211 2330320 2314737 2307904 2309132 2317890 2333812 2356565 2385803 2421079 2461538 2505649
61322 2505649 2551535 2597800 2644087 2690672 2737508 2783786 2828280 2869853 2907620 2941098 2970528
61311 2970528 2996781 3020579 3041918 3060468 3076232 3089354 3099462 3105730 3107588 3104938 3097684 3085577
61299 3085577 3068705 3047646 3022882 2994274 2961408 2924306 2883700 2840694 2796215 2750693 2704255
61288 2704255 2657239 2610399 2564528 2520165 2477901 2438679 2403398 2372425 2345866 2323986 2306765
61277 2306765 2293241 2282004 2272376 2264570 2258615 2253700 2248657 2242579 2234853 2225203 2213927 2201753 2189342
61264 2189342 2177285 2166488 2157907 2151762 2147570 2145074 2144595 2146368 2150258 2156510 2166280 2181110 2202265
61251 2202265 2230852 2268122 2315298 2373390 2443194 2524877 2617254 2717938 2824390 2934388 3045194
$$ packed form
61334B389677l4466k4891j5583o833J228Q758J5922K2753K9238L5276M0459M4111
61322B505649M5886M6265M6287M6585M6836M6278M4494M1573L7767L3478K9430
61311B970528K6253K3798K1339J8550J5764J3122J0108O268J858k650p254j2107
61299C085577j6872k1059k4764k8608l2866l7102m0606m3006m4479m5522m6438
61288B704255m7016m6840m5871m4363m2264l9222l5281l0973k6559k1880j7221
61277B306765j3524j1237r628p806n955m915n043o078p726r650j1276j2174j2411
61264B189342j2057j0797q581o145m192k496m79J773L890O252R770J4830K1155
61251B202265K8587L7270M7176N8092O9804Q1683R2377J00684J06452J09998J10806
$$ plain form
61240 3045194 3152741 3251903 3337099 3402625 3443321 3455769 3438803 3392783 3319024 3220293 3101241
61229 3101241 2967643 2825234 2679240 2534313 2394215 2261683 2138685 2026442 1925091
61220 1925091 1833971 1752547 1680545 1617102 1560719 1510559 1466929 1429823 1397812 1369266 1344029
61209 1344029 1322862 1305640 1291226 1279045 1269804 1264597 1263953 1267780 1275513 1286182 1298860 1313232
61197 1313232 1329456 1347512 1366956 1387056 1406704 1424512 1439569 1452018 1462376 1470436 1475413 1477075
61185 1477075 1476080 1473151 1468398 1461569 1452503 1441248 1428063 1413359 1397331 1379679 1360039 1338710
61173 1338710 1316608 1294393 1271885 1248382 1223402 1197128 1170310 1143744 1117739 1092094 1066523
61162 1066523 1040924 1015250 989529 964081 939324 915239 891491 868282 846585 827197 810007
$$ packed form
61240C045194J07547R9162Q5196O5526M0696J2448j6966m6020p3759r8731j19052
61229C101241j33598j42409j45994j44927j40098j32532j22998j12243j01351
61220A925091r1120q1424p2002o3443n6383n0160m3630l7106l2011k8546k5237
61209A344029k1167j7222j4414j2181r241n207o44L827P733J0669J2678J4372
61197A313232J6224J8056J9444K0100J9648J7808J5057J2449J0358Q060M977J662
61185A477075r95k929m753o829r066j1255j3185j4704j6028j7652j9640k1329
61173A338710k2102k2215k2508k3503k4980k6274k6818k6566k6005k5645k5571
61162A066523k5599k5674k5721k5448k4757k4085k3748k3209k1697j9388j7190
$$ plain form
61151 810007 794498 780426 767512 754922 741621 727039 711104 694055 676601 659743 643902
61140 643902 628618 613650 599827 588206 578883 571344 565562 561832 559872 559031 559277 561094 564424 568588
61126 568588 573294 578992 586025 594060 602533 611174 620029 629365 639528 650428 661254 671258 680714
61113 680714 690517 700897 711232 721147 731092 741599 752540 763318 773300 781856 788422 792789 795129
61100 795129 795603 794216 791068 786417 780547 773823 766881 760392 754584 749226 744052 739017 734265 729986
61086 729986 726093 721862 716284 709009 700596 691502 681452 670323 658981 648475 638798 629306 619969
61073 619969 611332 603516 596282 589937 585137 581756 578957 576467 574849 574309 574188 573958 573918 574501 575525 576509
61057 576509 577261 577901 578740 580255 582682 585573 588328 591138 594758 599251 603710 607425 610647 613991 617737
$$ packed form
61151H10007j5509j4072j2914j2590j3301j4582j5935j7049j7454j6858j5841
61140F43902j5284j4968j3823j1621r323p539n782l730j960q41K46J817L330M164
61126E68588M706N698P033Q035Q473Q641Q855R336J0163J0900J0826J0004R456
61113F80714R803J0380J0335R915R945J0507J0941J0778R982Q556O566M367K340
61100G95129M74j387l148m651n870o724o942o489n808n358n174n035m752m279
61086G29986l893m231n578p275q413r094j0050j1129j1342j0506r677r492r337
61073F19969q637p816p234o345m800l381k799k490j618n40j21k30m0N83J024R84
61057E76509P52O40Q39J515K427K891K755K810L620M493M459L715L222L344L746
$$ plain form
61042 617737 621854 626111 629941 632924 635623 639270 644361 650188 656008 661995 668728 676471 685379 695774
61028 695774 707658 720439 733594 747205 761506 776376 791700 807764 824755 842120 858915
61017 858915 874684 889778 904961 920903 937876 955766 974454 994160 1015337 1038369 1063642
61006 1063642 1091684 1122877 1157257 1194985 1236659 1282594 1332177 1384661 1440339 1500258 1565226
60995 1565226 1636097 1714728 1803512 1904023 2017157 2144340 2287399 2447644 2626850 2829452
60985 2829452 3062542 3334288 3655008 4040717 4513675 5098371 5818142 6695343 7751512
60976 7751512 9006401 10480188 12196101 14169214 16376931 18734343 21103134 23328804
60968 23328804 25270269 26805092 27838455 28345247 28418636 28259593 28085254 28018857 28046973
$$ packed form
61042F17737M117M257L830K983K699L647N091N827N820N987O733P743Q908J0395
61028F95774J1884J2781J3155J3611J4301J4870J5324J6064J6991J7365J6795
61017H58915J5769J5094J5183J5942J6973J7890J8688J9706K1177K3032K5273
61006A063642K8042L1193L4380L7728M1674M5935M9583N2484N5678N9919O4968
60995A565226P0871P8631Q8784J00511J13134J27183J43059J60245J79206K02602
60985B829452K33090K71746L20720L85709M72958N84696P19771Q77201J056169
60976G751512J254889J473787J715913J973113K207717K357412K368791K225670
60968B3328804J941465J534823J033363N06792P3389j59043j74339o6397K8116
$$ plain form
60959 28046973 28059930 27914654 27466054 26580136 25170344 23252123 20962115 18510435 16099699
60950 16099699 13869981 11891952 10186360 8743707 7538019 6537784 5712786 5035269
60942 5035269 4479254 4021545 3642904 3327376 3061309 2833631 2635956 2461577 2304977
60933 2304977 2162557 2032653 1914054 1805250 1705416 1614855 1533514 1459825 1391883 1328938
60923 1328938 1270670 1215532 1161115 1106298 1052229 1000967 953615 909943 869375 831918 798042
60912 798042 767849 740656 715642 692683 672205 654342 638667 624766 612554 601921 592531 584152
60900 584152 576846 570658 565439 561084 557576 554652 551821 548993 546820 546125 547149 549473 552555 556214
60886 556214 560744 566581 573746 581621 589447 596941 604202 611154 617450 622882 627434 630870 632668 632427
$$ packed form
60959B8046973J2957j45276m48600q85918j409792j918221k290008k451680k410736
60950A6099699k229718j978029j705592j442653j205688j000235q24998o77517
60942E035269n56015m57709l78641l15528k66067k27678j97675j74379j56600
60933B304977j42420j29904j18599j08804r9834r0561q1341p3689o7942o2945
60923A328938n8268n5138n4417n4817n4069n1262m7352m3672m0568l7457l3876
60912G98042l0193k7193k5014k2959k0478j7863j5675j3901j2212j0633r390q379
60900E84152p306o188n219m355l508k924k831k828k173o95J024K324L082L659
60886E56214M530N837P165P875P826P494P261O952O296N432M552L436J798k41
$$ plain form
60872 632427 630027 625426 618751 610666 602079 593284 583845 573581 563219 553696 545196 537315 529907 523289
60858 523289 517756 513352 510169 508438 508172 508984 510439 512471 515330 519284 524517 531265 539727 549801
60844 549801 561102 573482 587364 603161 620364 637614 653947 669655 685547 701576 716642
60833 716642 729750 740888 750647 759427 767349 774671 781743 788351 793450 795909 795607 793625 791293 789223
60819 789223 787264 785068 782434 779303 775803 772242 768739 764890 760105 754170 747182 739061 729654 719301
60805 719301 708665 697883 686469 674234 661746 649618 637933 626692 616230 606745 597960 589792
60793 589792 582904 578025 575124 573796 574053 576073 579514 583801 588886 595048 602163 609916 618589 628822
60779 628822 640550 652920 665410 678317 691829 705258 717659 728869 739500 750063 760463
$$ packed form
60872F32427k400m601o675q085q587q795r439j0264j0362r523q500p881p408o618
60858E23289n533m404l183j731k66Q12J455K032K859L954N233O748Q462J0074
60844E49801J1301J2380J3882J5797J7203J7250J6333J5708J5892J6029J5066
60833G16642J3108J1138R759Q780P922P322P072O608N099K459l02j982k332k070
60819G89223j959k196k634l131l500l561l503l849m785n935o988q121r407j0353
60805G19301j0636j0782j1414j2235j2488j2128j1685j1241j0462r485q785q168
60793E89792o888m879k901j328K57K020L441M287N085O162P115P753Q673J0233
60779F28822J1728J2370J2490J2907J3512J3429J2401J1210J0631J0563J0400
$$ plain form
60768 760463 770377 779813 789060 798031 805968 812260 817458 822910 829185 835430 840632 844926 849129 853489
60754 853489 857582 861121 864128 866575 868555 870643 873326 876151 878108 878867 878942 878746 878181 877173 875818
60739 875818 873861 870722 866307 861256 856147 850918 845182 838657 831173 822806 814130 805874 798201 790782
60725 790782 783632 777345 772334 768341 764789 761231 757423 753581 750599 749363 749637 750154 749919 748897 747330
60710 747330 745220 742736 740389 738307 735959 733043 730038 727390 724735 721597 718459 716431 716075 717120
60696 717120 719126 721799 724642 726847 727781 727387 726044 724116 721646 718414 714262 709203 703024 694965 684311
60681 684311 671312 657141 642820 628599 614451 600641 587604 575655 565045 555898 547924 540652
60669 540652 534198 529364 526724 526039 526750 528537 531081 533901 536876 540515 545144 550234 555014 559443 564034
$$ packed form
60768G60463R914R436R247Q971P937O292N198N452O275O245N202M294M203M360
60754H53489M093L539L007K447J980K088K683K825J957P59P5j96n65j008j355
60739H75818j957l139m415n051n109n229n736o525p484q367q676q256p673p419
60725G90782p150o287n011l993l552l558l808l842k982j236K74N17k35j022j567
60710G47330k110k484k347k082k348k916l005k648k655l138l138k028l56J045
60696G17120K006K673K843K205R34l94j343j928k470l232m152n059o179q059j0654
60681F84311j2999j4171j4321j4221j4148j3810j3037j1949j0610r147p974p272
60669E40652o454m834k640o85P11J787K544K820K975L639M629N090M780M429M591
$$ plain form
60654 564034 568970 573941 578615 582806 586336 589301 592366 596294 601143 606220 610789 614600 617919 621330
60640 621330 625318 629674 633542 636390 638732 641549 645286 649867 655410 662268 670450 679582 689540 700591
60626 700591 712895 726324 740819 756362 772473 788171 802715 816061 828415 839710 849722
60615 849722 858402 865729 871414 875011 876294 875312 872178 866976 859945 851635 842767 833834 824851 815582
60601 815582 806078 796777 787945 779197 769869 759765 749211 738410 727148 715356 703647 692948
60589 692948 683728 675876 669309 664407 661658 661076 662165 664432 667718 671977 676937 682187 687474 692660
60575 692660 697363 700907 702870 703644 704287 705734 708093 710690 712866 714768 717246 720842 725008 728590 731042
60560 731042 732849 734631 736149 736452 734845 731402 726623 720915 714503 707628 700595 693718 687410 682362
$$ packed form
60654E64034M936M971M674M191L530K965L065L928M849N077M569L811L319L411
60640F21330L988M356L868K848K342K817L737M581N543O858Q182R132R958J1051
60626G00591J2304J3429J4495J5543J6111J5698J4544J3346J2354J1295J0012
60615H49722Q680P327N685L597J283r82l134n202p031q310q868q933q983r269
60601H15582r504r301q832q748r328j0104j0554j0801j1262j1792j1709j0699
60589F92948r220p852o567m902k749n82J089K267L286M259M960N250N287N186
60575F92660M703L544J963P74O43J447K359K597K176J902K478L596M166L582K452
60560G31042J807J782J518L03j607l443m779n708o412o875p033o877o308n048
$$ plain form
60546 682362 679362 678715 679876 681948 684594 688366 694201 702936 715304 731906 752831 777526 805293
60533 805293 835578 867404 898969 928379 954581 976883 993716 1002800 1002886 994759 980231 960702
60521 960702 937150 911045 884644 860347 839910 824066 812682 805454 802479 803882 808832 815547
60509 815547 822626 830009 838237 847158 855973 864402 873225 883611 896254 911217 928331 947769 970521
60496 970521 998355 1033104 1075846 1126826 1186066 1253923 1331190 1418935 1518312 1630488 1756763
60485 1756763 1898798 2058551 2237941 2438595 2661635 2906839 3171185 3447842 3726446
60476 3726446 3993958 4235178 4433414 4572472 4639693 4628412 4538677 4376647 4153470 3883977
60466 3883977 3585138 3274337 2967486 2677084 2410812 2171535 1958845 1771149 1606895
$$ packed form
60546F82362l000o47J161K072K646L772N835Q735J2368J6602K0925K4695K7767
60533H05293L0285L1826L1565K9410K6202K2302J6833R084Q6q127j4528j9529
60521I60702k3552k6105k6401k4297k0437j5844j1384p228k975J403M950O715
60509H15547P079P383Q228Q921Q815Q429Q823J0386J2643J4963J7114J9438K2752
60496I70521K7834L4749M2742N0980N9240O7857P7267Q7745R9377J12176J26275
60485A756763J42035J59753J79390K00654K23040K45204K64346K76657K78604
60476C726446K67512K41220J98236J39058O7221j1281q9735j62030k23177k69493
60466C883977k98839l10801l06851k90402k66272k39277k12690j87696j64254
$$ plain form
60457 1606895 1464552 1342089 1236970 1146720 1069296 1002866 945503 895421 851427 812907 779403
60446 779403 750394 725425 704120 685978 670337 656580 644256 633048 622832 613657 605378 597364
60434 597364 588925 580050 571338 563158 555262 547325 539535 532417 526335 521268 516859 512630 508487 505000
60420 505000 502839 501809 500890 499410 497787 496975 497618 499937 503911 509113 514658 519782 524338 528538 532450
60405 532450 535976 539058 541678 543924 546251 549300 553223 557508 561682 565797 570041 574414 579156 584873
60391 584873 591676 598649 604781 610054 614978 619488 623060 625651 627650 629047 629559 629583 630087 631239 631881
60376 631881 630758 627803 623897 619909 616343 613531 611633 610486 609700 608912 607957 606968 606376 606592 607627 609152
60360 609152 610876 612651 614340 615997 618101 621181 625107 629254 633458 638385 644710 652353 660749 669428
$$ packed form
60457A606895j42343j22463j05119r0250p7424o6430n7363n0082m3994l8520l3504
60446G79403k9009k4969k1305j8142j5641j3757j2324j1208j0216r175q279q014
60434E97364q439q875q712q180p896p937p790p118o082n067m409m229m143l487
60420E05000k161j030r19j480j623q12O43K319L974N202N545N124M556M200L912
60405E32450L526L082K620K246K327L049L923M285M174M115M244M373M742N717
60391E84873O803O973O132N273M924M510L572K591J999J397N12K4N04J152O42
60376F31881j123k955l906l988l566k812j898j147p86p88r55r89n92K16J035J525
60360F09152J724J775J689J657K104L080L926M147M204M927O325P643Q396Q679
$$ plain form
60346 669428 677979 685873 692921 699732 707177 715317 723228 729938 735238 739476 742903 745464 747030 747585
60332 747585 747194 746012 744405 742887 741873 741542 742114 744140 748235 754314 761242 767467 772001 774722 775827
60317 775827 775322 773121 769379 764499 758822 752428 745190 736994 728033 719110 711487 706107 702798 700478
60303 700478 698281 696268 694849 693842 692692 691523 691276 692463 694287 695471 695758 696069 697347 699702 702639
60288 702639 705639 708386 710777 712922 714981 717019 719118 721487 724224 727161 730293 734121 739028 744375
60274 744375 748774 751396 752570 753144 753756 754761 756226 757816 759244 761037 764285 769394 775682 782555 790486
60259 790486 800336 812192 825413 839556 854838 871947 891687 914497 940066 967838 998213 1032667
60247 1032667 1072256 1116552 1164674 1216818 1274026 1336877 1405295 1479429 1559720 1646042 1737617
$$ packed form
60346F69428Q551P894P048O811P445Q140P911O710N300M238L427K561J566N55
60332G47585l91j182j607j518j014l31N72K026M095O079O928O225M534K721J105
60317G75827n05k201l742m880n677o394p238q196q961q923p623n380l309k320
60303G00478k197k013j419j007j150j169k47J187J824J184K87L11J278K355K937
60288G02639L000K747K391K145K059K038K099K369K737K937L132L828M907N347
60274G44375M399K622J174N74O12J005J465J590J428J793L248N109O288O873P931
60259G90486R850J1856J3221J4143J5282J7109J9740K2810K5569K7772L0375L4454
60247A032667L9589M4296M8122N2144N7208O2851O8418P4134Q0291Q6322R1575
$$ plain form
60236 1737617 1833977 1935343 2041698 2151893 2263781 2374734 2481921 2582702 2675260 2758643
60226 2758643 2831929 2893587 2941980 2976379 2997165 3005046 3000413 2983712 2956262 2920291 2878014 2831062
60214 2831062 2781132 2730811 2683029 2639757 2601907 2570622 2547897 2535659 2534868 2545900 2569118 2604549
60202 2604549 2651653 2710109 2780339 2862494 2955275 3056464 3164237 3277107 3392773 3507912
60192 3507912 3619163 3723569 3818003 3899000 3963640 4010316 4038487 4048027 4038953 4011598 3966967
60181 3966967 3906959 3834099 3750931 3659962 3564314 3467871 3374261 3286059 3205387 3134812 3076908
60170 3076908 3033276 3004693 2991906 2995464 3014918 3048978 3096419 3156066 3225889 3302862 3383855
60159 3383855 3466070 3546557 3622022 3689343 3745945 3789773 3819502 3834813 3836038 3823719 3799100
$$ packed form
60236A737617R6360J01366J06355J10195J11888J10953J07187J00781R2558Q3383
60226B758643P3286O1658M8393L4399K0786P881m633j6701k7450l5971m2277m6952
60214B831062m9930n0321m7782m3272l7850l1285k2725j2238p91J1032K3218L5431
60202B604549M7104N8456P0230Q2155R2781J01189J07773J12870J15666J15139
60192C507912J11251J04406R4434Q0997O4640M6676K8171R540r074k7355m4631
60181C966967o0008p2860q3168r0969r5648r6443r3610q8202q0672p0575n7904
60170C076908m3632k8583j2787L558J9454L4060M7441N9647O9823P6973Q0993
60159C383855Q2215Q0487P5465O7321N6602M3828K9729J5311J225j2319k4619
$$ plain form
60148 3799100 3764793 3724131 3679856 3634174 3589966 3550908 3520140 3499527 3490379 3494137 3512182 3545803
60136 3545803 3596588 3666107 3755001 3863283 3991924 4143298 4319475 4520707 4746125 4995267
60126 4995267 5268160 5564190 5881419 6216780 6566417 6925853 7289939 7652517 8006285
60117 8006285 8343682 8658159 8944242 9196376 9408512 9575232 9692767 9758610 9770819 9728300
60107 9728300 9631533 9482720 9285634 9045634 8769447 8464629 8139496 7803462 7466459 7137323
60097 7137323 6822913 6529003 6261234 6024539 5821989 5654794 5523241 5427228 5366216 5339151
60087 5339151 5344248 5378513 5437725 5517253 5612797 5720128 5834400 5949952 6060609 6160213 6243532
60076 6243532 6307173 6349502 6369577 6366613 6340589 6292709 6224849 6138886 6036774 5920583 5792031
$$ packed form
60148C799100l4307m0662m4275m5682m4208l9058l0768k0613r148L758J8045L3621
60136C545803N0785O9519Q8894J08282J28641J51374J76177K01232K25418K49142
60126D995267K72893K96030L17229L35361L49637L59436L64086L62578L53768
60117H006285L37397L14477K86083K52134K12136J66720J17535O5843J2209m2519
60107I728300r6767j48813j97086k40000k76187l04818l25133l36034l37003l29136
60097G137323l14410k93910k67769k36695k02550j67195j31553r6013o1012k7065
60087E339151N097L4265N9212P9528R5544J07331J14272J15552J10657R9604Q3319
60076F243532O3641M2329K0075k964k6024m7880o7860q5963j02112j16191j28552
$$ plain form
60065 5792031 5652492 5503830 5348592 5188941 5026204 4862311 4701032 4546732 4402069
60056 4402069 4267851 4144989 4035608 3942021 3865385 3805706 3762728 3736530 3727533 3736081 3761956
60045 3761956 3804339 3862443 3935918 4024289 4126035 4238469 4358308 4482001 4605657 4725136
60035 4725136 4836268 4934881 5016862 5078721 5118212 5134306 5126746 5095824 5042385 4967713 4873514
60024 4873514 4762279 4637431 4502801 4362120 4219243 4078496 3944121 3819254 3705707
60015 3705707 3604627 3517082 3444110 3386581 3345083 3319708 3310069 3315853 3337360 3375408 3430749
60004 3430749 3503752 3594417 3702396 3826985 3967203 4121656 4288101 4463142 4642457 4821095
59994 4821095 4993582 5154302 5298353 5422086 5522785 5598149 5646322 5666116 5656963 5618943
$$ packed form
60065E792031j39539j48662j55238j59651j62737j63893j61279j54300j44663
60056D402069j34218j22862j09381r3587p6636n9679m2978k6198q997Q548K5875
60045C761956M2383N8104P3475Q8371J01746J12434J19839J23693J23656J19479
60035D725136J11132R8613Q1981O1859L9491J6094p560l0922n3439p4672r4199
60024D873514j11235j24848j34630j40681j42877j40747j34375j24867j13547
60015C705707j01080q7545p2972n7529m1498k5375r639N784K1507L8048N5341
60004C430749P3003R0665J07979J24589J40218J54453J66445J75041J79315J78638
59994D821095J72487J60720J44051J23733J00699P5364M8173J9794r153l8020
$$ plain form
59984 5618943 5553158 5461832 5347805 5214342 5065694 4907264 4744672 4582912 4426766 4281338
59974 4281338 4151189 4039013 3945803 3872165 3818815 3785986 3773225 3779974 3805681 3849182 3908563
59963 3908563 3981864 4067414 4163266 4266874 4375611 4487100 4598634 4706689 4807700 4899361
59953 4899361 4980826 5051612 5110684 5156839 5189905 5211288 5223246 5227914 5227297 5224100 5221949 5224653
59941 5224653 5235743 5259090 5299409 5361341 5448197 5562260 5706247 5883660 6097357 6348225
59931 6348225 6635416 6957104 7310272 7689877 8088771 8498223 8907776 9304429 9672768
59922 9672768 9996901 10262741 10458716 10575270 10605307 10546138 10400877 10177595 9887433 9543777
59912 9543777 9162112 8758616 8347693 7940879 7547837 7177240 6835908 6527751 6254402
$$ packed form
59984E618943o5785r1326j14027j33463j48648j58430j62592j61760j56146j45428
59974D281338j30149j12176r3210p3638n3350l2829j2761O749K5707M3501N9381
59963C908563P3301Q5550R5852J03608J08737J11489J11534J08055J01011R1661
59953D899361Q1465P0786N9072M6155L3066K1383J1958M668o17l197k151K704
59941E224653J1090K3347M0319O1932Q6856J14063J43987J77413K13697K50868
59931F348225K87191L21688L53168L79605L98894M09452M09553L96653L68339
59922I672768L24133K65840J95975J16554L0037n9169j45261k23282k90162l43656
59912I543777l81665m03496m10923m06814l93042l70597l41332l08157k73349
$$ plain form
59903 6254402 6016817 5815819 5651551 5523315 5430218 5371673 5347207 5355959 5396357 5466189 5563155
59892 5563155 5685285 5830336 5994466 6171918 6356159 6540737 6718595 6881260 7019606
59883 7019606 7125288 7191145 7211065 7180925 7100000 6970808 6797604 6585744 6342368 6076375
59873 6076375 5796775 5511200 5226112 4947584 4681024 4430244 4197370 3983746 3790599
59864 3790599 3618761 3467977 3336708 3222810 3124551 3041040 2971668 2915214 2869542 2831972
59854 2831972 2799759 2770413 2742082 2713887 2685776 2657882 2630090 2602275 2574915 2549307 2527011
59843 2527011 2508925 2494858 2484000 2475592 2468984 2463110 2456241 2446262 2431094 2409173 2380109 2345020
59831 2345020 2305804 2264088 2221203 2178937 2139416 2104020 2073129 2047192 2027270 2014046 2007000
$$ packed form
59903F254402k37585k00998j64268j28236r3097n8545k4466Q752M0398O9832R6966
59892E563155J22130J45051J64130J77452J84241J84578J77858J62665J38346
59883G019606J05682O5857J9920l0140q0925j29192j73204k11860k43376k65993
59873F076375k79600k85575k85088k78528k66560k50780k32874k13624j93147
59864C790599j71838j50784j31269j13898r8259q3511o9372n6454m5672l7570
59854B831972l2213k9346k8331k8195k8111k7894k7792k7815k7360k5608k2296
59843B527011j8086j4067j0858q408o608n874o869r979j5168k1921k9064l5089
59831B345020l9216m1716m2885m2266l9521l5396l0891k5937j9922j3224p046
$$ plain form
59820 2007000 2005117 2007757 2014292 2023663 2035276 2049920 2069027 2093392 2123324 2159432 2202125 2250476
59808 2250476 2302516 2356537 2411331 2465450 2517336 2566245 2611971 2653555 2689152 2717366 2737937
59797 2737937 2751053 2757071 2757216 2753570 2747832 2740822 2733635 2728447 2727603 2732577 2744479 2764957 2795886
59784 2795886 2838609 2894191 2964149 3050416 3155012 3280450 3430163 3607692 3815331 4053993
59774 4053993 4324035 4625139 4954719 5306441 5670064 6031895 6375039 6680071 6927009
59765 6927009 7098205 7180919 7169063 7064409 6877149 6624896 6329617 6013517 5695660 5390336
59755 5390336 5107041 4851463 4626830 4434798 4275387 4146607 4045065 3967505 3911857 3876845
59745 3876845 3861115 3863069 3881254 3914551 3962189 4023925 4100060 4190978 4296905 4418351 4556489
$$ packed form
59820B007000j883K640O535R371J1613J4644J9107K4365K9932L6108M2693M8351
59808B250476N2040N4021N4794N4119N1886M8909M5726M1584L5597K8214K0571
59797B737937J3116O018J45l646n738p010p187n188q44M974J1902K0478L0929
59784B795886M2723N5582O9958Q6267J04596J25438J49713J77529K07639K38662
59774D053993K70042L01104L29580L51722L63623L61831L43144L05032K46938
59765F927009J71196Q2714j1856j04654j87260k52253k95279l16100l17857l05324
59755E390336k83295k55578k24633j92032j59411j28780j01542p7560n5648l5012
59745C876845j5730J954J8185L3297M7638O1736P6135R0918J05927J21446J38138
$$ plain form
59734 4556489 4712610 4887388 5081150 5294899 5530739 5791418 6079776 6398393 6749289
59725 6749289 7133866 7553359 8009052 8501510 9029476 9589684 10177347 10786194 11408172
59716 11408172 12033893 12653751 13258567 13839772 14390388 14906936 15390555 15846288 16281578
59707 16281578 16705499 17128535 17561644 18014132 18491408 18993919 19517512 20054190 20592380
59698 20592380 21117104 21611066 22056526 22436754 22736883 22945307 23055781 23068513 22989302 22828152
59688 22828152 22598892 22318916 22007761 21685207 21370305 21080931 20832919 20639404 20511443
59679 20511443 20458955 20490448 20612286 20829174 21145356 21564521 22088406 22715685 23441543 24256887
59669 24256887 25147240 26092309 27065959 28035663 28962376 29802621 30512310 31050177 31380597
$$ packed form
59734D556489J56121J74778J93762K13749K35840K60679K88358L18617L50896
59725F749289L84577M19493M55693M92458N27966N60208N87663O08847O21978
59716A1408172O25721O19858O04816N81205N50616N16548M83619M55733M35290
59707A6281578M23921M23036M33109M52488M77276N02511N23593N36678N38190
59698B0592380N24724M93962M45460L80228L00129K08424J10474J2732p9211j61150
59688B2828152k29260k79976l11155l22554l14902k89374k48012j93515j27961
59679B0511443n2488L1493J21838K16888L16182M19165N23885O27279P25858Q15344
59669B4256887Q90353R45069R73650R69704R26713Q40245P09689N37867L30420
$$ plain form
59660 31380597 31477152 31326436 30929914 30303398 29475795 28487202 27384846 26217333 25030022
59651 25030022 23862613 22747245 21706376 20752060 19887085 19106126 18396184 17738048 17109494
59642 17109494 16488264 15853856 15189872 14487596 13748122 12980841 12200061 11422510 10665499
59633 10665499 9944340 9269916 8648344 8082244 7571643 7114169 6705750 6341907 6018498
59624 6018498 5731543 5477057 5251334 5051332 4874713 4719589 4584151 4466513 4364891
59615 4364891 4277769 4203604 4140469 4086341 4039593 3998705 3961537 3925454 3888204 3848133 3803663
59604 3803663 3753327 3696573 3633815 3565435 3491381 3412040 3328862 3243756 3158503 3075042 2995483
59593 2995483 2921177 2852293 2788894 2731946 2682670 2641350 2607436 2580520 2560557 2547331 2540317
$$ packed form
59660C1380597R6555j50716l96522o26516q27603r88593j102356j167513j187311
59651B5030022j167409j115368j040869r54316q64975p80959p09942o58136o28554
59642A7109494o21230o34408o63984p02276p39474p67281p80780p77551p57011
59633A0665499p21159o74424o21572n66100n10601m57474m08419l63843l23409
59624F018498k86955k54486k25723k00002j76619j55124j35438j17638j01622
59615D364891q7122p4165o3135n4128m6748m0888l7168l6083l7250m0071m4470
59604C803663n0336n6754o2758o8380p4054p9341q3178q5106q5253q3461p9559
59593B995483p4306o8884o3399n6948m9276m1320l3914k6916j9963j3226p014
$$ plain form
59582 2540317 2539056 2543232 2552388 2565818 2582678 2602077 2623276 2645949 2669972 2694850 2719698 2743962
59570 2743962 2767733 2791180 2814163 2836788 2860003 2885312 2914181 2947901 2987635 3034271 3088452
59559 3088452 3150844 3222016 3302118 3391338 3490932 3603119 3729569 3870554 4025888 4195985
59549 4195985 4381451 4582294 4798241 5029343 5275412 5534876 5804618 6080693 6358821
59540 6358821 6634589 6903924 7163516 7410550 7642127 7855149 8046664 8214307 8356782
59531 8356782 8474018 8566390 8633818 8676476 8696853 8700570 8694668 8685577 8678946 8680407 8695376 8728217
59519 8728217 8782159 8859593 8961522 9086413 9229716 9384154 9540270 9687202 9813672 9908453
59509 9908453 9960478 9959896 9900104 9778626 9595894 9354153 9058247 8716485 8339270 7936931
$$ packed form
59582B540317j261M176R156J3430J6860J9399K1199K2673K4023K4878K4848K4264
59570B743962K3771K3447K2983K2625K3215K5309K8869L3720L9734M6636N4181
59559C088452O2392P1172Q0102Q9220R9594J12187J26450J40985J55334J70097
59549D195985J85466K00843K15947K31102K46069K59464K69742K76075K78128
59540F358821K75768K69335K59592K47034K31577K13022J91515J67643J42475
59531H356782J17236R2372O7428M2658K0377L717n902r091o631J461J4969L2841
59519H728217N3942P7434J01929J24891J43303J54438J56116J46932J26470R4781
59509I908453N2025n82n9792j21478j82732k41741k95906l41762l77215m02339
$$ plain form
59499 7936931 7519536 7098008 6683618 6285658 5910204 5561160 5241534 4953261 4696511
59490 4696511 4469957 4271789 4100370 3954147 3831269 3729547 3647029 3582587 3535611 3505161
59480 3505161 3489942 3489334 3503837 3534103 3580049 3641467 3718992 3813810 3926640 4057542 4206377
59469 4206377 4372874 4556463 4756570 4972665 5203195 5444489 5691130 5937154 6176305
59460 6176305 6401421 6604521 6777841 6914482 7008305 7054062 7048262 6990083 6881672 6727700
59450 6727700 6534274 6307814 6054866 5782794 5499843 5213873 4931177 4656665 4394420
59441 4394420 4147339 3916620 3702424 3505033 3324896 3161849 3014936 2882879 2764315
59432 2764315 2657829 2562364 2477494 2402857 2337574 2280647 2231598 2190117 2155365 2126275 2102345
$$ packed form
59499G936931m17395m21528m14390l97960l75454l49044l19626k88273k56750
59490D696511k26554j98168j71419j46223j22878j01722q2518o4442m6976l0450
59480C505161j5219o08J4503L0266M5946O1418P7525R4818J12830J30902J48835
59469D206377J66497J83589K00107K16095K30530K41294K46641K46024K39151
59460F176305K25116K03100J73320J36641R3823M5757n800n8179j08411j53972
59450F727700j93426k26460k52948k72072k82951k85970k82696k74512k62245
59441D394420k47081k30719k14196j97391j80137j63047j46913j32057j18564
59432B764315j06486r5465q4870p4637o5283n6927m9049m1481l4752k9090k3930
$$ plain form
59421 2102345 2083565 2069785 2060779 2056713 2057823 2063650 2073105 2085279 2099822 2116756 2136364 2158962
59409 2158962 2184174 2210595 2236584 2261086 2283352 2302556 2318637 2333222 2348944 2368127 2392828
59398 2392828 2425440 2467745 2519234 2577507 2640621 2708188 2780101 2855501 2933881 3016742 3107687
59387 3107687 3211155 3331199 3470909 3632537 3818221 4030645 4272774 4547143 4855741
59378 4855741 5200341 5582244 6001662 6457751 6948862 7471723 8020043 8584505 9154334
59369 9154334 9718550 10266061 10786121 11269974 11712172 12110086 12462492 12769054 13030902
59360 13030902 13251034 13433542 13582072 13698574 13783085 13834198 13849424 13825418 13758727 13646928
59350 13646928 13489111 13285546 13037700 12748918 12424490 12070471 11692758 11297320 10890177
$$ packed form
59421B102345j8780j3780r006m066J110N827R455J2174J4543J6934J9608K2598
59409B158962K5212K6421K5989K4502K2266J9204J6081J4585J5722J9183K4701
59398B392828L2612M2305N1489N8273O3114O7567P1913P5400P8380Q2861R0945
59387C107687J03468J20044J39710J61628J85684K12424K42129K74369L08598
59378D855741L44600L81903M19418M56089M91111N22861N48320N64462N69829
59369I154334N64216N47511N20060M83853M42198L97914L52406L06562K61848
59360A3030902K20132J82508J48530J16502Q4511N1113J5226k4006o6691j11799
59350A3646928j57817k03565k47846k88782l24428l54019l77713l95438m07143
$$ plain form
59341 10890177 10476096 10057532 9635499 9211170 8786301 8362935 7943691 7531983 7131231
59332 7131231 6744199 6373762 6023603 5697068 5395615 5119129 4867247 4639514 4434969
59323 4434969 4252849 4093254 3955821 3838215 3737404 3652179 3582843 3528591 3487036 3456562
59313 3456562 3437412 3429869 3432955 3445735 3468535 3501871 3545046 3596608 3655310 3719864 3788625 3860277
59301 3860277 3934161 4009159 4082891 4152697 4216808 4273855 4321939 4359176 4384909 4399686 4404271
59290 4404271 4399407 4386473 4367784 4346051 4323689 4302619 4284626 4271947 4267357 4273420 4291775 4323470
59278 4323470 4369711 4431614 4509274 4601804 4708341 4828243 4960006 5100398 5244767 5387684
59268 5387684 5523249 5645424 5748535 5827538 5878495 5899775 5892842 5861143 5808302 5737992 5655036
$$ packed form
59341A0890177m14081m18564m22033m24329m24869m23366m19244m11708m00752
59332G131231l87032l70437l50159l26535l01453k76486k51882k27733k04545
59323D434969j82120j59595j37433j17606j00811q5225o9336n4252m1555l0474
59313C456562j9150p543L086J2780K2800L3336M3175N1562N8702O4554O8761P1652
59301C860277P3884P4998P3732O9806O4111N7047M8084L7237K5733J4777M585
59290D404271m864j2934j8689k1733k2362k1070j7993j2679m590O063J8355L1695
59278D323470M6241O1903P7660R2530J06537J19902J31763J40392J44369J42917
59268E387684J35565J22175J03111P9003N0957K1280o933l1699n2841p0310q2956
$$ plain form
59257 5655036 5565018 5472348 5379624 5289174 5204069 5127093 5059607 5001902 4953799 4914245 4881008
59246 4881008 4851444 4823287 4794609 4763882 4730496 4694552 4655819 4613662 4568351 4521619 4475584
59235 4475584 4432069 4393499 4363473 4345541 4342040 4354835 4386553 4440351 4519007 4624999 4760999
59224 4760999 4929427 5131675 5368261 5639199 5943353 6277392 6635702 7010913 7393888
59215 7393888 7773287 8135739 8466719 8751540 8976446 9129791 9202897 9190460 9091010 8907380
59205 8907380 8646445 8318253 7935420 7512664 7065449 6608091 6152949 5710777 5290560
59196 5290560 4898570 4538227 4211107 3917396 3655446 3422250 3215169 3032627 2872870
59187 2872870 2733011 2609942 2501412 2405683 2320923 2245632 2179020 2120369 2068638 2023203 1984197
$$ packed form
59257E655036r0018r2670r2724r0450q5105p6976o7486n7705m8103l9554l3237
59246D881008k9564k8157k8678l0727l3386l5944l8733m2157m5311m6732m6035
59235D475584m3515l8570l0026j7932l501J2795L1718N3798P8656J05992J36000
59224D760999J68428K02248K36586K70938L04154L34039L58310L75211L82975
59215G393888L79399L62452L30980K84821K24906J53345P3106j2437r9450j83630
59205H907380k60935l28192l82833m22756m47215m57358m55142m42172m20217
59196E290560l91990l60343l27120k93711k61950k33196k07081j82542j59757
59187B872870j39859j23069j08530r5729q4760p5291o6612n8651n1731m5435l9006
$$ plain form
59176 1984197 1951440 1923689 1899647 1879158 1862693 1850234 1841352 1835916 1834051 1835852 1841692 1852292
59164 1852292 1867849 1887562 1910622 1937187 1967820 2002488 2040772 2082634 2128371 2178227 2232604
59153 2232604 2292209 2357392 2427698 2502482 2581455 2664130 2749361 2835956 2923231 3010368 3095795
59142 3095795 3177713 3254645 3324929 3386362 3437071 3476206 3503308 3517784 3519744 3510599 3491911 3464353
59130 3464353 3428711 3387324 3343414 3299440 3257103 3218490 3185991 3161183 3144744 3137490 3140679 3155354
59118 3155354 3182097 3221414 3273837 3339790 3419758 3514273 3623250 3745819 3881394 4030470
59108 4030470 4193789 4371227 4562114 4765946 4981848 5207702 5440541 5677236 5913815
59099 5913815 6144587 6362931 6562676 6737830 6881605 6987161 7049594 7066579 7037553 6963524
$$ packed form
59176A984197l2757k7751k4042k0489j6465j2459q882n436j865J801N840J0600
59164A852292J5557J9713K3060K6565L0633L4668L8284M1862M5737M9856N4377
59153B232604N9605O5183P0306P4784P8973Q2675Q5231Q6595Q7275Q7137Q5427
59142C095795Q1918P6932P0284O1433N0709L9135K7102J4476J960r145j8688k7558
59130C464353l5642m1387m3910m3974m2337l8613l2499k4808j6439p254L189J4675
59118C155354K6743L9317N2423O5953P9968R4515J08977J22569J35575J49076
59108D030470J63319J77438J90887K03832K15902K25854K32839K36695K36579
59099E913815K30772K18344J99745J75154J43775J05556O2433J6985k9026p4029
$$ plain form
59089 6963524 6847662 6695038 6511465 6302986 6075839 5835597 5586243 5330974 5073838
59080 5073838 4819547 4571629 4331713 4100749 3879894 3669997 3471204 3283582 3107510
59071 3107510 2943098 2789797 2646954 2514322 2391862 2279366 2176409 2082278 1995928 1916370
59061 1916370 1843092 1775862 1714280 1657918 1606623 1560184 1517892 1478908 1442820 1409342 1377820
59050 1377820 1347708 1319225 1292699 1267488 1242452 1217498 1193834 1172554 1153619 1136302 1120007
59039 1120007 1104571 1090371 1078245 1068854 1062035 1057191 1054198 1053446 1055098 1058863 1064502 1072037 1081427
59026 1081427 1092452 1104878 1118408 1132611 1147168 1161795 1175549 1186780 1194523 1199640 1203811 1207650
59014 1207650 1210572 1212239 1213176 1213977 1214790 1215773 1217421 1220310 1224972 1231920 1241182 1251860 1262690 1272992
$$ packed form
59089F963524j15862j52624j83573k08479k27147k40242k49354k55269k57136
59080E073838k54291k47918k39916k30964k20855k09897j98793j87622j76072
59071C107510j64412j53301j42843j32632j22460j12496j02957r4131q6350p9558
59061A916370p3278o7230o1582n6362n1295m6439m2292l8984l6088l3478l1522
59050A377820l0112k8483k6526k5211k5036k4954k3664k1280j8935j7317j6295
59039A120007j5436j4200j2126r391o819m844k993p52J652L765N639P535R390
59026A081427J1025J2426J3530J4203J4557J4627J3754J1231P743N117M171L839
59014A207650K922J667R37Q01Q13R83J648K889M662O948R262J0678J0830J0302
$$ plain form
59000 1272992 1282584 1290952 1297197 1300744 1301545 1299716 1295561 1289840 1283370 1276412 1269000 1261625 1255001 1249320
58986 1249320 1244448 1240645 1238394 1237636 1237919 1239217 1241817 1245506 1249643 1254050 1259090 1264805 1270744 1276806
58972 1276806 1283592 1291747 1301430 1312629 1325572 1340671 1358183 1377799 1398458 1419032 1439541 1461181
58960 1461181 1484647 1509013 1532930 1556332 1580043 1604242 1628461 1652903 1678669 1706635 1736855
58949 1736855 1769039 1802972 1838625 1876545 1917844 1963099 2011648 2062846 2117560 2177395 2242846
58938 2242846 2313294 2388515 2468945 2554733 2645862 2743252 2848408 2961886 3083375 3213510
58928 3213510 3354434 3508300 3676337 3859694 4060125 4279418 4519095 4781077 5067926
58919 5067926 5382085 5725591 6100571 6509313 6953767 7435765 7957588 8521161 9126285
$$ packed form
59000A272992R592Q368O245L547Q01j829m155n721o470o958p412p375o624n681
58986A249320m872l803k251p58K83J298K600L689M137M407N040N715N939O062
58972A276806O786Q155R683J1199J2943J5099J7512J9616K0659K0574K0509K1640
58960A461181K3466K4366K3917K3402K3711K4199K4219K4442K5766K7966L0220
58949A736855L2184L3933L5653L7920M1299M5255M8549N1198N4714N9835O5451
58938B242846P0448P5221Q0430Q5788R1129R7390J05156J13478J21489J30135
58928C213510J40924J53866J68037J83357K00431K19293K39677K61982K86849
58919E067926L14159L43506L74980M08742M44454M81998N21823N63573O05124
$$ plain form
58910 9126285 9770111 10447835 11152563 11874416 12600970 13318604 14012040 14662484 15247986
58901 15247986 15746715 16139641 16410859 16548138 16545213 16403186 16129246 15734927 15236022 14652408
58891 14652408 14005834 13317256 12605949 11889505 11183014 10498067 9843042 9224030 8645137
58882 8645137 8108407 7614139 7161244 6747363 6369451 6024814 5711278 5426283 5166474
58873 5166474 4928495 4709642 4507571 4320096 4145714 3983790 3833864 3695132 3566693
58864 3566693 3447797 3337787 3236377 3143844 3060142 2983901 2913281 2847876 2788698 2736118 2689066
58853 2689066 2646644 2609300 2577721 2551601 2530332 2514060 2503195 2497488 2496389 2499883 2508383 2522152
58841 2522152 2541331 2566141 2596651 2632692 2674310 2721893 2775727 2835908 2902757 2976665 3057454
$$ packed form
58910I126285O43826O77724P04728P21853P26554P17634O93436O50444N85502
58901A5247986M98729L92926K71218J37279k925j42027k73940l94319m98905n83614
58891A4652408o46574o88578p11307p16444p06491o84947o55025o19012n78893
58882H645137n36730m94268m52895m13881l77912l44637l13536k84995k59809
58873E166474k37979k18853k02071j87475j74382j61924j49926j38732j28439
58864C566693j18896j10010j01410r2533q3702p6241p0620o5405n9178n2580m7052
58853B689066m2422l7344l1579k6120k1269j6272j0865n707j099L494Q500J3769
58841B522152J9179K4810L0510L6041M1618M7583N3834O0181O6849P3908Q0789
$$ plain form
58830 3057454 3144697 3238860 3341312 3453006 3574068 3704960 3847099 4001927 4170253 4353007
58820 4353007 4551871 4768686 5005123 5263503 5547211 5859689 6203630 6581507 6996045
58811 6996045 7449515 7943065 8477075 9051349 9664106 10311016 10985274 11677789 12376676
58802 12376676 13067070 13731800 14351864 14906450 15374048 15735090 15974190 16080849 16049772
58793 16049772 15881640 15583234 15166521 14647855 14047424 13387429 12689177 11971485 11251034
58784 11251034 10542410 9856916 9202257 8583874 8005747 7469598 6974732 6519679 6103267
58775 6103267 5723617 5377267 5060306 4769704 4502850 4256742 4028577 3816519 3619125
58766 3619125 3434761 3262317 3101799 2953284 2815795 2687911 2568948 2458827 2357287
$$ packed form
58830C057454Q7243R4163J02452J11694J21062J30892J42139J54828J68326J82754
58820D353007J98864K16815K36437K58380K83708L12478L43941L77877M14538
58811F996045M53470M93550N34010N74274O12757O46910O74258O92515O98887
58802A2376676O90394O64730O20064N54586M67598L61042K39100J06659l1077
58793A6049772j68132k98406m16713n18666o00431o59995o98252p17692p20451
58784A1251034p08624o85494o54659o18383n78127n36149m94866m55053m16412
58775F103267l79650l46350l16961k90602k66854k46108k28165k12058j97394
58766C619125j84364j72444j60518j48515j37489j27884j18963j10121j01540
$$ plain form
58757 2357287 2263885 2178349 2100396 2029642 1965989 1909380 1858841 1812701 1770291 1732500 1700001
58746 1700001 1671800 1646324 1623109 1602579 1584805 1569301 1555508 1542782 1530514 1518760 1508064
58735 1508064 1498089 1487314 1474755 1461133 1447525 1433738 1418965 1403251 1387265 1371131 1354534
58724 1354534 1337551 1320463 1302995 1284530 1264846 1244039 1222057 1198828 1174624 1149914 1125191
58713 1125191 1101072 1077948 1055308 1032201 1008627 985593 963585 942098 921100 901726 884748
58702 884748 869429 854717 840578 827322 814633 802228 790643 780370 770905 761452 751838 741990
58690 741990 731384 719917 708631 698733 690544 684020 679384 676508 674593 673306 673409 675459 678809 682647
58676 682647 686962 691589 695319 697049 697018 696021 694325 692178 690341 689107 687821 686268 685379 685553 685638 684775
$$ packed form
58757B357287r3402q5536p7953p0754o3653n6609n0539m6140m2410l7791l2499
58746A700001k8201k5476k3215k0530j7774j5504j3793j2726j2268j1754j0696
58735A508064r975j0775j2559j3622j3608j3787j4773j5714j5986j6134j6597
58724A354534j6983j7088j7468j8465j9684k0807k1982k3229k4204k4710k4723
58713A125191k4119k3124k2640k3107k3574k3034k2008k1487k0998j9374j6978
58702H84748j5319j4712j4139j3256j2689j2405j1585j0273r465r453r614r848
58690G41990j0606j1467j1286r898q189o524m636k876j915j287J03K050L350L838
58676F82647M315M627L730J730l1r97j696k147j837j234j286j553q89J74Q5q63
$$ plain form
58660 684775 683903 683930 683737 681722 678291 674960 671795 667673 662539 657562 653345 649636 646642 645214 645811
58645 645811 648370 652872 659079 666261 674283 684283 697168 712109 727755 744103 761846 780772
58633 780772 800414 821610 845734 872810 901929 933088 967135 1004392 1044882 1089502 1139435
58622 1139435 1194724 1254985 1321273 1395809 1480165 1575059 1681582 1801147 1934452 2081774
58612 2081774 2243867 2421151 2612340 2815037 3027028 3245391 3464734 3677794 3877413
58603 3877413 4056581 4207360 4321881 4394590 4422491 4404067 4340024 4234890 4095993 3930714
58593 3930714 3745950 3549453 3349309 3151589 2959872 2776923 2605234 2446005 2299246
58584 2299246 2165093 2043756 1934487 1836131 1748602 1672294 1606245 1548466 1497903 1454489 1417485
$$ packed form
58660F84775q72K7j93k015l431l331l165m122n134m977m217l709k994j428N97
58645F45811K559M502O207P182Q022J0000J2885J4941J5646J6348J7743J8926
58633G80772J9642K1196K4124K7076K9119L1159L4047L7257M0490M4620M9933
58622A139435N5289O0261O6288P4536Q4356R4894J06523J19565J33305J47322
58612B081774J62093J77284J91189K02697K11991K18363K19343K13060J99619
58603C877413J79168J50779J14521P2709K7901j8424o4043j05134j38897j65279
58593C930714j84764j96497k00144j97720j91717j82949j71689j59229j46759
58584B299246j34153j21337j09269r8356q7529p6308o6049n7779n0563m3414l7004
$$ plain form
58573 1417485 1385530 1358166 1335474 1316238 1298290 1280831 1264726 1250464 1237497 1225609 1215147
58562 1215147 1205597 1195647 1184844 1173585 1161265 1146121 1127189 1104949 1079925 1052349 1023390 995015
58550 995015 968210 942823 919292 898853 881664 866414 852294 839964 830139 822606 817043 813489
58538 813489 811565 810373 809416 808550 807090 804256 800460 796724 792878 787774 781195 773874 765640 755297
58524 755297 742607 728741 714513 699748 684616 669954 655950 641972 628030 614967 603025
58513 603025 591650 580875 571430 563421 556402 550781 547500 546209 545403 544482 544071 544310 544541 544783 545733
58498 545733 547297 548914 551332 556022 562667 569203 574592 579628 584914 590231 596114 603691 612437 620296
58484 620296 626579 632659 639242 645295 650376 655759 662250 668929 675013 681010 687012 691807 694738 696728
$$ packed form
58573A417485l1955k7364k2692j9236j7948j7459j6105j4262j2967j1888j0462
58562A215147r550r950j0803j1259j2320j5144j8932k2240k5024k7576k8959k8375
58550I95015k6805k5387k3531k0439j7189j5250j4120j2330r825p533n563l554
58538H13489j924j192r57q66j460k834l796l736l846n104o579p321q234j0343
58524G55297j2690j3866j4228j4765j5132j4662j4004j3978j3942j3063j1942
58513F03025j1375j0775r445q009p019n621l281j291q06r21m11K39K31K42R50
58498E45733J564J617K418M690O645O536N389N036N286N317N883P577Q746P859
58484F20296O283O080O583O053N081N383O491O679O084N997O002M795K931J990
$$ plain form
58470 696728 698465 699207 698253 695953 692403 686765 678698 668874 657504 644197 629936 617127 606635
58457 606635 596645 585580 574445 565199 558327 553131 548993 545463 542402 540708 541516 544179 546613 548103
58443 548103 549975 553033 556344 559264 562626 567047 571952 577201 583848 592431 602169 612527 623680 634780
58429 634780 643833 650048 654343 656899 656532 653293 649304 645992 642815 639765 638553 639979 642601 645608
58415 645608 650659 659047 669145 678588 687194 695958 704805 713155 721310 729619 737525 744734 751965 759415
58401 759415 765887 770468 773464 774769 773143 768227 761392 753549 743990 732598 721218 711531 703351 696129
58387 696129 690275 685814 681785 678159 676397 676938 678150 678938 680217 682605 684848 685863 686190 686193 685175 683523
58371 683523 683304 685258 687580 689171 691632 696510 703042 710267 718890 729214 739593 748738 757384 766180
$$ packed form
58470F96728J737P42r54k300l550n638q067r824j1370j3307j4261j2809j0492
58457F06635r990j1065j1135r246o872n196m138l530l061j694Q08K663K434J490
58443E48103J872L058L311K920L362M421M905N249O647Q583R738J0358J1153J1100
58429F34780R053O215M295K556l67l239l989l312l177l050j212J426K622L007
58415F45608N051Q388J0098R443Q606Q764Q847Q350Q155Q309P906P209P231P450
58401G59415O472M581K996J305j626m916o835p843r559j1392j1380r687q180p222
58387F96129n854m461m029l626j762N41J212P88J279K388K243J015L27Lj018j652
58371F83523k19J954K322J591K461M878O532P225Q623J0324J0379R145Q646Q796
$$ plain form
58357 766180 774343 781962 790900 801634 811851 820078 828056 837622 847930 857715 867515 877530 885960
58344 885960 891670 895872 899122 899598 896540 892417 889249 885754 880663 875825 873293 872283 871780 873252 877813
58329 877813 883551 888683 894606 902897 912213 921256 931827 945574 960566 974507 988643 1004968 1022336
58316 1022336 1038939 1055937 1074838 1093847 1110672 1126473 1143254 1159701 1173545 1185642 1197779
58305 1197779 1208659 1216054 1220930 1225620 1230027 1233295 1236929 1242475 1248388 1253020 1258374 1267038 1277939
58292 1277939 1289067 1301716 1317712 1335040 1350747 1365883 1383195 1402271 1421443 1442003 1465802
58281 1465802 1491005 1514976 1539229 1566852 1597175 1627703 1659121 1693617 1730390 1767522 1806038
58270 1806038 1847430 1889480 1929267 1967853 2007348 2046077 2081615 2115767 2151414 2187382 2221644
$$ packed form
58357G66180Q163P619Q938J0734J0217Q227P978R566J0308R785R800J0015Q430
58344H85960N710M202L250M76l058m123l168l495n091m838k532j010n03J472M561
58329H77813N738N132N923Q291R316R043J0571J3747J4992J3941J4136J6325J7368
58316A022336J6603J6998J8901J9009J6825J5801J6781J6447J3844J2097J2137
58305A197779J0880P395M876M690M407L268L634N546N913M632N354Q664J0901
58292A277939J1128J2649J5996J7328J5707J5136J7312J9076J9172K0560K3799
58281A465802K5203K3971K4253K7623L0323L0528L1418L4496L6773L7132L8516
58270A806038M1392M2050L9787L8586L9495L8729L5538L4152L5647L5968L4262
$$ plain form
58259 2221644 2256499 2295065 2335804 2376227 2418663 2466424 2517708 2569587 2624509 2686239 2752901
58248 2752901 2820994 2892738 2972137 3057240 3143992 3234326 3332493 3436637 3542268 3650912 3767027
58237 3767027 3889550 4015059 4146116 4287678 4438437 4594678 4759319 4937920 5129309
58228 5129309 5329777 5542727 5774075 6022054 6282232 6558663 6859065 7183390 7528957
58219 7528957 7902373 8313775 8763848 9249776 9779366 10365450 11011740 11719610 12503703
58210 12503703 13384424 14370013 15463380 16681641 18051344 19591558 21323197 23290697
58202 23290697 25555277 28176438 31226112 34815845 39089284 44208140 50389797 57957582
58194 57957582 67316102 78872994 93003155 110055690 130335079 154080915 181478888
$$ packed form
58259B221644L4855L8566M0739M0423M2436M7761N1284N1879N4922O1730O6662
58248B752901O8093P1744P9399Q5103Q6752R0334R8167J04144J05631J08644J16115
58237C767027J22523J25509J31057J41562J50759J56241J64641J78601J91389
58228E129309K00468K12950K31348K47979K60178K76431L00402L24325L45567
58219G528957L73416M11402M50073M85928N29590N86084O46290P07870P84093
58210A2503703Q80721R85589J093367J218261J369703J540214J731639J967500
58202B3290697K264580K621161L049674L589733M273439N118856O181657P567785
58194E7957582R358520J1556892J4130161J7052535K0279389K3745836K7397973
$$ plain form
58187 181478888 212533748 246631258 282069590 316148156 345897145 368750590 382587081
58180 382587081 385541642 376406497 355576965 325532345 290151319 253345467 218038164
58173 218038164 185936117 157787116 133708040 113452925 96622445 82781090 71486638
58166 71486638 62310126 54881768 48915476 44187906 40516251 37763114 35837938 34674237
58158 34674237 34212949 34416062 35279112 36795413 38877040 41296500 43708853 45739423
58150 45739423 47055302 47374089 46470275 44258842 40907664 36832385 32529938 28388800
58142 28388800 24624197 21325832 18511568 16148201 14174570 12533158 11177513 10058067
58134 10058067 9122874 8334656 7671861 7112513 6631267 6211978 5848220 5529709 5240560
$$ packed form
58187A81478888L1054860L4097510L5438332L4078566K9748989K2853445J3836491
58180C82587081K954561r135145k0829532l0044620l5381026l6805852l5307303
58173B18038164l2102047k8149001k4079076k0255115j6830480j3841355j1294452
58166G1486638r176512p428358n966292m727570l671655k753137j925176j163701
58158C4674237m61288K03113Q63050J516301K081627K419460K412353K030570
58150D5739423J315879L18787r03814k211433l351178m075279m302447m141138
58142B8388800l764603l298365k814264k363367j973631j641412j355645j119446
58134A0058067r35193p88218o62795n59348m81246m19289l63758l18511k89149
$$ plain form
58125 5240560 4971567 4722012 4488457 4263365 4045725 3841791 3653756 3477632 3313098
58116 3313098 3165127 3034413 2915621 2806376 2708841 2621226 2536768 2452650 2371593 2293282
58106 2293282 2212691 2128631 2046052 1968060 1892920 1820520 1754416 1695577 1640818 1589114 1543102
58095 1543102 1502906 1464857 1427795 1394503 1365491 1337307 1308388 1280843 1255223 1229123 1202105
58084 1202105 1176385 1151679 1124885 1095925 1068280 1042714 1016086 987537 960222 935579 911451
58073 911451 887313 865988 848509 832359 816321 802180 790225 778000 764994 753679 744498 734740
58061 734740 723821 714719 708465 702182 694388 687416 682525 677229 669720 661665 654364 646302 636654 627312
58047 627312 619223 610476 600217 590828 584098 578619 572972 568142 564869 561889 558708 556872 556743 556228
$$ packed form
58125E240560k68993k49555k33555k25092k17640k03934j88035j76124j64534
58116C313098j47971j30714j18792j09245r7535q7615q4458q4118q1057p8311
58106B293282q0591q4060q2579p7992p5140p2400o6104n8839n4759n1704m6012
58095A543102m0196l8049l7062l3292k9012k8184k8919k7545k5620k6100k7018
58084A202105k5720k4706k6794k8960k7645k5566k6628k8549k7315k4643k4128
58073I11451k4138k1325j7479j6150j6038j4141j1955j2225j3006j1315r181r758
58061G34740j0919r102o254o283p794o972m891n296p509q055p301q062r648r342
58047F27312q089q747j0259r389o730n479n647m830l273k980l181j836j29n15
$$ plain form
58033 556228 554540 553915 555761 558269 559662 560709 562126 562608 561429 560060 559327 557824 555014 553058 553526
58018 553526 554957 555574 555887 556844 557940 558898 560674 563078 563897 562119 559544 557573 554935 550307 544630
58003 544630 539028 532880 525879 519656 515448 512251 509069 506844 506424 506659 506232 505393 504355 502076 498187
57988 498187 494054 490350 485753 479603 473642 469372 465778 461487 457198 454159 452131 450616 450273 451377
57974 451377 452642 453235 454280 456727 459515 461424 463006 464991 466514 466661 466183 466010 465513 463829 461474
57959 461474 459194 456642 453507 450448 447614 443814 438454 432724 427665 422726 417345 412104 407167 401675
57945 401675 396078 392853 393210 395130 396404 397510 399534 401469 401960 401922 402868 403963 403282 400882 398281 395656
57929 395656 391730 385914 378741 370662 361890 352832 343454 333079 322024 312290 305332 300295 295778 292056
$$ packed form
58033E56228j688o25J846K508J393J047J417M82j179j369p33j503k810j956M68
58018E53526J431O17L13R57J096R58J776K404Q19j778k575j971k638m628n677
58003E44630n602o148p001o223m208l197l182k225m20K35m27q39j038k279l889
57988D98187m133l704m597o150n961m270l594m291m289l039k028j515l43J104
57974D51377J265N93J045K447K788J909J582J985J523J47m78j73m97j684k355
57959D61474k280k552l135l059k834l800n360n730n059m939n381n241m937n492
57945D01675n597l225L57J920J274J106K024J935M91l8R46J095o81k400k601k625
57929C95656l926n816p173q079q772r058r378j0375j1055r734o958n037m517l722
$$ plain form
57915 292056 290092 289590 289680 290502 292629 295904 300131 305760 312583 319143 324855 331281 339768 349291 358295
57900 358295 367050 376184 384384 389923 393450 396949 400706 403503 405142 406505 407476 406835 404132 400039 395045
57885 395045 389270 383226 377391 371425 364972 358643 352967 347207 340612 334092 329161 325924 323521 321808
57871 321808 321042 320702 320241 320406 322225 325328 328763 332770 338065 344024 349335 353925 358597 363241 367153
57856 367153 370663 374643 378614 381097 381720 381423 380719 379249 377007 374523 371824 368511 364833 361555 358865
57841 358865 356377 353961 351520 348404 344151 339480 335478 332301 329673 327900 327054 325794 322542 317500
57827 317500 312160 307210 302209 296864 291207 284856 277477 269655 262076 254337 245864 237461 230460 224754
57813 224754 219187 213521 208489 204276 200491 197392 195568 194604 193564 192605 192649 193728 195117 196860 199608
$$ packed form
57915B92056j964n02R0Q22K127L275M227N629O823O560N712O426Q487R523R004
57900C58295Q755R134Q200N539L527L499L757K797J639J363R71o41k703m093m994
57885C95045n775o044n835n966o453o329n676n760o595o520m931l237k403j713
57871C21808p66l40m61J65J819L103L435M007N295N959N311M590M672M644L912
57856C67153L510L980L971K483O23k97p04j470k242k484k699l313l678l278k690
57841C58865k488k416k441l116m253m671m002l177k628j773q46j260l252n042
57827C17500n340m950n001n345n657o351p379p822p579p739q473q403p001n706
57813B24754n567n666n032m213l785l099j824r64j040r59M4J079J389J743K748
$$ plain form
57798 199608 203119 206514 209897 214241 219746 225790 232268 239361 246125 251061 254135 256630 258924 260129
57784 260129 260039 259765 260099 260764 261498 262329 262520 260836 257316 253366 249691 245531 240311 234622 229103 223743
57768 223743 218796 215044 212506 210067 207017 203953 201641 200040 198898 198282 198004 197523 196873 196835 197757 199164
57752 199164 200865 203440 207186 211462 215528 219223 222487 225081 227162 229315 231700 233939 236014 238389
57738 238389 241008 243129 244527 245991 248332 251614 255580 259989 264317 268006 271242 274774 278790 282839
57724 282839 286916 291652 297302 303460 309923 316859 324052 331067 338356 347011 357096 367333 376828 386076
57710 386076 395894 406381 417370 428922 440938 453219 466369 481726 499913 520270 542102 565696
57698 565696 591800 620966 653743 690567 731098 774543 820967 871495 927099 988380 1056875
$$ packed form
57798A99608L511L395L383M344N505O044O478P093O764M936L074K495K294J205
57784B60129r0k74L34O65P34Q31J91j684l520l950l675m160n220n689n519n360
57768B23743m947l752k538k439l050l064k312j601j142o16k78m81o50l8R22J407
57752A99164J701K575L746M276M066L695L264K594K081K153K385K239K075K375
57738B38389K619K121J398J464K341L282L966M409M328L689L236L532M016M049
57724B82839M077M736N650O158O463O936P193P015P289Q655J0085J0237R495R248
57710C86076R818J0487J0989J1552J2016J2281J3150J5357J8187K0357K1832K3594
57698E65696K6104K9166L2777L6824M0531M3445M6424N0528N5604O1281O8495
$$ plain form
57687 1056875 1135238 1225394 1327497 1441426 1568367 1710217 1868237 2042909 2234232 2441224
57677 2441224 2661566 2892139 3129190 3367422 3599708 3818412 4016707 4188583 4328781
57668 4328781 4433627 4501404 4531365 4522856 4475646 4390259 4267313 4107208 3911302 3683516
57658 3683516 3431207 3165315 2899208 2645362 2411651 2200939 2014015 1851575 1713095
57649 1713095 1595730 1495936 1411503 1341099 1282796 1234376 1194555 1162764 1138071 1119281 1105831
57638 1105831 1097714 1094777 1096779 1103882 1116426 1134455 1157978 1187361 1223009 1265116 1314197 1371421
57626 1371421 1437897 1514151 1600801 1699103 1810130 1933905 2070023 2218613 2379772 2552096
57616 2552096 2732228 2915494 3096434 3268958 3426538 3562245 3668677 3738789 3767666 3753584
$$ packed form
57687A056875P8363R0156J02103J13929J26941J41850J58020J74672J91323K06992
57677B441224K20342K30573K37051K38232K32286K18704J98295J71876J40198
57668D328781J04846O7777K9961q509m7210q5387j22946j60105j95906k27786
57658C683516k52309k65892k66107k53846k33711k10712j86924j62440j38480
57649A713095j17365r9794q4433p0404n8303m8420l9821l1791k4693j8790j3450
57638A105831q117k937K002P103J2544J8029K3523K9383L5648M2107M9081N7224
57626A371421O6476P6254Q6650R8302J11027J23775J36118J48590J61159J72324
57616B552096J80132J83266J80940J72524J57580J35707J06432P0112K8877j4082
$$ plain form
57606 3753584 3697483 3602272 3472994 3316658 3140838 2952527 2758405 2565045 2377698 2199132
57596 2199132 2030490 1873025 1728427 1597753 1480729 1375947 1281405 1195325 1117042 1046825
57586 1046825 984513 928835 878445 832925 792222 755743 722768 693146 666809 643100 621397
57575 621397 601920 584944 569611 554556 539640 526071 514664 504749 495092 485396 476590 469804
57563 469804 465181 461760 458640 456080 454989 455563 457181 459740 463961 469991 476733 483299 490211 498371
57549 498371 507645 517499 528312 540960 555572 571773 589790 610208 632903 657288 683475 712247
57537 712247 743979 778636 816830 859989 909341 965411 1028571 1099448 1178755 1267251 1365756
57526 1365756 1474562 1592974 1720014 1855309 1998357 2146849 2296371 2441711 2577766
$$ packed form
57606C753584n6101r5211j29278j56336j75820j88311j94122j93360j87347j78566
57596B199132j68642j57465j44598j30674j17024j04782r4542q6080p8283p0217
57586A046825o2312n5678n0390m5520m0703l6479l2975k9622k6337k3709k1703
57575F21397j9477j6976j5333j5055j4916j3569j1407r915r657r696q806o786
57563D69804m623l421l120k560j091N74J618K559M221O030O742O566O912Q160
57549D98371R274R854J0813J2648J4612J6201J8017K0418K2695K4385K6187K8772
57537G12247L1732L4657L8194M3159M9352N6070O3160P0877P9307Q8496R8505
57526A365756J08806J18412J27040J35295J43048J48492J49522J45340J36055
$$ plain form
57517 2577766 2699200 2800165 2874952 2918972 2929499 2906113 2850508 2765633 2655315 2524933
57507 2524933 2381559 2232166 2081687 1933402 1790640 1656786 1533650 1421166 1319067
57498 1319067 1227861 1147816 1078015 1017052 963959 917919 877763 842532 812219 787370 768109
57487 768109 753916 744117 738172 735629 736177 739783 746559 756512 769579 785815 805438 828667 855587
57474 855587 886312 921368 961868 1009130 1064082 1127246 1199229 1280805 1372355 1473607 1584113
57463 1584113 1703543 1831118 1965043 2102689 2240805 2375069 2499815 2608853 2696534 2757904
57453 2757904 2788536 2785235 2747146 2675970 2575297 2450105 2306533 2151312 1990916 1830989
57443 1830989 1675952 1528671 1390717 1263260 1147449 1043673 950999 867860 793054 725761
$$ packed form
57517B577766J21434J00965P4787M4020J0527k3386n5605q4875j10318j30382
57507B524933j43374j49393j50479j48285j42762j33854j23136j12484j02099
57498A319067r1206q0045o9801o0963n3093m6040m0156l5231l0313k4849j9261
57487G68109j4193r799n945k543N48L606O776R953J3067J6236J9623K3229K6920
57474H55587L0725L5056M0500M7262N4952O3164P1983Q1576R1550J01252J10506
57463A584113J19430J27575J33925J37646J38116J34264J24746J09038Q7681O1370
57453B757904L0632l301l8089p1176j00673j25192j43572j55221j60396j59927
57443A830989j55037j47281j37954j27457j15811j03776r2674q3139p4806o7293
$$ plain form
57433 725761 665124 610441 561443 517845 478964 444209 413421 386212 361487 338349 317027
57422 317027 298139 281454 266190 252115 239468 228059 217290 206925 197054 187602 178622 170718
57410 170718 164256 158405 151989 145106 138943 134056 129798 125398 120662 115601 110356 105524 101704 98638
57396 98638 95646 92799 90778 89608 88578 87438 86605 86014 84827 82598 79807 77021 74361 72006 70267
57381 70267 68865 67030 64645 62508 61189 60400 59717 59019 58009 56189 53732 51496 49835 48215 46363
57366 46363 44814 43838 42678 40485 37414 34341 32075 31119 31464 32205 32101 30939 29640 28775 27818 26272
57350 26272 24587 23412 22709 22232 22095 22306 22446 22373 22557 23184 23651 23516 23202 23181 23246 23246 23747 25180 27022
57331 27022 28603 30064 31759 33361 34405 35136 35930 36431 36203 35781 36116 37334 38864 40465 42229 43925
$$ packed form
57433G25761o0637n4683m8998m3598l8881l4755l0788k7209k4725k3138k1322
57422C17027j8888j6685j5264j4075j2647j1409j0769j0365r871r452q980p904
57410A70718o462n851o416o883o163m887m258m400m736n061n245m832l820l066
57396I8638k992k847k021j170j030j140q33n91j187k229k791k786k660k355j739
57381G0267j402j835k385k137j319p89o83o98j010j820k457k236j661j620j852
57366D6363j549r76j160k193l071l073k266r56L45P41j04j162j299q65r57j546
57350B6272j685j175p03m77j37K11J40p3J84O27M67j35l14k1O5%N01J433J842
57331B7022J581J461J695J602J044P31P94N01k28m22L35J218J530J601J764J696
$$ plain form
57315 43925 45233 46456 48241 50716 53573 56735 60266 63948 67669 71909 77040 82463 87246 91419
57301 91419 95825 100975 106917 113971 122518 132065 141559 150839 160906 172589 185678 199609 214321
57288 214321 230180 247731 267778 291104 317697 346580 376651 407420 438843 470903 503540
57277 503540 536554 569214 600099 627529 650124 666984 677622 681805 679381 670289 654872 634073
57265 634073 609027 580493 548817 514444 478314 441762 406074 372049 339983 310114 282956
57254 282956 258908 237771 219099 202983 189846 179539 171375 165034 160520 157010 152954 147965 143602
57241 143602 141409 141002 141016 141126 141987 143815 146307 149649 154250 159552 164314 168203 172131 176947 182783
57226 182783 189731 198033 207220 216052 223926 231848 241550 254015 268974 285301 301601 316950 331446
$$ packed form
57315D3925J308J223J785K475K857L162L531L682L721M240N131N423M783M173
57301I1419M406N150N942P054Q547R547R494R280J0067J1683J3089J3931J4712
57288B14321J5859J7551K0047K3326K6593K8883L0071L0769L1423L2060L2637
57277E03540L3014L2660L0885K7430K2595J6860J0638M183k424r092j5417k0799
57265F34073k5046k8534l1676l4373l6130l6552l5688l4025l2066k9869k7158
57254B82956k4048k1137j8672j6116j3137j0307q164o341m514l510m056m989m363
57241A43602k193m07J4J10Q61J828K492L342M601N302M762L889L928M816N836
57226A82783O948Q302R187Q832P874P922R702J2465J4959J6327J6300J5349J4496
$$ plain form
57213 331446 345934 361119 377158 393971 411471 429385 447305 464951 482181 498800 514709
57202 514709 530098 545200 560024 574683 589602 604896 619912 634060 647893 662616 678729
57191 678729 695882 713902 733122 753656 775104 797067 819384 841831 864146 886329 908392
57180 908392 929988 950902 971620 992675 1013750 1034429 1055549 1078575 1103561 1128937 1153609
57169 1153609 1178136 1203380 1229076 1254398 1279234 1304233 1330053 1356946 1384653 1412452 1439752
57158 1439752 1466770 1494115 1521724 1548932 1575541 1601925 1628025 1653290 1677855 1702698 1728268
57147 1728268 1753965 1779436 1805304 1831974 1858788 1885240 1912159 1940696 1970661 2000782 2030300
57136 2030300 2059606 2089604 2120947 2153507 2186128 2217214 2246013 2272930 2298437 2322410 2345012
$$ packed form
57213C31446J4488J5185J6039J6813J7500J7914J7920J7646J7230J6619J5909
57202E14709J5389J5102J4824J4659J4919J5294J5016J4148J3833J4723J6113
57191F78729J7153J8020J9220K0534K1448K1963K2317K2447K2315K2183K2063
57180I08392K1596K0914K0718K1055K1075K0679K1120K3026K4986K5376K4672
57169A153609K4527K5244K5696K5322K4836K4999K5820K6893K7707K7799K7300
57158A439752K7018K7345K7609K7208K6609K6384K6100K5265K4565K4843K5570
57147A728268K5697K5471K5868K6670K6814K6452K6919K8537K9965L0121K9518
57136B030300K9306K9998L1343L2560L2621L1086K8799K6917K5507K3973K2602
$$ plain form
57125 2345012 2367487 2391543 2418536 2449826 2487285 2532645 2586617 2648987 2719013 2795290 2875772
57114 2875772 2958450 3041724 3124253 3205691 3288469 3378346 3482838 3609643 3766273 3959217
57104 3959217 4192109 4465721 4781255 5143850 5563559 6055306 6639748 7343571 8198228
57095 8198228 9239517 10508956 12052998 13917752 16143022 18758428 21777270 25185556
57087 25185556 28934679 32948747 37144900 41453691 45827841 50232315 54612454 58851868
57079 58851868 62753394 66072017 68586252 70157818 70744791 70380393 69148771 67167402
57071 67167402 64566675 61467848 57974000 54177971 50173154 46055416 41919829 37859130
57063 37859130 33961680 30304406 26944149 23914071 21225738 18872965 16835893 15085939
$$ packed form
57125B345012K2475K4056K6993L1290L7459M5360N3972O2370P0026P6277Q0482
57114B875772Q2678Q3274Q2529Q1438Q2778Q9877J04492J26805J56630J92944
57104C959217K32892K73612L15534L62595M19709M91747N84442P03823Q54657
57095H198228J041289J269439J544042J864754K225270K615406L018842L408286
57087B5185556L749123M014068M196153M308791M374150M404474M380139M239414
57079E8851868L901526L318623K514235J571566N86973l64398j231622j981369
57071F7167402k600727l098827l493848l796029m004817m117738m135587m060699
57063C7859130l897450l657274l360257l030078k688333k352773k037072j749954
$$ plain form
57055 15085939 13590478 12315473 11226901 10292931 9486238 8784532 8169507 7626008 7141997
57046 7141997 6708433 6318738 5968196 5653290 5370899 5117804 4890722 4686334 4501184
57037 4501184 4332065 4176873 4034735 3904992 3786354 3677168 3575970 3481361 3391734 3305622
57027 3305622 3222158 3140940 3061928 2985885 2914520 2849479 2791147 2738754 2691457 2648873 2610623
57016 2610623 2575830 2543128 2510997 2478140 2443905 2408526 2373045 2339124 2308856 2284368 2267507
57005 2267507 2260243 2265440 2286693 2327246 2389466 2475053 2583881 2710929 2844466 2968301 3066024
56994 3066024 3123390 3128996 3076464 2968003 2815395 2636358 2449118 2268589 2104615 1961582
56984 1961582 1839635 1737063 1651769 1580943 1520736 1467329 1418010 1370754 1323456 1274526 1224042
$$ packed form
57055A5085939j495461j275005j088572r33970q06693p01706o15025n43499m84011
57046G141997m33564l89695l50542l14906k82391k53095k27082k04388j85150
57037D501184j69119j55192j42138j29743j18638j09186j01198r4609q9627q6112
57027C305622q3464q1218p9012p6043p1365o5041n8332n2393m7297m2584l8250
57016B610623l4793l2702l2131l2857l4235l5379l5481l3921l0268k4488j6861
57005B267507p264N197K1253M0553O2220Q5587J08828J27048J33537J23835R7723
56994C066024N7366N606n2532j08461j52608j79037j87240j80529j63974j43033
56984A961582j21947j02572q5294p0826o0207n3407m9319m7256m7298m8930n0484
$$ plain form
56973 1224042 1173635 1125294 1080634 1040819 1006386 977163 952772 933112 918077 907257 900436
56962 900436 897997 900194 906323 915316 926856 941120 957429 973901 988451 999579 1006203 1007342 1002132
56949 1002132 989856 970213 944193 914519 884414 855770 828979 804417 783175 766179 753321
56938 753321 743892 737432 733927 733687 737305 745417 758279 775667 796941 820649 844113 864054 877768
56925 877768 883370 879266 864391 839252 806109 767931 727685 688451 652987 622523 596524 574039
56913 574039 554781 538665 525127 513466 503328 494481 486667 480028 475064 471709 469052 466475 464428
56900 464428 463623 464162 466121 470278 477328 486797 497588 509343 522532 537459 554039 572429 593107
56887 593107 616197 641113 666773 691653 713838 731677 744402 751658 752574 745877 731079 709242
$$ packed form
56973A224042n0407m8341m4660l9815l4433k9223k4391j9660j5035j0820o821
56962I00436k439K197O129Q993J1540J4264J6309J6472J4550J1128O624J139n210
56949A002132j2276j9643k6020k9674l0105k8644k6791k4562k1242j6996j2858
56938G53321r429o460l505k40L618Q112J2862J7388K1274K3708K3464J9941J3714
56925H77768N602m104j4875k5139l3143l8178m0246l9234l5464l0464k5999k2485
56913E74039j9258j6116j3538j1661j0138q847p814o639m964l355k657k577k047
56900D64428q05N39J959M157P050R469J0791J1755J3189J4927J6580J8390K0678
56887E93107K3090K4916K5660K4880K2185J7839J2725P256R16o697j4798k1837
$$ plain form
56875 709242 682722 654463 627254 602902 581900 564210 550360 541593 539035 543105 553656 570365
56863 570365 593078 622158 658473 702590 753686 809108 864788 916091 958677 989039 1004403
56852 1004403 1002598 982920 947577 901750 851587 802075 756683 718015 687955 667439 656737
56841 656737 655970 665140 684189 713525 754076 806327 869749 943550 1027048 1118134 1211599 1300007
56829 1300007 1376106 1433642 1466447 1468759 1437894 1376682 1293150 1197908 1101107 1010244 929466
56818 929466 860455 803801 759615 727508 706931 697754 700162 714028 738840 774179 819752 874694
56806 874694 936804 1002237 1065768 1121765 1165259 1191862 1196939 1176487 1130399 1064564 988477 910426
56794 910426 835323 766093 705275 654670 614586 584239 562587 548711 542082 542693 550585 565255
$$ packed form
56875G09242k6520k8259k7209k4352k1002j7690j3850q767k558M070J0551J6709
56863E70365K2713K9080L6315M4117N1096N5422N5680N1303M2586L0362J5364
56852A004403j805j9678l5343m5827n0163m9512m5392l8668l0060k0516j0702
56841F56737p67R170J9049K9336M0551N2251O3422P3801Q3498R1086R3465Q8408
56829A300007P6099N7536L2805K312l0865o1212q3532r5242r6801r0863q0778
56818I29466o9011n6654m4186l2107k0577r177K408J3866K4812L5339M5573N4942
56806H74694O2110O5433O3531N5997M3494K6603N077k0452m6088o5835p6087p8051
56794I10426p5103o9230o0818n0605m0084l0347k1652j3876o629O11P892J4670
$$ plain form
56782 565255 586020 612571 644221 678588 711964 741070 763639 777327 779302 767642 742620 706499
56770 706499 662753 615541 568820 525132 485536 450703 421326 397284 377364 360403 346117
56759 346117 334479 324971 316850 309586 302749 296080 290012 285451 282622 280766 279236 278178 277725 277311
56745 277311 276451 275495 274955 274575 273746 272441 271133 270067 269142 268222 267059 265170 262297 258863 255610 252891
56729 252891 250511 248125 245747 243935 243396 244002 244448 243463 241217 238804 236572 234022 231376 229889 230097
56714 230097 230891 231069 230834 230951 231238 230863 229596 227892 226127 224465 223143 222280 221785 221825 222756 224131 224565
56697 224565 223331 221393 220107 219629 219448 219657 220489 221182 220724 219534 219104 219988 221294 222206 222844 223395 223502
56680 223502 223015 222564 222908 224249 226429 229158 231695 232994 232711 231799 231643 232777 234675 236483 237629 237887
$$ packed form
56782E65255K0765K6551L1650L4367L3376K9106K2569J3688J975j1660k5022l6121
56770G06499m3746m7212m6721m3688l9596l4833k9377k4042j9920j6961j4286
56759C46117j1638r508q121p264o837o669o068m561k829j856j530j058m53m14
56745B77311q60r56n40l80q29j305j308j066r25r20j163j889k873l434l253k719
56729B52891k380k386k378j812n39O06M46r85k246k413k232k550k646j487K08
56714B30097P94J78k35J17K87l75j267j704j765j662j322q63m95M0R31J375M34
56697B24565j234j938j286m78j81K09Q32O93m58j190m30Q84J306R12O38N51J07
56680B23502m87m51L44J341K180K729K537J299k83r12j56J134J898J808J146K58
$$ plain form
56664 237887 237291 236128 234858 233841 233093 232377 231575 230838 230199 229277 227749 226035 225002 224898 225105 225045 224777
56647 224777 224417 223610 222068 220178 218586 217442 216493 215599 214743 213809 212751 211744 210850 209845 208688 207787
56631 207787 207441 207401 207343 207368 207565 207554 207042 206512 206753 207941 209618 211327 212719 213320 212828 211519 210043 208930
56613 208930 208604 209430 211295 213382 214791 215152 214445 212804 210940 210057 210607 211529 211478 210464 209593 209597 210404 211820
56595 211820 213663 215364 216297 216558 216778 217207 217596 217835 218005 217905 217273 216465 216226 216731 217489 218181 218991 220032
56577 220032 221028 221677 221927 221901 221990 222895 225043 227998 230926 233553 236176 238972 241934 245371 249803 255355
56561 255355 261806 269121 277223 285375 292560 298638 304440 310562 316707 322415 327852 333505 339508 345515
56547 345515 351020 355600 359096 361637 363311 363904 363150 361118 358050 353968 348746 342458 335344 327629 319691
$$ packed form
56664B37887n96j163j270j017p48p16q02p37o39r22j528j714j033j04K07o0k68
56647B24777l60q07j542j890j592j144r49q94q56r34j058j007q94j005j157r01
56631B07787l46m0n8K5J97j1n12n30K41J188J677J709J392O01m92j309j476j113
56613B08930l26Q26J865K087J409L61p07j641j864q83N50R22n1j014q71MQ07J416
56595B11820J843J701R33K61K20M29L89K39J70j00o32q08k39N05P58O92Q10J041
56577B20032R96O49K50k6Q9R05K148K955K928K627K623K796K962L437M432N552
56561B55355O451P315Q102Q152P185O078N802O122O145N708N437N653O003O007
56547C45515N505M580L496K541J674N93p54k032l068m082n222o288p114p715p938
$$ plain form
56532 319691 312164 305468 299456 293826 288558 283572 278402 272805 267349 262770 259020 255618 252549 250082
56518 250082 247910 245357 242408 239752 237795 236281 234918 233719 232648 231555 230526 229838 229531 229461 229623
56503 229623 229911 229758 228680 227064 225784 225111 224654 224305 224451 225160 225804 225732 224942 223979 223484 223801 224711 225601
56485 225601 226088 226253 226173 225727 225164 225181 225958 226832 227526 228863 231441 234456 236878 239034 241742 244614 246729
56468 246729 248520 251314 255224 259099 262508 266069 269751 272623 274686 277228 280744 284039 286133 287711
56454 287711 289756 291979 293660 295113 297138 299639 301762 303118 304107 305235 306613 307972 308926 309394 309786
56439 309786 310344 310491 309507 307758 306307 305353 304069 302147 300303 298899 297265 294988 292854 291680 290994
56424 290994 289670 287286 284217 280929 277820 275320 273504 271861 269850 267398 264610 261432 257933 254471
$$ packed form
56532C19691p527o696o012n630n268m986n170n597n456m579l750l402l069k467
56518B50082k172k553k949k656j957j514j363j199j071j093j029o88l07p0J62
56503B29623K88j53j078j616j280o73m57l49J46P09O44p2p90r63m95L17R10Q90
56485B25601M87J65q0m46n63J7P77Q74O94J337K578L015K422K156K708K872K115
56468B46729J791K794L910L875L409L561L682K872K063K542L516L295K094J578
56454B87711K045K223J681J453K025K501K123J356R89J128J378J359R54M68L92
56439C09786N58J47r84j749j451r54j284j922j844j404j634k277k134j174o86
56424B90994j324k384l069l288l109k500j816j643k011k452k788l178l499l462
$$ plain form
56410 254471 251315 248450 245910 243872 242322 241069 240151 239693 239434 239009 238665 238985 239945 241103 242605 245011
56394 245011 248056 250679 252464 253922 255150 255483 255045 255406 257850 261821 265812 269005 271310 272563 272622
56379 272622 271897 271124 270754 270864 271289 271616 271510 271177 271054 271083 270972 271115 272289 274343 276199 277345 278379
56362 278379 279851 281646 283767 286571 289779 292438 294386 296619 299653 302575 304394 305262 305713 305782 305663
56347 305663 306166 307620 309282 310681 312586 315596 318642 320117 319990 319745 320550 322408 324729 326958 328834
56332 328834 330633 332939 335820 338684 341287 344290 348391 353550 359499 366279 373750 381221 388199 394974
56318 394974 402000 409315 416966 425322 434486 444006 453561 463234 472726 481181 488252 494517 500314 504993
56304 504993 507916 509441 510316 510773 510683 509859 507831 504178 499592 495767 493688 492800 492218 491874 492129 493180
$$ packed form
56410B54471l156k865k540k038j550j253r18m58k59m25l44L20R60J158J502K406
56394B45011L045K623J785J458J228L33m38L61K444L971L991L193K305J253N9
56379B72622p25p73l70J10M25L27j06l33j23K9j11J43J174K054J856J146J034
56362B78379J472J795K121K804L208K659J948K233L034K922J819Q68M51O9j19
56347C05663N03J454J662J399J905L010L046J475j27k45Q05J858K321K229J876
56332C28834J799K306K881K864K603L003M101N159N949O780P471P471O978O775
56318C94974P026P315P651Q356R164R520R555R673R492Q455P071O265N797M679
56304E04993K923J525Q75M57r0q24k028l653m586l825k079q88n82l44K55J051
$$ plain form
56288 493180 495318 498834 503344 508208 513881 521591 531408 542050 553060 565560 580201 596018 612266
56275 612266 629862 649925 672298 696664 723726 754111 787372 823309 863130 908053 957979
56264 957979 1012778 1073707 1142199 1218396 1302294 1395242 1498808 1613052 1737310 1871790 2016940
56253 2016940 2171984 2335353 2505736 2681356 2859035 3035209 3207079 3371556 3524034
56244 3524034 3659612 3774870 3867443 3935067 3976653 3993421 3987525 3960278 3913020 3848749 3771238
56233 3771238 3683257 3587038 3485705 3382571 3279469 3176999 3075680 2975592 2875701 2775036
56223 2775036 2673936 2572969 2471548 2368935 2265666 2162566 2059314 1955635 1853000
56214 1853000 1753511 1657824 1565764 1478146 1396265 1320232 1249436 1183972 1124019 1068605 1016727
$$ packed form
56288D93180K138L516M510M864N673P710R817J0642J1010J2500J4641J5817J6248
56275F12266J7596K0063K2373K4366K7062L0385L3261L5937L9821M4923M9926
56264I57979N4799O0929O8492P6197Q3898R2948J03566J14244J24258J34480J45150
56253B016940J55044J63369J70383J75620J77679J76174J71870J64477J52478
56244C524034J35578J15258R2573O7624M1586J6768n896k7247m7258o4271p7511
56233C771238q7981r6219j01333j03134j03102j02470j01319j00088r9891j00665
56223B775036j01100j00967j01421j02613j03269j03100j03252j03679j02635
56214A853000r9489r5687r2060q7618q1881p6033p0796o5464n9953n5414n1878
$$ plain form
56203 1016727 969070 926957 890156 857276 827687 801476 778152 757032 738301 722203 707839
56192 707839 694183 681500 670282 659813 649401 640038 632968 627555 622449 617920 615096 613750 612907
56179 612907 612828 614340 616936 619634 623017 628385 635558 643542 652588 663464 675511 687654 700636 715868
56165 715868 732713 749203 764859 780368 795058 807249 816830 825059 832101 837111 840462 843537 846463
56152 846463 848286 849168 850302 851998 854072 857728 864823 875618 889440 907053 930086 958729 992442
56139 992442 1032472 1081153 1139254 1206500 1284020 1373304 1473022 1579639 1690780 1805093 1919155
56128 1919155 2027719 2127275 2216806 2295443 2362451 2419490 2469676 2513905 2550513 2578325 2597183
56117 2597183 2605738 2602085 2586916 2563058 2531630 2491447 2442130 2384581 2318194 2240891 2152488 2055250
$$ packed form
56203A016727m7657m2113l6801l2880k9589k6211k3324k1120j8731j6098j4364
56192G07839j3656j2683j1218j0469j0412r363p070n413n106m529k824j346q43
56179F12907p9J512K596K698L383N368P173P984R046J0876J2047J2143J2982J5232
56165G15868J6845J6490J5656J5509J4690J2191R581Q229P042N010L351L075K926
56152H46463J823Q82J134J696K074L656P095J0795J3822J7613K3033K8643L3713
56139I92442M0030M8681N8101O7246P7520Q9284R9718J06617J11141J14313J14062
56128A919155J08564R9556Q9531P8637O7008N7039N0186M4229L6608K7812J8858
56117B597183Q555l653j5169k3858l1428m0183m9317n7549o6387p7303q8403r7238
$$ plain form
56105 2055250 1951174 1842030 1732288 1628285 1533568 1447972 1371724 1307012 1254687 1212712
56095 1212712 1178988 1152930 1133370 1117765 1104430 1093125 1082911 1072102 1060654 1049946 1039947
56084 1039947 1029486 1019290 1011465 1005792 999976 993879 989939 988888 988656 988151 988570 990281 991995 993854
56070 993854 997765 1003843 1009948 1015620 1022954 1032730 1043092 1052845 1062713 1072774 1082192 1092000 1104434
56057 1104434 1118954 1132750 1145567 1159905 1176011 1191253 1205214 1220738 1238804 1256963 1274099
56046 1274099 1292222 1312165 1332007 1351198 1371847 1394471 1416887 1438652 1462148 1487903 1513511
56035 1513511 1538506 1565603 1595713 1626542 1657496 1690945 1727098 1762857 1797415 1833886 1873710
56024 1873710 1914695 1956153 2000563 2048351 2096610 2144771 2195830 2250268 2304672 2358199 2414217
$$ packed form
56105B055250j04076j09144j09742j04003r4717q5596p6248o4712n2325m1975
56095A212712l3724k6058j9560j5605j3335j1305j0214j0809j1448j0708r999
56084A039947j0461j0196p825n673n816o097l940j051k32n05M19J711J714J859
56070I93854L911O078O105N672P334R776J0362R753R868J0061R418R808J2434
56057A104434J4520J3796J2817J4338J6106J5242J3961J5524J8066J8159J7136
56046A274099J8123J9943J9842J9191K0649K2624K2416K1765K3496K5755K5608
56035A513511K4995K7097L0110L0829L0954L3449L6153L5759L4558L6471L9824
56024A873710M0985M1458M4410M7788M8259M8161N1059N4438N4404N3527N6018
$$ plain form
56013 2414217 2473632 2533062 2591754 2653690 2720586 2789601 2860194 2936141 3018275 3102607 3188325
56002 3188325 3280021 3379213 3481587 3585684 3696087 3814721 3937541 4063535 4198291 4344655
55992 4344655 4498642 4658649 4829626 5013967 5207783 5410640 5629139 5866263 6117522
55983 6117522 6382457 6669021 6981478 7315632 7671801 8060321 8487927 8951345 9451255
55974 9451255 9999620 10606406 11273155 12007324 12828163 13750153 14776319 15916711 17197362
55965 17197362 18643025 20270973 22113297 24227225 26675360 29520703 32855187 36811864
55957 36811864 41544993 47241351 54179429 62746885 73370029 86442364 102319144 121319344
55949 121319344 143701590 169676564 199386005 232597493 268140441 303646917 336062116
$$ packed form
56013B414217N9415N9430N8692O1936O6896O9015P0593P5947Q2134Q4332Q5718
56002C188325R1696R9192J02374J04097J10403J18634J22820J25994J34756J46364
55992D344655J53987J60007J70977J84341J93816K02857K18499K37124K51259
55983F117522K64935K86564L12457L34154L56169L88520M27606M63418M99910
55974I451255N48365O06786O66749P34169Q20839R21990J026166J140392J280651
55965A7197362J445663J627948J842324K113928K448135K845343L334484L956677
55957C6811864M733129N696358O938078Q567456J0623144J3072335J5876780J9000200
55949A21319344K2382246K5974974K9709441L3211488L5542948L5506476L2415199
$$ plain form
55942 336062116 362520041 380721749 388709236 384882569 368793448 342017504 308013447
55935 308013447 270899522 234140188 199977577 169552537 143233934 120907064 102214704
55928 102214704 86723023 73976493 63510513 54897427 47789713 41906143 37001239
55921 37001239 32872686 29376226 26403456 23853240 21638792 19703485 18007163 16506957
55913 16506957 15166389 13969270 12906812 11960178 11108893 10344798 9663056 9048771 8485895
55904 8485895 7970687 7503855 7077467 6681323 6314564 5979620 5671444 5383051 5115054
55895 5115054 4869833 4642432 4426531 4223461 4036610 3862778 3697356 3542191 3400116
55886 3400116 3267302 3139016 3017604 2907002 2804474 2705332 2610820 2524005 2442576 2362942
$$ packed form
55942C36062116K6457925J8201708P987487l826667j6089121k6775944l4004057
55935C08013447l7113925l6759334l4162611l0425040k6318603k2326870j8692360
55928A02214704j5491681j2746530j0465980q613086p107714n883570m904904
55921C7001239m128553l496460k972770k550216k214448j935307j696322j500206
55913A6506957j340568j197119j062458r46634q51285p64095o81742o14285n62876
55904H485895n15208m66832m26388l96144l66759l34944l08176k88393k67997
55895E115054k45221k27401k15901k03070j86851j73832j65422j55165j42075
55886C400116j32814j28286j21412j10602j02528r9142r4512q6815q1429p9634
$$ plain form
55876 2362942 2286961 2217715 2152955 2089311 2028564 1973199 1920235 1866136 1813597 1766774 1723721
55865 1723721 1680217 1637325 1598498 1562608 1526505 1491499 1461037 1434699 1410451 1390005 1375917
55854 1375917 1365727 1354683 1341983 1328961 1313577 1292273 1265409 1235840 1204081 1169628 1134919
55843 1134919 1103115 1073879 1045738 1020459 1000666 985283 971738 960411 952571 946310 939068 931982
55831 931982 927112 922520 914721 904029 892866 880688 865294 847502 829869 812215 792717 772025
55819 772025 752026 732031 710459 688879 670091 653521 636729 620205 606384 595024 583887
55808 583887 573111 564754 558752 553342 548897 547474 549046 551718 555115 560155 566109 571236 575707 580577
55794 580577 584583 585291 582729 578705 573244 564982 554415 543504 532564 520650 508414 497574 488097
$$ packed form
55876B362942p5981o9246o4760o3644o0747n5365n2964n4099n2539m6823m3053
55865A723721m3504m2892l8827l5890l6103l5006l0462k6338k4248k0446j4088
55854A375917j0190j1044j2700j3022j5384k1304k6864k9569l1759l4453l4709
55843A134919l1804k9236k8141k5279j9793j5383j3545j1327p840o261p242p086
55831I31982m870m592p799j0692j1163j2178j5394j7792j7633j7654j9498k0692
55819G72025j9999j9995k1572k1580j8788j6570j6792j6524j3821j1360j1137
55808E83887j0776q357o002n410m445j423J572K672L397N040N954N127M471M870
55794E80577M006P08k562m024n461q262j0567j0911j0940j1914j2236j0840r477
$$ plain form
55781 488097 478868 470509 464603 460802 457527 454786 453337 451891 448203 442327 435862 428713 419661 409448
55767 409448 400158 392039 384064 377089 373238 372323 371816 370276 368104 365183 360524 354114 346629 337689 326849
55752 326849 315720 306499 298912 291173 283261 276476 270531 264157 258123 254442 252757 250587 247103 243738
55738 243738 241048 237989 234516 232123 231356 231215 231289 232220 233933 235586 237209 239174 240316 238900 235275
55723 235275 231180 226772 220885 213950 207912 203267 198817 194365 191011 188726 186292 183860 182942 183637 184392
55708 184392 184827 186288 189292 192922 197052 202651 209367 215219 219286 222525 225511 227547 228425 228828 228568
55693 228568 226660 223625 221541 221251 221604 221871 222826 224916 227504 230403 234092 237908 240147 240545 240668 241347
55677 241347 241736 241427 241334 241775 241673 240414 238627 236519 233329 229163 225506 223197 221592 220290 219829 220074
$$ packed form
55781D88097r229q359n906l801l275k741j449j446l688n876o465p149r052j0213
55767D09448r290q119p975o975l851r15n07j540k172k921m659o410p485q940j0840
55752C26849j1129r221p587p739p912o785n945o374o034l681j685k170l484l365
55738B43738k690l059l473k393p67j41P4R31J713J653J623J965J142j416l625
55723B35275m095m408n887o935o038m645m450m452l354k285k434k432r18O95P55
55708A84392M35J461L004L630M130N599O716N852M067L239K986K036Q78M03k60
55693B28568j908l035k084k90L53K67R55K090K588K899L689L816K239L98J23O79
55677B41347L89l09r3M41j02j259j787k108l190m166l657k309j605j302m61K45
$$ plain form
55661 220074 219813 218734 217998 218162 218329 218147 218843 221250 224448 227304 229967 232964 236122 239096 241750 243515
55645 243515 243677 242652 241513 239906 236118 229639 221960 214338 206614 198776 191790 186020 180528 174836
55631 174836 169751 165574 161142 155606 149677 144174 138873 133685 129453 126482 123670 120185 116760 114323
55617 114323 112532 110686 108954 107700 106654 105619 104982 104749 104174 103115 102597 103155 103837 103755 103483 103851 104410
55600 104410 104221 103387 102706 102439 102326 102253 102073 101290 99661 97729 96269 95616 95710 96246 96613 96362 95825 95480
55582 95480 94845 93149 91039 90211 91104 92361 92955 93372 94146 94743 94681 94511 94822 95389 96127 97800 100877 104560
55564 104560 107736 110199 112309 114223 115941 117290 117460 115462 111467 106782 102226 97621 93163 89852
55550 89852 87955 86328 84070 81730 80136 79123 78217 77552 77320 77259 77385 78288 79981 81453 82167 83040 85083
$$ packed form
55661B20074k61j079p36J64J67j82O96K407L198K856K663K997L158K974K654J765
55645B43515J62j025j139j607l788o479p679p622p724p838o986n770n492n692
55631A74836n085m177m432n536n929n503n301n188m232k971k812l485l425k437
55617A14323j791j846j732j254j046j035o37k33n75j059n18N58O82q2k72L68N59
55600A04410j89q34o81k67j13p3j80p83j629j932j460o53R4N36L67k51n37l45
55582I5480o35j696k110q28Q93J257N94M17P74N97o2j70L11N67P38J673L077L683
55564A04560L176K463K110J914J718J349J70j998l995m685m556m605m458l311
55550H9852j897j627k258k340j594j013r06o65k32o1J26R03J693J472P14Q73K043
$$ plain form
55533 85083 87974 90833 93557 96464 99292 101442 102761 103452 103686 103827 104453 105693 107078 108316 109495
55518 109495 110338 110185 109042 107661 106270 104263 101480 98603 95807 92311 88004 84262 82219 81160 79569
55503 79569 76941 73706 70185 66539 63187 60487 58361 56707 55646 55110 54831 54935 55702 56581 56552 55681
55487 55681 55149 55380 55472 54919 54432 54349 53711 51929 50018 49081 48620 47587 46142 45205 44982 45000 45022 45054 45054 45383
55467 45383 46777 49120 51014 51322 50428 49326 48359 47635 47680 48683 49833 50331 50366 50301 49752 48423 47111
55450 47111 46852 47591 48513 49161 49443 49193 48512 48065 48298 48822 49045 48826 48150 46985 45883 45711 46303 46428
55432 46428 45678 45216 45928 47056 47566 47650 47900 48162 48338 49205 51133 52966 53490 53181 53222 53552 53269 52321 51398
55413 51398 50642 49734 48858 48456 48357 48192 48267 49141 50704 52447 54138 55556 56278 56491 57139 58413 59083 58326
$$ packed form
55533H5083K891K859K724K907K828K150J319O91K34J41O26J240J385J238J179
55518A09495Q43j53j143j381j391k007k783k877k796l496m307l742k043j059j591
55503G9569k628l235l521l646l352k700k126j654j061n36k79J04P67Q79k9q71
55487E5681n32K31R2n53m87q3o38j782j911r37m61j033j445r37k23J8K2L2%L29
55467D5383J394K343J894L08q94j102r67p24M5J003J150M98L5o5n49j329j312
55450D7111k59P39R22O48K82k50o81m47K33N24K23k19o76j165j102j72N92J25
55432D6428p50m62P12J128N10Q4K50K62J76Q67J928J833N24l09M1L30k83r48r23
55413E1398p56r08q76m02r9j65P5Q74J563J743J691J418P22K13O48J274O70p57
$$ plain form
55395 58326 57176 56966 57316 57015 56029 55145 54393 53314 52188 51481 50681 49195 47832 47775 48494 48412 47385 46830
55377 46830 47431 48327 48755 48997 49417 49785 49926 50094 50488 51118 52096 53329 54101 53856 53046 52363 51515 49881
55359 49881 47928 46639 45772 44131 41577 39410 38529 38404 38176 37763 37530 37637 38044 38608 39098 39551 40437
55342 40437 41879 43100 43337 42936 42661 42389 41508 40253 39481 39267 38894 38167 37613 37359 36888 36079 35534 35670
55324 35670 36266 37005 37795 38503 38976 39265 39344 38822 37614 36513 36340 36904 37530 38170 39081 39935 40339 40813 42058
55305 42058 43576 44262 44147 44261 44851 45050 44342 43173 42042 41146 40977 42021 43650 44389 43640 42229 41160
55288 41160 40734 41025 42157 43848 45489 46899 48230 49194 49226 48413 47342 46124 44585 43346 43453 44749
55272 44749 45732 45335 43855 41971 39938 38108 37167 37266 37687 37801 37787 38148 39111 40595 42167 43005 42680 41920
$$ packed form
55395E8326j150k10L50l01r86q84p52j079j126p07q00j486j363n7P19q2j027n55
55377D6830O01Q96M28K42M20L68J41J68L94O30R78J233P72k45q10o83q48j634
55359D9881j953j289q67j641k554k167q81j25k28m13k33J07M07N64M90M53Q86
55342D0437J442J221K37m01k75k72q81j255p72k14l73p27n54k54m71q09n45J36
55324C5670N96P39P90P08M73K89P9n22j208j101j73N64O26O40R11Q54M04M74J245
55305D2058J518O86j15J14N90J99p08j169j131q96j69J044J629P39p49j411j069
55288D1160m26K91J132J691J641J410J331R64L2q13j071j218j539j239J07J296
55272D4749R83l97j480j884k033j830r41R9M21J14j4L61R63J484J572Q38l25p60
$$ plain form
55254 41920 41811 42277 42314 41626 40934 40590 40068 39119 38354 38297 38756 39426 40217 40752 40547 39973 40062 41029 41940 42200
55234 42200 42302 42625 42585 41718 40735 40689 41667 42914 43797 44126 44030 43959 44382 45147 45555 45335 45004 45102 45594 46234
55214 46234 46860 47115 46589 45516 44733 44585 44501 43902 42949 42077 41409 41015 41167 41955 42984 43741 43940 43494 42608
55195 42608 41919 41920 42202 41905 40954 40143 39948 40084 40406 41281 42713 43886 44137 43836 43830 44466 45505 46625 47685
55176 47685 48763 50063 51494 52451 52441 51797 51214 50756 49987 48886 47798 46616 45014 43485 43088 43915 44800
55159 44800 44770 43935 42721 41264 39929 39430 39850 40286 39964 39111 38363 38015 38194 39081 40465 41660 42223 42286
55141 42286 41965 41100 39778 38518 37639 37081 37000 37774 39194 40390 40918 41222 41781 42483 43117 43776 44458 44909
55123 44909 45115 45382 45785 46185 46841 48147 49678 50428 50231 50061 50649 51650 52431 52773 52584 51914 51527 52446
$$ packed form
55254D1920j09M66L7o88o92l44n22r49p65n7M59O70P91N35k05n74Q9R67R11K60
55234D2200J02L23m0q67r83m6R78J247Q83L29r6p1M23P65M08k20l31R8M92O40
55214D6234O26K55n26j073p83j48q4n99r53q72o68l94J52P88J029P57J99m46q86
55195D2608o89JK82k97r51q11j95J36L22Q75J432J173K51l01oO36J039J120J060
55176D7685J078J300J431R57j0o44n83m58p69j101j088j182j602j529l97Q27Q85
55159D4800l0q35j214j457j335m99M20M36l22q53p48l48J79Q87J384J195N63O3
55141D2286l21q65j322j260q79n58q1P74J420J196N28L04N59P02O34O59O82M51
55123D4909K06K67M03M00O56J306J531P50j97j70N88J001P81L42j89o70l87R19
$$ plain form
55105 52446 54540 56478 57483 58087 58874 59552 59821 60105 60755 61422 61756 61879 61755 61082 60225 60113 60700 60789
55087 60789 60035 59852 61437 64046 66267 67829 69051 69537 68821 67578 66910 66910 67053 67431 68469 69881 71010
55070 71010 71819 72535 72759 72031 70976 70766 71577 72512 72956 73104 73223 73223 73075 73004 73176 73572 74115 74609 74744 74406
55050 74406 73736 72767 71501 70437 70304 70927 71229 70764 70348 70533 70471 69251 67527 66689 66972 67489 67753 68030
55032 68030 68383 68423 68094 67923 68362 69299 70187 70348 69468 68113 67382 67736 68590 69297 69830 70123 69678 68533 67803
55013 67803 68393 69729 70556 70506 70117 69893 70121 71024 72289 72972 72675 72256 72621 73449 73934 74027 73960 73253 71439
54994 71439 69308 68191 68255 68591 68666 68608 68296 67341 65930 64761 64142 63936 64123 64627 64864 64312 63277 62316
54976 62316 61341 60197 59614 60437 62187 63575 64228 64836 65780 66792 67852 69283 70946 72438 74031 76353
$$ packed form
55105E2446K094J938J005O04P87O78K69K84O50O67L34J23j24o73q57j12N87Q9
55087F0789p54j83J585K609K221J562J222M86p16j243o68%J43L78J038J412J129
55070G1010Q09P16K24p28j055k10Q11R35M44J48J19%j48p1J72L96N43M94J35l38
55050G4406o70r69j266j064j33O23L02m65m16J85o2j220j724q38K83N17K64K77
55032F8030L53M0l29j71M39R37Q88J61q80j355p31L54Q54P07N33K93m45j145p30
55013F7803N90J336Q27n0l89k24K28R03J265O83k97m19L65Q28M85R3o7p07j814
54994G1439k131j117O4L36P5n8l12r55j411j169o19k06J87N04K37n52j035r61
54976F2316r75j144n83Q23J750J388O53O08R44J012J060J431J663J492J593K322
$$ plain form
54960 76353 79160 81553 83429 85616 88462 91424 94204 97232 100751 104466 108413 113272 119459 126639
54946 126639 134435 142890 152043 161724 171895 182482 192677 201166 207165 210593 211231 208606 202904 195160
54932 195160 186196 176069 164899 153542 143061 133866 125672 118048 110998 105226 101529 99526 97460
54919 97460 93985 89858 87041 86407 87181 88325 89368 90010 90183 90680 92678 96362 100820 105434 110497 116379
54903 116379 123114 130977 140467 151306 162293 172471 181697 189843 196301 200576 202579 202067 198568 192178
54889 192178 183764 174111 163564 152612 141979 131881 122061 112786 105037 99362 95272 91992 89082
54876 89082 86160 82968 80016 78263 77766 77502 76861 76418 76816 77788 78783 79687 80371 80396 79755 79126 78781 78024
54858 78024 76342 74390 73119 72632 72546 72828 73433 73684 72897 71262 69457 67740 66005 64380 63070 61894
$$ packed form
54960G6353K807K393J876K187K846K962K780L028L519L715L947M859O187P180
54946A26639P796Q455R153R681J0171J0587J0195Q489N999L428O38k625n702p744
54932A95160q964j0127j1170j1357j0481r195q194p624p050n772l697k003k066
54919I7460l475m127k817o34P74J144J043O42J73M97J998L684M458M614N063N882
54903A16379O735P863R490J0839J0987J0178R226Q146O458M275K003n12l499o390
54889A92178q414r653j0547j0952j0633j0098r820r275p749n675m090l280k910
54876H9082k922l192k952j753m97k64o41m43L98R72R95R04O84K5o41o29l45p57
54858G8024j682j952j271m87q6K82O05K51p87j635j805j717j735j625j310j176
$$ plain form
54842 61894 60566 59227 58232 57674 57491 57671 57955 57800 57134 56720 57197 58132 58603 58395 58085 58233 59062 60658
54824 60658 62820 64797 65795 65752 65324 65176 65572 66428 67405 68093 68441 68836 69472 69904 69664 69168 69556 71556
54806 71556 74734 77944 80397 82295 84407 87077 89894 92537 95546 99682 104769 109946 115154 121499
54792 121499 129787 139493 149608 159903 170719 182013 193210 203747 213179 220876 226038 228045 226680
54779 226680 222311 215935 208658 200904 192448 183423 174744 167215 160653 154399 148416 143459 140266 138829
54765 138829 138376 137946 137206 136741 137328 138991 141152 143555 146429 149830 153673 158580 165771 175634 187134
54750 187134 199192 212032 226591 243148 261138 279906 298924 317464 334474 348684 358721
54739 358721 363628 363508 359149 350775 337911 320894 301689 282425 263702 245069 226656 209403
$$ packed form
54842F1894j328j339r95n58j83J80K84j55o66m14M77R35M71k08l10J48Q29J596
54824F0658K162J977R98m3m28j48L96Q56R77O88L48L95O36M32k40m96L88K000
54806G1556L178L210K453J898K112K670K817K643L009M136N087N177N208O345
54792A21499Q288R706J0115J0295J0816J1294J1197J0537R432P697N162K007j365
54779B26680m369o376p277p754q456r025q679p529o562o254n983m957l193j437
54765A38829m53m30p40m65N87J663K161K403K874L401L843M907P191R863J1500
54750A87134J2058J2840J4559J6557J7990J8768J9018J8540J7010J4210J0037
54739C58721M907j20m359q374j2864j7017j9205j9264j8723j8633j8413j7253
$$ plain form
54727 209403 194027 180646 169294 159978 152188 145075 138254 132037 126832 122643 119099 115694 112149
54714 112149 108814 106449 105287 104600 103561 102238 101321 101194 101659 102296 102624 102225 101223 100410 100476 101307 102408
54697 102408 103633 105066 106523 107761 108853 109875 110468 110276 109551 108775 107967 106895 105702 104745 104083 103694
54681 103694 103896 104829 105862 106293 106449 107216 108582 109585 109816 110043 111073 112743 114507 116360 118684 121526
54665 121526 124552 127602 130909 134757 139021 143121 146526 149318 152062 155043 157945 160508 163071 166073
54651 166073 169328 172349 175185 178373 182230 186784 192345 199513 208548 219250 231517 245523 261280
54638 261280 278508 297137 317481 339585 362594 384834 404350 419377 428625 431393 427496 417266
54626 417266 401703 382329 360562 337384 313767 291028 270253 251613 234746 219574 206223
$$ packed form
54727B09403j5376j3381j1352r316p790p113o821o217n205m189l544l405l545
54714A12149l335k365j162o87j039j323r17j27M65O37L28l99j002q13O6Q31J101
54697A02408J225J433J457J238J092J022N93j92p25p76q08j072j193r57o62l89
54681A03694K02R33J033M31J56P67J366J003K31K27J030J670J764J853K324K842
54665A21526L026L050L307L848M264M100L405K792K744K981K902K563K563L002
54651A66073L255L021K836L188L857M554N561P168R035J0702J2267J4006J5757
54638B61280J7228J8629K0344K2104K3009K2240J9516J5027R248K768l897j0230
54626D17266j5563j9374k1767k3178k3617k2739k0775j8640j6867j5172j3351
$$ plain form
54615 206223 194369 183472 173728 166086 161123 158345 156762 155653 154627 153472 152285 151425 151028 150719
54601 150719 149930 148341 146030 143429 141172 139590 138287 136455 133690 130252 126596 122998 119627 116522
54587 116522 113394 109885 106204 103124 101097 99726 98374 96980 95904 95099 93955 92054 89819 88097
54573 88097 87142 86321 84994 83457 82627 82869 83580 83970 83725 82773 81056 79051 77942 78576 80492 82553 84244
54556 84244 85687 86706 86875 86522 86784 88289 90363 91875 92422 92422 92504 93138 94507 96442 98608 100842 103080
54539 103080 105023 106386 107537 109409 112574 116863 122117 128741 137075 146555 156039 164862 173252 181807
54525 181807 190816 200011 208709 216155 221756 224991 225277 222206 215979 207319 196963 185551 174006 163466
54511 163466 154510 146763 139597 132948 127127 122106 117446 112883 108638 105083 102338 100209 98383 96651
$$ packed form
54615B06223j1854j0897r744p642m963k778j583j109j026j155j187q60l97l09
54601A50719p89j589k311k601k257j582j303j832k765l438l656l598l371l105
54587A16522l128l509l681l080k027j371j352j394j076q05j144j901k235j722
54573H8097r55q21j327j537q30K42P11L90k45r52j717k005j109O34J916K061J691
54556H4244J443J019J69l53K62J505K074J512N47%Q2O34J369J935K166K234K238
54539A03080J943J363J151J872L165M289N254O624Q334R480R484Q823Q390Q555
54525A81807R009R195Q698P446N601L235K86l071o227q660j0356j1412j1545j0540
54511A63466q956p747p166o649n821n021m660m563m245l555k745k129j826j732
$$ plain form
54497 96651 95090 93979 93438 93166 92581 91230 89095 86696 84942 84641 85913 88104 90408 92497 94454
54482 94454 96224 97439 97834 97651 97442 97595 98106 98785 99480 100031 100176 99769 99075 98660 98853 99410 99779 99661
54464 99661 99235 98935 98996 99102 98505 96730 94299 92500 92213 93116 94178 94739 94831 94626 94028 92939 91627 90586
54446 90586 90049 89734 89185 88366 87812 87953 88402 88224 87000 85275 83855 83024 82697 82876 83480 83960 83662 82564
54428 82564 81300 80439 80024 79807 79586 79322 79113 79060 79029 78702 78111 77871 78543 79903 81225 82190 83086 84142
54410 84142 85154 85790 85958 85762 85500 85758 87132 89641 92608 95257 97348 99284 101762 105193 109155 112496
54394 112496 114359 115166 116323 118907 122849 127293 131304 134161 135455 135299 134319 133222 132301 131296 129688
54379 129688 127236 124394 122023 120496 119235 117421 114969 112494 110501 109065 108124 107545 106877 105590 103677
$$ packed form
54497I6651j561j111n41k72n85j351k135k399j754l01J272K191K304K089J957
54482I4454J770J215L95j83k09J53N11O79O95N51J45m07o94m15J93N57L69j18
54464I9661m26l00O1J06n97j775k431j799k87R03J062N61R2k05n98j089j312j041
54446I0586n37l15n49q19n54J41M49j78j224j725j420q31l27J79O04M80k98j098
54428H2564j264q61m15k17k21k64k09n3l1l27n91k40O72J360J322R65Q96J056
54410H4142J012O36J68j96k62K58J374K509K967K649K091J936K478L431L962L341
54394A12496J863Q07J157K584L942M444M011K857J294j56r80j097r21j005j608
54379A29688k452k842k371j527j261j814k452k475j993j436r41n79o68j287j913
$$ plain form
54364 103677 101614 99752 98198 97268 97362 98152 98510 97648 95964 94460 93688 93615 94055 94786 95482 96052 96945 98713
54346 98713 101269 103917 106089 107782 109299 110917 112888 115493 118808 122462 125861 128732 131313 133893
54332 133893 136263 137893 138642 138904 138906 138195 136180 132937 129088 125058 120938 116956 113538 110804 108471 106348
54316 106348 104516 102839 100788 98027 94842 91718 88770 85900 83232 81003 79176 77580 76368 75935
54302 75935 76246 76568 76159 75113 74205 73902 73828 73399 72706 72375 72687 73305 73900 74488 74990 74975 74273 73378 72809
54283 72809 72362 71511 70248 69026 68040 67161 66424 66074 66116 66301 66508 66694 66655 66348 66338 67269 68882 70246 71016
54264 71016 71780 73015 74344 75227 75883 77037 78973 81170 82786 83363 83120 82534 81693 80385 78967 78490
54248 78490 79343 80291 79811 78207 77325 78196 79983 81418 82171 82402 82055 81306 80874 81174 81677 81769 81653 81780
$$ packed form
54364A03677k063j862j554r30R4P90L58q62j684j504p72p3M40P31O96N70Q93J768
54346I8713K556K648K172J693J517J618J971K605L315L654L399K871K581K580
54332A33893K370J630P49K62Kp11k015l243l849m030m120l982l418k734k333k123
54316A06348j832j677k051k761l185l124k948k870k668k229j827j596j212m33
54302G5935L11L22m09j046r08l03p4m29o93l31L12O18N95N88N02j5p02q95n69
54283G2809m47q51j263j222r86q79p37l50M2J85K07J86l9l07j0R31J613J364P70
54264G1016P64J235J329Q83O56J154J936K197J616N77k43n86q41j308j418m77
54248G8490Q53R48m80j604q82Q71J787J435P53K31l47p49m32L00N03R2j16J27
$$ plain form
54230 81780 81948 81671 81061 80595 80348 80128 80098 80577 81366 81896 82016 82085 82322 82459 82054 80893 79233 77824 77416
54211 77416 77982 78735 79134 79471 80146 80903 81316 81569 82062 82527 82292 81306 80252 79665 79504 79589 79872 80138 79920
54192 79920 78948 77464 76039 75175 75003 75121 74848 73866 72505 71244 70112 68861 67507 66391 65867 66145
54176 66145 67194 68539 69422 69503 69176 68939 68842 68831 69065 69398 69125 68009 67123 67799 69892 71999 73231 73867
54158 73867 74292 74289 73753 73253 73458 74500 76119 77832 78801 78242 76412 74616 73843 73880 74082 74326 74683 74746 74063
54139 74063 72938 72045 71417 70576 69577 69163 69671 70381 70317 69305 67893 66548 65362 64438 64097 64532 65484 66421
54121 66421 66946 66950 66487 65711 64923 64444 64336 64362 64308 64205 64161 64142 64117 64260 64717 65232 65286 64712 63921 63421 63325 63469
54099 63469 63817 64431 65086 65244 64615 63663 63300 64000 65294 66232 66286 65744 65295 65421 66186 67372 68697 69928
$$ packed form
54230H1780J68k77o10m66k47k20l0M79P89N30J20O9K37J37m05j161j660j409m08
54211G7416N66P53L99L37O75P57M13K53M93M65k35r86j054n87j61Q5K83K66k18
54192G9920r72j484j425q64j72J18k73r82j361j261j132j251j354j116n24K78
54176F6145J049J345Q83Q1l27k37r7j1K34L33k73j116q86O76K093K107J232O36
54158G3867M25ln36n00K05J042J619J713R69n59j830j796p73L7K02K44L57O3o83
54139G4063j125q93o28q41r99m14N08P10o4j012j412j345j186r24l41M35R52R37
54121F6421N25Mm63p76p88m79j08K6n4j03m4j9k5J43M57N15N4n74p91n00r6J44
54099F3469L48O14O55J58o29r52l63P00J294R38N4n42m49J26P65J186J325J231
$$ plain form
54081 69928 70896 71415 71302 70600 69749 69287 69318 69455 69367 69168 69177 69506 70078 70867 71888 72996 73900 74387 74503 74528
54061 74528 74792 75362 75877 75885 75442 75173 75635 76774 78090 79110 79539 79279 78651 78417 79120 80419 81410 81661
54043 81661 81684 82285 83722 85645 87681 89780 92005 94286 96588 99214 102599 106701 110884 114677 118466
54028 118466 123061 128675 134660 140290 145451 150509 155840 161519 167141 171901 175250 177548 179657 181832
54014 181832 183601 184805 186083 187875 189611 190505 190619 190403 189544 187218 183470 179557 176700 174996 173695
53999 173695 172058 169764 166898 163786 160634 157235 153299 149049 145138 141883 138982 136106 133420 131267
53985 131267 129641 128245 126905 125656 124470 123190 121809 120713 120466 121258 122593 123672 124129 124257 124495
53970 124495 124916 125408 126015 126774 127401 127627 127756 128453 129847 131270 132073 132356 132589 132773 132374 131112 129448
$$ packed form
54081F9928R68N19j13p02q51m62L1J37q8j99RL29N72P89J021J108R04M87J16K5
54061G4528K64N70N15Qm43k69M62J139J316J020M29k60o28k34P03J299R91K51
54043H1661K3O01J437J923K036K099K225K281K302K626L385M102M183L793L789
54028A18466M595N614N985N630N161N058N331N679N622M760L349K298K109K175
54014A81832J769J204J278J792J736Q94J14k16q59k326l748l913k857j704j301
53999A73695j637k294k866l112l152l399l936m250l911l255k901k876k686k153
53985A31267j626j396j340j249j186j280j381j096k47P92J335J079M57J28K38
53970A24495M21M92O07P59O27K26J29O97J394J423Q03K83K33J84l99j262j664
$$ plain form
53953 129448 128127 127452 127165 126985 126956 127189 127507 127601 127440 127296 127363 127636 128199 129318 131158 133674 136937 141254
53935 141254 146669 152523 157795 161870 164843 167149 169043 170356 170620 169513 167327 164914 163136 162410 162762
53920 162762 163997 165752 167690 169864 172716 176462 180646 184497 187650 190411 193458 197430 202539 208408
53906 208408 214347 219950 225320 230714 236147 241355 245900 249279 251281 252277 252799 252759 251594 249333 246939
53891 246939 245253 244050 242535 240374 237778 234915 231736 228147 223934 218716 212385 205482 198810 192823
53877 192823 187605 183110 179072 174970 170459 165701 161067 156859 153490 151422 150448 149471 147529 144754 141872
53862 141872 139129 136191 132787 128917 124723 120611 117153 114444 111930 109324 107166 105960 105350 104813 104532
53847 104532 104719 104690 103689 102179 101219 100913 100669 100666 101607 103075 103599 102633 101173 100047 98879 97318 96080
$$ packed form
53953A29448j321o75k87j80k9K33L18R4j61j44O7K73N63J119J840K516L263M317
53935A41254N415N854N272M075K973K306J894J313K64j107k186k413j778p26L52
53920A62762J235J755J938K174K852L746M184L851L153K761L047L972N109N869
53906B08408N939N603N370N394N433N208M545L379K002R96N22m0j165k261k394
53891B46939j686j203j515k161k596k863l179l589m213n218o331o903o672n987
53877A92823n218m495m038m102m511m758m634m208l369k068r74r77j942k775k882
53862A41872k743k938l404l870m194m112l458k709k514k606k158j206o10n37k81
53847A04532J87k9j001j510r60l06k44lR41J468N24r66j460j126j168j561j238
$$ plain form
53830 96080 95948 96591 97174 97515 97954 98598 99352 100293 101433 102451 103016 103130 102914 102496 102241 102532 103084 103098 102404
53811 102404 101834 102110 102972 103800 104576 105712 107383 109404 111372 112714 113148 113422 114999 118608 123594 128953
53795 128953 134330 139578 144136 147585 150362 153222 156342 159492 162664 165930 169023 171680 174163 176915
53781 176915 179899 182717 185158 187154 188535 189317 189979 190950 191997 192525 192206 190925 188453 184735 180316
53766 180316 175963 171990 168397 165421 163375 162015 160575 158519 155996 153563 151694 150520 149870 149597 149785
53751 149785 150382 150731 150102 148863 148432 149657 151772 153385 153922 153580 152514 150916 149470 148792 148486 147513
53735 147513 145474 142933 140523 138382 136524 135201 134646 134718 134848 134265 132537 130170 128401 127957 128314 128495
53719 128495 128250 127946 127726 127479 127395 127821 128666 129659 131067 133405 136460 139306 141346 142718 143709 144528 145761
$$ packed form
53830I6080j32O43N83L41M39O44P54R41J140J018N65J14k16m18k55K91N52J4o94
53811A02404n70K76Q62Q28P76J136J671K021J968J342M34K74J577L609M986N359
53795A28953N377N248M558L449K777K860L120L150L172L266L093K657K483K752
53781A76915K984K818K441J996J381P82O62R71J047N28l19j281k472l718m419
53766A80316m353l973l593k976k046j360j440k056k523k433j869j174o50k73J88
53751A49785N97L49o29j239m31J225K115J613N37l42j066j598j446o78l06r73
53735A47513k039k541k410k141j858j323n55P2J30n83j728k367j769m44L57J81
53719A28495k45l04k20k47q4M26Q45R93J408K338L055K846K040J372R91Q19J233
$$ plain form
53702 145761 148173 151708 155292 158009 159995 161938 164276 167236 171101 175828 180792 185376 189579 193670
53688 193670 197545 200897 203784 206478 208892 210709 212145 213951 216362 218446 219040 218192 217236 217338 218385
53673 218385 219549 220496 221506 222554 223007 222460 221344 220293 219318 218116 216873 216136 215884 215344 213922 211973
53657 211973 210390 209686 209729 210182 210843 211533 211900 211609 210716 209627 208612 207578 206510 205839 205943 206410 206331 205346
53639 205346 203952 202716 201802 201398 201872 203085 204185 204646 205020 206020 207320 208027 208033 208071 208565 209224 209781 210369
53621 210369 211080 211851 212949 214929 217807 220840 223502 226243 229863 234388 238899 242418 244735 246541 248849
53606 248849 252178 256213 260375 264618 269364 274691 280010 284777 289154 293703 298606 303493 307973 312047
53592 312047 315974 319967 324118 328529 333339 338575 344087 349668 355159 360360 365008 369085 373003 377094
$$ packed form
53702A45761K412L535L584K717J986J943K338K960L865M727M964M584M203M091
53688A93670L875L352K887K694K414J817J436J806K411K084N94q48r56J02J047
53673B18385J164R47J010J048M53n47j116j051r75j202j243p37k52n40j422j949
53657B11973j583p04M3M53O61O90L67k91q93j089j015j034j068o71J04M67p9r85
53639B05346j394j236r14m04M74J213J100M61L74J000J300P07OL8M94O59N57N88
53621B10369P11P71J098J980K878L033K662K741L620M525M511L519K317J806K308
53606B48849L329M035M162M243M746N327N319M767M377M549M903M887M480M074
53592C12047L927L993M151M411M810N236N512N581N491N201M648M077L918M091
$$ plain form
53578 377094 380988 383913 385723 387118 388699 390289 391567 392839 394637 396831 398724 399879 400420 400652 400859
53563 400859 401434 402774 404923 407561 410261 412604 414283 415352 416188 416913 417174 416899 416870 417964 420014 422039
53547 422039 423429 424275 424626 424174 422864 421215 419843 419009 418753 419038 419646 420268 420801 421266 421557 421653 421995 423185
53529 423185 425346 428263 432028 436846 442227 447247 451831 456992 463354 470198 476565 482771 490041 498916
53515 498916 508815 519210 530499 543398 557889 573208 588781 604753 621428 638634 656085 674270
53503 674270 694263 716405 739781 763461 787750 813553 840979 869421 898762 929450 961278
53492 961278 993115 1024213 1055013 1086211 1117751 1149224 1180635 1212145 1243455 1274132 1304362
53481 1304362 1334810 1365827 1397190 1428559 1459777 1490740 1521291 1551316 1580801 1609762 1638160
$$ packed form
53578C77094L894K925J810J395J581J590J278J272J798K194J893J155N41K32K07
53563D00859N75J340K149K638K700K343J679J069Q36P25K61k75k9J094K050K025
53547D22039J390Q46L51m52j310j649j372q34k56K85O08O22N33M65K91R6L42J190
53529D23185K161K917L765M818N381N020M584N161O362O844O367O206P270Q875
53515D98916R899J0395J1289J2899J4491J5319J5573J5972J6675J7206J7451J8185
53503F74270J9993K2142K3376K3680K4289K5803K7426K8442K9341L0688L1828
53492I61278L1837L1098L0800L1198L1540L1473L1411L1510L1310L0677L0230
53481A304362L0448L1017L1363L1369L1218L0963L0551L0025K9485K8961K8398
$$ plain form
53470 1638160 1665855 1692611 1718175 1742279 1764438 1784053 1801051 1816271 1830697 1844354 1856487
53459 1856487 1866776 1875669 1883356 1889181 1892482 1893314 1891833 1887514 1879689 1868533 1854909 1839439 1822259
53446 1822259 1803447 1783061 1760879 1736704 1710952 1684406 1657338 1629349 1600147 1570027 1539484
53435 1539484 1508751 1477848 1446717 1415116 1382855 1350427 1319064 1289753 1262353 1236107 1210884
53424 1210884 1187421 1166262 1146993 1128848 1111725 1096237 1082914 1071877 1063182 1056902 1052706 1049887
53412 1049887 1048122 1047863 1049695 1053676 1059679 1067968 1078956 1092598 1108541 1126673 1146932 1168744 1191367
53399 1191367 1214818 1239825 1266708 1294900 1323854 1353922 1386005 1420717 1458224 1498568 1541704
53388 1541704 1587315 1634952 1684406 1735861 1789659 1845910 1904325 1964529 2026580 2090907 2157519
$$ packed form
53470A638160K7695K6756K5564K4104K2159J9615J6998J5220J4426J3657J2133
53459A856487J0289Q893P687N825L301Q32j481m319p825j1156j3624j5470j7180
53446A822259j8812k0386k2182k4175k5752k6546k7068k7989k9202l0120l0543
53435A539484l0733l0903l1131l1601l2261l2428l1363k9311k7400k6246k5223
53424A210884k3463k1159j9269j8145j7123j5488j3323j1037q695o280m196k819
53412A049887j765k59J832L981O003Q289J0988J3642J5943J8132K0259K1812K2623
53399A191367K3451K5007K6883K8192K8954L0068L2083L4712L7507M0344M3136
53388A541704M5611M7637M9454N1455N3798N6251N8415O0204O2051O4327O6612
$$ plain form
53377 2157519 2225600 2294247 2363332 2433073 2503001 2572038 2639522 2705527 2770128 2833030 2894002
53366 2894002 2952946 3009209 3061458 3108609 3150501 3187441 3219561 3246877 3269566 3287884 3302071
53355 3302071 3312320 3318401 3319421 3314601 3304322 3289573 3270280 3245193 3213772 3177078 3136088 3090075
53343 3090075 3037642 2978795 2915129 2848432 2779934 2710507 2640645 2570453 2500389 2431774 2365773
53332 2365773 2302099 2239523 2177501 2116512 2056933 1998545 1941214 1885267 1831013 1778554 1728247
53321 1728247 1680769 1636476 1595186 1556739 1521330 1489133 1459998 1433576 1409364 1386655 1364943
53310 1364943 1344471 1325943 1309588 1294973 1281799 1270374 1261107 1254016 1248998 1246150 1245439 1246268 1247726
53297 1247726 1249213 1250731 1252686 1255541 1259590 1265006 1272064 1281097 1292025 1304163 1316925 1330651 1346354
$$ packed form
53377B157519O8081O8647O9085O9741O9928O9037O7484O6005O4601O2902O0972
53366B894002N8944N6263N2249M7151M1892L6940L2120K7316K2689J8318J4187
53355C302071J0249O081J020m820j0279j4749j9293k5087l1421l6694m0990m6013
53343C090075n2433n8847o3666o6697o8498o9427o9862p0192p0064o8615o6001
53332B365773o3674o2576o2022o0989n9579n8388n7331n5947n4254n2459n0307
53321A728247m7478m4293m1290l8447l5409l2197k9135k6422k4212k2709k1712
53310A364943k0472j8528j6355j4615j3174j1425r267p091n018k848p11Q29J458
53297A247726J487J518J955K855M049N416P058R033J0928J2138J2762J3726J5703
$$ plain form
53284 1346354 1364643 1385254 1407613 1431383 1456427 1482696 1510418 1539995 1571314 1603332 1634667
53273 1634667 1664655 1693712 1722675 1751810 1780433 1807483 1832422 1855421 1876637 1895682 1912055
53262 1912055 1925844 1937575 1947531 1955689 1962253 1967657 1971865 1974102 1973535 1969965 1963660 1954742 1942966
53249 1942966 1927966 1909535 1887777 1863129 1836178 1807363 1776815 1744463 1710279 1674518 1637834
53238 1637834 1601043 1564643 1528718 1493403 1459187 1426484 1395112 1364611 1334989 1306737 1280079
53227 1280079 1254603 1229770 1205503 1182098 1159690 1137887 1115926 1093283 1070252 1047821 1026837
53216 1026837 1007508 989870 974355 961366 950419 940241 929744 918586 906882 894878 882941
53205 882941 871320 859762 847725 835030 821910 808367 794008 778706 762991 747502 732403
$$ packed form
53284A346354J8289K0611K2359K3770K5044K6269K7722K9577L1319L2018L1335
53273A634667K9988K9057K8963K9135K8623K7050K4939K2999K1216J9045J6373
53262A912055J3789J1731R956Q158O564N404M208K237n67l570o305q918j1776
53249A942966j5000j8431k1758k4648k6951k8815l0548l2352l4184l5761l6684
53238A637834l6791l6400l5925l5315l4216l2703l1372l0501k9622k8252k6658
53227A280079k5476k4833k4267k3405k2408k1803k1961k2643k3031k2431k0984
53216A026837j9329j7638j5515j2989j0947j0178j0497j1158j1704j2004j1937
53205H82941j1621j1558j2037j2695j3120j3543j4359j5302j5715j5489j5099
$$ plain form
53194 732403 717605 703188 689311 675868 662504 648820 634497 619498 604243 589252 574449
53183 574449 559182 543144 526896 511203 496194 481525 467054 452934 439301 426247 413993
53172 413993 402704 392204 382127 372281 362641 353222 344292 336450 330032 324518 318983 313030 306860
53159 306860 300523 293770 286749 280244 274823 270175 265640 261072 256724 252580 248354 244080 240144 236581
53145 236581 232814 228386 223654 219463 216304 214078 212515 211488 210875 210427 209932 209353 208728 208054 207304 206417
53129 206417 205208 203399 200921 198198 196042 195187 195756 197096 198192 198429 197972 197364 196874 196406 195932 195696
53113 195696 195969 196830 198210 199889 201453 202617 203648 205089 206948 208622 209857 211321 213794 217072 220066
53098 220066 221857 222259 221558 220171 218491 216679 214575 212057 209404 207024 204877 202468 199401 195685 191609
$$ packed form
53194G32403j4798j4417j3877j3443j3364j3684j4323j4999j5255j4991j4803
53183E74449j5267j6038j6248j5693j5009j4669j4471j4120j3633j3054j2254
53172D13993j1289j0500j0077r846r640r419q930p842o418n514n535n953o170
53159C06860o337o753p021o505n421m648m535m568m348m144m226m274l936l563
53145B36581l767m428m732m191l159k226j563j027o13m48m95n79o25o74p50q87
53129B06417j209j809k478k723k156q55N69J340J096K37m57o08m90m68m74k36
53113A95696K73Q61J380J679J564J164J031J441J859J674J235J464K473L278K994
53098B20066J791M02p01j387j680j812k104k518k653k380k147k409l067l716m076
$$ plain form
53083 191609 187604 184165 181570 179704 178347 177477 176966 176183 174380 171463 167992 164522 161373 158966 157665
53068 157665 157120 156344 154789 152958 151633 150871 150111 149057 148036 147533 147631 147871 147580 146383 144545 142731
53052 142731 141454 140814 140676 140813 140921 140826 140729 140922 141172 140804 139574 138110 137191 136914 136854 136726 136463 135858 134686
53033 134686 133214 132116 131686 131449 130717 129364 127803 126374 125069 123903 123173 123121 123473 123638 123354 122835 122215
53016 122215 121274 119957 118774 118248 118112 117600 116540 115669 115718 116526 117300 117435 116874 115924 115032 114653 115069 116229
52998 116229 117815 119399 120590 121249 121680 122450 123854 125607 127114 127989 128216 127960 127385 126680 126102 125808 125672
52981 125672 125402 124988 124869 125509 126836 128436 130173 132136 133935 134711 134254 133540 133650 134582 135738 137137
52965 137137 139268 141972 144485 146609 148893 151481 153787 155730 158320 162332 167104 171426 175092 178727
$$ packed form
53083A91609m005l439k595j866j357q70n11p83j803k917l471l470l149k407j301
53068A57665n45p76j555j831j325p62p60j054j021n03R8K40k91j197j838j814
53052A42731j277o40j38J37J08r5r7J93K50l68j230j464r19k77o0j28k63o05j172
53033A34686j472j098m30k37p32j353j561j429j305j166p30n2L52J65k84n19o20
53016A22215r41j317j183n26j36n12j060q71M9Q08P74J35n61r50q92l79M16J160
52998A16229J586J584J191O59M31P70J404J753J507Q75K27k56n75p05n78k94j36
52981A25672k70m14j19O40J327J600J737J963J799P76m57p14J10R32J156J399
52965A37137K131K704K513K124K284K588K306J943K590M012M772M322L666L635
$$ plain form
52951 178727 182437 185617 187953 189778 191259 191971 191597 190519 189306 187967 186095 183631 181122 179145 177694
52936 177694 176226 174301 171989 169595 167192 164649 162101 160049 158845 158317 158015 157650 157137 156474 155803 155401
52920 155401 155385 155466 155172 154189 152480 150327 148401 147449 147615 148285 148891 149588 150767 152135 152837 152480 151509 150516
52902 150516 149663 148953 148627 148906 149605 150319 150898 151486 152201 153011 153808 154395 154441 153770 152712 151901 151613 151534 151308
52883 151308 151073 151216 151794 152509 153133 153640 153954 153964 153886 154176 154906 155573 155772 155756 155986 156438 156753 156892 157157 157626
52863 157626 158044 158260 158419 158633 158852 159105 159536 160109 160605 161011 161587 162467 163474 164469 165551 166746 167769
52846 167769 168391 168894 169954 172087 175238 178832 182213 185181 188035 191025 193894 196261 198272 200470 203035
52831 203035 205631 208024 210347 212621 214494 215722 216483 216867 216409 214584 211586 208265 205291 202614 199773
$$ packed form
52951A78727L710L180K336J825J481P12l74j078j213j339j872k464k509j977j451
52936A77694j468j925k312k394k403k543k548k052j204n28l02l65n13o63o71m02
52920A55401j6Q1k94r83j709k153j926r52J66O70O06O97J179J368P02l57r71r93
52902A50516q53p10l26K79O99P14N79N88P15Q10P97N87M6o71j058q11k88p9k26
52883A51308k35J43N78P15O24N07L14J0p8K90P30O67J99j6K30M52L15J39K65M69
52863A57626M18K16J59K14K19K53M31N73M96M06N76Q80J007R95J082J195J023
52846A67769O22N03J060K133L151L594L381K968K854K990K869K367K011K198K565
52831B03035K596K393K323K274J873J228P61L84m58j825k998l321k974k677k841
$$ plain form
52816 199773 196574 193403 190809 188789 186666 183895 180769 177979 175605 173080 170098 166988 164068 161218
52802 161218 158303 155536 153158 151143 149514 148467 147887 147169 145901 144367 143017 141774 140265 138416 136434
52787 136434 134450 132614 131353 131081 131702 132638 133235 133060 132035 130506 128948 127479 125926 124409 123337
52772 123337 122683 121819 120363 118649 117024 115336 113592 112439 112283 112452 111987 110881 109800 108976 108220 107709
52756 107709 107734 107789 106925 105092 103296 102268 101733 101189 100617 100090 99336 98140 96745 95524 94530 93619 92711
52739 92711 91784 90852 90038 89430 88875 88269 87936 88251 88881 88945 88063 86738 85581 84688 83996 83690 83889 84269 84439
52720 84439 84453 84677 85300 86188 87063 87648 87747 87331 86514 85469 84455 83769 83426 83025 82285 81589 81549 82100 82517
52701 82517 82343 81834 81424 81266 81384 81820 82460 83162 84169 85934 88390 90880 92957 94810 96740 98812
$$ packed form
52816A99773l199l171k594k020k123k771l126k790k374k525k982l110k920k850
52802A61218k915k767k378k015j629j047n80p18j268j534j350j243j509j849j982
52787A36434j984j836j261k72O21R36N97j75j025j529j558j469j553j517j072
52772A23337o54q64j456j714j625j688j744j153j56J69m65j106j081q24p56n11
52756A07709K5N5q64j833j796j028n35n44n72n27p54j196j395j221r94r11r08
52739I2711r27r32q14o08n55o06l33L15O30O4q82j325j157q93o92l06J99L80J70
52720H4439J4K24O23Q88Q75N85R9m16q17j045j014o86l43m01p40o96m0N51M17
52701H2517j74n09m10j58J18M36O40P02J007J765K456K490K077J853J930K072
$$ plain form
52685 98812 101273 104659 108991 113306 116490 118286 119129 119380 119199 118861 118624 118394 117870 116885 115321 112962
52669 112962 109858 106639 104014 102058 100271 98180 95663 92915 90460 88937 88470 88465 88328 88103 88012 87752
52653 87752 86875 85610 84606 84010 83502 83160 83433 84196 84630 84362 83956 83873 83702 83024 82409 82717 83711 84233 83738
52634 83738 82928 82726 83223 83903 84461 85066 86010 87408 89070 90512 91195 90941 90059 89028 88141 87476 86957 86350
52616 86350 85391 84094 82777 81655 80625 79687 79308 79909 81064 81730 81472 81099 81787 83749 86024 87436
52600 87436 87613 87206 87319 88604 90606 92038 91954 90668 89332 88670 88434 88154 87997 88496 89627 90667 91072
52583 91072 91155 91583 92437 93161 93427 93617 94206 95037 95537 95593 95812 96872 98822 101121 103193 104878 106459 108291
52565 108291 110353 112225 113554 114372 114830 114893 114612 114397 114552 114722 114460 114258 115248 117643 120260 121946 122848
$$ packed form
52685I8812K461L386M332M315L184J796Q43K51j81l38k37k30n24r85j564k359
52669A12962l104l219k625j956j787k091k517k748k455j523m67nj37k25r1k60
52653H7752q77j265j004n96n08l42K73P63M34k68m06q3j71o78o15L08R94N22m95
52634H3738q10k02M97O80N58O05R44J398J662J442O83k54q82j031q87o65n19o07
52616H6350r59j297j317j122j030r38l79O01J155O66k58l73O88J962K275J412
52600H7436J77m07J13J285K002J432q4j286j336o62k36k80j57M99J131J040M05
52583I1072Q3M28Q54P24K66J90N89Q31N00N6K19J060J950K299K072J685J581J832
52565A08291K062J872J329Q18M58O3k81k15J55J70k62k02R90K395K617J686R02
$$ plain form
52548 122848 123736 124709 125327 125618 126148 127136 128152 128720 128725 128262 127570 127141 127425 128371 129572 130851 132345 133993
52530 133993 135379 136137 136264 136016 135706 135570 135591 135522 135281 135119 135196 135300 135347 135736 136582 137010 136085 134343 133364
52511 133364 133705 134209 133799 133046 133211 134370 135345 135299 134596 134048 133934 133993 133984 133854 133467 132545 131075 129585 128720
52492 128720 128585 128884 129696 131514 134212 136601 137645 137663 137599 137537 136934 136132 136393 138182 140478 142210 143417
52475 143417 144446 144994 144784 144539 145266 146882 148355 149034 149195 149399 149923 150775 151727 152381 152573 152587 152612 152244
52457 152244 151020 149287 147986 147637 148005 148661 149329 149683 149419 148700 148098 147894 147807 147595 147557 148166 149362 150501
52439 150501 150997 150942 151060 152004 153693 155438 156789 158005 159553 161374 162982 164147 165123 166196 167320 168209
52423 168209 168595 168360 167604 166571 165383 163864 161833 159454 157133 155172 153659 152532 151525 150219 148512
$$ packed form
52548A22848Q88R73O18K91N30R88J016N68Nm63o92m29K84R46J201J279J494J648
52530A33993J386P58J27k48l10j36K1o9k41j62P7J04M7L89Q46M28r25j742r79
52511A33364L41N04m10p53J65J159R75m6p03n48j14N9rj30l87r22j470j490q65
52492A28720j35K99Q12J818K698K389J044J8o4o2o03q02K61J789K296J732J207
52475A43417J029N48k10k45P27J616J473O79J61K04N24Q52R52O54J92J4K5l68
52457A52244j224j733j301l49L68O56O68L54k64p19o02k04q7k12l8O09J196J139
52439A50501M96n5J18R44J689J745J351J216J548J821J608J165R76J073J124Q89
52423A68209L86k35p56j033j188j519k031k379k321j961j513j127j007j306j707
$$ plain form
52408 148512 146902 145946 145566 145320 145294 146192 148376 151276 153941 155796 156646 156437 155495 154732 155051 156436 157955
52391 157955 158761 158916 159158 160076 161576 163073 164100 164664 165059 165446 165771 166124 166856 168079 169258 169726 169622
52374 169622 169906 171236 173216 175086 176805 178947 181639 184228 186174 187749 189550 191710 193955 196175
52360 196175 198476 200793 202871 204672 206497 208621 211044 213571 216002 218218 220186 221839 222922 223218
52346 223218 223097 223541 225197 227652 230070 232354 235082 238374 241483 243723 245223 246472 247596 248455 249182
52331 249182 250183 251656 253324 254650 255332 255714 256626 258587 261189 263579 265485 267406 269880 273018 276749
52316 276749 280924 285093 288775 292193 296133 300819 305564 309913 314505 320195 326810 333449 339768 346311
52302 346311 353733 362210 371523 381279 391144 401272 412333 424726 437942 451159 464335 478175
$$ packed form
52408A48512j610r56l80k46k6Q98K184K900K665J855Q50k09r42p63L19J385J519
52391A57955Q06J55K42R18J500J497J027N64L95L87L25L53P32J223J179M68j04
52374A69622K84J330J980J870J719K142K692K589J946J575J801K160K245K220
52360A96175K301K317K078J801J825K124K423K527K431K216J968J653J083K96
52346B23218j21M44J656K455K418K284K728L292L109K240J500J249J124Q59P27
52331B49182J001J473J668J326O82L82R12J961K602K390J906J921K474L138L731
52316B76749M175M169L682L418L940M686M745M349M592N690O615O639O319O543
52302C46311P422Q477R313R756R865J0128J1061J2393J3216J3217J3176J3840
$$ plain form
52290 478175 493068 508570 524005 539167 554351 570015 586435 603332 619812 635081 649330
52279 649330 663620 678734 694294 709126 722320 733879 744497 754833 764942 774337 782506 789237
52267 789237 794537 798593 801933 805225 808556 811116 811946 810869 808455 805254 801454 797176 792690 788244
52253 788244 783957 779887 776069 772500 769260 766556 764542 763203 762580 762911 764417 767080 770854 775853 782167
52238 782167 789698 798368 808171 818772 829381 839418 849039 858675 868369 878026 887957 898537 909446
52225 909446 919799 928957 936794 943288 948393 952272 955127 956852 957268 956543 954800 951449 945729 937951
52211 937951 929462 921163 912816 904019 895111 886577 878141 869043 858923 847969 836558 825179 814385
52198 814385 804333 794591 784841 775516 767241 759905 752956 746497 741379 737982 735543 733039 730318 727899
$$ packed form
52290D78175J4893J5502J5435J5162J5184J5664J6420J6897J6480J5269J4249
52279F49330J4290J5114J5560J4832J3194J1559J0618J0336J0109R395Q169O731
52267G89237N300M056L340L292L331K560Q30j077k414l201l800m278m486m446
52253G88244m287m070l818l569l240k704k014j339o23L31J506K663L774M999O314
52238G82167P531Q670R803J0601J0609J0037R621R636R694R657R931J0580J0909
52225I09446J0353R158P837O494N105L879K855J725M16p25j743l351n720p778
52211I37951q489q299q347q797q908q534q436r098j0120j0954j1411j1379j0794
52198H14385j0052r742r750r325q275p336o949o459n118l397k439k504k721k419
$$ plain form
52184 727899 726024 724360 722499 720240 717516 714596 712363 711764 712626 713514 713192 711877 710606 709714 708623
52169 708623 706882 704695 702318 699678 696764 693792 690740 687321 683745 680917 679449 678945 678687 678511 678503 678314
52153 678314 677467 676128 674909 674051 673325 672612 672031 671523 670743 669354 667080 663614 658968 653838 649171 645303
52137 645303 641850 638389 634883 631505 628317 625170 621751 617875 613845 610201 607023 603974 601215 599497
52123 599497 598777 597513 594306 589755 585738 583187 581607 580457 579728 579151 578153 576917 576450 577218 578697 580565
52107 580565 583364 587456 592262 597225 602764 609594 617701 626767 637039 649033 662649 677249 692435
52094 692435 708232 724739 742065 760418 779798 799719 819588 839178 858443 877173 895205
52083 895205 912774 930188 947242 963261 977706 990531 1001999 1012291 1021178 1028102 1032754 1035626
$$ packed form
52184G27899j875j664j861k259k724k920k233n99Q62Q88l22j315j271q92j091
52169G08623j741k187k377k640k914k972l052l419l576k828j468n04k58j76qj89
52153F78314q47j339j219q58p26p13n81n08p80j389k274l466m646n130m667l868
52137F45303l453l461l506l378l188l147l419l876m030l644l178l049k759j718
52123E99497p20j264l207m551m017k551j580j150p29n77r98j236m67P68J479J868
52107E80565K799M092M806M963N539O830Q107R066J0272J1994J3616J4600J5186
52094F92435J5797J6507J7326J8353J9380J9921J9869J9590J9265J8730J8032
52083H95205J7569J7414J7054J6019J4445J2825J1468J0292Q887O924M652K872
$$ plain form
52071 1035626 1037649 1039205 1039769 1038602 1035435 1030479 1024230 1017417 1010652 1003866 996493 988365 979934 971458
52057 971458 962608 953296 944324 936651 930386 925018 920322 916474 913460 910939 908704 906974 906187 906608 908054
52042 908054 910010 912300 915587 920691 927359 934344 940870 947342 954244 961147 967410 973203 979060 984914
$$ packed form
52071A035626K023J556N64j167l167m956o249o813o765o786p373q128q431q476
52057I71458q850r312q972p673o265n368m696l848l014k521k235j730p87M21J446
52042I08054J956K290L287N104O668O985O526O472O902O903O263N793N857N854
$$ [...]
##END NTUPLES=NMR SPECTRUM
##END=
