
##TITLE=AC1212_MSMAH12043_7160485_mURdhBHiU7
##JCAMPDX= 6.0         $$ Bruker NMR JCAMP-DX V2.0
##DATA TYPE= NMR SPECTRUM
##DATA CLASS= NTUPLES
##ORIGIN= BRUKER
##OWNER= Administrator
$$ 1.72 TOPSPIN		Version 2.1
$$ 2012-12-01 05:17:49.389 -0500  Administrator@X
$$ Compression mode = diff/dup
##.OBSERVE FREQUENCY= 400.02188249412
##.OBSERVE NUCLEUS= ^1H
##.ACQUISITION MODE= SIMULTANEOUS (DQD)
##.ACQUISITION SCHEME= undefined
##.AVERAGES= 64
##.DIGITISER RES= 22
##SPECTROMETER/DATA SYSTEM= spect
##.PULSE SEQUENCE= noesygpps1d.comp
##.SOLVENT NAME= COFFEE_meoh
##.SHIFT REFERENCE= INTERNAL, COFFEE_meoh, 1, 14.96241
##AUDIT TRAIL= $$ (NUMBER, WHEN, WHO, WHERE, PROCESS, VERSION, WHAT)
$$ ##TITLE= Audit trail, TOPSPIN		Version 2.1
$$ ##JCAMPDX= 5.01
$$ ##ORIGIN= Bruker BioSpin GmbH
$$ ##OWNER= Administrator
$$ $$ E:\/data/COFFEE/nmr/AC1212_MSMAH12043_7160485_mURdhBHiU7/12/pdata/1/auditp.txt
$$ ##AUDIT TRAIL=  $$ (NUMBER, WHEN, WHO, WHERE, PROCESS, VERSION, WHAT)
(   1,<2012-12-01 05:17:41.730 -0500>,<Administrator>,<X>,<go>,<TOPSPIN 2.1>,
      <created by zg
	started at 2012-12-01 05:06:10.482 -0500,
	POWCHK enabled, PULCHK disabled,
       configuration hash MD5:
       86 BA 57 50 F2 9D 5C 9B 26 00 A9 28 5F 66 2E 89
       data hash MD5: 64K
       51 CC 74 15 12 1B CD DE 17 2F 75 49 F7 63 A9 81>)
(   2,<2012-12-01 05:17:45.580 -0500>,<Administrator>,<X>,<proc1d>,<TOPSPIN 2.1>,
      <Start of raw data processing
       efp LB = 0.3 FT_mod = 6 PKNL = 1 PHC0 = 0 PHC1 = 0 SI = 128K 
       data hash MD5: 128K
       3F 18 F6 65 08 29 5F 55 49 A7 08 9D A5 81 E4 A4>)
(   3,<2012-12-01 05:17:47.007 -0500>,<Administrator>,<X>,<proc1d>,<TOPSPIN 2.1>,
      <pk PHC0 = -80.9198 PHC1 = 0 
       data hash MD5: 128K
       12 50 2F 17 D1 5C D1 33 AB 1C B3 95 1D 1F 2F 58>)
(   4,<2012-12-01 05:17:47.997 -0500>,<Administrator>,<X>,<proc1d>,<TOPSPIN 2.1>,
      <abs ABSG = 1 
       data hash MD5: 128K
       01 F2 7F 98 97 2D 80 AE 7B 32 90 14 A2 57 38 25>)
(   5,<2012-12-01 05:17:48.229 -0500>,<Administrator>,<X>,<proc1d>,<TOPSPIN 2.1>,
      <abs ABSG = 2 
       data hash MD5: 128K
       81 BE 4F AA 82 53 32 D6 9B 3A 94 64 65 0E A7 0E>)
(   6,<2012-12-01 05:17:48.492 -0500>,<Administrator>,<X>,<proc1d>,<TOPSPIN 2.1>,
      <abs ABSG = 3 
       data hash MD5: 128K
       FC 43 34 FC 6E 15 21 77 B1 5F 59 EF BE F7 EC BB>)
(   7,<2012-12-01 05:17:48.708 -0500>,<Administrator>,<X>,<proc1d>,<TOPSPIN 2.1>,
      <abs ABSG = 4 
       data hash MD5: 128K
       73 B7 34 22 C9 FF 18 6D ED D2 0A 62 89 AB 36 7E>)
(   8,<2012-12-01 05:17:48.971 -0500>,<Administrator>,<X>,<proc1d>,<TOPSPIN 2.1>,
      <abs ABSG = 5 
       data hash MD5: 128K
       C5 31 12 E7 42 ED CB 5F C8 77 D8 E3 D9 A4 17 73>)
$$ ##END=
$$ 
$$ $$ hash MD5
$$ $$ 41 54 C0 BC 5E E2 40 DE 19 A9 E5 7F 46 2F 64 DA
##$RELAX= 
##$RELAX= 
##$RELAX= 
##$RELAX= 
##$RELAX= 
##$RELAX= 
##$RELAX= 
##$RELAX= 
$$ Bruker specific parameters
$$ --------------------------
##$DU= <E:\>
##$EXPNO= 12
$$ [...]
150 150 150 150 150 150 150 150
##$TP07= 0
##$TPNAME0= <>
##$TPNAME1= <>
##$TPNAME2= <>
##$TPNAME3= <>
##$TPNAME4= <>
##$TPNAME5= <>
##$TPNAME6= <>
##$TPNAME7= <>
##$TPOAL= (0..7)
0.5 0.5 0.5 0.5 0.5 0.5 0.5 0.5
##$TPOFFS= (0..7)
0 0 0 0 0 0 0 0
##$TUNHIN= 0
##$TUNHOUT= 0
##$TUNXOUT= 0
##$USERA1= <user>
##$USERA2= <user>
##$USERA3= <user>
##$USERA4= <user>
##$USERA5= <user>
##$V9= 5
##$VALIST= <valist>
##$VCLIST= <CCCCCCCCCCCCCCC>
##$VD= 0
##$VDLIST= <DDDDDDDDDDDDDDD>
##$VPLIST= <PPPPPPPPPPPPPPP>
##$VTLIST= <TTTTTTTTTTTTTTT>
##$WBST= 1024
##$WBSW= 4
##$XGAIN= (0..3)
0 0 0 0
##$XL= 0
##$YL= 0
##$YMAX_a= 7656384
##$YMIN_a= -16436176
##$ZGOPTNS= <>
##$ZL1= 120
##$ZL2= 120
##$ZL3= 120
##$ZL4= 120
##$ABSF1= 14.96241
##$ABSF2= -5.595772
##$ABSG= 5
##$ABSL= 3
##$ALPHA= 0
##$AQORDER= 0
##$ASSFAC= 0
##$ASSFACI= 0
##$ASSFACX= 0
##$ASSWID= 0
##$AUNMP= <proc_prof1d_extract.lims>
##$AXLEFT= 0
##$AXNAME= <>
##$AXNUC= <1H>
##$AXRIGHT= 0
##$AXTYPE= 0
##$AXUNIT= <>
##$AZFE= 0.1
##$AZFW= 0.1
##$BCFW= 0
##$BC_mod= 0
##$BYTORDP= 0
##$COROFFS= 0
##$CY= 15
##$DATMOD= 1
##$DC= 0
##$DFILT= <>
##$DTYPP= 0
##$F1P= 0
##$F2P= 0
##$FCOR= 0.5
##$FTSIZE= 131072
##$FT_mod= 6
##$GAMMA= 0
##$GB= 0
##$INTBC= 1
##$INTSCL= 1
##$ISEN= 128
##$LB= 0.3
##$LEV0= 0
##$LPBIN= 0
##$MAXI= 10000
##$MC2= 0
##$MEAN= 0
##$ME_mod= 0
##$MI= 0
##$NCOEF= 0
##$NC_proc= -2
##$NLEV= 6
##$NOISF1= 0
##$NOISF2= 0
##$NSP= 0
##$NTH_PI= 0
##$NZP= 0
##$OFFSET= 14.96241
##$PC= 1
##$PHC0= -80.9198
##$PHC1= 0
##$PH_mod= 1
##$PKNL= yes
##$PPARMOD= 0
##$PPDIAG= 0
##$PPIPTYP= 0
##$PPMPNUM= 2147483647
##$PPRESOL= 1
##$PSCAL= 4
##$PSIGN= 0
##$PYNMP= <proc.py>
##$REVERSE= no
##$SF= 400.020009072058
##$SI= 131072
##$SIGF1= 0
##$SIGF2= 0
##$SINO= 400
##$SIOLD= 131072
##$SPECTYP= <>
##$SREGLST= <1H.CDCl3>
##$SSB= 0
##$STSI= 131072
##$STSR= 0
##$SW_p= 8223.68421052631
##$SYMM= 0
##$S_DEV= 0
##$TDeff= 65536
##$TDoff= 0
##$TI= <>
##$TILT= no
##$TM1= 0
##$TM2= 0
##$TOPLEV= 0
##$USERP1= <user>
##$USERP2= <user>
##$USERP3= <user>
##$USERP4= <user>
##$USERP5= <user>
##$WDW= 1
##$XDIM= 131072
##$YMAX_p= 437469016
##$YMIN_p= -11604
##$CURPLOT= <Network HP LaserJet P1505>
##$CURPRIN= <$Network HP LaserJet P1505>
##$DFORMAT= <normdp>
##$LAYOUT= <+/1D_H.xwp>
##$LFORMAT= <normlp>
##$PFORMAT= <normpl>
##$SURQMSG= 1
$$ End of Bruker specific parameters
$$ ---------------------------------
##NTUPLES= NMR SPECTRUM
##VAR_NAME=  FREQUENCY,     SPECTRUM/REAL,   SPECTRUM/IMAG
##SYMBOL=    X,             R,               I
##VAR_TYPE=  INDEPENDENT,   DEPENDENT,       DEPENDENT
##VAR_FORM=  AFFN,          ASDF,            ASDF
##VAR_DIM=   131072,        131072,          131072
##UNITS=     HZ,            ARBITRARY UNITS, ARBITRARY UNITS
##FACTOR=    0.0627417313425164, 1,          1
##FIRST=     8223.62146879497, -1383,        -63844
##LAST=      0,             -7,              -63512
##MIN=       0,             -11604,          0
##MAX=       8223.62146879497, 437469016,    0
$$ Real data points
##PAGE= N=1
##DATA TABLE= (X++(R..R)), XYDATA
$$ [...]
63243C80361O209P302R132J0965J1762J1364J0671J0603J1430J3089J5441J8015
63231E16344K0056K1239K1990K2818K3610K3933K3796K3701K4031K4643K5070
63220G71231K4916K4066K2740K1399K0498K0207K0296K0290J9841J8979J7970
63209A002433J6812J5017J2027P830K899k432q253j4581k0853k6177l0074l2711
63197I21937l4418l5206l4865l3362l0860k7549k3641j9612j6034j2992r979o661
63185F36758l411o90J806M780Q199J1188J3135J4334J5358J6363J7290J8133J8728
63172G71971J8741J8304J8130J8584J9080J8895J8146J7369J6558J5232J3164
63161I64174J0461P168L382n34m372q393j2718j6792k0113k2988k5767k7846k8486
$$ y = [380361, 386570, 393872, 403004, 413969, 425731, 437095, 447766, 458369, 469799, 482888, 498329, 516344, 536400, 557639, 579629, 602447, 626057, 649990, 673786, 697487, 721518, 746161, 771231, 796147, 820213, 842953, 864352, 884850, 905057, 925353, 945643, 965484, 984463, 1002433, 1019245, 1034262, 1046289, 1054119, 1057018, 1054586, 1046333, 1031752, 1010899, 984722, 954648, 921937, 887519, 852313, 817448, 784086, 753226, 725677, 702036, 682424, 666390, 653398, 643419, 636758, 633347, 632657, 634463, 639243, 647442, 658630, 671765, 686099, 701457, 717820, 735110, 753243, 771971, 790712, 809016, 827146, 845730, 864810, 883705, 901851, 919220, 935778, 951010, 964174, 974635, 981803, 985185, 984651, 980279, 971886, 959168, 942376, 922263, 899275, 873508, 845662, 817176]
63148H17176k8173k7925k7454k5570k2392j9588j8025j6697j4683j2707j1718
63137E92244j1092r585p300n447m500l808k761j444j72Q32J408J725K319L361
63123E55780M191M266M086M361M665L999K523J573J857K714L328L732M172M408
63109F05655M172L707L312K844K141J448J017P30N42Q96K060L394L815K957J487
63094F40177L77J38O09J142J121N78J59K04K24l57j185j357o18M01J156J800K641
63077F47210L602M511N456O498P387P931Q377R040R830J0501J1185J2194J3457
63064G57179J4604J5597J6743J8025J8929J9166J9213J9832K1272K3225K5367
63053I69152K7664L0180L2841L5423L7763L9833M1680M3264M4530M5615M6767
$$ y = [817176, 789003, 761078, 733624, 708054, 685662, 666074, 648049, 631352, 616669, 603962, 592244, 581152, 571567, 564267, 558820, 554320, 550512, 547751, 546307, 546135, 546967, 548375, 550100, 552419, 555780, 559971, 564237, 568323, 572684, 577349, 581348, 583871, 585444, 587301, 590015, 593343, 597075, 601247, 605655, 609827, 613534, 616846, 619690, 621831, 623279, 624296, 625026, 625568, 626464, 628524, 631918, 635733, 638690, 640177, 640554, 640692, 641301, 642443, 643564, 644142, 644301, 644505, 644729, 644372, 643187, 641830, 641212, 641613, 642769, 644569, 647210, 650812, 655323, 660779, 667277, 674664, 682595, 690972, 700012, 709842, 720343, 731528, 743722, 757179, 771783, 787380, 804123, 822148, 841077, 860243, 879456, 899288, 920560, 943785, 969152, 996816, 1026996, 1059837, 1095260, 1133023, 1172856, 1214536, 1257800, 1302330, 1347945, 1394712]
63042A394712M7884M8394M7865M6569M5117M3825M2850M2667M3629M5139M6081
63031A894732M6255M6564M7469M7995M6778M3408L8199L1258K2538J2368J171
63020B278735j0958k3764l6195m6995n5684o2438o7241o9922p0692o9863o7301
63009A697682o2840n7088n0982m4706l7944l1011k4715j9104j3412p433j886K886
62997A349447P547J2562J7269K0711K2826K4178K5154K5930K6739K7588K8079
62986A588030K7998K7628K7192K6385K4793K2388J9222J5204J0381M958j257q791
62974A784131j7443k6028l3662m0625m7352n3297n7644o0473o2278o2802o1421
62963A261106n8499n5240n2180m8736m4409l9621l5108l1169k7796k5010k2723
$$ y = [1394712, 1442596, 1490990, 1538855, 1585424, 1630541, 1674366, 1717216, 1759883, 1803512, 1848651, 1894732, 1940987, 1987551, 2035020, 2083015, 2129793, 2173201, 2211400, 2242658, 2265196, 2277564, 2278735, 2267777, 2244013, 2207818, 2160823, 2105139, 2042701, 1975460, 1905538, 1834846, 1764983, 1697682, 1634842, 1577754, 1526772, 1482066, 1444122, 1413111, 1388396, 1369292, 1355880, 1348447, 1346561, 1349447, 1356994, 1369556, 1386825, 1407536, 1430362, 1454540, 1479694, 1505624, 1532363, 1559951, 1588030, 1616028, 1643656, 1670848, 1697233, 1722026, 1744414, 1763636, 1778840, 1789221, 1794179, 1792922, 1784131, 1766688, 1740660, 1706998, 1666373, 1619021, 1565724, 1508080, 1447607, 1385329, 1322527, 1261106, 1202607, 1147367, 1095187, 1046451, 1002042, 962421, 927313, 896144, 868348, 843338, 820615]
62952H20615k0605j8409j6272j4532j3355j2529j1556j0088q429p389p342p739
62940F72370p806p469p171p064o991o980p183p380p205o831o848p357p793p725
62926E70567p279o706o047n414n089n041m726l721k260r88m35q01j895l083l675
62911E13407l563l189k820k292j661j477j941k306j777p55l89r83j633j642j429
62896D85550j542j507n10J133K113J788Q93M02L97M60M32K21n89k099l480l786
62880D79876l241k833k799k412j371l91m9L4L80P51O80L17O5j30n23q85p86l30
62862D66353o0k69q33j522k004j900j229o42o81j058j145q75o76p04p88r44j358
62845D49665j863k054j892j753j849j988j899j446o15L35Q58O93K94K60N13N72
$$ y = [820615, 800010, 781601, 765329, 750797, 737442, 724913, 713357, 703269, 694840, 687451, 680109, 672370, 664564, 657095, 649924, 642860, 635869, 628889, 621706, 614326, 607121, 600290, 593442, 586085, 578292, 570567, 563288, 556582, 550535, 545121, 540032, 534991, 530265, 526544, 524284, 523296, 522861, 522060, 520165, 517082, 513407, 509844, 506655, 503835, 501543, 499882, 498405, 496464, 494158, 492381, 491626, 491237, 490254, 488621, 486979, 485550, 484008, 482501, 481991, 483124, 485237, 487025, 487918, 488320, 488717, 489177, 489609, 489830, 489241, 487142, 483662, 479876, 476635, 473802, 471003, 468591, 467220, 466829, 466780, 466814, 467194, 467945, 468625, 468942, 469007, 468877, 468354, 467469, 466683, 466353, 466293, 466024, 465191, 463669, 461665, 459765, 458536, 457894, 457213, 456155, 455010, 454135, 453459, 452755, 451967, 451023, 449665, 447802, 445748, 443856, 442103, 440254, 438266, 436367, 434921, 434306, 434641, 435499, 436192, 436486, 436746, 437259, 437831]
62829D37831L31J8m39j207j919j959j408r09o48k88P1j88j008j442r85l58l25
62812D25168m97k6J036J874K104K042J997J959J990K343L079L937M664N224N669
62797D62563O056O529P263Q250R237R941J0335J0795J1866J3703J5762J7362J8570
62784F08232K0138K2436K4939K7110K9267L2130L5773L9670M3638M8083N3250
62773I84666N8841O4559P0489P6597Q2227Q6580Q9516R1366R1999R0583Q6391
62762A873814P9502P0485N9611M6755L1870J5381j924j9061l5010m9023o0899
62751B011501p0814p8797q4645q8331r0198r0491q9043q5755q1218p6448p1984
62740A103777o7560o2770n7703n2753m8031m3344l8703l4497l0970k7800k4538
$$ y = [437831, 438162, 438180, 437741, 436534, 434615, 432656, 431248, 430339, 429691, 429403, 429474, 429286, 428278, 426836, 425851, 425493, 425168, 424671, 424645, 425681, 427555, 429659, 431701, 433698, 435657, 437647, 439990, 443069, 447006, 451670, 456894, 462563, 468619, 475148, 482411, 490661, 499898, 509839, 520174, 530969, 542835, 556538, 572300, 589662, 608232, 628370, 650806, 675745, 702855, 732122, 764252, 800025, 839695, 883333, 931416, 984666, 1043507, 1108066, 1178555, 1255152, 1337379, 1423959, 1513475, 1604841, 1696840, 1787423, 1873814, 1953316, 2023801, 2083412, 2130167, 2162037, 2177418, 2175494, 2156433, 2121423, 2072400, 2011501, 1940687, 1861890, 1777245, 1688914, 1598716, 1508225, 1419182, 1333427, 1252209, 1175761, 1103777, 1036217, 973447, 915744, 862991, 814960, 771616, 732913, 698416, 667446, 639646, 615108]
62729F15108k1351j8868j7238j5837j4174j2643j1832j1479j0730r291p655o208
62717D57802m784l273j995j175n34L03J332K330L173L872M664O072Q318J0656
62703D86761J2015J2477J3374J5592J8645K1775K5029K8563L1853L4538L7398
62692G38020M1389M6161N0566N4241N7643O0715O2721O3360O3025O1803N9114
62681A358758N4507M8032L9694K9415J7683N584o128j7347k7927l7333m5269n1991
62669A367678n7707o2137o4881o5795o4908o2436n8976n5205n1344m7349m3566
62658G33374m0465l7737l4450l0406k6604k3985k2315k0769j9025j7332j5835
62647D44451j4394j2838j1148r433p934o964o673o977p580q002p796p042o366
$$ y = [615108, 593757, 574889, 557651, 541814, 527640, 514997, 503165, 491686, 480956, 471665, 464010, 457802, 453018, 449745, 447750, 446575, 446041, 446344, 447676, 450006, 453179, 457051, 461715, 467787, 476105, 486761, 498776, 511253, 524627, 540219, 558864, 580639, 605668, 634231, 666084, 700622, 738020, 779409, 825570, 876136, 930377, 988020, 1048735, 1111456, 1174816, 1237841, 1299644, 1358758, 1413265, 1461297, 1500991, 1530406, 1548089, 1553673, 1547545, 1530198, 1502271, 1464938, 1419669, 1367678, 1309971, 1247834, 1182953, 1117158, 1052250, 989814, 930838, 875633, 824289, 776940, 733374, 692909, 655172, 620722, 590316, 563712, 539727, 517412, 496643, 477618, 460286, 444451, 430057, 417219, 406071, 396638, 388704, 381740, 375067, 368090, 360510, 352508, 344712, 337670, 331304]
62634C31304o083n689m740l821l792m372m443l678k860k449j964j069l38l80r61
62619B84665j493j732j580q66K08R55J024Q89J183J998L034L962M399M172L788
62604C04606M003M780N430N937P087Q986J0616J1421J2251J3965J6135J8101K0287
62591D43605K3317K6670K9443L1972L5320L9529M3595M6872M9312N0445M9498
62580H69578M6682M3165L9485L4875K8512K0582J1898L145n140j2607j9446k6119
62568A034610l2433l7446m0557m2096m2627m2242m0952l9149l7174l4853l2010
62557F13071k9035k6445k4167k1827j9526j7676j6141j4254j1946j0215r978j0821
62545D01040j1393j0912r749q624p835p410p321p204o434m989l775l458l447k722
$$ y = [331304, 325221, 319532, 314792, 310971, 307179, 302807, 298364, 294686, 291826, 289377, 287413, 286344, 286006, 285626, 284665, 283172, 281440, 279860, 278994, 279202, 280157, 281181, 282070, 283253, 285251, 288285, 292247, 296646, 300818, 304606, 308609, 313389, 318819, 324756, 331843, 340829, 351445, 362866, 375117, 389082, 405217, 423318, 443605, 466922, 493592, 523035, 555007, 590327, 629856, 673451, 720323, 769635, 820080, 869578, 916260, 959425, 998910, 1033785, 1062297, 1082879, 1094777, 1097922, 1092782, 1080175, 1060729, 1034610, 1002177, 964731, 924174, 882078, 839451, 797209, 756257, 717108, 679934, 645081, 613071, 584036, 557591, 533424, 511597, 492071, 474395, 458254, 444000, 432054, 421839, 411861, 401040, 389647, 378735, 368986, 360362, 352527, 345117, 337796, 330592, 324158, 319169, 315394, 311936, 308489, 305767]
62531C05767j367l46N8N33J437K270K703L101L624L754L375L401M593O379P736
62516C47018Q630R745J1252J2784J4388J6507J9056K1311K2913K4374K6449K9353
62504E63780L2639L5513L7319L7962L7743L6655L4189L0139K5129J9873J4300
62493I05241P930Q42o346j3153j9313k4415k8176l0899l3075l4550l4763l3669
62481F55654l1818k9621k7077k4253k1422j8712j6192j4170j2874j1821j0268
62470D37426q270o683n930n484m748l828l056k345j480o52k03JM83J427K392K911
62454D01961L162L803N040O140O223N491N138N861P032P664P676P574P386O672
62440D86823N456M248L133J559p40l301n624p769r903j1713j2693j2809j2516
$$ y = [305767, 304400, 304054, 304112, 304645, 306082, 308352, 311055, 314156, 317780, 321534, 324909, 328310, 332903, 339282, 347018, 355648, 365393, 376645, 389429, 403817, 420324, 439380, 460691, 483604, 507978, 534427, 563780, 596419, 631932, 669251, 707213, 744956, 781611, 815800, 845939, 871068, 890941, 905241, 913171, 914013, 907667, 894514, 875201, 850786, 822610, 791711, 758636, 724086, 689323, 655654, 623836, 594215, 567138, 542885, 521463, 502751, 486559, 472389, 459515, 447694, 437426, 429156, 422473, 416543, 411059, 406311, 402483, 399427, 397082, 395602, 394950, 394747, 394748, 395231, 396658, 399050, 401961, 405123, 408926, 413966, 420106, 426329, 431820, 436958, 442819, 449851, 457515, 465191, 472765, 480151, 486823, 492279, 496527, 499660, 501219, 500479, 497178, 491554, 483785, 473882, 462169, 449476, 436667, 424151]
62427D24151j2210j1908j1396j0561r549q596p714o624n187l716k650j950j150
62414C30940l2J031J510J361J130J467K561L987N123N654N655N341N021N101N733
62399C81583O413O438N861N480N656N730N000L697K506J556M61r36k359l480m005
62384D19601l737k952k425k584k962k943k642k468k122q79J253L361M735N592
62370D08828O695Q564J1138J3841J6150J8232K0751K3895K7051K9820L2668L6058
62358F53691L9559M2592M5369M8287N0862N2238N2330N1327M8548M3064L5270
62347A163137K6643J7992R194O15o680j2376j7391k2451k7314l1648l5510l8545
62335A025666l9923l9656l8910l8339l7141l4505l1039k7925k5400k3045k0882
$$ y = [424151, 411941, 400033, 388637, 378076, 368527, 359931, 352217, 345593, 340406, 336690, 334040, 332090, 330940, 330908, 331939, 333449, 334810, 335940, 337407, 339968, 343955, 349078, 354732, 360387, 365728, 370749, 375850, 381583, 387996, 394434, 400295, 405775, 411431, 417161, 422161, 425858, 428364, 429920, 430381, 429445, 427086, 423606, 419601, 415864, 412912, 410487, 407903, 404941, 401998, 399356, 396888, 394766, 393887, 395140, 398501, 403236, 408828, 415523, 424087, 435225, 449066, 465216, 483448, 504199, 528094, 555145, 584965, 617633, 653691, 693250, 735842, 781211, 829498, 880360, 932598, 984928, 1036255, 1084803, 1127867, 1163137, 1189780, 1207772, 1216966, 1217581, 1210901, 1198525, 1181134, 1158683, 1131369, 1099721, 1064211, 1025666, 985743, 946087, 907177, 868838, 831697, 797192, 766153, 738228, 712828, 689783, 668901]
62324F68901j9266j8139j7179j6356j5659j4647j2983j1046r388p995o615n362
62312E14266m328l084j315L91J234J343J407J411O81q40k275k898k824k466k051
62297D98652j895k436l563m363m101l168k562k594k517j561P4J458J978J873J737
62282D77012J848K143K537K974L301L460L735M448N484O460P396Q735J0526J2069
62268E52128J2676J2537J2498J3164J4516J6327J8568K1348K4625K8185L1960
62257G58532L6104M0564M4732M7927N0268N2489N4637N5504N3750M9164M2337
62246A286008L3707K3639J3020K777o928j6159k4141k9870l3718l7202m0908m3772
62234A126453m4748m4103m2547m0231l7323l4526l2077k9040k4647j9762j5935
$$ y = [668901, 649635, 631496, 614317, 597961, 582302, 567655, 554672, 543626, 534238, 526243, 519628, 514266, 509938, 506854, 505539, 505930, 507164, 508507, 509914, 511325, 512006, 511166, 508891, 505993, 503169, 500703, 498652, 496757, 494321, 490758, 486395, 482294, 479126, 476564, 473970, 471453, 469892, 469966, 471424, 473402, 475275, 477012, 478860, 481003, 483540, 486514, 489815, 493275, 497010, 501458, 506942, 513402, 520798, 529533, 540059, 552128, 564804, 577341, 589839, 603003, 617519, 633846, 652414, 673762, 698387, 726572, 758532, 794636, 835200, 879932, 927859, 978127, 1030616, 1085253, 1140757, 1194507, 1243671, 1286008, 1319715, 1343354, 1356374, 1359151, 1352223, 1336064, 1311923, 1282053, 1248335, 1211133, 1170225, 1126453, 1081705, 1037602, 995055, 954824, 917501, 882975, 850898, 821858, 797211, 777449, 761514]
62223G61514j3374j0958q045n210l102j559j93Q52J195Q80L92J44J76K90L58M56
62207G23816O63Q08P10O03J005K007L075L757M217M887N897P195Q877J0966J3075
62192G91558J4755J6113J7772K0150K3052K5938K8384L0173L1137L1097L0048
62181A060177K8273K6071K3318J9722J5561J1754Q799O117L038R8j425j084M46
62168A200865K666N910J0430J5622K0530K4662K7897L0119L1163L0872K9059K5788
62156A455583K1664J7334J2798P854L103l86k494m248o409q790j1089j3310j5024
62143A456586j5375j4389j3196j2262j0483p005k897O9J654L005M734O372P452
62130A404265Q086Q561R081R873J0953J1932J2620J3473J4960J6801J8403J9665
$$ y = [761514, 748140, 737182, 729137, 723927, 720825, 719266, 719073, 719925, 721120, 722000, 722392, 722536, 722712, 723002, 723360, 723816, 724479, 725287, 725997, 726600, 727605, 729612, 732687, 736444, 740661, 745548, 751445, 758640, 767517, 778483, 791558, 806313, 822426, 840198, 860348, 883400, 909338, 937722, 967895, 999032, 1030129, 1060177, 1088450, 1114521, 1137839, 1157561, 1173122, 1184876, 1193675, 1199792, 1202830, 1202928, 1201503, 1200419, 1200865, 1203531, 1209441, 1219871, 1235493, 1256023, 1280685, 1308582, 1338701, 1369864, 1400736, 1429795, 1455583, 1477247, 1494581, 1507379, 1515233, 1518336, 1517950, 1515456, 1511208, 1504799, 1496009, 1484920, 1471610, 1456586, 1441211, 1426822, 1413626, 1401364, 1390881, 1383876, 1380979, 1381048, 1382702, 1385707, 1390441, 1396813, 1404265, 1412351, 1420912, 1429993, 1439866, 1450819, 1462751, 1475371, 1488844, 1503804, 1520605, 1539008, 1558673]
62118A558673K0822K1856K2744K3790K5076K6016K6141K5915K5997K6183K5933
62107A829146K5494K5511K5805K5627K4978K4699K5201K6027K6713K7393K8356
62096B114950K9692L1439L3548L5697L7612L9549M1888M4382M6290M7162M7040
62085B549249M6106M4700M3541M3412M4696M7471N1532N5821N8461N8258N5844
62074C099091N2681M9438M6171M3467M2094M1729M1350M0856M1072M2092M2803
62063C582844M2382M1149L9563L7301L3863K9416K4561J9743J5073J0369N229
62052C881493m29n941j0571j4447j8171k1749k4785k7548l0698l3930l5990l6316
62040C620918l5614l4544l2918l0572k7965k5378k2505j9449j7164j6085j5108
$$ y = [1558673, 1579495, 1601351, 1624095, 1647885, 1672961, 1698977, 1725118, 1751033, 1777030, 1803213, 1829146, 1854640, 1880151, 1905956, 1931583, 1956561, 1981260, 2006461, 2032488, 2059201, 2086594, 2114950, 2144642, 2176081, 2209629, 2245326, 2282938, 2322487, 2364375, 2408757, 2455047, 2502209, 2549249, 2595355, 2640055, 2683596, 2727008, 2771704, 2819175, 2870707, 2926528, 2984989, 3043247, 3099091, 3151772, 3201210, 3247381, 3290848, 3332942, 3374671, 3416021, 3456877, 3497949, 3540041, 3582844, 3625226, 3666375, 3705938, 3743239, 3777102, 3806518, 3831079, 3850822, 3865895, 3876264, 3881493, 3881064, 3875123, 3864552, 3850105, 3831934, 3810185, 3785400, 3757852, 3727154, 3693224, 3657234, 3620918, 3585304, 3550760, 3517842, 3487270, 3459305, 3433927, 3411422, 3391973, 3374809, 3358724, 3343616]
62029C343616j2853r476o377m558l933l936m058l938l519l131l056l191l389l813
62015C274388m583n334n509m967m088l406l238l541l979m359m866n553n763m717
62001C210485k602n17P99J375J186k45k991o395j0114j4793k1043k8321l5499
61988C091325m2061m8108n3464n7536n9844o0206n8663n5700n2289m9211m6404
61977B507839m3493m0585l8100l5952l3566l0690k7780k5482k4074k3376k2957
61966B161784k2385k1501k0398j9139j7677j6167j5057j4585j4456j4243j3858
61955A972318j3421j2930j2386j1973j1726j1220r967p941n434k587M72L266N317
61942A881788O843Q659J1178J3941J6242J7878J9113K0161K1068K1891K2721K3449
$$ y = [3343616, 3330763, 3321287, 3314910, 3310352, 3306419, 3302483, 3298425, 3294487, 3290968, 3287837, 3284781, 3281590, 3278201, 3274388, 3269805, 3264471, 3258962, 3253995, 3249907, 3246501, 3243263, 3239722, 3235743, 3231384, 3226518, 3220965, 3215202, 3210485, 3207883, 3207366, 3208165, 3209540, 3210726, 3210481, 3207490, 3201095, 3190981, 3176188, 3155145, 3126824, 3091325, 3049264, 3001156, 2947692, 2890156, 2830312, 2770106, 2711443, 2655743, 2603454, 2554243, 2507839, 2464346, 2423761, 2385661, 2349709, 2316143, 2285453, 2257673, 2232191, 2208117, 2184741, 2161784, 2139399, 2117898, 2097500, 2078361, 2060684, 2044517, 2029460, 2014875, 2000419, 1986176, 1972318, 1958897, 1945967, 1933581, 1921608, 1909882, 1898662, 1888695, 1880754, 1875320, 1872733, 1873205, 1876471, 1881788, 1888631, 1897290, 1908468, 1922409, 1938651, 1956529, 1975642, 1995803, 2016871, 2038762, 2061483, 2084932]
61930B084932K3819K3759K3476K3111K2489K1423K0153J9238J9028J9597K1157
61919B322182K4119K8577L4196M0872M9118N9452P1691Q5289J00111J16407J34219
61908C066233J53383J74073J96842K22122K50061K80810L14662L51959L93119
61899E403264M38440M87265N37426N85752O28737O61871O78433O69855O27900
61890A0718943N46957M25598K68071Q5247j06618k89533m47765n70645o53979
61881I976276o99784p13848p02557o71632o27047n75333n21935m69682m19535
61872D574923l72296l29053k90342k55867k25133j97987j74372j53899j35895
61863B440079j19783j05292r2137p9624o7061n4687m3617l4418k6238j7931r506
$$ y = [2084932, 2108751, 2132510, 2155986, 2179097, 2201586, 2223009, 2243162, 2262400, 2281428, 2301025, 2322182, 2346301, 2374878, 2409074, 2449946, 2499064, 2558516, 2630207, 2715496, 2815607, 2932014, 3066233, 3219616, 3393689, 3590531, 3812653, 4062714, 4343524, 4658186, 5010145, 5403264, 5841704, 6328969, 6866395, 7452147, 8080884, 8742755, 9421188, 10091043, 10718943, 11265900, 11691498, 11959569, 12044816, 11938198, 11648665, 11200900, 10630255, 9976276, 9276492, 8562644, 7860087, 7188455, 6561408, 5986075, 5464140, 4994458, 4574923, 4202627, 3873574, 3583232, 3327365, 3102232, 2904245, 2729873, 2575974, 2440079, 2320296, 2215004, 2122867, 2043243, 1976182, 1921495, 1877878, 1843460, 1817222, 1799291, 1789785]
61852A789785j664N574J2649J9112K3807K6455K7829K8247K7072K4049J9929J5268
61840B018112R785L478k654p748j1946j5437j7518j7395j5166j1280n941K48N925
61827A932463J0278J3903J7341J9511J8788J5169J0017M076l038j1302j9489k6182
61815A981535l0896l3969l5864l6733l6364l4546l1637k8354k4767k0128j4098
61804A654179p497j218M863J1167J7308K2733K7887L3585L9634M5187N0251N5638
61792A953717O1546O7409P3152P9507Q6907R5101J04111J14539J26714J40306
61782B903009J55204J71990J91377K13808K39869K70335L05669L46132L92551
61773E189944M46207N07661N76462O52241P35093Q24333R17414J010423J098674
$$ y = [1789785, 1788121, 1793695, 1806344, 1825456, 1849263, 1875718, 1903547, 1931794, 1958866, 1982915, 2002844, 2018112, 2027897, 2031375, 2028721, 2020973, 2009027, 1993590, 1976072, 1958677, 1943511, 1932231, 1926290, 1926538, 1932463, 1942741, 1956644, 1973985, 1993496, 2012284, 2027453, 2037470, 2041546, 2038508, 2027206, 2007717, 1981535, 1950639, 1916670, 1880806, 1844073, 1807709, 1773163, 1741526, 1713172, 1688405, 1668277, 1654179, 1646682, 1645464, 1650327, 1661494, 1678802, 1701535, 1729422, 1763007, 1802641, 1847828, 1898079, 1953717, 2015263, 2082672, 2155824, 2235331, 2322238, 2417339, 2521450, 2635989, 2762703, 2903009, 3058213, 3230203, 3421580, 3635388, 3875257, 4145592, 4451261, 4797393, 5189944, 5636151, 6143812, 6720274, 7372515, 8107608, 8931941, 9849355, 10859778, 11958452]
61764A1958452J175745J232161J255650J232734J150492R98925P74959M86722
61756B0265840J54929j90538n17560p99005j017350j165655j245903j266555j240027
61747A2978176j180040j099066j006934r10854q16020p26011o43077n68382n02131
61738E525661m43712l92174l46814l07110k72304k41443k13997j89976j69253
61729B948878j51058j34397j18809j04568r2231q2108p3989o7343o1918n8091
61719B004366n6364n6467n7198n7258n6152n4178n1808m9234m6408m3297l9968
61708A436034l6509l2984k9553k6528k4084k2002j9942j7953j6337j5144j4203
61697A180795j3669j3833j4352j4354j3716j3332j3621j3629j2477j0968j0549
$$ y = [11958452, 13134197, 14366358, 15622008, 16854742, 18005234, 19004159, 19779118, 20265840, 20420769, 20230231, 19712671, 18913666, 17896316, 16730661, 15484758, 14218203, 12978176, 11798136, 10699070, 9692136, 8781282, 7965262, 7239251, 6596174, 6027792, 5525661, 5081949, 4689775, 4342961, 4035851, 3763547, 3522104, 3308107, 3118131, 2948878, 2797820, 2663423, 2544614, 2440046, 2347815, 2265707, 2191718, 2124375, 2062457, 2004366, 1948002, 1891535, 1834337, 1777079, 1720927, 1666749, 1614941, 1565707, 1519299, 1476002, 1436034, 1399525, 1366541, 1336988, 1310460, 1286376, 1264374, 1244432, 1226479, 1210142, 1194998, 1180795, 1167126, 1153293, 1138941, 1124587, 1110871, 1097539, 1083918, 1070289, 1057812, 1046844, 1036295]
61686A036295j1168j1379j0488r330q796q785q870r027r217r102q695q558q961
61673I13919r393r329q878q273p343o060n011m732m974n220n507o080o587o315
61659H20217n250m215l824l702l020j533J04J058J208J227J815L047M544O056
61645H17732P460Q465Q764Q514Q088P374N868L679J775R48R93J268J537J853K109
61630H86427K360L211N135P469Q824Q492P033N332L669J849k58k726n677q991
61616I22149j2086j4427j6137j7624j8683j8495j6824j4675j3287j2763j2286
61605G54862j1505j0911j0731j0239q757o723n125m215l516k843k510k488k189
61592F73110j373n98l47k17N24J902L237M038M428M727N030N320N642O053O537
$$ y = [1036295, 1025127, 1013748, 1003260, 993930, 985134, 976349, 967479, 958452, 949235, 940133, 931438, 922880, 913919, 904526, 895197, 886319, 878046, 870703, 864643, 859632, 854900, 849926, 844706, 839199, 833119, 826532, 820217, 814967, 810752, 806928, 803226, 800206, 798673, 798777, 799835, 801043, 802270, 804085, 807132, 811676, 817732, 825192, 833657, 842421, 850935, 859023, 866397, 872265, 875944, 877719, 878667, 879660, 880928, 882465, 884318, 886427, 888787, 891998, 897133, 904602, 913426, 921918, 928951, 934283, 937952, 939801, 939543, 936817, 931140, 922149, 910063, 895636, 879499, 861875, 843192, 824697, 807873, 793198, 779911, 767148, 754862, 743357, 732446, 721715, 711476, 702719, 695996, 690871, 686656, 683140, 680297, 677787, 675299, 673110, 671737, 671139, 670792, 670575, 671099, 673001, 676238, 680276, 684704, 689431, 694461, 699781, 705423, 711476, 718013]
61577G18013P145Q071R356J0679J1684J2524J3800J5746J7851J9498K0717K1884
61565H86968K2974K3742K4491K5843K7604K8659K8351K7267K6214K5156K3809
61554A171078K2583K2021K1757K1002J9749J8617J7642J6212J4157J1944R753
61543A366515P253M407J594j320n074r725j4110j7086j8724j9745k0419k0552
61531A253014k0109j9129j7405j4894j2159r907q121o142l465j18L614P443J1089
61518A163711J4418J7630K1136K5259L0157L5902M2432M9457N6712O4255P2601
61507A593670Q2443R4180J07514J21632J35969J50803J66798J83928K01073K16740
61497C054750K29795K39437K44547K43255K33140K12168J79877J37913Q9386L7879
$$ y = [718013, 725158, 733229, 742585, 753264, 764948, 777472, 791272, 807018, 824869, 844367, 865084, 886968, 909942, 933684, 958175, 984018, 1011622, 1040281, 1068632, 1095899, 1122113, 1147269, 1171078, 1193661, 1215682, 1237439, 1258441, 1278190, 1296807, 1314449, 1330661, 1344818, 1356762, 1366515, 1373768, 1378175, 1379769, 1378449, 1373375, 1363650, 1349540, 1332454, 1313730, 1293985, 1273566, 1253014, 1232905, 1213776, 1196371, 1181477, 1169318, 1159411, 1151290, 1145148, 1141683, 1141565, 1145179, 1152622, 1163711, 1178129, 1195759, 1216895, 1242154, 1272311, 1308213, 1350645, 1400102, 1456814, 1521069, 1593670, 1676113, 1770293, 1877807, 1999439, 2135408, 2286211, 2453009, 2636937, 2838010, 3054750, 3284545, 3523982, 3768529, 4011784, 4244924, 4457092, 4636969, 4774882, 4864268, 4902147]
61487D902147j2953n9559r9299j31193j55440j72232j81632j84400j82100j76003
61477C547336j66558j54192j39995j25265j10783r6919q3823p1212n8407m5178
61467B495004l2228k0417r815O3R390J7902K5513L2499L9067M4992M9780N3116
61455B704866N5208N6607N7503N7353N5614N2767N0023M7949M6088M4174M2912
61444C271064M3076M4363M5763M6647M6902M6337M4705M2140L9050L5576L1637
61433C737260K7333K2870J8181J3094P820K797j926o742j1895j7229k2582k7978
61421C741003l3218l7603m0305m1060m0364l8910l6856l3853k9767k5151k0675
61410C363241j6325j1703p057l364j200k14l7j123m084q614j3599j8074k1663
$$ y = [4902147, 4889194, 4829635, 4730336, 4599143, 4443703, 4271471, 4089839, 3905439, 3723339, 3547336, 3380778, 3226586, 3086591, 2961326, 2850543, 2753624, 2669801, 2598589, 2540182, 2495004, 2462776, 2442359, 2432544, 2432607, 2441997, 2459899, 2485412, 2517911, 2556978, 2601970, 2651750, 2704866, 2760074, 2816681, 2874184, 2931537, 2987151, 3039918, 3089941, 3137890, 3183978, 3228152, 3271064, 3314140, 3358503, 3404266, 3450913, 3497815, 3544152, 3588857, 3630997, 3670047, 3705623, 3737260, 3764593, 3787463, 3805644, 3818738, 3826558, 3829355, 3827429, 3820687, 3808792, 3791563, 3768981, 3741003, 3707785, 3670182, 3629877, 3588817, 3548453, 3509543, 3472687, 3438834, 3409067, 3383916, 3363241, 3346916, 3335213, 3328156, 3324792, 3323592, 3323378, 3323341, 3322218, 3318134, 3309520, 3295921, 3277847, 3256184]
61397C256184k4252k5782k6250k5508k3180j9039j3285o140K602J3297K5909M0184
61385C174740N6015P3260R1422J10061J29368J49768J70980J91977K11820K30025
61375D589436K46095K59055K67490K69644K63471K47139K19844J82245J36352
61366F680771Q5356L3289j6060o0381r9083j32430j60716j84134k02901k17203
61356E726508k27255k33365k35736k34228k28701k19716k08511j96171j83178
61347C759647j69870j56842j44519j32633j20603j08414r6735q6091p6195o6302
61337B601443n6099m5978l6389k7197j7906q465N52Q606J5827K2742K9533L5781
61325B522450M0887M4574M6988M8409M8875M8119M5985M2885L9617L6626L3647
$$ y = [3256184, 3231932, 3206150, 3179900, 3154392, 3131212, 3112173, 3098888, 3092748, 3095350, 3108647, 3134556, 3174740, 3230755, 3304015, 3395437, 3505498, 3634866, 3784634, 3955614, 4147591, 4359411, 4589436, 4835531, 5094586, 5362076, 5631720, 5895191, 6142330, 6362174, 6544419, 6680771, 6766127, 6799416, 6783356, 6722975, 6623892, 6491462, 6330746, 6146612, 5943711, 5726508, 5499253, 5265888, 5030152, 4795924, 4567223, 4347507, 4138996, 3942825, 3759647, 3589777, 3432935, 3288416, 3155783, 3035180, 2926766, 2830031, 2743940, 2667745, 2601443, 2545344, 2499366, 2462977, 2435780, 2417874, 2409409, 2409961, 2418567, 2434394, 2457136, 2486669, 2522450, 2563337, 2607911, 2654899, 2703308, 2752183, 2800302, 2846287, 2889172, 2928789, 2965415, 2999062]
61314B999062L0178K6182K2124J8585J5947J4257J3105J1725R515O469K984p19
61302C169414m806r542j4854k0239k5097k9264l3095l6872m0295m2892m4773m6486
61290B821199m8094m9014m8895m8040m6676m4381m0748l6150l1329k6539k1620
61279B379713j6693j2268q817o571n447m918m318l690l902n396p357q729r560
61266B282047j0409j0838r596o344k200J628M869P683R999J1814J3537J5604J8311
61253B326105K2188K7990L5934M5443N5878O7015P8491Q9400R8923J06854J12977
61242C067198J16258J15106J08175R4571P3743M5933J2705k3244n8797r0974j17380
61231C343294j36870j49681j56641j58322j55191j48163j38480j27223j15321
$$ y = [2999062, 3029240, 3055422, 3077546, 3096131, 3112078, 3126335, 3139440, 3151165, 3160680, 3167149, 3170133, 3169414, 3164608, 3155066, 3140212, 3119973, 3094876, 3065612, 3032517, 2995645, 2955350, 2912458, 2867685, 2821199, 2773105, 2724091, 2675196, 2627156, 2580480, 2536099, 2495351, 2459201, 2427872, 2401333, 2379713, 2363020, 2350752, 2341935, 2335364, 2329917, 2324999, 2320681, 2316991, 2313089, 2307693, 2300336, 2291607, 2282047, 2271638, 2260800, 2251204, 2244860, 2242660, 2244288, 2249157, 2256840, 2266839, 2278653, 2292190, 2307794, 2326105, 2348293, 2376283, 2412217, 2457660, 2513538, 2580553, 2659044, 2748444, 2847367, 2954221, 3067198, 3183456, 3298562, 3406737, 3501308, 3575051, 3620984, 3633689, 3610445, 3551648, 3460674, 3343294, 3206424, 3056743, 2900102, 2741780, 2586589, 2438426, 2299946, 2172723, 2057402]
61222B057402j03773r3296q3849p5003o6679n9063n1963m4951l8209l2561k8411
61211A379644k5154k1888j8281j4495j0743p261m347j925O84M103Q107J1862J4907
61198A315213J7502K0060K2505K4317K4919K3953K1487J8084J4540J1315Q293
61187A522188N197K205p0j336k261m027p044j0312j2511j3601j4825j6934j9087
61174A427582k0080k0121k0584k2101k3839k4855k5322k6012k7127k8309k9336
61163A159896l0210l0715l0536k9745k8741k7680k6386k4836k3310k1981k0670
61152H65086j9102j7167j4970j2933j1857j2459j4597j7121j8720j8845j7817
61141F89498j6306j4821j3534j2382j1238r985q462o527m288k147m60P63J648
$$ y = [2057402, 1953629, 1860333, 1776484, 1701481, 1634802, 1575739, 1523776, 1478825, 1440616, 1408055, 1379644, 1354490, 1332602, 1314321, 1299826, 1289083, 1281822, 1277475, 1275550, 1276234, 1280337, 1288444, 1300306, 1315213, 1332715, 1352775, 1375280, 1399597, 1424516, 1448469, 1469956, 1488040, 1502580, 1513895, 1522188, 1527385, 1529590, 1529520, 1528184, 1525923, 1521896, 1514852, 1504540, 1492029, 1478428, 1463603, 1446669, 1427582, 1407502, 1387381, 1366797, 1344696, 1320857, 1296002, 1270680, 1244668, 1217541, 1189232, 1159896, 1129686, 1098971, 1068435, 1038690, 1009949, 982269, 955883, 931047, 907737, 885756, 865086, 845984, 828817, 813847, 800914, 789057, 776598, 762001, 744880, 726160, 707315, 689498, 673192, 658371, 644837, 632455, 621217, 611232, 602770, 596243, 591955, 589808, 589348, 590111, 591759]
61128E91759K236K675L447M957O870Q304Q736Q505Q366Q779R685J0671J1307J1464
61114F97761J1350J1183J0916J0499J0171J0134J0181J0067J0025J0323J0400
61103H13010R173O437L313R29p73k537m519o073o639o367n856n565n523n514n514
61088G77982n856o836q182r209r614r768j0174j0873j1556j2014j2264j2325j2047
61075F47264j1215r844q382p413o967o395n231l841k804j936o98O32J062L15o34
61060E83913q04k82L28Q89J538K068K105J717J308J113J130J364J733J939J864
61045F01923J856K275K827K853K262J762K067L055L931M152M076M590O126Q200
61031F51955J0022J1291J2208J2921J3431J3895J4503J5055J5112J4651J4151
$$ y = [591759, 593995, 596670, 600117, 605074, 611944, 620248, 628984, 637489, 645855, 654634, 664319, 674990, 686297, 697761, 709111, 720294, 731210, 741709, 751880, 762014, 772195, 782262, 792287, 802610, 813010, 822183, 828620, 831933, 832862, 832089, 829552, 825033, 818960, 812321, 805954, 800098, 794533, 789010, 783496, 777982, 772126, 765290, 757108, 747899, 738285, 728517, 718343, 707470, 695914, 683900, 671636, 659311, 647264, 636049, 626205, 617823, 610410, 603443, 597048, 591817, 587976, 585172, 583236, 582538, 583170, 584232, 584547, 583913, 583109, 582827, 583155, 584044, 585582, 587650, 589755, 591472, 592780, 593893, 595023, 596387, 598120, 600059, 601923, 603779, 606054, 608881, 611734, 613996, 615758, 617825, 620880, 624811, 628963, 633039, 637629, 643755, 651955, 661977, 673268, 685476, 698397, 711828, 725723, 740226, 755281, 770393, 785044, 799195]
61020G99195J3872J3519J2755J1777J1088J0904J0942J0778J0444J0591J1779
61009I27644J3588J5004J5953J7650K0890K4746K7898L0674L4431L9220M3383
60998A211081M5702M6817M8344N1398N6242O2632P0370P9920R2099J06526J21119
60987A992250J34336J47377J62961J82921K08811K44005K92563L56307M35429
60978D156960N31421O46409P80106R31588J104544J306917J545634J825405K144827
60969A4973811K470025K698195K670261K267975J530788O71903m2651m45718n18958
60960B6275631l33289J1936L81003N83114M35217j12484r14018j708571k278436
60951B2340103k546941k558339k399468k146489j855636j567454j305632j078047
$$ y = [799195, 813067, 826586, 839341, 851118, 862206, 873110, 884052, 894830, 905274, 915865, 927644, 941232, 956236, 972189, 989839, 1010729, 1035475, 1063373, 1094047, 1128478, 1167698, 1211081, 1256783, 1303600, 1351944, 1403342, 1459584, 1522216, 1592586, 1672506, 1764605, 1871131, 1992250, 2126586, 2273963, 2436924, 2619845, 2828656, 3072661, 3365224, 3721531, 4156960, 4688381, 5334790, 6114896, 7046484, 8151028, 9457945, 11003579, 12828984, 14973811, 17443836, 20142031, 22812292, 25080267, 26611055, 27282958, 27240307, 26794589, 26275631, 25942342, 25954278, 26335281, 26918395, 27353612, 27241128, 26327110, 24618539, 22340103, 19793162, 17234823, 14835355, 12688866, 10833230, 9265776, 7960144, 6882097]
60943F882097q84911p24957n94864m88758m01837l32506k79557k39528k08338
60934B726841j83629j64161j48451j35206j23897j13907j04111r3917q3792p4354
60924A501416o5950n9291n5250n3595n3006n2554n2083n1143m8945m5565m1812
60913I22222l7844l3283k8815k5824k4181k2173j9166j6464j4858j3257j0797
60902F75560q570p832p876p151n523m042l199k633k053j338j38J638L320M123
60888F34286M083L846L857M141M422M252L462K570K085J508j29k612m576n411
60874F55784o034p378r135j0377j0551r583p967o910p304q336q361p208o252n963
60860E44425n136l094q68O24J977L823N445O040O108O466P039P633Q740J0527
$$ y = [6882097, 5997186, 5272229, 4677365, 4188607, 3786770, 3454264, 3174707, 2935179, 2726841, 2543212, 2379051, 2230600, 2095394, 1971497, 1857590, 1753479, 1659562, 1575770, 1501416, 1435466, 1376175, 1320925, 1267330, 1214324, 1161770, 1109687, 1058544, 1009599, 964034, 922222, 884378, 851095, 822280, 796456, 772275, 750102, 730936, 714472, 699614, 686357, 675560, 666990, 659158, 651282, 644131, 638608, 634566, 631367, 628734, 626681, 625343, 625205, 626843, 630163, 634286, 638369, 642215, 646072, 650213, 654635, 658887, 662349, 664919, 667004, 668512, 668383, 665771, 661195, 655784, 649750, 642372, 633237, 622860, 612309, 602726, 594759, 587849, 580545, 572209, 563848, 556640, 550388, 544425, 539289, 536195, 535327, 535951, 537928, 541751, 547196, 553236, 559344, 565810, 572849, 580482, 589222, 599749]
60846E99749J2171J3219J4367J5903J6804J6606J6713J8227J9811J9413J7096
60835G80079J4321J1462Q050M732K850K279J625N16q7J24J15q95k496l947m947
60820H13781n350n221n202n947p162q045q564r346j0496j1436j1936j2329j2700
60807G00047j2737j2401j1967j1386j0345q893p454o248n263m552m056l450k706
60794E98589k300k297j855m11J319K401L107M225N567O468P289Q942J1129J2435
60780F54608J2291J1670J1628J2189J2891J3463J3738J3633J3389J3291J3119
60769G95910J2463J1459J0595R957R295Q617Q016P159N761M271L287K599J597
60756H90986M16l51p77j479k428k935k807k611k737l008l269l596l891l946l891
$$ y = [599749, 611920, 625139, 639506, 655409, 672213, 688819, 705532, 723759, 743570, 762983, 780079, 794400, 805862, 813912, 818644, 821494, 823773, 825398, 825914, 825827, 825951, 826066, 825171, 822675, 818728, 813781, 808431, 803210, 798008, 792061, 784899, 776854, 768290, 758944, 748448, 737012, 725076, 712747, 700047, 687310, 674909, 662942, 651556, 641211, 632318, 624864, 618616, 613353, 608801, 604745, 601295, 598589, 596289, 593992, 592137, 591726, 593045, 595446, 598553, 602778, 608345, 614813, 622102, 631044, 642173, 654608, 666899, 678569, 690197, 702386, 715277, 728740, 742478, 756111, 769500, 782791, 795910, 808373, 819832, 830427, 840384, 849679, 858296, 866312, 873471, 879232, 883503, 886790, 889389, 890986, 891402, 891051, 890274, 888795, 886367, 883432, 880625, 878014, 875277, 872269, 869000, 865404, 861513, 857567, 853676]
60741H53676m033m362m856n955p937j0101j1368j1518j1055j0203q935p702p094
60728G48557o884o372n514m780m102l063j878j150o70L73J999L300L770L729L429
60713G30744K753J947J598J749J914J991K213K291J673P30M22P04M50p27j849
60698G48603k131k038k251k610k856l457m991p207r255j0492j0743j0302r884
60685F70386j0066j0587j0717j0349j0068j0078r925r446r060q892q379p220n960
60672E49639n182m690l910k643j122K79J229J698K162L129M403N267N399N122
60658E60780M838M702M723M688M176L253K835L579M772N185M759M449M659N009
60644F22407N455O279O961O397M636L119K863L449M219N264O644P770Q248Q616
$$ y = [853676, 849643, 845281, 840425, 834470, 826533, 816432, 805064, 793546, 782491, 772288, 763353, 755651, 748557, 741673, 735301, 729787, 725007, 720905, 717842, 715964, 714814, 714144, 714517, 716516, 719816, 723586, 727315, 730744, 733497, 735444, 737042, 738791, 740705, 742696, 744909, 747200, 748873, 749603, 750025, 750729, 751179, 750452, 748603, 746472, 744434, 742183, 739573, 736717, 733260, 728269, 721062, 711807, 701315, 690572, 680270, 670386, 660320, 649733, 639016, 628667, 618599, 608521, 598596, 589150, 580090, 571198, 562819, 555599, 549639, 544457, 539767, 535857, 533214, 532092, 532371, 533600, 535298, 537460, 540589, 544992, 550259, 555658, 560780, 565618, 570320, 575043, 579731, 583907, 587160, 589995, 593574, 598346, 603531, 608290, 612739, 617398, 622407, 627862, 634141, 641102, 647499, 652135, 655254, 658117, 661566, 665785, 671049, 677693, 685463, 693711, 702327]
60630G02327R469J0526J1131J1127J0831J0595J0650J0875J0572R096O802M716
60618H18717L243J963O99k90j226k827n034o783p483p821q584r584j0179j0037
60604G54774q928o635l612j109o6l85j491k975m428n442o085o722p217p073o413
60589F86193n880n437m316k410o03O87K095L972N491N795N113M204L451K992K911
60574G04258K870K330J521J255J594J693J344J386K156K752K499J905J465P52
60560G29780m95j544j883k233l352m750n519n645n598n507n468n751n876m603
60546F71556j749J044K478L423N365Q079J0378J2352J5215J9327K3883K8390L3104
60533H32845L8004M2389M5514M6789M5601M1666L5330K6902J6128L207j0176k1753
$$ y = [702327, 711796, 722322, 733453, 744580, 755411, 766006, 776656, 787531, 798103, 807199, 814001, 818717, 821960, 823923, 824622, 824332, 823106, 820279, 815245, 808462, 800979, 793158, 784574, 774990, 764811, 754774, 745846, 739211, 735599, 734490, 734424, 734039, 732548, 729573, 725145, 719703, 713618, 706896, 699679, 692606, 686193, 680313, 674876, 670560, 668150, 667547, 668234, 670329, 674301, 679792, 685587, 690700, 694904, 698355, 701347, 704258, 707128, 709458, 710979, 712234, 713828, 715521, 716865, 718251, 720407, 723159, 725658, 727563, 729028, 729780, 729285, 727741, 725858, 723625, 720273, 715523, 710004, 704359, 698761, 693254, 687786, 682035, 676159, 671556, 669807, 670851, 673329, 676752, 682117, 690196, 700574, 712926, 728141, 747468, 771351, 799741, 832845, 870849, 913238, 958752, 1005541, 1051142, 1092808, 1128138, 1155040, 1171168, 1174375, 1164199, 1142446]
60521A142446l0313l5762l8106l7421l4435l0191k5230j9725j4104q791l789P54
60509H65333M110N844O621P324P902P947P863Q444R739J1328J3359J6391K0530
60496I92735K5527L1350L7888M4628N1490N9349O8705P8449Q7060R4582J02260
60485A674023J10707J19813J30200J43420J60686J82347K08405K38354K70379
60476C238334L01250L26477L39794L33647L02319K45101J65877P0414l4194j38187
60466E150832k30140l01032l47070l68821l69273l53143l26324k94309k61026
60457B299694k29030j99880j73900j50510j29370j10849r5268q2350p1556o2321
60447I94660n3881m5619l7838l1475k6904k3553k0787j8417j6331j4351j2661
$$ y = [1142446, 1112133, 1076371, 1038265, 1000844, 966409, 936218, 910988, 891263, 877159, 868368, 864579, 865333, 869443, 875287, 881908, 889232, 897134, 905081, 912944, 921388, 931127, 942455, 955814, 972205, 992735, 1018262, 1049612, 1087500, 1132128, 1183618, 1242967, 1311672, 1390121, 1477181, 1571763, 1674023, 1784730, 1904543, 2034743, 2178163, 2338849, 2521196, 2729601, 2967955, 3238334, 3539584, 3866061, 4205855, 4539502, 4841821, 5086922, 5252799, 5323213, 5289019, 5150832, 4920692, 4619660, 4272590, 3903769, 3534496, 3181353, 2855029, 2560720, 2299694, 2070664, 1870784, 1696884, 1546374, 1417004, 1306155, 1210887, 1128537, 1056981, 994660, 940779, 895160, 857322, 825847, 798943, 775390, 754603, 736186, 719855, 705504, 692843]
60436F92843j1680j1382j1335j1385j1626j1759j1268j0248r260q402p310o124
60424E71064n478n421n286m699l913l018j858q11n96r97q79J16R79R24N15N27
60408E41169O79M22J37O47J954L315M231M598M266L250K197J890K367L061L747
60393E77930M662N694O151N713N107N321O305O941O433N218M117L072J425o94
60379F43395k266k910l470m582n521n350m460l904l753l282k472k011j953j611
60365E95850r06n47n81p1J288K345K064J097Q93J828L101M017M611N136N593N930
60349F31648O220O567O916P031O727O236O169O792P470P350O563O124O547P024
60335G25384O354M293J696l94j533j933k016j911j415m45O31J304J477J436J504
$$ y = [692843, 681163, 669781, 658446, 647061, 635435, 623676, 612408, 602160, 592900, 584498, 577188, 571064, 565586, 560165, 554879, 550180, 546267, 543249, 541391, 540580, 539984, 538987, 538108, 538224, 539203, 540127, 540642, 541169, 541848, 542270, 542407, 543054, 545008, 548323, 552554, 557152, 561418, 564668, 566865, 568755, 571122, 574183, 577930, 582592, 588286, 594437, 600150, 605257, 610578, 616883, 623824, 630257, 635475, 639592, 642664, 644089, 643395, 641129, 638219, 634749, 630167, 624646, 619296, 614836, 610932, 607179, 603897, 601425, 599414, 597461, 595850, 594944, 594397, 593816, 593745, 595033, 597378, 599442, 600539, 601432, 603260, 606361, 610378, 614989, 620125, 625718, 631648, 637868, 644435, 651351, 658382, 665109, 671345, 677514, 684306, 691776, 699126, 705689, 711813, 718360, 725384, 731738, 736031, 737727, 737333, 735800, 733867, 731851, 729940, 728525, 728080, 728711, 730015, 731492, 732928, 734432]
60320G34432J835K336K490J598l83k541l954m576m757m412l415k396k204k641
60306G11412k704k050j394j305j508j572j543j573j521j213p21j48M52R23J206
60291F96741J609K441L332L586L115K513K204K185K514L315M216M595M474M458
60277G41298M678M621M139L787L791L531K597J646J649K674L908M556M496M315
60263G91686M904O669Q965J0778J1997J3497J5778J8183J9825K0813K2091K4389
60251I69575K7711L1633L5811M0221M5036N0220N5464O0679O6365P3061Q0573
60240A536349Q8197R5470J02202J07906J11900J14033J14734J14283J12447J08790
60230B606311J02938R4688Q4242P2174N8750M3745K7543J1814j894j3846k5284
$$ y = [734432, 736267, 738603, 741093, 742691, 742308, 739767, 735813, 731237, 726480, 722068, 718653, 716257, 714053, 711412, 708708, 706658, 705264, 703959, 702451, 700879, 699336, 697763, 696242, 695029, 694308, 694160, 694612, 695535, 696741, 698350, 700791, 704123, 707709, 710824, 713337, 715541, 717726, 720240, 723555, 727771, 732366, 736840, 741298, 745976, 750597, 754736, 758523, 762314, 765845, 768442, 770088, 771737, 774411, 778319, 782875, 787371, 791686, 796590, 803259, 812224, 823002, 834999, 848496, 864274, 882457, 902282, 923095, 945186, 969575, 997286, 1028919, 1064730, 1104951, 1149987, 1200207, 1255671, 1316350, 1382715, 1455776, 1536349, 1624546, 1720016, 1822218, 1930124, 2042024, 2156057, 2270791, 2385074, 2497521, 2606311, 2709249, 2803937, 2888179, 2960353, 3019103, 3062848, 3090391, 3102205, 3100311, 3086465, 3061181]
60219C061181l6132m4803n0273n3025n3829n2740m9670m4796l8014k9060j8461
60208B590378p369L946J6295K9857M3388N5788O7442P9235R1089J02189J11871
60197C184109J19469J23908J24323J20731J13623J03321R0212P4949N7965L9313
60187D151923J9396p22k0178l8813n6380p1986q4816r4720j01501j04420j03048
60176C494735r8028r0261q0012o7364n3005l7724k1775n397J0568K5385L9299
60165C116421N2809O5437P6017Q3874Q8854R0427Q7720Q0539O9816N6907M2873
60154C911694K8381J3861l03j3532k5071l4364m1107m4837m4975m1473l5008k6128
60142C647138j4719p56J4954L1312M7925O4999Q2649J00849J19939J40547J63042
$$ y = [3061181, 3025049, 2980246, 2929973, 2876948, 2823119, 2770379, 2720709, 2675913, 2637899, 2608839, 2590378, 2583009, 2586955, 2603250, 2633107, 2676495, 2732283, 2799725, 2878960, 2970049, 3072238, 3184109, 3303578, 3427486, 3551809, 3672540, 3786163, 3889484, 3979696, 4054645, 4112610, 4151923, 4171319, 4170597, 4150419, 4111606, 4055226, 3983240, 3898424, 3803704, 3702203, 3597783, 3494735, 3396707, 3306446, 3226434, 3159070, 3106065, 3068341, 3046566, 3041169, 3051737, 3077122, 3116421, 3169230, 3234667, 3310684, 3394558, 3483412, 3573839, 3661559, 3742098, 3811914, 3868821, 3911694, 3940075, 3953936, 3953633, 3940101, 3915030, 3880666, 3839559, 3794722, 3749747, 3708274, 3673266, 3647138, 3632419, 3631663, 3646617, 3677929, 3725854, 3790853, 3873502, 3974351, 4094290, 4234837, 4397879]
60131D397879J87359K13193K40016K66970K93131L17829L40502L60249L75669
60122F992797L85194L87660L82679L70395L50750L23363K88385K47103K01079
60113I929405J51132R7763M2064j4765p2346j30283j86455k37518k81207l16775
60103H981015l43099l58233l61566l54963l40740l19784k92566k60690k26036
60094F123338j89328j50900j12094p4454l8136k522L1807O3028Q9717J11382J27458
60083E979296J36944J39177J34193J22237J03767Q0100N3440K5997p45k6089m9868
60072F698449p1950r1782j08730j23062j35925j47907j58198j65754j70569j73093
60062E351479j73099j70112j64483j57015j47727j35960j21634j05651q9045p2273
$$ y = [4397879, 4585238, 4798431, 5038447, 5305417, 5598548, 5916377, 6256879, 6617128, 6992797, 7377991, 7765651, 8148330, 8518725, 8869475, 9192838, 9481223, 9728326, 9929405, 10080537, 10178300, 10220364, 10205599, 10133253, 10002970, 9816515, 9578997, 9297790, 8981015, 8637916, 8279683, 7918117, 7563154, 7222414, 6902630, 6610064, 6349374, 6123338, 5934010, 5783110, 5671016, 5596562, 5558426, 5555904, 5587711, 5650739, 5740456, 5851838, 5979296, 6116240, 6255417, 6389610, 6511847, 6615614, 6695714, 6749154, 6775151, 6774406, 6748317, 6698449, 6626499, 6534717, 6425987, 6302925, 6167000, 6019093, 5860895, 5695141, 5524572, 5351479, 5178380, 5008268, 4843785, 4686770, 4539043, 4403083, 4281449, 4175798, 4086753, 4014480]
60052D014480n5255l7610j9110k72J7807L4697N1191O8057Q4705R9803J12623
60041D371116J22978J30235J33413J31972J25731J14328R7806P7505N5288L1881
60031E392253O877j9590m6075p0909r3259j12817j29115j41507j49430j52551
60021D483877j50958j45340j36653j25615j12735r8579q3674o8268n2521l6773
60011C472761k1305n928R829K6365M3949O2657Q2015J01095J19364J37010J54035
60000D181847J69448J81745J89726J92443J88967J78938J63043J42402J17831
59991E706390R0158O0702L0809J213k7627n5133q0969j05175j27115j44933j56804
59980E191516j62392j62379j57242j47356j33729j17592r9500p9729n9074l8361
$$ y = [4014480, 3959225, 3921615, 3902505, 3902233, 3920040, 3954737, 4005928, 4073985, 4158690, 4258493, 4371116, 4494094, 4624329, 4757742, 4889714, 5015445, 5129773, 5227579, 5305084, 5360372, 5392253, 5399130, 5379540, 5333465, 5262556, 5169297, 5056480, 4927365, 4785858, 4636428, 4483877, 4332919, 4187579, 4050926, 3925311, 3812576, 3713997, 3630323, 3562055, 3509534, 3472761, 3451456, 3445528, 3455357, 3481722, 3525671, 3588328, 3670343, 3771438, 3890802, 4027812, 4181847, 4351295, 4533040, 4722766, 4915209, 5104176, 5283114, 5446157, 5588559, 5706390, 5796548, 5857250, 5888059, 5889272, 5861645, 5806512, 5725543, 5620368, 5493253, 5348320, 5191516, 5029124, 4866745, 4709503, 4562147, 4428418, 4310826, 4211326, 4131597, 4072523, 4034162]
59970D034162j7556L634K4633M4354O2296P8264R1397J00803J06908J10967J13207
59959D753069J12659J08842J02410R3892Q3064P0015N5951M2369K9980J8760Q610
59948E479621k68p176j0986j0793o532J392J2983K8744M8997P3566J01909J33205
59936E844662J66676K02207K40222K80300L20386L57991L91580M19976M40877
59927H664877M51097M47891M29186L93039L38256K65738J78544Q0966k1517j21980
59917A1106097k13476k91304l53370l98746m27050m39153m37210m23716m01168
59908G720904l72351l39684l04286k66654k28068j90142j53148j16273p9544m4067
59898E626687j0092K3429N6845Q8854J18254J45246J69961J90736K05029K11350
$$ y = [4034162, 4016606, 4020240, 4044873, 4089227, 4151523, 4229787, 4321184, 4421987, 4528895, 4639862, 4753069, 4865728, 4974570, 5076980, 5170872, 5253936, 5323951, 5379902, 5422271, 5452251, 5471011, 5479621, 5479353, 5472177, 5461191, 5450398, 5443866, 5445258, 5458241, 5486985, 5535982, 5609548, 5711457, 5844662, 6011338, 6213545, 6453767, 6734067, 7054453, 7412444, 7804024, 8224000, 8664877, 9115974, 9563865, 9993051, 10386090, 10724346, 10990084, 11168628, 11249594, 11228077, 11106097, 10892621, 10601317, 10247947, 9849201, 9422151, 8982998, 8545788, 8122072, 7720904, 7348553, 7008869, 6704583, 6437929, 6209861, 6019719, 5866571, 5750298, 5670754, 5626687, 5616595, 5640024, 5696869, 5785723, 5903977, 6049223, 6219184, 6409920, 6614949, 6826299]
59888F826299K09295J98257J77164J45517J04036N4431r70n9400j17737j72607
59878G364285k20722k59718k88741l07915l17451l17844l10650k98192k82265
59869D760787k63756k43446k22311k00902j79221j57520j36632j17284r9636q3608
59859C056471o9136n6047m4305l4381k6863k1755j8712j7800j9141k1929k4615
59848B701787k6188k6597k6017k4439k1909j8333j3315p117j579J133O17k042
59836B536001o388j3009k1633l0446l7790m3375m7292m9101m8529m6018m1948
59825B150472l6251k9308k2207j5465q435o96O845J2889J7110J9999K2152K4281
59813B141386K7260L1513L6820M3027N0162N7450O3060O5485O4661O1385N6349
$$ y = [6826299, 7035594, 7233851, 7411015, 7556532, 7660568, 7714999, 7714029, 7654629, 7536892, 7364285, 7143563, 6883845, 6595104, 6287189, 5969738, 5651894, 5341244, 5043052, 4760787, 4497031, 4253585, 4031274, 3830372, 3651151, 3493631, 3356999, 3239715, 3140079, 3056471, 2987335, 2931288, 2886983, 2852602, 2825739, 2803984, 2785272, 2767472, 2748331, 2726402, 2701787, 2675599, 2649002, 2622985, 2598546, 2576637, 2558304, 2544989, 2537872, 2536293, 2537426, 2538043, 2536001, 2529613, 2516604, 2494971, 2464525, 2426735, 2383360, 2336068, 2286967, 2238438, 2192420, 2150472, 2114221, 2084913, 2062706, 2047241, 2038806, 2038110, 2044955, 2057844, 2074954, 2094953, 2117105, 2141386, 2168646, 2200159, 2236979, 2280006, 2330168, 2387618, 2450678, 2516163, 2580824, 2642209, 2698558]
59802B698558N0097M3127L5503K6977J7892R281J830m450r319j2051j2457j1152
59790B833836q332l327M050J2792K2078L2357M4352N7872P2608Q9252J08854J31562
59778C397954J56843J84498K14706K47407K82227L18397L54100L86159M10527
59769E952818M22255M14664L80131L13853K17783J01218k1893j36692k30952k97841
59759G115344l36574l50561l44970l25441k97331k64799k30556j96677j64970
59750D603465j36211j09950q5683o3618m3810k5508p950Q877K4902M0509N5835
59739D260858P0475Q4637R9667J16484J34404J52494J71266J91911K14548K38560
59729E735304K64191K92497L23867L57680L93334M30653M69264N08332N46789
$$ y = [2698558, 2748655, 2791782, 2827285, 2854262, 2872154, 2881435, 2883265, 2878815, 2869496, 2857445, 2844988, 2833836, 2825504, 2822177, 2826227, 2839019, 2861097, 2893454, 2937806, 2995678, 3068286, 3157538, 3266392, 3397954, 3554797, 3739295, 3954001, 4201408, 4483635, 4802032, 5156132, 5542291, 5952818, 6375073, 6789737, 7169868, 7483721, 7701504, 7802722, 7780829, 7644137, 7413185, 7115344, 6778770, 6428209, 6083239, 5757798, 5460467, 5195668, 4965112, 4768435, 4603465, 4467254, 4357304, 4271621, 4208003, 4164193, 4138685, 4130735, 4139612, 4164514, 4205023, 4260858, 4331333, 4415970, 4515637, 4632121, 4766525, 4919019, 5090285, 5282196, 5496744, 5735304, 5999495, 6291992, 6615859, 6973539, 7366873, 7797526, 8266790, 8775122, 9321911]
59720I321911N83168O15236O40353O56155O60698O52621O31900O00365N61133
59711A4923540N18169M76607M42386M20267M12274M18314M37376M67171N03336
59702A9019440N40359N73172N97161O07246N98383N67157N12388M34758L37036
59693B3787100K24752J05601j2270j21491k15858k90786l43697l73626l80689
59684B2379036l66198l32709k83119k19888j45435o2539K6651J21569K22445L28762
59674B1668575M39164N52145O65697P76339Q79264R69078J039482J082523J089313
59665B9161580J051674R63018Q18997O19631L71909R0014k07102m98466p63389
59656C1607866r84404j150268j256887j305894j303116j257746j180963j083780
$$ y = [9321911, 9905079, 10520315, 11160668, 11816823, 12477521, 13130142, 13762042, 14362407, 14923540, 15441709, 15918316, 16360702, 16780969, 17193243, 17611557, 18048933, 18516104, 19019440, 19559799, 20132971, 20730132, 21337378, 21935761, 22502918, 23015306, 23450064, 23787100, 24011852, 24117453, 24105183, 23983692, 23767834, 23477048, 23133351, 22759725, 22379036, 22012838, 21680129, 21397010, 21177122, 21031687, 20969148, 20995799, 21117368, 21339813, 21668575, 22107739, 22659884, 23325581, 24101920, 24981184, 25950262, 26989744, 28072267, 29161580, 30213254, 31176272, 31995269, 32614900, 32986809, 33076823, 32869721, 32371255, 31607866, 30623462, 29473194, 28216307, 26910413, 25607297, 24349551, 23168588, 22084808]
59648B2084808r75843q66039p63355o76815o14803n84034n87595o22509o78936
59639A5714879p42386p97966q34360q46010q33039p99528p51360o94523o34030
59630H781677n73385n14847m60064m10155l65274l24820k88388k56019k27326
59621E361399k01220j76988j54974j35509j17945j01492q6397p3372o2270n2350
59611D198882m3606l7002l3383l2875l5118l9437m4956n1194n8374o6537p4606
59600C681794q1045q5266q7685q8678q8189q6260q3121p8718p2768o5353n7055
59589B807656m8499m0195l2571k5687j9038j2186n448M74N421R883J4285J8554
59577B672649K2205K4620K5541K5435K5082K4637K3617K2025K0726K0332K0531
$$ y = [22084808, 21108965, 20242926, 19479571, 18802756, 18187953, 17603919, 17016324, 16393815, 15714879, 14972493, 14174527, 13340167, 12494157, 11661118, 10861590, 10110230, 9415707, 8781677, 8208292, 7693445, 7233381, 6823226, 6457952, 6133132, 5844744, 5588725, 5361399, 5160179, 4983191, 4828217, 4692708, 4574763, 4473271, 4386874, 4313502, 4251232, 4198882, 4155276, 4118274, 4084891, 4052016, 4016898, 3977461, 3932505, 3881311, 3822937, 3756400, 3681794, 3600749, 3515483, 3427798, 3339120, 3250931, 3164671, 3081550, 3002832, 2930064, 2864711, 2807656, 2759157, 2718962, 2686391, 2660704, 2641666, 2629480, 2624032, 2624506, 2629927, 2639810, 2654095, 2672649, 2694854, 2719474, 2745015, 2770450, 2795532, 2820169, 2843786, 2865811, 2886537, 2906869, 2927400]
59566B927400K1112K2816K6414L1578L7493M4007N1462N9872O9069P9183R0270
59555C460676J01990J14285J27742J42610J58233J74194J91130K09330K27450
59546D907640K43847K58444K71903K83554K91637K95221K94512K89488K79718
59537G415964K65469K47848K27934K06681J85065J63056J38950J11452Q2332N5593
59527I100344L4035J8154Q124M877Q752J8729L3804N3737P7732J03431J27829
59516I589548J48216J61675J64790J54819J30857R3654M4967j2582p5920j42238
59506A0257786k08921k72689l29743l77031m12869m36377m47244m46318m35516
59497F891078m16714l91404l61486l29411k97030k64975k33584k03800j76654
$$ y = [2927400, 2948512, 2971328, 2997742, 3029320, 3066813, 3110820, 3162282, 3222154, 3291223, 3370406, 3460676, 3562666, 3676951, 3804693, 3947303, 4105536, 4279730, 4470860, 4680190, 4907640, 5151487, 5409931, 5681834, 5965388, 6257025, 6552246, 6846758, 7136246, 7415964, 7681433, 7929281, 8157215, 8363896, 8548961, 8712017, 8850967, 8962419, 9044751, 9100344, 9134379, 9152533, 9160657, 9165534, 9174286, 9193015, 9226819, 9280556, 9358288, 9461719, 9589548, 9737764, 9899439, 10064229, 10219048, 10349905, 10443559, 10488526, 10475944, 10400024, 10257786, 10048865, 9776176, 9446433, 9069402, 8656533, 8220156, 7772912, 7326594, 6891078, 6474364, 6082960, 5721474, 5392063, 5095033, 4830058, 4596474, 4392674, 4216020]
59488D216020j52373j30403j10013r0735p2511n5596m0077k5481j1169L165J7658
59477C548485L2577M7914O3152P8214R4124J11947J31355J51163J70872J90639
59467D620442K10006K27787K43109K55489K64004K67290K64193K53483K33353
59458F839156K02616J62245J14561O1187L316n6260j13296j64643k09148k45867
59448F593867k73179k90447k99038l00802k96567k86907k73224k57199k39938
59439D076566k22163k04489j86899j68900j50765j33866j19296j06880r5820q5516
59429B601972p5438o5297n5726m7846m1658l5789k9258k2512j6323j0719n505
59418B195901q24L399P651J1939J5597J8414K1028K3765K6283K8775L2107L5757
$$ y = [4216020, 4063647, 3933244, 3823231, 3732496, 3659985, 3604389, 3564312, 3538831, 3527662, 3530827, 3548485, 3581062, 3628976, 3692128, 3770342, 3864466, 3976413, 4107768, 4258931, 4429803, 4620442, 4830448, 5058235, 5301344, 5556833, 5820837, 6088127, 6352320, 6605803, 6839156, 7041772, 7204017, 7318578, 7379765, 7383081, 7326821, 7213525, 7048882, 6839734, 6593867, 6320688, 6030241, 5731203, 5430401, 5133834, 4846927, 4573703, 4316504, 4076566, 3854403, 3649914, 3463015, 3294115, 3143350, 3009484, 2890188, 2783308, 2687488, 2601972, 2526534, 2461237, 2405511, 2357665, 2316007, 2280218, 2250960, 2228448, 2212125, 2201406, 2195901, 2195077, 2198476, 2206127, 2218066, 2233663, 2252077, 2273105, 2296870, 2323153, 2351928, 2384035, 2419792]
59406B419792L6956L3267K5496J7160J1612J0432J3612K0081K8405L7947M9104
59395B703864O1670P3491Q1662Q5069Q5375Q5949R0135R9921J15327J35049J57981
59384C775493J83837K12431K43209K75939L11117L49086L89160M30046M70516
59375F640834N09259N44449N73766N94250O02314N95161N72909N38699M96231
59366A1667872M48006L96219L44021K94715K50171K10682J75699J43936J13391
59357A4044712Q2195M9274J3802k5361o9029j16795j67093k17540k64861l05344
59347A3023960l36320l57153l68798l73195l73277l72396l72683l74417l77284
59338I718437l81445l86665l91325l93217l90937l83932l71930l55183l34774
$$ y = [2419792, 2456748, 2490015, 2515511, 2532671, 2544283, 2554715, 2568327, 2588408, 2616813, 2654760, 2703864, 2765534, 2839025, 2920687, 3005756, 3091131, 3177080, 3267215, 3367136, 3482463, 3617512, 3775493, 3959330, 4171761, 4414970, 4690909, 5002026, 5351112, 5740272, 6170318, 6640834, 7150093, 7694542, 8268308, 8862558, 9464872, 10060033, 10632942, 11171641, 11667872, 12115878, 12512097, 12856118, 13150833, 13401004, 13611686, 13787385, 13931321, 14044712, 14126907, 14176181, 14189983, 14164622, 14095593, 13978798, 13811705, 13594165, 13329304, 13023960, 12687640, 12330487, 11961689, 11588494, 11215217, 10842821, 10470138, 10095721, 9718437, 9336992, 8950327, 8559002, 8165785, 7774848, 7390916, 7018986, 6663803, 6329029]
59329F329029l11893k87141k61024k34531k08620j83684j59999j38072j18018
59320D426047r9231q1284o4494m9040l4407k0309p395L805J3788K3110L1300L7764
59308D179654M2923M7309N0127N0028M6921M1784L4982K6061J5152L432p988j8699
59296D511686k8440l6726m3237m7909n0535n0888m9218m5996m1107l3875k4112
59285D059643j2629n13J1839K4828L8993N4359P0372Q6462J02563J18801J34741
59274D689459J49424J62156J72773J81001J86071J87151J83483J73748J56055
59265F241321J29463R5604N8490K2573r263l6418n9595p9059r3969j03681j09112
59254F056354j11994j13131j12515j10938j10019j10259j10499j09884j09147
$$ y = [6329029, 6017136, 5729995, 5468971, 5234440, 5025820, 4842136, 4682137, 4544065, 4426047, 4326816, 4245532, 4181038, 4131998, 4097591, 4077282, 4069887, 4073692, 4087480, 4110590, 4141890, 4179654, 4222577, 4269886, 4320013, 4370041, 4416962, 4458746, 4493728, 4519789, 4534941, 4538373, 4530385, 4511686, 4483246, 4446520, 4403283, 4355374, 4304839, 4253951, 4204733, 4158737, 4117630, 4083755, 4059643, 4047014, 4046501, 4058340, 4083168, 4122161, 4176520, 4246892, 4333354, 4435917, 4554718, 4689459, 4838883, 5001039, 5173812, 5354813, 5540884, 5728035, 5911518, 6085266, 6241321, 6370784, 6466388, 6524878, 6547451, 6538188, 6501770, 6442175, 6363116, 6269147, 6165466, 6056354, 5944360, 5831229, 5718714, 5607776, 5497757, 5387498, 5276999, 5167115, 5057968]
59245E057968j09139j09189j07828j04448r9375r2992q5525p7109o7379n5500
59235D149484m1220k5306q495R524K9522N1786P6137J02417J30505J60435J92689
59224D827478K27559K64023L00145L34754L67444L96438M17815M27590M23588
59215G986834M04693L69767L18552K52549J74056Q5301j0353j07467k00164k84191
59205H989577l56435m13589m52968m74286m79450m70849m50935m22888l90322
59196E077855l56061l21749k88310k56261k25933j98034j73455j52227j33427
59187B972398j16606j02329r0726q0640p1075o2369n4940m7983m0681l3707k8169
59176B243173k3739j9166j4060q934m060N97M832Q632J2589J6967K1038K4360
$$ y = [5057968, 4948829, 4839640, 4731812, 4627364, 4527989, 4434997, 4349472, 4272363, 4204984, 4149484, 4108264, 4082958, 4074463, 4083987, 4113509, 4165295, 4241432, 4343849, 4474354, 4634789, 4827478, 5055037, 5319060, 5619205, 5953959, 6321403, 6717841, 7135656, 7563246, 7986834, 8391527, 8761294, 9079846, 9332395, 9506451, 9591752, 9581399, 9473932, 9273768, 8989577, 8633142, 8219553, 7766585, 7292299, 6812849, 6342000, 5891065, 5468177, 5077855, 4721794, 4400045, 4111735, 3855474, 3629541, 3431507, 3258052, 3105825, 2972398, 2855792, 2753463, 2662737, 2582097, 2511022, 2448653, 2393713, 2345730, 2305049, 2271342, 2243173, 2219434, 2200268, 2186208, 2177274, 2173214, 2173811, 2178643, 2187275, 2199864, 2216831, 2237869, 2262229]
59164B262229K7807L2269L7260M2018M7017N2934N9013O4004O8029P1932P5466
59153B839978P7763P9105Q0436Q1473Q0884P8082P3369O6647N7537M6599L4977
59142C596850K2990J0369k391j4243k4865l4352m2044m7117n0001n1734n2199
59131C311263n0516m6786m1833l5551k7358j8012r022j60J0430K3264L6499M8468
59119C200686N9678P1649Q4990R9263J13720J27755J41466J55962J72184J89457
59109D416810K06301K22450K38646K54395K67599K76682K81563K81883K75643
59100F721972K60448K35179J99867J54927J01488M2040j9781q0046j35345j83524
59090G297225k23818k56044k79951k95751l04672l08067l06390k99919k89825
$$ y = [2262229, 2290036, 2322305, 2359565, 2401583, 2448600, 2501534, 2560547, 2624551, 2692580, 2764512, 2839978, 2917741, 2996846, 3077282, 3158755, 3239639, 3317721, 3391090, 3457737, 3515274, 3561873, 3596850, 3619840, 3630209, 3627818, 3613575, 3588710, 3554358, 3512314, 3465197, 3415196, 3363462, 3311263, 3260747, 3213961, 3172128, 3136577, 3109219, 3091207, 3082185, 3082025, 3092455, 3115719, 3152218, 3200686, 3260364, 3332013, 3417003, 3516266, 3629986, 3757741, 3899207, 4055169, 4227353, 4416810, 4623111, 4845561, 5084207, 5338602, 5606201, 5882883, 6164446, 6446329, 6721972, 6982420, 7217599, 7417466, 7572393, 7673881, 7715921, 7696140, 7616094, 7480749, 7297225, 7073407, 6817363, 6537412, 6241661, 5936989, 5628922, 5322532, 5022613, 4732788]
59081D732788k77443k63006k46420k28807k11853j95959j80504j65611j52080
59072B811105j39728j27566j15700j05362r6871q9098q1312p3977o7432o1199
59062A852860n5064m9500m4607l9847l5194l1336k8284k5071k1190j7287j4049
59051A491431j1524r835r366r871j0504j1166j2724j5484j8478k0683k2007k2651
59039A317138k2466k1266j9024j5586j1081o701l946k923k230o79J808M959Q549
59026A226552J1918J4249J5615J6779J7863J8156J7313J5659J3220R667N361J397
59014A383749j494l216l606k633j108Q4J263L255N690P552R086J1321J3743J4407
59000A438093J2631R796P046L980J22m047q092j2003j5052j5957j4878j3654j3338
$$ y = [4732788, 4455345, 4192339, 3945919, 3717112, 3505259, 3309300, 3128796, 2963185, 2811105, 2671377, 2543811, 2428111, 2322749, 2225878, 2136780, 2055468, 1981491, 1914059, 1852860, 1797796, 1748296, 1703689, 1663842, 1628648, 1597312, 1569028, 1543957, 1522767, 1505480, 1491431, 1479907, 1470072, 1460706, 1450835, 1440331, 1429165, 1416441, 1400957, 1382479, 1361796, 1339789, 1317138, 1294672, 1273406, 1254382, 1238796, 1227715, 1221014, 1217068, 1214145, 1211915, 1211236, 1213044, 1218003, 1226552, 1238470, 1252719, 1268334, 1285113, 1302976, 1321132, 1338445, 1354104, 1367324, 1376991, 1382352, 1383749, 1382255, 1379039, 1375433, 1372800, 1371692, 1371776, 1373039, 1376294, 1381984, 1389536, 1398622, 1409943, 1423686, 1438093, 1450724, 1460520, 1467566, 1471546, 1471668, 1467621, 1459529, 1447526, 1432474, 1416517, 1401639, 1387985, 1374647]
58987A374647j2916j1205q582o041l923k335j460p62Q67L421N499O347O907Q146
58973A358610R664J0776J1730J3071J4805J6873J9343K1727K3235K4140K5621
58962A549595K7866K9693L0431L0708L0880L0448K9549K9354L0088L0405K9648
58951A878665K9119L0063L1925L3728L5748L8672M2339M6477N1399N6954O2052
58940B337141O6373P1245P7729Q5039R2084R9233J07209J15410J22889J30237
58930C304589J39050J50031J62719J76625J91827K08939K29083K53131K80454
58921E096448L09410L39593L72392M08753M47723M88108N30149N74387O19863
58912I186826O64516P06243P42537P69982P85188P85520P68125P29307O65977
$$ y = [1374647, 1361731, 1350526, 1341944, 1335903, 1331980, 1329645, 1328185, 1327423, 1328290, 1331711, 1337210, 1343557, 1350464, 1358610, 1368274, 1379050, 1390780, 1403851, 1418656, 1435529, 1454872, 1476599, 1499834, 1523974, 1549595, 1577461, 1607154, 1637585, 1668293, 1699173, 1729621, 1759170, 1788524, 1818612, 1849017, 1878665, 1907784, 1937847, 1969772, 2003500, 2039248, 2077920, 2120259, 2166736, 2218135, 2275089, 2337141, 2403514, 2474759, 2552488, 2637527, 2729611, 2828844, 2936053, 3051463, 3174352, 3304589, 3443639, 3593670, 3756389, 3933014, 4124841, 4333780, 4562863, 4815994, 5096448, 5405858, 5745451, 6117843, 6526596, 6974319, 7462427, 7992576, 8566963, 9186826, 9851342, 10557585, 11300122, 12070104, 12855292, 13640812, 14408937, 15138244, 15804221]
58903A5804221N77191M64055L29466J78945K0575j37086k86632m21560n36216
58894A5992959o27222o93965p37071p57666p58587p44473p19399o85613o45206
58885I623757o01254n56130n10359m64573m20982l81492l45825l13043k83637
58876E746462k58503k37156k18612k02999j90640j80485j71040j61960j53402
58867C971665j44680j35114j25265j15940j06781r7245q8063q0293p3637o7107
58857B937540o0588n4585m9053m3751l8890l4389k9360k3367j7253j1824o749
58846B567731j686K904P146J2352J8962K5487L0940L6641M3836N1284N7290O2661
58834B915548O9304P7060Q4390R1337R9283J08332J17292J26048J35830J47253
$$ y = [15804221, 16381412, 16845467, 17174933, 17353878, 17374453, 17237367, 16950735, 16529175, 15992959, 15365737, 14671772, 13934701, 13177035, 12418448, 11673975, 10954576, 10268963, 9623757, 9022503, 8466373, 7956014, 7491441, 7070459, 6688967, 6343142, 6030099, 5746462, 5487959, 5250803, 5032191, 4829192, 4638552, 4458067, 4287027, 4125067, 3971665, 3826985, 3691871, 3566606, 3450666, 3343885, 3246640, 3158577, 3078284, 3004647, 2937540, 2876952, 2822367, 2773314, 2729563, 2690673, 2656284, 2626924, 2603557, 2586304, 2574480, 2567731, 2566045, 2568949, 2576095, 2588447, 2607409, 2632896, 2663836, 2700477, 2744313, 2795597, 2852887, 2915548, 2984852, 3061912, 3146302, 3237639, 3336922, 3445254, 3562546, 3688594, 3824424, 3971677]
58824C971677J59833J73365J88304K05017K23954K45983K71313K98793L27754
58815F065993L59591L95912M36028M78046N21431N66446O11750O54641O93114
58806A0782952P25588P48941P58894P52029P25680O76447O01254N00171L76677
58797A6648633K35543Q2288p5584k29198l70822m94909n97257o75089p28123p58170
58787A3037312p67631p59378p37415p05852o67401o24175n79328n36089m95515
58778G164528m56899m20177l86220l55002l25435k97194k71296k48732k29705
58769D173868k13946k00587j88075j75400j63089j51908j41375j30803j20832
58760B687853j12294j04498r6372q8438q1695p5419o8234o0647n4246m8923m3238
$$ y = [3971677, 4131510, 4304875, 4493179, 4698196, 4922150, 5168133, 5439446, 5738239, 6065993, 6425584, 6821496, 7257524, 7735570, 8257001, 8823447, 9435197, 10089838, 10782952, 11508540, 12257481, 13016375, 13768404, 14494084, 15170531, 15771785, 16271956, 16648633, 16884176, 16966464, 16890880, 16661682, 16290860, 15795951, 15198694, 14523605, 13795482, 13037312, 12269681, 11510303, 10772888, 10067036, 9399635, 8775460, 8196132, 7660043, 7164528, 6707629, 6287452, 5901232, 5546230, 5220795, 4923601, 4652305, 4403573, 4173868, 3959922, 3759335, 3571260, 3395860, 3232771, 3080863, 2939488, 2808685, 2687853, 2575559, 2471061, 2374689, 2286251, 2204556, 2129137, 2060903, 2000256, 1946010, 1897087, 1853849]
58749A853849l7157l2088k8339k4810k1159j8031j5209j1729p937n315m146l332
58737A644597k557k572l331l966m697o630r488j1674j2794j3989j5493j6170j5912
58724A525324j6305j8152k0275k1575k2549k4034k5977k8099l0352l2188l2705
58713A253113l2086l1537l1496l1133k9919k8317k6714k4941k3024k1186j9104
58702I53656j6455j4012j2783j2296j1280r779q905q745q382p834p995q685q677
58689H17828p779o942o265m899l058k022j871j216M26J919K469K430J784j47k953
58674G89704m941n237m573l579k058j91J202K025K849L371K726J487J397K717
58660G86899L685L046J304p96l108n032n610n242n427o318o347m765k678j046
$$ y = [1853849, 1816692, 1784604, 1756265, 1731455, 1710296, 1692265, 1677056, 1665327, 1657390, 1652075, 1647929, 1644597, 1642040, 1639468, 1636137, 1632171, 1627474, 1620844, 1611356, 1599682, 1586888, 1572899, 1557406, 1541236, 1525324, 1509019, 1490867, 1470592, 1449017, 1426468, 1402434, 1376457, 1348358, 1318006, 1285818, 1253113, 1221027, 1189490, 1157994, 1126861, 1096942, 1068625, 1041911, 1016970, 993946, 972760, 953656, 937201, 923189, 910406, 898110, 886830, 877051, 868146, 859401, 851019, 843185, 835190, 826505, 817828, 810049, 803107, 796842, 791943, 788885, 786863, 784992, 783776, 784202, 786121, 788590, 791020, 792804, 792657, 789704, 784763, 779526, 774953, 771374, 769316, 769125, 770327, 772352, 775201, 778572, 781298, 782785, 784182, 786899, 790584, 793630, 794934, 794138, 791030, 785998, 780388, 775146, 769719, 763401, 757054, 752289, 749611, 748565]
58646G48565N56K536M373N831P488R487J1162J2259J3205J4040J4581J5577J7979
58633H77639K1126K3542K5362K7997L1531L4716L7513M1197M5894N0529N5475
58622A272521O2480P1568Q0741Q9465R9751J12908J27802J43219J59422J76313
58612B396190J92579K07688K22261K35287K43429K44285K37972K24174K00243
58603D404108J64169J17558O4134P209m9877j02728j47451j82308k06957k21374
58593C846483k26587k24796k17690k05914j90779j74725j59215j43852j28397
58584B174528j13906j01061q9193p7777o7171n7239m7208l7565l0083k5254k1594
58573A506477j8140j5429j3478j1230q753p521p606p210n899n596p123q549q512
$$ y = [748565, 749121, 751657, 756030, 761861, 769349, 778836, 789998, 802257, 815462, 829502, 844083, 859660, 877639, 898765, 922307, 947669, 975666, 1007197, 1041913, 1079426, 1120623, 1166517, 1217046, 1272521, 1335001, 1406569, 1487310, 1576775, 1676526, 1789434, 1917236, 2060455, 2219877, 2396190, 2588769, 2796457, 3018718, 3254005, 3497434, 3741719, 3979691, 4203865, 4404108, 4568277, 4685835, 4749969, 4757178, 4707301, 4604573, 4457122, 4274814, 4067857, 3846483, 3619896, 3395100, 3177410, 2971496, 2780717, 2605992, 2446777, 2302925, 2174528, 2060622, 1959561, 1870368, 1792591, 1725420, 1668181, 1620973, 1583408, 1553325, 1528071, 1506477, 1488337, 1472908, 1459430, 1448200, 1439447, 1431926, 1424320, 1417110, 1411211, 1405615, 1398492, 1389943, 1381431]
58560A381431q551j0449j3623j6873k0473k4740k8563l1029l2636l3570l2792
58549A128132l0145k7264k5062k2556j9370j6932j5835j4611j2625j1480j1889
58538I20363j1919j0385r162r985j1489j1845j1817j2630j3146j1896r975r175
58526G86939q986q038o956p262q691r968j0935j1880j2123j1230j0248r949r370
58513F61303p815o521o433o228m586k581j714j361l16Q98J441K116L727N060M835
58498F41825M046M236N044N603O649Q918J1037J1443J0945J1221J2128J2647J2970
58485G58712J3508J3261J1417R172P921O997N135K655L25k285n411p775q648r427
58471G95557j1179j2626j2594j2341j3143j3669j2372j0472r936j0245r818q955
$$ y = [1381431, 1372880, 1362431, 1348808, 1331935, 1311462, 1286722, 1258159, 1227130, 1194494, 1160924, 1128132, 1097987, 1070723, 1045661, 1023105, 1003735, 986803, 970968, 956357, 943732, 932252, 920363, 908444, 898059, 888897, 878912, 867423, 855578, 843761, 831131, 817985, 806089, 796114, 786939, 777953, 769915, 762959, 755697, 747006, 737038, 726103, 714223, 702100, 690870, 680622, 670673, 661303, 653488, 646967, 640534, 634306, 629720, 627139, 625425, 624064, 623748, 624646, 626087, 628203, 631930, 636990, 641825, 645871, 650107, 655151, 660754, 667403, 676321, 687358, 698801, 709746, 720967, 733095, 745742, 758712, 772220, 785481, 796898, 806070, 813991, 820988, 826123, 828778, 829103, 826818, 821407, 813632, 804984, 795557, 784378, 771752, 759158, 746817, 733674, 720005, 707633, 697161, 687225, 676980, 667162, 658207]
58459F58207q736q549p316n641m424k960p12R02Q36N87J589K506J755O68J247
58444F29959K723L319L538M755O326P094Q080J0669J3720J5370J6049J6888J7020
58431G55510J5358J3164J1768R707N317K82k771m362o453q501q699p530o568n346
58417G60876k898p74r02k006j581J2R00J470L156N087N691O081Q075J0448J0974
58402H04609J0611J1553J2652J1030P020L291J13m169q872j1434j1676j1671j1930
58389H01127j1278r849q782p686n677l838l429l067j139P57N33j05J756N036O457
58374G60816O024O238P224P243O782P588Q740Q244P309Q416J0386J0181Q435Q229
58360H71855R475R644R100J0429J3037J3733J2323J1565J1933J1416J0240J0760
$$ y = [658207, 649471, 640922, 633606, 627965, 623541, 620581, 619869, 620771, 621607, 622194, 623783, 626289, 628044, 628712, 629959, 632682, 636001, 639539, 644294, 650620, 657714, 665794, 676463, 690183, 705553, 721602, 738490, 755510, 770868, 784032, 795800, 805507, 810824, 811106, 808335, 803973, 797520, 789019, 780320, 772790, 766222, 760876, 757978, 757204, 756302, 754296, 752715, 752727, 753627, 755097, 758253, 763340, 769031, 775112, 783187, 793635, 804609, 815220, 826773, 839425, 850455, 857475, 860766, 860879, 856710, 847838, 836404, 824728, 813057, 801127, 789849, 780000, 771218, 763532, 757855, 754017, 750588, 747521, 746382, 747139, 747672, 747567, 749323, 754359, 760816, 766840, 773078, 780302, 787545, 794327, 801915, 810655, 818899, 826208, 834624, 845010, 855191, 863626, 871855, 881330, 890974, 900074, 910503, 923540, 937273, 949596, 961161, 973094, 984510, 994750, 1005510]
58348A005510J2720J3338J2014J0547R063O161K528J2k128n550q538q290o180
58335A041207n635o006l998q6K310L060M902P528Q140P380Q635J1793J3553J3614
58321A106397J4642J6488J6527J5348J6014J8001J8058J6752J7812K1124K2807
58310A299970K2028K1366K0712J7430J2524R833R207P073L604K432L458L153J827
58297A434617L146O503P507O256P331J1150J3297J2969J4068J7178J8477J7615
58285A570114J8602K1817K3129K2060K2833K6260K8512K8961L1123L4945L6518
58274A864874L6293L9008M4492M7311M6483M6593M8327M7305M3339M1221M1158
58263B346404L8228L2638L0417L2492L3464L2619L5361M1984M6139M6557M9182
$$ y = [1005510, 1018230, 1031568, 1043582, 1054129, 1063192, 1069353, 1071881, 1071893, 1069765, 1064215, 1055677, 1047387, 1041207, 1035572, 1029566, 1025568, 1025482, 1027792, 1030852, 1035754, 1043282, 1051422, 1058802, 1067437, 1079230, 1092783, 1106397, 1121039, 1137527, 1154054, 1169402, 1185416, 1203417, 1221475, 1238227, 1256039, 1277163, 1299970, 1321998, 1343364, 1364076, 1381506, 1394030, 1403863, 1413070, 1420143, 1423747, 1426179, 1429637, 1432790, 1434617, 1437763, 1444266, 1451773, 1458029, 1465360, 1476510, 1489807, 1502776, 1516844, 1534022, 1552499, 1570114, 1588716, 1610533, 1633662, 1655722, 1678555, 1704815, 1733327, 1762288, 1793411, 1828356, 1864874, 1901167, 1940175, 1984667, 2031978, 2078461, 2125054, 2173381, 2220686, 2264025, 2305246, 2346404, 2384632, 2417270, 2447687, 2480179, 2513643, 2546262, 2581623, 2623607, 2669746, 2716303, 2765485]
58252B765485N5362N9423O0191O3297O9639P3413P4128P8307Q6623R1934R2852
58241C570654R6420J04463J10625J13822J20780J32084J40068J43896J51885J65431
58231D850128J76151J82543J93232K09784K23257K32094K45819K66449K84723
58222F864180K99606L22063L54115L84529M11036M45575M91267N36771N80274
58213A0689416O35296P05343P77905Q51710R43490J059245J187105J327969J503160
58204A9680639J722517J978396K282416K672954L175728L797517M572287N569526
58196D5451980O840851Q402359J0278581J2505528J5079242J7975964K1246795
58189A37781300K5016883K9369093L4273653L9470007M3989470M5615461M1364081
$$ y = [2765485, 2820847, 2880270, 2940461, 3003758, 3073397, 3146810, 3220938, 3299245, 3385868, 3477802, 3570654, 3667074, 3771537, 3882162, 3995984, 4116764, 4248848, 4388916, 4532812, 4684697, 4850128, 5026279, 5208822, 5402054, 5611838, 5835095, 6067189, 6313008, 6579457, 6864180, 7163786, 7485849, 7839964, 8224493, 8635529, 9081104, 9572371, 10109142, 10689416, 11324712, 12030055, 12807960, 13659670, 14603160, 15662405, 16849510, 18177479, 19680639, 21403156, 23381552, 25663968, 28336922, 31512650, 35310167, 39882454, 45451980, 52292831, 60695190, 70973771, 83479299, 98558541, 116534505, 137781300, 162798183, 192167276, 226440929, 265910936, 309900406, 355515867, 396879948]
58182C96879948K9430294J1158774r080401k6335094l7683000m2917940m3425278
58175B78027303m0852201l6557563l1578782k6625908k2082867j8119238j4799804
58168H7410940j2097262r905573q115960o659827n472679m473823l604418k842256
58160C4239142k164024j532413r27838l50906K14219Q03045J438318K121712K816326
58151C6657581L355003L391145K587564R51496j058976k825700l963922m443486
58143C4650705m431039m113092l638853l119014k618883k166067j776015j458658
58135A1329084j207146j003685q38311p08168o03919n13581m36040l76317l31579
58126E310338k94437k64705k45409k32366k19223k07410k00263j93123j79771
$$ y = [396879948, 426310242, 437469016, 428388615, 402053521, 364370521, 321452581, 278027303, 237175102, 200617539, 169038757, 142412849, 120329982, 102210744, 87410940, 75313678, 65408105, 57292145, 50632318, 45159639, 40685816, 37081398, 34239142, 32075118, 30542705, 29614867, 29263961, 29478180, 30281225, 31719543, 33841255, 36657581, 40012584, 43403729, 45991293, 46942789, 45883813, 43058113, 39094191, 34650705, 30219666, 26106574, 22467721, 19348707, 16729824, 14563757, 12787742, 11329084, 10121938, 9118253, 8279942, 7571774, 6967855, 6454274, 6018234, 5641917, 5310338, 5015901, 4751196, 4505787, 4273421, 4054198, 3846788, 3646525, 3453402, 3273631]
58117C273631j62976j48623j35263j19031j02882r1410q2372p2490o5738o6715
58107B226131p1384p3230p3074p4399p4624o9895o3249n9497n6737n0980m4380
58096A514682m1048l9257l5348l0935k9091k7879k4635k2079k3403k5827k5697
58085A189483k5216k7502k9833k8620k6367k6896k8158k6663k4515k5116k6169
58074H94428k3980k0613j9885k0099j7689j4365j3737j4266j2400r430q605q544
58062G10815o193l362l684n729n645m135m578o510p181p307r237j1506j1115r300
58048F15333r330j0475r756p792p361p844o536l983k798k730j782o71j366k728
58034E40181k311r07p85j238l43P80P6j034r2J467P10j305j290N67J556J616K692
$$ y = [3273631, 3110655, 2962032, 2826769, 2707738, 2604856, 2513446, 2431074, 2358584, 2292846, 2226131, 2154747, 2081517, 2008443, 1934044, 1859420, 1789525, 1726276, 1666779, 1610042, 1559062, 1514682, 1473634, 1434377, 1399029, 1368094, 1339003, 1311124, 1286489, 1264410, 1241007, 1215180, 1189483, 1164267, 1136765, 1106932, 1078312, 1051945, 1025049, 996891, 970228, 945713, 920597, 894428, 870448, 849835, 829950, 809851, 792162, 777797, 764060, 749794, 737394, 727964, 719359, 710815, 704622, 701260, 697576, 691847, 686202, 682067, 677489, 670979, 663798, 656491, 647254, 635748, 624633, 615333, 606003, 595528, 585772, 577980, 570619, 562775, 556239, 552256, 549458, 546728, 544946, 544275, 542909, 540181, 537870, 536963, 536178, 534940, 534597, 535377, 535453, 534419, 534327, 535794, 536504, 535199, 533909, 534476, 536032, 537648, 540340]
58017E40340M245M193L253L707M924M493K770J964J805N07j157j115k67j100k966
58002E65596l141j730j210j826j605m21O6j26K47M01j401m288n986o914r275j2726
57986E15661j4789j4828j4033j2265q780n294m401n424n503m146l099k401n36
57973D20162K080L546M013N050O078N183L085K454L523M076L528L325L467K383
57959D71953K75r57j119j729k859l271l451m974p077p465o299n823o163n277l100
57944D12664j823j786r34J136K312J843J512K075J985N66o46q38j238k507l627
57929D10694m321n893q626j0828j1468j1479j1624j1287j0106q705p226n114k809
57916C01208j586j337o08R05K002K363K993M146M964N466O665Q469R592R741R773
$$ y = [540340, 544585, 548778, 552031, 555738, 560662, 565155, 567925, 569889, 571694, 572201, 571044, 569929, 569662, 568562, 565596, 562455, 560725, 559515, 557689, 556084, 555663, 555729, 555603, 555850, 556251, 554850, 550562, 544576, 537662, 528387, 515661, 500872, 486044, 472011, 459746, 450966, 445672, 441271, 435847, 430344, 426198, 423099, 420698, 420162, 422242, 425788, 429801, 434851, 440929, 446112, 449197, 451651, 455174, 459250, 462778, 466103, 469570, 471953, 472228, 471271, 470152, 468423, 465564, 462293, 458842, 453868, 446791, 439326, 433027, 427204, 421041, 415764, 412664, 410841, 409055, 408121, 409257, 411569, 413412, 414924, 416999, 418984, 419550, 418904, 418066, 416828, 414321, 410694, 406373, 400480, 391854, 381026, 369558, 358079, 346455, 335168, 325062, 316357, 309131, 304017, 301208, 299622, 298285, 297677, 298582, 300584, 302947, 305940, 310086, 315050, 320516, 327181, 335650, 345242, 354983, 364756]
57901C64756R641Q428O573N605N536M892L497K854L393L729L084K223J534L89
57887D26134j253k528l310m199m889m616m109m819o255o543n534m895n090m933
57873C63161m265m245m674l859j673J0N21J301K908L907L680L749N028O211O072
57858C77832N297M787M152L036K129J750J042m73j970k730l003l004k549k048
57844C84248k236k708k343j267n95l00N38J452J002l81o50M25P45o14k097k688
57828C72531l467n104o401o656p117q624r957r997r568r698r786q915p461o257
57814B63523n498n338o005o656n822l754k442k618k790k009j389j746j919q21
57800B14716P63J811K696L882M712M811N147O365P565P866P686P359O192M054
$$ y = [364756, 374397, 382825, 389398, 395003, 400539, 405431, 408928, 411782, 415175, 418904, 421988, 424211, 425745, 426134, 424881, 422353, 419043, 414844, 409955, 405339, 401230, 396411, 390156, 383613, 378079, 373184, 368094, 363161, 358896, 354651, 349977, 346118, 344445, 344455, 344976, 346277, 349185, 353092, 356772, 360521, 365549, 371760, 377832, 383129, 387916, 392068, 395104, 397233, 398983, 400025, 399552, 397582, 394852, 391849, 388845, 386296, 384248, 382012, 379304, 376961, 375694, 375099, 374799, 375337, 376789, 377791, 377410, 376760, 377185, 377930, 377316, 375219, 372531, 369064, 363960, 357559, 350903, 343786, 335162, 325205, 315208, 305640, 295942, 286156, 277241, 269780, 263523, 258025, 252687, 246682, 240026, 234204, 230450, 228008, 225390, 222600, 220591, 219202, 217456, 215537, 214716, 215479, 217290, 219986, 223868, 228580, 233391, 238538, 244903, 252468, 260334, 268020, 275379, 281571, 285625]
57786B85625K264J711J563J026P21J147J398P11k38p82j482k720l659l863m345
57771B79077n681o714o460n748n534n181l965k796k699k958k384j278n38J14J399
57756B28654K912L848M420N232O044O403O616P001P074O556O192O383O184M769
57742C08288K854J531O96j70q39j054j366k040k229j383l79q3R3R51K003K496
57726C09369K848L679M420M316L946M432N811P311Q510R183R005Q358Q468R669
57712C99325J0660J0453R895J0161J1008J1740J2650J4141J5594J6562J7851K0123
57700E60163K2513K4119K5666K8167L1160L3902L7212M2236M8401N4468O0836
57689I68843O8871P8579Q8840R9571J11885J26226J41935J58470J75736J93353
$$ y = [285625, 287889, 289600, 291163, 292189, 292910, 294057, 295455, 296166, 295928, 295146, 293664, 290944, 287285, 283422, 279077, 273396, 266682, 260222, 254474, 248940, 243759, 239794, 236998, 234299, 231341, 228957, 227679, 227141, 227255, 228654, 231566, 235414, 239834, 245066, 251110, 257513, 264129, 271130, 278204, 284760, 290952, 297335, 303519, 308288, 311142, 312673, 313369, 313199, 312360, 311306, 309940, 307900, 305671, 304288, 303909, 303826, 303919, 304870, 306873, 309369, 312217, 315896, 320316, 324632, 328578, 333010, 338821, 346132, 354642, 363825, 372830, 381188, 389656, 399325, 409985, 420438, 430333, 440494, 451502, 463242, 475892, 490033, 505627, 522189, 540040, 560163, 582676, 606795, 632461, 660628, 691788, 725690, 762902, 805138, 853539, 908007, 968843, 1037714, 1116293, 1205133, 1304704, 1416589, 1542815, 1684750, 1843220, 2018956, 2212309]
57679B212309K10639K26971K41207K51242K55018K51373K39110K16557J83489
57670D287915J42726R8589N4696J4169j9950m7286p2580j02898j41495j84968
57660D028918k25792k56346k71636k70808k57198k36054k11692j86656j62504
57651A950232j40120j19755j01648q6241p3269o1610n0796m1602l4299k7739k1237
57640A191916j5757j1740p403j087O077J1942J6641K1829K7721L3383L9270M6871
57628A359663N6083O5400P4633Q5205R7703J11183J25002J39373J53949J67705
57618B435899J80268J91601K00183K03288J99088J86967J65871J34438R3197M5122
57608D035922o113n7003j03628j42365j71802j92550k05052k09219k06204j98672
$$ y = [2212309, 2422948, 2649919, 2891126, 3142368, 3397386, 3648759, 3887869, 4104426, 4287915, 4430641, 4529230, 4583926, 4598095, 4578145, 4530859, 4458279, 4355381, 4213886, 4028918, 3803126, 3546780, 3275144, 3004336, 2747138, 2511084, 2299392, 2112736, 1950232, 1810112, 1690357, 1588709, 1502468, 1429199, 1367589, 1316793, 1275191, 1240892, 1213153, 1191916, 1176159, 1164419, 1157016, 1155929, 1162006, 1173948, 1190589, 1212418, 1240139, 1273522, 1312792, 1359663, 1415746, 1481146, 1555779, 1640984, 1738687, 1849870, 1974872, 2114245, 2268194, 2435899, 2616167, 2807768, 3007951, 3211239, 3410327, 3597294, 3763165, 3897603, 3990800, 4035922, 4029809, 3972806, 3869178, 3726813, 3555011, 3362461, 3157409, 2948190, 2741986, 2543314]
57598B543314j88738j77014j63925j50358j36723j22977j09875r8671q9288q0364
57588A225381p1530o3992n8328n3351m7918m2500l8090l4657l1497k8270k5106
57577G30142k2299k0221j8888j7589j5638j3401j1671j0406r099q069q004q485
57565E66372q368p485o489n309l316r06Q55K058L657N350N830N255N385O793Q060
57550E77742Q357Q830J0540J2841J4768J6366J7771J8582J9169K0992K4521K8300
57538G78779L1213L4334L9251M5810N2737N9538O6577P4152Q2572R2348J03410
57527A460721J14787J25796J36675J47348J56563J63025J66386J66215J60868
57518B798384J48354J27741R9182O3529K2785j9824o0960r7894j28111j49654
$$ y = [2543314, 2354576, 2177562, 2013637, 1863279, 1726556, 1603579, 1493704, 1395033, 1305745, 1225381, 1153851, 1089859, 1031531, 978180, 930262, 887762, 849672, 815015, 783518, 755248, 730142, 707843, 687622, 668734, 651145, 635507, 622106, 610435, 600029, 590930, 582861, 574857, 566372, 558004, 550519, 544030, 538721, 535405, 534499, 535354, 537412, 541069, 546419, 552249, 557504, 562889, 569682, 577742, 586099, 594929, 605469, 618310, 633078, 649444, 667215, 685797, 704966, 725958, 750479, 778779, 809992, 844326, 883577, 929387, 982124, 1041662, 1108239, 1182391, 1264963, 1357311, 1460721, 1575508, 1701304, 1837979, 1985327, 2141890, 2304915, 2471301, 2637516, 2798384, 2946738, 3074479, 3173661, 3237190, 3259975, 3240151, 3179191, 3081297, 2953186, 2803532]
57508B803532j62623j69083j70715j67529j59631j48739j36843j24477j11563
57499A452329r8968q7758p7789o8362n9675n2348m6004l9656l3128k7053k1757
57488H39831j7125j3267j0251p414l874L48M405P701J0358J2885J5924J9945K4739
57475H84205K9572L4237L9453M5811N3050O0861O9645P9722R0608J01745J13311
57464A602220J25316J36629J45790J52314J56112J56070J50229J37155J16279
57455B878114Q7353N0799Q798l4763p5738j10918j38314j57277j68429j73007
57445B166618j72020j66228j56694j44938j32515j20594j09674r9546q9776q0406
57435H94227p1846o4123n6828m9960m4101l9455l5420l1518k8109k5661k3899
$$ y = [2803532, 2640909, 2471826, 2301111, 2133582, 1973951, 1825212, 1688369, 1563892, 1452329, 1353361, 1265603, 1187814, 1119452, 1059777, 1007429, 961425, 921769, 888641, 861588, 839831, 822706, 809439, 799188, 791774, 787900, 788248, 792653, 800354, 810712, 823597, 839521, 859466, 884205, 913777, 948014, 987467, 1033278, 1086328, 1147189, 1216834, 1296556, 1387164, 1488909, 1602220, 1727536, 1864165, 2009955, 2162269, 2318381, 2474451, 2624680, 2761835, 2878114, 2965467, 3016266, 3025064, 2990301, 2914563, 2803645, 2665331, 2508054, 2339625, 2166618, 1994598, 1828370, 1671676, 1526738, 1394223, 1273629, 1163955, 1064409, 974633, 894227, 822381, 758258, 701430, 651470, 607369, 567914, 532494, 500976, 472867, 447206, 423307]
57424D23307k2238k0567j9067j7674j6185j4563j2827j1046r689r331r750r968
57412B50402r529q987q773q407p375o078n235m965m960n032m926m231l048k154
57398A66702k067k344k342j975j446q91o82j250k188k383j563p24n92o28k74l6
57382A45317m90j179j436j397j241m84R31J762J001n04j222j026q59r46q08n97
57366A36822r32j596j732j291j071j362j588j354r13o39p57j473k508k851j758
57351A14997J13J408J658J344Q35J62m02n63o00r45j332j282j019j079j246r21
57335A11128k04L95J012K054L061L118K389J980K252K449K143J826J828J670R58
57320A38059P8m39n66n15l45r8J29L60O18P64Q29J269K319L416L927M148M766
$$ y = [423307, 401069, 380502, 361435, 343761, 327576, 313013, 300186, 289140, 279451, 270120, 260370, 250402, 240873, 231886, 223113, 214706, 207331, 201253, 196018, 191053, 186093, 181061, 176135, 171904, 168856, 166702, 164635, 162291, 159949, 157974, 156528, 155637, 154955, 153705, 151517, 149134, 147571, 146847, 146255, 145627, 145353, 145317, 144827, 143648, 142212, 140815, 139574, 139090, 140021, 141783, 142784, 142280, 141058, 140032, 139173, 138227, 137419, 136822, 135890, 134294, 132562, 131271, 130200, 128838, 127250, 125896, 124983, 124344, 123587, 122114, 119606, 116755, 114997, 115110, 116518, 118176, 119520, 120355, 120517, 120115, 119552, 118952, 118007, 116675, 115393, 114374, 113295, 112049, 111128, 110924, 111319, 112331, 114385, 117446, 120564, 122953, 124933, 127185, 129634, 131777, 133603, 135431, 137101, 138059, 138137, 137698, 137132, 136617, 136272, 136174, 136303, 136663, 137281, 138045, 138874, 140143, 142462, 145878, 149805, 153953, 158719]
57303A58719N609N871N436N018N056N326N646O113O652P061P538Q323Q999R020
57289B50387Q869R676J1538J3293J4125J4526J5375J6860J8721K0841K3266K5885
57277D43362K8349L0050L0388K9369K7688K5732K2890J8499J3041P574K332l157
57265F76117q862j4131j8609k2279k4836k6024k6445k6906k7139k6318k4719k3517
57253D06332k2892k1688j9255j6356j3901j1895j0135q814p943p083o129n568
57241B54673n501n331m759m275m238m227l796l114k503k034j859k215k792k880
57227B05149k432k200k490k644k135j329p12j38O02J235J487J602J810J830J346
57212B00981N87O7J05O66J336J499J112J103K299M046M862M461M019M320M754
$$ y = [158719, 164328, 170199, 175635, 180653, 185709, 191035, 196681, 202794, 209446, 216507, 224045, 232368, 241367, 250387, 259256, 268932, 280470, 293763, 307888, 322414, 337789, 354649, 373370, 394211, 417477, 443362, 471711, 501761, 532149, 561518, 589206, 614938, 637828, 656327, 669368, 676942, 679274, 676117, 667255, 653124, 634515, 612236, 587400, 561376, 534931, 508025, 480886, 454568, 429849, 406332, 383440, 361752, 342497, 326141, 312240, 300345, 290210, 281396, 273453, 266370, 260241, 254673, 249172, 243841, 239082, 234807, 230569, 226342, 222546, 219432, 216929, 214895, 213036, 210821, 208029, 205149, 202717, 200517, 198027, 195383, 193248, 191919, 191207, 191069, 191671, 192906, 194393, 195995, 197805, 199635, 200981, 201568, 201635, 201740, 202406, 203742, 205241, 206353, 207456, 209755, 213801, 218663, 223124, 227143, 231463, 236217]
57197B36217M576M047L756L670L343K517J251J7l06O00J658J561P51Q58K129K959
57181B69604K411J504J325J406J037P89J474K568K938K449J809J487J598K280
57167B94679L311M006M127M251M746N235N662O730Q532R900J0039R773J0127J0785
57153C91903J1105J1549J2748J4002J4231J3701J3460J3678J3847J4071J4768
57142E39063J5579J5941J6235J7144J8303J8984J9546K0816K2511K3739K4645
57131G52506K6064K7857K9262L0621L3110L6734M0194M2836M5287M8014N0691
57120A163176N3216N6085N9522O3312O7570P2537P7819Q3044Q9025R6973J06857
57109A989136J18129J31597J48711J69264J92041K17725K48870K87014L32603
$$ y = [236217, 240793, 244840, 248596, 252266, 255609, 258126, 259377, 259394, 259088, 259688, 261346, 262907, 263658, 264516, 266645, 269604, 272015, 273519, 274844, 276250, 277287, 278076, 279550, 282118, 285056, 287505, 289314, 290801, 292399, 294679, 297990, 301996, 306123, 310374, 315120, 320355, 326017, 332747, 341279, 351179, 361218, 370991, 381118, 391903, 403008, 414557, 427305, 441307, 455538, 469239, 482699, 496377, 510224, 524295, 539063, 554642, 570583, 586818, 603962, 622265, 641249, 660795, 681611, 704122, 727861, 752506, 778570, 806427, 835689, 866310, 899420, 936154, 976348, 1019184, 1064471, 1112485, 1163176, 1216392, 1272477, 1331999, 1395311, 1462881, 1535418, 1613237, 1696281, 1785306, 1882279, 1989136, 2107265, 2238862, 2387573, 2556837, 2748878, 2966603, 3215473, 3502487, 3835090]
57100C835090L88339M59945N52801O70304Q15948R93585J204065J444335J710371
57091A2074783J996524K289946K570732K821402L032001L192203L285734L302094
57083C4565419L249700L144723K985634K752086K436127K064041J674191J274383
57075E4146304Q29789K94277l49194j072722j813701k496591l055970l453574
57067D3028618l681253l750870l683501l506279l251866k953622k639351k329415
57059A7232461k038118j773999j539894j335243j158756j008348q80138p69633
57051F728332o73610n89814n15833m49778l91440l41221k98411k61614k30096
57042B976515k03379j80235j59563j41610j26881j14464j02929r2306q3506p6265
$$ y = [3835090, 4223429, 4683374, 5236175, 5906479, 6722427, 7716012, 8920077, 10364412, 12074783, 14071307, 16361253, 18931985, 21753387, 24785388, 27977591, 31263325, 34565419, 37815119, 40959842, 43945476, 46697562, 49133689, 51197730, 52871921, 54146304, 54976093, 55270370, 54921176, 53848454, 52034753, 49538162, 46482192, 43028618, 39347365, 35596495, 31912994, 28406715, 25154849, 22201227, 19561876, 17232461, 15194343, 13420344, 11880450, 10545207, 9386451, 8378103, 7497965, 6728332, 6054722, 5464908, 4949075, 4499297, 4107857, 3766636, 3468225, 3206611, 2976515, 2773136, 2592901, 2433338, 2291728, 2164847, 2050383, 1947454, 1855148, 1771642, 1695377]
57032A695377o9474o3063n7850n3671m9507m5393m2308m0079l7293l3547l0042
57021A173150k7543k5425k3173k1193j9616j7796j5655j4072j3334j2571j1255
57010I71517r901q627o396k358L307J0432J9373K9915M1191N3509O9034Q9949
56998A260945J16667J46895J73287J81718J56906R4983J0620p1054j30500j62326
56988A778141j71475j65355j49864j29214j06558q4501o5272n0318l9987l4268
56978G81329l3270l6242m0741m3974m4877m4012m1927l8657l4558l0383k6477
56967C66211k2617j8532j3926q395k102L876Q711J2915J7388K2001K6164L0096
56955D21790L3941L5814L2477K2666Q740n226j6260k3321k6584k6786k4892k1776
$$ y = [1695377, 1625903, 1562840, 1504990, 1451319, 1401812, 1356419, 1314111, 1274032, 1236739, 1203192, 1173150, 1145607, 1120182, 1097009, 1075816, 1056200, 1038404, 1022749, 1008677, 995343, 982772, 971517, 961616, 952989, 946593, 944235, 947542, 957974, 977347, 1007262, 1048453, 1101962, 1170996, 1260945, 1377612, 1524507, 1697794, 1879512, 2036418, 2131401, 2142021, 2070967, 1940467, 1778141, 1606666, 1441311, 1291447, 1162233, 1055675, 971174, 905902, 855584, 815597, 781329, 748059, 711817, 671076, 627102, 582225, 538213, 496286, 457629, 423071, 392688, 366211, 343594, 325062, 311136, 302741, 300639, 304515, 313226, 326141, 343529, 365530, 391694, 421790, 455731, 491545, 524022, 546688, 555428, 550202, 533942, 510621, 484037, 457251, 432359, 410583]
56943D10583j8079j4255j0523o947l653q04J831M889Q686J2940J7347K1970K6842
56930D50827L1780L6473L9686L8286K8919J1947p352k2845l2199l6743l8151l6967
56918D63661l3654k9148k4347k0079j7227j5767j4260j1528q368o318n401m487
56906B73077l378k699k183q97R08J967K194K960M886O979Q368R403J0520J1388
56892C23493J1783J2155J2795J3451J4222J5816J8491K1489K3740K4231K1561
56881E13227J4437L291r340k0427k8081l1759l1986l0000k6869k2695j7295j1329
56869C01174n748l52N737J2270J8006K2867K8435L5899M4813N4344O4176P3109
56857F54730P7695P3540N8115L2651K209k6183m6826n7919o0977n8232n1470m2689
$$ y = [410583, 392504, 378249, 367726, 360779, 357126, 356322, 358153, 363042, 371728, 384668, 402015, 423985, 450827, 482607, 519080, 558766, 597052, 625971, 637918, 630566, 607721, 575522, 538779, 500628, 463661, 430007, 400859, 376512, 356433, 339206, 323439, 309179, 297651, 289283, 282965, 277564, 273077, 269699, 267000, 264817, 263920, 264828, 266795, 268989, 271949, 276835, 283814, 292182, 301585, 312105, 323493, 335276, 347431, 360226, 373677, 387899, 403715, 422206, 443695, 467435, 491666, 513227, 527664, 530955, 521615, 501188, 473107, 441348, 409362, 379362, 352493, 329798, 312503, 301174, 295426, 295074, 300811, 313081, 331087, 353954, 382389, 418288, 463101, 517445, 581621, 654730, 732425, 805965, 864080, 896731, 898940, 872757, 825931, 768012, 707035, 648803, 597333, 554644]
56845E54644l3920k5728j7094p281L190J3641K4123L4838M5808N7438P0351Q4372
56833H04382R8546J11665J20893J19889J01280O3227J2942l7350p7434j02552
56823A215488j12739j11166j02372r0120p6352o2168m8726l6505k4763j2858j408
56812E36311Q829J8468K8859M0437N2663O5084P7097Q6372Q8263P7583N2071J5244
56800A147281k4160n6803p7857q7819q9323q4570p5617o4884n4051m3485l3428
56789D55284k4666j7372j0501l256L878J0374J6807K3845L1162L8079M4006M7100
56777F14740M3799L1639J2289r282k8267m1993m9626n1725n0013m6402m1909l6827
56765C46423l1475k6233k1338j7166j4219j2333j0680q965p729p009n786l604
$$ y = [554644, 520724, 494996, 477902, 470621, 473811, 487452, 511575, 546413, 592221, 649659, 720010, 804382, 902928, 1014593, 1135486, 1255375, 1356655, 1419882, 1432824, 1395474, 1318040, 1215488, 1102749, 991583, 889211, 799091, 722739, 660571, 611845, 575340, 550577, 537719, 536311, 545140, 563608, 592467, 632904, 685567, 750651, 827748, 914120, 1002383, 1079966, 1132037, 1147281, 1123121, 1066318, 988461, 900642, 811319, 726749, 651132, 586248, 532197, 488712, 455284, 430618, 413246, 402745, 399489, 403367, 413741, 430548, 454393, 485555, 523634, 567640, 614740, 658539, 690178, 702467, 693185, 664918, 622925, 573299, 521574, 471561, 425159, 383250, 346423, 314948, 288715, 267377, 250211, 235992, 223659, 212979, 204014, 196285, 189276, 183490, 179886]
56753A79886j586q90j095j204j242j653j997j605q58n95p27o29l55l46m82m87
56737A64135p76j705k544k407j687j403j568j466j090j051j292j263j090j343
56723A43450j788j677j166j217k016k639k398j541n27M32R66O28l50j091j095
56708A27971p29o08r11j341j411q92j88l0n00q61o08r4K58O02J033J175J047J394
56690A25307K346K711J644J94j30M87P61M46M09Q89J199J075R81J155J365J626
56674A42465K049K125J240j25p71l51L19N72N45N71O74P40N75p3r62j226m51N19
56656A48435O95M10P41J876L064L876M478M871M885M738M719M608M169L800L797
56641A99162L509K376J198J173J961K165J405N57M7o45j751k776l519m359n293
$$ y = [179886, 178300, 177410, 176315, 175111, 173869, 172216, 170219, 168614, 167756, 167161, 166434, 165805, 165450, 165104, 164622, 164135, 163359, 161654, 159110, 156703, 155016, 153613, 152045, 150579, 149489, 148438, 147146, 145883, 144793, 143450, 141662, 139985, 138819, 137602, 135586, 132947, 130549, 129008, 128481, 128913, 129879, 130507, 130157, 129066, 127971, 127242, 126634, 125723, 124382, 122971, 122079, 121891, 121861, 121361, 120500, 119892, 119798, 120056, 120658, 121691, 122866, 123913, 125307, 127653, 130364, 132008, 132202, 132072, 132559, 133320, 133766, 134175, 135064, 136263, 137338, 138319, 139474, 140839, 142465, 144514, 146639, 147879, 147754, 146983, 146632, 146951, 147523, 148068, 148639, 149313, 150053, 150628, 150555, 149593, 148367, 147916, 148435, 149130, 149540, 150281, 152157, 155221, 159097, 163575, 168446, 173331, 178069, 182788, 187396, 191565, 195365, 199162, 202671, 205047, 206245, 207418, 209379, 211544, 212949, 213506, 213553, 212908, 211157, 208381, 204862, 200503, 195210]
56626A95210n749n509m956m359l733l284l118k758j870j161j387j837j218J93
56612A54464Q21K54k16K13O42J28p90j028m48K87O57N66J42k53k38J58O37J067
56594A57063J398J288N46l16o12l75r1J68N58Q32P42O74R98J206P65K72N78J185
56576A66879R80K39L09J452K505K779K767K851K753K588L053M169N055N280N391
56561B09050N801O289O832P792Q970R552R309Q812Q320P555O697O426O671O537
56547C14613N751M951M255K828M28j808k818k925l143l978n371p073q518r092
56533B88100q842q468q355q205p719o952n970m858m046l921m149m091l707l389
56519B05428l200l100l413m071m006k490o18k3n91r49p88r11j287j008j73Q0l72
$$ y = [195210, 189461, 183952, 178996, 174637, 170904, 167620, 164502, 161744, 159874, 158713, 157326, 155489, 154271, 154464, 155285, 155539, 155323, 155536, 156178, 156306, 155516, 154488, 154040, 154327, 154984, 155550, 155692, 155439, 155201, 155359, 155996, 157063, 158461, 159749, 160295, 159979, 159367, 158992, 158901, 159069, 159627, 160459, 161201, 161875, 162873, 164079, 164844, 165116, 165694, 166879, 167859, 168098, 168407, 169859, 172364, 175143, 177910, 180761, 183514, 186102, 189155, 193324, 198379, 203659, 209050, 214851, 221140, 227972, 235764, 244734, 254286, 263595, 272407, 280727, 288282, 294979, 301405, 308076, 314613, 320364, 325315, 329570, 332398, 332826, 331018, 328200, 325275, 322132, 318154, 312783, 305710, 297192, 288100, 279258, 270790, 262435, 254230, 246511, 239559, 233589, 228731, 224685, 220764, 216615, 212524, 208817, 205428, 202228, 199128, 195715, 191644, 187638, 185148, 184530, 184507, 183916, 182967, 182179, 181268, 179981, 178973, 178800, 178880, 178508]
56502A78508l89L74R56Q85O86L49q09k307k526j176O1N7l71l51l88r39j277q24
56484A70519k50j51L9Q68J845K480L104L798L769K748J801J835K383K657K716
56469B00161K801K669K396K729L851M774M709M053L429K877K544K922L703L699
56455B47317K573J476J265J361J081P40O11J62p30j046j42J066J436J137R27Q58
56439B60092N32p2p53j372j616j321j156j871k810k604j418q34j269j490j074
56424B40964j218k304k912k287j730k185k578k020j717k825m166m013k826k246
56410B05937k483k592k431k526k684k302j578j055n40L38J161J297Q46J03j073
56395A90418k453l039k381j438j214j518j849k368l089l330k919k827l620m319
$$ y = [178508, 178119, 178493, 179449, 180334, 181020, 181369, 180560, 178253, 175727, 174551, 174612, 174669, 174298, 173947, 173559, 172620, 171343, 170519, 170269, 170118, 170157, 171025, 172870, 175350, 178454, 182252, 186021, 188769, 190570, 192405, 194788, 197445, 200161, 202962, 205631, 208027, 210756, 214607, 219381, 224090, 228143, 231572, 234449, 236993, 239915, 243618, 247317, 249890, 251366, 252631, 253992, 255073, 255813, 256424, 256586, 255856, 254810, 254668, 255734, 257170, 258307, 259234, 260092, 260624, 260552, 259799, 258427, 256811, 255490, 254334, 252463, 249653, 247049, 245631, 244797, 243528, 242038, 240964, 239746, 237442, 234530, 232243, 230513, 228328, 225750, 223730, 222013, 219188, 215022, 211009, 208183, 205937, 203454, 200862, 198431, 195905, 193221, 190919, 189341, 188286, 187746, 188084, 189245, 190542, 191388, 191491, 190418, 187965, 184926, 182545, 181107, 179893, 178375, 176526, 174158, 171069, 167739, 164820, 161993, 158373, 154054]
56381A54054l709j723J143M463P320Q556Q451Q584R313R143P428N671N045M703
56367B28442L872L487M166M571L605K363K068J943J098N97J485K502K112J256
56353B63567J596K440K030P54M01J103J512J385J559J869J402M46J83P30J217
56338B82194J438J771K033J937K069K915L689L618L419L962M563M300L928M590
56324C26426N699O056O021O592P281O999O243O347P273Q066Q646R328R505Q660
56310D29142P762P672P338N539L224J915J070n05j892j425L2J20j375k612k948
56295D53057l305l680k983j342oR00K291L925M637M579N010N983O509O731P735
56280D90041R335J0325J0788J1941J3838J5394J6555J8282K0523K2363K4080K6906
$$ y = [154054, 150345, 148622, 149765, 154228, 161548, 170104, 178555, 187139, 196452, 205595, 213023, 218694, 223739, 228442, 232314, 235801, 239967, 244538, 248143, 250506, 252574, 254517, 255615, 256212, 257697, 260199, 262311, 263567, 265163, 267603, 269633, 270387, 270788, 271891, 273403, 274788, 276347, 278216, 279618, 280064, 280247, 280977, 282194, 283632, 285403, 287436, 289373, 291442, 294357, 298046, 301664, 305083, 309045, 313608, 317908, 321836, 326426, 332125, 338181, 344202, 350794, 358075, 365074, 371317, 377664, 384937, 393003, 401649, 410977, 420482, 429142, 436904, 444576, 451914, 457453, 460677, 462592, 463662, 463157, 461265, 459840, 459872, 459992, 458617, 456005, 453057, 449752, 446072, 443089, 441747, 441741, 442641, 444932, 448857, 453494, 458073, 463083, 469066, 475575, 482306, 490041, 499376, 509701, 520489, 532430, 546268, 561662, 578217, 596499, 617022, 639385, 663465, 690371]
56268F90371L0785L4475L7783M1726M6574N1784N7641O4996P3438Q1697Q9727
56257A300997R8493J07958J17219J26238J35522J44357J51305J56046J58838J58790
56247B655763J54723J47208J37575J25404J09253Q9415O7738M5265K2383P08j7643
56236C537792l2508m5106n5480o2688o7073p0021p1819p2005p1320p1118p1422
56225B847232p1752p3109p6719q1668q6166r0230r4571r7966r8813r8250r8519
56214A879469r9033r7423r3721r0011q6494q1518p5243o9606o4691n8748n1854
56203A011127m6165m2284l8679l4800l1576k8789k5265k1641j9658j8732j6654
56192F86884j3602j1815j1343r890p201n634n944o187n401m774m480l052n43J148
$$ y = [690371, 721156, 755631, 793414, 835140, 881714, 933498, 991139, 1056135, 1129573, 1211270, 1300997, 1399490, 1507448, 1624667, 1750905, 1886427, 2030784, 2182089, 2338135, 2496973, 2655763, 2810486, 2957694, 3095269, 3220673, 3329926, 3419341, 3487079, 3532344, 3554727, 3555435, 3537792, 3505284, 3460178, 3404698, 3342010, 3274937, 3204916, 3133097, 3061092, 2989772, 2918654, 2847232, 2775480, 2702371, 2625652, 2543984, 2457818, 2367588, 2273017, 2175051, 2076238, 1977988, 1879469, 1780436, 1683013, 1589292, 1499281, 1412787, 1331269, 1256026, 1186420, 1121729, 1062981, 1011127, 964962, 922678, 883999, 849199, 817623, 788834, 763569, 741928, 722270, 703538, 686884, 673282, 661467, 650124, 640234, 633033, 627399, 621455, 615268, 609867, 605093, 600613, 597561, 597018, 598166]
56178E98166J755L018N072O056N907O802R224J1213J2216J3871J6196J6955J5866
56165G22317J5520J6966J8058J7406J6258J5202J2758Q692N190L205J027k053
56153H50546m055l720k493j651n25J161K337L115N363R551J4058J8388K3962L0921
56139I46958L7509M3534N1136O1324P2971Q5686J00047J14263J24365J28442J27228
56128A893463J20365J06596Q8380P1772O0295N2753M7521M4331M0960L3247K0346
56117B580029N878p286j9150k8816l3914l5481l8643m6604n8116p1851q7935j03784
56105B054327j13972j16577j14803j10581j01919q8553p4610o2960n2097m1086
56095A177169l2356k6899k1901j5981j1845j1048j1063j0140j0021j1283j1234
$$ y = [598166, 599921, 602939, 608011, 614067, 619974, 626776, 636000, 647213, 659429, 673300, 689496, 706451, 722317, 737837, 754803, 772861, 790267, 806525, 821727, 834485, 843177, 848367, 851572, 852599, 850546, 846491, 842771, 840278, 838627, 838102, 839263, 841600, 844715, 850078, 859629, 873687, 892075, 916037, 946958, 984467, 1028001, 1079137, 1140461, 1213432, 1299118, 1399165, 1513428, 1637793, 1766235, 1893463, 2013828, 2120424, 2208804, 2280576, 2340871, 2393624, 2441145, 2485476, 2526436, 2559683, 2580029, 2585907, 2578621, 2559471, 2530655, 2496741, 2461260, 2422617, 2376013, 2317897, 2246046, 2158111, 2054327, 1940355, 1823778, 1708975, 1598394, 1496475, 1407922, 1333312, 1270352, 1218255, 1177169, 1144813, 1117914, 1096013, 1080032, 1068187, 1057139, 1046076, 1035936, 1025915, 1014632, 1003398]
56084A003398r121q073r100q705n244k091j479q97J249K328J166J128L844N737
56070I74140M598L705N551P361O947P079R721J1748J0865J0089J1885J3497J2618
56057A089804J1948J3564J4542J2831J1753J3938J6438J6520J6462J8050J8432
56046A254282J6191J5207J7690J9712J8659J8274K1163K3369K2059K1427K4886
56035A472919K8525K8665K8681L1729L3877L1655K9338L1462L4816L5282L5773
56024A822722L9824M4027M4575M4761M8326N1987N2097N1969N4994N7584N6576
56013B369442N6174N9776O2698O1059N9839O3639O8010O8541O9796P5956Q1813
56002C096743Q2816Q4622R2520J00992J04525J08738J19336J30253J34928J39130
$$ y = [1003398, 994277, 986204, 977104, 968399, 963155, 961064, 959585, 958688, 959937, 962265, 963431, 964559, 968403, 974140, 978738, 982443, 987994, 995355, 1002302, 1009381, 1019102, 1030850, 1041715, 1051804, 1063689, 1077186, 1089804, 1101752, 1115316, 1129858, 1142689, 1154442, 1168380, 1184818, 1201338, 1217800, 1235850, 1254282, 1270473, 1285680, 1303370, 1323082, 1341741, 1360015, 1381178, 1404547, 1426606, 1448033, 1472919, 1501444, 1530109, 1558790, 1590519, 1624396, 1656051, 1685389, 1716851, 1751667, 1786949, 1822722, 1862546, 1906573, 1951148, 1995909, 2044235, 2096222, 2148319, 2200288, 2255282, 2312866, 2369442, 2425616, 2485392, 2548090, 2609149, 2668988, 2732627, 2800637, 2869178, 2938974, 3014930, 3096743, 3179559, 3264181, 3356701, 3457693, 3562218, 3670956, 3790292, 3920545, 4055473, 4194603]
55992D194603J49874J61971J68730J75506J88924K03378K12418K22479K40660
55983E918543K60496K75065K91989L19281L49229L73356L99803M37901M79876
55974I105539N17199N59887O18877O85403P50166Q26018R27629J046758J173759
55965A6211235J324515J518181J749737K016461K349729K786697L335737M009594
55957C5301886M866877N975932P362178R034066J1025416J3359016J6012185J8989038
55949A21926594K2386687K6314668L0778084L5620604M0271838M3192488M1761250
55942C62252213L3530836J8342824p17676j8818079l2131676l9434994m1612755
55935B81410693m0248995l6752273l2216033k7450482k2949452j8941065j5523023
$$ y = [4194603, 4344477, 4506448, 4675178, 4850684, 5039608, 5242986, 5455404, 5677883, 5918543, 6179039, 6454104, 6746093, 7065374, 7414603, 7787959, 8187762, 8625663, 9105539, 9622738, 10182625, 10801502, 11486905, 12237071, 13063089, 13990718, 15037476, 16211235, 17535750, 19053931, 20803668, 22820129, 25169858, 27956555, 31292292, 35301886, 40168763, 46144695, 53506873, 62540939, 73566355, 86925371, 102937556, 121926594, 144313281, 170627949, 201406033, 237026637, 277298475, 320490963, 362252213, 395783049, 414125873, 413408197, 394590118, 362458442, 323023448, 281410693, 241161698, 204409425, 172193392, 144742910, 121793458, 102852393, 87329370]
55928H7329370j2719141j0463279q640779p167995n995710n060525m290975l651318
55920B9339648l132373k708354k342570k024508j762354j546743j355425j184926
55912A3282395j045393r31351q26668p31437o56503n97696n40899m86609m45340
55903G020499m14325l81484l47334l21444l01990k79164k54337k36439k23579
55894D260403k06659j87213j73968j65595j53790j39690j30922j26011j17514
55885B859041j07147j02448j01597r6535q8091q3547q2062p6733o8558o4507o3905
55874A923911o0080n3473n0259m9906m6613m1269l9726m0871l8410l3002l0987
55863A439315l2423l1685k8627k8034k9072k6265k0120j6237j4600j0139l379
$$ y = [87329370, 74610229, 64146950, 55506171, 48338176, 42342466, 37281941, 32990966, 29339648, 26207275, 23498921, 21156351, 19131843, 17369489, 15822746, 14467321, 13282395, 12237002, 11305651, 10478983, 9747546, 9091043, 8493347, 7952448, 7465839, 7020499, 6606174, 6224690, 5877356, 5555912, 5253922, 4974758, 4720421, 4483982, 4260403, 4053744, 3866531, 3692563, 3526968, 3373178, 3233488, 3102566, 2976555, 2859041, 2751894, 2649446, 2547849, 2451314, 2363223, 2279676, 2197614, 2120881, 2052323, 1987816, 1923911, 1863831, 1810358, 1760099, 1710193, 1663580, 1622311, 1582585, 1541714, 1503304, 1470302, 1439315, 1406892, 1375207, 1346580, 1318546, 1289474, 1263209, 1243089, 1226852, 1212252, 1202113, 1198734]
55852A198734m71k947o920j1787k0186k9732l4311l3613l2657l2236k8647k2394
55840I42833j8208j6392j2765p350m628n029m335j890j530l981n890o760r500
55827H44575j3774j5996j6077j7307j9565j9611j8066j8914k1983k2990k1221
55816F39071k0225k0683j9526j6518j4927j5056j3742j0762r294r463p912m343
55804D76620k166j991o59K513M570M777N641P343O955M095J721N03k057o127q695
55789D93043r043r785j1594j2153j1041j0548j0878r614o728n118n437n195l550
55776C82359k231j400M13J902k39n533r693j0928j1328j1670j0174p138n533n854
55762C02953n260k768o13J98R17J088j383n406p044n570m261m472m073k662k850
$$ y = [1198734, 1198263, 1195316, 1188396, 1176609, 1156423, 1126691, 1092380, 1058767, 1026110, 993874, 965227, 942833, 924625, 908233, 895468, 888118, 883490, 878461, 874126, 872236, 870706, 866725, 860835, 854075, 844575, 830801, 814805, 798728, 781421, 761856, 742245, 724179, 705265, 683282, 660292, 639071, 618846, 598163, 578637, 562119, 547192, 532136, 518394, 507632, 498338, 488875, 480963, 476620, 474454, 472463, 471804, 474317, 478887, 483664, 489305, 496648, 503603, 507698, 509419, 509922, 507865, 501738, 493043, 484000, 474215, 462621, 450468, 439427, 428879, 418001, 408387, 401659, 396541, 391104, 385909, 382359, 380128, 378728, 379141, 381043, 380804, 375271, 365578, 354650, 343322, 331652, 321478, 314340, 308807, 302953, 297693, 294925, 294312, 294510, 295427, 296515, 295132, 289726, 282682, 277112, 272851, 268379, 264306, 261644, 258794]
55747B58794m980n900m596m008n449o230m825l608m293n090m563m157m721m490
55733A91884k658j188j130p00J071K280J528N7j070k584m502n268m711m565n094
55718A63350m592l112k803l716l272j069M2r79j464J68J847J953J983L157M119
55703A55612M066M559O231P075N904M218K950Q59k070l291j809r6P5L53K290M437
55687A91363N192N379N856N593M151L169L323K809P49r01p80m66j405k532k874
55672B18626l558n074n585m126k630k648k874j987j102j182q98O39J736J029o9
55657A90297l1L16J36O11K359L475K573J256J203J339K87q62q69r74k591m569
55641A93956n371n860p315q691q470p403o915o529n327m243m498n259n149m559
$$ y = [258794, 253814, 247914, 243318, 239310, 233861, 227631, 222806, 219198, 214905, 209815, 205252, 201095, 196374, 191884, 189226, 188038, 186908, 186208, 187279, 189559, 191087, 191144, 190074, 187490, 182988, 177720, 173009, 168444, 163350, 158758, 155646, 152843, 149127, 145855, 144786, 144828, 143849, 142385, 142553, 144400, 146353, 148336, 151493, 155612, 159678, 164237, 170468, 177543, 183447, 187665, 190615, 191474, 189404, 186113, 184304, 184208, 184283, 184636, 186926, 191363, 196555, 201934, 207790, 213383, 217534, 220703, 224026, 226835, 227584, 226683, 225903, 225437, 224032, 221500, 218626, 215068, 209994, 204409, 200283, 197653, 195005, 192131, 190144, 189042, 187860, 186962, 187601, 189337, 190366, 190297, 190266, 190582, 190718, 191329, 193688, 197163, 199736, 200992, 202195, 203534, 203821, 202959, 202090, 201116, 198525, 193956, 188585, 182725, 175410, 166719, 158249, 150846, 143931, 137402, 132075, 127832, 123334, 118075, 112926, 108367]
55627A08367m387m130l270k828l515m022l161j984j757j686p90j19q84j983j827
55612G2024r66p95j084r76r40j561j832p76O10R57P05P74O38l35j169r50o58j325
55594F2341j932j248k10l15j043j022m13m2M39J453J918R12l52l32L29J46o52
55577E9977r95j189k052k939k676j620q76m61Q5L57M4J4P48J090K39n03J26J076
55559E0445Q52J74M47J077O22n18r28o82p51q80l03M10L20K0M35P45l05j880k081
55540D7219q11M19R28J161J257J168J497K465K900J967R20J290K379K557K007
55525F9323K062K642K527J559O08j9m71m22J22k0j479k854k746k068k426l403
55509F2935l711l805m929o481o750n617m289l037j447j83k04q42q26n30j033j717
$$ y = [108367, 103980, 99850, 96580, 93752, 90237, 86215, 83054, 81070, 79313, 77627, 76837, 76718, 75834, 73851, 72024, 71058, 70263, 69179, 68203, 67263, 65702, 63870, 63094, 63704, 64661, 65366, 66140, 66778, 66443, 65274, 64324, 63666, 62341, 60409, 59161, 58951, 58636, 57593, 56571, 56158, 56116, 56555, 58008, 59926, 60838, 60486, 60154, 60483, 60629, 59977, 58982, 57793, 55741, 52802, 50126, 48506, 47630, 47169, 47254, 47611, 47655, 47669, 48417, 49507, 49746, 49243, 49369, 50445, 51297, 51471, 51918, 52995, 53617, 53099, 52171, 51489, 50738, 49858, 49555, 49965, 50285, 50305, 50740, 51485, 51180, 49300, 47219, 46408, 46827, 47755, 48916, 50173, 51341, 52838, 55303, 58203, 60170, 61090, 62380, 64759, 67316, 69323, 71385, 74027, 76554, 78113, 78721, 78702, 78231, 77809, 77931, 77911, 76432, 73578, 70832, 68764, 66338, 62935, 59224, 55419, 50490, 44009, 37259, 31642, 27353, 24316, 22869, 22686, 22482, 21640, 20814, 20284, 19251, 17534]
55493A7534j188J38P18N90R34J501J006k90q58n02l60n47j77N30M94J1L48J226
55475B1108J012m63j568j463r57o28j47L97L54q8j21J23j61p79q98p32j050j332
55457A2607n03Q76J257P12O42J115Q39k27o64j91n6n89o11K07O37J30k50K02P66
55438A6899Q41Q48J016Q49K90k0j4k76o43k88N90P78M7m69j72K73L26K57K00o0
55418B1272k60qJ40n63j379r61K66N87j79m35M31J156R74P20J015J244J075J131
55400B6226J508J273J58p92r76j127j750k194j945j479j198p75j06L29M83Q35
55384A8470J158N82p19j377q33p7N4j12j88m36q27p65k64j32o00j024j187j498
55366A0225j712r85M64J302J108Q58J008Q14Kn52m71m94r11r48l88j41m53k48
$$ y = [17534, 16346, 16484, 17202, 17792, 18726, 20227, 21233, 20943, 20085, 19583, 19223, 18676, 18499, 19029, 19523, 19534, 19882, 21108, 22120, 21657, 20089, 18626, 17669, 17041, 16894, 17291, 17645, 17557, 17436, 17559, 17398, 16619, 15721, 14989, 13939, 12607, 12104, 12980, 14237, 14949, 15591, 16706, 17545, 17318, 16654, 16463, 16407, 15818, 15207, 15414, 16051, 16181, 15931, 16133, 16899, 17740, 18588, 19604, 20453, 20743, 20723, 20709, 20433, 19790, 19502, 20092, 20870, 20917, 20448, 20276, 20549, 20875, 21132, 21332, 21272, 21012, 21004, 21144, 20581, 19202, 18241, 18507, 19094, 18915, 18480, 18911, 20067, 21041, 21761, 22776, 24020, 25095, 26226, 27734, 29007, 29165, 28373, 27397, 26270, 24520, 22326, 20381, 18902, 17704, 16929, 16823, 17152, 17635, 18470, 19628, 20210, 19491, 18114, 17281, 17204, 17258, 17146, 16958, 16522, 15695, 14930, 14666, 14534, 13934, 12910, 11723, 10225, 8513, 7528, 7992, 9294, 10402, 11260, 12268, 13082, 13084, 12532, 12061, 11567, 10656, 9708, 9320, 9179, 8726, 8478]
55348H478R09J815J528P78N06M56K33K43O32N52l64j073p14M6K82K30M46O65N45
55329A6193M55N63K07q04j349n91O17R99O40L89L92K87J47J05k60j152j784j318
55311A3736j08Q22J009O26m8n21j69Q52J457J058M33M92R10P96J04n39q59r73
55293A9078q45m18mJ7l12p27j027r40k37P42J244J060P38O07L38k47o95o35k99
55274A7438RL19O15O80N87O38P12L62l42q61j097j309j209k64J017J388P43L25
55256A9751P37J004K82p51r75l49L81P12N37j4m89n12m10o70q27n3J179J468O47
55237B1648k1l3l53j324j734q28L57P86R93J716K299J797N84l37p72r56o59K32
55219B3395R81R36M71K04N7j07J70J022J613J258M33j32m59p02n06J15L45r6k29
$$ y = [8478, 9387, 11202, 12730, 13508, 14014, 14470, 14703, 14946, 15578, 16130, 15766, 14693, 13979, 14025, 14307, 14537, 14983, 15648, 16193, 16648, 17211, 17418, 16614, 15265, 14674, 15291, 16290, 16930, 17319, 17711, 17998, 18145, 18250, 17990, 16838, 15054, 13736, 13628, 14450, 15459, 16085, 16037, 15516, 15347, 16199, 17656, 18714, 19147, 19639, 20549, 21345, 21449, 20910, 20051, 19078, 18233, 17815, 17811, 17828, 17516, 16789, 15762, 14822, 14585, 15327, 16571, 17631, 18369, 18976, 19314, 19067, 18372, 17737, 17438, 17447, 17766, 18381, 19061, 19648, 20286, 20998, 21360, 21018, 20157, 19060, 17751, 16542, 16278, 17295, 18683, 19426, 19751, 20488, 21492, 21774, 21023, 20048, 19699, 20080, 20792, 21329, 21315, 20826, 20314, 19904, 19234, 18407, 18354, 19533, 21001, 21648, 21627, 21594, 21241, 19917, 18183, 17355, 17712, 18498, 19491, 21207, 23506, 25303, 25887, 25550, 24778, 23822, 23163, 23395, 24376, 25312, 25783, 25987, 26044, 25937, 26107, 27129, 28742, 30000, 30433, 30301, 29842, 29140, 28634, 28749, 29094, 28998, 28769]
55200B8769N55J302R77J23k18k20o17j149j074o02m94p32p34m13l4M89J194J515
55182B8637J073L93J0m37j290j909j693j186j084r67k13N73M46k33l65J28M32
55165B2315K37j21n24q61n41O34J627J359K89m06n90p98q05j36M85j35j592k241
55147A8196j550n70m4M30J095J375R81M26Q0k72o00m11K54O02K93n5O2K67J25
55128B0684p4J10M84N74M38N97J329K285K787K415J445N99L03L83N57P89Q85L52
55110C6942q12j713j543o45R7N29J056J543J356M82l35o50p84r27n98N68J930
55093C6496K370J623O35M07P20M97n84j372p48P12J395Q34J62L02Q08R22P70Q63
55075D6812J171J350J390J374J154O71J83j80m99n60l6O03L67o80j224o09J73
$$ y = [28769, 29324, 30626, 31603, 31726, 31508, 31288, 30671, 29522, 28448, 27846, 27352, 26620, 25886, 25473, 25439, 25928, 27122, 28637, 29710, 30103, 30113, 29676, 28386, 26477, 24784, 23598, 22514, 21547, 21334, 21907, 22353, 22120, 21755, 21883, 22315, 22552, 22431, 21907, 21046, 20505, 21139, 22766, 24125, 24414, 24008, 23418, 22620, 21815, 21679, 22164, 22029, 20437, 18196, 16646, 16076, 16032, 16462, 17557, 18932, 19913, 20339, 20419, 20147, 19547, 19136, 19390, 19992, 20285, 20230, 20292, 20559, 20684, 20610, 20720, 21204, 21778, 22216, 22813, 24142, 26427, 29214, 31629, 33074, 33673, 33976, 34359, 34916, 35705, 36590, 36942, 36130, 34417, 32874, 32229, 32326, 32855, 33911, 35454, 36810, 37292, 36957, 36307, 35523, 34596, 33998, 34566, 36496, 38866, 40489, 41124, 41531, 42251, 42748, 42164, 40792, 40044, 40756, 42151, 42985, 43147, 43449, 44257, 45179, 45949, 46812, 47983, 49333, 50723, 52097, 53251, 53922, 54105, 53925, 53426, 52866, 52830, 53433, 53800, 53120, 51896, 51287, 51460]
55058E1460J35k19k1M20K89l49r36j467k049k162j437n67l97o45n74k72k19j94
55040D0796K94R55J211J198J245R65L0p79n23L92Q91Q95R62Q42j20j404j710q93
55022D5247m2L60R12J775K142J633J040J105J470J420R52O68R31J474J644J030
55006F3761M3m82l90m06q67j078n60p8m79j261j422j097j077j251q71p8K11k50
54988E2368q60j320j754j865j213k42J16j71l33j56n9Q1P96J762J950J230N95
54971E0925N59N46J99J25P71J563J678J127O04P01J447K217K179J237L26K39P00
54954F7143J209K130L841N412N555M649M354N269O407P052P674Q649R444R529
54940A48317R098Q355O979M733J844j462m978q003r664j0025j0032j0231j0289
$$ y = [51460, 51595, 51376, 51355, 51775, 52064, 51715, 50779, 49312, 47263, 45101, 43664, 43097, 42700, 42055, 41481, 41209, 40990, 40796, 41090, 42045, 43256, 44454, 45699, 46664, 46694, 45915, 45392, 45784, 46675, 47570, 48532, 49374, 49254, 47850, 46140, 45247, 45205, 45565, 46477, 48252, 50394, 52027, 53067, 54172, 55642, 57062, 58014, 58682, 59613, 61087, 62731, 63761, 63804, 63322, 62932, 62526, 61659, 60581, 60021, 59943, 59464, 58203, 56781, 55684, 54607, 53356, 52485, 52407, 52618, 52368, 51508, 50188, 48434, 46569, 45356, 45114, 45230, 45059, 44726, 44570, 44511, 44592, 45388, 47150, 49100, 50330, 50925, 51484, 52030, 52229, 52354, 53125, 54688, 56366, 57493, 58097, 58798, 60245, 62462, 64641, 65878, 66204, 66443, 67143, 68352, 70482, 74323, 79735, 85290, 89939, 94293, 99562, 105969, 113021, 120695, 129344, 138788, 148317, 157415, 165770, 172749, 177482, 179326, 177864, 172886, 164883, 155219, 145194, 135162, 124931, 114642]
54927A14642r837q907p488n591l789k836k573k176j498j214j511j723j388p64
54913F3347o3Q27J725K151K177K376K852L252L735M869O453P533P824Q068Q686
54898A25812R149R024Q607Q092O995M842J773j741n131p687r057r749j0314j0319
54884A20296r153p541o841o949o465n103m190m367m443l331j667o51m27m69n82
54869E8117p21o21l48m24r08j124p39k38K6L15O08L29n50j162j029p01o33n42
54851D9655l41n27j027q68J88R43N09l04l50J27J85k63o70r38j205j143l91O46
54833D4226J308J538J610J536J306J219J334J158M19l66o69o29n05j48M90R53
54817E4780J002J013J167R78K22m41m23l5K67P17J620K536K776K272J438P44P09
$$ y = [114642, 104805, 95898, 88410, 82819, 79030, 76194, 73621, 71445, 69947, 68733, 67222, 65499, 64111, 63347, 63284, 64111, 65836, 67987, 70164, 72540, 75392, 78644, 82379, 87248, 93701, 101234, 109058, 117126, 125812, 134961, 143985, 152592, 160684, 167679, 172521, 174294, 172553, 167422, 159735, 150678, 140929, 130615, 120296, 111143, 103602, 96761, 89812, 83347, 78244, 74054, 69687, 65244, 61913, 60246, 59595, 59168, 58699, 58117, 57396, 56775, 56427, 56003, 55095, 53971, 53232, 52994, 53020, 53335, 53943, 54272, 53722, 52560, 51531, 50830, 50197, 49655, 49314, 48787, 47760, 46892, 47080, 48023, 48532, 48228, 47878, 48005, 48190, 47927, 47257, 46319, 45114, 43971, 43580, 44226, 45534, 47072, 48682, 50218, 51524, 52743, 54077, 55235, 55654, 55288, 54619, 53990, 53485, 53337, 53827, 54780, 55782, 56795, 57962, 58940, 59162, 58721, 58298, 58263, 58530, 59247, 60867, 63403, 66179, 68451, 69889, 70633, 71342]
54800G1342J619K870L450L349L508M132M366M116M670O619Q620R404R624J0378
54786A48067J1147J0735R349Q011O662M489J648q85k919m915o612p240p027p014
54772A63496p322o946n431l592k330j749j600j680j517n40J076K444L052L322
54758A40683L833M586N251N843O822Q684J1339J4007J5896J7000J7889J8713J9055
54745B89601J8758J8065J6737J4041R971N481J036l932r495j4353j7464j9397
54733C09049k0955k1610k0629j8807j7447j6338j4362j1638r387q011o850n772
54721A37243n382n631n696n319m952m466l138j148K51M04k0k92n01p84p55k58
54705I9556K28L20J23l02j025j559j061L43J359J142K43l99o50q13q35n86l41
$$ y = [71342, 72961, 75831, 79281, 82630, 86138, 90270, 94636, 98752, 103422, 110041, 118661, 128065, 137689, 148067, 159214, 169949, 179298, 187309, 193971, 198460, 200108, 199223, 196304, 191389, 184777, 177537, 170510, 163496, 156174, 149228, 143797, 140205, 137875, 136126, 134526, 132846, 131329, 130789, 131865, 134309, 137361, 140683, 144516, 149102, 154353, 160196, 167018, 175702, 187041, 201048, 216944, 233944, 251833, 270546, 289601, 308359, 326424, 343161, 357202, 367173, 372654, 373690, 369758, 360263, 345910, 328446, 309049, 288094, 266484, 245855, 227048, 209601, 193263, 178901, 167263, 157876, 149865, 143015, 137243, 131861, 126230, 120534, 115215, 110263, 105797, 102659, 101511, 101762, 102166, 102146, 101854, 101353, 100569, 99814, 99556, 99784, 100104, 100227, 99925, 98900, 97341, 96280, 96623, 97982, 99124, 99367, 98968, 98318, 97505, 96670, 96084, 95743]
54688I5743l39l25j2L14K57K7J55O88J102J003N82L66O79J332J835J929J873K082
54670A09291K612L210L632L666L145K335K077K976M517N512N452M902M560M503
54656A62390M460M272L896L347K957L323M734O729Q451R405R863J0641J2416J5204
54642B62088J8410K1380K3729K5312K6252K6949K7590K7434K5138K0048J2780
54631E17110M389m442j3086k0573k6122k9658l1326l1054k9110k6485k4011k1522
54619B64110j8588j5615j3426j2105j1087j0013q760p058m914l151k504k497k064
54606A52328j107m52m12n26o56j199k073k549k405k332k800l439l800l954l928
54591A20696l398k432j870k337l361m022m051l831l580l112k290j363p94q44j235
$$ y = [95743, 95404, 95079, 95067, 95381, 95638, 95665, 95820, 96508, 97610, 98613, 99195, 99561, 100240, 101572, 103407, 105336, 107209, 109291, 111903, 115113, 118745, 122411, 125556, 127891, 129968, 132944, 137461, 142973, 148425, 153327, 157887, 162390, 166850, 171122, 175018, 178365, 181322, 184645, 189379, 196108, 204559, 213964, 223827, 234468, 246884, 262088, 280498, 301878, 325607, 350919, 377171, 404120, 431710, 459144, 484282, 504330, 517110, 521499, 517057, 503971, 483398, 457276, 427618, 396292, 365238, 336128, 309643, 285632, 264110, 245522, 229907, 216481, 204376, 193289, 183276, 174516, 167458, 162544, 159393, 156889, 154392, 152328, 151221, 150769, 150357, 149831, 149175, 147976, 145903, 143354, 140949, 138617, 135817, 132378, 128578, 124624, 120696, 117298, 114866, 112996, 110659, 107298, 103276, 99225, 95394, 91814, 88702, 86412, 85049, 84255, 83411, 82176]
54576H2176j295o73J57M20K7l75l44j85l99r42j290j033k95M06O19L97K07L53
54558G7931O67Q70R64J011Q23K74k70k55M11J355K185K696K759K403J893J510
54542I7227J404J775K812M207N240N693O243P451Q872R765J0192J0780J1659J2395
54528A95715J2705J2589J1930J0599Q744O479L536j61l912o901r129j1065j2646
54515B18483j3393j3286j2719j1848j0628r328q251p222o023n048m756m751m304
54502A06926l496k932k616k106j560j499j628j130j42K07n16j398j549j123o60
54487H4778k85J4J08J13L79Q22Q99N19K71N05Q43Q89P91P82P44N04J52j86m23
54468I2219l46J30N56M09r2k35J20M23L67K17J41k7k68l03j84k70n61p56r08j277
$$ y = [82176, 80881, 80208, 80365, 80785, 80812, 80437, 80093, 79908, 79509, 78567, 77277, 76244, 75949, 76355, 76974, 77371, 77578, 77931, 78598, 79468, 80432, 81443, 82266, 82540, 82270, 82015, 82426, 83781, 85966, 88662, 91421, 93824, 95717, 97227, 98631, 100406, 103218, 107425, 112665, 118358, 124601, 132052, 140924, 150689, 160881, 171661, 183320, 195715, 208420, 221009, 232939, 243538, 252282, 258761, 262297, 262136, 258224, 251323, 242194, 231129, 218483, 205090, 191804, 179085, 167237, 156609, 147281, 139030, 131808, 125785, 120737, 115981, 111230, 106926, 103430, 100498, 97882, 95776, 94216, 92717, 91089, 89959, 89817, 90024, 89508, 88110, 86561, 85438, 84778, 84493, 84507, 84615, 84728, 85107, 85929, 86828, 87347, 87618, 88123, 88966, 89855, 90646, 91428, 92172, 92676, 92828, 92642, 92219, 91873, 92003, 92559, 92968, 92876, 92641, 92761, 93184, 93551, 93768, 93909, 93882, 93614, 93311, 93127, 92857, 92296, 91540, 90632, 89355]
54448H9355j564j213n32m99j324k111k182j780j234m64L32N05rl49mL20j99j184
54430G5864j507p51L28P04J09p13p62R2R66J137R31Q29M34o92j668j180M89J661
54412G6271J590J151J070R36M52K50P34J258J208R91J205J681J969K096K301K733
54396I7896L607M917N775N100L292K041K098K415J968J106L89m70j654k423k313
54381A23744k104k524l020k802k274k208k403k260j986k034k027j368m50j59o09
54366I5516j226j615j605j027k27r3p83j161m78M07M76K32N59Q76J27j008p91
54349H8179Q84K254K247J634J433J571J657J819K209K525K553K549K699K808K710
54334A19731K483K131J593J044O99L33l90j230j652j715j922k297k367k104k116
$$ y = [89355, 87791, 86578, 86046, 85547, 84223, 82112, 79930, 78150, 76916, 76452, 76784, 77289, 77280, 76931, 76927, 77247, 77048, 75864, 74357, 73606, 73934, 74638, 74747, 74034, 73272, 73364, 74330, 75467, 76398, 77227, 77661, 76969, 75301, 74121, 74610, 76271, 77861, 79012, 80082, 81018, 81470, 81720, 82454, 83712, 84920, 85911, 87116, 88797, 90766, 92862, 95163, 97896, 101503, 106420, 112195, 117295, 120587, 122628, 124726, 127141, 129109, 130215, 130604, 130134, 128480, 126057, 123744, 121640, 119116, 116096, 113294, 111020, 108812, 106409, 104149, 102163, 100129, 98102, 96734, 96284, 96125, 95516, 94290, 92675, 91070, 90043, 89816, 89723, 88940, 87779, 87301, 87708, 88184, 88416, 88975, 89851, 89978, 88970, 88179, 89063, 91317, 93564, 95198, 96631, 98202, 99859, 101678, 103887, 106412, 108965, 111514, 114213, 117021, 119731, 122214, 124345, 125938, 126982, 127681, 128014, 127624, 126394, 124742, 123027, 121105, 118808, 116441, 114337, 112221]
54319A12221k710l405l604l256k651k054j698j830k461l262l699l355k357j507
54305G4372j537k119k206j566j122j382j470n80N29N39n01j437j739j736j515
54290E6530q52j89l47j154j470p46L50J046J225R97M54K2J82O13M82k21n73j60
54272E6189K83J27j36K98J342K211K363J890J254R17R49Q99L49m04o86l73nN9
54254F7526k5q1j23l6K85N07J82m61p97q04r52j117o19M12Q84L69j43K32Q92P60
54234F6891r5o65m36K49Q76J121Q03J46j70K12P54P81N10N77Q21M08p54j605j274
54215F9150k56K11l32j102j053m0J017J124K07q57j255j027p21n44k61J51K96
54198F4708rl46l03j50l70p22m74M31J033O33k65p12n82m30m45l30q7q6l28m50
$$ y = [112221, 109511, 106106, 102502, 99246, 96595, 94541, 92843, 91013, 88552, 85290, 81591, 78236, 75879, 74372, 72835, 70716, 68510, 66944, 65822, 64440, 62970, 62390, 62919, 63458, 62957, 61520, 59781, 58045, 56530, 55678, 55489, 55142, 53988, 52518, 51772, 52122, 53168, 54393, 55390, 55844, 55866, 56048, 56661, 57143, 56922, 56349, 56189, 56472, 56599, 56463, 56761, 58103, 60314, 62677, 64567, 65821, 66738, 67687, 68586, 68935, 68531, 67845, 67472, 67467, 67526, 67501, 67420, 67297, 67261, 67546, 68053, 68235, 67774, 66977, 66173, 65221, 64104, 63485, 63897, 64781, 65150, 65007, 65239, 66131, 66891, 66796, 66131, 65695, 65944, 66820, 67941, 68744, 68890, 68720, 68932, 69686, 70467, 70977, 71554, 72375, 72783, 72029, 70424, 69150, 68894, 69105, 68773, 67671, 66618, 66578, 67595, 68719, 68926, 68069, 66814, 65787, 65066, 64522, 64261, 64412, 64708, 64699, 64353, 64050, 63900, 63530, 62808, 62334, 62765, 63798, 64431, 64166, 63454, 62872, 62442, 61997, 61667, 61580, 61494, 61166, 60716]
54178F0716n03r85j795k072j419n11nL68R59J302Q63J66J06N94P84M89K88L88
54160E9733K99j39l80q6K56O9m69p41m98l9K69L78M67O37P47O43M29K85Q1m54
54140F1487j101j209n90J20L25J82N4j50n90r22p91m30j89J21P01J082P79K06
54122E9085O4J29l16j136j504j308j318j762j850j075l8M39L98M46Q88J488J778
54105E4408J435O67J02M4L1l92q15o21r5P6J36Q93K028K131P91o40r23n25n10
54086E8221q20o00L28J257J565J171K90p28j463j754j755j423m23J084K097J823
54070E8870P27p0j53k3j33l95o11p92q61m67N85J919K764K641J790Q89M05L39
54052F7424N65J096J743J918J250K97N0P09J457J540J135Q83J054J423J788K198
$$ y = [60716, 60213, 59228, 57433, 55361, 53942, 53431, 53426, 53794, 54753, 56055, 56918, 57084, 57190, 57784, 58568, 59057, 59345, 59733, 60032, 59893, 59513, 59427, 59683, 59752, 59283, 58542, 58044, 58005, 58274, 58652, 59119, 59756, 60503, 61146, 61575, 61860, 61941, 61487, 60386, 59177, 58587, 58707, 59032, 59214, 59268, 59118, 58528, 57606, 56815, 56385, 56196, 56317, 57018, 58100, 58879, 59085, 59149, 59278, 58962, 57826, 56322, 55014, 53696, 51934, 50084, 49009, 48971, 49410, 49808, 50254, 51142, 52630, 54408, 55843, 56510, 56612, 56656, 56687, 56295, 55480, 54859, 54764, 54840, 54976, 55869, 57897, 60028, 60819, 60179, 59256, 58731, 58221, 57401, 56801, 57129, 58386, 59951, 61122, 61412, 60684, 59221, 57467, 55712, 54289, 53866, 54950, 57047, 58870, 59597, 59527, 59374, 59351, 59218, 58823, 58212, 57420, 56559, 56092, 56677, 58596, 61360, 64001, 65791, 66680, 67085, 67424, 67989, 69085, 70828, 72746, 73996, 74293, 74343, 75052, 76509, 78049, 79184, 80067, 81121, 82544, 84332, 86530]
54036H6530K737L286L550L410L236L567M392N057N173N108N254N262M693M008
54022A45263M058M759N128M657L798L079K468J779R43j26j345k090j867j287j453
54007A67764k264k404j347k14j62r17j627k168k774l155k958k655k925l548l740
53992A34906l359k974k894k877k698k365j802r63k01L7j32j56J42M21M52M22M49
53975A16408K92k41q66j062o50L9N21N08L6o01r46n97L97J323J365N22l50n81
53957A15517m30m70o61o25m52n30o70k44P94J704J930J652J288J067J241J973
53941A23084K790K801J852R16J016K211L808N006N170M122K541J526J395J438
53927A59676J032L68j74o64j183j372r74k71M96J553K935L971M050L468K904K546
$$ y = [86530, 89267, 92553, 96103, 99513, 102749, 106316, 110708, 115765, 120938, 126046, 131300, 136562, 141255, 145263, 149321, 154080, 159208, 163865, 167663, 170742, 173210, 174989, 175932, 175806, 174461, 172371, 170504, 169217, 167764, 165500, 163096, 161749, 161535, 161373, 160456, 158829, 156661, 153887, 150732, 147774, 145119, 142194, 138646, 134906, 131547, 128573, 125679, 122802, 120104, 117739, 115937, 114974, 114773, 114810, 114678, 114522, 114664, 115085, 115537, 115959, 116408, 116700, 116459, 115593, 114531, 113881, 113920, 114441, 114949, 114985, 114384, 113438, 112841, 113238, 114561, 115926, 116448, 116098, 115517, 115087, 114617, 113956, 113331, 112879, 112349, 111679, 111435, 112229, 113933, 115863, 117515, 118803, 119870, 121111, 123084, 125874, 128675, 130527, 131443, 132459, 134670, 138478, 143484, 148654, 152776, 155317, 156843, 158238, 159676, 160708, 161076, 160902, 160238, 159055, 157683, 156709, 156438, 156934, 158487, 161422, 165393, 169443, 172911, 175815, 178361]
53911A78361K303K520L605N173O265O426O037N654N474N374N108M455L409K236
53897B42400J162J97o72j375j991k681l289l388k942k506k516k877l416m190m995
53882B06921n208m661m105m330n162n854o017n696m948l901k984k531k410k427
53868A46687k727l337l741l468k808k427k491k694k845k902k707k173j595j239
53854A09533r37m47k0n3m59q66j252j812k391k567k215j550p61m6K08k65j162
53837I2938j830j876j354n12L48R68J340J614J704J319M88l55r96j559j847j304
53821H9086jJ051J205R95J090J144O02m8J12R45J424J115N54K74L04N78J043J393
53803A02866J412J461J962K565K577K084J872K275K924L595M473N458N976N717
$$ y = [178361, 180664, 183184, 186789, 191962, 198227, 204653, 210690, 216344, 221818, 227192, 232300, 236755, 240164, 242400, 243562, 243759, 243087, 241712, 239721, 237040, 233751, 230363, 227421, 224915, 222399, 219522, 216106, 211916, 206921, 201713, 197052, 192947, 188617, 183455, 177601, 171584, 165888, 160940, 157039, 154055, 151524, 149114, 146687, 143960, 140623, 136882, 133414, 130606, 128179, 125688, 122994, 120149, 117247, 114540, 112367, 110772, 109533, 108596, 108149, 108129, 108076, 107617, 106751, 105499, 103687, 101296, 98729, 96514, 94964, 94203, 94157, 94365, 94100, 92938, 91108, 89232, 87878, 87366, 87714, 88682, 90022, 91636, 93340, 94659, 95147, 94792, 93796, 92237, 90390, 89086, 89085, 90136, 91341, 92336, 93426, 94570, 95172, 95124, 95236, 96181, 97605, 98720, 99274, 99548, 99852, 100430, 101473, 102866, 104278, 105739, 107701, 110266, 112843, 114927, 116799, 119074, 121998, 125593, 130066, 135524, 141500, 147217]
53789A47217N013M253L518K882K539K505K587K690K768K546J809R30N14N65N53
53774A82889K70j7k65q89k060l302l976l810k950j794q97o70j052j708k412k997
53758A54360l216l012k712k474j917q41Q7R2n46r00q25r88j512j627r17j00q6
53741A32866q06j456j456r29m47m71r04j176j003q12r78j059m27N50P93m4j127
53724A21114j582j311n92L54J172J444J228J063J226J481J665J921K190K063J427
53709A34863P55N56R03J592K332K654K225J418J073J520K272K834L299L906M542
53694A66744M911M891M522L924L296K756K142J370Q21J000J791K605L120L392
53680B07285L379K987K490K264K107J567P88L08O0m56j052r59j77L32J46PM56
$$ y = [147217, 152230, 156483, 160001, 162883, 165422, 167927, 170514, 173204, 175972, 178518, 180327, 181257, 181771, 182336, 182889, 183159, 183142, 182877, 181988, 179928, 176626, 172650, 168840, 165890, 164096, 163199, 162529, 161477, 159769, 157357, 154360, 151144, 148132, 145420, 142946, 141029, 140188, 140275, 140367, 139821, 138921, 138096, 137108, 135596, 133969, 133052, 132952, 132866, 132060, 130604, 129148, 128219, 127772, 127301, 126397, 125221, 124218, 123406, 122428, 121369, 120942, 121492, 122285, 122241, 121114, 119532, 118221, 117629, 117983, 119155, 120599, 121827, 122890, 124116, 125597, 127262, 129183, 131373, 133436, 134863, 135618, 136174, 137077, 138669, 141001, 143655, 145880, 147298, 148371, 149891, 152163, 154997, 158296, 162202, 166744, 171655, 176546, 181068, 184992, 188288, 191044, 193186, 194556, 195377, 196377, 198168, 200773, 203893, 207285, 210664, 213651, 216141, 218405, 220512, 222079, 222867, 223175, 223235, 222779, 221727, 220768, 220591, 220923, 221069, 221076, 221532]
53663B21532Q79N60j69o23r11j548k316k356j262L42J287P72q49k166k102j182
53647B09888p90j228j493j138r89j512j740q23M21O96J90P2N85R74R90J103J305
53630B06511R82J60k69J50Q28J213J570K203K649K382J761J642K222K937L356
53615B30297L608L842L748L025K062J673K094K689K827K705K940L625M331M870
53601B74336N393N792N720N351N442O185O696O118M813L865L773M153M520M768
53587C46925M915M926M830M678M423M084L921M172M682N016M873M212L192K183
53573D07032J631J579J492Q65j02p63p84m09k1K11K84K54K03J51l3m72j034j389
53555D08695j350j069q88r74j131r70m03J87M10L23K25J39j06m32n65n18m97l44
$$ y = [221532, 222411, 222971, 222802, 222179, 221268, 219720, 217404, 215048, 213786, 214128, 215415, 216187, 215338, 213172, 211070, 209888, 209098, 207870, 206377, 205239, 204250, 202738, 200998, 200175, 200596, 201292, 201482, 201554, 202139, 203113, 204103, 205206, 206511, 207493, 207653, 207384, 207534, 208362, 209575, 211145, 213348, 215997, 218379, 220140, 221782, 224004, 226941, 230297, 233905, 237747, 241495, 244520, 246582, 248255, 250349, 253038, 255865, 258570, 261510, 265135, 269466, 274336, 279729, 285521, 291241, 296592, 302034, 308219, 314915, 321033, 325846, 329711, 333484, 337637, 342157, 346925, 351840, 356766, 361596, 366274, 370697, 374781, 378702, 382874, 387556, 392572, 397445, 401657, 404849, 407032, 408663, 410242, 411734, 412599, 412497, 411734, 410950, 410541, 410520, 410731, 411015, 411269, 411472, 411623, 411590, 411118, 410084, 408695, 407345, 406276, 405388, 404414, 403283, 402313, 401910, 402097, 402507, 402830, 403055, 403194, 403088, 402656, 402091, 401573, 401076, 400732]
53537D00732L38J370J979J842J586J835K348K623K867L651M835N612N592N320
53523D42530N504O183O896P382P821Q467R272J0008J0661J1510J2699J3919J4734
53510E67586J5082J5292J5687J6370J7300J8297J9162K0030K1386K3278K4888
53499G74358K5476K5551K6295K7886K9268K9709K9694K9930L0281L0291L0071
53488A088810K9989K9997K9855K9676K9718K9939L0234L0771L1568L2038L1586
53477A424181L0550K9934L0199L0767L0752K9794K8092K5943K3579K1385J9907
53466A725083J9388J9291J8680J7258J5678J4565J3693J2640J1676J1134J0280
53455A889366P956M280O17k290n047q179j1136j3329j5083j6921j8724k0348k2213
$$ y = [400732, 401070, 402440, 404419, 406261, 407847, 409682, 412030, 414653, 417520, 421171, 426006, 431618, 437210, 442530, 448034, 454217, 461113, 468495, 476316, 484783, 494055, 504063, 514724, 526234, 538933, 552852, 567586, 582668, 597960, 613647, 630017, 647317, 665614, 684776, 704806, 726192, 749470, 774358, 799834, 825385, 851680, 879566, 908834, 938543, 968237, 998167, 1028448, 1058739, 1088810, 1118799, 1148796, 1178651, 1208327, 1238045, 1267984, 1298218, 1328989, 1360557, 1392595, 1424181, 1454731, 1484665, 1514864, 1545631, 1576383, 1606177, 1634269, 1660212, 1683791, 1705176, 1725083, 1744471, 1763762, 1782442, 1799700, 1815378, 1829943, 1843636, 1856276, 1867952, 1879086, 1889366, 1897322, 1901602, 1902219, 1899929, 1894882, 1886703, 1875567, 1862238, 1847155, 1830234, 1811510, 1791162, 1768949]
53442A768949k4514k6600k7932k8966l0245l1292l1380l0884l0797l1282l1630
53431A443427l1474l1057l0454k9407k7933k6422k5110k3941k2800k1488j9707
53420A153634j7528j5535j4016j2448j0276p742n370l114p98J276K959M997Q038
53407A084077J1335J3623J5059J6989J9794K2190K3098K3138K3751K5484K7703
53396A306241K9562L0916L2448L4959L8367M1602M3833M5511M7627N0282N2721
53385A754069N4660N6707N9410O2530O5482O7931O9866P1446P2870P4079P4716
53374B483766P4672P4334P3905P2917P1044O8900O7213O5550O2758N8488N3395
53363C226942M8076M2743L7831L3868L0712K7704K4505K0949J6386J0312L609
$$ y = [1768949, 1744435, 1717835, 1689903, 1660937, 1630692, 1599400, 1568020, 1537136, 1506339, 1475057, 1443427, 1411953, 1380896, 1350442, 1321035, 1293102, 1266680, 1241570, 1217629, 1194829, 1173341, 1153634, 1136106, 1120571, 1106555, 1094107, 1083831, 1076089, 1070719, 1067605, 1066807, 1068083, 1071042, 1076039, 1084077, 1095412, 1109035, 1124094, 1141083, 1160877, 1183067, 1206165, 1229303, 1253054, 1278538, 1306241, 1335803, 1366719, 1399167, 1434126, 1472493, 1514095, 1557928, 1603439, 1651066, 1701348, 1754069, 1808729, 1865436, 1924846, 1987376, 2052858, 2120789, 2190655, 2262101, 2334971, 2409050, 2483766, 2558438, 2632772, 2706677, 2779594, 2850638, 2919538, 2986751, 3052301, 3115059, 3173547, 3226942, 3275018, 3317761, 3355592, 3389460, 3420172, 3447876, 3472381, 3493330, 3509716, 3520028, 3523637]
53352C523637k140o682j1289j6784k2726k8918l6209m5109n4526o2776o9021p3176
53340C094281p5310p5877p5737p5268p4040p2019p0267o9663o9642o9040o7770
53329B299648o6664o6074o5399o3928o1485n8352n5054n2049m9296m6311m2948
53318A672088l9713l6996l4454l1623k8800k6732k5679k5138k4358k2811k0511
53307A355273j8087j6228j4780j2883j0215p528n507l849j991j78R54J439J818
53294A268238K266K615L046M017N587P450R500J1778J3968J5730J7412J9828K3187
53281A404622K6776K9799L2015L3522L4397L4739L4728L4488L4079L3587L3015
53270A765767L2203L1099K9907K8689K7077K4829K2423K0496J8934J7107J4958
$$ y = [3523637, 3521497, 3514815, 3503526, 3486742, 3464016, 3435098, 3398889, 3353780, 3299254, 3236478, 3167457, 3094281, 3018971, 2943094, 2867357, 2792089, 2718049, 2646030, 2575763, 2506100, 2436458, 2367418, 2299648, 2232984, 2166910, 2101511, 2037583, 1976098, 1917746, 1862692, 1810643, 1761347, 1715036, 1672088, 1632375, 1595379, 1560925, 1529302, 1500502, 1473770, 1448091, 1422953, 1398595, 1375784, 1355273, 1337186, 1320958, 1306178, 1293295, 1283080, 1275552, 1270045, 1266196, 1264205, 1264027, 1264981, 1266420, 1268238, 1270504, 1273119, 1276165, 1280182, 1285769, 1293219, 1302719, 1314497, 1328465, 1344195, 1361607, 1381435, 1404622, 1431398, 1461197, 1493212, 1526734, 1561131, 1595870, 1630598, 1665086, 1699165, 1732752, 1765767, 1797970, 1829069, 1858976, 1887665, 1914742, 1939571, 1961994, 1982490, 2001424, 2018531, 2033489]
53259B033489J3012J1336R221O256L004J60k426n405q979j2823j6625k0233k3423
53246A986564k6093k8627l1560l4851l7829l9881m0916m1114m0639l9791l9039
53235A586224l8646l8435l8071l7368l6187l4398l2276l0603k9938k9943k9895
53224A210464k9711k9833l0228l0188k9341k8096k6825k5253k3172k1148j9876
53213I16793j9230j8584j7732j6881j6021j5032j4226j4073j4398j4580j4451
53202G41585j4413j4635j4862j5022j5305j5545j5178j4108j2947j2184j1667
53191E85719j1134j0727j0682j1007j1624j2381j2849j2672j2279j2531j3382
53180D54451j3698j2819j1563j1075j1299j1263j0423r031p570o480o151o576
$$ y = [2033489, 2046501, 2057837, 2067058, 2073314, 2076318, 2076478, 2074052, 2068647, 2059668, 2046845, 2030220, 2009987, 1986564, 1960471, 1931844, 1900284, 1865433, 1827604, 1787723, 1746807, 1705693, 1665054, 1625263, 1586224, 1547578, 1509143, 1471072, 1433704, 1397517, 1363119, 1330843, 1300240, 1270302, 1240359, 1210464, 1180753, 1150920, 1120692, 1090504, 1061163, 1033067, 1006242, 980989, 957817, 936669, 916793, 897563, 878979, 861247, 844366, 828345, 813313, 799087, 785014, 770616, 756036, 741585, 727172, 712537, 697675, 682653, 667348, 651803, 636625, 622517, 609570, 597386, 585719, 574585, 563858, 553176, 542169, 530545, 518164, 505315, 492643, 480364, 467833, 454451, 440753, 427934, 416371, 405296, 393997, 382734, 372311, 363280, 355710, 349230, 343079, 336503]
53168C36503p113p130o719o373o205n958n522m977m325l681l507m099m970n318
53154B60606m964m344l781l308l102l391l864l787k881j632o67j74o5k68o69r96
53138B22713j015o70r9L33J58o89j550j654j084o27o40o12j21L48P8p47j197q18
53120B12107j63M9j30j10M13J185J814K088J913J348Q33R35J680K389K498K260
53104B31109K226K300J847P02n13j215j554k038k805l558l972l932l533l021k715
53089B09328k873l615m736n498n012l229j359p13j259j911k085k144k316k215
53075A70363j751j603k153k725k598k104j960k054j746j069o59o63n76j68J53
53060A48687K9m28r83j535j898j785j177m02K11M16M2p77j336j004j14K76l00
$$ y = [336503, 329390, 322260, 315541, 309168, 302963, 297005, 291483, 286506, 282181, 278500, 274993, 270894, 265924, 260606, 255642, 251298, 247517, 244209, 241107, 237716, 233852, 230065, 227184, 225552, 224885, 224711, 224646, 224378, 223709, 222713, 221698, 221028, 220929, 221262, 221420, 220731, 219181, 217527, 216443, 215816, 215176, 214564, 214443, 214791, 214869, 214122, 212925, 212107, 211944, 211993, 211863, 211753, 212166, 213351, 215165, 217253, 219166, 220514, 221347, 222282, 223962, 226351, 228849, 231109, 233335, 235635, 237482, 238184, 237671, 236456, 234902, 232864, 230059, 226501, 222529, 218597, 215064, 212043, 209328, 206455, 202840, 198104, 192606, 187594, 184365, 183006, 182293, 181034, 179123, 177038, 174894, 172578, 170363, 168612, 167009, 164856, 162131, 159533, 157429, 155469, 153415, 151669, 150600, 149941, 149278, 148702, 148534, 148687, 148716, 148288, 147305, 145770, 143872, 142087, 140910, 140508, 140719, 141135, 141177, 140400, 139064, 138060, 137946, 138222, 137922]
53043A37922j198j608j528j436j449j309j027r62j178j164n01L75O17J22k24K02
53027A25654P29K91r24j560r70r3j4m66n49l19o16j510j973j318j59M12J03n06
53009A16212q05o93m21k12r6pM0m1j07K16J075J985K201J545O38K92P33J419J581
52990A25555J038L97K88M83K15o36j248j015l77p2r9k6J41J49K13P26J318J157
52972A28207K03n47l61L81R32J229J744K667L636M158L980L185K183J614K026
52957A55237L408M953N472M400K489J127Q53R28N77N8OK67J88l16p79j141j758
52940A75969k457k558k039j835k531l479l711l158k419j793j145n06j73j98k12
52925A47755J71Q74J365J109J02j027j565j337o71J38R70J559J558J034N57M92
$$ y = [137922, 136724, 135116, 133588, 132152, 130703, 129394, 128367, 127405, 126227, 125063, 124562, 124937, 125554, 125676, 125452, 125654, 126383, 126674, 125750, 124190, 123220, 123127, 123113, 122647, 122098, 121779, 121163, 119653, 117680, 116362, 116203, 116615, 116718, 116212, 115407, 114714, 114293, 114081, 113985, 113978, 114018, 113977, 113870, 114086, 115161, 117146, 119347, 120892, 121530, 121822, 122555, 123974, 125555, 126593, 126990, 127278, 127761, 127976, 127340, 126092, 125077, 124700, 124628, 124529, 124503, 124644, 124793, 125006, 125732, 127050, 128207, 128410, 127863, 127502, 127883, 128815, 130044, 131788, 134455, 138091, 142249, 146229, 149414, 151597, 153211, 155237, 158645, 163598, 169070, 173470, 175959, 177086, 177939, 178867, 179444, 179502, 179508, 179775, 179963, 179647, 178868, 177727, 175969, 173512, 170954, 168915, 167080, 164549, 161070, 157359, 154201, 151782, 149989, 148844, 148338, 148165, 147967, 147755, 147926, 148800, 150165, 151274, 151376, 150349, 148784, 147447, 146776, 146914, 147884, 149443, 151001, 152035, 152592, 153084]
52909A53084N91M27K1k54j67K24O76Q51M44m52j241j311o82K5K62J29J97P56J386
52890A54966J419Q00J67L9L17P43J331J902J751N79o51o32N30J415J244P43P66
52873A67429R92P22J51ML06M23J69R7N34R79P68on83m45P3J84l28p35j97J087
52853A71624J970J702P47J82N54J564K498K718K040R93N56J232K474L301L383
52838A97538L194L209L370L392L266L163K971K246P44j062k319k715k811l191
52824B10995l585l304k381j655j661k085k438k712k981k971k557k205k332k579
52810A75549k350j799j625j938k066j602r44p16j091j893k820l347k915j673o28
52795A48142o27j404k002j976j651j408j231j073j134j465j684j414p91k20J93
$$ y = [153084, 153675, 154102, 154123, 153869, 153702, 153926, 154602, 155453, 155897, 155445, 154204, 152893, 152211, 152236, 152498, 152627, 152824, 153580, 154966, 156385, 157185, 157352, 157391, 157708, 158451, 159782, 161684, 163435, 164014, 163363, 162731, 163261, 164676, 165920, 166663, 167429, 168421, 169143, 169294, 169298, 169604, 170027, 170196, 170293, 170827, 171806, 172574, 172568, 171985, 171540, 171613, 171797, 171469, 170734, 170537, 171624, 173594, 175296, 176043, 176225, 176779, 178343, 180841, 183559, 185599, 186592, 187148, 188380, 190854, 194155, 197538, 200732, 203941, 207311, 210703, 213969, 217132, 220103, 222349, 223093, 222031, 219712, 216997, 214186, 210995, 207410, 204106, 201725, 200070, 198409, 196324, 193886, 191174, 188193, 185222, 182665, 180460, 178128, 175549, 173199, 171400, 169775, 167837, 165771, 164169, 163225, 162509, 161418, 159525, 156705, 153358, 150443, 148770, 148142, 147515, 146111, 144109, 142133, 140482, 139074, 137843, 136770, 135636, 134171, 132487, 131073, 130282, 130062, 130255]
52780A30255N09M61l47j601k220j548k58M15J36l48m16l69q06j639k154j866j079
52763A17125n29o80j306j731j500q08k45j61m36q50j337j800j946j652j277j250
52747I9617j411j112j40Q48J034M09l01n84o40q76j239j404j351j352j413j169
52731H8916m54L32O63M27r2n79q30p01j96M29P92N95k63j483k328k175j274n93
52713H1186o31q22m73J67M06K56L29P00P77L74J25M98J033J092Q56J006J660K202
52695I0741K110J527R10N11L46N01J138K168L084L331K862K149J550R39P4q58
52679A13083j394j402j195j059r80q78q49j041j411j699j657j332j132j412j937
52664I3705k039j466p68n85q86j224j432j620j725j572j263r80o28r3L57M33M07
$$ y = [130255, 130764, 131225, 130878, 129277, 127057, 125509, 125251, 125666, 125802, 125454, 125038, 124669, 123863, 122224, 120070, 118204, 117125, 116596, 115916, 114610, 112879, 111379, 110571, 110326, 110165, 109729, 108879, 107542, 105742, 103796, 102144, 100867, 99617, 98206, 97094, 96954, 97802, 98836, 99245, 98944, 98360, 97720, 96844, 95605, 94201, 92850, 91498, 90085, 88916, 88462, 88794, 89457, 89884, 89792, 89213, 88383, 87682, 87486, 87915, 88707, 89302, 89039, 87556, 85228, 83053, 81779, 81186, 80555, 79733, 79260, 79427, 79833, 80089, 80418, 81118, 81895, 82269, 82394, 82892, 83925, 85017, 85873, 86879, 88539, 90741, 92851, 94378, 95288, 95799, 96145, 96646, 97784, 99952, 103036, 106367, 109229, 111378, 112928, 113867, 113941, 113083, 111689, 110287, 109092, 108033, 107053, 106175, 105326, 104285, 102874, 101175, 99518, 98186, 97054, 95642, 93705, 91666, 90200, 89432, 88847, 87961, 86737, 85305, 83685, 81960, 80388, 79125, 78145, 77517, 77424, 77781, 78214, 78621]
52647G8621O61Q83M32n20j040p03n1L50N47O84N91K71J20L16M70K66m4q4J82O89
52627H2641J451K126K003Q85m84j265j436j471j530j388q57qP83Q45j71j505j844
52610G8775r43K4J88J75Q57J765J785R24K57L64Q26J182J403J380Q50Rm94l73
52592H8954N4M59P92R22P29N98J085J828J674L02r99q41M35J211O89j88k3J345
52574I9026K721K973K230J622J902K586K569J541L54JN24J205J551J650J627J320
52558A25402P16K56L01N37M13O8J24O08P39K03j82L30J173J306Q74R58J774K233
52540A37833J576M74N2N25J265J648J356M35n68r22o06m05q12j356j379r03l04
52523A37909L30R47J190Q12J18n19j077j487j372p54l44n18o54j57M70M82J36
$$ y = [78621, 79282, 80165, 80597, 80077, 79037, 78334, 78283, 78633, 79180, 79864, 80455, 80726, 80846, 81162, 81632, 81898, 81854, 81770, 81952, 82641, 84092, 86218, 88221, 89106, 88622, 87357, 85921, 84450, 82920, 81532, 80675, 80667, 81450, 82295, 82124, 80619, 78775, 77832, 77856, 78044, 78219, 79076, 80841, 82626, 83550, 83807, 84171, 84997, 86179, 87582, 88962, 89812, 89821, 89327, 88954, 89008, 89467, 90259, 91181, 91910, 92508, 93593, 95421, 97095, 97397, 96398, 95557, 95992, 97203, 97892, 97704, 97681, 99026, 101747, 104720, 106950, 108572, 110474, 113060, 115629, 117170, 117524, 117525, 118049, 119254, 120805, 122455, 124082, 125402, 126118, 126374, 126675, 127212, 127625, 127693, 127817, 128425, 129164, 129367, 129185, 129515, 130688, 131994, 132868, 133826, 135600, 137833, 139409, 139883, 139935, 140460, 141725, 143373, 144729, 145164, 144596, 143674, 143068, 142663, 141851, 140495, 139116, 138213, 137909, 138239, 139186, 140376, 141188, 141306, 140787, 139710, 138223, 136851, 136097, 135753, 135235, 134581, 134424, 134894, 135376, 135512]
52506A35512J01K00j02l85J88J218J409N63j01J32N43L94L3J9J53J32K97R27J550
52487A42783J674J689K191K888K900J961O32m41r57p79LQ69J202Q78K88j84m06
52470A57191k99J86R38J616J891J621R75L63J65L61N84O01N31N36N43N29P56J348
52452A70436J838J593P52K44O81J507J669R43J36p3N6k0j67J32P72J008M75l88
52434A81594j109j650j996j923j597j673k296k612j961q96l40j80L15J080J311
52419A66067Q24L20K55L43L03K16j7p27j697k112j637p95m6P27J480J567P40j34
52401A65677r6N97R43O52L73N91J069J407J612J826J907J584R56N01N47Q58R12
52384A81916O21M43P11J114J153Q64O64P18Q77J087J430J811K047K175K179J708
$$ y = [135512, 135613, 135813, 135711, 135326, 135514, 136732, 138141, 138704, 138603, 138735, 139278, 139672, 139705, 139724, 139877, 140009, 140306, 141233, 142783, 144457, 146146, 148337, 151225, 154125, 156086, 156718, 156277, 155320, 154541, 154544, 155413, 156615, 157493, 157781, 157597, 157191, 156892, 157078, 158016, 159632, 161523, 163144, 164119, 164482, 164647, 165008, 165592, 166193, 166724, 167260, 167803, 168332, 169088, 170436, 172274, 173867, 174619, 174863, 175544, 177051, 178720, 179663, 179799, 179726, 179782, 179762, 179595, 179727, 180499, 181507, 181982, 181594, 180485, 178835, 176839, 174916, 173319, 171646, 169350, 166738, 164777, 163881, 163541, 163361, 163676, 164756, 166067, 166891, 167211, 167466, 167809, 168112, 168328, 168311, 167584, 165887, 163775, 162138, 161343, 161297, 162024, 163504, 165071, 165811, 165677, 165581, 166178, 167121, 167773, 168146, 168737, 169806, 171213, 172825, 174651, 176558, 178142, 179098, 179599, 180146, 181004, 181916, 182537, 182980, 183691, 184805, 185958, 186822, 187486, 188204, 189081, 190168, 191598, 193409, 195456, 197631, 199810, 201518]
52368B01518O42k02J73J550K675K900K755K743K524J842J305J533K181K468K233
52353B28840J869J586J373J331J521J743J885K166K604K769K512K471L107L677
52339B59454K993J092o62j115l72P28J500J743J646J610J826K002J787J372J263
52324B76867J495J594J414J452K091K944L321L163L096L587M341M729M618M519
52310C19231M921N758O653P378P812P833P664Q068R520J1310J2236J2227J2450
52297D33061J3619J5080J6002J6519J7059J7339J7008J6741J7498J8950J9733
52286F18609J9312J8555J8263J8106J7447J6452J5730J5336J4730J3540J1871
52275G97951J0009Q186O624N482M720M135L482K537J209k50j323j818k218l128
$$ y = [201518, 202160, 201958, 202131, 203681, 206356, 209256, 212011, 214754, 217278, 219120, 220425, 221958, 224139, 226607, 228840, 230709, 232295, 233668, 234999, 236520, 238263, 240148, 242314, 244918, 247687, 250199, 252670, 255777, 259454, 262447, 263539, 262877, 261762, 261390, 262118, 263618, 265361, 267007, 268617, 270443, 272445, 274232, 275604, 276867, 278362, 279956, 281370, 282822, 284913, 287857, 291178, 294341, 297437, 301024, 305365, 310094, 314712, 319231, 324152, 329910, 336563, 343941, 351753, 359586, 367250, 375318, 384838, 396148, 408384, 420611, 433061, 446680, 461760, 477762, 494281, 511340, 528679, 545687, 562428, 579926, 598876, 618609, 637921, 656476, 674739, 692845, 710292, 726744, 742474, 757810, 772540, 786080, 797951, 807960, 816146, 822770, 828252, 832972, 837107, 840589, 843126, 844335, 844085, 842762, 840944, 838726, 835598]
52261H35598m366n043m702m021l939m369m408l771l298l651m227l931k660j229
52247G81983q9J087K561M095N494O937Q458R699J0478J1046J1606J2079J2556
52234H77990J3320J4145J4259J3418J2400J1960J1850J1395J0447R175P513N581
52222A013453M077L443K992J776p0j704k968m466o277p726q502r072r760j0284
52208I64912j0454j0584j0802j0675j0005r424r638j0388j0763j0333r568r190
52196H43088r306r222q137o076m103l253l361l298k392j150m71n83r86j116p86
52181G88848k55l3m23j139j539j345q94n81m07k28j13j90l40l29j75j71n92j458
52163G78636k540l496m126m483m715m793m535l916l190k675k470k439k382k304
$$ y = [835598, 831232, 826189, 821487, 817466, 813527, 809158, 804750, 800979, 797681, 794030, 789803, 785872, 783212, 781983, 781894, 782981, 785542, 789637, 795131, 802068, 810526, 820225, 830703, 841749, 853355, 865434, 877990, 891310, 905455, 919714, 933132, 945532, 957492, 969342, 980737, 991184, 1000359, 1007872, 1013453, 1017530, 1020973, 1023965, 1025741, 1025671, 1023967, 1020999, 1016533, 1010256, 1002530, 994028, 984956, 975196, 964912, 954458, 943874, 933072, 922397, 912392, 902968, 893330, 882942, 872179, 861846, 852278, 843088, 833782, 824560, 816423, 810347, 806244, 802991, 799630, 796332, 793940, 792790, 792319, 791736, 790750, 789634, 788848, 788593, 788560, 788137, 786998, 785459, 784114, 783220, 782639, 782232, 782004, 781891, 781701, 781361, 781032, 780857, 780686, 780094, 778636, 776096, 772600, 768474, 763991, 759276, 754483, 749948, 746032, 742842, 740167, 737697, 735258, 732876, 730572]
52149G30572k508l245m205m659m349l885l929m228m007l186k594k847l623m209
52135F79098m348m218l974l650l325l057k785k435k124k075k370k840l177l115
52121F35605k612j873j187q01q86j412j887j587l20J288K530L421M288N005N263
52106F44835N453O392Q086R569J0239J0687J1709J3169J4401J5338J6559J8347
52094G84784K0221K1462K1785K1510K1278K1611K2465K3239K3231K2201K0488
52083A024275J8746J7448J6445J5078J3017J0853R415Q565P293N136K792J063
52071A150126j72j455k858m214n717p493q943r384r231r621j0807j1738j1528
52058A056965j0561r766r361q891q071p005n776m344k767j184M12J985L162L603
$$ y = [730572, 728064, 724819, 720614, 715955, 711606, 707721, 703792, 699564, 695557, 692371, 689777, 686930, 683307, 679098, 674750, 670532, 666558, 662908, 659583, 656526, 653741, 651306, 649182, 647107, 644737, 641897, 638720, 635605, 632993, 631120, 629933, 629132, 628246, 626834, 624947, 623360, 623040, 624328, 626858, 630279, 634567, 639572, 644835, 650288, 656680, 664766, 674335, 684574, 695261, 706970, 720139, 734540, 749878, 766437, 784784, 805005, 826467, 848252, 869762, 891040, 912651, 935116, 958355, 981586, 1003787, 1024275, 1043021, 1060469, 1076914, 1091992, 1105009, 1115862, 1125277, 1133842, 1141135, 1146271, 1149063, 1150126, 1149954, 1148499, 1145641, 1141427, 1135710, 1128217, 1119274, 1109890, 1100659, 1091038, 1080231, 1068493, 1056965, 1046404, 1036638, 1027277, 1018386, 1010315, 1003310, 997534, 993190, 990423, 989239, 989651, 991636, 994798, 998401]
52044I98401L642M115N294O447O808O680P023Q072Q991R057Q670Q703R195R310
52030A100408Q524P244O057M953L612K094P47l35j311k167k758l284m205n623
$$ y = [998401, 1002043, 1006158, 1011452, 1017899, 1024707, 1031387, 1038410, 1046482, 1055473, 1064530, 1073200, 1081903, 1091098, 1100408, 1108932, 1116176, 1122233, 1127186, 1130798, 1132892, 1133639, 1133304, 1131993, 1129826, 1127068, 1123784, 1119579, 1113956]
$$ [...]
##END NTUPLES=NMR SPECTRUM
##END=
