
##TITLE=AC1213_BRAAS12064_7164184_Es8uZslE2v
##JCAMPDX= 6.0         $$ Bruker NMR JCAMP-DX V2.0
##DATA TYPE= NMR SPECTRUM
##DATA CLASS= NTUPLES
##ORIGIN= BRUKER
##OWNER= Administrator
$$ 1.72 TOPSPIN		Version 2.1
$$ 2012-12-01 16:13:54.192 -0500  Administrator@X
$$ Compression mode = diff/dup
##.OBSERVE FREQUENCY= 400.02188249412
##.OBSERVE NUCLEUS= ^1H
##.ACQUISITION MODE= SIMULTANEOUS (DQD)
##.ACQUISITION SCHEME= undefined
##.AVERAGES= 8
##.DIGITISER RES= 22
##SPECTROMETER/DATA SYSTEM= spect
##.PULSE SEQUENCE= zg30
##.SOLVENT NAME= COFFEE_meoh
##.SHIFT REFERENCE= INTERNAL, COFFEE_meoh, 1, 14.98509
##AUDIT TRAIL= $$ (NUMBER, WHEN, WHO, WHERE, PROCESS, VERSION, WHAT)
$$ ##TITLE= Audit trail, TOPSPIN		Version 2.1
$$ ##JCAMPDX= 5.01
$$ ##ORIGIN= Bruker BioSpin GmbH
$$ ##OWNER= Administrator
$$ $$ E:\/data/COFFEE/nmr/AC1213_BRAAS12064_7164184_Es8uZslE2v/10/pdata/1/auditp.txt
$$ ##AUDIT TRAIL=  $$ (NUMBER, WHEN, WHO, WHERE, PROCESS, VERSION, WHAT)
(   1,<2012-12-01 16:13:46.219 -0500>,<Administrator>,<X>,<go>,<TOPSPIN 2.1>,
      <created by zg
	started at 2012-12-01 16:12:37.332 -0500,
	POWCHK enabled, PULCHK disabled,
       configuration hash MD5:
       86 BA 57 50 F2 9D 5C 9B 26 00 A9 28 5F 66 2E 89
       data hash MD5: 64K
       D7 03 99 1E 88 52 21 9D 8E 1A 6E B4 E1 C0 97 00>)
(   2,<2012-12-01 16:13:49.329 -0500>,<Administrator>,<X>,<proc1d>,<TOPSPIN 2.1>,
      <Start of raw data processing
       efp LB = 0 FT_mod = 6 PKNL = 1 PHC0 = 0 PHC1 = 0 SI = 32K 
       data hash MD5: 32K
       79 EF 26 9F 20 9B FD AD B9 6E 18 81 53 93 58 08>)
(   3,<2012-12-01 16:13:49.794 -0500>,<Administrator>,<X>,<proc1d>,<TOPSPIN 2.1>,
      <pk PHC0 = 97.05322 PHC1 = 0 
       data hash MD5: 32K
       08 D2 3C CB F4 4E 02 3A D9 13 DB 0A 15 AB 1E CF>)
(   4,<2012-12-01 16:13:50.004 -0500>,<Administrator>,<X>,<proc1d>,<TOPSPIN 2.1>,
      <abs ABSG = 1 
       data hash MD5: 32K
       D0 A4 E8 D0 DA 73 8A 6F 03 1A FC F9 7A E8 89 2B>)
(   5,<2012-12-01 16:13:50.139 -0500>,<Administrator>,<X>,<proc1d>,<TOPSPIN 2.1>,
      <abs ABSG = 2 
       data hash MD5: 32K
       F2 8B D2 EE 76 62 0F 08 8E 9B 29 64 B9 24 EA 04>)
(   6,<2012-12-01 16:13:50.275 -0500>,<Administrator>,<X>,<proc1d>,<TOPSPIN 2.1>,
      <abs ABSG = 3 
       data hash MD5: 32K
       F3 F7 AB ED DB 76 66 29 F6 08 A5 C2 53 9A 27 BE>)
(   7,<2012-12-01 16:13:50.410 -0500>,<Administrator>,<X>,<proc1d>,<TOPSPIN 2.1>,
      <abs ABSG = 4 
       data hash MD5: 32K
       F9 80 5F AB BD 4C 4C 43 81 AD F1 41 CC B3 64 DD>)
(   8,<2012-12-01 16:13:50.560 -0500>,<Administrator>,<X>,<proc1d>,<TOPSPIN 2.1>,
      <abs ABSG = 5 
       data hash MD5: 32K
       0E 9D E1 9B 0D BD AE 14 C1 1B 67 02 93 14 9A B6>)
$$ ##END=
$$ 
$$ $$ hash MD5
$$ $$ 28 4C 20 6C 22 83 5D 29 7D 38 C8 8D 15 33 37 98
##$RELAX= 
##$RELAX= 
##$RELAX= 
##$RELAX= 
##$RELAX= 
##$RELAX= 
##$RELAX= 
$$ Bruker specific parameters
$$ --------------------------
##$DU= <E:\>
##$EXPNO= 10
##$NAME= <AC1213_BRAAS12064_7164184_Es8uZslE2v>
$$ [...]
##$TP= (0..7)
150 150 150 150 150 150 150 150
##$TP07= 0
##$TPNAME0= <>
##$TPNAME1= <>
##$TPNAME2= <>
##$TPNAME3= <>
##$TPNAME4= <>
##$TPNAME5= <>
##$TPNAME6= <>
##$TPNAME7= <>
##$TPOAL= (0..7)
0.5 0.5 0.5 0.5 0.5 0.5 0.5 0.5
##$TPOFFS= (0..7)
0 0 0 0 0 0 0 0
##$TUNHIN= 0
##$TUNHOUT= 0
##$TUNXOUT= 0
##$USERA1= <user>
##$USERA2= <user>
##$USERA3= <user>
##$USERA4= <user>
##$USERA5= <user>
##$V9= 5
##$VALIST= <valist>
##$VCLIST= <CCCCCCCCCCCCCCC>
##$VD= 0
##$VDLIST= <DDDDDDDDDDDDDDD>
##$VPLIST= <PPPPPPPPPPPPPPP>
##$VTLIST= <TTTTTTTTTTTTTTT>
##$WBST= 1024
##$WBSW= 4
##$XGAIN= (0..3)
0 0 0 0
##$XL= 0
##$YL= 0
##$YMAX_a= 663955
##$YMIN_a= -559980
##$ZGOPTNS= <>
##$ZL1= 120
##$ZL2= 120
##$ZL3= 120
##$ZL4= 120
##$ABSF1= 14.98509
##$ABSF2= -5.573092
##$ABSG= 5
##$ABSL= 3
##$ALPHA= 0
##$AQORDER= 0
##$ASSFAC= 0
##$ASSFACI= 0
##$ASSFACX= 0
##$ASSWID= 0
##$AUNMP= <proc_prof1d_extract_pilot.lims>
##$AXLEFT= 0
##$AXNAME= <>
##$AXNUC= <1H>
##$AXRIGHT= 0
##$AXTYPE= 0
##$AXUNIT= <>
##$AZFE= 0.1
##$AZFW= 0.1
##$BCFW= 0
##$BC_mod= 0
##$BYTORDP= 0
##$COROFFS= 0
##$CY= 15
##$DATMOD= 1
##$DC= 0
##$DFILT= <>
##$DTYPP= 0
##$F1P= 0
##$F2P= 0
##$FCOR= 0.5
##$FTSIZE= 32768
##$FT_mod= 6
##$GAMMA= 0
##$GB= 0
##$INTBC= 1
##$INTSCL= 1
##$ISEN= 128
##$LB= 0
##$LEV0= 0
##$LPBIN= 0
##$MAXI= 10000
##$MC2= 0
##$MEAN= 0
##$ME_mod= 0
##$MI= 0
##$NCOEF= 0
##$NC_proc= -8
##$NLEV= 6
##$NOISF1= 0
##$NOISF2= 0
##$NSP= 0
##$NTH_PI= 0
##$NZP= 0
##$OFFSET= 14.98509
##$PC= 1
##$PHC0= 97.05322
##$PHC1= 0
##$PH_mod= 1
##$PKNL= yes
##$PPARMOD= 0
##$PPDIAG= 0
##$PPIPTYP= 0
##$PPMPNUM= 2147483647
##$PPRESOL= 1
##$PSCAL= 4
##$PSIGN= 0
##$PYNMP= <proc.py>
##$REVERSE= no
##$SF= 400.02
##$SI= 32768
##$SIGF1= 0
##$SIGF2= 0
##$SINO= 400
##$SIOLD= 32768
##$SPECTYP= <>
##$SREGLST= <1H.CDCl3>
##$SSB= 0
##$STSI= 32768
##$STSR= 0
##$SW_p= 8223.68421052631
##$SYMM= 0
##$S_DEV= 0
##$TDeff= 65536
##$TDoff= 0
##$TI= <>
##$TILT= no
##$TM1= 0
##$TM2= 0
##$TOPLEV= 0
##$USERP1= <user>
##$USERP2= <user>
##$USERP3= <user>
##$USERP4= <user>
##$USERP5= <user>
##$WDW= 1
##$XDIM= 32768
##$YMAX_p= 472515184
##$YMIN_p= -881350
##$CURPLOT= <Network HP LaserJet P1505>
##$CURPRIN= <$Network HP LaserJet P1505>
##$DFORMAT= <normdp>
##$LAYOUT= <+/1D_H.xwp>
##$LFORMAT= <normlp>
##$PFORMAT= <normpl>
##$SURQMSG= 1
$$ End of Bruker specific parameters
$$ ---------------------------------
##NTUPLES= NMR SPECTRUM
##VAR_NAME=  FREQUENCY,     SPECTRUM/REAL,   SPECTRUM/IMAG
##SYMBOL=    X,             R,               I
##VAR_TYPE=  INDEPENDENT,   DEPENDENT,       DEPENDENT
##VAR_FORM=  AFFN,          ASDF,            ASDF
##VAR_DIM=   32768,         32768,           32768
##UNITS=     HZ,            ARBITRARY UNITS, ARBITRARY UNITS
##FACTOR=    0.250966925370066, 1,           1
##FIRST=     8223.43324360094, -25875,       55931
##LAST=      0,             55571,           12304
##MIN=       0,             -881350,         0
##MAX=       8223.43324360094, 472515184,    0
$$ Real data points
##PAGE= N=1
##DATA TABLE= (X++(R..R)), XYDATA
$$ [...]
$$ plain form
19468 22741 294969 31046 -221465 142554 -142359 -98855 31560 124227 -214273 -219294 -264371
19457 -264371 117223 -17485 -133780 100507 -361666 18340 -113260 146801 15740 83674
19447 83674 149273 100103 -266827 121181 -25020 179549 -2163 -40706 -264874 -180361 310167
19435 -220363 186807 11991 -276699 133322 -29558 -377434 115181 -116485 41678 24108
19425 24108 -232468 -100368 -309855 -163206 -73402 -89627 64319 225528 -71814 75351 -190745
19413 -32365 -306886 4322 -85656 -149036 307 191664 215005 -203371 139508 -64607 176728
19401 -254391 -91409 129949 -85375 -53261 -78574 -377143 -141235 -173502 -189962 -79785 -142625
19390 -142625 -149040 -135680 -206717 10294 90695 -29960 -145374 -156962 -54146 -396322 -105425
$$ packed form
19468B2741K72228C1046b21465A42554a42359M3504C1560R2667b14273n021m5077
19457b64371A17223a7485j16295A00507c61666A8340a13260A46801A5740O7934
19447H3674O5599m9170b66827A21181b5020A79549b163l8543k24168Q4513C10167
19435b20363A86807A1991b76699A33322b9558l47876A15181a16485D1678j7570
19425B4108b32468a00368k09487J46649g3402j6225F4319J61209g1814G5351a90745
19413c2365k74521D322h5656o3380C07J91357K3341b03371A39508f4607A76728
19401b54391i1409A29949h5375L2114k5313k98569a41235l2267j6460g9785o2840
19390a42625o415J3360p1037A0294Q0401b9960j15414j1588e4146l42176a05425
$$ plain form
19378 153804 -237467 -101929 69412 -47035 -183751 161257 -275833 -225825 80838 -463148
19367 -45543 -319458 35102 -38478 7219 129624 56756 -399251 -219489 84016 -228407 -196616
19356 -196616 -371020 -133422 -139934 -194492 -370664 -41355 221882 -226184 -67402 206055
19345 -196949 -216773 55618 -475540 33711 321140 -131652 -368912 -137236 -139288 -70689 24853
19333 -186736 -208917 -144390 -178869 -101784 78569 165743 -84122 3436 -181978 -140761 -238868
19322 -238868 -123117 -125949 -11000 -27836 78423 238073 12844 -118326 191115 -25864 -4255
19310 -142394 78622 -235125 -208919 18109 64158 -79039 43203 366825 -180467 -75336 11672
19298 -454950 61785 -307554 -305979 62133 46002 -36 -77608 -77210 -63130 -199063 -188629 244149
$$ packed form
19378A53804b37467a01929F9412d7035j36716A61257b75833N0008H0838d63148
19367d5543k73915C5102c8478G219J22405E6756c99251J79762H4016b28407L1791
19356a96616j74404a33422o512n4558j76172d1355B21882b26184f7402B06055
19345a96949j9824E5618d75540C3711K87429a31652k37260a37236k052O8599B4853
19333a86736k2181O4527l4479P7085G8569Q7174h4122C436a81978M1217r8107
19322b38868J15751k832a1000j6836G8423J59650A2844a18326A91115b5864d255
19310a42394G8622b35125K6206A8109M6049g9039D3203L23622a80467g5336A1672
19298d54950F1785c07554J575F2133j6131c6p7572L98J4080j35933J0434B44149
$$ plain form
19285 -270354 -122501 -158969 26002 158036 148451 41727 -120401 -71896 333832 215824 -22243
19273 -187440 132793 -728332 27528 -251570 57526 -234324 -169003 76295 55158 -70883 -235928
19262 -235928 29128 80703 42335 -168248 103386 -9311 82567 -179727 73651 8721 141569
19251 141569 186277 -99288 73077 -394189 50771 118827 -175477 -182199 -192318 -253341 -75264
19239 -178068 -126301 3430 -158274 -146679 -11085 1711 114912 -199278 -103070 217832 -93380
19227 10505 -440884 -153996 -4592 -132984 -89868 -46970 -54685 -155643 -131027 -16654 -44793
19216 -44793 -98989 89202 -162679 -185473 97293 -397253 -222888 -84995 121758 121436 -236111
19204 -296550 66035 256180 89982 243040 -34699 170626 226993 -120272 -211968 -202920 -339246
$$ packed form
19285b70354a22501l6468B6002J32034r585D1727a20401M8505C33832j18008b2243
19273a87440A32793g28332B7528b51570E7526b34324O5321G6295k1137g0883j65045
19262b35928B9128N1575l8368a68248A03386i311H2567a79727G3651H721J32848
19251A41569M4708i9288G3077c94189E0771O8056a75477o722j0119o1023g5264
19239a78068N1767C430a58274J1595a1085A711J13201a99278R6208B17832i3380
19227A0505d40884a53996d592j28392M3116M2898p715j00958K4616a6654k8139
19216d4793n4196H9202a62679k2794I7293c97253J74365h4995A21758l22b36111
19204b96550F6035J90145H9982J53058c4699A70626N6367a20272r1696R048j36326
$$ plain form
19193 -339246 -119226 65656 -205350 -264866 -165650 -9571 -334594 -106784 7511 194385 -145293
19181 267565 -132451 -233309 -12985 73041 -235647 -123899 113906 -26187 -304526 -116806
19170 114719 -43820 159934 201970 -92146 63936 -415563 -81527 78244 -153049 -292034 -10489
19158 -70490 65172 -198354 -499365 -159388 -140887 -146315 99328 -110840 -238637 -302350 80587
19146 -287312 93997 293786 -318467 -243058 -240916 57628 -20627 -348942 -174078 -15103 -65666
19135 -65666 -210922 -167782 -78965 -370308 -128975 -218198 -128603 231484 -287739 -227294 -236077
19124 -236077 2782 -45566 -157419 -214002 198953 67572 -31034 -33613 115494 87745 -56464
19112 -314987 -63856 -335910 38978 -139682 262918 -64423 -302361 -398937 -158028 -296698
$$ packed form
19193c39246a19226F5656b05350n9516R9216i571l25023a06784G511J86874a45293
19181B67565a32451j00858a2985G3041b35647J11748A13906b6187k78339a16806
19170A14719d3820A59934M2036i2146F3936d15563h1527G8244a53049j38985a0489
19158g0490F5172a98354l01011a59388J8501n428I9328a10840j27797o3713H0587
19146b87312I3997J99789c18467P5409K142E7628b0627l28315a74078a5103n0563
19135f5666j45256M3140g8965k91343a28975q9223Q9595B31484b87739O0445q783
19124b36077B782d5566j11853n6583A98953F7572c1034k579A15494k7749e6464
19112c14987f3856k72054C8978a39682B62918f4423k37938r6576a58028j38670
$$ plain form
19102 -296698 -127536 253297 -80269 83693 225019 207206 143618 168841 -99857 90588 -52594
19090 -225962 68184 99576 -14449 69032 -497880 -11017 -56029 -121412 -63384 -109828 -55045
19079 -55045 -21741 -315368 -215096 149390 -236186 -1479 22435 -46290 -242125 -139583 -148385
19068 -148385 255634 -71034 -153869 88189 103422 -288625 41020 -82727 -376673 -335306 -290205
19057 -290205 -142308 -140024 -71440 176 -280376 -166774 -319404 211267 -100213 -119385 -138803
19046 -138803 63659 207427 -242408 -494910 36046 43060 6292 -201227 5848 155173 -52107
19034 90166 -110449 134462 -238734 155484 -19571 -268930 -114115 336123 -455550 176539
19023 67766 -96304 281686 -40984 -125314 -111413 61901 -4263 30675 -243888 80010 243639
$$ packed form
19102b96698a27536B53297h0269H3693J41326j7813o3588K5223i9857I0588e2594
19090b25962F8184L1392a4449F9032d97880a1017m5012o5383N8028m6444N4783
19079e5045b1741k93627J00272A49390b36186a479B2435d6290j95835J02542q802
19068a48385B55634g1034q2835H8189J5233b88625D1020h2727k93946M1367M5101
19057b90205a42308K284O8584A76b80376J13602j52630B11267a00213j9172j9418
19046a38803F3659J43768b42408k52502C6046P014F292b01227E848J49325e2107
19034I0166a10449A34462b38734A55484a9571k49359a14115C36123d55550A76539
19023F7766i6304B81686d0984q4330J3901F1901d263C0675b43888H0010J63629
$$ plain form
19012 243639 98620 -23301 179822 -316781 278852 -75927 140983 -88516 23076 -28278 99203
19000 -279194 62359 -132384 -155679 -265743 27910 -152906 -143194 25965 80084 -87643 -151430
18989 -151430 -53597 -5152 259046 -176571 -128340 -4954 -97533 -77216 -124998 -151561 -39872
18977 -60043 79853 -41879 -73090 45678 246003 312773 411233 716770 219384 63134 -85199
18965 -71184 -285924 -192628 -187074 7422 47975 143670 182819 -134408 96872 -214778 110058
18953 83883 -54676 -207274 -91388 -124574 -5248 -129210 104373 197480 -375518 19513 -59409
18941 -234312 -149177 49644 90985 -62346 -106206 -93760 -75156 -222104 -6461 -25820 28264
18929 -146557 6757 109050 -201992 -243889 -114493 452654 189551 -67620 -138126 44578 -120122
$$ packed form
19012B43639I8620b3301A79822c16781B78852g5927A40983h8516B3076b8278I9203
19000b79194F2359a32384k3295j10064B7910a52906R712B5965N4119h7643o3787
18989a51430e3597e152B59046a76571M8231d954r2579K0317m7782k6563c9872
18977f0043G9853d1879l1211D5678K00325O6770R8460L05537B19384F3134h5199
18965g1184k14740R3296N554G422M0553R5695L9149a34408I6872b14778A10058
18953H3883e4676j52598i1388l3186e248j23962A04373R3107c75518A9513e9409
18941b34312Q5135D9644M1341f2346m3860J2446J8604j46948f461j9359B8264
18929a46557F757J02293b01992m1897a14493D52654A89551f7620p0506D4578a20122
$$ plain form
18917 6756 -216776 223497 -277511 -91038 -54047 -103873 -36813 -36762 -28215 639197 339028 438080
18905 438080 141651 175378 106167 -56017 -156860 188047 165456 68140 -110112 -357964
18895 -357964 -284443 53128 242357 -238414 -253330 7329 -119592 -94529 -21111 -299633 3931
18883 53585 -15838 -155688 -103798 223368 108412 27424 12812 -122533 147195 -127366
18872 347509 -268022 457601 -51820 -294727 29747 107988 86192 81187 -79236 -159665 68628
18860 -64045 208536 57581 -200010 15325 -323615 -108178 -213572 -305000 -763650 -187047
18849 8651 -102682 -45233 -275015 173075 -26890 355821 -131741 195441 177990 -153261
18838 -266255 -11626 -72207 5873 -164320 -230819 -48777 131713 -48755 -266014 -281908 -141952
$$ packed form
18917F756b16776B23497b77511i1038L6991m9826c6813N1Q547F39197l00169R9052
18905D38080A41651L3727o9211e6017j00843A88047k2591F8140a10112k47852
18895c57964P3521E3128J89229b38414j4916G329a19592K5063b1111k78522C931
18883E3585a5838j39850N1890B23368A08412B7424A2812a22533A47195a27366
18872C47509b68022D57601e1820k42907B9747P8241k1796n005g9236q0429F8628
18860f4045B08536E7581b00010A5325c23615a08178j05394r1428m58650a87047
18849H651a02682d5233k29782A73075b6890C55821a31741A95441j7451a53261
18838b66255a1626o0581E873a64320o6499d8777A31713d8755k17259j5894J39956
$$ plain form
18827 -141952 73326 -47232 -19513 239312 -160909 80906 108339 -504395 -127581 -287156
18817 -287156 -381112 -203678 190323 143656 -199536 79004 91229 129546 239632 176124 -140319
18805 -77915 87818 -160538 -86542 -232317 97707 245157 -150525 213383 -14435 -157773
18795 -157773 166744 -166943 1731 -55132 -18470 54007 161132 179613 -153912 5351 -306612
18783 -126246 -168717 -204728 20131 -152193 -113914 -552079 -77138 -213901 63570 -48676 368381
18771 361161 249605 7481 -25448 2999 52098 27994 -40673 352938 280710 18731 225301
18760 225301 43953 165223 129702 -114206 -196875 -23806 -161367 -73115 -51411 151615 -98957
18748 -333368 -110195 42302 -281675 265455 21010 232768 103269 218380 -340836 130882
$$ packed form
18827a41952G3326d7232a9513B39312a60909H0906K7433e04395a27581j59575
18817b87156r3956J77434A90323m6667a99536G9004J2225L8317J10086o3508a40319
18805g7915H7818a60538P3996j45775I7707J47450a50525B13383a4435j43338
18795a57773A66744a66943A731e5132a8470E4007J07125J8481a53912E351c06612
18783a26246m2471l6011B0131a52193L8279m38165g7138j36763F3570d8676C68381
18771C61161j11556G481b5448B999M9099k4104d0673C52938p2228A8731K06570
18760B25301D3953J21270l5521a14206q2669b3806j37561g3115K1704A51615i8957
18748c33368a10195D2302b81675B65455B1010K11758A03269J15111c40836A30882
$$ plain form
18737 -94739 -135082 16515 82990 -217700 -31285 -96799 246365 -113564 -61767 221082 -91054
18725 12729 73826 148701 -213813 272648 -242187 -328355 113029 159211 -116651 -46710 59550
18713 -469428 -328493 -23598 -51347 -392237 95033 11673 37121 -182392 -89389 -169361 45405
18701 217375 4676 22213 -91502 -90354 -100826 -40510 -193436 -87909 156285 -258882 261046
18689 -130504 -127574 195916 35639 -386582 -19398 37031 -57884 49577 41539 -184668 -209536
18678 -209536 125848 -43029 156308 203009 2161 -96509 -302646 22307 -243037 -481958 153752
18666 -138067 -175285 -131854 -57050 -134209 -102326 96085 -446189 -286789 -45988 -89461 -98118
18655 -98118 -72059 187375 -244595 -11508 -227736 -91985 -251300 -24231 95131 -111791 -181646
$$ packed form
18737i4739m0343A6515O6475b17700c1285o5514B46365a13564N1797B21082i1054
18725A2729O1097P4875b13813B72648b42187q6168A13029M6182a16651d6710E9550
18713d69428J40935b3598k7749l40890I5033A1673K5448a82392h9389p9972D5405
18701B17375D676J7537i1502J148j0472d0510j52926h7909A56285b58882B61046
18689a30504K930A95916C5639c86582a9398C7031e7884D9577q038a84668k4868
18678b09536A25848d3029A56308M6701B161i6509k06137B2307b43037k38921A53752
18666a38067l7218M3431e7050p7159L1883I6085d46189J59400d5988m3473q657
18655i8118K6059A87375b44595a1508k16228i1985j59315b4231I5131a11791o9855
$$ plain form
18644 -181646 93968 -172582 31854 -144125 261527 -269982 41790 -110790 129389 -18254
18633 -245068 -167839 -163143 -48102 -212981 -45359 -149552 -148068 -91100 -372009 -19618 136318
18621 93520 -170692 -118041 -226521 274300 2773 1653 -63632 11912 -92787 -151462 -278577
18610 -278577 31674 -377688 -164555 -146002 243860 -95115 -75295 -25691 270782 -60699 47936
18598 45765 152127 250829 182045 49988 -119783 -73536 -85327 -26352 47435 -19339 -74329
18587 -74329 -371630 -35866 96432 57026 294998 -68673 22906 89895 -360645 93375 297494
18576 297494 80097 308801 170687 -226522 2879 -47430 -114590 -108909 146244 -4022 -226936
18565 -226936 196860 -151871 -85500 -521733 -64994 -49725 -93053 -71556 20458 105679 130919
$$ packed form
18644a81646I3968a72582C1854a44125B61527b69982D1790a10790A29389a8254
18633b45068P7229M696d8102j64879d5359j04193J484N6968k80909a9618A36318
18621I3520a70692N2651j08480B74300B773j120f3632A1912i2787n8675j27115
18610b78577C1674c77688a64555J8553B43860i5115J9820b5691B70782f0699D7936
18598D5765J06362R8702o8784D9988a19783M6247j1791b6352D7435a9339n4990
18587g4329k97301c5866I6432l9406K37972f8673B2906O6989c60645I3375K04119
18576B97494H0097K28704j38114b26522B879d7430o7160N681A46244d022k22914
18565b26936A96860a51871O6371m36233f4994J5269m3328K1497B0458Q5221K5240
$$ plain form
18554 130919 -63051 128843 -116848 -72911 -251848 93520 -42093 -70874 -93189 -141980 -149341
18543 -149341 47798 281861 219447 -75858 57069 -437341 -347243 -299217 -126753 69233 299559
18532 299559 -354621 -156622 153361 -69263 -215735 -243437 -150033 -271266 -114492 57418
18521 2878 -66532 -382068 -69671 -411021 -117770 -519698 -57826 -238627 -15382 26696 34684
18510 34684 -64974 177651 20530 -309699 -146197 -7969 -145912 280243 286913 -38577 -121901
18499 -121901 -150602 5312 -327881 47163 159951 62196 -79844 155005 123546 191873 169765
18488 169765 209299 16940 17094 -25818 34386 202934 128174 -233737 -35625 303378 188865
18477 188865 -385992 -239698 -17929 91995 185498 134928 -171942 -133200 -15780 4420 -338920
$$ packed form
18554A30919f3051A28843a16848M3937j78937I3520d2093k8781k2315m8791p361
18543a49341D7798K34063o2414g5858E7069d37341R0098M8026a26753F9233K30326
18532B99559c54621a56622A53361f9263j46472k7702R3404j21233a14492E7418
18521B878f6532l15536f9671l41350a17770m01928e7826j80801a5382B6696P988
18510C4684f4974A77651B0530c09699a46197g969j37943B80243O670c8577q3324
18499a21901k8701E312c27881D7163J12788F2196g9844A55005l1459O8327k2108
18488A69765L9534A6940J54b5818C4386J68548p4760b33737c5625C03378j14513
18477A88865c85992J46294a7929I1995R3503n0570a71942L8742a5780D420c38920
$$ plain form
18465 214933 184249 -67290 4564 -77030 -14251 -25844 -172704 -91672 -216136 217489 -68446
18453 231406 -47656 -194606 40280 -142960 126226 -301972 -89310 68945 79395 -200550
18442 -27171 -119885 -19319 49937 58543 -20838 -39464 37236 -454899 -217965 -164908 -85942
18431 -85942 -186613 230974 -175666 -107277 -68999 155102 263836 124413 -257392 -441742
18421 -441742 -447025 -185579 -180738 -285135 -202326 -280148 -67946 81286 254813 70856 -254379
18409 -131311 -30237 -20011 -72168 25509 -173939 330885 41701 -28238 612 30670 -56361
18397 185894 -51404 860 7681 -4613 165399 180460 179999 -131466 -315177 -189273 -178508 -71231
18384 110372 288265 -202214 22860 151976 7640 -106553 -142378 144827 65420 -71953 -257019
$$ packed form
18465B14933l0684f7290D564g7030a4251j1593j46860Q1032j24464B17489f8446
18453B31406d7656j46950D0280a42960A26226c01972h9310F8945J0450b00550
18442b7171r2714a9319D9937Q606b0838j8626C7236d54899b17965N3057P8966
18431h5942j00671B30974a75666O8389L8278A55102J08734A24413b57392j84350
18421d41742n283a85579M841j04397Q2809p7822f7946H1286J73527G0856b54379
18409a31311c0237J0226n2157B5509a73939C30885D1701b8238F12L0058e6361
18397A85894e1404H60O821d613A65399J5061m61a31466j83711J25904J0765g1231
18384A10372J77893b02214B2860J29116G640a06553l5825A44827F5420g1953j85066
$$ plain form
18373 -257019 105382 -364790 247618 -100016 -130206 -17161 -141809 -191313 141508 -32391
18362 131087 -206181 -33187 103785 -353646 291753 -148965 196537 -141209 -155530 -170448
18352 -170448 -194219 185170 -165521 -51787 -223464 -113225 -91530 23074 160902 159817 327942
18341 327942 117173 -16719 27724 -232192 33208 154662 -197115 -96924 -124620 -280365
18331 -280365 151550 263937 81976 142992 -404714 92642 -8839 -55378 -112019 526832 249376
18319 -373757 249863 -60844 -125224 -156294 185510 -142606 182181 -4426 -293127 137340
18308 173022 -190751 -45963 -8612 -147527 55916 -15904 -307832 -177987 -216874 418810 -4366
18296 78401 -326743 163152 -158021 -92964 148695 -356643 277131 240468 28872 -214587
$$ packed form
18373b57019A05382c64790B47618a00016l0190a7161j24648m9504A41508c2391
18362A31087b06181c3187A03785c53646B91753a48965A96537a41209j4321j4918
18352a70448k3771A85170a65521e1787j71677J10239K1695B3074J37828j085J68125
18341C27942A17173a6719B7724b32192C3208J21454a97115i6924k7696j55745
18331b80365A51550J12387H1976O1016d04714I2642h839m6539n6641E26832B49376
18319c73757B49863f0844o4380l1070A85510a42606A82181d426k88701A37340
18308A73022a90751d5963h612j38915E5916a5904k91928J29845l8887D18810d366
18296G8401c26743A63152a58021O5057A48695c56643B77131l6663B8872b14587
$$ plain form
18285 -118231 -69405 102011 -39043 101406 -154625 -12557 5705 -45329 115073 65644 -371128
18273 65533 81044 245921 92645 180837 12887 -42014 45438 91995 14357 -225985 -390869
18262 -390869 -58554 82710 -102595 -40336 -83204 -233233 -303760 -94312 -244887 -117867 -113405
18251 -113405 -222433 -194317 -22413 91992 -185284 67546 205901 44852 -215567 -33639 93761
18239 29691 -52675 -183804 3723 -279129 146812 -59146 6221 -85611 -257005 -259752 -130695
18228 -130695 -134323 18735 3703 -148606 -176694 183840 -79747 18562 -111173 -13609 -107421
18217 -107421 -250322 -114980 -90918 -169826 -94874 -355278 189209 -201870 16345 -200264
18206 -296539 -186163 64096 53274 -383431 49654 117674 187767 3211 247839 10703 -251543
$$ packed form
18285a18231M8826A02011c9043A01406a54625a2557E705d5329A15073m9429c71128
18273F5533J5511J64877I2645Q8192A2887d2014D5438M6557A4357b25985j64884
18262c90869e8554H2710a02595d0336m2868j50029p0527i4312j50575a17867M462
18251a13405j09028K8116b2413I1992a85284F7546J38355D4852b15567c3639I3761
18239B9691e2675j31129C723b79129A46812e9146F221h5611j71394k747J29057
18228a30695l628A8735C703a48606k8088A83840g9747A8562a11173a3609r3812
18217a07421j42901a14980K4062p8908P4952k60404A89209b01870A6345b00264
18206b96539J10376F4096j0822c83431D9654O8020P0093C211K44628A0703b51543
$$ plain form
18194 -177499 31413 -99969 -43755 -9572 120857 177844 13232 -210467 -130131 -240412 35650
18182 68910 -181960 -160996 53009 109115 -126511 92995 -371340 -187320 98627 100940 89222
18171 89222 139595 -328773 -143261 257584 -67910 53769 152228 240670 388758 84229 -33439
18159 245566 -34103 -65239 -219852 -236209 -141547 35774 174936 3662 25788 -144304 182541
18147 421242 97861 -295103 -44191 321455 -6726 107548 -25921 -53486 -36904 -128362 156964
18135 -38720 64455 179207 160126 -235766 -21519 -14412 -47990 28820 -175160 -52392 -78342
18124 -78342 -186131 -61340 -279839 -259748 -1388 -66541 -48883 -257801 40218 -47004 -150113
18113 -150113 197034 48215 191145 276376 -2064 -104736 -293570 -308252 -65483 206778 30423
$$ packed form
18194a77499C1413i9969d3755i572A20857N6987A3232b10467Q0336j10281C5650
18182F8910a81960K0964E3009N6106a26511I2995c71340J84020I8627K313j1718
18171H9222N0373c28773a43261B57584f7910E3769R8459Q8442J48088H4229c3439
18159B45566c4103l1136j54613j6357R4662C5774J39162C662K2126a44304A82541
18147D21242I7861b95103d4191C21455f726A07548b5921k7565J6582r1458A56964
18135c8720F4455J14752j9081b35766b1519P107l3578B8820a75160e2392k5950
18124g8342j07789f1340k18499K0091a388o5153J7658k08918D0218d7004j03109
18113a50113A97034D8215J42930Q5231b064j02672j88834j4682f5483B06778C0423
$$ plain form
18101 9151 -55341 70244 -222169 336836 15131 114909 81681 36495 -627872 -130800 139092
18089 -78992 -397167 -79197 -75654 -321524 -45997 328203 272091 41755 303991 -117990 162878
18077 -125977 85921 -439757 37081 -363183 27295 90595 330581 -385778 -275608 -286361
18067 -286361 43657 -65717 235060 82879 300600 81763 -209188 -233081 -181108 -330674 163032
18055 -17236 -281212 35255 -110053 -131790 -264625 182171 -139131 -226339 95797 -252224
18044 416015 -79450 29194 -222242 -189630 69493 -131209 85792 357049 82673 166303 -104856
18032 -113835 -478580 48636 76380 153429 -32649 -540303 279254 -114602 73684 -31080 113390
18020 -33264 -153180 102701 -164434 -78898 108692 13452 -47255 -124687 -140627 -323 84763
$$ packed form
18101I151e5341G0244b22169C36836A5131R9778l3228C6495f27872a30800A39092
18089g8992l18175g9197L543k45870d5997C28203n6112D1755K62236a17990A62878
18077a25977H5921d39757C7081c63183B7295O3300K39986c85778J10170j0753
18067b86361D3657f5717B35060H2879K17721H1763b09188k3893N1973j49566A63032
18055a7236k63976C5255a10053k1737j32835A82171a39131q7208I5797b52224
18044D16015g9450B9194b22242L2612F9493a31209H5792K71257H2673Q3630a04856
18032a13835l64745D8636K7744P7049c2649n07654B79254a14602G3684c1080A13390
18020c3264j19916A02701a64434g8898A08692A3452d7255p7432j5940c23H4763
$$ plain form
18008 -350487 -92579 -4215 9619 -114874 -91212 13999 -73316 -33199 53984 -42722 69940 40238
17996 40238 -74542 -36400 -35274 275436 159700 -129404 59206 -404017 216281 13362 -307023
17984 267109 73910 82663 -466550 116698 -89688 105666 -255881 -249767 119212 52270 151941
17973 151941 138088 -36158 -156986 -314829 -97268 -286005 -400178 414867 136478 -253075
17962 133405 111956 -76468 -55520 11087 -107771 -81230 -174162 43372 -11767 58627 -52005
17950 187941 -223572 68920 145210 71327 -250523 -10538 -367605 288135 123492 10060
17939 -333728 -72089 -119353 -42624 258142 41038 -134332 -80714 -109090 -113613 256235 -20090
17927 76248 72163 119744 97983 -71726 395855 203728 169542 -85534 -172583 25159 -281711
$$ packed form
18008c50487i2579d215I619a14874K3662A3999g3316c3199E3984d2722F9940k9702
17996D0238g4542c6400J126B75436j15736a29404E9206d04017B16281A3362c07023
17984B67109G3910Q753d66550A16698h9688A05666b55881O114A19212E2270R9671
17973A51941j3853c6158j20828j57843i7268j88737j14173D14867A36478b53075
17962A33405k1449g6468K0948A1087a07771K6541r2932D3372a1767E8627e2005
17950A87941b23572F8920P6290G1327b50523a0538l57067B88135A23492A0060
17939c33728g2089m7264d2624B58142D1038a34332N3618k8376m523B56235b0090
17927G6248m085M7581k1761g1726C95855j92127l4186h5534q7049B5159b81711
$$ plain form
17915 259969 -205735 -146294 38288 250391 -146702 80265 259737 -242733 -52307 16798
17904 -40775 305182 33398 205292 177225 21000 288697 126654 -257309 -69171 -63308 105141
17892 -68256 5962 213178 134552 40708 -129310 25051 149229 194324 -113621 -19701 157691
17880 293640 325336 -92243 -145828 -247830 -330917 -127345 155666 -258316 235237 -76411
17869 54159 208620 -196569 69812 245973 109893 -99680 -154014 -113202 332581 60519 137686
17858 137686 111711 -61861 112690 99514 -192832 -97210 216962 48683 -34323 70631 136691
17847 136691 -207963 241391 27739 -63092 7574 260486 10782 -14957 70352 -54703 -60493
17836 -60493 -48690 44546 134972 217139 443040 79764 -174537 60117 -116620 -26639 58494
$$ packed form
17915B59969b05735N9441C8288K12103a46702H0265J79472b42733e2307A6798
17904d0775C05182C3398J71894k8067B1000K67697A26654b57309f9171N863A05141
17892f8256E962K07216p8626D0708a29310B5051J24178M5095a13621a9701A57691
17880B93640L1696i2243n3585j02002q3087a27345A55666b58316B35237g6411
17869E4159J54461a96569F9812J76161A09893i9680n4334M0812C32581F0519P7167
17858A37686k5975f1861A12690j3176a92832R5622B16962D8683c4323G0631O6060
17847A36691b07963B41391B7739f3092G574K52912A0782a4957G0352e4703n790
17836f0493J1803D4546R0426Q2167K25901G9764a74537F0117a16620b6639E8494
$$ plain form
17824 9479 -51899 209301 -71781 -59107 28814 282710 186135 302755 -25588 -183230 159204
17812 282151 -157121 -29640 -7254 54540 28762 441436 -82009 19632 80203 -106238 -255947
17801 -255947 52957 302215 -84209 236637 115660 -6396 -59177 58388 -245746 137546 14788
17789 -16043 185021 30989 167596 153340 -62996 146521 -6051 47367 -34043 5782 -36309
17777 -354836 234559 138025 280478 110522 70519 -161578 -35154 30787 83464 -16070 476596
17765 -112030 -146036 -168007 -137852 319166 -10338 -200200 81069 -167645 99970 -163075 158104
17753 74510 -242538 63172 96182 310086 184339 50228 137752 -172976 418114 168412
17742 54789 47273 -46873 -199119 359416 40005 -245880 101980 87974 217845 542473 139406
$$ packed form
17824I479e1899B09301g1781J2674B8814K53896r6575J16620b5588j57642A59204
17812B82151a57121b9640g254E4540k5778M12674h2009A9632O0571a06238j49709
17801b55947E2957K49258h4209B36637A15660f396n2781E8388b45746A37546A4788
17789a6043A85021C0989J36607j4256f2996A46521f051D7367c4043E782c6309
17777c54836B34559r6534J42453A10522m0003a61578c5154C0787N2677a6070D76596
17765a12030l4006k1971L0155C19166a0338j89862H1069a67645I9970a63075A58104
17753G4510b42538F3172L3010K13904j25747E0228Q7524a72976D18114A68412
17742E4789p516d6873j52246C59416D0005b45880A01980j4006J29871L24628A39406
$$ plain form
17730 240038 281708 -9883 313440 -20852 -16695 -19716 -196508 177879 70276 126602 182746
17719 182746 76750 188719 82737 374807 408326 -236791 -57789 278153 238238 1827 64625
17708 64625 -138523 70670 312368 297823 116091 126859 130053 -4209 53820 -135076 107559
17696 179730 237834 253318 326151 -167811 13538 57565 46615 220404 -79424 -62405 36833
17684 217425 -62188 -31709 150740 -181618 227957 30561 401639 175971 456659 -22754
17673 55538 -46175 251026 146191 117207 -414361 39357 257401 42672 -95583 262729 229741
17662 229741 -15808 -405211 101690 75575 427559 40457 -193539 198159 -51153 -5619 19249
17650 367335 -222613 -206569 84520 193796 197940 63600 143375 -129223 283216 40308 435588
$$ packed form
17730B40038M1670i883C13440b0852M157l021j76792A77879G0276N6326N6144
17719A82746G6750J11969H2737K92070L3519b36791e7789B78153l9915A827O2798
17708F4625a38523G0670K41698j4545A16091J0768L194d209E3820a35076A07559
17696A79730N8104J5484P2833a67811A3538M4027j0950J73789g9424J7019C6833
17684B17425f2188L0479A50740a81618B27957C0561L71078A75971K80688b2754
17673E5538d6175B51026j04835k8984d14361C9357K18044D2672i5583B62729l2988
17662B29741a5808l89403A01690k6115L51984D0457a93539A98159e1153e619A9249
17650C67335b22613J6044H4520J09276M144F3600P9775a29223B83216D0308L95280
$$ plain form
17639 435588 -353355 281184 264060 403125 126118 265075 99990 8407 306850 -143425
17628 195713 164746 -130766 116107 59295 -82714 -258230 278052 -236470 228311 71844
17617 -73069 54126 419351 -85218 33002 132316 433931 -236191 387403 335715 315094 90233
17605 200836 105307 -18281 -329452 248009 181278 32167 414513 556198 166882 385851
17595 385851 51910 86946 359439 259617 -194496 60613 -111331 119854 173098 -58792 25197
17583 289236 174998 238993 -179866 41913 -78074 -57852 -213062 -26989 488866 -51687 215199
17571 4936 238545 -54695 301711 -157411 -159007 119654 39317 -123123 -35930 60222 -5076
17559 -59538 466262 220685 213134 163991 370660 178870 120034 9852 238456 82708 72189
$$ packed form
17639D35588c53355B81184j7124J39065A26118J38957I9990H407K98443a43425
17628A95713l0967a30766A16107n6812h2714j75516B78052b36470B28311G1844
17617g3069E4126L65225h5218C3002R9314L01615b36191C87403n1688k0621I0233
17605B00836r5529a8281l11171B48009o6731C2167L82346J41685A66882K18969
17595C85851E1910L5036K72493r9822a94496F0613a11331A19854N3244e8792B5197
17583B89236j14238O3995a79866D1913g8074K0222j55210b6989D88866e1687B15199
17571D936K33609e4695C01711a57411j596A19654C9317a23123c5930F0222e076
17559e9538D66262B20685p551m9143K06669A78870n8836I852K28604H2708j0519
$$ plain form
17548 72189 196865 164849 104172 139444 147708 85155 533841 -12282 182291 178965 223749
17537 223749 45277 -120609 233933 -9448 183013 142950 93979 50327 320152 256507 386279
17526 386279 472302 570019 1036491 1055250 948661 1141983 758035 1072471 335080 617941
17516 617941 258959 -147140 614062 149613 595395 612486 656455 692460 1001748 1037732
17506 1037732 1148637 688818 1152964 517511 271303 533010 580344 113578 293200 323033
17496 323033 68307 230530 460261 429432 80495 79786 8227 414480 16663 38640 190967
17485 190967 456628 184031 442714 265787 344139 158101 72496 205729 573920 255914
17474 242910 -57577 221291 54618 348987 118702 607009 129308 160640 248270 405647
$$ packed form
17548G2189J24676l2016o0677L5272Q264o2553M48686a2282A82291l326M4784
17537B23749D5277a20609B33933i448A83013m0063m8971m3652K69825o3645J29772
17526C86279Q6023R7717M66472J8759j06589J93322l83948L14436C35080K82861
17516F17941B58959a47140F14062A49613M45782J7091M3969L6005L09288L5984
17506A037732J10905m59819M64146E17511k46208K61707M7334A13578J79622K9833
17496C23033F8307J62223K29731l0829H0495p09H227M06253A6663K1977J52327
17485A90967K65661A84031K58683j76927P8352A58101G2496J33233L68191B55914
17474B42910e7577B21291E4618K94369A18702M88307A29308L1332Q7630J57377
$$ plain form
17464 405647 482582 105487 21881 298685 -27345 -8907 246890 395224 293135 261717 436142
17453 436142 508744 552913 393896 516649 412287 386581 45776 222331 305209 524699
17443 524699 538515 304358 196472 229336 202751 483698 356469 553657 46322 307600
17433 307600 268926 578948 331111 142609 293724 380296 589005 266022 50577 83764
17423 83764 199914 375264 207132 78581 325724 576040 65810 321523 328936 -72976 63620
17411 344842 268183 280079 610879 711183 384608 472877 -40669 -236004 241447 294403
17401 294403 403577 -141098 347520 343821 59811 135232 431713 186388 407911 147796
17390 -64631 -16514 170512 447283 420361 237367 356616 128868 107066 123591 222611 400652
$$ packed form
17464D05647P6935A05487B1881K76804b7345h907B46890J48334j02089l1418J74425
17453D36142P2602M4169j59017J22753j04362k5706D5776J76555Q2878K19490
17443E24699J3816k34157j07886L2864k6585K80947j27229J97188D6322K61278
17433C07600l8674L10022k47837A42609J51115Q6572K08709B66022E0577L3187
17423H3764J16150J75350j68132G8581K47143K50316F5810K55713P413g2976F3620
17411C44842p6659J1896L30800J00304l26575Q8269d0669j95335B41447N2956
17401B94403J09174a41098C47520l699E9811P5421K96481A86388K21523A47796
17390f4631a6514A70512K76771k6922j82994J19249A28868k1802J6525R9020J78041
$$ plain form
17379 400652 90900 90964 702205 459999 279810 -29282 143658 356129 -26139 267595 172750
17368 172750 348392 54504 60713 587983 259764 140506 348603 -72816 219472 291255
17358 291255 143727 498851 6842 154505 475408 229256 136601 428829 160136 177114
17348 177114 162133 172412 267956 573901 368630 -41080 281948 235018 -39238 448016 -35161
17336 207383 347573 119785 202974 323469 25989 193961 191290 128741 421820 13782 162611
17325 162611 239256 343419 165697 69653 21374 448444 -7785 338758 101096 27039 216627
17314 216627 311625 266163 520687 667173 204956 398572 283243 313465 501021 -37360
17303 156725 543058 274608 302735 465302 -33907 35715 211484 252946 360284 366459 528171
$$ packed form
17379D00652I0900O4O11241k42206j80189b9282A43658K12471b6139B67595r4845
17368A72750J75642E4504O209N27270B59764j19258K08097g2816B19472P1783
17358B91255A43727L55124F842J47663L20903B29256r2655K92228A60136J6978
17348A77114j4981J0279R5544L05945k05271d1080B81948m6930c9238D48016c5161
17336B07383J40190A19785Q3189J20495B5989J67972k671o2549K93079A3782J48829
17325A62611P6645J04163A65697F9653B1374M27070g785C38758A01096B7039J89588
17314B16627R4998m5462K54524J46486B04956J93616j15329L0222J87556c7360
17303A56725L86333k68450K8127J62567c3907C5715J75769M1462J07338O175J61712
$$ plain form
17292 528171 214226 230185 177861 483952 237180 16106 456469 304717 57588 312790
17282 312790 -106193 385214 76511 228596 300273 493518 157103 300444 404047 505705
17272 505705 311936 342312 253336 163826 211936 369741 106224 167265 408450 139137
17261 276712 -38423 473662 115353 363887 245093 -40213 655267 210839 298368 236959
17251 236959 472946 309147 225866 786200 -65587 212271 517751 548615 382355 452667
17241 452667 286487 307864 191683 214769 377610 407471 652209 462355 260756 220225
17231 220225 207913 473656 591726 396951 339923 467573 30859 387761 533478 225011
17220 637947 570332 257541 392520 340403 -13219 249053 113242 90777 484154 333383
$$ packed form
17292E28171B14226J5959n2324L06091B37180A6106M40363j51752E7588K55202
17282C12790a06193C85214G6511J52085P1677J93245A57103J43341J03603J01658
17272E05705j93769L0376q8976q9510M8110J57805A06224O1041K41185A39137
17261B76712c8423D73662A15353K48534j18794d0213F55267B10839Q7529o1409
17251B36959K35987j63799q3281N60334f5587B12271L05480L0864j66260P0312
17241D52667j66180K1377j16181K3086J62841K9861K44738j89854k01599m0531
17231B20225j2312K65743J18070j94775n7028J27650C0859L56902J45717B25011
17220F37947o7615B57541J34979n2117a3219B49053A13242k2465L93377j50771
$$ plain form
17210 333383 752912 179269 287783 392606 462949 242403 582770 291005 112681 328416
17200 328416 369879 9800 485757 611208 217657 360284 266651 440513 406051 367299 363983
17189 363983 389679 638539 439060 574129 526162 652386 588542 339803 568832 188273
17178 613217 192025 554069 499685 629769 645845 448576 475548 426746 433956 462452 590782
17167 590782 490101 656870 484160 298529 563922 369082 329912 495118 306870 486538
17157 486538 470694 575227 317180 366420 292681 314511 832543 406350 804860 519696
17147 519696 437110 101400 484595 367824 251363 427214 836481 460733 377156 456487
17137 456487 177610 574171 512958 610885 744856 609506 357986 485119 359645 579965
$$ packed form
17210C33383M19529A79269J08514J04823P0343k20546L40367B91005A12681K15735
17200C28416M1463I800M75957J25451B17657J42627r3633J73862l4462l8752l316
17189C63983K5696K48860j99479J35069m7967J26224o3844k48739K29029A88273
17178F13217A92025L62044n4384J30084J6076j97269K6972m8802P210K8496J28330
17167E90782j00681J66769j72710j85631K65393j94840l9170J65206j88248J79668
17157D86538j5844J04533k58047M9240p3739K1830N18032D06350L98510k85164
17147E19696q2586A01400L83195j16771j16461J75851M09267l75748q3577P9331
17137D56487A77610L96561o1213R7927J33971j35350k51520J27133j25474K20320
$$ plain form
17127 579965 421292 526047 397031 714499 707257 319746 578600 238085 222206 466438
17117 466438 775020 565951 353689 860143 734419 463158 523687 433780 691232 701417
17107 701417 506927 494716 662244 740784 912638 329978 429463 596122 513074 430864
17097 430864 297017 317959 733212 375505 489620 931125 754366 632141 852724 775287
17087 775287 692010 489056 533468 667985 333442 755975 746060 402904 668311 497918
17077 497918 457513 610023 942658 606527 338737 777348 899011 896591 547816 503567
17067 503567 632334 587829 575328 800580 1083146 802585 665738 531154 689402 747935
17057 747935 737992 479798 605285 971113 998154 915875 825867 1042029 783067 1043479
$$ packed form
17127E79965j58673J04755j29016L17468p242C19746K58854B38085j5879K44232
17117D66438L08582k09069k12262N06454j25724k71261O0529q9907K57452J0185
17107G01417j94490j2211J67528P8540J71854C29978R9485J66659q3048q2210
17097D30864j33847K0942M15253l57707J14115M41505j76759j22225K20583p7437
17087G75287q3277k02954M4412J34517C33442M22533r915l43156K65407j70393
17077D97918m0405J52510L32635l36131k67790M38611J21663k420l48775m4249
17067E03567J28767m4505j2501K25252K82566k80561j36847j34584J58248N8533
17057G47935r943k58194J25487L65828K7041q2279r0008K16162k58962K60412
$$ plain form
17047 1043479 577978 929913 1152355 1021461 1153908 988258 745560 609732 975113
17038 975113 941584 658954 996044 1131551 1073076 1107612 767343 1250112 867797 851227
17028 851227 1162090 864248 813069 911712 709089 814556 800465 897491 1196110 879784
17018 879784 1289105 928071 1152432 1073078 1076275 1137179 1027063 905775 1076107 1094519
17008 1094519 1174014 1288876 1364950 1342690 1379871 740107 838416 1324486 1100919 1014625
16998 1014625 955589 1003542 1338302 1446989 1257099 1425532 1289309 1384361 1185519 1107548
16988 1107548 1182651 1238995 1294473 1318154 1403261 1485994 1563717 1191130 1574064 1364930 1338739
16977 1338739 1505034 1432213 1341754 1045279 1535923 1372372 1468469 1665750 1597112 1427178
$$ packed form
17047A043479m65501L51935K22442j30894J32447j65650k42698j35828L65381
17038I75113l3529k82630L37090J35507n8475L4536l40269M82769l82315j6570
17028H51227L10863k97842n1179R8643k02623J05467j4091R7026K98619l16326
17018H79784M09321l61034K24361p9354L197O0904j10116j21288J70332J8412
17008A094519P9495J14862P6074k2260L7181o39764R8309M86070k23567q6294
16998A014625n9036M7953L34760J08687j89890J68433j36223R5052j98842p7971
16988A107548P5103N6344N5478K3681Q5107Q2733P7723l72587L82934k09134k6191
16977A338739J66295p2821r0459k96475M90644j63551R6097J97281o8638j69934
$$ plain form
16967 1427178 1210854 1723833 1380378 1526328 1230452 1568635 1723773 1594387 1665861 1432974
16957 1432974 1883192 1565758 1644398 1439932 1906100 1572236 1680885 1693160 1551547 1534170
16947 1534170 1989633 1602459 2133259 1979391 1677981 1990077 1753823 2002508 1807304
16938 1807304 2204492 1970602 2151566 2111423 1996682 2013544 1965212 1968117 1880408 1469716
16928 1469716 2192769 2169903 2083992 2198821 2097465 2197541 2266781 2046470 2132709 2247821
16918 2247821 1946905 2610579 2212964 2153198 2270628 2364200 2550076 2691866 2615879 2558891
16908 2558891 2828699 2589543 2552116 2735480 2782063 2748368 2581182 2846824 2673313 2646158
16898 2646158 2698041 2695525 3030769 3057032 2877532 3100343 3089484 3096700 3019319 3040889 3242487
$$ packed form
16967A427178k16324N12979l43455J45950k95876L38183J55138j29386P1474k32887
16957A432974M50218l17434P8640k04466M66168l33864J08649J2275j41613j7377
16947A534170M55463l87174N30800j53868l01410L12096k36254K48685j95204
16938A807304L97188k33890J80964m0143j14741J6862m8332K905q7709m10692
16928A469716P23053k2866q5911J14829j01356J00076O9240k20311Q6239J15112
16918B247821l00916O63674l97615n9766J17430R3572J85876J41790p5987n6988
16908B558891K69808k39156l7427J83364M6583l3695j67186K65642j73511k7155
16898B646158N1883k516L35244K6263j79500K22811j0859P216p7381K1570K01598
$$ plain form
16887 3242487 3386673 3376637 3342509 3216864 3443395 3658136 3268571 3774628 3541113 3678544
16877 3678544 4115754 3761471 3702515 3687898 3793849 3658723 3882592 3952584 3973045 3986309
16867 3986309 4023835 4388657 4460314 4174588 4351036 4066685 4516927 4246755 4715344 4883611
16857 4883611 4847154 4891130 5070114 5075364 5272540 5231024 5408163 5185822 5174617 5604697
16847 5604697 5467597 5872940 6078039 5680900 5224362 5816204 6188145 6168437 6110508 6391068
16837 6391068 6332880 6439175 6757442 6558737 6608913 6815239 7062131 6881017 7349095 7127347
16827 7127347 7475961 7580479 7560160 7919712 8147874 8246793 8523851 8432767 8425450 8643596
16817 8643596 8793346 9086076 9432772 9678896 9529783 9865292 10561804 10103888 10227395
$$ packed form
16887C242487J44186j0036l4128j25645K26531K14741l89565N06057k33515J37431
16877C678544M37210l54283n8956j4617J05951j35126K23869O9992K0461J3264
16867C986309L7526L64822P1657k85726J76448k84351M50242k70172M68589J68267
16857D883611l6457M3976J78984N250J97176m1516J77139k22341j1205M30080
16847E604697j37100M05343K05099l97139m56538N91842L71941j9708n7929K80560
16837F391068n8188J06295L18267j98705N0176K06326K46892j81114M68078k21748
16827G127347L48614J04518k0319L59552K28162R8919K77058r1084p317K18146
16817H643596J49750K92730L46696K46124j49113L35509O96512m57916J23507
$$ plain form
16808 10227395 10531946 10918743 11079728 11200883 11995390 12014721 12405976 12486152 12593366 13114034
16798 13114034 13481177 13705499 13937877 13975313 14626317 15008369 15732347 15700235 16064510 16512732
16788 16512732 16954427 17914258 17694451 18454736 18974431 19655490 19602799 20743683 21073069
16779 21073069 21560711 22122296 22885672 23468356 24284150 25065892 25950772 26487542 27357863
16770 27357863 28084968 29065189 30166155 31027551 31654438 33095262 34374049 35633576 36923495
16761 36923495 37659229 39036649 40773998 42003188 43426638 45052183 46893071 48290850
16753 48290850 50365926 52288526 53857532 56303221 58238319 60233059 62778194 65251275
16745 65251275 67576044 70235955 73040497 75912693 78769717 81431793 84169468 87413372
$$ packed form
16808A0227395L04551L86797J60985J21155P94507J9331L91255Q0176J07214N20668
16798A3114034L67143K24322K32378L7436O51004L82052P23978l2112L64275M48222
16788A6512732M41695R59831k19807P60285N19695O81059n2691J140884L29386
16779B1073069M87642N61585P63376N82684Q15794P81742Q84880N36770Q70321
16770B7357863P27105R80221J100966Q61396O26887J440824J278787J259527J289919
16761C6923495P35734J377420J737349J229190J423450J625545J840888J397779
16753D8290850K075076J922600J569006K445689J935098J994740K545135K473081
16745F5251275K324769K659911K804542K872196K857024K662076K737675L243904
$$ plain form
16737 87413372 90532232 93407165 96646874 99554279 102786358 105666236 108755851 111605514
16729 111605514 114276370 116956123 119001586 121437439 123086764 124744145 126077674 126644549
16721 126644549 127731060 127891632 127866396 127569472 126221743 125666975 124061836 122425734 120050930
16712 120050930 118090996 115590524 112531918 110033831 106885724 103756763 100876172 97766785
16704 97766785 94589569 91215082 88316781 84793734 82211075 79189211 76573918 73129204
16696 73129204 70947224 67816207 65233728 63346523 60401396 58328057 56131739 54051877
16688 54051877 52004905 50368022 48243505 46579316 44618682 43284871 41720613 40407791
16680 40407791 38900827 37236386 36475754 34894127 33634455 32596726 31842455 30847105
$$ packed form
16737H7413372L118860K874933L239709K907405L232079K879878L089615K849663
16729A11605514K670856K679753K045463K435853J649325J657381J333529N66875
16721A26644549J086511J60572k5236k96924j347729n54768j605139j636102k374804
16712A20050930j959934k500472l058606k498087l148107l128961k880591l109387
16704I7766785l177216l374487k898301l523047k582659l021864k615293l444714
16696G3129204k181980l131017k582479j887205k945127k073339k196318k079862
16688E4051877k046972j636883k124517j664189j960634j333811j564258j312822
16680D0407791j506964j664441p60632j581627j259672j037729p54271r95350
$$ plain form
16672 30847105 29485985 28655035 27778652 27054408 26048803 25576495 24654509 23924286 23076903
16663 23076903 22172571 21810164 21017402 20268734 19739516 19329482 19010809 18553304 18019327
16654 18019327 17418278 16967406 16707806 15835772 15685654 15460152 14915020 14707266 14561086
16645 14561086 13856448 13364419 13034870 13132835 12504015 12360857 11930886 11641884 11818298
16636 11818298 11560858 11231704 10727574 11008347 10429005 10182611 9876893 9755281 9945394
16627 9945394 9213875 8963775 8782633 9013473 8538888 8290037 8192348 8242392 8262800 7883112
16617 7883112 7935622 7832661 7497891 7621357 7252226 6974040 6814778 6656846 6604217 6507939
16607 6507939 6660806 6423114 6202650 6075547 6235220 5864679 5853672 5749543 5348500 5794635
$$ packed form
16672C0847105j361120q30950q76383p24244j005605m72308r21986p30223q47383
16663B3076903r04332l62407p92762p48668n29218m10034l18673m57505n33977
16654A8019327o01049m50872k59600q72034j50118k25502n45132k07754j46180
16645A4561086p04638m92029l29549R7965o28820j43158m29971k89002J76414
16636A1818298k57440l29154n04130K80773n79342k46394l05718j21612J90113
16627I945394p31519k50100j81142K30840m74585k48851r7689N0044K0408l79688
16617G883112N2510j02961l34770J23466l69131k78186j59262j57932n2629r6278
16607F507939J52867k37692k20464j27103J59673l70541j1007j04129m01043M46135
$$ plain form
16597 5794635 5433029 5162432 5346449 5414666 5078061 4923184 4956671 4952944 4934781 5027338
16587 5027338 4693320 4637159 4474436 4612869 4220152 4323485 4185112 4269476 4389457 3759023
16577 3759023 4146920 3774818 4057869 3657078 3825991 4085210 3970311 4033550 3772264 3586998
16567 3586998 3210693 3423901 3320854 3334534 3135927 3725731 3436237 3019331 2975787 3060012
16557 3060012 2893419 3041732 2949691 2922104 2816002 2752450 3092622 2939906 2925420 2908394
16547 2908394 2805670 2856653 3216811 2500206 2179833 2554072 2453676 2503067 2631690 2220283
16537 2220283 2411202 2264657 2791167 2385880 2083928 2457251 2299240 2306881 2364407 2149695
16527 2149695 2229943 2033016 2062793 1816578 2003659 1898677 2096018 2096278 2270783 1531190
$$ packed form
16597E794635l61606k70597J84017O8217l36605j54877L3487l727j8163R2557
16587E027338l34018n6161j62723J38433l92717J03333j38373Q4364J19981o30434
16577C759023L87897l72102K83051m00791J68913K59219j14899O3239k61286j85266
16567C586998l76305K13208j03047J3680j98607N89804k89494m16906m3544Q4225
16557C060012j66593J48313r2041k7587j06102o3552L40172j52716j4486j7026
16547B908394j02724N0983L60158p16605l20373L74239j00396M9391J28623m11407
16537B220283J90919j46545N26510m05287l01952L73323j58011P641N7526k14712
16527B149695Q0248j96927K9777k46215J87081j04982J97341K60J74505p39593
$$ plain form
16517 1531190 2151490 1961794 1884201 1570184 1900408 1705529 1869900 1851592 1941997 1729515
16507 1729515 1847173 1727989 1852600 1527416 1464527 1753534 1636851 1808170 1731844 1736821
16497 1736821 1641237 1720490 1375302 1480252 1549707 1677955 1426618 1763343 1227378 1493112
16487 1493112 1817810 1595140 1544740 1420256 1343308 1731441 1648286 1497299 1455311 1835480
16477 1835480 1516493 1250118 1572282 1431651 1411614 982049 1260359 1083992 1553504 1451843
16467 1451843 1456641 1389094 1117974 1203589 1438571 973746 1575951 1052869 1273250 901187
16457 901187 1328694 1202749 1635379 1146932 1022202 1210809 1046626 978327 1034857 965631
16447 965631 1029699 1062860 1069474 1301107 813136 939164 1108470 1356095 1107100 1213701
$$ packed form
16517A531190O20300j89696p7593l14017L30224j94879J64371j8308R0405k12482
16507A729515J17658j19184J24611l25184o2889K89007j16683J71319p6326M977
16497A736821r5584P9253l45188J04950O9455J28248k51337L36725n35965K65734
16487A493112L24698k22670n0400j24484p6948L88133q3155j50987m1988L80169
16477A835480l18987k66375L22164j40631k0037m29565K78310j76367M69512j01661
16467A451843M798o7547k71120Q5615K34982m64825O02205n23082K20381l72063
16457I01187M27507j25945M32630m88447j24730J88607j64183o8299N6530o9226
16447I65631O4068L3161O614K31633m87971J26028J69306K47625k48995J06601
$$ plain form
16437 1213701 1173375 886005 996359 969913 707515 842331 893664 845861 1116980 1170439
16427 1170439 848603 1154477 1021352 844870 942192 1087005 569075 873750 834187 529015
16417 529015 698052 836475 697795 902745 1075693 789485 770313 924670 738598 919981
16407 919981 846487 879569 1078723 878326 782641 698804 584074 835682 664118 974490
16397 974490 1032727 715085 749233 822246 881747 794859 638744 780414 680063 905594
16387 905594 1175870 595609 570820 444258 501047 646688 437624 707065 71006 902223
16377 902223 446942 737960 689953 599735 862147 109050 424264 317273 478634 557338
16367 557338 609487 741082 636158 796919 918583 631676 743808 830997 749863 640769
$$ packed form
16437A213701m0326k87370J10354k6446k62398J34816N1333m7803K71119N3459
16427A170439l21836L05874j33125j76482R7322J44813n17930L04675l9563l05172
16417E29015J69037J38423j38680K04950J72948k86208j9172J54357j86072J81383
16407I19981p3494L3082J99154k00397r5685q3837j14730K51608j71564L10372
16397I74490N8237l17642L4148P3013N9501q6888j56115J41670j00351K25531
16387I05594K70276n80261k4789j26562N6789J45641k09064K69441G1006Q31217
16377I02223D46942K91018m8007r0218K62412A09050L15214j06991J61361P8704
16367E57338N2149J31595j04924J60761J21664k86907J12132Q7189q1134j09094
$$ plain form
16357 640769 513943 767982 583704 181367 525454 608558 645470 486948 339052 712712
16347 712712 553607 175865 774045 486256 535361 332096 419561 502000 610748 355617
16337 355617 313731 694840 374691 574614 498305 416225 587124 443600 638232 464768
16327 464768 271320 733826 637283 598004 482241 769933 490643 605612 368273 247309
16317 247309 92510 614450 482451 488153 680508 356939 337102 542901 71648 252763
16307 252763 601737 632711 416922 183222 501010 589474 327137 533806 688649 426638
16297 426638 532210 497068 347398 433031 308803 374662 441148 428987 269024 331127 81721
16285 193025 205608 371739 369890 359725 459653 373979 368865 219301 246386 221821 300948
$$ packed form
16357F40769j26826K54039j84278A81367L44087Q3104L6912j58522j47896L73660
16347G12712j59105A75865N98180k87789M9105k03265Q7465Q2439J08748k55131
16337C55617m1886L81109l20149J99923p6309q2080J70899j43524J94632j73464
16327D64768j93448M62506r6543l9279j15763K87692k79290J14969k37339j20964
16317B47309I2510N21940j31999N702J92355l23569j9837K05799G1648J81115
16307B52763L48974L0974k15789A83222L17788Q8464k62337K06669J54843k62011
16297D26638J05572l5142j49670Q5633j24228O5859O6486j2161j59963O2103H1721
16285A93025J2583J66131j849j0165R9928q5674n114j49564K7085k4565P9127
$$ plain form
16274 300948 6930 310525 160211 109458 166103 355324 291892 47627 128760 353252 130640
16262 584429 229110 495518 99989 12167 369542 245378 -70840 15235 649444 178964
16251 404871 161402 764189 243236 201084 -12075 438778 420217 706199 49551 150444
16241 150444 323088 130175 140210 122011 55593 283750 329703 195327 147739 110883 281483
16230 281483 -15400 410591 196010 276542 683272 622782 108654 201522 52634 250808
16220 250808 -85668 253816 75401 450340 359289 389169 134993 256868 188598 379313
16210 379313 275996 243895 298825 -72700 220646 163006 -123062 -16306 175022 171321 188470
16199 188470 246071 430481 143454 273341 237915 30973 561762 93757 325570 213309
$$ packed form
16274C00948F930L03595j50314n0753N6645J89221o3432D7627Q1133K24492A30640
16262E84429B29110K66408I9989A2167L57375j24164g0840A5235O34209A78964
16251D04871A61402O02787B43236m2152a2075D38778j8561K85982D9551J00893
16241A50444J72644A30175J0035j8199E5593K28157M5953j34376m7588l6856J70600
16230B81483a5400D10591A96010Q0532M06730o0490A08654R2868E2634J98174
16220B50808h5668B53816G5401L74939r1051K9880A34993J21875o8270J90715
16210C79313j03317l2101N4930g2700B20646n7640a23062a6306A75022l701J7149
16199A88470N7601J84410A43454J29887l5426C0973N30789I3757K31813j12261
$$ plain form
16189 213309 272238 393664 211474 131 397334 39075 136045 -240533 486649 -184297 112354
16177 203078 377574 -29253 241350 333318 117502 -55863 218893 57465 230269 -99494
16166 201337 198127 101370 199015 17548 -175512 172538 283272 24526 30351 -174268 -47381
16154 262313 100086 240342 132067 40724 -72922 144065 172069 341232 17397 -132332
16143 -13210 62963 -58123 421385 56331 31455 241135 177614 175583 211076 258822 43353
16131 255455 192176 492835 -48857 43635 125897 -178388 226932 177995 374688 364231 -35580
16119 -175062 134670 141464 167823 105124 55505 151780 358554 79545 56771 77762 67343
16108 67343 78785 -77208 -8730 -70021 203360 208301 276262 594751 -208980 250522 -70709
$$ packed form
16189B13309N8929J21426j82190A31L97203C9075R6970b40533D86649a84297A12354
16177B03078J74496b9253B41350R1968A17502e5863B18893E7465J72804i9494
16166B01337l210r6757R7645A7548a75512A72538J10734B4526N825a74268d7381
16154B62313A00086J40256j08275D0724g2922A44065K8004J69163A7397a32332
16143a3210F2963e8123D21385E6331k4876K09680o3521k031L5493M7746D3353
16131B55455o3279L00659d8857D3635Q2262a78388B26932m8937J96693j0457c5580
16119a75062A34670O794K6359o2699m9619R6275K06774G9545k2774K0991j0419
16108F7343J1442g7208h730o1291B03360M941O7961L18489b08980B50522g0709
$$ plain form
16096 341202 20458 -18890 141285 9622 218035 170958 144022 108004 394206 -170539 58344
16084 143737 356790 -244728 247513 10119 72800 194570 -84535 288197 -220096 160761
16073 60602 -42038 -246291 -109708 92468 -230957 62401 230181 -136331 -80722 431966
16062 -57565 117076 85821 378305 28406 326993 233989 152367 260914 27472 9071 196777
16051 196777 82250 320653 84382 -4839 127680 135828 222222 456875 309389 71666 605618
16040 605618 183376 -397273 184294 -196511 -40534 90527 -82087 239654 -231225 -207118
16030 -207118 78480 49596 -58349 108393 96024 443167 -68501 204371 -88469 88565 -21192
16018 -86466 18320 -66409 181724 -219220 141051 -226258 65382 96107 -336526 214737
$$ packed form
16096C41202B0458a8890A41285I622K08413m7077k6936l6018K86202a70539E8344
16084A43737K13053b44728B47513A0119O2681J21770h4535B88197b20096A60761
16073F0602d2038k04253a09708I2468b30957F2401J67780a36331N5609D31966
16062e7565A17076l1255K92484B8406K98587r3004q1622J08547B7472I071J87706
16051A96777H2250K38403H4382d839A27680Q148Q6394K34653j47486G1666N33952
16040F05618A83376c97273A84294a96511d0534I0527h2087B39654b31225K4107
16030b07118G8480k8884e8349A08393j2369L47143f8501B04371h8469H8565b1192
16018h6466A8320f6409A81724b19220A41051b26258F5382L0725c36526B14737
$$ plain form
16007 368051 -6140 77059 31021 203931 165429 24559 -192857 79611 320399 44792 -80029
15995 -37021 261190 69666 310070 -3832 222786 152134 -23129 301224 458831 620627 1256849
15984 1256849 1149397 1376763 809121 415003 638058 312250 -69060 118127 251771 414725
15974 414725 -89077 38664 114066 174681 172146 20299 -20158 -8652 -59562 90201 -201499 131719
15961 158579 -251926 -147028 -376464 202798 199292 124673 242359 -88194 -126226 100097
15950 -42620 326425 -185002 24535 65073 62094 135356 -212623 -157461 -14086 -33259 -283078
15939 -283078 -319513 -107954 -13390 137459 -234706 -37066 74209 201573 -154365 213728
15928 -41676 24837 109499 -19243 -173825 -505363 -77801 -123587 -77033 117806 -138369 29568
$$ packed form
16007C68051f140G7059C1021J72910l8502B4559a92857G9611K40788D4792h0029
15995c7021B61190F9666K40404c832B22786p0652b3129C01224J57607J61796O36222
15984A256849j07452K27366n67642l94118K23055C12250f9060A18127J33644J62954
15974D14725h9077C8664P5402O0615k535B0299b0158h652n0910I0201b01499A31719
15961A58579b51926J04898k29436B02798l506p4619J17686h8194l8032A00097
15950d2620C26425a85002B4535M0538k979P3262b12623N5162a4086j9173k49819
15939b83078l6435a07954a3390A37459b34706c7066G4209J27364a54365B13728
15928d1676B4837Q4662a9243j54582l31538g7801m5786M6554A17806a38369B9568
$$ plain form
15916 -253147 24357 173398 -135139 111862 -233267 -210472 110745 -243024 13461 104937
15906 104937 -12613 -86496 167080 -42200 165461 -106813 -103148 -58419 155721 -21471 123266
15894 205902 -362899 51855 -5526 -146329 -239850 -202555 94361 -155425 70282 -18728 -73178
15883 -73178 346919 -114432 174631 51487 262899 -130591 -28452 -163628 174191 -140326
15872 111461 98657 -151582 37595 -74026 240985 -13810 -245925 -56822 -207850 -3101 11001
15860 -186884 126126 -70776 47482 -318143 176744 161160 25323 41838 338419 -256241
15849 100392 -242576 31662 -135564 -74672 -27835 -315094 -69709 162070 -181217 -9867 132994
15837 -287663 -58829 -52928 85829 -84739 19587 186343 116555 198522 71712 -307817 -132394
$$ packed form
15916b53147B4357J49041a35139A11862b33267K2795A10745b43024A3461R1476
15906A04937a2613p3883A67080d2200A65461a06813L665M4729A55721b1471A23266
15894B05902c62899E1855e526j40803r3521L7295I4361a55425G0282a8728n4450
15883g3178C46919a14432A74631E1487K11412a30591b8452j35176A74191a40326
15872A11461j2804a51582C7595g4026B40985a3810k32115e6822j51028c101A1001
15860a86884A26126g0776D7482c18143A76744j5584B5323J6515K96581b56241
15849A00392b42576C1662a35564O0892b7835k87259f9709A62070a81217i867A32994
15837b87663e8829N901H5829h4739A9587J66756o9788Q1967G1712c07817a32394
$$ plain form
15825 -263261 -137059 -17906 -25984 63830 -110610 86515 77726 -110707 80193 155387 199505
15814 199505 -58433 -124134 -128390 126725 202939 215861 -234794 -275247 -57990 -254195 182141
15802 346011 238215 204093 110269 191989 8738 42249 -208245 166101 -253323 -5623 -128835
15791 -128835 -3413 -155240 29731 267302 25627 152266 153400 -26951 -32521 257119 313668
15780 313668 8603 -273541 -52716 -102687 -331655 -8878 75282 -250390 415940 254957 3430
15768 -63366 -333440 -442453 141898 361513 -119983 -84680 -129076 -2133 224657 -191201
15757 78667 193726 -115137 212829 137941 -141394 -15943 172938 48546 150599 -205086
15746 180908 -95234 37572 29229 168512 84471 11062 -79365 -67252 310378 -56176 -46632
$$ packed form
15825b63261J26202a7906q078F3830a10610H6515q789a10707H0193P5194M4118
15814A99505e8433o5701m256A26725P6214J2922b34794m0453e7990j96205A82141
15802C46011j07796l4122r3824Q1720H738L3511b08245A66101b53323e623j23212
15791a28835c413j51827B9731K37571B5627J26639J134b6951n570B57119N6549
15780C13668H603b73541e2716m9971k28968h878G5282b50390D15940j60983C430
15768f3366k70074j09013A41898K19615a19983L5303m4396b133B24657a91201
15757G8667J15059a15137B12829p4888a41394a5943A72938D8546J02053b05086
15746A80908i5234C7572q343J39283q4041A1062g9365J2113C10378e6176R544
$$ plain form
15735 -46632 -108594 11378 -53855 -156243 87242 75401 74437 -57331 -276092 -61647 -106643 -173273
15723 -173273 -278797 -127707 -192546 153202 -129922 319382 151854 219444 -3582 -303372
15713 -303372 -144245 -242335 315439 -74920 -256365 -41221 -218817 80647 -3069 324 265408
15702 265408 -278558 -220743 -44185 -49323 -65212 15231 272049 -285694 -79315 -146872 298272
15690 170461 -386399 -19653 -176175 -281064 -58211 -140024 236765 121093 9866 113981
15680 113981 13170 49944 -227487 79125 -35530 -23154 92412 -147616 25593 404305 -53394
15668 67622 58700 63631 57584 -173941 -273376 342224 157196 67201 63906 -93107 -63300 -209584
15656 -209584 131674 115960 35813 -108033 -52302 -236525 28674 11381 83154 -111392 -311415
$$ packed form
15735d6632o1962A1378e3855j02388H7242j1841r64e7331k18761f1647m4996o6630
15723a73273j05524a27707o4839A53202a29922C19382A51854O7590c582k99790
15713c03372a44245r8090C15439g4920j81445d1221j77596H0647c069C24K65084
15702B65408b78558N7815d4185n138j5889A5231K56818b85694g9315o7557B98272
15690A70461c86399a9653j56522j04889e8211q1813B36765j15672I866J04115
15680A13981A3170L6774b27487G9125c5530J2376I2412a47616B5593L78712e3394
15668F7622q922M931o047a73941r9435C42224A57196F7201l295i3107K9807j46284
15656b09584A31674j5714C5813a08033e2302j84223B8674A1381P1773a11392k00023
$$ plain form
15645 -311415 232504 200107 -11393 -116052 291149 126148 173133 32610 -61302 -154822 -140207
15634 -140207 -30239 -114008 -97552 208493 -432507 -284703 52590 -90895 125181 128077 163622
15623 163622 -19129 160114 37653 -392416 23555 -30226 -265379 -121522 -89350 161650
15612 -152823 -109059 268312 23403 -87548 -54945 64838 304218 -88031 7899 120261 -74458
15600 -258630 -153767 97506 -159263 372053 -161495 -271576 22383 -244884 -171935 -138511
15590 -138511 -144976 243829 -386603 5240 -86570 107377 -89502 12919 140296 -145885 118630
15578 -16715 -213304 221849 -392341 -76130 -195063 -365571 -247305 -200035 -41245 101252
15567 -20784 155503 -59000 -129294 -173603 -16359 -63414 132948 13273 -152455 -191656 -51778
$$ packed form
15645c11415B32504l2397a1393j04659B91149A26148M6985C2610f1302r3520J4615
15634a40207c0239q3769J6456B08493d32507J47804E2590i0895A25181K896L5545
15623A63622a9129A60114C7653c92416B3555c0226k35153a21522L2172A61650
15612a52823M3764B68312B3403h7548L2603F4838K39380h8031G899J12362g4458
15600b58630J04863I7506a59263C72053a61495j10081B2383b44884P2949L3424
15590a38511o465B43829c86603E240h6570A07377h9502A2919J27377a45885A18630
15578a6715j96589B21849c92341g6130j18933j70508J18266M7270d1245A01252
15567b0784A55503e9000p0294m4309a6359m7055A32948A3273a52455l9201e1778
$$ plain form
15555 160928 -23068 -140605 -395629 -136396 72445 -55441 -24456 83647 96688 -118073 85135
15543 -210614 -76906 -116474 -10699 275436 -149171 63125 -317418 127206 -13172 85215 188142
15532 188142 55663 185587 -216126 59583 -37313 23478 76087 23671 246093 -154160 88755
15520 -103394 192716 368630 293797 128396 281684 380880 375452 185130 56600 -118573
15509 246314 521879 298612 244560 -29197 198416 56228 -119362 281630 -81855 -126584
15499 -126584 415799 -32738 -76790 275370 115665 -192825 -131822 367117 40596 105918
15489 105918 -306095 144527 -70707 283104 -788 240074 484284 114693 -118948 317579
15478 -31911 160440 213202 265643 411181 243794 297994 817448 608308 406224 203999
$$ packed form
15555A60928b3068j17537k55024a36396G2445e5441b4456H3647J3041a18073H5135
15543b10614g6906l9568a0699B75436a49171F3125c17418A27206a3172H5215J02927
15532A88142E5663J29924b16126E9583c7313B3478N2609B3671K22422a54160H8755
15520a03394A92716J75914p4833A28396J53288R9196n428A85130E6600a18573
15509B46314K75565k23267n4052b9197A98416E6228a19362B81630h1855m4729
15499a26584D15799c2738m4052B75370A15665a92825O1003C67117D0596O5322
15489A05918c06095A44527g0707B83104g88B40074K44210A14693a18948C17579
15478c1911A60440N2762N2441J45538j67387N4200N19454k09140k02084k02225
$$ plain form
15468 203999 -17483 -34986 -6641 417798 111212 353618 -4996 150122 132591 -344467 143455
15456 -68270 -144857 -27892 75905 96060 -198418 -26715 -271165 111140 341911 130622 225929
15445 225929 -62916 382548 459471 423252 745224 1131051 1200913 1044501 590837 359568
15435 359568 323947 -151189 -45389 490544 -441252 110837 104138 238466 282102 -247933
15424 -79108 -82079 90328 137697 -74388 -27030 34661 75364 30154 105531 -109701 95249 50938
15412 50938 156361 -323707 75811 -475062 27973 -137507 26403 129737 157488 -149494
15401 -133810 -126417 -256560 -239709 53539 -410992 -205756 67869 -57715 -177754 25482 -316427
15389 -74972 565812 141188 -166476 -2598 211269 19111 65784 -306397 -78805 -41132 -167024
$$ packed form
15468B03999a7483j7503f641D17798A11212K42406d996A50122j7531c44467A43455
15456f8270p6587b7892G5905K0155a98418b6715k44450A11140K30771A30622R5307
15445B25929f2916C82548P6923l6219L21972L85827O9862j56412m53664k31269
15435C59568l5621a51189d5389D90544d41252A10837o699J34328M3636b47933
15424g9108k971I0328M7369g4388b7030C4661M0703C0154P5377a09701I5249m4311
15412E0938J05423c23707G5811d75062B7973a37507B6403J03334K7751a49494
15401a33810P393j30143J6851E3539d10992K05236F7869e7715j20039B5482c16427
15389g4972E65812A41188a66476b598B11269A9111M6673c06397g8805L7673j25892
$$ plain form
15378 -167024 -4667 104632 -61069 155184 136727 -52299 286305 313960 97491 206989 101884
15366 253669 141504 37027 91591 138967 128518 198996 233000 -50327 111618 161302 307566
15355 307566 64690 210838 429569 -183116 -15324 330878 312812 26355 22417 -317510 -188722
15344 -188722 190638 446219 424656 565270 269170 153648 373129 16740 160645 301868
15334 301868 71253 -234176 97987 86898 -46051 126702 176633 -65596 364632 141682 -161433
15322 290502 36006 -79055 97796 198227 269323 190268 -94569 -295449 -59421 39176 270839
15311 270839 -119990 30262 312855 29188 125258 340103 -37881 175656 -187068 254853
15300 209376 67916 -383419 190533 -136894 -62360 26719 57647 -128823 -969 147015 -83880
$$ packed form
15378a67024d667A04632f1069A55184j8457e2299B86305K7655I7491J09498A01884
15366B53669j12165C7027N4564M7376j0449P0478L4004e0327A11618M9684J46264
15355C07566F4690J46148K18731a83116a5324C30878j8066B6355l938c17510J28788
15344a88722A90638K55581k1563J40614B69170j15522K19481A6740J43905J41223
15334C01868G1253b34176I7987j1089d6051A26702M9931f5596C64632A41682a61433
15322B90502C6006g9055I7796J00431P1096p9055i4569k00880e9421C9176K31663
15311B70839a19990C0262K82593B9188R6070K14845c7881A75656a87068B54853
15300B09376F7916c83419A90533a36894f2360B6719L0928a28823i69A47015h3880
$$ plain form
15288 -61895 -146005 -301300 74629 -91876 -396097 -120503 177896 -92654 147571 -138532
15277 147630 131038 332885 -121721 -160814 -98751 229746 -37762 44646 369865 -97832 163484
15265 4657 2281 200094 -169187 -97106 -15245 18535 -44827 -44803 -22114 -220829 -38051 22212
15252 208090 171981 152815 -172503 71588 190015 233045 359256 320005 650609 1221991
15242 1221991 2112821 1364698 1838381 1243749 283112 328533 -20197 -207623 331502 -356001
15231 149319 -115094 -186843 -8079 -227866 -63126 462530 -99284 314741 98944 13138 -83087
15219 -71707 49757 -35949 246354 160018 341662 -158333 371416 -29407 -27581 113579 157259
15208 157259 375378 144996 309001 78991 255690 99621 -59905 6057 309260 149938
$$ packed form
15288f1895q4110j55295G4629i1876l04221a20503A77896i2654A47571a38532
15277A47630j6592K01847a21721l9093O2063B29746c7762D4646L25219i7832A63484
15265D657B281J97813a69187P2081a5245A8535d4827K4b2114j98715c8051B2212
15252B08090l6109j9166a72503G1588J18427M3030J26211l9251L30604N71382
15242A221991Q90830p48123M73683n94632B83112M5421b0197j87426C31502c56001
15231A49319a15094p1749h079k19787f3126D62530i9284C14741I8944A3138h3087
15219g1707D9757c5949B46354q6336J81644a58333C71416b9407J826A13579M3680
15208A57259K18119A44996J64005G8991J76699I9621e9905F057L03203A49938
$$ plain form
15197 357653 -171682 120801 -139057 115806 256720 244014 -181322 -255121 -357756 309809
15186 147730 14271 -366016 184785 -114965 -182656 340953 27450 -38271 150198 -196462
15175 -440629 -183151 -31326 85413 -11774 243218 282252 101019 -17827 -21613 -226036 343141
15163 104148 108260 33616 85515 127468 -212843 -29919 -213581 -23024 310353 46585 210357
15152 210357 144035 -39896 149151 -35170 99201 280999 -65433 -57010 6362 15585 121636
15141 121636 374458 406998 51915 193686 236336 240677 -218895 7183 172821 28021 195890
15130 195890 121104 -162333 186372 -76598 90575 245659 94684 223637 219378 82787 424425
15119 424425 542855 374945 249318 44949 111280 260929 83181 -18112 39585 420106
$$ packed form
15197C57653a71682A20801a39057A15806J40914j2706a81322p3799j02635C09809
15186A47730A4271c66016A84785a14965o7691C40953B7450c8271A50198a96462
15175d40629a83151c1326H5413a1774B43218L9034A01019a7827l786k04423C43141
15163A04148M112C3616N1899M1953b12843b9919j83662b3024C10353D6585J63772
15152B10357o6322c9896A49151c5170I9201J81798f5433Q423F362R223J06051
15141A21636K52822L2540E1915J41771M2650M341b18895G183J65638B8021J67869
15130A95890p4786a62333A86372g6598I0575J55084I4684J28953m259H2787L41638
15119D24425J18430j67910j25627D4949O6331J49649H3181a8112C9585L80521
$$ plain form
15109 420106 -237538 301151 177488 233210 -199269 -75264 84773 239649 74059 143484
15099 143484 479470 209303 277323 173973 81036 388699 -58388 234355 -229367 -211508
15089 -211508 521600 -152680 204996 368743 252434 89299 316194 41183 -18232 288916
15078 215604 82108 235061 101810 280826 231313 193984 262892 183514 423717 78012 344297
15067 344297 -41012 265511 446058 276051 205141 324140 763 190329 -74283 549855 273053
15055 220766 295320 -41105 299190 191540 330103 396799 172650 528547 13014 382421
15045 382421 208648 246166 313460 337072 62209 364450 184569 389170 308521 300069 242355
15034 242355 484031 740747 457339 431895 659905 684093 384392 887936 507396 505782
$$ packed form
15109D20106b37538C01151j23663N5722a99269g5264H4773J54876G4059O9425
15099A43484L35986B09303O8020j03350H1036L07663e8388B34355b29367J7859
15089b11508E21600a52680B04996J63747j16309H9299K26895D1183a8232B88916
15078B15604H2108J52953A01810J79016m9513l7329O8908p9378K40203G8012K66285
15067C44297d1012B65511J80547j70007p0910J18999G63J89566g4283E49855B73053
15055B20766P4554d1105B99190j07650J38563O6696A72650L55897A3014L69407
15045C82421j73773L7518O7294K3612F2209L02241j79881K04601q0649q452n7714
15034B42355K41676K56716k83408k5444K28010K4188k99701N03544l80540j614
$$ plain form
15024 505782 325415 362482 158785 511565 365862 297275 546766 270239 188692 536421
15014 536421 347460 259355 432060 397816 383523 217656 398208 330707 306119 315921 149481
15002 53222 456950 896253 453034 491255 248082 632752 567442 330659 -46714 617648
14991 318587 507399 256557 500727 360263 552338 512887 559340 469981 571175 718818
14981 718818 756801 772067 786911 850420 591086 735802 167080 476175 694496 506399
14971 506399 592875 885744 352843 561821 96836 211369 365168 183012 535155 120395
14960 314554 429557 423992 333002 517228 102566 443317 -2906 584325 56384 201899 393036
14949 393036 523019 172997 181841 344784 468441 277964 687137 979949 337593 336614
$$ packed form
15024E05782j80367L7067A58785L52780j45703o8587K49491B70239q1547L47729
15014E36421j88961q8105J72705l4244j4293j65867J80552o7501k4588R802A49481
15002E3222M03728M39303m43219L8221k43173L84670o5310k36783d6714F17648
14991C18587J88812k50842K44170j40464J92075l9451M6453q9359J01194J47643
14981G18818L7983J5266J4844O3509k59334J44716A67080L09095K18321j88097
14971E06399Q6476K92869C52843K08978I6836J14533J53799j82156L52143A20395
14960C14554J15003n565r0990J84226A02566L40751b906E84325E6384J45515J91137
14949C93036J29983A72997Q844J62943J23657j90477M09173K92812C37593r79
$$ plain form
14939 336614 751746 158005 331874 316787 448764 495608 486918 551055 889786 827892 1115168
14928 1115168 1229871 1300528 1045032 1523035 1464071 1559611 1283313 1310755 1313214 1241186 1453910
14917 1453910 1842352 2234593 2457112 1648507 1788933 1186955 876767 1205011 1012197
14908 1012197 810576 368279 510338 278705 338763 513416 373713 240483 446889 549030
14898 549030 80018 78764 -84403 249882 483988 315636 880626 492160 538951 382245
14888 382245 490204 668762 530745 666603 828294 843043 734258 834686 598810 682191
14878 682191 1059657 930552 817558 881059 649954 534839 593494 679783 399640 413151
14868 413151 386658 603539 586854 545172 582697 950039 423996 378629 544988 422699
$$ packed form
14939C36614M15132A58005J73869j5087J31977M6844q690O4137L38731o1894K87276
14928A115168J14703P0657k55496M78003n8964R5540k76298K7442K459p2028K12724
14917A453910L88442L92241K22519q08605J40426o01978l10188L28244j92814
14908A012197k01621C68279J42059k31633O0058J74653j39703j33230K06406J02141
14898E49030H0018j254h4403B49882K34106j68352N64990l88466M6791j56706
14888C82245J07959J78558j38017J35858J61691J4749j08785J00428k35876Q3381
14878F82191L77466j29105j12994O3501k31105j15115N8655Q6289k80143J3511
14868D13151k6493K16881j6685m1682L7525L67342D23996m5367J66359j22289
$$ plain form
14858 422699 146518 327566 420630 685210 239236 486475 348893 565017 540726 896751
14848 896751 259007 690697 572473 709900 914029 738294 869301 928753 933621 706529
14838 706529 1452083 1216148 1009409 859805 505057 957362 776823 175065 664899 435012
14828 435012 915581 530642 812419 584344 913805 583643 683148 686937 425814 675749
14818 675749 672031 820679 919589 1016970 953479 783788 424452 595940 978979 708953
14808 708953 776192 535563 724720 581969 568149 916204 721920 1023000 530010 1018478
14798 1018478 266156 391556 359291 282310 314369 505381 442802 708978 575307 534689
14788 534689 574900 576124 821274 478868 469292 789607 486501 901423 540160 768297
$$ packed form
14858D22699A46518J81048R3064K64580B39236K47239j37582K16124k4291L56025
14848H96751B59007M31690j18224J37427K04129j75735J31007N9452M868k27092
14838G06529P45554k35935k06739j49604l54748M52305j80539A75065M89834k29887
14828D35012M80569l84939K81777k28075L29461l30162R9505L789k61123K49935
14818F75749l718J48648R8910R7381o3491j69691l59336J71488L83039k70026
14808G08953O7239k40629J89157j42751j3820L48055j94284L01080m92990M88468
14798A018478B66156J25400l2265p6981L2059J91012o2579K66176j33671m0618
14788E34689M0211J224K45150l42406r576L20315l03106M14922l61263K28137
$$ plain form
14778 768297 712073 943477 586769 977902 1042686 924739 1065575 878417 390538 985335
14768 985335 734782 795747 708982 375370 286894 625288 685559 509145 669748 720471
14758 720471 605369 851332 814047 508266 305549 749787 367042 860364 648698 768750
14748 768750 508706 683535 1003373 516437 842540 443003 1180329 744287 585256 729999
14738 729999 1117443 719330 645636 915859 965259 698409 804551 822260 814530 929924
14728 929924 1113952 1188198 1340388 2027319 2086458 1336930 1680187 1141111 1000372 1131290
14718 1131290 718638 878720 912525 964724 615952 883968 798474 792119 701369 1060091
14708 1060091 939919 980382 977930 614240 1084690 1464442 1522773 1227628 1855333 1738568
$$ packed form
14778G68297n6224K31404l56708L91133O4784j17947J40836j87158C90538N94797
14768I85335k50553O0965q6765l33612q8476L38394O0271j76414J60603N0723
14758G20471j15102K45963l7285l05781k02717M44238C67042M93322k11666J20052
14748G68750k60044J74829L19838m86936L26103l99537P37326m36042j59031J44743
14738G29999L87444l98113p3694K70223M9400k66850J06142J7709p730J15394
14728I29924J84028P4246J52190O86931N9139p49528L43257n39076j40739J30918
14718A131290m12652J60082L3805N2199l48772K68016q5494o355r0750L58722
14708A060091j20172M0463k452l63690M70450L79752N8331k95145O27705j16765
$$ plain form
14698 1738568 1459478 1655139 1458702 1403986 1289394 821833 927500 1193798 740975 610143
14688 610143 640773 954767 951183 617229 1020963 349724 1133427 1105443 1065110 935499
14678 935499 860876 836127 1005951 1149735 1291941 751326 1010425 633317 1164269 879603
14668 879603 822446 1034045 1126989 970923 839177 775675 971712 1141336 702978 1137028
14658 1137028 1296231 1214963 1158065 1520911 965527 1028420 977594 1356136 1092114 1238303
14648 1238303 1308803 1382739 751903 1088187 1259757 1396254 1086259 1076295 924547 1309981
14638 1309981 1146959 1117133 1230181 1374935 1005486 1180041 1087513 1249790 1315626 1418457
14628 1418457 1348551 1514585 1182918 1368172 1255088 1249595 946582 1302479 1535485 1223352
$$ packed form
14698A738568k79090J95661j96437n4716j14592m67561J05667K66298m52823j30832
14688F10143L0630L13994l584l33954M03734C49724P83703k7984m0333j29611
14678I35499p4623k4749J69824J43784J42206n40615K59099l77108N30952k84666
14668H79603n7157K11599R2944j56066j31746o3502J96037J69624m38358M34050
14658A137028J59203q1268n6898L62846n55384O2893n0826L78542k64022J46189
14648A238303P0500P3936o30836L36284J71570J36497l09995r964j51748L85434
14638A309981j63022k9826J13048J44754l69449J74555r2528J62277O5836J02831
14628A418457o9906J66034l31667J85254j13084n493l03013L55897K33006l12133
$$ plain form
14618 1223352 1381842 1320041 1502116 1683650 1565696 1482942 1393460 1530688 1629035 1402312
14608 1402312 1467832 1536037 1591662 1549645 1688585 1611466 1788263 1783168 1855465 1854617 1801910
14597 1801910 1486777 1636364 1541064 1472594 1432615 1591759 1855333 1887772 1730634 1635980
14587 1635980 1916965 1830880 1957459 1956114 1986708 1892443 1860615 2087989 2059066 1903499 1906500
14576 1906500 2140423 2089055 1913729 2052796 2090942 1869090 2211666 2080904 2325937 2354555
14566 2354555 2244755 2716615 2515955 2242402 2695022 2309423 2772333 2782564 2740547 2935371
14556 2935371 2791629 3210673 3344777 3628902 3908275 4362378 5301642 6904713 9946354
14547 9946354 16813163 32377096 52684501 24369684 10021574 5313490 3878309 3332148
$$ packed form
14618A223352J58490o1801J82075J81534j17954q2754q9482J37228R8347k26723
14608A402312O5520O8205N5625m2017J38940p7119J76797n095P2297q48n2707
14597A801910l15133J49587r5300o8470l9979J59144K63574L2439j57138r4654
14587A635980K80985q6085J26579j345L0594r4265l1828K27374k8923j55567L001
14576A906500K33923n1368j75326J39067L8146k21852L42576j30762K45033K8618
14566B354555j09800M71860k00660k73553M52620l85599M62910J0231m2017J94824
14556B935371j43742M19044J34104K84125K79373M54103R39264J603071L041641
14547I946354O866809J5563933K0307405B4369684A0021574m708084j435181n46161
$$ plain form
14539 3332148 4362417 5321927 2748007 2260422 1911538 2215528 2537752 2164365 1952978
14530 1952978 2171713 2223717 2094082 2134020 2408126 2061460 2175150 2037337 2340571 2379957
14520 2379957 2356032 2387688 2474198 2912862 2349110 2514459 2801782 2743872 2726837 2494499
14510 2494499 2628584 3156624 3118245 2924764 2926981 3069602 3299664 3083973 2961424 2945146
14500 2945146 3354391 3010345 3219106 2904097 2980750 3141117 3419813 3280702 3370922 3478064
14490 3478064 3463971 3710994 3462771 3773404 3497218 3790560 3557624 3772805 3683922 3771514
14480 3771514 4008713 3855965 4053384 4130538 3778457 4163981 4103562 4175160 4283439 4306151
14470 4306151 4274752 4192654 4420371 4793793 4551168 4807827 4573332 4748814 4770249 4849642
$$ packed form
14539C332148J030269R59510k573920m87585l48884L03990L22224l73387k11387
14530A952978K18735N2004j29635L9938K74106l46666J13690j37813L03234L9386
14520B379957k3925L1656Q6510M38664n63752J65349K87323n7910j7035k32338
14510B494499J34085N28040l8379j93481K217J42621K30062k15691j22549j6278
14500B945146M09245l44046K08761l15009P6653J60367K78696j39111R0220J07142
14490C478064j4093K47023k48223L10633k76186K93342k32936K15181q8883Q7592
14480C771514K37199j52748J97419P7154l52081L85524o0419P1598J08279K2712
14470D306151l1399q2098K27717L73422k42625K56659k34495J75482K1435P9393
$$ plain form
14460 4849642 4830787 4717154 4909551 4774585 5117145 5105475 5246065 5322247 5110571 5317250
14450 5317250 5147609 5482553 5446517 5630125 5296162 5553601 5562575 5831620 6100117 5922975
14440 5922975 6337643 6163881 6425237 6166097 6396344 6619576 6691511 6826207 7095214 6838081
14430 6838081 6950103 7242342 7137989 7034811 7406314 7689739 7886789 7359785 7904348
14421 7904348 7945654 8196390 8447585 9090440 8609578 9042285 8988293 8734052 9122148 8709039
14411 8709039 9178648 9229535 9246815 9869726 9667716 9882808 9915246 10031659 10517983 10633662
14401 10633662 10636336 10763193 10988648 10996145 11051692 11255303 11458229 11491669 11754951 11757502 12127210
14390 12127210 12287208 12571121 12568164 12858503 13198946 13376293 14049004 13829486 14003583 14346644
$$ packed form
14460D849642j8855j13633J92397j34966L42560j1670J40590P6182k11676K06679
14450E317250j69641L34944l6036J83608l33963K57439Q974K69045K68497j77142
14440E922975M14668j73762K61356k59140K30247K23232P1935J34696K69007k57133
14430F838081J12022K92239j04353j03178L71503K83425J97050n27004N44563
14421G904348M1306K50736K51195O42855m80862M32707n3992k54241L88096m13109
14411H709039M69609N0887J7280O22911k02010K15092L2438J16413M86324J15679
14401A0633662K674J26857K25455P497N5547K03611K02926L3440K63282K551L69708
14390A2127210J59998K83913k957K90339L40443J77347O72711k19518J74097L43061
$$ plain form
14380 14346644 15006740 15623523 15377740 15807277 15786936 15909975 16550114 17027438 17268107
14371 17268107 17386930 17892975 17981029 18472820 18771766 19263335 19952168 20682953 20652980 21078054
14361 21078054 21641592 22040744 22398764 23098334 23516604 24215262 24471833 24778178 25540698
14352 25540698 26309850 27117434 27995985 28416595 29402273 29563314 31032915 31515948 32570755
14343 32570755 33103129 34139183 34850526 36073127 36864758 37873436 38965182 40352976
14335 40352976 41583956 42573831 43772285 45336679 46629834 48225820 49309176 51115900
14327 51115900 52746813 54358421 56389055 58183573 59841491 62218391 64219382 66736931
14319 66736931 69101912 71852030 74651095 77106251 79560976 83090596 86397739 89529017
$$ packed form
14380A4346644O60096O16783k45783M29537k0341J23039O40139M77324K40669
14371A7268107J18823N06045Q8054M91791K98946M91569O88833P30785k9973M25074
14361B1078054N63538L99152L58020O99570M18270O98658K56571L06345P62520
14352B5540698P69152Q07584Q78551M20610R85678J61041J469601M83033J054807
14343C2570755N32374J036054P11343J222601P91631J008678J091746J387794
14335D0352976J230980R89875J198454J564394J293155J595986J083356J806724
14327E1115900J630913J611608K030634J794518J657918K376900K000991K517549
14319F6736931K364981K750118K799065K455156K454725L529620L307143L131278
$$ plain form
14311 89529017 93375503 97190216 101627885 105679867 110295161 114994572 120244006 125572562
14303 125572562 131520457 137426381 144223928 151096525 158214331 166050677 174083766 182490624
14295 182490624 191834036 201566592 211453539 222460247 233595672 245610232 257862000
14288 257862000 270991054 284501310 298671236 312962272 327835021 342977439 358185807
14281 358185807 373683962 388618623 403356930 417686364 430977955 443305557 454286019
14274 454286019 463327176 469333421 472010416 472515184 472391225 471138223 466476552 460682050
14266 460682050 453436170 444301057 434696924 422163476 407913961 393101754 377313354
14259 377313354 361499871 345293208 329357290 313570698 298484466 283848727 269471839
$$ packed form
14311H9529017L846486L814713M437669M051982M615294M699411N249434N328556
14303A25572562N947895N905924O797547O872597P117806P836346Q033089Q406858
14295A82490624R343412R732556R886947J1006708J1135425J2014560J2251768
14288B57862000J3129054J3510256J4169926J4291036J4872749J5142418J5208368
14281C58185807J5498155J4934661J4738307J4329434J3291591J2327602J0980462
14274D54286019R041157O006245K676995N04768j23959j253002m661671n794502
14266D60682050p245880r135113r604133j2533448j4249515j4812207j5788400
14259C77313354j5813483j6206663j5935918j5786592j5086232j4635739j4376888
$$ plain form
14252 269471839 255784257 242866717 230385088 220535851 209722024 198890644 189000071
14245 189000071 179501354 171707243 163259263 155515335 148246758 141333855 134915503 129275841
14237 129275841 123666787 118180803 113100924 108183441 103701564 99458928 95877596 92005974
14229 92005974 88555146 85014506 81696831 78769246 75910765 72919756 70428178 67907739
14221 67907739 65466935 63198129 61639679 59148166 57217668 55441560 53366758 51901637
14213 51901637 50880725 49230847 47402737 46066006 44486955 43362826 42944310 41695343
14205 41695343 40174648 38783179 37693721 36673554 35727523 35757728 34620439 33239944
14197 33239944 32056586 31590996 30765240 30208052 29341197 28474784 28048773 27345629 26488149
$$ packed form
14252B69471839j3687582j2917540j2481629r849237j0813827j0831380r890573
14245A89000071r498717p794111q447980p743928p268577o912903o418352n639662
14237A29275841n609054n485984n079879m917483m481877m242636l581332l871622
14229I2005974l450828l540640l317675k927585k858481k991009k491578k520439
14221F7907739k440804k268806j558450k491513j930498j776108k074802j465121
14213E1901637j020912j649878j828110j336731j579051j124129m18516j248967
14205D1695343j520695j391469j089458j020167r46031L0205j137289j380495
14197C3239944j183358m65590q25756n57188q66855q66413m26011p03144q57480
$$ plain form
14188 26488149 25871093 25461842 24960009 24420776 23504338 23349074 23066926 22236884 21726081
14179 21726081 21289683 21047336 20511317 20053671 19472960 19123284 18610757 18788084 18014675
14170 18014675 17954534 17498429 17399233 17154595 16515836 16379227 15938209 15986231 15558510 15057835
14160 15057835 14842457 14631055 14323895 14371859 13778469 13290756 13274584 13224479 12483448 12715927
14150 12715927 12593887 12428884 11905162 12088351 11593885 11678324 11137083 11135208 10611044 10725373
14140 10725373 10580475 10513803 10191037 10343558 10359583 10027584 10110369 9799777 9312596 9242044
14130 9242044 9426437 9125155 9148539 8741438 8689758 8408640 8179106 8547290 7835924 7767190
14120 7767190 8110787 8128006 7992982 7578789 7258155 7487507 7404620 7333899 6945561 7385261
$$ packed form
14188B6488149o17056m09251n01833n39233r16438j55264k82148q30042n10803
14179B1726081m36398k42347n36019m57646n80711l49676n12527J77327p73409
14170A8014675o0141m56105r9196k44638o38759j36609m41018M8022m27721n00675
14160A5057835k15378k11402l07160M7964n93390m87713j6172n0105p41031K32479
14150A2715927j22040j65003n23722J83189m94466Q4439n41241j875n24164J14329
14140A0725373j44898o6672l22766J52521J6025l31999Q2785l10592m87181p0552
14130I242044J84393l01282K3384m07101n1680k81118k29534L68184p11366o8734
14120G767190L43597J7219j35024m14193l20634K29352q2887p0721l88338M39700
$$ plain form
14110 7385261 6990328 6854425 6649665 6667224 7053503 7011196 6763015 6452814 6217780 6290561
14100 6290561 6185409 6552528 5823661 5647436 6002932 5712687 5870404 5584051 5689942
14091 5689942 5389839 5623220 5426513 5208675 5355458 5216601 5183901 5264824 5330045 4960733
14081 4960733 5037574 4701344 5134901 4664379 4955830 4801508 4536316 4402777 4577580 4514427
14071 4514427 4307637 4496634 4535067 4267153 4700319 4621518 4226596 4353896 4552538 4364155
14061 4364155 4466598 4237372 3960284 3990805 4042079 3889152 3741478 3879801 3684580 3868396
14051 3868396 3556768 3649311 3952687 3690747 3410315 3386319 3614112 3388398 3430903 3711158
14041 3711158 3341407 3347727 3253508 3279901 3346676 3109808 2843176 2824409 3020060 3155517
$$ packed form
14110G385261l94933j35903k04760J7559L86279m2307k48181l10201k35034P2781
14100F290561j05152L67119p28867j76225L55496k90245J57717k86353J05891
14091E689942l00103K33381j96707k17838J46783j38857l2700Q0923O5221l69312
14081D960733P6841l36230M33557m70522K91451j54322k65192j33539J74803o3153
14071D514427k06790J88997L8433k67914M33166p8801l94922J27300J98642j88383
14061D364155J02443k29226k77088L0521N1274j52927j47674J38323j95221J83816
14051C868396l11628R2543L03376k61940k80432k3996K27793k25714M2505K80255
14041C711158l69751O320r4219K6393O6775k36868k66632j8767J95651J35457
$$ plain form
14031 3155517 3535227 3433990 3239243 3440493 3184628 3117498 2944263 3016264 3184792 2917636
14021 2917636 2761576 2828590 2937868 2636766 2767738 2541225 2727724 2667695 2641851 2488687
14011 2488687 2638801 2570640 2264508 2100136 2397198 2541038 2545942 2536484 2224834 2352507
14001 2352507 2674894 2044769 2349616 2093383 2351707 2235913 2389087 2330923 2331559 2420686
13991 2420686 2483508 3000434 3727314 5514263 10470333 23448811 50988161 32450888
13983 32450888 15678402 9383568 6596346 5336441 4631963 3543661 3384457 3105843
13975 3105843 3118953 3006753 2716593 2752756 2632827 2306273 2591669 2664100 2402605 2385563
13965 2385563 2464170 2220272 2477810 2303027 2263156 2281862 2168848 2086252 2028249 2018082
$$ packed form
14031C155517L79710j01237j94747K01250k55865o7130j73235P2001J68528k67156
14021B917636j56060O7014J09278l01102J30972k26513J86499o0029k5844j53164
14011B488687J50114o8161l06132j64372K97062J43840M904r458l11650J27673
14001B352507L22387o30125L04847k56233K58324j15794J53174n8164O36Q9127
13991B420686O2822N16926P26880J786949M956070J2978478K7539350j8537273
13983C2450888A5678402o294834k787222j259905p04478j088302j59204k78614
13975C105843J3110j12200k90160L6163j19929l26554K85396P2431k61495j7042
13965B385563P8607k43898K57538j74783l9871J8706j13014q2596n8003j0167
$$ plain form
13955 2018082 1718898 2059636 1939087 1999907 1962244 2164428 2194185 2187625 2035716 1778308
13945 1778308 1782598 1771131 2005459 1715845 1909844 2028815 1908478 1901685 1887781 1486096
13935 1486096 1695072 1892434 1922075 1574269 1757333 1574194 2071470 1822468 1389943 1952890
13925 1952890 1687780 1419556 1850891 1592207 1312173 1676174 1513105 1783907 1527949
13916 1527949 1627608 1693852 1660392 1530421 1168557 1424601 1433543 1242146 1313881 1546922
13906 1546922 1339257 1364524 1391289 1647301 1569430 1392128 1284022 1531858 983302 1110086
13896 1110086 1264308 1512898 1400295 1292033 1468558 1056152 1202659 1495722 976605
13887 976605 1351964 1155688 1098450 1497610 1027215 1404012 1460025 1344449 1073569 1397415
$$ packed form
13955B018082k99184L40738j20549O0820l7663K02184K9757o560j51909k57408
13945A778308M290j1467K34328k89614J93999J18971j20337o793j3904m01685
13935A486096K08976J97362K9641l47806J83064j83139M97276k49002m32525N62947
13925A952890k65110k68224M31335k58684k80034L64001j63069K70802k55958
13916A527949R9659O6244l3460j29971l61864K56044Q942j91397P1735K33041
13906A546922k07665K5267K6765K56012p7871j77302j08106K47836n48556J26784
13896A110086J54222K48590j12603j08262J76525m12406J46507K93063n19117
13887I76605L75359j96276n7238L99160m70395L76797N6013j15576k70880L23846
$$ plain form
13877 1397415 1104315 1338992 1085099 1206810 982983 1312496 1282270 1098767 1223089 1259492
13867 1259492 1050745 1176936 1439846 805439 1149026 1039484 1251110 1332848 1204807 1195275
13857 1195275 1652435 1144249 1319281 903646 879581 1238685 1213340 1037373 817199 1241350
13847 1241350 1047577 1076037 883849 929306 1093271 1147725 921048 828154 793084 758367
13837 758367 1098919 1193005 905849 948877 1338829 976816 1059183 922826 1118246 1079353
13827 1079353 838675 1274213 850582 642734 850273 802312 723032 931641 565854 723307
13817 723307 1063668 488061 776311 977925 781359 977074 774267 946631 1132796 953854
13807 953854 773837 1054241 835515 803313 837506 761969 973275 969114 880062 581792 893363
$$ packed form
13877A397415k93100K34677k53893J21711k23827L29513l0226j83503J24322L6403
13867A259492k08747J26191K62910o34407L43587j09542K11626Q1738j28041r532
13857A195275M57160n08186J75032m15635k4065L59104k5345j75967k20174M24151
13847A241350j93773K8460j92188M5457J63965N4454k26677r2894l5070l4717
13837G58367L40552R4086k87156M3028L89952l62013Q2367j36357J95420l8893
13827A079353k40678M35538m23631k07848K07539m7961p9280K08609l65787J57453
13817G23307L40361D88061K88250K01614j96566J95715k02807J72364J86165j78942
13807I53854j80017K80404k18726l2202L4193p5537K11306m161q9052k98270L11571
$$ plain form
13796 893363 978371 954092 939613 633515 990858 966986 927745 591175 506037 968272 1050472
13785 1050472 1008956 536691 836021 686138 838480 924708 732402 686386 650710 697601
13775 697601 750263 530907 795736 894309 836835 866646 835661 743089 514002 535083 626849
13764 626849 624210 843558 502916 894129 907954 844154 711439 674857 623164 663778 584545
13753 584545 770027 840763 427009 674810 763765 680367 598722 940836 340172 332625 527492
13742 527492 662265 593145 524159 871147 786447 725185 579985 743311 514972 654407
13732 654407 698941 623967 519292 625259 909212 601192 633382 631825 412622 469569 336399
13721 336399 516420 590507 779744 538622 631896 339655 390038 359032 590539 650887
$$ packed form
13796H93363Q5008k4279j4479l06098L57343k3872l9241l36570q5138M62235Q2200
13785A050472m1516m72265K99330j49883J52342Q6228j92306m6016l5676M6891
13775F97601N2662k19356K64829R8573n7474K9811l0985r2572k29087K1081R1766
13764F26849k639K19348l40642L91213J3825o3800j32715l6582n1693M0614p9233
13753E84545J85482P0736m13754K47801Q8955q3398q1645L42114C40172p547J94867
13742E27492J34773o9120o8986L46988q4700o1262j45200J63326k28339J39435
13732F54407M4534p4974j04675J05967K83953l08020L2190j557k19203N6947j33170
13721C36399J80021P4087J89237k41122R3274k92241N0383l1006K31507O0348
$$ plain form
13711 650887 602682 589562 639481 799005 600091 246726 499173 549460 626216 767801
13701 767801 315995 562830 468315 444567 504827 632442 666371 652231 763080 485652
13691 485652 537307 659220 598598 447895 551089 422361 289353 500312 449227 556090
13681 556090 698781 527695 693215 590243 302414 395549 431407 418349 401379 475531
13671 475531 592752 419041 337187 460986 209284 346286 561375 218519 378334 589632
13661 589632 827132 377787 391795 332395 431571 442499 291634 341943 270293 398907 413328
13650 413328 462312 300926 449293 285164 131682 447637 523554 641400 125395 438203
13640 438203 462530 667649 235753 490206 256320 304680 569982 170501 415319 793012
$$ packed form
13711F50887m8205j3120M9919J59524j98914B46726K52447N0287P6756J41585
13701G67801C15995K46835r4515k3748O0260J27615L3929j4140J10849k77428
13691D85652N1655J21913o0622j50703J03194j28728j33008K10959n1085J06863
13681E56090J42691j71086J65520j02972k87829R3135L5858j3058j6970P4152
13671D75531J17221j73711q1854J23799B09284J37002K15089B18519J59815K11298
13661E89632K37500C77787J4008n9400R9176J0928j50865N0309p1650J28614J4421
13650D13328M8984j61386J48367j64129A31682L15955P5917J17846A25395L12808
13640D38203K4327K05119B35753K54453k33886M8360K65302A70501K44818L77693
$$ plain form
13630 793012 392815 501743 299763 282473 465343 480773 433512 725993 716551 92011 -1448
13618 397116 338710 224396 237421 260375 264460 392435 399746 358778 474338 405841 203945
13607 203945 329201 266191 416323 256052 394255 845350 598037 559132 335362 219010
13597 219010 225687 629865 -24090 444511 144552 671632 375229 214993 525449 444596
13587 444596 500830 417215 538269 352019 415365 543079 334510 274517 595248 568795
13577 568795 559787 310576 376095 123103 414184 120300 505796 328396 -81011 288470
13566 71746 303191 350815 288688 245478 497497 393450 176211 239265 291255 504198 285047
13555 285047 239485 224071 404205 369804 218629 338630 288069 177649 91579 -76306 297106
$$ packed form
13630G93012C92815J08928k01980j7290J82870J5430m7261K92481r442I2011a448
13618C97116n8406j14314J3025K2954M085J27975P311m0968J15560o8497k01896
13607B03945J25256o3010J50132j60271J38203M51095k47313l8905k23770j16352
13597B19010O677M04178b4090D44511A44552N27080k96403j60236L10456q0853
13587D44596N6234q3615J21054j86250O3346J27714k08569n9993L20731k6453
13577E68795r008k49211O5519A23103K91081A20300L85496j77400h1011B88470
13566G1746K31445M7624o2127m3210K52019j04047A76211O3054N1990K12943k19151
13555B85047m5562j5414J80134l4401j51175J20001n0561j10420q6070g6306B97106
$$ plain form
13543 338835 152502 399764 219633 427691 205153 582138 329443 305138 243774 269132
13533 269132 74499 126116 463619 509868 203667 36472 327250 288479 339357 491183 162535
13521 109503 480379 390354 383026 235555 263255 295728 107600 328525 146459 519194
13511 519194 219805 -13735 707763 534225 376278 219555 499315 140714 385077 191825
13500 -31589 -155606 521118 351593 485315 142324 536934 89532 114105 235712 177813
13490 177813 148153 -29786 337166 90286 408149 297461 -90134 326046 258073 45554 318682
13479 318682 598076 325631 374829 383692 226458 23362 414436 200258 216232 579950
13469 579950 222307 386340 165707 435198 -30921 378603 71950 31442 15497 501647
$$ packed form
13543C38835A52502K47262j80131K08058B05153L76985k52695k4305o1364K5358
13533B69132G4499N1617L37503M6249B03667C6472K90778l8771N0878J51826A62535
13521A09503L70876r0025p328j47471K7700L2473A07600K20925A46459L72735
13511E19194B19805a3735G07763j73538j57947j56723K79760A40714K44363A91825
13500c1589j24017E21118j69525J33722A42324L94610H9532K4573J21607n7899
13490A77813k9660b9786C37166I0286L17863j10688i0134C26046o7973D5554K73128
13479C18682K79394k72445M9198Q863j57234B3362L91074B00258J5974L63718
13469E79950B22307J64033A65707K69491c0921C78603G1950C1442A5497M86150
$$ plain form
13459 501647 70171 32457 205031 62958 261539 406497 117786 150780 236175 100623
13448 55541 139915 217846 148841 192327 394838 81249 114555 405564 90744 352207 169183
13436 -26145 96744 303623 83338 352047 161359 388330 57285 73338 300163 587129
13426 587129 124916 213764 283001 -3179 -1326 166150 269586 167141 344369 110888 94616
13415 94616 195126 286619 291572 -128128 16034 172644 440263 256385 -37747 331315 86383
13403 151585 109768 112145 154351 436400 10609 270640 -263012 289439 -17807 68742 185499
13392 185499 265467 554210 -42282 97086 55153 334462 296830 516160 -98000 86010 -63677
13380 113856 119760 323418 261850 111023 48169 -25568 -220881 276992 220682 256029 204232
$$ packed form
13459E01647G0171C2457J72574F2958J98581J44958A17786L2994Q5395A00623
13448E5541Q4374P7931o9005M3486K02511H1249L3306K91009I0744K61463A69183
13436b6145I6744K06879H3338K68709A61359K26971E7285J6053K26825K86966
13426E87129A24916Q8848O9237c179a326A66150J03436j02445J77228A10888j6272
13415I4616J00510R1493M953a28128A6034J56610K67619j83878c7747C31315H6383
13403A51585m1817K377M2206K82049A0609K60031b63012B89439a7807F8742J16757
13392A85499P9968K88743d2282I7086m1933K79309l7632K19330i8000H6010f3677
13380A13856N904K03658o1568A11023D8169b5568j95313B76992n6310L5347n1797
$$ plain form
13369 204232 520681 243001 191491 17667 332143 385409 2287 101793 131867 -75265 -141269
13358 -141269 632925 144877 63605 -130963 73436 34642 -89475 -123215 -52672 458893 7444
13346 150098 39090 535100 460638 556396 285285 350503 250318 504231 321004 115557
13335 125814 19291 196133 -21098 331861 209229 252003 272528 162351 163178 345654 153389
13323 384059 271624 83450 37644 49520 52481 418930 267287 341786 209383 334326 318135
13312 318135 98534 66165 -147654 8540 23011 161325 36905 -38513 18984 34206 216585
13301 216585 166268 142576 204639 181103 350161 91034 285540 351893 190192 -133396 331691
13289 25849 253477 227378 509363 170435 76876 136157 255388 29707 391654 213327
$$ packed form
13369B04232L16449B43001n1510A7667L14476N3266B287R9506L0074g5265o6004
13358a41269F32925A44877F3605a30963G3436C4642h9475l3740e2672D58893G444
13346A50098C9090M96010p4462R5758k71111O5218j00185K53913j83227A15557
13335A25814A9291J76842b1098C31861j22632M2774K0525j10177Q27J82476A53389
13323C84059j12435H3450C7644J1876K961L66449j51643P4499j32403J24943j6191
13312C18135I8534l2369a47654H540J4471J38314C6905c8513A8984J5222J82379
13301B16585n0317k3692O2063k3536J69058I1034J94506O6353j61701a33396C31691
13289B5849K27628k6099K81985A70435G6876N9281J19231B9707L61947j78327
$$ plain form
13279 213327 161213 437513 176233 69862 461550 24031 242471 -32553 46453 266032
13269 266032 74372 294547 -81779 6593 -84025 -287794 323550 261518 189429 155875 614993
13258 614993 213898 6622 187162 340318 174716 -178294 238711 313174 238524 123227
13248 123227 179139 -299013 226675 146694 116238 -17568 220256 -63171 283360 58538 256546
13237 256546 121232 190222 14785 352714 70725 183832 -31812 92459 47617 -61503 77584
13225 39938 -84588 374076 26396 6359 71663 119818 6639 -176435 205130 -61474 61346
13213 242941 -3300 207013 -127054 388650 -296337 161339 263747 33791 -32668 317953
13202 -64913 -81443 -79141 335672 321321 169305 297510 188478 -112541 69448 187744 76333
$$ packed form
13279B13327n2114K76300A76233F9862L91688B4031K18440c2553D6453K19579
13269B66032G4372K20175h1779F593h4025k03769C23550o2032p2089l3554M59118
13258F14993B13898F622J80540J53156j65602a78294B38711P4463p4650j15297
13248A23227N5912b99013B26675p9981l0456a7568B20256f3171B83360E8538J98008
13237B56546A21232O8990A4785L37929G0725J13107c1812I2459m4842f1503G7584
13225C9938h4588C74076B6396F359O5304M8155F639a76435B05130f1474F1346
13213B42941c300B07013a27054C88650b96337A61339J02408C3791c2668C17953
13202f4913j6530K302C35672j4351j52016J28205j09032a12541F9448J18296G6333
$$ plain form
13190 -83823 -99042 319122 154167 309624 -52384 -228062 -86454 -90561 244340 211781 -131642
13178 119935 5867 95749 -77413 165626 99272 21398 -154233 219138 360267 75974 -94615
13166 -90710 54522 -319942 -196619 172156 32338 202732 -185082 -30136 199935 39160
13155 66234 239388 38163 101013 -196906 -100589 -287270 79766 -151907 -184917 -116594 470765
13143 -119935 184561 9878 329231 84826 175851 -284732 -21343 -52532 139192 39885 -154578
13131 5057 214784 -36594 70805 239490 126227 -36492 42914 -38395 -255860 59947 76741
13120 76741 -200963 -49892 58070 -7866 -132655 -8492 -55960 51247 412400 -235190 -42309
13108 37666 281370 -89498 -239249 161714 -318462 298580 27807 97423 -23285 219343
$$ packed form
13190h3823j5219C19122A54167J55457e2384j75678h6454m107B44340l2559a31642
13178A19935E867Q9882g7413A65626o6354B1398a54233B19138J41129G5974i4615
13166i0710E4522c19942J23323A72156C2338J70394a85082c0136A99935C9160
13155F6234J73154C8163O2850a96906R6317j86681G9766a51907l3010O8323D70765
13143a19935A84561I878L19353H4826R1025b84732b1343l1189A39192C9885a54578
13131E057K09727c6594G0805J68685j13263c6492D2914c8395k17465E9947J6794
13120G6741b00963d9892E8070g866j24789h492m7468E1247L61153b35190d2309
13108C7666K43704h9498j49751A61714c18462B98580B7807O9616b3285B19343
$$ plain form
13097 22864 70662 270719 -21074 128074 -17507 75457 71060 182177 -178224 -126662 320457
13085 99881 51642 112708 -44720 229746 -20149 181094 65711 61741 -54064 -50251 -97313 -50377
13073 -50377 88681 80485 316309 -18006 102020 319063 144501 83927 100130 -56130 46633
13061 201464 161390 338791 76094 193982 129885 16884 172713 92696 -214363 -76115 -10210
13049 40558 190720 162763 486236 -115293 -195903 155596 94950 -261032 179814 6158 -365694
13037 254604 48221 177172 172899 84354 142778 25562 339638 42485 406263 121303 -93970
13025 -54597 354121 117758 65846 107858 -25074 -76770 182077 -227041 -170269 288604 304660
13014 304660 -123393 380227 -405244 425741 -27381 111682 124124 183491 -39760 315552
$$ packed form
13097B2864M7798K00057b1074A28074a7507G5457m397J11117a78224N1562C20457
13085I9881m8239O1066d4720B29746b0149A81094F5711l970e4064L813m7062M6936
13073e0377H8681q196K35824a8006A02020K17043A44501o0574J6203e6130D6633
13061B01464m0074J77401G6094J17888o4097A6884J55829q0017b14363g6115a0210
13049D0558J50162k7957L23473a15293q0610A55596o0646b61032A79814F158c65694
13037B54604D8221J28951m273H4354N8424B5562L14076D2485L63778A21303i3970
13025e4597C54121A17758n1912M2012b5074n1696A82077b27041N6772B88604J6056
13014C04660a23393C80227d05244D25741b7381A11682J2442N9367c9760C15552
$$ plain form
13003 -209341 -130639 418323 133816 -23362 -18531 241688 -224723 -215641 157946 -21726 50
12991 92207 -276277 71497 -70715 232485 250120 198299 -93128 -244791 -138765 241493 -25907
12979 175427 69005 -358651 80271 57570 73830 -237144 -361446 -61930 56217 -47004 134308
12967 94872 216285 -296080 -194692 29686 5420 109641 17896 -118186 188423 -81504 146054
12955 -72487 -5846 175647 94271 -219936 -171819 -257518 157143 -56513 -34580 139632 -240356
12943 -105542 -290957 -22912 59188 207878 -398197 -137235 20544 260397 74826 -96889
12932 6904 -48597 -22622 -76703 512859 59288 51905 -5547 90497 317315 233913 -157810 83655
12919 -129834 -173918 51669 201565 -241725 -147741 21290 -131311 207750 3435 -140674 14605
$$ packed form
13003b09341P8702D18323A33816b3362M831B41688b24723R082A57946b1726E0
12991I2207b76277G1497g0715B32485J7635n1821i3128j51663J06026B41493b5907
12979A75427F9005c58651H0271k2701J6260b37144j24302f1930E6217d7004A34308
12967I4872J21413b96080J01388B9686E420J04221A7896a18186A88423h1504A46054
12955g2487e846A75647q1376b19936M8117q5699A57143e6513K1933A39632b40356
12943a05542j85415b2912E9188J48690c98197a37235B0544K39853G4826i6889
12932F904d8597b2622n4081E12859E9288p383e547I0497K26818q3402a57810H3655
12919a29834m4084E1669J49896b41725R3984B1290a31311B07750C435a40674A4605
$$ plain form
12907 117778 -65420 -30781 234234 9445 34234 102915 41099 -92688 56786 -25774 -5431 -278523
12895 -278523 -101878 -62395 -108453 69915 -102755 89304 -170488 107925 125805 -22209 -133662
12884 -133662 -237909 -26493 318287 58664 -23092 14031 -372601 159075 -147308 62640
12873 27563 131764 212354 835 244883 304754 201760 190878 174565 -154786 -196085 171310
12861 194965 16338 -103441 7243 233985 193732 72276 -326282 122038 -176791 -34773 -204930
12850 -204930 246677 -127340 -90066 -63902 -5053 16218 13108 209648 44524 188461 -174456
12838 272419 112631 51933 11712 -19874 121556 855 -136709 -161171 -206225 315157 -56055
12826 -216983 -53599 52506 75291 165611 -73853 23511 -310321 186259 7155 -8151 -131722
$$ packed form
12907A17778f5420c0781B34234I445K4789O8681D1099i2688E6786b5774e431k73092
12895b78523a01878L9483m6058F9915a02755H9304a70488A07925J7880b2209j11453
12884a33662j04247b6493C18287E8664b3092A4031c72601A59075a47308F2640
12873B7563J04201Q0590H35K44048N9871j02994j0882j6313a54786m1299A71310
12861A94965A6338a03441G243K26742m0253G2276c26282A22038a76791c4773j70157
12850b04930B46677a27340L7274K6164e053A6218l110J96540D4524J43937a74456
12838B72419A12631E1933A1712a9874A21556H55a36709k4462m5054C15157e6055
12826b16983e3599E2506K2785R0320g3853B3511c10321A86259G155h151j23571
$$ plain form
12815 -131722 -165641 80942 -69748 93188 257914 300522 90576 1714 106678 -17627 228859
12803 395870 222784 172878 16952 168301 -28244 74461 -18938 187323 67551 181382 -93477
12791 43333 63543 68051 -182254 -258726 -201893 -57603 89866 -300481 -29414 -3982 -57189 257970
12778 -79561 -370781 252957 -47363 193869 -177890 298587 -497217 -4943 54397 340833
12768 340833 -198457 143644 -60757 -58788 34175 335792 40068 423753 127813 361005
12758 361005 7639 -149155 28337 -230585 -107059 3661 -12107 7557 172538 53199 -65693
12746 -124419 191265 217117 -322766 47304 -72985 159105 -194061 300315 -23336 57738
12735 130050 188316 110803 34291 162071 -50511 30995 132757 -21212 -240038 -98278 229286
$$ packed form
12815a31722l3919H0942f9748I3188J64726M2608I0576A714J04964a7627B28859
12803C95870j73086m9906A6952J51349b8244G4461a8938A87323F7551J13831i3477
12791D3333K0210M508a82254p6472N6833e7603H9866c00481b9414c982n3207B57970
12778g9561k91220B52957d7363A93869a77890B98587d97217d943E4397K86436
12768C40833a98457A43644f0757J969C4175L01617D0068L83685A27813K33192
12758C61005G639a49155B8337b30585a07059C661a2107G557J64981E3199f5693
12746a24419A91265K5852c22766D7304g2985A59105a94061C00315b3336E7738
12735A30050N8266p7513C4291J27780e0511C0995J01762b1212k18826i8278B29286
$$ plain form
12723 -11678 28126 -68454 -116573 -52673 -2918 14278 243866 261101 16996 -201067 125492
12711 -19400 -161959 61348 51157 60452 245823 246180 35867 17564 75251 330417 321957 59218
12698 357206 -182446 27358 -245055 24622 272510 -1290 221249 175719 -275171 106641
12687 111054 73367 -135513 115860 -69199 219169 129325 -43869 -580 244656 76625 304207
12676 304207 -139169 138347 -14901 116028 24942 -26993 -113736 -241124 40989 -183410
12665 90838 188150 307822 204200 222792 -164404 -28605 148086 24455 -121117 40668 -77612
12653 -63827 124956 236852 2615 -91689 230806 202987 33393 -252497 -209874 68012 -285319
12641 -54677 929 -20398 -187402 -426737 178774 -154387 44470 -47759 -180548 210331 226175
$$ packed form
12723a1678B8126f8454m8119e2673b918A4278K29588J7235A6996b01067A25492
12711a9400j42559F1348j0191R295J85371L57C5867A7564N7687K55166q460E9218
12698C57206a82446B7358b45055B4622K47888a290B21249m5530b75171A06641
12687A11054l7687a35513A15860f9199B19169q9844d3869e80B44656G6625K27582
12676C04207a39169A38347a4901A16028B4942b6993q6743j27388D0989a83410
12665I0838R7312J19672j03622J8592a64404b8605A48086B4455a21117D0668g7612
12653f3827A24956J11896B615i1689B30806k7819C3393b52497M2623F8012b85319
12641e4677I29b0398j67004k39335A78774a54387D4470d7759j32789B10331J5844
$$ plain form
12630 226175 -159033 -68339 259332 60673 213568 -73372 -13474 95122 10011 59169 110563
12619 110563 -21397 -54529 52681 -212659 157245 -190481 -30683 88745 -1027 121679 -247787
12607 99367 216671 293308 -143503 -130474 43514 -54058 12508 -7116 191573 126777 -43056
12595 -216042 78958 -341028 -199771 102705 -378389 133304 43671 -40836 -207296 -27209
12584 -234274 184193 95512 10296 -50999 35991 216948 146921 10445 -149710 -91454 -95124
12573 -95124 130124 -263260 13227 111934 133271 -85633 96329 -83444 182925 -177339 230722
12561 -150525 -38891 -165582 93530 118786 -26146 118493 39071 239786 205477 218701 206562
12550 206562 70458 -113591 -251796 363016 85618 -28222 141939 -300678 -40873 -181821
$$ packed form
12630B26175a59033f8339B59332F0673J52895g3372a3474I5122A0011M9158N1394
12619A10563b1397l3132E2681b12659A57245a90481c0683H8745a027A21679b47787
12607I9367J17304P6637a43503J3029D3514e4058A2508g116A91573o4796d3056
12595b16042G8958c41028J41257A02705c78389A33304D3671d0836j66460b7209
12584b34274A84193q8681A0296e0999C5991J80957p0027A0445a49710N8256l670
12573i5124A30124b63260A3227R8707K1337h5633I6329h3444A82925a77339B30722
12561a50525c8891j26691I3530K5256b6146A18493C9071K00715l4309J3224j2139
12550B06562G0458a13591j38205C63016H5618b8222A41939c00678d0873j40948
$$ plain form
12540 -181821 -182981 169232 152556 80038 230445 50777 -138138 388866 246940 22106 60716
12529 60716 -104219 -543325 152854 -150954 55673 -94206 71436 140092 12833 -76112 -201806
12518 -201806 212073 36978 -75466 201220 -236546 -560482 -97269 -114821 249087 -36763
12507 -22619 -48806 -120484 -27732 91033 277768 244847 92233 154691 123720 -34505 -121975
12496 -121975 198373 132997 366890 -240181 -54810 36856 -27493 26777 -153656 -60404 -114461
12485 -114461 -28001 -79415 -146398 -59312 62443 234369 5741 34120 166761 79400 117446
12474 117446 -118675 244869 123729 -17592 -306144 171067 -92132 30115 -7272 -122732
12464 -122732 38119 -93417 276707 -188679 86263 38951 439503 25658 -119552 123543
$$ packed form
12540a81821j160A69232j6676p2518J50407E0777a38138C88866j41926B2106L8610
12529F0716a04219m39106A52854a50954E5673i4206G1436O8656A2833g6112j25694
12518b01806B12073C6978g5466B01220b36546l23936i7269j7552B49087c6763
12507b2619k6187p1678b7732I1033J86735l2921I2233O2458l0971c4505q7470
12496a21975A98373o5376K33893b40181e4810C6856b7493B6777a53656f0404n4057
12485a14461b8001n1414o6983e9312F2443J71926E741K8379J32641G9400L8046
12474A17446a18675B44869j21140a7592k88552A71067i2132C0115g272j15460
12464a22732C8119i3417B76707a88679H6263C8951M00552B5658a19552A23543
$$ plain form
12453 147585 -341074 207293 -90598 -27840 -130086 -161669 252067 -137997 11254 156392
12443 156392 56697 186507 36580 147695 426277 -150996 53542 -218909 138666 15078
12432 -224420 -492659 -140345 130354 130151 152675 -169906 17400 194501 -100555 -194089 183961
12420 -142450 -234693 158812 -76976 -106543 90154 4022 -116504 -31006 47665 359904 237213
12409 237213 -112444 178598 440953 -108984 -111017 172895 -144731 -200871 -200029 194792 -129872
12397 -80434 46365 -25205 -201431 48381 99666 -22145 -207920 204683 71864 -103283 92195
12385 133402 185303 -268973 83034 82397 -14510 63194 -26521 17113 338489 353611 -38343
12373 279342 8146 -86575 117622 -175442 -82537 311645 253907 -29577 -112222 -145446 -261497
$$ packed form
12453A47585c41074B07293i0598b7840j02246l1583B52067a37997A1254J45138
12443A56392E6697J29810C6580J11115K78582a50996E3542b18909A38666A5078
12432b24420k68239a40345A30354k03K2524a69906A7400J77101a00555r3534A83961
12420a42450r2243A58812g6976k9567I0154D022a16504c1006D7665L12239j22691
12409B37213a12444A78598K62355a08984k033A72895a44731n6140Q42A94792a29872
12397h0434D6365b5205j76226D8381N1285b2145j85775B04683G1864a03283I2195
12385A33402N1901b68973H3034o37a4510F3194b6521A7113L21376J5122c8343
12373B79342H146h6575A17622a75442h2537C11645n7738b9577q2645l3224j16051
$$ plain form
12362 -261497 -17963 38075 -26432 21157 -180578 -5792 -220916 106930 -35775 37978 417465
12351 417465 -5252 52732 159651 -40287 -34450 -195969 131535 235362 60056 17608 -22507
12339 41496 54655 98324 53958 -39111 -248089 252210 348752 209007 46365 316898 10033
12327 329055 243855 185650 82672 171129 332945 157591 373010 -51397 -118610 17802 124786
12316 124786 55424 -78779 -61556 204989 45833 209655 -98011 75438 381 -308770 55188
12304 68741 52560 5307 163213 -59151 -194332 -148361 -282050 225312 19335 -14553 68554
12292 -78532 113208 94293 51715 333973 49800 91771 365259 -149293 57016 365659 7456
12280 119401 74042 101763 615913 242055 324463 200764 86428 82858 336454 136951 171794
$$ packed form
12362b61497a7963C8075b6432B1157a80578e792k15124A06930c5775C7978L79487
12351D17465e252E2732J06919d0287N837j61519A31535J03827F0056A7608b2507
12339D1496J3159M3669m4366c9111k08978B52210R6542j39745D6365K70533A0033
12327C29055q5200n8205H2672Q8457J61816A57591K15419e1397o7213A7802J06984
12316A24786E5424g8779J7223B04989D5833J63822i8011G5438C81c08770E5188
12304F8741j6181E307J57906e9151j35181M5971j33689B25312A9335a4553F8554
12292g8532A13208j8915m2578K82258D9800M1971K73488a49293E7016L08643G456
12280A19401m5359K7721N14150B42055Q2408j23699H6428l570K53596A36951L4843
$$ plain form
12269 171794 357840 198820 324225 441938 -56969 27209 329200 261928 102452 424763
12259 424763 262703 -91315 45953 223715 186309 106334 196214 139152 -242292 339226 108371
12247 244041 322991 160042 -388903 -38614 147310 245147 116182 186906 302033 171300
12237 171300 166454 82900 199921 263282 203269 21812 388585 58276 152898 46174 99229
12226 99229 -133013 564521 -45153 -47869 423520 333114 245649 360966 285460 252830 -75065
12214 130975 444876 -40561 298990 73816 263653 -133558 13628 287391 13217 242458
12204 242458 18802 376429 282840 318997 211139 384573 113300 154747 -11500 15280 421846
12193 421846 31785 55538 32097 77252 414997 213094 134023 67976 -62666 17182 94767
$$ packed form
12269A71794J86046j59020J25405J17713e6969B7209L01991o7272A02452L22311
12259D24763j62060i1315D5953J77762l7406p9975Q9880n7062b42292C39226A08371
12247B44041P8950A60042c88903c8614A47310R7837A16182P0724J15127j30733
12237A71300m846H2900J17021O3361o0013B1812L66773E8276R4622D6174N3055
12226I9229a33013E64521d5153k716D23520r0406q7465J15317p5506l2630g5065
12214A30975L13901d0561B98990G3816J89837a33558A3628K73763A3217K29241
12204B42458A8802L57627r3589L6157j07858J73434A13300M1447a1500A5280M06566
12193D21846C1785K3753k3441M5155L37745k01903p9071o6047f2666A7182P7585
$$ plain form
12182 94767 213113 61153 -82921 524110 369570 -63864 221368 311096 62285 115683 262605
12171 262605 36861 -35984 379248 587550 273483 208960 108150 -19392 450715 127078
12160 16941 26868 2683 85332 170477 126243 -180038 -50338 -21433 25044 -148821 59064 -102567
12147 -25367 274252 230758 163731 -6497 129593 155418 451995 240485 178096 158403 -111065
12135 -182298 -226213 -11666 140685 42031 383448 -153770 109661 258773 -304338 208142
12124 228608 -32997 262726 210143 418372 111493 -137379 584962 144998 181970 -109507
12113 -88114 -104742 -307279 184912 30324 -39996 -176564 249900 -37621 -21261 170615 -175964
12101 339657 341559 -56486 93349 117944 325127 212445 318936 117594 362562 -6075 240551
$$ packed form
12182I4767J18346F1153h2921E24110j54540f3864B21368Q9728F2285N3398J46922
12171B62605C6861c5984C79248K08302B73483o4523j00810a9392D50715A27078
12160A6941R927B683Q2649Q5145m4234a80038e0338b1433B5044a48821E9064a02567
12147b5367B74252m3494o7027f497A29593K5825K96577k11510o2389j9693a11065
12135a82298m3915a1666A40685D2031L41417a53770A09661J49112c04338B08142
12124B28608c2997B62726n2583K08229A11493a37379E84962A44998L6972a09507
12113h8114j6628k02537A84912C0324c9996j36568B49900c7621J6360A70615a75964
12101C39657J902e6486I3349K4595K07183j12682J06491A17594K44968f075B40551
$$ plain form
12089 561715 132313 -89821 -57504 -91238 263427 318966 -140257 343555 -107934 285798
12078 46331 365939 485499 207618 131033 -153559 107897 971 299155 211548 373507 181574
12066 -40204 360168 -35548 -28071 509801 24128 181589 49280 150356 79039 -25294 -6069
12054 1828 90311 62282 23617 216517 292833 304045 -328879 80727 -74396 76363 249843
12043 249843 21454 -24968 202732 71759 249084 62343 -19672 -26899 60523 47639 -292414
12031 323329 131256 85588 -315087 8943 120689 -27783 382613 83643 271359 266547 -162942
12019 -64763 104407 -147814 334425 -153240 92843 123324 -416105 -150735 -178385 284796
12008 45398 -27673 -25963 -27482 355492 -61572 -83252 -157144 -196786 20613 -270944 -2340 375399
$$ packed form
12089E61715A32313h9821L2317l3734B63427N5539a40257C43555a07934B85798
12078D6331L19608J19560B07618p6585a53559A07897I71K98184q7607J61959A81574
12066d0204C60168c5548P477E09801B4128J57461D9280J01076p1317b5294f069
12054A828Q8483k8029B3617J92900P6316J1212c28879H0727g4396G6363J73480
12043B49843B1454b4968B02732G1759J77325F2343a9672p227F0523j2884b92414
12031C23329A31256m5668c15087H943J11746b7783C82613H3643J87716m812a62942
12019f4763A04407a47814C34425a53240I2843L0481d16105a50735k7650B84796
12008D5398b7673J710j519C55492f1572k1680p3892l9642B0613b70944b340C75399
$$ plain form
11995 271658 -293104 126791 -277110 -80971 209124 130630 192580 -3298 6605 14685 58132
11984 58132 -503296 296 -7126 14697 -352316 185042 -87294 16508 237772 -311488 -91878
11972 -240044 -227774 -127273 280156 65175 220385 -98236 96551 -124938 -234172 -294587
11962 -294587 -246976 7606 -463992 -51922 -182124 5002 104714 -47461 239921 -48741 86718
11950 -139907 54808 -205562 63818 100831 -192756 -207178 -575462 87133 -147362 114507
11939 332735 -100553 -5301 -154557 -159650 -151184 257620 82601 -42822 -142111 157718 -396582
11927 149836 134646 -23523 14470 -23103 183704 319198 51322 -123445 -73819 -40455 224035
11915 175533 -245361 9504 -35357 105566 -67172 -16436 -47955 -10173 -174422 -191700 -15067
$$ packed form
11995B71658b93104A26791b77110h0971B09124p8494O1950c298F605Q080M3447
11984E8132e03296B96g126A4697c52316A85042h7294A6508K21264c11488i1878
11972b40044J2270J00501B80156F5175J55210i8236I6551a24938j09234o0415
11962b94587M7611G606d63992e1922j30202E002R9712d7461B39921d8741H6718
11950a39907E4808b05562F3818L7013a92756j4422l68284H7133a47362A14507
11939C32735a00553e301j49256n093Q466B57620H2601d2822r9289A57718c96582
11927A49836j5190b3523A4470b3103A83704J35494E1322a23445M9626L3364B24035
11915A75533b45361I504c5357A05566f7172a6436l1519a0173j64249j7278a5067
$$ plain form
11903 92877 -85829 -180067 53751 107121 51639 -103602 15391 -5456 -17376 198238 -194195
11891 304085 164392 283784 -90216 -121717 -227171 -389193 -60910 -28108 216157 149186
11881 149186 -26601 -379654 -187874 -367201 -262650 100480 -39880 -124665 25843 -286939
11870 -491548 -160012 -110037 -126400 212495 -55124 -161323 46377 -70475 191047 119427 4560
11858 152974 -327303 -25495 -132877 -79667 35985 -13390 -205805 -95875 -211890 83616 -147250
11846 -262787 -251120 -238314 -12466 -120281 -140059 -252240 23851 54103 -208068 293132 -213157
11834 -1171 -64150 -207916 119183 -149612 40995 50770 105766 -72100 177873 -34722 185 83350
11822 83350 34345 -77520 -11181 78477 -100804 -140502 -27674 -192819 505960 -69359 50170
$$ packed form
11903I2877h5829r4238E3751N3370E1639a03602A5391e456j1920A98238a94195
11891C04085j39693J19392i0216l1501j05454j62022f0910b8108B16157o6971
11881A49186b6601l53053a87874j79327J04551A00480c9880q4785B5843b86939
11870d91548a60012M9975j6363B12495e5124j06199D6377g0475A91047p1620D560
11858A52974c27303b5495j07382N3210C5985a3390j92415i5875j16015H3616a47250
11846b62787J1667J2806a2466j07815j9778j12181B3851L0252b08068B93132b13157
11834a171o2979j43766A19183a49612D0995R775N4996g2100A77873c4722A85Q3165
11822H3350C4345g7520a1181G8477a00804l9698b7674j65145E05960f9359E0170
$$ plain form
11810 291935 167303 -231209 -279775 222276 -129706 -108052 -324342 104954 -17194 67244
11799 129026 99756 -31856 107966 -173112 -53986 31840 -129709 -910 11995 -117562 -110280
11788 -110280 8427 199873 -264275 72681 -252019 -31908 -586529 -423558 -58602 276849
11777 78526 147610 170 -57504 -86968 21496 75025 49164 114817 14599 104609 -183089 -39348
11764 139148 94296 73742 -56024 124495 354760 93605 -15730 -269233 -100011 368694
11753 -37305 -248577 -3577 498880 90357 -171279 124870 216734 -304059 150726 -7123 -161542
11742 -161542 79903 123615 357749 261395 -404435 -151889 -199103 224572 47639 -250778
11731 -370910 203690 88759 -76052 -40826 -66588 169937 -29647 -19505 -200742 112338 -120457
$$ packed form
11810B91935j24632b31209m8566B22276a29706K1654k16290A04954a7194F7244
11799A29026k9270c1856A07966a73112e3986C1840a29709i10A1995a17562P282
11788a10280H427J91446b64275G2681b52019c1908n54621J62971e8602B76849
11777G8526O9084A70e7504k9464B1496N3529k5861O5653A4599R0010a83089c9348
11764A39148m4852k0554e6024A24495K30265I3605a5730k53503a00011C68694
11753c7305k11272c577D98880I0357a71279A24870R1864c04059A50726g123j54419
11742a61542G9903M3712K34134r6354d04435a51889m7214B24572D7639b50778
11731c70910B03690H8759g6052L5226k5762A69937b9647J0142j81237A12338a20457
$$ plain form
11719 -283474 25914 164828 -110225 -87978 108431 248854 330 -188172 127096 31718 57355
11708 57355 194304 78449 -112081 -70850 -113127 94839 246001 143958 -289363 -10083 16331
11696 -170613 181315 74659 92778 91056 -264510 272203 287517 100659 113350 -28578 -84153
11685 -84153 130182 -136858 252177 -2328 -79856 -145015 58097 52972 -45043 -6851 -42971 182751
11672 124551 84688 246171 113386 106199 209147 -466757 246178 36133 193790 177788
11662 177788 -205524 16504 -2528 -29038 187238 51465 -138812 -257776 -115599 89271 -270931
11650 -106216 194909 -169024 213843 -112053 -348715 -102202 106977 -145006 -144998 -284947
11640 -284947 -63186 -265158 107142 -11041 -63111 24555 82 -131590 174917 -70503 -102860
$$ packed form
11719b83474B5914J38914a10225K2247A08431J40423C30a88172A27096C1718K5637
11708E7355J36949G8449a12081M1231m2277I4839J51162j02043b89363a0083A6331
11696a70613A81315G4659J8119j722b64510B72203J5314A00659J2691b8578n5575
11685h4153A30182a36858B52177b328p7528o5159E8097n125d5043f851l6120A82751
11672A24551l9863J61483A13386p187J02948d66757B46178C6133J57657j6002
11662A77788b05524A6504b528k6510A87238E1465a38812j18964a15599H9271b70931
11650a06216A94909a69024B13843a12053k36662a02202A06977a45006Qj39949
11640b84947f3186k01972A07142a1041n2070B4555H2a31590A74917g0503l2357
$$ plain form
11629 -102860 -251565 -351737 -300891 248564 -42221 157279 80932 85481 116509 108182 109181
11618 109181 303484 304189 146308 62458 137686 159169 -111165 -48031 -43347 -139908 246423
11606 109717 101176 -111821 186791 -127647 92933 47561 112384 -219693 19185 30198 124412
11595 124412 30390 26161 -259691 79207 93548 301050 -55955 -237456 -126949 -64586 14169
11583 34470 9526 -218660 35348 158766 63175 33840 125719 138753 -148239 13868 -14358
11571 123308 -207862 121691 258651 -327453 46722 -10425 14621 65871 121228 -75243 32603
11559 97936 127852 -16839 132607 43554 229782 70799 -29653 -144135 467766 303859 -261332
11547 -34294 -135544 175744 -297038 197670 -11116 -60121 -63223 460085 -153029 365649
$$ packed form
11629a02860j48705j00172N0846B48564d2221A57279p6347M549L1028q327R99
11618A09181J94303P05A46308F2458P5228K1483a11165d8031M684r6561B46423
11606A09717q541a11821A86791a27647I2933m5372O4823b19693A9185J1013R4214
11595A24412C0390m229b59691G9207J4341K07502e5955j81501J10507O2363A4169
11583C4470I526b18660C5348J23418F3175k9335R1879J3034a48239A3868a4358
11571A23308b07862A21691J36960c27453D6722a0425A4621N1250N5357g5243C2603
11559I7936K9916a6839A32607D3554J86228G0799b9653j14482D67766j63907b61332
11547c4294j01250A75744b97038A97670a1116m9005l102D60085a53029C65649
$$ plain form
11536 -247439 235782 80091 171648 -3216 311136 49832 160774 276253 153206 -172438
11525 -199176 -83212 -70940 39641 -215018 51300 -130952 -352394 -164695 25923 60990 109328
11514 109328 -16218 26485 -4228 -52564 -41617 -69268 -63333 46333 -92652 113922 -12590 352940
11501 -64317 187987 55621 194340 -183874 374762 137481 117202 85568 410704 277291
11491 277291 2598 87438 -24247 224037 138507 93997 226133 469743 194384 183429 -41516
11479 160005 254638 255564 194579 11911 347547 276855 279096 -7171 -71639 292034 199524 31425
11466 7588 -35934 84298 33708 -270453 -47550 122046 32219 274597 53162 -61022 -147028
11455 -147028 -138031 261406 281361 66278 36233 286179 229189 -95840 28239 -63377 -41036
$$ packed form
11536b47439B35782H0091R1557c216C11136D9832J10942J15479j23047a72438
11525a99176h3212J2272C9641b15018E1300a30952k21442a64695B5923L5067M8338
11514A09328a6218B6485d228m8336J0947k7651N935D6333i2652A13922a2590C52940
11501f4317A87987E5621J38719a83874C74762A37481k0279l1634L25136j33413
11491B77291B598Q4840b4247B24037q5530m4510J32136K43610A94384j0955d1516
11479A60005R4633R26o0985A1911L35636p0692K241g171o4468B92034r2510C1425
11466G588c5934H4298C3708b70453d7550A22046C2219K42378E3162f1022q6006
11455a47028Q997B61406J9955F6278l0045K49946n6990i5840B8239f3377K2341
$$ plain form
11444 -41036 -74737 133495 61231 -102653 108898 -58219 -22220 -145312 232576 392589
11434 392589 242446 82549 -43542 129356 -68096 -180617 77734 -85873 144727 95849 11452
11422 42510 96233 -220548 -113181 -144632 256638 211125 65010 -76239 169286 -111724 -217252
11411 -217252 -100392 -183666 -159365 -149922 134903 -86858 125886 238133 -9853 -117810 171124
11399 -238350 -116362 41648 -92816 134338 91321 -180243 -42047 112872 -152305 -117740
11389 -117740 -127963 -356593 -123347 -166753 117491 -144405 58454 26135 18417 73965 -127375
11377 77441 -120012 -243458 -26727 50261 35574 -124219 -53574 62023 -2505 -96726 -257885
11366 -257885 -110927 -67751 -81138 61200 -58955 -72928 234935 113231 153708 -56927 -169449
$$ packed form
11444d1036l3701A33495F1231a02653A08898e8219b2220j23092B32576J60013
11434C92589j50143H2549d3542A29356f8096j12521G7734h5873A44727m8878A1452
11422D2510N3723b20548J07367l1451B56638m5513F5010g6239A69286a11724j05528
11411b17252a00392q3274K4301R443A34903h6858A25886J12247i853j07957A71124
11399b38350a16362D1648i2816A34338m3017a80243d2047A12872a52305L4565
11389a17740j0223k28630a23347m3406A17491a44405E8454B6135p718N5548a27375
11377G7441a20012j23446b6727E0261j4687a24219e3574F2023b505r4221j61159
11366b57885a10927M3176j3387F1200e8955j3973B34935A13231M0477e6927j12522
$$ plain form
11355 -169449 50975 32351 -149800 340790 -117101 7209 -408687 -178926 102936 139861
11345 139861 -240364 256247 141755 122562 68702 -164738 54211 -97084 -16942 145211
11334 23839 -131192 36399 -282318 -216937 170077 -238392 -159575 17 227252 -24477 -407226
11323 -407226 20499 -168789 -17635 -207261 138608 -179462 67311 -112722 -127907 622516
11312 36895 -222044 -39807 -174091 -53335 -92703 -131971 13015 165507 -220618 152040 235015
11301 235015 -12650 -23514 292202 -121880 -356815 -197990 14131 -51367 132434 13847
11290 105269 65780 -77181 -2009 21123 -433855 -304708 -260251 -30088 -248726 89905 -124342
11278 4237 -297925 -244728 244420 -196300 11138 -148307 128761 -100697 86349 -1385 -10054
$$ packed form
11355a69449E0975j8624a49800C40790a17101G209d08687a78926A02936L6925
11345A39861b40364B56247j14492j9193n3860a64738E4211i7084a6942A45211
11334B3839a31192C6399b82318O5381A70077b38392P8817A7K27235b4477l82749
11323d07226B0499a68789a7635j89626A38608a79462F7311a12722j5185F22516
11312C6895b22044c9807j34284e3335l9368l9268A3015J52492b20618A52040Q2975
11301B35015a2650j0864B92202a21880k34935J58825A4131e1367A32434A3847
11290A05269l9489g7181b009B1123d33855J29147M4457c0088k18638H9905a24342
11278D237b97925N3197B44420a96300A1138a48307A28761a00697H6349a385q669
$$ plain form
11267 -10054 -118995 -58527 -171464 -166957 -261358 -252052 337178 -79993 35506 -481567 -354287
11256 -354287 -200708 36054 -44272 48683 8705 -41563 -139582 -239284 -217415 -188098 137522
11244 -218838 -143243 -343338 47435 -266682 -138632 50871 -114914 92277 -68290 165867
11233 -184674 144635 -27167 -66975 -198021 -79037 276290 33257 -99920 -234579 -154526 -42805
11221 -48128 -64392 -43350 -157605 9480 -67608 15876 31692 -316425 -112531 110616 56034
11210 56034 397 -187009 -130084 -47610 -333685 -140769 79761 -331706 50767 -106357 -141194
11199 -141194 86262 -86554 155754 184294 1872 38095 -429379 166791 -112720 264133 59247
11187 114819 -37671 -104404 74639 -147580 181608 -111760 -114705 -234881 -466382 137406
$$ packed form
11267a0054j08941e8527j12937M507r4401R306C37178g9993C5506d81567J27280
11256c54287J53579C6054d4272D8683H705d1563r8019r9702K1869K9317A37522
11244b18838P5595k00095D7435b66682J28050E0871a14914I2277f8290A65867
11233a84674A44635b7167l9808j31046g9037B76290C3257i9920j34659Q0053d2805
11221d8128j6264K1042j14255I480f7608A5876J5816c16425a12531A10616n4582
11210E6034C97a87009N6925d7610k86075a40769G9761c31706E0767a06357l4837
11199a41194H6262h6554A55754K8540A872L6223d29379A66791a12720B64133E9247
11187A14819c7671o6733G4639a47580A81608a11760k945j20176k31501A37406
$$ plain form
11176 -129179 30703 -334460 -143892 -311102 42892 34643 101071 -160465 -212436 161597 53631
11164 -304172 -82241 119635 -219933 34368 172302 -193133 77125 -190038 -4365 437249
11153 113584 -201734 -25642 -71162 -104749 289415 -42713 196100 193840 -324796 126921 246926
11142 246926 184092 -189747 -88285 236466 51444 -180380 -96048 99004 75297 -22979 152488
11130 30494 -98818 -58198 115525 -292637 250482 17553 118886 128305 287806 -219538 -202560
11119 -202560 231098 163629 -198429 173304 -105228 124528 62928 -53842 -79909 97733
11108 214375 -336722 353717 29961 344430 300665 160266 -74315 448347 114092 94355
11098 94355 107032 178643 282032 30735 58572 -52805 24778 154424 -39129 58338 228529
$$ packed form
11176a29179C0703c34460a43892j67210D2892q249O6428a60465n1971A61597E3631
11164c04172h2241A19635b19933C4368J37934a93133G7125a90038d365D37249
11153A13584b01734b5642m5520l3587B89415d2713A96100k260c24796A26921J20005
11142B46926o2834a89747h8285B36466E1444a80380Q4332I9004k3707b2979A52488
11130C0494i8818M0620A15525b92637B50482A7553J01333R419J59501b19538J6978
11119b02560B31098o7469a98429A73304a05228A24528o1600e3842k6067I7733
11108B14375c36722C53717B9961L14469m3765j40399g4315D48347A14092j9737
11098I4355J2677P1611J03389C0735K7837e2805B4778J29646c9129E8338J70191
$$ plain form
11087 228529 251743 285888 216082 52064 436085 276466 380273 156291 435733 401243
11077 401243 166571 173799 -186928 436475 286771 303781 204310 -54528 344988 589060
11067 589060 172964 262340 485016 524456 228646 200758 823272 519922 124112 564301
11057 564301 779187 664833 598687 384536 631681 605522 644971 238229 428621 666711
11047 666711 590670 693196 543796 834219 608703 645531 722047 628826 636352 537590 902308
11036 902308 470033 716986 874384 648442 693348 766993 561301 455981 814748 758870
11026 758870 753017 687123 723180 900909 661086 793910 722053 653732 777643 771434 423270
11015 423270 688938 590113 497152 685401 628922 683803 443299 685805 654407 734292 628998
$$ packed form
11087B28529K3214L4145o9806E2064L84021j59619J03807A56291K79442l4490
11077D01243A66571P228a86928D36475j49704J7010r9471e4528C44988K44072
11067E89060A72964Q9376K22676L9440B28646k7888O22514l03350A24112M40189
11057E64301K14886j14354o6146k14151K47145k6159L9449B38229J90392K38090
11047F66711p6041J02526j49400K90423k25516L6828P6516r3221P526r8762L64718
11036I02308m32275K46953J57398k25942M4906P3645k05692j05320L58767n5878
11026G58870n853o5894L6057J77729k39823J32824p1857o8321J23911o209l48164
11015D23270K65668r8825r2961J88249n6479N4881k40504K42506l1398P9885j05294
$$ plain form
11004 628998 494587 762259 917851 466394 603365 521107 859614 679755 666887 694408
10994 694408 743452 585906 882089 758189 660352 509336 445487 948351 738662 558863
10984 558863 773494 1213820 781299 924328 862395 1150332 836544 1284423 1207752 1324672
10974 1324672 1507797 1802044 1719551 2284193 2167059 2562491 2465031 2789234 2714516 2929228
10964 2929228 2639058 2594851 2361332 2052615 1640747 1612237 1879397 1959505 1922568 1957246
10954 1957246 1781717 2088183 1828310 1730300 1245893 1078959 748645 675864 773582 748316
10944 748316 520565 516023 397318 250943 162121 312875 197808 352215 25140 198761
10934 198761 306488 48869 53047 292803 -18013 82294 142535 188807 -328441 -71833 355782
$$ packed form
11004F28998j34411K67672J55592m51457J36971q2258L38507j79859j2868K7521
10994F94408M9044j57546K96183j23900r7837j51016o3849N02864k09689j79799
10984E58863K14631M40326m32521J43029o1933K87937l13788M47879p6671J16920
10974A324672J83125K94247q2493N64642j17134L95432r7460L24203p4718K14712
10964B929228k90170m4207k33519l08717m11868k8510K67160Q0108l6937L4678
10954A957246j75529L06466k59873r8010m84407j66934l30314p2781R7718k5266
10944G48316k27751m542j18705j46375q8822J50754j15067J54407B5140J73621
10934A98761J07727D8869M178K39756a8013H2294O0241M6272c28441g1833C55782
$$ plain form
10922 -280478 97472 40431 249518 247838 269474 529468 -290176 -4697 -294580 -282176 19143
10910 -49235 -68912 -52072 20193 19059 26186 -168495 239133 211322 -85130 70088 -325753
10898 -186879 49111 -55007 -110349 -58521 163516 113818 -174736 -97799 146979 30722 178618
10887 178618 -23955 -129422 153800 311742 30448 105989 -292115 -18651 -286363 -159061
10877 -159061 336795 -9921 170667 -417888 -11917 -46299 -35296 -48448 339 -40699 -262749
10866 -262749 69611 -21835 251255 -66705 59630 43971 326 -50681 247744 -286818 -208653
10855 -208653 73912 -125237 -11125 132813 -58522 36427 28927 332713 28610 -239535 204937
10843 19983 -284992 -265904 -178032 -216857 -211340 133806 -197314 -199457 319788 169647 -183948
$$ packed form
10922b80478I7472D0431K09087j680K1636K59994b90176d697k89883J2404A9143
10910d9235j9677J6840B0193j134P127a68495B39133k7811h5130G0088c25753
10898a86879D9111e5007n5342N1828A63516m9698a74736P6937A46979C0722J47896
10887A78618b3955j05467A53800J57942C0448P5541b92115a8651k67712J27302
10877a59061C36795i921A70667d17888a1917l4382J1003j3152C39d0699k22050
10866b62749F9611b1835B51255f6705E9630j5659C26e0681B47744b86818P8165
10855b08653G3912a25237a1125A32813e8522C6427p500L03786B8610b39535B04937
10843A9983b84992J9088Q7872l8825N517A33806a97314k143C19788j50141a83948
$$ plain form
10831 -265975 -32752 161098 246784 -152904 224655 -277318 95015 -128163 116144 -57924
10820 -362879 -232981 -172312 -133674 -165191 276029 -215093 -156426 43276 -345516 -131004
10809 -29413 -154766 84855 -129204 76371 61967 132703 120101 225871 -4116 -5220 -131661
10798 -131661 69110 -110202 -250343 -73685 -44857 -187116 -200953 -327547 -282912 75253 54875
10787 54875 378516 -137091 -219386 -431530 203009 84963 55467 -133108 -3722 -107198 -642922
10776 -642922 -113305 -71837 155250 -506393 89350 3653 75184 -299 -63971 -20806 -40839
10765 -40839 -142942 -187631 -54895 -120746 -332080 -50378 -352118 -211667 -460872 -110240
10754 -40793 -80396 -64803 -163723 190509 -75176 82640 359271 -210166 -183106 -216116 -32479
$$ packed form
10831b65975c2752A61098Q5686a52904B24655b77318I5015a28163A16144e7924
10820c62879J29898O0669L8638l1517B76029b15093N8667D3276c45516a31004
10809b9413j25353H4855a29204G6371j4404P0736j2602J05770d116j104j26441
10798a31661F9110a10202j40141g3685K8828j42259j3837j26594M4635G5253k0378
10787E4875L23641a37091q2295k12144B03009H4963k9496a33108c722j03476n35724
10776f42922a13305M1468A55250e06393H9350C653P1531b99o3672b0806k0033
10765d0839j02103m4689e4895o5851k11334e0378l01740J40451k49205a10240
10754d0793l9603J5593r8920A90509g5176H2640K76631b10166K7060l3010c2479
$$ plain form
10742 27137 -160247 -82909 62808 -90076 -200279 -120536 -17305 -33700 16616 69436 227445
10731 227445 -313201 -341054 -251299 -108668 408421 -5317 -92211 262499 -232920 174708
10720 -71017 -137058 93327 234352 -270220 -70027 78543 -75761 68386 -189732 17752 16451
10709 16451 -123914 -62580 207757 -294710 232016 91737 -6431 113741 -117489 -145971 -41579
10697 269555 -124482 -56627 -96831 80869 62609 143540 111406 -123358 75604 59490 -112308
10685 54784 -146634 -77232 107772 -11424 -268574 173198 19838 -131677 -188440 1141 4374
10674 4374 -38172 -46846 66261 166477 -220309 -17062 -168173 132066 148874 -78190 -330875
10663 -330875 -17485 -127639 280080 -294820 -297588 60293 -381299 -74352 -553 -374893 23516
$$ packed form
10742B7137a60247P7338F2808i0076j10203P9743a7305j6395A6616N2820J58009
10731B27445c13201k7853Q9755a08668D08421e317q6894B62499b32920A74708
10720g1017o6041I3327J41025b70220g0027G8543g5761F8386a89732A7752j301
10709A6451a23914O1334B07757b94710B32016I1737f431A13741a17489k8482d1579
10697B69555a24482e6627m0204H0869j8260Q0931l2134a23358G5604j6114a12308
10685E4784a46634O9402A07772a1424k57150A73198A9838a31677n6763A141L233
10674D374c8172q674F6261J00216b20309a7062j51111A32066J6808g8190k52685
10663c30875a7485j10154B80080b94820k768F0293c81299g4352e53l74340B3516
$$ plain form
10651 -217089 -164465 125273 -86966 -32335 284762 -161859 62785 -46426 -159973 -51303 -132507
10640 -132507 23679 30965 -23372 -363491 -86580 -106589 182986 -88170 177504 -165670 -9558
10628 208847 68541 64312 -201532 -6290 -231945 130301 44616 81233 -284622 71645 -179535
10616 -39751 105636 -12433 -26303 -153371 -252537 80526 -77812 385133 19497 -61128 102056
10604 -115318 -147966 7501 -382584 -102582 -133266 -2223 -198106 137002 -170511 -11541 -228725
10593 -228725 153388 91867 -190819 -151932 -88113 -223759 205841 -137206 -230533 61149
10582 -64374 61270 -139540 -42737 -14778 -251959 -78260 -138133 -61645 -182488 167012 226868
10571 226868 101069 -181615 99214 14356 332147 -43693 -247009 120211 -113175 84927
$$ packed form
10651b17089N2624A25273h6966c2335B84762a61859F2785d6426j13547e1303q1204
10640a32507B3679P286b3372l40119h6580k0009A82986h8170A77504a65670i558
10628B08847F8541m229b01532f290k25655A30301D4616L6617b84622G1645a79535
10616c9751A05636a2433j3870j27068r9166H0526g7812C85133A9497f1128A02056
10604a15318l2648G501c82584a02582l0684b223j95883A37002a70511a1541k17184
10593b28725A53388o1521a90819L8887O3819j35646B05841a37206r3327F1149
10582f4374F1270a39540d2737a4778k37181g8260n9873f1645j20843A67012N9856
10571B26868A01069a81615I9214A4356L17791d3693k03316A20211a13175H4927
$$ plain form
10560 -273653 -121570 31965 -238381 -11951 37285 -64503 -311028 -175612 -256237 -208778 -244538
10549 -244538 -211900 -220272 -298818 -160805 89253 -326204 -26219 229729 58643 -119034 -14422
10537 -150754 -155791 -111088 -77899 117810 114406 31910 -155077 21665 -247367 -100958 -83114
10526 -83114 -6864 -165523 20408 -12700 -326093 -407735 -148763 163879 -178735 132874 109145
10515 109145 -27209 83812 -190010 74707 -40553 -37813 31882 -99951 -248211 69620 211245
10504 211245 -45832 -300289 -237288 -321751 129577 -155185 416847 -192199 -69741 -159991
10494 -159991 -316051 15867 90362 57562 -69735 -164656 -194805 8260 121694 -163240 54190
10482 352349 94916 30722 -71780 -53834 85803 442531 146565 235202 174805 133196 157541
$$ packed form
10560b73653a21570C1965b38381a1951C7285f4503k46525J35416q0625M7459l5760
10549b44538L2638q372p8546J38013H9253c26204b6219B29729E8643a19034a4422
10537a50754n037M4703L3189A17810l404C1910a55077B1665b47367a00958J7844
10526h3114f864j58659B0408a2700l13393q1642a48763A63879a78735A32874k3729
10515A09145b7209H3812a90010G4707d0553K740C1882i9951j48260F9620J41625
10504B11245d5832k54457O3001q4463A29577a55185D16847a92199f9741r0250
10494a59991j56060A5867P4495l2800f9735r4921l0149H260J13434a63240E4190
10482C52349I4916C0722g1780J7946H5803L56728A46565Q8637o0397m1609K4345
$$ plain form
10471 157541 26436 208137 -52751 228699 4449 -29550 345371 -45666 -27183 119084 -8522
10459 -60953 -108052 153044 4421 -270744 -82016 -193906 -285811 50251 129243 56007 -423081
10447 -104718 -111388 -142148 -231198 -212880 -220902 -160247 -146761 17173 -49774 216285 -104821
10435 17859 196483 -30435 -17693 42203 112100 -251628 363770 169738 -100228 167306
10424 167332 133960 -91226 -170441 -62024 -138336 -110650 -229657 -244694 -34398 -246656 -298911
10413 -298911 69861 -153388 -12611 -322368 2635 132698 60264 -320300 -175429 46382 210604
10402 210604 -495543 51317 -126783 -55266 -81465 -41415 -82577 17617 216397 -53216 47551
10390 -202364 -35475 54185 195069 143353 340268 367861 -12862 289136 446987 -153843
$$ packed form
10471A57541B6436J81701e2751B28699D449b9550C45371d5666J8483A19084h522
10459f0953m7099A53044D421b70744h2016j11890r1905E0251P8992E6007d23081
10447a04718o670l0760q9050J8318q022O0655J3486A7173d9774B16285a04821
10435A7859J78624c0435J2742D2203O9897b51628C63770A69738a00228A67306
10424A67332l3372i1226p9215f2024p6312K7686j19007j5037c4398k12258n2255
10413b98911F9861a53388a2611l09757B635J30063F0264c20300J44871D6382J64222
10402B10604d95543E1317a26783e5266k6199M0050m1162A7617J98780e3216D7551
10390b02364c5475E4185J40884n1716J96915K7593a2862B89136J57851a53843
$$ plain form
10379 -129792 194368 264451 658 68332 8973 181767 480386 57070 261034 255177 469304
10368 469304 250195 194809 425077 136950 301991 678890 661435 322174 725122 148523
10357 17529 220064 337233 557646 280725 -30249 320676 409037 444888 637478 278021
10346 657029 566419 445368 233808 89030 186832 572135 47506 472460 47423 87297 34780
10334 273459 250502 259068 76845 140435 -92070 253444 293978 -142278 168189 347143 -13198
10322 93528 -73856 260164 59185 67745 -98816 469541 240956 -90399 277205 338060 118618
10310 19115 72376 433984 -203316 -20912 167194 102386 -152759 126165 157791 371525
10300 371525 193015 -44425 -74373 -384441 -76056 -125152 -18092 114001 108078 314353 75108
$$ packed form
10379a29792A94368P0083F58O7674H973J72794K98619E7070K03964n857K14127
10368D69304k19109n5386K30268A36950J65041L76899j7455C22174M02948A48523
10357A7529K02535J17169K20413k76921c0249C20676Q8361L5851J92590B78021
10346F57029r0610j21051k11560H9030R7802L85303D7506M24954D7423L9874C4780
10334B73459k2957Q566G6845O3590i2070B53444M0534a42278A68189J78954a3198
10322I3528g3856B60164E9185Q560i8816D69541k28585i0399B77205O0855A18618
10310A9115N3261L61608b03316b0912A67194o4808a52759A26165L1626K13734
10300C71525j78510d4425k9948l10068g6056m9096a8092A14001n923K06275G5108
$$ plain form
10288 88381 -114354 209573 -410114 -14963 -390378 -26208 -106658 -99907 -184726 -142878 235076
10276 297608 -196966 -101132 193018 20748 52093 -252591 -142218 -115868 83903 -274213
10265 -277488 -25874 154435 -121126 -260195 79009 59976 68415 -141289 -78075 337100 316822
10254 316822 405668 260918 313221 740248 241526 223820 263711 85852 -9765 -133071 -240106
10243 -240106 85521 225947 288410 117393 191708 -150711 143292 -189946 105310 -155813
10232 -209531 -195083 48439 -200265 -236001 -11964 -144769 -133241 -130006 -52112 -116777 36282
10220 47945 -31997 -158038 -87598 -99852 -85256 -230215 97293 -121631 125789 -192032 -163754
10209 -163754 -8495 -200828 -71665 3370 -106251 -224032 -251624 -140725 51744 -426572 -308213
$$ packed form
10288H8381a14354B09573d10114a4963l75415b6208q0450O751q4819M1848B35076
10276B97608a96966R5834A93018B0748L1345b52591J10373K6350H3903b74213
10265b77488b5874A54435a21126j39069G9009j9033Q439a41289O3214C37100k0278
10254C16822Q8846j44750N2303M27027B41526j7706L9891H5852i765j23306j07035
10243b40106H5521J40426O2463A17393P4315a50711A43292a89946A05310a55813
10232b09531J4448D8439b00265l5736a1964j32805J1528L235e2112o4665C6282
10220D7945c1997j26041P0440j2254J4596j44959I7293a21631A25789a92032K8278
10209a63754h495j92333g1665C370a06251j17781k7592J10899E1744d26572J18359
$$ plain form
10198 -308213 -182266 -177996 -363204 131608 2526 111250 -70860 -232232 209044 -359442
10187 -150798 -139757 -109617 -107395 93914 -265719 -61384 -48636 -30113 -340132 -357416 -296234
10176 -296234 -110423 35626 -63374 72052 81862 53289 126757 -95193 23625 -121575 14521
10164 93184 -90148 74490 191955 23621 -341283 215275 -251924 24602 -304478 -204832 267070
10152 -38374 -126861 -219332 -104616 -275830 87540 73828 -151724 -165255 -146904 -141430 -313888
10141 -313888 52874 32722 -63830 58351 -1700 -106207 -142970 -8880 -185105 -34121 53849
10129 -137439 -179190 -181267 -340138 57567 139876 -55828 -298 176467 6624 -225509 135703
10117 151280 -367991 -37541 -78952 -368402 -165940 -202182 -507426 -25341 40363 42351 -325488
$$ packed form
10198c08213J25947M270j85208A31608B526J08724g0860j61372B09044c59442
10187a50798J1041L0140K222I3914b65719f1384J2748J8523l10019j7284O1182
10176b96234a10423C5626f3374G2052R810k8573P3468i5193B3625a21575A4521
10164I3184i0148G4490J17465B3621c41283B15275b51924B4602c04478R9646B67070
10152c8374q8487r2471a04616j71214H7540j3712a51724j3531J8351N474j72458
10141c13888E2874k0152f3830E8351a700j04507l6763h880j76225c4121E3849
10129a37439m1751k077j58871E7567Q2309e5828b98A76467F624b25509A35703
10117A51280c67991c7541m1411k89450a65940l6242l05244b5341D0363J988c25488
$$ plain form
10105 -100069 -17575 -267346 -179313 86670 -161820 -214195 23964 -267427 256843 -67463 252918
10093 -325531 -72610 -388957 79364 144235 80509 262726 -118238 73322 119076 41855 135301
10082 135301 -416211 -137350 -265229 79163 -41939 -263797 -68303 14520 113273 -228212
10071 80313 55963 -89123 -196303 55079 -18651 118582 -82721 103362 -247648 18495 393584
10060 393584 71428 -27701 -275661 -211596 1420 -111386 -221885 -23612 -335510 50342 -4413
10048 -406528 51010 79787 95229 7487 -76491 195207 -60800 -109654 -331101 -174783 -217823
10037 -217823 -259498 64392 -396349 -197408 167852 -372453 13956 33064 -144596 -3464 18758
10025 -26100 94863 -251839 149531 7637 -298782 4297 -85837 134454 -9501 374808 -67443
$$ packed form
10105a00069a7575k49771Q8033H6670a61820n2375B3964b67427B56843f7463B52918
10093c25531g2610l16347G9364O4871o3726J82217a18238G3322M5754D1855R3446
10082A35301d16211a37350j27879G9163d1939k21858f8303A4520R8753b28212
10071H0313k4350h9123j07180E5079a8651A18582h2721A03362b47648A8495L75089
10060C93584G1428b7701k47960O4065A420a11386j10499b3612l11898E0342d413
10048d06528E1010K8777J5442G487g6491A95207f0800m8854k21447J56318m3040
10037b17823m1675F4392c96349a97408A67852c72453A3956J9108a44596c464A8758
10025b6100I4863b51839A49531G637b98782D297h5837A34454i501C74808f7443
$$ plain form
10013 -258624 -61954 -91252 -160264 2334 -81996 -129634 268393 -325062 -174431 -226767 -712
10001 -170306 272248 -166528 -34461 37888 253411 -77940 70487 65060 195103 235332 36262
9989 17551 -376387 47971 -87124 -105060 -204732 -189297 -232881 -171136 44975 -135311 -8766 -38811
9977 -38811 124103 -136393 -203840 63849 75041 -204823 41330 181251 -534292 -125627 182297
9965 23234 -135713 149053 35949 190770 -86495 -213573 -84452 -100163 -102971 16066 67560
9954 67560 13370 -37501 -202773 -179816 139574 153746 -131972 -216434 164734 -273090 -95686
9942 -190178 -158 62424 48341 22628 -227640 -164132 111365 39185 48447 53074 -73066 209621
9929 156743 32917 -291669 82922 -7650 83095 114319 -201480 500676 42976 -349707 103150
$$ packed form
10013b58624f1954k9298o9012B334h1996m7638B68393c25062J50631n2336g12
10001a70306B72248a66528c4461C7888K15523g7940G0487n427J30043M0229C6262
9989A7551c76387D7971h7124j7936r9672J5435m3584O1745D4975a35311h766l0045
9977c8811A24103a36393o7447F3849J1192b04823D1330J39921e34292a25627A82297
9965B3234a35713A49053C5949J54821h6495j27078h4452j5711k808A6066N1494
9954F7560A3370c7501j65272K2957A39574J4172a31972q4462A64734b73090i5686
9942a90178a58F2424j4083B2628b27640O3508A11365C9185R262M627g3066B09621
9929A56743C2917b91669H2922g650H3095L1224b01480E00676D2976c49707A03150
$$ plain form
9917 -135005 194600 -227089 -108252 -59480 5652 -47290 -126095 -178752 182312 214061 -174625
9905 96800 -146738 -38370 58884 -12897 188119 -349073 58935 -141927 -146416 -181915 -65049
9893 -254876 198375 76748 -39959 -146509 74747 -68744 162093 -99406 -119728 -173779 145591
9881 -286469 106928 -323491 -296395 -160310 -95823 88128 -148596 -121812 -80458 -366135 -256845
9870 -256845 -33728 80363 146935 -9368 50390 -261644 -363632 -304559 -68429 31397 -43568
9858 74452 80856 50825 64177 -145135 -259447 26845 7607 -105294 -176406 91454 -76936 -195295
9846 -195295 -115325 -250240 38071 -233412 397536 -36712 173441 43168 -16551 -154859 203344
9834 -278541 185966 -68919 35168 -111119 340357 -115326 96455 55519 72271 -191969 -164067
$$ packed form
9917a35005A94600b27089a08252M8772E652d7290p8805n2657A82312L1749a74625
9905I6800a46738c8370E8884a2897A88119c49073E8935a41927m489l5499f5049
9893b54876A98375G6748c9959j06550G4747f8744A62093i9406k0322n4051A45591
9881b86469A06928c23491K7096J36085O4487H8128a48596K6784M1354k85677J09290
9870b56845c3728H0363O6572i368E0390b61644j01988N9073f8429C1397d3568
9858G4452O404l0031J3352a45135j14312B6845G607a05294p1112I1454g6936j18359
9846a95295P9970j34915C8071b33412C97536c6712A73441D3168a6551j38308B03344
9834b78541A85966f8919C5168a11119C40357a15326I6455m0936J6752a91969K7902
$$ plain form
9823 -164067 60483 -315732 98663 208389 -95833 85370 -173422 -227751 212799 -48231 -177326
9812 -177326 29860 -534727 -27775 47450 -166018 69842 -30665 115279 -153994 602 251594
9801 251594 216788 242323 55343 125891 -419456 -288260 194193 -266357 -329014 -234992 13467
9789 47 -190725 -117400 -80286 -272494 221541 166185 -308571 -263994 -179803 48511 -364450
9777 494749 -289102 -160898 -260749 -381587 59145 145119 -43679 -38365 -384748 -258909 -278517
9766 -278517 247811 -221634 -166913 -157684 -210720 -42559 60455 -53159 -44522 -79375 -5374 -505861
9754 -505861 -232420 3785 -219347 -31676 -64512 -147124 53097 216716 -59029 124583 -29996
9742 -58610 -175560 -290861 -310504 -381662 33341 267251 66388 34521 -53481 123638 52779
$$ packed form
9823a64067F0483c15732I8663J09726i5833H5370a73422n4329B12799d8231j29095
9812a77326B9860e34727b7775D7450a66018F9842c0665A15279a53994F02K50992
9801B51594l4806K5535E5343P0548d19456J31196A94193b66357o2657R4022A3467
9789D7a90725P3325L7114j92208B21541n5356c08571M4577Q4191D8511c64450
9777D94749b89102J28204r9851j20838E9145Q5974d3679N314l46383J25839j9608
9766b78517B47811b21634N4721R229n3036d2559F0455e3159Q637l4853e374n00487
9754e05861b32420C785b19347c1676l2836q2612E3097J63619e9029A24583b9996
9742e8610j16950j15301j9643p1158C3341K33910F6388l1867e3481A23638E2779
$$ plain form
9730 -105122 75498 -229859 -317492 -75253 299177 94753 -313713 -41312 40100 183317 -401107
9718 -93982 -341835 88093 -33071 -140484 -185430 134395 234736 52758 77573 -247510 42694
9706 160224 -34471 -56432 98905 185603 428247 -210761 -4892 -186034 243822 -114884 -69134
9695 -69134 -18911 74402 -252005 12900 -141849 -102239 -130253 179607 -164962 232846 -138447
9683 -67037 -161676 -237487 -529282 125757 -296972 5145 171545 -244183 -95004 -32957 213423
9671 -227921 221719 107403 -145667 -246984 -39468 -395900 -43604 -4611 276184 26122 -106921
9659 7756 -119124 -115438 -316881 -116383 -117989 106068 -155608 -442332 -182223 28772 -120009
9647 -14711 169316 -284303 -22545 -152778 16745 318218 -39286 -269566 -268902 45105 -110464
$$ packed form
9730a05122G5498b29859q7633g5253B99177I4753c13713d1312D0100J43217d01107
9718i3982k47853H8093c3071j07413m4946A34395J00341E2758K4815b47510D2694
9706A60224c4471k1961I8905Q6698K42644b10761d892j81142B43822a14884M5750
9695f9134a8911G4402b52005A2900a41849L9610k8014A79607a64962B32846a38447
9683f7037r4639p5811k91795A25757b96972E145J66400b44183i5004c2957B13423
9671b27921B21719A07403a45667j01317c9468l56432d3604d611B76184B6122a06921
9659G756a19124L686k01443a16383j606A06068a55608k86724a82223B8772a20009
9647a4711A69316b84303b2545j30233A6745L01473c9286k30280O64D5105a10464
$$ plain form
9635 -157455 -193852 9655 227751 -231824 32207 141723 161651 -114896 -61806 28739 48579
9624 48579 253180 88390 -177239 79750 -42695 -243427 -397616 -218460 249732 -101062
9613 237614 -293546 -109615 70783 58509 -377865 -330692 111611 378857 72723 -243191
9602 -45002 12304 -337216 -71619 -15967 -227268 -174183 -111050 -131644 66263 88909 42892
9590 -120016 -287464 390233 -156076 116359 308940 -150875 -141027 -34535 -126900 74768 -67650
9578 59588 388995 -68550 6424 -207833 863 -126536 62295 121033 25799 157652 -152750
9566 93887 -24948 60853 -154241 -143363 -59374 -93462 -254915 157010 -18124 -219229 57332
9554 -235338 -120365 -76201 60356 84462 23927 -40358 267621 -98871 -183076 -153928 -75017
$$ packed form
9635a57455l6397I655K18096b31824C2207J09516J9928a14896N3090B8739J9840
9624D8579K04601H8390a77239G9750d2695k00732j54189J79156B49732a01062
9613B37614b93546a09615G0783j2274c77865M7173A11611K67246G2723b43191
9602d5002A2304c37216g1619a5967k11301N3085O3133k0594F6263K2646D2892
9590a20016j67448C90233a56076A16359J92581a50875R848c4535r2365G4768f7650
9578E9588L29407f8550F424b07833H63a26536F2295N8738B5799J31853a52750
9566I3887b4948F0853a54241J0878e9374l4088j61453A57010a8124k01105E7332
9554b35338J14973M4164F0356K4106B3927d0358B67621i8871q4205K9148g5017
$$ plain form
9542 -252297 -252600 290668 -255507 123536 -45631 -94154 -331937 -115573 -317005 253141 -232080
9530 23041 -234458 -121565 -84252 71645 -236009 -31365 100000 -203071 55796 123878 -205339
9518 -137689 -12073 -180337 -107429 194369 103865 -207077 -584 90953 275543 -112364 -117141
9507 -117141 -26101 -118902 -147274 83092 93395 -124381 -133069 -353568 121375 145963 -223911
9495 195181 196467 -82251 -142021 -234345 12896 -45616 -350122 -88631 -225542 -166361 -100060
9484 -100060 -74182 -65458 36278 -217771 -289161 -145925 5516 62247 -76774 -276495 -57898
9472 273373 -263342 320899 -158083 -28695 42075 69880 -280570 96864 -202878 29379 -173035
9460 235362 -334849 -175341 -998 2336 41623 11151 -78714 231614 -61326 -179276 145729
$$ packed form
9542b52297l03B90668b55507A23536d5631m8523k37783a15573k01432B53141b32080
9530B3041b34458J12893L7313G1645b36009c1365A00000b03071E5796O8082b05339
9518a37689a2073j68264P2908A94369r0504b07077e84I0953J84590a12364m777
9507a17141b6101r2801k8372H3092J0303a24381q688k20499A21375K4588b23911
9495A95181J286h2251n9770r2324A2896d5616l04506h8631j36911N9181O6301
9484a00060K5878Q724C6278b17771p1390J43236E516N6731g6774j99721e7898
9472B73373b63342C20899a58083b8695D2075K7805b80570I6864b02878B9379a73035
9460B35362c34849J59508i98B336L9287A1151g8714B31614f1326j17950A45729
$$ plain form
9448 -54220 -437845 -118727 -217318 -27590 -5514 -346273 193833 4930 108955 44656 184591
9437 184591 316903 75009 -50383 -112232 -8182 -198767 -289983 26727 -337434 -208583 -122783
9426 -122783 150 -61265 -259182 -690412 -235968 -124246 -238744 -403565 108153 -72394 -428109
9415 -428109 -308215 -131913 134661 -384108 -48468 -229259 -454427 -102744 89122 148449
9405 148449 69775 -231821 -148611 160990 -110236 -20157 105938 -221921 -73882 -125185 121279
9393 -190484 -4514 -115298 16131 -291868 36258 -208872 -120430 -290092 -191284 -14518 -145362
9382 -145362 117569 262921 104961 75848 -226598 -229845 271105 -252330 -74176 -107505 78728
9370 -81099 -191438 110172 208928 -63048 -85872 -171849 232545 -243399 127662 -242926 -416433
$$ packed form
9448e4220l83625a18727r8591b7590e514l40759A93833D930J04025D4656J39935
9437A84591J32312G5009e0383o1849h182j90585r1216B6727c37434J28851Q5800
9426a22783A50f1265j97917m31230b35968J11722j14498j64821A08153g2394l55715
9415d28109J19894a31913A34661c84108d8468j80791k25168a02744H9122N9327
9405A48449F9775b31821Q3210A60990a10236b0157A05938b21921g3882n1303A21279
9393a90484d514j10784A6131b91868C6258b08872Q8442j69662R8808a4518j30844
9382a45362A17569J45352A04961k9113b26598l247B71105b52330g4176l3329G8728
9370h1099j10339A10172R8756f3048k2824q5977B32545b43399A27662b42926j73507
$$ plain form
9359 -416433 -98418 -187295 -568750 -223996 125552 -63814 10918 -108251 -98383 130227 -110470
9347 -48002 86309 -336190 -422134 106731 17959 -69618 248241 -142381 269881 -225088 -263758
9336 -263758 22440 -372228 -157038 -159537 76464 5310 -17317 -208661 -333821 50103 -99481
9324 -254916 1996 318035 -134997 -43226 7087 199337 -225905 -252818 325406 -135320 -334016
9313 -334016 -129430 24678 208840 -202427 -42942 83552 -34518 -69954 -358314 191713 -224018
9301 170028 -278057 -143793 441811 -66624 80765 -183942 -122038 -34037 60015 -87664 -21677
9289 258472 -81043 -71046 1550 -99319 -223070 174275 -111104 -52291 -29937 67643 139622
9278 139622 -326061 88432 109771 90617 -139835 -338032 3087 71782 27985 -100833 -98094
$$ packed form
9359d16433i8418q8877l81455b23996A25552f3814A0918a08251R868A30227a10470
9347d8002H6309c36190q5944A06731A7959f9618B48241a42381B69881b25088l8670
9336b63758B2440c72228a57038k499G6464E310a7317j91344j25160E0103i9481
9324b54916A996L16039a34997d3226G087J92250b25905k6913C25406a35320j98696
9313c34016a29430B4678J84162b02427d2942H3552c4518l5436k88360A91713b24018
9301A70028b78057J34264D41811f6624H0765a83942O1904c4037F0015h7664b1677
9289B58472h1043R997A550i9319j23751A74275a11104e2291K2354F7643P1979
9278A39622c26061H8432K1339j9154a39835j98197C087O8695B7985a00833K739
$$ plain form
9267 -98094 112936 399942 2154 -228514 -62105 47862 -107590 215203 -361836 -244631 -331960
9256 -331960 -52209 -242255 -330997 345376 -178695 -49089 161847 -278984 -212467 -85075 -96609
9245 -96609 -138768 -18878 338704 -368231 -85354 -243269 -2914 -120238 -166304 195964 -66431
9233 -282982 11545 -157218 -195210 -233891 -45860 312099 352753 36926 -157239 -15078 260865
9221 -231136 -12330 -38816 -34109 -65577 -156954 71524 -188301 -99449 -276592 -36587 -551958
9210 -551958 -298563 -141593 179535 85025 159011 13996 42408 85926 -2891 -12019 153952
9198 -69995 35587 -62764 -158651 -130990 18019 -103329 -103843 -89413 240697 155473 139277 -174931
9185 19023 36560 -27420 -13790 -33358 164499 3593 -494814 -95370 -15724 -149611 -6565 59054
$$ packed form
9267i8094A12936K87006B154b28514f2105D7862a07590B15203c61836J17205q7329
9256c31960e2209j90046q8742C45376a78695d9089A61847b78984O6517h5075j1534
9245i6609m2159a8878C38704c68231h5354j57915b914j17324m6066A95964f6431
9233b82982A1545a57218l7992l8681d5860C12099M0654C6926a57239a5078B60865
9221b31136a2330k6486M707l1468r1377G1524a88301Q8852j77143c6587n15371
9210e51958K53395a41593A79535H5025P3986A3996K8412M3518b891r128A53952
9198f9995C5587f2764r5887K7661A8019a03329n14J4430B40697q5224j6196a74931
9185A9023J7537b7420J3630j9568A64499C593d94814i5370a5724j33887f565E9054
$$ plain form
9172 171212 -125283 -286546 129536 116763 -297903 -206340 -60897 68297 -287133 -44358 37858
9160 -156878 -68401 -121930 -387789 -61946 -60084 -220036 16851 9294 -94490 -20374 -8197 176255
9147 -445067 -216047 -94341 -52999 -263198 -134853 -17091 190622 -119862 -159335 -50713 -202590
9136 -202590 33187 -168757 -449326 -19284 221667 59139 -224961 -31872 24236 301603 -103874
9124 -264349 -13418 58427 97984 198863 205399 -133425 -282013 -138350 99989 106911 -56771
9112 -357546 -27665 96510 111863 -162826 207570 83238 -62437 35616 121584 -127574 -128247
9101 -128247 -117481 213479 -237668 -200619 403689 -238166 -20436 304981 -31871 70395 184048
9090 184048 -105321 -394759 -146861 -252411 -30811 16020 -128596 41093 -184746 -49533
$$ packed form
9172A71212a25283j61263A29536j2773b97903R1563f0897F8297b87133d4358C7858
9160a56878f8401n3529k65859f1946J862j59952A6851p557i4490b0374h197A76255
9147d45067b16047i4341M1342k10199J28345a7091A90622a19862l9473e0713j51877
9136b02590C3187a68757k80569a9284B21667E9139b24961c1872B4236K77367a03874
9124b64349a3418E8427L9557J00879O536a33425j48588a38350I9989O922e6771
9112c57546b7665I6510J5353a62826B07570H3238f2437C5616Q5968a27574o73
9101a28247J0766B13479b37668L7049D03689b38166b0436C04981c1871G0395J13653
9090A84048a05321k89438a46861j05550c0811A6020a28596D1093a84746d9533
$$ plain form
9079 -409907 -36475 -141499 10246 -175552 -324033 -231332 -36223 -135679 153059 -99379 -71649
9068 -71649 108874 -106686 -62455 -118454 67684 -201304 -72550 -134440 64434 -198814 16597
9056 -195881 199122 -62541 -162929 159496 -5072 -34282 -131183 -61582 -305459 -168056 -147499
9045 -147499 -38922 -364677 164602 112650 -109167 103931 -90213 673 -68001 -188791 -373148
9034 -373148 -105786 -359547 -167978 51364 -105782 99308 -154158 40479 46514 -3186 206395
9022 -267054 -37185 -101379 -173359 -36136 -99894 -208437 -135951 -171616 -271173 248303 -73239
9010 55616 29563 255587 -19996 -186291 38610 -31543 76055 -32576 85889 -1883 -227504
8999 -227504 -221969 157328 -46249 -32979 -282448 25878 -275106 40125 -179177 -109395 15335
$$ packed form
9079d09907c6475j05024A0246a75552j48481R2701c6223r9456A53059i9379K7730
9068g1649A08874a06686M4231n5999F7684b01304g2550o1890F4434a98814A6597
9056a95881A99122f2541j00388A59496e072k9210r6901f1582k43877J37403K0557
9045a47499c8922l25755A64602n1952a09167A03931i0213F73f8001j20790j84357
9034c73148a05786k53761a67978E1364a05782I9308a54158D0479O035c186B06395
9022b67054c7185o4194p1980c6136o3758j08543P2486l5665r9557B48303g3239
9010E5616k6053K26024a9996j66295C8610c1543G6055c2576H5889a883k25621
8999b27504N535A57328d6249J3270k49469B5878b75106D0125a79177O9782A5335
$$ plain form
8987 -7721 -8141 33426 74740 18093 54856 -99201 267948 192329 -589106 -65823 -115369 102358
8974 -265283 -58736 -28348 -261023 41297 -160385 33390 -321178 -149497 -285011 234188
8963 165320 -246230 15566 216258 348993 -201052 -56789 119255 -365274 93215 52176
8953 52176 -36504 -82029 -370263 203054 229303 -412189 -161991 48924 144158 -57251 -35997
8942 -35997 -400849 99066 -154937 23709 -116815 25651 -178167 -84829 -41679 161823 403283
8931 403283 90501 220359 73973 -132445 -250002 510633 32789 316509 300597 843844
8921 843844 1513715 4883111 16168537 4339236 1590577 1220340 878351 91404 125363
8912 125363 189342 214464 -94289 51683 84170 -4914 603032 205239 -217216 233757 -515239
$$ packed form
8987g721m20C3426M1314A8093L6763i9201B67948p5619e89106f5823m9546A02358
8974b65283e8736b8348k32675D1297a60385C3390c21178a49497j35514B34188
8963A65320b46230A5566K00692J32735b01052e6789A19255c65274I3215m1039
8953E2176c6504m5525k88234B03054K6249d12189a61991D8924R5234e7251K1254
8942c5997l64852I9066a54937B3709a16815B5651a78167h4829d1679A61823K41460
8931D03283I0501J29858G3973a32445j17557E10633C2789K83720j5912N43247
8921H43844O69871L369396J1285426D339236A590577l70237l41989I1404L3959
8912A25363O3979K5122i4289E1683L2487d914F03032B05239b17216B33757e15239
$$ plain form
8900 -138129 -114457 -63322 -77666 -162423 164984 89739 67969 -23307 -429845 -333454 144357
8888 -252458 333036 -274580 -315237 -122786 -24889 -168394 -115297 -118518 211891 -225021 -99883
8876 -181441 -124821 179577 -92088 -365362 148679 22436 72441 -110144 30260 245895 -137397
8864 -294195 71090 -87232 -62666 -36206 69646 -71190 -93706 -60843 -129726 -245219 796 -177959
8851 -64053 227970 22811 -5038 -123974 -65529 -634342 64780 16880 -194033 -264915 -415822
$$ packed form
8900a38129K3672N1135j4344q4757A64984p5245k1770b3307m06538R6391A44357
8888b52458C33036b74580m0657a22786b4889j43505N3097l221B11891b25021i9883
8876a81441N6620A79577i2088k73274A48679B2436N0005a10144C0260K15635a37397
8864b94195G1090h7232K4566K6460F9646g1190k2516L2863o8883j15493G96a77959
8851f4053B27970B2811e038j18936N8445n68813F4780A6880a94033p0882j50907
$$ [...]
##END NTUPLES=NMR SPECTRUM
##END=
