
##TITLE=AC1213_BRAAS12064_7164184_Es8uZslE2v
##JCAMPDX= 6.0         $$ Bruker NMR JCAMP-DX V2.0
##DATA TYPE= NMR SPECTRUM
##DATA CLASS= NTUPLES
##ORIGIN= BRUKER
##OWNER= Administrator
$$ 1.72 TOPSPIN		Version 2.1
$$ 2013-01-30 03:43:30.100 -0500  Administrator@X
$$ Compression mode = diff/dup
##.OBSERVE FREQUENCY= 400.02188249412
##.OBSERVE NUCLEUS= ^1H
##.ACQUISITION MODE= SIMULTANEOUS (DQD)
##.ACQUISITION SCHEME= undefined
##.AVERAGES= 64
##.DIGITISER RES= 22
##SPECTROMETER/DATA SYSTEM= spect
##.PULSE SEQUENCE= noesygpps1d.comp
##.SOLVENT NAME= COFFEE_meoh
##.SHIFT REFERENCE= INTERNAL, COFFEE_meoh, 1, 14.96255
##AUDIT TRAIL= $$ (NUMBER, WHEN, WHO, WHERE, PROCESS, VERSION, WHAT)
$$ ##TITLE= Audit trail, TOPSPIN		Version 2.1
$$ ##JCAMPDX= 5.01
$$ ##ORIGIN= Bruker BioSpin GmbH
$$ ##OWNER= Administrator
$$ $$ E:\/data/COFFEE/nmr/AC1213_BRAAS12064_7164184_Es8uZslE2v/22/pdata/1/auditp.txt
$$ ##AUDIT TRAIL=  $$ (NUMBER, WHEN, WHO, WHERE, PROCESS, VERSION, WHAT)
(   1,<2013-01-30 03:43:24.084 -0500>,<Administrator>,<X>,<go>,<TOPSPIN 2.1>,
      <created by zg
	started at 2013-01-30 03:31:54.194 -0500,
	POWCHK enabled, PULCHK disabled,
       configuration hash MD5:
       86 BA 57 50 F2 9D 5C 9B 26 00 A9 28 5F 66 2E 89
       data hash MD5: 64K
       3B 49 3E E9 CA 28 74 10 E2 0F C4 47 53 C7 C1 C2>)
(   2,<2013-01-30 03:43:27.287 -0500>,<Administrator>,<X>,<proc1d>,<TOPSPIN 2.1>,
      <Start of raw data processing
       efp LB = 0.3 FT_mod = 6 PKNL = 1 PHC0 = 0 PHC1 = 0 SI = 128K 
       data hash MD5: 128K
       BF 49 CD DE 9F F3 EB 4E 02 E3 2C 6A 8D 60 1D F2>)
(   3,<2013-01-30 03:43:28.350 -0500>,<Administrator>,<X>,<proc1d>,<TOPSPIN 2.1>,
      <pk PHC0 = -79.0686 PHC1 = 0 
       data hash MD5: 128K
       09 8D 65 5E 71 90 98 79 98 B1 67 8A E0 DC EA 96>)
(   4,<2013-01-30 03:43:29.053 -0500>,<Administrator>,<X>,<proc1d>,<TOPSPIN 2.1>,
      <abs ABSG = 1 
       data hash MD5: 128K
       F5 07 F2 C9 7C 26 7A D9 C8 97 BC F0 36 60 DB 99>)
(   5,<2013-01-30 03:43:29.225 -0500>,<Administrator>,<X>,<proc1d>,<TOPSPIN 2.1>,
      <abs ABSG = 2 
       data hash MD5: 128K
       46 06 67 C0 63 FE 7C 05 11 CB 1D 2B 2A 6D B9 93>)
(   6,<2013-01-30 03:43:29.381 -0500>,<Administrator>,<X>,<proc1d>,<TOPSPIN 2.1>,
      <abs ABSG = 3 
       data hash MD5: 128K
       3F 1C B6 1F A9 8C 1E FC 4D 15 DC 00 20 5E 7C C2>)
(   7,<2013-01-30 03:43:29.584 -0500>,<Administrator>,<X>,<proc1d>,<TOPSPIN 2.1>,
      <abs ABSG = 4 
       data hash MD5: 128K
       7F 6D 9F 74 2F 62 8C AA 02 BD 9F 39 BE 25 85 76>)
(   8,<2013-01-30 03:43:29.772 -0500>,<Administrator>,<X>,<proc1d>,<TOPSPIN 2.1>,
      <abs ABSG = 5 
       data hash MD5: 128K
       C4 80 29 47 C7 C2 BC FE FC F2 0C 68 44 B8 D8 56>)
$$ ##END=
$$ 
$$ $$ hash MD5
$$ $$ 16 3E 16 BC E8 1D CE 49 35 2A A5 91 72 35 95 FE
##$RELAX= 
##$RELAX= 
##$RELAX= 
##$RELAX= 
##$RELAX= 
##$RELAX= 
##$RELAX= 
##$RELAX= 
$$ Bruker specific parameters
$$ --------------------------
##$DU= <E:\>
##$EXPNO= 22
$$ [...]
150 150 150 150 150 150 150 150
##$TP07= 0
##$TPNAME0= <>
##$TPNAME1= <>
##$TPNAME2= <>
##$TPNAME3= <>
##$TPNAME4= <>
##$TPNAME5= <>
##$TPNAME6= <>
##$TPNAME7= <>
##$TPOAL= (0..7)
0.5 0.5 0.5 0.5 0.5 0.5 0.5 0.5
##$TPOFFS= (0..7)
0 0 0 0 0 0 0 0
##$TUNHIN= 0
##$TUNHOUT= 0
##$TUNXOUT= 0
##$USERA1= <user>
##$USERA2= <user>
##$USERA3= <user>
##$USERA4= <user>
##$USERA5= <user>
##$V9= 5
##$VALIST= <valist>
##$VCLIST= <CCCCCCCCCCCCCCC>
##$VD= 0
##$VDLIST= <DDDDDDDDDDDDDDD>
##$VPLIST= <PPPPPPPPPPPPPPP>
##$VTLIST= <TTTTTTTTTTTTTTT>
##$WBST= 1024
##$WBSW= 4
##$XGAIN= (0..3)
0 0 0 0
##$XL= 0
##$YL= 0
##$YMAX_a= 7786581
##$YMIN_a= -16750251
##$ZGOPTNS= <>
##$ZL1= 120
##$ZL2= 120
##$ZL3= 120
##$ZL4= 120
##$ABSF1= 14.96255
##$ABSF2= -5.595632
##$ABSG= 5
##$ABSL= 3
##$ALPHA= 0
##$AQORDER= 0
##$ASSFAC= 0
##$ASSFACI= 0
##$ASSFACX= 0
##$ASSWID= 0
##$AUNMP= <proc_prof1d_extract.lims>
##$AXLEFT= 0
##$AXNAME= <>
##$AXNUC= <1H>
##$AXRIGHT= 0
##$AXTYPE= 0
##$AXUNIT= <>
##$AZFE= 0.1
##$AZFW= 0.1
##$BCFW= 0
##$BC_mod= 0
##$BYTORDP= 0
##$COROFFS= 0
##$CY= 15
##$DATMOD= 1
##$DC= 0
##$DFILT= <>
##$DTYPP= 0
##$F1P= 0
##$F2P= 0
##$FCOR= 0.5
##$FTSIZE= 131072
##$FT_mod= 6
##$GAMMA= 0
##$GB= 0
##$INTBC= 1
##$INTSCL= 1
##$ISEN= 128
##$LB= 0.3
##$LEV0= 0
##$LPBIN= 0
##$MAXI= 10000
##$MC2= 0
##$MEAN= 0
##$ME_mod= 0
##$MI= 0
##$NCOEF= 0
##$NC_proc= -2
##$NLEV= 6
##$NOISF1= 0
##$NOISF2= 0
##$NSP= 0
##$NTH_PI= 0
##$NZP= 0
##$OFFSET= 14.96255
##$PC= 1
##$PHC0= -79.0686
##$PHC1= 0
##$PH_mod= 1
##$PKNL= yes
##$PPARMOD= 0
##$PPDIAG= 0
##$PPIPTYP= 0
##$PPMPNUM= 2147483647
##$PPRESOL= 1
##$PSCAL= 4
##$PSIGN= 0
##$PYNMP= <proc.py>
##$REVERSE= no
##$SF= 400.020009016669
##$SI= 131072
##$SIGF1= 0
##$SIGF2= 0
##$SINO= 400
##$SIOLD= 131072
##$SPECTYP= <>
##$SREGLST= <1H.CDCl3>
##$SSB= 0
##$STSI= 131072
##$STSR= 0
##$SW_p= 8223.68421052631
##$SYMM= 0
##$S_DEV= 0
##$TDeff= 65536
##$TDoff= 0
##$TI= <>
##$TILT= no
##$TM1= 0
##$TM2= 0
##$TOPLEV= 0
##$USERP1= <user>
##$USERP2= <user>
##$USERP3= <user>
##$USERP4= <user>
##$USERP5= <user>
##$WDW= 1
##$XDIM= 131072
##$YMAX_p= 383448007
##$YMIN_p= -12054
##$CURPLOT= <Network HP LaserJet P1505>
##$CURPRIN= <$Network HP LaserJet P1505>
##$DFORMAT= <normdp>
##$LAYOUT= <+/1D_H.xwp>
##$LFORMAT= <normlp>
##$PFORMAT= <normpl>
##$SURQMSG= 1
$$ End of Bruker specific parameters
$$ ---------------------------------
##NTUPLES= NMR SPECTRUM
##VAR_NAME=  FREQUENCY,     SPECTRUM/REAL,   SPECTRUM/IMAG
##SYMBOL=    X,             R,               I
##VAR_TYPE=  INDEPENDENT,   DEPENDENT,       DEPENDENT
##VAR_FORM=  AFFN,          ASDF,            ASDF
##VAR_DIM=   131072,        131072,          131072
##UNITS=     HZ,            ARBITRARY UNITS, ARBITRARY UNITS
##FACTOR=    0.0627417313425164, 1,          1
##FIRST=     8223.62146879497, 763,          -61587
##LAST=      0,             2704,            -62348
##MIN=       0,             -12054,          0
##MAX=       8223.62146879497, 383448007,    0
$$ Real data points
##PAGE= N=1
##DATA TABLE= (X++(R..R)), XYDATA
$$ [...]
67515 68085 66751 65844 65961 66803 67763 68829 70349 72122 73317 73441 72948 72620 72591 72374 71763 71281 71506 72189
67497 72189 72362 71352 69502 67801 66983 67063 67562 67920 67790 67214 66590 66338 66580 67202 68130 69316 70546 71610
67479 71610 72637 73890 75156 75799 75604 75119 74830 74467 73568 72413 71741 71678 71618 71205 70915 71411 72742 74356
67461 74356 75627 76249 76389 76561 77092 77719 78065 78416 79494 81280 82707 82898 82274 81956 82383 83011 83147 82602
67443 82602 81626 80675 80223 80413 80800 80729 79999 78952 77997 77333 77091 77378 78093 79011 80072 81333 82570 83303
67425 83303 83390 83296 83520 83950 84128 83951 83828 84117 84729 85343 85678 85493 84568 82997 81326 80170 79712 79776 80241
67406 80241 81060 81951 82501 82722 83068 83715 84235 84336 84483 85210 86095 86125 85080 83927 83692 84449 85576 86422
67388 86422 86490 85538 83998 82974 83313 84788 86461 87575 87845 87265 86178 85297 85072 85079 84535 83468 82836 83347
67370 83347 84584 85585 85943 86022 86218 86399 86178 85609 85389 86265 88241 90512 92204 93090 93527 93934 94450 94980
67352 94980 95328 95339 95039 94553 93894 93042 92313 92325 93292 94593 95402 95658 96013 96915 98104 99013 99402 99503 99773
67333 99773 100448 101198 101353 100752 100157 100372 101097 101227 100370 99451 99486 100292 100914 101004 101225 102340 104266 106159 107172
67314 107172 107103 106492 106153 106557 107599 108888 110118 111112 111638 111442 110490 109138 107994 107526 107719 108144 108453
67297 108453 108745 109330 110165 110813 110989 110919 111009 111335 111626 111667 111574 111739 112569 114103 115835 117007 117188 116477 115167
67278 115167 113510 111966 111262 111770 112928 113725 113784 113611 113735 114034 114121 114039 114211 114869 115929 117323 119066 120864
67260 120864 122060 122202 121572 120962 121057 122129 124089 126476 128470 129356 129110 128377 127800 127564 127611 127913 128346 128563
67242 128563 128327 127820 127383 127096 126901 126983 127639 128810 130077 131190 132269 133409 134435 135173 135729 136282 136813
67225 136813 137220 137538 137885 138318 138870 139629 140584 141488 141987 141905 141411 141073 141669 143553 146010 147589 147489 146524
67207 146524 146354 147786 150205 152579 154517 156138 157336 157701 157125 156117 155388 155288 155696 156287 156778 157009
67191 157009 157041 157226 158056 159723 161806 163526 164430 164833 165505 166956 169045 171174 172713 173279 172869 171887 170989
67174 170989 170711 171243 172549 174527 176907 179076 180399 180840 181080 181834 183162 184588 185809 187054 188740
67159 188740 190945 193271 195120 196142 196542 196961 197934 199410 200897 202033 202872 203664 204610 205811 207192 208431
67143 208431 209297 210214 212106 215296 218843 221349 222345 222497 222630 223035 223712 224669 225756 226696 227639 229294 232056
67126 232056 235266 237845 239539 241012 242745 244522 246154 248040 250472 252825 254230 254917 256137 258537
67112 258537 261259 263048 263740 264109 264664 265357 266377 268385 271615 275327 278583 281208 283599 285906 287959
67097 287959 289833 291907 294244 296393 298077 299790 302366 305998 309894 312963 314763 315755 316750 318213 320131
67082 320131 322373 324958 327984 331444 335173 338807 341819 343856 345233 346844 349382 352716 356217 359467
67068 359467 362443 365133 367405 369327 371371 374198 378206 383203 388371 392696 395733 397952 400226 403087
67054 403087 406622 410856 415774 420959 425675 429495 432622 435458 438181 440942 444199 448414 453416 458367
67040 458367 462537 466050 469720 474128 478953 483348 486882 489919 493098 496684 500539 504403 508010 511174
67026 511174 514103 517388 521404 525879 530465 535479 541546 548565 555643 562135 568229 574320 580352 586103
67012 586103 591774 597874 604720 612251 620151 627971 635321 642141 648588 654648 660216 665659 671761 678750
66998 678750 685810 692083 697829 703995 710861 717788 724313 730863 738168 746511 755879 766336 777730 789206
66984 789206 799597 808452 816391 824378 832896 842040 852044 863170 874994 886263 895917 904129 912008
66971 912008 920388 929256 938333 947716 957688 968229 979009 989717 1000190 1010386 1020461 1030749
66959 1030749 1041443 1052430 1063601 1075210 1087682 1101140 1115265 1129563 1143596 1157115 1170211
66948 1170211 1183244 1196404 1209419 1221901 1233880 1245772 1257935 1270552 1283849 1297968 1312584
66937 1312584 1327012 1340964 1354946 1369706 1385410 1401536 1417347 1432268 1445966 1458486 1470399
66926 1470399 1482544 1495365 1508549 1521517 1534304 1547724 1562536 1578517 1594601 1609909 1624429
66915 1624429 1638621 1652643 1666259 1679365 1692244 1705159 1717888 1729908 1741020 1751684 1762609
66904 1762609 1774064 1785690 1797004 1807957 1818847 1829781 1840483 1850654 1860248 1869232 1877333 1884312
66892 1884312 1890423 1896361 1902716 1909598 1916745 1923747 1930158 1935599 1939965 1943496 1946594 1949557 1952463 1955213
66878 1955213 1957638 1959606 1961046 1961876 1961956 1961199 1959742 1957920 1956006 1953973 1951554 1948496 1944703 1940167 1934882
66863 1934882 1928906 1922440 1915675 1908535 1900761 1892306 1883520 1874732 1865788 1856227 1845857 1834976 1824026
66850 1824026 1813260 1802770 1792576 1782518 1772247 1761431 1749927 1737719 1724836 1711414 1697704
66839 1697704 1683897 1670006 1655941 1641636 1627127 1612624 1598456 1584738 1571062 1556797 1541779
66828 1541779 1526493 1511526 1497050 1482944 1469120 1455518 1441921 1428051 1413751 1399035 1384030
66817 1384030 1368965 1354052 1339296 1324616 1310182 1296390 1283370 1270784 1258217 1245471 1232342
66806 1232342 1218519 1204028 1189460 1175408 1161886 1148666 1135857 1123698 1111912 1099872 1087392
66795 1087392 1074890 1062709 1050773 1039045 1027843 1017341 1007034 996115 984337 972283 960736
66784 960736 950002 939876 930099 920637 911470 902318 892809 882931 873026 863295 853546 843597 833731 824480
66770 824480 816020 807956 799648 790672 781083 771332 761883 752815 743880 734968 726279 718027 710236 702910
66756 702910 696089 689591 683015 676165 669202 662247 655252 648427 642222 636575 630734 624359 618228 613145
66742 613145 608575 603180 596505 589311 582352 575654 568977 562212 555234 548136 541679 536722 532965 529019
66728 529019 523991 518376 513111 508461 504213 500239 496380 492277 487834 483451 479386 475333 471044 466867
66714 466867 463196 459823 456344 452804 449435 446113 442661 439316 436323 433372 430033 426440 422861 418920
66700 418920 414061 408670 403897 400281 397332 394565 392123 390017 387568 384199 380363 377082 374775 372944
66686 372944 370860 368140 364749 360884 356935 353297 350059 346924 343498 339621 335433 331193 327069 323175
66672 323175 319755 317082 314987 312658 309271 304929 300753 297887 296589 296284 296235 296023 295579 295002 294308 293235
66656 293235 291410 288850 286141 283945 282373 281027 279583 278069 276548 274853 272869 270902 269466 268682
66642 268682 268108 267251 266109 265053 264243 263341 261855 259661 257101 254554 252032 249268 246188 243133 240558
66627 240558 238598 237092 235920 235092 234524 233989 233393 232826 232230 231273 229783 228092 226648 225442 224127 222561
66611 222561 220901 219216 217395 215404 213370 211380 209540 208180 207598 207577 207514 207097 206520 205965 205305 204436 203468
66594 203468 202397 200984 199182 197348 195790 194467 193272 192209 191124 189817 188739 188868 190299 191529
66580 191529 190929 188650 186274 184844 184099 183498 182996 182600 182003 181062 180043 179115 178138 177223 176902 177322 177791
66563 177791 177577 176790 176027 175562 175311 175252 175292 174993 174016 172696 171720 171295 171085 170820 170435 169711 168388 166693
66545 166693 165175 163932 162549 160930 159573 158706 157814 156514 155359 155092 155437 155423 154814 154416 154752 155119 154394
66528 154394 152369 149862 147748 146268 145180 144182 143133 142094 141233 140640 140277 140135 140275 140549 140434 139417
66512 139417 137516 135318 133525 132581 132584 133310 134298 135082 135389 135102 134202 132907 131683 130831 130164 129366 128553 128086
66494 128086 127865 127275 125965 124373 123283 123079 123527 123987 123765 122582 120918 119666 119276 119446 119719 119974 120161
66477 120161 119995 119307 118386 117630 117079 116658 116567 116942 117365 117235 116542 115746 115020 114152 113196 112595 112524 112646 112688 112767
66457 112767 112916 112819 112318 111761 111431 111078 110420 109801 109833 110606 111727 112911 113997 114529 114023 112664 111184 109940
66439 109940 108697 107435 106668 106584 106527 105912 105183 105131 105565 105436 104260 102656 101332 100244 99080 98025 97569
66422 97569 97884 98785 100014 101230 101952 101900 101275 100443 99512 98486 97556 96883 96331 95834 95799 96630 97985 99046
66404 99046 99423 99282 98734 97758 96763 96458 96950 97535 97648 97479 97352 97131 96631 96129 95952 95955 95821 95559 95266 94774
66384 94774 93984 93247 92934 92904 92903 93105 93690 94158 93818 92849 92161 92195 92449 92278 91569 90517 89284 88068 87088
66365 87088 86321 85631 85154 85099 85161 84719 83793 83213 83557 84425 85113 85479 85734 85822 85598 85323 85393 85659 85556 84922
66345 84922 84209 83778 83363 82489 81210 80185 80048 80846 82071 83152 83825 84144 84222 84025 83346 81980 80074
66328 80074 78277 77318 77259 77448 77364 77202 77352 77643 77645 77471 77607 78005 78082 77696 77400 77472 77419 76887 76411 76639 77258
66307 77258 77420 76954 76477 76383 76410 76227 75866 75465 74983 74442 74118 74309 75019 75945 76645 76820 76632 76710 77524 78776
66287 78776 79649 79658 78995 78109 77324 76927 77171 77952 78673 78702 77982 77101 76791 77288 78080 78324 77663 76570 75768 75456
66267 75456 75360 75320 75398 75481 75303 74988 75075 75783 76696 77391 77954 78563 78961 78800 78208 77511 76621 75248 73623 72463
66247 72463 72142 72294 72299 71862 71136 70683 71274 73183 75485 76556 75567 73218 70859 69278 68511 68312 68319 68101
66229 68101 67507 66836 66381 66068 65908 66392 67871 69770 71049 71335 71001 70342 69504 69184 70332 72746 74805
66212 74805 75202 74316 73304 72525 71634 70741 70383 70504 70451 70109 70213 71262 72781 74002 74712 75097 75222 75108
66194 75108 74955 74806 74276 73065 71592 70696 70711 71134 71204 70555 69358 68095 67244 66966 67041 67247 67739 68835
66176 68835 70422 71859 72570 72530 72010 71094 69771 68416 67771 68245 69436 70537 71048 70896 70144 68986 68024
66159 68024 67993 68981 70189 70682 70134 68721 66724 64573 62928 62116 61630 60697 59296 58118 57608 57609 57956 58754
66141 58754 59845 60616 60755 60741 61162 61929 62633 63299 64194 65069 65236 64492 63440 62732 62393 62086 61689 61335 61107
66122 61107 60969 60978 61273 61831 62378 62646 62592 62301 61721 60733 59511 58593 58357 58562 58671 58585 58745 59475 60557 61605
66102 61605 62450 62911 62558 61189 59451 58468 58746 59700 60368 60312 59736 59023 58451 58215 58414 58908 59334 59431 59338
66083 59338 59472 60050 60800 61260 61354 61509 62212 63477 64808 65570 65412 64516 63486 62851 62607 62403 62185 62354
66065 62354 63094 63870 63929 63190 62250 61609 61258 61021 60876 60767 60495 60021 59630 59556 59674 59836 60277 61277 62581
66046 62581 63632 64411 65525 67168 68450 68196 66360 64155 62749 62112 61324 59787 57871 56446 55938 55967
66030 55967 55922 55735 55875 56576 57418 57941 58347 59102 59965 60124 59357 58505 58471 59284 60456 61710 62831 63304 62804
66011 62804 61840 61305 61521 62261 63413 64884 66012 65975 64937 64034 63975 64319 64400 64315 64598 65416 66436 67104 66874
65992 66874 65613 64054 63285 63533 63989 64096 64251 64816 65254 64955 64271 63943 63972 63972 64194 65177 66575 67329 67021
65973 67021 66222 65496 64915 64649 65122 66253 67308 67801 67957 68002 67724 67127 66866 67458 68454 68968 68784 68530 68845
65954 68845 69705 70405 70084 68443 66145 64264 63222 62548 61766 61054 60765 60771 60726 60675 60881 61228 61224 60634 59773 59217
65934 59217 59376 60262 61437 62297 62639 62858 63441 64402 65357 65966 66121 65889 65538 65440 65683 65944 65972 66002 66352 66794
65914 66794 66767 66166 65510 65298 65525 65891 66158 66222 66061 65720 65183 64293 63069 62090 62185 63556 65473 66998 67809
65895 67809 68135 68166 67857 67266 66735 66584 66715 66644 65956 64759 63638 63108 63109 63169 63063 63109 63657 64428 64655 63899
65875 63899 62541 61343 60667 60333 60153 60298 60939 61770 62220 62122 61839 61596 61104 60137 59231 59291 60472 61886
65857 61886 62577 62440 61996 61637 61403 61304 61405 61648 61938 62460 63601 65443 67500 69041 69550 68901 67356 65508
65839 65508 63994 63066 62543 62219 62065 61957 61578 60904 60486 60806 61534 61897 61762 61831 62646 63854 64714 64920 64645
65820 64645 64138 63663 63612 64172 64919 65150 64701 64131 64071 64716 66033 68075 70740 73406 75191 75675 75216 74504
65802 74504 73939 73539 73278 73229 73263 72843 71429 69199 67146 66287 66775 67898 68897 69617 70356 71246 72022 72413
65784 72413 72555 72841 73419 74052 74514 74818 74931 74533 73385 71807 70448 69632 69224 69045 69021 68947 68608 68194 68153
65765 68153 68454 68474 67856 66957 66161 65248 63950 62676 62046 61912 61485 60349 58838 57480 56612 56525 57373 58768
65747 58768 59923 60380 60295 59985 59561 59132 58915 58980 59160 59320 59417 59227 58419 57066 55784 55176 55385 56218 57386
65728 57386 58518 59291 59760 60259 60861 61243 61156 60661 59795 58564 57472 57474 58896 60771 61786 61631 61002 60554
65710 60554 60402 60467 60666 60713 60225 59161 57858 56589 55451 54687 54716 55634 56983 58177 58945 59251 59004 58150
65692 58150 56935 55876 55414 55577 55947 55966 55387 54468 53706 53428 53679 54375 55381 56398 56997 56895 56178 55257
65674 55257 54625 54601 55174 56037 56902 57773 58864 60172 61251 61536 60940 60034 59568 59795 60341 60702 60732 60571 60277
65655 60277 59788 59209 58857 58938 59352 59894 60468 61024 61448 61643 61590 61291 60854 60686 61288 62631 63995 64685 64695
65636 64695 64356 63656 62438 61219 61017 62058 63089 62592 60548 58499 57792 58206 58560 58286 57920 58108 58676
65619 58676 58941 58584 57812 56851 55733 54622 53903 53741 53824 53797 53820 54403 55754 57504 59061 60087 60595 60735
65601 60735 60626 60401 60271 60374 60504 60226 59451 58710 58575 58917 59046 58532 57524 56278 54891 53637 53040 53195
65583 53195 53402 52876 51688 50649 50477 51401 53306 55747 57885 58919 58765 58048 57416 57109 57144 57475 57898
65566 57898 58119 58136 58297 58757 59111 58794 57750 56483 55475 54773 54210 53873 54070 54828 55621 55841 55467 55001
65548 55001 54751 54484 53902 53104 52384 51846 51511 51514 51847 52151 52199 52395 53250 54459 55091 54777 54117 53719 53431 52940
65528 52940 52648 53327 55057 57054 58604 59787 61151 62915 64632 65536 65185 63903 62593 61990 62078 62327
65512 62327 62465 62808 63749 65122 66269 66737 66755 66933 67615 68615 69582 70464 71478 72691 73806 74515 74931
65495 74931 75447 76141 76580 76415 75973 75945 76503 77106 77323 77437 77888 78402 78190 76996 75523 74707 74918 76003
65477 76003 77709 79760 81793 83559 85078 86370 87171 87265 87025 87334 88825 91312 94004 96180 97641 98608
65461 98608 99283 99579 99339 98681 97906 97077 95934 94340 92590 91134 90130 89420 88709 87652 85949 83607
65445 83607 80994 78509 76315 74478 73068 71940 70687 69149 67751 67012 66829 66542 65638 64119 62337
65430 62337 60775 59827 59458 59112 58309 57247 56554 56538 57002 57658 58295 58575 58185 57309 56565 56317 56339 56267 56104
65411 56104 56156 56722 57941 59731 61742 63477 64528 64676 63947 62854 62343 63065 64729 66490 67865 68818
65395 68818 69120 68432 67172 66550 67271 68651 69498 69514 69360 69625 70274 71037 71868 72891 74126 75374 76339 76960
65377 76960 77622 78858 80736 82747 84431 85847 87304 88910 90704 93006 96303 100784 106211 112161 118306
65362 118306 124554 131076 138055 145276 152108 157979 162693 166181 168220 168598 167289 164256 159427 153197
65348 153197 146676 140969 136297 132170 128213 124377 120488 116251 111860 108171 105977 105368 105889 107007 108231
65333 108231 109058 109140 108429 107057 105219 103249 101488 99805 97474 93942 89721 86168 84220 83556 83080 81973
65317 81973 80128 77824 75429 73387 72111 71638 71562 71447 71147 70614 69658 68207 66674 65671 65300 65030 64381
65300 64381 63516 63007 63215 63990 64860 65363 65292 64744 63951 63104 62352 61817 61420 60797 59692 58389 57465 57101 56978
65281 56978 56858 56863 57089 57409 57853 58741 60058 61083 61077 60110 58787 57418 56002 54898 54813 55910 57354 58049
65263 58049 57647 56696 55953 55776 56073 56681 57583 58653 59305 58818 57288 55943 56082 57780 59995 61815 63106
65246 63106 64022 64531 64738 65187 66343 68020 69630 70848 71735 72361 72715 72953 73366 74003 74512 74470 73740 72530
65228 72530 71264 70381 70026 69870 69368 68336 67107 66144 65607 65367 65199 64828 64037 62967 62091 61592 60927 59467
65210 59467 57530 56264 56339 57125 57440 56749 55385 53916 52734 52041 51774 51538 50954 50035 48995 47869 46732
65193 46732 46100 46529 47803 49018 49644 49983 50458 50959 51206 51297 51488 51746 51881 51871 51746 51389 50818 50415 50519
65174 50519 50994 51508 52041 52690 53215 53279 53044 53013 53252 53261 52696 51805 51047 50645 50642 51028 51559 51752 51356 50727 50513
65153 50513 51041 52085 53146 53837 54092 54133 54192 54254 54146 53887 53811 54248 55154 56144 56864 57314 57779 58406 58900 58732
65133 58732 57729 56350 55283 54900 55157 55830 56644 57326 57830 58458 59552 61050 62543 63681 64351 64594 64640
65116 64640 64909 65649 66518 66876 66540 65959 65627 65614 65828 66317 67127 68125 69256 70812 73182 76391 80017 83479
65098 83479 86312 88356 89890 91529 93854 97143 101377 106271 111247 115744 119802 124048 128831 133605
65084 133605 137518 140375 142581 144293 145195 145144 144412 143075 140700 137014 132489 127833 123237 118605 114229
65069 114229 110524 107184 103338 98772 94364 90909 88031 84738 80709 76480 72642 69430 66994 65415
65055 65415 64342 63149 61656 60286 59362 58685 57999 57465 57352 57580 57910 58315 58820 59130 58775 57642 56173
65038 56173 55045 54691 54967 55216 54909 54282 54025 54275 54434 54202 54142 54745 55515 55691 55454 55508 55686 55006 53187
65019 53187 51184 49928 49377 49179 49444 50208 50792 50503 49679 49359 50014 51202 52313 53059 53282 52924 52361 52311
65001 52311 53101 54259 55004 54969 54441 54084 54472 55608 56744 56888 55730 53989 52769 52654 53490 54832 56365
64984 56365 57871 59030 59489 59176 58466 57854 57433 56793 55556 53939 52630 52126 52338 52813 53147 53146 52797 52327
64966 52327 52193 52739 53770 54626 54791 54408 54065 54066 54020 53233 51525 49550 48227 47914 48215 48583 48881 49238 49579
64947 49579 49575 49077 48325 47662 47242 47123 47409 48089 48893 49521 49940 50282 50574 50790 51108 51813 52964 54319 55575
64928 55575 56452 56700 56364 56018 56301 57097 57574 57207 56432 56062 56337 56817 56985 56719 56338 56337 56899 57523 57420 56423
64908 56423 55201 54424 54088 53959 54199 55068 56348 57611 58817 60086 61068 61202 60570 59903 59710 59912 60342
64891 60342 60987 61632 61816 61354 60477 59354 57943 56444 55342 54811 54566 54500 54933 55957 57109 58095 59234
64874 59234 60714 61969 62378 62183 61984 61701 60832 59518 58477 57900 57300 56616 56607 57734 59304 60226 60113 59175
64856 59175 57513 55265 53123 51943 51779 51909 51889 52033 52697 53625 54328 54650 54627 54168 53376 52871 53213 54089
64838 54089 54654 54663 54683 55047 55269 54874 54289 54363 55238 56284 56997 57479 57946 58284 58299 58099 57968 57969 57888 57528 56962
64817 56962 56415 55959 55445 54873 54675 55352 56748 58035 58513 58183 57406 56451 55660 55568 56348 57350 57711 57300
64799 57300 56657 56248 56296 57067 58620 60326 61349 61647 61837 62013 61444 59724 57503 55701 54530 53700 53110
64782 53110 52906 53164 53840 54731 55334 55173 54563 54462 55187 55862 55645 54984 54936 55642 56297 56532 56962 58240 60116
64763 60116 61690 62210 61526 60070 58559 57541 57118 57151 57553 58222 58852 59133 58994 58484 57599 56535 55862 56035
64745 56035 56875 57873 58874 60025 61250 62254 62973 63524 63764 63428 62704 62136 61893 61621 61155 60821 60853 61022
64727 61022 61114 61286 61667 62009 62090 62063 61972 61360 59938 58403 57885 58555 59409 59636 59679 60509 62188 63710 64255
64708 64255 64160 64371 65223 66147 66527 66420 66186 65711 64459 62308 59937 58221 57485 57570 58361 59800 61444 62491
64690 62491 62545 62080 61845 61931 61799 61157 60373 59867 59542 59116 58710 58643 58831 58877 58768 59046 60179 62133 64560
64671 64560 66981 68674 68937 67864 66523 65978 66251 66520 66121 65003 63452 61824 60572 60143 60693 61960
64655 61960 63455 64739 65608 66091 66206 65809 64940 64180 64196 64843 65264 65099 64960 65311 65572 65023 64049 63605 63755
64636 63755 63700 63107 62413 61736 60539 58720 57175 56759 57347 58389 59764 61456 62932 63644 63891 64460 65443
64619 65443 66058 65720 64808 64129 63990 64044 63918 63700 63694 63842 63666 62940 62193 62194 63010 64013 64770 65419 66072 66458
64599 66458 66473 66498 66757 66850 66468 66102 66332 66736 66351 65108 63941 63432 63205 62922 62990 63715 64430 64210 63124
64580 63124 62143 61933 62346 62996 63722 64402 64791 64783 64533 64226 63970 63997 64631 65874 67272 68314 68795 68695 67979
64561 67979 66761 65451 64529 64230 64564 65487 66841 68276 69420 70101 70339 70246 70051 69990 70027 69888 69536 69327
64543 69327 69405 69261 68329 66834 65566 64921 64680 64672 65040 65727 66299 66557 66872 67591 68457 68926 68763 68027 66800
64524 66800 65273 63914 63207 63295 64063 65332 66782 67942 68545 68752 68779 68554 68028 67532 67456 67683 67725 67316 66563
64505 66563 65618 64535 63441 62559 62067 62111 62791 63933 65008 65579 65721 65775 65849 65850 65825 65879 65882 65652 65414 65653 66479
64484 66479 67462 68101 68216 67922 67544 67555 68237 69310 70097 70099 69244 67676 65654 63637 62203 61726 62227 63419
64466 63419 64783 65850 66671 67775 69360 70800 71412 71423 71611 72111 72276 71730 70931 70525 70679 71219 71891 72263
64448 72263 71875 70816 69848 69684 70344 71292 71893 71664 70546 69136 68306 68312 68557 68343 67600 66799 66449 66793 67597
64429 67597 68221 68376 68860 70937 74707 78636 81090 81908 82174 82963 84729 87450 90737 94044 97221 100702
64413 100702 104769 108914 112355 114891 116786 118050 118467 118216 117896 117844 117850 117536 116655 115007 112528 109516 106433
64396 106433 103377 100091 96562 93250 90533 88216 85844 83353 81189 79749 78874 77984 76774 75618 75108
64381 75108 75176 75013 74007 72501 71264 70414 69375 67904 66659 66431 67132 67974 68537 69201 70366 71655 72280
64364 72280 72080 71716 71776 72090 72171 71971 71789 71680 71382 70810 70227 69926 70008 70463 71148 71770 72193 72700 73561 74494
64344 74494 75013 75180 75437 75741 75617 75191 75352 76530 77958 78668 78630 78427 78330 78332 78667 79601 80873 81937 82676
64325 82676 83361 84009 84267 83968 83433 83225 83817 85380 87585 89724 91279 92235 92734 92745 92397 92235 92672 93382
64307 93382 93683 93342 92612 91753 90999 90770 91314 92175 92540 92173 91614 91514 92161 93552 95397 97085 98148 98787
64289 98787 99549 100530 101425 102345 103912 106308 108816 110666 111959 113342 115013 116463 117220 117551 118250 119716
64273 119716 121379 122243 122037 121513 121429 121630 121496 120970 120512 120173 119438 118120 116762 115845 115051 113695 111633
64256 111633 109440 107855 107237 107374 107634 107434 106815 106457 106961 108132 109102 109175 108501 107927 108159 109162 110397
64239 110397 111546 112748 114163 115675 117226 119081 121514 124493 127947 131916 136071 139478 141473 142586
64225 142586 143968 145953 147788 148774 149006 148851 148341 147398 146229 145095 143934 142450 140460 138055 135598
64210 135598 133589 132335 131723 131491 131550 131747 131513 130383 128879 128274 129265 131320 133529 135598 137676 139698
64194 139698 141383 142696 143882 145068 146119 146870 147375 147884 148589 149307 149483 148640 146824 144532 142381 140967
64178 140967 140730 141495 142368 142584 142377 142535 143202 143747 143805 143815 144381 145733 147909 150817 153842 156043 157104
64161 157104 157646 158328 159203 160249 161943 164784 168666 173116 177798 182500 187187 192436 199231 207775 217026
64146 217026 225991 234986 244907 255754 266662 277026 286652 294953 301081 305036 307799 310037 311287
64133 311287 310692 307963 303292 296848 288858 279928 270871 262207 254024 246223 238804 232027 226266 221549
64119 221549 217244 212513 207186 202024 198042 195691 194682 194361 194229 194285 194955 196547 198761 200932 202698
64104 202698 204213 205748 207417 209365 211880 215093 218794 222759 227079 231937 237198 242447 247421 252276
64090 252276 257477 263519 270632 278478 286160 292761 298047 302482 306464 309691 311476 311544 310194 307697 303956
64075 303956 298979 293369 287949 283018 278325 273666 269105 264601 259917 255083 250611 246952 244035 241615
64061 241615 239833 239098 239437 240345 241359 242593 244588 247691 251671 255977 260312 264843 269864 275427 281499
64046 281499 288205 295653 303660 312004 320873 330618 341063 351463 361205 370189 378547 386517 394655 403509
64032 403509 412817 421562 429140 435924 442276 447733 451798 455050 458662 463083 467928 472951 478356 484235
64018 484235 490467 497284 505189 514120 523256 531851 539745 546881 552911 557657 561570 565309 569081 572656
64004 572656 575852 578809 581960 585911 591141 597648 605020 613009 621926 632406 644946 659653 676216
63991 676216 694061 712840 732905 755074 779852 807106 836594 868544 903492 941788 983476
63980 983476 1028515 1076950 1129016 1185121 1245592 1310437 1379725 1454336 1535992 1626339 1726411
63969 1726411 1837313 1961019 2099996 2256422 2432559 2631964 2859634 3120741 3419783
63960 3419783 3761267 4150701 4594267 5097632 5665268 6300360 7004263 7775497 8609447
63951 8609447 9499116 10435935 11409764 12408445 13417500 14419887 15395675 16322338 17176148
63942 17176148 17934085 18575419 19082931 19443993 19650965 19700328 19591424 19326183 18909802
63933 18909802 18351190 17662867 16861153 15966536 15002802 13994532 12964579 11933111 10917738
63924 10917738 9933545 8992981 8106132 7280999 6523211 5835635 5218725 4671218 4190277
63915 4190277 3771243 3407948 3093695 2822019 2586882 2382765 2204891 2049223 1912231
63906 1912231 1790822 1682528 1585569 1498569 1420181 1348886 1283100 1221658 1164246 1111049 1061771
63895 1061771 1015262 970414 927090 885819 846829 809880 774811 741587 709921 679480 650570
63884 650570 623855 599191 575426 551774 528842 507700 488316 469644 451143 433552 417903
63873 417903 404218 391547 379146 367273 356745 347893 340200 332914 325828 319352 314000 309969 307002
63860 307002 304401 301283 297236 292821 289216 287244 286801 287175 287697 288080 288394 288846 289469 290012 290172 289914 289415
63843 289415 288863 288393 288028 287386 285713 282605 278484 273911 268604 261857 253951 246348 240151 234979 229779
63828 229779 224248 218889 214006 209258 204177 198776 193614 189414 186439 184048 181075 176895 171937 167035
63814 167035 162622 158840 155990 154312 153446 152589 151198 149260 147033 144832 142923 141231 139295 136918 134726
63799 134726 133570 133437 133453 132965 132078 131060 129847 128410 127099 126210 125572 124929 124447 124433 124701 124563 123443
63782 123443 121313 118656 116205 114582 113937 113965 114401 115316 116684 117908 118192 117400 116209 115414 115310 115701 116160
63765 116160 116246 115836 115369 115440 116020 116424 116268 116087 116662 117978 119233 119728 119387 118526 117572 117009 117144 117772 118349
63746 118349 118660 119065 120027 121619 123568 125514 127150 128459 129925 132194 135308 138679 142016 145881 150919
63731 150919 156902 163085 169266 175915 183349 191394 199919 209044 218514 227328 234410 239455 242858 244925
63717 244925 245423 243870 240143 234798 228792 222781 216802 210791 205201 200648 196953 193078 188234 182647
63703 182647 176950 171335 165758 160602 156459 153332 150673 148257 146483 145601 145121 144319 143057 141770 140822
63688 140822 140258 140114 140630 142023 144304 147482 151725 157099 163089 168711 173300 177222 181679 187723 195448
63673 195448 204095 212809 221168 229013 235964 241320 244520 245611 245153 243592 240769 236149 229530 221493
63659 221493 213079 205066 197609 190535 183821 177662 172233 167598 163870 161153 159202 157381 155246 153078
63645 153078 151564 151037 151284 152041 153334 155312 158035 161495 165491 169518 173191 176887 181497 187298 193601
63630 193601 199840 206498 214383 223424 232901 242682 253469 265789 279394 293787 308794 324409 340598
63617 340598 357490 375373 394273 413818 433664 453610 473024 490485 504426 514061 519545 521433
63605 521433 520231 516385 510461 503261 495682 488333 481396 474993 469443 464760 460028 453876 445736 436147
63591 436147 425711 414293 401576 387923 374273 361444 349883 339765 330883 322658 314659 307069
63579 307069 300437 295168 291436 289246 288176 287334 286073 284673 283936 284231 285342 287129 289866 293921 299501
63564 299501 306840 316233 327744 341083 355866 371794 388582 406012 424213 443609 464326 485713
63552 485713 506676 526540 545477 563903 581380 596301 606949 612902 615288 615724 615301 614624 614286
63539 614286 614844 616449 618787 621303 623286 623859 622161 617537 609567 598120 583518 566392 547146 525791
63525 525791 502455 477740 452369 426867 401909 378526 357382 338130 320114 303500 289079
63514 289079 277057 266746 257523 249402 242501 236614 231618 227723 224955 222758 220517 218220 216302 215110
63500 215110 214736 215063 215679 216049 216171 216864 219092 223103 228489 234853 242099 250180 258997 268524 278714
63485 278714 289286 299873 310428 321185 332064 342309 350904 357271 361424 363532 363572 361495 357513
63472 357513 351964 344912 336194 325975 314976 303914 292981 282209 272150 263651 256977 251645 247230
63459 247230 243816 241420 239473 237285 234804 232527 230887 230009 229887 230455 231625 233557 236678 241128 246335
63444 246335 251618 257039 263220 270406 278297 286841 296591 308047 321156 335775 352173 370609 390699
63431 390699 411713 433315 455614 478631 502293 526910 553062 580745 609018 636804 663672
63420 663672 689407 713017 732690 746865 755054 757561 754854 747559 736862 724370 711351 698285
63408 698285 685262 672568 660549 648928 636628 622468 605971 587415 567301 546053 524170
63397 524170 502297 480941 460243 440189 420983 403092 386985 372939 361107 351575 344296 339024
63385 339024 335433 333334 332724 333578 335624 338450 341923 346420 352517 360481 370208 381571 394576 409111
63371 409111 424817 441418 459063 478224 499276 522269 546947 572905 599746 627124 654437
63360 654437 680486 703714 722998 737960 748447 754037 754440 750040 741671 730142 716407 701874
63348 701874 687795 674386 661117 647863 635029 622425 608876 593417 576293 558250 539349
63337 539349 519174 497945 476706 456371 437110 418739 401287 385016 370162 356859 345169
63326 345169 335058 326365 318865 312350 306719 301975 298077 294794 291829 289106 286756 284833 283213 281819
63312 281819 280717 279965 279580 279660 280203 280741 280578 279567 278331 277510 277134 276935 276849 276849 276586 275601 273798 271466
63294 271466 269138 267570 267414 268502 269751 270251 270222 270554 271769 273829 276500 279216 280982 281235 280729 280769
63278 280769 281619 282393 282526 282493 282851 283424 283867 284353 285160 286051 286622 286965 287501 288368 289393 290535 291881 293308
63260 293308 294529 295533 296707 298398 300553 302838 305002 306992 308816 310506 312393 315176 319358 324549
63246 324549 329723 334372 339019 344330 350172 356082 362315 369703 378507 388123 398023 408447 419938 432685
63232 432685 446534 461325 477006 493705 511661 530724 550015 568655 586810 605351 624300
63221 624300 642390 658550 673166 687318 701352 714895 727974 741343 755645 770634 785190
63210 785190 797847 807481 813825 817271 818025 815738 810110 801424 790115 776220 759803 741581 722491
63197 722491 702853 682678 662795 644898 630232 618808 610206 604595 602491 603873 608122 614838 624270
63184 624270 636827 652427 670537 690723 712941 737305 763716 791802 820999 850518 879403
63173 879403 907048 933770 960548 987966 1015550 1042272 1067556 1091520 1114322 1135492 1153935
63162 1153935 1168472 1178342 1183238 1182922 1176938 1164883 1146903 1123674 1095909 1064141 1029070 991798
63150 991798 953505 915040 876954 839737 803863 769799 738125 709445 683999 661577 641930
63139 641930 624969 610398 597548 586033 576296 568943 563642 559168 554596 550056 546245 543574 541959
63126 541959 541068 540546 540160 539949 540160 540991 542512 544870 548315 552802 557704 562190 565943 569378 573142 577475
63110 577475 582081 586493 590448 593990 597401 601048 605077 609122 612521 614962 616855 618808 620851 622406
63096 622406 622952 622465 621234 619602 617910 616384 614951 613446 612017 611044 610550 610114 609565 609355 609977 611297
63080 611297 612869 614665 617110 620473 624562 629010 633606 638438 643898 650495 658381 667085 675921 684692
63066 684692 693892 704259 716155 729255 742772 756143 769675 784384 801042 819486 838991 859152
63054 859152 880277 903042 927955 955064 983992 1014253 1045554 1077705 1110358 1143167 1176211
63043 1176211 1209913 1244400 1279319 1314346 1349376 1383969 1417197 1448607 1479077 1510194 1542897
63032 1542897 1576993 1611674 1645993 1679003 1709941 1738267 1763172 1783197 1796809 1803282 1802677 1795039
63020 1795039 1780023 1757392 1727632 1692160 1653019 1612158 1570748 1529426 1489341 1452299 1419492
63009 1419492 1390749 1365876 1346168 1333513 1328172 1328645 1333808 1344088 1360257 1382169 1409303 1441615
62997 1441615 1478993 1520379 1564232 1609625 1656391 1704429 1753383 1802743 1851791 1899614 1945629
62986 1945629 1989980 2033010 2074433 2113313 2148665 2179670 2205369 2224543 2235968 2238530 2231114 2212656
62974 2212656 2182455 2140446 2087269 2024203 1952985 1875581 1794075 1710621 1627175 1545088 1465089
62963 1465089 1387733 1313816 1244334 1180234 1122148 1070095 1023398 981213 943214 909482 879726
62952 879726 853138 829189 808030 789708 773449 758208 743682 730226 717938 706412 695317
62941 695317 684719 674688 665004 655404 645820 636271 626790 617560 608863 600737 592902 585143 577643 570757
62927 570757 564636 559194 554366 550217 546778 543895 541242 538416 535061 531028 526558 522236 518627 515866
62913 515866 513602 511328 508705 505630 502207 498710 495357 492008 488324 484475 481368 479770 479311 478833 477763
62898 477763 476702 476559 477513 478983 480216 480642 479993 478420 476341 473939 471008 467480 463813 460516 457540
62883 457540 454539 451608 449286 447736 446310 444158 441135 437925 435313 433533 432360 431673 431566 431834 431766
62868 431766 430867 429602 428915 429059 429449 429681 430074 430903 431759 432097 431936 431534 430832 429776 428781 428153 427365 425657
62850 425657 423145 420523 417818 414445 410667 407943 407209 407520 407109 405368 403143 401372 400204 399418 399066
62835 399066 399332 399990 400253 399240 396700 393360 390389 388375 386942 385460 383816 382261 380772 379079 377326
62820 377326 376189 376135 376776 377188 376787 375789 374900 374687 375177 375921 376395 376386 376091 375894 376040 376559 377555 379566 383402
62801 383402 389281 396204 402590 407775 412657 418650 426270 435032 444460 454678 466049 478657 492267
62788 492267 506507 521080 536112 552349 570661 591264 613808 638292 665397 695686 728950
62777 728950 764787 803446 845580 891379 940413 992206 1046444 1102636 1160026 1217866 1275417
62766 1275417 1331630 1385137 1434486 1478063 1513939 1540422 1556853 1563384 1559882 1545615 1520270 1484803
62754 1484803 1441077 1391107 1336868 1280187 1222185 1163087 1103043 1042960 984266 928180 875561
62743 875561 827064 782876 742495 705310 671212 640268 612102 586229 562742 542015 523821
62732 523821 507477 492796 480119 469319 459628 450764 443460 438416 435262 433069 431369 430174 429403
62719 429403 428972 429229 430666 433205 436333 439961 444699 451167 459462 469482 481416 495541 511747 529676
62705 529676 549384 571539 596738 624845 655328 688226 724465 765120 810677 861150 916599
62694 916599 977196 1043001 1113996 1190153 1271055 1355512 1441918 1528893 1615212 1699182 1778496
62683 1778496 1850682 1913324 1964020 2000773 2022521 2028862 2019258 1993266 1951708 1896911 1831382 1756785
62671 1756785 1674584 1587072 1497103 1407103 1318779 1233451 1152101 1075248 1003293 936847 876301
62660 876301 821272 770892 724563 682151 643631 608951 578029 550466 525476 502502 481686
62649 481686 463222 446539 430823 416225 403710 393495 384361 374862 364763 354938 346292 339172
62637 339172 333497 328932 324956 321089 317116 313019 308825 304636 300653 296982 293485 290017 286727 284020
62623 284020 282160 281004 280060 278778 276927 274800 273065 272249 272326 272768 273079 273296 273909 275277 277206 279281
62607 279281 281518 284395 288178 292555 297198 302369 308627 316061 324312 333320 343618 355699 369437
62594 369437 384404 400575 418480 438682 461312 486097 512731 541124 571259 602816 634974
62583 634974 666699 697153 725772 751938 774692 792863 805535 812420 813827 810222 801801 788509
62571 788509 770506 748536 723845 697740 671152 644386 617293 589875 562833 537317 514087
62560 514087 493129 474193 457384 442919 430522 419440 408982 398774 388592 378353 368336
62549 368336 359086 350931 343724 337135 331035 325483 320453 315725 311134 306927 303759 302116 301683 301504 300967
62534 300967 300489 301020 302995 306017 309493 313288 317779 323460 330526 338681 347340 356181 365520 376048
62520 376048 388262 402247 417867 434956 453436 473523 495789 520787 548624 579156 612528
62509 612528 649210 689431 732851 778906 827125 876853 926852 975529 1021584 1064158 1102252
62498 1102252 1134262 1158431 1173744 1180083 1177428 1165317 1143482 1112855 1075453 1033308 987895 940522
62486 940522 892668 845590 800049 756665 716130 678744 644207 612306 583514 558441 536994
62475 536994 518497 502363 488131 475145 462852 451370 441241 432685 425581 420008 416108 413433
62463 413433 411146 408996 407506 407038 407271 407839 408887 410673 413109 416065 419776 424521 430114 436046 441900
62448 441900 447405 452297 456457 460069 463404 466545 469317 471314 471850 470215 466177 460117 452571 443867
62434 443867 434256 424105 413727 403228 392684 382328 372450 363322 355320 348858 343992 340253 337026
62421 337026 334065 331601 330126 330029 331196 332953 334652 336368 338763 342302 346959 352644 359413 367083 375092
62406 375092 382973 390651 398120 405260 412196 419382 426943 434332 440941 446695 451609 455159 456684 456304
62392 456304 454925 453279 451321 448564 444754 440120 435187 430371 425744 421267 417269 414412 413058 412995 413990
62377 413990 416344 420617 427046 435592 446378 459646 475342 493041 512354 533282 556322 582330
62365 582330 612101 645799 682910 722854 765475 810777 858462 907965 958635 1009509 1059063
62354 1059063 1105492 1147125 1182390 1209727 1228070 1237384 1238421 1231975 1218585 1198805 1173463 1143694
62342 1143694 1110860 1076161 1040021 1002138 962480 922009 882124 843759 807498 774132 744286
62331 744286 717527 692636 668983 647115 627888 611425 597037 583752 570912 558676 548028
62320 548028 539798 533666 528594 524232 521232 519985 519784 519640 519361 519324 519602 519861 519858 519510 518572 516693 513803
62303 513803 510132 505933 501387 496694 492025 487421 482846 478215 473372 468363 463901 461091 460305 460592 460666
62288 460666 460328 460497 461959 464590 467776 471127 474619 478380 482518 486999 491622 496323 501508 507796 515360
62273 515360 523814 532843 542674 553711 566015 579417 594057 610536 629540 651502 676619 704975
62261 704975 736565 771324 809173 850030 893686 939685 987292 1035523 1083121 1128483 1169618
62250 1169618 1204396 1231112 1248998 1258092 1258599 1250527 1234117 1210450 1181309 1148360 1112613 1074706
62238 1074706 1035390 995600 956226 918029 881671 847611 815992 786848 760408 737028 716846
62227 716846 699661 685193 673212 663334 654913 647344 640445 634482 629854 626811 625320 625009 625216 625247
62213 625247 624723 623865 623424 624214 626495 629816 633574 637668 642392 647773 653405 659108 665414 673093 682364
62198 682364 692888 704427 717158 731300 746740 763178 780494 798839 818434 839365 861542
62187 861542 884810 909022 933881 958676 982334 1003890 1022895 1039259 1052874 1063601 1071646 1077738
62175 1077738 1082887 1088092 1094179 1101730 1111054 1122435 1136507 1154222 1176207 1202094 1230554 1260003
62163 1260003 1289245 1317503 1344011 1367777 1387808 1403443 1414378 1420486 1421874 1419165 1413457 1405724
62151 1405724 1396287 1384974 1371797 1357333 1342477 1327940 1314045 1300971 1289101 1278966 1270800 1264337
62139 1264337 1259304 1256015 1255032 1256211 1258549 1261277 1264720 1269645 1276097 1283410 1291248 1299971 1309980 1321271
62125 1321271 1333844 1347996 1363888 1381146 1399281 1418275 1438493 1460180 1483323 1507820 1533407
62114 1533407 1559523 1585593 1611549 1637827 1664769 1692148 1719347 1745944 1772115 1798516 1825800
62103 1825800 1854225 1883739 1914322 1945983 1978481 2011440 2045002 2080032 2117274 2156469 2196709
62092 2196709 2237550 2279211 2321649 2364042 2405505 2445931 2485790 2525520 2565647 2607182 2651149
62081 2651149 2697522 2745010 2792115 2838159 2883255 2927657 2971380 3014264 3056239 3097697 3139633
62070 3139633 3183131 3228511 3275117 3322049 3368785 3414960 3459909 3502796 3542926 3579585 3611864
62059 3611864 3639089 3661266 3678601 3690768 3697230 3698334 3695421 3689626 3681046 3669289 3654337 3636478
62047 3636478 3615816 3592383 3566633 3539449 3511709 3484074 3457118 3431376 3407202 3384648 3363499
62036 3363499 3343494 3324760 3308013 3294062 3282950 3273909 3266225 3259822 3254712 3250283 3245564 3240053 3233959
62023 3233959 3227793 3222014 3216863 3212136 3207221 3201732 3196087 3191193 3187635 3185428 3184385 3184327 3185034 3186476 3189080
62008 3189080 3193325 3199025 3205426 3212082 3219105 3226395 3233157 3238605 3242789 3246120 3248113 3247073 3241188 3229680
61994 3229680 3212682 3190254 3161941 3127388 3087119 3042444 2994709 2944941 2894137 2843449 2793805
61983 2793805 2745606 2699041 2654502 2612405 2572760 2535237 2499624 2465944 2434226 2404387 2376315
61972 2376315 2349830 2324636 2300487 2277330 2255094 2233565 2212697 2192852 2174371 2157094 2140737
61961 2140737 2125512 2111810 2099322 2087159 2074950 2063241 2052605 2042998 2034338 2027184 2022224 2019390
61949 2019390 2017979 2017564 2018428 2021235 2026685 2035335 2047288 2061950 2078438 2096329 2115791 2136960 2159439
61936 2159439 2182577 2206067 2230108 2255074 2281113 2307987 2335166 2362114 2388601 2414784 2440974
61925 2440974 2467435 2494673 2523949 2557286 2596726 2643679 2699205 2764874 2842947 2935691 3044774
61914 3044774 3171539 3317552 3484632 3674545 3888879 4129117 4396635 4692914 5020074
61905 5020074 5381120 5779375 6217571 6697264 7218354 7778170 8370331 8983853 9602222
61896 9602222 10202494 10755641 11229126 11590831 11812849 11875055 11768851 11499535 11085296 10553307
61886 10553307 9935568 9265489 8574362 7888058 7225918 6601963 6025840 5502256 5030966
61877 5030966 4608991 4233190 3900610 3607431 3348974 3120919 2919914 2743096 2587707
61868 2587707 2451277 2331640 2226724 2134791 2054841 1986277 1928179 1879413 1839404 1808176 1785493
61857 1785493 1770548 1762731 1762068 1768449 1780854 1797791 1818252 1841669 1867087 1892917 1917656 1940459
61845 1940459 1960840 1978080 1991159 1999191 2001800 1999258 1992496 1982966 1972291 1961881 1952820 1945943 1941818
61832 1941818 1940693 1942683 1948011 1956754 1968164 1980463 1991557 1999828 2004114 2003268 1996286 1982862 1963495
61819 1963495 1938984 1910136 1877990 1843976 1809697 1776690 1746325 1719596 1696937 1678507 1664755
61808 1664755 1656443 1654149 1658102 1668497 1685511 1708833 1737682 1771635 1811138 1856916 1909165 1967620
61796 1967620 2032231 2103495 2182280 2269545 2366011 2471952 2587633 2714272 2854361 3010793
61786 3010793 3185859 3381371 3599527 3843359 4116484 4422728 4765852 5149502 5577644
61777 5577644 6055236 6588174 7182323 7842922 8575059 9383791 10272445 11240140 12280409
61768 12280409 13380600 14520275 15668725 16783954 17814568 18703802 19394694 19836622
61760 19836622 19992885 19847248 19407069 18702169 17780058 16698756 15518903 14297017 13081014
61751 13081014 11907985 10803814 9784249 8856782 8022564 7278196 6617541 6033321 5517947
61742 5517947 5063741 4663275 4309847 3997550 3720874 3474692 3254861 3058579 2883851
61733 2883851 2728691 2590908 2468464 2359674 2263044 2177087 2100365 2031615 1969724 1913516
61723 1913516 1861583 1812444 1764926 1718357 1672391 1626785 1581449 1536528 1492296 1449097 1407535
61712 1407535 1368450 1332382 1299164 1268338 1239916 1214354 1191758 1171460 1152557 1134608 1117643
61701 1117643 1101646 1086269 1071079 1055979 1041329 1027486 1014226 1000891 987267 974052 962086
61690 962086 951297 940833 930177 919630 909656 900304 891514 883505 876406 869739 862728 855057 847047
61677 847047 839141 831571 824610 818707 814052 810105 805980 801446 797259 794232 792176 790154 787689 785119
61663 785119 782586 779282 774267 767744 761021 755341 751190 748552 747150 746407 745797 745517 746400 748977 752946
61648 752946 757701 762913 768333 773474 777947 781897 785742 789539 792910 795498 797252 798327 799017 799849 801556
61633 801556 804740 809482 815291 821555 828140 835397 843467 851764 859367 865748 870707 873694 873790 870535 864357
61618 864357 855922 845458 832987 818879 803795 788330 773052 758705 745910 734652 724305 714235
61606 714235 704230 694500 685436 677349 670252 663894 658035 652548 647252 641935 636740 632279 629121 627355
61592 627355 626780 627211 628280 629313 629988 631001 633551 638094 644000 650434 657079 663892 670732 677703 685613
61577 685613 695541 707851 721821 736379 751201 767073 785160 805873 828527 852156 876494 901898
61565 901898 928436 955481 982355 1008978 1035614 1062193 1088204 1113135 1136781 1159181 1180542
61554 1180542 1201212 1221496 1241407 1260733 1279303 1296946 1313244 1327616 1339787 1349914 1358020
61543 1358020 1363490 1365435 1363536 1358234 1350018 1338798 1324205 1306459 1286681 1266330 1246475 1227712
61531 1227712 1210568 1195663 1183373 1173619 1166164 1161017 1158308 1157927 1159727 1164158 1172289 1184953 1202095
61518 1202095 1223319 1248821 1279411 1315713 1357796 1405684 1459856 1521125 1590338 1668410 1756447
61507 1756447 1855569 1966676 2090402 2227142 2377108 2540593 2718242 2910660 3117379 3336091
61497 3336091 3562813 3792437 4018926 4235250 4433436 4604859 4740942 4834610 4882046 4883292
61487 4883292 4841140 4759674 4644038 4500938 4338390 4164437 3985996 3808510 3636035 3471508
61477 3471508 3317282 3175545 3048110 2935849 2838634 2755839 2686740 2630583 2586710 2554642
61467 2554642 2533753 2522920 2520979 2527588 2543123 2567431 2598989 2635592 2675688 2718854 2765185 2814474
61455 2814474 2865834 2917842 2969028 3018372 3065431 3110162 3152833 3194108 3234952 3276224 3318343
61444 3318343 3361304 3404959 3449287 3494523 3540928 3588342 3636002 3682880 3728012 3770377 3808795
61433 3808795 3842308 3870419 3892551 3907542 3914316 3912869 3903865 3887316 3862531 3829619 3790247 3746489
61421 3746489 3699640 3650719 3601394 3553532 3508105 3465339 3425854 3390974 3361863 3338839 3321614
61410 3321614 3309701 3302495 3299322 3299539 3302396 3306795 3311392 3314939 3316364 3314736 3309596 3301320 3290790 3278677
61396 3278677 3265394 3251760 3239318 3229856 3224973 3226339 3236017 3256083 3287928 3332236 3389739 3461903
61384 3461903 3550777 3658206 3785131 3931529 4096853 4280474 4481769 4699860 4933087 5178411
61374 5178411 5431060 5684765 5932280 6165630 6376098 6554768 6693949 6788574 6836518 6837939
61364 6837939 6794690 6710303 6590024 6440163 6266769 6074495 5866668 5646548 5418428 5187242
61354 5187242 4957084 4730470 4509127 4295096 4090729 3897838 3717269 3549193 3393539
61345 3393539 3250160 3119033 3000441 2894867 2802566 2723178 2655718 2598970 2552138 2515238
61335 2515238 2488677 2472291 2464991 2465536 2473413 2488679 2511078 2539614 2572941 2609877 2649560 2691313
61323 2691313 2734408 2777846 2820497 2861593 2900984 2938694 2974429 3007736 3038465 3066700 3092362
61312 3092362 3115247 3135396 3153003 3167975 3179921 3188601 3193942 3195547 3192622 3184659 3171971 3155369
61300 3155369 3135512 3112635 3086600 3057015 3023579 2986601 2947021 2905670 2862666 2817743 2771117
61289 2771117 2723763 2676887 2631365 2587755 2546704 2509146 2476129 2448456 2426436 2409842 2398027
61278 2398027 2390175 2385548 2383510 2383284 2383817 2384156 2383963 2383447 2382789 2381957 2381117 2380655 2380395 2379259 2376334 2372041
61262 2372041 2367610 2363519 2359231 2354616 2350907 2349952 2353149 2361619 2376878 2400644 2434102 2477839 2532437
61249 2532437 2598605 2676632 2765903 2864945 2971636 3083270 3196528 3307316 3410595 3500591
61239 3500591 3571541 3618426 3637217 3625067 3580943 3506226 3404471 3280573 3140195 2989452
61229 2989452 2834245 2679439 2528756 2385368 2252048 2130525 2021057 1922998 1835659 1758498
61219 1758498 1690789 1631539 1579664 1534086 1493784 1458098 1426935 1400407 1378250 1359891 1345169
61208 1345169 1334721 1329408 1329386 1333836 1341549 1351710 1364135 1378882 1395686 1413768 1432146 1450006
61196 1450006 1466784 1482010 1495261 1506245 1514831 1521022 1524974 1526969 1527196 1525509 1521538 1515061 1506187
61183 1506187 1495118 1481854 1466232 1448214 1428110 1406492 1383809 1360018 1334749 1307986 1280464
61172 1280464 1253176 1226597 1200707 1175653 1151899 1129590 1108244 1087298 1066627 1046253 1026015
61161 1026015 1005961 986743 969056 952823 937440 922677 908734 895357 881545 866328 849396
61150 849396 830776 810445 788693 766500 745016 724742 705564 687551 671355 657717 646753
61139 646753 637839 630159 623355 617704 613677 611394 610562 610869 612306 615092 619454 625471 632984 641614 650950
61124 650950 660702 670591 680276 689697 699371 709959 721545 733617 745750 757823 769556 780472
61112 780472 790611 800657 810851 820113 826808 830235 830909 829602 826598 821882 815508 807666 798730 789366
61098 789366 780269 771713 763542 755623 747979 740465 732645 724204 715186 705675 695413 684052 671670
61085 671670 658824 646120 633904 622334 611532 601516 592140 583316 575314 568591 563187 558441 553605
61072 553605 548724 544601 541819 540116 538933 538316 538796 540373 542071 542860 542869 543281 544977 547581 550069 552109
61056 552109 554297 557101 560140 562900 565701 569290 573566 577382 579833 581273 582778 585015 587960 591440
61042 591440 595455 600033 605144 610824 617104 623731 630128 635864 641202 647025 654097 662391 671345 680782
61028 680782 691240 703167 716021 728548 739867 749977 759415 768835 778857 789815 801556 813747
61016 813747 826316 839259 852259 865191 878968 895135 914434 936426 960695 987715 1018217
61005 1018217 1052307 1089701 1130234 1173745 1219930 1268811 1320999 1377235 1438296 1505877 1583069
60994 1583069 1673351 1779325 1902656 2044657 2206460 2389161 2594575 2825960 3088328 3389055
60984 3389055 3738630 4150102 4637573 5216272 5904218 6722249 7692373 8839143 10193460
60975 10193460 11787887 13636068 15707453 17916494 20129600 22177899 23875248 25059438
60967 25059438 25659101 25745591 25516453 25207190 24991500 24933146 24994230 25059381 24954428 24481667
60957 24481667 23490609 21951994 19975950 17756882 15491515 13328387 11361853 9643537
60949 9643537 8189446 6985863 6001792 5202614 4556168 4032834 3606424 3256378 2967376
60940 2967376 2726618 2522543 2345680 2189133 2048038 1919290 1801491 1694075 1596295 1507440
60930 1507440 1427413 1356097 1292342 1234495 1181731 1133895 1090020 1047960 1005823 963280 921297
60919 921297 881170 843955 810265 780124 753068 728534 706191 685983 668037 652371 638574
60908 638574 625936 614098 603357 594065 585942 578269 570674 563490 557414 552978 550201 548610 547685 547303
60894 547303 547480 547846 547897 547883 548764 550962 553725 556171 558367 560755 563017 564287 564276 563379 561744 558984 554962
60877 554962 550226 545369 540336 534643 528099 521164 514673 509197 504574 500127 495470 490973 487307 484709
60863 484709 482945 481861 481599 482334 483996 486334 489172 492652 497225 503234 510441 518269 526539 535598 545578
60848 545578 556010 566548 577684 590290 604622 620172 636275 652456 668227 683015 696316
60837 696316 707800 717298 724804 730324 733671 734700 733872 732210 730465 728665 726660 724563 722291 719225
60823 719225 714901 709676 704168 698381 692010 685256 678626 672070 665025 657238 648902 640077 630729 621402
60809 621402 613114 606302 600350 594361 587997 581481 575308 570147 566520 564289 562729 561313 560098 559273
60795 559273 558757 558563 559153 561070 564374 568745 573987 580107 586944 594059 601172 608541 616637 625335 633668
60780 633668 640693 646592 652513 659179 666008 671880 676490 680575 685063 690437 696763 703771 710812 717218
60766 717218 722927 728532 734527 740689 746344 751155 755429 759551 763198 765412 765671 764708 763859 763681 763665 763238
60750 763238 762348 760906 758493 755149 751821 749373 747624 745923 744097 742051 738962 733900 727101 719711
60736 719711 712365 704950 697670 691242 685823 680704 675444 670485 666266 662469 658646 654937 651604 648413
60722 648413 645017 641520 638142 634692 630903 627007 623450 620268 617275 614668 612844 611656 610419 608829
60708 608829 607447 606988 607357 607636 607064 605769 604481 603632 602927 601776 599858 597142 593653 589505 585001 580320
60692 580320 575222 569349 562772 555879 548799 541333 533471 525548 517808 510234 502954 496439 491014 486445
60678 486445 482244 478188 474370 470943 468115 466296 465897 466813 468172 468857 468523 468106 469057 471926 475968 480225
60662 480225 484604 489535 494965 500251 504896 508830 512043 514552 516806 519624 523464 528030 532671 536959
60648 536959 540899 544906 549566 555130 561297 567698 574288 580893 586778 591478 595873 601502 608721 616406
60634 616406 623710 631217 639838 649351 658705 667301 675270 682770 689590 695340 699695 702577 704378 705739
60620 705739 706795 706818 704899 700819 695107 688519 681686 674924 668066 660727 652979 645523 639007 633558 629262
60605 629262 626575 625748 626208 627152 628556 630933 634101 636852 638131 638077 637589 637155 636488 635257 633813 632995
60589 632995 633419 635154 638058 642045 646831 651794 656523 661369 666999 673380 679556 684494 687727 689215
60575 689215 689123 687974 686544 685182 683458 680765 677105 673057 669113 665226 660907 655665 649482 642867 636338
60560 636338 629942 623580 617573 612415 608048 603950 599989 596622 594220 592892 593115 595684 600661 607122
60546 607122 614512 623526 634990 648502 663079 678781 696753 717844 742033 769187 799601 833511
60534 833511 870648 910415 951942 993668 1033149 1067497 1094001 1110542 1115958 1110253 1094437 1070182
60522 1070182 1039732 1005834 971255 938245 908554 883702 864758 851848 844228 840971 841373 844831
60510 844831 850678 858306 867274 877221 887795 898729 910008 922135 936252 953730 975420 1001458
60498 1001458 1031975 1067828 1110470 1161386 1221821 1292612 1373805 1464661 1564479 1673321 1791622
60487 1791622 1919505 2057141 2205701 2367477 2545196 2741793 2960493 3203687 3470629
60478 3470629 3755944 4049878 4338849 4605312 4828514 4987798 5067076 5057580 4958027 4773974
60468 4773974 4517577 4206831 3863156 3507851 3159094 2830349 2529983 2261805 2026322
60459 2026322 1822111 1646558 1496078 1366663 1254904 1158536 1075870 1005038 944036 891274
60449 891274 845622 805982 771255 740690 713931 690733 670916 654436 640922 629133 617472
60438 617472 605218 592847 581027 569921 559660 550773 543510 537198 530835 524150 517657 511907 507169
60425 507169 503632 501335 499865 498503 496741 494574 492456 491197 491568 493586 496285 498556 500173 501671
60411 501671 503440 505342 507202 509243 511860 515126 518625 521728 524102 526007 528006 530423 533304 536884
60397 536884 541553 547181 552903 557985 562542 567060 571561 575733 579590 583401 587079 590138 592256 593513
60383 593513 594122 594218 593798 592543 589911 585763 580776 575857 571385 567456 564557 563230 563032 562540 560703 557778
60367 557778 554780 552456 551069 550796 551843 554159 557282 560650 564100 567936 572373 576973 580986 584353
60353 584353 587995 592836 598858 605338 611615 617242 621820 625332 628502 632292 637061 642533 648275 653709
60339 653709 657924 660251 661016 661113 660846 659805 657887 655720 653891 652364 650966 649947 649762 650656 652685 655767
60323 655767 659451 662943 665644 667494 668638 669058 668621 667285 665052 661997 658462 655012 652029 649523 647391
60308 647391 645663 644339 643170 641784 640069 638448 637678 638107 638960 638763 636855 634259 632604 632423 633016 633805
60292 633805 635027 637003 639371 641433 642821 643565 643833 643897 644114 644719 645751 647222 649158 651478 654094 657162
60276 657162 660913 665231 669714 674176 678758 683605 688824 694794 701970 710296 719278 728841 739643 752276
60262 752276 766538 781835 797979 815284 834106 854648 877152 901992 929558 960070 993540
60251 993540 1029972 1069737 1113570 1161949 1214677 1271478 1332881 1399992 1473387 1552761 1637738
60240 1637738 1728403 1824708 1925836 2030539 2137812 2246851 2356481 2464893 2569845 2668975
60230 2668975 2760054 2841155 2910647 2967208 3010106 3039378 3055446 3058584 3049057 3027689 2995947 2955514
60218 2955514 2908255 2856637 2803718 2752589 2706012 2666287 2634817 2611872 2597486 2592775 2599686 2619354
60206 2619354 2651416 2695246 2751076 2819430 2900073 2992009 3093888 3203783 3319008 3436802
60196 3436802 3554882 3670774 3780992 3881546 3969183 4041732 4097596 4135617 4155291 4156551 4139356
60185 4139356 4104003 4051827 3985105 3906262 3817594 3721798 3622290 3522856 3427163 3338531 3259720
60174 3259720 3192752 3139099 3100061 3076728 3069484 3077749 3100317 3135952 3183731 3242892 3312218 3389417
60162 3389417 3471175 3553869 3634089 3708550 3774033 3827950 3868796 3895762 3908160 3905792 3889860
60151 3889860 3862925 3827694 3786104 3739854 3691580 3645125 3604613 3573349 3553577 3547001 3555290 3580053
60139 3580053 3622538 3683539 3763633 3863480 3983973 4126161 4290928 4478695 4689596 4923979
60129 4923979 5182312 5464216 5767792 6090237 6428781 6780342 7140323 7502506 7860315
60120 7860315 8207671 8538506 8846221 9124293 9367230 9570703 9731085 9845292 9910858 9925914
60110 9925914 9889337 9801270 9663449 9478945 9251916 8987783 8693399 8376816 8046993 7713459
60100 7713459 7385366 7070220 6773699 6500847 6256767 6045597 5869261 5727990 5621890
60091 5621890 5551352 5516058 5514311 5543482 5600632 5682464 5785017 5903557 6032583 6165882 6296911
60080 6296911 6419355 6527422 6615894 6680390 6717943 6727439 6709589 6666388 6600260 6513292 6407174
60069 6407174 6283780 6145632 5995650 5836647 5671174 5501642 5330374 5159674 4992082
60060 4992082 4830469 4677710 4536356 4408672 4296702 4201965 4125151 4066311 4025385 4002461
60050 4002461 3997668 4010900 4041602 4088836 4151773 4230054 4323309 4430123 4547587 4671763 4798180
60039 4798180 4921976 5038306 5143117 5233326 5306034 5358057 5386590 5390069 5368189 5321589 5251936
60028 5251936 5161856 5054175 4931384 4796242 4652564 4504918 4357683 4214795 4079904 3955964
60018 3955964 3844661 3746897 3663902 3597299 3547991 3515605 3499361 3499232 3516009 3550525 3603029
60007 3603029 3673201 3760563 3864817 3985754 4122764 4274435 4438570 4612309 4792065 4973461
59997 4973461 5151505 5320801 5475646 5610452 5720593 5802992 5855955 5878734 5871479 5835230
59987 5835230 5771551 5682148 5569048 5435119 5284336 5121767 4953324 4785165 4622873 4471057
59977 4471057 4333557 4213494 4112955 4032993 3974162 3936748 3920380 3923995 3946514 3987123 4044603
59966 4044603 4116976 4202206 4298630 4404140 4515491 4629202 4742796 4854360 4961268 5060261
59956 5060261 5148736 5225208 5288650 5338297 5374311 5397932 5410684 5413927 5409354 5399486 5387540 5377208
59944 5377208 5372618 5378006 5397176 5433515 5490535 5572026 5681510 5821753 5994727 6201742 6443535
59933 6443535 6720395 7032027 7376893 7751667 8151261 8568758 8994687 9416672 9820496
59924 9820496 10191593 10515315 10776651 10961413 11058850 11063505 10975293 10798970 10543793 10222762
59914 10222762 9851190 9445382 9021693 8595266 8178624 7781234 7410187 7070800 6766615
59905 6766615 6499588 6270769 6080653 5928953 5814609 5736315 5692845 5682902 5705050 5757816
59895 5757816 5839420 5947380 6078830 6231094 6401168 6584382 6773980 6962038 7140198 7299533
59885 7299533 7430777 7525544 7577241 7580830 7532657 7431389 7279100 7081095 6844837 6579044
59875 6579044 6293059 5996073 5696482 5401619 5117553 4848831 4598693 4369709 4163803
59866 4163803 3981478 3821578 3682326 3562372 3460475 3374518 3301388 3237860 3181298 3129672
59856 3129672 3081243 3034388 2987595 2939804 2890935 2842074 2794997 2751531 2713226 2681249 2656245
59845 2656245 2638253 2626713 2620364 2617197 2614832 2611086 2604045 2591731 2572325 2545106 2510939 2471581
59833 2471581 2428673 2383590 2337945 2293768 2253073 2217387 2187671 2164547 2148462 2139645 2137963 2143025
59821 2143025 2154459 2171817 2194077 2219666 2247521 2278150 2313328 2354724 2402933 2457386 2516568
59810 2516568 2578368 2640750 2702156 2760946 2814766 2861200 2899026 2928220 2948802 2960595 2964282
59799 2964282 2961779 2955173 2945984 2935926 2927586 2923665 2926005 2935966 2955329 2986159 3030014 3087870 3160696
59786 3160696 3249661 3356061 3481577 3628516 3799379 3996327 4221375 4476698 4763863 5082259
59776 5082259 5427983 5793449 6167036 6532640 6869937 7155847 7367209 7484659 7497036 7404460
59766 7404460 7218231 6957799 6646623 6308517 5964884 5632950 5325117 5049093 4808353
59757 4808353 4602943 4430881 4289722 4177331 4091591 4029900 3989338 3967485 3962986 3975241 4003566
59746 4003566 4046879 4104321 4175944 4262471 4364504 4482275 4616183 4767147 4936296 5124597
59736 5124597 5332991 5562694 5815249 6092421 6396159 6728492 7091353 7486516 7915550
59727 7915550 8379549 8878749 9412271 9977671 10570143 11182221 11804672 12427728 13041308
59718 13041308 13634833 14198309 14724542 15210467 15657012 16068988 16455466 16829040 17203254
59709 17203254 17590214 18000040 18440895 18917833 19431132 19975892 20542803 21118723 21686937
59700 21686937 22228133 22722150 23149673 23493741 23741481 23885798 23926182 23868550 23724624 23510966
59690 23510966 23247490 22955717 22657190 22372176 22118867 21913262 21769331 21698636 21709738 21808674
59680 21808674 22000492 22289878 22680032 23171592 23763230 24452525 25234897 26101269 27036668
59671 27036668 28020054 29023799 30012783 30944932 31773944 32452788 32937056 33189045 33182874
59662 33182874 32908867 32375104 31606120 30640113 29525267 28314929 27061980 25813885 24609583
59653 24609583 23477962 22436814 21492028 20637898 19859064 19133292 18434211 17734508 17010467
59644 17010467 16246928 15440125 14597108 13732816 12866487 12018089 11205088 10440434 9732133
59635 9732133 9083777 8495383 7964619 7488150 7062280 6682781 6344961 6044387 5777261
59626 5777261 5539933 5328650 5140340 4973243 4826188 4697557 4585467 4488677 4406508 4337747
59616 4337747 4280071 4230714 4187356 4148350 4112372 4077943 4043077 4005355 3962480 3912754 3855055
59605 3855055 3788752 3714013 3632053 3544741 3454038 3361961 3270752 3182494 3098519 3019465 2945971
59594 2945971 2879062 2819793 2768684 2725466 2689288 2659302 2635241 2617499 2606587 2602625 2605265 2613795
59582 2613795 2627189 2644364 2664595 2687434 2712110 2737381 2762239 2786454 2810166 2833273 2855592
59571 2855592 2877423 2899692 2923711 2951004 2983053 3020933 3065426 3117592 3178643 3248984 3328044
59560 3328044 3415811 3514064 3625347 3750855 3890142 4042789 4209559 4391755 4590147 4804790
59550 4804790 5035329 5281037 5540665 5812498 6094413 6383694 6676743 6968962 7255189
59541 7255189 7530824 7792943 8040103 8270831 8482704 8673255 8841304 8986693 9109051
59532 9109051 9207788 9283549 9339165 9379100 9408606 9433578 9460391 9495028 9542246 9605600 9687677
59521 9687677 9789461 9909062 10041216 10178125 10310694 10428972 10521949 10577941 10586143 10538346
59511 10538346 10429563 10257824 10024269 9733495 9393041 9011996 8600109 8167966 7726953
59502 7726953 7288113 6860809 6452346 6068271 5712550 5387717 5095095 4834668 4604776
59493 4604776 4402737 4226321 4074315 3945412 3837319 3747680 3675453 3620658 3583030 3561606
59483 3561606 3555446 3564120 3587572 3626055 3680114 3750146 3836120 3938075 4056689 4192905 4347150
59472 4347150 4519243 4708674 4914415 5134730 5367635 5611084 5861913 6114785 6362727
59463 6362727 6598369 6814000 7000993 7150547 7255509 7311099 7314212 7263112 7158238 7002884
59453 7002884 6803014 6566611 6302794 6020474 5727430 5430660 5136965 4852193 4580034
59444 4580034 4322363 4080649 3856214 3649399 3459790 3287496 3133098 2995962 2873639
59435 2873639 2763544 2664515 2576331 2498524 2430378 2371404 2321095 2278606 2243237 2214858 2193285
59424 2193285 2177502 2166023 2158022 2153782 2154180 2159799 2170204 2183932 2199530 2216907 2237301 2261726
59412 2261726 2289768 2320010 2351109 2381982 2411410 2438191 2461892 2483297 2504249 2527279 2555282
59401 2555282 2591130 2637168 2694722 2763921 2844028 2933929 3032178 3136875 3246552 3362081 3487430
59390 3487430 3627876 3787584 3969274 4175613 4409734 4674407 4971764 5304044 5673576
59381 5673576 6081493 6527073 7008545 7523570 8068055 8634804 9213810 9793638 10362437
59372 10362437 10908580 11421579 11893014 12316892 12689805 13011285 13283755 13511497 13699056
59363 13699056 13850009 13966500 14049446 14099002 14114527 14093876 14033181 13928210 13776386 13577620
59353 13577620 13333937 13049414 12730599 12386057 12024829 11655114 11283656 10915019 10550906
59344 10550906 10190776 9833351 9477089 9119560 8757978 8391362 8021834 7653492 7290683
59335 7290683 6937550 6598071 6275533 5972301 5690528 5432383 5198925 4989440 4802742
59326 4802742 4638645 4497313 4377562 4276848 4192881 4124579 4071493 4033018 4008249 3996066
59316 3996066 3995164 4004274 4022287 4047927 4079492 4115298 4154220 4195333 4237030 4276822 4311981 4340204
59304 4340204 4359882 4370141 4370729 4361746 4343541 4316922 4283255 4244195 4201480 4157029 4112912 4071024
59292 4071024 4033041 4000706 3975741 3959330 3952143 3955171 3970109 3998666 4041788 4099875 4173278 4262181
59280 4262181 4366294 4485076 4617971 4764098 4921938 5089578 5264846 5444694 5624669
59271 5624669 5799320 5962958 6109770 6233708 6329196 6392513 6422672 6421254 6391540 6337525 6263371
59260 6263371 6173522 6072792 5965536 5854455 5740702 5625261 5509646 5395053 5281620 5169212
59250 5169212 5058459 4950410 4845463 4743334 4644019 4548424 4458205 4375333 4301620 4238350
59240 4238350 4186521 4147575 4123505 4116018 4126123 4154993 4204760 4277957 4376539 4501954 4655715
59229 4655715 4839177 5053048 5297727 5573870 5881706 6219632 6583759 6968408 7365940
59220 7365940 7765824 8154624 8517521 8839910 9107889 9308455 9430549 9466577 9413211 9271163
59210 9271163 9044743 8741880 8374309 7956978 7506333 7038339 6567354 6105853 5664105
59201 5664105 5249530 4866557 4517297 4202352 3921143 3672078 3452869 3260783 3092760
59192 3092760 2945811 2817562 2706235 2610014 2526756 2454433 2391580 2337218 2290604 2251095 2217905
59181 2217905 2190007 2166648 2147943 2134472 2126257 2122648 2123182 2127887 2136588 2148668 2163785 2182292
59169 2182292 2204670 2231127 2261888 2297190 2336713 2379800 2426544 2477877 2534125 2594192 2656765
59158 2656765 2721588 2788984 2858757 2930156 3002252 3073613 3142135 3205895 3263768 3314675 3356948
59147 3356948 3389176 3411104 3422959 3424442 3415283 3396331 3369229 3335346 3295838 3252341 3206708 3160296
59135 3160296 3114334 3070674 3031268 2997101 2968523 2946506 2932684 2928172 2933151 2947682 2972233 3007351
59123 3007351 3053440 3110924 3180160 3261229 3354171 3459215 3576390 3705255 3845555 3997791
59113 3997791 4162573 4339803 4529182 4730985 4945328 5170832 5404914 5645195 5889620
59104 5889620 6135010 6376211 6606669 6819166 7006106 7159997 7274035 7342090 7358658 7320021
59094 7320021 7225854 7079379 6886135 6653049 6388178 6100062 5796812 5486004 5174950 4870070
59084 4870070 4575841 4295010 4029689 3781462 3550644 3336568 3138932 2958066 2793692
59075 2793692 2644221 2507641 2382467 2267639 2162129 2065022 1975555 1892883 1816248 1745468
59065 1745468 1680798 1622229 1569279 1521394 1477983 1438188 1401209 1366915 1335580 1307104 1281017
59054 1281017 1257094 1235227 1214846 1195288 1176744 1159978 1145018 1130966 1117216 1104058 1091955
59043 1091955 1081158 1072192 1065786 1061814 1059132 1056967 1055800 1056448 1058882 1062556 1067260 1073065 1079800 1087237
59029 1087237 1095633 1105620 1117657 1131793 1147804 1165217 1183354 1201448 1218691 1234167 1247079 1257153
59017 1257153 1264682 1270241 1274488 1278072 1281337 1284215 1286731 1289482 1293241 1298284 1304545 1312160 1321198 1330909
59003 1330909 1339874 1346934 1351555 1353455 1352530 1349097 1343604 1336090 1326512 1315529 1304316 1293545 1283212
58990 1283212 1273425 1264688 1257291 1251117 1246205 1242920 1241458 1241637 1243226 1245965 1249397 1253343 1258500 1265813
58976 1265813 1275206 1285632 1296458 1308075 1321112 1335821 1352436 1371325 1392450 1415280 1439443
58965 1439443 1464983 1491854 1519754 1548541 1578208 1608376 1638470 1668481 1698873 1729668 1760350
58954 1760350 1790765 1821414 1852750 1884986 1918739 1955039 1994425 2036813 2082490 2132508 2187767
58943 2187767 2248438 2314512 2386288 2463980 2547620 2637662 2735044 2840312 2953236 3073622 3202088
58932 3202088 3339957 3488917 3650848 3827381 4019629 4228973 4457923 4709317 4984732
58923 4984732 5284767 5610888 5965757 6351538 6769162 7219787 7705738 8229182 8790616
58914 8790616 9389081 10022782 10688652 11381707 12095054 12819424 13541952 14245980 14912524
58905 14912524 15521508 16052009 16483324 16797429 16980662 17023844 16923121 16682163 16312555
58896 16312555 15830818 15255370 14606252 13905353 13174310 12431992 11694432 10975781 10287361
58887 10287361 9636110 9025407 8457325 7933031 7451637 7010510 6607142 6239742 5905926
58878 5905926 5602066 5324427 5070211 4837240 4623308 4426228 4244140 4075576 3919608
58869 3919608 3775917 3644264 3523766 3412978 3310738 3216599 3130471 3052089 2980899 2916299
58859 2916299 2857995 2806103 2760691 2721172 2686540 2656374 2631262 2612053 2598929 2591263 2588064 2588561
58847 2588561 2592873 2602147 2617495 2638781 2665108 2696484 2734042 2778413 2828964 2885153 2947660 3017423
58835 3017423 3094436 3178417 3270033 3370480 3480239 3599097 3727264 3865755 4015866 4178867
58825 4178867 4356164 4549326 4760102 4990636 5243395 5520619 5824098 6155531 6516652
58816 6516652 6908997 7334299 7795182 8294449 8833069 9409521 10021287 10665730 11338454
58807 11338454 12031392 12733111 13430043 14106272 14742673 15317678 15809526 16198175 16466550
58798 16466550 16601855 16596741 16449834 16166093 15757092 15239994 14635032 13963448 13246953 12506997
58788 12506997 11762638 11028857 10316979 9635815 8991623 8387781 7825556 7305120 6825590
58779 6825590 6385051 5981522 5613386 5278341 4972730 4692718 4435598 4199259 3981267
58770 3981267 3779382 3592269 3418690 3256714 3104761 2962796 2831400 2710165 2598009
58761 2598009 2494408 2399130 2311335 2230245 2156298 2090223 2031251 1977572 1928499 1884827 1846944
58750 1846944 1813746 1783655 1755846 1730238 1707038 1686458 1668287 1651674 1635746 1620218 1604914
58739 1604914 1589013 1571456 1551817 1530225 1506784 1481648 1455134 1427111 1396956 1364999 1333376
58728 1333376 1304294 1277786 1252203 1226555 1201273 1176936 1153399 1130154 1106640 1082342 1057395
58717 1057395 1032972 1010294 989488 970059 951977 935405 919921 905072 891328 879302 868404
58706 868404 857486 846559 836630 827917 819503 810772 802108 794015 786565 779760 773585 767640 761553 755652
58692 755652 750491 745831 740890 735409 729658 723728 717692 712167 707735 704099 700658 697478 694755 691873
58678 691873 688219 684437 681568 679363 676904 674549 673718 674871 677215 680307 684406 689132 693345 696603
58664 696603 699492 702339 704851 707088 709422 711491 712574 713054 713989 715078 714694 712358 709681 708367 708702
58649 708702 710438 713670 718136 723029 728304 735120 744299 755388 767789 781708 797391 814585 833442
58636 833442 854901 879413 906231 934688 965307 998963 1035870 1076138 1120556 1170004 1224707
58625 1224707 1284788 1351061 1424723 1506723 1597860 1698990 1810746 1933516 2067981 2215129
58615 2215129 2375568 2549359 2736489 2936541 3147501 3365469 3585632 3802583 4009375
58606 4009375 4197253 4357052 4480685 4561553 4594863 4578500 4513512 4403749 4255481 4077060
58596 4077060 3877760 3666246 3450138 3236294 3030208 2834974 2651824 2481769 2325903
58587 2325903 2184322 2056038 1940213 1836532 1744360 1662714 1591116 1529273 1475807 1428630
58577 1428630 1386887 1351241 1321855 1297333 1276101 1257616 1241730 1227990 1216065 1205823 1196598
58566 1196598 1187445 1178554 1171285 1166285 1162502 1158408 1153123 1145973 1136178 1123553 1108532 1091116 1070867
58553 1070867 1048341 1025305 1003008 981331 960085 940003 921803 905308 890042 875752 861961
58542 861961 848088 834461 822105 811132 800408 789166 777689 766152 754253 742493 732256
58531 732256 723883 716113 708192 701068 695555 690644 684779 677696 670010 662015 653800 645642 637444 628778
58517 628778 620153 613091 608112 603817 598860 593708 589540 586625 584843 584714 586659 589981 593641 597350
58503 597350 601167 604852 608447 612704 618158 624557 631735 640040 649262 658300 666709 675475 685483 696251
58489 696251 706904 717135 726391 733409 737568 739604 740083 738412 734338 729006 723329 716508 707466 696681
58475 696681 685324 673699 661859 650727 641164 632679 624384 616461 609491 603114 596601 590110 584264
58462 584264 579160 574758 571424 569098 566843 564175 561984 561071 560825 560409 560218 560910 562000 562763 563668 565598
58446 565598 568448 571767 576067 582186 590051 599180 609676 621625 634323 647260 661079 676427 692620
58433 692620 708375 722844 734866 742422 744371 741916 737051 730375 721704 711783 701828 692079 682290
58420 682290 673068 665456 659765 655876 653917 653547 653532 653279 653998 657152 662707 670067 679592 691694 705400
58405 705400 719279 732940 746164 757545 765595 770416 772795 772428 768598 761822 753347 743659 732914
58392 732914 722124 712499 704267 697335 692245 689212 687268 685691 685234 686511 688332 689241 689607 690514 691683
58377 691683 692274 692773 694162 696092 697696 699426 702309 706188 710424 715570 722530 730791 739151 747453 756005
58362 756005 764223 771589 779054 787783 797359 806890 816814 827844 839291 850382 862104 875605 889735
58349 889735 902259 912611 921396 928166 931963 933262 933199 931577 927719 922500 917500 912989 908753 905872
58335 905872 905484 906746 908268 910631 915178 921375 927799 934817 943772 954312 965019 975915 987915
58322 987915 1000601 1013025 1025929 1040751 1057153 1073949 1091530 1110851 1130957 1150066 1168234
58311 1168234 1186337 1203346 1217327 1228245 1237177 1243817 1247557 1249956 1253161 1256868 1259772 1262880 1268276
58298 1268276 1275647 1283284 1291478 1301616 1312992 1324071 1335995 1351136 1368901 1386603 1403845 1422451
58286 1422451 1442678 1463186 1484187 1507006 1531048 1554787 1579198 1606660 1637123 1668903 1702337
58275 1702337 1738844 1777338 1815549 1853939 1894190 1934827 1972730 2008077 2043244 2077745 2109094
58264 2109094 2137986 2167728 2199100 2230708 2263723 2300977 2341785 2383000 2424997 2471319 2522533
58253 2522533 2575821 2630594 2689132 2751681 2816242 2883181 2954774 3030373 3107470 3187135 3272735
58242 3272735 3363796 3457141 3553577 3657169 3768404 3884612 4006660 4138306 4279336 4426510
58232 4426510 4581044 4747782 4927231 5116026 5314991 5528846 5758348 6001098 6259781
58223 6259781 6540916 6845820 7171985 7522930 7906978 8326712 8780138 9272112 9813924
58214 9813924 10412002 11068750 11794627 12607584 13521344 14547749 15711490 17050719 18605649
58205 18605649 20421298 22557605 25077075 28022685 31427691 35348320 39871145 45098761
58197 45098761 51161230 58245078 66585726 76436288 88078705 101863065 118199133 137519261
58189 137519261 160284068 186930713 217557119 251418685 286653102 320468013 349536053
58182 349536053 370329240 379616711 375420606 358015503 330060879 295576221 258535069
58175 258535069 222030705 188168353 158212810 132689545 111523418 94284249 80409744
58168 80409744 69314456 60451513 53376289 47761163 43351255 39938453 37379320 35593617
58160 35593617 34527246 34142033 34436706 35418729 37015248 39023304 41146656 43037634
58152 43037634 44293138 44492910 43353597 40893822 37439412 33457241 29370217 25475484
58144 25475484 21952463 18891546 16313882 14189317 12457210 11046573 9891759 8939649
58136 8939649 8147838 7481448 6914254 6428968 6012190 5650124 5330341 5043831 4782528
58127 4782528 4538024 4305218 4083993 3874851 3676058 3487066 3310779 3149642 3002581
58118 3002581 2868120 2747122 2640022 2544507 2458113 2380031 2308393 2239122 2169649 2100678 2032565
58107 2032565 1963495 1893281 1825320 1762296 1703076 1646088 1592560 1543992 1499427 1457667 1419449
58096 1419449 1385097 1352715 1321007 1291343 1264739 1239228 1212446 1184600 1156764 1128494 1099291
58085 1099291 1070429 1043245 1017327 992051 968084 945719 923605 900738 878015 856506 835982
58074 835982 816327 798426 782441 767129 752052 738470 727010 716522 706298 697166 689311 681390
58062 681390 673127 666419 662401 659573 656245 652633 648993 643930 636323 627103 617512 607364 596423 585770
58048 585770 576285 567434 558872 551527 545837 540677 535327 530768 527729 525227 522333 519634 517659 515656
58034 515656 513309 511907 512390 513784 514837 515595 516156 515674 513887 511987 510636 508843 506089 503779 503122
58019 503122 503375 503637 504593 506772 508790 509175 508579 508442 508677 508363 507499 506474 504881 502356 499598 497184
58003 497184 494462 490899 487381 484848 482734 480102 477111 474102 470436 465643 460597 456154 451723 446506
57989 446506 441058 436185 431367 425825 420302 416273 414066 413018 412791 413345 414320 415547 417523 420427 423434
57974 423434 425887 428275 431179 434180 436711 439027 441497 443865 445963 448103 450072 450955 450704 450555 451122
57959 451122 451531 451328 451609 453089 454641 455075 454954 455223 455506 455209 455030 455805 457003 457845 458740 460203 461456
57942 461456 461578 460815 459378 456265 450954 444962 439930 435255 429442 422688 416149 409664 402260 394184 386303
57927 386303 378085 368258 357116 346306 336600 327654 319670 313447 308864 305019 301909 300517 301219 303380
57913 303380 306477 310467 315203 320506 326614 333580 340745 347778 355572 364890 374810 383813 391750 399320
57899 399320 406244 411514 415007 417343 418580 418546 417925 417376 416006 412498 407489 403037 399790 396439 392052
57884 392052 387291 383084 379558 376595 374180 371885 369127 366148 363842 362610 362345 363329 366011 369967 374217
57869 374217 378449 382872 387107 390430 393008 395584 398089 399792 400698 401526 402336 402432 401594 400145 397841 394045
57853 394045 389110 384303 380219 376535 373412 371807 372095 373510 375238 377049 378734 380040 381403 383604
57839 383604 386431 388644 389491 389298 388456 386892 384781 382680 380542 377396 372369 365359 356635 346639 336233
57824 336233 326309 316947 307676 298514 290029 282462 275639 269605 264442 259640 254670 249994 246409 243617
57810 243617 240666 237681 235777 235289 235524 236377 238617 242216 245881 248858 252019 256540 262629 270100 279131
57795 279131 289718 301203 312821 323947 333500 340171 343837 345885 347555 348694 348570 347066 344516
57782 344516 341062 336742 331671 325758 318755 310834 302543 294119 285540 277359 270489 264913 259553 253794
57768 253794 248328 244181 241738 241015 241946 243912 245839 247307 248946 251383 254424 257495 260121 261779 262176
57753 262176 261987 262422 263715 264904 265441 266011 267358 269304 271526 274346 278047 282161 286125 289983 293885
57738 293885 297478 300364 302596 304357 305835 307716 310963 315643 320717 325490 330422 336113 342435 349246
57724 349246 356987 365786 374816 383416 392120 401713 411897 421803 431382 441458 452775 465600 479855
57711 479855 495035 510470 526293 543691 563650 585925 609778 635165 662594 692467 725303
57700 725303 762103 803735 850285 901666 958456 1021601 1091812 1169909 1257312 1355525 1465515
57689 1465515 1588119 1724448 1875193 2040037 2218448 2410466 2615729 2831959 3054963
57680 3054963 3279507 3499307 3706676 3893449 4052456 4177917 4265418 4313153 4323566 4303130
57670 4303130 4260338 4203898 4141401 4077323 4011073 3937193 3847666 3734224 3590106 3412391 3204412
57659 3204412 2975811 2739477 2507806 2290618 2094570 1923018 1776326 1652867 1550238
57650 1550238 1465991 1397844 1343607 1301047 1268070 1243168 1225577 1214795 1210189 1211294 1218215 1231348
57638 1231348 1250913 1277111 1310499 1351669 1400620 1456999 1521064 1594112 1677767 1772976 1879756
57627 1879756 1997843 2127512 2269558 2424171 2589836 2763623 2942291 3122354 3298843
57618 3298843 3464754 3612241 3734006 3823468 3874701 3883445 3848301 3770766 3654619 3505817
57608 3505817 3332338 3142895 2945325 2746125 2550778 2363593 2187312 2023437 1872916
57599 1872916 1736072 1612279 1500471 1400003 1310512 1231058 1160003 1095748 1037257 984014
57589 984014 935945 893194 855468 821714 790838 762529 736892 713610 692080 672118 653830
57578 653830 636961 621066 606231 592873 580896 569774 559508 550757 543920 538718 534817 532205
57566 532205 530760 530030 529709 529909 530796 532379 534769 538267 543077 549282 557016 566182 576120 586247 597101
57551 597101 610030 625696 643569 663139 684817 709192 736186 765652 798376 835630 877895
57540 877895 924755 976116 1032972 1096743 1168249 1247593 1334823 1430398 1534953 1648772 1771591
57529 1771591 1902795 2041450 2185899 2333323 2479794 2620601 2750354 2862975 2952147 3012242
57519 3012242 3039181 3030915 2987659 2911925 2808103 2681784 2539262 2387230 2232241 2079839
57509 2079839 1933905 1796677 1669292 1552387 1446345 1351214 1266590 1191764 1126006 1068695
57499 1068695 1019264 977171 941794 912203 887221 866041 848697 835549 826461 820963 819077 821185
57487 821185 827023 835620 846564 860605 878562 900473 926423 957450 994738 1038349 1087687 1142940
57475 1142940 1205289 1275876 1355302 1443963 1542091 1649455 1765591 1890189 2022587 2160866
57465 2160866 2301851 2441611 2575237 2696472 2798572 2875773 2923503 2937779 2915845 2857892
57455 2857892 2767455 2649779 2510400 2355336 2191508 2025924 1864280 1710230 1565527 1430812
57445 1430812 1306752 1194474 1094585 1005994 926519 854622 789923 732136 680537 634638 594393
57434 594393 559244 527777 498769 471912 447152 424119 402740 383630 367138 352535 338799
57423 338799 325718 313576 302248 291358 281043 271808 263756 256538 249926 243891 238227 232643 227159
57410 227159 221964 216908 211604 206033 200706 196177 192619 189841 187518 185407 183441 181548 179385 176614
57396 176614 173612 171504 171123 172103 173291 173893 173875 173467 172726 171632 170292 168981 168031 167600 167474 167194 166476
57379 166476 165406 164216 163120 162418 162370 162802 163100 162841 162147 161236 159954 158077 155843 153810 152376 151702
57363 151702 151912 152947 154283 155145 155123 154413 153524 152903 152820 153296 154036 154502 154283 153585 153259 154036 155547 156460
57345 156460 155953 154785 154469 155578 157443 159337 161163 162926 164375 165567 167103 169313 171711 173701 175359
57330 175359 177052 178744 180166 181372 182600 183863 185170 186843 189054 191268 192760 193686 195093 197747
57316 197747 201281 204637 207178 209291 211991 215912 220742 225735 230626 235688 240984 246188 251332 257117
57302 257117 264145 272267 281056 290483 300744 311855 323883 337177 351869 367436 383232 399211
57290 399211 415716 432953 451145 470802 492185 514704 537408 559948 582597 605531 628559
57279 628559 651264 672826 691977 707730 719938 728602 732900 731668 724697 712779 696666 676831
57267 676831 654278 630604 606871 583027 558769 534450 510840 488514 467826 449082 432327
57256 432327 417169 403038 389551 376594 364331 353193 343597 335550 328649 322402 316410 310479 304918
57243 304918 300547 297879 296363 294909 293117 291450 290186 288843 286888 284529 282491 281289 280939 281161 281669
57228 281669 282364 283310 284472 285636 286776 288224 290123 291983 293347 294713 297224 301394 306660 312101 317030
57213 317030 320958 323791 326240 329318 333174 336990 340272 343592 347664 352288 356687 360531 364153 368024
57199 368024 372405 377310 382494 387670 392918 398652 405016 411607 418060 424576 431503 438662 445464 451639
57185 451639 457631 464226 471899 480460 489271 497881 506389 515193 524580 534741 545914 558135 571050
57172 571050 584390 598458 613673 629817 646385 663539 682032 702100 723126 744468 766034
57161 766034 787899 810021 832421 855016 877283 898899 920855 944992 972093 1001282 1031620
57150 1031620 1063272 1096563 1130909 1165558 1200665 1236726 1273511 1310405 1347406 1384971 1423328
57139 1423328 1462734 1503934 1547390 1592317 1637511 1683123 1730722 1781510 1835182 1890720 1947687
57128 1947687 2006456 2067614 2131449 2198036 2267733 2341506 2420430 2504881 2594669 2690029 2791829
57117 2791829 2900555 3015915 3138019 3268282 3408660 3560847 3727010 3910577 4115348
57108 4115348 4344661 4602795 4897002 5237053 5633218 6096060 6638182 7275190 8025286
57099 8025286 8909595 9953395 11186124 12640032 14349733 16352810 18689135 21398318
57091 21398318 24517307 28078544 32106947 36616026 41605329 47058467 52938449 59182015
57083 59182015 65700489 72390541 79146480 85859969 92399489 98576336 104119850 108691870
57075 108691870 111953333 113655013 113694840 112105186 108993051 104492480 98764017 92022065
57067 92022065 84547955 76669067 68716542 60983749 53698483 47012251 41004862 35698502
57059 35698502 31073728 27083248 23663853 20746733 18264297 16152849 14353624 12814572
57051 12814572 11492048 10350444 9360309 8497125 7741162 7076968 6491967 5975295 5517656
57042 5517656 5111333 4749602 4426176 4135536 3873573 3637369 3424204 3230985 3054581
57033 3054581 2892428 2742714 2604251 2476298 2358330 2249737 2149693 2057266 1971574 1891908
57023 1891908 1817843 1749229 1685971 1627869 1574768 1526723 1483742 1445438 1411238 1380963 1354996
57012 1354996 1333912 1318299 1308985 1307115 1313912 1330566 1358359 1398669 1453011 1523534 1613171 1724162
57000 1724162 1855522 2001556 2151821 2290825 2397830 2450492 2433608 2347210 2206470 2033496
56990 2033496 1848624 1667090 1499755 1353752 1232256 1134939 1059336 1001858 958345 924775
56980 924775 897719 873829 849279 820659 786707 748717 709121 670023 632961 599174 569468
56969 569468 544109 523251 507286 496505 490665 489194 491638 497665 506947 519449 535647 555985
56957 555985 580011 606256 632737 657208 677044 689495 692421 684898 667477 642360 613031 582904
56945 582904 553894 526620 501925 481461 466460 456613 450862 448900 451297 458392 469827 485193
56933 485193 504568 528239 556191 587797 621472 654318 682354 701381 707944 700112 678165 644805
56921 644805 604355 561229 518810 479261 443820 413094 387255 366001 348325 332737 318224
56910 318224 305015 293985 285306 278068 271241 264485 257895 251545 245621 240589 236819 234219 232578 232033
56896 232033 232910 235272 239016 244409 252230 263347 278256 296992 319380 345373 375105 408404 444115
56883 444115 480010 513396 541688 562511 573948 575408 568378 555935 541275 526607 513259 502378
56871 502378 495167 492417 494148 500037 510192 525247 545696 571594 603283 642027 689229 744895
56859 744895 807104 872688 937571 996262 1041939 1068168 1071171 1050990 1011238 958060 898590 839261
56847 839261 784821 738410 701936 676180 661083 656546 662958 680792 710082 750666 802752 866890
56835 866890 943524 1032606 1132885 1240552 1348342 1446293 1523618 1570444 1579498 1548354 1481090
56824 1481090 1387334 1278862 1166385 1058285 960604 877109 809397 757480 720485 697151 686276
56813 686276 687128 699406 722878 757444 803504 861524 930522 1006911 1084847 1157312 1216664 1254957
56801 1254957 1265315 1244343 1193833 1120389 1033200 941405 852293 770816 700024 641537 595646
56790 595646 561443 537434 522364 515525 516433 524549 539423 560925 588977 622814 660520 699315
56778 699315 736108 767559 789593 797562 787899 760300 718350 667766 613851 560277 509500 463422
56766 463422 423294 389364 361048 337546 318220 302486 289658 279065 270271 263114 257480 253082
56754 253082 249428 246000 242426 238537 234390 230377 227259 225784 226113 227636 229364 230417 230169 228372 225442
56739 225442 222421 220232 218978 218176 217493 216851 215966 214397 212138 209678 207378 205284 203643 202840 202493 201348
56723 201348 198759 195717 193702 192953 192610 192172 191825 191589 191178 190763 190899 191484 191703 191261 190776 190586 190106 188975
56705 188975 188036 188365 189792 191096 191327 190319 188323 185874 183777 182498 181642 180548 179284 178541 178647 179253
56689 179253 179870 180188 179978 179274 178685 178939 180007 181132 181790 182141 182428 182518 182308 182143 182428 183046 183489 183422 182959
56670 182959 182493 182434 182966 183834 184464 184412 183711 182666 181383 179717 177690 175777 174538 173964 173371 172048 169884
56653 169884 167202 164287 161427 159223 158280 158448 158833 158759 158325 157805 157061 155955 154945 154681 155217 156095 157025
56636 157025 158013 158956 159616 159981 160223 160352 160348 160568 161486 162971 164329 165193 165973 167221 168941 170732 172300
56619 172300 173576 174533 175173 175558 175723 175595 175162 174611 174229 174193 174436 174635 174382 173575 172638 172175 172340 172760 173101
56600 173101 173531 174433 175786 177059 177715 177780 177793 178252 179165 180167 180901 181191 181045 180805 181154 182530 184442 185816
56582 185816 186216 186326 186998 188260 189632 190960 192376 193718 194663 195413 196625 198536 200657 202474 204105
56567 204105 206002 208371 211105 214107 217422 221100 225039 228955 232529 235670 238613 241620 244595 247176
56553 247176 249234 251069 253005 254860 256040 256236 255930 255980 256664 257401 257540 257093 256292 254801 252047 248314
56537 248314 244750 242076 239885 237499 234883 232345 229908 227512 225380 223677 222189 220852 220219 220830 222388
56522 222388 224127 225690 227083 228046 228120 227195 225436 222842 219510 216163 213685 212135 210786 209184 207631
56507 207631 206531 205787 204955 203626 201611 199103 196681 194877 193693 192721 191658 190514 189560 189306 190196 191969
56491 191969 193639 194496 194799 195191 195899 197001 198851 201442 203747 204638 204309 204070 204861 206722 209464 212973
56475 212973 216811 220315 223206 225605 227610 229447 231743 234890 238371 241519 244665 248570 252977 256880
56461 256880 260131 263534 267235 270297 272154 273329 274290 274698 274392 274112 274503 275054 274684 272917 270092 266918
56445 266918 264178 262325 261073 259838 258660 258091 258145 258201 258068 258245 258812 259027 258412 257352 256174 254588 252548
56428 252548 250831 249981 249448 248425 246931 245411 243839 241938 239805 237690 235547 233349 231478 230254 229487
56413 229487 228897 228591 228661 228732 228332 227412 226210 225020 224297 224423 225058 225313 224916 224605 224997 225739 226241 226673 227659
56394 227659 229373 231426 233310 234714 235756 237072 239200 241803 244085 246014 248306 251178 254037 256595
56380 256595 259185 261663 263147 263370 263212 263316 263211 262454 261467 260556 259268 257715 257347 259241 262495 265502
56364 265502 267953 270378 272590 274031 275073 276509 278066 278808 278804 279076 279948 280656 280672 280482 280890 282349 284884
56347 284884 287983 290612 292063 292715 293436 294488 295667 297121 299200 301688 304027 306187 308662 311706 315136
56332 315136 318733 322336 325783 329283 333514 338841 344841 350996 357311 363705 369524 374451 379291 384956
56318 384956 391200 397215 402980 409050 415395 421346 426391 430284 432772 433982 434606 434965 434519 433081 431765
56303 431765 431597 431899 431300 429799 428584 428286 428783 430272 433041 436331 438958 441055 443974 448430 453943
56288 453943 459999 466525 473282 480143 488042 498361 511118 524905 538791 553230 569015 586516
56276 586516 606186 628666 653990 681561 711235 743612 779153 817852 859888 905779 955898
56265 955898 1010766 1071798 1140686 1217888 1302674 1394662 1494257 1601504 1715715 1836447 1963695
56254 1963695 2096704 2233516 2371955 2510032 2645005 2773102 2890763 2995562 3085683 3159325
56244 3159325 3215130 3252574 3271755 3273469 3259663 3233062 3195986 3150051 3097006 3039026 2977929
56233 2977929 2914755 2850209 2784739 2717975 2648825 2576391 2500322 2420317 2336106 2248117 2157545
56222 2157545 2065609 1973156 1880873 1789207 1698232 1608286 1520608 1436609 1356760 1281023 1210067
56211 1210067 1145012 1086099 1032672 984353 941171 902574 867551 835853 808026 784047 762870
56200 762870 743512 725690 709305 694240 680750 669106 658779 648913 639626 631908 626183 621893
56188 621893 618472 615712 613266 610868 609121 608985 610493 612981 616435 621399 627558 633738 639476 645369
56174 645369 651811 658636 666129 675008 685076 695154 704636 713975 723372 732248 740334 748093 755717 762880
56160 762880 769806 777394 785856 794350 802476 811205 821968 835664 852758 873329 896776 922491 951150
56147 951150 984599 1024388 1071289 1126199 1190487 1265438 1352364 1453126 1569319 1700726 1845232
56136 1845232 1999745 2160021 2320155 2473875 2616484 2744705 2855781 2948786 3026390 3092997
56126 3092997 3150824 3199325 3237839 3266307 3283245 3285700 3272239 3244452 3205077 3156263 3099586
56115 3099586 3035446 2961591 2874007 2770027 2649689 2514711 2368557 2217519 2069122 1928616
56105 1928616 1798608 1681803 1581244 1497382 1427621 1369610 1322576 1284918 1253398 1225919 1202617
56094 1202617 1183132 1165272 1147572 1130678 1114964 1099279 1083466 1069604 1059041 1050369 1041945 1034297
56082 1034297 1028407 1023731 1019695 1017305 1017495 1019475 1022188 1025774 1030342 1035121 1040094 1046584 1054913 1063418
56068 1063418 1071097 1079225 1088986 1099542 1109934 1120930 1133446 1147009 1161132 1176303 1192333 1207708
56056 1207708 1221858 1236000 1250658 1264667 1277856 1292162 1308569 1325463 1341525 1357775 1375164
56045 1375164 1392801 1410220 1428825 1449282 1470091 1490516 1512230 1536207 1560793 1584912 1610369
56034 1610369 1638799 1668998 1699496 1731071 1764501 1798594 1832726 1868628 1907453 1947788 1988710
56023 1988710 2031826 2078044 2125497 2173078 2222793 2275992 2330577 2384697 2439925 2497894 2557152
56012 2557152 2616380 2677417 2741963 2808567 2876061 2946642 3022296 3101549 3182950 3268288 3359103
56001 3359103 3453682 3550963 3653643 3763958 3880283 4001499 4130509 4269619 4416675 4569750
55991 4569750 4731290 4903663 5085401 5276165 5480460 5701769 5938068 6187938 6455848
55982 6455848 6746420 7059182 7394448 7758587 8157622 8591639 9061604 9575651 10142637
55973 10142637 10766449 11453535 12219172 13079659 14046559 15137060 16383428 17826327 19508768
55964 19508768 21483596 23813794 26553793 29741670 33421958 37667545 42574601 48259059
55956 48259059 54878252 62643406 71798824 82611095 95397419 110542356 128472866
55949 128472866 149649328 174563105 203561575 236404499 271810003 307367467 339840921
55942 339840921 365586043 381028122 383448007 372004794 348302099 315879615 278909159
55935 278909159 241024391 204861783 172117206 143686255 119776978 100098992 84110867
55928 84110867 71200243 60769814 52293375 45354393 39635292 34880082 30882486 27492723
55920 27492723 24603263 22122388 19971165 18095102 16457684 15023010 13756360 12635313
55912 12635313 11645264 10766741 9978718 9270100 8636044 8066213 7547278 7073405 6643752
55903 6643752 6252522 5891065 5556811 5250821 4969103 4705058 4457913 4230354 4020200
55894 4020200 3822417 3636972 3466772 3309869 3161283 3020737 2891315 2772063 2658842
55885 2658842 2551044 2450879 2357358 2267280 2180931 2100807 2025997 1953601 1884377 1821209 1763243
55874 1763243 1707168 1653178 1604087 1559561 1516705 1475552 1438619 1405522 1373123 1340625 1309808
55863 1309808 1280768 1252075 1224804 1201878 1183574 1167695 1153725 1142712 1133487 1122983 1109976
55852 1109976 1094768 1075769 1050492 1019669 986709 953382 919550 886599 857189 831627 807931
55841 807931 785416 765027 746511 728587 711671 697182 684379 671050 656995 643692 630889
55830 630889 616848 601773 587764 575434 563637 552436 543182 535668 528142 520219 512932 505941 497603
55817 497603 487849 478228 469011 459094 448902 440628 435259 431839 429856 429927 431943 434920 438834 444304
55803 444304 450427 455265 458522 461451 464116 465179 464441 463051 460944 456451 448927 439587 429374 418078
55789 418078 405902 393943 382711 371954 362089 354076 347759 342126 337244 334120 332722 331976 331609 331922
55775 331922 331740 328708 321914 312458 301426 289195 276858 266245 258129 251995 247654 245399 244530 243527
55761 243527 241801 239563 236011 229606 220378 210228 200734 192182 184753 178811 173839 168811 163853 160032
55747 160032 157421 154976 152345 150113 148210 145720 142501 139428 136896 134512 132322 130934 130435 130542 131533
55732 131533 133584 135621 136531 137068 138635 140588 140879 139107 136672 134054 130338 125607 121367 118177 115063
55717 115063 111744 109210 107565 105497 102621 100266 99228 98742 98511 99715 102977 107225 111682 117257 124740
55702 124740 133024 140401 146390 151185 154346 155181 153753 150714 146761 142653 138883 135100 130849 127120
55688 127120 125860 127561 130450 132547 133433 133745 134109 134987 136415 137569 137678 137549 138914 142054 145449 147961
55672 147961 149908 151657 152738 152894 152549 151717 149870 147508 146373 147341 149319 150921 151993 152859 153380 153596
55656 153596 154246 155787 157763 159751 161980 164526 166819 168481 169667 170224 169513 167482 164771 161411 156558
55641 156558 150018 142888 136184 129894 123846 118354 113463 108591 103459 98415 93556 88616 83986 80585
55627 80585 78295 75808 72474 69006 65945 62806 59328 56170 53716 51507 49538 48722 49278 49937 49684
55612 49684 49069 48966 49144 48994 48632 48381 48056 47584 47372 47376 46781 45343 44036 43612 43559 43271 43159 43744 44553
55593 44553 44821 44452 43608 42256 40793 40072 40067 39602 38105 36514 35591 34578 32591 30209 28451 27153 25632
55576 25632 24187 23618 23807 23971 23867 23686 23181 21918 20137 18500 17321 16738 17152 18764 21015 23198
55560 23198 25236 27325 29281 30876 32337 33901 35229 35761 35287 33880 31798 29770 28743 28987 29958
55545 29958 31162 32431 33338 33409 33155 33698 35029 35895 35910 36422 38616 42024 45748 49834 54394 58512 61215
55528 61215 62682 63537 63861 63853 64529 66568 69194 71198 72373 73076 73191 72500 71281 69570 66609 62066 56979
55511 56979 52499 48400 43865 38928 34060 29129 23963 19318 16030 13706 11292 8442 5376 2088
55496 -1210 -3532 -4171 -3842 -3686 -3647 -2953 -1668 -549 191 872 1405 1502 1487 1887 2555 3093 3677 4544 5169 5005
55476 5005 4524 4454 4527 4107 3512 3442 3547 2957 1943 1659 2310 2882 2739 2408 2643 3630 5165 6819 7895
55457 7895 7972 7427 6882 6387 5719 5015 4414 3598 2520 1985 2533 3335 3274 2627 2520 3158 3842 4366 5103 5852
55437 5852 5859 4971 3820 2952 2651 3305 4886 6394 6867 6625 6492 6321 5632 5217 6451 9087 11356 12358
55419 12358 12866 13553 13948 13578 12818 12086 11253 10357 9968 10435 11616 13588 16681 20521 23962 26325 27899
55402 27899 29034 29622 29707 29657 29404 28378 26492 24413 22524 20512 18310 16561 15681 15172 14331 13095 11817
55385 11817 10732 9973 9599 9368 8938 8446 8408 8908 9440 9603 9462 9163 8752 8375 8090 7496 6192 4551
55367 4551 3399 2978 2888 2948 3227 3312 2563 1355 1096 2570 4886 6450 6534 5661 4929 5130 6096 6760 6159
55348 6159 4381 2318 794 316 1062 2339 2642 1332 -92 405 2737 4883 5627 5639 5708 5503 4735 4211
55330 4211 4723 5656 5590 3929 1401 -683 -1442 -1045 -541 -628 -647 558 2944 5221 6483 6891 6690 5703 4120
55311 4120 2739 1958 1421 1070 1629 3453 5749 7519 8620 9325 9478 8742 7213 5367 3756 2990 3423
55294 3423 4588 5535 6000 6554 7447 8076 7933 7264 6402 5268 4025 3387 3703 4429 5087 6013 7518 8976
55276 8976 9547 9300 8893 8519 7902 7044 6353 6148 6476 7229 8068 8467 8145 7298 6264 5259 4563 4475 4912
55257 4912 5545 6440 7956 9772 10797 10500 9712 9540 10025 10442 10449 10272 10005 9362 8120 6473 4966 4199
55239 4199 4369 5014 5417 5321 4992 4696 4561 4846 5676 6536 6778 6661 7136 8422 9665 10248 10588 11252 12127
55220 12127 12894 13558 14007 13832 13180 13039 13993 15289 15794 15406 14865 14626 14586 14558 14415 13989 13293 12624 12161
55201 12161 11826 11717 12126 12872 13238 12992 12857 13521 14755 15922 16738 17060 16613 15544 14649 14480 14712 14863
55183 14863 14993 15240 15410 15632 16544 18087 18935 18080 16269 14808 13667 12018 10126 9226 9654 10452 10971
55166 10971 11693 13188 15227 17213 18663 19057 18043 16185 14802 14597 14932 14796 14019 13166 12633 12318 12026
55149 12026 11813 11890 12393 13287 14448 15674 16566 16577 15538 14103 13251 13196 13249 12890 12485 12589 13045 13275 13159
55130 13159 13210 14051 16012 18897 21870 23911 24797 25286 26008 26649 26670 26353 26510 27409 28535 29210 28989 27765
55112 27765 25968 24435 23654 23339 23140 23294 24097 25163 25912 26435 27211 28218 29016 29515 29998 30538 30973 31285
55094 31285 31428 31081 30219 29667 30286 31807 33276 34427 35709 37087 37845 37742 37398 37238 37019 36733 37183
55077 37183 38965 41442 43301 43847 43343 42416 41599 41225 41294 41448 41292 40698 39762 38676 37778 37484 37893 38524
55059 38524 38613 37685 35869 33743 31898 30578 29733 29368 29641 30474 31340 31759 31891 32338 33435 34954 36441
55042 36441 37532 37980 37695 36893 35986 35283 34855 34691 34853 35456 36523 37782 38665 38717 38152 37730 37969 38671
55024 38671 39378 40020 40874 42111 43560 44742 45086 44437 43492 43299 44046 44728 44371 43209 42259 42090 42482 43027
55006 43027 43501 43753 43679 43350 42882 42244 41435 40668 40184 40003 39989 39959 39611 38815 38065 38154 39108 40008 40207 40129 40358
54985 40358 40569 40101 39151 38617 39019 40255 42114 44300 46188 47344 48220 49671 51895 54398 56806 59023
54969 59023 60740 61580 61797 62183 63286 65177 67874 71357 75257 79178 83274 87964 93180 98513 103946
54954 103946 109810 116225 123341 131928 142729 155227 167935 179965 191347 201727 209888 214969 217155
54941 217155 216588 212540 204449 193159 180322 166947 153264 139673 127027 115960 106475 98250 91031
54928 91031 84697 79215 74607 70873 67984 65962 64847 64571 64998 66065 67720 69775 72089 74849 78440
54913 78440 83006 88402 94479 101114 108083 115317 123260 132568 143411 155372 167939 180498 191799
54900 191799 200081 204145 204109 200895 195202 187154 176725 164288 150781 137349 124755 113192 102738
54887 102738 93713 86377 80563 75944 72382 69630 67038 64153 61361 59356 58041 56701 55172 54110
54873 54110 54020 54611 55244 55384 54566 52608 50096 48086 47011 46281 45155 43520 41694 39957 38489 37320
54857 37320 36155 34672 33097 32053 31710 31642 31639 32012 32839 33529 33557 33164 32904 32879 32819 32620 32416 32322 32382 32641
54837 32641 33111 33775 34650 35621 36260 36174 35513 34810 34414 34529 35602 37879 40571 42323 42776 42970 43927 45557
54819 45557 47320 49131 51025 52586 53429 53828 54259 54653 54727 54793 55651 57746 60854 64456 68088 71519 74981
54802 74981 79069 84155 90031 96346 103175 110944 120098 131009 143777 157769 171755 184866 197057
54789 197057 208237 217339 222845 224024 221174 214905 205768 194543 182269 169845 157869 146824 137094
54776 137094 128728 121494 115240 110060 106076 103178 101008 99178 97596 96536 96217 96356 96588 97325 99691
54761 99691 104215 110030 115814 121307 127398 134914 143883 153985 165174 177580 191087 205291 219710
54748 219710 233803 246741 257361 264503 267410 265796 259689 249462 236047 220772 204760 188700
54736 188700 173192 158863 145787 133342 121231 110254 101390 94416 88283 82648 78059 74619 71527
54723 71527 68307 65554 63989 63505 63586 63935 64156 63548 61907 60017 58730 58009 57514 57544 58632 60483 62099
54706 62099 62827 62722 62077 61155 60225 59339 58224 56881 56030 56378 57623 58816 59597 60395 61411 62140 62112 61528
54688 61528 60855 60254 59721 59508 60016 61344 63137 64905 66380 67614 68752 69805 70665 71302 71768 72037 72065
54671 72065 72134 72921 75011 78416 82612 86961 91033 94686 97950 100788 103055 104786 106388 108219 110090
54656 110090 111509 112413 113248 114426 116076 118292 121106 124249 127498 131233 136025 141616 147029 151849 156602
54641 156602 161666 166673 171380 176181 181044 184693 185678 183818 179874 174348 167432 159802 152459 145782
54627 145782 139338 132666 125777 119005 112830 107718 103777 100719 98405 97051 96552 96122 95136 93900 93025
54612 93025 92416 91664 91042 91287 92472 93879 94908 95458 95486 94887 93866 92839 91880 90817 89763 88968 88121
54595 88121 86498 83911 81002 78419 76161 73906 71532 69158 66946 65063 63626 62586 61804 61141 60358
54580 60358 59145 57518 56012 55169 54979 55053 55094 54943 54498 53926 53640 53673 53480 52803 52207 52216 52342 51790 50756
54561 50756 50175 50348 50712 50920 51305 52151 53291 54542 55907 57189 58023 58404 58693 59032 59263 59424 59772 60360
54543 60360 61182 62667 65304 68720 71877 74333 76672 79543 82923 86506 90126 93526 96354 98690 101037
54528 101037 103495 105448 106335 106268 105596 104337 102323 99540 96147 92493 89191 86672 84539 81961 78864
54513 78864 76135 74374 73118 71656 70024 68708 67811 67032 66156 65129 63880 62465 61179 60290 59826 59785
54497 59785 60227 61014 61855 62820 64373 66551 68562 69598 69711 69501 69282 69017 68824 68975 69471 70086 70824 71893
54479 71893 73166 74027 74002 73402 73147 73886 75360 76684 77229 77112 76799 76502 76188 75944 75972 76334 76953 77729 78344
54460 78344 78229 77231 76141 75949 76601 77091 76825 76212 75743 75151 73894 72005 70080 68731 68317 68860 69908
54443 69908 70719 70826 70343 69628 68920 68354 68032 67950 68070 68474 69105 69448 68887 67438 65745 64372 63551 63515 64415
54424 64415 65840 67075 67960 68865 69750 70058 69759 69626 70124 70853 71576 72891 75203 77746 79542 80760 82287
54407 82287 84307 86177 87476 88374 89147 90055 91553 93915 96717 99378 102114 105610 109725 113282 115376
54392 115376 116358 117247 118592 120097 121022 120775 119318 117122 114601 111695 108281 104790 101927 99795 97779
54377 97779 95428 92957 90715 88620 86499 84649 83605 83404 83480 83337 83060 82991 83082 82860 82033 80910 80013
54360 80013 79452 78896 78140 77472 77424 78300 79917 81678 83002 83854 84786 86236 87943 89387 90666 92403 94888
54343 94888 97872 101250 105242 109584 113213 115288 116141 116794 117773 118807 119345 118947 117420 115009 112314 109651
54327 109651 106725 103319 100063 97932 96993 96158 94346 91564 88690 86356 84251 81520 77781 73609 69950
54312 69950 67218 65236 63867 63102 62504 61214 58914 56339 54476 53582 53323 53433 53787 54141 54322 54444 54546
54295 54546 54251 53270 52027 51237 50999 50832 50531 50442 50896 51818 52941 53965 54455 54027 52870 51821 51693 52562
54277 52562 53737 54406 54377 54254 54773 55937 56977 57222 56711 55838 54827 53814 53103 52945 53263 53898 54843 55943
54259 55943 56701 56825 56658 56675 56886 57172 57805 59009 60270 60882 61015 61502 62541 63325 63132 62180 61199 60667
54241 60667 60700 61238 62061 62878 63543 63972 63914 63195 62135 61319 60877 60457 59949 59666 59692 59548 58829 57730 56665
54222 56665 55683 54618 53557 52806 52515 52576 52796 52997 53053 52967 52892 52961 53200 53572 54006 54420 54839 55458 56397 57408
54202 57408 58023 57943 57171 55937 54735 54239 54706 55556 55903 55528 54896 54286 53418 52065 50539 49340 48706 48649
54184 48649 49034 49429 49365 49024 49238 50398 51717 52054 51206 49941 48948 48247 47569 46814 46049 45445 45336 46021
54166 46021 47349 48747 49835 50812 52036 53336 54060 53810 52943 52222 52106 52474 52972 53421 53808 54100 54233
54149 54233 54301 54538 55010 55383 55195 54460 53835 53945 54536 54625 53689 52376 51698 51737 51666 50999 50181 49779 49700 49599
54129 49599 49576 49982 50803 51708 52509 53137 53335 52832 51770 50573 49456 48430 47695 47637 48377 49563 50580 50776
54111 50776 49770 47968 46560 46506 47560 48746 49638 50577 51729 52704 53308 53956 54960 55975 56552 56820 57176
54094 57176 57621 57901 58041 58278 58542 58418 57664 56432 55009 53560 52143 50798 49590 48659 48226 48413 49106
54077 49106 50091 51281 52670 54125 55324 55904 55628 54521 52999 51799 51534 52267 53591 55195 57133 59413
54061 59413 61529 62783 63124 63320 64071 65261 66412 67605 69438 72117 75105 77747 79734 80891 81140
54046 81140 80933 81170 82242 83628 84875 86483 89196 92744 96056 98615 100955 103829 107470 111743 116487
54031 116487 121521 126609 131543 136119 140238 144327 149357 155825 162884 168998 173517 177031 180226 183020
54017 183020 184969 185956 186248 186220 186178 186162 185903 185238 184443 183713 182573 180418 177528 174795 172451 169887 166800
54000 166800 163602 160443 156770 152385 148123 144828 142195 139377 136277 133626 131994 131318 131164 131023 130516
53985 130516 129655 128752 127849 126576 124836 123166 122070 121389 120709 119941 119090 117935 116517 115477 115241 115244 114654
53968 114654 113596 112875 112679 112381 111611 110683 109822 108720 107157 105493 104225 103446 103040 103115 103914 105473 107502
53951 107502 109500 111000 111959 112918 114539 116942 119689 122333 124681 126665 128456 130763 134478 139746 145688
53936 145688 151249 156042 160194 163718 166420 168278 169487 170135 170046 169042 167259 165172 163309 161992 161339
53921 161339 161586 163204 166482 170979 175686 179923 183933 188426 193684 199299 204713 209791 214821 220189
53907 220189 226127 232635 239451 246153 252388 257971 262681 266037 267524 267049 265114 262528 260091 258371
53893 258371 257400 256486 254743 252016 248969 246064 242911 238987 234559 230239 225925 220883 214748 207720 199884
53878 199884 191285 182833 176146 171978 169384 166901 163885 160213 155570 149984 144596 140811 138684 136953
53864 136953 134663 132044 129655 127423 124895 121942 118821 115823 113174 111159 110001 109548 109122 107849 105357
53849 105357 102220 99476 97575 96110 94693 93605 93140 92809 91900 90625 89980 90405 91312 92014 92417 92550
53833 92550 92148 91197 90418 90617 91725 92935 93671 94040 94409 94866 95178 95116 94825 94913 96013 98104 100424 102206
53815 102206 103353 104207 104875 105094 104753 104262 104347 105596 108145 111553 114930 117429 118857 119841 121343 123957
53799 123957 127555 131532 135413 139333 143876 149299 155018 160124 164482 169020 174655 181103 187067 191527
53785 191527 194505 196583 198131 199232 200032 200769 201505 202050 202092 201294 199475 196941 194406 192271 190124 187264
53769 187264 183648 179999 177066 175076 173745 172412 170362 167534 164891 163437 162861 161837 159745 157345
53755 157345 155452 153772 151656 149265 147241 145675 144199 142815 141794 140872 139338 136994 134428 132241
53741 132241 130522 129106 127801 126258 124210 121995 120422 119854 119814 119651 119182 118497 117581 116469 115454 114801
53725 114801 114473 114401 114867 116279 118629 121427 124130 126472 128466 130245 131919 133446 134610 135224 135379 135527
53709 135527 136303 138135 140880 143920 146807 149766 153359 157627 161852 165301 168029 170678 173560 176186
53695 176186 177780 178187 178146 178740 180646 183888 188049 192442 196237 198872 200564 202175 204323 206770 208878
53680 208878 210419 211636 212750 213833 215122 216943 219150 221037 222084 222586 223283 224469 225753 226691 227374
53665 227374 228184 229139 229746 229568 228706 227533 226213 224802 223735 223659 224627 225805 226259 225816 224920 223968 223072
53648 223072 222271 221603 221023 220566 220523 221178 222398 223681 224600 225054 225176 225150 225036 224689 224033 223461 223650 224759
53630 224759 226210 227470 228665 230037 231288 232046 232633 233698 235250 236791 238249 239988 241856 243119 243708
53615 243708 244767 247413 251364 255324 258497 261264 264465 268427 272814 277269 281955 287332 293404 299535
53601 299535 305225 310739 316572 322597 328292 333634 339033 344398 349047 352814 356554 361163 366517 371835
53587 371835 376678 381190 385677 390339 395229 400124 404526 408058 410768 412998 415112 417418 420037 422722
53573 422722 425124 427326 429735 432293 434301 435326 435855 436613 437541 437905 437249 435821 434174 432692 431475
53558 431475 430419 429366 428322 427417 426590 425543 424139 422588 421053 419389 417550 415951 415084 414861 414691
53543 414691 414065 412875 411358 410023 409505 410154 411717 413586 415289 416713 418080 419790 422067 424641 427119
53528 427119 429789 433585 438975 445290 451572 457657 463929 470382 476642 482775 489418 497075 505852 515847
53514 515847 527201 539606 552281 564652 576841 589432 603049 618104 634485 651489 668513
53503 668513 685889 704582 725015 746722 769253 792797 817545 843029 868623 894333 920541
53492 920541 947230 974016 1000866 1028182 1056078 1084000 1111218 1137516 1163280 1189088 1215288
53481 1215288 1241826 1268466 1295292 1322869 1351614 1381050 1410040 1437849 1464624 1490657 1515580
53470 1515580 1538675 1559769 1579329 1597785 1615165 1631465 1646909 1661642 1675537 1688535 1700834
53459 1700834 1712456 1722921 1731782 1739266 1745886 1751483 1755120 1755988 1753991 1749368 1742185 1732445 1720357
53446 1720357 1706214 1690192 1672468 1653250 1632534 1610114 1586144 1561432 1536830 1512446 1487771
53435 1487771 1462413 1436308 1409300 1381046 1351565 1321614 1292262 1264184 1237487 1212078 1187987
53424 1187987 1165277 1143873 1123690 1104956 1088147 1073425 1060301 1048151 1037071 1027875 1021153 1016643
53412 1016643 1013732 1012306 1012810 1015674 1020955 1028525 1038319 1050385 1064773 1081378 1099856 1119891 1141558
53399 1141558 1165185 1190727 1217622 1245514 1274776 1305972 1339083 1373702 1409822 1447886 1488144
53388 1488144 1530543 1575254 1622709 1672917 1725286 1779434 1835721 1894624 1955937 2018990 2083433
53377 2083433 2149365 2216772 2285217 2354008 2422351 2489420 2554686 2618254 2680609 2741960 2802014
53366 2802014 2860338 2916498 2969679 3018573 3062084 3100152 3133687 3163778 3191079 3215722 3237417
53355 3237417 3255595 3269745 3279712 3285525 3286879 3283067 3273481 3257878 3236026 3207409 3171601 3128775
53343 3128775 3079609 3024897 2965566 2902911 2838391 2773067 2707506 2642115 2577264 2513093 2449581
53332 2449581 2386896 2325361 2264973 2205251 2145658 2085927 2025936 1965752 1906053 1848108 1792888
53321 1792888 1740380 1690065 1641877 1596353 1553929 1514532 1477927 1444162 1413460 1385783 1360648
53310 1360648 1337409 1315704 1295555 1276992 1259752 1243594 1228853 1216286 1206274 1198458 1192277 1187548
53298 1187548 1184327 1182551 1182133 1183096 1185280 1188173 1191429 1195418 1200871 1208123 1217098 1227924 1241086 1256911
53284 1256911 1275264 1295788 1318140 1342001 1367311 1394528 1424178 1455897 1488222 1519668 1549837
53273 1549837 1579278 1608546 1637765 1666918 1696004 1724678 1752105 1777517 1800847 1822530 1842704
53262 1842704 1861001 1877252 1892029 1906084 1919423 1931357 1941372 1949378 1955073 1957651 1956531 1951946
53250 1951946 1944395 1933781 1919528 1901363 1879609 1854839 1827606 1798371 1767345 1734465 1699840
53239 1699840 1664094 1627904 1591342 1554135 1516554 1479566 1444047 1410170 1377562 1345627 1313647
53228 1313647 1281041 1247790 1214399 1181322 1148654 1116358 1084395 1052559 1020621 988925 958443
53217 958443 929900 903034 877053 851654 827344 804844 784517 766273 749688 734068 718624
53206 718624 702927 687201 672040 657655 643490 628777 613497 598469 584356 570904 557479
53195 557479 544093 531394 519736 508745 497886 486997 476157 465451 455092 445395 436346 427426
53183 427426 418150 408544 398849 389021 378870 368574 358672 349567 341301 333801 327046 320865 314771 308250
53169 308250 301241 294193 287617 281658 276212 271365 267372 264112 260988 257720 254940 253342 252374 250517
53155 250517 247088 243114 239947 237575 234979 231828 228965 227158 226104 224946 223284 221263 219002 216420
53141 216420 213553 210679 208065 205856 204257 203534 203647 204057 204096 203517 202543 201478 200500 199808 199672 200187 201151
53124 201151 202360 203855 205688 207573 209033 209921 210585 211478 212729 214133 215453 216743 218356 220576 223173
53109 223173 225487 227088 228172 229147 230013 230449 230331 229708 228369 225928 222440 218477 214476 210391 206275
53094 206275 202695 200152 198272 196046 192860 188997 185156 181779 178936 176556 174577 172909 171375 169758
53080 169758 167946 166051 164314 162833 161449 159954 158428 157246 156740 156824 156947 156483 155228 153515 151782
53065 151782 150114 148288 146206 144173 142728 142267 142689 143317 143326 142506 141496 141025 140996 140651 139586 138199 137107
53048 137107 136577 136659 137353 138362 139015 138884 138227 137505 136709 135650 134614 134141 134173 134075 133687 133689 134490 135224 134532
53029 134532 132224 129573 127880 127262 127058 126895 126804 126625 125970 124896 124057 123887 123991 123685 122871 122007 121337 120611
53011 120611 119607 118590 118024 117999 118116 117973 117690 117805 118549 119405 119667 119452 119689 120878 122252 122643 121862 120704
52993 120704 119760 118864 117813 116990 116925 117589 118433 119007 119309 119658 120333 121298 122287 123222 124395 126043 127903 129528
52975 129528 130936 132539 134516 136760 139397 142725 146523 150083 153210 156618 160875 165388 168965 171035
52961 171035 171869 171949 171673 171448 171407 171008 169509 166947 164230 162118 160507 158858 157005 155218 153773 152757
52945 152757 152230 152185 152287 151937 150869 149592 148939 149138 149545 149382 148464 147127 145759 144702 144266 144409 144556
52928 144556 144260 143895 144223 145257 146110 146043 145211 144294 143847 144095 144881 145702 146193 146647 147543 148592 148961 148496
52910 148496 147890 147410 146478 145012 144220 145155 147203 148956 150053 151155 152462 153386 153619 153527 153402 153174 152997
52893 152997 153372 154405 155515 156116 156189 156101 156295 157091 158333 159270 159335 158989 159214 160228 161408 162441 163715
52876 163715 165387 166877 167673 167988 168258 168539 168816 169326 170125 170791 171003 171027 171225 171451 171389 171121 170926 170858 170942
52857 170942 171460 172603 174108 175773 178012 181318 185358 189241 192630 195983 199653 203336 206634 209641
52843 209641 212705 215869 218833 221252 222890 223601 223369 222341 220762 218901 217038 215341 213698 211780 209421
52828 209421 206898 204737 203214 202029 200552 198379 195592 192408 188735 184334 179414 174770 171155 168712
52814 168712 167112 165946 164741 162958 160515 158190 157005 157050 157335 156899 155709 154274 152869 151526 150481
52799 150481 150022 149917 149468 148264 146607 145043 143768 142609 141335 139803 138005 136191 134788 134017 133678
52784 133678 133460 133290 133160 132857 132177 131256 130388 129598 128715 127800 127134 126800 126667 126714 126942 126991 126366 125184 124097
52765 124097 123275 122076 120087 117924 116410 115419 114199 112609 111284 110601 110154 109391 108241 106905 105437
52750 105437 103781 102022 100353 98883 97570 96277 94961 93881 93464 93775 94272 94338 93931 93432 93016 92488
52734 92488 91706 90763 89846 89209 89188 89868 90796 91438 91852 92469 93233 93518 93002 92159 91628 91517 91518 91431 91288 91182
52714 91182 91169 91192 91014 90403 89441 88492 87893 87851 88511 89802 91266 92461 93475 94640 95847 96700 97335 98462
52696 98462 100424 102835 105259 107614 109616 110602 110428 109979 110197 110956 111452 111298 110682 109724 108396 106962 105929
52679 105929 105468 105222 104687 103521 101674 99516 97738 96712 96079 95180 93748 91873 89603 87064 84784
52664 84784 83364 82849 82747 82607 82227 81423 80071 78372 76724 75385 74532 74424 75077 75929 76414 76795 77842
52647 77842 79663 81425 82339 82355 81772 80836 80006 80007 81096 82561 83428 83479 83249 83229 83415 83513 83273 82677 82058 81938
52627 81938 82559 83526 84068 83602 82036 79760 77517 76070 75651 75755 75670 75192 74688 74541 74749 75076 75419 75971
52609 75971 76981 78393 79760 80737 81619 83105 85305 87258 87846 87120 86371 86783 88287 89879 90774 91057
52593 91057 91299 91844 92568 93195 93695 94262 94944 95426 95365 94923 94797 95623 97426 99732 102043 104073 105668 106806
52575 106806 107698 108649 109786 111077 112603 114494 116518 118125 119138 120104 121603 123450 125048 126327 127749
52560 127749 129365 130506 130632 130031 129376 129019 129086 129874 131640 134049 136250 137510 137571 136628 135253 134235 134090
52543 134090 134707 135646 136643 137551 138083 138093 137979 138225 138523 137966 136292 134427 133444 133456 133900 134531 135586 137142
52525 137142 138870 140397 141498 141928 141484 140447 139584 139424 139695 139719 139239 138542 137864 137065 136071 135297 135268 135847
52507 135847 136265 136014 135502 135596 136670 138287 139650 140186 139802 138863 137924 137322 137019 136918 137181 138006 139225 140499
52489 140499 141807 143351 144977 146193 146876 147416 147914 147828 146907 145984 146069 146879 147132 146369 145671 146188 147635 148854
52471 148854 149451 150137 151587 153674 155945 158220 160386 162029 162807 163043 163466 164331 165145 165384 165171 164970 164880
52454 164880 164572 163887 163129 162651 162440 162325 162306 162389 162231 161415 160114 159091 158851 159066 159050 158524 157666 156643 155521
52435 155521 154544 154027 153878 153580 152789 151687 150628 149688 148768 147888 147145 146540 146041 145666 145344 144912 144447 144401
52417 144401 145133 146443 147856 149187 150493 151658 152482 153123 153955 154905 155404 155203 154846 155054 155944 157150 158388
52400 158388 159566 160524 161119 161596 162494 164073 166011 167805 169351 171010 173132 175613 177942 179621 180458
52385 180458 180504 179931 179118 178679 179101 180319 181843 183319 184803 186439 188115 189512 190419 190980 191705 193144
52369 193144 195308 197524 199188 200566 202442 204982 207459 209246 210608 212221 214371 216929 219697 222335
52355 222335 224291 225348 226114 227503 229763 232393 234910 237276 239620 241902 243985 245789 247363 248915
52341 248915 250680 252579 254177 255246 256157 257450 259183 261056 262928 264784 266416 267667 268900 270671
52327 270671 272944 275160 277032 278729 280288 281524 282708 284641 287754 291674 295956 300675 305914 311268
52313 311268 316448 321917 328285 335369 342484 349490 356900 365013 373626 382665 392566 403762 416204 429541
52299 429541 443470 457719 472040 486426 501095 516038 530742 544628 557770 570968 585037
52288 585037 600021 615109 629365 642575 655332 668235 681188 693622 705203 716036 726232
52277 726232 735645 744120 751683 758405 764277 769313 773555 776979 779706 782325 785510 789068 791813 792806
52263 792806 792413 791690 791018 789971 788356 786591 784979 783349 781735 780773 780898 781633 782299 783135 785032 788184
52247 788184 791655 794434 796514 798736 801916 806410 812278 819583 828482 839075 851127 864001 876983
52234 876983 889678 901971 913739 924868 935504 946028 956711 967551 978357 988793 998412 1006996
52222 1006996 1014794 1022055 1028445 1033433 1037311 1041178 1045593 1049697 1052120 1052450 1051479 1050242 1049181 1048045
52208 1048045 1046329 1043852 1041085 1038652 1036426 1033519 1029400 1024625 1020121 1016191 1012687 1009742 1007718 1006629
52194 1006629 1006223 1006519 1007669 1009411 1011231 1013084 1015380 1018225 1021203 1023956 1026487 1028773 1030595 1031878
52180 1031878 1032787 1033359 1033496 1033360 1033318 1033315 1032747 1031181 1028823 1026148 1023492 1021155 1019358 1017766 1015522 1012166
52164 1012166 1008202 1004400 1000798 996831 992228 987355 982694 978367 974215 970153 966356 963139 960600 958360
52150 958360 955796 952514 948485 943816 938693 933489 928555 923844 919045 914135 909346 904554 899240 893259
52136 893259 887072 880975 874670 868058 861901 857069 853437 850080 846312 841955 836883 831042 824933 819379
52122 819379 814620 810101 805289 800287 795531 791332 787897 785400 783711 782385 781197 780542 781009 782696 785212
52107 785212 788309 792201 797209 803310 810213 817747 825969 834927 844615 855285 867562 881900 897972
52094 897972 914905 932141 949844 968443 987993 1008021 1027744 1046429 1063868 1080598 1097312
52083 1097312 1113983 1129908 1144655 1158440 1171429 1183248 1193603 1202838 1211328 1218728 1224520 1228998
52071 1228998 1232942 1236372 1238361 1238254 1236530 1234240 1232054 1230018 1227848 1225186 1221838 1217958 1213877 1209768
52057 1209768 1205649 1201696 1198201 1195220 1192542 1190047 1187754 1185557 1183348 1181489 1180736 1181493 1183499 1186367
52043 1186367 1190004 1194271 1198677 1202788 1206628 1210343 1213705 1216374 1218371 1219878 1220766 1220880 1220783 1221638 1224014
52028 1224014 1227084 1229304 1229814 1229052 1228101 1227584 1227133 1225817 1223078 1219285 1215346 1211723 1207901 1202928 1196494
52013 1196494 1189370 1182703 1176879 1171102 1164060 1154941 1143854 1131455 1118337 1104712 1090448 1075230
52001 1075230 1058722 1040699 1021148 1000308 978611 956461 933976 910894 886915 862166 837272
51990 837272 812803 788709 764521 740148 716226 693434 671638 650062 628245 606418 584925
51979 584925 563806 543238 523881 506226 489880 474070 458669 444120 430464 417239 404399
51968 404399 392569 382024 372106 362140 352408 343673 336154 329529 323579 318222 313135 307936 302665 297671
51954 297671 293160 289295 286471 284847 283723 282037 279528 276852 274552 272491 270401 268318 266258 263992
51940 263992 261487 259115 257043 254771 251693 247973 244494 241934 240112 238277 235980 233577 231813 230935
51926 230935 230489 230089 229921 230149 230270 229737 228924 228638 228715 228099 226497 225037 224767 225280 225477 225084 224609 224210
51908 224210 223448 222066 220319 218485 216619 214877 213594 212804 212004 210594 208473 206139 204218 202818 201318
51893 201318 199003 195979 193192 191414 190505 189872 189310 188978 188812 188461 187774 186976 186308 185730 184933 183568 181584
51876 181584 179491 178074 177642 177785 178037 178428 179083 179785 180422 181504 183541 186115 188292 189825 191256 192845
51860 192845 194245 195331 196530 198014 199296 200066 200824 202062 203329 203797 203475 203225 203583 204151 204266 203860
51844 203860 203488 203665 204350 205099 205701 206508 207989 210028 212083 214009 216195 218685 220715 221582 221605 221676 222158
51827 222158 222749 223251 223790 224337 224657 224873 225493 226646 227763 228310 228448 228677 229117 229457 229413 229007 228536 228427
51809 228427 228878 229493 229592 229109 228817 229327 230161 230358 229838 229583 230367 231800 232815 232806 232079 231412 231351 231840 232387
51790 232387 232662 232900 233563 234700 235876 236776 237537 238400 239317 240069 240535 240676 240479 240053 239575 238997 238118 237176
51772 237176 237005 238193 240286 242290 243841 245455 247624 250149 252501 254452 256175 257883 259559 260944
51758 260944 261816 262354 263111 264314 265309 265117 263571 261449 259465 257596 255636 253822 252472 251391 250195
51743 250195 248960 248017 247257 246245 245020 244246 244367 245119 246101 247348 249020 250855 252461 253948 255766 257843
51727 257843 259377 259757 259393 259313 260012 260984 261385 260902 259912 259080 258942 259646 260759 261394 260881 259416 257841 256714
51709 256714 255766 254359 252194 249429 246415 243618 241622 240714 240349 239396 237193 234238 231675 230179 229545
51694 229545 229293 229332 229832 230703 231546 232175 232855 233897 235299 237037 239464 243021 247607 252697 258001 263491
51678 263491 268637 272220 273348 272322 270059 267021 263218 259036 255323 252579 250558 248800 247121 245450
51664 245450 243614 241615 239833 238724 238464 238943 239831 240570 240675 240164 239366 238171 235985 232670 228924 225275
51648 225275 221243 216270 211107 207248 205038 203302 201121 199058 198059 197832 197129 195335 193004 190942 189382
51633 189382 188122 186949 185721 184421 183328 182929 183446 184501 185293 185103 183817 182159 181237 181522 182340 182714
51617 182714 182610 182881 183974 185264 185906 185846 185605 185496 185536 185877 186804 188315 190138 192118 194244 196303 197963
51600 197963 199309 200934 203283 206138 208942 211529 214284 217600 221285 224614 227064 228958 231185 234156
51586 234156 237289 239738 241399 242762 243971 244603 244509 244266 244460 244856 244741 243905 242904 242382 242416 242576 242444
51569 242444 242024 241754 242189 243611 245944 248917 252162 255208 257741 259989 262594 265900 269543 272917 275799
51554 275799 278284 280354 281887 282991 283942 284769 285273 285464 285670 286080 286470 286511 286148 285522 284722 283792 282873 282111
51536 282111 281462 280696 279570 277950 275831 273361 270807 268436 266399 264772 263649 263080 262923 262818 262348 261248
51520 261248 259550 257567 255747 254453 253754 253302 252438 250616 247949 245270 243464 242667 242262 241679 240978 240493
51504 240493 240161 239613 238921 238832 239964 241923 243568 244116 243754 243111 242464 241637 240502 239226 238085 237267 236931
51487 236931 237188 237865 238439 238436 237940 237655 238455 240806 244513 248822 252876 256251 259190 262302 265969 269956
51471 269956 273569 276225 277954 279469 281677 284978 288942 292659 295459 297248 298220 298394 297685 296387 295250
51456 295250 294833 294945 295016 294877 294773 294594 293619 291286 287900 284283 281004 278247 276031 274006 271250 266950
51440 266950 261434 255993 251527 247787 244106 240399 237048 234190 231594 229161 227160 225874 225157 224438 223224
51425 223224 221662 220503 220353 221061 222128 223541 225674 228314 230464 231411 231536 231691 232181 232735 233037 232743
51409 232743 231348 228706 225495 222524 219681 216153 211699 207017 202737 198707 194623 190804 187832 185671
51395 185671 183583 180910 177682 174431 171576 169099 166744 164451 162453 160920 159730 158694 157829 157198 156656
51380 156656 156054 155511 155184 154864 154241 153478 153172 153680 154847 156313 157644 158160 157224 154950 152254 149977 148241
51363 148241 146785 145460 144132 142467 140237 137646 135124 133008 131603 131198 131704 132553 133309 134140 135300
51348 135300 136460 137037 137126 137537 138876 140985 143352 145698 148042 150472 153040 155679 158113 160061 161561
51333 161561 162976 164641 166634 168818 170846 172172 172457 172075 171781 171671 170850 168516 165072 161662 158769
51318 158769 155866 152551 149376 147156 145849 144654 143044 141196 139390 137530 135462 133355 131378 129249
51304 129249 126530 123358 120530 118713 117796 117148 116369 115634 115362 115670 116248 116733 117045 117298 117455 117321 116888
51287 116888 116426 116111 115841 115609 115778 116609 117699 118328 118315 118150 118324 118956 120066 121611 123045 123415 122379
51270 122379 120843 120147 120706 121771 122366 122136 121385 120667 120353 120305 119898 118603 116613 114745 113700 113535 113866
51253 113866 114317 114665 114751 114514 114147 114018 114302 114712 114791 114467 114091 113824 113293 112222 111154 111005 111842 112651 112577
51234 112577 111962 111849 112834 114767 117202 119624 121449 122313 122431 122340 122343 122507 122961 123770 124527 124573 123670 122159
51216 122159 120501 119084 118365 118650 119609 120487 120959 121352 121925 122463 122783 123115 123671 124344 125239 126921 129613
51199 129613 132535 134709 136091 137258 138211 138405 137967 137895 138704 139602 139598 138909 138674 139536 141097 142591 143536 143757
51181 143757 143320 142626 142168 141954 141409 140046 138015 135789 133531 131142 128845 127244 126545 125976 124449 121804
51165 121804 119071 117343 116669 116326 115897 115625 115782 116211 116685 117287 118158 119166 120126 121100 122149 123023 123486
51148 123486 123774 124251 124720 124604 123805 122860 122116 121319 120260 119305 118889 118862 118807 118680 118650 118499 117799 116605 115442
51129 115442 114538 113607 112493 111586 111286 111484 111905 112653 113983 115628 116902 117527 118045 119116 120644 121846
51113 121846 122172 121867 121548 121459 121394 121211 121068 121106 121225 121354 121702 122461 123438 124241 124788 125373 126255 127429 128772
51094 128772 130188 131544 132725 133840 135133 136586 137737 138046 137434 136397 135663 135737 136685 138204 139865 141320
51078 141320 142416 143305 144444 146211 148442 150552 152218 153663 155122 156453 157656 159341 162013 165107
51064 165107 167447 168697 169614 170715 171462 171226 170454 170264 171088 172246 172745 172201 171011 169872 169088 168336 167256
51047 167256 166246 166193 167292 168682 169519 169903 170313 170710 170878 171269 172638 174925 177237 179000 180371 181384
51031 181384 181477 180299 178509 177254 177096 177770 178726 179455 179427 178199 175801 172834 170084 168020 166672 165888
51015 165888 165667 166146 167275 168612 169658 170391 171337 173035 175506 178260 180748 182788 184616 186554 188683
51000 188683 190882 193198 195929 199235 202869 206516 210278 214554 219523 225031 230961 237385 244305 251530
50986 251530 258953 266726 274990 283596 292298 301131 310494 320898 332809 346643 362731 381121 401493
50973 401493 423463 447051 472719 500836 531268 563733 598434 635896 676186 718788 763452
50962 763452 810621 860588 912634 965523 1018477 1070981 1121914 1169787 1213955 1254835 1292687
50951 1292687 1326922 1357030 1383548 1407501 1429256 1448594 1465761 1481814 1497808 1514069 1530480
50940 1530480 1547284 1565254 1584938 1605696 1625594 1642453 1654952 1662582 1664753 1660494 1649122 1630631
50928 1630631 1605087 1572190 1531906 1485203 1433505 1377537 1317288 1253155 1186621 1119707 1054098
50917 1054098 990864 930584 873476 819685 769661 724109 683425 647368 615404 587161 562342
50906 562342 540392 520568 502352 485762 471281 459501 450612 444030 438660 433709 429165 425374 422322
50893 422322 419629 417143 415163 413978 413473 413381 413673 414427 415509 416749 418390 420997 424780 429302 434073
50878 434073 439168 444985 451529 458353 465277 472781 481413 491039 501067 511414 522951 536670 552528
50865 552528 569396 586283 603532 622626 644933 670817 700027 732661 769426 810980 857372
50854 857372 908313 963889 1024806 1091919 1165733 1246357 1333761 1427812 1528049 1633643 1743682
50843 1743682 1857342 1973572 2090632 2206199 2318053 2424541 2524279 2615633 2696818 2766676
50833 2766676 2825198 2873271 2912060 2942867 2967525 2988612 3008935 3030825 3056052 3086241 3122788
50822 3122788 3165986 3214484 3265954 3318114 3368614 3413994 3449504 3470454 3473625 3457368 3420851
50811 3420851 3363743 3286388 3189779 3075395 2945384 2802914 2651943 2496467 2340084 2186110
50801 2186110 2037746 1897861 1768661 1651563 1547292 1456072 1377780 1311916 1257581 1213757
50791 1213757 1179782 1155355 1139992 1132754 1132702 1139239 1151650 1168591 1188477 1210180 1232834 1255088
50779 1255088 1275119 1291430 1303245 1310157 1312022 1309278 1302850 1293419 1281107 1265954 1248289 1228497
50767 1228497 1206788 1183378 1158463 1131865 1103150 1072357 1040219 1007483 974523 941960 911120
50756 911120 883287 858793 837284 818570 802689 789455 778694 770842 766696 766489 769741 776170 786173
50743 786173 800148 817724 838054 860756 886251 915325 948602 986473 1029248 1077163 1130199
50732 1130199 1188027 1250233 1316542 1386660 1459859 1534916 1610485 1685298 1757914 1826551 1889449
50721 1889449 1945337 1993388 2032898 2063292 2084425 2096699 2100890 2098024 2089444 2076928 2062767 2049633
50709 2049633 2039971 2035250 2035898 2042037 2053980 2071642 2093745 2118082 2142470 2165049 2183652 2195437
50697 2195437 2197440 2187336 2163609 2125504 2073220 2008164 1932759 1849910 1762605 1673798 1586391
50686 1586391 1503059 1425955 1356436 1295128 1242348 1198534 1164231 1139703 1124609 1118063 1119097 1127305
50674 1127305 1143219 1167914 1202004 1244994 1295744 1353398 1417589 1487735 1562461 1639789 1717545
50663 1717545 1793372 1864599 1928638 1983792 2029657 2066708 2095483 2116116 2128516 2132907 2130190 2121740
50651 2121740 2108700 2091461 2069893 2044223 2015522 1985164 1953995 1922387 1891053 1861257 1834055
50640 1834055 1809934 1789617 1774680 1766625 1765472 1769986 1779129 1792498 1809316 1827970 1846928 1865351
50628 1865351 1882266 1895921 1904718 1908489 1908240 1904909 1898927 1890669 1880626 1869258 1857278 1845979 1836731
50615 1836731 1830209 1826555 1826135 1829468 1836455 1846260 1857964 1870789 1883639 1895087 1904082 1910266 1913405
50602 1913405 1912931 1908148 1898442 1883079 1861199 1832265 1796239 1753174 1703030 1646168 1583844 1518010
50590 1518010 1450745 1383827 1318512 1255516 1195364 1138760 1086322 1038047 993511 952706 916227
50579 916227 884409 856730 832368 811078 793192 778951 768129 760216 754794 751761 751241 753230 757467
50566 757467 763880 772964 785230 800354 817458 836379 858079 883557 912857 945491 981363 1020830
50554 1020830 1064183 1111509 1162860 1218162 1277147 1339549 1405086 1472925 1541464 1608938 1673998
50543 1673998 1735397 1791595 1841275 1884152 1920949 1952786 1981001 2007194 2032791 2058526 2084741
50532 2084741 2111984 2140788 2170994 2202005 2233893 2267797 2305057 2346374 2391927 2441842 2496234
50521 2496234 2555057 2618170 2685261 2755397 2826690 2896612 2962609 3022439 3074147 3116005 3146526
50510 3146526 3164415 3168417 3157355 3130578 3088579 3033016 2965822 2888370 2802009 2709458 2615017
50499 2615017 2522907 2435794 2355369 2283772 2223500 2176066 2141660 2120246 2112064 2116522 2131320 2153357
50487 2153357 2180230 2210266 2241341 2270346 2293899 2309091 2313367 2304102 2278850 2236309 2177149 2103976
50475 2103976 2020294 1929288 1833398 1734832 1636121 1539876 1447999 1361341 1280171 1204769 1135504
50464 1135504 1072564 1015950 965788 922277 885129 853301 825666 801914 782388 767004 754801
50453 754801 744788 736820 731287 728302 727686 729450 733670 739938 747563 756338 766529 777976 789929
50440 789929 802145 815554 831286 849400 869222 890589 913920 939011 964672 990022 1015647
50429 1015647 1042806 1071710 1101212 1130223 1158844 1187858 1217582 1247623 1277524 1307105 1336233
50418 1336233 1364787 1393040 1421677 1451218 1481755 1513430 1546813 1582336 1619620 1657813 1696586
50407 1696586 1736342 1777357 1819018 1860011 1899033 1935274 1968424 1998313 2024428 2045771 2061256
50396 2061256 2070143 2071869 2065646 2050548 2026033 1992073 1948833 1896595 1836072 1768505 1695482 1619082
50384 1619082 1542171 1467900 1398409 1334270 1275480 1222713 1177316 1140326 1111936 1091766 1079249
50373 1079249 1073744 1074609 1081295 1093230 1109492 1128609 1148529 1166798 1180995 1189276 1190602 1184519 1170966
50360 1170966 1150361 1123582 1091629 1055435 1016173 975457 934884 895405 857297 820657 785697
50349 785697 752688 721914 693723 668470 646374 627387 611054 596496 582903 570240 559180
50338 559180 550128 542691 536449 531917 530102 531270 534581 538889 543447 547930 552410 557451 563712 571344
50324 571344 580116 590114 601714 614800 628647 642864 657825 673763 690032 705899 721620 738060
50312 738060 755453 773284 791315 809967 829457 849151 868117 885963 902822 918784 933697
50301 933697 947375 959643 970148 978407 984200 987841 989959 990976 990832 989228 986059 981562 976132 970081
50287 970081 963493 956032 946895 935279 921116 905163 888251 870668 852526 834349 816785 799852
50275 799852 783021 766220 750209 735648 722193 708987 695885 683777 673627 665495 658591 652127
50263 652127 646026 640973 637850 636994 637931 639900 642671 646687 652275 658915 665591 671877 678334 685599 693322
50248 693322 700358 705952 710398 714465 718544 722562 726378 729871 732705 734399 734730 733840 731948 729109 725258
50233 725258 720306 714218 707249 700113 693657 688226 683546 679223 675108 671124 667064 662873 658890 655625
50219 655625 653346 652083 651851 652686 654582 657555 661649 666715 672350 678249 684420 690807 696934 702256 706738
50204 706738 710743 714503 718060 721573 725071 727831 728606 726735 722680 717310 711119 704448 697943 692188
50190 692188 687006 681576 675148 667405 658355 648399 638400 629115 620393 611381 601674 591912 583022 575242
50176 575242 568153 561432 555185 549681 545145 541819 539983 539796 541179 543778 546913 549650 551212 551423 550625
50161 550625 549106 546745 543204 538303 532096 524806 516882 508987 501618 494741 487962 481191 474915 469675
50147 469675 465432 461639 457943 454570 451958 450158 448699 447039 445064 443150 441789 441131 440916 440871 441070
50132 441070 441728 442679 443354 443480 443572 444449 446293 448479 450385 452028 453806 455938 458413 461216 464208 466899
50116 466899 468883 470594 473156 477066 481321 484257 485230 485120 485220 486067 487546 489677 492866 497385 502961
50101 502961 508993 515031 521000 527038 533270 539739 546544 553912 562031 570828 580171 590271 601645 614516
50087 614516 628500 643125 658369 674357 690769 707114 723573 740957 759651 779152 799010
50076 799010 819745 842348 867216 894143 923204 955013 990094 1028595 1070787 1117324 1168689
50065 1168689 1224789 1285501 1351346 1423157 1501031 1583880 1669853 1756790 1842180 1923148 1996996
50054 1996996 2061909 2117117 2162538 2198512 2225936 2246437 2262098 2274822 2285771 2295128 2302010 2304493
50042 2304493 2300000 2286022 2260687 2222838 2171970 2108493 2033998 1950962 1862132 1770361 1678815
50031 1678815 1590644 1507993 1431578 1361502 1298197 1242159 1193020 1149580 1110917 1077055 1048302
50020 1048302 1024265 1003850 986037 970391 956918 945698 936673 929578 924034 919808 916860 915059
50008 915059 913960 913070 912233 911500 910700 909485 907824 906089 904391 902095 898316 892784 885951 878313 869950
49993 869950 860822 851169 841410 831738 822053 812277 802586 793346 784905 777476 771024 765168 759288 753050
49979 753050 746961 742247 739953 740080 741748 744178 747323 751525 756815 762870 769536 777141 786213 797029
49965 797029 809402 822800 836778 851519 867859 886460 907013 928722 951674 977294 1007089
49954 1007089 1041360 1079631 1122124 1170255 1225627 1289133 1361193 1442402 1533417 1634185 1743438
49943 1743438 1858910 1977953 2097982 2216396 2330137 2435731 2530343 2613051 2684903 2747668
49933 2747668 2802792 2851540 2895444 2935780 2972582 3004440 3029181 3044343 3047138 3034660 3004625
49922 3004625 2955975 2888952 2805021 2706878 2598008 2481811 2361069 2238226 2115638 1995202
49912 1995202 1877981 1764589 1655813 1552578 1455491 1364868 1281137 1204791 1135866 1073793
49902 1073793 1017827 967375 921937 881139 844889 813157 785473 760948 738881 718952 700689
49891 700689 683271 666173 649640 634094 619383 605016 590831 576914 563062 548907 534595
49880 534595 520820 508143 496669 486361 477250 469287 462420 456820 452561 449092 445584 441978 439065
49867 439065 437272 435925 434166 432126 430631 430044 429943 429837 429698 429867 430750 432560 435116 438016 441203 445024
49851 445024 449460 453739 457311 460912 465866 472384 479290 485544 491354 497580 504752 513080 522860 534288
49837 534288 547170 561280 576884 594607 615002 638530 665794 697388 733651 774867 821586
49826 821586 874442 933734 999419 1071409 1149540 1233182 1320910 1410363 1498209 1580537 1653879
49815 1653879 1716078 1766313 1804757 1832631 1852265 1866339 1876876 1885236 1892749 1900409 1907495 1911048
49803 1911048 1907151 1892493 1864662 1821928 1763809 1691758 1608613 1517278 1420363 1320910 1222613
49792 1222613 1128930 1042247 963876 894223 832733 778226 729881 687634 651354 620030 592282
49781 592282 567405 545400 526191 509392 494753 482192 471255 461119 451361 442255 434165 427050
49769 427050 420834 415733 411823 408622 405586 402802 400675 399060 397237 394807 392198 390121 388808 387913
49755 387913 386952 385737 384528 383834 383955 384648 385373 385807 386000 386080 386038 385844 385549 385213 384902 384788 385060 385694 386545
49736 386545 387742 389769 392915 396765 400431 403275 405307 406901 408283 409306 409681 409351 408671 408187 408265 408835
49720 408835 409443 409582 409181 408788 409079 410042 410930 411191 411235 411918 413435 415124 416305 416921 417320 417848 418800 420325
49702 420325 422219 424066 425779 427723 430182 433017 436016 439168 442414 445517 448481 451635 454945 457694
49688 457694 459451 460996 463516 466998 470180 472169 473352 474470 475512 476017 475952 475712 475489 475201 474895 474762
49672 474762 474764 474681 474573 474832 475678 476853 477902 478536 478624 478137 477339 476833 477098 477993 478860 479192 479083 479070 479599 480649
49652 480649 481751 482385 482455 482378 482632 483284 484050 484708 485151 485104 484239 482790 481683 481642 482359 483025 483519 484545 486534
49633 486534 489016 491299 493254 495050 496558 497587 498529 500152 502675 505508 508012 510201 512464 514925
49619 514925 517302 519334 521167 523299 526133 529490 532736 535549 538482 542439 547622 553353 559022 564773
49605 564773 571102 578182 585993 594775 604845 616012 627647 639351 651188 663257 675489 687991
49593 687991 701208 715410 730279 745357 760755 777112 794847 813750 833322 853334 873982
49582 873982 895651 918588 942758 967945 994066 1021325 1049963 1079881 1110665 1142022 1174085
49571 1174085 1207241 1241711 1277372 1313909 1351038 1388556 1426229 1463768 1501055 1538351 1575955
49560 1575955 1613486 1649782 1683850 1715777 1746305 1775575 1802800 1827231 1848877 1868003 1884436
49549 1884436 1897819 1908196 1915777 1920331 1921459 1919495 1915567 1910574 1904511 1896961 1887936 1877983 1867732
49536 1867732 1857586 1847733 1838269 1829373 1821401 1814704 1809372 1805484 1803595 1804577 1808718 1815237 1823057 1831872
49522 1831872 1842257 1854824 1869631 1886325 1904484 1923699 1943583 1963934 1984845 2006431 2028344
49511 2028344 2049638 2069282 2086828 2102328 2115479 2125097 2129874 2129589 2125160 2117438 2106430 2091766
49499 2091766 2073374 2051288 2025311 1995506 1962826 1928495 1892730 1854718 1814078 1771804 1729377
49488 1729377 1687300 1645032 1602244 1559633 1518332 1478820 1440647 1403126 1366076 1329898 1295126
49477 1295126 1262030 1230579 1200556 1171749 1144179 1118180 1094109 1071833 1050648 1029839 1009340
49466 1009340 989751 971790 955747 941341 927914 914844 901957 889647 878520 868863 860498 853011
49454 853011 846070 839546 833466 827863 822616 817521 812625 808380 805231 803052 801227 799342 797549 796116
49440 796116 794903 793647 792658 792769 794404 797104 800268 804074 809193 815726 822978 830446 838508 847837 858564
49425 858564 870386 883252 897453 913119 929932 947030 962796 975023 982123 984405 983908 982972 983272
49412 983272 985853 991136 998575 1007050 1016089 1026268 1038165 1051499 1065690 1080651 1096421 1112464
49400 1112464 1128094 1143374 1158983 1175204 1191565 1207406 1222404 1236631 1250493 1264497 1278679
49389 1278679 1292386 1305004 1316756 1328358 1340108 1351803 1363327 1374637 1385356 1395188 1404876 1415940
49377 1415940 1429035 1443110 1456642 1469297 1481949 1495417 1509711 1524479 1539683 1555657 1572688
49366 1572688 1590754 1609649 1629182 1649095 1668963 1688591 1708629 1730358 1754487 1780474 1807319
49355 1807319 1834696 1862852 1891799 1921330 1951700 1983481 2016685 2050713 2085318 2121020 2158431
49344 2158431 2197739 2239041 2282572 2328249 2375483 2423854 2473639 2525381 2579234 2634882 2691776
49333 2691776 2749232 2806748 2864426 2922656 2981168 3038864 3094869 3149232 3202219 3253422 3302052
49322 3302052 3347719 3390344 3429571 3464787 3495621 3522045 3544121 3562021 3576090 3586485 3592892
49311 3592892 3594955 3592901 3587452 3579273 3568820 3556577 3543083 3528798 3514157 3499545 3485026 3470357
49299 3470357 3455565 3441283 3428216 3416625 3406691 3399003 3394104 3391793 3391443 3392856 3396274 3401677 3408788
49286 3408788 3417717 3428974 3442652 3458120 3474675 3492031 3509918 3527672 3544537 3560160 3574594
49275 3574594 3587947 3600051 3610242 3617432 3620630 3619470 3613997 3604052 3589281 3569754 3546082 3518759
49263 3518759 3487745 3452926 3414593 3373292 3329549 3283983 3237332 3189973 3141667 3092161 3041903
49252 3041903 2991757 2942134 2892886 2844084 2796407 2750464 2706105 2662853 2620855 2580925 2543505
49241 2543505 2508080 2473878 2440728 2408708 2377247 2345365 2312949 2281113 2250944 2222351 2194636
49230 2194636 2167690 2141985 2117622 2094113 2071182 2049191 2028633 2009649 1992209 1976342 1961969
49219 1961969 1948848 1936999 1926936 1919094 1913109 1907994 1903122 1898885 1896207 1895437 1895885 1896553 1897149 1898173
49205 1898173 1900068 1902700 1905772 1909344 1913721 1919112 1925721 1933887 1943747 1954934 1966881 1979210 1991604
49192 1991604 2003694 2015543 2027961 2041764 2056916 2072904 2089656 2107406 2125851 2144314 2162746
49181 2162746 2181738 2201377 2220867 2239560 2257661 2275653 2293713 2312056 2331116 2350888 2370624
49170 2370624 2389592 2407677 2424846 2440755 2455483 2470030 2485321 2501135 2516758 2532335 2548763
49159 2548763 2566478 2585202 2604819 2625638 2647695 2670559 2694042 2718546 2744488 2771871 2800583
49148 2800583 2830577 2861534 2892803 2924068 2955712 2988165 3021023 3053088 3083269 3111384 3138219
49137 3138219 3164822 3191578 3217876 3242821 3266175 3288399 3309883 3330517 3350024 3368297 3385244
49126 3385244 3400642 3414379 3426603 3437509 3447162 3455581 3462702 3468172 3471578 3473130 3473837 3474710 3475977
49113 3475977 3477284 3478341 3479094 3479560 3479977 3481030 3483483 3487522 3492717 3498573 3504824 3511304 3518007 3525369 3534024
49098 3534024 3543991 3554352 3564032 3572757 3581082 3589652 3598706 3608213 3618100 3628210 3638217 3647804 3656955
49085 3656955 3665990 3675250 3684778 3694300 3703548 3712494 3721168 3729371 3736705 3742953 3748229 3752700 3756343 3759065
49071 3759065 3760857 3761664 3761220 3759243 3755746 3750971 3745149 3738498 3731354 3723921 3715897 3706576 3695351 3681863
49057 3681863 3665795 3646984 3625877 3603481 3580572 3557218 3533269 3508917 3484429 3459607 3433962
49046 3433962 3407291 3379779 3351727 3323566 3295992 3269545 3244108 3219278 3195225 3172674 3151873
49035 3151873 3132165 3112863 3094199 3077041 3061914 3048651 3036858 3026379 3017307 3009745 3003592 2998489
49023 2998489 2993997 2989914 2986391 2983728 2982171 2981813 2982527 2983940 2985723 2987891 2990612 2993703 2996671 2999395
49009 2999395 3002377 3006016 3009901 3013146 3015303 3016636 3017602 3018299 3018386 3017327 3014775 3010857 3006036 3000627 2994652
48994 2994652 2988245 2981861 2975773 2969660 2963139 2956588 2950935 2946576 2942914 2939030 2934485 2929356 2923866 2918199
48980 2918199 2912379 2906013 2898304 2888670 2877413 2865688 2854662 2844614 2834751 2823953 2811941 2799688
48968 2799688 2788408 2778089 2767331 2754917 2741241 2727800 2715403 2703456 2691176 2678901 2667753
48957 2667753 2658298 2650236 2643369 2638206 2635193 2633853 2633192 2632787 2633011 2634334 2636958 2641162 2647466 2656198 2667242
48942 2667242 2680350 2695366 2711977 2729671 2748185 2767702 2788235 2809222 2830136 2851330 2873796
48931 2873796 2898140 2924104 2951067 2978711 3007193 3036904 3068044 3100240 3132746 3165257 3198379
48920 3198379 3232984 3269205 3306473 3344434 3383426 3424015 3466487 3510879 3557205 3605396 3655255
48909 3655255 3706663 3759775 3814995 3872829 3933635 3997338 4063388 4131224 4200754 4272171 4345449
48898 4345449 4420168 4495802 4571893 4648141 4724661 4801983 4880315 4958787 5035892 5110716 5183318
48887 5183318 5253880 5322030 5387167 5448913 5506882 5560341 5608488 5650913 5687675 5719138 5745799
48876 5745799 5767943 5785302 5797395 5804247 5806346 5803780 5796058 5783033 5765353 5743541 5717171 5685631
48864 5685631 5649270 5609123 5565815 5519470 5470464 5419466 5366696 5311822 5254685 5195506 5134367
48853 5134367 5071149 5006212 4940572 4875103 4810022 4745382 4681535 4618732 4556694 4495081 4434157
48842 4434157 4374610 4316819 4260686 4206033 4152865 4101274 4051430 4003779 3959017 3917699 3879882
48831 3879882 3845193 3813228 3783844 3757049 3732724 3710677 3691071 3674514 3661508 3651942 3645456 3642107
48819 3642107 3642272 3645940 3652589 3661829 3673733 3688431 3705855 3725997 3748831 3773718 3799487 3825617
48807 3825617 3852881 3882236 3913470 3945613 3978363 4012252 4047475 4083521 4120172 4158039 4197576
48796 4197576 4238138 4278637 4318756 4358926 4399389 4439954 4480681 4522173 4564930 4608789 4653260
48785 4653260 4698228 4744040 4790958 4838659 4886310 4933129 4978937 5024134 5069046 5113258 5155719
48774 5155719 5195576 5232757 5267698 5300602 5331133 5358729 5382984 5403624 5420271 5432358 5439323
48763 5439323 5440931 5437439 5429469 5417586 5401939 5382399 5359106 5332763 5304200 5273694 5240840 5205063
48751 5205063 5166186 5124504 5080496 5034444 4986171 4935146 4881031 4824224 4765757 4706694 4647829
48740 4647829 4590017 4534292 4481392 4431358 4383931 4339183 4297447 4258823 4223226 4190895 4162348
48729 4162348 4137702 4116422 4097903 4081975 4068666 4057828 4049244 4042813 4038344 4035428 4033860 4033928 4035948
48716 4035948 4039709 4044839 4051542 4060428 4071649 4084747 4099545 4116614 4136556 4159141 4183533 4209138
48704 4209138 4235850 4263610 4292136 4321176 4350822 4381512 4413832 4448252 4484889 4523563 4564265
48693 4564265 4607502 4653863 4703220 4754582 4806936 4860058 4914327 4969896 5026290 5082801 5138987
48682 5138987 5194673 5249622 5303389 5355374 5404873 5451141 5493718 5532735 5568640 5601475 5630606
48671 5630606 5655368 5675748 5692030 5703846 5710185 5710574 5705865 5697353 5685319 5668943 5647608 5621692
48659 5621692 5591819 5557794 5518793 5474500 5425578 5372993 5317213 5258268 5196332 5131959 5065831
48648 5065831 4998486 4930251 4861289 4791666 4721509 4651111 4580806 4510720 4440727 4370657 4300499
48637 4300499 4230442 4160891 4092419 4025524 3960291 3896434 3833810 3772780 3713867 3657110 3601931
48626 3601931 3547646 3493986 3441126 3389388 3338981 3289907 3242039 3195347 3150006 3106125 3063393
48615 3063393 3021189 2979262 2938135 2898664 2861271 2825734 2791620 2758619 2726445 2694823 2663831
48604 2663831 2634180 2606796 2582086 2559744 2539282 2520487 2503252 2487283 2472340 2458703 2446985
48593 2446985 2437341 2429222 2422148 2416470 2413002 2411974 2412660 2414171 2416351 2419811 2425206 2432597 2441421 2451024
48579 2451024 2461236 2472384 2484743 2498098 2512013 2526383 2541480 2557547 2574668 2593012 2612718
48568 2612718 2633367 2653934 2673609 2692426 2710746 2728356 2744506 2758774 2771465 2783087 2793830
$$ [...]
##END NTUPLES=NMR SPECTRUM
##END=
