
##TITLE=AC1213_BRAAS12064_6528106_XEsjp4Wcx4
##JCAMPDX= 6.0         $$ Bruker NMR JCAMP-DX V2.0
##DATA TYPE= NMR SPECTRUM
##DATA CLASS= NTUPLES
##ORIGIN= BRUKER
##OWNER= Administrator
$$ 1.72 TOPSPIN		Version 2.1
$$ 2012-12-11 20:32:24.753 -0500  Administrator@X
$$ Compression mode = diff/dup
##.OBSERVE FREQUENCY= 400.02188249412
##.OBSERVE NUCLEUS= ^1H
##.ACQUISITION MODE= SIMULTANEOUS (DQD)
##.ACQUISITION SCHEME= undefined
##.AVERAGES= 64
##.DIGITISER RES= 22
##SPECTROMETER/DATA SYSTEM= spect
##.PULSE SEQUENCE= noesygpps1d.comp
##.SOLVENT NAME= COFFEE_meoh
##.SHIFT REFERENCE= INTERNAL, COFFEE_meoh, 1, 14.96061
##AUDIT TRAIL= $$ (NUMBER, WHEN, WHO, WHERE, PROCESS, VERSION, WHAT)
$$ ##TITLE= Audit trail, TOPSPIN		Version 2.1
$$ ##JCAMPDX= 5.01
$$ ##ORIGIN= Bruker BioSpin GmbH
$$ ##OWNER= Administrator
$$ $$ E:\/data/COFFEE/nmr/AC1213_BRAAS12064_6528106_XEsjp4Wcx4/22/pdata/1/auditp.txt
$$ ##AUDIT TRAIL=  $$ (NUMBER, WHEN, WHO, WHERE, PROCESS, VERSION, WHAT)
(   1,<2012-12-11 20:32:18.550 -0500>,<Administrator>,<X>,<go>,<TOPSPIN 2.1>,
      <created by zg
	started at 2012-12-11 20:20:48.377 -0500,
	POWCHK enabled, PULCHK disabled,
       configuration hash MD5:
       86 BA 57 50 F2 9D 5C 9B 26 00 A9 28 5F 66 2E 89
       data hash MD5: 64K
       29 EF E2 60 40 D9 CA 61 15 03 60 EC 6D 56 A8 6D>)
(   2,<2012-12-11 20:32:21.753 -0500>,<Administrator>,<X>,<proc1d>,<TOPSPIN 2.1>,
      <Start of raw data processing
       efp LB = 0.3 FT_mod = 6 PKNL = 1 PHC0 = 0 PHC1 = 0 SI = 128K 
       data hash MD5: 128K
       FF 87 33 B3 70 12 BD 60 9A 48 BB 0F FB E0 54 CD>)
(   3,<2012-12-11 20:32:22.910 -0500>,<Administrator>,<X>,<proc1d>,<TOPSPIN 2.1>,
      <pk PHC0 = -81.75476 PHC1 = 0 
       data hash MD5: 128K
       AC AA 61 DF F7 53 0C 6A 77 94 D6 EC FF FE 2A 5D>)
(   4,<2012-12-11 20:32:23.738 -0500>,<Administrator>,<X>,<proc1d>,<TOPSPIN 2.1>,
      <abs ABSG = 1 
       data hash MD5: 128K
       D2 92 CE 3F 31 FB 48 71 E6 13 FE 47 3B B3 17 5C>)
(   5,<2012-12-11 20:32:23.910 -0500>,<Administrator>,<X>,<proc1d>,<TOPSPIN 2.1>,
      <abs ABSG = 2 
       data hash MD5: 128K
       A4 0E 69 C2 60 AD 5D 91 41 0E DB 2D A2 81 C4 58>)
(   6,<2012-12-11 20:32:24.066 -0500>,<Administrator>,<X>,<proc1d>,<TOPSPIN 2.1>,
      <abs ABSG = 3 
       data hash MD5: 128K
       3B 19 DB C6 20 C2 37 4A 16 41 7C E1 93 8B 3B 52>)
(   7,<2012-12-11 20:32:24.253 -0500>,<Administrator>,<X>,<proc1d>,<TOPSPIN 2.1>,
      <abs ABSG = 4 
       data hash MD5: 128K
       55 33 81 CA 96 96 33 CF D6 9E 52 ED DB 48 C8 27>)
(   8,<2012-12-11 20:32:24.425 -0500>,<Administrator>,<X>,<proc1d>,<TOPSPIN 2.1>,
      <abs ABSG = 5 
       data hash MD5: 128K
       43 42 66 58 33 2D 20 20 DD 3B B7 B0 68 8C 57 3F>)
$$ ##END=
$$ 
$$ $$ hash MD5
$$ $$ 57 7F A7 48 48 96 FF B3 C4 89 D0 B1 D6 2D B5 E0
##$RELAX= 
##$RELAX= 
##$RELAX= 
##$RELAX= 
##$RELAX= 
##$RELAX= 
##$RELAX= 
##$RELAX= 
##$RELAX= 
$$ Bruker specific parameters
$$ --------------------------
##$DU= <E:\>
##$EXPNO= 22
$$ [...]
##$TP07= 0
##$TPNAME0= <>
##$TPNAME1= <>
##$TPNAME2= <>
##$TPNAME3= <>
##$TPNAME4= <>
##$TPNAME5= <>
##$TPNAME6= <>
##$TPNAME7= <>
##$TPOAL= (0..7)
0.5 0.5 0.5 0.5 0.5 0.5 0.5 0.5
##$TPOFFS= (0..7)
0 0 0 0 0 0 0 0
##$TUNHIN= 0
##$TUNHOUT= 0
##$TUNXOUT= 0
##$USERA1= <user>
##$USERA2= <user>
##$USERA3= <user>
##$USERA4= <user>
##$USERA5= <user>
##$V9= 5
##$VALIST= <valist>
##$VCLIST= <CCCCCCCCCCCCCCC>
##$VD= 0
##$VDLIST= <DDDDDDDDDDDDDDD>
##$VPLIST= <PPPPPPPPPPPPPPP>
##$VTLIST= <TTTTTTTTTTTTTTT>
##$WBST= 2048
##$WBSW= 25
##$XGAIN= (0..3)
0 0 0 0
##$XL= 0
##$YL= 0
##$YMAX_a= 9409685
##$YMIN_a= -17240223
##$ZGOPTNS= <>
##$ZL1= 120
##$ZL2= 120
##$ZL3= 120
##$ZL4= 120
##$ABSF1= 14.96061
##$ABSF2= -5.597571
##$ABSG= 5
##$ABSL= 3
##$ALPHA= 0
##$AQORDER= 0
##$ASSFAC= 0
##$ASSFACI= 0
##$ASSFACX= 0
##$ASSWID= 0
##$AUNMP= <proc_prof1d_extract.lims>
##$AXLEFT= 0
##$AXNAME= <>
##$AXNUC= <1H>
##$AXRIGHT= 0
##$AXTYPE= 0
##$AXUNIT= <>
##$AZFE= 0.1
##$AZFW= 0.1
##$BCFW= 0
##$BC_mod= 0
##$BYTORDP= 0
##$COROFFS= 0
##$CY= 15
##$DATMOD= 1
##$DC= 0
##$DFILT= <>
##$DTYPP= 0
##$F1P= 0
##$F2P= 0
##$FCOR= 0.5
##$FTSIZE= 131072
##$FT_mod= 6
##$GAMMA= 0
##$GB= 0
##$INTBC= 1
##$INTSCL= 1
##$ISEN= 128
##$LB= 0.3
##$LEV0= 0
##$LPBIN= 0
##$MAXI= 10000
##$MC2= 0
##$MEAN= 0
##$ME_mod= 0
##$MI= 0
##$NCOEF= 0
##$NC_proc= -2
##$NLEV= 6
##$NOISF1= 0
##$NOISF2= 0
##$NSP= 0
##$NTH_PI= 0
##$NZP= 0
##$OFFSET= 14.96061
##$PC= 1
##$PHC0= -81.75476
##$PHC1= 0
##$PH_mod= 1
##$PKNL= yes
##$PPARMOD= 0
##$PPDIAG= 0
##$PPIPTYP= 0
##$PPMPNUM= 2147483647
##$PPRESOL= 1
##$PSCAL= 4
##$PSIGN= 0
##$PYNMP= <proc.py>
##$REVERSE= no
##$SF= 400.020009791137
##$SI= 131072
##$SIGF1= 0
##$SIGF2= 0
##$SINO= 400
##$SIOLD= 131072
##$SPECTYP= <>
##$SREGLST= <1H.CDCl3>
##$SSB= 0
##$STSI= 131072
##$STSR= 0
##$SW_p= 8223.68421052631
##$SYMM= 0
##$S_DEV= 0
##$TDeff= 65536
##$TDoff= 0
##$TI= <>
##$TILT= no
##$TM1= 0
##$TM2= 0
##$TOPLEV= 0
##$USERP1= <user>
##$USERP2= <user>
##$USERP3= <user>
##$USERP4= <user>
##$USERP5= <user>
##$WDW= 1
##$XDIM= 131072
##$YMAX_p= 335178419
##$YMIN_p= -13435
##$CURPLOT= <Network HP LaserJet P1505>
##$CURPRIN= <$Network HP LaserJet P1505>
##$DFORMAT= <normdp>
##$LAYOUT= <+/1D_H.xwp>
##$LFORMAT= <normlp>
##$PFORMAT= <normpl>
##$SURQMSG= 1
$$ End of Bruker specific parameters
$$ ---------------------------------
##NTUPLES= NMR SPECTRUM
##VAR_NAME=  FREQUENCY,     SPECTRUM/REAL,   SPECTRUM/IMAG
##SYMBOL=    X,             R,               I
##VAR_TYPE=  INDEPENDENT,   DEPENDENT,       DEPENDENT
##VAR_FORM=  AFFN,          ASDF,            ASDF
##VAR_DIM=   131072,        131072,          131072
##UNITS=     HZ,            ARBITRARY UNITS, ARBITRARY UNITS
##FACTOR=    0.0627417313425164, 1,          1
##FIRST=     8223.62146879497, 3942,         -67204
##LAST=      0,             4144,            -66940
##MIN=       0,             -13435,          0
##MAX=       8223.62146879497, 335178419,    0
$$ Real data points
##PAGE= N=1
##DATA TABLE= (X++(R..R)), XYDATA
$$ [...]
$$ plain form
63866 840318 858181 877122 896503 916317 936632 957063 977085 996376 1014485 1030535 1043623
63855 1043623 1053313 1059543 1062472 1062620 1060670 1056713 1050030 1039927 1026384 1009595 989488 966269 940969
63842 940969 914746 887905 860187 831746 803121 774462 745518 716427 687913 660619 634704
63831 634704 610094 586657 564146 542416 521791 502834 485750 470317 456259 443296 430949
63820 430949 418886 407405 397119 388068 379604 371194 362932 355168 348080 341719 336146 331414 327577
63807 327577 324716 322658 320750 318267 315040 311429 307832 304591 302126 300573 299325 297525 295074 292610
63793 292610 290460 288224 285565 282806 280399 278247 275905 273143 270040 266810 263801 261413 259774 258557
63779 258557 257299 255823 254357 253361 253122 253285 252966 251689 250099 249224 249124 248903 248110 247429 247704 248894 250355
$$ packed form
63866H40318J7863J8941J9381J9814K0315K0431K0022J9291J8109J6050J3088
63855A043623R690O230K929J48j950l957o683j0103j3543j6789k0107k3219k5300
63842I40969k6223k6841k7718k8441k8625k8659k8944k9091k8514k7294k5915
63831F34704k4610k3437k2511k1730k0625j8957j7084j5433j4058j2963j2347
63820D30949j2063j1481j0286r051q464q410q262p764p088o361n573m732l837
63807C27577k861k058j908k483l227l611l597l241k465j553j248j800k451k464
63793B92610k150k236k659k759k407k152k342k762l103l230l009k388j639j217
63779B58557j258j476j466r96k39J63l19j277j590q75j00k21p93o81K75J190J461
$$ plain form
63762 250355 251651 252600 252947 252594 252005 251907 252563 253555 254220 254193 253676 253296 253555 254305 254954 255238 255511 256170 257142
63743 257142 258131 259080 260120 261248 262308 263181 263858 264488 265408 266956 269179 271874 274832 277810 280400 282395
63727 282395 284335 287147 291066 295340 299181 302560 305846 309123 312205 314966 317382 319580 322082 325544
63713 325544 329847 333827 336300 337104 336802 335715 333797 331245 328724 326903 325980 325603 325138 324198 323027 322184
63697 322184 321820 321661 321698 322347 323665 325035 326057 327238 329280 332132 335233 338278 341140 343494 345159
63682 345159 346574 348221 349809 350669 350762 350623 350488 350213 349942 350117 350811 351686 352592 353579 354398 354789 355320 357064
63664 357064 360121 363107 364538 364233 363099 362012 361225 360444 359107 356806 353646 350056 346298 342500 339071
63649 339071 336484 334605 332819 330926 329269 327852 326107 323904 322085 321495 322026 323078 324398 325960 327610
$$ packed form
63762B50355J296R49L47l53n89r8O56R92O65k7n17l80K59P50O49K84K73O59R72
63743B57142R89R49J040J128J060Q73O77O30R20J548K223K695K958K978K590J995
63727B82395J940K812L919M274L841L379L286L277L082K761K416K198K502L462
63713C25544M303L980K473Q04l02j087j918k552k521j821r23l77m65r40j171q43
63697C22184l64j59L7O49J318J370J022J181K042K852L101L045K862K354J665
63682C45159J415J647J588Q60R3j39j35k75k71J75O94Q75R06R87Q19L91N31J744
63664C57064L057K986J431l05j134j087p87p81j337k301l160l590l758l798l429
63649C39071k587j879j786j893j657j417j745k203j819n90N31J052J320J562J650
$$ plain form
63634 327610 329476 332274 336501 341658 346895 352056 357375 362619 367453 372443 378656 386283 394625 403505
63620 403505 413574 424876 436278 447009 457906 470309 484356 499344 515246 532730 551791
63609 551791 571548 591658 613025 636672 662509 689609 717027 743776 768515 790040 807907
63598 807907 822054 832106 837760 839749 839556 837959 834519 828841 821645 813993 805856 796135 783971 769483
63584 769483 753281 735863 717643 699134 680762 662684 644962 627769 611319 595745 581205
63573 581205 567989 556416 546706 539009 533469 530113 528724 528894 530215 532472 535723 540201 546054 553123
63559 553123 560991 569221 577563 586031 594870 604423 614924 626469 639227 653566 669809 688019 708260
63546 708260 731062 757283 787302 820368 854676 887882 917586 941746 959142 969641 973999 973389
$$ packed form
63634C27610J866K798M227N157N237N161N319N244M834M990O213P627Q342Q880
63620D03505J0069J1302J1402J0731J0897J2403J4047J4988J5902J7484J9061
63609E51791J9757K0110K1367K3647K5837K7100K7418K6749K4739K1525J7867
63598H07907J4147J0052N654J989j93j597l440n678p196p652q137r721j2164j4488
63584G69483j6202j7418j8220j8509j8372j8078j7722j7193j6450j5574j4540
63573E81205j3216j1573r710p697n540l356j389J70J321K257L251M478N853P069
63559E53123P868Q230Q342Q468Q839R553J0501J1545J2758J4339J6243J8210K0241
63546G08260K2802K6221L0019L3066L4308L3206K9704K4160J7396J0499M358o10
$$ plain form
63534 973389 969041 962164 953922 945269 936670 928021 918890 908863 897571 884507 869061 850905 830191
63521 830191 807270 782395 755906 728523 701152 674375 648324 623077 599021 576787 556845
63510 556845 539116 522892 507299 492028 477572 464702 453836 444939 437676 431376 425159 418591
63498 418591 412178 406811 402746 399444 396330 393331 390703 388727 387593 387175 386906 386242 385325 384823 385089 385924
63482 385924 387167 388953 391212 393420 395153 396541 397989 399786 402166 405242 408581 411248 412619 412850
63468 412850 412352 411278 409803 408293 406664 404127 400259 395974 392648 390529 388832 387279 386582 387162 388215
63453 388215 388590 388188 388081 389461 392707 397209 401886 406029 409820 413963 418878 424519 430945 438554 447581
63438 447581 457810 469111 481929 496952 514557 534902 558212 584320 611911 638756 662997
$$ packed form
63534I73389m348o877q242q653q599q649r131j0027j1292j3064j5446j8156k0714
63521H30191k2921k4875k6489k7383k7371k6777k6051k5247k4056k2234j9942
63510E56845j7729j6224j5593j5271j4456j2870j0866q897p263o300o217o568
63498D18591o413n367m065l302l114k999k628j976j134m18k69o64r17n02K66Q35
63482C85924J243J786K259K208J733J388J448J797K380L076L339K667J371K31
63468D12850m98j074j475j510j629k537l868m285l326k119j697j553o97N80J053
63453C88215L75m02j07J380L246M502M677M143L791M143M915N641O426P609R027
63438D47581J0229J1301J2818J5023J7605K0345K3310K6108K7591K6845K4241
$$ plain form
63427 662997 684051 702294 718226 732170 744500 755747 766432 777024 788149 800781 816074
63416 816074 834951 857711 883890 912443 942126 971686 999691 1024397 1044144 1058112 1066611 1070549
63404 1070549 1070765 1067935 1062799 1056057 1048018 1038576 1027536 1014754 1000009 983035 963711 942044 918021
63391 918021 891828 864231 836326 808777 781678 755253 730204 707037 685482 665045 645868
63380 645868 628626 613735 601120 590623 582184 575656 570857 567880 567013 568344 571737 577168 584714
63367 584714 594107 604566 615279 625970 637076 649503 664080 680957 699625 719728 741699 766233
63355 766233 793356 822432 852947 884558 916303 946411 973287 996243 1015052 1029279 1038489 1042786
63343 1042786 1042716 1038905 1032153 1023638 1014474 1005013 994820 983230 969675 953683 934995 913767 890460
$$ packed form
63427F62997K1054J8243J5932J3944J2330J1247J0685J0592J1125J2632J5293
63416H16074J8877K2760K6179K8553K9683K9560K8005K4706J9747J3968Q499L938
63404A070549K16k830n136o742q039r442j1040j2782j4745j6974j9324k1667k4023
63391I18021k6193k7597k7905k7549k7099k6425k5049k3167k1555k0437j9177
63380F45868j7242j4891j2615j0497q439o528m799k977q67J331L393N431P546
63367E84714R393J0459J0713J0691J1106J2427J4577J6877J8668K0103K1971K4534
63355G66233K7123K9076L0515L1611L1745L0108K6876K2956J8809J4227R210M297
63343A042786p0l811o752q515r164r461j0193j1590j3555j5992j8688k1228k3307
$$ plain form
63330 890460 865565 839636 813434 787710 762804 738687 715382 693156 672460 654023 639020
63319 639020 628611 622928 620519 618882 615553 608964 598815 586003 571994 557886 543958 530092
63307 530092 516426 503348 490994 479140 467683 456974 447468 439238 432055 425833 420660 416381 412451
63294 412451 408420 404351 400591 397247 394166 391316 388872 386844 384877 382582 379916 377116 374353 371671
63280 371671 369226 367363 366302 365829 365537 365415 365978 367585 369707 371221 371459 370708 369636 368651 367961 367800
63264 367800 368157 368638 369093 370088 372148 374729 376646 377611 378627 380713 383857 387530 391576 396140 401146
63249 401146 406323 411531 416694 421688 426618 431933 437932 444521 451722 460034 469783 480430 491135 501869
63235 501869 513472 526701 541678 558130 575653 593681 611641 629177 645990 661645 676001
$$ packed form
63330H90460k4895k5929k6202k5724k4906k4117k3305k2226k0696j8437j5003
63319F39020j0409n683k409j637l329o589j0149j2812j4009j4108j3928j3866
63307E30092j3666j3078j2354j1854j1457j0709r506q230p183o222n173m279l930
63294D12451m031m069l760l344l081k850k444k028j967k295k666k800k763k682
63280C71671k445j863j061m73k92j22N63J607K122J514K38p51j072r85o90j61
63264C67800L57M81M55R95K060K581J917R65J016K086L144L673M046M564N006
63249D01146N177N208N163M994M930N315N999O589P201Q312R749J0647J0705J0734
63235E01869J1603J3229J4977J6452J7523J8028J7960J7536J6813J5655J4356
$$ plain form
63224 676001 689749 704032 719530 736239 753905 772130 790211 807617 824681 842095 859609
63213 859609 875924 890079 902228 912699 921010 926346 928436 927325 922709 914270 902556 888946 874666
63200 874666 860165 845422 830574 816224 803266 792262 783002 775034 768691 765063 764701 767006 771399
63187 771399 778432 788915 802383 817463 833663 851814 872575 895334 918930 942790 966983 991705
63175 991705 1017094 1043093 1069160 1094501 1118959 1143209 1167631 1191243 1212196 1229174 1241971
63164 1241971 1250909 1256045 1256813 1252126 1240984 1223256 1199792 1171663 1139634 1104509 1067474 1029516
63152 1029516 990873 951724 913199 876919 843545 812473 783118 755763 730883 708345 687740
63141 687740 669004 652213 637225 624062 613212 604829 597846 590736 583210 576395 571205 567288 563958
$$ packed form
63224F76001J3748J4283J5498J6709J7666J8225J8081J7406J7064J7414J7514
63213H59609J6315J4155J2149J0471Q311N336K090j111m616q439j1714j3610j4280
63200H74666j4501j4743j4848j4350j2958j1004r260p968o343l628l62K305M393
63187G71399P033J0483J3468J5080J6200J8151K0761K2759K3596K3860K4193K4722
63175I91705K5389K5999K6067K5341K4458K4250K4422K3612K0953J6978J2797
63164A241971Q938N136P68m687j1142j7728k3464k8129l2029l5125l7035l7958
63152A029516l8643l9149l8525l6280l3374l1072k9355k7355k4880k2538k0605
63141F87740j8736j6791j4988j3163j0850q383o983p110p526o815n190l917l330
$$ plain form
63128 563958 561427 560427 561005 562460 564291 566456 568685 570336 571313 572537 574969 578442 581973 585054 588082
63113 588082 591531 595242 598704 601685 604279 606631 608914 611396 614208 617100 619690 621935 624090 626199
63099 626199 627877 628679 628504 627641 626599 625915 625784 625777 625302 624546 624584 626108 628333 629766 630020 630208 631417 633481
63081 633481 635642 637793 640377 643460 646764 650515 655283 660798 665818 669731 673643 679177 686596 694908
63067 694908 703530 712936 723640 735445 748032 761580 776300 791916 808145 825397 844466 865793
63055 865793 889443 915527 944063 974607 1006623 1040161 1075598 1112770 1151007 1190121 1230637
63044 1230637 1272730 1315523 1357900 1399626 1441241 1483212 1525642 1568562 1611983 1655694 1699307
63033 1699307 1742408 1784444 1824660 1862334 1896789 1926898 1951114 1968501 1979339 1983995 1981541 1970432
$$ packed form
63128E63958k531j000N78J455J831K165K229J651R77J224K432L473L531L081L028
63113E88082L449L711L462K981K594K352K283K482K812K892K590K245K155K109
63099F26199J678Q02j75q63j042o84j31pm75p56L8J524K225J433K54J88J209K064
63081F33481K161K151K584L083L304L751M768N515N020L913L912N534P419Q312
63067F94908Q622R406J0704J1805J2587J3548J4720J5616J6229J7252J9069K1327
63055H65793K3650K6084K8536L0544L2016L3538L5437L7172L8237L9114M0516
63044A230637M2093M2793M2377M1726M1615M1971M2430M2920M3421M3711M3613
63033A699307M3101M2036M0216L7674L4455L0109K4216J7387J0838M656k454j1109
$$ plain form
63021 1970432 1950567 1923756 1891990 1856176 1816910 1775589 1734000 1693351 1654396 1618128 1585669
63010 1585669 1557698 1534629 1517189 1506277 1502253 1504742 1513020 1526300 1543991 1566186 1593610 1626493
62998 1626493 1663677 1703493 1745311 1789399 1835329 1881537 1926853 1971628 2016805 2062471 2107835
62987 2107835 2152078 2194533 2234250 2269952 2300381 2324306 2340417 2347638 2345414 2333347 2310781 2277278
62975 2277278 2233433 2180767 2120787 2054536 1983069 1907924 1830922 1753743 1677721 1603822 1532714
62964 1532714 1465061 1401706 1343315 1289796 1240350 1194182 1150948 1110555 1072903 1037991 1005925
62953 1005925 976516 949093 923000 898191 875045 853591 833185 813077 793169 774077 756439
62942 756439 740238 724834 709621 694547 680017 666417 653852 642279 631656 621910 612876 604355
$$ packed form
63021A970432j9865k6811l1766l5814l9266m1321m1589m0649l8955l6268l2459
63010A585669k7971k3069j7440j0912m024K489Q278J3280J7691K2195K7424L2883
62998A626493L7184L9816M1818M4088M5930M6208M5316M4775M5177M5666M5364
62987B107835M4243M2455L9717L5702L0429K3925J6111P221k224j2067k2566l3503
62975B277278m3845n2666n9980o6251p1467p5145p7002p7179p6022p3899p1108
62964A532714o7653o3355n8391n3519m9446m6168m3234m0393l7652l4912l2066
62953A005925k9409k7423k6093k4809k3146k1454k0406k0108j9908j9092j7638
62942G56439j6201j5404j5213j5074j4530j3600j2565j1573j0623r746r034q521
$$ plain form
62930 604355 596281 588784 582130 576553 572143 568820 566327 564177 561773 558915 556192 554502 554003 553806 552940
62915 552940 551284 549201 546570 542827 537925 532652 527805 523489 519472 515821 512879 510794 509365 508183
62901 508183 506817 505038 503085 501501 500548 499949 499369 498875 498678 498648 498443 498002 497561 497275 497100 497045 497230 497677
62883 497677 498292 499037 499887 500599 500892 500925 501325 502524 504243 505884 507310 508931 510980 512904 513763 513269 512277
62866 512277 512061 513077 514511 515082 514191 512311 510479 509563 509855 511115 512903 514928 517100 519304 521350
62851 521350 523258 525435 528292 531709 535085 537915 540147 541908 543117 543517 543080 542285 541947 542636 544188
62836 544188 545777 546572 546410 545833 545519 545715 546139 546363 546295 546253 546611 547513 549069 551584 555124 558877 561516
62819 561516 562570 563010 564094 565954 567804 569214 570513 572083 573995 576430 579716 583687 587600 591085
$$ packed form
62930F04355q074p497o654n577m410l323k493k150k404k858k723j690m99j97q66
62915E52940j656k083k631l743m902n273m847m316m017l651k942k085j429j182
62901E08183j366j779j953j584r53n99n80m94j97l0k05m41m41k86j75n5J85M47
62883D97677O15P45Q50P12K93L3M00J199J719J641J426J621K049J924Q59m94r92
62866E12277k16J016J434N71q91j880j832r16K92J260J788K025K172K204K046
62851E21350J908K177K857L417L376K830K232J761J209M00m37p95l38O89J552
62836E44188J589P95j62n77l14J96M24K24o8m2L58R02J556K515L540L753K639
62819E61516J054M40J084J860J850J410J299J570J912K435L286L971L913L485
$$ plain form
62805 591085 594653 598855 603408 607739 612036 617091 623234 630058 637230 644911 653207 661747 670250 679182
62791 679182 689412 701297 714463 728515 743697 760768 780462 803218 829319 859009 892438
62780 892438 929610 970505 1015188 1063797 1116487 1173278 1233696 1296461 1359799 1422274 1483079
62769 1483079 1541269 1595019 1642161 1681370 1712306 1734600 1747364 1749929 1742479 1725588 1699618 1665145
62757 1665145 1623642 1577079 1526892 1473788 1418454 1361925 1305182 1248932 1193971 1141375 1092039
62746 1092039 1046168 1003433 963544 926561 892653 861610 832657 805009 778756 755004 734804
62735 734804 718099 704013 691967 681960 673817 666855 660598 655323 651540 649292 648359 648824 650874 654195
62721 654195 658111 662421 667664 674354 682208 690423 698661 707600 718464 732052 748275 766637 787007
$$ packed form
62805E91085L568M202M553M331M297N055O143O824P172P681Q296Q540Q503Q932
62791F79182J0230J1885J3166J4052J5182J7071J9694K2756K6101K9690L3429
62780H92438L7172M0895M4683M8609N2690N6791O0418O2765O3338O2475O0805
62769A483079N8190N3750M7142L9209L0936K2294J2764K565p450j6891k5970l4473
62757A665145m1503m6563n0187n3104n5334n6529n6743n6250n4961n2596m9336
62746A092039m5871m2735l9889l6983l3908l1043k8953k7648k6253k3752k0200
62735G34804j6705j4086j2046j0007q143o962o257n275l783k248r33M65K050L321
62721F54195L916M310N243O690P854Q215Q238Q939J0864J3588J6223J8362K0370
$$ plain form
62708 787007 809820 835591 864506 896519 931602 969844 1011612 1057743 1109260 1166536 1228976
62697 1228976 1295871 1367335 1443959 1525671 1611445 1700057 1790444 1881070 1969559 2053377 2130556
62686 2130556 2199270 2257070 2301261 2330117 2343313 2341121 2323699 2291400 2245371 2187438 2119529
62675 2119529 2043483 1961330 1875386 1787879 1700537 1614562 1530881 1450362 1373759 1301501 1233621
62664 1233621 1170040 1110936 1056696 1007407 962557 921414 883635 849295 818345 790307 764593
62653 764593 740921 719316 699779 682191 666449 652488 640077 628681 617688 606827 596336
62642 596336 586687 578136 570595 563891 558030 553139 549352 546893 546034 546654 547822 548177 546898 544188 540840
62627 540840 537621 535165 533985 534141 535008 535721 535889 535689 535412 535256 535548 536772 539138 542318 545764 549240
$$ packed form
62708G87007K2813K5771K8915L2013L5083L8242M1768M6131N1517N7276O2440
62697A228976O6895P1464P6624Q1712Q5774Q8612R0387R0626Q8489Q3818P7179
62686B130556O8714N7800M4191K8856J3196k192j7422l2299m6029n7933o7909
62675B119529p6046q2153q5944q7507q7342q5975q3681q0519p6603p2258o7880
62664A233621o3581n9104n4240m9289m4850m1143l7779l4340l0950k8038k5714
62653G64593k3672k1605j9537j7588j5742j3961j2411j1396j0993j0861j0491
62642E96336r649q551p541o704n861m891l787k459q59O20J168L55j279k710l348
62627E40840l219k456j180J56Q67P13J68k00k77j56K92J224K366L180L446L476
$$ plain form
62611 549240 552907 557001 561555 566480 571773 577492 583510 589520 595504 602126 610310 620369 631912 644746
62597 644746 659384 676313 695173 715275 736702 760285 786517 815098 845455 876917 908191
62586 908191 937452 963507 986420 1006537 1023344 1035799 1043396 1046222 1044155 1036746 1024011 1006807
62574 1006807 986247 963112 937939 911338 883991 856476 829235 802638 777080 753052 730982
62563 730982 710853 692106 674192 657100 641156 626533 613303 601774 592252 584490 577853 572043
62551 572043 567181 563107 559256 555459 552289 550185 548705 547217 545975 545864 547150 549124 551044 552919
62537 552919 555196 558040 561202 564310 567042 569207 570977 572985 575981 580303 585798 592281 599901 609024
62523 609024 619853 632379 646707 663235 682366 704141 728366 755062 784578 817240 853097
$$ packed form
62611E49240L667M094M554M925N293N719O018O010N984O622Q184J0059J1543J2834
62597F44746J4638J6929J8860K0102K1427K3583K6232K8581L0357L1462L1274
62586I08191K9261K6055K2913K0117J6807J2455P597K826k067p409j2735j7204
62574A006807k0560k3135k5173k6601k7347k7515k7241k6597k5558k4028k2070
62563G30982k0129j8747j7914j7092j5944j4623j3230j1529r522p762o637n810
62551E72043m862m074l851l797l170k104j480j488j242j11J286J974J920J875
62537E52919K277K844L162L108K732K165J770K008K996M322N495O483P620R123
62523F09024J0829J2526J4328J6528J9131K1775K4225K6696K9516L2662L5857
$$ plain form
62512 853097 892085 934239 979546 1027659 1077883 1129319 1180900 1231395 1279494 1323845 1362951
62501 1362951 1395232 1419406 1434810 1441318 1439199 1429244 1412791 1391213 1365384 1335936 1304047 1271624
62489 1271624 1240577 1212052 1186424 1163874 1144904 1130370 1120993 1116674 1116427 1119325 1125489 1135778
62477 1135778 1150468 1168596 1188694 1209638 1230492 1249985 1266702 1279661 1288321 1292157 1290670 1283665
62465 1283665 1271060 1252457 1227454 1196530 1161187 1123055 1083184 1042276 1001052 960045 919412
62454 919412 879436 840982 805067 772172 742403 716138 693844 675196 658973 644225 631178
62443 631178 620633 612697 606557 601395 597104 594039 592387 591991 592537 593701 595226 597083 599428 602153
62429 602153 604427 605039 603376 599891 595429 590303 584345 577705 571059 564892 558976 552865 546605 540592
$$ packed form
62512H53097L8988M2154M5307M8113N0224N1436N1581N0495M8099M4351L9106
62501A362951L2281K4174J5404O508k119r955j6453k1578k5829k9448l1889l2423
62489A271624l1047k8525k5628k2550j8970j4534r377m319k47K898O164J0289
62477A135778J4690J8128K0098K0944K0854J9493J6717J2959Q660L836j487p005
62465A283665j2605j8603k5003l0924l5343l8132l9871m0908m1224m1007m0633
62454I19412l9976l8454l5915l2895k9769k6265k2294j8648j6223j4748j3047
62443F31178j0545p936o140n162m291l065j652l96N46J164J525J857K345K725
62429F02153K274O12j663l485m462n126n958o640o646o167n916o111o260o013
$$ plain form
62415 540592 534945 529484 524257 519664 515952 512937 510327 508034 506028 504158 502337 500703 499411 498415
62401 498415 497601 496964 496483 495931 495048 493853 492711 492205 492915 495065 498196 501439 504325 507125 510201 513300
62385 513300 515896 518052 520435 523551 527356 531679 536555 542003 547819 553855 560269 567279 574836 582692
62371 582692 590688 598871 607472 616852 627322 638966 651790 666041 682146 700262 720187 741871
62359 741871 765789 792664 823017 857087 894864 935948 979604 1025212 1072384 1120304 1167191
62348 1167191 1210899 1250022 1284035 1312445 1334279 1348611 1355281 1354967 1348729 1337487 1321651 1301078
62336 1301078 1275591 1245710 1212799 1178420 1143674 1109147 1075247 1042421 1011222 982266 955957
62325 955957 932104 910001 889138 869689 852010 835737 819781 803313 786481 769900 753712
$$ packed form
62415E40592n647n461n227m593l712l015k610k293k006j870j821j634j292r96
62401D98415q14o37m81n52q83j195j142n06P10K150L131L243K886K800L076L099
62385E13300K596K156K383L116L805M323M876N448N816O036O414P010P557P856
62371E82692P996Q183Q601R380J0470J1644J2824J4251J6105J8116J9925K1684
62359G41871K3918K6875L0353L4070L7777M1084M3656M5608M7172M7920M6887
62348A167191M3708L9123L4013K8410K1834J4332O670l14o238j1242j5836k0573
62336A301078k5487k9881l2911l4379l4746l4527l3900l2826l1199k8956k6309
62325I55957k3853k2103k0863j9449j7679j6273j5956j6468j6832j6581j6188
$$ plain form
62314 753712 737490 720986 704489 688321 672415 656761 642043 629291 618875 610191 602386 595018
62302 595018 587910 580862 573882 567453 562194 558313 555591 553715 552431 551531 550989 550932 551299 551727 552079 552840
62286 552840 554604 557368 560681 564303 568241 572347 576465 580914 586159 591972 597543 602542 607444 612626
62272 612626 617823 622792 627864 633460 639646 646655 655316 666268 679089 692797 707065 722510 740102
62259 740102 760786 785428 814455 847574 884267 924492 968476 1015915 1065828 1116985 1167965
62248 1167965 1216917 1261898 1301485 1334742 1360781 1379020 1389808 1394120 1392499 1384747 1370593 1349982
62236 1349982 1322724 1288770 1249134 1205876 1160739 1114393 1067336 1020884 976625 935317 896870
62225 896870 861106 827974 797311 768956 743045 719818 699252 681150 665361 651602 639320
$$ packed form
62314G53712j6222j6504j6497j6168j5906j5654j4718j2752j0416q684p805p368
62302E95018p108p048o980o429n259l881k722j876j284r00n42n7L67M28L52P61
62286E52840J764K764L313L622L938M106M118M449N245N813N571M999M902N182
62272F12626N197M969N072N596O186P009Q661J0952J2821J3708J4268J5445J7592
62259G40102K0684K4642K9027L3119L6693M0225M3984M7439M9913N1157N0980
62248A167965M8952M4981L9587L3257K6039J8239J0788M312j621p752j4154k0611
62236A349982k7258l3954l9636m3258m5137m6346m7057m6452m4259m1308l8447
62225H96870l5764l3132l0663k8355k5911k3227k0566j8102j5789j3759j2282
$$ plain form
62214 639320 628165 618389 610357 603886 598469 593970 590620 588480 587380 587279 588201 589913 592132 594998
62200 594998 598798 603290 607872 612513 617964 624834 632955 641838 651262 661084 670855 680124 688950 697770
62186 697770 706744 715542 723811 731694 739788 748543 757682 766280 773468 778958 782854 785284 786555 787501
62172 787501 789179 792160 796466 802324 810592 822272 837845 857247 880252 906719 936547 969442
62160 969442 1004558 1040360 1075122 1107647 1137345 1163607 1185478 1202055 1212946 1218223 1218180 1213231
62148 1213231 1203803 1190217 1172825 1152201 1128856 1102798 1073899 1042857 1011330 980937 952526
62137 952526 926527 903359 883078 865125 848999 834836 822902 812936 804523 797732 792673 788699
62125 788699 784863 781157 778621 778125 779640 782733 787170 792795 799340 806609 814489 822499 829654 835045
$$ packed form
62214F39320j1155r776q032o471n417m499l350k140j100j01R22J712K219K866
62200E94998L800M492M582M641N451O870Q121Q883R424R822R771R269Q826Q820
62186F97770Q974Q798Q269P883Q094Q755R139Q598P188N490L896K430J271R46
62172G87501J678K981M306N858Q268J1680J5573J9402K3005K6467K9828L2895
62160I69442L5116L5802L4762L2525K9698K6262K1871J6577J0891N277m3m949
62148A213231r428j3586j7392k0624k3345k6058k8899l1042l1527l0393k8411
62137I52526k5999k3168k0281j7953j6126j4163j1934r966q413o791n059l974
62125G88699l836l706k536m96J515L093M437N625O545P269P880Q010P155N391
$$ plain form
62111 835045 838450 840367 841664 843143 845046 846833 847693 847226 845334 841614 835581 827689 819543 812697 807521
62096 807521 803502 800192 797586 795997 795999 798136 802198 807047 811614 815992 821166 827834 835881 844833 854326
62081 854326 864128 874248 885185 897781 912607 929644 948522 968797 989891 1011127 1032112 1053113
62069 1053113 1074899 1098104 1122660 1147701 1172129 1195443 1218135 1241232 1265403 1290513 1315917
62058 1315917 1341058 1365658 1389305 1410873 1428570 1440885 1447591 1449657 1448106 1443181 1434647 1422513
62046 1422513 1407057 1388278 1365705 1338875 1307957 1273937 1238274 1202168 1165996 1129522 1092785
62035 1092785 1056586 1021927 989128 957772 927390 898023 870254 844925 822625 803133 785473
62024 785473 768797 753104 738863 726174 714689 704111 694229 684591 674760 664963 655916 647856 640294
$$ packed form
62111H35045L405J917J297J479J903J787Q60m67j892l720o033p892q146o846n176
62096H07521m019l310k606j589KK137M062M849M567M378N174O668Q047Q952R493
62081H54326R802J0120J0937J2596J4826J7037J8878K0275K1094K1236K0985K1001
62069A053113K1786K3205K4556K5041K4428K3314K2692K3097K4171K5110K5404
62058A315917K5141K4600K3647K1568J7697J2315O706K066j551m925q534j2134
62046A422513j5456j8779k2573k6830l0918l4020l5663l6106l6172l6474l6737
62035A092785l6199l4659l2799l1356l0382k9367k7769k5329k2300j9492j7660
62024G85473j6676j5693j4241j2689j1485j0578r882r638r831r797r047q060p562
$$ plain form
62011 640294 632826 625637 618974 612705 606804 601780 598169 595905 594586 594056 594305 595097 596201 597809 600255
61996 600255 603442 606945 610554 614215 617433 619247 618952 616632 612974 608848 604989 601698 598636 595133
61982 595133 590774 585529 579458 572609 565291 558129 551651 545941 540802 536106 531915 528330 525262 522352
61968 522352 519298 516410 514561 514246 514857 515331 515383 515546 516032 516279 515935 515650 516345 518140 520566 523529 527310
61951 527310 531686 535786 539084 542075 545650 550133 555254 560875 567327 575022 583916 593530 603489 614030
61937 614030 625918 639734 655261 671642 688067 704130 719628 734477 748970 763674 778556
61926 778556 792436 803829 812368 818945 824348 828282 829992 829386 827047 823473 818928 813944 809380 805773
61912 805773 803070 801134 800208 800736 803106 807717 814878 824348 835283 846874 858774 870636 881634
$$ packed form
62011F40294p468p189o663o269n901n024l611k264j319n30K49P92J104J608K446
61996F00255L187L503L609L661L218J814k95k320l658m126l859l291l062l503
61982E95133m359n245o071o849p318p162o478n710n139m696m191l585l068k910
61968E22352l054k888j849l15O11M74N2J63M86K47l44k85O95J795K426K963L781
61951E27310M376M100L298K991L575M483N121N621O452P695Q894R614R959J0541
61937F14030J1888J3816J5527J6381J6425J6063J5498J4849J4493J4704J4882
61926G78556J3880J1393Q539O577N403L934J710o06k339l574m545m984m564l607
61912H05773k703j936r26N28K370M611P161R470J0935J1591J1900J1862J0998
$$ plain form
61899 881634 890849 897858 902503 904360 902954 898337 890931 880945 868561 854593 840243 826131 812136
61886 812136 798336 785364 773520 762202 750724 739231 728344 718266 708711 699315 689619 678982
61874 678982 667241 655368 644859 636380 629431 623323 617957 613532 609978 606988 604408 602430 601518 602189
61860 602189 604703 608896 614491 621489 630021 639891 650687 662487 676147 692635 712179 734130 757547
61847 757547 781851 807076 833617 861526 889955 917301 942038 963382 981248 995778 1007029
61836 1007029 1014997 1019741 1021389 1020033 1015779 1009123 1001341 994140 988607 984647 981811 980558 982240 987773
61822 987773 996730 1007835 1019863 1031777 1042377 1050420 1055118 1056288 1053969 1048059 1038332 1024674 1007327
61809 1007327 986963 964504 940770 916295 891490 866855 842903 819886 797701 776166 755456
$$ packed form
61899H81634R215P009M645J857j406m617p406r986j2384j3968j4350j4112j3995
61886H12136j3800j2972j1844j1318j1478j1493j0887j0078r555r396r696j0637
61874F78982j1741j1873j0509q479o949o108n366m425l554k990k580j978r12O71
61860F02189K514M193N595O998Q532R870J0796J1800J3660J6488J9544K1951K3417
61847G57547K4304K5225K6541K7909K8429K7346K4737K1344J7866J4530J1251
61836A007029P968M744J648j356m254o656p782p201n533l960k836j253J682N533
61822I87773Q957J1105J2028J1914J0600Q043M698J170k319n910r727j3658j7347
61809A007327k0364k2459k3734k4475k4805k4635k3952k3017k2185k1535k0710
$$ plain form
61798 755456 736265 719348 704745 691539 678568 665379 652375 640189 629271 619948 612365 606111
61786 606111 600256 594146 587990 582447 577825 573973 570790 568407 566734 565154 562907 559791 556384 553543
61772 553543 551630 550245 548793 547213 546051 545796 546342 547138 547741 548163 548845 550319 552732 555652 558510 561274
61756 561274 564427 568216 572200 575719 578595 581176 583884 586911 590148 593152 595282 596043 595314 593257 590174
61741 590174 586485 582545 578409 574084 570010 566815 564423 562005 559220 556941 556185 556739 557508 557887 558090
61726 558090 558376 558840 559881 562035 565158 568548 572009 576022 580584 584686 587456 589243 590985 592981 594825
61711 594825 596216 597168 597601 597277 596160 594492 592488 590197 587546 584400 580715 576822 573310 570469 568093
61696 568093 566012 564394 563195 561703 559163 555626 551726 547831 543981 540426 537564 535304 533092 530670
$$ packed form
61798G55456j9191j6917j4603j3206j2971j3189j3004j2186j0918r323p583o254
61786F06111n855o110o156n543m622l852l183k383j673j580k247l116l407k841
61772E53543j913j385j452j580j162k55N46P96O03M22O82J474K413K920K858K764
61756E61274L153L789L984L519K876K581K708L027L237L004K130P61p29k057l083
61741E90174l689l940m136m325m074l195k392k418k785k279p56N54P69L79K03
61726E58090K86M64J041K154L123L390L461M013M562M102K770J787J742J996J844
61711E94825J391R52M33l24j117j668k004k291k651l146l685l893l512k841k376
61696E68093k081j618j199j492k540l537l900l895l850l555k862k260k212k422
$$ plain form
61682 530670 528327 526337 524671 523363 522586 522105 521198 519544 517755 516635 516191 515827 515285 514882 514861 515007 515002
61665 515002 514858 514839 515102 515509 515730 515517 514964 514446 514212 514103 513773 513123 512348 511661 511160 510968 511269 512103 513282
61646 513282 514649 516322 518550 521293 524030 526112 527402 528545 530467 533495 536986 539877 541524 541977
61632 541977 541592 540626 539185 537343 535216 533002 531023 529572 528615 527683 526205 523964 521255 518652 516602
61617 516602 515157 513995 512756 511339 509859 508366 506822 505276 503790 502052 499350 495242 490109 484791
61603 484791 479786 475102 470788 467055 463736 460054 455339 449812 444411 439888 436270 433062 429748 426187
61589 426187 422747 420081 418599 418075 417816 417133 415656 413424 410924 408829 407353 405903 403742 401029 398794
61574 398794 397775 397588 397283 396409 395174 393759 391991 389838 387829 386699 386691 387423 388412 389481 390631 391764
$$ packed form
61682E30670k343j990j666j308p77m81r07j654j789j120m44l64n42m03k1J46n
61665E15002j44j9K63M07K21k13n53n18k34j09l30o50p75o87n01j92L01Q34J179
61646E13282J367J673K228K743K737K082J290J143J922L028L491K891J647M53
61632E41977l85r66j441j842k127k214j979j451r57r32j478k241k709k603k050
61617E16602j445j162j239j417j480j493j544j546j486j738k702m108n133n318
61603D84791n005m684m314l733l319l682m715n527n401m523l618l208l314l561
61589D26187l440k666j482n24k59o83j477k232k500k095j476j450k161k713k235
61574C98794j019j87l05q74j235j415j768k153k009j130qP32R89J069J150J133
$$ plain form
61558 391764 392766 393649 394352 394465 393613 392240 391595 392617 395060 397936 400538 402637 404006 404436 404261 404257 404783
61541 404783 405443 405801 406061 406719 407836 409003 409867 410455 411080 412133 413827 415979 418151 420065 421644 422650
61525 422650 422740 422059 421311 420844 420086 418427 416292 414651 413658 412566 411024 409717 409421 410109 411385 413209
61509 413209 415588 417900 419206 419235 418578 417797 416753 414979 412493 409969 408160 407259 406868 406580 406522 407171 408555
61492 408555 409865 410129 409230 408053 407550 407877 408496 408907 409038 409055 409057 409002 408841 408675 408896 410083 412498 415575
61474 415575 418170 419577 420165 420807 421847 422943 423834 424751 425898 426935 427362 427252 427247 427848 428915 429901 430411
61457 430411 430480 430382 430195 429644 428506 427153 426384 426543 427109 427433 427637 428422 430123 432351 434589 436684 438660
61440 438660 440382 441729 442894 444252 445918 447604 448977 450120 451538 453601 456076 458445 460708 463442
$$ packed form
61558C91764J002Q83P03J13q52j373o45J022K443K876K602K099J369M30j75mN26
61541D04783O60L58K60O58J117J167Q64N88O25J053J694K152K172J914J579J006
61525D22650R0o81p48m67p58j659k135j641r93j092j542j307k96O88J276J824
61509D13209K379K312J306K9o57p81j044j774k486k524j809r01l91k88n8O49J384
61492D08555J310K64q99j177n03L27O19M11J31J7Kn5j61j66K21J187K415L077
61474D15575K595J407N88O42J040J096Q91R17J147J037M27j10nO01J067R86N10
61457D30411O9r8j87n51j138j353p69J59N66L24K04P85J701K228K238K095J976
61440D38660J722J347J165J358J666J686J373J143J418K063K475K369K263K734
$$ plain form
61426 463442 466859 470190 472505 473844 474991 476284 477391 478284 479636 481924 484752 487471 489895 491947
61412 491947 493127 493081 492393 492037 492150 492048 491447 490866 490565 489786 487628 484385 481445 479963 479962 480709 481575 482395
61394 482395 483222 483997 484467 484362 483625 482481 481295 480340 479683 479303 479321 480057 481727 484063 486374 488106 489283
61377 489283 490312 491465 492795 494436 496633 499303 501857 503725 504996 506235 507663 508787 509013 508447 507856
61362 507856 507916 508697 509904 511329 512915 514583 516312 518358 521118 524719 528954 533684 539071 545178 551589
61347 551589 557709 563458 569380 575988 583172 590276 596585 601630 605258 607744 609827 612305 615372 618465
61333 618465 620960 622981 625306 628409 631827 634619 636276 636962 637016 636582 635762 634743 633540 631903 629821
61318 629821 627954 627125 627390 627997 628435 629186 631121 634367 638220 642218 646835 652858 660318 668477 676843
$$ packed form
61426D63442L417L331K315J339J147J293J107Q93J352K288K828K719K424K052
61412D91947J180m6o88l56J13j02o01n81l01p79k158l243k940j482jP47Q66Q20
61394D82395Q27P75M70j05p37j144j186r55o57l80J8P36J670K336K311J732J177
61377D89283J029J153J330J641K197K670K554J868J271J239J428J124K26n66n91
61362E07856O0P81J207J425J586J668J729K046K760L601M235M730N387O107O411
61347E51589O120N749N922O608P184P104O309N045L628K486K083K478L067L093
61333F18465K495K021K325L103L418K792J657O86N4m34q20j019j203j637k082
61318F29821j867q29K65O07M38P51J935L246L853L998M617O023P460Q159Q366
$$ plain form
61303 676843 685748 695702 706455 717101 726997 736085 744247 750832 755255 757739 758846 758322 755088 748751
61289 748751 740648 732840 726298 720572 715075 709933 705403 701186 696835 692500 688674 685450 682521 679834
61275 679834 677688 676196 675170 674609 674840 675950 677503 679075 680799 683161 686433 690443 694616 698185 700764
61260 700764 702940 705925 710431 716213 722796 730049 737677 744859 751082 756868 762913 768802 773425 776493
61246 776493 778773 780831 782410 783204 783434 783308 782597 781186 779528 778228 777476 777102 776693 775473 772723 768833
61230 768833 765463 764143 764905 766618 768325 769873 771559 773655 776226 779141 782375 786332 791529 797804
61216 797804 804335 810628 816928 823300 828959 833154 836197 838907 841393 843135 844064 844717 845450 846224 847201
61201 847201 848851 851307 854209 857328 860886 865216 870591 877423 886051 896152 906828 917438 927878
$$ packed form
61303F76843Q905R954J0753J0646R896R088Q162O585M423K484J107n24l234o337
61289G48751q103p808o542n726n497n142m530m217m351m335l826l224k929k687
61275F79834k146j492j026n61K31J110J553J572J724K362L272M010M173L569K579
61260G00764K176K985M506N782O583P253P628P182O223N786O045N889M623L068
61246G76493K280K058J579P94K30j26p11j411j658j300p52l74m09j220k750l890
61230G68833l370j320P62J713J707J548J686K096K571K915L234L957N197O275
61216G97804O531O293O300O372N659M195L043K710K486J742R29O53P33P74R77
61201H47201J650K456K902L119L558M330N375O832Q628J0101J0676J0610J0440
$$ plain form
61188 927878 937960 947085 954771 961077 966245 970308 973333 975731 977973 980138 981877 982653 981978 979784
61174 979784 976690 973579 970719 967537 963362 958107 952130 945819 939507 933426 927452 921067 913773 905406
61160 905406 896036 885908 875553 865549 855928 846264 836624 828009 821462 816956 813593 810696 808313
61147 808313 806785 806214 806301 806336 805374 802764 798635 793734 788746 783870 778979 773970 768950 764196 760001 756521
61131 756521 753781 751794 750625 750429 751575 754625 759887 766954 774928 783127 791405 799909 809009 819462
61117 819462 832058 846810 862930 879860 897856 917264 937706 958471 979303 1000244 1021063
61106 1021063 1041471 1061697 1082125 1102388 1121444 1138649 1154154 1168137 1180168 1189620 1196279 1200280
61094 1200280 1201640 1200157 1195609 1187999 1177732 1165581 1152251 1137956 1122664 1106696 1090681 1074862
$$ packed form
61188I27878J0082R125P686O306N168M063L025K398K242K165J739P76o75k194
61174I79784l094l111k860l182m175n255n977o311o312o081n974o385p294q367
61160I05406r370j0128j0355j0004r621r664r640q615o547m506l363k897k383
61147H08313j528n71Q7L5r62k610m129m901m988m876m891n009n020m754m195l480
61131G56521k740j987j169j96J146L050N262P067P974Q199Q278Q504R100J0453
61117H19462J2596J4752J6120J6930J7996J9408K0442K0765K0832K0941K0819
61106A021063K0408K0226K0428K0263J9056J7205J5505J3983J2031R452O659M001
61094A200280J360j483m548p610j0267j2151j3330j4295j5292j5968j6015j5819
$$ plain form
61082 1074862 1058876 1042490 1026201 1010746 996265 982312 968601 955397 943171 932216 922709
61071 922709 914896 908947 904615 901191 897999 895005 892926 892617 894291 897346 900934 904629 908592 913321
61057 913321 919310 926786 935517 944932 954593 964665 975814 988536 1002678 1017737 1033542 1050442
61045 1050442 1068828 1088749 1110158 1133330 1158793 1186918 1217766 1251211 1286910 1324181 1362334
61034 1362334 1401278 1441725 1484720 1531072 1581097 1634650 1691360 1751011 1813542 1878449 1944591
61023 1944591 2011228 2079240 2150663 2226999 2308708 2396382 2491434 2595114 2707662 2829043 2959908
61012 2959908 3101449 3255353 3424796 3614918 3831687 4081461 4372925 4718838 5135170
61003 5135170 5640399 6257335 7012904 7931610 9029925 10320606 11816101 13506672 15315895
$$ packed form
61082A074862j5986j6386j6289j5455j4481j3953j3711j3204j2226j0955r507
61071I22709p813n949m332l424l192k994k079l09J674L055L588L695L963M729
61057I13321N989P476Q731R415R661J0072J1149J2722J4142J5059J5805J6900
61045A050442J8386J9921K1409K3172K5463K8125L0848L3445L5699L7271L8153
61034A362334L8944M0447M2995M6352N0025N3553N6710N9651O2531O4907O6142
61023A944591O6637O8012P1423P6336Q1709Q7674R5052J03680J12548J21381J30865
61012B959908J41541J53904J69443J90122K16769K49774K91464L45913M16332
61003E135170N05229O16936P55569R18706J098315J290681J495495J690571J809223
$$ plain form
60994 15315895 17080952 18602215 19739863 20478294 20907262 21153081 21330644 21536048 21836726
60985 21836726 22229344 22603693 22772780 22566995 21919503 20878706 19556712 18071479 16520252
60976 16520252 14976813 13492028 12094492 10797672 9610428 8541183 7594442 6767438
60968 6767438 6051505 5435265 4906339 4452357 4062286 3726869 3437732 3186922 2967761
60959 2967761 2775413 2606141 2456505 2323616 2205471 2100381 2006364 1921559 1844887 1775758
60949 1775758 1713197 1655653 1601627 1550212 1501083 1454243 1409836 1368040 1329036 1292940 1259600
60938 1259600 1228472 1198910 1170633 1143682 1117964 1093209 1069465 1047213 1026683 1007389 988786
60927 988786 971124 955137 940903 927610 914653 902497 892003 883107 874717 865998 857387 850021
$$ packed form
60994A5315895J765057J521263J137648P38431M28968K45819J77563K05404L00678
60985B1836726L92618L74349J69087k05785o47492j040797j321994j485233j551227
60976A6520252j543439j484785j397536j296820j187244j069245r46741q27004
60968F767438p15933o16240n28926m53982l90071l35417k89137k50810k19161
60959B967761j92348j69272j49636j32889j18145j05090r4017q4805p6672o9129
60949A775758o2561n7544n4026n1415m9129m6840m4407m1796l9004l6096l3340
60938A259600l1128k9562k8277k6951k5718k4755k3744k2252k0530j9294j8603
60927I88786j7662j5987j4234j3293j2957j2156j0494q896q390q719q611p366
$$ plain form
60915 850021 844369 839829 835612 831606 828174 825518 823605 822568 822679 823873 825680 827752 830176 833166
60901 833166 836751 840972 846094 852314 859467 867326 876031 885848 896618 907856 919432 931771 945233
60888 945233 959620 974401 989065 1003046 1015742 1026995 1037358 1047508 1057502 1066969 1075720 1083680
60876 1083680 1090369 1095270 1098840 1102414 1106629 1110514 1112635 1112700 1111432 1109288 1106083 1101645 1095965 1088673
60862 1088673 1079233 1068030 1056526 1045943 1036201 1026486 1016291 1005435 993635 980778 967408 954304
60850 954304 941595 928795 915623 902304 889116 876126 863434 851217 839379 827563 815680
60839 815680 804101 793129 782489 771562 759961 747801 735604 724055 713676 704528 696226 688342
60827 688342 680768 673693 667355 661826 656957 652496 648251 644114 639962 635756 631809 628711 626742 625552
$$ packed form
60915H50021n652m540m217m006l432k656j913j037J11J194J807K072K424K990
60901H33166L585M221N122O220P153P859Q705R817J0770J1238J1576J2339J3462
60888I45233J4387J4781J4664J3981J2696J1253J0363J0150R994R467Q751P960
60876A083680O689M901L570L574M215L885K121O5j268k144l205m438n680p292
60862A088673r440j1203j1504j0583r742r715j0195j0856j1800j2857j3370j3104
60850I54304j2709j2800j3172j3319j3188j2990j2692j2217j1838j1816j1883
60839H15680j1579j0972j0640j0927j1601j2160j2197j1549j0379r148q302p884
60827F88342p574p075o338n529m869m461m245m137m152m206l947l098j969j190
$$ plain form
60813 625552 624622 623856 623440 623306 623164 622981 622976 623203 623528 623953 624503 624809 624405 623587 623374 624310 625729 626516 626195
60794 626195 624976 623254 621544 620469 620121 619590 617832 615025 612500 611178 610599 609667 607859 605349 602384
60779 602384 599142 596126 594068 593148 592555 591162 588529 585028 581131 577036 573043 569768 567574 566051 564499
60764 564499 562829 561553 560938 560657 560366 560162 560287 560694 561133 561408 561411 561127 560751 560516 560340 559973 559612 559987 561630
60745 561630 564366 567713 571347 574927 577920 580034 581491 582551 583113 583128 582959 582763 581939 579866 576925 574053
60729 574053 571445 568518 565153 562127 560056 558543 556772 554463 551904 549347 546735 543883 540764 537691
60715 537691 535152 533233 531329 528840 526056 523874 522629 521740 520585 519198 517901 516821 515978 515382 514794
60700 514794 513869 512814 512363 512807 513530 513862 513864 513825 513578 512986 512688 513488 515166 516630 517327 517856 519059 521005
$$ packed form
60813F25552r30p66m16j34j42j83nK27L25M25N50L06m04q18k13R36J419P87l21
60794F26195j219j722j710j075l48n31j758k807k525j322n79r32j808k510k965
60779F02384l242l016k058r20n93j393k633l501l897m095l993l275k194j523j552
60764E64499j670j276o15k81k91k04J25M07M39K75Lk84l76k35j76l67l61L75J643
60745E61630K736L347L634L580K993K114J457J060N62J5j69j96q24k073k941k872
60729E74053k608k927l365l026k071j513j771k309k559k557k612k852l119l073
60715E37691k539j919j904k489k784k182j245q89j155j387j297j080q43n96n88
60700E14794r25j055m51M44P23L32Kl9k47n92k98Q00J678J464O97N29J203J946
$$ plain form
60682 521005 523115 524879 526258 527595 529316 531588 534203 536870 539563 542416 545460 548716 552418 556814
60668 556814 561739 566656 571037 574542 577020 578745 580473 582755 585225 587034 588048 589006 590339 591427
60654 591427 591474 590679 589990 589897 590019 589933 589874 590356 591345 592178 592282 591744 591071 590533 589926 588873 587169 584807 581946
60635 581946 578927 576106 573476 570624 567262 563682 560480 558014 556305 555282 554755 554312 553596 552708 552032
60620 552032 551660 551329 550931 550726 550968 551590 552343 553023 553529 553974 554753 556118 557587 558178 557514 556408 556069 556885
60602 556885 558248 559386 560123 560853 562051 563829 565925 568111 570482 573083 575355 576430 576215 575821 576494
60587 576494 578303 580265 581618 582502 583350 584103 584398 584291 584414 585325 586918 588682 590443 592593 595505 599031
60571 599031 602840 607122 612549 619533 627815 636885 646465 656475 666834 677466 688186 698322 706738
$$ packed form
60682E21005K110J764J379J337J721K272K615K667K693K853L044L256L702M396
60668E56814M925M917M381L505K478J725J728K282K470J809J014R58J333J088
60654E91427M7p95o89r3J22q6n9M82R89Q33J04n38o73n38o07j053j704k362k861
60635E81946l019k821k630k852l362l580l202k466j709j023n27m43p16q88o76
60620E52032l72l31l98k05K42O22P53O80N06M45P79J365J469N91o64j106l39Q16
60602E56885J363J138P37P30J198J778K096K186K371K601K272J075k15l94O73
60587E76494J809J962J353Q84Q48P53K95j07J23R11J593J764J761K150K912L526
60571E99031L809M282N427O984Q282R070R580J0010J0359J0632J0720J0136Q416
$$ plain form
60558 706738 712568 715765 716676 715395 711953 707044 701966 697723 694501 692108 690555 690010 690492 691889 694203
60543 694203 697580 702179 708148 715753 725400 737404 751592 767094 782663 797403 811143 823940
60531 823940 835246 843900 849035 850792 849998 847401 843436 838566 833410 828394 823517 818634 813833 809360
60517 809360 805329 801768 798955 797404 797320 798235 799397 800508 801969 804449 808338 813563 819759 826666 834544
60502 834544 844204 856475 871633 889507 910132 934054 961881 993722 1029105 1067256 1107250 1148021
60490 1148021 1188397 1227148 1262936 1294334 1319958 1338521 1348782 1349687 1340841 1322893 1297362 1266011
60478 1266011 1230221 1190903 1148993 1105976 1063608 1022910 983737 945764 909797 877528 849967
60467 849967 826625 806372 788509 772724 758595 745730 734076 723580 713771 704203 695120 687201
$$ packed form
60558G06738N830L197R11j281l442m909n078m243l222k393j553n45M82J397K314
60543F94203L377M599N969P605R647J2004J4188J5502J5569J4740J3740J2797
60531H23940J1306Q654N135J757p94k597l965m870n156n016m877m883m801m473
60517H09360m031l561k813j551q4R15J162J111J461K480L889N225O196O907P878
60502H34544R660J2271J5158J7874K0625K3922K7827L1841L5383L8151L9994M0771
60490A148021M0376L8751L5788L1398K5624J8563J0261R05q846j7948k5531l1351
60478A266011l5790l9318m1910m3017m2368m0698l9173l7973l5967l2269k7561
60467H49967k3342k0253j7863j5785j4129j2865j1654j0496r809r568r083p919
$$ plain form
60455 687201 680682 675152 670173 665626 661448 657420 653410 649571 646206 643539 641578 640063 638687 637493
60441 637493 636836 636725 636485 635454 633761 632017 630481 629042 627790 626927 626178 624987 623407 622119 621392 620687
60425 620687 619564 618450 618058 618467 619162 619744 620306 621248 622910 625158 627240 628350 628468 628320 628447 628709 628809
60408 628809 628756 628618 628381 628394 629388 631607 634306 636585 638268 639524 640203 640340 640908 643072 646663 650194 652557
60391 652557 654075 655756 658162 661268 664820 668385 671410 673669 675549 677618 680054 682631 685101 687404
60377 687404 689646 691987 694488 697002 699368 701722 704410 707498 710594 713227 715210 716575 717457 718242 719565
60362 719565 721785 724532 727025 728856 730287 731807 733646 735794 738284 741137 744071 746632 748887 751852
60348 751852 756781 763865 771901 779453 786049 791984 797284 801446 804121 805432 805478 804083 801379 798221 795508
$$ packed form
60455F87201o519n530m979m547m178m028m010l839l365k667j961j515j376j194
60441F37493o57j11k40j031j693j744j536j439j252q63p49j191j580j288p27p05
60425F20687j123j114l92M09O95N82N62R42J662K248K082J110J18j48J27K62J00
60408F28809n3j38k37J3R94K219K699K279J683J256O79J37N68K164L591L531K363
60391F52557J518J681K406L106L552L565L025K259J880K069K436K577K470K303
60377F87404K242K341K501K514K366K354K688L088L096K633J983J365Q82P85J323
60362G19565K220K747K493J831J431J520J839K148K490K853K934K561K255K965
60348G51852M929P084Q036P552O596N935N300M162K675J311M6j395k704l158k713
$$ plain form
60333 795508 793270 790813 787657 783964 780119 776324 772694 769373 766356 763402 760324 757183 754026 750596
60319 750596 746608 742357 738793 736802 736420 736876 737416 737987 739078 741073 743989 747836 752946 759771 768595
60304 768595 779668 793431 810111 828937 848142 866010 881770 895281 906100 913241 915787 913424
60292 913424 906481 895851 882949 869218 855361 841296 827071 813524 801699 791851 783433 775954
60280 775954 769403 763904 759458 756145 754068 752802 751257 748503 744682 740851 737979 736263 735232 734183
60266 734183 732503 729900 726579 723201 720522 718938 718228 717748 716970 715864 714696 713527 712143 710523 709075
60251 709075 708203 707822 707541 707162 706742 706266 705648 705084 705056 705706 706452 706539 706031 705951 707258 709781 712426 714457
60233 714457 716270 718683 721745 724664 726915 728888 731246 734002 736587 738585 739997 740903 741303 741395 741767
$$ packed form
60333G95508k238k457l156l693l845l795l630l321l017k954l078l141l157l430
60319G50596l988m251l564j991l82M56N40N71J091J995K916L847N110O825Q824
60304G68595J1073J3763J6680J8826J9205J7868J5760J3511J0819P141K546k363
60292I13424o943j0630j2902j3731j3857j4065j4225j3547j1825r848q418p479
60280G75954o551n499m446l313k077j266j545k754l821l831k872j716j031j049
60266G34183j680k603l321l378k679j584p10m80p78j106j168j169j384j620j448
60251G09075q72l81k81l79m20m76o18n64k8O50P46Q7n08q0J307K523K645K031
60233G14457J813K413L062K919K251J973K358K756K585J998J412R06M00R2L72
$$ plain form
60218 741767 743161 746070 750485 755834 761235 766072 770406 774730 779390 784359 789513 794838 800364 806109
60204 806109 812102 818269 824307 829975 835523 841458 847740 853515 857979 861298 864341 867648 871019 874043
60190 874043 876628 878840 880628 881911 882762 883232 883136 882274 880754 878757 876131 872607 868461 864412 860645
60175 860645 856441 851259 845808 841429 838546 836413 834326 832391 830868 829537 828115 826747 825548 824069
60161 824069 821891 819447 817646 816739 816179 815584 815237 815512 816317 817317 818334 819286 820032 820518 820931 821570 822654
60144 822654 824251 826169 827906 828993 829509 830104 831477 833982 837660 842313 847509 852821 858131 863495 868732
60129 868732 873544 878060 882663 887093 890259 891399 891118 890840 891484 893104 895543 898797 902625 906342 909284
60114 909284 911333 912858 914282 915803 917435 919200 921192 923361 925292 926409 926503 925878 924851 923373 921346
$$ packed form
60218G41767J394K909M415N349N401M837M334M324M660M969N154N325N526N745
60204H06109N993O167O038N668N548N935O282N775M464L319L043L307L371L024
60190H74043K585K212J788J283Q51M70r6q62j520j997k626l524m146m049l767
60175H60645m204n182n451m379k883k133k087j935j523j331j422j368j199j479
60161H24069k178k444j801r07n60n95l47K75Q05J000J017R52P46M86M13O39J084
60144H22654J597J918J737J087N16N95J373K505L678M653N196N312N310N364N237
60129H68732M812M516M603M430L166J140k81k78O44J620K439L254L828L717K942
60114I09284K049J525J424J521J632J765J992K169J931J117R4o25j027j478k027
$$ plain form
60099 921346 919020 916723 914420 911937 909477 907346 905274 902620 899476 896961 896000 896210 896438 896112 895571
60084 895571 895266 895235 895398 895803 896328 896553 896211 895538 894887 894170 892964 891091 888798 886418 883972 881143 877498
60067 877498 872829 867463 862146 857447 853336 849464 845694 842076 838416 834345 829822 825200 820665 816054
60053 816054 811408 807325 804434 802811 802225 802605 803852 805382 806403 806694 806790 807427 809060 811830 815591 819969
60037 819969 824674 829757 835238 840592 845101 848712 852114 855736 859108 861394 862220 861737 860189 857803 854893
60022 854893 851724 848267 844265 839488 833901 827769 821671 816197 811483 807229 803284 799965 797583 795906
60008 795906 794422 792951 791689 790670 789490 787656 785120 782422 780322 779155 778461 777398 775662 773875
59994 773875 772945 773217 774391 776075 778095 780323 782531 784514 786304 788233 790817 794374 798607 802672 805964
$$ packed form
60099I21346k326k297k303k483k460k131k072k654l144k515r61K10K28l26n41
60084H95571l05l1J63M05N25K25l42o73o51p17j206j873k293k380k446k829l645
60067H77498m669n366n317m699m111l872l770l618l660m071m523m622m535m611
60053H16054m646m083k891j623n86L80J247J530J021K91R6O37J633K770L761M378
60037H19969M705N083N481N354M509L611L402L622L372K286Q26m83j548k386k910
60022H54893l169l457m002m777n587o132o098n474m714m254l945l319k382j677
60008G95906j484j471j262j019j180j834k536k698k100j167o94j063j736j787
59994G73875r30K72J174J684K020K228K208J983J790J929K584L557M233M065L292
$$ plain form
59979 805964 808776 811939 815768 819546 822133 822950 822297 820867 819143 817241 815134 812841 810419 808060 806328
59964 806328 806050 807568 810084 812152 812955 812931 813060 813887 815377 817313 819441 821372 822759 823622 824311 825195
59948 825195 826503 828328 830581 833004 835460 838090 840998 843885 846251 847928 849195 850454 851964 853773
59934 853773 855591 856834 857106 856688 856248 856077 855902 855486 855069 855007 855312 855779 856389 857306 858544 859915 861391
59917 861391 863292 866023 869639 873764 877935 882011 886227 890899 896056 901287 905899 909363 911691 913343
59903 913343 914690 915640 915920 915583 915007 914470 913996 913575 913232 912879 912473 912384 913169 914842 916742 918414 920233
59886 920233 922854 926376 930403 934605 938779 942628 946018 949311 952953 956774 960193 963080 965934 969128
59872 969128 972378 975068 976790 977475 977254 976269 974405 971301 966890 961873 957296 953685 950870 948556 946620
$$ packed form
59979H05964K812L163L829L778K587Q17o53j430j724j902k107k293k422k359j732
59964H06328k78J518K516K068Q03k4J29Q27J490J936K128J931J387Q63O89Q84
59948H25195J308J825K253K423K456K630K908K887K366J677J267J259J510J809
59934H53773J818J243K72m18m40j71j75m16m17o2L05M67O10R17J238J371J476
59917H61391J901K731L616M125M171M076M216M672N157N231M612L464K328J652
59903I13343J347R50K80l37n76n37m74m21l43l53m06q9P85J673J900J672J819
59886I20233K621L522M027M202M174L849L390L293L642L821L419K887K854L194
59872I69128L250K690J722O85k21r85j864l104m411n017m577l611k815k314j936
$$ plain form
59857 946620 944888 943187 941719 940954 941050 941846 943515 946712 951825 958524 966273 974784 983625 991888 998770
59842 998770 1004228 1008630 1012014 1014191 1015426 1016493 1018011 1020026 1022137 1023669 1023780 1021877 1018114 1013242
59828 1013242 1007870 1002063 995742 989237 983268 978443 974786 971698 968368 964386 960021 955852 952144 948695
59814 948695 945261 941946 939110 937036 935790 935263 935118 934693 933300 930884 928282 926514 925812 925557 925148 924524
59798 924524 923737 922540 920840 919222 918449 918598 919203 920128 921630 923461 924632 924439 923327 922366 922217 922869
59782 922869 924043 925346 926175 925880 924187 921439 918544 916574 916051 916441 916659 916217 915563 915196 914987 914662 914468
59765 914468 914873 915926 917424 919391 921849 924331 926217 927461 928483 929512 930600 932154 934739 938239
59751 938239 941934 945553 949638 954551 959789 964765 969833 975876 982981 990064 995879 1000105 1003314 1006169
$$ packed form
59857I46620j732j701j468p65R6P96J669L197N113O699P749Q511Q841Q263O882
59842I98770N458M402L384K177J235J067J518K015K111J532J11j903l763m872
59828A013242n372n807o321o505n969m825l657l088l330l982m365m169l708l449
59814I48695l434l315k836k074j246n27j45m25j393k416k602j768p02k55m09o24
59798I24524p87j197j700j618p73J49O05R25J502J831J171j93j112r61j49O52
59782I22869J174J303Q29k95j693k748k895j970n23L90K18m42o54l67k09l25j94
59765I14468M05J053J498J967K458K482J886J244J022J029J088J554K585L500
59751I38239L695L619M085M913N238M976N068O043P105P083N815M226L209K855
$$ plain form
59737 1006169 1008844 1011147 1012955 1014295 1015085 1015170 1014833 1014944 1016160 1018093 1019694 1020441 1020680 1020869 1021143 1021750
59721 1021750 1023209 1025540 1027827 1029135 1029578 1029949 1030580 1031189 1031723 1032627 1034144 1035965 1037800 1039816 1042235
59706 1042235 1044869 1047467 1050270 1053800 1058159 1062834 1067201 1071004 1074335 1077427 1080544 1083983 1088001 1092691
59692 1092691 1097833 1102828 1106882 1109430 1110453 1110407 1109845 1109146 1108470 1107904 1107587 1107712 1108331 1109158 1109637 1109325 1108169
59675 1108169 1106369 1104095 1101406 1098338 1094906 1091106 1087124 1083414 1080278 1077409 1074209 1070630 1067349 1064891
59661 1064891 1062942 1060875 1058685 1056989 1056191 1056154 1056743 1058287 1061228 1065503 1070473 1075358 1079655 1083264 1086339
59646 1086339 1088960 1090905 1091810 1091516 1090107 1087646 1084149 1079900 1075520 1071524 1067936 1064478 1060968 1057408
59632 1057408 1053895 1050649 1048044 1046348 1045508 1045271 1045428 1045791 1046100 1046096 1045596 1044326 1041950 1038549 1034860 1031628
$$ packed form
59737A006169K675K303J808J340P90Q5l37J11J216J933J601P47K39J89K74O07
59721A021750J459K331K287J308M43L71O31O09N34R04J517J821J835K016K419
59706A042235K634K598K803L530M359M675M367L803L331L092L117L439M018M690
59692A092691N142M995M054K548J023m6n62o99o76n66l17J25O19Q27M79l12j156
59675A108169j800k274k689l068l432l800l982l710l136k869l200l579l281k458
59661A064891j949k067k190j696p98l7N89J544K941M275M970M885M297L609L075
59646A086339K621J945R05k94j409k461l497m249m380l996l588l458l510l560
59632A057408l513l246k605j696q40k37J57L63L09mn00j270k376l401l689l232
$$ plain form
59616 1031628 1028733 1025339 1020922 1015771 1010452 1005306 1000711 997383 995868 995832 996300 996692 997394 999126 1001882
59601 1001882 1004687 1006469 1007138 1007656 1009020 1011280 1013668 1015494 1016625 1017184 1017221 1016844 1016373 1016112 1016108 1016266 1016488
59584 1016488 1016540 1016067 1015011 1013836 1013021 1012528 1012020 1011410 1010765 1009859 1008308 1006174 1003971 1002027 1000295 998808
59568 998808 997772 997012 995912 994270 992791 992259 992503 992617 992037 991020 990312 990672 992460 995176 997577 998741
59552 998741 998960 999233 1000142 1001787 1004463 1008503 1013431 1018177 1022392 1026808 1032025 1037796 1043963 1051300 1060726
59537 1060726 1072306 1085669 1100710 1116838 1131950 1143352 1149882 1152391 1152254 1150312 1147315 1144309 1141959
59524 1141959 1140115 1138550 1137688 1138138 1139902 1142489 1145581 1149164 1153135 1157116 1160620 1163256 1164898 1165643 1165386
59509 1165386 1163443 1159017 1152268 1144554 1137339 1131079 1125345 1119684 1114029 1108519 1103306 1098438 1093785 1089175
$$ packed form
59616A031628k895l394m417n151n319n146m595l328j515l6M68L92P02J732K756
59601A001882K805J782O69N18J364K260K388J826J131N59L7l77m71k61mJ58K22
59584A016488N2m73j056j175q15m93n08o10o45r06j551k134k203j944j732j487
59568I98808j036p60j100j642j479n32K44J14n80j017p08L60J788K716K401J164
59552I98741K19K73R09J645K676M040M928M746M215M416N217N771O167P337R426
59537A060726J1580J3363J5041J6128J5112J1402O530K509j37j942k997l006k350
59524A141959j844j565q62M50J764K587L092L583L971L981L504K636J642P45k57
59509A165386j943m426o749p714p215o260n734n661n655n510n213m868m653m610
$$ plain form
59495 1089175 1084738 1080873 1077738 1075100 1072891 1071565 1071585 1072768 1074442 1076047 1077376 1078529 1079902 1081977
59481 1081977 1084771 1087715 1090345 1092878 1095849 1099482 1103772 1108766 1114251 1119449 1123623 1126845 1129694 1132455
59467 1132455 1135169 1138115 1141440 1144378 1145757 1145438 1144561 1144181 1144379 1144927 1146100 1148346 1151744 1156156 1161471
59452 1161471 1167366 1173391 1179801 1187694 1197672 1208719 1219060 1227862 1235413 1241872 1246650 1249106 1249249 1247621
59438 1247621 1244942 1241883 1238630 1234615 1229235 1223055 1217683 1214097 1211525 1208435 1204318 1200036 1196680 1194597
59424 1194597 1193513 1193117 1193396 1194686 1197505 1202114 1208268 1215704 1224873 1236752 1251751 1269229 1288443
59411 1288443 1309526 1332769 1356820 1378192 1393100 1399857 1399599 1395070 1388893 1382561 1376438 1370585 1365768
59398 1365768 1363596 1365190 1369525 1373356 1373217 1367630 1357458 1344474 1329902 1314275 1298088 1282122 1267164
$$ packed form
59495A089175m437l865l135k638k209j326K0J183J674J605J329J153J373K075
59481A081977K794K944K630K533K971L633M290M994N485N198M174L222K849K761
59467A132455K714K946L325K938J379l19q77l80J98N48J173K246L398M412N315
59452A161471N895O025O410P893R978J1047J0341Q802P551O459M778K456J43j628
59438A247621k679l059l253m015n380o180n372l586k572l090m117m282l356k083
59424A194597j084l96K79J290K819M609O154P436R169J1879J4999J7478J9214
59411A288443K1083K3243K4051K1372J4908O757k58m529o177o332o123n853m817
59398A365768k172J594M335L831j39n587j0172j2984j4572j5627j6187j5966j4958
$$ plain form
59385 1267164 1253721 1242064 1232282 1224166 1217288 1211453 1206954 1204082 1202521 1201563 1200996 1201371 1203215 1206324
59371 1206324 1210092 1214187 1218483 1222595 1226129 1229362 1233112 1237746 1242854 1248088 1253782 1260316 1267294 1274023
59357 1274023 1280566 1287654 1295543 1303677 1311707 1320158 1329631 1339877 1350326 1361221 1373409 1387023 1401155
59344 1401155 1415162 1429662 1445716 1463368 1481547 1499174 1515845 1531483 1545831 1558391 1568492
59333 1568492 1575412 1578836 1579314 1577919 1575264 1571111 1565063 1557241 1548091 1537857 1526666 1514971 1503481
59320 1503481 1492605 1482226 1472110 1462389 1453544 1445941 1439386 1433201 1426839 1420408 1414444 1409249 1404735
59307 1404735 1400954 1398393 1397504 1398228 1400321 1403957 1409673 1417820 1428351 1441043 1455449 1470482 1484312
59294 1484312 1494949 1501037 1502256 1499238 1493218 1485550 1477250 1468778 1460167 1451401 1442747 1434778 1428078 1422908
$$ packed form
59385A267164j3443j1657r782q116o878n835m499k872j561r58n67L75J844L109
59371A206324L768M095M296M112L534L233L750M634N108N234N694O534O978O729
59357A274023O543P088P889Q134Q030Q451R473J0246J0449J0895J2188J3614J4132
59344A401155J4007J4500J6054J7652J8179J7627J6671J5638J4348J2560J0101
59333A568492O920L424M78j395k655m153o048p822r150j0234j1191j1695j1490
59320A503481j0876j0379j0116r721q845p603o555o185o362o431n964n195m514
59307A404735l781k561q89P24K093L636N716Q147J0531J2692J4406J5033J3830
59294A484312J0637O088J219l018o020p668q300q472q611q766q654p969o700n170
$$ plain form
59280 1422908 1419139 1416338 1413879 1411262 1408641 1406954 1407100 1409008 1411813 1414960 1418719 1423625 1429929 1437733
59266 1437733 1446994 1457068 1466704 1474994 1482022 1488220 1493492 1497385 1499785 1500869 1500563 1498522 1494591 1488927
59252 1488927 1481885 1474038 1466035 1458026 1449569 1440587 1432082 1425303 1420430 1416641 1413214 1409972 1406891 1404056
59238 1404056 1401905 1400833 1400614 1400926 1402207 1405104 1409095 1412696 1415203 1417337 1419862 1422549 1424883 1426862
59224 1426862 1428441 1429001 1428215 1426911 1426301 1426533 1426579 1425327 1422334 1417880 1412862 1408432 1405258 1403191 1401908
59209 1401908 1401493 1402005 1402889 1403452 1403722 1404300 1405519 1407272 1409497 1412198 1414977 1417132 1418443 1419538 1421322
59194 1421322 1424235 1428082 1432345 1436591 1440726 1444930 1449298 1453671 1457861 1461880 1465846 1469852 1474063 1478662
59180 1478662 1483502 1488104 1492250 1496283 1500466 1504333 1507121 1508737 1509879 1511274 1513145 1515395 1517969 1520994
$$ packed form
59280A422908l769k801k459k617k621j687J46J908K805L147L759M906O304P804
59266A437733R261J0074R636Q290P028O198N272L893K400J084l06k041l931n664
59252A488927p042p847q003q009q457q982q505o779m873l789l427l242l081k835
59238A404056k151j072k19L12J281K897L991L601K507K134K525K687K334J979
59224A426862J579N60p86j304o10K32M6j252k993m454n018m430l174k067j283
59209A401908m15N12Q84N63K70N78J219J753K225K701K779K155J311J095J784
59194A421322K913L847M263M246M135M204M368M373M190M019L966M006M211M599
59180A478662M840M602M146M033M183L867K788J616J142J395J871K250K574L025
$$ plain form
59166 1520994 1524747 1529407 1534630 1539582 1543768 1547760 1552631 1558671 1565047 1570823 1575891 1580621 1584944 1588207
59152 1588207 1589924 1590307 1589839 1588516 1585874 1581861 1577355 1573500 1570701 1568533 1566494 1564387 1562035 1559186
59138 1559186 1555877 1552485 1549299 1546394 1543994 1542407 1541411 1540300 1538865 1537737 1537380 1537321 1536913 1536289 1535902 1535658
59122 1535658 1535337 1535552 1537275 1540488 1544222 1548024 1552610 1558794 1566470 1574932 1583632 1592266 1600545 1608243
59108 1608243 1615271 1621571 1627257 1632878 1639047 1645602 1651526 1656019 1659333 1662315 1665394 1668343 1670743 1672308
59094 1672308 1672866 1672395 1671177 1669703 1668322 1667040 1665729 1664507 1663753 1663610 1663596 1663010 1661722 1660164 1658395 1655708
59078 1655708 1651589 1646688 1642163 1638266 1634206 1629362 1623904 1618219 1612455 1606938 1602398 1599263 1597077 1594952
59064 1594952 1592384 1589423 1586386 1583737 1581886 1580735 1579577 1577835 1575722 1573898 1572655 1571758 1570921 1570018 1568879
$$ packed form
59166A520994L753M660N223M952M186L992M871O040O376N776N068M730M323L263
59152A588207J717L83m68j323k642m013m506l855k799k168k039k107k352k849
59138A559186l309l392l186k905k400j587r96j111j435j128l57n9m08o24l87k44
59122A535658l21K15J723L213L734L802M586O184P676Q462Q700Q634Q279P698
59108A608243P028O300N686N621O169O555N924M493L314K982L079K949K400J565
59094A672308N58m71j218j474j381j282j311j222p54j43j4n86j288j558j769k687
59078A655708m119m901m525l897m060m844n458n685n764n517m540l135k186k125
59064A594952k568k961l037k649j851j151j158j742k113j824j243q97q37r03j139
$$ plain form
59049 1568879 1567350 1565714 1564686 1564745 1565620 1566667 1567634 1568789 1570340 1572083 1573738 1575380 1577184 1578946 1580259
59034 1580259 1581170 1582235 1583828 1585825 1588189 1591384 1595785 1601054 1606608 1612450 1618926 1625859 1632639 1639231
59020 1639231 1646459 1655098 1665208 1676502 1688778 1701630 1714216 1725709 1735720 1744047 1750427 1754935
59008 1754935 1758280 1761194 1763732 1765604 1767080 1769042 1772029 1775627 1778907 1781340 1783222 1785426 1788718 1793096
58994 1793096 1797720 1801589 1804320 1806195 1807626 1808803 1809842 1810844 1811694 1812057 1811849 1811533 1811670 1812286 1812939 1813384
58978 1813384 1813826 1814488 1815333 1816411 1818167 1821080 1825208 1830424 1836855 1844692 1853685 1863363 1873602 1884451
58964 1884451 1895361 1905370 1914259 1922869 1931858 1940762 1948751 1955699 1961865 1966995 1970549 1972524 1973220 1972380
58950 1972380 1969400 1964312 1957766 1949998 1940733 1930279 1919863 1910530 1902383 1895222 1889129 1883855 1878394
$$ packed form
59049A568879j529j636j028N9Q75J047R67J155J551J743J655J642J804J762J313
59034A580259R11J065J593J997K364L195M401N269N554N842O476O933O780O592
59020A639231P228Q639J0110J1294J2276J2852J2586J1493J0011Q327O380M508
59008A754935L345K914K538J872J476J962K987L598L280K433J882K204L292M378
58994A793096M624L869K731J875J431J177J039J002Q50L63k08l16J37O16O53M45
58978A813384M42O62Q45J078J756K913M128N216O431P837Q993R678J0239J0849
58964A884451J0910J0009Q889Q610Q989Q904P989O948O166N130L554J975O96q40
58950A972380k980n088o546p768r265j0454j0416r333q147p161o093n274n461
$$ plain form
58937 1878394 1872023 1865430 1860041 1856456 1854192 1852748 1852068 1851888 1851436 1850193 1848515 1847136 1846318 1845788 1845270
58922 1845270 1844786 1844545 1844836 1845862 1847384 1848673 1849255 1849734 1851331 1854369 1857732 1860299 1862461 1865548 1869947
58907 1869947 1874689 1878979 1883276 1888503 1894950 1902524 1911404 1921674 1932709 1943651 1954320 1964978 1975492
58894 1975492 1985491 1995172 2005177 2015693 2026444 2037668 2050297 2064976 2081460 2099129 2117479 2135949
58882 2135949 2153882 2170937 2187001 2201555 2213769 2223424 2231060 2236906 2240353 2240966 2239318 2236214 2231590
58869 2231590 2224928 2216397 2206934 2197312 2187751 2178373 2169467 2161242 2153637 2146422 2139294 2131956 2124360 2116769
58855 2116769 2109349 2101846 2093953 2085885 2078314 2071776 2066321 2061618 2057176 2052533 2047482 2042244 2037398 2033612
58841 2033612 2031247 2029945 2028677 2026573 2023743 2020995 2018693 2016371 2013587 2010663 2008269 2006656 2005591 2004762
$$ packed form
58937A878394o371o593n389l585k264j444o80j80m52j243j678j379q18n30n18
58922A845270m84k41K91J026J522J289N82M79J597L038L363K567K162L087M399
58907A869947M742M290M297N227O447P574Q880J0270J1035J0942J0669J0658J0514
58894A975492R999R681J0005J0516J0751J1224J2629J4679J6484J7669J8350J8470
58882B135949J7933J7055J6064J4554J2214R655P636N846L447O13j648l104m624
58869B231590o662q531r463r622r561r378q906q225p605p215p128p338p596p591
58855B116769p420p503p893q068p571o538n455m703m442m643n051n238m846l786
58841B033612k365j302j268k104k830k748k302k322k784k924k394j613j065q29
$$ plain form
58827 2004762 2003968 2003183 2002689 2002938 2004046 2005747 2007950 2010902 2014578 2018412 2022097 2026183 2031386 2037584 2043961
58812 2043961 2049869 2055039 2059271 2062538 2065301 2068155 2071205 2074197 2077109 2080084 2082887 2084979 2086199 2086902
58798 2086902 2087398 2087718 2087912 2088079 2087961 2087042 2085322 2083577 2082555 2082183 2081851 2081237 2080601 2080433 2081174 2083144 2086411
58781 2086411 2090661 2095458 2100708 2106671 2113409 2120485 2127435 2134338 2141489 2148550 2154499 2158669 2161338 2162926
58767 2162926 2163075 2161215 2157848 2154450 2151957 2150035 2148040 2146032 2144396 2143026 2141542 2140062 2139156 2139069 2139430
58752 2139430 2139799 2140266 2141430 2143917 2147849 2152663 2157486 2161792 2165688 2169690 2174405 2180373 2187826 2196403
58738 2196403 2205363 2214241 2223128 2232242 2241486 2250560 2259291 2267650 2275596 2282974 2289549 2295198 2300226 2305262
58724 2305262 2310519 2315354 2319010 2321642 2324058 2326639 2329176 2331709 2334641 2337861 2340601 2342542 2344406 2347063
$$ packed form
58827B004762p94p85m94K49J108J701K203K952L676L834L685M086N203O198O377
58812B043961N908N170M232L267K763K854L050K992K912K975K803K092J220P03
58798B086902M96L20J94J67j18r19j720j745j022l72l32o14o36j68P41J970L267
58781B086411M250M797N250N963O738P076O950O903P151P061N949M170K669J588
58767B162926J49j860l367l398k493j922j995k008j636j370j484j480r06q7L61
58752B139430L69M67J164K487L932M814M823M306L896M002M715N968P453Q577
58738B196403Q960Q878Q887R114R244R074Q731Q359P946P378O575N649N028N036
58724B305262N257M835L656K632K416K581K537K533K932L220K740J941J864K657
$$ plain form
58710 2347063 2350666 2354974 2359780 2364587 2368521 2371139 2372890 2374323 2375327 2375544 2374948 2373515 2370845 2366627
58696 2366627 2361009 2354151 2346050 2337221 2328859 2321694 2315370 2309584 2305031 2302388 2301004 2299606 2297876 2296384
58682 2296384 2295368 2294553 2293916 2293665 2293579 2293181 2292488 2291927 2291760 2292281 2294207 2298043 2303254 2308861 2314621 2320889
58666 2320889 2327661 2334647 2342075 2350463 2359791 2369662 2379965 2390406 2399752 2406722 2411504 2415271 2418345
58653 2418345 2420071 2420439 2420414 2420453 2420088 2419360 2419359 2420695 2422563 2424023 2425247 2426794 2428569 2430344 2432531 2435546
58637 2435546 2438913 2441861 2444476 2447543 2451533 2456420 2462263 2469156 2476573 2483352 2488626 2492532 2495866 2499166
58623 2499166 2502339 2505194 2508041 2511375 2515002 2518130 2520677 2523892 2529077 2536115 2543901 2551813 2559960 2568332
58609 2568332 2576630 2584751 2592482 2598911 2603250 2606267 2609819 2614754 2620243 2625306 2629881 2634093 2637650 2640557
$$ packed form
58710B347063L603M308M806M807L934K618J751J433J004K17n96j433k670m218
58696B366627n618o858q101q829q362p165o324n786m553k643j384j398j730j492
58682B296384j016q15o37k51q6l98o93n61j67N21J926L836N211N607N760O268
58666B320889O772O986P428Q388R328R871J0303J0441R346O970M782L767L074
58653B418345J726L68k5L9l65p28jJ336J868J460J224J547J775J775K187L015
58637B435546L367K948K615L067L990M887N843O893P417O779N274L906L334L300
58623B499166L173K855K847L334L627L128K547L215N185P038P786P912Q147Q372
58609B568332Q298Q121P731O429M339L017L552M935N489N063M575M212L557K907
$$ plain form
58595 2640557 2643491 2646820 2649988 2652486 2654748 2657498 2660857 2664706 2669377 2675343 2682644 2691099 2700700 2711373
58581 2711373 2722746 2734528 2746713 2759127 2771285 2782978 2794475 2805907 2817026 2827858 2838916
58570 2838916 2850422 2862019 2873639 2885923 2899244 2913069 2926915 2941310 2957120 2974436 2992876
58559 2992876 3012582 3034097 3057449 3081895 3106433 3130125 3152186 3172156 3189880 3205138 3217742
58548 3217742 3228150 3237285 3245314 3251293 3254587 3256006 3256731 3256644 3254664 3250480 3244992 3239003 3232274 3224061
58534 3224061 3214026 3202398 3189714 3176683 3164122 3152687 3142533 3133277 3124481 3116386 3109963 3105885
58522 3105885 3103615 3102016 3100809 3100799 3102603 3105874 3109890 3114205 3118435 3122145 3125407 3128856 3132763 3136618
58508 3136618 3140002 3143223 3146636 3150041 3153340 3157157 3162010 3167306 3171958 3175731 3179256 3182911 3186425 3189571
$$ packed form
58595B640557K934L329L168K498K262K750L359L849M671N966P301Q455R601J0673
58581B711373J1373J1782J2185J2414J2158J1693J1497J1432J1119J0832J1058
58570B838916J1506J1597J1620J2284J3321J3825J3846J4395J5810J7316J8440
58559B992876J9706K1515K3352K4446K4538K3692K2061J9970J7724J5258J2604
58548C217742J0408R135Q029N979L294J419P25q7j980m184n488n989o729q213
58534C224061j0035j1628j2684j3031j2561j1435j0154r256q796q095o423m078
58522C105885k270j599j207j0J804L271M016M315M230L710L262L449L907L855
58508C136618L384L221L413L405L299L817M853N296M652L773L525L655L514L146
$$ plain form
58494 3189571 3192677 3196321 3200847 3206191 3211999 3217984 3224308 3231418 3239378 3247676 3255834 3263939 3272459 3281845
58480 3281845 3292412 3304223 3317020 3330730 3345974 3363487 3382927 3402957 3422590 3441682 3459934
58469 3459934 3476399 3490374 3501914 3510996 3517096 3520196 3521345 3521493 3520629 3518905 3517747 3518770 3522044 3526557
58455 3526557 3532001 3539096 3548287 3559165 3571240 3584504 3598994 3614246 3629313 3643060 3654541 3663361
58443 3663361 3669575 3673198 3674199 3673108 3671080 3669050 3667232 3665659 3664592 3664170 3664408 3665935 3669826 3676107
58429 3676107 3683227 3689887 3696786 3705741 3717531 3731409 3746306 3761672 3777333 3793284 3809528 3825628
58417 3825628 3840622 3853758 3865046 3874765 3882888 3889383 3894577 3898743 3901744 3903452 3904093 3903940 3903262 3902806
58403 3902806 3903496 3905356 3907573 3909992 3913551 3918743 3924793 3931076 3938208 3946887 3956671 3966873 3977627 3989036
$$ packed form
58494C189571L106L644M526N344N808N985O324P110P960Q298Q158Q105Q520R386
58480C281845J0567J1811J2797J3710J5244J7513J9440K0030J9633J9092J8252
58469C459934J6465J3975J1540R082O100L100J149J48q64j724j158J023L274M513
58455C526557N444P095R191J0878J2075J3264J4490J5252J5067J3747J1481Q820
58443C663361O214L623J001j091k028k030j818j573j067m22K38J527L891O281
58429C676107P120O660O899Q955J1790J3878J4897J5366J5661J5951J6244J6100
58417C825628J4994J3136J1288R719Q123O495N194M166L001J708O41j53o78m56
58403C902806O90J860K217K419L559N192O050O283P132Q679R784J0202J0754J1409
$$ plain form
58389 3989036 4000274 4010706 4020951 4031626 4041952 4050990 4059413 4068542 4078286 4087636 4096730 4106843
58377 4106843 4118532 4131192 4144267 4157620 4170938 4184035 4197649 4212684 4228801 4244854 4260561
58366 4260561 4276630 4293455 4310839 4328889 4347955 4367733 4387545 4407530 4428566 4450981 4474181
58355 4474181 4497530 4520763 4543590 4565566 4586274 4605180 4621780 4636501 4650850 4665950 4681538
58344 4681538 4697065 4712872 4729335 4745849 4761957 4778656 4797199 4817262 4837688 4858416 4880295
58333 4880295 4903610 4928213 4954447 4982403 5010855 5038554 5066054 5094628 5123833 5151846 5177792
58322 5177792 5202104 5225034 5246663 5268052 5290484 5313604 5336009 5357545 5379320 5401582 5423479
58311 5423479 5445006 5467450 5491678 5517483 5544717 5573604 5603844 5634786 5666549 5699739 5734221
$$ packed form
58389C989036J1238J0432J0245J0675J0326R038Q423R129R744R350R094J0113
58377D106843J1689J2660J3075J3353J3318J3097J3614J5035J6117J6053J5707
58366D260561J6069J6825J7384J8050J9066J9778J9812J9985K1036K2415K3200
58355D474181K3349K3233K2827K1976K0708J8906J6600J4721J4349J5100J5588
58344D681538J5527J5807J6463J6514J6108J6699J8543K0063K0426K0728K1879
58333D880295K3315K4603K6234K7956K8452K7699K7500K8574K9205K8013K5946
58322E177792K4312K2930K1629K1389K2432K3120K2405K1536K1775K2262K1897
58311E423479K1527K2444K4228K5805K7234K8887L0240L0942L1763L3190L4482
$$ plain form
58300 5734221 5769408 5805436 5842684 5880610 5918575 5957230 5997431 6038259 6078010 6116781 6156246
58289 6156246 6197325 6239954 6284587 6331710 6380182 6428373 6476871 6527938 6582333 6638756 6696316
58278 6696316 6755332 6815695 6876713 6938750 7003101 7070175 7139570 7211664 7287183 7365541 7445737
58267 7445737 7528379 7614614 7703629 7793831 7885999 7982540 8083851 8188149 8294603 8403854
58257 8403854 8515724 8629373 8745516 8865546 8988714 9113180 9239579 9370325 9505808
58248 9505808 9644729 9787897 9937945 10095393 10258830 10428990 10608743 10799005 10998733
58239 10998733 11208966 11432519 11669363 11916897 12175353 12448481 12738285 13043752 13365551
58230 13365551 13707304 14071253 14457244 14866795 15303504 15768714 16261709 16784922 17343859
$$ packed form
58300E734221L5187L6028L7248L7926L7965L8655M0201M0828L9751L8771L9465
58289F156246M1079M2629M4633M7123M8472M8191M8498N1067N4395N6423N7560
58278F696316N9016O0363O1018O2037O4351O7074O9395P2094P5519P8358Q0196
58267G445737Q2642Q6235Q9015R0202R2168R6541J01311J04298J06454J09251
58257H403854J11870J13649J16143J20030J23168J24466J26399J30746J35483
58248I505808J38921J43168J50048J57448J63437J70160J79753J90262J99728
58239A0998733K10233K23553K36844K47534K58456K73128K89804L05467L21799
58230A3365551L41753L63949L85991M09551M36709M65210M92995N23213N58937
$$ plain form
58221 17343859 17941316 18577178 19254612 19980696 20760274 21595401 22491530 23457643 24499593
58212 24499593 25620551 26829030 28139142 29562424 31108035 32792376 34639942 36674178
58204 36674178 38917793 41403964 44177470 47285181 50779577 54736453 59261546 64486742
58196 64486742 70584432 77796062 86436902 96874720 109513287 124765430 142974174
58189 142974174 164323203 188805091 216141607 245449483 274773640 301071658 321072016
58182 321072016 332573297 335178419 329953147 318511438 302374549 282875563 261262365
58175 261262365 238676527 216053081 194099041 173341650 154150995 136731359 121137348
58168 121137348 107321106 95175591 84563400 75339656 67362911 60490477 54576604
$$ packed form
58221A7343859N97457O35862O77434P26084P79578Q35127Q96129R66113J041950
58212B4499593J120958J208479J310112J423282J545611J684341J847566K034236
58204C6674178K243615K486171K773506L107711L494396L956876M525093N225196
58196F4486742O097690P211630Q640840J0437818J2638567J5252143J8208744
58189A42974174K1349029K4481888K7336516K9307876K9324157K6298018K0000358
58182C21072016J1501281K605122n225272j1441709j6136889j9498986k1613198
58175B61262365k2585838k2623446k1954040k0757391j9190655j7419636j5594011
58168A21137348j3816242j2145515j0612191r223744p976745o872434n913873
$$ plain form
58161 54576604 49484842 45098202 41314308 38038903 35189674 32699823 30512428 28576157
58153 28576157 26849507 25302554 23909799 22645836 21490529 20432147 19461422 18567236
58145 18567236 17740791 16978182 16275123 15623822 15018148 14456824 13937949 13454678 12999649
58136 12999649 12569685 12163100 11776494 11407539 11057293 10726550 10413015 10114725 9832896
58127 9832896 9568594 9319809 9084586 8864010 8659349 8468983 8290733 8124603 7970754
58118 7970754 7827409 7693180 7569029 7455614 7351037 7253390 7163101 7080542 7003707 6930570
58108 6930570 6861580 6797622 6737608 6680248 6626240 6576462 6529810 6484878 6442131 6402518 6365593
58097 6365593 6330803 6298909 6270366 6243930 6218612 6195372 6175262 6157539 6141225 6126842 6114900
$$ packed form
58161E4576604n091762m386640l783894l275405k849229k489851k187395j936271
58153B8576157j726650j546953j392755j263963j155307j058382r70725q94186
58145A8567236q26445p62609p03059o51301o05674n61324n18875m83271m55029
58136A2999649m29964m06585l86606l68955l50246l30743l13535k98290k81829
58127I832896k64302k48785k35223k20576k04661j90366j78250j66130j53849
58118G970754j43345j34229j24151j13415j04577r7647r0289q2559p6835p3137
58108F930570o8990o3958o0014n7360n4008m9778m6652m4932m2747l9613l6925
58097F365593l4790l1894k8543k6436k5318k3240k0110j7723j6314j4383j1942
$$ plain form
58086 6114900 6104302 6093869 6083874 6074515 6064598 6053423 6042312 6032487 6023006 6012549 6001688 5991580
58074 5991580 5981865 5971781 5962007 5953425 5945197 5936015 5926334 5917677 5910581 5904762 5900326 5897281 5894746 5892132
58060 5892132 5890234 5889833 5890192 5890266 5890273 5890703 5890903 5890249 5889653 5890331 5891964 5893623 5895609 5898743 5902646 5906339 5909931
58043 5909931 5914172 5918900 5923333 5927417 5931585 5935748 5939794 5944447 5950350 5956879 5963054 5969038 5975462 5981882
58029 5981882 5987279 5991618 5995652 5999528 6002782 6005397 6007826 6010282 6012902 6016226 6020640 6025778 6031200 6037080
58015 6037080 6043492 6049824 6055736 6061927 6069012 6076516 6084016 6092307 6102150 6112651 6122276 6130940 6139760 6149215
58001 6149215 6158875 6168598 6178704 6189141 6199553 6209958 6220402 6230279 6238981 6246967 6255309 6264547 6274823
57988 6274823 6286676 6300621 6316147 6332035 6347504 6362405 6376685 6390380 6403774 6416921 6429504
$$ packed form
58086F114900j0598j0433r995r359r917j1175j1111r825r481j0457j0861j0108
58074E991580r715j0084r774q582q228r182r681q657p096n819m436l045k535k614
58060E892132j898m01L59P4PM30K00o54n96O78J633J659J986L134L903L693L592
58043E909931M241M728M433M084M168M163M046M653N903O529O175N984O424O420
58029E981882N397M339M034L876L254K615K429K456K620L324M414N138N422N880
58015F037080O412O332N912O191P085P504P500Q291R843J0501R625Q664Q820R455
58001F149215R660R723J0106J0437J0412J0405J0444R877Q702P986Q342R238J0276
57988F274823J1853J3945J5526J5888J5469J4901J4280J3695J3394J3147J2583
$$ plain form
57977 6429504 6441613 6453850 6466054 6476925 6485943 6494685 6505050 6517018 6529401 6541917 6555015 6568328
57965 6568328 6581023 6593353 6606289 6619823 6633107 6646165 6659877 6674248 6688133 6700914 6713155
57954 6713155 6725309 6737027 6748129 6759151 6770541 6782199 6794236 6807342 6821897 6837334 6852775
57943 6852775 6867891 6882881 6898092 6913919 6930832 6949272 6969510 6991415 7014232 7037015 7059593
57932 7059593 7082655 7106539 7130456 7153370 7174991 7195304 7213804 7230074 7244629 7258267 7271003
57921 7271003 7282519 7293245 7303930 7314334 7323341 7330384 7336038 7341281 7346906 7353519 7361428 7370477 7380427
57908 7380427 7391215 7402518 7413672 7424648 7436441 7449583 7462846 7474541 7484719 7494981 7506401
57897 7506401 7518780 7531779 7545552 7560054 7574739 7589264 7603899 7619150 7635450 7653089 7671829
$$ packed form
57977F429504J2109J2237J2204J0871R018Q742J0365J1968J2383J2516J3098J3313
57965F568328J2695J2330J2936J3534J3284J3058J3712J4371J3885J2781J2241
57954F713155J2154J1718J1102J1022J1390J1658J2037J3106J4555J5437J5441
57943F852775J5116J4990J5211J5827J6913J8440K0238K1905K2817K2783K2578
57932G059593K3062K3884K3917K2914K1621K0313J8500J6270J4555J3638J2736
57921G271003J1516J0726J0685J0404R007P043N654N243N625O613P909R049R950
57908G380427J0788J1303J1154J0976J1793J3142J3263J1695J0178J0262J1420
57897G506401J2379J2999J3773J4502J4685J4525J4635J5251J6300J7639J8740
$$ plain form
57886 7671829 7690800 7709413 7728120 7747615 7767619 7787273 7806461 7825774 7845275 7864128 7881487
57875 7881487 7897142 7911400 7924949 7938572 7952435 7965942 7978860 7992003 8006019 8020139 8033190
57864 8033190 8045412 8058126 8071954 8086512 8101610 8117551 8134328 8151651 8169662 8188612 8208020
57853 8208020 8227299 8246983 8268058 8290176 8311823 8332325 8352342 8372227 8391247 8408797 8425256
57842 8425256 8441197 8456700 8471793 8486769 8501792 8516932 8532673 8549528 8567139 8584641 8601875
57831 8601875 8619292 8636772 8653699 8670202 8687064 8704397 8721734 8739526 8758996 8780183 8801594
57820 8801594 8822365 8843254 8864873 8886378 8906920 8927161 8948220 8969985 8991475 9012112 9031706
57809 9031706 9049871 9066444 9081994 9097257 9112440 9127704 9143622 9160506 9177788 9194729 9211297
$$ packed form
57886G671829J8971J8613J8707J9495K0004J9654J9188J9313J9501J8853J7359
57875G881487J5655J4258J3549J3623J3863J3507J2918J3143J4016J4120J3051
57864H033190J2222J2714J3828J4558J5098J5941J6777J7323J8011J8950J9408
57853H208020J9279J9684K1075K2118K1647K0502K0017J9885J9020J7550J6459
57842H425256J5941J5503J5093J4976J5023J5140J5741J6855J7611J7502J7234
57831H601875J7417J7480J6927J6503J6862J7333J7337J7792J9470K1187K1411
57820H801594K0771K0889K1619K1505K0542K0241K1059K1765K1490K0637J9594
57809I031706J8165J6573J5550J5263J5183J5264J5918J6884J7282J6941J6568
$$ plain form
57798 9211297 9227848 9244484 9261276 9278621 9296844 9315914 9335891 9356962 9378639 9399719 9419693
57787 9419693 9439456 9459986 9481071 9502102 9523391 9545729 9569080 9592680 9616138 9639570 9662928
57776 9662928 9685996 9709035 9732628 9756873 9781187 9804902 9827657 9849359 9870179 9890478 9910448
57765 9910448 9929946 9948878 9967435 9985678 10003290 10020087 10036428 10052758 10069080 10085286 10101680
57754 10101680 10118708 10136485 10154967 10174288 10194476 10215122 10235841 10256930 10279072 10302383 10326096
57743 10326096 10349243 10371514 10393458 10415908 10439078 10462251 10484512 10505721 10526501 10547429 10568725
57732 10568725 10590636 10613456 10637037 10660803 10684416 10707963 10731403 10754387 10776751 10798667 10820287
57721 10820287 10841836 10864029 10887590 10912170 10936556 10960174 10983576 11007223 11030737 11053739 11076502
$$ packed form
57798I211297J6551J6636J6792J7345J8223J9070J9977K1071K1677K1080J9974
57787I419693J9763K0530K1085K1031K1289K2338K3351K3600K3458K3432K3358
57776I662928K3068K3039K3593K4245K4314K3715K2755K1702K0820K0299J9970
57765I910448J9498J8932J8557J8243J7612J6797J6341J6330J6322J6206J6394
57754A0101680J7028J7777J8482J9321K0188K0646K0719K1089K2142K3311K3713
57743A0326096K3147K2271K1944K2450K3170K3173K2261K1209K0780K0928K1296
57732A0568725K1911K2820K3581K3766K3613K3547K3440K2984K2364K1916K1620
57721A0820287K1549K2193K3561K4580K4386K3618K3402K3647K3514K3002K2763
$$ plain form
57710 11076502 11099233 11121589 11143464 11165453 11187904 11210309 11232348 11254751 11278329 11302882 11327905
57699 11327905 11353684 11380730 11408739 11437123 11466086 11496029 11526148 11554721 11580757 11604570 11626791
57688 11626791 11647691 11667465 11686428 11704829 11723034 11741906 11762429 11784892 11808851 11833819 11859632
57677 11859632 11886355 11914389 11944602 11977967 12015133 12056606 12102959 12154439 12210798 12272074 12339014
57666 12339014 12411597 12486854 12558654 12619935 12665461 12693377 12705323 12705188 12697141 12684359 12669253 12654047
57654 12654047 12640384 12628795 12619321 12612555 12609422 12610123 12614055 12620762 12630295 12642555 12656893 12672624 12689597
57641 12689597 12708086 12728277 12749836 12771841 12793346 12814232 12835246 12857028 12879447 12902139 12925158
57630 12925158 12948547 12971738 12994076 13015737 13037535 13059995 13083068 13106471 13129792 13152585 13174904
$$ packed form
57710A1076502K2731K2356K1875K1989K2451K2405K2039K2403K3578K4553K5023
57699A1327905K5779K7046K8009K8384K8963K9943L0119K8573K6036K3813K2221
57688A1626791K0900J9774J8963J8401J8205J8872K0523K2463K3959K4968K5813
57677A1859632K6723K8034L0213L3365L7166M1473M6353N1480N6359O1276O6940
57666A2339014P2583P5257P1800O1281M5526K7916J1946j35q047j2782j5106j5206
57654A2654047j3663j1589r474o766l133P01L932O707R533J2260J4338J5731J6973
57641A2689597J8489K0191K1559K2005K1505K0886K1014K1782K2419K2692K3019
57630A2925158K3389K3191K2338K1661K1798K2460K3073K3403K3321K2793K2319
$$ plain form
57619 13174904 13197468 13220744 13244247 13267302 13290038 13312878 13335557 13357653 13379725 13402784 13426693
57608 13426693 13450270 13473106 13496175 13520352 13545278 13570196 13595088 13620396 13646107 13671659 13696526
57597 13696526 13720662 13744539 13768779 13793465 13817884 13841325 13863999 13886669 13909535 13932190 13954608
57586 13954608 13977389 14000884 14024748 14048526 14072081 14095375 14118497 14142061 14166843 14192731 14218708
57575 14218708 14244107 14269228 14294427 14319322 14343337 14366514 14389318 14412167 14435452 14459517 14484141
57564 14484141 14508555 14532363 14556012 14579925 14603748 14626990 14649942 14673277 14697049 14720800 14744451
57553 14744451 14768419 14792847 14817292 14841335 14865120 14889165 14913807 14938816 14963423 14986910 15009459
57542 15009459 15032231 15056247 15081309 15106347 15130711 15154680 15178712 15202714 15226312 15249485 15272666
$$ packed form
57619A3174904K2564K3276K3503K3055K2736K2840K2679K2096K2072K3059K3909
57608A3426693K3577K2836K3069K4177K4926K4918K4892K5308K5711K5552K4867
57597A3696526K4136K3877K4240K4686K4419K3441K2674K2670K2866K2655K2418
57586A3954608K2781K3495K3864K3778K3555K3294K3122K3564K4782K5888K5977
57575A4218708K5399K5121K5199K4895K4015K3177K2804K2849K3285K4065K4624
57564A4484141K4414K3808K3649K3913K3823K3242K2952K3335K3772K3751K3651
57553A4744451K3968K4428K4445K4043K3785K4045K4642K5009K4607K3487K2549
57542A5009459K2772K4016K5062K5038K4364K3969K4032K4002K3598K3173K3181
$$ plain form
57531 15272666 15296309 15320559 15345270 15370153 15394984 15419739 15444472 15468927 15492481 15514688 15535849
57520 15535849 15556726 15577671 15598338 15618373 15638074 15658005 15678250 15698413 15718250 15737861 15757282
57509 15757282 15776410 15795412 15814701 15834302 15853589 15871937 15889332 15906146 15922638 15938912 15955089
57498 15955089 15971271 15987569 16004385 16022289 16041343 16060844 16079974 16098424 16116152 16133031 16149149
57487 16149149 16165125 16181654 16198918 16216741 16234973 16253353 16271448 16289133 16306799 16324597 16341919
57476 16341919 16358188 16373776 16389481 16405455 16421336 16437125 16453134 16469237 16484970 16500328 16515751
57465 16515751 16531403 16547138 16563040 16579258 16595391 16610893 16626060 16641724 16657916 16673715 16688670
57454 16688670 16703457 16718781 16734374 16749529 16763987 16777887 16791333 16804458 16817499 16830497 16843284
$$ packed form
57531A5272666K3643K4250K4711K4883K4831K4755K4733K4455K3554K2207K1161
57520A5535849K0877K0945K0667K0035J9701J9931K0245K0163J9837J9611J9421
57509A5757282J9128J9002J9289J9601J9287J8348J7395J6814J6492J6274J6177
57498A5955089J6182J6298J6816J7904J9054J9501J9130J8450J7728J6879J6118
57487A6149149J5976J6529J7264J7823J8232J8380J8095J7685J7666J7798J7322
57476A6341919J6269J5588J5705J5974J5881J5789J6009J6103J5733J5358J5423
57465A6515751J5652J5735J5902J6218J6133J5502J5167J5664J6192J5799J4955
57454A6688670J4787J5324J5593J5155J4458J3900J3446J3125J3041J2998J2787
$$ plain form
57443 16843284 16855918 16868695 16881551 16893950 16905608 16916858 16928036 16938988 16949432 16959348 16968766
57432 16968766 16977611 16986003 16994307 17002668 17010898 17018943 17026980 17034898 17042332 17049394 17056759 17064621 17072188 17078660
57418 17078660 17084180 17089332 17094261 17098878 17103534 17108813 17114741 17120711 17126150 17130970 17135519 17140354 17145818 17151644
57404 17151644 17157209 17162375 17167706 17173543 17179270 17183929 17187332 17190118 17192903 17195821 17198847 17202078 17205582 17209182
57390 17209182 17212558 17215639 17218842 17222753 17227377 17231917 17235646 17238807 17242159 17245772 17248947 17251370 17253577 17255997
57376 17255997 17258225 17259646 17260253 17260384 17260153 17259552 17258706 17257554 17255685 17252971 17250024 17247543 17245440 17243083 17240182
57361 17240182 17237058 17234257 17232242 17231156 17230421 17228838 17225581 17221061 17216434 17212316 17208259 17203461 17197730 17191733
57347 17191733 17186294 17181319 17175604 17168113 17159378 17151000 17143686 17136548 17128556 17119791 17110636 17100626 17089096
$$ packed form
57443A6843284J2634J2777J2856J2399J1658J1250J1178J0952J0444R916R418
57432A6968766Q845Q392Q304Q361Q230Q045Q037P918P434P062P365P862P567O472
57418A7078660N520N152M929M617M656N279N928N970N439M820M549M835N464N826
57404A7151644N565N166N331N837N727M659L403K786K785K918L026L231L504L600
57390A7209182L376L081L203L911M624M540L729L161L352L613L175K423K207K420
57376A7255997K228J421O07J31k31o01q46j152j869k714k947k481k103k357k901
57361A7240182l124k801k015j086p35j583l257m520m627m118m057m798n731n997
57347A7191733n439m975n715p491q735q378p314p138p992q765r155j0010j1530
$$ plain form
57334 17089096 17076506 17064106 17052384 17040696 17028350 17015272 17001534 16987022 16971880 16956693 16941841
57323 16941841 16926935 16911139 16894018 16875937 16857744 16840026 16822653 16805119 16787242 16769268 16751295
57312 16751295 16733099 16714716 16696627 16678980 16661118 16642385 16623055 16603891 16585108 16566383 16547629
57301 16547629 16529035 16510386 16490966 16470304 16448639 16426632 16404889 16383703 16362852 16341719 16319900
57290 16319900 16297660 16275570 16253860 16232469 16211449 16190863 16170422 16149697 16128642 16107524 16086428
57279 16086428 16065222 16043935 16022821 16002145 15982220 15963507 15946336 15930701 15916651 15904593 15894788
57268 15894788 15886828 15880123 15874573 15870090 15865737 15860141 15852701 15843593 15832606 15818820 15801706 15781817 15760066
57255 15760066 15736878 15712375 15686792 15660306 15632839 15604466 15575769 15547460 15519836 15492796 15466177
$$ packed form
57334A7089096j2590j2400j1722j1688j2346j3078j3738j4512j5142j5187j4852
57323A6941841j4906j5796j7121j8081j8193j7718j7373j7534j7877j7974j7973
57312A6751295j8196j8383j8089j7647j7862j8733j9330j9164j8783j8725j8754
57301A6547629j8594j8649j9420k0662k1665k2007k1743k1186k0851k1133k1819
57290A6319900k2240k2090k1710k1391k1020k0586k0441k0725k1055k1118k1096
57279A6086428k1206k1287k1114k0676j9925j8713j7171j5635j4050j2058r805
57268A5894788p960o705n550m483m353n596p440r108j0987j3786j7114j9889k1751
57255A5760066k3188k4503k5583k6486k7467k8373k8697k8309k7624k7040k6619
$$ plain form
57244 15466177 15439843 15413646 15387523 15361550 15335790 15310256 15285108 15260664 15237120 15214438 15192637
57233 15192637 15172065 15153327 15137049 15123703 15113537 15106647 15103160 15103173 15106405 15112130 15119669 15128706 15138756
57220 15138756 15148707 15157422 15164666 15170856 15176021 15179685 15181782 15182893 15183326 15182684 15180708 15177956 15175091 15172008
57206 15172008 15168262 15163988 15159644 15154981 15149025 15141194 15131779 15121090 15108690 15093994 15077263 15059345
57194 15059345 15040446 15019715 14996236 14969930 14941120 14909594 14874701 14836242 14794800 14751104 14705475
57183 14705475 14657827 14607681 14554116 14496248 14434002 14367874 14297744 14222504 14141258 14054314 13962458
57172 13962458 13865741 13763588 13655674 13541965 13422181 13296053 13164090 13027543 12887722
57163 12887722 12745982 12604304 12465172 12330712 12202400 12081513 11969196 11865968 11771620
$$ packed form
57244A5466177k6334k6197k6123k5973k5760k5534k5148k4444k3544k2682k1801
57233A5192637k0572j8738j6278j3346j0166o890l487J3L232N725P539R037J0050
57220A5138756R951Q715P244O190N165L664K097J111M33o42j976k752k865l083
57206A5172008l746m274m344m663n956p831r415j0689j2400j4696j6731j7918
57194A5059345j8899k0731k3479k6306k8810l1526l4893l8459m1442m3696m5629
57183A4705475m7648n0146n3565n7868o2246o6128p0130p5240q1246q6944r1856
57172A3962458r6717j02153j07914j13709j19784j26128j31963j36547j39821
57163A2887722j41740j41678j39132j34460j28312j20887j12317j03228r4348
$$ plain form
57154 11771620 11685655 11607323 11535212 11467316 11401578 11335941 11268066 11195860 11118514 11036455 10950251
57143 10950251 10860417 10768575 10677809 10590955 10508792 10430310 10354222 10279461 10204496 10127090 10045199
57132 10045199 9957979 9865992 9770754 9674074 9577342 9480946 9384200 9286015 9185916 9084715 8984258
57121 8984258 8886486 8792749 8703874 8620554 8543488 8473432 8411461 8359010 8317381 8287325 8269301
57110 8269301 8263823 8271226 8291538 8325304 8374597 8442925 8534618 8655164 8812288 9016247 9279292
57099 9279292 9615829 10043483 10583709 11261750 12107078 13154424 14443671 16017889 17920238
57090 17920238 20189513 22852892 25916556 29357735 33120226 37112077 41205240 45242246
57082 45242246 49055874 52499500 55474793 57940402 59895466 61349377 62299966 62734733
$$ packed form
57154A1771620q5965p8332p2111o7896o5738o5637o7875p2206p7346q2059q6204
57143A0950251q9834r1842r0766q6854q2163p8482p6088p4761p4965p7406q1891
57132A0045199q7220r1987r5238r6680r6732r6396r6746r8185j00099j01201j00457
57121H984258r7772r3737q8875q3320p7066p0056o1971n2451m1629l0056j8024
57110H269301n478P403K0312L3766M9293O8328R1693J20546J57124K03959K63045
57099I279292L36537M27654N40226O78041Q45328J047346J289247J574218J902349
57090A7920238K269275K663379L063664L441179L762491L991851M093163M037006
57082D5242246L813628L443626K975293K465609J955064J453911R50589M34767
$$ plain form
57074 62734733 62648679 62058398 60999508 59513445 57638134 55408842 52864668 50054454
57066 50054454 47039814 43894060 40695598 37517614 34419992 31447968 28635897 26010970
57058 26010970 23593966 21398030 19427684 17679141 16141738 14799893 13635069 12627349
57050 12627349 11756488 11002697 10347510 9774725 9270832 8824467 8425531 8065020 7735519
57041 7735519 7431402 7148365 6883013 6632864 6396247 6171852 5958574 5755792 5563253
57032 5563253 5380420 5206447 5041158 4885481 4740481 4606540 4484035 4373648 4273841 4177313
57022 4177313 4071414 3943927 3789366 3610218 3413205 3205234 2992264 2779949 2573567
57013 2573567 2376979 2192180 2020135 1861669 1717326 1586715 1468541 1361347 1264018 1175699
$$ packed form
57074F2734733q6054n90281j058890j486063j875311k229292k544174k810214
57066E0054454l014640l145754l198462l177984l097622k972024k812071k624927
57058B6010970k417004k195936j970346j748543j537403j341845j164824j007720
57050A2627349q70861p53791o55187n72785n03893m46365l98936l60511l29501
57041G735519l04117k83037k65352k50149k36617k24395k13278k02782j92539
57032E563253j82833j73973j65289j55677j45000j33941j22505j10387r9807r6528
57022D177313j05899j27487j54561j79148j97013k07971k12970k12315k06382
57013B573567j96588j84799j72045j58466j44343j30611j18174j07194r7329q8319
$$ plain form
57003 1175699 1095699 1023632 959251 901858 850097 802617 758831 718865 682882 650681 621877
56992 621877 596248 573782 554462 538041 524121 512515 503418 497036 493132 491147 490589 490868 490714
56979 490714 488312 482368 472871 460693 446761 431822 416601 401653 387103 372803 358816 345591
56967 345591 333770 323907 316245 310605 306695 304694 305405 309624 317415 328108 340774 354405 367686
56954 367686 378858 386023 387802 383974 375592 364276 351222 336937 321814 306599 292140 278992
56942 278992 267485 257908 250359 244666 240823 239436 241420 247215 256504 268687 283458 300778 320201
56929 320201 340174 358002 370774 376565 374930 366520 352602 334844 315027 294476 273798 253308
56917 253308 233582 215421 199354 185354 172987 161770 151446 142048 133715 126441 120035 114233
$$ packed form
57003A175699q0000p2067o4381n7393n1761m7480m3786l9966l5983l2201k8804
56992F21877k5629k2466j9320j6421j3920j1606r097o382l904j985n58K79j54
56979D90714k402n944r497j2178j3932j4939j5221j4948j4550j4300j3987j3225
56967C45591j1821r863p662n640l910k001P11M219P791J0693J2666J3631J3281
56954C67686J1172P165J779l828q382j1316j3054j4285j5123j5215j4459j3148
56942B78992j1507r577p549n693l843j387J984N795R289J2183J4771J7320J9423
56929C20201J9973J7828J2772N791j635q410j3918j7758j9817k0551k0678k0490
56917B53308j9726j8161j6067j4000j2367j1217j0324r398q333p274o406n802
$$ plain form
56905 114233 108884 104110 100332 97875 96397 94995 93066 90817 88716 86897 85522 85238 86579 89219
56891 89219 92583 96967 103227 111575 121718 134023 149239 166669 183764 198116 209000 216578 220789
56878 220789 221867 220992 219341 217046 214056 211441 210828 212891 217348 224104 233430 245249 259394 276682
56864 276682 298735 326521 359733 397828 440824 488449 538606 586880 627656 656255 670787
56853 670787 672314 663229 645720 621830 594183 565697 538609 514359 494289 479708 471255 468822
56841 468822 472281 481968 498528 522767 555665 598036 650203 712121 783093 860094 936151 1001477
56829 1001477 1047326 1069394 1068230 1047381 1011278 964001 909144 850456 792119 737759 689137
56818 689137 646363 609445 579120 556198 540952 533589 534733 544927 564113 592049 628763 673677
$$ packed form
56905A14233n349m774l778k457j478j402j929k249k101j819j375k84J341K640
56891H9219L364M384O260Q348J0143J2305J5216J7430J7095J4352J0884P578M211
56878B20789J078q75j651k295k990k615o13K063M457O756R326J1819J4145J7288
56864B76682K2053K7786L3212L8095M2996M7625N0157M8274M0776K8599J4532
56853F70787J527r085j7509k3890k7647k8486k7088k4250k0070j4581q453k433
56841D68822L459R687J6560K4239L2898M2371N2167O1918P0972P7001P6057O5326
56829A001477M5849K2068j164k0849l6103m7277n4857n8688n8337n4360m8622
56818F89137m2774l6918l0325k2922j5246p363J144J0194J9186K7936L6714M4914
$$ plain form
56806 673677 723994 774259 817760 848581 863013 860041 841165 809743 769886 725172 677921 629588
56794 629588 581814 536802 496501 461745 432454 408527 390101 377141 369306 366400 368662 376487
56782 376487 390028 408922 431853 456103 477838 493313 500123 497604 486414 467904 443744 415837
56770 415837 386135 356162 326617 297661 269670 243417 219508 198056 179148 163164 150201
56759 150201 139488 129870 120771 112352 104925 98626 93477 89257 85345 81092 76442 71999 68539 66501
56745 66501 65620 64815 62858 59555 55974 53193 51225 49573 48276 47677 47577 47427 47190 47243 47572 47806 47919
56728 47919 48142 48284 47985 47565 47756 48528 49125 49386 50123 51839 53926 55513 56422 56873 57028 57305 58507 60978
56710 60978 64032 66732 68907 70916 72825 74361 75429 76103 76243 75593 74303 73026 72467 72929 74187 75652
$$ packed form
56806F73677N0317N0265M3501L0821J4432k972j8876l1422l9857m4714m7251m8333
56794F29588m7774m5012m0301l4756k9291k3927j8426j2960p835k906K262P825
56782C76487J3541J8894K2931K4250K1735J5475O810k519j1190j8510k4160k7907
56770D15837k9702k9973k9545k8956k7991k6253k3909k1452j8908j5984j2963
56759A50201j0713r618r099q419p427o299n149m220l912m253m650m443l460k038
56745F6501q81q05j957l303l581k781j968j652j297n99j00j50k37N3L29K34J13
56728D7919K23J42k99m20J91P72N97K61P37J716K087J587R09M51J55K77J202K471
56710F0978L054K700K175K009J909J536J068O74J40o50j290j277n59M62J258J465
$$ plain form
56694 75652 76714 77101 76919 76483 76164 76253 76706 77112 77161 76998 76844 76518 75795 75086 75124 76032 77229 78243 79016
56675 79016 79433 79288 78869 78859 79405 79888 79946 80099 80957 82344 83635 84508 84921 84729 83852 82579 81340 80369
56657 80369 79861 80088 80989 81868 81912 80934 79374 77739 76235 74760 73045 70950 68776 67105 66185 65661 65045
56640 65045 64262 63642 63602 64437 66181 68548 71178 73983 77054 80223 83048 85297 87189 89099 91265 93711
56624 93711 96131 97883 98504 98243 97801 97577 97550 97704 97987 97993 97330 96384 96036 96515 97161 97449 97543 97582 97210 96241
56604 96241 95245 94991 95708 97173 99084 101017 102493 103498 104535 105860 107005 107405 107157 106889 107139 108025
56588 108025 109166 109833 109657 109285 109781 111247 112670 113341 113701 114450 115552 116612 117565 118503 119385 120484 122510
56571 122510 125641 128904 131218 132704 134342 136635 139314 142141 145397 149580 155039 161812 169524 177595
$$ packed form
56694G5652J062L87j82m36l19Q9M53M06M9j63j54l26p23p09L8R08J197J014P73
56675G9016M17j45m19j0N46M83N8J53Q58J387J291Q73M13j92q77j273j239r71
56657H0369n08K27R01Q79M4r78j560j635j504j475j715k095k174j671r20n24o16
56640F5045p83o20m0Q35J744K367K630K805L071L169K825K249J892J910K166K446
56624I3711K420J752O21k61m42k24k7J54K83Oo63r46l48M79O46K88R4L9l72r69
56604I6241r96k54P17J465J911J933J476J005J037J325J145M00k48k68K50Q86
56588A08025J141O67j76l72M96J466J423O71L60P49J102J060R53R38Q82J099K026
56571A22510L131L263K314J486J638K293K679K827L256M183N459O773P712Q071
$$ plain form
56557 177595 185719 193776 201053 206172 208352 208391 207819 207348 206654 205366 203627 201760 199915 198056 196070
56542 196070 193962 192101 190947 190327 189353 187439 185061 183143 182071 181694 181871 182445 182978 183086 182924 182910 183079
56525 183079 183110 182865 182609 182767 183659 185192 186649 187174 186723 186147 185998 185800 184892 183549 182691 182802 183689 184988
56507 184988 186303 187110 187131 186775 186671 186847 186784 186226 185473 184843 184202 183160 181640 180204 179697 180285 180967 180465
56489 180465 178681 176751 175663 175459 175973 177417 179708 181909 183093 183377 183532 183890 184204 184292 184276 184382 184893
56472 184893 186051 187689 189260 190522 191816 193459 195300 197133 198971 200587 201408 201267 200689 200101 199456
56457 199456 199029 199655 201515 203499 204570 205031 205625 206161 206101 205940 206775 208705 210703 211956 212540 212848 213111
56440 213111 213404 213558 213278 212745 212687 213403 214267 214866 215942 218376 221770 224929 227248 228765 229429 229406 229654
$$ packed form
56557A77595Q124Q057P277N119K180L9n72m71o94j288j739j867j845j859j986
56542A96070k108j861j154o20r74j914k378j918j072l77J77N74N33J08j62j4J69
56525A83079L1k45k56J58Q92J533J457N25m51n76j49j98r08j343q58J11Q87J299
56507A84988J315Q07K1l56j04J76o3n58p53o30o41j042j520j436n07N88O82n02
56489A80465j784j930j088k04N14J444K291K201J184K84J55L58L14Q8j6J06N11
56472A84893J158J638J571J262J294J643J841J833J838J616Q21j41n78n88o45
56457A99456m27O26J860J984J071M61N94N36o0j61Q35J930J998J253N84L08K63
56440B13111K93J54k80n33n8P16Q64N99J076K434L394L159K319J517O64k3K48
$$ plain form
56423 229654 231030 233026 234390 234743 234634 234433 234239 234579 235964 237874 239256 239883 240257 240462 240337 240515 241900
56406 241900 244100 245726 246386 247121 248645 250336 251343 251623 251540 251436 251917 253593 256129 258418 260059 261875
56390 261875 264670 268258 271994 275493 278456 280579 282019 283403 285057 286751 288307 289845 291268 292191
56376 292191 292551 292729 292991 293381 294211 295919 298329 300627 302182 302920 303083 303204 304002 305498 306511 306020 304833
56359 304833 304689 305836 306816 306778 306619 307406 308945 310528 312065 313695 315117 316025 316701 317609 318868 320453
56343 320453 322400 324525 326453 328174 330087 332411 335107 338413 342636 347314 351454 354835 358273 362315
56329 362315 366454 369967 372835 375443 378009 380621 383345 386103 388921 392252 396347 400388 403140 404589
56315 404589 406011 408219 410646 412433 413512 414310 415217 416744 419457 423309 427621 431923 436217 440357 444015
$$ packed form
56423B29654J376J996J364L53j09k01j94L40J385J910J382O27L74K05j25J78J385
56406B41900K200J626O60P35J524J691J007K80q3j04M81J676K536K289J641J816
56390B61875K795L588L736L499K963K123J440J384J654J694J556J538J423R23
56376B92191L60J78K62L90Q30J708K410K298J555P38J63J21P98J496J013m91j187
56359C04833j44J147R80l8j59P87J539J583J537J630J422R08O76R08J259J585
56343C20453J947K125J928J721J913K324K696L306M223M678M140L381L438M042
56329C62315M139L513K868K608K566K612K724K758K818L331M095M041K752J449
56315D04589J422K208K427J787J079P98R07J527K713L852M312M302M294M140L658
$$ plain form
56300 444015 447480 451654 456928 462709 468277 473453 478307 482971 487792 492955 497958 502279 506496 511692
56286 511692 517838 523916 529702 536120 543622 551509 559252 567201 575589 584098 592954 603198 615199 627991
56272 627991 640749 653852 667831 682371 697141 712636 729389 747136 765556 785050 806121
56261 806121 828691 852706 878679 907027 937552 970148 1005405 1044121 1086955 1134895 1189119
56250 1189119 1249937 1316767 1389604 1469441 1556621 1649756 1746947 1847171 1949725 2053187 2155737
56239 2155737 2255833 2351876 2441810 2523531 2595088 2654167 2698368 2726486 2738814 2735884 2717913
56228 2717913 2685824 2641588 2586865 2522368 2449220 2369868 2286912 2201953 2116186 2031055 1947508
56217 1947508 1865572 1785516 1708659 1636330 1568807 1505767 1446898 1391615 1339284 1290281 1245738
$$ packed form
56300D44015L465M174N274N781N568N176M854M664M821N163N003M321M217N196
56286E11692O146O078N786O418P502P887P743P949Q388Q509Q856J0244J2001J2792
56272F27991J2758J3103J3979J4540J4770J5495J6753J7747J8420J9494K1071
56261H06121K2570K4015K5973K8348L0525L2596L5257L8716M2834M7940N4224
56250A189119O0818O6830P2837P9837Q7180R3135R7191J00224J02554J03462J02550
56239B155737J00096R6043Q9934Q1721P1557N9079M4201K8118J2328k930j7971
56228B717913l2089m4236n4723o4497p3148p9352q2956q4959q5767q5131q3547
56217A947508q1936q0056p6857p2329o7523o3040n8869n5283n2331m9003m4543
$$ plain form
56206 1245738 1205720 1168848 1134257 1102572 1074270 1048478 1024329 1002199 982683 965570 950651
56195 950651 938215 927767 917644 907023 897106 889317 883574 879230 876263 874394 872555 870511 869550
56182 869550 870261 871191 871164 871318 873037 875409 876836 877963 880762 885501 890739 895706 900748 905959 911272
56167 911272 917428 925040 933111 940301 947262 955971 966987 979068 991293 1003897 1017187 1031266 1046844
56154 1046844 1064849 1085066 1106311 1127930 1150232 1173721 1199034 1227373 1259938 1297115 1339047
56143 1339047 1386594 1440924 1502780 1572981 1652710 1741977 1838311 1938018 2038083 2135980 2228803
56132 2228803 2314226 2391846 2462446 2526704 2585739 2641711 2695908 2746652 2790550 2825497 2851367
56121 2851367 2868652 2877944 2880161 2875713 2863625 2842410 2811089 2768569 2713359 2645459 2567595 2483256
$$ packed form
56206A245738m0018l6872l4591l1685k8302k5792k4149k2130j9516j7113j4919
56195I50651j2436j0448j0123j0621r917p789n743m344k967j869j839k044r61
56182H69550P11R30k7J54J719K372J427J127K799M739N238M967N042N211N313
56167I11272O156P612Q071P190O961Q709J1016J2081J2225J2604J3290J4079J5578
56154A046844J8005K0217K1245K1619K2302K3489K5313K8339L2565L7177M1932
56143A339047M7547N4330O1856P0201P9729Q9267R6334R9707J00065R7897R2823
56132B228803Q5423P7620P0600O4258N9035N5972N4197N0744M3898L4947K5870
56121B851367J7285R292K217m448j2088k1215l1321m2520n5210o7900p7864q4339
$$ plain form
56109 2483256 2394624 2303860 2214820 2131325 2054594 1984305 1921186 1866445 1819567 1778980 1744419
56098 1744419 1716517 1694596 1676967 1663077 1653328 1647179 1643339 1641534 1642272 1645217 1649535 1655390 1663365
56085 1663365 1672869 1682855 1693511 1705544 1718442 1731293 1744641 1759663 1776139 1793051 1810407 1828625
56073 1828625 1847004 1864852 1883265 1903739 1925862 1948476 1972006 1997282 2023099 2047625 2071466
56062 2071466 2096682 2123498 2150651 2178359 2208153 2240161 2273181 2306962 2341872 2376816 2410173
56051 2410173 2442412 2475241 2508782 2542197 2576328 2612772 2650927 2688971 2727279 2767835 2810715
56040 2810715 2854272 2898550 2945373 2995217 3046982 3100645 3157156 3215971 3275657 3336689 3400767
56029 3400767 3467750 3536256 3606698 3680617 3757540 3835761 3915606 3998551 4083810 4169402 4256034
$$ packed form
56109B483256q8632r0764q9040q3495p6731p0289o3119n4741m6878m0587l4561
56098A744419k7902k1921j7629j3890r749o149l840j805P38K945M318N855P975
56085A663365R504R986J0656J2033J2898J2851J3348J5022J6476J6912J7356J8218
56073A828625J8379J7848J8413K0474K2123K2614K3530K5276K5817K4526K3841
56062B071466K5216K6816K7153K7708K9794L2008L3020L3781L4910L4944L3357
56051B410173L2239L2829L3541L3415L4131L6444L8155L8044L8308M0556M2880
56040B810715M3557M4278M6823M9844N1765N3663N6511N8815N9686O1032O4078
56029C400767O6983O8506P0442P3919P6923P8221P9845Q2945Q5259Q5592Q6632
$$ plain form
56018 4256034 4346231 4440183 4536266 4635110 4739174 4848672 4961891 5079065 5201997 5330433
56008 5330433 5462975 5601034 5747521 5902174 6062531 6228921 6403923 6587762 6779134
55999 6779134 6979869 7193562 7420182 7657191 7905232 8167320 8443411 8731809 9035110
55990 9035110 9358498 9702942 10066693 10452643 10866982 11311142 11782662 12283684 12820786
55981 12820786 13396670 14010323 14665424 15370090 16128208 16939867 17810486 18750270 19764653
55972 19764653 20855208 22030155 23303659 24685136 26181071 27807985 29591904 31555681
55964 31555681 33720974 36123544 38812836 41837676 45250556 49129118 53580456 58732187
55956 58732187 64749580 71871106 80412009 90737504 103250464 118372069 136455306
$$ packed form
56018D256034R0197R3952R6083R8844J04064J09498J13219J17174J22932J28436
56008E330433J32542J38059J46487J54653J60357J66390J75002J83839J91372
55999F779134K00735K13693K26620K37009K48041K62088K76091K88398L03301
55990I035110L23388L44444L63751L85950M14339M44160M71520N01022N37102
55981A2820786N75884O13653O55101P04666P58118Q11659Q70619R39784J014383
55972A9764653J090555J174947J273504J381477J495935J626914J783919J963777
55964C1555681K165293K402570K689292L024840L412880L878562M451338N151731
55956E8732187O017393P121526Q540903J0325495J2512960J5121605J8083237
$$ plain form
55949 136455306 157683224 182055201 209351833 238808668 268570978 295552065 316222423
55942 316222423 327977998 330072606 323497106 310154009 292083615 271089988 248627481
55935 248627481 225773774 203282342 181702101 161462515 142873091 126100323 111180949
55928 111180949 98054106 86587941 76613255 67963392 60489645 54048832 48498077 43708979
55920 43708979 39574374 35997325 32886048 30163969 27773465 25665133 23792221 22117685
55912 22117685 20616163 19264747 18039339 16921831 15901858 14968409 14107181 13308158
55904 13308158 12567960 11882118 11242052 10641718 10080252 9555645 9062190 8596158 8157834
55895 8157834 7745922 7355731 6984723 6634262 6304371 5992247 5697260 5421744 5165296
$$ packed form
55949A36455306K1227918K4371977K7296632K9456835K9762310K6981087K0670358
55942C16222423J1755575K094608o575500j3343097j8070394k0993627k2462507
55935B48627481k2853707k2491432k1580241k0239586j8589424j6772768j4919374
55928A11180949j3126843j1466165r974686q649863p473747o440813n550755m789098
55920D3708979m134605l577049l111277k722079k390504k108332j872912j674536
55912B2117685j501522j351416j225408j117508j019973r33449q61228p99023
55904A3308158p40198o85842o40066o00334n61466n24607m93455m66032m38324
55895H157834m11912l90191l71008l50461l29891l12124k94987k75516k56448
$$ plain form
55886 5165296 4923885 4696116 4484885 4291141 4111356 3942872 3786379 3641067 3502447
55877 3502447 3367358 3236801 3111889 2991324 2874678 2763809 2659041 2557909 2459510 2366152
55867 2366152 2279003 2196118 2116489 2042087 1973994 1910303 1849825 1794227 1744425 1698193 1653357
55856 1653357 1610386 1570119 1531911 1495636 1462507 1432335 1402825 1373006 1344476 1317987 1291889
55845 1291889 1265242 1239326 1214604 1189341 1162832 1136983 1113038 1089652 1065822 1042858 1021720
55834 1021720 1001265 980875 962042 945464 929185 911615 894039 878222 863758 849646 836386
55823 836386 824698 813976 803524 793516 783451 771738 758123 744522 732257 720600 709151
55812 709151 699142 690978 682906 673769 664832 657274 650167 642661 635947 631136 627202 622986 619420 617878
$$ packed form
55886E165296k41411k27769k11231j93744j79785j68484j56493j45312j38620
55877C502447j35089j30557j24912j20565j16646j10869j04768j01132r8399r3358
55867B366152q7149q2885p9629p4402o8093o3691o0478n5598m9802m6232m4836
55856A653357m2971m0267l8208l6275l3129l0172k9510k9819k8530k6489k6098
55845A291889k6647k5916k4722k5263k6509k5849k3945k3386k3830k2964k1138
55834A021720k0455k0390j8833j6578j6279j7570j7576j5817j4464j4112j3260
55823H36386j1688j0722j0452j0008j0065j1713j3615j3601j2265j1657j1449
55812G09151j0009q164q072r137q937p558p107p506o714m811l934m216l566j542
$$ plain form
55798 617878 617942 618551 619721 621484 622763 622897 622675 622346 620453 616301 611716 608473 605719 601972 597979 595288
55782 595288 593224 589545 583247 574804 564511 552555 540155 528935 519531 511937 506496 503339 501683
55769 501683 500858 501119 502364 503051 501697 498501 494314 488991 482076 474215 466586 459599 453185 447566 442612
55754 442612 437315 430939 423936 416896 409537 401657 394036 387380 381274 375146 369292 363977 358551 352483
55740 352483 346393 341156 336846 333283 330530 328064 324690 320242 316226 313873 312733 311992 311708 311673 310548
55725 310548 307556 303773 300347 296612 291427 285328 279788 275177 270838 266582 262823 259833 257881 257512
55711 257512 258838 261248 264415 268567 273184 276798 278890 280517 282093 282261 280167 277217 275059 273289
55697 273289 270772 267707 264697 261124 256378 251461 247412 243340 238075 232746 229468 228230 227317 226188
$$ packed form
55798F17878O4O09J170J763J279J34k22l29j893m152m585l243k754l747l993k691
55782E95288k064l679o298q443j0293j1956j2400j1220r404p594n441l157j656
55769E01683q25K61J245O87j354l196m187n323o915p861p629o987o414n619m954
55754D42612n297o376p003p040p359p880p621o656o106o128n854n315n426o068
55740C52483o090n237m310l563k753k466l374m448m016k353j140p41k84l5j125
55725C10548k992l783l426l735n185o099n540m611m339m256l759k990j952l69
55711B57512J326K410L167M152M617L614K092J627J576J68k094k950k158j770
55697B73289k517l065l010l573m746m917m049m072n265n329l278j238r13j129
$$ plain form
55683 226188 225781 226376 227363 228873 231585 235031 237964 240348 243172 246376 248681 249486 249306 248441 246841 245239
55667 245239 244690 244857 244329 242751 241183 240254 239480 238570 237961 237771 237554 237314 237606 238443 239239 239910 240857 241773
55649 241773 241715 240485 238822 237084 234894 232257 229878 228139 226651 224908 222479 218721 213454 207861 203525
55634 203525 200496 197466 193837 190314 187354 184433 181231 178363 176438 175365 174933 175128 175569 175555 175036 174709
55618 174709 174852 174968 174822 174878 175309 175467 174801 173544 172048 170103 167407 164226 161221 158943 157652 157203
55602 157203 156990 156404 155431 154465 153718 153274 153409 154123 154590 153935 152466 151342 151022 150931 150662 150630 151354 152899
55584 152899 155245 158454 162251 166035 169477 172643 175552 178282 181571 186587 193922 203274 214131 226233
55570 226233 239350 253119 267055 280279 291529 300095 306420 311050 313274 311807 306684 299482 291577
$$ packed form
55683B26188m07N95R87J510K712L446K933K384K824L204K305Q05j80q65j600j602
55667B45239n49J67n28j578j568r29p74r10o09j90k17k40K92Q37P96O71R47R16
55649B41773n8j230j663j738k190k637k379j739j488j743k429l758n267n593m336
55634B03525l029l030l629l523k960k921l202k868j925j073m32J95M41j4n19l27
55618A74709J43J16j46N6M31J58o66j257j496j945k696l181l005k278j291m49
55602A57203k13n86r73r66p47m44J35P14M67o55j469j124l20r1k69l2P24J545
55584A52899K346L209L797L784L442L166K909K730L289N016P335R352J0857J2102
55570B26233J3117J3769J3936J3224J1250Q566O325M630K224j467n123p202p905
$$ plain form
55557 291577 283086 273564 262855 251112 238806 226897 216276 206931 198327 190536 184158 179137 174562
55544 174562 169805 165055 160656 156757 153677 151743 150609 149600 148761 148612 148772 147975 145870 143721 142726
55529 142726 142508 141842 140176 137804 135136 132440 129950 127700 125418 122801 119648 115761 111204 106673 103000
55514 103000 100253 97899 95800 94220 92891 91079 88893 87546 87806 88953 89765 89829 89367 88467 87159 85779
55498 85779 84642 83667 82741 82106 82013 82365 82989 83898 84969 85899 86770 88162 90304 92551 94136 95074 95864
55481 95864 96640 97072 96904 96227 95405 95001 95492 96764 98086 98900 99409 100125 101012 101413 100781 99288 97683 96602
55463 96602 96037 95544 94986 94799 95286 95971 96103 95646 95275 95491 96204 97127 98017 98550 98523 98211 98042 97897 97271
55444 97271 96210 95487 95675 96528 97442 98029 98076 97451 96363 95449 95296 95981 97052 97756 97424 95999 94181 92770
$$ packed form
55557B91577q491r522j0709j1743j2306j1909j0621r345q604p791o378n021m575
55544A74562m757m750m399l899l080j934j134j009q39j49J60p97k105k149r95
55529A42726k18o66j666k372k668k696k490k250k282k617l153l887m557m531l673
55514A03000k747k354k099j580j329j812k186j347K60J147Q12O4m62r00j308j380
55498H5779j137r75r26o35r3L52O24R09J071R30Q71J392K142K247J585R38P90
55481I5864P76M32j68o77q22m04M91J272J322Q14N09P16Q87M01o32j493j605j081
55463I6602n65m93n58j87M87O85J32m57l71K16P13R23Q90N33k7l12j69j45o26
55444I7271j061p23J88Q53R14N87M7o25j088r14j53O85J071P04l32j425j818j411
$$ plain form
55426 92770 91912 91266 90650 90128 89723 89561 90069 91466 93243 94743 96069 97786 99931 102013 103802 105403
55410 105403 106672 107384 107813 108318 108491 107645 106091 104916 104469 104067 103304 102561 101985 101061 99545 97878 96307
55393 96307 94545 92683 91476 91223 91284 91179 91333 92184 93369 94361 95129 95639 95503 94735 94056 93781 93164 91537
55375 91537 89398 87650 86490 85846 86131 87567 89265 90016 89748 89263 88792 87764 86011 84373 83838 84530
55359 84530 85639 86124 85562 84581 84305 85145 86355 86897 86392 85099 83534 82466 82639 83951 85344 86058 86583
55342 86583 87778 89480 90706 90999 90836 90799 90997 91356 91965 92961 94305 95713 96681 96739 95822 94271 92361
55325 92361 90136 87829 86019 85072 84743 84633 84718 85111 85588 85738 85413 84855 84545 84967 86157 87380 87676 86862
55307 86862 85562 84217 82769 81536 81516 83226 85817 87972 89270 90109 90761 91147 91240 91058 90509 89691 89127
$$ packed form
55426I2770q58o46o16n22m05j62N08J397J777J500J326J717K145K082J789J601
55410A05403J269P12M29N05J73q46j554j175m47m02p63p43n76r24j516j667j571
55393I6307j762j862j207k53O1j05J54Q51J185R92P68N10j36p68o79k75o17j627
55375I1537k139j748j160o44K85J436J698P51k68m85m71j028j753j638n35O92
55359H4530J109M85n62r81k76Q40J210N42n05j293j565j068J73J312J393P14N25
55342H6583J195J702J226K93j63l7J98L59O09R96J344J408R68N8r17j551j910
55325I2361k225k307j810r47l29j10Q5L93M77J50l25n58l10M22J190J223K96q14
55307H6862j300j345j448j233k0J710K591K155J298Q39O52L86R3j82n49q18n64
$$ plain form
55290 89127 89158 89420 89429 89429 90073 91421 92812 93722 94290 94918 95653 96008 95327 93440 91044 89172 88230 87839 87632
55271 87632 87718 88253 89106 90115 91128 91611 90926 89286 87766 87021 86736 86705 87450 89062 90316 89987 88528
55254 88528 87440 87416 88056 89022 90362 91807 92836 93499 94311 95187 95322 94422 93345 93079 93510 93598 92606 90950
55236 90950 89807 89911 90751 91211 90915 90514 90553 90697 90469 90075 89921 89775 89142 88178 87544 87484 87614 87514 87050
55217 87050 86291 85565 85433 86093 86965 87211 86556 85412 84520 84666 86173 88267 89543 89515 89129 89243 89456 89161
55199 89161 88820 89086 89383 88763 87765 87892 89341 90666 90873 90548 90555 90835 90959 90950 90964 90864 90544 90118 89532 88617
55179 88617 87717 87536 88137 88839 89391 90404 92145 93700 93943 92794 90993 89160 87646 86844 86938 87496 87816
55162 87816 87630 87146 86586 86045 85682 85762 86478 87789 89364 90680 91445 91941 92678 93660 94351 94411 94065 93619 93034
$$ packed form
55290H9127L1K62R%O44J348J391R10N68O28P35L55o81j887k396j872r42l91k07
55271H7632Q6N35Q53J009J013M83o85j640j520p45k85l1P45J612J254l29j459
55254H8528j088k4O40R66J340J445J029O63Q12Q76J35r00j077k66M31Q8r92j656
55236I0950j143J04Q40M60k96m01L9J44k28l94j54j46o33r64o34o0J30j00m64
55217H7050p59p26j32O60Q72K46o55j144q92J46J507K094J276k8l86J14K13k95
55199H9161l41K66K97o20r98J27J449J325K07l25PK80J24rJ4j00l20m26n86r15
55179H8617r00j81O01P02N52J013J741J555K43j149j801j833j514q02R4N58L20
55162H7816j86m84n60n41l63Q0P16J311J575J316P65M96P37R82O91O0l46m46n85
$$ plain form
55143 93034 92244 91486 91031 90820 90660 90610 90907 91648 92713 93893 94930 95573 95777 95821 96094 96762 97660 98431 98783
55124 98783 98640 98058 97011 95455 93636 92120 91302 91104 91327 92041 93299 94684 95529 95586 95195 94890 95026
55107 95026 95677 96603 97437 98086 98815 99725 100440 100604 100391 100194 100097 100054 100278 100966 101810 102301 102363 102236 101951 101434
55087 101434 100995 101150 101969 103023 103905 104401 104355 103831 103251 102848 102135 100483 98119 96039 95053 95350 96741
55070 96741 98675 100234 100844 100955 101426 102323 103013 103272 103553 104129 104748 105167 105383 105325 104952 104590 104463 104088 102967
55051 102967 101677 101178 101097 100045 97850 96143 96101 96876 97077 96766 96930 97745 98517 98957 99450 100193 100893 101319
55033 101319 101533 101565 101377 101122 101062 101249 101537 101786 101860 101576 100893 99989 99000 97923 96938 96488 96753 97258 97270 96489
55013 96489 95269 94311 94148 94688 95308 95675 96278 97672 99351 100167 99901 99588 100067 101009 101751 102263 102759 103086
$$ packed form
55143I3034p90p58m55k11j60n0K97P41J065J180J037O43K04M4K73O68Q98P71L52
55124I8783j43n82j047j556j819j516q18j98K23P14J258J385Q45N7l91l05J36
55107I5026O51R26Q34O49P29R10P15J64k13j97r7m3K24O88Q44M91O2j27k85n17
55087A01434m39J55Q19J054Q82M96m6n24n80m03p13j652k364k080r86K97J391
55070I6741J934J559O10J11M71Q97O90K59K81N76O19M19K16n8l73l62j27l75j121
55051A02967j290m99q1j052k195j707m2P75K01l11J64Q15P72M40M93P43P00M26
55033A01319K14L2j88k55o0J87K88K49P4k84o83r04r89j077r85m50K65N05J2p81
55013I6489j220r58j63N40O20L67O03J394J679Q16k66l13M79R42P42N12M96L27
$$ plain form
54995 103086 103158 103452 104349 105429 106068 106408 107080 108276 109694 111169 112711 114059 114842 115081 115027 114596 113474
54978 113474 111788 110208 109334 109299 109896 110740 111372 111571 111561 111629 111653 111320 110796 110731 111517 112778 113806 114352 114834
54959 114834 115730 116854 117432 116960 115782 114559 113436 112167 110901 110203 110236 110585 111076 112116 113825 115442
54943 115442 116120 115937 115599 115456 115341 115157 115048 115067 115122 115286 115809 116753 117848 118741 119301 119691 120207 120951 121667
54924 121667 122083 122372 123060 124552 127074 130971 136501 143240 150210 156762 162885 168563 173443 177381 180582
54909 180582 182858 183357 181579 178222 174508 171100 168018 165077 161791 157362 151533 145263 139955 136135
54895 136135 133350 131101 129278 127857 126741 125875 125144 124311 123422 123008 123488 124575 125775 127142 128974 130992
54879 130992 132511 133432 134479 136355 139139 142587 146597 151256 156673 162813 169283 175309 180111 183234
$$ packed form
54995A03086P2K94Q97J080O39L40O72J196J418J475J542J348P83K39n4m31j122
54978A13474j686j580q74l5N97Q44O32J99j0O8K4l33n24o5P86J261J028N46M82
54959A14834Q96J124N78m72j178j223j123j269j266o98L3L49M91J040J709J617
54943A15442O78j83l38j43j15j84j09J9N5J64N23R44J095Q93N60L90N16P44P16
54924A21667M16K89O88J492K522L897N530O739O970O552O123N678M880L938L201
54909A80582K276M99j778l357l714l408l082k941l286m429n829o270n308l820
54895A36135k785k249j823j421j116q66p31q33q89m14M80J087J200J367J832K018
54879A30992J519R21J047J876K784L448M010M659N417O140O470O026M802L123
$$ plain form
54865 183234 184484 183938 182288 180719 179873 179072 177068 173455 168947 164434 160312 156638 153366 150289 147138
54850 147138 143878 140714 137825 135222 132810 130396 127778 125004 122362 119994 117838 116022 114875 114267
54836 114267 113551 112536 111870 111871 111666 110359 108542 107527 107394 106980 105781 104660 104407 104721 105110 105843 107259
54819 107259 108817 109643 109723 109884 110698 111878 112726 112852 112469 112181 112461 113289 114340 115466 116710 117884 118448
54802 118448 117997 116657 114982 113643 113222 113938 115480 117286 119023 120552 121569 121751 121328 121050 121347 121943
54786 121943 122512 123273 124543 125973 126742 126446 125410 124141 122857 121711 121159 121704 123252 124998 126157 126778
54770 126778 127643 129381 131925 134865 138104 141965 146758 152505 159048 166254 174013 182022 189626 196039
54756 196039 200891 204409 206763 207409 205505 201058 195150 188894 182679 176636 171172 166545 162341 157989
$$ packed form
54865A83234J250n46j650j569q46q01k004l613m508m513m122l674l272l077l151
54850A47138l260l164k889k603k412k414k618k774k642k368k156j816j147o08
54836A14267p16j015o66Jk05j307j817j015j33m14j199j121k53L14L89P33J416
54819A07259J558Q26Q0J61Q14J180Q48J26l83k88K80Q28J051J126J244J174N64
54802A18448m51j340j675j339m21P16J542J806J737J529J017J82m23k78K97N96
54786A21943N69P61J270J430P69k96j036j269j284j146n52N45J548J746J159O21
54770A26778Q65J738K544K940L239L861M793N747O543P206P759Q009P604O413
54756A96039M852L518K354O46j904m447n908o256o215o043n464m627m204m352
$$ plain form
54742 157989 153537 149392 145579 141861 138470 136066 134897 134478 134191 133842 133564 133512 133761 134303 135098 136214
54726 136214 137772 139596 141191 142342 143480 145188 147586 150578 154317 158914 163860 168376 172289 176066
54712 176066 179944 183466 185913 186821 186109 184111 181462 178579 175262 171125 166391 161839 158008 154811 151996
54697 151996 149583 147689 146123 144347 141876 138893 136372 135208 135078 134630 133036 130791 128607 126292 123427
54682 123427 120605 118957 118676 118938 119162 119425 119701 119609 119110 118662 118483 118366 118317 118585 118915 118560 117385 116220
54664 116220 115646 115082 113605 111318 109370 108838 109915 111935 113879 114973 115051 114411 113413 112331 111411 110734
54648 110734 110181 109741 109640 109845 109846 109454 109389 110352 111822 112662 112686 112664 112920 113060 113171 114039 115763 117210 117507
54629 117507 117202 117316 117924 118367 118346 118171 118243 118723 119366 119465 118405 116586 115257 115115 115584 115746 115425 114943 114436
$$ packed form
54742A57989m452m145l813l718l391k404j169m19k87l49k78n2K49N42P95J116
54726A36214J558J824J595J151J138J708K398K992L739M597M946M516L913L777
54712A76066L878L522K447R08p12j998k649k883l317m137m734m552l831l197k815
54697A51996k413j894j566j776k471k983k521j164j30m48j594k245k184k315k865
54682A23427k822j648k81K62K24K63K76r2m99m48j79j17m9K68L30l55j175j165
54664A16220n74n64j477k287j948n32J077K020J944J094P8o40r98j082r20o77
54648A10734n53m40j01K05Jl92o5R63J470Q40K4k2K56J40J11Q68J724J447K97
54629A17507l05J14O08M43k1j75P2M80O43R9j060j819j329j42M69J62l21m82n07
$$ plain form
54610 114436 113909 113518 113358 113341 113584 114452 115882 117178 117832 118033 118054 117742 117064 116537 116575 116911 117185 117597 118454
54591 118454 119546 120549 121572 122714 123526 123565 123223 123339 124224 125469 126475 126729 125945 124423 123008 122231
54575 122231 121755 121003 120003 119181 118741 118689 119127 120085 121436 123272 125803 128469 129829 129025 126856 124743
54559 124743 123167 121868 120975 120975 121810 122947 124164 125526 126771 127568 128228 129330 130721 131648 131863 131829 131831 131612
54541 131612 131027 130439 130289 130685 131484 132443 133376 134427 135943 137739 138909 138901 138313 137973 137803 137390 137153 137718
54523 137718 138445 137914 135957 133942 132836 132136 131151 130168 129748 129759 129794 129837 129906 129639 128941 128497 128976 130023 130691
54504 130691 130629 130359 130533 131319 132361 133023 132866 132120 131493 131340 131305 130993 130616 130622 130916 130890 130118 128761 127389
54485 127389 126603 126736 127735 129303 131145 132967 134346 134965 135028 135169 135829 136980 138442 140096 141725 143056
$$ packed form
54610A14436n27l91j60j7K43Q68J430J296O54K01K1l12o78n27L8L36K74M12Q57
54591A18454J092J003J023J142Q12L9l42J16Q85J245J006K54p84j522j415p77
54575A22231m76p52j000q22m40n2M38R58J351J836K531K666J360q04k169k113
54559A24743j576j299q93%Q35J137J217J362J245P97O60J102J391R27K15l4Kk19
54541A31612n85n88j50L96P99R59R33J051J516J796J170qn88l40j70m13k37N65
54523A37718P27n31j957k015j106p00r85r83m20J1L5M3O9k67o98m44M79J047O68
54504A30691o2k70J74P86J042O62j57p46o27j53l5l12l77OK94k6p72j357j372
54485A27389p86J33R99J568J842J822J379O19O3J41O60J151J462J654J629J331
$$ plain form
54469 143056 144175 145537 147309 149011 150030 150241 149900 149254 148470 147748 147148 146458 145453 144197 142941 141860
54453 141860 141049 140637 140692 141100 141645 142147 142457 142465 142205 141825 141370 140761 140022 139394 139049 138809 138237 137025 135303
54434 135303 133673 132834 132977 133588 134045 134347 134987 136111 137159 137503 137197 136871 137009 137524 138044 138482 139170 140394
54416 140394 141917 143172 143872 144147 144075 143575 142934 142869 143597 144292 144083 143295 143017 143630 144508 145127 145670 146355 146888
54397 146888 146989 146991 147570 149050 151140 153048 153884 153337 152077 151159 150992 151237 151606 152189 152987 153722 154293 154827
54379 154827 155185 154999 154402 154031 154004 153551 152109 150238 148936 148511 148576 148752 148856 148775 148668 149017 149985 151026
54361 151026 151612 152073 153191 155143 157382 159393 161033 162246 163037 163788 165102 167137 169384 171197 172328
54346 172328 172907 173136 173131 172984 172857 172916 173060 172836 171902 170529 169296 168246 166848 164972 163376 162832 163110 163236
$$ packed form
54469A43056J119J362J772J702J019K11l41o46p84p22o00o90j005j256j256j081
54453A41860q11m12N5M08N45N02L10Qk60l80m55o09p39o28l45k40n72j212j722
54434A35303j630q39J43O11M57L02O40J124J048L44l06l26J38N15N20M38O88J224
54416A40394J523J255P00K75p2n00o41o5P28O95k09p88k78O13Q78O19N43O85N33
54397A46888J01KN79J480K090J908Q36n47j260r18j67K45L69N83P98P35N71N34
54379A54827L58j86n97l71k7m53j442j871j302m25O5J76J04q1j07L49R68J041
54361A51026N86M61J118J952K239K011J640J213P91P51J314K035K247J813J131
54346A72328N79K29nj47j27N9J44k24r34j373j233j050j398j876j596n44K78J26
$$ plain form
54328 163236 162500 160853 158618 156236 154109 152364 150885 149783 149458 149952 150673 151153 151634 152347 152699 151960
54312 151960 150483 149403 149202 149385 149539 149808 150115 149803 148589 147194 146401 145833 144353 141615 138708 137126
54296 137126 137300 138288 138848 138719 138736 139707 141446 143108 144233 145007 145654 146123 146483 147050 147828 148240 147790 146773
54278 146773 145958 145716 145833 146137 146894 148360 150210 151693 152433 152830 153487 154297 154435 153360 151617 150378 150284
54261 150284 150963 151599 151752 151639 151800 152555 153697 154777 155680 156667 157720 158230 157754 156860 156611 157258 157996 158149
54243 158149 157968 157961 157946 157378 156406 156002 156883 158619 160037 160386 159908 159297 158818 158168 157122 155969 155150 154755
54225 154755 154622 154669 154725 154235 152703 150497 148698 147992 148073 148281 148385 148496 148650 148894 149517 150767 152396 153803
54207 153803 154583 154760 154593 154327 154029 153468 152282 150444 148501 147169 146790 147215 147957 148348 147907 146894 146237
$$ packed form
54328A63236p36j647k235k382k127j745j479j102l25M94P21M80M81P13L52p39
54312A51960j477j080k01J83J54K69L07l12j214j395p93n68j480k738k907j582
54296A37126J74R88N60j29J7R71J739J662J125P74O47M69L60N67P78M12m50j017
54278A46773q15k42J17L04P57J466J850J483P40L97O57Q10J38j075j743j239r4
54261A50284O79O36J53j13J61P55J142J080R03R87J053N10m76q94k49O47P38J53
54243A58149j81pj5n68r72m04Q81J736J418L49m78o11m79o50j046j153q19l95
54225A54755j33M7N6m90j532k206j799p06Q1K08J04J11J54K44O23J250J629J407
54207A53803P80J77j67k66k98n61j186j838j943j332l79M25P42L91m41j013o57
$$ plain form
54190 146237 146549 147403 147950 148046 148251 148861 149493 149702 149541 149373 149495 150014 150778 151319 151258 150834 150740 151379 152603
54171 152603 154116 155589 156406 156023 154881 154258 154772 155524 155243 153746 151711 149593 147586 146265 146212 147036
54155 147036 147664 147717 147799 148289 148701 148573 148182 147913 147580 146957 146483 146778 147798 148981 149942 150518 150473 149820 149278
54136 149278 149720 151128 152578 153346 153580 153859 154484 155331 156094 156533 156661 156723 156856 156898 156801 156993 157939 159408 160670
54117 160670 161365 161753 162035 161968 161349 160460 159768 159476 159586 160181 161326 162818 164190 165000 165139 164977 165100 165657
54099 165657 166079 165727 164729 163745 163024 162283 161562 161524 162544 164122 165617 167093 168908 170822 172127 172517 172301
54082 172301 171827 171205 170575 170201 170231 170660 171570 173062 174938 176725 178086 179027 179756 180606 182007 184101 186348
54065 186348 187946 188788 189662 191267 193371 195312 197065 199361 202776 207118 211877 216939 222552 228689 234700
$$ packed form
54190A46237L12Q54N47R6K05O10O32K09j61j68J22N19P64N41o1m24r4O39J224
54171A52603J513J473Q17l83j142o23N14P52k81j497k035k118k007j321n3Q24
54155A47036O28N3Q2M90M12j28l91k69l33o23m74K95J020J183R61N76m5o53n42
54136A49278M42J408J450P68K34K79O25Q47P63M39J28O2J33M2r7J92R46J469J262
54117A60670O95L88K82o7o19q89o92k92J10N95J145J492J372Q10J39j62J23N57
54099A65657M22l52r98r84p21p41p21l8J020J578J495J476J815J914J305L90k16
54082A72301m74o22o30l74L0M29R10J492J876J787J361R41P29Q50J401K094K247
54065A86348J598Q42Q74J605K104J941J753K296L415M342M759N062N613O137O011
$$ plain form
54050 234700 239628 242748 243861 243283 241644 239581 237517 235753 234658 234515 235124 235902 236577 237532 239285 241917
54034 241917 245379 249948 255829 262412 268591 273840 278421 282516 285921 288778 291802 295239 298238 299887
54020 299887 300443 300844 301393 301710 301743 301940 302294 302037 300542 297935 294553 290321 285169 279640 274536 270083
54004 270083 265907 261804 258134 255240 252744 249711 245574 240742 236222 232697 230133 228167 226542 225036
53990 225036 223304 221111 218682 216529 214997 214100 213669 213446 213161 212812 212752 213137 213401 212769 211366 210281 210235
53973 210235 210584 210068 208391 206637 206147 207308 209502 211885 214014 215874 217630 219440 221363 223340 225286
53958 225286 227280 229588 232440 235803 239463 243262 247129 250933 254488 257693 260513 262851 264722 266534
53944 266534 268824 271581 274158 276153 278029 280530 283706 286931 289753 292294 294887 297702 300768 303932
$$ packed form
54050B34700M928L120J113n78j639k063k064j764j095j43O09P78O75R55J753K632
54034B41917L462M569N881O583O179N249M581M095L405K857L024L437K999J649
54020B99887N56M01N49L17L3J97L54k57j495k607l382m232n152n529n104m453
54004B70083m176m103l670k894k496l033m137m832m520l525k564j966j625j506
53990B25036j732k193k429k153j532q97m31k23k85l49o0L85K64o32j403j085m6
53973B10235L49n16j677j754m90J161K194K383K129J860J756J810J923J977J946
53958B25286J994K308K852L363L660L799L867L804L555L205K820K338J871J812
53944B66534K290K757K577J995J876K501L176L225K822K541K593K815L066L164
$$ plain form
53930 303932 306757 308786 310118 311437 313321 315694 318092 320341 322897 326558 331800 338263 344917 350921
53916 350921 356319 361833 368159 375668 384491 394363 404492 414194 423735 434036 445403 457077 468216
53903 468216 478632 488120 495725 500358 501856 500678 496814 489849 480161 469231 458385 447733 436709
53890 436709 425200 413689 402598 392021 381942 372284 362737 352986 343180 333860 325350 317514 310229
53877 310229 303787 298516 294194 290144 285873 281472 277421 274110 271454 268754 265100 260183 254800 250296
53863 250296 247394 245725 244463 243193 241980 240882 239716 238264 236526 234680 232925 231386 230121 229163
53849 229163 228532 228201 228088 228104 228150 228017 227422 226297 225002 224024 223470 222989 222143 220740 218914 217108 215839
53832 215839 215133 214332 212940 211646 211862 213974 216603 218035 217981 217488 217498 218097 219009 220157 221572 223147 224708
$$ packed form
53930C03932K825K029J332J319J884K373K398K249K556L661N242O463O654O004
53916C50921N398N514O326P509Q823R872J0129R702R541J0301J1367J1674J1139
53903D68216J0416R488P605M633J498j178l864o965r688j0930j0846j0652j1024
53890D36709j1509j1511j1091j0577j0079r658r547r751r806r320q510p836p285
53877C10229o442n271m322m050m271m401m051l311k656k700l654m917n383m504
53863B50296k902j669j262j270j213j098j166j452j738j846j755j539j265r58
53849B29163o31l31j13J6M6j33n95j125j295r78n54m81q46j403j826j806j269
53832B15839p06q01j392j294K16K112K629J432n4m93J0N99R12J148J415J575J561
$$ plain form
53815 224708 226160 227535 228949 230454 231827 232731 233265 234154 236097 239068 242508 246086 249965 254437 259518
53800 259518 264871 269959 274461 278673 283198 288095 292734 296809 300909 305563 310131 313499 315626 317606
53786 317606 320221 323161 325711 327448 328076 327351 325540 323463 321770 320438 319116 317475 315155 311862 307742
53771 307742 303255 298532 293351 287866 282806 278686 275287 272078 268690 264869 260581 256428 253343 251509
53757 251509 250115 248383 246209 243548 240128 236406 233878 233456 234057 233810 232254 230356 228702 226920 224939
53742 224939 223588 223500 224246 225068 225791 226520 226979 226832 226366 226258 226720 227324 227724 228247 229577 231915 234570 236488
53724 236488 237224 237318 237674 238685 240092 241486 242674 243618 244397 245281 246629 248518 250615 252499 254043 255441
53708 255441 256951 258693 260669 262855 265158 267301 268996 270447 272439 275529 279189 282307 284590 286928
$$ packed form
53815B24708J452J375J414J505J373R04N34Q89J943K971L440L578L879M472N081
53800B59518N353N088M502M212M525M897M639M075M100M654M568L368K127J980
53786C17606K615K940K550J737O28p25j811k077j693j332j322j641k320l293m120
53771C07742m487m723n181n485n060m120l399l209l388l821m288m153l085j834
53757B51509j394j732k174k661l420l722k528m22O01k47j556j898j654j782j981
53742B24939j351q8P46Q22P23P29M59j47m66j08M62O04M00N23J330K338K655J918
53724B36488P36R4L56J011J407J394J188R44P79Q84J348J889K097J884J544J398
53708B55441J510J742J976K186K303K143J695J451J992L090L660L118K283K338
$$ plain form
53694 286928 290116 293854 297395 300569 303504 305827 307016 307429 308057 309208 310140 310187 309584 308886 308227 307538
53678 307538 307077 307201 307793 308315 308387 308106 307820 307745 307751 307487 306783 305891 305192 304755 304427 304243 304353 304534 304240 303302
53658 303302 302151 301165 300193 298978 297685 296650 295866 295153 294612 294497 294758 295174 295903 297443 299821 302221
53642 302221 303709 304171 304293 304658 305187 305529 305705 306102 306953 308162 309681 311686 314193 316777 319040 321158
53626 321158 323586 326304 328824 330937 333065 335722 339052 342995 347516 352355 356945 360949 364695 368722
53612 368722 373068 377328 381263 385002 388716 392492 396531 401075 406033 410962 415528 419709 423456 426504
53598 426504 428744 430559 432479 434632 436807 438913 441006 442880 444106 444680 445229 446214 447096 446740 444636
53583 444636 441360 437832 434491 431367 428520 426040 423766 421356 418599 415569 412602 410308 409294 409488
$$ packed form
53694B86928L188L738L541L174K935K323J189M13O28J151R32M7o03o98o59o89
53678C07538m61J24N92N22P2k81k86p5Ok64p04q92o99m37l28j84J10J81k94r38
53658C03302j151r86r72j215j293j035p84p13n41j15K61M16P29J540K378K400
53642C02221J488M62J22L65N29L42J76L97Q51J209J519K005K507K584K263K118
53626C21158K428K718K520K113K128K657L330L943M521M839M590M004L746M027
53612C68722M346M260L935L739L714L776M039M544M958M929M566M181L747L048
53598D26504K240J815J920K153K175K106K093J874J226N74N49R85Q82l56k104
53583D44636l276l528l341l124k847k480k274k410k757l030k967k294j014J94
$$ plain form
53569 409488 409826 409056 406963 404482 402615 401536 400826 400239 399995 400525 402080 404464 407017 409043 410355 411329
53553 411329 412407 413710 415108 416390 417350 418029 418968 420870 423822 427182 430454 433935 438177 443100 448081
53538 448081 452790 457563 462918 469053 475757 482605 489244 495817 503058 511725 521945 533266 545191
53525 545191 557389 569554 581567 593848 607064 621390 636402 651793 667758 684449 701584
53514 701584 718938 736886 755966 776176 797164 818936 841780 865446 888973 911551 933232
53503 933232 954599 976047 997631 1019373 1041369 1063644 1086062 1108307 1129870 1150312 1169736
53492 1169736 1188826 1208110 1227270 1245515 1262536 1278765 1294699 1310423 1325970 1341697 1357909
53481 1357909 1374295 1390146 1405020 1418903 1431712 1443034 1452516 1460297 1466822 1472229 1475999 1477274
$$ packed form
53569D09488L38p70k093k481j867j079p10n87k44N30J555K384K553K026J312R74
53553D11329J078J303J398J282R60O79R39J902K952L360L272L481M242M923M981
53538D48081M709M773N355O135O704O848O639O573P241Q667J0220J1321J1925
53525E45191J2198J2165J2013J2281J3216J4326J5012J5391J5965J6691J7135
53514G01584J7354J7948J9080K0210K0988K1772K2844K3666K3527K2578K1681
53503I33232K1367K1448K1584K1742K1996K2275K2418K2245K1563K0442J9424
53492A169736J9090J9284J9160J8245J7021J6229J5934J5724J5547J5727J6212
53481A357909J6386J5851J4874J3883J2809J1322R482P781O525N407L770J275
$$ plain form
53469 1477274 1475574 1471295 1465401 1458597 1450850 1441852 1431692 1420769 1409197 1396756 1383543 1370179
53457 1370179 1357055 1343682 1329132 1312997 1295583 1277320 1258428 1239191 1220119 1201557 1183305
53446 1183305 1164922 1146441 1128679 1112748 1099226 1087798 1077714 1068515 1060177 1052640 1045622 1039207
53434 1039207 1034247 1031604 1030947 1030848 1030322 1029890 1030821 1033631 1037869 1043214 1050209 1059628 1071436 1084749 1098716
53419 1098716 1113119 1128096 1143713 1160195 1178392 1199399 1223400 1249200 1275383 1301796 1329535
53408 1329535 1359526 1391628 1425209 1460078 1496522 1534824 1575097 1617292 1661003 1705476 1750193
53397 1750193 1795290 1841160 1887956 1935813 1985143 2036034 2087583 2138573 2188739 2238604 2288078
53386 2288078 2336099 2381937 2425950 2468545 2509151 2546888 2581654 2613874 2643577 2670461 2694491
$$ packed form
53469A477274j700m279n894o804p747q998j0160j0923j1572j2441j3213j3364
53457A370179j3124j3373j4550j6135j7414j8263j8892j9237j9072j8562j8252
53446A183305j8383j8481j7762j5931j3522j1428j0084r199q338p537p018o415
53434A039207m960k643o57r9n26m32R31K810M238N345O995R419J1808J3313J3967
53419A098716J4403J4977J5617J6482J8197K1007K4001K5800K6183K6413K7739
53408A329535K9991L2102L3581L4869L6444L8302M0273M2195M3711M4473M4717
53397A750193M5097M5870M6796M7857M9330N0891N1549N0990N0166M9865M9474
53386B288078M8021M5838M4013M2595M0606L7737L4766L2220K9703K6884K4030
$$ plain form
53375 2694491 2715602 2733009 2745696 2753573 2757396 2757432 2752868 2742614 2726126 2703402 2674927 2641829
53363 2641829 2605444 2566477 2525109 2482009 2438359 2394501 2349391 2302166 2253705 2205920 2159969
53352 2159969 2115859 2073352 2032235 1991792 1951001 1909496 1867689 1825812 1783590 1741169 1699597
53341 1699597 1659875 1622019 1585631 1550958 1518641 1488566 1459713 1431350 1403889 1378320 1355131
53330 1355131 1334043 1314489 1296027 1278426 1261656 1245755 1230455 1215084 1199221 1183481 1169251
53319 1169251 1157415 1147593 1138776 1130440 1122805 1116322 1111338 1108114 1106719 1106862 1108140 1110468 1113968 1118522
53305 1118522 1123878 1130252 1138359 1148594 1160572 1173714 1187934 1203450 1220232 1238053 1256909 1277015
53293 1277015 1298409 1320923 1344466 1368984 1394007 1418494 1441350 1462099 1481049 1498810 1515635
$$ packed form
53375B694491K1111J7407J2687P877L823L6m564j0254j6488k2724k8475l3098
53363B641829l6385l8967m1368m3100m3650m3858m5110m7225m8461m7785m5951
53352B159969m4110m2507m1117m0443m0791m1505m1807m1877m2222m2421m1572
53341A699597l9722l7856l6388l4673l2317l0075k8853k8363k7461k5569k3189
53330A355131k1088j9554j8462j7601j6770j5901j5300j5371j5863j5740j4230
53319A169251j1836r822q817q336p635o483m984l224j395J43J278K328L500M554
53305A118522N356O374Q107J0235J1978J3142J4220J5516J6782J7821J8856K0106
53293A277015K1394K2514K3543K4518K5023K4487K2856K0749J8950J7761J6825
$$ plain form
53282 1515635 1531224 1545179 1557453 1568154 1576983 1583294 1586855 1588145 1587626 1585022 1579721 1571785 1562140
53269 1562140 1551678 1540350 1527189 1511153 1491960 1470270 1447093 1423112 1398638 1374000 1349507
53258 1349507 1324946 1299587 1272950 1245317 1217331 1189461 1162086 1135673 1110425 1086063 1062342
53247 1062342 1039445 1017365 995248 972008 947505 922530 897751 873302 849367 826437 804774
53236 804774 784175 764486 745901 728529 712157 696714 682549 669945 658599 647845 637134
53225 637134 626119 614583 602620 590633 578820 566793 554006 540469 526741 513254 499949
53214 499949 486654 473590 461270 449975 439518 429687 420748 413170 406831 400902 394705 388340 382125
53201 382125 375780 368744 361162 353931 347639 341976 336422 331054 326418 322866 320225 317940 315357 312052
$$ packed form
53282A515635J5589J3955J2274J0701Q829O311L561J290n19k604n301p936r645
53269A562140j0462j1328j3161j6036j9193k1690k3177k3981k4474k4638k4493
53258A349507k4561k5359k6637k7633k7986k7870k7375k6413k5248k4362k3721
53247A062342k2897k2080k2117k3240k4503k4975k4779k4449k3935k2930k1663
53236H04774k0599j9689j8585j7372j6372j5443j4165j2604j1346j0754j0711
53225F37134j1015j1536j1963j1987j1813j2027j2787j3537j3728j3487j3305
53214D99949j3295j3064j2320j1295j0457r831q939p578o339n929o197o365o215
53201C82125o345p036p582p231o292n663n554n368m636l552k641k285k583l305
$$ plain form
53187 312052 308058 303760 299527 295563 292012 289027 286715 285121 284127 283226 281686 279369 277112 275745 274901
53172 274901 273453 271047 268485 266472 264848 263383 262556 262934 264184 265267 265415 264637 263581 263149 263857 265181
53156 265181 265813 264891 262708 260070 257451 255077 253285 252191 251382 250511 249873 249832 249988 249620 248799 248299 248366
53139 248366 248269 247297 245743 244665 244891 246353 248189 249469 250004 250356 250886 251086 250241 248530 246956 246275 246490
53122 246490 247374 248849 250688 252352 253418 253930 254176 254429 254971 255955 257039 257538 257183 256466 255983 255712 255259
53105 255259 254496 253583 252486 250959 249017 247069 245508 244412 243738 243487 243503 243402 243026 242740 242920 243231 242920
53088 242920 241862 240802 240351 240241 240012 239918 240521 241646 242532 242981 243552 244465 245081 244865 244217 243808 243549 242764
53070 242764 241155 239145 237479 236776 237175 238018 238232 237484 236695 236940 238106 239151 239432 239125 238491 237478 236199
$$ packed form
53187C12052l994m298m233l964l551k985k312j594r94r01j540k317k257j367q44
53172B74901j448k406k562k013j624j465q27L78J250J083J48p78j056m32P08J324
53156B65181O32r22k183k638k619k374j792j094q09q71o38m1J56l68q21n00O7
53139B48366r7r72j554j078K26J462J836J280N35L52N30K00q45j711j574o81K15
53122B46490Q84J475J839J664J066N12K46K53N42R84J084M99l55p17m83k71m53
53105B55259p63r13j097j527j942j948j561j096o74k51J6j01l76k86J80L11l11
53088B42920j058j060m51j10k29r4O03J125Q86M49N71R13O16k16o48m09k59p85
53070B42764j609k010j666p03L99Q43K14p48p89K45J166J045K81l07o34j013j279
$$ plain form
53053 236199 235162 234759 234935 235562 236764 238577 240534 241864 242117 241486 240576 239839 239232 238447 237455 236539 235767
53036 235767 234778 233414 232224 231972 232797 234128 235272 235796 235598 234974 234446 234233 234121 234103 234641 235825 236759
53019 236759 236549 235619 235249 235948 237056 237830 238077 237727 236720 235524 234990 235404 236300 237356 238651 239879 240213
53002 240213 239431 238407 237927 237734 237397 237404 238545 240566 242295 243048 243276 243818 245052 246808 248697 250338 251531
52985 251531 252316 252854 253288 253697 254014 254015 253606 253120 252990 253178 253412 253974 255666 258731 262341 265426 267606 269095
52967 269095 270264 271616 273605 275968 277687 278093 277633 277145 276843 276535 276282 276162 275698 274294 272125 270032
52951 270032 268632 267957 267702 267357 266322 264410 262132 260058 258223 256554 255412 255062 255011 254640 254150 254092 254250
52934 254250 253914 253061 252270 251559 250367 248758 247541 246994 246506 245810 245495 245798 245974 245573 245399 246229 247299
$$ packed form
53053B36199j037m03J76O27J202J813J957J330K53o31r10p37o07p85r92r16p72
53036B35767r89j364j190k52Q25J331J144N24j98o24n28k13j12j8N38J184R34
53019B36759k10r30l70O99J108P74K47l50j007j196n34M14Q96J056J295J228L34
53002B40213p82j024m80j93l37PJ141K021J729P53K28N42J234J756J889J641J193
52985B51531P85N38M34M09L17Jm09m86j30J88K34N62J692L065L610L085K180J489
52967B69095J169J352J989K363J719M06m60m88l02l08k53j20m64j404k169k093
52951B70032j400o75k55l45j035j912k278k074j835j669j142l50n1l71m90n8J58
52934B54250l36q53p91p11j192j609j217n47m88o96l15L03J76m01j74Q30J070
$$ plain form
52917 247299 247118 245501 243809 243231 243608 243960 243533 242284 240851 240136 240541 241554 242287 242380 242068 241551 240727
52900 240727 239569 238413 237765 237913 238732 239786 240672 241329 241810 241889 241319 240631 241050 243171 246077 248256 249069
52883 249069 248876 248100 246938 245836 245446 245920 246751 247434 247878 248137 248193 248141 248129 248047 247666 247222 247364 248379 249884
52864 249884 251552 253654 256462 259412 261363 261631 260551 259077 258028 257615 257482 257166 256557 255810 254839 253256
52848 253256 250974 248601 246905 245962 245095 243631 241564 239495 238001 237063 236135 234839 233461 232492 231788 230686
52832 230686 229056 227666 227144 227138 227070 227266 228507 230561 232005 231812 230437 229040 228136 227456 226713 225944 225260
52815 225260 224732 224510 224637 224763 224403 223627 223206 223901 225749 228148 230448 232237 233235 233280 232588 231771 231360 231326
52797 231326 231241 230837 230123 229021 227283 224991 222812 221390 220676 220240 220096 220698 222027 223186 223239 222208 220991
$$ packed form
52917B47299j81j617j692n78L77L52m27j249j433p15M05J013P33R3l12n17q24
52900B40727j158j156o48J48Q19J054Q86O57M81P9n70o88M19K121K906K179Q13
52883B49069j93p76j162j102l90M74Q31O83M44K59N6n2j2q2l81m44J42J015J505
52864B49884J668K102K808K950J951K68j080j474j049m13j33l16o09p47r71j583
52848B53256k282k373j696r43q67j464k067k069j494r38r28j296j378r69p04j102
52832B30686j630j390n22oo8J96J241K054J444j93j375j397r04o80p43p69o84
52815B25260n28k22J27J26l60p76m21O95J848K399K300J789R98M5o92q17m11l4
52797B31326q5m04p14j102j738k292k179j422p14m36j44O02J329J159N3j031j217
$$ plain form
52780 220991 220497 221065 222518 224412 226282 227875 229187 230178 230573 230098 228867 227364 226080 225218 224684 224230
52764 224230 223704 223298 223476 224479 225988 227377 228212 228349 227749 226472 224857 223441 222602 222408 222748 223413 224078
52747 224078 224508 224924 225906 227760 230054 231994 233199 233987 234885 236035 237180 238178 239299 240912 243042 245417
52731 245417 247826 250154 252102 253306 253860 254391 255350 256512 257380 257799 257854 257485 256651 255650 254770 253750 252089
52714 252089 249864 247720 246046 244699 243589 242978 242968 243190 243241 243023 242417 241137 239303 237698 237020 237115 237393
52697 237393 237664 238126 238792 239492 240334 241564 242996 244049 244483 244702 245231 246224 247571 249088 250463 251318 251584
52680 251584 251629 251869 252325 252647 252434 251458 249788 247837 246205 245327 245222 245554 245881 246004 246203 247010 248498 249928
52662 249928 250497 250381 250547 251400 252198 252196 251926 252681 254874 257560 259664 261124 262536 264132 265567 266506 266964
$$ packed form
52780B20991m94N68J453J894J870J593J312R91L95m75j231j503j284q62n34m54
52764B24230n26m06J78J003J509J389Q35J37o00j277j615j416q39j94L40O65O65
52747B24078M30M16R82J854K294J940J205P88Q98J150J145R98J121J613K130K375
52731B45417K409K328J948J204N54N31R59J162Q68M19N5l69q34j001q80j020j661
52714B52089k225k144j674j347j110o11j0K22N1k18o06j280j834j605o78R5K78
52697B37393K71M62O66P00Q42J230J432J053M34K19N29R93J347J517J375Q55K66
52680B51584M5K40M56L22k13r76j670j951j632q78j05L32L27J23J99Q07J488J430
52662B49928N69j16J66Q53P98kk70P55K193K686K104J460J412J596J435R39M58
$$ plain form
52645 266964 267044 266693 265892 264823 263700 262532 261200 259711 258312 257378 257168 257533 257794 257149 255426 253391
52629 253391 252078 251903 252606 253946 255959 258410 260456 261323 261200 261022 261315 261617 261211 260165 259351 259505 260543
52612 260543 261834 262904 263655 264020 263716 262585 261079 260136 260409 261751 263462 264956 266059 266849 267486 268166
52596 268166 268951 269555 269528 268882 268384 268936 270638 272611 273773 273656 272557 271194 270348 270553 271751 273276 274390
52579 274390 274933 275379 276290 277815 279650 281252 282102 281975 281073 279852 278731 278054 278168 279168 280568 281570
52563 281570 281825 281594 281093 280077 278373 276406 274786 273606 272558 271528 270625 269815 269052 268640 268886 269409
52547 269409 269422 268749 268048 267871 268130 268641 269540 270785 271771 271939 271404 270606 269734 268934 268600 268875 269190 269029 268925
52528 268925 269920 272043 274048 274819 274401 273487 272522 271684 271188 271113 271166 271058 270929 271143 271837 272932 274350 275915
$$ packed form
52645B66964Q0l51q01j069j123j168j332j489j399r34k10L65K61o45j723k035
52629B53391j313j75P03J340K013K451K046Q67j23j78K93L02m06j046q14J54J038
52612B60543J291J070P51L65l04j131j506r43K73J342J711J494J103P90O37O80
52596B68166P85O04k7o46m98N52J702J973J162j17j099j363q46K05J198J525J114
52579B74390N43M46R11J525J835J602Q50j27r02j221j121o77J14J000J400J002
52563B81570K55k31n01j016j704j967j620j180j048j030r03q10p63m12K46N23
52547B69409J3o73p01j77K59N11Q99J245R86J68n35p98q72q00l34K75L15j61j04
52528B68925R95K123K005P71m18r14r65q38m96p5N3j08j29K14O94J095J418J565
$$ plain form
52510 275915 277309 278514 280097 282590 285677 288494 290694 292663 294616 296102 296718 296785 296813 296627 295557 293385
52494 293385 290589 287747 285161 283035 281502 280383 279318 278253 277393 276685 275879 275242 275539 276962 278608
52479 278608 279519 279768 280012 280505 281198 282329 284026 285554 285928 285291 284834 285274 286233 287292 288705 290671 292721
52462 292721 294390 295926 297812 300044 302344 304584 306504 307495 307245 306253 305151 303858 302013 299889 298158
52447 298158 296863 295335 293162 290723 288679 287356 286676 286355 286128 285957 285974 286086 285914 285325 284728 284457 284199
52430 284199 283417 282048 280369 278545 276873 276111 276720 277980 278659 278574 278744 279940 281874 283935 285930 287741
52414 287741 289025 289793 290837 293030 296477 300676 305232 310008 314883 319836 325219 331567 338967 346677
52400 346677 353394 357961 359987 359850 358087 354971 350854 346610 343214 340866 338932 336785 334334 331762
$$ packed form
52510B75915J394J205J583K493L087K817K200J969J953J486O16O7K8j86j070k172
52494B93385k796k842k586k126j533j119j065j065q60p08q06o37K97J423J646
52479B78608R11K49K44M93O93J131J697J528L74o37m57M40R59J059J413J966K050
52462B92721J669J536J886K232K300K240J920R91k50r92j102j293j845k124j731
52447B98158j295j528k173k439k044j323o80l21k27j71J7J12j72n89n97k71k58
52430B84199p82j369j679j824j672p62O09J260O79q5J70J196J934K061J995J811
52414B87741J284P68J044K193L447M199M556M776M875M953N383O348P400P710
52400C46677O717M567K026j37j763l116m117m244l396k348j934k147k451k572
$$ plain form
52386 331762 329276 327259 326207 326187 326661 327069 327424 328182 329759 332268 335464 338812 341751 343979 345488 346571
52370 346571 348065 351169 356382 362696 368473 373142 377335 381372 384470 385790 385542 384602 383634 383033 383152
52355 383152 383973 384915 385465 385719 385986 386278 386643 387521 389233 391422 393561 395749 398488 401933 405863 410124
$$ packed form
52386C31762k486k017j052k0M74M08L55P58J577K509L196L348K939K228J509J083
52370C46571J494L104N213O314N777M669M193M037L098J320k48r40r68o01J19
52355C83152Q21R42N50K54K67K92L65Q78J712K189K139K188K739L445L930M261
$$ [...]
##END NTUPLES=NMR SPECTRUM
##END=
