
##TITLE=AC1214_MBOAH12040_5946941_p5poUjc0Yj
##JCAMPDX= 6.0         $$ Bruker NMR JCAMP-DX V2.0
##DATA TYPE= NMR SPECTRUM
##DATA CLASS= NTUPLES
##ORIGIN= BRUKER
##OWNER= Administrator
$$ 1.72 TOPSPIN		Version 2.1
$$ 2012-04-11 04:20:57.656 -0500  Administrator@TOPSPIN
$$ Compression mode = diff/dup
##.OBSERVE FREQUENCY= 400.13188235
##.OBSERVE NUCLEUS= ^1H
##.ACQUISITION MODE= SIMULTANEOUS (DQD)
##.ACQUISITION SCHEME= undefined
##.AVERAGES= 8
##.DIGITISER RES= 22
##SPECTROMETER/DATA SYSTEM= spect
##.PULSE SEQUENCE= zg30
##.SOLVENT NAME= COFFEE_meoh
##.SHIFT REFERENCE= INTERNAL, COFFEE_meoh, 1, 14.98061
##AUDIT TRAIL= $$ (NUMBER, WHEN, WHO, WHERE, PROCESS, VERSION, WHAT)
$$ ##TITLE= Audit trail, TOPSPIN		Version 2.1
$$ ##JCAMPDX= 5.01
$$ ##ORIGIN= Bruker BioSpin GmbH
$$ ##OWNER= Administrator
$$ $$ C:\Bruker\TOPSPIN/data/COFFEE/nmr/AC1214_MBOAH12040_5946941_p5poUjc0Yj/10/pdata/1/auditp.txt
$$ ##AUDIT TRAIL=  $$ (NUMBER, WHEN, WHO, WHERE, PROCESS, VERSION, WHAT)
(   1,<2012-04-11 04:20:50.640 -0500>,<Administrator>,<TOPSPIN>,<go>,<TOPSPIN 2.1>,
      <created by zg
	started at 2012-04-11 04:19:44.046 -0500,
	POWCHK enabled, PULCHK disabled,
       configuration hash MD5:
       1A 1E CE 29 27 FD 77 03 67 4E F0 E3 C4 B2 CB 90
       data hash MD5: 64K
       59 75 B0 11 D0 8D 4C C8 01 8B 78 83 E6 F0 64 BA>)
(   2,<2012-04-11 04:20:53.250 -0500>,<Administrator>,<TOPSPIN>,<proc1d>,<TOPSPIN 2.1>,
      <Start of raw data processing
       efp LB = 0 FT_mod = 6 PKNL = 1 PHC0 = 0 PHC1 = 0 SI = 32K 
       data hash MD5: 32K
       7C E0 28 9A 67 C7 FD 9B 3E 0F 4F 30 34 BD E5 6F>)
(   3,<2012-04-11 04:20:53.671 -0500>,<Administrator>,<TOPSPIN>,<proc1d>,<TOPSPIN 2.1>,
      <pk PHC0 = 210.0861 PHC1 = 0 
       data hash MD5: 32K
       4A B8 F6 10 13 9A 5E D5 CA A9 D0 2B 6E AD 37 3C>)
(   4,<2012-04-11 04:20:53.781 -0500>,<Administrator>,<TOPSPIN>,<proc1d>,<TOPSPIN 2.1>,
      <abs ABSG = 1 
       data hash MD5: 32K
       34 D0 BA F4 7A EF 15 9A 55 F5 6F 72 82 F9 22 7F>)
(   5,<2012-04-11 04:20:53.812 -0500>,<Administrator>,<TOPSPIN>,<proc1d>,<TOPSPIN 2.1>,
      <abs ABSG = 2 
       data hash MD5: 32K
       DF 30 47 2F 74 16 75 56 C1 99 1D 5D 57 64 FB BC>)
(   6,<2012-04-11 04:20:53.843 -0500>,<Administrator>,<TOPSPIN>,<proc1d>,<TOPSPIN 2.1>,
      <abs ABSG = 3 
       data hash MD5: 32K
       06 5E D4 A9 5E A6 84 4C 68 7A E1 6B A6 C0 57 0C>)
(   7,<2012-04-11 04:20:53.875 -0500>,<Administrator>,<TOPSPIN>,<proc1d>,<TOPSPIN 2.1>,
      <abs ABSG = 4 
       data hash MD5: 32K
       FC C4 D6 BE 47 F9 0D 5E 9A E8 59 C8 8D 9F 53 D4>)
(   8,<2012-04-11 04:20:53.890 -0500>,<Administrator>,<TOPSPIN>,<proc1d>,<TOPSPIN 2.1>,
      <abs ABSG = 5 
       data hash MD5: 32K
       4D 77 FC D3 2E 50 4C 55 61 50 03 32 ED 7E 16 63>)
$$ ##END=
$$ 
$$ $$ hash MD5
$$ $$ D3 DB D8 EC BB 1F FF 6C 16 BF A4 1C 85 45 37 34
##$RELAX= 
##$RELAX= 
##$RELAX= 
##$RELAX= 
##$RELAX= 
##$RELAX= 
##$RELAX= 
$$ Bruker specific parameters
$$ --------------------------
$$ [...]
##$TP= (0..7)
150 150 150 150 150 150 150 150
##$TP07= 0
##$TPNAME0= <>
##$TPNAME1= <>
##$TPNAME2= <>
##$TPNAME3= <>
##$TPNAME4= <>
##$TPNAME5= <>
##$TPNAME6= <>
##$TPNAME7= <>
##$TPOAL= (0..7)
0.5 0.5 0.5 0.5 0.5 0.5 0.5 0.5
##$TPOFFS= (0..7)
0 0 0 0 0 0 0 0
##$TUNHIN= 0
##$TUNHOUT= 0
##$TUNXOUT= 0
##$USERA1= <user>
##$USERA2= <user>
##$USERA3= <user>
##$USERA4= <user>
##$USERA5= <user>
##$V9= 5
##$VALIST= <valist>
##$VCLIST= <CCCCCCCCCCCCCCC>
##$VD= 0
##$VDLIST= <DDDDDDDDDDDDDDD>
##$VPLIST= <PPPPPPPPPPPPPPP>
##$VTLIST= <TTTTTTTTTTTTTTT>
##$WBST= 1024
##$WBSW= 4
##$XGAIN= (0..3)
0 0 0 0
##$XL= 0
##$YL= 0
##$YMAX_a= 484519
##$YMIN_a= -603194
##$ZGOPTNS= <>
##$ZL1= 120
##$ZL2= 120
##$ZL3= 120
##$ZL4= 120
##$ABSF1= 14.98061
##$ABSF2= -5.57192
##$ABSG= 5
##$ABSL= 3
##$ALPHA= 0
##$AQORDER= 0
##$ASSFAC= 0
##$ASSFACI= 0
##$ASSFACX= 0
##$ASSWID= 0
##$AUNMP= <proc_prof1d_extract_pilot.lims>
##$AXLEFT= 0
##$AXNAME= <>
##$AXNUC= <1H>
##$AXRIGHT= 0
##$AXTYPE= 0
##$AXUNIT= <>
##$AZFE= 0.1
##$AZFW= 0.1
##$BCFW= 0
##$BC_mod= 0
##$BYTORDP= 0
##$COROFFS= 0
##$CY= 15
##$DATMOD= 1
##$DC= 0
##$DFILT= <>
##$DTYPP= 0
##$F1P= 0
##$F2P= 0
##$FCOR= 0.5
##$FTSIZE= 32768
##$FT_mod= 6
##$GAMMA= 0
##$GB= 0
##$INTBC= 1
##$INTSCL= 1
##$ISEN= 128
##$LB= 0
##$LEV0= 0
##$LPBIN= 0
##$MAXI= 10000
##$MC2= 0
##$MEAN= 0
##$ME_mod= 0
##$MI= 0
##$NCOEF= 0
##$NC_proc= -8
##$NLEV= 6
##$NOISF1= 0
##$NOISF2= 0
##$NSP= 0
##$NTH_PI= 0
##$NZP= 0
##$OFFSET= 14.98061
##$PC= 1
##$PHC0= 210.0861
##$PHC1= 0
##$PH_mod= 1
##$PKNL= yes
##$PPARMOD= 0
##$PPDIAG= 0
##$PPIPTYP= 0
##$PPMPNUM= 2147483647
##$PPRESOL= 1
##$PSCAL= 4
##$PSIGN= 0
##$PYNMP= <proc.py>
##$REVERSE= no
##$SF= 400.13
##$SI= 32768
##$SIGF1= 0
##$SIGF2= 0
##$SINO= 400
##$SIOLD= 32768
##$SPECTYP= <>
##$SREGLST= <1H.CDCl3>
##$SSB= 0
##$STSI= 32768
##$STSR= 0
##$SW_p= 8223.68421052632
##$SYMM= 0
##$S_DEV= 0
##$TDeff= 65536
##$TDoff= 0
##$TI= <>
##$TILT= no
##$TM1= 0
##$TM2= 0
##$TOPLEV= 0
##$USERP1= <user>
##$USERP2= <user>
##$USERP3= <user>
##$USERP4= <user>
##$USERP5= <user>
##$WDW= 1
##$XDIM= 32768
##$YMAX_p= 432486637
##$YMIN_p= -718194
##$CURPLOT= <Network HP LaserJet P1505>
##$CURPRIN= <$Network HP LaserJet P1505>
##$DFORMAT= <normdp>
##$LAYOUT= <+/1D_H.xwp>
##$LFORMAT= <normlp>
##$PFORMAT= <normpl>
##$SURQMSG= 1
$$ End of Bruker specific parameters
$$ ---------------------------------
##NTUPLES= NMR SPECTRUM
##VAR_NAME=  FREQUENCY,     SPECTRUM/REAL,   SPECTRUM/IMAG
##SYMBOL=    X,             R,               I
##VAR_TYPE=  INDEPENDENT,   DEPENDENT,       DEPENDENT
##VAR_FORM=  AFFN,          ASDF,            ASDF
##VAR_DIM=   32768,         32768,           32768
##UNITS=     HZ,            ARBITRARY UNITS, ARBITRARY UNITS
##FACTOR=    0.250966925370066, 1,           1
##FIRST=     8223.43324360095, -62575,       7612
##LAST=      0,             -63604,          -105085
##MIN=       0,             -718194,         0
##MAX=       8223.43324360095, 432486637,    0
$$ Real data points
##PAGE= N=1
##DATA TABLE= (X++(R..R)), XYDATA
$$ [...]
23779 -244173 201050 48282 -73972 -190486 182271 75433 285095 -68260 -346837 77279
23768 -293037 373520 157122 -69036 266891 -122148 -58964 65503 -306908 29193 90703
23758 90703 -246319 241432 -182723 -455274 -76817 -18425 -53053 -143978 -11185 -12159 -6159
23747 -6159 93076 352600 -143632 -3778 -70198 60095 -167668 -313161 61422 40468 92567
23736 92567 55705 -268091 -308192 -124743 -145006 85696 108109 -139124 -192738 259312 32755
23724 -258072 136880 -204706 292164 52555 139646 -33472 207516 -12705 -191997 198300
23713 116055 74257 36495 5629 312624 206654 -24404 77372 -334685 253290 -200195 -93798
23701 -252973 135772 -121818 -200542 24149 -192515 -322368 67610 -20826 -184475 111528
23690 -360100 -115479 -25627 55173 -543687 146035 239284 -124968 -201738 122235 -416784
23679 -158257 -59151 -43274 36426 42298 -114842 139389 29021 -10433 -73279 -1748 -100740
23668 -100740 112140 154479 -284087 30443 -141188 -102142 -33385 -64487 -50672 -35034 209387
23656 151920 -71199 -253769 -151108 -426031 196317 157511 107528 16005 -50033 -56187 -225723
23645 -225723 321994 82759 103657 1930 -108251 -111972 -165145 -91761 50892 -208473 342003
23633 -123462 -239407 -70491 75504 -9858 -131030 82681 19921 -184949 204716 -5017 -94750
23622 -94750 257792 -2252 -258848 -372638 -243709 150383 -100229 -244615 -89040 -369320
23612 -369320 241530 -154415 -136948 528539 -86996 -333204 79022 -138084 207295 -16111
23601 25693 90899 110286 336918 133020 107283 -149095 -325471 -53764 33807 -54398 109591
23589 47337 8916 75728 -95478 180035 76032 102139 141975 112840 83431 -143282 365862
23577 521717 78297 418425 296230 334446 -63248 148658 255413 8996 236700 261554 174925
23566 174925 57068 -260073 160881 -93109 -191547 -212731 -83201 65250 46300 74141 57734
23555 57734 67994 321374 -86376 -173021 85974 76978 29363 -1748 75739 241207 165047 140848
23543 140848 105356 184685 -95349 -103597 -177839 -102907 -77257 191051 -88049 153544 122863
23532 122863 78585 130946 -81989 263883 202116 -196805 -69678 29078 -190448 -156100 -26037
23520 -301951 -185239 -82486 381832 140426 -183302 -305646 -41620 -167044 112696 -174675
23509 -246764 -220700 -45288 225413 -83477 -131481 -207571 200992 177870 306576 84388 -29799
23497 41604 -118931 -100430 282861 133336 -16433 -41834 40216 -199127 -90177 -58143 -7661
23485 130554 -203702 -68187 168200 359639 187430 -168733 239704 83806 94641 302086
23475 302086 44227 6312 -14682 137246 84728 50315 7315 328083 172454 -166995 -314741
23464 -314741 188003 -326395 -198926 -64315 -75491 31376 160667 -163606 254560 36462
23453 81738 145953 -58252 41917 9720 -168273 -183440 65539 -10034 114128 17885 -244076
23441 138959 63012 -113240 -23601 -101837 -11719 -75304 -161851 -66523 -231559 -225592 -229832
23430 -229832 -191388 -305413 313742 288402 127130 -23623 -352035 34265 139225 -54708
23419 -156681 68978 -11581 -13335 -243849 -94180 96170 -44833 199324 129146 356883 -287174
23407 299736 333471 52221 312928 326681 115496 -215588 -36766 36139 -150815 -32181 11281
23395 20127 -21981 -152314 143371 -76614 -94717 101542 66403 56224 -89998 -132404 -151731
23384 -151731 76879 49642 -221891 -122545 -46283 159572 -181163 262675 90326 -22223 -7542
23372 -218089 -193704 -11588 -4483 -317831 -35285 37906 28265 395950 320739 -3880 -157550
23361 -157550 -22174 65129 45939 -165310 94823 95270 35933 -15029 -43250 -56931 -284304
23350 -284304 235426 -48717 22839 20979 -71636 -261735 11768 -16418 -284401 251670 83791
23338 95185 -348945 106584 113755 -137808 18084 -246219 -531422 95011 -190179 -190077 -31234
23326 185249 -283247 22585 39956 -112062 153758 57279 -189124 -87779 123608 -190887
23315 -358880 -159708 81408 188398 -83086 -115057 -180033 116323 -11931 169222 -137722
23304 358700 99246 173199 56061 1367 -82517 -107603 64655 -135881 6528 -328455 -279467
23293 -279467 -450135 260985 -291714 -547092 -145626 -86045 -237009 -355786 -145005 105589
23282 -33704 -178034 -216561 41926 -20045 179597 -35194 -220064 -46737 78896 -112407 -40183
23270 114150 -292185 -113132 210754 -45196 92757 -248252 -55752 -123196 -55099 17772 50056
23259 50056 6185 -21338 168006 331913 151799 -460008 -178300 134004 72461 169638 -145613
23247 -162349 148256 -229374 -76354 -235690 79363 88763 141850 78464 129857 -157008 -13478
23235 -323137 34816 -40494 -153772 -254906 -83022 -207331 127950 -305942 169281 -62004
23224 -75183 83677 -176023 113474 81749 -451971 -72573 46917 -124303 -10758 5322 -86331
23212 117793 58112 111932 202241 -198359 94827 17500 -218682 357709 -376876 -236009
23202 -236009 169377 -49248 -207926 -72212 242602 103481 4041 392253 8510 -286926 -33694
23190 -219338 8406 -131177 -52781 -303906 -15503 -230690 77330 60143 197394 -196011 -428268
23179 -428268 61781 135364 -433072 45247 -103211 -133527 169335 62480 -94235 -136450 -50946
23167 -192433 -372779 -65640 302883 -144079 5208 69344 263142 23436 7469 -166584 -75652
23155 -134312 -164184 257238 -37154 284553 321240 -74827 -40412 -15751 -48485 -13528 -7808
23144 -7808 -82559 -79390 92282 -76495 51381 21574 99788 298852 24972 -22432 -247346 -29612
23131 223707 30435 30021 109678 180808 -150247 -247383 -687605 -162976 20669 146769 -21786
23119 27932 -264388 11842 449447 103781 452781 62900 212674 31402 95841 -153302
23108 74418 36233 113897 40566 344381 -81323 -326666 -141846 -27075 -195952 -260655 -131645
23097 -131645 138953 17334 30086 75236 81268 39231 287255 8974 -333517 111023 -92456
23085 94222 -157146 154710 -26491 230025 -41435 29714 422624 34991 242231 269121 -75716
23073 205477 -206361 -132923 -34135 22004 24052 -141129 130693 90763 -137416 181006 28201
23061 80762 170806 105335 -38904 -47088 -148239 220771 -124434 194826 -23797 -16742 239500
23049 -67308 154989 -125177 -52516 5378 34808 -336322 149562 -62953 21237 -136588 117285
23037 -35827 154335 62837 -78448 315274 165784 87958 -116178 280840 -60885 103464
23026 98019 246515 3520 -1034 -125985 227953 -108605 -301128 131781 191929 341795 -78912
23014 -213758 -91493 -10296 46260 -175359 -75329 -89305 91605 -227954 -375430 166820 43129
23002 92502 -18512 -204690 -44737 171260 -232491 -165541 -92380 233427 51411 -65902 10375
22990 -190014 -138810 -146767 235266 34485 114021 -21342 164755 -130188 -96950 -55697 -173223
22979 -173223 -42537 71175 221783 77033 25874 -534682 221802 -5796 -129753 -272303 81819
22967 -163866 -169612 -212060 -93380 113591 -289531 102154 -157239 196310 67415 -128849
22956 -72520 -148731 -92620 -250278 136684 70108 -82368 -144537 -250875 222839 -70808 -12939
22944 -396959 229523 320451 247553 159572 141820 -43569 -394997 37285 131132 177980 -135268
22932 -106809 -373577 -256562 -11246 -63276 -62131 -250680 218465 122158 -114338 182130
22921 -212581 -65225 -96892 -185531 112044 -11961 98229 -138104 -437377 -282617 79956 -195823
22909 5272 32329 64227 -73482 -313812 84259 120534 -41011 -149554 143809 -198566 -140417
22898 -140417 102293 238938 -96318 -316318 101608 -133957 -25642 98160 102153 -30411 -407271
22887 -407271 92158 -150908 321725 87224 -370094 -212861 -188638 -65551 -214194 -42120
22876 8232 20486 101913 103351 124097 38200 -14723 247450 -167593 14422 -12142 48179 -273927
22863 -448526 68387 -400839 -43422 -81122 -72184 -273136 -339468 84922 -322508 -52673 55313
22851 170137 -166291 136067 78242 21869 265151 -162356 -43964 -544 124877 -4021 -105522
22840 -105522 14018 302014 -112206 26366 128525 -124344 254027 89237 124684 -18814
22829 -247732 17513 -209199 9971 111226 -97976 -29171 -45214 -151483 -221064 56596 264081
22818 264081 195346 -6773 222600 88827 -226291 -292735 125435 25590 -556261 -221503 23915
22806 6322 31964 172715 -64703 20246 -32612 -174791 -392627 193726 -248522 -120545 -82383
22795 -82383 32697 103958 12601 -2679 -369345 -41835 -285630 118837 293763 385514 -83991
22783 -141422 45397 86392 148015 334291 -302089 -58853 18325 -184444 -88466 201922 41764
22771 -55566 -123553 -117595 214298 -77502 41390 -198945 244696 -170794 -1350 169083 -18587
22759 -334012 39594 163694 -440764 -79007 18567 -231239 92020 -275538 122266 -143616
22748 175488 -262401 163562 -359343 8699 -289012 299980 68603 -101923 -29689 150245
22737 -141272 190119 155691 -17156 -349837 -14079 140722 -379921 -148749 170971 75440
22726 97787 57343 131637 -63078 -41268 -78380 148976 -48379 -164832 30224 -150133 -70654
22714 149957 99645 75000 117232 196274 -123384 339209 -178573 -226909 -306284 204508 -222542
22702 82717 -420451 53223 -160663 -421515 -158804 106965 156010 -131231 -29972 -73335
22692 -73335 205151 -298549 -50656 178316 -70186 -288988 104397 -201989 -180810 -93224
22682 -93224 53796 -48186 -170451 79957 109226 -21743 -356 -6019 27396 47932 124095 194854
22670 194854 196024 -30597 -45146 28776 -156988 -247235 -240869 -225656 -29484 -99064 -242582
22659 -242582 -69159 42886 -104768 187627 339814 220491 89145 -38313 -145188 -156218
22649 -156218 298824 32480 -138890 58840 242946 50399 14196 -244133 -41091 -251598
22639 -251598 -313654 166379 53267 32664 25418 -299439 -61820 41470 -222146 46678 153005
22628 153005 -64091 41577 -606 -41714 -282860 -175063 -42121 93697 146615 -67943 -123685
22617 -123685 -209362 -249601 -361069 -92772 -26625 -260736 -52351 63426 20343 152096 -93541
22605 184476 -61502 -135260 -107883 25042 -215201 -4462 -21503 -100152 -72345 -88365 147535
22593 205879 -289248 37482 -100624 233345 -28379 -66238 -29369 -41179 -410073 15269 87242
22582 87242 -212373 133975 -141646 152701 -288435 72081 -57724 -225851 -257039 -91066
22571 -194086 -233255 -153960 -117089 -307601 121074 51373 -179882 -64861 444321 -76955 -175543
22560 -175543 -199334 -81796 -153468 -23244 10154 -128658 -91790 -18081 -88234 203664 178764
22549 178764 153090 -391467 208159 -255544 -170436 -170036 -238092 -159173 -183194 341645 -98127
22537 -304800 117287 -92034 115844 77246 -112103 -32132 -354735 -135930 208955 245262
22527 245262 8544 2083 198538 -140613 -161284 -89566 -64647 212786 53722 97146 334599
22516 334599 -172502 154482 -153498 -17080 -117139 -119077 175305 -312699 29097 -181766
22505 254586 -114921 -177173 -12644 -138887 -53761 -2156 -83258 29751 85629 243608 210861
22494 210861 -421996 -344790 -298072 233696 -126182 -149261 -45607 357943 100219 214714
22484 214714 -67420 -13902 112659 7379 98044 -88306 -161676 42217 -64646 -52100 89289
22472 113581 -104070 284240 -114522 41388 -19119 3529 -291440 -66977 -216811 -98847 -217195
22461 -217195 -57259 -50266 -151459 -72727 -27757 -94446 -140319 5235 57565 -65370 -283205
22450 -283205 -286326 -328649 -12141 4725 -102744 -58418 -26059 -37932 -92884 24663 -6665 -137373
22438 -137373 -311356 52848 249450 -265903 -121262 161914 -106156 46864 23100 1474
22427 -33008 -44889 158371 -109187 36856 -35240 242645 -103542 33230 35451 242857 5197
22415 -18631 269890 -302368 -219043 267089 -249798 203693 13167 125783 70248 -5029 -319648
22404 -319648 -30528 53780 33449 -101954 -324132 146967 -147860 -84789 77856 -202560
22393 -79928 5773 308320 5664 149695 281330 255333 -296219 -88784 157033 -153579 -58807
22381 -18124 123312 -14485 -50192 -182403 -79807 -7966 -58006 -238079 -16983 31164 -172860
22369 -285152 65022 41374 -72044 -159474 -285965 -208150 100079 -375695 -59026 14829 12750
22358 12750 -58753 -5117 -96423 316700 269879 -149143 -165691 -80417 99851 91864 -209501
22346 -115902 -42731 -76963 99894 -117412 -21294 202674 171252 429327 -25375 200634 -11125
22334 -210799 -43977 -356 -258570 -144640 -44647 -7664 -66222 92053 -25762 -299740 -136630
22322 10833 -100612 32942 -95169 2065 -74065 192629 83304 24157 -53736 56283 125780
22311 125780 -303146 194555 -20768 -287507 -28549 131370 -112279 -102069 166604 -245401
22300 -305322 -407565 -331301 -164612 -39881 172025 40178 150157 -291046 -145178 3830
22289 -69078 -203116 -47667 -150985 -159341 -301233 -179070 -143832 -191699 182674 -181258 267328
22277 166335 -206955 -309194 57287 -93681 61187 60971 -55015 153599 -58769 70112 -170384
22265 402444 -35855 47310 9884 -2054 139492 216633 -177468 4437 226386 -291296 276680
22253 167623 -209975 64162 -3471 -212416 -57696 -49466 -165092 -121090 23973 -285587 -107007
22241 -402882 -125001 -315018 -157634 27021 91139 -105171 -2924 216245 202582 14789 305877
22230 305877 189140 19116 95800 234753 261126 -130398 -24201 68203 188009 -102741
22219 -320046 24563 -15634 37388 49114 176244 80227 -222328 -352807 -222467 -404168
22209 -404168 -107712 55751 -109473 115834 217833 -25624 221238 -119261 -95917 -125167
22199 -125167 190559 -207474 125497 -226289 93999 -30049 -196781 179838 -88132 421201
22188 -228069 -57937 -98887 205704 -20160 86997 83837 -146491 -317562 168169 105682 199671
22177 199671 241120 18594 273854 -220418 -100175 -244410 -82157 -100635 277940 -217737
22166 8351 -79950 59879 95694 37429 -229936 -315154 -149326 -321660 -238591 -71924 -218358
22155 -218358 114355 -43604 83334 -134023 -353007 34970 -90324 -170846 43406 71302 -293597
22143 268302 -254854 -34288 27052 70169 48938 48095 305248 251115 -66840 -36696 137248
22131 -184996 108082 -233633 126538 48216 -69775 163816 -25633 -124525 158027 -268101
22120 12277 143355 27088 218210 39523 42020 -255565 -205647 -193371 -175638 -40550 -32977
22109 -32977 -173757 -23545 47518 -82768 187522 -245351 -479005 -233046 130579 -176951
22098 271277 -302483 -143386 -211197 -92384 -237606 -321310 -501834 -644211 -43853 -260813
22088 -260813 30120 -186593 77255 19903 -102999 -20434 -63628 90962 -262107 -8059 -368073
22077 -368073 -84770 -129241 -324378 -229208 -412212 162618 -35268 -346111 -79671 109379
22066 237633 -53556 -250877 -44653 179030 -374099 88664 -193475 -263090 -103998 -201665
22056 -201665 -53071 -148988 -339096 -174445 104702 -295320 42214 342347 -208152 11968
22045 -269901 190176 10405 -257493 -144134 -34818 -123778 73874 69692 282274 -75096 233528
22033 -108563 -381662 -272896 -49858 -33526 -251125 26869 48362 -47552 -300639 2660 -94072
22021 124321 -126712 43396 -69249 222561 -191091 123228 -58523 -115333 124393 214068
22011 214068 -223454 -293321 207125 88212 192449 236525 -136829 -9547 130270 -93557 -134137
22000 -134137 -37360 -95204 -365891 -6527 46848 62465 -109271 2500 -252458 -105899 211981
21988 -203801 423324 39289 59148 -98010 -303600 -14777 146561 -36946 -134398 -50488 121041
21976 219735 -258494 106456 21179 308337 197977 -99330 59066 -427113 31793 -81181
21965 68247 -404783 -112418 100080 -199070 -142758 51420 -52254 -136474 -18757 -101266 27599
21953 -67234 -11207 -328431 385649 -336039 23524 -15063 -201468 -81957 -16842 -100264 -70620
21942 -70620 -158456 -215909 -50003 -138105 -369452 143131 -86726 51584 187612 83021 87378
21931 87378 -40596 -258935 257100 224365 -44910 -47873 -108114 100035 -163395 60431 -12326
21919 93303 80629 39688 193904 -58223 -148146 -78233 -174637 -338220 30378 -718194 -24869
21907 -191503 21703 263244 -22083 424402 -124564 -259025 -360362 -217494 -148946 -211663
21897 -211663 -13764 -20804 -41832 -182679 -121289 281528 -91671 149857 104661 14584 414
21885 -41811 507496 141638 221205 -84055 73274 -5283 121328 242323 -53549 -28219 -119222
21874 -119222 -166424 -121524 -88333 -105753 117458 49886 -3477 -19105 -159780 19 100625 -64993
21861 213625 200872 5200 -162500 109385 -18592 -15906 189481 -16721 -71759 -300047 7769
21849 -224394 -188743 -94084 -215601 109013 158579 127670 -72275 -97298 215903 -172408 -11815
21837 -325043 -14268 -237282 -267905 28951 -13931 -319846 -170667 -180081 -97679 5924 45319
21826 45319 125380 -35336 -420801 -358099 192157 -462184 184678 -206736 122410 -7296 -255220
21815 -255220 -94634 214462 29068 -195772 -226485 192565 36977 -339799 -172564 -270804
21805 -270804 78868 -198358 -318085 -81575 90746 34192 -86796 258736 -83124 -87877 -268042
21794 -268042 -145831 146825 348124 -378700 -128754 317694 -222427 -159057 18794 -12838
21783 217159 63602 98065 -462388 121348 50109 79212 -183376 -64514 -41851 317498 -160390
21771 3393 228535 58953 1737 30862 202753 -80466 -156196 36600 -50539 -216131 -407192
21760 -407192 -86737 182440 127323 -23679 144707 -42104 -1403 184850 -277930 -127582 81105
21748 95468 119221 -24159 -134150 116798 379364 -175795 249871 54984 -281428 -114109
21737 97109 -156327 26370 -119317 12580 167525 -317360 -240902 12766 238447 -16287 286361
21725 -108887 -3586 97795 114128 -18929 154579 -158795 -58734 4880 -144295 129280 -103460
21713 175060 -81604 -14984 -201405 -59927 257498 -34398 -151617 -105526 -157434 200472 23911
21701 4417 159907 -27995 66259 15238 39346 -67295 -149124 -190298 43729 170450 -207980
21689 94249 -111459 -10008 -336948 -190896 -116971 -85730 -206124 -151809 -227354 -278442 -159551
21678 -159551 51680 -283930 115638 1440 155922 102390 -35557 72551 257550 -43940 23280
21666 -45463 85816 56517 -201646 -217897 -165914 76397 -262509 -268518 -316739 -391252 74652
21654 -204560 -101880 34441 311966 -59190 -202181 -139732 -81894 -191951 -92091 202501
21643 195183 9014 14696 -426979 -294833 181277 107724 10709 -177755 151889 -40498 -132467
21632 -132467 -103017 -279294 -7847 12882 362309 8634 71688 -17737 120430 -158674 -494873
21621 -494873 -40495 96408 -209134 -268096 -223883 217486 -420549 -115126 -155238 165998
21610 204471 37344 -137908 -166247 -328145 84509 95101 -107858 -303624 -55243 -54885 16612
21598 -141958 -129699 -180600 -114611 -149195 -52903 -122956 -76353 21231 -68797 174533 51855
21586 -189100 262010 47588 -216376 -51523 194965 266408 162370 43407 -353184 -273567
21576 -273567 25956 -166777 -152873 -147139 109607 -177276 -430519 -146759 66816 35341 16044
21564 -9788 290340 -89362 225319 41013 -216111 22911 103795 114573 -69817 -3866 149029
21552 -213848 18937 -31335 -142334 -113361 61860 -108827 -156829 -101169 -32610 -81513 128459
21540 -226461 -36389 -163035 158830 102990 -383042 -193 -13868 -125644 -220935 -88049 -53906
21529 -53906 -84597 -204799 -29618 170608 -467870 -246968 19658 3055 -47710 -13760 -81184
21518 -81184 -198376 259316 57068 -29943 65967 -208088 -229924 -384232 276652 -167464
21507 71275 -246457 65257 68179 -168983 -52793 30360 280760 -26128 3391 73197 -44476
21495 -407616 27003 36791 -16774 79655 -48131 112543 -179335 6802 -22403 62179 13927
21483 -40900 -38459 157306 -264236 -178908 -448086 -309025 244217 -212966 -158558 -5069 -12657
21472 -12657 -146061 42082 -63609 -32645 -7102 -1720 110331 198568 62787 -165428 -268657
21461 -268657 323667 -80340 -52221 309723 -200658 -270469 158579 132970 -94818 -243543
21451 -243543 -239466 123077 -64491 -270996 34390 -163405 -245310 -2477 -154472 -238557 100595
21439 -31958 243944 -171905 -107602 -60660 -155847 32385 -38307 -56866 211386 73718 -83257
21427 -118000 -19461 196834 154574 28429 118313 76279 -84590 71527 251591 88585 -15216
21415 -55171 -166375 2493 -214964 -101433 -144245 117611 222903 -339196 -274300 245892
21404 133456 -98594 287915 79822 9735 -117922 -142939 259635 -121341 108290 65252 -447842
21392 -28430 -11941 484844 155731 -224444 -115454 64413 117818 -64238 -259284 76544 87137
21381 87137 -146636 -72185 -284259 -36852 -180693 39929 71307 -95941 210707 -223474 25457
21369 44947 -107296 -220257 76836 -553249 -326135 357165 -128942 -127561 169380 29444
21358 -46945 -397851 -104771 -57984 59840 -95336 -192489 -340440 -199455 -67182 -151792 161526
21346 63609 168617 118167 -87624 -262378 -112418 127148 -269574 302916 -19679 127922
21335 147536 80022 16896 323934 -166690 163022 -303866 -16796 -208095 73269 -452845
21324 -27047 -212589 -156843 15358 -84056 120373 -225052 99976 114533 -122350 -409872 -229334
21313 -229334 -368298 -62611 -233400 71685 -22496 -94696 133576 33158 -128593 -225142 19302
21301 -268639 -254657 22764 -147952 227440 -206440 -76729 220124 139049 -249040 -526327
21291 -526327 -296080 237995 57579 -57916 40278 -246457 -64003 -48382 -218013 -179208 -210814
21280 -210814 131516 -243897 -107356 129422 -197961 -173149 83785 98468 -207513 124935
21269 18385 -149892 -6454 -340254 -184831 63701 -29669 -7545 39720 138329 101295 57148
21258 57148 -95444 -13580 -168560 60569 3179 -142068 52611 52922 168786 48643 -58435 -125696
21246 -125696 -159051 -332482 183541 -351253 110891 -194389 -57949 290077 -62116 33325
21235 -16089 37217 16040 225704 -58993 -134622 79459 -373095 -92844 90000 -173411 -16302
21223 97442 -192479 -129686 -181725 -256463 15645 -109106 8037 -386221 -100995 -43573 166914
21211 -192065 -163215 -242668 -122620 -111960 19586 -282137 -109807 -176527 -71699 -378670 124901
21199 -170293 -25781 -10344 251939 -235227 -184066 -90881 -244657 -150730 -546327 -312295
21189 -312295 88817 -128478 -100807 -243207 228 -233539 12249 237554 32683 -106785 -197280
21178 -197280 165584 60083 148430 159814 -199345 -120915 -133830 -135088 -6713 -100545 -46574
21166 11576 -179930 147209 159637 -142825 -130090 -96095 316817 26282 325919 -149775
21155 97632 105066 243885 -122177 85889 -203375 -34060 -126147 -8235 -35409 120200 47559
21143 -133843 -44174 -249967 -133064 141749 -238851 -23304 103550 -283939 -106471 96835
21132 -71400 -8094 -95390 159369 -142055 184181 -215425 -35916 80264 -95217 39578 -113876
21120 -119231 -276476 246440 -506747 -14741 85271 208654 134905 -34623 -76398 -185683
21110 -185683 -29213 140887 76679 37642 2149 97564 -301639 -182775 37681 -27283 22341
21098 -49861 -43 -96621 -148848 -303587 -259120 -69868 -79102 34608 352678 -11124 -511438 -414128
21086 -414128 -233715 10219 -101118 14868 -44431 150013 -120396 -141684 -80669 66213 46749
21075 46749 -123562 6607 -143726 115031 -49115 44632 -247054 85070 -197344 19063 167447
21064 167447 -23279 182126 -95297 24285 13790 -92726 -157709 362 -38319 142469 -200176
21052 -139965 14724 23424 268617 -213869 314318 -246314 -96653 -257803 653 -214314 -52341
21040 9921 -49271 -161935 102228 531397 164001 -78160 271124 -287686 -43755 42046 -86231
21028 -312204 -208002 90083 -205764 -63765 -155584 31248 11130 142706 191908 145203 529227
21017 529227 -78971 23923 -102382 132720 166266 91489 -319500 96011 -82597 -162538 43001
21005 79788 -203892 -54578 123027 -99790 -87348 -27628 -285223 31298 -37563 216150 74856
20993 166035 450853 124882 422629 183929 469794 998 56235 -84763 -100380 183237 -11328
20981 -265061 -72280 -103859 286856 179508 -218918 -308878 47246 24289 199902 30004 30045
20970 30045 86191 218487 35039 -68230 -125273 56797 203033 -268963 -244260 -12220 -96191
20959 -96191 247559 -86044 118816 -171739 -131116 246203 -213950 -21342 141564 236418
20949 236418 33569 43020 -52044 245682 37520 -128005 77433 -163291 -169844 -60565 86892
20937 68637 211532 -260312 138877 108614 -88886 102015 302006 177985 220887 346806
20927 346806 160066 102029 101727 257843 147062 -26767 -94741 64512 -233169 -129640 -156481
20916 -156481 125807 301585 110697 -196472 -16594 67428 31493 -194079 114927 -7637
20905 -131949 -204266 -2627 -107694 -6463 257549 -238876 101567 8 -103438 23953 248242
20894 248242 -305450 45001 76810 -91666 -355628 -151181 -191517 -101142 -160455 -329364 -140946
20882 -92798 -207192 -166801 -358651 -173474 188020 -91536 33757 -25517 600 -134860 27049
20870 -367425 -250762 -57451 -113180 -245321 199085 -98097 -403249 -116000 9758 -199278
20859 -136877 -82652 147189 24639 140255 -2312 -245069 5048 115296 -65679 -169346 -218249
20848 -218249 -360084 -112114 -900 -95026 -310099 236959 -124272 -172525 155903 104866 53797
20837 53797 40512 67549 -271545 -140940 102441 120107 -526420 11516 -50498 238898 345314
20826 345314 -130972 153494 113718 -32483 -110070 -261007 -118019 66679 -155553 77543
20815 365916 -269389 -26417 70304 25207 81496 37511 -30570 -419236 222562 -69642 -19495
20803 -53797 389606 -59648 -93041 -540678 -297038 -74606 -201730 -171782 -524555 269794
20792 323654 -169797 -86184 -27037 -252719 -9391 -229511 -125217 100364 55884 -87843 -270576
20781 -270576 9945 -532222 -17467 51616 -379115 -256088 -17286 -251101 -311774 -30856 -115667
20770 -115667 -293202 9973 -196598 41363 -222985 184410 -12903 -54840 -98548 -278957 327590
20758 -185251 -305821 -438701 101766 -29157 22537 38290 -23400 -305725 -87155 -63917 -137934
20747 -137934 181179 -69045 -312601 -23364 -8952 -119328 -154343 -127752 -27514 62136 -114437
20735 -91341 -187103 -402153 40482 63094 41277 -197936 61930 -90015 -82878 -224146 127552
20723 -63344 284221 -28488 406282 -159648 -272925 363078 159760 152045 152452 -153461 42521
20711 -67306 -41723 73045 -149650 -321758 -192080 -127115 55670 -357965 222235 -77377 72806
20699 314981 -65025 -42656 -281254 -76616 22490 -82975 65536 -7955 49264 106581 220 75355
20687 75355 56574 183700 -286214 -195290 -398107 -218931 9933 -320218 77536 -66093 -170016
20676 -170016 -154329 83662 -358562 -250815 -249824 86565 -182208 -17698 -133177 -68444 -16794
20664 -99705 -65837 -189661 387985 -152761 -230490 -209563 -272751 135518 -58606 187257 -94671
20652 -124676 30327 84125 -324516 -231469 -51056 177874 -201787 -174283 1817 -237516 17840
20640 4424 -114614 -277637 -110098 -460228 12805 -85748 72520 -143581 -129914 87757 166023
20629 166023 -266520 -311425 87976 -16694 79456 -145781 -124755 18908 -145185 102395 5152
20617 -103424 -184264 326646 -238167 7870 81792 226548 -100648 269548 -36556 -98215 106117
20605 -13362 -319433 180276 -316987 -116171 36523 -28272 -126157 371714 -199127 127021
20594 -13359 -118101 -6440 -360592 -42442 149028 151935 -195526 51993 157261 127970 38927
20582 -539719 -118543 -46395 -92297 -192403 -17912 50279 -346014 74209 -388424 -64526 120700
20570 91234 249481 -41366 344558 110244 -54032 -7075 -84008 -175329 193785 -139141 -184124
20559 -184124 145416 -136552 -53017 1357 143783 -137513 270319 -317389 40393 88107
20549 88107 30889 -132149 -305365 -89109 -180076 -71932 166424 -164885 234989 -49649 -165553
20538 -165553 -215651 -121569 -230778 -512418 -432636 -95306 226285 -125897 -64683 -103736 126044
20526 126193 -184725 -6729 102448 -84981 -38629 -112248 -79401 -218853 84415 183292 74233
20514 159762 -108385 -177563 -278597 -159456 274578 -35024 340326 -44004 -48177 -373379
20504 -373379 -163621 1930 -349919 -163159 16369 -264870 86006 112722 1084 -217602 -247425
20493 -247425 -63785 33465 38607 -178494 -22241 75376 -338486 -341388 27891 -71282 -48756
20482 -48756 72877 -109425 161850 76728 -73472 -25136 -292387 -265395 -114406 -61605 -71083
20471 -71083 -71003 -188858 40659 -131846 -272341 -35338 -245158 -86472 -289042 -12167 199153
20459 -257154 -98067 49613 -111241 -159184 177179 -29314 -274378 -140181 -56156 -142366 124597
20447 -366417 7449 2846 66512 31466 -260292 91210 -29812 23710 185639 -137493 49672
20435 49342 -29663 -20981 -340136 -437480 -146317 49399 47607 -363656 183894 -94093 -141845
20424 -141845 124201 -37653 67560 44975 220927 -191164 18770 -51147 -180524 -188669 46373
20412 27830 -79974 159175 83315 46937 -240464 90615 -83152 -26834 -309981 40258 61811
20401 61811 70546 96293 -234910 -91537 74509 127071 -134540 -130117 -140491 -41524 -125700 -119547
20389 -119547 12183 61299 178439 140913 -238303 -220998 -120741 -277906 -372813 -269958
20379 -269958 -230523 -428546 -115904 -186995 -52008 8703 -251200 -29812 -36473 251727 88011
20367 128957 -138221 29912 -176666 -61555 74744 11572 -151870 -135825 43043 76764 -130708
20355 -205046 53837 -277821 88437 -158708 -214693 -59089 -394353 109426 -126523 -131096 136738
20343 24168 195609 78785 -735 65572 29354 -233064 -80037 -402822 -232782 -274508 82140
20331 216459 -106682 42048 -45312 154954 -292077 147485 13254 -6737 138162 92021 -488969
20319 -115451 -182919 -196319 -13803 -443659 -257415 146633 -199576 -126735 -449258 -155772
20308 27571 23761 -562576 -23802 230613 -106415 -143184 -313664 -56614 -165602 -73706 -75254
20297 -75254 144280 181022 -244495 266093 307581 202151 -253843 178599 34525 -28655
20286 -3326 -78443 -165080 -350690 -165026 -225757 -115016 -188079 29465 53028 -62467 -125479
20275 -125479 -81996 -43245 -158182 -249440 7990 -59603 203639 -276535 237569 121892 -320616
20263 35727 126424 17550 -66242 10174 -10847 -213241 -86959 -125074 -35727 -104035 -99864 -24140
20250 -42442 148884 -17420 -91893 -483268 -67954 -330743 188319 -99695 -82018 53563 -165748
20238 -89893 294686 80961 63706 -125591 -215023 11581 -57329 48488 346305 57548 -167950
20226 -76789 -198977 110338 -45750 -154140 162723 38665 -128233 26502 -321044 -219181
20216 -219181 -158923 -37965 -37732 -109583 14927 -31460 -114776 42732 -78064 169719 -180952
20204 107552 -50947 4824 179978 -484508 -383526 -61489 -157681 -78821 -185698 71257 247999
20193 247999 -135221 135545 -251917 -186032 -46028 -88457 -311885 196365 -236199 29013
20182 -289770 -50909 61654 64326 -3535 118066 93936 -46809 -35922 218537 116374 -126581
20170 -140118 -90149 -217194 -144171 -108278 -132000 -135915 -89734 110506 271693 -258026 99743
20158 342075 216039 -58496 -336130 36486 178004 218383 -173890 541783 61785 -66316
20147 19860 -161528 -342184 -54937 32913 -70297 -84139 -91658 -20608 37479 356948 491430
20136 491430 13779 321011 200300 451945 214762 529667 308686 505558 141804 171571
20126 171571 98573 115687 114547 314203 -104151 147308 -52351 264173 -174738 -138371 2537
20114 298575 51204 -335136 -273077 174348 148289 -308415 -52610 -219608 -7766 -151360 -224364
20103 -224364 -99200 169391 -18425 37877 -148823 -52312 -18436 -189055 54795 -297308 -357722
20092 -357722 217798 167091 48799 86271 -7856 80249 -152858 50585 105942 -110993 7176
20080 -20497 -36677 -27337 -95418 302137 3964 287475 -91476 -41250 -69351 -73708 -46658 -11347
20067 235136 4248 -167554 -35914 153916 -172789 -110757 -268569 59238 -15227 70583 11661
20055 129006 -194944 -85954 208724 -50257 -510403 -63891 -306639 342060 -13213 -134103
20045 -134103 -199123 184517 157208 -172686 -55509 -49259 86410 251590 264305 -212965 72942
20033 53689 -301188 -171063 -227787 -250081 -176235 -98093 -182310 45836 -181965 -211031 46489
20021 -81176 -13102 -167210 -89269 55673 620185 -103018 67917 -151152 -64542 -34175 -145442
20010 -145442 -109569 26491 -186648 -226407 141778 -100147 -159249 138860 79458 -136809
19999 -179123 -251698 -3282 -154450 24561 -236801 -240366 96769 -280896 -166878 160536 -173489
19987 -230238 5441 -403038 42957 258605 -94084 283294 204572 42429 -44088 87902 154830
19976 154830 -263631 94587 256073 -296935 241154 142305 255098 -88311 -145477 173493
19965 354824 78571 -301738 -91700 74523 -231899 -48791 -52697 116677 17998 78049 23106
19953 188299 422189 -96932 434878 -73376 49014 -73247 286831 280668 126915 260900 154164
19942 154164 178073 159183 -71006 86100 -14601 -95291 -15033 168323 73373 229009 186708
19931 186708 -126156 -67029 -146789 -205435 101747 -62782 26820 34889 57259 138794 -3038
19919 -67988 38630 18962 182513 -107940 -282731 -315726 30328 -221419 -148238 55923 -219282
19907 -304778 -155719 -36592 -148522 -288320 -124426 8615 -109724 34765 223021 -120610
19896 20484 -201221 -7365 -155175 67015 265229 -514992 -191172 -163890 105350 -474815
19885 -40655 16750 -279122 -353319 -135841 19048 -53197 -157770 636934 -273669 -87495 96993
19873 -334607 -22094 -426085 -66722 -3524 -156620 -135732 -44724 -192616 190756 -76762 -456109
19862 -456109 -329316 -75865 195810 34572 -300229 -298209 -345189 -85254 99624 134233 -223043
19850 244436 119397 -75513 10447 247411 278821 -267929 -72849 -322226 -289183 195830
19839 -131920 -163011 -272570 -72907 127765 -40815 -279265 99124 -32175 -64607 129526 -70921
19827 -145339 -256333 -221750 159401 41206 -247444 -277836 -11924 -128443 152811 -140721
19816 -76039 -43281 -175338 -118292 -132987 54165 33366 126419 -126435 290403 -414129 -126046
19804 224269 177549 89467 -75916 -28619 -18442 -222030 75353 256726 185099 -14421 -121810
19793 -121810 5746 -78357 -227351 -85293 -67018 275034 -10020 -192188 -239983 49679 106821
19782 106821 64263 309310 -136170 27239 -217663 6576 189098 238861 -212671 -50636 -88563
19771 -88563 -73857 -165630 172761 268430 266612 -85271 143376 36725 -238304 117247 -138009
19759 -36865 -262195 -102292 -94941 115830 -209532 -189008 -44751 107740 156484 -341095 -3081
19747 -501577 -403515 -13526 -274061 67642 -185250 159329 21602 112579 65465 318741 -48201
19735 45961 -93550 264736 83727 -6052 -165782 201607 -25539 -366691 61855 -8117 66586
19723 155204 93735 17065 1303 -10917 231754 122423 233899 710440 466656 273150
19713 273150 384276 -74939 -31697 126286 -431269 210037 69819 62764 68610 -162174 3152
19701 -17076 -117773 -76589 -249182 4309 159297 375969 17861 52343 -90246 -18044 -107286
19690 -107286 -15313 -95975 -84205 253938 189848 321527 246252 420866 450485 450954 -73997
19678 70283 29822 -37428 125958 104039 -60029 381016 -88700 -95661 -151106 -11150 111176
19666 -160425 -24490 -70925 -205642 -229866 -217361 79952 173353 412 -262953 21339 -210658
19654 -14724 -106489 -35162 -216091 106117 285890 -190239 -218823 -9082 151029 -144636 -397344
19643 -397344 269705 73416 -349480 -535053 -291514 -308909 -77999 -180682 -647539 -245062
19632 -141023 148458 128814 -205085 210320 -88467 17196 -158785 139419 -357679 146185
19621 -32392 83390 98035 -25601 74325 -32104 -445245 -211482 -161149 -153249 250421 -120278
19609 75608 -214638 -168327 -259220 -246447 -187850 215203 -79603 -359210 -330095 -10599 -270896
19598 -270896 -87601 199567 101661 127981 16750 2012 -268538 -9117 157974 -7027 67426
19586 -77293 -229767 -173780 -289157 -222054 -129438 -217936 137781 -63339 200385 -231675 -385295
19575 -385295 -95888 -396141 -243151 196121 -2133 -437115 -185542 171207 119085 49418
19564 -151782 -106463 -33529 -287238 40935 102158 -43149 1455 50948 6096 -203362 -30210
19552 -338078 -339656 29714 169773 -264157 -485251 114445 148198 -370857 234718 120058
19542 120058 68389 -213319 535 -183627 187794 -127534 -344995 12818 -139134 -45477 46051
19530 -360925 -302848 -45300 -42479 -47147 -203361 -64617 -128397 -375450 -70022 -11314 -210977
19519 -210977 -142782 1102 422347 34554 384908 -252987 -70491 -39203 -332846 86209 -175926
19507 128512 -424934 -141104 -286412 -410239 -169323 -30756 -317567 232385 -347579 32061
19496 -339101 69735 49571 -182181 -91535 -9860 67070 45635 111788 -137036 -157527 -30908
19484 207318 -177559 -42791 -218564 -5612 -43626 -32794 -153233 -275315 -106037 -162746 179616
19472 67391 -204927 263694 365943 -154433 -73136 -165920 -267553 154508 -62252 75599
19461 15516 -108924 -88273 -14340 -149127 373485 28823 -57686 233401 14278 36611 -44382
19449 137118 -69734 -354664 -123628 17380 -195040 -27452 951 252934 -63771 -184743 1833
19437 -182177 262456 -26227 -60784 24454 331818 147617 -199534 46562 -210187 140144
19426 -80591 96059 279645 -79910 20691 236842 -163910 -102083 87435 -73977 -162884 -504910
19415 -504910 -123018 -52232 213366 20350 -34408 -234567 -96241 -143506 432937 -35566 -141579
19404 -141579 -426199 -137582 129542 -143765 -202350 -63910 145255 143723 -108552 -241362
19394 -241362 -250624 3030 -97576 -180179 -244270 62743 -21509 11087 -82088 -96124 -136800 -301123
19382 -301123 83754 -429739 101396 -198188 10450 241720 -9589 -12513 126507 -152058 -15895
19370 -2924 -125698 -327583 157047 86067 -229013 -105350 -2200 -172234 21967 -274519 -25352
19358 72511 328518 -270951 -308119 -90338 -10243 -201274 33244 114573 161951 -326958 -14777
19346 -140336 206309 11142 -187141 -22774 96526 -50580 -380132 -123547 -212091 -258215 -100382
19334 -194865 -416952 -26192 78906 -386735 -131985 -353398 114707 -111803 70772 -24305
19323 -123272 -257894 115903 -42660 119543 -262086 -402031 73352 -364915 -52742 -86715
19313 -86715 284178 -144097 -218087 -407942 -244013 -291199 -93387 -166981 -87010 49234 -156941
19301 23687 143448 131149 -127575 -165677 -205511 -249040 -382652 108975 214627 26755 -25737
19289 -200633 -189849 -29301 -217332 463687 5968 -128994 -98586 -99149 -72370 110951 -412014
19277 -145775 24796 -56658 -62128 7241 -45041 143895 -98644 -161246 161600 -18851 51864
19265 -244829 -238905 -284132 -17339 -3593 -259265 -186244 -46231 131800 -89487 5173 108353
19254 108353 -202297 -243169 49612 -100497 -42842 -118369 263776 260829 195985 -89984 -14009
19242 -147643 -453245 -177563 104297 -29209 -88962 234877 -44550 -30752 -122618 -75773 18895
19230 -354912 119842 99698 216228 -82823 41926 -257630 -8439 31730 -147313 -56603 13992
19218 -222610 -86027 -133654 5876 -127005 -110196 -206089 -178815 -65656 -23994 70639 -77045
19206 -383629 -28591 -286618 27899 -207548 -343945 98170 -400613 187246 96624 -204418
19195 -171901 -198001 -89860 -125611 -347206 -288323 5368 10676 -14026 -128012 17830 26820 -200380
19182 -175976 -204056 132165 -5759 -266099 -116237 223669 -88274 -89120 56305 29533 -149434
19170 6466 -306229 235851 111979 10549 -109903 -22270 -90556 -46111 -157268 -23750 12603
19158 -188533 -264379 -124239 268753 -254719 -40188 -34362 -7272 -165910 77056 -115554 45148
19146 -203597 -2903 20855 -137019 27912 -4798 -226505 -114363 -191398 -285758 -68152 -191112
19135 -191112 50641 -28555 18477 -85874 -340831 -35178 139010 95479 -182992 336413 116186
19123 -238798 -115121 60134 -336677 -21491 14878 -258932 155612 -186029 -432635 -16589
19112 237581 -325365 -5389 77672 -222412 88696 -15630 56778 51646 6290 -397275 -204048
19101 -204048 -200803 21182 56041 -78768 -48572 18302 202593 50472 -157233 158363 -50290
19089 206336 338578 -233688 -172793 80527 -12829 -46550 134671 313540 34424 -102108
19078 229125 -201869 38638 -344620 -87140 72096 -426748 -203726 -74588 71177 291631
19068 291631 -125180 -169656 124843 -298239 95530 182201 -264177 -228818 -139901 -120415 96065
19056 -98338 -2418 -91002 233721 -161104 36589 567794 312185 -180914 10211 226002 -83562
19044 -215087 -356502 -398732 -115934 -40612 -4506 843 -386064 -202982 -275197 -84012 1740
19032 -244379 -155404 -176951 -189655 -31644 -267778 171079 30307 157521 -287783 -272260 131590
19020 -104723 -261698 -205152 -125884 78643 -5663 206954 -110215 339155 -51436 -51026 360177
19008 200462 211395 -32267 7981 -156117 15293 149707 -210711 21275 -294066 67338 -163101
18996 167780 -261992 73229 323324 -421783 399355 -324578 9076 92925 74884 129 82524
18985 82524 -14154 -141809 78845 -166227 63402 -160608 59907 -72224 27194 107606 -369614
18973 -276405 -9145 -269347 -141121 -40393 -336144 18305 -79016 -239727 -17371 -198794 65090
18961 -229495 85000 377965 209986 226982 690929 352143 281583 78298 248529 17251
18950 159346 -51606 221711 135740 201513 -115629 -155047 98766 -93999 -112847 -164913 204574
18938 -110483 -119908 32383 -202853 -115849 -67402 -99616 -23477 -39751 71986 -334952 89068
18926 -173073 57717 -121147 -61912 -258186 -41914 47412 -295742 -291432 -250991 1197 -234323
18914 -66483 -103663 239126 203783 -122430 73253 -189186 12525 -295763 -181131 143854
18903 95256 144480 318576 77759 -295935 174098 246638 291236 310415 127135 412895 419381
18892 419381 224312 144805 382247 74708 -269961 -187583 -162400 86943 -157924 108881
18881 -163461 85181 -216666 -398817 -65688 -165193 -47228 -105364 216558 -68502 197139 -324293
18869 -246749 -326625 -332586 -318337 41495 302437 -148773 150988 -106329 211795 -406781
18858 -12511 -551272 -414535 103990 182494 232603 8971 -21858 -186329 -116233 -11804 -70778
18847 -70778 -102950 -39741 -347207 -13276 -97480 -44318 126616 1928 41414 -106193 25012
18835 -181600 -184543 263730 -102492 -145673 -310827 86961 -182982 294753 53154 -286647
18824 4220 -49346 -85404 -414379 41663 -201125 4391 -19987 209424 269186 -141087 -73188
18813 -73188 -318228 273675 5823 -149973 -77723 -20137 -103909 157817 -18941 230022 18557
18801 -44932 -48559 -322511 -21452 -50213 -103137 -299437 65115 381626 100893 269962 44157
18789 78291 -186704 -61556 192188 -341531 -168925 -340502 316141 -139186 9919 39533
18779 39533 -152831 135452 -132052 -100688 -60325 30798 -249795 -71413 -240356 5674 -108599
18767 16689 198200 -67468 -60393 -84443 -131030 334496 94097 -71255 118801 -93174 198529
18755 -257121 35411 40246 -249487 -44816 -50731 -87623 127511 -56452 -217855 -116067 112635
18743 -343339 88660 -158657 -364734 26795 227031 -253087 -80865 -34231 53690 200743
18733 200743 -15521 18165 23287 138053 -203546 -135515 60130 -105206 -294618 -327423 -153864
18721 -328768 -109664 -243737 -142776 114650 113348 259154 57890 -26156 -132266 118614
18710 -28930 -18901 -117308 -168229 -157966 -355885 -144115 -231239 -170096 2698 149449 -263539
18698 -137293 -167011 -422327 -254535 143254 -138598 -59196 -141080 -395158 -125573 -163258
18688 -163258 59049 38310 -86729 -375714 -39660 103158 -159849 -340714 -143378 -7049 -312287
18677 -312287 6034 -100764 19886 -130523 -194163 2086 -84281 284164 -41443 -53945 -146163
18666 -146163 -32498 -125872 -41986 34044 31706 -114960 145393 -156983 137656 -197331 49023
18654 -139912 -144268 -110023 -93081 75767 -31591 75664 -196683 -895 7349 -85758 -116495 -156507
18642 -156507 32121 -115603 -153490 -320748 158384 -54122 -203997 -3112 123905 -280419
18631 -164911 -305246 -64290 -61037 -259938 -49651 114383 127639 214660 -380419 85274 -71465
18619 -81138 -18477 -218401 -81427 16635 196530 -172284 -400545 252447 33177 -100990
18608 -587098 -112426 30075 -446568 -77496 -64005 39690 -157193 131532 -344738 45727
18597 74851 247383 -364801 -4919 -142620 -277035 -302796 57526 111165 -235564 -164585 -243283
18586 -243283 247701 -79783 -135399 38050 -83558 -215875 -422410 116522 -105848 -419094
18576 -419094 -157751 -168805 -116792 -141569 115182 -120040 -336458 147643 -107035 -50046
18565 -23514 22089 -273518 5441 -229700 122917 13385 -113717 119846 -127287 3896 -106365
18553 221151 -145252 -85788 356785 -132226 -121571 -216119 97354 -119604 -264580 -145563
18543 -145563 -63652 -196449 194172 -159211 61615 -21185 -247040 16794 -202827 145517
18532 -31174 -36426 179521 -470189 -58029 -213852 -39995 -86193 50205 -161545 288374 70744
18520 130458 -35343 -245943 -33581 -201096 -75305 -155209 7 -108685 -232273 -174992 271459
18508 86146 -350135 -86624 -60770 19080 -300669 134157 -41542 98870 -188570 222598 12807
18496 443413 -165642 83680 -198428 -153857 157627 -44793 -14598 69745 228111 -116825
18485 -146736 55805 -331367 -224960 -157020 66208 -487304 -185805 123145 -75625 134974
18474 -132249 -72604 -92924 -28756 -54423 -380148 -238344 182129 178459 121725 -296288 -58297
18462 -2923 -322 -111660 -249161 122016 9964 97366 -40719 -223366 -126567 -202384 -34617 -117558
18450 -117558 -34007 -388531 -258527 -29057 58722 105135 251987 79831 240012 -137341
18439 235307 -97268 -124192 255359 268797 -73480 -415978 -279593 -278791 -337677 174350 -132444
18427 154111 181947 115593 158548 -48281 -69581 -252091 110509 68534 -39503 -76832 -64773
18416 -64773 9359 18727 71824 -18097 73730 -208440 177718 312225 -150209 -121680 -10893
18404 -147760 198980 -100384 304788 -189933 59489 -54632 -106080 40668 384601 -88254
18393 -5216 -67170 163754 418631 201823 -508647 -34225 412045 -225500 -6162 -195081 -2482
18381 171295 -118870 -161586 -198834 -76561 -68351 246108 -266268 -157308 -35366 30824 -324696
18369 -180032 -192547 -180048 -286421 -54558 -80042 -108391 -80407 -185486 50934 110246 -110333
18357 -226141 89573 -130909 -110764 -216792 -311300 -216392 35606 -214293 145898 9129 177980
18346 177980 340115 106527 -233843 27133 162497 94572 -116944 -479595 -54183 -52850
18336 -52850 127805 -21310 -34071 55450 176007 232126 119442 -225741 -100794 -35232 100808
18324 -6172 -202537 -241538 58760 335799 47946 -194563 -167826 58387 226167 -69528 -302612
18313 -302612 179019 -71144 -50907 11320 82124 -203424 237102 -294950 -187215 -254054
18303 -254054 17781 -61329 87387 -28935 -66844 46694 -40707 52070 -262303 -175122 145738
18291 -258161 -132186 -19455 -10720 -210687 -5791 28598 -49465 244155 -216064 25594 92118
18280 92118 -283837 246650 -250929 87476 153808 -265116 46419 -224800 -69779 -74518 -96000
18269 -96000 40989 -472780 137989 -248178 -34717 -89819 -150698 -305812 -222538 284002 24355
18257 -28832 -305404 -12756 -319604 -87109 226967 -214270 -25194 -101692 -153541 89683 59853
18246 59853 12387 -284813 -291577 -108233 -18962 -129760 -228102 -98293 -119681 84091 -195215
18234 -215533 242869 -188578 89980 -60500 -348705 -3642 -115295 84852 281706 -413103
18223 -64097 -92866 -97118 65876 115549 267445 204609 -114258 60739 12851 69090 -107681
18211 -109580 3358 221933 131343 -463541 164876 -99410 -53645 -335141 -158722 66614 -172449
18199 -156276 -206607 -110322 89400 -152853 -46301 17041 -258787 -75544 236500 -177129 -68681
18187 -73845 -160944 -242799 -229509 -144445 -222316 -216698 22670 86596 25955 -21281 8153 -373298
18174 -446485 -113091 -73540 -109440 -290959 -22043 -36899 -76823 -77589 -28718 -45170 -188957
18163 -188957 -188282 -50567 -86856 164150 -129174 -108483 202080 187660 -244988 73368 -283176
18151 47379 257002 128755 -156488 93991 -99328 88896 -156303 485067 -193527 -67623
18140 -231215 16656 -94070 72434 28711 -364274 -124193 -203398 -134414 272757 11211 237960
18129 237960 -66535 293855 182210 84485 -147533 -206107 106542 2204 342104 198631
18119 198631 65370 62518 70369 156679 -262736 138105 -232000 -12906 -213348 88741 -25211
18107 -386447 182189 211573 -39389 -76229 -40130 -168952 50625 -378688 324713 116003
18096 160223 -135593 138981 -412607 -158280 -121925 -242797 43549 139501 -40250 -367290
18086 -367290 -51393 -73643 -265839 29658 -26282 -76086 -54676 336441 55680 -204603 130198
18074 -245736 -7889 -226277 122006 -9882 20829 101740 141896 -144094 28052 -107712 64184
18062 -205092 -94657 19543 145369 -24976 -120172 121419 71348 -201524 -191696 -34065 -170968
18051 -170968 54512 79626 -285815 -46829 48712 160422 162985 220024 36734 20031 -55667
18039 107829 42430 -59283 183504 64052 170524 215410 132149 27780 -324208 263798 -231559
18027 -42612 103802 32632 -251983 415687 62998 8402 37133 152821 -99771 42374 -151314
18015 39343 -3246 -277941 -104710 159576 91137 -28402 -316490 -121233 270822 -118175
18004 49491 -133574 -108965 66660 -188801 -112495 222463 376302 211836 13190 -139271
17993 -5395 116350 -140939 20885 -20607 165738 15069 51242 -263960 -189764 -3478 313311
17981 -226165 -110671 -4128 46816 44865 -312100 -306739 -39004 50338 141776 129740 -66734 -312474
17969 -312474 -18008 136526 167764 71559 270143 24005 241011 -144471 -135840 286849 96629
17957 -182710 -32258 -47738 111309 268428 93501 140450 -57480 205084 170352 -212620 -31598
17945 211040 181775 56558 -215082 -76828 -91769 160459 17233 188115 295764 -212921
17934 -86908 145991 13369 131435 -108182 290258 -152804 -35953 119218 -101381 -201773
17924 -201773 -42530 272762 -314381 -157030 -4097 -75239 -31842 17061 -196869 -241734 234239
17912 215978 -1923 126323 2335 -13828 -90821 124847 123953 -57825 -77703 248125 -38370 -65924
17900 -65924 500548 -254513 -44550 2135 -424559 -65882 46308 90729 273758 -298029 -48442
17888 297441 -234902 28510 -198498 -123960 45773 -112290 -105756 220847 88921 -56209 -220803
17877 -220803 -120898 -17172 317806 -290852 263718 135619 -189546 113841 -53659 -205694
17867 -205694 -51465 -295764 -13399 -191766 13876 -21234 -12912 127082 -40023 -131604 217620
17855 571867 127349 286801 272711 148690 -234650 170517 286169 345932 200336 -90956
17844 189339 -125538 -214032 -8861 145398 -92753 57191 239521 -57811 -134411 30789 -109473
17832 164780 -209840 58206 166819 -74834 -68961 -106628 31959 -50368 279314 -222112 156176
17820 42907 104541 199671 141640 130426 -171846 -86813 -271268 -8245 248153 -62710 -201964
17809 -201964 220993 -134095 -189230 -123789 246662 134902 -193618 -103609 188043 314758
17799 314758 38542 331217 -198997 362612 -56457 71 35512 -19112 282101 -48800 151202
17787 -221919 51728 -4376 167762 -58425 166688 -15924 245290 98043 30636 -45489 -17356
17775 -254209 -14361 -61302 -55954 66987 -123175 73519 -139146 115733 25084 -292087 -130835
17763 -65594 21513 -11741 -61275 323897 425134 61056 -32228 321911 -124679 -125967 265451
17751 266277 73782 77503 295477 400045 25340 -370275 174750 -75105 135722 3796 185377
17740 185377 269699 165931 38000 -220572 64625 76258 118981 163635 81299 -42555 117502
17728 75064 186678 34884 -258253 240139 9137 209432 12528 116117 213226 224090 15133
17716 -141821 156876 -247132 -13380 20524 -30018 135770 227054 112336 271992 249525
17706 249525 37340 -292459 197692 -281331 120994 -241261 296556 19770 29417 187928
17696 187928 -70302 -3745 427710 73451 241348 13602 311886 100993 314151 -149685
17685 -69703 -100578 323684 -89599 184065 -134549 -96903 -6017 186750 -66503 201566 102388
17674 102388 9707 248048 468744 246474 -2486 261573 -112373 295465 243885 304665 36580
17662 370280 35030 149623 -81128 -29081 -227 -63331 410947 -79249 251372 409467 92701
17650 20179 -7456 161172 176367 83433 184558 -62331 -8069 441898 -26080 80597 122476
17639 122476 -46747 -6372 263540 231193 313769 175795 284664 -161491 78160 -108485 -86825
17628 -86825 -139735 -70327 -201157 169832 353020 122921 128273 514087 444434 142928 20415
17616 -88856 218637 147016 -104497 128687 -101668 35770 138306 -69463 187938 141294
17606 141294 -102123 283740 -110479 50031 -190732 -77724 -378209 -268 264571 -98570 15263
17594 233092 33423 -54007 51113 91197 -45761 72467 66757 212042 159598 193497 140504
17583 140504 142273 87530 -147003 222293 576456 73778 -57846 349479 104364 322361
17573 322361 164567 280533 86782 269250 -269678 186797 -273269 154905 -113533 5356
17562 -43568 101234 270036 99970 -24728 409473 238894 97002 -144287 15257 -26923 -57208
17551 -57208 140501 384380 57996 426079 68974 227916 205636 123380 55598 143451 83534
17540 83534 -47437 245706 -291494 198431 36481 -45610 -22151 333206 162361 535095
17530 535095 398818 315610 41924 132545 66286 238620 219302 154393 77540 117493 14254
17518 372509 253769 377385 417805 223960 387500 425450 208894 733426 781158 807591
17508 807591 793982 810353 599295 619260 482692 435821 211386 578454 156272 818989
17498 818989 790187 616844 642597 406566 825450 632843 622501 425318 336984 464838
17488 464838 418509 358274 256141 192925 152996 561231 348461 52138 197202 244456 462405
17477 462405 305685 32887 453912 17529 234045 288494 541147 227160 209391 54945
17466 172315 258317 175404 -71777 516303 -57355 143664 312205 152215 275682 170603
17456 170603 263479 -126660 460961 212006 120747 320185 478114 339073 325276 518370
17446 518370 45385 375329 192205 110020 45983 100647 -164714 -76224 403598 165578
17435 332264 355767 172843 476699 321958 195140 707555 480417 430498 177727 379671
17425 379671 252305 151224 259699 288517 517214 119264 174455 -30655 42867 220311
17415 220311 -222709 766468 191076 563577 627250 396098 330728 150760 416102 367357
17405 367357 214838 247259 257272 405999 315818 103534 441585 431166 149166 415338
17395 415338 653119 8457 -27377 42188 165209 -30701 245100 396028 -52515 82031 175435
17384 175435 68242 138528 158711 164144 97998 60620 244557 -70427 311746 254409 151809
17373 151809 278379 84333 229785 321059 228363 96584 230678 568116 326326 105269
17362 276085 300745 132623 271899 17616 -17319 224192 -159187 405992 273025 680084
17352 680084 368327 124641 261769 392997 573391 403962 140028 87933 540612 290864
17342 290864 462500 218751 175537 250205 -10056 153972 348339 -34476 330073 428190
17332 428190 290477 350104 356497 52142 17156 23318 49793 418456 -104664 -186261 308317
17320 219954 404222 546193 -30657 176724 -44106 158970 149587 510486 319592 476867
17310 476867 207325 22446 205103 328496 270222 355944 250913 190786 -4338 357161 212625
17299 212625 295762 464138 332110 429454 200282 352119 153913 405316 309818 529023
17289 529023 136901 198866 346323 82733 486597 155539 39352 53551 641319 212830
17278 467550 391913 347776 430493 229370 374400 302016 315211 226463 360284 213535 167245
17267 167245 4117 435951 200036 335551 44601 211631 106230 303183 211930 349279
17257 349279 451697 320763 311964 397168 282324 360738 239192 157264 195424 488814 519106
17246 519106 328874 194311 451086 161001 161255 286244 355328 265593 215358 432663 164140
17234 225040 235201 15431 213257 544671 162160 470606 586189 269762 193915 57173
17223 360366 344957 413182 198274 324792 202615 377202 516046 368821 188473 324128
17213 324128 629538 350253 128494 218457 539458 587164 135808 502832 297333 508325
17203 508325 428751 516694 145865 366900 487586 335495 528686 455208 99373 271313
17193 271313 496763 374617 183044 552854 111390 682956 509804 422443 896595 503005
17183 503005 492861 299072 362841 223232 180455 584965 451736 378819 42991 540045
17173 540045 393222 406986 459947 188281 496422 345252 696602 501856 267948 613283
17163 613283 496475 302544 555885 326121 426194 495190 186364 465116 436305 293235
17153 293235 517483 524938 709173 332888 449030 172359 618281 392922 589228 400968
17143 400968 331623 788129 582155 532141 294728 375347 342600 612666 520408 326611
17133 326611 639090 187807 171828 428618 553946 672935 615001 491416 506059 853308
17123 853308 298447 608580 566090 704341 417795 462763 336060 933896 522600 747249
17113 747249 298472 934437 499739 494556 579048 439822 365555 535553 648364 654434 668170
17102 668170 406648 204945 343101 576417 623096 788303 837953 494407 722875 496370
17092 496370 279099 685969 592053 756145 472820 730695 604635 603489 396446 772005
17082 772005 827620 572830 730039 696481 670656 617355 581078 509418 834523 484341 698647
17071 698647 613334 544589 570900 612509 338672 804270 624207 756215 628249 542341
17061 542341 727409 433229 640627 819515 982114 865677 501938 435299 1100657 732421
17051 732421 1046111 648982 972924 936666 501849 922581 557809 611544 718911 790701
17041 790701 576046 1036195 1134308 985032 804615 931615 511501 822924 523717 948351
17031 948351 946418 812204 770410 936552 536915 1334213 905137 1004836 754246 804623
17021 804623 1171977 770426 809006 958344 827901 737406 1163370 1190442 764063 811597
17011 811597 976534 963280 911769 879582 1218379 922401 792497 1019682 1065472 1086135
17001 1086135 1393862 730581 830798 977357 660119 1012273 1076665 1003765 889217 1367781
16991 1367781 1366390 1085586 1182703 1226803 1368310 982448 1122046 1300690 1053219 1137490
16981 1137490 865359 1421764 1177360 1049320 1259830 1280702 1302219 1353350 1194750 1135253
16971 1135253 1621337 1126107 1240307 1343918 1235724 1261158 1232976 1445700 1355340 1192222
16961 1192222 1409859 1518539 1460655 1420797 1338590 1328515 1444129 1618125 1688791 1584029
16951 1584029 1615560 1408092 1596692 1667815 1726729 1125970 1671699 1397643 1442573 1756510
16941 1756510 1537200 1811898 1590451 1493126 1794483 1750521 1716716 1870729 1896892 1671332
16931 1671332 1604586 1803296 1942058 1523565 1651803 1924245 2012675 1974269 1759133 2091139
16921 2091139 2169436 2166382 2184908 2321154 2235033 1986742 1918692 2137726 2118522 2146945 1783773
16910 1783773 2372620 2253380 2166424 2096316 2408937 2436831 2092102 2219623 2330974 2445279
16900 2445279 2272626 2419973 2553299 2496978 2375816 2527105 2313777 2612570 2610899 2896035
16890 2896035 2860050 2940797 2809028 2492244 2784711 3027672 2795905 2853941 3117576 2666658
16880 2666658 3147859 3048653 3135633 2925586 3260237 3418614 3032830 3135437 3214737 3266210
16870 3266210 3344867 3333717 3407817 3778230 3447301 3406898 3590005 3415711 3566853 3563978
16860 3563978 3681926 3841796 3596697 3913674 3794252 3731459 4090014 4376589 4317043 4251223
16850 4251223 4325490 4423957 4454507 4297947 4523047 4499953 4731587 4821748 4684664 4721492
16840 4721492 5089499 4782261 5246007 5324016 5272464 5627649 5310217 5229400 5661922 5594908
16830 5594908 5698402 5824774 5911432 5578598 6067088 5988345 6395062 6239810 6548809 6763429
16820 6763429 6550553 6576510 6875250 7070489 7390106 7143142 7444633 7532903 7779358 7681989
16810 7681989 8054847 8109177 8173371 8599485 8638954 8721127 8926250 9052165 9124647 9342881
16800 9342881 9434881 9935689 10325060 10112859 10329700 10797618 10602206 10797345 11405839 11334376
16790 11334376 11802293 11885508 12268626 12642053 12928545 13115466 13246032 13839292 14246167
16781 14246167 14708809 14480349 15559369 15561892 16034332 16373883 16966353 17240559 17756008
16772 17756008 18173738 18431144 19020086 19727280 19934957 20808347 21626043 22106723 22893733
16763 22893733 23137949 23926495 24659485 25193662 26281792 27106678 27976088 28966191 29659187
16754 29659187 30278389 31787789 32872615 33748819 35012480 36379732 37216298 38677225
16746 38677225 40463012 41419639 43109166 44570416 46144127 47955771 49357095 51337296
16738 51337296 53319080 55281468 57484699 59357528 61568905 64012767 66168315 68508595
16730 68508595 71074085 73671506 76153586 78729273 81620785 84265237 86422223 89290205
16722 89290205 91835906 94536317 97073257 99590409 101718200 103899174 106033595 108101050
16714 108101050 109669437 111151305 112106494 113163929 113616559 114070096 114451925 114042455 113338758
16705 113338758 112774612 112005557 111036470 109023184 107374167 105775227 103488726 101258309
16697 101258309 98747531 96441093 93829289 90933129 88629516 86011952 82913358 80448662
16689 80448662 77797275 75008207 72163136 69881092 67630712 65314155 62710231 60444062
16681 60444062 58356328 56436459 54272626 52010215 50373888 48661975 46881250 45064156
16673 45064156 43641879 41936440 40465030 38983258 37844779 36269125 35139046 34012305
16665 34012305 32903365 31758017 30809123 29710528 28865890 27910986 27176326 25976341 25470061
16656 25470061 24542838 23837696 23399233 22237586 21721632 21328001 20563865 19993793 19384825
16647 19384825 18697665 18309113 17869492 17107726 16705484 16527141 16094932 15481399 14996047
16638 14996047 14808747 14462782 14083714 13696295 13244951 13370288 12857094 12269075 12066142
16629 12066142 11942134 11570919 11144501 11068013 10764756 10557900 10312540 10333094 9862427 9626237
16619 9626237 9393619 9242125 8958686 9007590 8587995 8783340 8429913 8387635 7932661 7965694
16609 7965694 8038802 7521315 7229851 7456292 6999554 7302614 6914057 6701283 6610935 6154761
16599 6154761 6398024 6320864 6157094 6512617 5745070 6233484 5912988 5828372 5780103 5146595
16589 5146595 5535293 5184610 5464167 5289265 5741457 5005428 5023086 5233736 4940417 4828319
16579 4828319 4572322 4939842 4343742 4388131 4415824 4081528 4187964 4301029 4129916 4129024
16569 4129024 4200278 4214241 3885658 3743318 3889749 3817896 3895728 3348634 3685685 3310546
16559 3310546 3451412 3656891 3473574 3436686 3058649 3328750 3430268 3444889 3064664 3309869
16549 3309869 2757371 3308335 2967935 2909743 2766218 2922822 2688421 3241167 2994353 2923435
16539 2923435 2893561 2785816 2719855 2657848 2932616 2601443 2514954 2571762 2375819 2398930
16529 2398930 2453656 2571420 2261814 2676497 2463232 2480600 2365161 2206859 1984251 2080553
16519 2080553 2483501 2377872 2075096 2001570 2539839 2027107 2092764 2195489 1580112 1701616
16509 1701616 2102696 1792102 2137161 1997217 1934079 1874891 1875143 1840389 2069223 1594133
16499 1594133 1652324 1934434 1546025 1578742 1526241 1867506 1757557 1660115 1554411 1732072
16489 1732072 1630128 1576808 1726633 1688069 1685975 1455446 1446547 1795274 1404914 1353481 1517699
16478 1517699 1462990 1788211 1568301 1312708 1455021 1458394 1496421 1471437 1406177 1496084 1365809
16467 1365809 1878475 1099393 1300774 1512446 1525700 1570461 1291306 1203698 1211731 996458
16457 996458 1396330 1079294 931825 1268205 1064738 1273520 1371735 1070305 860701 1273436
16447 1273436 1081100 1129323 1160215 1134132 1063538 1268515 884707 1060222 1085622 1215769
16437 1215769 971100 832379 987560 704342 1097374 918016 954771 849829 917246 660353
16427 660353 1225619 808844 633238 682999 989173 776634 1039996 846534 1040869 1109359
16417 1109359 850925 1031454 676610 977521 768330 1197486 1005798 848842 1187022
16408 1187022 793021 900674 929383 802612 1016981 941134 931789 931434 520523 634705 735820
16397 735820 871538 903257 634177 733099 1055106 827969 1086550 1068067 570845 993128
16387 993128 742366 624493 557947 852873 513059 659799 832060 992309 854209 697606
16377 697606 783484 603490 883677 628575 641682 641020 780209 679252 572060 469335
16367 469335 883041 987968 592564 554456 1028732 247840 759065 451529 687386 281144
16356 483324 482313 349264 193462 526470 792253 508643 698676 745160 863231 377959
16345 718136 544138 488679 652435 476462 574880 444883 396240 751786 346648 265514
16335 265514 583765 195008 614576 360412 584347 458264 490602 476959 734737 145539
16324 647367 604396 -80802 537107 524176 563712 553472 361342 342622 418486 459962 525420
16313 525420 489391 492754 492560 579303 348257 557543 237831 452318 209905 311466 309944
16302 309944 386684 180841 324711 240870 628241 433500 145484 508838 314839 232391
16292 232391 492965 28672 710792 85347 324140 863410 454382 585752 340125 238187
16282 238187 240757 258638 624600 320010 402088 400463 455261 434084 391223 405456 321937
16271 321937 349498 556977 63709 146855 214486 137666 -149111 431216 263786 24701 108287
16260 108287 450276 181372 420025 250030 558764 232833 326939 279658 423220 585787
16250 585787 325861 392885 325760 43417 269039 442711 377310 53050 283180 477822
16240 477822 259017 451443 270408 450781 257604 255240 113130 -8623 297245 106571
16229 344531 254306 249592 71012 586028 324623 369118 228583 62391 259063 246433 540276
16218 540276 518374 280391 175982 159662 145478 186633 271358 274829 131473 243018 370160
16207 370160 475718 -45953 124579 99156 232498 353845 263566 438483 219662 254406
16197 254406 353326 187009 87117 235051 478643 163407 381074 194464 77454 101779
16187 101779 250161 73938 135005 -2855 168445 184127 363054 254988 163963 129546 288393
16176 288393 148300 82844 363439 -62778 285798 72706 209825 248726 50301 162160
16166 162160 271512 236021 180745 257131 165038 375800 10089 51734 259324 184343 -20820
16154 593066 239887 98314 -75760 184532 -238883 -169814 34406 14324 333961 266622 54681
16142 334256 88493 290773 119109 33221 50257 94274 248775 85398 178883 125391 21502
16130 185933 205153 217785 195296 446144 32893 -15976 -102012 82577 191598 27303 149068
16119 149068 261616 -75773 34708 94205 -154165 -147530 -42264 -3909 -32995 306973 243812
16108 243812 78977 326825 -51998 349054 179314 7424 -82803 120710 -132492 97194 197568
16097 197568 119370 33232 -174628 -30635 -224799 54136 19345 192209 228715 -154314 -65153
16085 349348 -19569 205321 223294 277511 64567 -264091 50807 -29204 307757 36768 585066
16074 585066 -109352 -52699 60085 827 132234 74963 154499 -301294 -207373 -133036 372707
16062 283162 100001 67645 220306 76505 255999 252589 160895 -111897 128397 41476 -396110
16050 264989 -357973 454112 -198837 187048 -82196 20701 324159 194879 166246 226844
16040 226844 -166860 -95238 193012 -213673 84850 97910 -163508 385054 -22479 -51618
16030 -51618 -280733 -59897 74952 -132005 53085 -158665 33580 218031 -112833 -342128
16020 -342128 241509 172187 -245011 175356 143145 220726 -7318 -95209 101821 259811 79366
16008 -17172 -192323 -196657 33725 129071 184239 122682 -270912 -119484 -97811 218889 100008
15996 -9390 -90842 -11895 188776 5258 -18844 -31059 42899 -102915 180284 370932 -152796
15984 71374 316945 140482 -38688 150910 17530 24944 -35083 162226 295908 267115 481582
15973 481582 123498 305347 724070 829927 982903 1160185 821675 713195 537235 253062
15962 147955 278260 -149802 -51513 115767 -205943 -256790 2228 -14474 -87458 87293 -134702
15950 272569 203203 123065 387885 -152821 -227725 33839 80994 79814 93262 57196 -11786
15938 -13740 35783 104247 -111350 -140742 196311 -153847 22867 -85029 -120033 4011 -140728
15926 55442 68733 723 -175065 81534 -249459 -84309 36453 334975 -87263 -621 -130172 112016
15913 180241 -99290 -153244 -321359 82310 42818 166249 -105280 -201741 170878 -35260 -383941
15902 -383941 41672 -74759 201287 90499 18510 -324684 -17925 218204 -141595 89734 72370
15891 72370 -53522 -161368 416133 -238545 -121055 286020 225304 255966 110293 -85636
15880 -473333 239520 -132370 189514 -107347 287084 -104365 230206 -104685 -135200 -85239
15870 -85239 101938 -26115 223122 -123703 -247172 -131074 -369713 253763 -331856 -35421
15859 37865 -163883 -199312 129498 -152459 -31721 143878 14050 -394946 -170930 -130690
15849 -130690 104902 -239854 -265511 85416 -33663 237291 236020 -220928 -341895 171178
15838 358854 29694 -62999 307946 -131618 216916 115428 -233714 -245036 -312917 270355
15827 -95800 283171 90220 257317 -529449 -38383 -235129 5558 -123404 -129272 -174849 316073
15815 -84340 15619 87816 109470 -336006 422599 166880 18434 -15926 -144198 -310271 -56336
15803 203058 -324110 -30161 174896 -143431 -314894 -314345 -14298 26366 -222855 -70133 -71169
15792 -71169 84320 44722 141835 162254 65716 260393 247356 98943 -193449 123887 -290373
15780 -2376 -201811 150700 -4006 89205 237088 351357 -182947 -232290 2797 -301622 332715
15768 -108167 -288586 -227431 189095 112596 -290541 66346 231852 407030 -168674 40266
15757 50778 -103893 171890 266151 -249172 68524 120758 -12990 203487 36585 225927 260695
15746 260695 -392413 -24677 428293 -111597 1883 111907 18539 35054 161126 3877 -381716
15734 -156478 24070 197243 -53688 39986 -151646 -178193 166019 -25403 -44651 274000 60336
15722 7594 60171 -177398 -101660 143316 -299114 -136094 25176 52580 -175893 -51955 -293928
15711 -293928 -63059 174636 -273575 134254 -8957 -210639 72814 25966 33814 -98063 -76572
15700 -76572 -53842 -91361 34308 9334 -195702 141013 -26410 46464 -130453 -906 116747
15688 -49475 340112 20200 -34295 -338193 75503 100886 -35869 -29040 -12750 48034 164213
15677 164213 135450 247149 -255403 -42409 85449 -64618 -79010 11318 -235761 6088 -194177
15665 2682 23715 -64140 -287798 -85007 -182589 -174604 70386 43469 -128418 -75162 -141162 219695
15652 234642 23568 -283626 163984 -34456 -50572 -69007 70326 -99629 -154420 280161 -39935
15640 -69703 -4986 -127951 -72416 -105178 271475 35423 143924 -38138 142317 -50372 178390
15628 521528 -189915 -237219 209008 136542 96420 119873 85757 -24462 149518 -188092 -191237
15617 -191237 14618 -127568 -228365 -126215 -170933 42767 60543 -235494 -21052 30152 19432
15606 19432 20838 -359002 -304640 -324365 62057 -21942 -68756 83792 -221306 68104 -1697 20059
15593 228055 295569 -259178 1422 154403 -22833 -27068 20321 346898 21193 -11891 -48016
15582 -48016 129562 76842 143154 80808 -373231 -58889 193381 -360363 58265 -49096 16590
15570 -90986 -52936 -25492 81206 -13296 -93988 158374 61677 261989 -196369 -172251 67547
15558 80911 4844 -155461 -47330 64607 -137363 -42062 -139961 66401 136552 -253252 38950
15546 -415220 -75884 17536 -105014 211519 -40027 206405 19204 -201187 -8744 79818 -117574
15534 -96116 -5327 -424891 -98389 -95712 14433 -28236 205216 -124078 -135943 -140668 33897 67742
15522 67742 242080 -67387 90411 114586 26421 -20662 -8436 86510 65219 -23901 321772
15510 -103153 -79116 1687 14261 -126499 374001 190174 330257 79559 -11831 -39066 -140333
15499 -140333 136394 140057 135830 344666 452927 180026 330156 231739 31955 -7603 250250
15487 253786 107822 42349 77276 278086 81325 62853 -74599 -14536 20676 508559 96806
15475 170875 243619 438500 -138050 -72735 -65962 -38009 -127447 144528 365249 134927 10882
15463 250430 357597 73232 107131 487508 508365 561218 427872 475009 268235 -125615
15452 15034 113022 3736 18120 144073 179514 5854 54166 413341 232618 218323 -285069
15440 -150610 250328 722 -266379 225393 207138 219974 37294 -149349 -202596 230609 377485
15429 377485 329604 434611 648339 921506 986145 562547 618897 277121 458136 219538
15418 -230638 277528 125574 243841 176193 289084 39467 -152261 170675 -72717 262967
15407 4371 -228169 -202740 -156180 201476 100941 -121676 -43381 -112171 45612 149927 127849
15396 127849 118080 -89389 203762 -180029 -164352 108938 -123865 -186436 -26593 33158 -123557
15384 185896 15293 -152442 -403900 113776 89507 129123 40289 -246589 90744 -246658
15373 -117295 -68897 -34088 247866 -14987 -93027 -155642 -78902 -116110 441177 -200922 165160
15361 -93974 49658 -74289 -499797 187498 125125 -200148 -218518 38129 58003 -188139 246190
15349 263691 -5683 351278 110621 367963 256387 285441 44055 67978 19303 351793 212731
15338 212731 120248 107638 161717 42004 68439 541028 337226 -15072 378409 394385 483542
15327 483542 323572 8135 -42241 109880 192985 217687 174870 -105434 51056 -30712 142159
15315 -25404 -121334 -211806 428022 100441 191739 50257 102746 208146 -83140 66839 -1800
15303 145633 -68135 107893 -74403 433190 207212 -207957 514552 416704 91235 148118
15293 148118 58173 52697 246607 -305445 102189 104202 92856 154472 50837 146020 -230262
15281 -309377 235989 198654 195371 24305 -41033 -161537 120417 77059 -76111 15772 121231
15270 121231 196152 -203263 46117 76428 209722 265492 -19733 -254502 -57426 178854 140134
15259 140134 74928 394844 -93694 69673 -45420 -10845 -93198 90204 -166005 228272 -177300
15247 15710 137139 119056 -2118 -171912 -160632 -168558 242677 72633 -109537 255915 271682
15236 271682 313281 420960 187491 424035 67140 55140 427778 545626 477419 807195
15226 807195 1518993 1350998 1271578 1322887 783401 216272 247731 181559 150061 -160361
15215 278085 212374 202841 414243 -153502 106185 -276195 53881 109500 -94847 54349 -61910
15203 -176633 -102333 119528 223197 119427 159024 285211 129982 -29475 24295 -302615
15192 64856 -3946 -28565 -164381 -225529 62505 92673 296763 -228857 -2740 59472 -140247
15180 49586 127991 -53805 86569 210577 -14173 -222464 381272 355808 415179 -92135 56100
15168 -28235 -74210 252473 -107437 -16833 -137929 57954 87008 80602 173527 341 -172498
15156 -16391 55148 71798 87571 499550 30133 -23842 140650 311676 331246 28995 186254
15145 186254 15307 264171 202338 22620 148940 -74095 -11684 -226141 106792 -43845 352389
15133 -37924 106810 126328 280443 -22081 54563 345264 71167 236763 91345 253661 103212
15121 162012 -9945 -26850 213016 263125 45233 93214 77172 204050 132958 336145 323266
15110 323266 81571 344513 233195 329200 121407 386645 145725 105223 271165 -26706
15099 23092 19392 -55087 -58145 49899 105459 85169 381656 -47345 203387 -9313 -179744 374773
15086 -51872 195388 59659 231614 210473 345372 179621 -45718 185476 369418 112367
15075 -9257 368726 -43020 379095 -157752 -213107 -90739 -25678 336124 57908 241003 112465
15063 -88694 256106 201503 -104711 90800 -3242 227919 240504 -27979 123501 56791 217750
15052 217750 161061 258272 97981 339022 99589 330205 140155 2299 -27382 134671 104357
15041 104357 78535 134045 326856 329177 187337 126326 294485 339557 122806 225693 78341
15029 253749 38279 386392 264758 376165 136753 416772 624237 -155793 413914 594161
15019 594161 45194 299055 311123 431569 388573 560174 753298 212916 429312 435885
15009 435885 604897 659558 164977 352324 493370 345630 163930 522369 255229 258296
14999 258296 311091 146373 570291 459836 441447 692479 470702 287611 486319 451308
14989 451308 487559 236705 156034 414000 523282 385052 442318 98072 122092 547662
14979 547662 351802 478287 355040 261939 462002 565499 751436 465703 583766 578503
14969 578503 319671 827490 548031 628896 722321 366571 542928 499158 188074 591198
14959 591198 594362 184313 574056 572586 507484 612705 441701 275556 15691 207193 428519
14948 428519 401772 156204 332599 321587 370713 283763 383428 259515 362247 -19601 289994
14936 414877 76670 565033 157500 390865 230090 446283 600121 819744 397841 669650
14926 669650 674838 526571 519832 465234 417013 512583 253170 609777 649955 592435 801254
14915 801254 1191893 947207 992516 1161749 1340463 1155060 1424171 1281019 1459458 1289084
14905 1289084 1432344 1374951 1714865 1799397 1858803 1827157 1699852 1109224 1298083 999362
14895 999362 770609 1074069 493083 169300 463410 437590 286850 543090 391283 233209
14885 233209 308392 298024 631194 455648 318706 377019 354414 796945 605741 493941
14875 493941 464048 287917 69287 684626 616352 614588 747824 874971 653390 730739 735168
14864 735168 774872 487937 813082 598568 417597 267842 417814 480417 560916 395614
14854 395614 175670 455249 515325 627998 542463 447041 390606 556083 901370 237588
14843 203147 587830 199402 209138 278598 734768 990862 748370 606859 211918 771524
14833 771524 416019 713672 478809 566589 640708 1063490 678107 962222 1027222 1106625
14823 1106625 1040839 662006 361420 661183 411457 453956 817654 344958 261389 688581
14813 688581 765842 582104 365700 615664 534639 458024 650354 520257 679890 709768
14803 709768 703230 652742 518877 771896 796424 731008 628822 696250 528228 844781 912323
14792 912323 711686 556213 632844 902938 661511 764047 539486 519180 403297 595718
14782 595718 679994 409738 637696 467403 626772 381281 224404 731106 351323 396118
14772 396118 481365 296697 693669 461302 638947 283650 716985 766298 441054 726930
14762 726930 584136 681300 1091093 658148 845912 667181 690633 646361 637789 879309
14752 879309 721671 512817 483491 599891 772225 485910 800194 524647 243156 411608
14742 411608 656354 746796 594918 829121 696088 508881 675571 834649 659839 583210
14732 583210 675936 971201 576606 567835 477482 646609 611650 519035 735751 611665 672022
14721 672022 1013899 714250 602110 1061972 1224695 1075712 1144812 1234196 1324173 1699388
14711 1699388 1405551 1461929 1198129 1061944 963437 919754 919723 898277 1034280 923059 1025020
14700 1025020 773009 877917 755387 1118728 755061 777713 438113 1048315 1262993 900022
14690 900022 1107344 1122280 1081090 1319493 1509932 1610135 1686134 1179338 1219403 1159172
14680 1159172 726419 955989 1123916 969720 608799 933700 857414 1086723 702360 846529
14670 846529 641673 1075820 749523 1023613 914403 549008 668488 808366 1012614 941663
14660 941663 707602 676309 963249 755684 865106 843217 886673 958842 740853 741176 873590
14649 873590 960893 870985 1406247 841193 904248 1045719 861228 834007 1110413 1040886
14639 1040886 1325580 1221539 1592524 1563267 1222488 1434286 1190110 1043182 1000866 1078716
14629 1078716 885539 1001224 716686 1061768 1364547 1432221 1088574 1229558 1264289 1291591
14619 1291591 1182051 1074996 975656 1190192 1264270 848354 1128968 1374781 1046166 1236003
14609 1236003 1618083 1272843 1251328 1168956 1231894 1586852 1370125 1305924 1554992 1179446
14599 1179446 1276235 1460878 1571220 1240947 1169228 1726173 1671657 1363108 1632784 1841473
14589 1841473 1493454 1465847 1739318 1821901 1552120 1480474 1506621 1552448 1803794 1268055
14579 1268055 1835996 1466901 1471334 1512342 1600316 1864038 1539505 1740725 1676407 1958819
14569 1958819 1649436 1810337 1507971 2056929 2034592 1985520 1367958 1767639 1554120 1887834
14559 1887834 1839182 1970161 2242458 1969570 2314034 2066822 2273699 2235780 1859775 2368409
14549 2368409 2051388 2188504 2550649 2746358 2717512 2572601 3064505 3220467 3221211 3759976
14539 3759976 3906309 4295202 5339518 5958897 7089735 9447536 13100912 19771751 30614746
14530 30614746 29712335 16844479 9360364 5377712 3971212 3561539 3040879 3378322
14522 3378322 4360748 4058215 2717381 2449090 2294645 2134613 2370921 2132396 2285289
14513 2285289 2021578 2208762 2217096 2218709 2382703 2189253 2311052 2112084 2166245 2380231
14503 2380231 2412610 2447943 2426774 2734329 2661707 2562283 2570314 2590677 2805051 2522489 2999212
14492 2999212 2736459 2842429 2852144 2606398 2853227 2789193 2990628 2785180 2654360 2881554
14482 2881554 3143718 2949164 2810645 3032501 3373559 3354237 3368293 3144122 3449152 3279139
14472 3279139 3627064 3546094 3207878 3321425 3494822 3082584 3750373 3607057 3604422 3507134
14462 3507134 3828885 3903004 3811814 3975134 4000819 3919092 3723403 4062971 4148413 4191278
14452 4191278 4058414 4035739 4365637 4560724 4046452 4175051 4598951 4572199 4331875 4688555
14442 4688555 4649732 4917033 4561954 4508653 4893696 4945197 4861755 4910697 5198616 5068070
14432 5068070 5486754 5161574 5417207 5576346 5440457 5772777 5620156 5714394 6113976 5892320
14422 5892320 5837471 5944580 6107147 6197880 6138076 6193202 6181052 6273439 6656196 6883577
14412 6883577 6655526 6961958 6692793 7424722 7133483 7290720 7518129 7339725 7853645
14403 7853645 8077813 7957088 8392480 8333562 8168545 8275099 8449730 8253190 8403193 8840616
14393 8840616 8576979 8816127 9555404 9392808 9997654 9636740 9671032 10103058 9822837 10323048
14383 10323048 10252697 10177176 10348897 11077998 11005535 10873423 11325281 11621101 11443393 11625240
14373 11625240 12015047 12128518 12662413 12849738 13090301 13429868 13828783 13917570 14222690
14364 14222690 14431172 14530582 14981794 14730541 15506610 15511739 15946442 16374475 16405389 16749602
14354 16749602 17300932 17783242 18061789 18440923 18909768 19292348 19762493 19890722 19936591
14345 19936591 21039728 21180884 21683845 22238571 22615779 23274797 23874554 24686039 25072066
14336 25072066 25887727 26065700 26899184 27760131 28171313 29081072 29948311 30766139 31532988
14327 31532988 32313150 33246405 33762436 35292577 36019526 37225955 38061199 39204555 40239371
14318 40239371 41703975 43016401 44499699 45584719 46662233 48647703 50553109 51857663
14310 51857663 53555519 55697964 57501573 59663438 61867015 63721977 66397458 68990033
14302 68990033 71407672 74085258 76927330 80284352 83268403 86276625 90487667 94172954
14294 94172954 98181768 102719647 107355008 112229488 117492292 122930727 129015635 135287089
14286 135287089 141844838 149082279 156274225 164143785 172719120 181429892 191203580 201069460
14278 201069460 211943124 223273531 235019971 247279775 259715841 273042704 286566685
14271 286566685 300163012 313793337 326486364 339526672 352290854 364200383 374827937
14264 374827937 384627896 393912213 402650197 411863350 419261503 425229222 427499739 428991420
14256 428991420 430699920 432486637 429004534 423373095 417839166 410595379 400610173 388921826
14248 388921826 375568976 361624501 348299944 335717458 321684872 308353481 295066005
14241 295066005 283112539 269862704 257793485 246269821 234819407 223602138 213433745
14234 213433745 203264251 193305367 184439223 175084510 166050537 158156424 150254226 143389402
14226 143389402 136534900 130017219 124291499 118283876 113342688 107910037 103185919 98665256
14218 98665256 94636881 90846751 87326821 83505479 80185906 77052926 73931013 71483243
14210 71483243 68396239 65867301 63565909 61374508 59278774 57062126 55246442 53301915
14202 53301915 51460364 49749992 48543740 47210471 45928991 44278782 42740072 41533714
14194 41533714 40381021 39655177 38730267 37418202 36096995 35138455 34101714 33308417 32369159
14185 32369159 31832491 30776500 29811371 28970108 28363783 27596532 27209982 26625522 25962604
14176 25962604 25145243 24379254 23870606 23312921 22962345 22328233 21777568 21619526 21130137
14167 21130137 20398510 20097184 19232822 19160601 18722803 18488091 17960487 17481748 17230929
14158 17230929 16999540 16547189 16152924 16037165 15268238 15384266 15155209 15347029 14585496
14149 14585496 14200323 13875226 13798397 13540126 13647477 13272248 12761334 12838411 12199733 12379277
14139 12379277 12211297 12111557 11313463 11602442 11473470 11216777 11034399 10811501 10343638
14130 10343638 10340162 10179239 10066429 9966331 9708296 9693890 9552653 9675718 9235403 9111729
14120 9111729 8774736 8801578 8338692 8696653 8851762 8274365 8140412 8147204 8109957 7665037
14110 7665037 7573809 7826018 7084472 7615581 7407124 7260831 7376110 6773380 7110183 6739592
14100 6739592 6779054 6582225 6309479 6330750 6503129 6315468 6135942 6301539 6203254 6044589
14090 6044589 5920579 5847643 6265917 5855327 5723944 5927415 5909386 5155428 5459185 5252533
14080 5252533 5446352 5121532 5031223 5150723 5026082 5179242 4760805 5302711 4981290 4757321
14070 4757321 5079203 4554883 4358547 4415547 4388131 4538221 4572912 4376259 4315167 4365822
14060 4365822 4372929 4039451 4249474 4059773 4292341 4000709 4268549 4050013 3912253 3845304
14050 3845304 3798429 3802584 3988137 3998266 3816460 3863376 3905818 3966316 3824657 3614484 4108816
14039 4108816 3670006 3649929 3604483 3280620 3101759 3282648 3384748 3186720 2703685 3197973
14029 3197973 3449828 3145215 3096525 3043984 3155160 3017267 2738386 2823753 3037676 2838902
14019 2838902 3117209 2783477 3163081 3071750 2474062 2924770 2892866 2834515 2837115 2541006
14009 2541006 2754493 2231598 2411977 2420356 2182964 2074044 2683201 2391035 2488005 2350447
13999 2350447 2389469 2394080 2150968 2283956 2415938 2005587 2147812 2045143 2296881 2126837
13989 2126837 2175655 1850273 2341322 2053269 2494978 2085626 1930872 2371891 2279234 2344082
13979 2344082 2847453 3016788 3029165 3599419 4354540 6009998 8990062 14368230 25766298
13970 25766298 31969645 20699180 13173859 8477782 6302147 4983129 4432569 3917247
13962 3917247 3427532 3197859 2818473 2997696 2903203 2602647 2653365 2575241 2683957 2242543
13952 2242543 2402286 2317013 2063534 2060356 2226697 2418307 1628365 1892466 1993222 1756929
13942 1756929 2016157 1847293 1782735 1724239 2052735 1576554 1969610 2067569 1907396 1880478
13932 1880478 1808832 1784909 1716931 1811677 1681335 1493128 1817087 1894900 1588107 1495134
13922 1495134 1790831 1345745 1736756 1559936 1458897 1526494 1400646 1591461 1545911 1609689
13912 1609689 1471086 1468341 1798347 1777956 1542146 1490857 1409039 1503560 1388726 1551051
13902 1551051 1452097 1267362 1340515 1813247 1354258 1441593 1367663 1479849 969809 1539836
13892 1539836 1079293 1161138 1326452 1372666 1206433 1111204 1453973 1409412 1070829 1014808
13882 1014808 1220843 1046527 1478661 1027225 1480440 775815 1388757 1139914 1296527
13873 1296527 1282444 991920 934142 1376940 1550535 1147001 1116601 908607 911427 947838
13863 947838 1042335 854041 1232371 992750 1249400 1090484 1208423 1017613 1097844 1318987
13853 1318987 1366696 933955 1026090 980469 876833 920342 837545 832480 609255 1054196 1068067
13842 1068067 1142177 836319 1034630 912021 836929 843924 897871 1009832 767248 766324 918491
13831 918491 776108 721640 577044 524762 788371 753828 676010 788203 917920 797150
13821 797150 1096156 1039378 1025340 869025 844881 851889 981957 575960 912717 1236817
13811 1236817 1025199 1399132 950401 888471 877069 1045925 860224 873475 690472 700664
13801 700664 503336 780406 491776 1021544 1026543 663088 779028 940606 755440 851517
13791 851517 1181179 873508 486470 1086622 977258 575897 772422 730378 458679 861551
13781 861551 739924 837598 696788 750892 307146 538900 905658 493259 705004 731222
13771 731222 787930 590909 603597 751381 934558 590888 682621 792292 738604 638848
13761 638848 721823 413381 412179 1008913 474447 561663 621541 718647 812340 695230 825065
13750 825065 772460 603235 672390 418185 676001 660377 650383 731069 441013 646041 483320
13739 483320 275349 642327 1089395 716410 577161 799349 660548 450849 790936 634924
13729 634924 654140 576659 624634 648639 688066 339936 885195 546306 817626 265209
13718 453412 794904 420926 665961 549143 498950 547644 406103 389689 607572 399793
13708 399793 494691 580501 182678 452386 673646 862822 475598 389738 516127 577949
13698 577949 277089 587288 674805 605021 756912 548082 557235 309943 411942 502319
13688 502319 549779 217373 588991 446976 629444 318647 449466 788498 413626 502591
13678 502591 727861 497804 582871 218109 608362 402734 541394 342598 432550 487442
13668 487442 577434 412340 420731 683264 183538 484773 720247 443677 382365 199436
13658 199436 488739 568893 198285 360880 483841 416717 734115 384298 293289 447203
13648 447203 133038 337821 679870 221866 351445 319684 226045 179781 550341 320526
13638 320526 144249 150243 423649 407648 192836 249168 442466 325688 509350 334127
13628 334127 517967 290055 509363 188690 220170 782479 289834 688202 419727 663108
13618 663108 285615 191442 275472 51949 206063 402048 363024 411175 144540 411546
13608 411546 470222 367551 355421 314854 183130 132187 141299 422413 354660 537077 477006
13597 477006 458379 -59603 504895 161171 626551 473638 595044 296743 306331 654700
13587 654700 271099 332330 198449 698259 324955 463477 107313 245266 70041 258268
13577 258268 287523 269304 536228 382203 441789 457381 220303 587000 321536 583960
13567 583960 -61741 245381 325403 431456 115228 232735 -39794 467140 71475 501119
13557 501119 393765 265218 472076 171065 511828 353924 206564 192555 322200 560433
13547 560433 42497 98336 490205 325536 91294 588008 137366 603868 215546 661901
13537 661901 273745 392583 50516 406882 155265 166816 353826 495282 254437 471068
13527 471068 246460 354817 401952 564880 505653 74488 520079 90484 76655 252362
13517 252362 180140 175732 405268 236380 318820 731653 239369 301204 193957 333746
13507 333746 90571 162122 172616 259541 429731 136751 -23728 383123 296516 385664 426495
13496 426495 125676 -44480 233110 208507 405210 232309 54787 33504 596077 250732
13485 207157 182209 582993 188436 431156 355025 484920 149987 464439 113942 626901
13475 626901 414169 203696 216413 188370 317160 357349 54 491859 409294 225706 210931
13464 210931 91681 137362 350168 135200 125536 414971 -829 209675 333003 92723 139851
13453 139851 327538 335249 86097 169899 480647 281030 337490 352379 285152 -115389 101286
13441 219530 440332 13351 453063 23627 176516 174399 57334 236784 32169 308370 -12451
13429 323517 133685 89666 29476 41082 188219 4543 113783 345186 -66655 232981 -56970
13417 63998 183008 121758 103856 103079 155563 119844 205800 -16117 487146 135417 149102
13406 149102 202182 120746 393142 635830 183407 265849 94548 101063 464568 229862 -55851
13394 367131 602407 113734 269715 159552 308928 237061 200611 175920 169784 57931 64696
13383 64696 475048 21975 -137741 226595 157109 291935 312748 112567 -131045 11242
13372 31318 -73387 -25063 66702 234983 193478 -58262 141612 233374 321399 -460065 139884
13360 151683 -56155 419167 118469 27186 241432 304829 100616 193973 387589 147246
13349 169910 225886 88955 566880 293470 289829 214098 210323 253459 343450 108501 31309
13337 42518 135279 347231 258238 425918 168265 252704 76106 -144 199660 186737 385824
13326 385824 63637 278412 298988 142159 -70710 572937 110794 410374 172141 258269
13316 258269 197985 -81909 564026 49357 220229 474279 154545 201350 197827 60405 121994
13305 121994 -37551 -29908 45760 248426 -10801 378831 -98986 23233 -43227 43779 -228659
13293 209879 95633 -10366 63336 102746 -75029 577051 57670 15276 91887 360171 219974
13282 219974 -53077 336711 302574 -110797 355411 164217 -54239 324967 385382 84066
13271 132486 -163878 137096 295166 -103993 230954 43324 -89410 -196114 -111164 -103279
13261 -103279 266911 155309 -103974 -186797 34555 -48413 48493 -102023 176006 25049
13250 -38000 180057 -7718 -214074 332031 338735 160247 199196 346354 -143091 -120210 177161
13238 253312 -8994 423438 180434 -265966 -27163 267008 292333 224422 -26589 17483 -26545
13226 -78435 -140944 182064 59120 212191 213671 171132 73604 176458 227569 70748 69935 273905
13214 273905 223783 175527 260481 228512 96487 -80109 -15196 41396 28987 -134562 101167
13202 -54818 236064 297530 123219 343291 380772 292691 22449 43699 119601 121221 68216
13191 68216 366588 146414 -21524 -159863 190867 -53135 82166 121751 258238 47464 -15033
13179 -98861 130799 -246064 13991 3866 280144 189467 76860 -29698 14511 -129255 271859
13167 320368 -125565 -50194 99157 24593 -188024 241849 24198 293610 -86426 258957
13156 231105 134759 144902 125628 42310 66903 -15042 164142 22825 146133 -142228 36785
13144 225594 -18491 13424 486551 -243438 -175063 -1959 86108 -151546 -196784 -224360 80241
13132 -3189 -41650 67717 23536 -138683 227603 81226 384567 149796 -84469 16861 45706
13121 45706 -78180 -103901 78642 -379356 -104702 537460 86409 -197371 114389 156170 -277666
13109 142759 -159219 -48624 62486 250128 141487 -55189 267719 -56327 -41241 198024
13098 96921 157043 -124963 -285861 150756 46041 259101 -92498 261087 219931 55451 270299
13087 270299 -241460 101979 -151591 -68595 343420 -22675 280927 1868 144009 -21357
13076 -301021 15071 159946 61026 555714 85173 109438 85728 16570 2558 -17973 -45823
13065 -45823 5393 -116377 23186 146554 140299 264203 118003 242200 63509 318645 257421
13054 257421 163226 143214 93178 89672 35343 -218823 -180734 365772 -28302 326784 -195461
13042 43450 34911 383775 -115108 -231538 236308 44296 -73883 20732 215980 177428 -81536
13030 151257 136870 -102785 148239 22498 -121669 16992 308608 18962 -119718 -179719
13020 -179719 252542 115279 65141 135327 110536 225200 -238389 47719 236597 178735
13010 178735 163141 23818 60935 -151572 43542 -5329 62033 101277 261050 -49629 5820
12998 124378 -52178 136944 -15769 270122 203457 -112089 29949 206770 181273 158916 251493
12987 251493 -133153 48088 19162 49236 181292 65145 -304862 -183364 -179557 129562 145905
12976 145905 361050 -140144 270855 -198099 282293 45780 -33589 -88334 -164643 122720
12965 76473 136448 993 166945 165067 251669 -90999 -174103 -398538 123684 -178307 50362
12953 -10268 237549 -21984 50780 66068 -21654 -40542 129424 104556 31579 -9661 45257
12941 53455 183529 46069 149440 -198352 -256839 43185 367736 -36714 70905 -156480 -50742
12929 28986 60936 -287352 93537 -170855 -34791 79196 -88883 292738 158322 -5189 377025
12917 -45692 -41161 57730 -75214 378664 -63544 -223628 77111 -263342 52362 141022 120771
12906 120771 -115678 21507 -101496 34098 -276704 529750 -219488 67476 -196888 15874
12895 5993 119439 29886 40793 11800 -216974 26334 103305 2226 -62078 94009 -107556
12883 16662 33011 128009 -118347 71241 224627 36095 61086 -266571 169350 63094 292539
12872 292539 95397 -21672 97648 209038 210175 -61991 40898 -24430 -88480 195705 -156372
12860 -18235 -187717 -174537 -116176 40492 -32843 174113 187834 226277 106075 117561 -107841
12848 246911 206567 96544 38684 59099 -169865 -190956 93792 57333 151037 -143005 439528
12836 175036 -88456 -114151 103317 208234 88176 -58323 -291714 -32140 -21921 72260 -196051
12824 33155 -200959 57814 27591 151777 -468636 -200299 -5618 32469 97950 -191518 167297
12812 -90795 29461 -20616 -23255 64553 14818 -140803 28034 47715 90831 21168 48936 -86613
12799 377274 74761 14286 151801 -109582 -110786 -128533 306444 -180728 247575 -38006 -36833
12788 -36833 -155263 56107 -88405 89891 -225578 -249513 77438 111594 529352 387776 -255842
12776 -161594 54986 15431 -11254 -6362 123336 -253383 17881 31586 -155547 11191 99833
12765 99833 -46570 260362 -7138 -122729 110041 44933 -103181 -80469 91676 -103844 -231487
12754 -231487 244321 117660 -289004 -38632 20589 40847 -114836 22957 114923 32274 -255480
12742 7108 211974 81251 -45192 186446 331096 201306 -418901 -111461 136947 55317
12731 -178714 230587 -4450 91373 223117 -181177 -246221 -267386 -207630 118448 72947 367426
12720 367426 -253466 -186864 97916 -137824 33136 -28431 -50294 60381 42267 240522 -45862
12708 -151639 -135070 -80585 128736 -69001 30867 44118 -104338 131562 261225 12888 -158723
12696 -14146 70727 -23079 163169 -278973 174512 515313 353652 523005 635 138790 110393
12685 110393 172619 134299 57054 -66712 131255 -141035 190287 -168420 245746 227954
12675 227954 -16252 20875 -16894 27950 -12692 -35470 -162624 107271 -23693 14964 -28826
12663 -122716 -186703 43939 241743 -19358 205530 -5322 -44078 103881 92428 263345 -33335
12651 -197719 -6050 -74457 -199010 -38744 254348 101046 49894 -303250 145037 159933 -174893
12639 101130 208270 310810 41492 304899 -4164 204167 -9776 115041 -46559 189183 -33013
12627 222240 -12963 -188011 -27259 165426 25347 -199010 204490 -8644 102956 -128709
12616 -53054 75883 175395 282788 -88266 -71710 -76421 427278 434787 242216 1494 -109447
12604 -248503 110212 -329651 30145 -88501 242030 37373 -110057 83063 31349 83947 -48263
12592 175515 -114020 -77628 -126708 -249339 58228 -37987 122835 -64547 198618 -13188 132650
12580 -211246 105859 134527 -67539 -49123 -8184 55525 23975 -135861 -177926 26170 304310
12569 304310 -188372 133541 59184 36189 268732 86110 156825 284671 225471 -94626 81102
12557 27656 -158685 147005 280323 -147249 -40117 166595 -133486 153922 -89862 93500
12546 -387222 95651 393803 -91929 50420 88279 35798 -10733 -212055 99321 161788 -25028
12534 21947 173904 -137666 25758 230060 -167420 -26121 56562 176850 -109321 181317
12523 322139 98335 -120130 37912 138994 -291116 19438 -197312 -400261 194692 227291
12513 227291 66169 208883 -5522 -64420 -151402 -110145 141318 -139090 -53881 -88226 70258
12501 67221 110556 -325267 338672 161700 2685 217854 -29908 18560 49593 -150051 264136
12489 -427930 57156 -139419 -366096 -189044 -348036 -18189 98327 -145729 143498 -12663
12478 107471 -310836 -79739 129670 171903 104023 123366 189576 -88629 39375 13666 109350
12467 109350 -124309 -140982 57403 92719 174814 -723 77173 -229466 22881 65346 -175222
12455 36008 -249753 -247858 7732 -210479 -26282 276822 3776 -260008 -105878 369089 74838
12443 -183836 -136767 270704 185893 44731 -86624 238733 258255 71955 62590 -783 -323938
12432 -323938 21912 -218304 59976 -204971 193782 -103513 134961 -206387 -367433 -396101
12422 -396101 14490 -196967 -61344 -183803 -251916 324699 -17658 17872 199388 -3551 -249250
12411 -249250 -86625 -292203 -307821 150968 212596 -187993 -211238 -505679 -164252 -157329 2995
12399 -186379 -23779 -100096 -173217 -578444 43535 -195840 -171899 -81929 146843 139620 -494
12387 -477919 240609 -25812 -350977 138019 94214 -17398 -112086 238608 -256904 -14394
12376 -168178 -121617 -93661 175936 358651 222351 134043 138687 235366 -66144 -165042 -92573
12365 -92573 28124 331827 266261 293155 342170 -64119 16163 121594 285838 128009 -386647
12353 167505 -381096 -159764 -34446 180873 -101994 -128346 -101225 -32753 -88050 -336313
12343 -336313 59534 -222903 -195271 252218 -20002 -4609 -32619 -54992 -84422 -17942 80116
12331 108213 -217373 -238240 -146282 -108108 -94203 113806 116245 10245 -134927 -138424 -61633
12319 210153 -275024 -4230 180935 50529 -55325 52781 266573 -167681 194499 68121 206794
12308 206794 53643 87842 -14540 -100187 64004 330018 -136655 75833 62059 73695 151242
12297 151242 148425 186832 8371 77755 63073 113396 8947 71203 39884 57528 14306 194905
12285 194905 -90633 540780 257465 -121344 310115 159589 38540 53222 24710 290586
12275 290586 -40128 18264 288089 137582 150760 295336 -76445 111548 92402 242964
12265 242964 156475 55751 -62381 175700 33428 -45388 -104731 247042 262972 143438 -136068
12253 159845 254758 -90641 317163 412885 11372 97750 173894 180870 27412 310184 212357
12242 212357 -149274 115684 121536 234945 189188 -108101 -105949 173618 373536 561473
12232 561473 82534 99907 134925 9496 113858 170936 98666 205012 112758 234294 81521
12220 -81624 76741 252375 10824 169164 217989 -134061 -73650 -66960 351168 81775 51116
12209 51116 156479 229965 128937 262392 123355 60983 63046 26994 349107 -259007 -3598
12197 323475 463567 71163 584120 47749 345589 48646 -350 -184414 39316 72456 230032
12186 230032 106509 197581 202158 190284 78268 181575 127260 154753 60426 1127 156972
12175 156972 346367 337517 128585 371217 101849 158531 21964 28046 239939 193236 -184999
12163 -57808 152163 431079 198582 134475 49504 -132493 259630 12039 -177445 -6421 342694
12151 462778 632148 -42719 208133 144103 412074 43646 344411 261058 497008 -211200
12140 -55437 243575 92857 433161 84107 87653 149343 58785 219202 -101821 257457 -215107
12128 70476 117562 -401007 298739 90588 359699 150511 -195825 66833 -114851 43518
12117 -100393 -37027 -71988 459400 277906 318373 126150 110257 20419 117742 200831 183077
12106 183077 334731 124602 79858 157585 -75329 230069 453873 166213 54157 243181
12096 243181 -22139 145360 219485 90814 -20553 111581 17929 314020 255849 -214719 114826
12084 -46311 -99357 188113 324742 65434 243123 -27224 -431714 -124726 -149168 260747
12073 373505 87801 118065 -6515 -223095 -26343 -2939 125313 351148 14383 -26518 70020
12061 47111 201148 98124 12500 -315297 265584 330482 112176 41197 54881 365895 -20704
12049 258374 -241461 -118172 510348 68677 176365 -111691 -6981 126349 -5964 -36106 73336
12037 -145046 -36143 332603 294199 312744 249064 -46809 -13665 -50671 -129208 -231061 35060
12025 23025 318572 120643 81984 -186972 255362 -102803 9209 321977 160161 -74871
12014 195203 -162320 81721 22955 -169614 277794 55969 -256440 -46808 55906 463235
12004 463235 -127102 -7264 281191 -64905 110810 289807 -375704 228811 -63913 -35049
11994 -35049 128208 193501 11215 1779 -21452 -149664 76585 -171129 144726 111089 -138544
11982 -78080 239937 -108056 -84232 -75989 -13056 1172 -9422 37875 -208650 1497 -209516 -126748
11970 -126748 -238474 -260239 183607 -41927 -320447 84556 -44899 352567 34626 -113594
11959 -228962 -140393 13424 34381 -243291 336604 -138339 400313 -57998 -424414 -88220
11948 -173646 -84834 -160323 -68238 81655 150692 159225 -94368 -84382 285750 128805 -36223
11936 37026 94807 138470 -64824 -240042 -347369 -294622 -45015 -16215 -95779 107448 115262
11925 115262 58199 229068 -194739 205373 -56091 247873 -120859 215598 -59124 -16862
11914 203174 -79329 51655 42293 -41778 -178571 106781 190169 -256674 81786 -251149 136169
11902 -120036 -38692 174888 18687 -131275 256957 8392 -25963 7936 -45272 -86124 111493
11890 -37016 -486515 41504 -384270 147051 126137 165431 -193572 -147811 253693 -24498 -412366
11879 -412366 363969 -431506 -186609 -289168 319077 -4250 -322908 361819 -226594 -132162
11869 -132162 -131731 7047 -250411 -350790 -62554 4590 -108665 -60014 -208559 -393351 182306
11857 361735 -22873 -140527 106078 19082 -123345 -158659 -160074 100584 -104015 108299
11846 -53497 113016 -51810 201863 42570 -28730 -28828 48485 60114 -124010 2831 -18946 -44556
11834 -44556 -455269 -33772 -99044 -128797 15913 100475 -281166 79001 44005 -285150 194162
11822 -212308 16970 -8842 -96702 -21701 -11662 21828 -40380 -13573 46043 240626 127434
11811 127434 -92049 42296 -144961 -531841 -32883 -52373 77145 231202 134909 -271422 142236
11799 14943 533101 -380539 -37112 -78664 -148076 85402 -82141 -5422 55686 130754 22113
11787 -132990 340157 -3868 152729 -134163 227737 183806 -61812 -222135 -319413 141316
11776 -119078 33049 -62647 204120 137952 88206 361593 -199112 -268745 -271765 -44413 -26975
11765 -26975 -140876 -136618 37387 -20596 85255 217793 293271 65532 -105996 -184380 -219667
11754 -219667 147384 -160604 277697 -142302 -112246 106317 -43816 -91786 147057 26442
11743 -102753 274283 -206380 135568 184794 65922 -157304 188370 57622 10448 -30449
11732 -20886 32973 102398 179938 -207087 185769 -196608 40854 10158 97255 -51099 3176
11720 -100622 164292 176520 -245962 -304076 68013 -118770 -153699 79562 -151864 127488
11709 42622 50385 259503 187216 -25929 -10345 192201 -39866 -268794 147610 -133235 -81220
11698 -81220 200126 159383 12535 200504 -67932 139905 370243 -105707 -182049 92131 -83342
11686 157656 -42382 -187812 105939 232142 -290672 -51707 -270343 -417756 -33088 -137325
11676 -137325 -173282 -444604 -169153 -8853 -110406 -100709 -516 -2601 -27603 139795 270022
11665 270022 68374 343412 92086 101855 97139 -123111 140933 -420215 -56455 -339871 277410
11653 198272 -125491 159352 -316934 69153 -138900 300939 -200908 88299 -118729 -153352
11643 -153352 -264674 198466 -199329 398221 45944 -253916 -149940 170161 62719 226326
11633 226326 252535 -1204 198440 -14797 109763 18243 -122957 -107643 200599 593 73630
11622 73630 -419814 76343 -68433 -45946 219583 25730 149192 -210279 254445 3027 -317570
11610 109658 -269183 -162157 -86496 84235 -176873 160965 -164456 125020 291771 3116
11599 -41070 -198965 149450 -335517 5068 -214148 394137 -81830 184401 30092 249370
11589 249370 -15207 48508 53519 -191777 108730 -44574 -140601 -331696 -226695 24939 5235
11577 249876 105513 -63339 -14333 -85184 67550 -240845 -75936 -32266 -253338 29448 206086
11566 206086 -178849 108693 70882 256441 -109475 -40822 -319857 -304576 177761 176222
11556 176222 382309 -320029 183196 -66075 113946 -47424 311831 -240413 183769 -162753
11545 12686 -248594 48604 301967 265390 -13507 772 132364 -18220 221763 -72431 84216
11533 219964 -59814 358565 145693 13353 240306 67571 28807 130278 -275550 81953
11522 -93382 301327 148645 185501 172915 17304 147789 167861 -83673 39251 87025 -9322
11510 73842 316373 137897 162086 20176 -87311 -145780 -142547 111040 -5563 207163 -88240
11498 133797 -181037 -96365 72645 -50306 126162 21966 138518 238773 -242521 96101
11487 -3016 296588 107092 -85915 357353 -111332 149978 12498 -79060 146062 -19390 -109910
11476 -109910 153589 14462 46830 351563 -32302 405797 -4915 -121291 1675 128434 59810
11464 23450 17431 86749 104193 -153044 -229270 299334 328254 198560 -32685 174643 -89461
11452 12236 201512 280494 40018 171374 26545 170238 242857 41863 -174072 369160 323773
11441 323773 64771 107085 106672 -47413 52881 755 98990 -11882 -48991 137664 128046 218881
11429 218881 264108 186478 189715 -148173 234140 229935 302094 184900 -25604 283284 -42181
11417 89389 -17773 124248 171452 16008 -100834 -182970 -54448 23127 64147 -43087 114910
11405 -76858 135155 -58501 378992 38571 -73576 -31762 -28697 -9987 -315259 167605 76945
11393 -38470 189112 -6437 53423 218545 -125673 -244543 132164 -222468 -232021 -154567 -79250
11382 -79250 -68985 -179063 -58215 283604 -28735 -17907 -113725 -232539 -237417 -373447 -264371
11371 -264371 -190647 -341715 -78913 -345774 112903 151445 -137607 110477 -276371 -158804
11361 -158804 57698 243150 66180 56836 105794 -10652 -115404 236253 66355 107617 -27287
11349 131341 -124765 -18771 -11803 -205 -12455 -125788 -129355 209153 195621 -374262 -105578
11337 191712 -154046 148637 -286179 259919 -306412 181157 -217342 178348 286623 -170870
11326 -191903 112336 -416253 -229420 47794 -93531 158927 109906 110935 181352 12503 -186349
11314 -232095 90359 67842 60880 23707 54332 -362544 105549 68246 -122483 5873 63679
11303 63679 -25629 -132293 -109886 -137549 17862 -21226 254918 190369 -209009 3960 28199
11292 28199 173955 -226969 -154729 -344916 -165217 442081 290372 -237632 -32837 -123577
11282 -123577 24703 -440389 -223557 116443 6717 113283 -594326 1487 124274 -102743
11271 -81348 -83439 -121539 -128825 -104609 18358 -180987 329622 -139022 -437975 276198 -43124
11259 -255992 -76695 -281733 37403 -26185 -221133 68782 20896 36008 -258090 -5554 -153380
11248 -153380 -166161 -33402 71087 -566 -392999 -39778 78595 78264 -202292 136072 200942 -65726
11235 -167380 -333865 -26703 7353 569 -221856 -11102 -150057 -679802 -219446 -75136 -2575
11223 91260 -366944 -152095 -309553 52278 29169 -147700 -56729 -238518 104986 -66017
11212 -31722 -56923 82787 17619 80207 76571 -160999 127952 -360458 -98792 -148509 12445
11200 -380285 134504 -209107 -380683 -174186 -374792 -12815 -130835 361542 -106258 -110913
11190 -110913 -330292 -170004 -81871 51075 -48904 -11336 -309570 -38582 -29025 -329477 4063
11178 372284 -10329 25921 -78203 -69879 -266193 137407 -101929 -279136 -20555 72309 14406
11166 247089 110186 53372 192560 -19475 -312360 -171664 81177 73357 270139 -129302
11155 -149249 -174346 30988 381117 94951 -237616 -22667 -168760 40846 38481 -16588 11067
11143 -168467 72514 5196 -60751 -29500 -197014 230722 194094 -44005 -198556 -109856 -72991
11132 -72991 -74166 376077 78005 -90018 -122932 -205394 -98957 -7658 -71782 -38976 88777 155102
11120 155102 -256484 -116649 -544441 35044 229079 -131545 102673 44149 64299 15222
11109 126030 -40764 65643 80584 -104491 229167 32097 -93183 22477 -56767 -153136 15943
11097 35667 -66415 -182396 176720 -103222 450447 -66475 298108 120820 3852 -49059 -184355
11086 -184355 474251 19100 212339 11126 -219830 -21622 243858 -103278 -99992 -59857 -10986
11074 91307 209547 276687 131616 10390 354026 -137830 -15632 -210240 141342 262827
11064 262827 -58693 269801 -98923 231892 162639 401775 100049 206826 384460 175330
11053 237404 140704 341615 136455 113323 147230 187987 173354 268968 375598 498781 401934
11042 401934 449009 643461 419981 626476 388139 576095 540613 583439 566671 408644
11032 408644 770361 509221 557901 537340 603989 807745 798201 457015 634787 644159 852755
11021 852755 437557 607328 807059 361439 545780 270772 556052 785470 652157 581576
11011 581576 509571 849893 559813 520003 390423 604851 625779 540470 144984 733771
11001 733771 510392 645747 608793 419928 414629 553452 495664 477469 415570 598758 482182
10990 482182 320845 519464 288159 400556 415493 653879 297430 603825 348446 520272
10980 520272 471631 740845 485510 476564 448222 391757 531740 742021 555650 566480 582397
10969 582397 762288 606847 646051 700387 728741 743639 959742 1033020 905712 1115768
10959 1115768 1064828 1484845 1568036 1763666 1883354 1861159 1533861 1969399 2202500 2035104
10949 2035104 2067697 2036416 1757423 1808666 1682485 1691836 1758472 1542000 1494184 1485446 1694809
10938 1694809 1225763 1885214 1810356 1217480 1340718 1173841 956386 1355531 777994 762270
10928 762270 491460 617632 543446 219235 95269 157599 156167 44382 106005 76533 -269006
10916 -23160 168661 70834 51752 -89831 110954 -37370 -17846 -233533 60355 30889 -8993
10904 -60623 23375 349487 8964 -57799 -125571 -138455 -238842 -146429 94859 -97837 -137021
10893 -137021 72838 -64003 -124948 -80809 -180729 538 -341346 243431 80012 -69879 301707
10881 53928 90182 -45807 150614 -172374 -373940 97461 -296232 174301 -4052 261060 55393
10869 92282 -106492 26227 -207431 -316582 142498 2698 -205942 169339 39449 -253415
10858 -22506 -162286 -298238 -113731 -46594 -64674 129117 -98412 86179 -38316 38005 -51644
10846 -120837 41351 -5003 35965 216916 68403 54976 26765 -244557 96429 -26084 36719
10834 344658 155254 281898 -198665 -292862 87750 -119579 243237 60652 5649 -207664
10823 -136290 -261675 -32675 -110735 -327128 -123882 -274992 114023 117921 227619 245570
10813 245570 -180898 8556 -190925 113642 -192949 -332829 -92387 28525 -92557 58180 -95068
10801 -44709 52810 -251430 -355518 -19747 148155 51665 26450 224731 88056 -34674 34597
10789 -145149 -62939 281078 -151075 -273703 -221908 -406002 -324757 65296 -333513 66051
10778 54067 73288 -213013 56938 52275 -172056 -243638 86393 -178827 -208984 315702 -60711
10766 -70428 118056 120864 -62470 -265298 90744 -208801 45050 -193194 27141 -99592 139443
10754 214278 -12930 210813 -261455 -115304 -121262 20086 -339777 -111447 -104777 -99253 -142740
10743 -142740 -17961 -337288 -400124 -236560 -226884 -271772 236432 -189532 141255 92624 212996
10732 212996 -356618 35289 8470 -53650 21230 -423234 11466 -10930 141682 17693 405549
10721 405549 28735 47598 -103906 157731 -176423 -172275 -155529 196264 91340 -194197 -19772
10709 -283859 -24338 -298486 -42066 -283769 -388598 32037 -77338 -58986 197109 184220 -302666
10697 119903 -441093 55005 138 -142108 -141742 -11072 -297891 -259950 122158 5593 197421
10686 197421 -12638 -154244 -106135 -348684 421608 25013 162866 -235311 -275881 165092
10675 3904 53416 -81338 117274 77384 -71364 -98845 -158332 180470 -213750 84245 -99376
10663 -129624 -337987 142968 -10849 141974 -284543 -43645 -148961 24172 220286 66326
10652 -414535 85672 -19336 -89004 -194401 -68251 -41318 12300 175329 -30303 -108456 147480
10640 -282122 -105057 -7840 -130131 -342970 -160668 -196231 139247 -157032 23779 -138140
10629 -56196 63230 -209616 173369 -307359 18887 -83315 11006 336912 -330946 -215633
10619 -215633 62059 -313161 -27581 -79840 -1074 -333626 150236 -87933 96489 103015 311148
10608 311148 -253689 27720 -145879 -280022 -71893 -78665 -156509 -490367 32314 71428 3431
10596 108056 -42952 2279 -270462 259889 -174195 -31945 -448328 285538 -337358 -221363
10586 -221363 -370905 -240868 136004 -248119 15201 160569 114845 3774 -340601 11171
10575 154436 -62179 -351384 -353592 -355652 21160 -65430 86595 -165122 213075 79032 -347069
10563 -92753 -370050 -19484 -12607 -79169 88718 -193969 -12758 223541 7034 -5907 -582 -117924
10551 -117924 195667 -60869 88738 162078 211332 27702 32181 284627 66662 -210426 -136991
10540 -136991 228750 -105146 -34684 40039 41386 -25663 -204500 -97055 -120726 -155495 90134
10528 136523 -103569 284508 198257 -193552 -72545 -204808 -291483 -228014 147724 -19155
10517 -72395 -198737 166112 -43945 -48522 14356 -115565 145461 133853 -126197 214579 -186054
10505 -63403 -143962 -198304 -21133 -266589 44797 110941 -29575 62953 213566 365836 235066
10494 235066 30725 3312 -39417 -66557 -187275 110448 -419441 -212011 -66932 -140421 -206699
10483 -206699 -206600 335284 -234694 -343180 92708 -227994 146401 144929 -2347 85002 -18568
10471 163655 -89833 -220498 106198 -42009 267214 -53700 258366 40521 -39364 -212316
10461 -212316 255044 195695 353532 338654 360074 96721 120879 108045 -64958 -1556 -36448
10450 -36448 -150787 -127479 287244 -303257 -108696 -56304 6508 51689 -4956 -15089 -51661
10439 -51661 -205447 -162257 199069 -71146 64127 -4209 39032 24544 -107875 -225074 -219040
10428 -219040 24301 -148803 -168373 -93760 151743 -58687 335411 -390248 -219495 -117924
10418 -117924 -75479 -301298 -140370 183991 191773 -212502 103173 -132281 129428 82698
10408 82698 179822 -94818 -40053 335963 -203852 -233934 -229489 -199520 -155365 -147404 -72067 -43401
10396 -43401 147292 -6666 -1593 230133 87542 -131186 159381 -431901 208899 -89810 -36051
10384 -303690 -129585 140835 -58377 152969 71818 -210493 33320 344200 -8938 92097 -93899
10372 117194 47539 53377 -13997 -118543 251551 -59209 -2250 -213757 86084 32691 216021
10361 216021 31408 160922 118706 180561 133138 350651 46096 -28191 315311 13524 316417
10350 316417 97888 388542 431534 216478 160847 341817 215484 159587 424462 -202457
10339 -84616 370781 95481 -913 332470 240375 45684 369215 359763 377219 300497 360104 418449
10327 418449 628238 108482 542751 335708 473400 -276940 -46756 223357 -82635 284581
10316 326502 110629 257802 307161 356560 -42718 -177676 140450 226177 103110 -244217
10305 -84438 -110291 -170062 39927 147618 92334 61155 43579 160840 80844 209447 43862
10293 -162604 -100567 36046 123311 262674 294016 -202685 179890 -229549 -81151 23267 -134020
10281 -158544 71536 -395571 166460 118358 -308538 -63691 -329630 -57348 -140768 -228825 -268394
10270 -268394 6081 84864 -131084 -235759 78476 -12007 -37383 -23395 -267608 -79483 97183
10258 10292 155143 92718 21467 -83687 -21776 -63963 -2579 -14837 -21567 -104914 -337156 28043
10245 -176447 85239 86090 -189841 -244329 454936 121648 234109 231537 179883 298685 234759
10234 234759 457282 210549 161063 107760 -83033 -113192 46574 -68117 -189605 -214778 35705
10222 -92214 -162520 195613 73249 -153107 -77070 -66759 -99970 -446 85831 -150871 303651
10210 -243444 327189 -195492 -370969 164032 -105830 -70999 -152971 -29957 -43773 104559
10199 -149629 66806 -221843 57860 56797 -44508 74705 -429425 -69730 -93781 142907 -96834
10187 52545 147496 -35318 63714 -57084 -101569 -132783 104815 -280549 130915 -193886 12973
10175 -282136 111162 58716 89453 33279 236408 -177926 -146903 -231001 45409 -214724 -328142
10164 -328142 -153286 306607 -199205 -322975 104479 -32345 -547939 -103674 -190470 -61836
10153 103850 -71836 -213404 -191474 -271075 -166698 263173 72505 -13494 -74134 -422947 -67972
10141 -83780 -181403 29627 152645 166442 9930 245017 64820 123923 252553 133419 -24472
10129 89224 -120664 216732 -258860 27208 -13019 -72899 -200188 10111 -46073 -150081 -331247
10118 -331247 43231 78027 -58314 -107661 -79781 -119864 125085 78372 -123770 -151438 9780
10106 21127 -5633 -258933 33610 -223766 25780 -361887 -272997 339692 -218784 -71488 50347
10094 1871 177402 -31966 93172 92395 32734 -36660 -278447 -82501 -346981 -27919 -453959
10083 -453959 167738 77388 -198210 -82824 -32258 -15516 -184710 -55631 -321109 -24355 21404
10071 80138 152092 -343222 -139212 219389 -210937 -142486 -131174 -175076 -185458 120538 -341143
10059 -244213 163739 -73196 -196397 -136916 -75552 -242517 -144117 -142009 -133976 53966 -193058
10047 98920 60733 177204 603 -171663 -60311 -190726 -82636 65387 133650 -196536 -354184
10036 -354184 25394 -422652 -108431 -185213 -2123 -267342 -136978 45009 -46622 93096 -130329
10024 -258075 -124089 68234 -347568 -32902 -122451 -22722 -142685 16611 332996 -1645 -214052
10013 -214052 -162972 40363 870 -46153 -8481 113711 -146141 -166114 -57841 -324037 104809
10001 -292530 -3410 -77860 -26286 -293625 65521 50933 124403 236159 -58558 -281843 34134
9989 -373534 81070 253080 141338 -33824 145342 -61776 -86545 88443 -77894 -240879 -206059
9978 -206059 -127439 -93291 -361989 288738 84725 162803 133665 -141394 -279380 20119 -355722
9966 -190558 51776 -117249 -83976 -251970 64610 148403 252252 -28449 -267526 -298491 53203
9954 -248609 209599 -6427 -176548 333564 152933 -210635 -66589 158980 -178194 -209544
9944 -209544 -44840 73550 -276142 -31872 150892 -282424 -86365 -119909 -93477 83345 -163074
9932 -290021 -74500 -107619 -167114 -321486 79062 91721 -237141 180687 -381328 49356 -88358
9920 -160707 -11192 -182194 -370313 -79845 244845 -158949 -490 -254543 -46253 -229129 74777
9908 -56781 355522 -164841 -44091 -154949 -126894 -474472 -311542 205790 -61202 299843
9897 -29960 -351343 -65144 -102305 -230888 -153806 130484 114964 -82990 -205009 -82475 -289808
9886 -289808 -167983 75796 29536 -26119 14314 -342565 16957 -11062 38608 -234984 7882
9874 -126422 -187615 -90283 38582 42658 -297636 -241587 -120779 55848 -302258 7343 178516
9863 178516 159421 3905 -48963 -39263 -223937 -460199 -164061 261238 102030 -158496 -116063
9852 -116063 -403045 -165552 -174631 -315020 117004 -466919 -18096 -321188 -311122 213494
9841 -243190 93760 -64635 -40402 106345 -177963 6442 3786 266118 -92043 -4306 259606
9829 -239675 82501 314924 -263310 -268954 -73724 -229336 109888 -219261 19257 -108110 -90616
9818 -90616 -51655 -387514 -170888 -41946 -357174 -126321 -90831 -30711 77643 -217127 -98755
9806 -142051 57544 -47803 -52828 -272411 62182 -296650 -42516 69114 299995 -78874 295794
9794 -274834 238727 -84003 -77273 -458308 -225974 -195158 20025 134711 232432 -49987 98558
9782 -295492 -39934 113520 -121124 321618 -367715 -173239 -39371 122207 215554 164608
9772 164608 -70151 -49014 -280691 20000 220894 41860 -164661 66565 -128157 96338 -306541
9760 22645 -9911 6389 -249944 -15540 220768 -147341 70794 -184621 -194754 -41308 -187248
9749 -187248 282984 -228679 197765 -67639 149098 149703 230937 232811 -91314 146804 -76764
9737 -19532 -377433 203302 -325890 -209768 99001 -543720 -294200 -280701 246441 -70573
9726 -5208 -105175 -229803 -255962 108695 11564 -228801 -69220 -68483 -25480 -87471 -59494 35883
9713 23949 -96668 -153192 91997 134854 199387 196192 -331534 -9349 -266836 -257727 -61231 -202126
9701 -202126 -237238 -89219 -279744 60417 192755 300907 194484 -69825 -265802 -156041
9691 -156041 -216960 -312120 -19198 -162447 -280902 -145136 -340151 100740 22617 165539
9681 165539 -148522 -51492 286848 32855 -216490 75491 54419 -63243 -17025 233261 60739
9669 25200 240679 -194853 -49659 -278083 22482 -136155 -94647 189230 -159256 -292736
9659 -292736 170005 185438 -139630 -268123 -205348 -67914 156041 -92232 -260581 -281498 -48068
9647 -255509 83997 -55581 -14771 -370075 -16909 -206308 -120676 120022 -43759 -49926 -4178
9635 -224679 -101686 -115846 -151845 -246314 -68143 -98368 24511 8158 -163325 -228611 -313201
9624 -313201 -97997 138716 -412963 -51618 -58742 -33668 -143335 -110370 -23089 -27044 -150275
9613 -150275 -302030 -158277 20886 -356164 238370 -161397 77064 349477 -402798 -262949
9603 -262949 -128082 132423 43575 12089 129200 -251646 -103312 -99695 -121361 -24490 -456096
9592 -456096 -411478 -178818 236292 -185090 -108336 219343 -188962 -32572 155552 134248
9582 134248 3657 -114303 79620 -309187 -8792 -188678 -174367 -56787 -53631 66216 46902 -87805
9569 135439 -62310 -139037 62550 -244820 127429 4679 26164 -81421 -52262 81164 531733
9558 531733 -104098 16958 -219033 4300 -107187 108764 -34973 -89306 -228224 38165 -180856
9546 -40737 -104560 -56128 -45251 -468157 -98523 225866 -220378 -243914 50349 -17275 -87075
9535 -87075 -128537 69602 3234 -289205 -158362 65769 -307380 148704 -153826 -332215 -99786
9523 -398872 -121154 -170758 25157 -201543 -109793 -99541 -327476 -71312 -49244 87473 17743
9511 224903 -165426 -46724 -92576 9059 181529 32612 -144368 34709 186007 32814 87120
9500 87120 110077 61902 -113756 -250616 46341 -4942 53052 -128088 -60135 114944 195891
9489 195891 -148121 -288474 74293 -149828 127571 -140788 230886 -50400 6056 -7006 -11782
9478 -11782 -298067 -327634 -231611 175195 106396 392138 -14940 -145142 -168050 101782 -296651
9466 -46414 -79955 -37301 -350821 -243892 -202383 51490 -89190 -154777 -171976 -106521 10606
9454 14386 -64532 -169392 -53423 -131598 -116548 -207958 -188629 -214075 173365 235737 78128
9442 -146719 5097 -41967 -168329 71781 170508 190022 -329527 137484 56199 -311441 -135804
9430 177088 -69235 218466 51494 -276352 277752 -372321 300035 -189354 -104659 -2749 -301273
9419 -301273 42355 115251 -91138 323929 -111977 174670 29155 90754 412045 -272985 -93194
9407 -64736 -18801 -150854 -178871 -29522 228584 -108001 22051 -97350 -103316 93309 -168097
9395 -73427 175050 -155599 -80690 -193372 -101730 -208677 320513 -300031 44592 10855 -223979
9383 86205 -185195 -311222 -57836 -286502 -133394 -21183 2435 -274057 49888 23803 171056
9372 171056 -173203 -317067 -136654 -132532 -158542 -290201 174305 -8438 117371 -213154 -69844
9360 99861 153486 -287467 -47447 -315566 92769 -149714 271289 -79995 135803 194108 95810
9348 -55544 1287 37798 -127880 73862 -253511 -82296 108752 89888 260043 -41599 27253
9336 62873 -94002 3155 59537 -79664 -51145 -231549 34885 -216 17617 154214 -91129 -18100
9323 193627 24723 89868 -99356 -84096 219699 -82921 159543 -19155 -211431 79800 -113253
9311 -718 -297246 43048 -12647 12587 -90031 -287575 -150323 -83209 -259064 -93588 6114 -89241
9298 -264984 -44591 -238721 -122172 -206551 160820 -93424 173157 -161891 -168470 -91948 -211287
9287 -211287 -158858 199879 14193 -501724 -189829 11668 -159947 -176344 156765 313395
9277 313395 101711 267989 -181058 112876 169358 77092 92000 118738 131388 418725 78876
9265 -103780 -93056 64723 -153635 -17049 -157831 -137163 154565 -51033 -227584 -66081 -14661
9253 372080 -118911 -355217 102196 120491 -175249 76630 -213240 -68606 -100219 20444 -149192
9241 -67345 -210934 -30326 6353 -100354 140988 144296 -129557 -55368 212876 93384 -20186
9229 -111162 -162688 -187611 19019 180330 -595 -211147 141822 -94517 41352 -319238 -153033
9217 -200403 -151416 -111096 193 248145 -317501 -52059 -148840 -40117 13864 -136180 -50823
9205 -71268 -384729 -58371 277631 -261047 -137955 -60867 -375552 -204813 -39342 135487
9194 145490 -236414 142092 -369583 -89466 -221095 -237936 24702 130979 -38916 95047 -38360
9182 -96039 64196 -42280 -132802 -96768 165035 43091 98338 -9502 272433 -127945 -350415
9171 -350415 223094 -216475 -385372 195211 92157 78408 -196064 -244668 48972 152223
9161 152223 -91566 57462 -86742 -76883 3294 -154603 59322 24406 -167385 277674 -291924
9149 -131416 250084 246759 -101072 -11165 -69341 -202888 -240840 -396710 232548 -68357 57232
9137 -268441 165412 -21827 76964 25414 -122304 -110131 -180754 -39029 -188868 245166 78468
9125 -111130 -370675 -191001 127229 52592 279010 -284441 -131525 -255199 -153501 54228
9114 21321 244671 -24775 -309453 -190922 -595107 85200 59278 250070 -124122 -370762
9104 -370762 -14089 53935 3540 -336689 -75644 126475 -319956 -64207 -450661 -31599 -378988
9093 -378988 -117978 -304058 144934 8478 -18870 17697 31789 136209 -137569 49718 -142135
9081 188962 -149495 -77369 -35120 -16077 -55198 -131367 -747 -187983 -79675 -13591 -106743 -155835
9069 -155835 31569 -185749 -295798 -338318 -272377 -108410 -20427 -161678 -392086 64491 -181580
9057 -171521 72268 13794 103885 -296990 -82950 -42156 55629 119386 104111 -119012 -131271
9046 -131271 -98454 -24679 64311 -246950 -53488 -52593 -167779 -183161 74733 -45693 -17613 -4725
9033 -427458 119975 -223490 71372 -55541 54121 -65628 3498 -270207 283376 58445 -87785
9021 22392 64171 -116121 -105333 -173556 110992 -283324 249701 -145330 -121231 173178 -265089
9009 -18394 68913 -212497 -155608 -301581 -117552 -9511 -137800 287615 72095 211074 -220027
8997 100439 -73175 -50167 65189 -356364 -157668 -191670 -9821 -185081 175027 -85641 22715
8985 149711 216352 176238 170458 1919 27051 116679 -299171 73617 4212 -66707 63501 379216
8973 379216 -417311 -388690 -278073 151264 36949 -274228 -55561 208056 -187666 -24882
8962 -117947 -354149 -36009 30523 190135 -178113 -321421 -308428 31649 -333979 128789
8951 27963 155391 -219558 -947 -151321 -158912 -118465 287030 -7702 -97704 -209649 23472 142658
8939 142658 397805 57346 84669 -228910 2730 -177932 -243737 49795 333424 -53842 129673
8927 139199 -405724 85104 -226046 150485 97781 319288 468916 -200215 201927 31894
8916 -52629 256854 298950 -137387 145482 145850 108440 194394 186175 437635 828497 997700
8905 997700 1865648 3127871 7002009 4408333 2125876 1079762 665591 205149 471459
8896 471459 -133407 -25124 59058 -72877 55178 355029 55630 54301 -91101 -55382 112260
8884 -87918 -61006 105991 14450 -259163 -135078 -134950 -216604 94681 -124557 -9048 310106
8872 44992 156538 248573 -232822 271848 -268006 -104285 -87385 202449 259861 -100618
8861 26300 -107301 -499586 -74845 -144682 168549 -242858 -453155 -61002 -18214 -187562 -150326
8850 -150326 -145670 27752 -157762 1629 -208090 155174 -103551 78396 -275062 -25440 -420389
8839 -420389 -259876 -115221 -119420 -121826 -375823 273997 89582 -213257 53526 -273211 -91968
8827 -278694 -324932 173653 -4301 95282 -33448 53723 135713 -213191 68229 81106 -497741
8815 -204252 1180 -143482 -38298 -33679 26555 188158 214946 195457 427770 64133 182694
8804 182694 137127 250482 -273102 98105 -163362 283622 97138 -368148 4427 -39661 143375
8792 246218 25297 -208271 201901 64602 243449 109122 58139 -95225 -249556 -166757 -266029
8781 -266029 -130825 10959 -72687 27654 129152 -243568 -280135 -98406 89826 -185940 193546
8769 -280118 -136347 142550 -62033 -105943 -390819 -81289 114438 28894 306985 -149442
8758 -72377 34978 -104034 79425 47274 67534 420 28704 55779 -211797 -269545 -47393 -40184
8746 -40184 -288958 17807 172484 52775 -219920 -302821 -327988 -148986 -53053 24113 -182829
8734 -189875 41465 -25287 -112418 102515 237134 -107983 -121964 -48184 6792 124670 -264019
8722 11642 -183580 -31649 33451 -11782 -88946 36208 -124342 86358 51448 -185858 -21007
8710 -282820 -247398 -144345 -189144 -147966 -93333 -414413 -142411 -131716 51123 -30729 229480
8698 -88452 213297 120306 86633 45192 -207119 39524 -180674 50692 -20228 33495 65124
8687 65124 7818 -44902 -30590 -216756 -251978 59196 -3152 -481784 -369818 -1190 27895 413956
8675 413956 52367 -129682 156576 61891 9784 144956 -189184 61571 138255 39090 101270
8664 101270 -43146 87283 -85830 -411393 96436 -28340 10753 -314526 -262439 117321 -228837
8652 -159443 81480 90201 79600 49496 216501 -153012 -30257 110489 -129684 -29413 -65196
8641 -65196 341584 -103003 11188 -362692 227699 -58035 102080 -289101 -244199 148702
8630 158716 4281 86284 28348 -143631 -100482 -11961 -2363 76326 -11420 -145596 76665 367663
8618 367663 -65741 -284170 24769 -244202 -126585 -120527 -127919 -312270 20144 45764 -40884
8606 52107 -95640 -374626 -158696 -394578 -254781 -33850 59878 -129490 -436961 -76612 -12791
8594 175147 159653 -262075 171005 -59405 -105167 284073 183366 -159937 -102133 115828
8583 -31666 -72871 -42894 55835 -253469 -11597 -408915 172933 39660 -194816 35811 50189
8572 50189 27855 86822 211376 101645 -160023 117550 -279297 -79727 -205208 -61635 -71515
8561 -71515 378848 -158391 -103655 -124664 77555 -134157 142045 38377 89446 -278593 669
8549 -114099 2198 -68582 -215337 141997 -25616 -221664 -212303 -6417 -291514 -23218 -330827
8538 -330827 -269047 -271758 -288480 -24863 55204 -245703 -28989 139785 -28730 19555 -158597
8526 -44227 35179 -75659 91855 73262 44977 107368 -116075 -45786 -22646 -130385 93653
8514 -172710 -191825 -61747 -28125 -113678 -220962 -303112 -160824 -428180 -270706 -229903 -259301
8503 -259301 44509 -75132 39107 -88344 156746 -82487 173224 -153699 -280464 174090 131524
8492 131524 17411 384579 -62301 14352 40307 -340092 -71869 83172 -17778 -81548 -265690
8481 -265690 -295717 74777 -328881 -198798 -141683 -63849 184073 -210030 -38720 -128132 -56343
8469 -167160 -260357 -62551 -128577 68876 -208403 101625 128169 -26370 -49913 -90567 -300652
8458 -300652 -48533 121321 39133 -149011 -246678 35296 -441694 -344469 40681 41841 71318
8447 71318 13718 -85572 316581 133377 -96166 -21348 -71658 197567 -21542 -146604 391857
8435 63162 15787 -252513 28820 -48160 -145519 11381 74357 -337349 -216730 77077 77703 190198
8423 190198 -133744 -266388 -216633 -80630 171726 -136297 247848 161489 -8791 13545 5626
8411 -168780 180826 -97198 -74059 -74881 -133387 129001 -112374 -935 -88831 386283 -211149
8399 123329 18976 -100880 -126223 147791 29463 -8138 -13188 116822 -5498 -135797 262679
8387 184082 -59490 -76173 -20357 -14467 -194134 226894 -54969 -30787 -226856 -355237 -3000
8375 48373 -160305 -310636 23749 -259804 368849 -303748 -33945 -272396 -112823 -57634
8365 -57634 -204466 4885 -282854 -142157 -166206 -403554 168641 172585 119106 -38035 98314
8353 2656 226767 -27137 -166557 251550 -180772 326448 -11711 -217889 -220707 165280 -55511
8341 -123166 -70667 -77455 -251203 -83391 -99932 -508112 163971 -195158 -82114 -130946 36685
8329 -230988 18024 89362 -89446 -269757 8459 -101171 13156 12407 -262621 139009 7963 -126736
8316 233003 -67970 33311 50370 -230079 -363475 39126 -140446 -219736 -152101 -26547 206446
8304 -23341 64637 336796 -66355 -88686 267409 -70030 149638 -47577 -226255 -225037 -13077
8292 -143302 -280426 79843 -96060 -175221 4298 -441635 5046 -461247 -145286 -78783 -45882
8281 -45882 207822 58181 137605 -128945 -178118 70520 -291047 -268744 -112929 -28226 -124285
8270 -124285 1641 114843 -10735 -58596 68017 71519 182647 89291 -67790 11838 -14890 -52884
8258 -52884 -113915 -114692 -257376 205345 94743 45988 22152 -475255 -154442 -171931 80218
8246 -112491 -77107 133070 -333460 157475 -103177 -49973 87893 -228712 -340888 -136181
8235 -220693 -211880 198870 -79492 -98234 57039 -91643 -292069 -258719 -271069 80775 17600
8223 68320 26644 -385490 5735 -5477 -237439 -210383 -39513 -2386 -26544 -220368 156600 -46738
8210 -108639 -30413 -57775 -420451 24575 -203397 150879 -171653 -62705 -87649 74632 -9322
8198 -16517 -115249 -23879 -39096 370 140002 10947 -143639 -297834 197597 -167853 -126951
8187 -126951 260479 -170023 46873 -66474 17126 -41076 -154837 -187249 -27674 50259 4125
8175 -27186 -217167 32809 -187864 166172 -20072 -118868 -219572 -221799 64124 -68547 -78162
8164 -78162 79901 40246 -149135 -98344 -106358 187651 -193576 411994 -45467 87014 -56833
8152 16038 107779 -1042 91699 245258 5045 -50461 -123553 -72788 -177691 -5336 -117518 78854
8139 -98599 -155461 -33016 41793 9991 95004 -239336 220153 -305607 94576 63189 130846
8128 130846 -28504 -230235 239573 -94497 308168 -143809 -94579 55051 54902 153600 -244770
8116 127435 -306056 356356 62223 37652 -129793 96774 287839 -156473 152252 140766
8106 140766 -78121 -284990 116822 -107528 40236 77943 -153837 -255218 -76660 -122471 -17525
8094 -173422 38873 -35251 62987 112580 436850 122151 106620 56480 88438 207689 361455
8083 361455 -95854 345353 -276844 165271 12317 62365 -164121 -31857 -59641 -14991 -235540
8072 -235540 -231472 -17253 -203564 -152170 37398 -263493 64701 370663 -103348 -62725 -357960
8061 -357960 -205209 186228 -33363 326024 97477 -104550 -65612 -170042 -81968 75958 52854
8050 52854 -71723 -145211 -134299 14505 191875 -193007 -227797 -263756 -68540 -243151 144097
8038 99392 -276470 -184747 -26915 -2424 -83091 -222664 14725 197280 301089 -44084 135277
8026 -61586 -21776 29962 -210181 -95859 254962 -226021 -138943 24751 31793 15395 250347
8015 250347 -181338 -188469 290533 -7015 135968 -10305 31451 138254 -225428 80891 -48838
8003 169455 -223474 37131 -141474 -41554 -181341 -173563 287556 258530 175109 244737 -233651
7991 -103737 -471957 103829 -220769 -164989 -98075 30085 107777 -339220 66862 -310787 -138826
7979 -282592 15914 -99311 -94791 271333 257528 -173220 -369902 -72000 -119903 -98354 -159122
7968 -159122 158712 -181544 -46621 157735 59019 -9395 1358 -41411 74854 29701 -215011
7956 -212080 -191042 -162961 -137947 41557 110771 -105041 -5826 48811 -60657 -195214 65737
7944 -64290 -207986 -65454 51700 53293 163536 217572 144788 65828 50723 -199165 52711
7932 201379 -405435 -107342 273580 -223879 -56141 -259834 -136238 -330319 297711 13809
7921 25553 -315595 98466 76012 76518 -78266 47206 -65114 36214 44137 52533 -125322 -99678
7909 -99678 -119256 158128 48678 -184088 76265 -165246 253666 82009 108484 30737 218348
7898 218348 -275360 -78351 104237 124297 -18332 -106751 28181 -31774 -53298 -3586 -275118
7887 -275118 -152086 220847 -403797 -94 -125950 -254359 -178638 -458074 -61767 -206276 -46378
7875 -315951 120826 284938 -39296 43266 29030 -275840 68796 -52722 51258 -21343 147323
7863 -156320 -124456 -24000 -82975 -237631 -82499 -99012 -255281 -220139 75799 51270 116846
7852 116846 -190107 -42226 -234182 -190604 -216045 -110314 68011 -122462 -58337 78278 52999
7841 52999 56982 -165883 -202489 364078 -113766 -24618 -186717 -76458 -32358 -288308 -55321
7829 42362 117610 116766 -131044 -30095 -49566 23267 -43009 76099 25621 -72833 109323 152551
7817 152551 -156806 8890 -215626 -181220 -68220 -26129 -188022 56855 126402 -135834 27640
7805 562293 200845 -270279 -99274 -142528 226751 251250 27502 234309 -165826 217669
7794 111271 184334 -204668 -355006 79073 -173683 -154641 143238 -23844 33207 -157683 482694
7782 -258188 -120171 -83592 -164536 208048 188822 399415 -198196 -175095 154300 -154764
7771 -185647 -205558 -19402 72839 -389311 -46614 104821 -393576 -121148 -151098 -193563 -410959
7760 -410959 -77287 -128209 142367 -137760 107118 -185059 -79177 -178188 44748 209009 483665
7749 483665 -167625 277863 285965 -260587 -127758 -284195 -193147 -313419 114785 -63028
7738 -51454 -33248 -178908 24107 -132041 -70759 288486 -22642 -261399 381811 -254188 -23057
7726 -24165 -196739 -4608 -419678 -202765 -264253 259144 -136019 -77391 93463 -351405 -137462
7714 90312 -214218 -7195 67290 20398 8951 131179 -308031 110671 -159149 -41492 -60716
7703 -60716 -58557 54611 -206612 42027 -66795 -125887 204709 -158271 163616 30149 -199463
7691 60604 -141633 -243690 -248503 -163537 -178872 192716 -219311 71571 2148 20629 -196564
7679 -113559 286311 -117297 -160511 -67594 -143877 -406386 -272801 3477 44037 -14457 -207695
7668 -207695 -153061 81686 -1241 -84205 167741 -366953 106118 -191301 -13716 253435 226722
7657 226722 -111184 -39006 -335365 36345 24400 -55693 41329 90216 -129705 160237 -11481
7645 408288 130496 220563 139054 -266732 -29171 -2947 42955 -133840 -60520 92189 -219784
7633 224155 -39123 240786 -330604 117506 -98019 -22378 -375349 75983 -80828 -186182 -55960
7621 86095 -14725 -170546 120032 -30247 -77411 -105920 -32508 9526 151399 57907 -254231
7609 -174819 -145786 -110890 -280557 -267696 -93254 -63814 83313 -264166 194887 -206868 127809
7597 24426 -107874 115283 -164527 -155788 53705 -374793 -189857 -128324 -331334 -229802 32021
7585 -57272 234256 -129120 -118149 -77894 160349 -50473 121570 -376236 -199093 345881
7574 149963 47712 125732 17396 -23435 87730 -1030 -216338 46264 133498 291567 4470 25500
7562 25500 -30974 70769 154398 245352 -139942 -182306 184182 167483 -95587 77088 86615 -79720
7549 16385 -42709 232370 75347 191625 -308638 -262465 -245408 -63795 -163922 16639 -239374
7537 143167 448764 -113859 28733 75845 -27366 -192498 368546 -172754 -191072 23893 -74043
7525 36888 -107261 -80648 -29941 -297994 -236582 -139210 -257545 -111426 -154300 80305 -6027
7513 -452017 -27266 -287055 48689 -105851 -217069 129959 -87890 -107603 174440 211626 181985
7502 181985 -341457 -400085 223435 -104004 97439 46761 -188867 -97197 -41777 -279427 -52917
7490 -204127 38108 52782 78554 56721 -281199 15483 -25188 -48054 170033 -5374 -44444
7479 -44444 -30694 278833 -188760 128137 -428064 -262228 -260934 108521 -9145 -143719 75929
7467 -7538 152423 -501710 96501 34433 -380112 -341304 -118254 43907 115384 -143899 75816
7455 -180557 -329480 -137916 -115980 165314 138201 138554 -211273 -175245 -9040 245838 227271
7444 227271 -294417 -94224 -38222 2396 77401 -49588 -152769 -139337 74384 -62358 -115568
7433 -115568 -141237 -351355 -20155 -229462 109666 21228 -55642 -132110 -239080 -168885 -74927
7421 -52293 -17744 -271867 -179559 73227 -129992 -276593 110601 -98477 -303990 -139102 45596
7409 22311 28343 -129124 43034 -63157 -56411 -90726 52603 167960 -234994 4995 -197707 -172789
7397 -172789 -62728 360873 -290337 -511120 -39636 -13479 222081 -210073 -272747 319458
7386 30316 247331 381559 29435 -168581 192394 59862 -62988 -389944 -157991 -79862 110883
7374 33863 466283 -74297 154131 -86753 -61630 -107344 7777 -135886 71636 -257195 -84307
7362 -336890 -76088 -74735 -114432 64470 9691 160560 205475 287401 52272 176597 234430 326279
7350 326279 -460212 110715 60000 45329 -12685 -47341 9107 -352063 -181580 -396620 -93565
7338 68438 21246 300360 85328 54601 -260609 46960 -287878 -197606 -21526 -37699 -118834
7327 -118834 36166 -337898 68951 -166115 -179717 114568 -97126 62683 -151509 -333501 55126
7315 259911 221 153842 135059 -258305 -273837 73658 200383 -193351 61288 159823 146460
7304 146460 30822 168349 -164508 151555 46848 -93570 101493 -51138 48869 212022 -244684
7292 -22830 198532 -62097 72654 345333 -83986 -34545 250333 154717 -302716 190746 -155827
7280 -35104 13295 203350 247168 62964 -127808 -50305 7527 202206 252347 79538 -135395
7268 -14138 6138 -115184 99997 -82600 -90697 255524 -114844 73577 218667 213178 -110443
7256 -6650 -196679 -289228 58403 289621 85055 -111749 86076 -63337 68150 -216918 -134235
7245 -134235 -71479 -80903 105474 -69134 -91986 111474 -94409 -96760 28552 85587 -298652
7233 120172 150824 -229107 185580 109200 -44902 -209345 282989 98972 -72216 375363 15480
7221 -375541 127274 -243837 129300 83127 -226837 38664 263378 -68944 -126619 108398
7210 537 33092 -116285 -169059 117609 -42645 414415 93071 -41685 59236 86320 261723
7199 261723 11178 267848 -364887 -200490 113615 143471 -106692 -256088 80619 112242
7189 112242 -295876 -183292 -40414 -171438 -351025 -5112 -306034 -303187 105308 -43660 -197366
7178 -197366 113982 70739 -62909 406356 -201411 80333 383447 15346 -145302 -68590 -16427
7166 159302 -232021 -61330 132110 247302 -154571 366164 -80206 -240384 -124625 142834
7155 -125947 218275 -109334 17134 22800 -457984 -12635 244805 -169749 -52613 -40737 -480250
7144 -480250 -15745 24077 236805 174702 115853 -136934 82168 -294718 -125991 -555449 -298441
7133 -298441 -34083 -358084 304184 -408729 -190099 -195159 186016 -243251 173439 58191
7122 -272974 -72884 11513 -379306 159112 -95815 -106307 69273 83947 33647 -219998 -64839
7110 -292544 272128 -212313 -128120 284615 -64376 -38984 121669 192758 -254194 -84479 6239
7098 -109579 -46043 163967 65010 -212707 73970 -107014 -128581 214322 -68432 -94005 -83494
7087 -83494 -114860 107089 -47846 132306 -25793 27420 -33145 -65774 234203 -200339 -22548
7075 267868 33180 -145524 -48989 -8747 -284966 119750 -144738 -62993 -131769 -268850 120328
7063 118755 237846 -79144 318311 -73256 276275 -147293 -244180 -236328 -16892 91094 26779
7051 -92031 -179469 -215046 54338 -141741 -240485 -73026 103453 -110258 152816 -11306 43925
7039 192784 -24250 -48475 -238809 -211924 81007 -146369 -313047 327179 -82333 99712 -160228
7027 -84546 -90322 -199339 167348 27223 -228385 17469 -95566 188796 223953 -97030 112057
7015 -268536 95874 134428 -348443 18406 -5193 44959 -157289 -43461 141234 161678 -129579
7003 -91843 186946 -160784 106689 -182970 -86908 81262 61639 274876 22393 -26609 -121062
6992 -121062 35050 268336 -94660 -103805 116753 25449 57664 137652 138398 211327 164793 -159080
6979 213622 83833 170403 -201643 183611 -245512 211267 -5251 300989 85005 -255043 143406
6967 -204467 -160389 58928 -82395 10175 -309264 113965 -94844 -14455 181802 5391 -74964
6955 -169347 -107212 -32721 28731 -288410 22780 -65443 -87146 -301064 -345616 213003 -165515
6943 76702 172794 166049 -53490 -258009 26211 -100488 161206 -237898 24110 52814 -36682
6931 152312 -374560 -13956 -139934 -28579 -167829 -99437 210078 -211646 -45629 81407 -23298
6919 -283920 53434 3643 -72879 28566 47050 -46076 -590599 -241656 -124989 43684 302649
6908 302649 -76589 -105703 -123424 -1688 -280535 324935 -3672 -106904 107950 194144 8812
6896 176841 211809 7398 -94376 323373 -67426 -99319 20339 64837 41518 -5153 -71991 60331
6883 136211 -146920 222341 -12907 8068 -263187 87643 -158446 -151524 100115 17361 -7763
6871 373012 -112760 289717 186586 80489 -44189 -182020 74485 199075 48135 -4152 276306
6859 -250729 -237064 -38280 -238352 -39762 195373 -267873 -281924 30370 41617 6912 -9073
6847 -68340 156419 -338389 25601 -71939 -10804 241315 269587 -113956 314397 -217029 -107664
6835 297299 236245 -7554 -28270 -178888 -445390 155427 -142491 302960 -354421 -46548 -79632
6824 -79632 -239986 -110579 80386 3388 -88124 131393 123831 69905 333898 -51534 -48994 -72665
6812 -72665 -327501 276551 82232 -136131 -74594 179847 -161599 36535 57191 24331 147206
6801 147206 -29179 325031 -181146 -247262 164710 -57200 63355 -38236 -27649 58385 55694
6790 55694 63300 34125 362575 139021 45391 188465 -185741 36843 227565 94430 -95465
6778 -150556 -60927 -87099 -9812 -215087 254067 94701 246681 -110049 -45077 -125628 -110411
6767 -110411 -115990 -86943 2303 -190091 -138281 -111001 78362 50448 212834 -16639 -63797 16348
6754 3207 -5324 167052 3573 -151731 -45088 -103806 -43133 -274442 -59091 287647 42967 194089
6742 194089 5523 -51634 132049 -121994 133644 -107748 -388280 217998 -14299 204011
6731 75085 6834 109124 202749 -364359 -206455 739 -1281 -125255 -56698 -8106 -253363 -169524
6719 -169524 -209452 -30426 338775 90064 -117244 -68940 -167603 -10032 -273330 -67092 -102396
6708 -102396 -130672 36757 417162 306469 160487 -75873 -114004 -236447 396041 52647 206107
6697 206107 -199501 121028 163557 1057 -253751 -119010 15109 -3401 -49633 118629 -1862
6685 -174820 -86497 -3623 -251724 -115462 149626 -70974 -26279 41467 128016 6877 -9552 141273
6672 -61125 -74012 -165479 86667 -23885 191469 116048 -143188 -61366 199703 101723 292492
6661 292492 -60714 -271443 -249135 41138 -5187 -46471 -249292 93513 121636 -143024 -46849
6649 -66287 9713 -331698 119614 -158372 -484279 -89632 -305029 -97161 149685 -147616 35176
6637 212403 -91536 148430 -75330 -217451 154510 -130952 111959 237725 276015 82902
6626 44037 -258813 -125852 60311 101915 165694 -114300 -178223 632 -14034 18931 317262
6615 317262 -34490 -86530 322358 125910 106441 -205577 52627 88781 -272808 46650 -81368
6603 141001 -109239 57884 -36789 -69457 -114989 175636 -97068 -124840 -231236 120297 -267655
6591 67016 151837 -55184 -323570 226260 12718 -138995 -4405 -226853 -138690 201589 -167454
6579 324229 -126448 -214032 -96397 -233538 -215422 -14572 -41483 -345668 -257370 -10413 19061
6567 40421 -133259 -19565 314932 178082 114029 41354 -85249 -421273 -139541 42525 61780
6556 61780 305998 -493222 281150 83029 -196557 86004 14108 41212 68453 59400 192133
6545 192133 -60160 -114174 200281 -294246 115393 -126204 342131 291840 32282 111970 -786
6533 -6049 -194880 -359165 -22076 31822 123670 -39576 -112681 -391354 -262777 135937 -282632
6521 -50143 -148261 132033 -92817 -260598 77835 -20287 -256689 -323172 -7156 -62685 -92517
6510 -92517 -114931 -76788 -125989 160435 68119 195515 -238290 133471 78895 -84679 271945
6498 -285230 83908 -211954 -64579 14401 101941 239318 -66942 -206325 126590 -67755 -5609
6486 127748 -74423 33719 63518 169481 -49454 -179951 62401 -126060 -173133 83279 -234627
6474 -124877 -246785 138492 -129716 -24442 -139969 73938 85133 130118 220512 -70698 -40276
6463 -40276 -209713 59217 -20511 196413 52852 -49622 579 -268125 57912 -9881 -57167 284276
6450 32683 279971 55843 -133016 -114430 -138669 -118744 158854 44956 -86394 -242442 -147348
6439 -147348 12186 -37560 -12457 -307753 -39743 44094 28631 422341 -136999 -214268 166035
6427 298129 -117744 -229833 309883 -241158 -185377 445332 133669 -40750 132648 241639
6417 241639 5050 -84058 -55111 225157 50897 -71725 96225 -130756 -55603 40402 4048 -124258
6404 -370020 -13875 -81764 25109 -82781 -7739 10916 -103721 191654 -238135 -334339 93619
6392 -149710 279126 130950 -9797 6605 -100328 -353621 -48667 -118562 -28965 58752 -226080
6380 195321 187853 109162 107980 -268877 -115814 287021 -97316 27072 -1699 -90164 -244920
6369 -244920 -3365 57174 -330433 34559 -341794 -32346 -169731 -24159 -24544 215 -21849 -222987
6357 -222987 112132 84269 150313 184205 128460 66226 -303732 -100283 44365 3785 34135
6346 34135 336739 -122516 -55389 -143431 134588 -82716 269891 68950 296654 9518 -79433
6334 119044 -86812 -384258 138743 -214872 -18752 314172 10524 47722 -241990 -302957 -47818
6322 78773 34971 193575 -10026 -211825 -92274 67353 -204269 -55582 -91633 -338540 -138773
6310 33666 26935 -338454 81847 -291300 -210945 227193 -175662 19264 197004 -211632 240383
6298 -177413 -123768 114795 -1398 -252139 -14370 90184 -238360 255754 -17817 -74166 -179131
6287 -179131 -77742 -104924 251236 -181005 140497 12328 -24046 -42356 6016 -403972 -342305
6276 -342305 320648 163263 -100278 -174303 76290 414118 146530 18737 32896 -80226 34520
6264 194597 -69536 90679 -2401 76772 99982 60920 208552 103194 108804 -94635 -49845 -97767
6252 -97767 -230993 11862 -157124 211988 -4089 57203 -224266 129919 -88370 184229 -43495
6240 74705 -200451 -58137 55090 -181467 29335 32693 20463 -41657 124699 -107167 -53088
6228 -19297 88827 156894 152202 -293075 -108624 9894 171709 35355 -114426 314150 -127475
6216 85266 234949 -59261 -100157 61131 16873 -117381 75964 -95630 179370 105366 -23284
6204 -48079 57739 93389 -339848 85774 -19788 212681 -28785 -60731 173090 -138260 -38141
6192 73031 -275327 -173763 -201417 298079 101753 -42814 -423486 192870 305441 38491
6181 30905 250256 -201567 101029 104209 62989 -55458 363546 359232 37822 -103614 224999
6169 134827 -26081 37931 -279259 152 -340169 166381 -52158 12393 -134789 49170 -31131
6157 38525 -168520 171578 145520 -20018 74095 -21630 414519 388549 -168253 -76022 -373565
6146 -373565 -214218 -55697 -162916 154139 57279 -46475 -78135 -47166 -129438 -10508 -246507
6135 -246507 130508 -139206 185367 -176853 5274 -83959 -25227 -138045 -72727 286438 200706
6124 200706 -203917 -45712 -49475 265937 162884 232151 -112749 -69016 147043 77885 -81386
6112 -32051 31166 628561 43869 23179 -89399 -131207 72064 16581 52630 67123 212123
6101 212123 -94952 44867 -7110 300883 -281305 293678 -188746 -83124 -184552 38787 -240695
6089 104797 -222747 -122641 303720 -39970 -421961 204578 32031 64073 32600 207586
6079 207586 28292 -178227 192366 18290 137914 -257270 -14612 24167 42248 -27096 91840
6067 -120855 192422 131733 -54484 68573 -215149 -79010 -86763 199801 -90079 -202334 130870
6055 335372 -68682 -36888 -64445 26410 150648 259701 -87126 139587 -75601 364048 -68806
6043 172929 -333360 -71889 -197876 142926 -473971 -30651 -53230 -135021 42914 -327321 -297402
6032 -297402 -151632 172651 -42715 -213509 1568 -101706 94372 107050 -327562 119290 152312
6021 152312 -98411 270467 39762 -83975 -314671 92441 -24773 107428 121893 257237 -102222
6009 -34272 266984 -13964 -31802 -62264 -208887 234631 -398130 109230 -367530 -128642
5998 77910 104564 199000 -64542 -101715 79006 -74478 -175061 -222472 99097 -116284 -57325
5986 97871 -100035 -243067 357183 -171725 -169204 -80169 -57334 -5080 -249055 23089 87229
5975 87229 50570 -328656 -6485 -395859 28177 -180335 -145480 -161876 34760 -97821 -23415
5963 -236526 26501 -190398 -1818 -161814 86021 -50181 68214 188908 183324 197160 -69068
5951 -33284 120249 326614 474514 -398658 69601 224084 158905 385652 78953 -286961
5940 162634 104236 -278047 43967 107087 -104189 -40764 -277317 -254822 72991 -13801 201834
5928 -228866 -58868 13744 14874 -25660 -153280 162656 -73502 122824 -137637 -211389 263458
5916 148461 126225 264113 239543 -123144 225384 -58537 -87580 78126 -133163 -293723 -48714
5904 -142817 -7293 -44348 123509 131032 10857 -63285 34507 166743 -121796 154478 -158181
5892 -50725 258389 -15191 524 274241 -300858 267065 -25806 399173 32302 -39598 -177133
5881 -177133 287013 -111526 240565 71976 -62658 141656 193039 -210349 16841 -51508 211346
5869 -151210 137914 261180 -19746 -114690 138702 -185187 -105195 -20566 -220059 -174759 140266
5857 165636 -398777 34459 433208 -198843 47450 -82535 134092 146549 60446 -510 90155
5845 342273 -65210 283971 260705 -93190 -27748 -108919 44962 -7514 107800 77300 -270930
5833 148767 -193740 -206547 6137 3868 168346 -128126 -42629 -10702 -189162 -106444 95153
5821 -173946 -343312 319404 137693 -180825 -208287 95161 -227522 -108693 -38402 110169
5810 -181260 43095 -319779 50692 132125 -102623 -98814 151682 15756 -80459 -96551 186247
5798 -295832 25944 -9696 -207943 77388 98097 223445 -42835 -144848 180671 52688 -23840
5786 -427065 75987 -141467 19050 45919 -153547 -37173 -46969 -41085 282765 -142326 -127849
5775 -127849 -120353 -41196 -26884 -26073 154167 108736 -72028 257583 402854 351706 58229 -65440
5762 -72865 -56883 100710 68566 -27947 -255796 -81427 -136616 63856 -248280 294294 109058
5750 258549 -18542 134043 12081 21537 14472 60978 -67123 -23173 326101 238554 11746 -11400
5737 -123709 190028 -142256 -363196 131008 79471 158144 29473 56708 -63339 -54197 -133353
5726 -133353 9873 -107388 -286188 -193868 -18810 -54816 -64352 -47331 43306 29453 280908
5715 280908 25366 90683 10818 -80805 230671 -28376 200253 35766 90250 88070 43919
5703 8742 -331343 164819 -34290 174108 227957 269456 -206537 126859 102837 -30889 -53627
5692 -53627 -187953 172314 259147 44417 126696 -91747 139542 180270 -268619 34090 78132
5681 78132 -218335 66250 -299791 -70724 251594 82248 480547 -20863 -121072 83467 156302
5670 156302 263160 -264556 287049 -26181 97324 -183996 -178245 46433 37272 73916 16533
5658 -82136 122183 6513 4571 -7246 -257804 85954 -142762 56107 -80884 170765 14999 -146710
5645 10954 -79764 145468 281767 -95231 -28786 339416 -84779 -20721 -115706 -43206 511647
5633 91747 150449 -91947 -57602 -166567 460639 152489 113543 51351 151149 -242453 -81518
5621 84189 -325898 -546 -121919 -178994 -61159 46857 -54139 7407 130568 129995 121805 14693
5608 305960 123195 28590 214564 -43080 165871 85744 162205 40344 -20187 -16737 -150832
5597 -150832 -49827 23996 44940 240948 -375200 -286173 -48921 216602 -94571 -68172 34232
5585 -112559 52112 77347 75976 187618 -282063 -30991 47834 108185 -131919 131626 190435
5574 190435 36239 106016 -35782 37270 -243543 210079 -24747 -180118 34703 80838 26941
5562 271140 148735 161186 -12507 77851 -10462 251224 148607 244405 -271253 93055 -71267
5550 75690 -267923 -67020 122833 233442 32363 -137037 -163382 -50675 451414 -3152 20984
5538 -29623 82572 191372 -155235 130805 -227664 -175692 -261753 198086 -246127 177307
5527 264331 79640 74132 33571 205419 -125731 63004 71471 -100368 -439765 -13518 -194766
5516 -194766 -214904 -101429 108295 433225 -327070 132948 -126604 135864 -235202 -96034
5505 38935 -164983 120967 453604 -100727 56156 43289 -69772 -86338 122629 116797 118727
5494 118727 178499 -354742 210824 -6933 124747 25711 328398 -141762 -210684 24215 119595
5483 119595 70368 -131517 -39632 -152120 53455 121125 -106654 70803 431530 55251 -86865
5471 -125985 -75281 -47834 -254912 -280382 -24908 76299 -65283 -65690 -314256 -3272 332147 19876
5458 88924 -273521 -144878 439827 174984 47992 -201610 48877 71087 149138 -608441 114241
5446 161958 -182830 134618 -42749 -147883 164070 -25861 47760 3960 -163004 130386 90088
5435 90088 -101579 -25102 -138066 -124256 -348219 156187 244808 -50396 289482 109751 23365
5423 93676 12047 239599 96402 -130488 -91128 -151317 -441160 -191584 128052 2125 35891
5412 35891 -184122 121306 -89255 -217477 -8322 104174 278176 -60057 -403704 -196757 -11534
5400 54815 166253 -213768 225534 -87846 -105239 -143393 -1927 305059 -112704 23968 143617
5389 143617 -136139 -50298 -304560 37787 29473 20256 166994 91622 66161 -125044 -9898
5377 102495 -99117 40406 -42353 77456 -19729 -82434 -132873 -89618 -198522 288785 129095
5365 118867 165655 -13997 107464 -217447 -33494 -261990 13649 110507 -96765 -74932 125771
5353 -22845 -39652 -127326 -30331 -140321 324913 154539 88163 -211971 132216 114761 198426
5342 198426 -136745 325892 43175 75554 -357834 -190605 181366 -210158 -201073 93015 202199
5331 202199 -3352 376926 3799 -272471 -55854 65612 -66229 117297 3424 36340 49968 5815
5318 142258 -41389 -38495 221970 -128594 -100682 95125 54233 -114604 -41243 -4757 64648
5306 -95799 93429 -1256 177564 17152 -41130 320021 155 -124328 29907 257454 -60641 21361
5293 -194162 86507 -23087 -147456 -77632 -275252 -114220 361084 -2496 85766 -139126 -164716
5282 -164716 -41443 -202980 229266 327304 -160479 -208077 243940 168874 -5844 -27455 216441
5270 -37503 159469 -8651 191979 257217 78074 134235 -247750 -186749 47586 14901 -67586
5258 -19660 -133700 39974 173176 -65743 -116605 -201412 78642 -120518 88076 222823 -113062
5246 -81518 88227 -213856 180256 57418 142388 -57076 -143041 -57108 269231 223269 208001
5235 208001 45610 -372534 82339 186708 142907 196902 -151781 -91691 192100 249109 -123691
5223 107230 -99775 -200323 138709 -157470 33620 84171 -57714 -160085 153166 168986 -207074
5211 -187998 48344 133551 170173 157223 177123 186457 -245770 69069 99555 -181698 -144448
5200 -144448 92542 -13225 -45323 -104161 -138542 -394435 -194419 -27374 335894 -297844 60784
5188 9436 -23480 455 266723 365552 30752 301500 -266103 -59919 65112 102233 246170 119159
5175 -118005 20561 24877 1983 21316 84479 -325290 145927 -191286 324977 348514 -47557
5163 209166 -58664 -32738 -164550 -25513 -203198 -495867 -92864 52373 129666 -74017 -94468
5152 -94468 -89835 154974 -67728 253656 -148702 8248 -115235 8386 123825 -331288 17845
5140 -166738 -29445 163624 53729 53975 61056 -61835 92438 -78768 225515 -194594 89074 55353
5128 55353 -64942 103828 -121047 -44 35917 -164398 209037 -126650 -82703 -16607 36178
5116 -92319 97724 -96053 -135660 101681 -128772 363770 60920 -10440 -85818 -34543 52850
5104 -202075 71097 -457333 -47402 -236006 185827 90871 -12605 -179188 -188507 279136 126572
5092 -252676 -167521 -39316 -61520 -248110 536116 113585 280093 132305 -289624 -24530
5081 -263873 81830 -50343 40115 -275254 48774 -211116 146628 202183 -7881 -23308 308327
5069 184873 -171112 5308 161353 -100473 99055 302531 15913 105498 209301 -177143 -372743
5058 -372743 -95525 -42538 180597 -127571 -62870 -329672 26245 -238453 178489 367128
5048 367128 -280510 -298805 45768 48508 -73563 386393 191814 374776 -55788 142998 -261598
5036 166833 153322 -169725 -214923 53635 -17360 -710935 212166 -115974 57765 138680 -93588
5024 -162155 385944 -278115 144925 22753 -45273 -93696 -40253 -109009 -198060 -157187 32103
5012 -46770 42161 49515 -308749 500568 239028 -71675 -246420 85266 120707 -89100 -82525
5001 -82525 58937 -164586 324138 2268 -2690 -110478 64335 35756 426846 -54217 48397
4989 -61407 70033 172560 -97162 -28141 219529 299940 168139 264706 214520 113756 110288
4978 110288 80412 -234250 33004 -117371 195985 36994 -138922 -50537 -231937 105646
4967 -225912 17825 50752 -2138 -42484 -218138 -5660 315690 111536 -8968 57829 33504 750
4954 187308 427548 155421 -71734 62178 -62920 234540 186881 -352789 30315 31750 6760
4942 -189994 -29582 -3329 -86703 -18705 -92323 -144399 -130189 -21731 92909 146046 -67699 371101
4929 371580 -140368 -325008 -495837 -8561 -180405 208962 240074 227947 194825 208712 62743
4917 38923 89181 173677 18860 -192501 -238959 -320237 217137 111423 43188 -182858 158732
4905 -26687 219421 84293 -27657 140453 -326696 28908 -443475 45563 -36268 129852 149261
4894 149261 220035 213946 -63255 370791 249415 -5941 82587 -57713 162135 -13031 -336703
4883 -336703 -87820 223780 385250 -182589 -104700 264306 110606 138902 30346 -15449 135840
4871 -76182 395207 -28199 -68292 -240277 111338 52808 -165371 -123890 244649 -218366 270864
4859 180346 -59323 -82003 193996 -219798 87853 259844 -48436 -222828 105312 54399 23091
4847 -230658 -130237 -45312 34921 -220384 -72702 -312085 -305296 89516 120874 185989 -236864
4835 64397 -61573 -262713 53714 -175350 -31672 -26146 350162 55164 -149263 -183722 -17740
4823 -115661 306574 12557 -268280 39692 186483 -149474 98318 71556 127898 -38799 230652
4811 27011 -58181 -272453 91157 192324 -244020 -315916 -25160 6591 87076 136542 -38680
4799 147308 -83481 115074 -153478 -302162 -16280 122000 162129 100369 -175812 -74508 -157443
4788 -157443 41874 182371 -194248 75030 366318 61386 276574 -316740 133774 138833 -132465
4776 90461 -20938 -196506 87159 139112 -82837 -183041 -69824 -57948 -110855 1698 -23976 -214036
4764 -214036 -239893 -248764 98115 109988 150632 -53508 188128 -232111 -148714 334 199455 -18533
4751 -55337 145918 319977 223861 149602 173804 -62380 132763 13221 -223809 4619 -192506
4739 -131252 129798 177934 -118409 -306704 -157117 258143 -174327 -263964 -2661 333963
4728 185179 -144077 296641 121494 185432 223216 73616 9419 120434 -153782 -128984 142630
4716 -347332 335 22436 -107074 -279936 25381 -50508 24144 -72776 -32397 -123746 12475 97636
4704 97636 -120536 -213477 -134792 -91821 -140674 180751 -116700 238843 -99141 195480 39912
4692 162171 297795 -347020 -146481 83533 -114750 122502 -175671 -226301 204300 132128
4682 132128 -159995 -41563 64209 110787 77194 -16835 35265 256093 177729 -85989 -5283
4670 158410 -196054 -327808 -84857 -6443 -244712 53147 1573 238736 5216 161040 -173883
4658 58588 100636 -192459 -146671 179197 -18887 -285975 82066 -76148 183243 46874 214539
4647 214539 -10808 -299696 177566 -34116 -24000 -84165 138027 87766 -145187 79662 -204642
4635 302940 69869 -28936 57876 113477 74133 148092 -258236 98799 -313814 259037 -119722
4623 34474 163675 110366 18111 39436 166387 321192 -3304 14800 47268 -101897 19264
4611 -31264 77941 -169245 -237520 -282095 -191585 -7135 110025 55661 -162346 -191008 133149
4599 -81704 390680 64845 70320 119249 408304 176760 -87121 -34046 326797 -803 49305 -51700
4586 232435 506646 57181 136024 146621 -6618 -159666 137517 -219160 -14021 -92206 141683
4574 243342 -62038 -91705 -213449 -74237 -186304 151045 111707 45014 -64467 -27474 307090
4562 -167221 322968 -40137 -81739 -104356 -17081 212564 -210298 -53197 40495 -352695 -126774
4550 274232 -82354 -87624 299588 373963 -115246 -162107 266614 104883 -205567 143524 82986
4539 82986 -424623 133651 91612 61318 24782 149274 147997 -65495 -76273 100278 -62711
4527 -152697 46910 -55922 -47280 60730 72462 24193 -167934 -88187 5463 -40170 -86376 -266656
4515 -266656 97549 182950 -62097 -187311 51871 -2048 -211608 -332302 -8283 -6281 -87021 242206
4502 -88166 -13094 -80959 306636 33088 -128453 -142192 186872 -138585 -60049 346539 -71946
4490 -89472 -227676 332639 126419 -135059 12094 -39905 -170788 36314 195263 -39147 -70280
4479 -70280 30621 -163034 -118118 -56720 12628 -124206 -5709 -319227 39785 -76960 -83572 96756
4466 -301133 163775 267351 191924 134084 -52631 -223687 -412383 28868 -45109 -82630 196750
4454 -172763 32582 -55599 204634 201712 -296144 211190 -10597 88135 85484 10572 179015
4443 179015 228060 -19339 -121155 -136517 -71352 78924 63673 221445 104905 57410 -117706
$$ [...]
##END NTUPLES=NMR SPECTRUM
##END=
