
##TITLE=AC1214_MBOAH12040_7165427_vBGWnf1sOw
##JCAMPDX= 6.0         $$ Bruker NMR JCAMP-DX V2.0
##DATA TYPE= NMR SPECTRUM
##DATA CLASS= NTUPLES
##ORIGIN= BRUKER
##OWNER= Administrator
$$ 1.72 TOPSPIN		Version 2.1
$$ 2012-12-02 02:55:30.178 -0500  Administrator@X
$$ Compression mode = diff/dup
##.OBSERVE FREQUENCY= 400.02188249412
##.OBSERVE NUCLEUS= ^1H
##.ACQUISITION MODE= SIMULTANEOUS (DQD)
##.ACQUISITION SCHEME= undefined
##.AVERAGES= 64
##.DIGITISER RES= 22
##SPECTROMETER/DATA SYSTEM= spect
##.PULSE SEQUENCE= noesygpps1d.comp
##.SOLVENT NAME= COFFEE_meoh
##.SHIFT REFERENCE= INTERNAL, COFFEE_meoh, 1, 14.96228
##AUDIT TRAIL= $$ (NUMBER, WHEN, WHO, WHERE, PROCESS, VERSION, WHAT)
$$ ##TITLE= Audit trail, TOPSPIN		Version 2.1
$$ ##JCAMPDX= 5.01
$$ ##ORIGIN= Bruker BioSpin GmbH
$$ ##OWNER= Administrator
$$ $$ E:\/data/COFFEE/nmr/AC1214_MBOAH12040_7165427_vBGWnf1sOw/12/pdata/1/auditp.txt
$$ ##AUDIT TRAIL=  $$ (NUMBER, WHEN, WHO, WHERE, PROCESS, VERSION, WHAT)
(   1,<2012-12-02 02:55:24.256 -0500>,<Administrator>,<X>,<go>,<TOPSPIN 2.1>,
      <created by zg
	started at 2012-12-02 02:43:54.163 -0500,
	POWCHK enabled, PULCHK disabled,
       configuration hash MD5:
       86 BA 57 50 F2 9D 5C 9B 26 00 A9 28 5F 66 2E 89
       data hash MD5: 64K
       71 DD 8F C0 2F B0 FB F2 70 E5 20 E6 A2 C2 65 13>)
(   2,<2012-12-02 02:55:27.335 -0500>,<Administrator>,<X>,<proc1d>,<TOPSPIN 2.1>,
      <Start of raw data processing
       efp LB = 0.3 FT_mod = 6 PKNL = 1 PHC0 = 0 PHC1 = 0 SI = 128K 
       data hash MD5: 128K
       AF 5F 10 BD 18 62 28 06 91 CB A9 8F 0C D3 DC E4>)
(   3,<2012-12-02 02:55:28.366 -0500>,<Administrator>,<X>,<proc1d>,<TOPSPIN 2.1>,
      <pk PHC0 = -80.36499 PHC1 = 0 
       data hash MD5: 128K
       42 29 2A C6 36 E6 EC EF B2 8B 1D E9 52 3A C3 D5>)
(   4,<2012-12-02 02:55:29.085 -0500>,<Administrator>,<X>,<proc1d>,<TOPSPIN 2.1>,
      <abs ABSG = 1 
       data hash MD5: 128K
       E1 B9 C2 97 74 F4 4C BC 06 A5 A6 7E 23 9C A2 DE>)
(   5,<2012-12-02 02:55:29.272 -0500>,<Administrator>,<X>,<proc1d>,<TOPSPIN 2.1>,
      <abs ABSG = 2 
       data hash MD5: 128K
       DE EF 4C 46 FB 34 10 C5 7E 13 26 00 1C C5 3D CC>)
(   6,<2012-12-02 02:55:29.428 -0500>,<Administrator>,<X>,<proc1d>,<TOPSPIN 2.1>,
      <abs ABSG = 3 
       data hash MD5: 128K
       F5 A8 61 9D B3 3F 10 7E 72 F4 7C 37 75 C0 E6 DB>)
(   7,<2012-12-02 02:55:29.616 -0500>,<Administrator>,<X>,<proc1d>,<TOPSPIN 2.1>,
      <abs ABSG = 4 
       data hash MD5: 128K
       0C 43 7E 2A 93 E4 81 1D 11 8E 0E E9 27 B9 63 A4>)
(   8,<2012-12-02 02:55:29.803 -0500>,<Administrator>,<X>,<proc1d>,<TOPSPIN 2.1>,
      <abs ABSG = 5 
       data hash MD5: 128K
       25 16 93 50 EC 88 16 39 09 B3 E7 28 5B 20 92 0B>)
$$ ##END=
$$ 
$$ $$ hash MD5
$$ $$ 0C E8 8C EE 79 FF 87 83 EA 0D 80 F7 38 D1 26 6E
##$RELAX= 
##$RELAX= 
##$RELAX= 
##$RELAX= 
##$RELAX= 
##$RELAX= 
##$RELAX= 
##$RELAX= 
$$ Bruker specific parameters
$$ --------------------------
##$DU= <E:\>
##$EXPNO= 12
$$ [...]
##$TP07= 0
##$TPNAME0= <>
##$TPNAME1= <>
##$TPNAME2= <>
##$TPNAME3= <>
##$TPNAME4= <>
##$TPNAME5= <>
##$TPNAME6= <>
##$TPNAME7= <>
##$TPOAL= (0..7)
0.5 0.5 0.5 0.5 0.5 0.5 0.5 0.5
##$TPOFFS= (0..7)
0 0 0 0 0 0 0 0
##$TUNHIN= 0
##$TUNHOUT= 0
##$TUNXOUT= 0
##$USERA1= <user>
##$USERA2= <user>
##$USERA3= <user>
##$USERA4= <user>
##$USERA5= <user>
##$V9= 5
##$VALIST= <valist>
##$VCLIST= <CCCCCCCCCCCCCCC>
##$VD= 0
##$VDLIST= <DDDDDDDDDDDDDDD>
##$VPLIST= <PPPPPPPPPPPPPPP>
##$VTLIST= <TTTTTTTTTTTTTTT>
##$WBST= 1024
##$WBSW= 4
##$XGAIN= (0..3)
0 0 0 0
##$XL= 0
##$YL= 0
##$YMAX_a= 9919341
##$YMIN_a= -20689068
##$ZGOPTNS= <>
##$ZL1= 120
##$ZL2= 120
##$ZL3= 120
##$ZL4= 120
##$ABSF1= 14.96228
##$ABSF2= -5.595901
##$ABSG= 5
##$ABSL= 3
##$ALPHA= 0
##$AQORDER= 0
##$ASSFAC= 0
##$ASSFACI= 0
##$ASSFACX= 0
##$ASSWID= 0
##$AUNMP= <proc_prof1d_extract.lims>
##$AXLEFT= 0
##$AXNAME= <>
##$AXNUC= <1H>
##$AXRIGHT= 0
##$AXTYPE= 0
##$AXUNIT= <>
##$AZFE= 0.1
##$AZFW= 0.1
##$BCFW= 0
##$BC_mod= 0
##$BYTORDP= 0
##$COROFFS= 0
##$CY= 15
##$DATMOD= 1
##$DC= 0
##$DFILT= <>
##$DTYPP= 0
##$F1P= 0
##$F2P= 0
##$FCOR= 0.5
##$FTSIZE= 131072
##$FT_mod= 6
##$GAMMA= 0
##$GB= 0
##$INTBC= 1
##$INTSCL= 1
##$ISEN= 128
##$LB= 0.3
##$LEV0= 0
##$LPBIN= 0
##$MAXI= 10000
##$MC2= 0
##$MEAN= 0
##$ME_mod= 0
##$MI= 0
##$NCOEF= 0
##$NC_proc= -2
##$NLEV= 6
##$NOISF1= 0
##$NOISF2= 0
##$NSP= 0
##$NTH_PI= 0
##$NZP= 0
##$OFFSET= 14.96228
##$PC= 1
##$PHC0= -80.36499
##$PHC1= 0
##$PH_mod= 1
##$PKNL= yes
##$PPARMOD= 0
##$PPDIAG= 0
##$PPIPTYP= 0
##$PPMPNUM= 2147483647
##$PPRESOL= 1
##$PSCAL= 4
##$PSIGN= 0
##$PYNMP= <proc.py>
##$REVERSE= no
##$SF= 400.020009123036
##$SI= 131072
##$SIGF1= 0
##$SIGF2= 0
##$SINO= 400
##$SIOLD= 131072
##$SPECTYP= <>
##$SREGLST= <1H.CDCl3>
##$SSB= 0
##$STSI= 131072
##$STSR= 0
##$SW_p= 8223.68421052631
##$SYMM= 0
##$S_DEV= 0
##$TDeff= 65536
##$TDoff= 0
##$TI= <>
##$TILT= no
##$TM1= 0
##$TM2= 0
##$TOPLEV= 0
##$USERP1= <user>
##$USERP2= <user>
##$USERP3= <user>
##$USERP4= <user>
##$USERP5= <user>
##$WDW= 1
##$XDIM= 131072
##$YMAX_p= 474444689
##$YMIN_p= -702871
##$CURPLOT= <Network HP LaserJet P1505>
##$CURPRIN= <$Network HP LaserJet P1505>
##$DFORMAT= <normdp>
##$LAYOUT= <+/1D_H.xwp>
##$LFORMAT= <normlp>
##$PFORMAT= <normpl>
##$SURQMSG= 1
$$ End of Bruker specific parameters
$$ ---------------------------------
##NTUPLES= NMR SPECTRUM
##VAR_NAME=  FREQUENCY,     SPECTRUM/REAL,   SPECTRUM/IMAG
##SYMBOL=    X,             R,               I
##VAR_TYPE=  INDEPENDENT,   DEPENDENT,       DEPENDENT
##VAR_FORM=  AFFN,          ASDF,            ASDF
##VAR_DIM=   131072,        131072,          131072
##UNITS=     HZ,            ARBITRARY UNITS, ARBITRARY UNITS
##FACTOR=    0.0627417313425164, 1,          1
##FIRST=     8223.62146879497, 2118,         -84201
##LAST=      0,             5498,            -84808
##MIN=       0,             -702871,         0
##MAX=       8223.62146879497, 474444689,    0
$$ Real data points
##PAGE= N=1
##DATA TABLE= (X++(R..R)), XYDATA
$$ [...]
60948B1137260k711381k460811k153158j845119j568280j327620j117383r36203
$$ 21137260 18425879 15965068 13811910 11966791 10398511 9070891 7953508 7017305
60940G017305p84920o59329n53098m64303l93793l39695k97706k64801k39073
$$ 7017305 6232385 5573056 5019958 4555655 4161862 3822167 3524461 3259660 3020587
60931C020587k17605j97779j79635j64142j50117j35440j20313j06549r4307q2380
$$ 3020587 2802982 2605203 2425568 2261426 2111309 1975869 1855556 1749007 1654700 1572320
60921A572320p1498o4293o1456o0450n8830n6512n3975n0537m5832m1064l7176
$$ 1572320 1500822 1436529 1375073 1314623 1255793 1199281 1145306 1094769 1048937 1007873 970697
60910I70697l3367k8964k5151k3010k1240j7963j3780j0825r448q166o482n362
$$ 970697 937330 908366 883215 860205 838965 821002 807222 796397 786949 778783 772301 766939
60898G66939m952m079k365q56q0P92K315L883M961N815O596P105P665Q743R467
$$ 766939 761987 757908 755543 754687 754607 755399 757714 761597 766558 772373 778969 786074 793739 802482 811949
60883H11949Q247N159K033l07k992o719j0245j2328j3462j4651j5767j6237j6099
$$ 811949 820196 825355 827388 827081 824089 817370 807125 794797 781335 766684 750917 734680 718581
60870G18581j5534j4406j3038j2240j1911j0872q792o845n784m791l135j480n24
$$ 718581 703047 688641 675603 663363 651452 640580 631788 624943 619159 614368 611233 609753 609229
60857F09229K89J580K849L545M227N586P321Q951J0689J2714J4522J5880J7359
$$ 609229 609518 611098 613947 617492 621719 627305 634626 643577 654266 666980 681502 697382 714741
60844G14741J9230K0900K2066K3231K4423K4758K3996K3089K2374K0615J6892
$$ 714741 733971 754871 776937 800168 824591 849349 873345 896434 918808 939423 956315
60833I56315J2155P950M835K802J919J691J112J73m0N83N50j004l125m895o671
$$ 956315 968470 976420 981255 984057 985976 987667 988779 988952 988912 989495 990045 989041 985916 981021 974350
60818I74350q601r796j0197j1342j3916j6389j7400j7748j8521j9098j8643j7845
$$ 974350 965749 955953 945756 934414 920498 904109 886709 868961 850440 831342 812699 794854
60806G94854j7398j6378j3948j1229r681q998q206p461p036o036l904j836q76
$$ 794854 777456 761078 747130 735901 726220 717222 709016 701555 694519 688483 684579 682743 681867
60793F81867q6J647L462M164M493N672P122P800Q431J0036J1488J1075R570R204
$$ 681867 681781 683428 686890 691054 695547 701219 708341 716141 724572 734608 746096 757171 766741 775945
60779G75945J0154J0530R458P918O777N973N545N762O334O922Q023J0075J2292
$$ 775945 786099 796629 806087 814005 820782 826755 832300 838062 844396 851318 859341 869416 881708
60766H81708J3683J4443J5085J5106J3935J2220J0694Q874O439M579M244M194
$$ 881708 895391 909834 924919 940025 953960 966180 976874 985748 992187 996766 1001010 1005204
60754A005204K722K41j697k902m049m702l972k411j261n77J33L16o77k093l130
$$ 1005204 1007926 1008167 1006470 1003568 999519 994817 990845 988434 987173 986596 986729 987045 986368 984275 981145
60739I81145m648p483j0227j1062j0759j1337j2618j2725j1377j0004r068p892
$$ 981145 976497 969014 958787 947725 936966 925629 913011 900286 888909 878905 869837 861945
60727H61945o882p277q692r305q639p991q059q157p866p481o777n205l291k114
$$ 861945 855063 847786 839094 829789 821150 813159 805100 796943 789077 781596 774819 769614 766323 764209
60713G64209j496l35J400K734L466M140M589M263L723M069N074N586N445N344
$$ 764209 762713 762378 763778 766512 769978 774118 778707 782970 786693 790762 795836 801422 806867 812211
60699H12211N198M392L250K467J462q96m262p186r192j0791j2052j2800j3727
$$ 812211 817409 821801 825051 827518 828980 828084 823822 816636 807444 796653 784601 771801 758074
60686G58074j5421j6929j7017j6186j5632j4983j3181j0886r719r625r140p897
$$ 758074 742653 725724 708707 692521 676889 661906 648725 637839 628120 618495 609355 601458
60674F01458o725n750m415l008k077r55J088K934L100K516L250N090N948N351
$$ 601458 594733 588983 584568 581560 579483 578528 579616 582550 585650 588166 591416 596506 602454 607805
60660F07805M854N183N374M870M134L276K102J400K095L520M465N342P013Q447
$$ 607805 612659 617842 623216 628086 632220 635496 637598 638998 641093 644613 649078 654420 661433 669880
60646F69880Q141P133P569Q880Q569O544N309N839O548O674P431R230J0721J1328
$$ 669880 678021 685154 692723 701603 710172 716716 722025 727864 734412 741086 748517 757747 768468 779796
60632G79796J2037J3101J3651J3947J5345J7446J8081J6657J4765J3005J0155
$$ 779796 791833 804934 818585 832532 847877 865323 883404 900061 914826 927831 937986
60621I37986O196L086J457n85m159p817j0267j2300j4599j6104j6062j5587j5681
$$ 937986 944182 947268 948725 948140 943981 936164 925897 913597 898998 882894 866832 851245 835564
60608H35564j5621j4571j2987j1271q798n446k429n53P71K057K916L392M201M996
$$ 835564 819943 805372 792385 781114 772316 766870 764441 763888 764659 766716 769632 773024 777225 782221
60594G82221M321K035j39j224k059k986k690m86K157L682M331M944N506N869O376
$$ 782221 786542 788577 788438 787214 785155 782169 779479 778993 781150 784832 789163 794107 799613 805482 811858
60579H11858O810O178M395K710J816J043m6q38j116j603k510l152l511m472o016
$$ 811858 818668 824846 829241 831951 833767 834810 834764 833926 832810 831207 828697 825545 822034 817562 811546
60564H11546o987p187p782r096r918r676r338r411q955p396n535m026k502q36
$$ 811546 804559 797372 789590 780494 770576 760900 751562 742151 733196 725800 720265 716239 713737 712901
60550G12901M72J703L886O858R200J0524J1929J3800J5321J6606J9058K2972K7012
$$ 712901 713373 715076 718962 725820 735020 745544 757473 771273 786594 803200 822258 845230 872242
60537H72242L0766L5476M1613M8040N4191O0515O5812O6842O1908N2492M0165
$$ 872242 903008 938484 980097 1028137 1082328 1142843 1208655 1275497 1337405 1389897 1430062
60526A430062K4461N477j3844k9917m1430m8592n1392n0128m6026l9979l2090
$$ 1430062 1454523 1460000 1446156 1416239 1374809 1326217 1274825 1224697 1178671 1138692 1106602
60515A106602k3369j5948j0539n577r8M575P229Q741J0134J0713R858Q878R276
$$ 1106602 1083233 1067285 1056746 1051169 1051071 1055646 1062875 1071616 1081750 1092463 1102321 1111199 1120475
60502A120475J0708J2331J4752J8963K4620L0978L8365M7331N7453O8308Q0544
$$ 1120475 1131183 1143514 1158266 1177229 1201849 1232827 1271192 1318523 1375976 1444284 1524828
60491A524828R4735J10216J26081J42219J58420J73756J88121K03349K21788K44670
$$ 1524828 1619563 1729779 1855860 1998079 2156499 2330255 2518376 2721725 2943513 3188183
60481C188183K72513L05527L41823L75304L95945L92572L56893K87342J89813
$$ 3188183 3460696 3766223 4108046 4483350 4879295 5271867 5628760 5916102 6105915
60472F105915P3973n0677j73977k82681l63385m09710m24783m16448l92339l59253
$$ 6105915 6179888 6129211 5955234 5672553 5309168 4899458 4474675 4058227 3665888 3306635
60462C306635l23200k87604k53233k21009j92936j69559j49098j30229j13567
$$ 3306635 2983435 2695831 2442598 2221589 2028653 1859094 1709996 1579767 1466200
60453A466200r9471q6847p5300o5973n9064n2789m6086l9999l5243l0788k6158
$$ 1466200 1366729 1279882 1204582 1138609 1079545 1026756 980670 940671 905428 874640 848482
60442H48482k2591k0618j8913j6852j5712j5939j5860j4578j3504j3476j3022
$$ 848482 825891 805273 786360 769508 753796 737857 721997 707419 693915 680439 667417
60431F67417j1281r830r698r231p045m615l688l516k824k209k344k040m07J137
$$ 667417 656136 646306 636608 627377 620332 615717 612029 608513 605689 603480 601136 599096 598689 599826
60417E99826J343J376K401L155K345J321J781K801K776K369K870L450K781J801
$$ 599826 601169 602545 604946 608101 610446 611767 613548 616349 619125 621494 624364 627814 630595 632396
60403F32396K114L049K995K336K447L005K893K683L738N683P050P586P972Q142
$$ 632396 634510 637559 640554 642890 645337 648342 651235 653918 657656 663339 670389 677975 685947 694089
60389F94089P711P109O557N128K466R3o60o57j242k141k689l459m806n543m895
$$ 694089 701800 708909 715466 720594 723060 723153 722493 721836 720594 718453 715764 712305 707499 701956 697061
60374F97061m065m066l817k380r93q53q33L04J410J133N36J093J897J525Q29J206
$$ 697061 692996 688930 685113 682733 681740 680887 680054 680358 681768 682901 683437 684530 686427 687952 688781 689987
60358F89987J799J293P68J882L690M268M068M739N841N837N192N579O836P590
$$ 689987 691786 693079 693847 695729 699419 703687 707755 712494 718335 724172 729364 734943 741779 749369
60344G49369P952Q919R943R817R071Q943Q844P432N264L811K718P32j548k463
$$ 749369 757321 766240 776183 786000 795071 804014 812858 820290 825554 829365 832083 832815 831267 828804
60330H28804k107j818j640o72P91J823K753M221N249M609L076K030R51j305l905
$$ 828804 826697 824879 823239 822567 823358 825181 827934 832155 837404 842013 845089 847119 848070 846765 842860
60315H42860n248n700o546p305o803n790n761o112n224l553k846l176l339l350
$$ 842860 837612 831912 825366 818061 811258 805468 799707 793595 788371 784818 781972 778796 775457 772107
60301G72107l859m034k801j303j307k046j422M40J773K443L664N077N146M022
$$ 772107 768248 764214 761413 760110 758803 756757 755335 755775 757548 759991 763655 768732 773878 777900
60287G77900L242K974K222J259J220J733J512Q21Q55J430J721K344M079N568N114
$$ 777900 781142 784116 786338 787597 788817 790550 792062 792883 793738 795168 796889 799233 803312 808880 813994
60272H13994L883M248N896O712O744P843R958J1202J1422J2401J4538J6483J8020
$$ 813994 817877 822125 828021 834733 841477 849320 859278 870480 881902 894303 908841 925324 943344
60259I43344K0368K3562K6331K8651L1733L5623L9275M2840M7338N2471N7224
$$ 943344 963712 987274 1013605 1042256 1073989 1109612 1148887 1191727 1239065 1291536 1348760
60248A348760O2086O8199P4967Q1225Q7833R6079J04388J09894J12676J15087
$$ 1348760 1410846 1479045 1554012 1635237 1723070 1819149 1923537 2033431 2146107 2261194
60238B261194J17382J17527J14937J10843J05087R6109Q4252P1775N9411M6061
$$ 2261194 2378576 2496103 2611040 2721883 2826970 2923079 3007331 3079106 3138517 3184578
60228C184578L1868J8348N523p810k0962l1704l9776m6687n2065n3789n1883m8722
$$ 3184578 3216446 3234794 3240317 3232507 3211545 3179841 3140065 3093378 3041313 2987524 2935641 2886919
60216B886919m4966l8795k9720j9678r570J913J5188K8585M1110N3631O6551P9023
$$ 2886919 2841953 2803158 2773438 2753760 2744190 2746103 2761291 2789876 2830986 2884617 2951168 3030191
60204C030191R0900J02812J13828J21787J26153J27739J25729J18221J05985R2236
$$ 3030191 3121091 3223903 3337731 3459518 3585671 3713410 3839139 3957360 4063345 4155581
60194D155581P8203O2193M3527K3978M642j5224l5324n3455o8535q1486r2311
$$ 4155581 4233784 4295977 4339504 4363482 4368124 4352900 4317576 4264121 4195586 4114100 4021789
60183D021789r9256j01748j01160r7962r1084q0835o9283n6928m2182k5023p929
$$ 4021789 3922533 3820785 3719625 3621663 3530579 3449744 3380461 3323533 3281351 3256328 3248399
60172C248399P871K3883M0866N6936P0471Q1902R1237R6544R6518R2135Q4635
$$ 3248399 3256270 3280153 3321019 3377955 3448426 3530328 3621565 3718109 3814627 3906762 3991397
60161C991397P4208O1681M8906L6267K2289O694q469k1640l3187m3130m9972n2853
$$ 3991397 4065605 4127286 4176192 4212459 4234748 4241442 4232973 4211333 4178146 4135016 4085044 4032191
60149D032191n2469m9088m1931l1277j8721m715J1707L0202M8844O7180Q6887
$$ 4032191 3979722 3930634 3888703 3857426 3838705 3833990 3845697 3875899 3924743 3991923 4078810
60138D078810J08770J31781J55532J80888K07537K33995K60574K89161L19227
$$ 4078810 4187580 4319361 4474893 4655781 4863318 5097313 5357887 5647048 5966275
60129E966275L47228L70744L90022M04600M11889M10386M01073L84378L58884
$$ 5966275 6313503 6684247 7074269 7478869 7890758 8301144 8702217 9086595 9445479
60120I445479L24402K83282K37364J86527J31391P4257J6031m4596j07371j68757
$$ 9445479 9769881 10053163 10290527 10477054 10608445 10682702 10698733 10654137 10546766 10378009
60110A0378009k25354k76046l19447l52396l72802l81298l78756l65033l41628
$$ 10378009 10152655 9876609 9557162 9204766 8831964 8450666 8071910 7706877 7365249
60101G365249l12432k80265k45218k07655j69714j32410r4392n5278j7329J7756
$$ 7365249 7052817 6772552 6527334 6319679 6149965 6017555 5923163 5867885 5850556 5868312
60091E868312N0761Q2107J09869J32086J48148J56658J55221J43910J25937J03493
$$ 5868312 5919073 6001180 6111049 6243135 6391283 6547941 6703162 6847072 6973009 7076502
60081G076502P6297M5501J5135j2361l8348o3644q5797j03159j18099j33211j47397
$$ 7076502 7152799 7198300 7213435 7201074 7162726 7099082 7013285 6910126 6792027 6658816 6511419
60070F511419j58483j66700j72812j75648j74440j71038j67006j60923j51162
$$ 6511419 6352936 6186236 6013424 5837776 5663336 5492298 5325292 5164369 5013207
60061E013207j38955j26135j12303r6743q0656o4957m8232k9444j0365P146K3951
$$ 5013207 4874252 4748117 4635814 4539071 4458415 4393458 4345226 4315782 4305417 4312563 4336514
60050D336514M1257N8001P3040Q7490J02089J14669J22843J26936J27675J23465
$$ 4336514 4377771 4435772 4508812 4596302 4698391 4813060 4935903 5062839 5190514 5313979
60040E313979J12892R7596P9722N8706L3606O539j9356m3765o8025r1613j12531
$$ 5313979 5426871 5524467 5604189 5662895 5696501 5703040 5683684 5639919 5571894 5480281 5367750
60029E367750j29780j42934j50752j52707j50457j45577j37391j25165j10659
$$ 5367750 5237970 5095036 4944284 4791577 4641120 4495543 4358152 4232987 4122328
60020D122328r6194q1816o6635n1264l6719k2459p601P497K2705L9236N7538P6149
$$ 4122328 4026134 3944318 3877683 3826419 3789700 3767241 3759640 3767137 3789842 3829078 3886616 3962765
60008C962765R4403J13808J34736J54310J69947J82394J92649J98405J96505J86889
$$ 3962765 4057168 4170976 4305712 4460022 4629969 4812363 5005012 5203417 5399922 5586811
59998E586811J71401J50696J25101R6557O6915L6037L899k7506n6685q4676j11857
$$ 5586811 5758212 5908908 6034009 6130566 6197481 6233518 6237417 6209911 6153226 6068550 5956693
59987E956693j35157j51422j61379j67159j68171j62790j52320j39749j25851
$$ 5956693 5821536 5670114 5508735 5341576 5173405 5010615 4858295 4718546 4592695
59978D592695j09660r1483p2541n2778l1733j0421R981K9933M9801O8030Q3219
$$ 4592695 4483035 4391552 4319011 4266233 4234500 4224079 4234060 4263993 4313794 4381824 4465043
59967D465043R6179J07642J16015J19794J20039J17945J12303J02158Q9606P7056
$$ 4465043 4561222 4668864 4784879 4904673 5024712 5142657 5254960 5357118 5446724 5523780
59957E523780O3970M9252L4545K1882J0380j294j1291j6814j7985j6085j0015
$$ 5523780 5587750 5637002 5671547 5693429 5703809 5702515 5691224 5674410 5656425 5640340 5630325
59946E630325J860J8292L7283N9856Q7999J20556J54918J91204K30959K73229
$$ 5630325 5632185 5650477 5687760 5747616 5835615 5956171 6111089 6302293 6533252 6806481
59936F806481L15612L57774L99893M38791M69339M88590M94921M84518M52784
$$ 6806481 7122093 7479867 7879760 8318551 8787890 9276480 9771401 10255919 10708703
59927A0708703L98653L24190K31438J23571Q157j04866k08284k97972l69861m20702
$$ 10708703 11107356 11431546 11662984 11786555 11794712 11689846 11481562 11183590 10813729 10393027
59917A0393027m51172m64586m63111m48347m24251l95427l63117l26427k86721
$$ 10393027 9941855 9477269 9014158 8565811 8141560 7746133 7383016 7056589 6769868
59908F769868k47252k09228j71813j35235j00265o5521k9106P817M2618P5553
$$ 6769868 6522616 6313388 6141575 6006340 5906075 5840554 5811448 5819265 5861883 5937436
59898E937436J08675J41196J69836J93243K12074K25044K28779K21471K03171
$$ 5937436 6046111 6187307 6357143 6550386 6762460 6987504 7216283 7437754 7640925
59889G640925J72979J29825P5913J5924m7006j11096j72414k25605k68184l00624
$$ 7640925 7813904 7943729 8019642 8035566 7988560 7877464 7705050 7479445 7211261 6910637
59879F910637l22631l33004l33077l26360l14578k97481k76467k54652k33193
$$ 6910637 6588006 6255002 5921925 5595565 5280987 4983506 4707039 4452387 4219194
59870D219194k10957j88043j66270j46095j26355j07187r0042p4847o0354m7134
$$ 4219194 4008237 3820194 3653924 3507829 3381474 3274287 3184245 3109398 3049044 3001910
59860C001910l7039k9944k4372k0928k1528k5365k9238l1888l4465l6835l7122
$$ 3001910 2964871 2934927 2910555 2889627 2868099 2842734 2813496 2781608 2747143 2710308 2673186
59849B673186l5009l1829k7297j9814j0214j648M546R325J2202J0766M525m206
$$ 2673186 2638177 2606348 2579051 2559237 2549023 2547375 2551921 2561246 2573448 2584214 2588739 2584533
59837B584533j3719k4000l4139m2073m7323n0907n2358n0095m4865l9336l4093
$$ 2584533 2570814 2546814 2512675 2470602 2423279 2372372 2320014 2269919 2225054 2185718 2151625
59826B151625k7464j9412j1980n563J591R695J6930K3151L0428L9111M6691N1498
$$ 2151625 2124161 2104749 2092769 2087206 2088797 2098492 2115422 2138573 2169001 2208112 2254803 2306301
59814B306301N4387N6322N7423N8862O2367O7170P0364P0622O8462O2981N2116
$$ 2306301 2360688 2417010 2474433 2533295 2595662 2662832 2733196 2803818 2872280 2935261 2987377
59803B987377L6674K0538O298o008j5734k1081k2409k2262k1318j7879j1914n716
$$ 2987377 3024051 3044589 3050887 3044879 3029145 3008064 2985655 2963393 2942075 2924196 2912282 2906566
59791B906566L13Q663K0317L3134M5810N9915P6619R4878J14349J36824J63254
$$ 2906566 2906879 2915542 2935859 2968993 3014803 3074718 3151337 3246215 3360564 3497388 3660642
59780C660642J92422K23893K59299K99267L41605L83340M21278M48977M55938
$$ 3660642 3853064 4076957 4336256 4635523 4977128 5360468 5781746 6230723 6686661
59771F686661M31668L69908K70594J42179K748j25861k28274k99548l40675l54584
$$ 6686661 7118329 7488237 7758831 7901010 7903758 7777897 7549623 7250075 6909400 6554816
59761F554816l47037l26218k98499k66600k32718k00014j69975j41571j14571
$$ 6554816 6207779 5881561 5583062 5316462 5083744 4883730 4713755 4572184 4457613
59752D457613r0682p0254n1095l1940j4106J677J6964L2795M8085O2253P6686
$$ 4457613 4366931 4296677 4245582 4213642 4199536 4201213 4218177 4250972 4299057 4361310 4437996
59741D437996R2359J08567J25086J42961J62238J81711K01708K24306K50024K77335
$$ 4437996 4530355 4638922 4764008 4906969 5069207 5250918 5452626 5676932 5926956 6204291
59731F204291L06023L37870L73269M10498M49007M89803N31665N70589O03989
$$ 6204291 6510314 6848184 7221453 7631951 8080958 8570761 9102426 9673015 10277004
59722A0277004O31758O51920O59284O50194O25567N88180N40850M88864M40294
$$ 10277004 10908762 11560682 12219966 12870160 13495727 14083907 14624757 15113621 15553915
59713A5553915M01584L75528L64526L71783L97442M37082M86122N42307O02047
$$ 15553915 15955499 16331027 16695553 17067336 17464778 17901860 18387982 18930289 19532336
59704A9532336O57954P02454P30718P38070P18038O65972N82477M71688L39191
$$ 19532336 20190290 20892744 21623462 22361532 23079570 23745542 24328019 24799707 25138898
59695B5138898J93567M6721r0277k10196l07630l77475m17507m29892m18106l84576
$$ 25138898 25332465 25379186 25288909 25078713 24771083 24393608 23976101 23546209 23128103 22743527
59685B2743527l32446k66503j90378j05245j2402Q5873J89336L00208M18937N42636
$$ 22743527 22411081 22144578 21954200 21848955 21836553 21922426 22111762 22411970 22830907 23373543
59675B3373543O68927P97430R25218J043940J143348J214092J245039J221884
$$ 23373543 24042470 24839900 25765118 26809058 27952406 29166498 30411537 31633421
59667C1633421J132210R70719P39230M46440J10873k39405n74358q69341j106196
$$ 31633421 32765631 33736350 34475580 34922020 35032893 34793488 34219130 33349789 32243593
59658C2243593j273081j367524j397004j373112j306335j207332j089016r63914
$$ 32243593 30970512 29602988 28205984 26832872 25526537 24319205 23230189 22266275
59650B2266275q41961p33426o51158o06562o04301o41522p08477p87836q58048
$$ 22266275 21424314 20690888 20039730 19433168 18828867 18187345 17478868 16691032 15832984
59641A5832984r02887r17871r06644q74283q26023p68446p07377o45660n85033
$$ 15832984 14930097 14012226 13105582 12231299 11405276 10636830 9929453 9283793 8698760
59632H698760n28114m76324m28376l83140l41907l05773k73361k43308k16385
$$ 8698760 8170646 7694322 7265946 6882806 6540899 6235126 5961765 5718457 5502072
59623E502072j92937j70920j48865j28242j10528r4601p9345o6134n6125m7795
$$ 5502072 5309135 5138215 4989350 4861108 4750580 4655979 4576634 4510500 4454375 4406580
59613D406580l9808l3964l2592l5187l9970m6500n4588o2945p1034p9857q8967
$$ 4406580 4366772 4332808 4300216 4265029 4225059 4178559 4123971 4061026 3989992 3910135 3821168
59602C821168r5456r7833r8001r7428r4646q8802q2236p6755p0640o2190n3121
$$ 3821168 3725712 3627879 3529878 3432450 3337804 3249002 3166766 3090011 3019371 2957181 2904060
59591B904060m5412l7912k9118k0378j3126n881K742J0801J6142K0061K4553K8463
$$ 2904060 2858648 2820736 2791618 2771240 2758114 2752233 2754975 2765776 2781918 2801979 2826532 2854995
59579B854995K9768K9273K8725K7538K4614K1174J8596J5828J1980R206R822J2792
$$ 2854995 2884763 2914036 2942761 2970299 2994913 3016087 3034683 3050511 3062491 3071697 3081519 3094311
59567C094311J6137K0451K7037L4868M2562N0962O0845P0520P8877Q8252J01030
$$ 3094311 3110448 3130899 3157936 3192804 3235366 3286328 3347173 3417693 3496570 3584822 3685852
59556C685852J15832J30300J45171J62272J80881J99480K18850K40006K61254
$$ 3685852 3801684 3931984 4077155 4239427 4420308 4619788 4838638 5078644 5339898
59547E339898K80325K97242L12176L23071L28416L29659L27772L20549L06536
$$ 5339898 5620223 5917465 6229641 6552712 6881128 7210787 7538559 7859108 8165644
59538H165644K88566K69891K50275K29609K11390J97562J83300J62673J37488
$$ 8165644 8454210 8724101 8974376 9203985 9415375 9612937 9796237 9958910 10096398
59529A0096398J15363J00988R4196R4616J02442J15268J29074J41864J52462J56763
$$ 10096398 10211761 10312749 10406945 10501561 10604003 10719271 10848345 10990209 11142671 11299434
59519A1299434J49410J28392R4585M8216j0184p6721j46108k15683k84018l47198
$$ 11299434 11448844 11577236 11671821 11720037 11709853 11633132 11487024 11271341 10987323 10640125
59509A0640125m00425m42043m72263m89610m92740m84325m68927m48131m21461
$$ 10640125 10239700 9797657 9325394 8835784 8343044 7858719 7389792 6941661 6520200
59500F520200l90598l58594l26180k92847k60325k31117k04796j79569j56091
$$ 6520200 6129602 5771008 5444828 5151981 4891656 4660539 4455743 4276174 4120083
59491D120083j35907j17737r9377q1800o7215n4474m0761k6453j3923k659R997
$$ 4120083 3984176 3866439 3767062 3685262 3618047 3563573 3522812 3496359 3482436 3479777 3489774
59480C489774K4134L7614N0319O4060P9048R4325J10768J29863J50496J70668
$$ 3489774 3513908 3551522 3601841 3665901 3744949 3839274 3950042 4079905 4230401 4401069
59470D401069J91181K13847K37356K58712K77257K93300L04271L06462K99171
$$ 4401069 4592250 4806097 5043453 5302165 5579422 5872722 6176993 6483455 6782626
59461F782626K82996K55785K14863J62040J01982L7096l1424r9157j60182k12304
$$ 6782626 7065622 7321407 7536270 7698310 7800292 7837388 7805964 7706807 7546625 7334321
59451G334321k56015k89607l10399l19779l21952l18419l08317k93209k76449
$$ 7334321 7078306 6788699 6478300 6158521 5836569 5518150 5209833 4916624 4640175
59442D640175k58614k38473k17623j99158j82580j65220j47789j33291j21138
$$ 4640175 4381561 4143088 3925465 3726307 3543727 3378507 3230718 3097427 2976289
59433B976289j07979r3974q2560p4114o5365n5296m6285l9127l2056k4940j9436
$$ 2976289 2868310 2774336 2691776 2617662 2552297 2497001 2450716 2411589 2379533 2354593 2335157
59422B335157j4842q749j927K515M844Q385J3503J7332J9622K3253K8496L2679
$$ 2335157 2320315 2311566 2309639 2312154 2316998 2325383 2338886 2356218 2375840 2399093 2427589 2460268
59410B460268L6123M2214N0092N3249M7888L7869K9373K5074K5428L0919M0436
$$ 2460268 2496391 2538605 2588697 2641946 2689834 2727703 2757076 2782150 2807578 2838497 2878933
59399B878933N1226O2660P7067R5089J13249J27434J36383J41477J46252J56162
$$ 2878933 2930159 2992819 3069886 3164975 3278224 3405658 3542041 3683518 3829770 3985932
59389C985932J75151K01932K32565K66277L04973L48020L92309M37251M84459
$$ 3985932 4161083 4363015 4595580 4861857 5166830 5514850 5907159 6344410 6828869
59380F828869N31948N73512O04547O23807O29076O16607N86381N43357M92253
$$ 6828869 7360817 7934329 8538876 9162683 9791759 10408366 10994747 11538104 12030357
59371A2030357M35291L75877L19436K68864K23237J82203J47273J17469Q8070
$$ 12030357 12465648 12841525 13160961 13429825 13653062 13835265 13982538 14100007 14188077
59362A4188077N5369J8897k2066o9841j24565j82724k40627k95738l43667l78054
$$ 14188077 14243446 14262343 14240277 14170436 14045871 13863147 13622520 13326782 12983115 12605061
59352A2605061l95090l95254l80431l53131l18932k85165k56123k33070k18812
$$ 12605061 12209971 11814717 11434286 11081155 10762223 10477058 10220935 9987865 9769053
59343I769053k17369k28388k46621k67907k91222l14252l32216l42717l47240
$$ 9769053 9551684 9323296 9076675 8808768 8517546 8203294 7871078 7528361 7181121
59334G181121l46403l38256l22656l02861k81277k57661k32703k08884j86602
$$ 7181121 6834718 6496462 6173806 5870945 5589668 5332007 5099304 4890420 4703818
59325D703818j63763j40504j19835j02501q5844o8917n3975m1517k8738j4505
$$ 4703818 4540055 4399551 4279716 4177215 4091371 4022454 3968479 3926962 3898224 3883719
59315C883719j047J0881K3738L8281N1688O2446P2479Q2517Q9977R3471R4852
$$ 3883719 3882672 3893553 3917291 3955572 4007260 4069706 4142185 4224702 4314679 4408150 4503002
59304D503002R4728R0478Q0837O8140N3994L7122J7536j549j8085l3215m7142
$$ 4503002 4597730 4688208 4769045 4837185 4891179 4928301 4945837 4944288 4926203 4892988 4845846
59293D845846n7417o3284o7172o9769o8178o1146n1569m1485k9110j3248L834
$$ 4845846 4788429 4725145 4657973 4588204 4520026 4458880 4407311 4365826 4336716 4323468 4327302
59282D327302K0435L7997N7278P6184R3835J12441J32666J51277J65875J77757
$$ 4327302 4347737 4385734 4443012 4519196 4613031 4725472 4858138 5009415 5175290 5353047
59272E353047J87672J93011J91783J85254J74270J57050J32927J04099P1521L3874
$$ 5353047 5540719 5733730 5925513 6110767 6285037 6442087 6575014 6679113 6750634 6784508
59262F784508o868m3529p0475q8149r8601j01330r6656q8568q0597p2600o4510
$$ 6784508 6777640 6734111 6663636 6575487 6476886 6375556 6278900 6190332 6109735 6037135 5972625
59251E972625n9144n8193n9423o0936o4250p0219p5942p8950q0557q1976q0932
$$ 5972625 5913481 5855288 5795865 5734929 5670679 5600460 5524518 5445568 5365011 5283035 5202103
59240E202103p5184o5769n3783l7807j7261N534K9527N7202Q9919J25093J60834
$$ 5202103 5126919 5061150 5007367 4969560 4952299 4957833 4987360 5044562 5134481 5259574 5420408
59229E420408J99126K41280K84442L25680L65245M02214M30939M45378M43451
$$ 5420408 5619534 5860814 6145256 6470936 6836181 7238395 7669334 8114712 8558163
59220H558163M24277L85508L26908K52686J66885P0459l3996j38971k37082l25390
$$ 8558163 8982440 9367948 9694856 9947542 10114427 10184886 10150890 10011919 9774837 9449447
59210I449447m01338m59118m94487n09568n09125m95553m71038m40420m07689
$$ 9449447 9048109 8588991 8094504 7584936 7075811 6580258 6109220 5668800 5261111
59201E261111l72915l36207l00974k69765k40753k12085j85820j63869j44168
$$ 5261111 4888196 4551989 4251015 3981250 3740497 3528412 3342592 3178723 3034555
59192C034555j24793j07945r5733q5987p6307o8315o3642n9589n3313m6575m1935
$$ 3034555 2909762 2801817 2706084 2620097 2543790 2475475 2411833 2352244 2298931 2252356 2210421
59181B210421l7853l2079k6244k2451j8813j3028p063l575q97L797R391J3522
$$ 2210421 2172568 2140489 2114245 2091794 2072981 2059953 2052890 2049315 2048418 2052215 2061606 2075128
59169B075128J7221K2372K7457L0394L2848L7295M2588M6625N0529N6088O2015
$$ 2075128 2092349 2114721 2142178 2172572 2205420 2242715 2285303 2331928 2382457 2438545 2500560
59158B500560O6865P2499Q0589Q8865R5008J00820J08192J14512J16715J16403
$$ 2500560 2567425 2639924 2720513 2809378 2904386 3005206 3113398 3227910 3344625 3461028
59148C461028J16177J14231J07661R7856Q7459P4980N7812L7842J8937J318j6524
$$ 3461028 3577205 3691436 3799097 3896953 3984412 4059392 4117204 4155046 4173983 4175301 4158777
59137D158777l2907m4951n3211n9497o2518o0316n4637m8193m0008k8098j4151
$$ 4158777 4125870 4080919 4027708 3968211 3905693 3845377 3790740 3742547 3702539 3674441 3660290
59126C660290r34J2476K8219M5011O0661P6669R5690J16849J37928J59492J82408
$$ 3660290 3659356 3671832 3700051 3745062 3805723 3882392 3978082 4094931 4232859 4392351 4574759
59115D574759K04262K22961K40945K61088K81328K97991L11043L20895L23315
$$ 4574759 4779021 5001982 5242927 5504015 5785343 6083334 6394377 6715272 7038587
59106G038587L13071K89834K55291K07965J46998P8420J1549m8796j01397j43272
$$ 7038587 7351658 7641492 7896783 8104748 8251746 8330166 8341715 8292919 8191522 8048250
59096H048250j71647j89047k00421k07148k09343k11287k18074k28642k38132
$$ 8048250 7876603 7687556 7487135 7279987 7070644 6859357 6641283 6412641 6174509
59087F174509k45345k52134k57468k58416k55461k50983k44007k32247k17762
$$ 6174509 5929164 5677030 5419562 5161146 4905685 4654702 4410695 4178448 3960686
59078C960686k04733j93082j79966j65999j54250j44509j34248j23909j15698
$$ 3960686 3755953 3562871 3382905 3216906 3062656 2918147 2783899 2659990 2544292
59069B544292j08498r9564q9790q1962p5371o7471n9118n2761m7284m0215l3111
$$ 2544292 2435794 2336230 2246440 2164478 2089107 2021636 1962518 1909757 1862473 1822258 1789147
59058A789147k9133k7191k4231k1265k1142k2451k1821k0344k1350k3609k3162
$$ 1789147 1760014 1732823 1708592 1687327 1666185 1643734 1621913 1601569 1580219 1556610 1533448
59047A533448k0197j7627j4604q130L19O646J1295J7818K5427K9676K9531K7202
$$ 1533448 1513251 1495624 1481020 1472890 1473209 1479855 1491150 1508968 1534395 1564071 1593602 1620804
59035A620804K2254J2888K121m355n999o503n991j169P368J5092K0636K6106L0670
$$ 1620804 1643058 1655946 1658067 1653712 1647713 1641210 1635219 1634050 1641418 1656510 1677146 1703252 1733922
59022A733922L0755K6694K2485J8813J2798M718j563n087q353j1300j1007p567
$$ 1733922 1764677 1791371 1813856 1832669 1845467 1850185 1848622 1843535 1835182 1823882 1812875 1805308
59010A805308m129j009M178J0675J4976J6862J8915K0349J7740J1611N819O25
$$ 1805308 1801179 1800170 1804348 1815023 1829999 1846861 1865776 1886125 1903865 1915476 1921295 1921920
58998A921920p014j6460k3427k7079l0345l3233l2605k8905k6168k4957k1900
$$ 1921920 1914906 1898446 1875019 1847940 1817595 1784362 1751757 1722852 1696684 1671727 1649827
58987A649827j6697j2773j0568o965j957R09J412L198O759Q668Q601J0309J4616
$$ 1649827 1633130 1620357 1609789 1602824 1600867 1601776 1603188 1606386 1613145 1621813 1630414 1640723 1655339
58974A655339J8074J9649K2141K5934K7901K7691K8658L1378L2573L1615L1771
$$ 1655339 1673413 1693062 1715203 1741137 1769038 1796729 1825387 1856765 1889338 1920953 1952724
58963A952724L3888L5063L4690L5606L8234L9733L9881M1622M4914M6410M5982
$$ 1952724 1986612 2021675 2056365 2091971 2130205 2169938 2209819 2251441 2296355 2342765 2388747
58952B388747M7144N0188N1530N0776N1725N5377N8653O1183O6545P5542Q4947
$$ 2388747 2435891 2486079 2537609 2588385 2640110 2695487 2754140 2815323 2881868 2957410 3042357
58941C042357R4097J06054J20959J34977J47044J59885J73182J82853J88631J95529
$$ 3042357 3136454 3242508 3363467 3498444 3645488 3805373 3978555 4161408 4350039 4545568
58931D545568K06272K19096K34364K56065K84980L17343L52066L92359M38536
$$ 4545568 4751840 4970936 5205300 5461365 5746345 6063688 6415754 6808113 7246649
58922G246649M86358N34414N86039O41834O97207P49129P98160Q41611Q71803
$$ 7246649 7733007 8267421 8853460 9495294 10192501 10941630 11739790 12581401 13453204
58913A3453204Q83178Q74211Q40569P74188O72029N39185L81624K03559J4220
$$ 13453204 14336382 15210593 16051162 16825350 17497379 18036564 18418188 18621747 18635967
58904A8635967j70998l39943m88113o11885p05409p67431q03728q19288q14637
$$ 18635967 18464969 18125026 17636913 17025028 16319619 15552188 14748460 13929172 13114535
58895A3114535p92596p60893p24562o82604o35470n88594n45052n01833m57233
$$ 13114535 12321939 11561046 10836484 10153880 9518410 8929816 8384764 7882931 7425698
58886G425698m15090l77953l42941l08328k77614k53108k31774k11297j94054
$$ 7425698 7010608 6632655 6289714 5981386 5703772 5450664 5218890 5007593 4813539
58877D813539j81307j69550j56353j43954j33721j23075j11061j00687r2742q3748
$$ 4813539 4632232 4462682 4306329 4162375 4028654 3905579 3794518 3693831 3601089 3517341
58867C517341p3163o5810o3867o3164o0772n9236n9751n8314n2723m6568m2277
$$ 3517341 3444178 3378368 3314501 3251337 3190565 3131329 3071578 3013264 2960541 2913973 2871696
58856B871696l6927k8937k1999j8198j3894o638L99N069J0526J8735K6407L1686
$$ 2871696 2834769 2805832 2783833 2765635 2751741 2745103 2745502 2750571 2761097 2779832 2806239 2837925
58844B837925L8128M7681N6429O1804O7312P5644Q3784Q9554R6277J06223J16109
$$ 2837925 2876053 2923734 2980163 3041967 3109279 3184923 3268707 3358261 3454538 3560761 3676870
58833C676870J23849J33102J46325J60019J71720J85006K02584K21201K38568
$$ 3676870 3800719 3933821 4080146 4240165 4411885 4596891 4799475 5020676 5259244
58824E259244K58586K84490L13401L43032L77028M18110M62604N07375N55485
$$ 5259244 5517830 5802320 6115721 6458753 6835781 7253891 7716495 8223870 8779355
58815H779355O09049O63008P12000P56988P98660Q30305Q43454Q34990Q02757
$$ 8779355 9388404 10051412 10763412 11520400 12319060 13149365 13992819 14827809 15630566
58806A5630566P40387O43354N15306L63039J90866N659j78719l48725m98325o24139
$$ 15630566 16370953 17014307 17529613 17892652 18083518 18089177 17910458 17561733 17063408 16439269
58796A6439269p20038p82896q17901q31744q25724q01188p65572p26205o83365
$$ 16439269 15719231 14936335 14118434 13286690 12460966 11659778 10894206 10168001 9484636
58787I484636o35721n87359n43074n01843m61219m23178l89747l58035l25632
$$ 9484636 8848915 8261556 7718482 7216639 6755420 6332242 5942495 5584460 5258828
58778E258828k95744k71253k49161k26605k06675j92250j79912j66219j54088
$$ 5258828 4963084 4691831 4442670 4216065 4009390 3817140 3637228 3471009 3316921
58769C316921j46576j40136j30691j20669j13411j06298r6250q6410q0394p5303
$$ 3316921 3170345 3030209 2899518 2778849 2665438 2559140 2462890 2376480 2296086 2220783
58759B220783o7307n8791n3100m7567l8772k9501k3519j8613j1572m694n41M314
$$ 2220783 2153476 2094685 2041585 1994018 1955246 1925745 1902226 1883613 1872041 1867347 1866806 1871120
58747A871120J3304K3069K9602L5643M4815N3816N7551N6526N2178M0862K0307
$$ 1871120 1884424 1907493 1937095 1972738 2017553 2071369 2128920 2185446 2237624 2278486 2298793
58736B298793l458k3251l9503n4651o5021o6559o3087o0426n7467n1135m4724
$$ 2298793 2295335 2272084 2232581 2177930 2112909 2046350 1983263 1922837 1865370 1814235 1769511
58725A769511m2790m2868m0741l8896m1234m4498m3665m1046m1337m2446l9987
$$ 1769511 1726721 1683853 1643112 1604216 1562982 1518484 1474819 1433773 1392436 1349990 1310003
58714A310003l6185l5365l5154l1076k5543k3467k3180k0395j6872j6461j6916
$$ 1310003 1273818 1238453 1203299 1172223 1146680 1123213 1100033 1079638 1062766 1046305 1029389
58703A029389j4292j1047j1192j1943r002n321n644p161m897j551k372m867l542
$$ 1029389 1015097 1004050 992858 980915 971913 966592 960948 953787 948890 947339 944967 940100 936558
58690I36558m46r53l222k146J68j936o887q895q303r189j0136p212k797j669j618
$$ 936558 936112 935159 931937 929791 929959 928023 921136 912241 903938 894749 884613 877401 874604 872935 871317
58675H71317K400Q363J1198J2800J7961K3972K4697K1626K0461K0151J5927J0006
$$ 871317 873717 882080 893278 906078 924039 948011 972708 994334 1014795 1034946 1050873 1060879
58663A060879Q412R917Q745N473M649M361r10r424j4695j6479j9047k1159j8421
$$ 1060879 1069291 1079208 1087953 1093426 1098075 1102436 1101526 1092102 1077407 1060928 1041881 1020722 1002301
58650A002301j3069j0853j0526o758q90J749K431O180J1163J1967J0790J4108
$$ 1002301 989232 978379 967853 961095 960205 961954 964385 970565 981728 993695 1004485 1018593
58638A018593K0596K3671K3774K6745L2244L5230L6954M2877N1545N7024O0609
$$ 1018593 1039189 1062860 1086634 1113379 1145623 1180853 1217807 1260684 1312229 1369253 1429862
58627A429862O8583Q0167Q9435R7417J10436J27896J43651J58050J76643J98203
$$ 1429862 1498445 1578612 1668047 1765464 1875900 2003796 2147447 2305497 2482140 2680343
58617B680343K16007K29987K45639K61806K71269K72221K67149K51627K16937
$$ 2680343 2896350 3126337 3371976 3633782 3905051 4177272 4444421 4696048 4912985
58608D912985J63670J01097L4127l7105j06147j62039k02330k32284k51874k56121
$$ 4912985 5076655 5177752 5211879 5174774 5068627 4906588 4704258 4471974 4220100 3963979
58598C963979k47764k36352k24431k07115j85370j66777j52611j36950j19364
$$ 3963979 3716215 3479863 3255432 3048317 2862947 2696170 2543559 2406609 2287245
58589B287245j06029r7394q7147p4331o4391n7495m7890l5618k6776k1495j3719
$$ 2287245 2181216 2083822 1996675 1922344 1857953 1800458 1752568 1716950 1690174 1668679 1654960
58578A654960l350L542O951J3001K1481K5899K6381K9952L7468M3019M6727N5130
$$ 1654960 1651610 1655152 1662103 1675104 1696585 1722484 1748865 1778817 1816285 1859304 1906031 1961161
58566A961161O8066P8072Q3361Q8064Q9090P6562M9029J5412j8965n4952q7908
$$ 1961161 2029227 2107299 2190660 2278724 2367814 2444376 2493405 2508817 2489852 2434900 2346992
58555B346992j08117j14981j17366j18330j12779j01212r1461q4949p5407o2959
$$ 2346992 2238875 2123894 2006528 1888198 1775419 1674207 1582746 1497797 1422390 1359431
58545A359431n5328n3160m8571m0267l5612l5596l2639k5724k2736k4893k3825
$$ 1359431 1304103 1250943 1202372 1162105 1126493 1090897 1058258 1032534 1009798 984905 961080
58534I61080j7315j3033j3406j1638o299m842q849j0502p622p514j2060j3735
$$ 961080 943765 930732 917326 905688 899389 894547 885698 875196 867574 860060 848000 834265
58522H34265j0424r413j2578j2535p603n592q401p978k030J382m35J25N495P996
$$ 834265 823841 814428 801850 789315 781712 776120 767719 759741 757711 759093 758658 758783 764278 772274
58508G72274N339N563J1244J4338J2216J3216K0424K5531K4921K6408L3625L9178
$$ 772274 777613 783176 794420 808758 820974 834190 854614 880145 905066 931474 965099 1004277
58496A004277L9748M2653N0689N5800N4536N4525N8680N8314M9162L9065L2625
$$ 1004277 1044025 1086678 1137367 1193167 1247703 1302228 1360908 1419222 1468384 1507449 1540074
58485A540074K3523R352j401n040j0222k2151l3901m0928m8944n9749o4605n9916
$$ 1540074 1563597 1572949 1571548 1566508 1556286 1534135 1500234 1459306 1410362 1350613 1286008 1226092
58473A226092n4573n3805n0829m2253l6232l6829l5781k8411k2452k2538k1274
$$ 1226092 1171519 1117714 1066885 1024632 988400 951571 915790 887379 864927 842389 821115
58462H21115j4436r647j1070j0914n089j779n377p479l093j06l253m504R86N144
$$ 821115 806679 797032 785962 775048 769959 768180 762803 755324 752231 752125 748872 744368 745354 750498
58448G50498K948K333Q307J3111J2100J3424K1746K8505K8609L0512L9106M5165
$$ 750498 753446 755779 764086 777197 789297 802721 824467 852972 881581 912093 951199 996364
58436I96364M2613L9613M1241L8023K3582P266k686j2229k5917l5086l4163l2322
$$ 996364 1038977 1078590 1119831 1157854 1181436 1188702 1186016 1173787 1147870 1112784 1078621 1046299
58424A046299l6316l7863l0641k3304k2873k1592j3331o487p430p573k18O357
$$ 1046299 1009983 972120 941479 918175 895302 873710 860379 853892 846462 838889 838671 845028
58412H45028N763O508J4734K1279J9672J9527K7812L4436L1034K6270K7409K4856
$$ 845028 850791 857299 872033 893312 912984 932511 960323 994759 1025793 1052063 1079472 1104328
58400A104328J0987l534q608j2228k2658l0910k8177k3406k6046k8246k1669j4945
$$ 1104328 1115315 1111781 1103173 1090945 1068287 1037377 1009200 985794 959748 931502 909833 894888
58388H94888j6705j8334j1463n487r577j4401j0194n696j0303j4767q927j482
$$ 894888 878183 859849 848386 842899 833322 818921 808727 803031 792728 777961 769034 767552
58376G67552k648m365K528Q868N021P79O821J3734J0367N678J0865J7098J3061
$$ 767552 764904 760539 763067 771935 776956 777735 784556 798290 808657 814335 825200 842298 855359
58363H55359P561J2269J8838J5750J1247J6663K3613K0802J6931K3599L2060L0334
$$ 855359 862920 875189 894027 909777 921024 937687 961300 982102 999033 1022632 1054692 1085026
58351A085026K6601L1790L5982K6491J2567P595L930r643k2930k2563j7868k2439
$$ 1085026 1111627 1143417 1179399 1205890 1218457 1226052 1229982 1220339 1197409 1174846 1156978 1134539
58339A134539k7365j9456q677r868j4303p318K731J436k795M234J3486J0009K751
$$ 1134539 1107174 1087718 1079041 1069173 1054870 1047552 1050283 1051719 1048924 1053158 1066644 1076653 1079404
58326A079404P432J6083J3511P625J3177K1823J9019J4029K2009L3087L0914K5028
$$ 1079404 1086836 1102919 1116430 1124055 1137232 1159055 1178074 1192103 1214112 1247199 1278113 1303141
58314A303141L2402M3777M1277L2340L2763L3470J8704q8l667r33j0007k1280
$$ 1303141 1335543 1379320 1420597 1452937 1485700 1519170 1537874 1537786 1534119 1533186 1523179 1501899
58302A501899j6112m597o810j3825o037P063M977l075M070J7873J7137J0004J7266
$$ 1501899 1485787 1481190 1474380 1460555 1454518 1461581 1466558 1463483 1467553 1485426 1502563 1512567 1529833
58289A529833L0316K8204K0137K7889M2366M1587L5098M5613O3342O4829O0335
$$ 1529833 1560149 1588353 1608490 1636379 1678745 1720332 1755430 1801043 1864385 1929214 1989549
58278A989549P4908R8925J05937J03271J15089J31473J25307J04015R2974Q3792
$$ 1989549 2064457 2163382 2269319 2372590 2487679 2619152 2744459 2848474 2941448 3025240
58268C025240N2139J0860r126j5015l4161n6793n3867l5621l3486l9533k4032
$$ 3025240 3077379 3088239 3079113 3064098 3029937 2973144 2919277 2883656 2850170 2810637 2786605
58257B786605K899R029L308J7928M3213M5692L5052M5873O8632O8145N4716O5353
$$ 2786605 2789504 2798533 2801841 2819769 2862982 2908674 2943726 2989599 3058231 3126376 3181092 3246445
58245C246445Q9999R0249P5672Q5272J09062J07126R0801J02750J31939J33563
$$ 3246445 3336444 3426693 3502365 3587637 3696699 3803825 3894626 3997376 4129315 4262878
58235D262878J18081J32044J65604J70992J58023J75726K13646K20863K08683
$$ 4262878 4380959 4513003 4678607 4849599 5007622 5183348 5396994 5617857 5826540
58226E826540K30842K75946K87747K77984L05887L59824L78355L74571M14192
$$ 5826540 6057382 6333328 6621075 6899059 7204946 7564770 7943125 8317696 8731888
58217H731888M84199N15668N23186N81226O75858P29289P58376Q49503R89000
$$ 8731888 9216087 9731755 10254941 10836167 11512025 12241314 12999690 13849193 14838193
58208A4838193J089178J170338J333637J566078J771527J983372K330010K802922
$$ 14838193 15927371 17097709 18431346 19997424 21768951 23752323 26082333 28885255
58200B8885255L299162L880714M722815N816100P021269Q405899J0183664J2350500
$$ 28885255 32184417 36065131 40787946 46604046 53625315 62031214 72214878 84565378
58192H4565378J4816350J7886627K2081644K7478002L3894814M1602012N0399705
$$ 84565378 99381728 117268355 139349999 166828001 200722815 242324827 292724532
58185B92724532N7178002N5831812M1805636J7176484r854153l0967135m2820530
$$ 292724532 349902534 405734346 447539982 464716466 454862313 423895178 381074648
58178C81074648m6804441m5713728m1721411l6430619l1082756k6260437k1972006
$$ 381074648 334270207 288556479 246835068 210404449 179321693 153061256 131089250
58171A31089250j8206559j5100759j2636105j0593048q851252p449156o345637
$$ 131089250 112882691 97781932 85145827 74552779 65701527 58252371 51906734
58164E1906734n386249m513884l789994l203898k653254k108375j624483j197978
$$ 51906734 46520485 42006601 38216607 35012709 32359455 30251080 28626597 27428619
58156B7428619p56284k72919K33658P89187J450414K244563L168708M100933M605758
$$ 27428619 26672335 26399416 26633074 27422261 28872675 31117238 34285946 38386879 42992637
58147D2992637M050725K202441l54498k625540m013442m571361m593668m270316
$$ 42992637 47043362 49245803 48891305 46265765 42252323 37680962 33087294 28816978
58139B8816978l745649l203013k743230k328597j929311j601116j370243j175082
$$ 28816978 25071329 21868316 19125086 16796489 14867178 13266062 11895819 10720737
58131A0720737r78596q23471p28380o39179n28721m43209m06480l73487l18597
$$ 10720737 9742141 8918670 8190290 7551111 7022390 6579181 6172701 5799214 5480617
58122E480617k79388k74756k65635k33071k13311k20948k16005j80444j51890
$$ 5480617 5201229 4926473 4660838 4427767 4214456 3993508 3777503 3597059 3445169
58113C445169j49703j40482j07500q3692q5472q2038n9689n0452o7816p7994o3396
$$ 3445169 3295466 3154984 3047484 2963792 2878320 2796282 2736593 2686141 2618325 2540331 2476935
58102B476935n2900o1560o0976l7155j9009k1863j9480O39R789p248k3811k3933
$$ 2476935 2424035 2362475 2301499 2264344 2245335 2223472 2203992 2204631 2214420 2207172 2183361 2159428
58090B159428l0731n6073p3260o6916o1075p1160p5672o1624n1524n8960o2278
$$ 2159428 2128697 2072624 1999364 1932448 1871373 1800213 1724541 1662917 1611393 1552433 1490155
58079A490155m8172l7804m4342m7128l3166k2799k9209l2895k1060j2887k1081
$$ 1490155 1441983 1404179 1359837 1312709 1279543 1256744 1227535 1194640 1173580 1160693 1139612
58068A139612k6753j6848r183j6332k1075j1481m628j2069j6621o781P2q245j5058
$$ 1139612 1112859 1096011 1086828 1070496 1049421 1037940 1033312 1021243 1004622 997841 997913 989668 974610
58055I74610p948k637j1022j7637j0591m719j1411j6115p992j922q914j4153o377
$$ 974610 966662 964025 953003 935366 924775 920056 908645 892530 884538 882616 873702 859549 853172
58042H53172q9o684j2075m878J228m950r786j853N609R22l591L060Q523J910m520
$$ 853172 853083 846399 834324 829446 830674 825724 815938 814085 819694 820616 817025 820085 828608 830518 825998
58027H25998K49M614j658o415P27P288K083k972L628J0724O999L137J0118J7258
$$ 825998 826247 830861 829203 822788 823515 830803 832886 829914 833542 844266 851265 854402 864520 881778
58013H81778J3318Q422J3673J9491J5293J0686J6190K2359J8771J4749K0708K7549
$$ 881778 895096 903518 917191 936682 951975 962661 978851 1001210 1019981 1034730 1055438 1082987
58001A082987K4702K0258K3184K3911J2580j135o256j0728k3903l6489l7847l6131
$$ 1082987 1107689 1127947 1151131 1175042 1187622 1186487 1180231 1169503 1145600 1109111 1071264 1035133
57989A035133m1327m5143l7674k7652k6112k5932j7486q875j0491j4556j0043
$$ 1035133 993806 948663 910989 883337 857225 831293 813807 804932 794441 779885 769842
57978G69842l391m694p600k584L612J260l078L48N339K480j953J427O521M135
$$ 769842 766451 761757 754157 751573 755185 756445 753367 753715 759054 761534 759581 761008 767529 771664
57964G71664L15L919Q487M869l79K370O966L629k089q69J676l517j0234q389l289
$$ 771664 771979 775898 784385 789254 788875 791245 798211 801840 799751 798882 800558 797041 786807 778418 775129
57949G75129n039r233o566j517l149p083m624k90k520o387l250J679r94o774o271
$$ 775129 770090 760857 754291 752774 749625 742542 737918 737628 735108 728721 725471 727150 726156 719382 713111
57934G13111l243o202j0876q646m079o509j2199j1997q932j1180j5212j2898p893
$$ 713111 709868 703666 692790 684144 680065 673556 661357 649360 640428 629248 614036 601138 593245
57921E93245q317j0531o703j016j847n188k347L083K524o75J812O442M750L97
$$ 593245 584928 574397 567694 566678 564831 559643 557296 560379 562903 562228 564040 570482 575232 575629
57907E75629K511Q221Q553N582P253J0909Q552L112L230O914O277L303N183R091
$$ 575629 578140 586361 594914 600496 607749 618658 627210 630322 633552 640466 646743 650046 655229 664320
57893F64320P400K987L802P217N299O06J109M315K149l033k986L99q31m866l993
$$ 664320 671720 674707 678509 685726 691025 691631 692740 697055 699204 696171 693185 693584 692753 687887 683894
57878F83894j49j171n397n225k212l533p151n665j201j451m534k856J692J517
$$ 683894 683745 682574 677177 671952 669740 666207 659056 653391 652190 650739 646205 643349 645041 646558
57864F46558j412N92N296M356m97o35K962K080k415k383J565J350k845l364j76
$$ 646558 645146 645738 651034 655390 654893 654258 657220 659300 656885 654502 656067 657417 654572 651208 651032
57849F51032k50l106j719L176M129J289J580M740M268J119K225O510O458K643
$$ 651032 650782 647676 645957 649133 653262 654551 656131 660871 665139 666258 668483 674993 681451 684094
57835F84094K508N629M505o68k361l50j808o886q367n800o092r746j0262p513
$$ 684094 686602 692231 696736 696068 693707 693357 691549 684663 676296 670496 664404 654658 644396 636883
57821F36883q117j2014j2257q716q491j1991j2039p758o042q065p504l524k502
$$ 636883 628766 616752 604495 595779 587288 575297 563258 555500 549458 541393 533889 530365 527863
57808E27863n311n549k045p93k869k627O32J284j008k84L805N078L022L812P985
$$ 527863 522552 517003 514958 514165 511296 508669 509301 510585 509577 509293 513098 518176 521198 525010 532995
57793E32995R307P274Q332J2945J3889R484O305O574M911K2k326o68o09l607m354
$$ 532995 542302 549576 557908 570853 584742 594226 600531 607105 612016 612038 609712 609044 608435 604828 600474
57778F00474j856j782n155n913k571j140l667m869k930k722n310n111p39J939
$$ 600474 598618 596836 591681 585768 583197 582057 578390 573521 570591 567869 562559 557448 556709 558648
57764E58648O89N52L638N441M323M600P250P618M942M189N825L993k307o609o287
$$ 558648 559337 559889 563527 568968 573291 577891 585141 592759 597701 601890 607715 611708 609401 602792 596505
57749E96505o186q193p709l670j588l171l114L98K182M32M25M112O135M040K640
$$ 596505 590319 582126 574417 570747 569159 565988 562874 563272 565454 565886 566311 570423 576558 580598 583238
57734E83238M323M787K334J690M576N979L920L458O909R407Q342P955J0429J1510
$$ 583238 587561 592348 594682 596372 600948 606927 610847 614305 621214 630621 638963 646918 657347 668857
57720F68857R259Q158J0362J1716J0482J0999J4736J6748J5123J4823J8073K0121
$$ 668857 678116 686274 696636 708352 718834 729833 744569 761317 776440 791263 809336 829457
57708H29457J8823J9093K3325K6598K6250K7081L2037L6714L8203M0740M7308
$$ 829457 848280 867373 890698 917296 943546 970627 1002664 1039378 1077581 1118321 1165629
57697A165629N4167N8881O5474P6319Q7196R5552J05653J20386J36075J50411
$$ 1165629 1219796 1278677 1344151 1420470 1507666 1603218 1708871 1829257 1965332 2115743
57687B115743J67421J89342K11649K31189K50861K70878K83630K82879K70171
$$ 2115743 2283164 2472506 2684155 2915344 3166205 3437083 3720713 4003592 4273763
57678D273763K46890K08696J54279R1960L1414k4032p1543j03786j16464j13724
$$ 4273763 4520653 4729349 4883628 4975588 5007002 4982970 4911427 4807641 4691177 4577453
57668D577453j00442p7371n0719l7834n3833r6663j51176k02222k38827k53664
$$ 4577453 4477011 4399640 4348921 4311087 4257254 4160591 4009415 3807193 3568366 3314702
57658C314702k47411k29552k08615j85449j59698j35824j17127j00430q2866o7702
$$ 3314702 3067291 2837739 2629124 2443675 2283977 2148153 2031026 1930596 1847730 1780028
57648A780028n7656m8846l7590k7075k0926j6179q988j502L272P941J5695K4218
$$ 1780028 1722372 1673526 1635936 1608861 1587935 1571756 1562768 1561266 1564538 1572479 1588174 1612392
57636A612392L0785L8051M8759O0044O9033P8759R2472J07451J20608J34797J53237
$$ 1612392 1643177 1681228 1729987 1790031 1859064 1937823 2030295 2137746 2258354 2393151 2546388
57625B546388J72860J89449K04317K19512K31157K33803K26739K10245J80659
$$ 2546388 2719248 2908697 3113014 3332526 3563683 3797486 4024225 4234470 4415129
57616D415129J35649Q0022K0660l9647r8143j47681j82979k06521k22302k28810
$$ 4415129 4550778 4630800 4651460 4611813 4513670 4365989 4183010 3976489 3754187 3525377
57606C525377k24326k13693k02817j91076j75800j59628j46525j34893j21491
$$ 3525377 3301051 3087358 2884541 2693465 2517665 2358037 2211512 2076619 1955128
57597A955128j08170r8146q9658p9817p0716o5273o1007n4402m7440m3446m0493
$$ 1955128 1846958 1748812 1659154 1579337 1508621 1443348 1382341 1327939 1280499 1237053 1196560
57586A196560l5333k9932k7521k6134k2614j9083j8761j9247j6736j3248j2754
$$ 1196560 1161227 1131295 1103774 1077640 1055026 1035943 1017182 997935 981199 967951 955197
57575I55197j3646j1973q850p779p730n630k853k585l540k675j227j773k360J33
$$ 955197 941551 929578 920728 912949 905219 899589 896736 894151 890611 887936 886709 884936 882576 882709
57561H82709L777N000N137P247R677R268P943R370J2099J2604J2235J4421J7796
$$ 882709 886486 891486 896623 903870 913547 922815 930758 940128 952227 964831 977066 991487 1009283
57548A009283J8940J9292K2455K7176K9907L1907L6907M3901M9247N3807O1181
$$ 1009283 1028223 1047515 1069970 1097146 1127053 1158960 1195867 1239768 1289015 1342822 1404003
57537A404003P0706P9028Q6903R7656J10527J22102J32854J45796J60078J72146
$$ 1404003 1474709 1553737 1640640 1738296 1848823 1970925 2103779 2249575 2409653 2581799
57527B581799J81565J89379J92199J84379J64896J36308R8815N1816r1m9163r1717
$$ 2581799 2763364 2952743 3144942 3329321 3494217 3630525 3729340 3781156 3781065 3731902 3640185
57516C640185j27681j54875j70179j75314j75229j71560j63162j51640j40384
$$ 3640185 3512504 3357629 3187450 3012136 2836907 2665347 2502185 2350545 2210161
57507B210161j29265j16173j02562r1775q3157p3571o3453n5656m9621m2546l5109
$$ 2210161 2080896 1964723 1862161 1770386 1687229 1613658 1550205 1494549 1444928 1402382 1367273
57496A367273l0185k7004k2295j6190j1511q406m976j815n30O56M447R336J2334
$$ 1367273 1337088 1310084 1287789 1271599 1260088 1251682 1246706 1244891 1244361 1245017 1249464 1258800 1271134
57483A271134J4835K0067K6861L1960L6461M3725N2853O0698O8449P9575R2933
$$ 1271134 1285969 1306036 1332897 1364857 1401318 1445043 1497896 1558594 1627043 1706618 1799551
57472A799551J04685J15465J28756J43559J55771J65432J75332J83254J82890
$$ 1799551 1904236 2019701 2148457 2292016 2447787 2613219 2788551 2971805 3154695
57463C154695J71893J52182J23181Q2382L2567j8569o6131j09009j44077j66865
$$ 3154695 3326588 3478770 3601951 3684333 3716900 3698331 3632200 3523191 3379114 3212249
57453C212249j78247j83443j84121j78023j66304j54066j43144j31063j17627
$$ 3212249 3034002 2850559 2666438 2488415 2322111 2168045 2024901 1893838 1776211
57444A776211j05927r6355q6212p5756o8135o2961n6557m8936m3852m1440l7649
$$ 1776211 1670284 1573929 1487717 1411961 1343826 1280865 1224308 1175372 1131520 1090080 1052431
57433A052431l1749k7460k5747k3348j9556j7597j7964j7024j3853j1893j2221
$$ 1052431 1020682 993222 967475 944127 924571 906974 889010 871986 858133 846240 834019
57422H34019j1551q782p187q154q673p107n783n941n572m088l747m757m287j923
$$ 834019 822468 813686 806499 798345 789672 782565 776782 770841 765269 761181 757434 752677 748390 746467
57408G46467q44k088k869j971j520k065j349P18J263j3M7K068K841J381P07K046
$$ 746467 745623 743535 740666 738695 737175 735110 733761 734479 735742 735729 735776 737844 740685 742066 742773 744819
57392G44819K801J892J678K897L160K000K037L554L429J083o6J217J976R04N52
$$ 744819 747620 749512 751190 754087 757247 759247 761284 764838 768267 769350 769284 770501 772477 773381 773933
57377G73933J886K292R44N77J986K333R11Q11K814L398J167n35K39R11m1j44J754
$$ 773933 775819 778111 779055 779632 781618 783951 784862 785673 788487 791885 793052 792517 792756 793667 793626 793482 795236
57360G95236K812J684J225K883L777K298J214K202K667J182P40L152N353M867
$$ 795236 798048 799732 800957 803840 807617 809915 811129 813331 815998 817180 817920 821072 826425 831292
57346H31292M005N013N861M584L301M083N068M459M161N891P469O710N332N635
$$ 831292 835297 840310 846171 850755 854056 858139 863207 867666 871827 877718 885187 891897 897229 902864
57332I02864O700O988P153P535O523M116L274N074O540N868N462P083Q409P678
$$ 902864 909564 916552 923705 931240 937763 941879 945153 950227 956767 962635 968097 975180 983589 991267
57318I91267P216Q869J0261R214P931Q926J0544J0293R185R206R620R254R300
$$ 991267 998483 1007352 1017613 1026827 1034758 1043684 1054228 1064521 1073706 1082912 1092532 1101786 1111086
57305A111086J0700J1831J1670J2001J3785J4853J3969J3409J4698J5632J4577
$$ 1111086 1121786 1133617 1145287 1157288 1171073 1185926 1199895 1213304 1228002 1243634 1258211
57294A258211J3826J5414J7445J7858J8119J9767K1059K0524K0240K2064K4048
$$ 1258211 1272037 1287451 1304896 1322754 1340873 1360640 1381699 1402223 1422463 1444527 1468575
57283A468575K4146K3973K5425K6968K6806K6413K7385K8142K7139K5969K5923
$$ 1468575 1492721 1516694 1542119 1569087 1595893 1622306 1649691 1677833 1704972 1730941 1756864
57272A756864K4874K1097J6569J3083Q677J731n061q753j0705j3174j4802j3676
$$ 1756864 1781738 1802835 1819404 1832487 1841164 1842895 1837834 1829081 1818376 1805202 1790400 1776724
57260A776724j1586j0883j0178p353l981k476j676N00K895L732M701Q040J2073
$$ 1776724 1765138 1754255 1744077 1736724 1732743 1730267 1728591 1729091 1731986 1735718 1740419 1748459 1760532
57247A760532J3915J4253J5340J6660J6670J6525J7880J9324J9005J8497K0009
$$ 1760532 1774447 1788700 1804040 1820700 1837370 1853895 1871775 1891099 1910104 1928601 1948610
57236A948610K2054K2066K1059K1549K2932K3141K2858K3938K5534K5812K5716
$$ 1948610 1970664 1992730 2013789 2035338 2058270 2081411 2104269 2128207 2153741 2179553 2205269
57225B205269K7008K8475K8106K7154K8062L0146L1364L2438L5149L8263L9331
$$ 2205269 2232277 2260752 2288858 2316012 2344074 2374220 2405584 2438022 2473171 2511434 2550765
57214B550765L9095M0052M2035M3178M3822M5505M7389M7523M6564M6558M7297
$$ 2550765 2589860 2629912 2671947 2715125 2758947 2804452 2851841 2899364 2945928 2992486 3039783
57203C039783M7267M6878M7202M7051M4920M2474M2402M4090M4977M4955M5846
$$ 3039783 3087050 3133928 3181130 3228181 3273101 3315575 3357977 3402067 3447044 3491999 3537845
57192C537845M7693M9139N0396N2554N4987N6577N8254O1254O4350O5868O6858
$$ 3537845 3585538 3634677 3685073 3737627 3792614 3849191 3907445 3968699 4033049 4098917 4165775
57181D165775O9014P1124P1035O9554O8997O9330O9171O9072P0204P1324P0635
$$ 4165775 4234789 4305913 4376948 4446502 4515499 4584829 4654000 4723072 4793276 4864600 4935235
57170D935235O9334O9792P1590P2782P3605P5349P7009P6853P5989P6597P7851
$$ 4935235 5004569 5074361 5145951 5218733 5292338 5367687 5444696 5521549 5597538 5674135 5751986
57159E751986P7402P5758P5304P5781P4679P1416O7544O3438N8318N3068M9637
$$ 5751986 5829388 5905146 5980450 6056231 6130910 6202326 6269870 6333308 6391626 6444694 6494331
57148F494331M8074M7204M7512N0130N3680N5554N5960N7614O1739O7202P3209
$$ 6494331 6542405 6589609 6637121 6687251 6740931 6796485 6852445 6910059 6971798 7039000 7112209
57137G112209P9945Q6830R2719R7542J01530J03442J01872R7589R2434Q6846Q0630
$$ 7112209 7192154 7278984 7371703 7469245 7570775 7674217 7776089 7873678 7966112 8052958 8133588
57126H133588P5049P1797P0938P2211P7276Q8078J03669J20830J37083J51184
$$ 8133588 8208637 8280434 8351372 8423583 8500859 8588937 8692606 8813436 8950519 9101703
57116I101703J61970J69308J75777J85359K00667K22513K51102K86048L25992
$$ 9101703 9263673 9432981 9608758 9794117 9994784 10217297 10468399 10754447 11080439
57107A1080439L69736M17739M72368N37692O19271P22802Q52862J013996J212764
$$ 11080439 11450175 11867914 12340282 12877974 13497245 14220047 15072909 16086905 17299669
57098A7299669J457505J757412K123130K565369L089299L691381M363331N094937
$$ 17299669 18757174 20514586 22637716 25203085 28292384 31983765 36347096 41442033
57090D1442033N868900O657439P428717Q150681Q782319R269834R562268R623220
$$ 41442033 47310933 53968372 61397089 69547770 78330089 87599923 97162191 106785411
57082A06785411R416174Q894644Q034831O870702N459024L803319J856497l67901
$$ 106785411 116201585 125096229 133131060 140001762 145460786 149264105 151120602 150752701
57074A50752701k708384m912088o773477q204931r202322r792757j0021590r949494
$$ 150752701 148044317 143132229 136358752 128153821 118951499 109158742 99137152 89187658
57066H9187658r634407r123258q466170p723153o947943o175879n432527m741960
$$ 89187658 79553251 70429993 61963823 54240670 47292727 41116848 35684321 30942361
57058C0942361m119889l568862l086770k672724k321167k019822j758847j535182
$$ 30942361 26822472 23253610 20166840 17494116 15172949 13153127 11394280 9859098
57050I859098j345180j181133j038187r16299q12050p16619o25333n41584m68090
$$ 9859098 8513918 7332785 6294598 5378299 4566249 3849630 3224297 2682713 2214623
57041B214623m01954l41524k90121k49130k14513j83743j59277j41702A06321
$$ 2214623 1812669 1471145 1181024 931894 717381 533638 374361 232659 106321
57031c955r6237q5996p6458o5746n6820n1523m6908m0881l5674l2518k8651k2797
$$ -3955 -100192 -186188 -262646 -328392 -385212 -436735 -483643 -524524 -560198 -592716 -621367 -644164
57019f44164j7979j5726j2971p834l136j061M68L165N207N657P143J1323J6057
$$ -644164 -662143 -677869 -690840 -698674 -701810 -702871 -702403 -699238 -694031 -688374 -681231 -669908 -653851
57006f53851J9734K4118L0730L8494M6895N7688P2044Q9553J10863b5423A48939
$$ -653851 -634117 -609999 -579269 -540775 -493880 -436192 -364148 -274595 -163732 -25423 148939
56994C69744K73182L09675K93693K03784O2752p4892j67562k10694k19575k05773
$$ 369744 642926 952601 1246294 1450078 1512830 1437938 1270376 1059682 840107 634334
56984F34334j76605j42552j12669q8830D2041b3121o9586p6327p7616p4738p1332
$$ 634334 457729 315177 202508 113678 42041 -23121 -92707 -169034 -246650 -321388 -392720
56973c92720o5515n5091m3959l6383l0256k2274j4419r301m551K315Q711J2509
$$ -392720 -458235 -513326 -557285 -593668 -623924 -646198 -660617 -669918 -674469 -672154 -663443 -650934
56961f50934J7278K6153L5865M2875M9969N9792O6605O1725M4129K0081m175k4015
$$ -650934 -633656 -607503 -571638 -528763 -478794 -419002 -352397 -290672 -246543 -226462 -230637 -254652
56949b54652l5155l7026l4626l2257k8713k2450j6594j3930j1627o309mM199Q027
$$ -254652 -289807 -326833 -361459 -393716 -422429 -444879 -461473 -475403 -487030 -493339 -493343 -489144 -481117
56936d81117J4235K1224K6735L2858M2317N3638O4123P2439P3871a9939H510E97
$$ -481117 -466882 -445658 -418923 -386065 -343748 -290110 -225987 -153548 -79677 -19939 8510 597
56923c4308m9303n5755n6125n0047m1479l5711l2090k6922k0997j7562j5611j2058
$$ -34308 -83611 -139366 -195491 -245538 -287017 -322728 -354818 -381740 -402737 -420299 -435910 -447968
56911d47968q112o876p048n393l049l144m462l730j860j828k634j403P94J129
$$ -447968 -456080 -462956 -470004 -475397 -478446 -481590 -486052 -489782 -491642 -493470 -496104 -497507 -496713 -495584
56897d95584P19K306M674N118N053P342J0651J2312J4049J8963K5553L0779L5913
$$ -495584 -494865 -492559 -487885 -482767 -477714 -470372 -459721 -447409 -433360 -414397 -388844 -358065 -322152
56884c22152M2558M5778L8740K2630N200q764j9088k4559k3265j7703j2736q915
$$ -322152 -279594 -233816 -195076 -172446 -167246 -176010 -195098 -219657 -242922 -260625 -273361 -282276
56872b82276l563K775P115J0060J4803K1095K6128L0626L8045M8434b7747D2524
$$ -282276 -285839 -283064 -275949 -265889 -251086 -229991 -203863 -173237 -135192 -86758 -27747 42524
56859A28318J05259J21738J25542J08641O8985J5565l3707o5007p8364q1270p7318
$$ 128318 233577 355315 480857 589498 658483 674048 640341 575334 496970 415700 338382
56848C38382o6814n3639m2961l4284k3983j2695l345N680J7972L2078M4576N7855
$$ 338382 271568 217929 174968 140684 116701 104006 100661 106341 124313 156391 200967 258822
56836B58822P7088J01729J27963J56118J84840J99329J78145J15777L0916m9806
$$ 258822 335910 437639 565602 721720 906560 1105889 1284034 1399811 1430727 1380921
56826A380921j09605j43529j53529j46772j32599j16305r8296p9606o3201m9391
$$ 1380921 1271316 1127787 974258 827486 694887 578582 480286 400680 337479 288088
56816B88088l5513k1181q837J538J3124K7143M2025N8134P8310J02556J25540
$$ 288088 252575 231394 222557 224095 237219 264362 306387 364521 442831 545387 670927
56805F70927J38624J31539R6084L5498l1371q2546j09973j19679j18374j08237
$$ 670927 809551 941090 1037174 1072672 1041301 958755 848782 729103 610729 502492
56795E02492r2995p8920o7875n6676m4599l4686k7118j8485q528m90N984J5114
$$ 502492 409497 330577 262702 206026 161427 126741 99623 81138 72610 72120 78104 93218
56783I3218K7408L9086M9768O2457P4124P4343N6804K6300p595l7710n8841o7777
$$ 93218 120626 159712 209480 271937 346061 420404 477208 503508 495913 458203 399362 331585
56771C31585o6989o2947n8471n1598m2604A3377a8445k7904k2551j8633j6893
$$ 331585 264596 201649 143178 91580 48976 13377 -18445 -46349 -68900 -87533 -104426
56760a04426j4188r828p279p589p384n332m232m794l876r07M27q88j157R10J679
$$ -104426 -118614 -128442 -135721 -143310 -150694 -156026 -160258 -165052 -168928 -169835 -169408 -170296 -171453 -170543 -168864
56745a68864l63j708n75r3j867k802j302l43j409j568L72R26j592l633k760j599
$$ -168864 -169227 -170935 -171510 -171603 -173470 -176272 -177574 -177917 -179326 -180894 -180522 -179596 -181188 -184821 -187581 -189180
56729a89180k294k654j135m1o14l88J497K007R2q09Q40J622l50j822o43L09r89
$$ -189180 -191474 -194128 -195263 -195304 -195918 -196306 -194809 -192802 -192710 -193519 -192679 -191057 -191407 -193229 -193872 -193563 -194552
56712a94552j716J73J877J125K30J124J577J29n73J025K053P46J3J822L328K380
$$ -194552 -196268 -196095 -194218 -193093 -192863 -191739 -190162 -190033 -190606 -189581 -187528 -186782 -186769 -184947 -181619 -179239
56696a79239J544K769L348J312l43R57K634J809J44r5k39j489j730J75J447M79
$$ -179239 -177695 -174926 -171578 -170266 -170609 -169652 -167018 -165209 -165065 -165160 -165399 -166888 -168618 -168443 -166996 -166517
56680a66517N7J896K988J215m46P02K364K041J537K692L388K064J327K945M052
$$ -166517 -166460 -164564 -161576 -160361 -160807 -160105 -157741 -155700 -154163 -151471 -148083 -146019 -144692 -141747 -137695
56665a37695K542J347K981M776M001K925M121N465M500L258M047M808L304J593
$$ -137695 -135153 -133806 -130825 -126049 -122048 -119123 -115002 -109537 -105037 -101779 -97732 -92924 -89620 -88027
56651h8027J845K000L2j820j458j133k911m465l770l277m896n702l448j466l004
$$ -88027 -86182 -84182 -84150 -85970 -87428 -88561 -91472 -95937 -99707 -102984 -107880 -113582 -117030 -118496 -121500
56636a21500n344m802l099l306l912k369m53o85j272Q3J240k78k138j304N05N07
$$ -121500 -126844 -131646 -134745 -138051 -141963 -144332 -144785 -145470 -146742 -146659 -145419 -145697 -147835 -149139 -148634 -148127
56620a48127J77J726L236K371J096J730K266N84q16N63K166J148j81R62K181N89
$$ -148127 -147950 -146224 -142988 -140617 -139521 -137791 -135525 -134941 -135757 -135194 -133028 -131880 -132061 -131099 -128918 -128329
56604a28329j226P2K130J247p69l68J025K84j118k84J108K40r06P52L106K570
$$ -128329 -129555 -129483 -127353 -126106 -126875 -127243 -126218 -125934 -127052 -127336 -126228 -125988 -126894 -126142 -123036 -120466
56588a20466P36J157K618K008O90J733L728L557K440L099L965K348L78J539M150
$$ -120466 -119730 -118573 -115955 -113947 -113257 -111524 -107796 -104239 -101799 -98700 -94735 -92387 -92009 -90470 -86320
56573h6320M441L259L593M455L420K338M132O805O843N747O941R174R297g222
$$ -86320 -81879 -78620 -75027 -70572 -67152 -64814 -60682 -53877 -47034 -41287 -34346 -25172 -15875 -7222
56558B961J2138J1210R146R578J1153J0340Q330Q384R163P412M545L884M036J843
$$ 2961 15099 26309 35455 45033 56186 66526 74856 83240 92403 99815 104360 108244 112280 114123
56544A14123j006j185o00k913o150o153m568n790q586q608o816p396r458q790
$$ 114123 113117 111932 111332 108419 102269 96116 91548 85758 77172 68564 61748 54352 44894 36104
56530C6104o150n785p289o731m514A310d307m804k662l055n341n572m046m275
$$ 36104 29954 24169 16880 10149 5635 1310 -4307 -9111 -11773 -14828 -20169 -25741 -29787 -34062
56516c4062n665m610j824j191k385j939l98j069k916k159J96o6k415k663q36m69
$$ -34062 -39727 -44337 -46161 -47352 -49737 -51676 -52074 -53143 -56059 -58218 -58022 -58088 -60503 -63166 -64002 -64471
56500f4471j181L08K839K284m54p10J500J993N42P05K279J762k35J95K534K639
$$ -64471 -65652 -65344 -62505 -60221 -60675 -61385 -59885 -57892 -57350 -56645 -54366 -52604 -52839 -52644 -50110 -47471
56484d7471O71N52K143J782k3O79L364L798K221K721M924M489J661J080L107L460
$$ -47471 -46800 -46248 -44105 -42323 -42346 -41667 -38303 -34505 -32284 -29563 -24639 -20150 -18489 -17409 -14302 -10842
56468a0842J609J442L361g41A466K514M634M937L375L297M335L207J160K373N474
$$ -10842 -9233 -7791 -4430 -741 1466 3980 8614 13551 16926 20223 24558 27765 28925 31298 36772
56453C6772N043J261m12R44J022p38l69K085K224l1j06K408L161J656J744L279
$$ 36772 41815 43076 42664 43608 44630 43892 43523 45608 47832 47801 47695 50103 53264 54920 56664 59943
56437E9943K158r10q96J861J724j880l532k000j806l745l496j012j498n461p274
$$ 59943 62101 61191 60295 62156 63880 62000 58468 56468 54662 50917 47421 46409 44911 39450 32176
56422C2176n310m178n289m696j940j507l673B161k72M98E41a363a33A812G77a276
$$ 32176 26866 22688 17399 12703 10763 9256 5583 2161 1889 2387 541 -1363 -133 1812 777 -1276
56405f73H63a78j746d84B564L68A123m54Q93K80J091M032M412J153m81J477K311
$$ -673 863 -178 -1924 -484 2564 2932 1123 669 1562 1842 2933 6965 11377 12530 12049 13526 15837
56388A5837K12q1L190M956K797J152K313K347l21j433K83j03m379p776q258A016
$$ 15837 16049 15968 19158 24114 26911 28063 30376 32723 32402 30969 31252 31149 26770 18994 10736 1016
56371a1522j0954l813J933K734L487O947b756C059M466P007Q075M628J728K704
$$ -11522 -22476 -26289 -24356 -21622 -18135 -11188 -2756 3059 7525 14532 22607 27235 28963 31667
56357C1667L250P88J5L415N730L680J905L586M505K081R02L437M566J385q61J409
$$ 31667 34917 35705 35720 39135 44865 48545 50450 54036 58541 60622 61524 64961 69527 70912 70051 71460
56341G1460L660K437J721M099N067K264R31L955O017L873K787O203Q835O874N321
$$ 71460 75120 77557 79278 83377 88444 90708 91639 95594 101611 105484 108271 114474 123309 130183 135504
56326A35504Q009J0070P661N679Q207J0619Q853P287R692J1496Q893O580Q550
$$ 135504 143513 153583 161244 166923 175130 185749 194602 201889 211581 223077 231970 238550 247100
56313B47100J0136P126L960M821N504K108r36L72J624j172l579j578L79j712l358
$$ 247100 257236 264362 268322 273143 278647 280755 279819 280191 281815 280643 277064 275486 275865 274153 270795
56298B70795n75K027L96q17K412N221L415J972N219P985N638L531O973J1070J0249
$$ 270795 270220 272247 272643 271826 274238 279459 282874 284846 290065 298050 303688 307219 314192 325262 335511
56283C35511Q800J1994J5677J4836J3819J7828K2698K3222K3245K7448L1720L1724
$$ 335511 344311 356305 371982 386818 400637 418465 441163 464385 487630 515078 546798 578522
56271E78522L2353L8399M4590M5461M6322N3681O3467O9735P6233Q8083J00752
$$ 578522 610875 649274 693864 739325 785647 839328 902795 972530 1048763 1136846 1237598
56260A237598J08901J17662J33290J50805J62863J72675J86042J98756K04285
$$ 1237598 1346499 1464161 1597451 1748256 1911119 2083794 2269836 2468592 2672877
56251B672877K06241K10544K12738K05498J91536J76689J57572J28745R5110O4604
$$ 2672877 2879118 3089662 3302400 3507898 3699434 3876123 4033695 4162440 4257550 4322154
56241D322154L5485L138k7556m9294o4925q0622r3482r8210r8987j02244j04706
$$ 4322154 4357639 4360777 4333221 4283927 4219002 4138380 4044898 3946688 3847701 3745457 3640751
56230C640751j01095r6310r7247j00025r8334r6780j02477j10849j13588j13534
$$ 3640751 3539656 3443346 3346099 3246074 3147740 3050960 2948483 2837634 2724046 2610512
56220B610512j17820j23381j23375j20952j22439j23804j18174j09990j07210
$$ 2610512 2492692 2369311 2245936 2124984 2002545 1878741 1760567 1650577 1543367
56211A543367j06198r8979q8697q3175p9692p1129o0731n5731n2829m5068l6590
$$ 1543367 1437169 1338190 1249493 1166318 1086626 1015497 954766 899035 846206 801138 764548
56200G64548l5219l6836l2680k5711k4124k5047k0716j4490j4390j6880j3449
$$ 764548 729329 692493 659813 634102 609978 584931 564215 549725 535335 518455 505006
56189E05006p293p052r897p473k693l687o996l906K242K337p00K103P765P080
$$ 505006 497713 490661 480764 473291 470598 466911 459915 456009 458251 460588 459888 461991 469756 476836
56175D76836K911M727J0206J0198O960R286J4540J3814R857J1556J5668J2761
$$ 476836 479747 484474 494680 504878 511838 521124 535664 549478 559335 570891 586559 599320
56163E99320O155O016R697P129P58N24M015J417m575l844J019K2l809n9P907Q734
$$ 599320 605475 611491 621188 628317 629075 629599 633614 635031 630456 626612 627631 627653 623844 623785 631692 640426
56147F40426N345R625J9226K2014J9733K4607L5773M1939M4521N5123P2541Q5226
$$ 640426 645771 655396 674622 696636 716369 740976 776749 818688 863209 918332 990873 1076099
56135A076099R4160J10055J29868J39278J36745J32308J25167J06414Q1993O8497
$$ 1076099 1170259 1280314 1410182 1549460 1686205 1818513 1943680 2050094 2132087 2200584
56125B200584O7072O4776N9744O0524O2589N1479K8891J0738n2j3865k9169l3581
$$ 2200584 2267656 2332432 2392176 2452700 2515289 2566768 2595659 2606397 2606345 2592480 2563311 2529730
56113B529730l0083l5746n3500p0381q3637j02205j22273j28711j21965j17093
$$ 2529730 2499647 2463901 2410401 2340020 2256383 2154178 2031905 1903194 1781229 1664136
56103A664136j15370j03783q3327o9857o5422n6561m2521l6970l9986l6900k7005
$$ 1664136 1548766 1444983 1361656 1291799 1226377 1169816 1127295 1090325 1050339 1013439 986434
56092I86434k4767l0479k8778j8657j5431k0436j8676r205p395j4066j3194l519
$$ 986434 961667 931188 902410 883753 868322 847886 829210 820005 812610 798544 785350 781831
56080G81831j237p785o827L041M962k821l141O273Q462J354K244J2969J5183O110
$$ 781831 780594 772809 765982 769023 773985 771164 768023 774296 782758 784112 786356 799325 814508 820618
56066H20618M234J3133J4892O192N126J4944J7182Q443P420J7478J9412R708Q177
$$ 820618 824852 837985 852877 859069 864195 879139 896321 904764 912184 929662 949074 958782 966959
56053I66959J8902K1848J2422J0423K0288K2124J2084J1146K3397K6854J6609
$$ 966959 985861 1007709 1020131 1030554 1050842 1072966 1085050 1096196 1119593 1146447 1163056
56042A163056J4945K7187L0592J9421J7039L0137L5525K6143K4841L8037M2010
$$ 1163056 1178001 1205188 1235780 1255201 1272240 1302377 1337902 1364045 1388886 1426923 1468933
56031A468933L0302K7589M0749M4452L1768K9500M5680N2561M0486L6945N2224
$$ 1468933 1499235 1526824 1567573 1612025 1643793 1673293 1718973 1771534 1812020 1848965 1901189
56020A901189N8884M6382M2514N8303O5828N4078N1465O8887P6815O3852O0394
$$ 1901189 1960073 2006455 2048969 2107272 2173100 2227178 2278643 2347530 2424345 2488197 2548591
56009B548591P8332Q6581P3171P0607R1535J02113Q8583Q5460J07034J17856J03575
$$ 2548591 2626923 2713504 2786675 2857282 2948817 3050930 3139513 3224973 3332007 3449863 3553438
55998C553438J01678J27714J42676J29779J29573J60354J80440J70136J71825
$$ 3553438 3655116 3782830 3925506 4055285 4184858 4345212 4525652 4695788 4867613
55989D867613K05506K26857K15132K17398K56682K84620K76944K83907L31143
$$ 4867613 5073119 5299976 5515108 5732506 5989188 6273808 6550752 6834659 7165802
55980G165802L66843L65639L83871M49472N03019N14713N48013O35807P12132
$$ 7165802 7532645 7898284 8282155 8731627 9234646 9749359 10297372 10933179 11645311
55971A1645311P44032Q05257R35407J060365J143427J271328J491281J719053
$$ 11645311 12389343 13194600 14130007 15190372 16333799 17605127 19096408 20815461
55963B0815461J918607K203796K641382L140917L676317M407738N426620O611967
$$ 20815461 22734068 24937864 27579246 30720163 34396480 38804218 44230838 50842805
55955E0842805P917654R537285J1586327J3958150J6765011K0524946K5562304
$$ 50842805 58760459 68297744 79884071 93842221 110607232 131132178 156694482
55948A56694482L1712792L9026022M7771159N6328203N9502950N1171423L0043980
$$ 156694482 188407274 227433296 275204455 331532658 391035608 442207031 472251011
55941D72251011K193678k3082830l9734091m7278888m8278094m5317608m0271343
$$ 472251011 474444689 451361859 411627768 364348880 316070786 270753178 230481835
55934B30481835l4638215k9377832k4709819k0564398j7036284j4214256j1930204
$$ 230481835 195843620 166465788 141755969 121191571 104155287 89941031 78010827
55927G8010827r977045q357400p109935o103532n198455m429463l856318l393605
$$ 78010827 68033782 59676382 52566447 46462915 41264460 36834997 32978679 29585074
55919B9585074k942805k545577k262376k031229j778477j547850j396351j273105
$$ 29585074 26642269 24096692 21834316 19803087 18024610 16476760 15080409 13807304
55911A3807304j116337r67249q79457q11163p09434o11817n66853n37073m73490
$$ 13807304 12690967 11723718 10844261 10033098 9323664 8711847 8144994 7607921 7134431
55902G134431m08377l85749l73485l28888k82172k73617k73378k41486k05351
$$ 7134431 6726054 6340305 5966820 5637932 5355760 5082143 4808765 4567279 4361928
55893D361928k02728k06957j81316j51323j52712j61055j41232j15884j18647
$$ 4361928 4159200 3952243 3770927 3619604 3466892 3305837 3164605 3048721 2930074
55884B930074j27808j10725q8032r1218j00421q5170o4828o9322q0033o7419m8982
$$ 2930074 2802266 2691541 2603509 2512291 2411870 2326700 2261872 2192550 2112517 2045098 1996116
55873A996116n3480o4312n3493l6810m1524n2632m3615k8682l3485m4584l7602
$$ 1996116 1942636 1878324 1824831 1788021 1746497 1693865 1650250 1621568 1588083 1543499 1505897
55862A505897k5978l3172m5002l7102k2316k4458l1611k1011m399l925p974M705
$$ 1505897 1479919 1446747 1401745 1364643 1342327 1317869 1286258 1265247 1260848 1256923 1248949 1253654
55850A253654K0766J5571j840q750j1258k5684l9784l3917k0414k1838k9697k3716
$$ 1253654 1274420 1289991 1288151 1279401 1268143 1242459 1202675 1168758 1148344 1126506 1096809 1073093
55838A073093j2330j5166k4276k1110j3903k0520l1821k9099k0788k5308l4244
$$ 1073093 1060763 1045597 1021321 1000211 986308 965788 933967 904868 884080 858772 824528
55827H24528k8867j7003j7570k4102j9121r665j3187k2559j9814j1030j3344k0657
$$ 824528 795661 778658 761088 736986 717865 708200 695013 672454 652640 641610 628266 607609
55815F07609j6083n740o655j3309r093P01r9o178j520Q438P341qK517J0521Q080
$$ 607609 591526 585786 579131 565822 556729 557430 557331 551153 549633 558071 565412 565404 567921 578442 586522
55800E86522q66q00M828J336p671q065l928r328j9528j9343j2369j3491j9829
$$ 586522 585656 584856 589684 591020 583349 575284 571356 562028 542500 523157 510788 497297 477468
55787D77468j7421r472r949j5828j3391n545n709j0893p760O98J224l213M49Q541
$$ 477468 460047 450575 440626 424798 411407 405862 400153 389260 381500 382198 383422 380209 380658 389199
55773C89199O436m022q625p272j0903j7119j4295n669m421q865o655Q58K419P2
$$ 389199 395635 391613 382988 375716 364813 347694 333399 327730 323309 314444 307789 308647 311066 311138
55759C11138M312J0809O494n284r759o941q884j4917j3940p926q824j4851j3588
$$ 311138 315450 326259 332753 327469 317710 310769 301885 286968 273028 265102 256278 241427 227839
55746B27839o186m974r471q139j861k282q548q670k672j844o198n032J206J690
$$ 227839 221653 216679 207208 199069 197208 194926 186378 177708 175036 173192 166994 161962 163168 164858
55732A64858l104k253L985M880N46J119N577K969n775q572m451m085q405p767
$$ 164858 161754 159501 163486 168366 168912 170031 175608 178577 172802 164230 159779 155694 147289 139522
55718A39522k381k483p770p400j073M47l555k609M007N668J061M39N640P518M885
$$ 139522 137141 134658 126888 119488 118415 118862 115307 112698 116705 122373 123434 123873 129513 137031 141916
55703A41916O560J2725J3467P899N834Q559O773l24k763J180K213j431j132M071
$$ 141916 148476 161201 174668 182567 188401 196960 203733 203409 200646 201826 204039 202608 201476 205547
55689B05547M887j05j775J481Q07n117p019k945j693n176m816J162L978J237P93
$$ 205547 210434 210329 208554 210035 210842 205725 198706 195761 194068 188892 184076 185238 189216 190453 191246
55674A91246M291L751j926l731M49K015j581k551J139J749k297k758K034L252
$$ 191246 195537 199288 197362 193631 194080 196095 194514 191963 193102 194851 192554 189796 191830 195082
55660A95082j676m151o86J389j007j250K808M125N83q20J782J216m209o829m465
$$ 195082 193406 189255 188569 189958 188951 187701 190509 194634 195217 194397 196179 197395 193186 186357 181892
55645A81892m562r284j1149p843o763j0268j1003o645m745p990r015m930k803
$$ 181892 177330 168046 156897 149054 142291 132023 121020 114375 109630 101640 92625 87695 84892
55632H4892n525o227k073J85k284l009M63J422k501m214r02M76l113m901j682
$$ 84892 79367 73140 71067 71252 68968 65959 66422 67844 65343 61129 60227 60703 57590 52689 51007
55617E1007J31k561l515K16K387q2j395J012J280k573l893l88R27k634l882L74
$$ 51007 51138 48577 45062 45278 47665 47583 46188 47200 48480 45907 42014 41626 42553 39919 36037 36411
55601C6411K911k69k687k55J247j767l462l06J962k20j517J031J778j908l558
$$ 36411 39322 39053 36366 36111 37358 35591 32129 31823 33785 33565 32048 33079 34857 32949 29391
55586B9391J25K581k34k428J9J667j091k709L07K162q64k923M7K550N88l89L580
$$ 29391 29516 32097 31863 29435 29454 31121 30030 27321 27628 29790 28926 26003 26050 28600 29188 28799 32379
55569C2379O820M746K392M393O504M983M365P928J0188O919L145L347L164j222
$$ 32379 39199 43945 46337 50730 57234 62217 66582 74510 84698 91617 94762 98109 101273 100051
55555A00051m929l645j938m296o659m799k488l567m421j887j06k131l303l40J772
$$ 100051 95122 91477 89539 85243 78584 73785 71297 67730 63309 61422 61316 59185 55882 55542 57314
55540E7314o51k429Q37M449L628K142M026N341K393k81J690M207K816J141L193
$$ 57314 56663 54234 55071 59520 63148 65290 69316 74657 77050 76769 78459 82666 85482 86623 89816
55525H9816N184L130P75K039L213O35j624L64K485N27j877j210j977q209j4680
$$ 89816 95000 98130 98905 100944 104157 104792 103168 103532 106017 106544 104667 103457 101480 93271 78591
55510G8591j5386j3493j4254j5133H517A256d812n928l175n94j574k778n61J601
$$ 78591 63205 49712 35458 20325 8517 1256 -4812 -10740 -13915 -14509 -16083 -18861 -19422 -17821
55496a7821q8k081l75J565l08k554j076P39j157l192j149J286m82k964j248J601
$$ -17821 -17909 -19990 -20365 -18800 -19108 -21662 -22738 -21999 -23156 -26348 -27497 -26211 -26693 -29657 -30905 -29304
55480b9304O73j421j70J782J06k394j311O85n84k127L65L495K033j394j440K20
$$ -29304 -28631 -30052 -30222 -28440 -28334 -30728 -32039 -31354 -31938 -34065 -33700 -30205 -28172 -29566 -31006 -30786
55464c0786p55k311l55K510J621q28k55J369j89k652j480J284J104l20J041L051
$$ -30786 -31541 -33852 -34207 -31697 -30076 -30904 -31159 -29790 -29979 -32631 -34111 -32827 -31723 -32043 -31002 -27951
55448b7951J458j520j216P66J97j321K7K115P60j930j441O14L4j612m04J867J282
$$ -27951 -26493 -28013 -29229 -28463 -28266 -29587 -29560 -27445 -26685 -28615 -30056 -29442 -29408 -31020 -31424 -29557 -28275
55431b8275k56J104L119J561j315p60J573J111q30j14J773Q30j262m37J522M04
$$ -28275 -28531 -27427 -24308 -22747 -24062 -24822 -23249 -22138 -22968 -23082 -21309 -20479 -21741 -22178 -20656 -20252
55415b0252j987j240J037M02j709r17J506J417J64J641M001K800k69l43J701J641
$$ -20252 -22239 -23479 -22442 -22040 -23749 -24666 -23160 -21743 -21579 -19938 -15937 -13137 -13406 -13749 -12048 -10407
55399a0407L37J308K720N52k968k815m09o86k617j623J035N09k101j782O93L36
$$ -10407 -10070 -8762 -6042 -5490 -8458 -11273 -11682 -12368 -14985 -16608 -15573 -15064 -17165 -18947 -18254 -17918
55383a7918k379k541k01K40j175n50J480Q05j676j310J336J358j262j804L12J061
$$ -17918 -20297 -22838 -23039 -22799 -23974 -24524 -23044 -22239 -23915 -25225 -23889 -22531 -23793 -25597 -25285 -24224
55367b4224r1K44J998J652n49r65K44m08k555k585p97p65k304k195r13j441k570
$$ -24224 -24315 -24071 -22073 -20421 -20970 -21935 -21691 -22099 -24654 -27239 -28036 -28801 -31105 -33300 -34213 -35654 -38224
55350c8224q40K158K014j81K68K766K576j22p09J011Q26j391j546M62N33j556
$$ -38224 -39064 -36906 -34892 -35073 -34805 -32039 -29463 -29585 -30294 -29283 -28457 -29848 -31394 -30932 -30399 -31955
55334c1955j843l9K04j093j55K769L338J150K91J500J330n75q26P10O18j087r91
$$ -31955 -33798 -33837 -33633 -34726 -34881 -32112 -28774 -27624 -27333 -25833 -24503 -25078 -25904 -25194 -24576 -25663 -26654
55317b6654O56K18j897j593R63J411n68q18J102J145j131j589N04J134o78j295
$$ -26654 -25998 -25780 -27677 -29270 -28307 -26896 -27464 -28282 -27180 -26035 -27166 -28755 -28251 -27117 -27795 -29090
55301b9090K27N65r48r80R65J387l37p63P74J007n09m35J557J838j17o13J114
$$ -29090 -28863 -28298 -29246 -30226 -29261 -27874 -28211 -28974 -28200 -27193 -27702 -28137 -26580 -24742 -24859 -25472 -24358
55284b4358J478n30j627o94l99j277p36J094J025p88p42J185J154j071j463N73
$$ -24358 -22880 -23410 -25037 -25731 -26130 -27407 -28143 -27049 -26024 -26812 -27554 -26369 -25215 -26286 -27749 -27176
55268b7176J119n58o34J640K332M21k58J474J926k25j427j16P02k92m12J078J249
$$ -27176 -26057 -26615 -27249 -25609 -23277 -22856 -23114 -21640 -19714 -19939 -21366 -21482 -20780 -21072 -21484 -20406 -19157
55251a9157m14o47J084J310o26j133N83R37p91p98J675K294m29k277j059k00j747
$$ -19157 -19571 -20218 -19134 -17824 -18450 -19583 -19000 -18063 -18854 -19652 -17977 -15683 -16112 -18389 -19448 -19648 -21395
55234b1395k611q65N99q6m18R34J299l49r04Q54J621j41j180L81J644O14m06J12
$$ -21395 -24006 -24871 -24272 -24358 -24776 -23842 -22543 -22892 -23796 -22942 -21321 -21462 -22642 -22261 -20617 -20003 -20409 -20297
55216b0297J03j181j071J025J701j52r93P42J617l02j796n62Q24K30k23R78J463
$$ -20297 -20194 -21375 -22446 -21421 -19720 -19872 -20865 -20123 -18506 -18808 -20604 -21166 -20342 -20112 -20335 -19357 -17894
55199a7894k23j546q24j77q00m37J705K660J072k79Q5k04j946k005O98K455J109
$$ -17894 -18117 -19663 -20487 -20664 -21464 -21901 -20196 -17536 -16464 -16743 -16658 -16862 -18808 -20813 -20115 -17660 -16551
55182a6551l14N48J336P0j076l70J68p49q63Q68J691K61o59M33R02o58j525k79
$$ -16551 -16865 -16317 -14981 -14911 -15987 -16357 -16189 -16938 -17801 -16933 -15242 -14981 -15640 -15207 -14305 -14963 -16488 -16767
55164a6767L48j025j536J31P31j345k604p40J201N72l74N06J124k3m00J341K014
$$ -16767 -16419 -17444 -18980 -18849 -18118 -19463 -22067 -22807 -21606 -21034 -21408 -20902 -19778 -19801 -20201 -18860 -16846
55147a6846j91j833l75J155j9j281L8J409R6j472l38J431P51r79j239j135k227
$$ -16846 -17037 -18870 -19245 -18090 -18109 -19390 -19352 -17943 -17847 -19319 -19657 -18226 -17475 -18454 -19693 -20828 -23055
55130b3055k478q1K382K079O78Q31J517J023Q18K294L290J905K67N43R65l24j287
$$ -23055 -25533 -25614 -23232 -21153 -20475 -19644 -18127 -17104 -16286 -13992 -10702 -8797 -8530 -7987 -7022 -7346 -8633
55113h633J43J849J216m97j099j240j759j120J053J908K55o59J200K769J403m12
$$ -8633 -8490 -6641 -5425 -5922 -7021 -8261 -10020 -11140 -10087 -8179 -7924 -8583 -7383 -4614 -3211 -3623
55097c623N9Q15n30j900q10Q98Q98P85a236A488O26I28n5J459M75o95Q86K877
$$ -3623 -3564 -2749 -3279 -5179 -5989 -5091 -4193 -3408 -1236 1488 2114 928 873 2332 2807 2112 2998 5875
55079E875J863m37o29K54l70j156K35J910R87q79n52Q92P00k36K24P13p90k226
$$ 5875 7738 7301 6672 6926 6556 5400 5635 7545 8532 7653 7101 7993 8693 8457 8681 9394 8604 6378
55061F378p78J745K020R54J169J616j1k100j776l19p02j997j469J4j74j321j149
$$ 6378 5600 7345 9365 10319 11488 13104 13093 10993 9217 8898 8196 6199 4730 4744 4570 3249 2100
55044B100n20B27a904n00f10I67j09j39J063R24j49j7O86J20n30Q21K625K039
$$ 2100 1580 227 -1904 -2404 -610 967 858 719 1782 2706 2557 2540 3226 3346 2816 3637 6262 8301
55026H301K0n51Q9j13o05K58J300O27l69M10J444L51j288p14Q21N04p37l16Q30
$$ 8301 8321 7770 7859 7746 7141 7399 8699 9326 8957 9367 10811 11162 9874 9160 9981 10485 9748 9432 10262
55007A0262L14p29Q5J267j7k315k210l90N5n21L29J668P75j212r58J031J488L77
$$ 10262 10576 9847 9932 11199 11182 8867 6657 6267 6322 5801 6130 7798 8573 7361 6403 7434 8922 9299
54989I299L49J281P76q19j089l20n93j168J17J974J433o14q11O95R96J07N31J997
$$ 9299 9648 10929 11705 10886 9797 9477 8884 7716 7833 9807 11240 10626 9815 10510 11506 11613 12144 14141
54971A4141J940O76P98K025J816N28Q17K407K563J393J560L079L450K664L140
$$ 14141 16081 16757 17555 19580 21396 21924 22741 25148 27711 29104 30664 33743 37193 39857 42997
54956D2997M855N422M821N368P142Q065Q213R587J1940J3260J3838J5295J6289
$$ 42997 47852 53274 58095 63463 70605 78670 86883 96470 108410 121670 135508 150803 167092
54943A67092J3879Q627L762l6m373q665j0850j1761j3764j5759j4733j1522r746
$$ 167092 180971 189598 193360 193324 188951 180286 169436 157675 143911 128152 113419 101897 92151
54930I2151r622q351o083n721o942o255l263j331j576j568m81k54j054o51J023
$$ 92151 82529 74178 68095 62374 55432 49177 45914 44583 43007 41439 40958 40704 39650 38999 40022
54915D0022J617J100J889L906M461L567M240O974Q943R350J0600J3295J4975J4734
$$ 40022 41639 42739 44628 48534 52995 56562 60802 67776 76719 86069 96669 109964 124939 139673
54901A39673J4373J4040J1396O124Q94l050o969j0767j2510j2396j2789j3783
$$ 139673 154046 168086 179482 185606 186500 183450 176481 165714 153204 140808 128019 114236
54889A14236j3147j1047j0101j0326q919n657l638l824l796k700k511l412k943
$$ 114236 101089 90042 79941 69615 60696 55039 51401 47577 43781 41081 38570 35158 32215
54876C2215r26l01j758k385j007j34j082j777j079p20j420j325OL72q56j415m85
$$ 32215 31289 30988 29230 26845 25838 25704 24622 22845 21766 21046 19626 18301 18307 18679 17823 16408 15923
54859A5923j57j101j049P83J961J178L90Q70J045r9j146j289j654k295j507N74
$$ 15923 15766 14665 13616 14399 16360 17538 17928 18798 19843 19744 18598 17309 15655 13360 11853 12427
54843A2427J395K64n31Q5M02l71p33k74n94j653j241Q11J854R50K44P11O79k60
$$ 12427 13822 14086 13555 13640 14042 13671 12938 12664 12070 10417 9176 9987 11841 12791 13035 13746 14425 14165
54825A4165j35J386J983R72M28R22M34j254j571N3R26J28J64J946K822J592Q54
$$ 14165 14030 15416 17399 18371 18799 19721 20155 18901 17330 17383 18309 18437 18601 20547 23369 24961 25815
54808B5815K148L209K363J515K317L410L701M541O371P180O491O952R716J2171
$$ 25815 27963 31172 33535 35050 37367 40777 44478 49019 55390 62570 69061 76013 85729 97900
54794I7900J2571J2906J4772J6226J5411J3573J1924R133M491J29k472m854q115
$$ 97900 110471 123377 138149 154375 169786 183359 195283 204416 208907 209036 206564 201710 193595
54781A93595j0545j0997j1174j2149j2115j0029q042p768p505n732m026l865l733
$$ 193595 183050 172053 160879 148730 136615 126586 118544 110776 103271 97539 93513 89648 85915
54768H5915k135m35j14%J219K547L000L624M999N687N215N681Q230J0914J2088
$$ 85915 83780 83345 83231 83231 84450 86997 89997 93621 98620 104307 109522 115203 123433 134347 146435
54753A46435J2927J4566J5871J6048J6304J6863J5633J1839P703M561O89m870
$$ 146435 159362 173928 189799 205847 222151 239014 254647 266486 274189 278750 279439 274569
54741B74569r923j2770j4762j6962j7835j6688j5735j6192j5834j3043r804q050
$$ 274569 264646 251876 237114 220152 202317 185629 169894 153702 137868 124825 115021 106971
54729A06971o547m171k764l761n196n025m231m028l271j426o63k024k904j409
$$ 106971 100424 96253 93489 89728 84532 79507 75276 71248 67977 66551 65888 63864 60960 59551
54715E9551K30l39j574j300n95r92j000R21K852K518J206J103J436O70j18M56
$$ 59551 59781 59442 57868 56568 55973 54981 53981 54902 57754 60272 61478 62581 64017 64687 64569 65025
54699F5025R85r2j237n75N49J51p16k31O97M55J9Q47J812J460R87J748K226O95
$$ 65025 66010 65918 64681 64106 64655 64806 64090 63859 64556 65011 65030 65877 67689 69149 70136 71884 74110 74805
54681G4805j337j626q42n75j60J299K187J108l5R18K647K954K675L493M315L566
$$ 74805 73468 71842 71000 70425 70265 71564 73751 74859 74824 75742 78389 81343 84018 87511 91826 95392
54665I5392K737L839N495N395M547N236O682O705N903O227P043O405M882M402
$$ 95392 98129 101968 107463 112858 117405 122641 129323 136028 141931 148158 155201 161606 166488 170890
54651A70890M710M415M113N022O059N769N509P204R507R816Q601Q005P590N271
$$ 170890 175600 180015 184128 189150 195209 200978 206487 213691 223198 233014 241615 249620 257210 262481
54637B62481J317k259n246q693j1846j3094j2997j3214j3423j2450j1170j1043
$$ 262481 263798 261539 256293 247600 235754 222660 209663 196449 183026 170576 159406 148363
54625A48363j0970q935n771l970l817l700l294l340l348k457j534j624j595j45
$$ 148363 137393 128458 122687 118717 114900 111200 107906 104566 101218 98761 97227 95603 94008 93863
54611I3863J433J401R05J994L905M570M322M691M998L661J532N48K89p46j878
$$ 93863 95296 96697 97602 99596 103501 108071 112393 117084 122082 125743 127275 127823 128112 127366 125488
54596A25488j692j357k835n030n405m362m234m982m674l418l031l446l137k442
$$ 125488 123796 122439 119604 114574 109169 104807 100573 95591 90917 87499 84468 81022 77885 75443
54582G5443k926l936l366j471n74j236j880j906k101k412k129j823k356k719j557
$$ 75443 72517 68581 65215 63744 63170 61934 60054 58148 56047 53635 51506 49683 47327 44608 43051
54567D3051Q6L49k04R6O80o1j300q76Q98J740J106L51l1m59m44M35Q29l55j453
$$ 43051 43137 43486 43282 43378 44058 43997 42697 41821 42719 44459 45565 45916 45885 45426 44982 45417 46246 45891 44438
54548D4438n60R87Q56j73J74J471J767J568K690M303M254L245L680N201N501M796
$$ 44438 43878 44865 45721 45548 45722 47193 48960 50528 53218 57521 61775 65020 68700 73901 79402 84198
54532H4198N291O729O687M914L385K342K51k531l977m096m689n694n496m513m620
$$ 84198 89489 96218 102905 107819 111204 113546 113797 111266 107289 103193 98504 92810 87314 82801 78181
54517G8181n323m494k588k156l299l624k656k274k691k110n55q7r05j004lM07
$$ 78181 72858 68364 65776 63620 60321 56697 54041 51767 49076 46966 46411 46324 45419 44415 44412 44819
54501D4819M2M94J617J513K48j21N55M01n38j92J416J863P16K64J284J900J330
$$ 44819 44861 45355 46972 48485 48733 48612 49167 49568 49030 48838 50254 52117 52833 53097 54381 56281 57611
54484E7611J051J473J157J02K05J609K139J209P46J441J554L16p65q86r68j041
$$ 57611 58662 60135 61292 61394 61599 63208 65347 66556 67302 68743 70297 70613 69848 68962 67994 66953
54468F6953O2J732J656k89j513q73k9o3n0K50k85j309r46O63J157O2m51K72J43
$$ 66953 67015 68747 70403 70114 68601 67728 67699 67636 67586 67836 67551 66242 65296 65959 67116 67178 66727 66999 67142
54449F7142j577k611j589k86l80j032j131j130j281p87J45j8j400k206j731j194
$$ 67142 65565 62954 61365 61079 60699 59667 58536 57406 56125 55338 55483 55465 54065 51859 50128 48934
54433D8934j015j46J255J495L80l92l53p00j251l54J607K201J163R41K182K520
$$ 48934 47919 47773 49028 50523 50903 50511 50158 49458 48207 47853 49460 51661 52824 53765 55947 58467
54417E8467R66k54K90J081R58J071J997K266J378J046J877K125J191J027K444
$$ 58467 59433 59179 59469 60550 61508 62579 64576 66842 68220 69266 71143 73268 74459 75486 77930
54402G7930L404K784K461L731M897M516L953M573N240M787M328N035N990O122
$$ 77930 81334 84118 86579 90310 95207 99723 103676 108249 113489 118276 122604 127639 133629 139751
54388A39751N999N978N002K774P72k46j375l003l836l669m175n700o269n198m475
$$ 139751 145750 151728 156730 159504 160276 160030 158655 155652 151816 148147 143972 138272 132003 126805 122330
54373A22330n035m971l322k200l087m164l671k884l274l513k000J45J117J221
$$ 122330 117295 112324 109002 106802 103715 99551 95880 92996 89722 86209 84209 84354 85471 86692
54359H6692J336P94q25j913j108L94Q22L39j36n65p02M80K695L816L052K314K970
$$ 86692 88028 88822 87997 86084 84976 85370 86192 86531 86395 85830 85128 85608 88303 92119 95171 97485 100455
54342A00455L741L559L701N149O413O150N545N887O140N120L857L513L079J335
$$ 100455 104196 107755 111456 116605 123018 129168 134713 140600 146740 151860 155717 159230 162309 163644
54328A63644p73j919k678l998n163n227m758m579m442m366n227o687o774n060
$$ 163644 162871 160952 158274 154276 149113 143886 139128 134549 130107 125741 120514 113827 107053 101993
54314A01993l785m325n094m591l850m017m105l333k998l905m426l329k095k207
$$ 101993 98208 93883 88789 84198 80348 76331 72226 68893 65895 61990 57564 54235 52140 49933
54300D9933k555j859j206j786k395j669n88m56m85K50O70j15p61q7N79r2q89m00
$$ 49933 47378 45519 44313 42527 40132 38463 37875 37419 36934 37184 37854 37739 36978 36891 37470 37378 36489 36089
54282C6089L46L7l50L12Q90K69k16O79J444M61q63n73M03L05q9O76J505P25m41
$$ 36089 36435 36472 36122 36434 37324 37593 37377 38056 39500 39961 39098 38525 38928 39233 39144 39820 41325 42050 41609
54263D1609J55J666J678M13J31J202J908J513P59j5p83p42M48J313O37l45o7N36
$$ 41609 41764 43430 45108 45521 45652 46854 48762 50275 51034 51019 50236 49494 49942 51255 51892 51547 51480 52016
54245E2016j36j190o47J088J932J360M85k60j018j094O1J313J422J042J182J004
$$ 52016 51880 50690 50043 51131 53063 54423 54908 54648 53630 52536 52597 53910 55332 56374 57556 58560
54229E8560n55k362k686k003j834k049j656j060j177j399p57J12K88N04J546K184
$$ 58560 58005 55643 52957 50954 49120 47071 45415 44355 43178 41779 41022 41134 41422 41926 43472 45656
54213D5656J153k95k49P90J230J269J818J993N29j521k211j772j679j827j245
$$ 45656 46809 46514 46265 47055 48285 49554 51372 53365 53894 52373 50162 48390 46711 44884 43639
54198D3639m29l52l04O90J565R43j94k36J13n54j268l90R47M83j187j540l61L83
$$ 43639 43210 42858 42554 43244 44809 45752 45558 45322 45435 44881 43613 43223 44170 44653 43466 41926 41565 41948
54180D1948J86K39N60L0r50q85l8n5r88j357q60n18m36N6N14N1o45l11M69L24
$$ 41948 42134 42373 42933 42963 42013 41128 41090 41035 40047 38690 37830 37312 36876 36932 37446 37497 36852 36541 37010 37334
54160C7334k57Q2Q07M15o42p66k06m01j051o85L90O24J36K48P33M16j12N81J685
$$ 37334 37077 37159 37966 38381 37739 36973 36767 36366 35315 34630 35020 35644 35780 36028 36761 37177 37065 37646 39331
54141C9331J163n50j047N0P60L41J10N85P89N22N86O49l35j590j205N63J449P38
$$ 39331 40494 39944 38897 38947 39707 40048 40158 40743 41532 42054 42640 43289 42954 41364 40159 40722 42171 42909
54123D2909k9m6j84p37q67n85q51j473j286n08n20j219j075P8O80J06o13p85o76
$$ 42909 42880 42834 42650 41913 41046 40461 39610 38137 36851 36343 35823 34604 33529 33607 34287 34393 33780 32995 32319
54104C2319k36O40R17k45j381n07J467J849L63o87k73L00L13O25J356J360M86
$$ 32319 32083 32723 33640 33395 32014 31507 32974 34823 35186 34499 34226 34526 34839 35464 36820 38180 38666
54087C8666r4j38n98j410j395n34r0l29l84l14r14j600r71N98J379J135J050J091
$$ 38666 38572 38434 37836 36426 35031 34497 34407 34078 33694 33380 32466 30866 29895 30493 31872 33007 34057 35148
54069C5148K29r54p97L88O86K4J72J276J486M27j32N36J128J008J001J100K82
$$ 35148 35377 34423 33626 34014 34700 34724 34896 36172 37658 38085 37953 38489 39617 40625 41626 42726 43008
54052D3008r23o08J206K339K003J686K009J809R93J144K441K980K188J919L086
$$ 43008 42085 41477 42683 45022 47025 48711 50720 52529 53522 54666 57107 60087 62275 64194 67280
54037F7280M061L726L327L948M708M816N081O033O677O409O160O620P226P640
$$ 67280 71341 75067 78394 82342 87050 91866 96947 102980 109657 116066 122226 128846 136072 143712
54023A43712Q290Q792P960O003M519L885K938J608J203J629J094o66j722j349
$$ 143712 152002 160794 168754 174757 179276 183161 186099 187707 188910 190539 191633 190967 189245 187896
54009A87896j266k445l512l509l517m195m361l431k818l437m085l770l362l576
$$ 187896 186630 184185 180673 177164 173647 169452 165091 161660 158842 155405 151320 147550 144188 140612
53995A40612l524k622j912k093k284j880j648j856j490m28j80j275k081j489n98
$$ 140612 137088 134466 132554 130461 128177 126297 124649 122793 121303 120875 120695 119420 117339 115850 115252
53980A15252m59l53L22N90k16j048j008p22o24J91K072L638L837L390L076K397
$$ 115252 114793 114440 114762 115352 115136 114088 113080 112358 111734 111925 113997 117635 121472 124862 127938 130335
53964A30335J108K42M16Q13Q02P90P28k34j726k023q76k01r48j674j367j175j932
$$ 130335 131443 131685 132101 132914 133716 134506 135234 135000 133274 131251 130375 130174 129226 127552 126185 125010 123078
53947A23078k354j327J81J081J965L402M441M371M148M607N021M781M537M465
$$ 123078 120724 119397 119578 120659 122624 126026 130467 134838 138986 143593 148614 153395 157932 162397
53933A62397L430J225n35j040j653l191m205l555k486k294k114r32K33K19q9N96
$$ 162397 165827 167052 166517 165477 163824 160633 156428 152873 150387 148093 145979 145047 145280 145499 145410 146006
53917A46006J751K419L141M626O009O230N790N541N266M831N128O347P015O325
$$ 146006 147757 150176 153317 157943 163952 170182 175972 181513 186779 191610 196738 203085 210100 216425
53903B16425N589N853N959M729L155K550K246J152j18o48j140k386l335k802j764
$$ 216425 222014 227867 233826 238555 241710 244260 246506 247658 247540 246892 245752 243366 240031 237229 235465
53888B35465j920l120m078m567n152n734o028o417p018p020o188n635n904n942
$$ 235465 233545 230425 226347 221780 216628 210894 204866 198449 191431 184411 178223 172588 166684 160742
53874A60742n140m598m974n032l924k894k935k868j761j131k411m131m138l063
$$ 160742 155602 151004 146030 140998 137074 134180 131245 128377 126616 125485 123074 118943 114805 111742
53860A11742k908l593l493k439j618j265p64l66p69j609k169k734l621l830k467
$$ 111742 108834 105241 101748 99309 97691 96426 95662 95296 94527 92918 90749 88015 84394 80564 78097
53845G8097n33M19M73M86K31p52j591j233k67J41J55M86Q07O12N07R67J089K85
$$ 78097 77564 77983 78456 78942 79173 78421 76830 75597 75330 75471 75626 76112 76919 77531 78038 79005 80094 80379
53827H0379j73P74J808J220k42p20k21M0J15P80J433R89R3J46P69N28l87n28K23
$$ 80379 80206 80980 82788 84008 83766 83046 82825 82865 82980 83760 85193 86182 86275 86421 87190 87718 87331 86803 87026
53808H7026O64N74R20J906K679K889K885K608J815J206J789L345M777N544N682
$$ 87026 87690 88264 89184 91090 93769 96658 99543 102151 103966 105172 106961 110306 115083 120627 126309
53793A26309N114M068L555M140M983N118M773M401L688K657K404L288L831K903
$$ 126309 131423 135491 139046 143186 148169 153287 158060 162461 166149 168806 171210 174498 178329 181232
53779A81232J578J219J227N32k14J7M42k33j529k248k634l393l787k922j791j786
$$ 181232 182810 184029 185256 185788 185574 185591 186033 185800 184271 182023 179389 175996 172209 169287 167496 165710
53763A65710k275j849r55q58j091l90P38Q85M34P82J678J798J395J833K959L368
$$ 165710 163435 161586 160631 159773 158682 158292 159030 159915 160349 161131 162809 164607 166002 167835 170794 174162
53747A74162K912K524K108R32k85k55L14m02k203l082k582k353l265m312m688
$$ 174162 177074 179598 181706 182638 182353 182098 182412 182010 179807 176725 174143 171790 168525 164213 159525
53732A59525m754m674m040l149k843k919k416j418q73p53j80O99Q40K94K40R73
$$ 159525 154771 150097 146057 142908 140065 137146 134730 133312 132439 131686 131506 132205 133045 133339 133579 134552
53716A34552J586J712J923K438K874L224L678L787L179K685L211M032L878L172
$$ 134552 136138 137850 139773 142211 145085 148309 151987 155774 158953 161638 164849 168881 172759 175931
53702A75931L359M468N256N416N781O591P359Q118R100R571Q743P487P243P749
$$ 175931 179290 183758 189014 194430 200211 206802 214161 222279 231379 240950 249693 257180 264423 272172
53688B72172P642O818O249N924N039L893L441L362K552J350J094J719J851J202
$$ 272172 279814 286632 292881 298805 303844 307737 311178 314540 317092 318442 319536 321255 323106 324308
53674C24308Q22J072J253J167J250J315R17O76J369K201J809N68j49m09j233k264
$$ 324308 325130 326202 327455 328622 329872 331187 332104 332780 334149 336350 338159 338727 338578 338169 336936 334672
53658C34672k372k104k958m433m536l193k413k859k899j649m42n29j432k278k927
$$ 334672 332300 330196 327238 322805 318269 315076 312663 309804 306905 305256 304814 304285 302853 300575 297648
53643B97648l210k808k242k375k790k334j306j103j713j655n34L27J88k36m11
$$ 297648 294438 291630 289388 287013 284223 281889 280583 279480 277767 276112 275578 275905 276093 275857 275446
53628B75446o70r29n83J21L18K24Q21J885K267K070K523L684M344M284M475M990
$$ 275446 274776 273847 273264 273385 273703 273927 274748 276633 278900 280970 283493 287177 291521 295805 300280 305270
53612C05270M879M264M337N127N454N364O241Q213R707J0058J0283J0803J0658
$$ 305270 310149 314413 318750 323877 329331 334695 340936 349149 358856 368914 379197 390000 400658
53599D00658R612Q850Q909Q888Q365Q180Q687R095R131R498J0197J0233R443Q886
$$ 400658 410270 419120 428029 436917 445282 453462 462149 471244 480375 489873 500070 510303 519746 528632
53585E28632R018R232R402R959J0345R441P819P371Q364R038Q397P245O122M592
$$ 528632 537650 546882 556284 566243 576588 586029 593848 601219 609583 618621 627018 634263 640385 644977
53571F44977L030K719L510L679K630J619J264P38j5J94J365J742O57m34o21r07
$$ 644977 648007 650726 654236 657915 660545 662164 663428 664166 664151 664345 665710 667452 668109 667675 667054 666147
53555F66147j962k906l276m017n346n900n061m134m100m305m302m784n680n577
$$ 666147 664185 661279 658003 653986 648640 642740 637679 633545 629445 625140 620838 616054 610374 604797
53541F04797m243l441l940m065k586q48l76m29K76J235J342R54J109J926L037
$$ 604797 600554 597113 593173 589108 586522 585674 585298 584869 585145 586380 587722 588676 589785 591711 594748
53526E94748M382N534N652N122N620P678R806J0949J1978J3692J5353J6435J7883
$$ 594748 599130 604664 610316 615438 621058 628736 638542 649491 661469 675161 690514 706949 724832
53513G24832K0266K2471K3625K4596K6141K7350K7455K7540K8858L0868L2521
$$ 724832 745098 767569 791194 815790 841931 869281 896736 924276 953134 984002 1016523
53502A016523L4075L6145L8235L9707M0992M2622M4215M5507M7104M9149N0614
$$ 1016523 1050598 1086743 1124978 1164685 1205677 1248299 1292514 1338021 1385125 1434274 1484888
53491A484888N0979N1167N1717N1725N0716M9920N0391N1385N1903N2364N3473
$$ 1484888 1535867 1587034 1638751 1690476 1741192 1791112 1841503 1892888 1944791 1997155 2050628
53480B050628N4942N6578N9008O2034O3824O3199O1144N8718N5185M9864M4248
$$ 2050628 2105570 2162148 2221156 2283190 2347014 2410213 2471357 2530075 2585260 2635124 2679372
53469B679372M0337L8018L5749L2865K9725K6626K3956K2518K2494K3056K3861
$$ 2679372 2719709 2757727 2793476 2826341 2856066 2882692 2906648 2929166 2951660 2974716 2998577
53458B998577K5532K7678K8125K5398K0546J5194R480L261k363o530j0224j4739
$$ 2998577 3024109 3051787 3079912 3105310 3125856 3141050 3150530 3153791 3151428 3144898 3134674 3119935
53446C119935j9771k4476k9126l4099l8521m1560m3878m6331m8457m9760n1152
$$ 3119935 3100164 3075688 3046562 3012463 2973942 2932382 2888504 2842173 2793716 2743956 2692804
53435B692804n3523n6076n7729n8924o0378o1299o0603n8798n7029n5277n3192
$$ 2692804 2639281 2583205 2525476 2466552 2406174 2344875 2284272 2225474 2168445 2113168 2059976
53424B059976n1529n0977n0544m8783m5805m2498l8781l4235k9458k5124k0577
$$ 2059976 2008447 1957470 1906926 1858143 1812338 1769840 1731059 1696824 1667366 1642242 1621665
53413A621665j4986r099m179r9M029Q131J1716J5347J9907K4957K9290L2601L5405
$$ 1621665 1606679 1597580 1593401 1593302 1597331 1605462 1617178 1632525 1652432 1677389 1706679 1739280 1774685
53400A774685L7890M0001M2043M4206M6207M8149N0755N4005N6863N9159O2217
$$ 1774685 1812575 1852576 1894619 1938825 1985032 2033181 2083936 2137941 2194804 2253963 2316180
53389B316180O6670P1335P5408P9905Q5558R1165R5702J00284J06101J12124J16836
$$ 2316180 2382850 2454185 2529593 2609498 2695056 2786221 2881923 2982207 3088308 3200432 3317268
53378C317268J20696J24774J28495J30799J32208J33581J34261J33586J32729
$$ 3317268 3437964 3562738 3691233 3822032 3954240 4087821 4222082 4355668 4488397
53369D488397J32692J31820J27916J21535J14666J07421R8985R0794Q5626Q3760
$$ 4488397 4621089 4752909 4880825 5002360 5117026 5224447 5323432 5414226 5499852 5583612
53359E583612Q2811Q1079P8444P4489O8451O1095N3963M6747L7792K7183J6615
$$ 5583612 5666423 5747502 5825946 5900435 5968886 6029981 6083944 6130691 6168483 6195666 6212281
53348F212281N868q113k7694n1824p7203j00429j18780j30875j37528j40898j42428
$$ 6212281 6218149 6210036 6182342 6130518 6053315 5952886 5834106 5703231 5565703 5424805 5282377
53337E282377j42544j41877j41285j40633j39121j36858j34829j33379j32064
$$ 5282377 5139833 4997956 4856671 4716038 4576917 4440059 4305230 4171851 4039787
53328D039787j30891j30274j29816j28498j26092j23125j19630j15152j09789
$$ 4039787 3908896 3778622 3648806 3520308 3394216 3271091 3151461 3036309 2926520
53319B926520j04060r7939r1088q3779p6478o9045o1560n5200n0879m7536m3293
$$ 2926520 2822460 2724521 2633433 2549654 2473176 2404131 2342571 2287371 2236492 2188956 2145663
53308B145663l7860l2349k7250k2145j7071j2600q828n659l585k818k260q31P67
$$ 2145663 2107803 2075454 2048204 2026059 2008988 1996388 1987560 1981901 1978316 1975498 1973238 1972407 1973174
53295A973174J263J145J905L488M498M707N419P361J0041J3256J7543K2845K8249
$$ 1973174 1974437 1975582 1977487 1980975 1985473 1990180 1995599 2002960 2013001 2026257 2043800 2066645 2094894
53282B094894L3226L7969M2458M6369M9798N2967N5395N6514N6839N7427N8450
$$ 2094894 2128120 2166089 2208547 2254916 2304714 2357681 2413076 2469590 2526429 2583856 2642306
53271B642306N9375O0073O0609O0540N9558N8232N6986N5135N2199M9263M7636
$$ 2642306 2701681 2761754 2822363 2882903 2942461 3000693 3057679 3112814 3165013 3214276 3261912
53260C261912M6996M6320M5543M4597M1948L6172K8281K0514J3492O478n17p123
$$ 3261912 3308908 3355228 3400771 3445368 3487316 3523488 3551769 3572283 3585775 3592253 3591736 3584613
53248C584613j4365k3558l3845m3154n1141n8923o6250p1487p4357p6286p7934
$$ 3584613 3570248 3546690 3512845 3469691 3418550 3359627 3293377 3221890 3147533 3071247 2993313
53237B993313p8616p8255p7698p6882p4830p1626o8495o5823o3079o0698n9928
$$ 2993313 2914697 2836442 2758744 2681862 2607032 2535406 2466911 2401088 2338009 2277311 2217383
53226B217383o0630o1348o1712o2761o4627o6016o6288o6075o5428o3417n9873
$$ 2217383 2156753 2095405 2033693 1970932 1906305 1840289 1774001 1707926 1642498 1579081 1519208
53215A519208n5772n1533m6792m1986l8304l5799l3425l1167l0082l0073k9711
$$ 1519208 1463436 1411903 1365111 1323125 1284821 1249022 1215597 1184430 1154348 1124275 1094564
53204A094564k8661k8139k8574k8827k8258k7499k6721k5199k3217k2229k2366
$$ 1094564 1065903 1037764 1009190 980363 952105 924606 897885 872686 849469 827240 804874
53193H04874k1890k0057j8570j8990k0508k1493k1663k1498k0906j9774j8800
$$ 804874 782984 762927 744357 725367 704859 683366 661703 640205 619299 599525 580725
53182E80725j8654j9001j9034j8348j6943j5188j4015j4107j4757j4587j3370
$$ 580725 562071 543070 524036 505688 488745 473557 459542 445435 430678 416091 402721
53171D02721j1994j0795r400q118p799q143p849o707n879n894n986n712n573n617
$$ 402721 390727 379932 370532 362414 354615 346472 338623 331916 326037 320143 314157 308445 302872 297255
53157B97255n129m124l599l844l961l473k906k618k451k656l586m367l742k242
$$ 297255 292126 288002 284403 280559 276598 273125 270219 267601 265150 262494 258908 254541 250799 248557
53143B48557j591j851j367J51Q69r5j175q99J40R01J559K351K578J985J648K300
$$ 248557 246966 245115 243748 243899 244768 244673 243498 242599 242739 243640 245199 247550 250128 252113 253761 256061
53127B56061L171L544M067N401O828P316O963O363N562M327K661M58k324m849
$$ 256061 259232 262776 266843 272244 279072 286388 293351 299714 305276 309603 312264 312722 310398 305549
53113C05549n920n621n191n152m904m409m494n173n340m703m268m394m168l322
$$ 305549 299629 294008 288817 283665 278761 274352 269858 264685 259345 254642 250374 245980 241812 238490
53099B38490k963l639m391m511m661n340n872n750n430n122m334l244k845l044
$$ 238490 235527 231888 227497 222986 218325 212985 207113 201363 195933 190811 186477 183233 180388 177344
53085A77344k493j061m78j580k810k667j784j358j259j061j258j993k081q62M06
$$ 177344 174851 173790 173312 171732 168922 166255 164471 163113 161854 160793 159535 157542 155461 154599 155005
53070A55005L93k46j98K93R8q03j457j419j000n69m54q54j258p94M01J178J152
$$ 155005 155398 155152 154954 155247 155345 154542 153085 151666 150666 150097 149643 148789 147531 146737 147138 148316 149468
53053A49468J198J744K013J595J245J398J379Q62N38N88J22r98j443n81L09O5
$$ 149468 150666 152410 154423 156018 157263 158661 160040 160902 161440 162028 162150 161152 159709 159128 159437 159502
53037A59502o47q19p25q45o60J92Q62O31P1k14o68j613k282k108j620j226n53
$$ 159502 158855 158036 157311 156466 155806 155998 156860 157491 157562 157348 156680 155067 152785 150677 149057 147831 147278
53020A47278P8n95k463l379k207o96p00j412j146k65j93q64j180j081j215j355
$$ 147278 147356 146761 144298 140919 138712 138016 137316 135904 134758 134493 134300 133436 132256 131175 129960 128605
53004A28605r52m62n34o16Q5J013J111N44K64M71P40R83J239J261J180J635K447
$$ 128605 127653 127191 126657 126041 126126 127139 128250 128794 129058 129529 130269 131252 132491 133752 134932 136567 139014
52987A39014K518J882K216M151N781N469M413M635N940O859P228P701P852O877
$$ 139014 141532 143414 145630 149781 155562 161031 165444 170079 176019 182878 190106 197807 205659 212536
52973B12536N368M412L645K170N03k78n56j368k323k364j964k431l506l705k826
$$ 212536 217904 222316 225961 228131 228634 228356 227800 226432 224109 221745 219781 217350 213844 210139 207313
52958B07313k128k119k107j882k107k833l208k850k278j807j214m69P2K47M6o52
$$ 207313 205185 203066 200959 199077 196970 194137 190929 188079 185801 183994 182780 182311 182383 182630 182676 182024
52942A82024j619k038j538q80p85q74o13m85j023j632j526j051q21m65N28J480
$$ 182024 180405 178367 176829 175949 175164 174290 173677 173192 172169 170537 169011 167960 167139 166674 167202 168682
52926A68682J518J086J074J175N69m12q19p23r00j365j566j486j376r50o3N20
$$ 168682 170200 171286 172360 173535 174104 173692 172873 172150 171250 169885 168319 166833 165457 164507 164444 164964
52910A64964J57m98o48p04j244j566p98M12R14Q79J067J147M70k36J18R98J056
$$ 164964 165121 164623 163975 163271 162027 160461 159663 160075 160989 161868 162935 164082 164552 164316 164434 165432 166488
52893A66488L98K13O53Q93R05J298J746J368N02K82P11Q16M80M68P39M67k86n63
$$ 166488 166886 167099 167752 168645 169550 170848 172594 173962 174464 174746 175457 176273 176753 177221 177960 178427 178141 177578
52875A77578k37j84o23o56K80J678K721K948K271J237R77J935L123L441L133K997
$$ 177578 177341 177157 176534 175878 176158 177836 180557 183505 185776 187013 187990 189925 193048 196489 199622 202619
52859B02619L092L253L946N218N909N289M486M633M792L592J842J284J627J191
$$ 202619 205711 208964 212910 218128 224037 229326 233812 238445 243237 246829 248671 249955 251582 252773
52845B52773q6q28r10j519k579k672j641r84j302j540j203j237k167l154l564
$$ 252773 252687 251859 250949 249430 246851 244179 242538 241554 240252 238712 237509 236272 234105 230951 227387
52830B27387l847m350m658m599m606m729m495l893l440l150k674k310k558k904
$$ 227387 223540 219190 214532 209933 205327 200598 196103 192210 188770 185620 182946 180636 178078 175174
52816A75174k439j543j380j899j983j436j167j353j206o24m79r54j223j030j062
$$ 175174 172735 171192 169812 167913 165930 164494 163327 161974 160768 160144 159665 158711 157488 156458 155396
52801A55396j580k000k053k081k030j540r96j187j857j997j490j108r84o22k35
$$ 155396 153816 151816 149763 147682 145652 144112 143116 141929 140072 138075 136585 135477 134493 133871 133636
52786A33636n83j439j790j523j418j560j326q26p49q95n24J5l17j317j781j518
$$ 133636 133053 131614 129824 128301 126883 125323 123997 123171 122422 121527 121003 121018 120701 119384 117603 116085
52770A16085j333j246o64j45q02j975j814l47L75n30j627j730j327r57l38J71
$$ 116085 114752 113506 112842 112697 111895 109920 108106 107759 108134 107604 105977 104247 102920 101963 101625 101796
52754A01796n50k262l152k526j737j712j618r27o11j149j291j54J142J263N81
$$ 101796 101246 98984 95832 93306 91569 89857 88239 87312 86701 85552 84261 84107 85249 86512 87093
52739H7093P5k62p82j156j104r31o13L71J565J464j88j609j496p21m24j05R73
$$ 87093 87168 86906 86124 84968 83864 82933 82320 82691 84256 85720 85532 83923 82427 81706 81282 81177 82150
52722H2150J974J778R27P20J181J408J275J371J796K194K555L011L283L132K945
$$ 82150 84124 85902 86829 87549 88730 90138 91413 92784 94580 96774 99329 102340 105623 108755 111700
52707A11700L120L378L258K832K309J597P01K0k61m56p98j163j572k214k845l053
$$ 111700 114820 118198 121456 124288 126597 128194 128895 128915 128654 128198 127400 126237 124665 122451 119606 116553
52691A16553l163l795m508m143k773j866k136k653k612k502k797k852k043q69
$$ 116553 113390 109595 105087 100944 98171 96305 94169 91516 88904 86402 83605 80753 78710 77841
52677G7841j25R9r0q92k049k660k329j681j180n70N8j09j138j713q40P20J517
$$ 77841 77716 77815 77725 76833 74784 72124 69795 68114 66934 66364 66422 66313 65175 63462 62622 63342 64859
52660F4859J086o4j234j731j200k54N2k22QR05J215L47m36J27J445K066J594O52
$$ 64859 65945 65881 64647 62916 61716 61462 61514 61292 61300 62205 63420 63767 63331 63458 64903 66969 68563 69215
52642F9215k57r50j225j079p10p6R19J626J109k98j091o06K87Q55J409K017J831
$$ 69215 68958 68008 66783 65704 64994 64918 65837 67463 68572 68274 67183 66577 66864 67719 69128 71145 72976
52625G2976N80n98q27p74j292j922j841j310r88o69K00J262J598R80M8n09m79
$$ 72976 73556 72958 72131 71357 70065 68143 66302 64992 64004 63335 63535 64797 66395 67375 67423 66914 66435
52608F6435j48O6K31R94K374L014J844O7j64J089J664O77k61J67J115J361J119
$$ 66435 66287 66353 66584 67578 69952 72966 74810 74877 74713 75802 77466 78143 77882 78049 79164 80525 81644
52591H1644J000Q23N84R94J961K067P96k78K18J420J823J583J671J951J712J228
$$ 81644 82644 83467 84051 85045 87006 89073 89869 89591 89809 91229 93052 94635 96306 98257 99969 101197
52575A01197J239J530J388R23Q06J167J695K231K546K174J148K02l00p21j055
$$ 101197 102436 103966 105354 106277 107083 108250 109945 112176 114722 116896 118044 118246 117946 117225 116170
52560A16170o50M10J028Q79R99J834K200J233p8m36J3O27J510K558K672J409J61
$$ 116170 115520 115930 116958 117837 118836 120670 122870 124103 124025 123589 123602 124229 125739 128297 130969 132378 132539
52543A32539K23Q20N79k09l53J95O34Q64J171J135L20n86o62k40k39o77j027j287
$$ 132539 132762 133582 134161 133952 133599 133794 134428 135292 136463 137598 137918 137332 136670 136430 136191 135514 134487 133200
52525A33200j600j491o71J72M32N89J109J287N09l54j50P63J281J310J426J535
$$ 133200 131600 130109 129438 129610 130042 130631 131740 133027 133536 133182 133032 133795 135076 136386 137812 139347
52509A39347J212P52O26M97m3m23L3Q67J215J036O39k03j478k225j714n94K08
$$ 139347 140559 141311 141937 142434 142391 141968 142001 142868 144083 145119 145758 145555 144077 141852 140138 139544 139752
52492A39752P83J418J648J271J155J724J940J206Q84K191L885L993K841K256K679
$$ 139752 140535 141953 143601 144872 146027 147751 149691 150897 151781 153972 157857 161850 164691 166947 169626
52477A69626L189L674M748N897N817M524L273K557J829R42K49n69k083l704m249
$$ 169626 172815 176489 181237 187134 192951 197475 200748 203305 205134 206076 206325 205756 203673 199969 195720
52462A95720l789l471l660l726l478l377l472l395l271l439l547l138k644k596
$$ 195720 191931 188460 184800 181074 177596 174219 170747 167352 164081 160642 157095 153957 151313 148717
52448A48717k419j405k56j93j005j510j505j633j777j285m52k08n17n87m30o73
$$ 148717 146298 144893 144637 144444 143439 141929 140424 138791 137014 135729 135277 135069 134552 133965 133535 132862
52432A32862j111r80l90oL69J312K265K117J039J42l51r70j401q59J66L89r7O
$$ 132862 131751 130771 130381 130375 130744 132056 134321 136438 137477 137619 137268 136298 134897 134038 134204 134593 134496 134502
52414A34502Q78J278P15J35J63K71K8l22p25j325j516m49J292K132J776J586K325
$$ 134502 135380 136658 137373 137508 137671 137942 137970 137648 136923 135598 134082 133633 134925 137057 138833 140419 142744
52397A42744L110L043K454K013J742J503J478J720J971K135K244K079J644J620
$$ 142744 145854 148897 151351 153364 155106 156609 158087 159807 161778 163913 166157 168236 169880 171500
52383A71500K393L088K706J802J623K011J845J231J432K579L237K571J364N48
$$ 171500 173893 176981 179687 181489 183112 185123 186968 188199 189631 192210 195447 198018 199382 199930
52369A99930J87K08P75J501J596J135J041J575K055K196K534L198L539L267K935
$$ 199930 200117 200325 201100 202601 204197 205332 206373 207948 210003 212199 214733 217931 221470 224737 227672
52354B27672K906K925K843K909L144L301L456L738L689K837J743J432K004K776
$$ 227672 230578 233503 236346 239255 242399 245700 249156 252894 256583 259420 261163 262595 264599 267375
52340B67375L458M046M053L150K189K206K860L169L284L862M323L613K352K231
$$ 267375 270833 274879 278932 282082 284271 286477 289337 292506 295790 299652 303975 307588 309940 312171
52326C12171L382M374M682N154N973O310O236O877Q239Q919Q455Q006Q164Q045
$$ 312171 315553 319927 324609 329763 335736 342046 348282 355159 363398 372317 380772 388778 396942 404987
52312D04987P249O840P500Q269Q065P077N998N187N099O206P986R273R947J0925
$$ 404987 412236 419076 426576 434845 442910 449987 455985 461172 466271 472477 480463 489736 499683 510608
52298E10608J2192J2639J2146J2068J3038J4089J4570J5165J6264J7098J7434
$$ 510608 522800 535439 547585 559653 572691 586780 601350 616515 632779 649877 667311
52287F67311J8382K0417K2194K2443K1754K1368K1386K1283K0993K0560J9658
$$ 667311 685693 706110 728304 750747 772501 793869 815255 836538 857531 878091 897749
52276H97749J8290J7014J5817J3991J1703J0274J0086R614P614N003L426K937
$$ 897749 916039 933053 948870 962861 974564 984838 994924 1004538 1012152 1017155 1020581 1023518
52264A023518K329R18r05k455l227l222l189l904n002n386m964m727m955m787
$$ 1023518 1025847 1026765 1025860 1023405 1020178 1016956 1013767 1009863 1004861 999475 994511 989784 984829 980042
52250I80042l946l320l197k475n80J418K452L073M301O088P852R523J1123J2309
$$ 980042 976096 972776 969579 967104 966524 967942 970394 973467 977768 983856 991708 1001231 1012354 1024663
52236A024663J3148J4346J5933J6858J6629J6218J6400J6436J5455J4033J3241
$$ 1024663 1037811 1052157 1068090 1084948 1101577 1117795 1134195 1150631 1166086 1180119 1193360
52225A193360J3022J2594J1708J0519Q971P133N544M351K940J018p03j718k677
$$ 1193360 1206382 1218976 1230684 1241203 1250174 1257307 1262851 1267202 1270142 1271160 1270457 1268739 1266062
52212A266062m377o566q428r547r842r352q638q542r074r358r062q748q564p900
$$ 1266062 1261685 1255119 1246691 1237144 1227302 1217950 1209312 1200770 1191696 1182338 1173276 1164528 1155964 1148064
52198A148064o837o447o982p277o743o401o899p117o067m741m557n103n017m229
$$ 1148064 1141227 1134780 1127798 1120521 1113778 1107377 1100478 1093361 1087294 1082553 1077996 1072893 1067876 1063647
52184A063647l762l959m258m343m233l748k842k130k126k434k471k399k534k517
$$ 1063647 1059885 1055926 1051668 1047325 1043092 1039344 1036502 1034372 1032246 1029812 1027341 1024942 1022408 1019891
52170A019891j935j204r67j158j389j697k173k420k075j396q54p23j345k878m488
$$ 1019891 1017956 1016752 1015785 1014627 1013238 1011541 1009368 1006948 1004873 1003477 1002623 1001900 1000555 997677 993189
52155I93189m807l720k611k394k539k584l101m330n270n229m978n308n665n383
$$ 993189 988382 984662 982051 979657 977118 974534 971433 967103 961833 956604 951626 946318 940653 935270
52141I35270n035n274n539n293n350o437p524p228o057n516n679n391m503m091
$$ 935270 930235 924961 919422 914129 908779 902342 894818 887590 881533 876017 870338 864947 860444 856353
52127H56353m547n069n131n119n392n639n512n039m360l600k963k496j939j152
$$ 856353 851806 846737 841606 836487 831095 825456 819944 814905 810545 806945 803982 801486 799547 798395
52113G98395l63L27J143K020K474K466K688L501M423N088N927P306Q876J0327
$$ 798395 798032 798359 799502 801522 803996 806462 809150 812651 817074 822162 828089 835395 844271 854598
52099H54598J1901J3633J5078J6331J8155K0565K2367K2922K3093K3681K4165
$$ 854598 866499 880132 895210 911541 929696 950261 972628 995550 1018643 1042324 1066489
52088A066489K3971K3704K4020K4439K4352K4135K4077K3384K1454J9183J7668
$$ 1066489 1090460 1114164 1138184 1162623 1186975 1211110 1235187 1258571 1280025 1299208 1316876
52077A316876J6572J4948J2782J0591Q402O243M668L680K217j73k346l453m460
$$ 1316876 1333448 1348396 1361178 1371769 1380171 1386414 1391082 1394762 1396979 1396806 1394460 1391007 1386547
52064A386547o334q143q671q707r724j1266j1708j0920j0114r610q698p377o286
$$ 1386547 1380213 1372070 1363399 1354692 1344968 1333702 1321994 1311074 1300960 1291350 1282652 1275275 1268989
52051A268989n213l447j420l03p4M13J646L141M766O854R067J0563J1197J1396
$$ 1268989 1263776 1260329 1258909 1258606 1258532 1258945 1260591 1263732 1268498 1275352 1284419 1294982 1306179 1317575
52037A317575J1084J0045Q982Q846R299R208Q353P493O925O375N946N896N704
$$ 1317575 1328659 1338704 1347686 1356532 1365831 1375039 1383392 1390885 1397810 1404185 1410131 1416027 1421731
52024A421731M692L246K239J513K86j355k681l712m964o178o798p401r123j1805
$$ 1421731 1426423 1429669 1431908 1433421 1433707 1432352 1429671 1425959 1420995 1414817 1408019 1400618 1391495 1379690
52010A379690j4181j5762j7132j8459j9178j9191j9121j9370k0036k1472k3691
$$ 1379690 1365509 1349747 1332615 1314156 1294978 1275787 1256666 1237296 1217260 1195788 1172097
51999A172097k5563k5952k5448k5539k6363k6767k6394k6128k6398k6650k6578
$$ 1172097 1146534 1120582 1095134 1069595 1043232 1016465 990071 963943 937545 910895 884317
51988H84317k6512k6450k5994k5284k4833k4393k3255k1638k0510k0029j9435
$$ 884317 857805 831355 805361 780077 755244 730851 707596 685958 665448 645419 625984
51977F25984j8434j7423j6479j5355j4381j3991j3590j2329j0875j0749j1825
$$ 625984 607550 590127 573648 558293 543912 529921 516331 504002 493127 482378 470553
51966D70553j2270j1121r379q136p217o231n571n586n828n757n419n018m600m314
$$ 470553 458283 447162 437783 429647 422430 416199 410628 405042 399214 393457 388038 383020 378420 374106
51952C74106m250l996l152k196j881k031j939j777k301l327l883l877m195n023
$$ 374106 369856 365860 362708 360512 358631 356600 354661 352884 350583 347256 343373 339496 335301 330278
51938C30278n441m964m185l638l245l108l617m482m787m306l736l340k589j366
$$ 330278 324837 319873 315688 312050 308805 305697 302080 297598 292811 288505 284769 281429 278840 277474
51924B77474l88j13j58j48k16l95m54m65p23r89p51k37j90o46r57j037j457k205
$$ 277474 277086 276973 276815 276667 276451 276056 275602 275137 274414 273425 272674 272437 272247 271601 270644 269607 268150 265945
51906B65945k497j999j260p74m89l20k93k18j4k08j099j809j372m28m90j603k267
$$ 265945 263448 261449 260189 259415 258926 258606 258313 258095 258081 257873 256774 254965 253593 253165 252675 251072 248805
51889B48805j717q60o69r76j239j331j195p26j75P4J80M77O46J79n99j006j190
$$ 248805 247088 246228 245559 244583 243344 242013 240818 240092 239917 239991 240171 240648 241294 241473 240874 239868 238678
51872B38678j644j994j567p83n63o39m7J063J676J744K090K711K872K692K843
$$ 238678 237034 235040 233473 232690 232127 231488 231441 232504 234180 235924 238014 240725 243597 246289 249132
51857B49132K956K186J162J272K164K152J168Q35J387J116m88j637j249o49j089
$$ 249132 252088 254274 255436 256708 258872 261024 262192 263027 264414 265530 265042 263405 262156 261507 260418
51842B60418j663j131rN64N75N08L57K94R69K165K514J552O86J095K074K433K180
$$ 260418 258755 257624 257615 258179 258754 259262 259619 259913 260882 263047 265561 267113 267799 268894 270968 273401 275581
51825B75581J828J288N68L15P18R42N59J98J28m27j661k399j954j277j218j110
$$ 275581 277409 278697 279265 279580 280298 281240 281799 281997 282125 281698 280037 277638 275684 274407 273189 272079
51809B72079k88M90M42K00M42M03p61k157k325j296j40O69J199J151M43p6L09
$$ 272079 271791 272281 272723 272923 273365 273768 273007 270850 268525 267229 267089 267758 268957 270108 270551 270475 270784
51792B70784R54Q89L11J7O6Q6K22O50Q22K85l79m38k44n68j289j684j513j024
$$ 270784 271738 272627 272938 272955 273021 273107 273329 273979 274801 275086 274707 274269 274025 273457 272168 270484 268971 267947
51774B67947l72K23L44O1M7M83P64P41J216K401L202K934K607L323M460M669L734
$$ 267947 267575 267798 268142 268203 268250 268733 269497 270238 271454 273855 277057 279991 282598 285921 290381 295050 298784
51757B98784K223J94k332m392m965m441m038m149m328m398m522m454l781k598
$$ 298784 301007 301201 298869 294477 289512 285071 281033 276884 272556 268158 263636 259182 255401 252803
51743B52803j304j00P74R08M20J14L41N56M84P22J411J504L50j054j427r28m60
$$ 252803 251499 251399 252173 253081 253501 253615 253956 254512 254996 255718 257129 258633 258983 257929 256502 255574 255114
51726B55114k12K4j0m25n21P7M58k34j347j738j407q63J66J913L232K737Q15r52
$$ 255114 254902 254926 254916 254491 253970 254047 254505 254271 252924 251186 249779 248916 249082 250995 254227 256964 257779 256827
51708B56827k038l136m395m951m247k726j213m46r20k306l367l277k610k227j980
$$ 256827 254789 251653 247258 242307 238060 235334 234121 233675 232755 230449 227082 223805 221195 218968 216988
51693B16988j392q62q59o72O47K589L894M519N456O850P865Q366R264J0894J2254
$$ 216988 215596 214734 213875 213203 213850 216439 220333 224852 230308 237158 245023 253389 262653 273547 285801
51678B85801J2260J0802Q370N381K117j085l768n280n232m268l831m520n389n476
$$ 285801 298061 308863 317233 322614 324731 323646 319878 314598 309366 305098 301267 296747 291358 285882
51664B85882n157n162n149m396l228k426j793n80J001J923J825J105j13j973m031
$$ 285882 280725 275563 270414 266018 262790 260364 258571 257991 258992 260915 262740 263845 263732 261759 257728
51649B57728n524o458p305p852p403o113m980m447l975l109k089j342j004j072
$$ 257728 252204 245746 238441 230589 223186 217073 212093 207646 203671 200562 198473 197131 196127 195055
51635A95055j338j258m86M84P96K43o42j249j265o86L4K20j52k96K93J092J394
$$ 195055 193717 192459 191973 192457 193253 193496 192854 191605 190340 189654 189688 189908 189756 189460 189753 190845 192239
51618A92239J241R57M69k10n57k78J66M76J081K053K371J389K11L93J792K921
$$ 192239 193480 194437 194906 194696 194139 193861 194027 194503 195584 197637 200008 201397 201608 202001 203793 206714
51602B06714K985K544K510L366M970O359O361N126M323M974O060O257N966O319
$$ 206714 209699 212243 214753 218119 223089 229448 235809 240935 245258 250232 256292 262549 268515 274834
51588B74834P152P534P505P644P487O103L910K295J603R30k40j555k707l565l633
$$ 274834 281986 289520 297025 304669 312156 318259 322169 324464 326067 326997 326757 325202 322495 318930 315297
51573C15297k624j348q05p36k56N52J112J849L594N732O669O203N809O452P522
$$ 315297 312673 311325 310520 309784 309528 310080 311192 313041 316635 322367 329036 335239 341048 347500 355022
51558C55022Q111Q095P716P175O757O403N280K889K82j016j008q85r95o89n3q1
$$ 355022 363133 371228 378944 386119 392876 399279 404559 407448 407730 406714 405706 404821 403826 403137 403084 403003
51542D03003r87j742j678j286j242j686k619l971n232n967o563p509q222p826
$$ 403003 402016 400274 398596 397310 396068 394382 391763 387792 382560 376593 370030 362521 354299 346473
51528C46473o739o070n767m877l448k516k221j663p76o50j643k698k979k785k502
$$ 346473 339734 333664 327897 323020 319572 317056 314835 313172 312396 311746 310103 307405 304426 301641 299139
51513B99139k006j523j770k747l557l744l759l784l370k478j741j403j111r06
$$ 299139 297133 295610 293840 291093 287536 283792 280033 276249 272879 270401 268660 267257 266146 265240
51499B65240j187j605j308m21M8n2J55Q15R76L83oK56L51j76n11q1M62M93M27
$$ 265240 264053 262448 261140 260719 260767 260715 260870 261685 262661 263044 263038 263294 263645 263469 262958 262877 263339 263832 264259
51480B64259P12J016J199J988L728N515O452O840P389Q063Q473Q613Q524P982
$$ 264259 264971 265987 267186 269174 272902 278417 284869 291709 299098 307161 315634 324247 332771 340753
51466C40753P097O508O405O104N141L959L082K350J514P98L83N5k88m62o47j339
$$ 340753 347850 354358 360763 366867 372008 375967 379049 381399 382913 383711 384094 384149 383861 383399 382752 381413
51450C81413k413l221l802m970o795q178q481q405q674q909q594q108p949p787
$$ 381413 379000 375779 371977 367007 360212 352034 343553 335148 326474 317565 308971 300863 292914 285127
51436B85127p129o171n200l907k106n62j73o85r28j19J512L098L787L368K587
$$ 285127 277998 271827 266627 262720 260614 260052 259879 259194 258266 258147 259659 262757 266544 269912 272499
51421B72499K505L397M599N412N590N043L818K363J088l98k737n539p580q324
$$ 272499 275004 278401 283000 288412 294002 299045 302863 305226 306314 305916 303179 297640 290060 281736
51407B81736q251p742o768n775n625o220o468n933n419n431n267m320l212k869
$$ 281736 273485 265743 258975 253200 247575 241355 234887 228954 223535 218104 212837 208517 205305 202436
51393B02436l294l890m326m536m422m057l660l228k730k586l092l517k915j731
$$ 202436 199142 195252 190926 186390 181968 177911 174251 171023 168293 165707 162615 159098 156183 154452
51379A54452j324j814j905j055k35j42j96K6k4n06n45J68M91l75j496j709j395
$$ 154452 153128 151314 149409 148354 148119 147977 147781 147807 147783 147277 146732 146900 147391 147016 145520 143811 142416
51362A42416j555k089k192j697r67j91L99L07m10p73j68P85J343J724K287K580
$$ 142416 140861 138772 136580 134883 133916 133725 134124 134431 134021 133248 133080 133865 135208 136932 139219 141799
51346A41799K159J613J748K390K930L416M183M982N364N502N821O253O497O589
$$ 141799 143958 145571 147319 149709 152639 156055 160238 165220 170584 176086 181907 188160 194657 201246
51332B01246O631O400N748M827L602J818j76j494k026k753m227n724o538p077
$$ 201246 207877 214277 220025 224852 228454 230272 230096 228602 226576 223823 219596 213872 207334 200257
51318B00257p890q524q243p101n611m099l008k932l620l866l085k121j849j970
$$ 200257 192367 183843 175600 168499 162888 158789 155781 152849 149229 145363 142278 140157 138308 136338
51304A36338j971k112k504k352j210p7m5o43o73k8M36K50l67r93j049j29J034
$$ 136338 134367 132255 129751 127399 126189 126112 126067 125424 124751 124723 125159 125409 125042 124049 123000 122871 123905
51287A23905R57m22j156J3J661J738N60K2O75J401J568J652J833J562P61J43J19
$$ 123905 124862 124440 123284 123297 124958 126696 127256 127278 127953 129354 130922 132574 134407 135969 136730 136873 136992
51270A36992K90J67l54j167j942k146j695j280j449j753j495q37m15m37p95j508
$$ 136992 137282 137449 137095 135928 133986 131840 130145 128865 127416 125663 124168 123331 122916 122479 121684 120176
51254A20176k254k219j260n43r94j811j629m97M23O21M69J94k19m39k16p3m62
$$ 120176 117922 115703 114443 113900 112906 111095 109466 108969 109392 110013 110482 110676 110457 110018 109802 109729 109267
51237A09267p12O2J360J897J468R75P84M27j72l88rM49O39P25P72O26M55N66P54
$$ 109267 108555 108617 109977 111874 113342 114317 115101 115528 115356 114968 114959 115408 116047 116772 117544 118170 118625 119191 119945
51218A19945N02o6k71J60P85J079Q26Q4p09q25p2Q08J140J255J787K504K695K381
$$ 119945 120447 120381 120110 120270 121055 122134 122960 123044 122335 121510 121438 122246 123386 124641 126428 128932 131627 134008
51200A34008K149K085J768J194Q59R93J302J471J325P91J40qO02J463K007K224
$$ 134008 136157 138242 140010 141204 142063 143056 144358 145829 147154 147945 148085 148077 148679 150142 152149 154373
51184A54373K207J721Q08J19M2R2k74r67j839l048m125l915k243o92n51j098j009
$$ 154373 156580 158301 159109 159228 159270 159362 159088 158121 156282 153234 149109 145194 142951 142259 141708 140610 139601
51167A39601m43l69p29q60q55j045q62K00J170Q95Q9L15J372J683R38M42Q06J225
$$ 139601 139158 138789 138060 137200 136345 135300 134438 134638 135808 136703 136792 137107 138479 140162 141100 141542 142348 143573
51149A43573J239J351J608J221N3r68j406j831k412k357j380n46q84k024k858
$$ 143573 144812 146163 147771 148992 149045 148077 146671 144840 142428 140071 138691 138145 137261 135237 132379
51134A32379k860k317j714j325j114r29r10j361j921j597j35J280J591J261J149
$$ 132379 129519 127202 125488 124163 123049 122120 121210 119849 117928 116331 116196 117476 119067 120328 121477
51119A21477R58J36n74j65O70M22p85j400q72o0N83J349J835J215J26K95J760
$$ 121477 122435 122571 121997 121832 122502 122924 122139 120739 119867 119807 120390 121739 123574 124789 124915 125210 126970
51102A26970K469J282l67o81K26J196J796K175K175J680J106Q09N83K17r4j99
$$ 126970 129439 130721 130354 129673 129899 131095 132891 135066 137241 138921 140027 140836 141419 141636 141542 141343
51086A41343j18L69J373K087J452j66j164p88P2N31Q59J525K264K645K698K554
$$ 141343 141225 141594 142967 145054 146506 146340 145176 144388 144460 144991 145850 147375 149639 152284 154982 157536
51070A57536K348K610L753N006N126M263L783L962L519J951N61L71N33m3q47q94
$$ 157536 159884 162494 166247 171253 176379 180642 184425 188387 191906 193857 194418 194789 195322 195279 194432 193538
51054A93538n30p37j402j645j318r94q06l67L18P46O01np87j346j237m63L58N72
$$ 193538 193008 192271 190869 189224 187906 186912 186106 185739 186057 186803 187404 187399 186612 185266 184029 183566 183924 184496
51036A84496N1r71k049k458j580K17J678J924J221L64r5Q6Q32J517J416O21m9
$$ 184496 184547 183576 181527 179069 177489 177706 179384 181308 182529 182893 182798 182884 183716 185233 186649 187270 187221
51019A87221k03k34m40o04n85n72n07o8O15J013J088J288J511J149L37J23R86
$$ 187221 187018 186784 186344 185740 185155 184583 184076 184008 184623 185636 186724 188012 189523 190672 191009 191132 192118
51002A92118K217L132L850M516M770M561M470M730M787M443M414N115N863N987
$$ 192118 194335 197467 201317 205833 210603 215164 219634 224364 229151 233594 238008 243123 248986 254973
50988B54973N898O348P328Q333R154R764J0081J0324J1021J2246J3524J4772J6554
$$ 254973 260871 267219 274547 282880 292034 301798 311879 322203 333224 345470 358994 373766 390320
50975C90320J8984K1269K2903K4516K6999L0467L4515L8761M2784M6311M9820
$$ 390320 409304 430573 453476 477992 504991 535458 569973 608734 651518 697829 747649
50964G47649N4149N9117O3559O6992P0180P3546P6281P7666P8035P7602P5521
$$ 747649 801798 860915 924474 991466 1061646 1135192 1211473 1289139 1367174 1444776 1520297
50953A520297P1131O5085N8235N0416M1409L2169K3840J6305Q910J955l738q250
$$ 1520297 1591428 1656513 1714748 1765164 1806573 1838742 1862582 1878887 1887797 1889752 1886014 1877764
50941A877764j2243j5576j7439j7632j6710j5028j2670j0214q743q988j1000j4399
$$ 1877764 1865521 1849945 1832506 1814874 1798164 1783136 1770466 1760252 1751509 1742521 1731521 1717122
50929A717122j8425k2189k5532k9320l4272l9874m5149m9895n4413n8408o1132
$$ 1717122 1698697 1676508 1650976 1621656 1587384 1547510 1502361 1452466 1398053 1339645 1278513
50918A278513o2402o2622o1894n9913n6679n2735m8694m4955m1709l8738l5458
$$ 1278513 1216111 1153489 1091595 1031682 975003 922268 873574 828619 786910 748172 712714
50907G12714l1640k7898k4876k2314j9498j6377j3613j1616j0111q632p001n229
$$ 712714 681074 653176 628300 605986 586488 570111 556498 544882 534771 526139 519138 513909
50895E13909l401j654j10J223K377L324L950M027L283J848M31k42j10M64J328
$$ 513909 510508 508854 508744 509967 512344 515668 519618 523645 526928 528776 529207 528965 528855 529319 530647
50880E30647K395L212L524L987N369P201Q268Q383Q486R043R681J0494J2159J4416
$$ 530647 533042 536254 539778 543765 549134 556335 564603 572986 581472 590515 600196 610690 622849 637265
50866F37265J5948J6406J7064J8816K0924K2644K4643K7755L1644L5767M0551
$$ 637265 653213 669619 686683 705499 726423 749067 773710 801465 833109 868876 909427
50855I09427M6376N2585N8679O5501P3900Q3185R2360J01871J12699J24338J35305
$$ 909427 955803 1008388 1067067 1132568 1206468 1289653 1382013 1483884 1596583 1720921 1856226
50844A856226J45042J53902J61751J68068J73018J76859J78412J75537J67068
$$ 1856226 2001268 2155170 2316921 2484989 2658007 2834866 3013278 3188815 3355883
50835C355883J53312J34960J12870Q8647O4097M0055J6821m502k2347l6270m6889
$$ 3355883 3509195 3644155 3757025 3845672 3909769 3949824 3966645 3962143 3939796 3903526 3856637
50824C856637n4239n7451n6177n1170m3284l3077k1796j1698m903k491m766j1479
$$ 3856637 3802398 3744947 3688770 3637600 3594316 3561239 3539443 3527745 3522842 3520351 3515585 3504106
50812C504106k1533l3332m5904n9234p3327q7534j00984j13070j23279j30928
$$ 3504106 3482573 3449241 3403337 3344103 3270776 3183242 3082258 2969188 2845909 2714981
50802B714981j35388j36301j33633j27745j19332j09088r7537q5360p3321o1496
$$ 2714981 2579593 2443292 2309659 2181914 2062582 1953494 1855957 1770597 1697276 1635780
50792A635780m9110l5760k2221r407K988J5896K9298M2212N3975O4561P3716Q0733
$$ 1635780 1586670 1550910 1528689 1519282 1522270 1538166 1567464 1609676 1663651 1728212 1801928 1882661
50780A882661Q5144Q6828Q5386Q0182P1216N9426M6028L2037J8363N743n553j5627
$$ 1882661 1967805 2054633 2140019 2220201 2291417 2350843 2396871 2428908 2447271 2453014 2447461 2431834
50768B431834k4592l2597m0042m7324n4547o1642o8388p4048p7615p8904p8834
$$ 2431834 2407242 2374645 2334603 2287279 2232732 2171090 2102702 2028654 1951039 1872135 1793301
50757A793301p8058p6084p2369o7598o2811n7900n2056m5297l8389l1617k4852
$$ 1793301 1715243 1639159 1566790 1499192 1436381 1378481 1326425 1281128 1242739 1211122 1186270
50746A186270j8528j3346r027m444R47O784J2763J8868K4727K9990L5341M2009
$$ 1186270 1167742 1154396 1145369 1140925 1141872 1148656 1161419 1180287 1205014 1235004 1270345 1312354
50734A312354N0044N8269O6101P4237Q3179R2281J00810J08871J16495J22618
$$ 1312354 1362398 1420667 1486768 1561005 1644184 1736465 1837275 1946146 2062641 2185259
50724B185259J25790J25454J21921J15544J06464R4876Q1012O5028M7193K8030
$$ 2185259 2311049 2436503 2558424 2673968 2780432 2875308 2956320 3021348 3068541 3096571
50714C096571Q186j1504k9831m5564n8122o7362p2649p2958o8343o0671n2154
$$ 3096571 3104757 3093253 3063422 3017858 2959736 2892374 2819725 2746767 2678424 2617753 2565599
50703B565599m3529l4351k4821j6431j0534p051n238n380q838j6279k6547l7706
$$ 2565599 2522070 2487719 2462898 2446467 2435933 2428882 2423644 2418264 2409426 2393147 2366600 2328894
50691B328894m8591n8678o7013p2390p4562p4355p2360o8369o2259n4507m5473
$$ 2328894 2280303 2221625 2154612 2082222 2007660 1933305 1860945 1792576 1730317 1675810 1630337
50680A630337l5132k3913j2884k517P960J9372L1655M4716N9250P5764R3546J11603
$$ 1630337 1595205 1571292 1558408 1555891 1563851 1583223 1614878 1659594 1718844 1794608 1888154 1999757
50668A999757J29894J48536J66350J81325J92166J98367J99175J93606J81482
$$ 1999757 2129651 2278187 2444537 2625862 2818028 3016395 3215570 3409176 3590658
50659C590658J63628J41259J15886Q9480O3848L9906J8127r84j7663l3362m9278
$$ 3590658 3754286 3895545 4011431 4100911 4164759 4204665 4222792 4221808 4204145 4170783 4121505
50648D121505o4683p7892q8486r7386j05102j11144j15136j17122j16759j13280
$$ 4121505 4056822 3978930 3890444 3793058 3687956 3576812 3461676 3344554 3227795 3114515
50638C114515j06572r7483q6896p5276o3055n0685l8413k6634j6265q024j721
$$ 3114515 3007943 2910460 2823564 2748288 2685233 2634548 2596135 2569501 2553236 2545212 2543491
50627B543491K953N413N005K455o46l499o115q101q806q468p753o226k739K756
$$ 2543491 2546444 2551857 2556862 2559317 2558671 2555172 2549057 2540956 2532150 2523682 2515929 2509703 2506964 2509720
50613B509720R093J5704K2959L0471L6569L9976M0791L9410L5783L0130K3250
$$ 2509720 2518813 2534517 2557476 2587947 2624516 2664492 2705283 2744693 2780476 2810606 2833856
50602B833856J5594P107j727j0004j8010k7341l8751n1019o2668p3561q3871r2634
$$ 2833856 2849450 2856557 2854830 2844826 2826816 2799475 2760724 2709705 2647037 2573476 2489605 2396971
50590B396971r8518j01367j01925j00575r7328r2629q7273q1632p5632o9346o3088
$$ 2396971 2298453 2197086 2095161 1994586 1897258 1804629 1717356 1635724 1560092 1490746 1427658
50579A427658n7154n1739m6910m2387l7641l2495k7302k2359j7516j2590p834
$$ 1427658 1370504 1318765 1271855 1229468 1191827 1159332 1132030 1109671 1092155 1079565 1071731
50568A071731l707l27K810O600J1556J7037K1684K5123K8679L3748L9880M5579
$$ 1071731 1068024 1067697 1070507 1077107 1088663 1105700 1127384 1152507 1181186 1214934 1254814 1300393
50556A300393N0509N5672O1580O7717P3940Q1065Q9590R8969J08581J18352J27800
$$ 1300393 1350902 1406574 1468154 1535871 1609811 1690876 1780466 1879435 1988016 2106368 2234168
50545B234168J35504J40124J41272J38796J31983J20144J03670Q4184O4145M6286
$$ 2234168 2369672 2509796 2651068 2789864 2921847 3041991 3145661 3229845 3293990 3340276
50535C340276L2567K3149J6835J2574R888P893N167J003l875q237j1227j2184
$$ 3340276 3372843 3395992 3412827 3425401 3435289 3443182 3448349 3449352 3445477 3437240 3426013 3413829
50523C413829j0532o358l40P081J5780K4974L3207L9675M4684M8408N0116M9041
$$ 3413829 3403297 3396939 3396599 3403680 3419460 3444434 3477641 3517316 3562000 3610408 3660524 3709565
50511C709565M5080L8230K8376J6136K929j0556k4907m0361n5580o8939q0207
$$ 3709565 3754645 3792875 3821251 3837387 3840316 3829760 3804853 3764492 3708912 3639973 3559766
50500C559766q9850r7341j01236j00691r5937q7459p5566o0833m4402k7695j1890
$$ 3559766 3469916 3372575 3271339 3170648 3074711 2987252 2911686 2850853 2806451 2778756 2766866
50489B766866K470J5386K6673L5315M0196M1353L9707L5358K7045J3760l909k4446
$$ 2766866 2769336 2784722 2811395 2846710 2886906 2928259 2967966 3003324 3030369 3044129 3040220 3015774
50477C015774m6499o8708q9128j05842j17987j25756j29686j30238j27763j22520
$$ 3015774 2969275 2900567 2811439 2705597 2587610 2461854 2332168 2201930 2074167 1951647
50467A951647j15020j06416r8074r0544q3464p6450o9513o2556n5267m7779m0732
$$ 1951647 1836627 1730211 1632137 1541593 1458129 1381679 1312166 1249610 1194343 1146564 1105832
50456A105832l4473k8871k3991k0093j6810j3302r432n880k871J19L175N663P573
$$ 1105832 1071359 1042488 1018497 998404 981594 968292 958860 952980 950109 950228 953403 959066 966639
50443I66639R933J3227J6536J8956K0809K2610K3994K4642K5342K7072K9719L2655
$$ 966639 976572 989799 1006335 1025291 1046100 1068710 1092704 1117346 1142688 1169760 1199479 1232134
50431A232134L5814L9197M1999M3368M3642M3893M4590M5539M6703M8133M9377
$$ 1232134 1267948 1307145 1349144 1392512 1436154 1480047 1524637 1570176 1616879 1665012 1714389
50420A714389M9712M8869M7016M4372M1398L8877L7166L5774L4250L3028L2727
$$ 1714389 1764101 1812970 1859986 1904358 1945756 1984633 2021799 2057573 2091823 2124851 2157578
50409B157578L3138L3563L3745L3742L3316L2148L0390K8366K6035K3364K0781
$$ 2157578 2190716 2224279 2258024 2291766 2325082 2357230 2387620 2415986 2442021 2465385 2486166
50398B486166J8625J6343J2878P780J447n570j3108k1399l0728m0956n1275o0774
$$ 2486166 2504791 2521134 2534012 2541792 2543239 2537669 2524561 2503162 2472434 2431478 2380203 2319429
50386B319429o9257p6931q3443q7873q9780q9424q6902q1959p4871o6491n7212
$$ 2319429 2250172 2173241 2089798 2001925 1912145 1822721 1735819 1653860 1578989 1512498 1455286
50375A455286m6913l6206k6407j7796r166J33Q917J5673K0174K2645K2603J9645
$$ 1455286 1408373 1372167 1345760 1327964 1318798 1318931 1327848 1343521 1363695 1386340 1408943 1428588
50363A428588J4470P900k04r886j9787k8219l4921m0546m4975m7464m8079m7712
$$ 1428588 1443058 1450958 1450754 1440868 1421081 1392862 1357941 1317395 1272420 1224956 1176877 1129165
50351A129165m6825m5184m2711l9718l6465l3179l0217k7610k4886k1900j9274
$$ 1129165 1082340 1037156 994445 954727 918262 885083 854866 827256 802370 780470 761196
50340G61196j7405j5740j3723j1671r954q108n673l140j100P85K909M758N901
$$ 761196 743791 728051 714328 702657 692703 684595 678922 675782 674682 675467 678376 683134 689035
50327F89035P149R339J1749J3113J3589J4325J5555J6604J7372J8327J9301J9780
$$ 689035 696184 705523 717272 730385 743974 758299 773854 790458 807830 826157 845458 865238
50315H65238K0197K1495K3558K5441K7008K8931L1109L2519L2725L2278L1495
$$ 865238 885435 906930 930488 955929 982937 1011868 1042977 1075496 1108221 1140499 1171994
50304A171994L0148K8539K7584K7516K7442K6410K4124K0575J5975J1030O390
$$ 1171994 1202142 1230681 1258265 1285781 1313223 1339633 1363757 1384332 1400307 1411337 1417727
50293A417727J844l028p634j0872j2703j4050j5287j6149j7129j9388k2968k6442
$$ 1417727 1419571 1416543 1408909 1398037 1385334 1371284 1355997 1339848 1322719 1303331 1280363 1253921
50281A253921k8816l0581l2379l3794l4220l3877l3232l2126l0246k7964k6092
$$ 1253921 1225105 1194524 1162145 1128351 1094131 1060254 1027022 994896 964650 936686 910594
50270I10594k5010k4430k3740k2443k0548j8626j7095j5546j3285j0419p757n722
$$ 910594 885584 861154 837414 814971 794423 775797 758702 743156 729871 719452 711695 705973
50258G05973m026k456j195l03N33J532K574L523M316M803M943N022N149M805L577
$$ 705973 701947 699491 698296 697993 698526 700058 702632 706155 710471 715274 720217 725239 730388 735193 738770
50243G38770K048J241J321J561J414Q71p1j378k557l148l544m460n658o163n726
$$ 738770 740818 742059 743380 744941 746355 747226 747155 745777 743220 740072 736528 732068 726410 720247 714521
50228G14521n161n042n059m863m723m941n255n147m340k930j385l65l7K62J172
$$ 714521 709360 704318 699259 694396 689673 684732 679477 674330 669990 667060 665675 665310 665273 665535 666707
50213F66707K390L188L558M037M654M919M778M682M768M679M180L325K152Q53
$$ 666707 669097 672285 675843 679880 684534 689453 694231 698913 703681 708360 712540 715865 718017 718870
50199G18870N1J31N31K87q46k438l973m812m268k745k010l142m851n256m617m651
$$ 718870 718921 719052 719583 719870 719024 716586 712613 707801 703533 700788 698778 695636 690785 685529 680912 676261
50183F76261n601o106n870o304p989r486r509q693q245q122p578o525n476m718
$$ 676261 670660 664554 658684 652380 644391 634905 625396 616703 608458 600336 592758 586233 580757 576039
50169E76039m156l504k338n66J105J890K025K201K139J002p84j711j437j387k545
$$ 576039 571883 568379 566041 565475 566580 568470 570495 572696 574835 575837 575053 573342 571905 570518 567973
50154E67973m146n190n848o518o684n785m304l039k050j098m02k27k64j61q3k57
$$ 567973 563827 558637 552789 546271 539587 533802 529498 526459 524409 523311 522909 522682 522418 522257 522174 521917
50138E21917m66m06r2L96R59J227J022J066K252M139N263N155M818M968N140N054
$$ 521917 521451 521045 520953 521349 522308 523535 524557 525623 527875 532014 537277 542432 547250 552218 557358 562412
50122E62412N392O440P260P056O326N853N602N403N642O376O754O259N582N410
$$ 562412 567804 574244 581504 588560 594886 600739 606341 611744 617386 623762 630516 636775 642357 647767
50108F47767N307M756M306M655N440N998O517P395Q240Q629R159J0502J2110J3033
$$ 647767 653074 657830 662136 666791 672231 678229 684746 692141 700381 709010 718169 728671 740781 753814
50094G53814J3498J4491J6118J7574J8588J9771K1551K3667K5772K7878L0245
$$ 753814 767312 781803 797921 815495 834083 853854 875405 899072 924844 952722 982967
50083I82967L3286L7405M2458M7800N3235N9480O7227P6323Q6503R8168J11774
$$ 982967 1016253 1053658 1096116 1143916 1197151 1256631 1323858 1400181 1486684 1584852 1696626
50072A696626J27097J43956J63003J84737K07941K30013K48420K61002K65184
$$ 1696626 1823723 1967679 2130682 2315419 2523360 2753373 3001793 3262795 3527979
50063C527979K58245K38819K08109J69903J29824R3900O6661N0158M4493M8512
$$ 3527979 3786224 4025043 4233152 4403055 4532879 4626779 4693440 4743598 4788091 4836603
50053D836603N9531P3063Q3784Q6747P7792N4084J5518l4526r0473j46434j96902
$$ 4836603 4896134 4969197 5052981 5139728 5217520 5271604 5287122 5252596 5162123 5015689 4818787
50042D818787k37021k63726k76667k77504k68602k52788k33371k13116j93258
$$ 4818787 4581766 4318040 4041373 3763869 3495267 3242479 3009108 2795992 2602734
50033B602734j74018j55659j38495j22573j08105r5669q5221p5717o6526n8405
$$ 2602734 2428716 2273057 2134562 2011989 1903884 1808215 1722994 1647277 1580751 1522346
50023A522346n2027m6449m0431l4502l0095k7113k4048k0385j7046j4493j2034
$$ 1522346 1470319 1423870 1383439 1348937 1318842 1291729 1267681 1247296 1230250 1215757 1203723
50012A203723r494p844p491p304o212m674l673l091k133p52L15O53O04O24P77
$$ 1203723 1194229 1186385 1178894 1171590 1165378 1160704 1157031 1153940 1151807 1151055 1151370 1152023 1152627 1153251 1154028
49997A154028Q67P21L24j98o39p87l84P13K185L282L614L672M230N400O823Q490
$$ 1154028 1154895 1155616 1155940 1155742 1155103 1154316 1153932 1154645 1156830 1160112 1163726 1167398 1171628 1177028 1183851 1192341
49981A192341J0669J3066J4838J5700J6433J8006K0654K3963K7446L0805L3967
$$ 1192341 1203010 1216076 1230914 1246614 1263047 1281053 1301707 1325670 1353116 1383921 1417888
49970A417888L7152M0625M4270M7762N1265N5572O1228O7848P4798Q2363R1789
$$ 1417888 1455040 1495665 1539935 1587697 1638962 1694534 1755762 1823610 1898408 1980771 2072560
49959B072560J04067J19177J36708J56931J80697K08368K39354K72695L07343
$$ 2072560 2176627 2295804 2432512 2589443 2770140 2978508 3217862 3490557 3797900
49950C797900L41132L69851L88185L91941L79565L52378L14437K72075K32214
$$ 3797900 4139032 4508883 4897068 5289009 5668574 6020952 6335389 6607464 6839678
49941F839678K00131J78513J68017J67679J74632J84397J91874J91587J77393
$$ 6839678 7039809 7218322 7386339 7554018 7728650 7913047 8104921 8296508 8473901
49932H473901J43859Q9490J8484o1012j40219k11666k69991l12874l41430l58852
$$ 8473901 8617760 8707250 8725734 8664722 8524503 8312837 8042846 7729972 7388542 7029690
49922G029690l68434l72587l72695l69011l61058l48846l33431l15963k96812
$$ 7029690 6661256 6288669 5915974 5546963 5185905 4837059 4503628 4187665 3890853
49913C890853k76153k54725k33269k11854j90607j70665j53359j38730j25633
$$ 3890853 3614700 3359975 3126706 2914852 2724245 2553580 2400221 2261491 2135858
49904B135858j13128j01103q9859p9744p1045o3635n7009n1168m6939m4754m3702
$$ 2135858 2022730 1921627 1831768 1752024 1680979 1617344 1560335 1509167 1462228 1417474 1373772
49893A373772m2653m1820m2063m3002m3024m1197l8216l5283l2978l1270k9797
$$ 1373772 1331119 1289299 1247236 1204234 1161210 1120013 1081797 1046514 1013536 982266 952469
49882I52469k7873k4922k1234j7814j5348j3672j2308j0999r715q575p788p345
$$ 952469 924596 899674 878440 860626 845278 831606 819298 808299 798584 790009 782221 774876
49870G74876o835n895m683l583k653j741q34J02J277K669L875M803O011P716R067
$$ 774876 768041 762146 757463 753880 751227 749486 748652 748754 750031 752700 756575 761378 767389 775105 784172
49855G84172R224Q661Q537R167J0081J1275J3256J5969J8733K1281K3940K6793
$$ 784172 793396 802057 810594 819761 829842 841117 854373 870342 889075 910356 934296 961089
49843I61089K9665L3020L7852M4380N1781N9513O8164P8661R1405J06485J24100
$$ 961089 990754 1023774 1061626 1106006 1157787 1217300 1285464 1364125 1455530 1562015 1686115
49832A686115J44259J66610J90733K16161K41510K63886K79388K84246K75807
$$ 1686115 1830374 1996984 2187717 2403878 2645388 2909274 3188662 3472908 3748715
49823C748715K53400K18896J76568J32212R2016O1279M3101L7862M3897N8220
$$ 3748715 4002115 4221011 4397579 4529791 4621807 4683086 4726187 4764049 4807946 4866166
49813D866166P6225R1316R6188Q5118N5420P690n4117j22896j90057k48084k92020
$$ 4866166 4942391 5033707 5129895 5215013 5270433 5278123 5224006 5101110 4911053 4662969 4370949
49802D370949l19356l29752l25166l09436k86889k61046k34310k08174j83508
$$ 4370949 4051593 3721841 3396675 3087239 2800350 2539304 2304994 2096820 1913312
49793A913312j60837j40520j22646j07023r3553q2309p3043o4961n7411n0457
$$ 1913312 1752475 1611955 1489309 1382286 1288733 1206424 1133381 1068420 1011009 960552
49783I60552m4370l9006l4183l0184k7249k4979k2870k0992j9465j7803j5602
$$ 960552 916182 877176 842993 812809 785560 760581 737711 716719 697254 679451 663849
$$ [...]
##END NTUPLES=NMR SPECTRUM
##END=
