
##TITLE=AC1216_HNAAH12057_7164140_aGhcq856Ux
##JCAMPDX= 6.0         $$ Bruker NMR JCAMP-DX V2.0
##DATA TYPE= NMR SPECTRUM
##DATA CLASS= NTUPLES
##ORIGIN= BRUKER
##OWNER= Administrator
$$ 1.72 TOPSPIN		Version 2.1
$$ 2012-12-01 17:03:32.279 -0500  Administrator@X
$$ Compression mode = diff/dup
##.OBSERVE FREQUENCY= 400.02188249412
##.OBSERVE NUCLEUS= ^1H
##.ACQUISITION MODE= SIMULTANEOUS (DQD)
##.ACQUISITION SCHEME= undefined
##.AVERAGES= 64
##.DIGITISER RES= 22
##SPECTROMETER/DATA SYSTEM= spect
##.PULSE SEQUENCE= noesygpps1d.comp
##.SOLVENT NAME= COFFEE_meoh
##.SHIFT REFERENCE= INTERNAL, COFFEE_meoh, 1, 14.96211
##AUDIT TRAIL= $$ (NUMBER, WHEN, WHO, WHERE, PROCESS, VERSION, WHAT)
$$ ##TITLE= Audit trail, TOPSPIN		Version 2.1
$$ ##JCAMPDX= 5.01
$$ ##ORIGIN= Bruker BioSpin GmbH
$$ ##OWNER= Administrator
$$ $$ E:\/data/COFFEE/nmr/AC1216_HNAAH12057_7164140_aGhcq856Ux/12/pdata/1/auditp.txt
$$ ##AUDIT TRAIL=  $$ (NUMBER, WHEN, WHO, WHERE, PROCESS, VERSION, WHAT)
(   1,<2012-12-01 17:03:26.146 -0500>,<Administrator>,<X>,<go>,<TOPSPIN 2.1>,
      <created by zg
	started at 2012-12-01 16:51:55.128 -0500,
	POWCHK enabled, PULCHK disabled,
       configuration hash MD5:
       86 BA 57 50 F2 9D 5C 9B 26 00 A9 28 5F 66 2E 89
       data hash MD5: 64K
       42 7B 25 FA D8 C3 A9 A2 BD 1A 41 D3 71 11 AC C8>)
(   2,<2012-12-01 17:03:29.383 -0500>,<Administrator>,<X>,<proc1d>,<TOPSPIN 2.1>,
      <Start of raw data processing
       efp LB = 0.3 FT_mod = 6 PKNL = 1 PHC0 = 0 PHC1 = 0 SI = 128K 
       data hash MD5: 128K
       E9 03 DC 95 DE 49 11 71 D5 44 97 19 8C EB 27 6C>)
(   3,<2012-12-01 17:03:30.596 -0500>,<Administrator>,<X>,<proc1d>,<TOPSPIN 2.1>,
      <pk PHC0 = -82.93579 PHC1 = 0 
       data hash MD5: 128K
       9A 17 A6 8B 8E D7 81 34 B7 5A 0F 74 98 2F 4A F4>)
(   4,<2012-12-01 17:03:31.318 -0500>,<Administrator>,<X>,<proc1d>,<TOPSPIN 2.1>,
      <abs ABSG = 1 
       data hash MD5: 128K
       51 46 EF 6A 21 05 5D 16 84 14 2F E6 B5 D4 C0 AB>)
(   5,<2012-12-01 17:03:31.478 -0500>,<Administrator>,<X>,<proc1d>,<TOPSPIN 2.1>,
      <abs ABSG = 2 
       data hash MD5: 128K
       37 90 33 A9 EB 5D 09 0F FC F4 D4 18 EB C3 47 3B>)
(   6,<2012-12-01 17:03:31.639 -0500>,<Administrator>,<X>,<proc1d>,<TOPSPIN 2.1>,
      <abs ABSG = 3 
       data hash MD5: 128K
       58 58 BC 8C 34 6E 34 EC A0 E6 8A C7 18 BA C1 1B>)
(   7,<2012-12-01 17:03:31.813 -0500>,<Administrator>,<X>,<proc1d>,<TOPSPIN 2.1>,
      <abs ABSG = 4 
       data hash MD5: 128K
       61 37 91 4E 77 D3 12 16 74 6B CA C6 AD 1E 46 4D>)
(   8,<2012-12-01 17:03:31.988 -0500>,<Administrator>,<X>,<proc1d>,<TOPSPIN 2.1>,
      <abs ABSG = 5 
       data hash MD5: 128K
       F8 60 07 14 4E C9 F4 A6 3C B9 D5 70 3F 32 A0 90>)
$$ ##END=
$$ 
$$ $$ hash MD5
$$ $$ DC 9F A5 31 E1 0D C1 39 E0 11 3D 39 FA 9A B6 62
##$RELAX= 
##$RELAX= 
##$RELAX= 
##$RELAX= 
##$RELAX= 
##$RELAX= 
##$RELAX= 
##$RELAX= 
$$ Bruker specific parameters
$$ --------------------------
##$DU= <E:\>
##$EXPNO= 12
$$ [...]
150 150 150 150 150 150 150 150
##$TP07= 0
##$TPNAME0= <>
##$TPNAME1= <>
##$TPNAME2= <>
##$TPNAME3= <>
##$TPNAME4= <>
##$TPNAME5= <>
##$TPNAME6= <>
##$TPNAME7= <>
##$TPOAL= (0..7)
0.5 0.5 0.5 0.5 0.5 0.5 0.5 0.5
##$TPOFFS= (0..7)
0 0 0 0 0 0 0 0
##$TUNHIN= 0
##$TUNHOUT= 0
##$TUNXOUT= 0
##$USERA1= <user>
##$USERA2= <user>
##$USERA3= <user>
##$USERA4= <user>
##$USERA5= <user>
##$V9= 5
##$VALIST= <valist>
##$VCLIST= <CCCCCCCCCCCCCCC>
##$VD= 0
##$VDLIST= <DDDDDDDDDDDDDDD>
##$VPLIST= <PPPPPPPPPPPPPPP>
##$VTLIST= <TTTTTTTTTTTTTTT>
##$WBST= 1024
##$WBSW= 4
##$XGAIN= (0..3)
0 0 0 0
##$XL= 0
##$YL= 0
##$YMAX_a= 7830691
##$YMIN_a= -16569380
##$ZGOPTNS= <>
##$ZL1= 120
##$ZL2= 120
##$ZL3= 120
##$ZL4= 120
##$ABSF1= 14.96211
##$ABSF2= -5.596072
##$ABSG= 5
##$ABSL= 3
##$ALPHA= 0
##$AQORDER= 0
##$ASSFAC= 0
##$ASSFACI= 0
##$ASSFACX= 0
##$ASSWID= 0
##$AUNMP= <proc_prof1d_extract.lims>
##$AXLEFT= 0
##$AXNAME= <>
##$AXNUC= <1H>
##$AXRIGHT= 0
##$AXTYPE= 0
##$AXUNIT= <>
##$AZFE= 0.1
##$AZFW= 0.1
##$BCFW= 0
##$BC_mod= 0
##$BYTORDP= 0
##$COROFFS= 0
##$CY= 15
##$DATMOD= 1
##$DC= 0
##$DFILT= <>
##$DTYPP= 0
##$F1P= 0
##$F2P= 0
##$FCOR= 0.5
##$FTSIZE= 131072
##$FT_mod= 6
##$GAMMA= 0
##$GB= 0
##$INTBC= 1
##$INTSCL= 1
##$ISEN= 128
##$LB= 0.3
##$LEV0= 0
##$LPBIN= 0
##$MAXI= 10000
##$MC2= 0
##$MEAN= 0
##$ME_mod= 0
##$MI= 0
##$NCOEF= 0
##$NC_proc= -2
##$NLEV= 6
##$NOISF1= 0
##$NOISF2= 0
##$NSP= 0
##$NTH_PI= 0
##$NZP= 0
##$OFFSET= 14.96211
##$PC= 1
##$PHC0= -82.93579
##$PHC1= 0
##$PH_mod= 1
##$PKNL= yes
##$PPARMOD= 0
##$PPDIAG= 0
##$PPIPTYP= 0
##$PPMPNUM= 2147483647
##$PPRESOL= 1
##$PSCAL= 4
##$PSIGN= 0
##$PYNMP= <proc.py>
##$REVERSE= no
##$SF= 400.02000919264
##$SI= 131072
##$SIGF1= 0
##$SIGF2= 0
##$SINO= 400
##$SIOLD= 131072
##$SPECTYP= <>
##$SREGLST= <1H.CDCl3>
##$SSB= 0
##$STSI= 131072
##$STSR= 0
##$SW_p= 8223.68421052631
##$SYMM= 0
##$S_DEV= 0
##$TDeff= 65536
##$TDoff= 0
##$TI= <>
##$TILT= no
##$TM1= 0
##$TM2= 0
##$TOPLEV= 0
##$USERP1= <user>
##$USERP2= <user>
##$USERP3= <user>
##$USERP4= <user>
##$USERP5= <user>
##$WDW= 1
##$XDIM= 131072
##$YMAX_p= 438840452
##$YMIN_p= -20763
##$CURPLOT= <Network HP LaserJet P1505>
##$CURPRIN= <$Network HP LaserJet P1505>
##$DFORMAT= <normdp>
##$LAYOUT= <+/1D_H.xwp>
##$LFORMAT= <normlp>
##$PFORMAT= <normpl>
##$SURQMSG= 1
$$ End of Bruker specific parameters
$$ ---------------------------------
##NTUPLES= NMR SPECTRUM
##VAR_NAME=  FREQUENCY,     SPECTRUM/REAL,   SPECTRUM/IMAG
##SYMBOL=    X,             R,               I
##VAR_TYPE=  INDEPENDENT,   DEPENDENT,       DEPENDENT
##VAR_FORM=  AFFN,          ASDF,            ASDF
##VAR_DIM=   131072,        131072,          131072
##UNITS=     HZ,            ARBITRARY UNITS, ARBITRARY UNITS
##FACTOR=    0.0627417313425164, 1,          1
##FIRST=     8223.62146879497, 360,          -61838
##LAST=      0,             1831,            -62037
##MIN=       0,             -20763,          0
##MAX=       8223.62146879497, 438840452,    0
$$ Real data points
##PAGE= N=1
##DATA TABLE= (X++(R..R)), XYDATA
$$ [...]
60995B163378J30564J42547J57450J75336J97691K30172K76633L36068M10272
$$ 2163378 2293942 2436489 2593939 2769275 2966966 3197138 3473771 3809839 4220111
60986D220111N07576O32684P80600R49076J148724J390466J674770K008507K408857
$$ 4220111 4727687 5360371 6140971 7090047 8238771 9629237 11304007 13312514 15721371
60977A5721371K838470L125478L011349K357127J319356K82408m11150o59012
$$ 15721371 18559841 21685319 24696668 27053795 28373151 28655559 28244409 27585397
60969B7585397n49863j94993L16527Q13949J006562O51130k24191j300221k192000
$$ 27585397 27035534 26840541 27157068 27971017 28977579 29628709 29404518 28104297 25912297
60960B5912297k692617k822039k705940k456872k148392j833708j547416j298900
$$ 25912297 23219680 20397641 17691701 15234829 13086437 11252729 9705313 8406413
60952H406413j083854r00827p50365o26714n21628m33246l63656l10693k68653
$$ 8406413 7322559 6421732 5671367 5044653 4523025 4089779 3726123 3415430 3146777
60943C146777k34564k07823j85810j65348j46857j32204j20039j07464r4676q3710
$$ 3146777 2912213 2704390 2518580 2353232 2206375 2074171 1954132 1846668 1751992 1668282
60933A668282p4241o4837n6944n3289n3242n3658n3378n3216n2492m9483m4810
$$ 1668282 1594041 1529204 1472260 1418971 1365729 1312071 1258693 1205477 1152985 1103502 1058692
60922A058692m0836l8063l5274l2582l1062k9928k7434k4220k2492k2227k1326
$$ 1058692 1017856 979793 944519 911937 880875 850947 823513 799293 776801 754574 733248
60911G33248j9358j7938j7372j6148j3981j2415j1983j1409j0116r030q514p731
$$ 733248 713890 695952 678580 662432 648451 636036 624053 612644 602528 593498 584984 577253
60899E77253o458n425m602l215j587q66q56k58Q91J200N20K56Q60J226R93J272
$$ 577253 570795 565370 560768 557553 555966 555100 554244 553986 554877 556077 556597 556853 557713 558939 559932 561204
60883E61204K505L564L646L299L047K607J904J369Q47l81k234l934n365o862p839
$$ 561204 563709 567273 570919 574218 577265 579872 581776 583145 583992 583611 581377 577443 572078 565216 557377
60868E57377p443o402o255o802o370m753l520l229k592j041J62K14J11Q19J933
$$ 557377 549934 543532 537277 530475 524105 519352 515832 512603 510011 508970 509132 509346 509457 510276 512209
60853E12209L062M756P019Q661R212R950J1905J4267J5880J6953J8033J8535J7599
$$ 512209 515271 520027 527046 535707 544919 554869 566774 581041 596921 613874 631907 650442 668041
60840F68041J5642J3827J2648J1903J1468J1210J0634R285P196M634J911l80j681
$$ 668041 683683 697510 710158 722061 733529 744739 755373 764658 771854 776488 778399 778019 776338
60827G76338k191k611l031k969k452k110k097j980j778j971k425k573k738l904
$$ 776338 774147 771536 768505 765536 763084 760974 758877 756897 755119 753148 750723 748150 745412 741508
60813G41508n969p528p820p560p525p623p701p900p826o801n404n241o555p586
$$ 741508 735539 728011 720191 712631 705106 697483 689782 681882 674056 667255 661851 656610 650055 642469
60799F42469p043n753m886m112k623q17L41P82J070J447K059L302N100O535P060
$$ 642469 635426 629673 624787 620675 618052 617235 617576 618358 619428 620875 622934 626236 631336 637871 644931
60784F44931P298P976Q911R762J0814J2154J3052J3138J3279J4159J4863J4073
$$ 644931 652229 660205 669116 678878 689692 701846 714898 728036 741315 755474 770337 784410
60772G84410J2103J0437R688R217Q520P820P312O822O319N969N561M569K938J409
$$ 784410 796513 806950 816638 825855 834375 842195 849507 856329 862648 868617 874178 878747 881685 883094
60758H83094Q22J255J928J905J062J37k99p25j933l656m718m582l892l331k880
$$ 883094 883916 885171 887099 889004 890066 890203 889904 889179 887246 883590 878872 874290 870398 867067 864187
60743H64187k429k291k632l159l815n010o699p992q254p972p882p821p121n754
$$ 864187 861758 859467 856835 853676 849861 844851 838152 830160 821906 813934 806052 798231 791110 785356
60729G85356m457l825l727l520k720j528o09j90K96J207J873J469L79k99k69j4
$$ 785356 780899 777074 773347 769827 767107 765579 764970 764780 765076 766283 768156 769625 770004 769705 769436 769422
60713G69422M05J219J825J272k4o50m07n99j757k709k583k129k239k619k833l294
$$ 769422 769827 771046 772871 774143 774119 773469 773062 772463 770706 767997 765414 763285 761046 758427 755594 752300
60697G52300m171m567l928l245l715n163o703q002q902q861p953p434q101q964
$$ 752300 748129 743562 739634 736389 732674 727511 720808 712806 703904 695043 687090 679656 671555 662591
60683F62591q798q148q359r294r568q709p703p425p680p829p496o718n971n788
$$ 662591 653793 645645 637286 627992 618424 609715 602012 594587 586907 579078 571582 564864 558893 553105
60669E53105n858n042k890n24P40R82J138J560K109K991M372N611N946N718N904
$$ 553105 547247 542205 539315 538791 539531 540513 541651 543211 545320 548311 552683 558294 564240 569958 575862
60654E75862O674P301P342P068O887O997P422P848P812P418P383P839P872O910
$$ 575862 582536 589837 597179 604247 611134 618131 625553 633401 641213 648631 656014 663853 671725 678635
60640F78635N703N143M901M290L657L809M646N584O727Q426J0142J1020J1216
$$ 678635 684338 689481 694382 698672 702329 706138 710784 716368 723095 731521 741663 752683 763899
60627G63899J1474J1805J1778J1652J1868J1775J0341Q003O360N976N785M756
$$ 763899 775373 787178 798956 810608 822476 834251 844592 852595 858955 864931 870716 875472
60615H75472K973R11j135k768l629m017m430m599l959k933k468k419j814q32j015
$$ 875472 878445 879356 878221 875453 871824 867807 863377 858778 854819 851886 849418 846999 845185 844353 843338
60600H43338l047n782q091j0294j3031j5778j7422j7528j6188j3462r886o807
$$ 843338 840291 834509 826418 816124 803093 787315 769893 752365 736177 722715 712829 706022
60588G06022n193m416l112r94J004K196K975L952M963N352N011M675N107O154
$$ 706022 700829 696413 693301 692307 693311 695507 698482 702434 707397 712749 717760 722435 727542 733696
60574G33696O870O562N386L989K947K686L348M307M420L281J866J333J605J777
$$ 733696 740566 747128 752514 756503 759450 762136 765484 769791 774211 777492 779358 780691 782296 784073
60560G84073J438P65l51k177m263n678o191o366o502o330n889n632n471m568k566
$$ 784073 785511 786276 785925 783748 779485 773807 767616 761250 754748 748418 742529 736897 731426 726858 724292
60545G24292k13J622K965M426O505R553J3767J8768K3709K8198L2611L7098M0863
$$ 724292 724079 725701 728666 733092 739597 749150 762917 781685 805394 833592 866203 903301 944164
60532I44164M2895M2894M0831L6060K7702J5983K592j0315k1101k8761l2788l3338
$$ 944164 987059 1029953 1070784 1106844 1134546 1150529 1153121 1142806 1121705 1092944 1060156 1026818
60520A026818l1331k7884k3580j8464j2736p138k465R58L066L687K973K001K019
$$ 1026818 995487 967603 944023 925559 912823 905685 903220 904178 907244 910931 913904 915905 917924
60507I17924K929L398K918K895M938Q751J2727J6157J9825K4494K9944L5787M2266
$$ 917924 920853 924251 927169 930064 935002 943753 956480 972637 992462 1016956 1046900 1082687 1124953
60494A124953M9757N7978O6197P3934Q1212Q8319R5551J03171J11584J21774J35472
$$ 1124953 1174710 1232688 1298885 1372819 1454031 1542350 1637901 1741072 1852656 1974430 2109902
60483B109902J54551J80026K11564K47808K86805L25779L60046L82114L82705
$$ 2109902 2264453 2444479 2656043 2903851 3190656 3516435 3876481 4258595 4641300
60474D641300L54360K95241K09671J05355q957j23287k26114l06850l59540l84171
$$ 4641300 4995660 5290901 5500572 5605927 5596970 5473683 5247569 4940719 4581179 4197008
60464D197008l85086l68733l41927l10228k77043k44376k14059j87456j64339
$$ 4197008 3811922 3443189 3101262 2791034 2513991 2269615 2055556 1868100 1703761
60455A703761j43375j23980j06892r2767q1090p0890o1770n3731m6579m0074l4383
$$ 1703761 1560386 1436406 1329514 1236747 1155657 1084767 1022997 969266 922687 882613 848230
60444H48230k9907k6656k4013k1176j7933j4972j3199j2556j1884j0305q351p219
$$ 848230 818323 791667 767654 746478 728545 713573 700374 687818 675934 665629 657278 650059
60432F50059p270p867q356q529q274p532o684o356o666p105p149o640n694m589
$$ 650059 642789 634922 626566 618037 609763 602231 595547 589191 582525 575420 568271 561631 555937 551348
60418E51348l597k604j167O70K028K200J655J384J656K112K632L239L438K694
$$ 551348 547751 545147 543980 544650 546678 548878 550533 551917 553573 555685 558317 561556 564994 567688
60404E67688J455P65R34J438K010K829L644L792L324L197M012N340O469P136P335
$$ 567688 569143 569908 570842 572280 574290 577119 580763 584555 587879 591076 595088 600428 606897 614033 621368
60389F21368P134O903P042P275O867N665M315L245K230J049r8j084k072k982l360
$$ 621368 628502 635405 642447 649722 656589 662254 666569 669814 672044 673093 672995 671911 669839 666857 663497
60374F63497l063k605k533k882l352l586l255k382j551j318j436j247o68j40K68
$$ 663497 660434 657829 655296 652414 649062 645476 642221 639839 638288 636970 635534 634287 633619 633479 633747
60359F33747Q64J550J873J976K542L712M818N427N873O585P520Q412Q982Q993
$$ 633747 634611 636161 638034 640010 642552 646264 651082 656509 662382 668967 676487 684899 693881 702874
60345G02874Q728R137J0625J1870J1035Q179N270L724L069K263R74p61k913m824
$$ 702874 711602 720739 731364 743234 754269 762448 767718 771442 774511 776774 777748 776987 774074 769250
60331G69250n354m239k475q67P81K605L986M606N074N679N539L856J209j270l267
$$ 769250 763896 759657 757182 756315 757096 759701 763687 768293 773367 779046 784585 788441 789650 788380 785113
60316G85113n004o362p159p619p805p204n762m584m681n531n818n128m041k995
$$ 785113 780109 773747 766588 758969 751164 743960 738198 733614 728933 723402 717584 712456 708415 705420
60302G05420k036j327j034q18k09P19J626K542L573M286M126L147J749Qj998l524
$$ 705420 703384 702057 701023 700205 699996 700715 702341 704883 708456 712742 716868 720015 721764 721772 719774 716250
60286G16250l737k837j937j739j915j738q35O43K206L374M101M809N778O776P495
$$ 716250 712513 709676 707739 706000 704085 702347 701512 702155 704361 707735 711836 716645 722423 729199 736694
60271G36694P997Q351Q307P692O843O217N830N439M974M451L872L563M171N876
$$ 736694 744691 753042 761349 769041 775884 782101 787931 793370 798344 802795 806667 810230 814401 820277
60257H20277P977R675J0908J2029J3151J4313J5874J8110K0742K3366K6052K9013
$$ 820277 828254 837929 848837 860866 874017 888330 904204 922314 943056 966422 992474 1021487
60245A021487L2093L5165L8729M3465M9321N5586O1747O7814P3996Q0485Q7454
$$ 1021487 1053580 1088745 1127474 1170939 1220260 1275846 1337593 1405407 1479403 1559888 1647342
60234A647342R4770J01777J07696J12137J14982J15977J14764J11227J05554R8087
$$ 1647342 1742112 1843889 1951585 2063722 2178704 2294681 2409445 2520672 2626226 2724313
60224B724313Q9150P8790O6722N2904L8121K3448R128n246j9288l1511m0808m7424
$$ 2724313 2813463 2892253 2958975 3011879 3050000 3073448 3082576 3077330 3058042 3026531 2985723 2938299
60212B938299n1904n4060n3689n1426m7810m2122l3387k2253j0752j91R891K0618
$$ 2938299 2886395 2832335 2778646 2727220 2679410 2637288 2603901 2581648 2570896 2570705 2580596 2601214
60200B601214L2460M5126N8066P0787Q3002R4643J05527J14995J21969J25329
$$ 2601214 2633674 2678800 2736866 2807653 2890655 2985298 3090825 3205820 3327789 3453118
60190C453118J24263J18713J09587R8018Q4243O7806M9034K9506J0463q412k7781
$$ 3453118 3577381 3696094 3805681 3903699 3987942 4055748 4104782 4134288 4144751 4136339 4108558
60179D108558m6863o3830p7654q8508r6495j00894j00934r6666q8927p8856o7467
$$ 4108558 4061695 3997865 3920211 3831703 3735208 3634314 3533380 3436714 3347787 3268931 3201464
60168C201464n5241m2044k7629j2153L899J9990L5512M9758O2257P2791Q0880
$$ 3201464 3146223 3104179 3076550 3064397 3068296 3088286 3123798 3173556 3235813 3308604 3389484
60157C389484Q5657Q6568Q3716P7310O7326N4274L9663K5076J1132k134j4391
$$ 3389484 3475141 3561709 3645425 3722735 3790061 3844335 3883998 3909074 3920206 3918072 3903681
60146C903681k5090l3958m0680m4460m4564m1041l4428k5093j3457l88J3353K7781
$$ 3903681 3878591 3844633 3803953 3759493 3714929 3673888 3639460 3614367 3600910 3600522 3613875 3641656
60134C641656M3300O0031P7982R7341J17883J38694J59299J80581K03724K28529
$$ 3641656 3684956 3744987 3822969 3920310 4038193 4176887 4336186 4516767 4720491 4949020
60124D949020K53606K77825L00639L21345L39108L53498L63968L68975L66663
$$ 4949020 5202626 5480451 5781090 6102435 6441543 6795041 7159009 7527984 7894647
60115G894647L56500L39225L15212K84042K45900K02322J54945J04274N0230o534
$$ 7894647 8251147 8590372 8905584 9189626 9435526 9637848 9792793 9897067 9947297 9940763
60105I940763o4289j20884j74406k23366k66434l01941l27936l43101l47555l42481
$$ 9940763 9876474 9755590 9581184 9357818 9091384 8789443 8461507 8118406 7770851 7428370
60095G428370l29183l08844k82882k52851k19973j85184j49529j14050p9388m5878
$$ 7428370 7099187 6790343 6507461 6254610 6034637 5849453 5699924 5585874 5506486 5460608
60085E460608j3964J5783M2860O6598Q5971J00020J08370J11068J08190J00020
$$ 5460608 5446644 5462427 5505287 5571885 5657856 5757876 5866246 5977314 6085504 6185524
60075F185524Q7189P0352N0094K7611M877j6530l6399n5155p2650q8420j02639
$$ 6185524 6272713 6343065 6393159 6420770 6425647 6409117 6372718 6317563 6244913 6156493 6053854
60064F053854j15947j28510j39974j50072j58487j64377j66876j65946j62092
$$ 6053854 5937907 5809397 5669423 5519351 5360864 5196487 5029611 4863665 4701573
60055D701573j55475j46018j34074j20358j05354q9450p3228n6889l9837k1707
$$ 4701573 4546098 4400080 4266006 4145648 4040294 3950844 3877616 3820727 3780890 3759183
60045C759183l356J4161L1172M8753O6732Q3628R8493J11573J22848J31163J35173
$$ 3759183 3755827 3769988 3801160 3849913 3916645 4000273 4098766 4210339 4333187 4464350 4599523
60034D599523J34350J28649J18050J02823Q3761O1830L7965J3209j1593l6194
$$ 4599523 4733873 4862522 4980572 5083395 5167156 5228986 5266951 5280160 5268567 5232373
60024E232373o0521q3812j04818j22693j37010j47026j51819j51304j46451j38406
$$ 5232373 5171852 5088040 4983222 4860529 4723519 4576493 4424674 4273370 4126919 3988513
60014C988513j27950j15743j02354q8006p2770n7018m1136k5045q582P877K3937
$$ 3988513 3860563 3744820 3642466 3554460 3481690 3424672 3383536 3358491 3349909 3357786 3381723
60003C381723M0061N7131P5354R4296J13687J33208J51730J67794J80660J89990
$$ 3381723 3421784 3478915 3554269 3648565 3762252 3895460 4047190 4214984 4395644 4585634
59993D585634J94697J93327J85473J71790J52826J29015J01672P2518M2109J0027
$$ 4585634 4780331 4973658 5159131 5330921 5483747 5612762 5714434 5786952 5829061 5839088
59983E839088k3217n5743q5934j13190j36725j55001j66894j72334j71475j64451
$$ 5839088 5815871 5760128 5674194 5561004 5424279 5269278 5102384 4930050 4758575 4594124
59973D594124j52392j37423j20808j02192q1292n9292l7862j7624J618J9984L7527
$$ 4594124 4441732 4304309 4183501 4081309 4000017 3940725 3902863 3885239 3886857 3906841 3944368
59962C944368N4371P0157Q3903R4989J03634J09981J13566J14179J12384J08546
$$ 3944368 3998739 4068896 4152799 4247788 4351422 4461403 4574969 4689148 4801532 4910078
59952D910078J02104R2591Q0808O8299N6065M4253L2672K1253J0464J572m124
$$ 4910078 5012182 5104773 5185581 5253880 5309945 5354198 5386870 5408123 5418587 5420159 5416035
59941E416035o392n728j774O855K0839L9373O1528Q7321J16757J48982J83265
$$ 5416035 5409643 5403915 5402141 5408996 5429835 5469208 5530736 5618057 5734814 5883796 6067061
59930F067061K19764K58228K96725L32761L64948L92412M12987M23271M20345
$$ 6067061 6286825 6545053 6841778 7174539 7539487 7931899 8344886 8768157 9188502
59921I188502M02402L68027L16190K47532J65168P4022k0309j12242j96594k69034
$$ 9188502 9590904 9958931 10275121 10522653 10687821 10761843 10741534 10629292 10432698 10163664
59911A0163664l26555l67853l93321m04434m02989l90943l70677l44687l14844
$$ 10163664 9837109 9469256 9075935 8671501 8268512 7877569 7506892 7162205 6847361
59902F847361k82335k48311k13910j79563j45098j10743p7378m5383j4078J7247
$$ 6847361 6565026 6316715 6102805 5923242 5778144 5667401 5590023 5544640 5530562 5547809
59892E547809M8259P7946J05579J30780J52983J71241J84311J90802J89503J79618
$$ 5547809 5596068 5674014 5779593 5910373 6063356 6234597 6418908 6609710 6799213 6978831
59882F978831J60382J30875R1129M3431q408o1188j12954j61574k04059k37971
$$ 6978831 7139213 7270088 7361217 7404648 7396240 7335052 7222098 7060524 6856465 6618494
59872F618494k62617k78457k86152k86662k81340k71330k57448k40904k23204
$$ 6618494 6355877 6077420 5791268 5504606 5223266 4951936 4694488 4453584 4230380
59863D230380k04972j85813j65766j45910j27099j09151r1932p6115o2189m9726
$$ 4230380 4025408 3839595 3673829 3527919 3400820 3291669 3199737 3123622 3061433 3011707
59853C011707l8491k9291k3002j9540j8527j9798k2453k4496k4715k3949k3351
$$ 3011707 2973216 2943925 2920923 2901383 2882856 2863058 2840605 2816109 2791394 2767445 2744094
59842B744094k2275j9313j4760j0526p873o649o621q277j2021j7433k3506k9112
$$ 2744094 2721819 2702506 2687746 2677220 2669347 2662698 2656077 2647800 2635779 2618346 2594840 2565728
59830B565728l3302l5599l6068l5052l3256l2075l2683l4322l4495l1663k6822
$$ 2565728 2532426 2496827 2460759 2425707 2392451 2360376 2327693 2293371 2258876 2227213 2200391
59819B200391k1685j6370j0179l728J247L872M765N090O123R343J5445K3330L1051
$$ 2200391 2178706 2162336 2152157 2148429 2149676 2153548 2158313 2163403 2169526 2178869 2194314 2217644 2248695
59806B248695L7780M3951M9825N4964N8996O1794O2822O1266N6888N0134M1575
$$ 2248695 2286475 2330426 2380251 2435215 2494211 2556005 2618827 2680093 2736981 2787115 2828690
59795B828690L1975K2598J4542P849K135k199m221l795j678J748O956J4361K3649
$$ 2828690 2860665 2883263 2897805 2905654 2907789 2905590 2901369 2897574 2895896 2897644 2904600 2918961 2942610
59782B942610L4123M5272N7066P0124Q5445J03592J24381J47683J73916K03233
$$ 2942610 2976733 3022005 3079071 3149195 3234640 3338232 3462613 3610296 3784212 3987445
59772C987445K34941K68446L03920L40840L76103M04252M18752M12086L76182
$$ 3987445 4222386 4490832 4794752 5135592 5511695 5915947 6334699 6746785 7122967
59763G122967L05966K04163Q2331m3122j56210k44948l03427l32444l37683l26228
$$ 7122967 7428933 7633096 7715427 7672305 7516095 7271147 6967720 6635276 6297593 5971365
59753E971365l04099k75812k44535k12161j79976j49542j22299r8372p6623n6117
$$ 5971365 5667266 5391454 5146919 4934758 4754782 4605240 4482941 4384569 4307946 4251829
59743D251829l6836j8951k221J3698K8914M3565N7925P2236Q6803J02090J18292
$$ 4251829 4214993 4196042 4193821 4207519 4236433 4279998 4337923 4410159 4496962 4599052 4717344
59732D717344J35025J52085J70192J90377K12794K36876K62371K89589L18940
$$ 4717344 4852369 5004454 5174646 5365023 5577817 5814693 6077064 6366653 6685593
59723F685593L50889L86021M24270M64383N04902N45154N84316O19985O48911
$$ 6685593 7036482 7422503 7846773 8311156 8816058 9361212 9945528 10565513 11214424
59714A1214424O68769O78106O75091O58212O28520N89928N47209N04880M67840
$$ 11214424 11883193 12561299 13236390 13894602 14523122 15113050 15660259 16165139 16632979
59705A6632979M41028M27329M26525M36516M54474M76436M97220N11683N15654
$$ 16632979 17074007 17501336 17927861 18364377 18818851 19295287 19792507 20304190 20819844
59696B0819844N05440M77753M31037L66417K86999J96912J01255N917q3528j62554
$$ 20819844 21325284 21803037 22234074 22600491 22887490 23084402 23185657 23191574 23108046 22945492
59686B2945492k27388k74909l03471l13272l05615k82171k45016j96343j37628
$$ 22945492 22718104 22443195 22139724 21826452 21520837 21238666 20993650 20797307 20659679
59677B0659679o9645O441Q8785J75952K67562L63328M62025N61723O60214P54485
$$ 20659679 20590034 20596475 20685260 20861212 21128774 21492102 21954127 22515850 23176064 23930549
59667B3930549Q40070R11211R61262R82820R68262R10929Q06257O52637M52854
$$ 23930549 24770619 25681830 26643092 27625912 28594174 29505103 30311360 30963997 31416851
59658C1416851K15611m4591l09776n61288p82187r59609j086714j162647j190689
$$ 31416851 31632462 31587871 31278095 30716807 29934620 28975011 27888297 26725650 25534961
59649B5534961j176742j128833j056148r67336q69940p71444o79977o03888n51465
$$ 25534961 24358219 23229386 22173238 21205902 20335962 19564518 18884541 18280653 17729188
59640A7729188n30568n45749n93486o60641p29266p83860q15298q20605q01685
$$ 17729188 17198620 16652871 16059385 15398744 14669478 13885618 13070320 12249715 11448030
59631A1448030p64073p14743o59505o02050n44898m90204m39497l93278l51349
$$ 11448030 10683957 9969214 9309709 8707659 8162761 7672557 7233060 6839782 6488433
59622F488433l13396k79227k48662k21382j96847j74554j54301j36042j19479
$$ 6488433 6175037 5895810 5647148 5425766 5228919 5054365 4900064 4764022 4644543
59613D644543j04144q9915p7099o5872n6146m8089m2280l9046l8141l9300m2692
$$ 4644543 4540399 4450484 4373385 4307513 4251367 4203278 4160998 4121952 4083811 4044511 4001819
59602D001819m8308n5333o2539o9077p4587p8816q1596q3016q3208q2055p9397
$$ 4001819 3953511 3898178 3835639 3766562 3691975 3613159 3531563 3448547 3365339 3283284 3203887
59591C203887p5481p0798o5501n9256n1857m3802l6031k9029k2438j5785r321
$$ 3203887 3128406 3057608 2992107 2932851 2880994 2837192 2801161 2772132 2749694 2733909 2724588
59580B724588l731R23N257R471J2897J5106J6763J8723K0816K2302K3130K3829
$$ 2724588 2720857 2721780 2727037 2736508 2749405 2764511 2781274 2799997 2820813 2843115 2866245 2890074
59568B890074K4466K4730K4871K5690K7478K9832L2540L5910M0144M5206N1395
$$ 2890074 2914540 2939270 2964141 2989831 3017309 3047141 3079681 3115591 3155735 3200941 3252336
59557C252336N9211O8467P8284Q8213R8676J10135J22558J35859J50214J65573
$$ 3252336 3311547 3380014 3458298 3546511 3645187 3755322 3877880 4013739 4163953 4329526
59547D329526J81380J97079K12460K27282K40968K52781K61980K67768K69448
$$ 4329526 4510906 4707985 4920445 5147727 5388695 5641476 5903456 6171224 6440672
59538F440672K66686K59505K48345K34152K17470J96827J69318J34378R6319O1371
$$ 6440672 6707358 6966863 7215208 7449360 7666830 7863657 8032975 8167353 8263672 8325043
59528H325043L2321P599j4701l4205m9841o1720p0061p3885p2066o4513n1254
$$ 8325043 8357364 8364963 8350262 8316057 8266216 8204496 8134435 8060550 7988484 7923971 7872717
59517G872717l1469m729K7643O3487J01284J39518J75386K05286K26271K35953
$$ 7872717 7841248 7836519 7864162 7927649 8028933 8168451 8343837 8549123 8775394 9011347
59507I011347K31817K12063J77133J29351P1162M656o7358j40879k11637k75892
$$ 9011347 9243164 9455227 9632360 9761711 9832873 9837529 9770171 9629292 9417655 9141763
59497I141763l30394l72362m00063m13237m13016m01611l81807l56243l27008
$$ 9141763 8811369 8439007 8038944 7625707 7212691 6811080 6429273 6073030 5746022
59488E746022k95899k64647k34497k05836j78596j52881j28914j06584q5513o5470
$$ 5746022 5450123 5185476 4950979 4745143 4566547 4413666 4284752 4178168 4092655 4027185
59478D027185m6454k8365j0837O594K4255M2201O0272P8419R6917J16064J35693
$$ 4027185 3980731 3952366 3941529 3948123 3972378 4014579 4074851 4153270 4250187 4366251 4501944
59467D501944J55243J74181J92117K08469K22370K32701K37993K36577K27367
$$ 4501944 4657187 4831368 5023485 5231954 5454324 5687025 5925018 6161595 6388962
59458F388962K10375J85967J53978J14285O8072J7822l3874q4781j32559j74895
$$ 6388962 6599337 6785304 6939282 7053567 7121639 7139461 7105587 7020806 6888247 6713352
59448F713352k10295k38099k57815k69310k73636k72639k67484k58351k45740
$$ 6713352 6503057 6264958 6007143 5737833 5464197 5191558 4924074 4665723 4419983
59439D419983k31137k16005k00859j85645j70353j55126j40351j26728j14671
$$ 4419983 4188846 3972841 3771982 3586337 3415984 3260858 3120507 2993779 2879108
59430B879108j03612r2698q2069p2584o4405n6781m9216m1865l4797k7951k1744
$$ 2879108 2775496 2682798 2600729 2528145 2463740 2406959 2357743 2315878 2281081 2253130 2231386
59419B231386j6612j2026p121k099K343O625J1616J6669K0528K4018K8910L3460
$$ 2231386 2214774 2202748 2195627 2193528 2195871 2202496 2214112 2230781 2251309 2275327 2304237 2337697
59407B337697L2279K2663Q822k241p277p349m109J605Q662J6279K5406L6651M6796
$$ 2337697 2369976 2392639 2401461 2399220 2391943 2384594 2380485 2382090 2390752 2407031 2432437 2469088 2515884
59394B515884N0283M5183L6005K9546K9245L4220M2197N1837O2697P4449Q6754
$$ 2515884 2566167 2611350 2647355 2676901 2706146 2740366 2782563 2834400 2897097 2971546 3058300
59383C058300R9674J13800J29750J47544J66795J87484K10235K35708K64193K95856
$$ 3058300 3157974 3271774 3401524 3549068 3715863 3903347 4113582 4349290 4613483 4909339
59373D909339L30760L68422M07843M48097M88180N26045N58568N82768N96358
$$ 4909339 5240099 5608521 6016364 6464461 6952641 7478686 8037254 8620022 9216380
59364I216380N97218N83750N56628N19262M75816M29377L82408L37649K97404
$$ 9216380 9813598 10397348 10953976 11473238 11949054 12378431 12760839 13098488 13395892
59355A3395892K62424K32163K05521J80721J55237J26744R3684N4686Q255m6333
$$ 13395892 13658316 13890479 14096000 14276721 14431958 14558702 14652386 14707072 14715327 14668994
59345A4668994j08433j76366k47298l16616l79188m32241m75952n10720n35412
$$ 14668994 14560561 14384195 14136897 13820281 13441093 13008852 12532900 12022180 11486768
59336A1486768n49140n53034n48845n37234n18805m95451m69047m39883m07988
$$ 11486768 10937628 10384594 9835749 9298515 8779710 8284259 7815212 7375329 6967341
59327F967341l74895l42435l10831k79740k50160k23384j98824j74929j51756
$$ 6967341 6592446 6250011 5939180 5659440 5409280 5185896 4987072 4812143 4660387
59318D660387j30682j11982r4659p8407o3833n0742l8156k6121j5824p657p42
$$ 4660387 4529705 4417723 4323064 4244657 4180824 4130082 4091926 4065805 4049981 4042324 4041582
59307D041582N420J0222J3228J4902J5663J5310J3607J0664O603J621l725r075
$$ 4041582 4047002 4057224 4070452 4085354 4101017 4116327 4129934 4140598 4147201 4148822 4145097 4136022
59295D136022j4744k0754k5833k8535k9058k8717k7921k5789k1631j5572p903
$$ 4136022 4121278 4100524 4074691 4046156 4017098 3988381 3960460 3934671 3913040 3897468 3889565
59284C889565J075J0721K0720L1871M5133O0159P5902R2066J08473J23226J33261
$$ 3889565 3890640 3901361 3922081 3953952 3999085 4059244 4135146 4227212 4335685 4458911 4592172
59273D592172J37230J36681J34307J31929J30018J27835J23611J15586J03167
$$ 4592172 4729402 4866083 5000390 5132319 5262337 5390172 5513783 5629369 5732536
59264E732536Q6740O6769M3889J9457n025k8717n0870p0096q5283r6710j05098
$$ 5732536 5819276 5886045 5929934 5949391 5944366 5915649 5864779 5794683 5709400 5612690 5507592
59253E507592j10245j11928j11371j10232j08669j06018j02860j00600r9300r7792
$$ 5507592 5397347 5285419 5174048 5063816 4955147 4849129 4746269 4645669 4546369 4448577
59243D448577r5759r3836r1798q8526q3958p9218p4626o9162o2208n4239m5573
$$ 4448577 4352818 4258982 4167184 4078658 3994700 3915482 3840856 3771694 3709486 3655247 3609674
59232C609674l5999k5712j5184l927R000K3303L7917N3185P0801R1385J13958
$$ 3609674 3573675 3547963 3532779 3528852 3537852 3561155 3599072 3652257 3723058 3814443 3928401
59221C928401J38071J64504J93435K23883K55527K89111L24158L57887L87211
$$ 3928401 4066472 4230976 4424411 4648294 4903821 5192932 5517090 5874977 6262188
59212F262188M10188M24683M27298M14847L85948L40534K79238K04179J19246
$$ 6262188 6672376 7097059 7524357 7939204 8325152 8665686 8944924 9149103 9268349
59203I268349K8647o3998j54778k39017l12415l71858m14929m40172m48476m43037
$$ 9268349 9296996 9232998 9078220 8839203 8526788 8154930 7740001 7299829 6851353 6408316
59193F408316m27300m03881l75515l45160l14414k83248k52151k23159j97940
$$ 6408316 5981016 5577135 5201620 4856460 4542046 4258798 4006647 3783488 3585548
59184C585548j76189j56813j39467j24072j10066r7133q5618p5404o5519n5608
$$ 3585548 3409359 3252546 3113079 2989007 2878941 2781808 2696190 2620786 2555267 2499659
59174B499659m6656l9381l3000k6535k0248j4821j0094n575j409K148N459Q910
$$ 2499659 2453003 2413622 2380622 2354087 2333839 2319018 2308924 2303349 2301940 2304088 2309547 2318457
59162B318457J2299J5537J9165K3457K7748L1418L4806L8502M2367M5792M8397
$$ 2318457 2330756 2346293 2365458 2388915 2416663 2448081 2482887 2521389 2563756 2609548 2657945
59151B657945N0038N0769N1035N1142N0407M7720M3077L7548L1605K4777J7130
$$ 2657945 2707983 2758752 2809787 2860929 2911336 2959056 3002133 3039681 3071286 3096063 3113193
59140C113193R655K801m017j0967j7199k2195k6309k9485l0896l0506k9509k8440
$$ 3113193 3122848 3125649 3121632 3110665 3093466 3071271 3044962 3015477 2984581 2954075 2924566 2896126
59128B896126k6339k2571j7960j3208p613m70P548J5395K2993L0690L8487M6558
$$ 2896126 2869787 2847216 2829256 2816048 2808435 2807965 2815513 2830908 2853901 2884591 2923078 2969636
59116B969636N5319O4262P2132P8960Q6339R4783J02562J08426J13824J20887
$$ 2969636 3024955 3089217 3161349 3240309 3326648 3421431 3523993 3632419 3746243 3867130
59106C867130J29538J38192J46113J53525J60374J66636J73014J79990J86792
$$ 3867130 3996668 4134860 4280973 4434498 4594872 4761508 4934522 5114512 5301304
59097E301304J92359J96323J97942J95120J85831J69527J46006J14112P3168K4924
$$ 5301304 5493663 5689986 5887928 6083048 6268879 6438406 6584412 6698524 6771692 6796616
59087F796616k7269q0365j31584j77692k16101k46050k67461k79656k82708k79002
$$ 6796616 6769347 6688982 6557398 6379706 6163605 5917555 5650094 5370438 5087730 4808728
59077D808728k71558k61385k48062k32235k15723j99622j84000j69172j55667
$$ 4808728 4537170 4275785 4027723 3795488 3579765 3380143 3196143 3026971 2871304
59068B871304j43185j31075j19658j09739j01064r2634q4314p6806p0254o4145
$$ 2871304 2728119 2597044 2477386 2367647 2266583 2173949 2089635 2012829 1942575 1878430
59058A878430n8460n3665m9721m6105m2638l9320l5776l1893k8511k6390k4881
$$ 1878430 1819970 1766305 1716584 1670479 1627841 1588521 1552745 1520852 1492341 1465951 1441070
59047A441070k2838k0364j8467j7386j6529j5708j5165j4653j3720j2702j2140
$$ 1441070 1418232 1397868 1379401 1362015 1345486 1329778 1314613 1299960 1286240 1273538 1261398
59036A261398j1543r964p626n662m331k722l09K354M577O260P587Q793J0188J1719
$$ 1261398 1249855 1239891 1232265 1226603 1222272 1219550 1219241 1221595 1226172 1232432 1240019 1248812 1259000 1270719
59022A270719J2692J2598J1939J1471J1042R928P979N582K939L64j151p81R43
$$ 1270719 1283411 1296009 1307948 1319419 1330461 1340389 1348368 1353950 1356889 1357253 1356102 1355321 1356264
59009A356264K655L704M449N361O652Q424J0324J1384J1010R729Q288O518L941
$$ 1356264 1358919 1362623 1367072 1372433 1379085 1387509 1397833 1409217 1420227 1429956 1438244 1444762 1448703
58996A448703Q85j987m748p836j0969j3338j4503j4435j3180j1261r725q962q067
$$ 1448703 1449588 1447601 1442853 1435017 1424048 1410710 1396207 1381772 1368592 1357331 1347606 1338644 1330577
58983A330577o228l997k297j027L08J469K150K984M545O077O586O585P371R102
$$ 1330577 1324349 1320352 1318055 1317028 1317336 1318805 1320955 1323939 1328484 1334561 1341147 1347732 1355103 1364205
58969A364205J0919J2529J4216J5754J6693J7356J8319J9243J9420J9072J8889
$$ 1364205 1375124 1387653 1401869 1417623 1434316 1451672 1469991 1489234 1508654 1527726 1546615
58958A546615J8756J8258J7876J8343J9274J9842K0344K1596K3295K4556K5667
$$ 1546615 1565371 1583629 1601505 1619848 1639122 1658964 1679308 1700904 1724199 1748755 1774422
58947A774422K7623L0143L1953L2966L4523L7309M0548M3483M6274M9123N1774
$$ 1774422 1802045 1832188 1864141 1897107 1931630 1968939 2009487 2052970 2099244 2148367 2200141
58936B200141N4204N6867N9987O3439O7299P1778P6758Q2120Q8270R5520J03447
$$ 2200141 2254345 2311212 2371199 2434638 2501937 2573715 2650473 2732593 2820863 2916383 3019830
58925C019830J11733J21038J32023J44147J56609J69830J84753K01287K18866
$$ 3019830 3131563 3252601 3384624 3528771 3685380 3855210 4039963 4241250 4460116
58916D460116K37905K59183K82311L06452L32152L60780L92402M25837M60567
$$ 4460116 4698021 4957204 5239515 5545967 5878119 6238899 6631301 7057138 7517705
58907G517705M96910N34323N71232O06429O39149O67526O88302O98097O93777
$$ 7517705 8014615 8548938 9120170 9726599 10365748 11033274 11721576 12419673 13113450
58898A3113450O71995O29947N66812M83433L81083K62087J31411l954j37306k62933
$$ 13113450 13785445 14415392 14982204 15465637 15846720 16108807 16240218 16236264 16098958 15836025
58888A5836025l75335m69889n44521n99383o35067o52580o54601o44848o25961
$$ 15836025 15460690 14990801 14446280 13846897 13211830 12559250 11904649 11259801 10633840
58879A0633840n99451n67498n32949m97462m61414m25825l92704l63175l36712
$$ 10633840 10034389 9466891 8933942 8436480 7975066 7549241 7156537 6793362 6456650
58870F456650l12500k90225k69557k50204k32592k17170k03180j89457j76156
$$ 6456650 6144150 5853925 5584368 5334164 5101572 4884402 4681222 4491765 4315609
58861D315609j64145j53022j41581j30042j19890j11402j03277r4782q6562p8979
$$ 4315609 4151464 3998442 3856861 3726819 3606929 3495527 3392250 3297468 3210906 3131927
58851C131927p1513o4049n7130n0681m4049l7445l1699k6527k0744j4274q151
$$ 3131927 3060414 2996365 2939235 2888554 2844505 2807060 2775361 2748834 2728090 2713816 2705665
58840B705665k514L478R636J4737J8822K3414K8978L4205L8435M2773M8137N3960
$$ 2705665 2703151 2706629 2716265 2731002 2749824 2773238 2802216 2836421 2874856 2917629 2965766 3019726
58828C019726N9659O5642P2126P8579Q5076R2698J01887J11812J21898J32511
$$ 3019726 3079385 3145027 3217153 3295732 3380808 3473506 3575393 3687205 3809103 3941614
58818C941614J43818J55557J68408J83845K02067K21697K42088K64279K89209
$$ 3941614 4085432 4240989 4409397 4593242 4795309 5017006 5259094 5523373 5812582
58809E812582L16665L46576L79502M15178M52231M89935N28576N67312O03426
$$ 5812582 6129247 6475823 6855325 7270503 7722734 8212669 8741245 9308557 9911983
58800I911983O34379O58812O74661O78000O64836O32749N80150N05846M10615
$$ 9911983 10546362 11205174 11879835 12557835 13222671 13855420 14435570 14941416 15352031
58791A5352031K98041J72970M0235r4550k24633l43669m46925n30942n93777o36143
$$ 15352031 15650072 15823042 15863277 15768727 15544094 15200425 14753500 14222558 13628781 12992638
58781A2992638o60797o70073o65333o48926o24632n95429n62516n27158m91647
$$ 12992638 12331841 11661768 10996435 10347509 9722877 9127448 8564932 8037774 7546127
58772G546127m57597m25108l94412l66502l41283l17068k93034k70466k50503
$$ 7546127 7088530 6663422 6269010 5902508 5561225 5244157 4951123 4680657 4430154
58763D430154k32328k14784j98133j83007j69060j55895j43986j33614j24083
$$ 4430154 4197826 3983042 3784909 3601902 3432842 3276947 3132961 2999347 2875264
58754B875264j14855j06182r7895q9131p9983p1882o5477n9730n3927m8782m4652
$$ 2875264 2760409 2654227 2556332 2467201 2387218 2315336 2249859 2190129 2136202 2087420 2042768
58743B042768m0429l5428l0661k7122k4315k1620j9496j8168j6782j5089j4340
$$ 2042768 2002339 1966911 1936250 1909128 1884813 1863193 1843697 1825529 1808747 1793658 1779318
58732A779318j5278j6754j7588j8254j9397k0245k0015j9475j9599j9856j9338
$$ 1779318 1764040 1747286 1729698 1711444 1692047 1671802 1651787 1632312 1612713 1592857 1573519
58721A573519j8583j8851k0438k2784k5384k7707k9216l0274l1950l4225l5622
$$ 1573519 1554936 1536085 1515647 1492863 1467479 1439772 1410556 1380282 1348332 1314107 1278485
58710A278485l5254l3900l2469l0827k8873k7115k5441k2954j9820j7644j7133
$$ 1278485 1243231 1209331 1176862 1146035 1117162 1090047 1064606 1041652 1021832 1004188 987055
58699I87055j7075j6456j5771j5424j4783j3802j3622j4459j4849j4043j3256
$$ 987055 969980 953524 937753 922329 907546 893744 880122 865663 850814 836771 823515
58688H23515j3338j3332j2488j1695j1502j0858r206p708o948n495k453O99K513
$$ 823515 810177 796845 784357 772662 761160 750302 741096 733388 726440 720945 718492 719191 721704
58675G21704L810N669P178P276O940P541Q483Q492P779P072N945L865J628J40
$$ 721704 725514 731183 738361 745637 752577 760118 768601 777093 784872 791944 797889 801754 803382 803522
58661H03522r23k014k767l362m968p528r148q984q586q900q503o577m936m971
$$ 803522 802599 800585 797818 794456 789488 781960 772812 763828 755242 746342 737839 731262 726326 721355
58647G21355n137l884k631l070l855k884r24J41P88K585M853N753N511N726O587
$$ 721355 716218 712334 709703 706633 702778 699894 698970 699111 699899 702484 707337 713090 718601 724327 730914
58632G30914P303Q191R854J1422J2046J2856J5134J7950K0044K2518K7146L3656
$$ 730914 738217 746408 756262 767684 779730 792586 807720 825670 845714 868232 895378 929034
58620I29034M1213N0872O3358P5982Q5130R0844R5943J01638J07124J12579J19279
$$ 929034 970247 1021119 1084477 1160459 1245589 1336433 1432376 1534014 1641138 1753717 1872996
58609A872996J27355J36182J46432J58960J72371J84264J94164K02595K08135
$$ 1872996 2000351 2136533 2282965 2441925 2614296 2798560 2992724 3195319 3403454
58600C403454K08096K01221J87182J64524J32147R2124M8315L038m2326q4665
$$ 3403454 3611550 3812771 3999953 4164477 4296624 4388748 4437063 4440101 4397775 4313110
58590D313110j20395j48669j70374j84884j90952j90066j85522j78569j68595
$$ 4313110 4192715 4044046 3873672 3688788 3497836 3307770 3122248 2943679 2775084
58581B775084j56469j44372j32541j19519j05555r2699q1567p0979o0818n2349
$$ 2775084 2618615 2474243 2341702 2222183 2116628 2023929 1942362 1871383 1810565 1758216
58571A758216m5654l9552l4030l0205k7876k5672k3441k1950k0616j8170j5214
$$ 1758216 1712562 1673010 1638980 1608775 1580899 1555227 1531786 1509836 1489220 1471050 1455836
58560A455836j3358j2232j0213p887p734j0417j4217j8171k2923k8216l2294l4189
$$ 1455836 1442478 1430246 1420033 1412146 1404412 1393995 1379778 1361607 1338684 1310468 1278174 1243985
58548A243985l4446l3489l1409k9173k7827k6682k4353k1090j8086j5237j1926
$$ 1243985 1209539 1176050 1144641 1115468 1087641 1060959 1036606 1015516 997430 982193 970267
58537I70267r099p986p694o722n920p003r087r828r308r536j0738j1324j1055
$$ 970267 961168 953182 945488 938766 932846 925843 916756 906928 897620 888084 877346 866022 854967
58524H54967j1036j1049j0099r124r927j1844j2674j2391j2632j3079j1949r708
$$ 854967 843931 832882 822783 813659 803732 791888 779214 766823 754191 741112 729163 719455
58512G19455q691r209r406q795q413p809n522k421r53j111p04O09J141R49J860
$$ 719455 710764 701555 692149 683354 674941 667132 661610 659189 658236 657125 656421 657030 658171 659120 660980
58497F60980L688M257L417L304M424N158N347O640Q876R862R198Q782R209R116
$$ 660980 664668 668925 672342 675646 680070 685228 690575 697215 706091 715953 725151 733933 743142 752258
58483G52258Q382Q371Q837Q112O468N692N365L423L61j206j228k222m472n620
$$ 752258 760640 769011 777848 785960 792428 798120 803485 806908 807269 806063 804835 802613 798141 792521
58469G92521n372o167q509j0076j0124j0468j1351j0801q929q424r737j0112q525
$$ 792521 787149 780982 772473 762397 752273 741805 730454 719653 710724 702300 692563 682451 673926
58456F73926p198p154o610m989m209m562l671r62R77R47R78K234L145L037L575
$$ 673926 666728 659574 652964 647975 643766 639204 635533 634571 635548 636495 637473 639707 642852 645889 649464
58441F49464N119N642M723M727O657Q659R794J1335J3214J3480J2391J2672J4406
$$ 649464 654583 660225 664948 669675 676332 684991 694785 706120 719334 732814 745205 757877 772283
58428G72283J4223J0947P447N349K626j680n004n639n263n117l867j215N61O42
$$ 772283 786506 797453 804900 810249 812875 811195 806191 800552 795289 790172 786305 785090 785651 786293
58414G86293J167K960L889L091K611L248L237K561L910P495R765R174Q519R570
$$ 786293 787460 790420 794309 797400 800011 803259 806496 809057 812967 820462 830227 839401 847920 857490
58400H57490J0243R224Q404Q429O692K281j757l572n206p905r481q830q259q900
$$ 857490 867733 876957 885361 893790 900482 902763 901006 897434 892228 884323 874842 866012 857753 848853
58386H48853q551o461n308o009n678l222j753k725l033q18J150R71J190L568N487
$$ 848853 840302 833841 828533 822524 816846 813624 811871 809146 806113 805295 806445 807416 808606 812174 817661
58371H17661M945M205N104N674M669M530O578Q122P521P172Q508R217Q346Q753
$$ 817661 822606 826811 831915 837589 842258 846788 853366 861488 869009 876181 884689 893906 902252 911005
58357I11005J1382J2837J1783J1814J4532J6025J4082J2592J4535J6744J6142
$$ 911005 922387 935224 947007 958821 973353 989378 1003460 1016052 1030587 1047331 1063473
58346A063473J5164J6261J6745J4080J0722Q996O554J654k535l520l975o128p212
$$ 1063473 1078637 1094898 1111643 1125723 1136445 1145441 1151995 1153649 1151114 1147594 1143619 1137491 1130279
58333A130279n052k502j865o64K627M755M126M570Q068J0424R199Q860J2650J6350
$$ 1130279 1125227 1122725 1120860 1120196 1122823 1127578 1131704 1136274 1144342 1154766 1163965 1172825 1185475 1201825
58319A201825J6096J5378J8061K1284K1709K2093K5057K6962K4782K2466K3755
$$ 1201825 1217921 1233299 1251360 1272644 1294353 1316446 1341503 1368465 1393247 1415713 1439468
58308A439468K5202K3062K0379K0340J9449J4530R713R047R004N794L157N194
$$ 1439468 1464670 1487732 1508111 1528451 1547900 1562430 1572143 1581190 1590194 1595988 1599145 1604339
58296A604339Q441Q887R839J4706J9168J8828J7652K0351K3572K3133K2620K5937
$$ 1604339 1612780 1621667 1631506 1646212 1665380 1684208 1701860 1722211 1745783 1768916 1791536 1817473
58284A817473K8829K7000K5079K8203L2234L1972L1297L5234L9751L9707L9172
$$ 1817473 1846302 1873302 1898381 1926584 1958818 1990790 2022087 2057321 2097072 2136779 2175951
58273B175951M3382M8317M8870M9319N4730O0172N9742N7916O0437O2547N8258
$$ 2175951 2219333 2267650 2316520 2365839 2420569 2480741 2540483 2598399 2658836 2721383 2779641
58262B779641N2630N2444N3539N0058M7123N1051N6326N6073N5917O3139P1775
$$ 2779641 2832271 2884715 2938254 2988312 3035435 3086486 3142812 3198885 3254802 3317941 3389716
58251C389716P3478P3465Q0116Q8476R0265R0501R7513J06290J08767J10591J20128
$$ 3389716 3463194 3536659 3616775 3705251 3795516 3886017 3983530 4089820 4198587 4309178 4429306
58240D429306J31232J34990J37802J49092J62260J67493J71826J85893K02754
$$ 4429306 4560538 4695528 4833330 4982422 5144682 5312175 5484001 5669894 5872648
58231E872648K11389K18889K36737K57721K70167K81943L05639L33465L52716
$$ 5872648 6084037 6302926 6539663 6797384 7067551 7349494 7655133 7988598 8341314
58222H341314L71901M04297M40641M67065M94334N38700N90328O33289O79342
$$ 8341314 8713215 9117512 9558153 10025218 10519552 11058252 11648580 12281869 12961211
58213A2961211P47150Q26659R01127R84656J098035J229043J359916J511062J710943
$$ 12961211 13708361 14535020 15436147 16420803 17518838 18747881 20107797 21618859 23329802
58204B3329802J948478K206862K516615K918809L408097L976903M682427N600751
$$ 23329802 25278280 27485142 30001757 32920566 36328663 40305566 44987993 50588744
58196E0588744O757335Q184156R991335J2275781J5009740J8138680K1728857
$$ 50588744 57346079 65530235 75521570 87797351 102807091 120945771 142674628
58189A42674628K5883373L0596572L5809564M1272505M5749814M6398735L9907872
$$ 142674628 168558001 199154573 234964137 276236642 321986456 368385191 408293063
58182D08293063K5234355N313034j4402143k9335410l7910196m1012596m0312329
$$ 408293063 433527418 438840452 424438309 395102899 357192703 316180107 275867778
58175B75867778l7296139l3147916k8722910k4467440k0552996j7093349j4147553
$$ 275867778 238571639 205423723 176700813 152233373 131680377 114587028 100439475
58168A00439475j1638371r445945p539084n910934m472645l128590j866183o58545
$$ 100439475 88801104 79355159 71816075 65905141 61432496 58303906 56437723 55779178
58160E5779178N79290J731748K278642J644227j65188k428282m276685n293970
$$ 55779178 56358468 58090216 60368858 62013085 61847897 59419615 55142930 49848960
58152D9848960n564301n349401m866291m271498l675125l126257k634717k211822
$$ 49848960 44284659 38935258 34068967 29797469 26122344 22996087 20361370 18149548
58144A8149548j866693j585576j348223j151223r94434q63355p45152o44634n67798
$$ 18149548 16282855 14697279 13349056 12197833 11203399 10340044 9594892 8950258 8382460
58135H382460n06629m53354m11952l83769l59387l34572l16518l05735k90242
$$ 8382460 7875831 7422477 7010525 6626756 6267369 5932797 5616279 5310544 5020302
58126E020302k65698k42758k26797k08936j84854j63773j50607j37108j19145
$$ 5020302 4754604 4511846 4285049 4076113 3891259 3727486 3576879 3439771 3320626
58117C320626j05899j03455j04948j04502j05863j10092j09745j02416r6056r4386
$$ 3320626 3214727 3111272 3006324 2901822 2795959 2685867 2576122 2473706 2377650 2283264
58107B283264r0719q2032p5220p3479p0131o2015n5702n4452n1885m4608l8720
$$ 2283264 2192545 2110513 2035293 1961814 1891683 1829668 1773966 1719514 1667629 1623021 1584301
58096A584301l7906l6964l2791l0205l1396l0819k5992k2578k3719k4842k3625
$$ 1584301 1546395 1509431 1476640 1446435 1415039 1384220 1358228 1335650 1311931 1287089 1263464
58085A263464k4484k8708l0723k8682k8262l1630l3018k9769k7213k8043k7281
$$ 1263464 1238980 1210272 1179549 1150867 1122605 1090975 1057957 1028188 1000975 972932 945651
58074I45651k2659j9649k1046k1474j7556j4091j4641j5100j2115r301r675j0009
$$ 945651 922992 903343 882297 860823 843267 829176 814535 799435 787320 778019 768344 758335
58062G58335p899o638q113q456n531l462n173p481p800q610j1130j1737q820o394
$$ 758335 750436 743798 735685 727229 721698 718236 713063 705582 697782 689172 678042 666305 657485 651091
58048F51091o953p451n931n275o762o926m441l245n201o424m597l063m084m703
$$ 651091 644138 636687 630756 625481 618719 611793 607352 604107 598906 592482 587885 584822 580738 576035
58034E76035k969j605j977j106J811K625m27l232l091k865m275m094q28J567P47
$$ 576035 573066 571461 569484 568378 570189 572814 572387 569155 566064 563199 558924 554830 554002 555569 556316
58019E56316K29K489M235K841J216J918K449P44n15N72R98j417l725l509l301
$$ 556316 556545 559034 563269 566110 567326 569244 571693 572437 571922 572494 573492 572075 568350 564841 561540
58004E61540n139o255m533k895l824m592k527k2J45k46J004K049J053K47J697
$$ 561540 556401 550146 545613 542718 538894 534302 531775 531753 531898 531652 532656 534705 535758 536005 537702
57989E37702L165K293Q60R78J052o65k513k970l751n946p214o111m999n387m865
$$ 537702 540867 543160 544020 544998 546050 545385 542872 539902 536151 530205 522991 516880 511881 506494 501629
57974E01629j954N32M66J31J498K436J257M05J735K778J574O10J884K670N78j628
$$ 501629 499675 500207 500673 500804 502302 504738 505995 506400 508135 510913 512487 513097 514981 517651 518229 516601
57958E16601q30R58N30j040j406j761l886n862n291l741l703m101k960j541j707
$$ 516601 515771 516729 517259 516219 514813 513052 509166 503304 498013 494272 490569 486468 483508 481967 480260
57943D80260k072o62J349K189K770M026M094J712p60j201j336l065m695m545m639
$$ 480260 478188 477526 478875 481064 483834 487860 491954 493666 492906 491705 490369 487304 482609 478064 473425
57928D73425p006r674j0290j0291j1607j2646j1653j0517j1114j1298q821n897
$$ 473425 466419 456745 446455 436164 424557 411911 400258 389741 378627 367329 358508 352611
57916C52611n301n276l069l46j56j291o25J412K491L149N102P024O827O021P222
$$ 352611 347310 342034 338965 338619 338463 337172 336547 337959 340450 343599 348701 355725 362552 368573 375795
57901C75795R234R173P610P059P226O201M736M798N434M437K629K265K601J301
$$ 375795 385029 394202 401812 408871 416097 422298 427034 431832 437266 441703 444332 446597 449198 450499
57887D50499j136k456k859m117n785o180n892o559p407o636m984m338m253l354
$$ 450499 449363 446907 444048 439931 434146 427966 422074 415515 408108 401472 396488 392150 387897 384543
57873C84543k547l176l666j834J023K186K132L203N161O018N943O435O868N700
$$ 384543 381996 378820 375154 373320 374343 376529 378661 381864 387025 393043 398986 405421 412289 417989
57859D17989L880L264K977J172r63r52M28M30r95j803k012l225m850m842l541
$$ 417989 421869 425133 428110 429282 428319 427367 427795 428225 427230 425427 423415 420190 415340 410498 406957
57844D06957l039l359k913j913j742j751l65J480J645O35N28J041L70j021j317
$$ 406957 403918 400559 397646 395733 393991 392240 391875 393355 395000 395635 396163 397204 397574 396553 395236
57829C95236j179k695n246o358o120o803q566r419r126r275r816r220p944p969
$$ 395236 394057 391362 386116 379758 373638 366835 358269 348850 339724 330449 320633 311413 303469 295500
57815B95500r074r069p638o523o103n123l606k688j940r7J960K346J790K677M990
$$ 295500 286426 277357 269719 263196 257093 251970 248364 245676 243736 243639 245599 247945 249735 252412 257402
57800B57402O661P443Q759J0041R032N695K266l61k939m812m295k017l64L69J849
$$ 257402 264063 271506 280265 290306 299338 305033 307299 306938 303999 299187 294892 292875 292511 292880 294729
57785B94729L948M732M117L945M408L860K143O08r76l925p216q373p698p818r028
$$ 294729 298677 303409 307526 311471 315879 319739 321882 322490 321514 317589 310373 302000 294302 286484 277456
57770B77456r094p790p424q397q373o672n470n661n375l746k461k343j856k35
$$ 277456 268362 260572 253148 244751 236378 229706 224236 218575 213200 209454 206993 204650 202794 202559
57756B02559J081J375K024L867O240R486J5277K3251L0151L3415L3097K9767K3563
$$ 202559 203640 205015 207039 210906 217146 226632 241909 265160 295311 328726 361823 391590 415153
57743D15153J6136J0340O781L396o81l780m935n477o314o570n949n721o207o001
$$ 415153 431289 441629 448410 451806 451125 447345 442410 436933 430619 424049 418100 412379 406172 400171
57729D00171m720l881m094l974k748j369k27J521L582M268L537L458M802N892
$$ 400171 395451 391570 387476 383502 380754 379385 379158 380679 384261 388529 392066 395524 400326 406218
57715D06218N805N829O693P200O799O839Q010R042R105R026R186Q760Q036Q806
$$ 406218 412023 417852 424545 431745 438544 445383 453393 462435 471540 480566 489752 498512 506548 515354
57701E15354J1281J3294J3695J4006J5545J7456J8845K0401K2652K4908K6992
$$ 515354 526635 539929 553624 567630 583175 600631 619476 639877 662529 687437 714429
57690G14429K9826L3401L6557L9521M4081N0459N6784O2565O9798P9565R0534
$$ 714429 744255 777656 814213 853734 897815 948274 1005058 1067623 1137421 1216986 1307520
57679A307520J01960J15199J30960J47986J65873J86205K09290K32552K53764
$$ 1307520 1409480 1524679 1655639 1803625 1969498 2155703 2364993 2597545 2851309
57670B851309K73069K90265L02929L08570L04923K85829K40884J63928O1511m9015
$$ 2851309 3124378 3414643 3717572 4026142 4331065 4616894 4857778 5021706 5083217 5034202
57660E034202j48886k25132k72770k94377k97200k88236k71640k50412k27896
$$ 5034202 4885316 4660184 4387414 4093037 3795837 3507601 3235961 2985549 2757653
57651B757653k06138j84893j64051j45223j29472j15533j01942q9149p8036o8173
$$ 2757653 2551515 2366622 2202571 2057348 1927876 1812343 1710401 1621252 1543216 1475043
57641A475043n9103n1435m5183l8835l1612k4787j9377j4497r345m670q22L505
$$ 1475043 1415940 1364505 1319322 1280487 1248875 1224088 1204711 1190214 1180869 1176199 1175377 1178882
57629A178882Q874J3719J7083K0534K5589L1341L6625M2428M9997N8518O6899
$$ 1178882 1187756 1201475 1218558 1239092 1264681 1296022 1332647 1375075 1425072 1483590 1550489
57618A550489P6088Q7416J00121J12614J24758J36972J48540J58500J66733J72335
$$ 1550489 1626577 1713993 1814114 1926728 2051486 2188458 2336998 2495498 2662231 2834566
57608B834566J72642J65579J51433J30638J01896O4777K2513k0035n9890r5582
$$ 2834566 3007208 3172787 3324220 3454858 3556754 3621531 3644044 3624009 3564119 3468537
57598C468537j25150j47018j61761j70806j74316j72288j66429j58864j49996
$$ 3468537 3343387 3196369 3034608 2863802 2689486 2517198 2350769 2191905 2041909
57589B041909j39475j28185j17396j07101r7067q8316q1621p5611o8450o0585
$$ 2041909 1902434 1774249 1656853 1549752 1452685 1364369 1282748 1207137 1138687 1078102
57579A078102n3937m9078m5010m1037l7262l3703l0360k7571k5281k2802k0074
$$ 1078102 1024165 975087 930077 889040 851778 818075 787715 760144 734863 712061 691987
57568F91987j8049j6997j5798j3836j1943j0541q730o357n008n420n896m902l332
$$ 691987 673938 656941 641143 627307 615364 604823 596093 589736 584728 579308 573412 568510 565178
57555E65178k481j718j09J547K277K801L902M705M634N207P622J0292J1245J1302
$$ 565178 562697 560979 560870 562417 564694 567495 571397 576102 580736 585943 593565 603857 615102 626404
57541F26404J2415J4352J5621J6420J7916J9680K0521K1015K2780K5835K8936
$$ 626404 638819 653171 668792 685212 703128 722808 743329 764344 787124 812959 841895
57530H41895L1834L5183L8948M2929M7937N4576O1791O8564P5872Q4973R4895
$$ 841895 873729 908912 947860 990789 1038726 1093302 1155093 1223657 1299529 1384502 1479397
57519A479397J03893J12199J20874J28891J33841J34903J32581J26112J13525
$$ 1479397 1583290 1695489 1816363 1945254 2079095 2213998 2346579 2472691 2586216
57510B586216R4086O8738L8687N531k7655n7486q2466j02623j17673j27060j31149
$$ 2586216 2680302 2749040 2787727 2793258 2765603 2708117 2625651 2523028 2405355 2278295 2147146
57499B147146j30848j26751j19841j11904j03869r5024q5250p6394o9643o3458
$$ 2147146 2016298 1889547 1769706 1657802 1553933 1458909 1373659 1297265 1227622 1164164
57489A164164n6157m8789m3100l8380l3048k7677k3658k0187j5610j0615p008
$$ 1164164 1108007 1059218 1016118 977738 944690 917013 893355 873168 857558 846943 839935
57478H39935m330p78L345O264Q161J0955J4983J8855K2247K6093L0373L4380L8780
$$ 839935 835605 834827 838172 844436 852597 863552 878535 897390 919637 945730 976103 1010483 1049263
57465A049263M4741N1580N7974O4851P4078Q4802R4369J02497J11236J20752J28472
$$ 1049263 1094004 1145584 1203558 1268409 1342487 1427289 1521658 1624155 1735391 1856143 1984615
57454A984615J32675J33682J30942J22102J05911Q3518N6267K4690r577m3253
$$ 1984615 2117290 2250972 2381914 2504016 2609927 2693445 2749712 2774402 2764825 2721572
57444B721572p3611r9390j19421j32525j39197j41266j39606j34158j26081j17533
$$ 2721572 2647961 2548571 2429150 2296625 2157428 2016162 1876556 1742398 1616317 1498784
57434A498784j09161j00112r0669q2406p5558o8771o1805n5980n1515m6929m1677
$$ 1498784 1389623 1289511 1198842 1116436 1040878 972107 910302 854322 802807 755878 714201
57423G14201l6998l3595l0646k7724k5447k3708k1423j8600j6495j5285j3758
$$ 714201 677203 643608 612962 585238 559791 536083 514660 496060 479565 464280 450522
57412D50522j1765j0659j0762j0663r661q722q338p621o308n479n500n228m055
$$ 450522 438757 428098 417336 406673 397012 388290 379952 372331 366023 360544 355044 349816 345761
57399C45761k882k414k269k280k787l204k358p17j23r09j401p77p6J51P81J881
$$ 345761 342879 340465 338196 335916 333129 329925 327567 326850 326727 325818 324417 323640 323564 323715 324496 326377
57383C26377K042R83M36J322K225J851R54N95M68K26N10J422J729Q53l2k2Q0n19
$$ 326377 328419 329402 329838 331160 333385 335236 336190 336785 337253 337479 337989 339411 341140 341993 341961 341939 342019 341500
57365C41500j131j025p75r65j054o38l90o42n23M50J426J773K081K657K632J755
$$ 341500 340369 339344 338569 337604 336550 335912 335522 334880 334357 334807 336233 338006 340087 342744 345376 347131
57349C47131J381K460L964M602M744N256N801N640N135N054N226N067M722M641
$$ 347131 348512 350972 354936 359538 364282 369538 375339 380979 386114 391168 396394 401461 406183 410824
57335D10824M732M687M566M421M132M006M597N615O083N911O157P301Q509R049
$$ 410824 415556 420243 424809 429230 433362 437368 441965 447580 453663 459574 465731 473032 481541 490590
57321D90590R102Q816Q001P172P453Q752R535R019Q257Q396R191R914J0413J0630
$$ 490590 499692 508508 516509 523681 531134 539886 549421 558440 566697 575093 584284 594198 604611 615241
57307F15241J0289R733R893J0881J1708J1828J1696J1636J1438J1370J2191J3773
$$ 615241 625530 635263 645156 656037 667745 679573 691269 702905 714343 725713 737904 751677
57295G51677J5196J6291J7599J8750J8817J8481J9730K2811K5549K6383K6221
$$ 751677 766873 783164 800763 819513 838330 856811 876541 899352 924901 951284 977505
57284I77505K6459K7068K7553K8132K8930K9428K9482K9589K9687K9109K8006
$$ 977505 1003964 1031032 1058585 1086717 1115647 1145075 1174557 1204146 1233833 1262942 1290948
57273A290948K7092K5802K2640J7738J2953Q999M649o84n819r913j3419j6223
$$ 1290948 1318040 1343842 1366482 1384220 1397173 1406172 1410821 1410137 1404318 1394405 1380986 1364763
57261A364763j7142j6159j4864j3871j2026r049o411m677k549L87K651L714N170
$$ 1364763 1347621 1331462 1316598 1302727 1290701 1281652 1275241 1270564 1268015 1268402 1271053 1274767 1279937
57248A279937P620R248R140R205J0878J2620J2853J2782J3998J5615J6268J6767
$$ 1279937 1287557 1296805 1305945 1315150 1326028 1338648 1351501 1364283 1378281 1393896 1410164 1426931
57236A426931J8195J9332J8661J7248J7075J8014J8836J9685K1163K2426K2640
$$ 1426931 1445126 1464458 1483119 1500367 1517442 1535456 1554292 1573977 1595140 1617566 1640206
57225A640206K2941K4562K6342K6551K5864K6001K6642K6326K5359K5233K5918
$$ 1640206 1663147 1687709 1714051 1740602 1766466 1792467 1819109 1845435 1870794 1896027 1921945
57214A921945K6161K5892K5944K6076K5494K4750K4915K5460K5081K4122K4060
$$ 1921945 1948106 1973998 1999942 2026018 2051512 2076262 2101177 2126637 2151718 2175840 2199900
57203B199900K4975K5653K5816K6317K7300K7998K8169K8224K8131K7579K6895
$$ 2199900 2224875 2250528 2276344 2302661 2329961 2357959 2386128 2414352 2442483 2470062 2496957
57192B496957K6631K6687K6887K7604K8726K9075K8180K7499K8317K9523K9166
$$ 2496957 2523588 2550275 2577162 2604766 2633492 2662567 2690747 2718246 2746563 2776086 2805252
57181B805252K7306K5606K4962K5087K5662K6260K5954K4578K3582K4185K5607
$$ 2805252 2832558 2858164 2883126 2908213 2933875 2960135 2986089 3010667 3034249 3058434 3084041
57170C084041K6481K6891K7513K7925K7502K6954K7197K7662K7310K6375K5534
$$ 3084041 3110522 3137413 3164926 3192851 3220353 3247307 3274504 3302166 3329476 3355851 3381385
57159C381385K4506K3081K2228K2442K2302K0513J8112J6699J5811J4214J2464
$$ 3381385 3405891 3428972 3451200 3473642 3495944 3516457 3534569 3551268 3567079 3581293 3593757
57148C593757J1866J1910J1187R931R373R348Q819Q014P876Q049P681P502Q907
$$ 3593757 3605623 3617533 3628720 3638651 3648024 3657372 3666191 3674205 3682081 3690130 3697811 3705313 3714220
57135C714220J1549J3876J5396J6455J6560J5044J2723J0762Q652N337J621n86
$$ 3714220 3725769 3739645 3755041 3771496 3788056 3803100 3815823 3826585 3835237 3840574 3842195 3841609
57123C841609p74L96K973P236J2158J6343J9791K2927K4971K5309K5346K6826
$$ 3841609 3840835 3841231 3844204 3851440 3863598 3879941 3899732 3922659 3947630 3972939 3998285 4025111
57111D025111K9499L2643L7528M5867N7176P0289Q6282J07174J33063J63542K01001
$$ 4025111 4054610 4087253 4124781 4170648 4227824 4298113 4384395 4491569 4624632 4788174 4989175
57100D989175K49489L11270L87351M80468N94601P32364Q95421J085724J302916
$$ 4989175 5238664 5549934 5937285 6417753 7012354 7744718 8640139 9725863 11028779
57091A1028779J541222J791273K042787K282465K492570K656446K763367K804290
$$ 11028779 12570001 14361274 16404061 18686526 21179096 23835542 26598909 29403199
57083B9403199K769272K659235K497165K312454K106789J843116J475546R88249
$$ 29403199 32172471 34831706 37328871 39641325 41748114 43591230 45066776 46055025
57075D6055025M05444k25482q51841j424489j905367k274840k531286k683241
$$ 46055025 46460469 46234987 45383146 43958657 42053290 39778450 37247164 34563923
57067C4563923k742991k724907k644379k515984k353241k169187j975285j780065
$$ 34563923 31820932 29096025 26451646 23935662 21582421 19413234 17437949 15657884
57059A5657884j590176j411906j250254j107115r81721q72252p76528o92557o19735
$$ 15657884 14067708 12655802 11405548 10298433 9316712 8444460 7667932 6975375 6355640
57050F355640n58469n07707m63979m23923l86445l51593l18803k87495k58076
$$ 6355640 5797171 5289464 4825485 4401562 4015117 3663524 3344721 3057226 2799150
57041B799150k31086k06297j83575j63440j45989j30359j16002j03289r2328q2515
$$ 2799150 2568064 2361767 2178192 2014752 1868763 1738404 1622402 1519113 1426785 1344270
57031A344270p3753o6590o0697n4875m9023m4305m0790l6957l2207k7803k4532
$$ 1344270 1270517 1203927 1143230 1088355 1039332 995027 954237 917280 885073 857270 832738
57020H32738k1517j8236j5532j3561j0899o746j886L550J0896K0407L0493M0890
$$ 832738 811221 792985 777453 763892 752993 746247 744361 747911 758807 779214 809707 850597
57008H50597N3944P1420R3066J19570J51553J80937J87451J52018P6077j5786
$$ 850597 904541 975961 1069027 1188597 1340150 1521087 1708538 1860556 1936633 1920847
56998A920847r3708j41623j60700j60385j49694j34415j17677j01029q5315p1072
$$ 1920847 1827139 1685516 1524816 1364431 1214737 1080322 962645 861616 776301 705229
56988G05229n8500m7465l7761k9219k1646j4887r005m504k590m691j0943j9190
$$ 705229 646729 599264 561503 532284 510638 495751 486746 482242 479652 474961 464018 444828
56976D44828k6354l0880l3035l3126l0874k6770k2485j9167j6340j3017q951m349
$$ 444828 418474 387594 354559 321433 290559 263789 241304 222137 205797 192780 183829 179480
56964A79480N85N308R124J2207J5501J9355K3205K6783L0249L2731L2073K6779
$$ 179480 180065 185373 194497 206704 222205 241560 264765 291548 321797 354528 386601 413380
56952D13380J7470O235m423j2222j6223j7684j8489j8713j7156j4035j1098q941
$$ 413380 430850 437085 432662 420440 404217 386533 368044 349331 332175 318140 307042 298101
56940B98101o425l152k91J768M329Q105J2075J5613J9731K5076L0450L4149L4883
$$ 298101 291676 288524 288233 290001 294330 302435 314510 330123 349854 374930 405380 439529 474412
56927D74412L0779K0029M037j2115k3971l0905l4150l4131l1336k7722k4892k2336
$$ 474412 505191 525220 529257 517142 493171 462266 428116 393985 362649 334927 310035 287699
56915B87699j9126j5926j3694j1895r702p642o442n585m512l846l987l881k706
$$ 287699 268573 252647 238953 227058 217356 209714 203272 197687 193175 189329 185342 181461 178755
56902A78755j293m05P40K666M135M303M664O782R611J1293J2230J4093J6946J9673
$$ 178755 177462 177057 177797 180463 184598 188901 193565 200347 209958 221251 233481 247574 264520 284193
56888B84193K2360K5908K9978L3267L5080L4777L0709K1995J0754M55p483j3576
$$ 284193 306553 332461 362439 395706 430786 465563 496272 518267 529021 529476 521993 508417
56876E08417j7650j8709j7137j4748j2510r939o751l411J0M005Q603J3418J8652
$$ 508417 490767 472058 454921 440173 427663 417724 410973 407562 407572 411577 420180 433598 452250
56863D52250K4858L1849L9083M6787N5360O3345O6910O1737M5797K1279n678k8222
$$ 452250 477108 508957 548040 594827 650187 713532 780442 842179 887976 909255 903577 875355
56851H75355m2921n0502n2749n0326m4108l6440k9296k2416j4681o208K284J0922
$$ 875355 832434 781932 729183 678857 634749 598309 569013 546597 531916 525708 527992 538914
56839E38914K0098K9527L9199N0073O2544P5540Q8183J00129J08177J04740Q3293
$$ 538914 559012 588539 627738 677811 740355 815895 904078 1004207 1112384 1217124 1300417
56828A300417M5415N47m0700p1603q9635r5472r2403q4531p4514o3472n2320m1761
$$ 1300417 1345832 1346379 1305679 1234076 1144441 1048969 956566 872035 797521 734049 681729 639968
56816F39968l1558k1328j1637k957N686J5578K6382L6907M7170N8028O8876P6663
$$ 639968 608410 587082 575445 572488 578174 593752 620134 657041 704211 762239 831115 907778
56804I07778P6836O5010L9691N254k8964n4699o9771p6503p7143p2804o5288n6878
$$ 907778 984614 1049624 1089315 1094569 1065605 1010906 941135 864632 787489 714685 649397 592519
56792E92519m8487l9981l1949k5230j9267j2775n692J235Q079J5254K2171K8189
$$ 592519 544032 504051 472102 446872 427605 414830 409138 410373 418452 433706 455877 484066
56780D84066L3919L9352M1417L6018K2508M408j3897k9293l9613m3974m3844m1826
$$ 484066 517985 557337 598754 634772 657280 661688 647791 618498 578885 534911 491067 449241
56768D49241l9032l5036l0046k5381k1738j8703j5983j3768j1939j0212q807p901
$$ 449241 410209 375173 345127 319746 298008 279305 263322 249554 237615 227403 218596 210695
56756B10695o924n526m454m242m023l068k299k595k872j841m69m24j122p65M94
$$ 210695 203771 198245 193791 189549 185526 182458 180159 177564 174692 172851 172382 171958 170836 170071 170565
56741A70565R47K58m60r38j677k121j385l81o29j464r92N50J126L88l3K96M2j036
$$ 170565 171512 171770 171310 170372 168695 166574 165189 164808 164179 162715 161723 162273 163399 163787 163754 164050 164092 163056
56723A63056j477q93p40j648k348j977j313r84n06K69N62J92M8N43J092J340J421
$$ 163056 161579 160686 159946 158298 155950 153973 152660 151676 151170 151439 152001 152193 152241 152784 153876 155216 156637
56706A56637R86l49j682j693p54l69o81n42J54L25j34k17J78J75k18k20j59r49
$$ 156637 157623 157274 155592 153899 153145 152776 152095 151553 151707 152032 151898 151681 151859 152034 151816 151596 151437 150488
56688A50488j841j221L82P28m97j223n48O4k18j29J081K076J675O14k4k67j83
$$ 150488 148647 147426 147808 148536 148039 146816 146268 146332 146114 145985 147066 149142 150817 151431 151407 151140 150957
56671A50957P77K399L381L209K810K767K480J780J545K032K252J676J003O64J70
$$ 150957 151734 154133 157514 160723 163533 166300 168780 170560 172105 174137 176389 178065 179068 179732 179902
56656A79902n65q40n78n76r76j053p78q95j322j166n02k79l40L73J548J604M18
$$ 179902 179337 178497 177919 177343 176367 175314 174536 173641 172319 171153 170651 170372 170032 170405 171953 173557 173975
56639A73975l28MQ4q66j801j854j592j515j261r21j255k069k255j893k225l104
$$ 173975 173647 173651 173735 172869 171068 169214 167622 166107 164846 163925 162670 160601 158346 156453 154228 151124
56623A51124k794r63M06M5q65r53n85m62k24M35R18R80J275J904J973J282P93
$$ 151124 148330 147367 147773 147818 146953 146000 145415 144953 144729 145164 146082 147062 148337 150241 152214 153496 154289
56606A54289R12R19O73R99J847J956R99J90J84J67l33o22l98l25n54m49j64n54
$$ 154289 155201 156120 156793 157792 159639 161595 162594 162784 162968 163135 162802 162180 161782 161457 160903 160454 160290 159736
56588A59736j223q00N05Q99J6m41M28J467J818K068K425K024R19N18J214J725
$$ 159736 158513 157713 158218 159117 159133 158692 159120 160587 162405 164473 166898 168922 169841 170359 171573 173298
56572A73298J491J498K112K399K192K563L579M047M066N166P292Q336P516O575
$$ 173298 174789 176287 178399 180798 182990 185553 189132 193179 197245 202411 209703 218039 225555 232130
56558B32130O699P041P114P850R171R392Q156P187P033O059L833K399K707K787
$$ 232130 238829 245870 252984 260834 270005 279397 287553 294740 301773 307832 311665 314064 316771 319558
56544C19558J181p69j739k624m143n102m913n109o459p261o485n840o655p398
$$ 319558 320739 319970 318231 315607 311464 306362 301449 296340 289881 282620 276135 270295 263640 256242
56530B56242o467m913m220l853l162l250m625n417m232k554k140k312j995k065
$$ 256242 249775 244862 240642 236789 233627 230377 225752 220335 216103 213549 211409 209097 207102 205037
56516B05037l318m369l959l212l356l374k287j404j907k363j235K05J05p85p64
$$ 205037 201719 197350 193391 190179 186823 183449 181162 179758 177851 175488 174253 174458 174563 173778 173014
56501A73014j94l01o34j95M23L35K21P93J128N33K73J326K329J908J030R81J015
$$ 173014 172820 172519 171885 171690 172113 172448 172669 173462 174590 175123 175396 176722 179051 180959 181989 182970 183985
56484A83985K68j40P60J630J129L90P85J358Q18R1M14R70Q65J189K700L694K846
$$ 183985 184253 184113 184873 186503 187632 188022 188807 190165 190983 191074 191488 192458 193323 194512 197212 200906 203752
56467B03752J851K487L442K958K269L195M501M067K740K582L115K637J665J667
$$ 203752 205603 208090 211532 214490 216759 219954 224455 228522 231262 233844 236959 239596 241261 242928
56453B42928J921R42l54j30J045J451J343J835K102Q49q08j051n55r94j824j625
$$ 242928 244849 245791 245437 245307 246352 247803 249146 250981 253083 253932 253124 252073 251518 250524 248700 247075
56437B47075j111j659k384j853j193k140l565l288j997j863k625k518j842k120
$$ 247075 245964 244305 241921 240068 238875 236735 233170 229882 227885 226022 223397 220879 219037 216917
56423B16917k798k260j105j021j493q48M88R69R68J630K009P39q46o59M04J03
$$ 216917 214119 211859 210754 209733 208240 207392 207880 208849 209817 211447 213456 214195 213349 212690 213094 213197
56407B13197j167j660k016l829n880n832m502m390n096m476l174l630n255n270
$$ 213197 212030 210370 208354 204525 198645 192813 188311 183921 178825 174349 171175 167545 162290 157020
56393A57020l870m032o258p845p600p179p418p195o238n656n286l766j170J542
$$ 157020 153150 149118 142860 135015 127415 120236 112818 105623 99385 93729 88443 84677 83507 85049
56379H5049N320J1792J9515K4845K6413K5564K3017J8649J4093J1668J0826R125
$$ 85049 90369 102161 121676 146521 172934 198498 221515 240164 254257 265925 276751 285876
56367B85876O478M902M479L318J393O16J210J504J264J743K625K455J779K350
$$ 285876 292354 297256 301735 305053 306446 307062 308272 309776 311040 312783 315408 317863 319642 321992
56353C21992L563L355K128K000K568J463j067k253j451p59r37n53O04J038N64
$$ 321992 325555 328910 331038 333038 335606 337069 336002 333749 332298 331539 330602 330049 330653 331691 332255
56338C32255L64J53j160k374j364Q74J422K77J7J061J624J854L553N941O331N025
$$ 332255 332619 332772 331612 329238 327874 328748 330170 330447 330464 331525 333149 335003 338556 344497 350828 355853
56322C55853M941O329O528N179M910O344P173O727O868P734P241N506N266P084
$$ 355853 360794 367123 373651 378830 383740 390084 397257 403984 410852 418586 425827 431333 436599 443683
56308D43683Q450Q476R018J0448J0732R487Q656Q454O931M293L062L388K688O97
$$ 443683 452133 460609 469627 480075 490807 500294 508950 517404 524335 528628 531690 535078 537766 538463
56294E38463J20J469K048J081J065K763L632K578J810K656L753M590O447Q840
$$ 538463 538583 540052 542100 543181 544246 547009 550641 553219 555029 557685 561438 566028 572475 581315
56280E81315R490Q805R892J3167J5592J6174J7363K0055K2205K3555K6539L1232
$$ 581315 590805 599610 609502 622669 638261 654435 671798 691853 714058 737613 764152 795384
56268G95384L4563L6053L9154M5336N1997N7796O4741P3289Q0870Q7248R5897
$$ 795384 829947 866000 905154 950490 1002487 1060283 1125024 1198313 1279183 1366431 1462328
56257A462328J07798J19262J28218J37309J48132J57777J63911J68243J71894
$$ 1462328 1570126 1689388 1817606 1954915 2103047 2260824 2424735 2592978 2764872
56248B764872J72190J67060J58106J46501J30307J08752Q4751O0477L4851Q050
$$ 2764872 2937062 3104122 3262228 3408729 3539036 3647788 3732539 3793016 3827867 3835917
56238C835917j6142l5343n1503o6159p7254q3559q7725r1923r4633r4614r3985
$$ 3835917 3819775 3784432 3732929 3666770 3589516 3505957 3418232 3326309 3231676 3137062 3043077
56227C043077r4520r5027r4913r6141r9144j01104j00812j00817j02360j02778
$$ 3043077 2948557 2853530 2758617 2662476 2563332 2462228 2361416 2260599 2158239 2055461
56217B055461j00495r7847r6403r4150q9998q6147q3360p8792p1324o4090n8992
$$ 2055461 1954966 1857119 1760716 1666566 1576568 1490421 1407061 1328269 1256945 1192855 1133863
56206A133863n3733m7110m1832l9089l5821l0646k6920k6375k5359k1254j7146
$$ 1133863 1080130 1033020 991188 952099 916278 885632 858712 832337 806978 785724 768578
56195G68578j5928j5213j2444r901j0024j0582r035p174p038o730m553k778l136
$$ 768578 752650 737437 724993 715092 705068 694486 685451 678277 671239 664509 659956 657178 654042
56182F54042l063o19J487R89M72K402M455M219L978O227Q956R678R882J1161J1544
$$ 654042 650979 650360 651847 652836 653308 655710 660165 664384 668362 674589 683545 693223 703105 714266 725810
56167G25810R944R562J2535J5805J6568J6998J9237K0797J9598J8445J9704K0462
$$ 725810 735754 745316 757851 773656 790224 807222 826459 847256 866854 885299 905003 925465
56155I25465J7985J5031J4719J5016J3288J1506J1949J2609J1905J2966J8153
$$ 925465 943450 958481 973200 988216 1001504 1013010 1024959 1037568 1049473 1062439 1080592
56144A080592K4379K8981L4999M5451N7742O9174Q2438R9868J17629J31444J42544
$$ 1080592 1104971 1133952 1168951 1214402 1272144 1341318 1423756 1523624 1641253 1772697 1915241
56133A915241J51793J53731J43452J24704J04807Q6326O9870N9393N7215N8073
$$ 1915241 2067034 2220765 2364217 2488921 2593728 2680054 2749924 2809317 2866532 2924605
56123B924605N4855M6429L4405J7740k859k0544k9574l2757l5812l9739m4986
$$ 2924605 2979460 3025889 3060294 3078034 3075175 3054631 3025057 2992300 2956488 2916749 2871763
56112B871763n6728p8005j02619j22234j35806j45260j47819j40639j27884j15241
$$ 2871763 2815035 2737030 2634411 2512177 2376371 2231111 2083292 1942653 1814769 1699528
56102A699528j02067q6284p1499o1487n2964m1845l1276k5471k1300j4279p294
$$ 1699528 1597461 1511177 1439678 1378191 1325227 1283382 1252106 1226635 1205335 1191056 1183762
56091A183762m754l742K21M285M084K653M382N884K468k088k084n00k922o510
$$ 1183762 1179008 1175266 1175487 1179772 1183856 1186509 1190891 1196775 1199243 1197155 1195071 1194571 1191649 1185139
56077A185139n474k184k117l001J85M479M225K149M211Q170Q380P058R612J3552
$$ 1185139 1179665 1177481 1175364 1172363 1172548 1177027 1181252 1183401 1187612 1195782 1204162 1211220 1220832 1234384
56063A234384J3378J1639J3878J7490J7067J5542J8284K1642J9627J6403J9296
$$ 1234384 1247762 1259401 1273279 1290769 1307836 1323378 1341662 1363304 1382931 1399334 1418630
56052A418630K4803K4855K1725K3077K7131K6768K3812K5099K8698K8036K5410
$$ 1418630 1443433 1468288 1490013 1513090 1540221 1566989 1590801 1615900 1644598 1672634 1698044
56041A698044K7369L1122K9734K6234K8136L2751L2627L0555L3981L9659L9584
$$ 1698044 1725413 1756535 1786269 1812503 1840639 1873390 1906017 1936572 1970553 2010212 2049796
56030B049796L7032M0521M6995M7571M4854M7493N2797N2307M9433N3392O0779
$$ 2049796 2086828 2127349 2174344 2221915 2266769 2314262 2367059 2419366 2468799 2522191 2582970
56019B582970O1743N9259O3112P0179P0533O7837P2987Q2575Q4972Q2729Q7074
$$ 2582970 2644713 2703972 2767084 2837263 2907796 2975633 3048620 3131195 3216167 3298896 3385970
56008C385970R5270R6152R3114R8152J07934J10036J08029J15178J28059J32595
$$ 3385970 3481240 3577392 3670506 3768658 3876592 3986628 4094657 4209835 4337894 4470489
55998D470489J31756J40124J55357J63122J66037J78597J97464K07048K10587
$$ 4470489 4602245 4742369 4897726 5060848 5226885 5405482 5602946 5809994 6020581
55989F020581K24494K45903K58537K66542K88163L19609L41204L55678L82908
$$ 6020581 6245075 6490978 6749515 7016057 7304220 7623829 7965033 8320711 8703619
55980H703619M20368M48479M71652N12174N66468O11523O51590P12044P90036
$$ 8703619 9123987 9572466 10044118 10556292 11122760 11734283 12385873 13097917 13887953
55971A3887953Q60979R30990J029830J154763J278583J410711J588865J812934
$$ 13887953 14748932 15679922 16709752 17864515 19143098 20553809 22142674 23955608
55963B3955608K054593K330251K691254L144873L667798M297437N120451O175014
$$ 23955608 26010201 28340452 31031706 34176579 37844377 42141814 47262265 53437279
55955E3437279P469114R089932J1165389J3710079J6651635K0016725K3925936
$$ 53437279 60906393 69996325 81161714 94871793 111523428 131540153 155466089
55948A55466089K8409114L3417970L8873776M4076259M6763937M3463959L1898249
$$ 155466089 183875203 217293173 256166949 300243208 347007145 390471104 422369353
55941D22369353J3479692o922803k4028121l5061649m0152620m0825782l8659414
$$ 422369353 435849045 428926242 404898121 369836472 329683852 288858070 250198656
55934B50198656l4929813l0624672k6359230k2396049j8855123j5829468j3318298
$$ 250198656 215268843 184644171 158284941 135888892 117033769 101204301 87886003
55927H7886003j1218959r449078p992588o814654n832502m994539m305091l751269
$$ 87886003 76667044 67217966 59225378 52410724 46578222 41583683 37278592 33527323
55919C3527323l279784k862548k515912k238385j991818j759025j561418j404755
$$ 33527323 30247539 27384991 24869079 22630694 20638876 18879851 17318433 15913678
55911A5913678j261137j118593r97892r06234q20872p31907o57524o03968n51470
$$ 15913678 14652541 13533948 12536056 11629822 10808950 10077043 9419519 8815551 8264081
55902H264081m92261m43916m13004l82006l43683l13683k97894k80298k54075
$$ 8264081 7771820 7327904 6914900 6532894 6189211 5875528 5577634 5297336 5043261
55893E043261k33450k24208k12430j92590j78046j73675j65835j49219j37068
$$ 5043261 4809811 4585603 4373173 4180583 4002537 3828862 3663027 3513808 3376740
55884C376740j35060j30682j18024j08467j07404j04065r3657q6700q7321q4404
$$ 3376740 3241680 3110998 2992974 2884507 2777103 2673038 2579381 2492681 2405360 2320956
55874B320956p3309o4987o4753o2704n3914m7859m9059m8021m0240l5258l7883
$$ 2320956 2247647 2182660 2117907 2055203 2001289 1953430 1904371 1856350 1816110 1780852 1742969
55863A742969l8559l1266k3854k2320k1512j9345k3443l5491m4928m6134m6501
$$ 1742969 1704410 1673144 1649290 1626970 1605458 1586113 1562670 1527179 1482251 1436117 1389616
55852A389616n0270n0198m2852l6611l6454l5728l0639k8120l1435l2573k7046
$$ 1389616 1339346 1289148 1246296 1209685 1173231 1137503 1106864 1078744 1047309 1014736 987690
55841I87690k2246k2986k2562j6430j1325j2172j2782q122l661l988l901P64M636
$$ 987690 965444 942458 919896 903466 892141 879969 867187 859065 855404 851416 847515 848279 852915
55828H52915L414K145M914O712L424k67o15k483r607j6818j9373k0846k4589k6555
$$ 852915 856329 858474 863388 870100 873524 873257 872642 870159 860552 843734 824361 803515 778926 752371
55814G52371k3865k1482k3236k4700k1892j8572j8239j7333j3085r758j0518j1088
$$ 752371 728506 707024 683788 659088 637196 618624 600385 583052 569967 560209 549691 538603
55802E38603p949m894n087m663n95K862K083P95K557M014J918l29N82J548n37
$$ 538603 530654 525760 520673 516010 515415 518277 520360 521155 523712 527726 529644 529315 529897 531445 530908
55787E30908k843k778l214o039p380m779k291k977l274k35K552J658n50k169o289
$$ 530908 528065 525287 522073 516034 508654 503875 501584 498607 495333 495098 497650 499308 498758 496589 490300
55772D90300j3766j8793j7618j4731j4666j4838j2328j0451j2003j2976r720n912
$$ 490300 476534 457741 440123 425392 410726 395888 383560 373109 361106 348130 338410 332498
55760C32498n815o865n538m269n810o830m007q23j369k917j505M35r58l451l197
$$ 332498 326683 319818 314280 310011 304201 297371 293364 292541 291172 288255 286750 287185 286227 282776 279579
55745B79579k110l853o736p284o806q022r109p356m947n025n747l985j299n16
$$ 279579 277469 273616 266880 259596 252790 244768 235659 228303 223356 218331 212584 208599 207300 206784
55731B06784k53J684L245J986Q1J04j34l068n870n178l379m279o350o111m609
$$ 206784 206531 208215 211460 213446 213527 213631 213497 210429 204559 199381 196002 191723 185373 179262 174653
55716A74653m679n159l696k018k712l799k152O65J412J040K306M431N292N900
$$ 174653 169974 164815 161119 159101 156389 152590 150438 151103 152515 153555 155861 160292 165584 171484
55702A71484P598P984M818Q23n09p49l017n918o409n534n772n684k797R01J934
$$ 171484 179082 187066 191884 192707 192198 191449 188432 182514 176105 170571 164799 159115 156318 157219 159153
55687A59153J300K103L784M066M089O168Q787R102Q253R028J0459R872Q004P003
$$ 159153 160453 162556 166340 170406 174495 180663 189450 198552 206805 215833 226292 236164 244168 251171
55673B51171N644J688l101n412n817o848p859o787m832m285l904j449J279J186
$$ 251171 256815 258503 255402 249990 244173 237325 229466 222679 217847 213562 209658 208209 209488 210674
55659B10674m51k51J269J248J58O02K102K332K029L479N533N258L260K350K239
$$ 210674 210223 209972 211241 212489 212647 213249 215351 217683 219712 223191 228724 233982 237242 239592 241831
55644B41831N36k165l223k817l201m157l895l255m360o199o243n236n798p436
$$ 241831 242367 240202 236979 234162 230961 226804 222909 219654 215294 209095 202852 197616 191818 184382
55630A84382p640o761p078q103p570o098o156p289p050n767n723o464n598l543
$$ 184382 176742 169981 162903 154800 147230 141132 134976 127687 120637 114870 109147 102683 97085 93542
55616I3542k859l484l186k098k300l466l358k181k099k935k609j298r98j469q19
$$ 93542 90683 87199 84013 81915 79615 76149 72791 70610 68511 65576 62967 61669 60671 59202 58383
55601E8383N21N07m70l65L87k74j770j784o41n71j266o48N97j07k308k997j777
$$ 58383 58904 59411 58941 58576 58963 58689 56919 55135 54494 53923 52657 52009 52606 52499 50191 47194 45417
55584D5417j058j324p15O45M71j306k188j503j171j786j777p62j45j65K45P66
$$ 45417 44359 43035 42320 42965 43436 42130 39942 38439 37268 35482 33705 32943 32798 32633 32878 33644
55568C3644K30m60N30K343K573J534J591K791L081K386K388K643J147j443k384
$$ 33644 33874 33414 33944 36287 38860 40394 41985 44776 47857 50243 52631 55274 56421 54978 52594
55553E2594j530j370k402k663j874j867k768k792k004k197k941j930N42J582N29
$$ 52594 51064 49694 47292 44629 42755 40888 38120 35328 33324 31127 28186 26256 26798 28380 28909
55538B8909l01n2l60j464j477j60N02J86Q58K775L665K694J679J616J533J282
$$ 28909 28608 28556 28196 26732 25255 25095 25597 25783 26641 29416 33081 35775 37454 39070 40603 41885
55522D1885J949K996K545R55N96J689K070J399J762L695N591P679J2454K0136
$$ 41885 43834 46830 49375 50330 50926 52615 54685 56084 57846 61541 67132 74811 87265 107401
55508A07401K7310L1070L1109K7390J9655J0053K377k357o178r642j1012j0454
$$ 107401 134711 165781 196890 224280 243935 253988 256365 254008 247830 238188 227176 216722
55496B16722j0734j2587j3480j2323j1332j1842j2040j0579q822p906o984n908
$$ 216722 205988 193401 179921 167598 156266 144424 132384 121805 112983 105077 98093 92185
55484I2185o245q105r205q508p657p452o261l377o79N36J298K256K244R48n8j39
$$ 92185 85940 77835 68630 60122 52465 45013 38752 35375 34696 35232 36530 38786 41030 41978 41920 41781
55468D1781n12j350j150R2M07m70m80P22R06m49r24L19Q40n41j523o70n2j242
$$ 41781 41269 39919 38769 38861 39268 38798 38318 39040 39946 39497 38573 38892 39732 39191 37668 36998 36946 35704
55450C5704k382j808j051j533j625J25J839J377q6l89J02J7j79M09Q40j0j220
$$ 35704 33322 31514 30463 28930 27305 27430 29269 30646 30560 30171 30273 30290 30111 30520 31360 31350 30130
55433C0130j421r70p37m82o8k97j082r03M42R66j58r09J55J396R87k05o78q24
$$ 30130 28709 27739 27002 26520 26452 26155 25073 24170 24612 25578 25420 24511 24666 26062 27049 26844 26166 25342
55415B5342j306j170K07J331Q99qLL89L05M47J360J858J001j32l90l94q37r92
$$ 25342 24036 22866 23073 24404 25303 25295 25298 25687 25992 26439 27799 29657 30658 30526 30136 29742 28905 27913
55397B7913m39k26p78q29O3L47o46j204l38K95n30j303o31K20r0l84N53J355M71
$$ 27913 27474 27248 26470 25641 25704 26051 25405 24201 23863 24158 23628 22325 21694 21914 21824 21440 21993 23348 23819
55378B3819j022j488j434j691j180P99K273J416k26k30Q44R54K49K34O96M25j16
$$ 23819 22797 21309 19875 18184 17004 17803 20076 21492 21266 21036 21880 22834 23083 23317 24013 24438 24322
55361B4322K95J054P13l65p47m58m92o85k63L13J13m71n61m73q50j238j124j098
$$ 24322 24617 25671 26384 26019 25272 24814 24322 23637 23374 23687 23800 23329 22768 22295 21445 20207 19083 17985
55343A7985j395q37J013K378J915J014J326J774N75j392j927r75j47P9K42N8q39
$$ 17985 16590 15753 16766 19144 21059 22073 23399 25173 25748 24356 22429 21454 21307 21386 21628 21686 20847
55326B0847j320l40Q59M85q09j062k33K13P2K92O67J61q13q01K57R71P05N7n11
$$ 20847 19527 19187 20046 20531 19722 18660 18427 18640 18712 19004 19671 19832 19019 18218 18475 19446 20151 20208 19697
55307A9697q86o08M74J392J311R23J127J287M06q62j102k85N80J097J344Q89m39
$$ 19697 18811 18203 18677 20069 21380 22303 23430 24717 25123 24261 23159 22874 23454 24551 25895 26784 26345
55290B6345j615j635q50L6J136K300K378R77m72q35r25j544j705o76J83l23q79
$$ 26345 24730 23095 22245 22281 23417 25717 28095 29072 28600 27765 26840 25296 23591 22915 23098 22775 21896
55273B1896J17J618J692O76J13j3m44m79O82J732J125l8J86J103O93o95j018k28
$$ 21896 22013 23631 25323 25999 26112 26099 25655 25176 25858 27590 28715 28677 28863 29966 30659 29964 28946 28718
55255B8718j23j011j486j308j542k041j520j80L85j17m11n3J11j18r4N7k94o53
$$ 28718 28595 27584 26098 24790 23248 21207 19687 19507 19892 19775 19364 19311 19422 19304 19210 19267 18973 18320
55237A8320j54N16O3r15p47M04Q29K58J02Q33J408J406J479J659J272N68M61O82
$$ 18320 18166 18682 18745 17830 17083 17487 18316 18574 18676 19509 20917 22323 23802 25461 26733 27301 27762 28444
55219B8444J25j131k005k303k440j802M03K934L579K283J002N53j7r97j339o82
$$ 28444 28569 27438 25433 23130 20690 18888 19291 22225 25804 28087 29089 29642 29625 28628 27289 26607
55203B6607P5M61Q07R30L76j54M20J457J352K20l21Q8K24l14o57o39r92j469j010
$$ 26607 26682 27143 27950 28880 29256 29102 29522 30979 32331 32551 32230 32318 32542 32228 31571 30932 29940 28471 27461
55184B7461R6M00k46o25n25q69j355n57J293K086J021l04o29o13r07q55q2M91
$$ 27461 27557 27957 27711 27086 26561 25692 24337 23780 25073 27159 28180 27876 27247 26634 25727 24872 24790 25281
55166B5281K17k52k79j74k01p3J44l7l75j23M52K90o29j236j165r91p02K73J438
$$ 25281 25498 25246 24967 24793 24592 24519 24663 24626 24251 24128 24580 24870 24241 23005 21840 20849 20147 20420 21858
55147B1858J542O18o5j25k78m70J03J006Q48j98l42R20J978J669O79j06o96r55
$$ 21858 23400 24018 23953 23828 23550 23080 23183 24189 25037 24839 24497 25417 27395 29064 29743 29637 28941 27986
55129B7986m35L09J01p57p06M17J058O04J61J79k84j245j152M41J822J795J393
$$ 27986 27551 27860 27961 27204 26498 26915 27973 28577 28738 28917 28633 27388 26236 26677 28499 30294 31687
55112C1687J775K423K525K311J914O75j232k189j378k3O30R49J490J621Q87K25
$$ 31687 33462 35885 38410 40721 42635 43310 42078 39889 38511 38488 39118 40067 41557 43178 44065 44290
55096D4290M72R88R06N32M10K36j84j57O68J379J161N26L13M60O26R44J336J136
$$ 44290 44762 45750 46656 47188 47598 47834 47650 47493 48161 49540 50701 51227 51540 52000 52626 53570 54906 56042
55078E6042J95o21p16n10m07q5N53Q73N82K22J24k4k04Q1O10M63l78q34n83n57
$$ 56042 56237 55616 54900 54390 53983 53898 54451 55324 55906 56128 56252 56228 56024 56105 56715 57178 56800 55966 55383 54826
55058E4826j116j345q24m67q81j334j183q39o15k9R44J382R20L52J36k96j034
$$ 54826 53710 52365 51541 51074 50193 48859 47676 46837 46222 46193 47137 48519 49439 49791 49927 49631 48597
55041D8597j125k67M65L91J36P6m39j484j869j117m22n63n43M65J499J435Q23
$$ 48597 47472 47205 47670 48061 48197 48273 47834 46350 44481 43364 42942 42379 41836 42301 43800 45235 46058
55024D6058O37N82N1m54k94L3j25l06N1L95R3k96K2P22J135J413J879K085J595
$$ 46058 46695 47277 47328 46874 46580 46613 46488 46182 46233 46628 46721 46425 46447 47169 48304 49717 51596 53681 55276
55005E5276R06N72K88k45n04j51J55j39m58j60K96J54m65j015j287j109k83N86
$$ 55276 56182 56754 57042 56797 56293 56142 56297 56158 55700 55540 55836 55990 55525 54510 53223 52114 51831 52417
54987E2417L79p84j304l75Q40J108Q24Q02P58J97m64o93q02j015q03nM57P5k84
$$ 52417 52796 52012 50708 50333 51173 52281 53105 53907 54665 54862 54398 53705 52903 51888 51085 51080 51537 51612 51328
54968E1328J94J014J502J909K363K097Q64j28J26R74J411J530J671J453Q45Q00
$$ 51328 51522 52536 54038 55947 58310 60407 61271 61143 61269 62243 63654 65184 66855 68308 69153 69953
54952F9953J625K119J596J277K267L647M185M490N649P091P700P938Q908J0280
$$ 69953 71578 73697 75293 76570 78837 82484 86669 91159 96808 103899 111599 119537 128445 138725
54938A38725J1032J1339J1833J1770R925O656L319J69l335o803r318j1033j2585
$$ 138725 149757 161096 172929 184699 194624 201280 204599 204768 201433 194630 185312 174279 161694
54925A61694j3344j2213r851q211p914p772o900n792n059m581m093l517k629j344
$$ 161694 148350 136137 126286 118075 110161 102389 95489 89697 84638 80057 75964 72447 69818 68474
54911F8474l17k77q55r40m4J342K541L138L087K992L795N573P250Q095Q626R453
$$ 68474 68157 67880 67025 66085 66041 67383 69924 73062 76149 79141 82936 88509 95759 103854 112480 121933
54895A21933J0271J0804J1531J2379J1937R279N496K034j340n379r206j1205j1391
$$ 121933 132204 143008 154539 166918 178855 188134 193630 195664 194324 188945 179739 168534 157143
54882A57143j1146j1061j0671r925r290q702p806o920o462n861m374k551j548
$$ 157143 145997 134936 124265 114340 105050 96348 88542 81622 75160 69299 64925 62374 60826
54869F0826j411j342j161j129q62J20J160J272P50N70O64K28o15j007r15j023
$$ 60826 59415 58073 56912 55783 54921 55041 56201 57473 58223 58793 59457 59685 59070 58063 57148 56125
54853E6125j317j177o73l58j14M67Q51K25r14j329r95r54j413j508r97o05n95
$$ 56125 54808 53631 52958 52600 52486 52953 53804 54029 53115 51786 50791 49837 48424 46916 45919 45314 44719
54836D4719m02J36M09J17l58o94p60j93J095K159J918O67l64p42r47r97k87J116
$$ 44719 44317 44453 44862 44979 44621 43927 43167 42974 44069 46228 48146 48813 48449 47707 46760 45763 45476 46592
54818D6592K250K429J833R31J90N7M46N41jk88M84J503J426L66m55n55k98K85
$$ 46592 48842 51271 53104 54035 54225 54282 54728 55269 55268 54980 55464 56967 58393 58759 58304 57749 57451 57736
54800E7736J331K198K141J682J911K714L145L192L651M550N297O164P921J0119
$$ 57736 59067 61265 63406 65088 66999 69713 72858 76050 79701 84251 89548 95712 103633 113752
54786A13752J1378J1517J1754J2719J3627J3630J2589J0441P086L133m45l431
$$ 113752 125130 136647 148401 161120 174747 188377 200966 211407 218493 221626 221181 217750
54774B17750o086p991q488q102q048q382q066o862n653m814l730k151p50K9M82
$$ 217750 211664 203673 195185 187083 179035 170653 162587 155725 150072 145258 141528 139377 138627 138656 139138
54759A39138Q92J224J653K405L186L719M505O037P743Q915J0055J1952J4077J5549
$$ 139138 140030 141254 142907 145312 148498 152217 156722 162759 170502 179417 189472 201424 215501 231050
54745B31050J6894J8913K0434J9533J6712J4367J3063J0870O717J889k430o719
$$ 231050 247944 266857 287291 306824 323536 337903 350966 361836 368553 370442 368012 361293
54733C61293j1308j5186j7724j9665k1335k1655k0104j8050j6844j5974j4389
$$ 361293 349985 334799 317075 297410 276075 254420 234316 216266 199422 183448 169059
54722A69059j2343j0718r521q248o911n715m503l293k609k625k718k497k380k621
$$ 169059 156716 145998 136477 128229 121318 115603 111100 107807 105198 102573 99855 97358 94978 92357
54708I2357k662j983q50J53O51L74n50j094k76J244J784R74R7q8k47p72r03l02
$$ 92357 89695 87712 86862 87015 87666 88040 87490 86396 86120 87364 89148 90122 90219 90131 89884 89112 88209 87907
54690H7907J17k04m46PM27K04J21Q79J596J091j12n18K39J198J550J363J107J179
$$ 87907 88024 87820 87374 87381 87808 88012 88133 89012 90608 91699 91587 91069 91308 92506 94056 95419 96526 97705
54672I7705J685K208K210J952K320L441M278M073L389L094L163L030K518J842
$$ 97705 99390 101598 103808 105760 108080 111521 115799 119872 123261 126355 129518 132548 135066 136908
54658A36908J236R86J298J853K178K546L643N202O070N948N864O489P152P243
$$ 136908 138144 139130 140428 142281 144459 147005 150648 155850 161920 167868 173732 180221 187373 194616
54644A94616P440Q691J0873J3285J5725J8321K0883K3202K5385K7316K8263K7536
$$ 194616 202056 210747 221620 234905 250630 268951 289834 313036 338421 365737 394000 421536
54632D21536K4957K0420J3703N217l704j1713j8172k2821k5488k6504k6634k6186
$$ 421536 446493 466913 480616 485833 482129 470416 452244 429423 403935 377431 350797 324611
54620C24611k4845k2594k0078j7776j5586j3449j1663j0299r064p864o806n657
$$ 324611 299766 277172 257094 239318 223732 210283 198620 188321 179257 171393 164587 158930
54608A58930m152k810k395k596k389j677j382j828k333k566k919l382l419l173
$$ 158930 154778 151968 149573 146977 144588 142911 141529 139701 137368 134802 131883 128501 125082 121909
54594A21909l384l867l645k817k610l187l203k198j496j944k514k240j827k112
$$ 121909 118525 114658 111013 108196 105586 102399 99196 96998 95502 93558 91044 88804 86977 84865
54580H4865k414j806p41j48K4J64o7r42j765j867j617j443q94K90J178Q92N6j62
$$ 84865 82451 80645 79904 79756 79780 79944 79877 78935 77170 75303 73686 72243 71349 71639 72817 73709 73765 73603
54562G3603K65M82N7q45j922k648k436j485p23l94K36J372K149K228K460L188
$$ 73603 73868 74350 74407 73562 71640 68992 66556 65071 64348 63954 64190 65562 67711 69939 72399 75587
54546G5587L328K224R75Q11J377J872K556L757M632M416L912M312N384O213O806
$$ 75587 78915 81139 82114 82925 84302 86174 88730 92487 97119 101535 105447 109759 115143 121356 128162
54531A28162P708Q809R809J1055J2654J3635J3255J2226J1392J0142P508L958
$$ 128162 135870 144679 154488 165543 178197 191832 205087 217313 228705 238847 246355 250313
54519B50313O04k503n849q938j0837j1657j2069j1940j0890r571q986q919q412
$$ 250313 250917 248414 242565 233627 222790 211133 199064 187124 176234 166663 157677 148758 140346
54506A40346p339o318n544m866m562m790m831l998k752j912j426r53p53r32p17
$$ 140346 133007 126689 121145 116279 111717 106927 102096 98098 95346 93434 92008 91055 90302 89370 88653
54491H8653K51Q54J46r59j111n97l72l7J201K482K314J148P21J177J033r7p93
$$ 88653 88904 89758 89904 88945 87834 87237 86865 86828 88029 90511 92825 93973 94694 95871 96904 96807 96014
54474I6014j67R39J404J071K99m38m22N62J418Q34q25j959j805q86K29J239J565
$$ 96014 95847 96786 98190 99261 99560 99122 98700 99262 100680 101514 100689 98730 96925 96039 96268 97507 99072
54457I9072Q85O8J08M90R1o99n01O41J161K89j125k165k628k327j267n13j184
$$ 99072 99957 100025 100133 100623 100714 100015 99514 100155 101316 101605 100480 98315 95687 93360 92093 91580 90396
54440I0396k516k608j245j35k75q73j145j315j325n25P32R36l06j417j099n7M70
$$ 90396 87880 85272 84027 83892 83617 82744 81599 80284 78959 78434 79166 80102 79796 78379 77280 77223 77693
54423G7693M49M27L52L7r3K92Q03J073J311J616J541R75N74P57J116J316J663
$$ 77693 78142 78569 78921 78958 78865 79157 79960 81033 82344 83960 85501 86476 87050 87807 88923 90239 91902
54406I1902K278K581K282K026K400K996L079K619K097J785J722J873K010J864
$$ 91902 94180 96761 99043 101069 103469 106465 109544 112163 114260 116045 117767 119640 121650 123514
54392A23514J623J652J654Q93o03j841k164j991j959k143k397k691k781k312j632
$$ 123514 125137 126789 128443 129336 128733 126892 124728 122737 120778 118635 116238 113547 110766 108454 106822
54377A06822j673k607l376l039j951j075p10m60r1K14K24o1m46p56j013j341j582
$$ 106822 105149 102542 99166 96127 94176 93101 92391 91931 91840 92054 92278 92217 91771 91015 90002 88661 87079
54360H7079j308n44M3J07K48R86J632J193po69k49O64J519K229K563K257J782
$$ 87079 85771 85227 85270 85377 85625 86611 88243 89436 89429 88760 88511 89175 90694 92923 95486 97743 99525
54343I9525J880K298K050J009J82J23K89J14j89l29m62p22r44j111j454j949k330
$$ 99525 101405 103703 105753 106762 106944 107067 107356 107470 107281 106952 106490 105768 104824 103713 102259 100310 97980
54326I7980k521k494j914p58R7j42r49j324j444k073k774k378j182q11j657k236
$$ 97980 95459 92965 91051 90293 90390 90248 89299 87975 86531 84458 81684 79306 78124 77313 75656 73420
54310G3420j564m91p0j00r8k81p86j087j021j195j745j792r83k90m81r43r17q09
$$ 73420 71856 71365 71295 71195 71097 70816 70030 68943 67922 66727 64982 63190 62207 61917 61436 60493 59576 58767
54292E8767j212j624j251l54K44L97M50M10J32j35j88l41p84j002n11L38R22J207
$$ 58767 57555 55931 54680 54326 54570 54967 55417 55827 55959 55824 55636 55295 54511 53509 52998 53336 54258 55465
54274E5465J425J444J091O49L95J39k74m24J02R60J426J234O86K16J20M01O28
$$ 55465 56890 58334 59425 60074 60469 60608 60334 59910 60012 60972 62398 63632 64318 64534 64654 65055 65683
54257F5683M37J65M74J244J573J058L23K1K4JM8L13N65N54L57J63J14L76P95O63
$$ 65683 66120 66285 66759 68003 69576 70634 70957 70978 71002 71003 71051 71364 71929 72483 72840 73003 73117 73493 74288 74951
54237G4951m55j699j726n68L74K68k93n39n09m06j01M10Q58J267J793J950J154
$$ 74951 74496 72797 71071 70503 70877 71145 70852 70313 69804 69398 69297 69707 70565 71832 73625 75575 76729
54220G6729N4rR05J271M36m71m75m8J49L12N42L30k35k05M21K15j281k328j500
$$ 76729 76783 76774 77679 78950 79386 78915 78440 78392 78541 78853 79395 79725 79490 79285 79706 79921 78640 76312 74812
54201G4812R4N65l2l79k49m33j031j494j755k006j828r35k07o30j654j984j457
$$ 74812 74906 75471 75439 75060 74811 74378 73347 71853 70098 68092 66264 65329 65122 64492 62838 60854 59397
54184E9397r09n77n0N08M80l8k99r3J95M61Q38R92N37o1l0M56N91K82J66L90L48
$$ 59397 58488 57911 57861 58369 58849 58811 58512 58419 58614 59075 59913 60905 61442 61381 61351 61807 62398 62680 62846 63236 63584
54163F3584l34j397k417k998k641j229M53J449J685J696J576R65o0q91j161r84
$$ 63584 63250 61853 59436 56438 53797 52568 53021 54470 56155 57851 59427 60392 60332 59441 58280 57296
54147E7296n71j39L8p6j54k7L6l6P9L34N8q49j353p62O2m6p61q84j64N72P55M02
$$ 57296 56725 56586 56624 56548 56394 56367 56403 56367 56446 56780 56838 55989 54636 53874 53936 53890 53129 52245 52081 52653 53408 53810
54125E3810m27j467j867j111M3N37N37Q63J409J362P49L72L36o5r11j366r82k51
$$ 53810 53383 51916 50049 48938 48981 49518 50055 50918 52327 53689 54438 54810 55146 55081 54170 52804 51822 51571
54107E1571L31P55R45O41O8j77o3j62n73o73j30N65Q41O65L22Q6J71N30P15M53
$$ 51571 51902 52657 53602 54243 54311 54134 54071 53909 53336 52663 52533 53098 53939 54604 54926 55012 55183 55713 56428 56881
54087E6881K11N65J175J176L86n24r72r12m21L47Q92Q04L99K86M25L63J66L11
$$ 56881 57092 57657 58832 60008 60394 59870 58898 57986 57565 57912 58804 59608 60007 60293 60718 61081 61247 61558
54069F1558P09P57M00K05L69M48K13L8K10N33Q02J078J367J515J530J541J489
$$ 61558 62267 63024 63424 63629 63998 64446 64659 64697 64907 65440 66242 67320 68687 70202 71732 73273 74762
54052G4762J247J055J225J598J717J438R50L94j4J49R59J751J954J963K404K984
$$ 74762 76009 77064 78289 79887 81604 83042 83992 84386 84372 84521 85480 87231 89185 91148 93552 96536
54036I6536K910K287K018K460L135L727M440N304O035O595P123P282O525N101
$$ 96536 99446 101733 103751 106211 109346 113073 117513 122817 128852 135447 142570 149852 156377 161478
54022A61478L949L495L311L050K930L149L480L616L393K682J556N05j79r02k020
$$ 161478 165427 168922 172233 175283 178213 181362 184842 188458 191851 194533 196089 196594 196415 195513 193493
54007A93493k992l130k913l373m408m894m447l855l699l696l637l744l799l100
$$ 193493 190501 187371 184458 181085 176677 171783 167336 163481 159782 156086 152449 148705 144906 141806
53993A41806j723q18j062j823k271k410k432k006r45J42N63L40j76q50j413j248
$$ 141806 140083 139265 138203 136380 134109 131699 129267 127261 126316 126458 127021 127361 127185 126335 124922 123674
53977A23674k87M54l5j409k413k409j917j725j982k178j798j016o28j110j822
$$ 123674 123387 123841 123806 122397 119984 117575 115658 113933 111951 109773 107975 106959 106331 105221 103399
53962A03399j595k02J289J768J212L61k99p52j054j040n30L45J008Q43l6o38r5
$$ 103399 101804 101602 102891 104659 105871 106232 105933 105181 104127 103087 102557 102902 103910 104753 104717 104079 103984
53945A03984J306K464K747K509K480L036M041M960N302N231N481O228O451N120
$$ 103984 105290 107754 110501 113010 115490 118526 122567 127527 132829 138060 143541 149769 156220 161340
53931A61340K705P37L1J55M23N29K64m57j044o45P57K289L321L964M395M537M515
$$ 161340 164045 164782 164813 164968 165391 165920 166184 165727 164683 164038 164795 167084 170405 174369 178764 183301 187816
53914A87816M651M867M796M613M972N987O971P390P327O975O355N675N096M188
$$ 187816 192467 197334 202130 206743 211715 217702 224673 232063 239390 246365 252720 258395 263491 267679
53900B67679K485O06k52j09k63j300k232k236j934k203k749k902k917l512m610
$$ 267679 270164 270770 270518 270409 270146 268846 266614 264378 262444 260241 257492 254590 251673 248161 243551
53885B43551n562o151o521o502n942n382n526o168o447o051n420m803l936k785
$$ 243551 237989 231838 225317 218815 212873 207491 201965 195797 189350 183299 177879 173076 169140 166355
53871A66355j969k033k678l073k766k038j432j193j307j850k871l932m222l583
$$ 166355 164386 162353 159675 156602 153836 151798 150366 149173 147866 146016 143145 139213 134991 131408
53857A31408k941l237m075m192l178j998j703k205k635k434j772j154q69p49m60
$$ 131408 128467 125230 121155 116963 113785 111787 110084 107879 105244 102810 101038 99884 99015 98266 97806
53842I7806p1r1o85j215j061n28l19l74n6O69J061P15O2l80n28m43j53O1j51n87
$$ 97806 97735 97644 96959 95744 94683 94155 93836 93462 93406 94075 95136 95851 95913 95533 95005 94562 94409 94470 94319 93732
53822I3732o39j02O88J495K247K548J943Q18J88L94P90Q67R29J326J849K224K475
$$ 93732 93093 92991 93679 95174 97421 99969 101912 102730 102918 103312 104102 104969 105898 107224 109073 111297 113772
53805A13772K568K329K001K194K981L717M041M345M942N493N587N343N085M966
$$ 113772 116340 118669 120670 122864 125845 129562 133603 137948 142890 148383 153970 159313 164398 169364
53791A69364N132N628N992N625M692M000L781L443K633J739J034K41p11j367j604
$$ 169364 174496 180124 186116 191741 196433 200433 204214 207657 210290 212029 213063 213304 212593 211226 209622
53776B09622j951k628l107l070k983l225l420l210k898k864k994l182l619m114
$$ 209622 207671 205043 201936 198866 195883 192658 189238 186028 183130 180266 177272 174090 170471 166357
53762A66357l969l084k348k326k404j932j407j621k308k578k281k022k058j991
$$ 166357 162388 159304 156956 154630 152226 150294 148887 147266 144958 142380 140099 138077 136019 134028
53748A34028j412l89N64P69j0j123j613j412j291j513j434p19k3O7j45k05l01
$$ 134028 132616 132227 132791 133560 133550 132427 130814 129402 128111 126598 125164 124445 124422 124489 124344 124139 123838
53731A23838n43m08L73J124J184Q89Q57R91R53R32J104J057O26N81J524K685K852
$$ 123838 123295 122887 123260 124384 125568 126457 127314 128305 129258 130190 131294 132351 132977 133558 135082 137767 140619
53714A40619J992J053N32K40J15K59M66N39P65J354J798J611J244J341J594J315
$$ 140619 142611 143664 144196 144436 144551 144810 145276 145815 146580 147934 149732 151343 152587 153928 155522 156837
53698A56837Q20J069K158L247L891M346M627M317L523K994L034L034K471J688
$$ 156837 157657 158726 160884 164131 168022 172368 176995 181312 184835 187829 190863 193897 196368 198056
53684A98056J412J889K725L285L161K535K039K018K145J959J552J284J189J125
$$ 198056 199468 201357 204082 207367 210528 213063 215102 217120 219265 221224 222776 224060 225249 226374
53670B26374J159J264R44j36j372j753j091k00J87J28J00L56O83N99k04j370k060
$$ 226374 227533 228797 229741 229605 228233 226480 225389 225189 225376 225504 225604 225960 226643 227242 227038 225668 223608
53653B23608j749o82N53J433J465L79j180j880j168j8L44oj35K53N75M15Q0M3
$$ 223608 221859 221177 221730 223163 224628 225007 223827 221947 220779 220761 221105 221099 220964 221217 221792 222207 222287 222330
53635B22330L17N14K92k22m64r3M48N79N70J105J893J817P40k3M31J409J952K263
$$ 222330 222647 223161 223453 223231 222767 222674 223122 223701 224271 225376 227269 229086 229826 229803 230234 231643 233595 235858
53617B35858K843L333L274L203L813M756N257N287N153M724M076M077N079N891
$$ 235858 238701 242034 245308 248511 252324 257080 262337 267624 272777 277501 281577 285654 290733 296624
53603B96624N383M333M223M892N107M826M999N476N153M192M113N296O289O040
$$ 296624 302007 306340 310563 315455 320562 325388 330387 335863 341016 345208 349321 354617 360906 366946
53589C66946N273M892M602L915L295L342L758L968L962L877L429K484J515R29
$$ 366946 372219 377111 381713 385628 388923 392265 396023 399991 403953 407830 411259 413743 415258 416187
53575D16187M73j95q82j301j537j702j570j094p58r18j201j020m21L3l8n56j293
$$ 416187 416660 416465 415583 414282 412745 411043 409473 408379 407621 406703 405502 404482 404061 404094 404056 403500 402207
53558D02207k066k688k951k774k351k036j937j713j038k55p1m81o67j62N54R81
$$ 402207 400141 397453 394502 391728 389377 387341 385404 383691 382653 382398 382327 381846 381179 381017 381571 382552
53542C82552J364J935K191J739J154J109J246R46N90R93J969K685L112L911N052
$$ 382552 383916 385851 388042 389781 390935 392044 393290 394236 394826 395819 397788 400473 403585 407496 412548
53527D12548N794O006O319O970P542P947Q567R375R925J0288J0995J2001J2732
$$ 412548 418342 424348 430667 437637 445179 453126 461693 471068 480993 491281 502276 514277 527009
53514E27009J3253J4276J5856J7119J7578J7741J8164J8813J9570K0521K1479
$$ 527009 540262 554538 570394 587513 605091 622832 640996 659809 679379 699900 721379
53503G21379K2110K2751K4211K6511K8684K9991L0593L0870L0951L1111L1717
$$ 721379 743489 766240 790451 816962 845646 875637 906230 937100 968051 999162 1030879
53492A030879L2473L2609L2018L1484L1477L1645L1623L1573L1691L1942L2485
$$ 1030879 1063352 1095961 1127979 1159463 1190940 1222585 1254208 1285781 1317472 1349414 1381899
53481A381899L3518L4607L4961L4500L3820L2985L1411K9094K6959K5664K4880
$$ 1381899 1415417 1450024 1484985 1519485 1553305 1586290 1617701 1646795 1673754 1699418 1724298
53470A724298K4017K2877K1470J9999J9065J8929J8645J7104J4838J3398J2910
$$ 1724298 1748315 1771192 1792662 1812661 1831726 1850655 1869300 1886404 1901242 1914640 1927550
53459A927550J1799R214O059L137p9l948p545j0092j2182j4485j6422j7382j8160
$$ 1927550 1939349 1948563 1954622 1957759 1957680 1953732 1946187 1936095 1923913 1909428 1893006 1875624 1857464
53446A857464j9887k2325k4451k6122k7887k9678l0836l1227l1337l1498l1718
$$ 1857464 1837577 1815252 1790801 1764679 1736792 1707114 1676278 1645051 1613714 1582216 1550498
53435A550498l2039l2394l2382l1716l0573k9140k7330k5281k3502k2052k0390
$$ 1550498 1518459 1486065 1453683 1421967 1391394 1362254 1334924 1309643 1286141 1264089 1243699
53424A243699j8417j6826j5849j4619j2508j0187q451o905m767k170L43K906N773
$$ 1243699 1225282 1208456 1192607 1177988 1165480 1155293 1146842 1139937 1135170 1133000 1133343 1136249 1142022
53411A142022Q341R991J1363J3548J6367J8759K0580K2713K5403K7710K8896K9348
$$ 1142022 1150363 1160354 1171717 1185265 1201632 1220391 1240971 1263684 1289087 1316797 1345693 1375041
53399A375041K9944L1202L3253L5947L8801M1351M3639M5971M8240N0111N1772
$$ 1375041 1404985 1436187 1469440 1505387 1544188 1585539 1629178 1675149 1723389 1773500 1825272
53388A825272N3940N7000O0599O4092O7063O9385P1213P2883P4579P6157P7377
$$ 1825272 1879212 1936212 1996811 2060903 2127966 2197351 2268564 2341447 2416026 2492183 2569560
53377B569560P8158P8388P7846P6529P4748P2695P0260O7451O4476O1173N6944
$$ 2569560 2647718 2726106 2803952 2880481 2955229 3027924 3098184 3165635 3230111 3291284 3348228
53366C348228N1713M6356M1761L8002L4768L1877K8838K4658J8945J2577O530
$$ 3348228 3399941 3446297 3488058 3526060 3560828 3592705 3621543 3646201 3665146 3677723 3684253
53355C684253O29n720j2171j8018k3705l0595l9203m8684n7938o6258p2858p6910
$$ 3684253 3684882 3679162 3666991 3648973 3625268 3594673 3555470 3506786 3448848 3382590 3309732 3232822
53343C232822p8521p8852p8822p8256p6667p4372p2341p1191p0745p0471p0082
$$ 3232822 3154301 3075449 2996627 2918371 2841704 2767332 2694991 2623800 2553055 2482584 2412502
53332B412502o9585o8944o7934o6466o4831o3285o1499n8941n5799n2868n0335
$$ 2412502 2342917 2273973 2206039 2139573 2074742 2011457 1949958 1891017 1835218 1782350 1732015
53321A732015m7386m3400l8892l4775l1269k8163k5674k4276k3853k3640k2962
$$ 1732015 1684629 1641229 1602337 1567562 1536293 1508130 1482456 1458180 1434327 1410687 1387725
53310A387725k1523j9217j6155j2886j0142q352p497p183o661n216k936p96L53
$$ 1387725 1366202 1346985 1330830 1317944 1307802 1299450 1291953 1284770 1278109 1272893 1269957 1269161 1269514
53297A269514O09O78J111K182L995O311Q577J0576J2689J5212J7866K0359K2910
$$ 1269514 1270123 1270801 1271912 1274094 1278089 1284400 1292977 1303553 1316242 1331454 1349320 1369679 1392589
53284A392589K5818K8874L1668L4037L5825L6696L6597L6023L5437L4886L4425
$$ 1392589 1418407 1447281 1478949 1512986 1548811 1585507 1622104 1658127 1693564 1728450 1762875
53273A762875L4290L4176L3105L0622K7506K4761K2463K0269J8329J6951J5915
$$ 1762875 1797165 1831341 1864446 1895068 1922574 1947335 1969798 1990067 2008396 2025347 2041262
53262B041262J4806J3539J1927R337N526J206k884o867j0945j4665j7828k1300
$$ 2041262 2056068 2069607 2081534 2090871 2096397 2097603 2094719 2087852 2076907 2062242 2044414 2023114
53250B023114k5692k9989l2852l4681l6948l9802m1999m2952m3350m3587m3153
$$ 2023114 1997422 1967433 1934581 1899900 1862952 1823150 1781151 1738199 1694849 1651262 1608109
53239A608109m1975m1005m0828m0684l9481l7164l4699l3104l2741l3064l3064
$$ 1608109 1566134 1525129 1484301 1443617 1404136 1366972 1332273 1299169 1266428 1233364 1200300
53228A200300l2321l1522l1363l1416l0858k9919k9458k9311k8290k5946k3204
$$ 1200300 1167979 1136457 1105094 1073678 1042820 1012901 983443 954132 925842 899896 876692
53217H76692k0961j9113j7346j5873j4905j4178j3494j3139j3333j3826j4276
$$ 876692 855731 836618 819272 803399 788494 774316 760822 747683 734350 720524 706248
53206G06248j4604j4731j4515j4057j3566j2931j1974j1120j1071j1735j2256
$$ 706248 691644 676913 662398 648341 634775 621844 609870 598750 587679 575944 563688
53195E63688j2168j1839j1569j1136j0476j0053j0153j0496j0760j0961j1025
$$ 563688 551520 539681 528112 516976 506500 496447 486294 475798 465038 454077 443052
53184D43052j0708j0187j0052j0390j0469r748q599p672p137o830o691o576o154
$$ 443052 432344 422157 412105 401715 391246 381498 372899 365227 358090 351260 344569 337993 331839
53171C31839n392m831m970n666o302o379n752m689l805l568l753l755l448l332
$$ 331839 326447 321616 316646 310980 304678 298299 292547 287858 284053 280485 276732 272977 269529 266197
53157B66197l721m326m669m511l793k688j742j445j582j553j286j207j398j486
$$ 266197 262476 258150 253481 248970 245177 242489 240747 239302 237720 236167 234881 233674 232276 230790
53143B30790j439j650k036j924j192o55r03j434j518j193q91o56l71k53m61n56
$$ 230790 229351 227701 225665 223741 222549 221894 220991 219557 218039 216846 215955 215299 214928 214675 214214 213658
53127B13658n2P40R95L77o40j353j408r18l74l45r23j543j593j166r80j520k433
$$ 213658 213606 214346 215341 215718 215078 213725 212317 211399 211025 210680 209757 208214 206621 205455 204475 202955 200522
53110B00522k795k087q45j48m04r69j201j382k042k811k780j910j186j251j705
$$ 200522 197727 195640 194795 194647 194243 193274 192073 190691 188649 185838 183058 181148 179962 178711 177006
53095A77006j935j876j647j170n50k39l45l21K63J116J751K144K418K370J816
$$ 177006 175071 173195 171548 170378 169828 169589 169244 168923 169186 170302 172053 174197 176615 178985 180801
53080A80801J066N43K34o4k30j8M52Q35J032J091P80k13j654k716k758k001j321
$$ 180801 181867 182410 182644 182580 182350 182332 182784 183619 184651 185742 186522 186309 184655 181939 179181 177180 175859
53063A75859j369j917k227k023j854k199k581k179j206q67j736k853k926j885
$$ 175859 174490 172573 170346 168323 166469 164270 161689 159510 158304 157437 155701 152848 149922 148037
53049A48037p46k23k03l76p15j170j436j296j024j063j405j524j073l92j48n21
$$ 148037 147291 147068 146865 146489 145774 144604 143168 141872 140848 139785 138380 136856 135783 135391 135243 134722
53033A34722j093j479j748k053k241k051j505q09j99k5o62j915k883k855k128
$$ 134722 133629 132150 130402 128349 126108 124057 122552 121743 121544 121519 120857 118942 116059 113204 111076
53018A11076j532j383j378j242q84j39J004J900J666K48j362k109j787r15q6M99
$$ 111076 109544 108161 106783 105541 104657 104518 105522 107422 109088 109336 107974 105865 104078 103163 103077 103576
53002A03576J019J631K067J880J130M40J55J2j66l8M86P49K44m81o05j82K12M30
$$ 103576 104595 106226 108293 110173 111303 111743 111898 111910 111744 111706 112192 112941 113185 112704 112099 111917 112129 112559
52984A12559N69L83k51p54o70m98p22o91K82J362J263M29M20J332J617O49l70
$$ 112559 113128 113511 113260 112506 111836 111338 110616 109925 110207 111569 112832 113261 113681 115013 116630 117279 116909
52967A16909m17L5K71M50P73Q72O50O24Q58P52K89K94R40J309R77P44J074J249
$$ 116909 116492 116527 116798 117248 118021 118893 119543 120167 121025 121777 122066 122360 123300 124609 125586 126330 127404 128653
52949A28653Q20N78J106J669J585J509K152K869K707K007J692J759J666J496J635
$$ 128653 129473 130051 131157 132826 134411 135920 138072 140941 143648 145655 147347 149106 150772 152268 153903
52934A53903J900K062K557L625M454M160L074J997R55k00p87j80Q65J101N36M3
$$ 153903 155803 157865 160422 164047 168501 172661 175735 177732 178687 178487 177700 177520 178385 179486 180022 180065
52918A80065k56q41j440j303o51n45j260j974k050j608r01j06L29J11k87l17l39
$$ 180065 179809 178968 177528 176225 175574 175029 173769 171795 169745 168137 167236 167130 167459 167570 167283 166966 166627
52901A66627q73j272n56P64J121K31n52m06k7o8k9N60J107R60N04L72L87Q2l12
$$ 166627 165754 164482 163926 164690 165811 166042 165490 165084 165057 164989 164960 165520 166627 167587 168091 168463 168850 168932 168620
52882A68620k55J25K25r6m13m02j23K22M36L54L3j68K3L69L34k57r22r69l02L27
$$ 168620 168365 168490 168715 168619 168206 167804 167681 167903 168339 168693 168726 168558 168581 168950 169284 169027 168105 167136 166834 167161
52862A67161R4q36j448j161n75n01p36m50N03J372J556J220Q07N08M01N87J026
$$ 167161 167255 166419 164971 163810 163235 162734 161998 161548 162051 163423 164979 166199 167006 167514 167915 168502 169528
52845A69528J505J850J973J762J204N35k2m92q39o82J20R12Q62L2p57j071j140
$$ 169528 171033 172883 174856 176618 177822 178357 178335 177843 177004 176322 176442 177354 178216 178248 177491 176420 175280
52828A75280j120q46m46m20p54p64j84K01l54j338j591r18l55o31j113o94O40
$$ 175280 174160 173314 172868 172448 171694 170930 170746 170947 170593 169255 167664 166746 166391 165760 164647 163953 164593
52811A64593J747J813J297J088J238J129N91J05j28n26j281j873j876j669j796
$$ 164593 166340 168153 169450 170538 171776 172905 173496 173601 173473 172947 171666 169793 167917 166248 164452
52796A64452k065j939j507j434j996k715k958k577j973j737k038k347k025j322
$$ 164452 162387 160448 158941 157507 155511 152796 149838 147261 145288 143551 141513 139166 137141 135819
52782A35819j275k298l438l519k558j505r23o35l94k74l80o77j041j268j202j098
$$ 135819 134544 132246 128808 125289 122731 121226 120303 119668 119274 119000 118620 117943 116902 115634 114432 113334
52766A13334j425k035k152j535j030j307j719j282l00L0o66j643k269k590k683
$$ 113334 111909 109874 107722 106187 105157 103850 102131 100849 100549 100579 99913 98270 96001 93411 90728
52751I0728k402j933j725j751j518r57n89o31o19j37N82J070J151R28N90L42J98
$$ 90728 88326 86393 84668 82917 81399 80442 79853 79222 78603 78466 79048 80118 81269 82197 82787 83129 83327
52734H3327j23p81j435j695j722j845j849j264k97L31M19M65P65J004R06O16L15
$$ 83327 83204 82423 80988 79293 77571 75726 73877 72613 72316 72647 73066 73531 74296 75300 76206 76822 77137
52717G7137k5k77j26L91P24L99n12j565k236k128j295l97j27m48p75p84o30m69
$$ 77137 77112 76835 76709 77100 77824 78223 77711 76146 73910 71782 70487 70090 69963 69515 68740 67956 67326 66857
52699F6857k23J53O23J210J820K004J409L41m94o96l21L62Q42N52l38p01J65J351
$$ 66857 66634 66787 67410 68620 70440 72444 73853 74194 73700 73004 72683 73045 73887 74439 74101 73400 73565 74916
52681G4916J432M90m6N60J510J833J540J152R38R23J105J280J191R23P48O28M20
$$ 74916 76348 76838 76792 77352 78862 80695 82235 83387 84325 85248 86353 87633 88824 89747 90495 91123 91543
52664I1543M40J082J994K411K200J846J483Q97L26K91N22K12o16j070q92q48j207
$$ 91543 91983 93065 95059 97470 99670 101516 102999 103896 104222 104513 105035 105247 104631 103561 102669 101821 100614
52647A00614j164k59O52O00k32j152j950k588k659k081j591j748j964j347j26
$$ 100614 99450 99191 99843 100443 100211 99059 97109 94521 91862 89781 88190 86442 84478 83131 83005
52632H3005P23Q72R51J511K327K767K378J188l08j499k149k386k166j274J7Q19
$$ 83005 83728 84600 85551 87062 89389 92156 94534 95722 95414 93915 91766 89380 87214 85940 85957 86776
52616H6776N87k18p95r31q76o36K9J043J826J814J043K13P9N93Q76L13n84r03
$$ 86776 87363 87145 86350 85419 84543 83907 83936 84979 86805 88619 89662 89875 89954 90547 91423 91736 91152 90249
52598I0249o36m81m98L4J291K267J983O93m82p13l3Q76J222Q46M24N71R45R21
$$ 90249 89613 89132 88634 88668 89959 92226 94209 94902 94420 93707 93674 94550 95772 96618 97042 97613 98558 99479
52580I9479P83J283K181K463K058K013K668L027K509J974K209K611K341J767J631
$$ 99479 100262 101545 103726 106189 108247 110260 112928 115955 118464 120438 122647 125258 127599 129366 130997
52565A30997J684J287P17O81J059J127P40L23K9k33k31K20O72O33L59L65M55J99
$$ 130997 132681 133968 134685 135366 136425 137552 138292 138615 138644 138411 138180 138400 139072 139705 140064 140429 140884 141083
52547A41083q9J69O85O64J35j88j91m36q32n07O63J471R73k09p76m25J28M54Q03
$$ 141083 140994 141163 141848 142512 142647 142459 142268 141832 141000 140493 141156 142627 143600 143391 142615 142190 142318 142772 143575
52528A43575J289J401P14l35r02q19p10r10q99k36M71L33l88n23K33P66J32j151
$$ 143575 144864 146265 146979 146644 145742 144923 144213 143303 142404 142168 142639 142972 142584 142061 142294 143060 143192 142041
52510A42041j885j648r08j45N20J103J619K016K020J403N14K4mj53n32m32M49
$$ 142041 140156 138508 137600 137455 137975 139078 140697 142713 144733 146136 146650 146674 146670 146517 145985 145553 146002
52493A46002J268J176M65j16m63p45o09K79J263J325M34n13q70o28O3Q78J067
$$ 146002 147270 148446 148911 148795 148332 147587 146978 147257 148520 149845 150279 149766 148896 148268 148331 149209 150276
52476A50276K12q49p81N10J685J709R72M41L50J45o62j827k489j908l03J199J650
$$ 150276 150488 149639 148858 149368 151053 152762 153734 154175 154525 154670 154008 152181 149692 147784 147481 148680 150330
52459A50330J121K97l29o02m32L3K65q5o69r21p05j44P24J561J479R1j508j724
$$ 150330 151451 151748 151419 150817 150385 150418 150683 150598 149929 149008 148303 148159 148883 150444 151923 152014 150506 148782
52441A48782l73J146J530P36m63j288j257l76P51J480J808K056K033J275Q2m93
$$ 148782 148409 149555 151085 151821 151358 150070 148813 148437 149188 150668 152476 154532 156565 157840 157922 157429
52425A57429J5P91P75j1o16l57L91O40q7j170j548r79k64j26l60m24l38l58k68
$$ 157429 157444 158235 159010 158999 158383 158026 158417 159057 158970 157800 156252 155273 155009 154883 154523 154099 153761 153403 153135
52406A53135L39J278J963K170K034J561Q20L60O13J044P85L7j03P21J598J723
$$ 153135 153474 154752 156715 158885 160919 162480 163300 163660 164273 165317 166102 166139 166036 166757 168355 170078
52390A70078J385J192J080O31j22p29q80n56N4N64O42M82O95J501K357K634K367
$$ 170078 171463 172655 173735 174366 174244 173515 172635 172079 172133 172697 173339 173821 174516 176017 178374 181008 183375
52373A83375K055J973K018K055K075J983J549P87K14M98J576K477K339J534J219
$$ 183375 185430 187403 189421 191476 193551 195534 197083 197870 198084 198582 200158 202635 204974 206508 207727
52358B07727J801K459K440K034J852J833J664J629K185K998L218K600J717J117
$$ 207727 209528 211987 214427 216461 218313 220146 221810 223439 225624 228622 231840 234440 236157 237274
52344B37274R61J278J946K442K284J671J199J071J105J296J663J775J211M78N67
$$ 237274 238235 239513 241459 243901 246185 247856 249055 250126 251231 252527 254190 255965 257176 257654 258221
52329B58221J595K616K856K456J902J486J473K033K831L287L362L520L909M248
$$ 258221 259816 262432 265288 267744 269646 271132 272605 274638 277469 280756 284118 287638 291547 295795
52315B95795M592N338O412P264P850Q717R877J0556J0496J0556J1366J2348J2777
$$ 295795 300387 305725 312137 319401 327251 335968 345845 356401 366897 377453 388819 401167 413944
52302D13944J3044J3932J5170J5779J5659J5797J6838J8270J9222J9406J9066
$$ 413944 426988 440920 456090 471869 487528 503325 520163 538433 557655 577061 596127
52291E96127J8414J7527J6616J6029J6001J6388J6713J6444J5359J3659J1794
$$ 596127 614541 632068 648684 664713 680714 697102 713815 730259 745618 759277 771071
52280G71071J0239R273Q801Q316P218N320L057J228M31N78Q09J20j676l700m865
$$ 771071 781310 790583 799384 807700 814918 820238 823295 824523 824954 825532 826341 826461 824785 821085 816220
52265H16220m928m466m097l962l898l733l407k949k370j592o65j1k7l02K60K170
$$ 816220 811292 806826 802729 798767 794869 791136 787729 784780 782410 780818 780153 780142 780115 779813 780073 782243
52249G82243M652O575P685Q430R078R673J0450J1601J2772J3482J3818J4128J4267
$$ 782243 786895 793470 801155 809585 818663 828336 838786 850387 863159 876641 890459 904587 918854
52236I18854J3839J2946J1978J0869R320P661O636O338O066N244L874K133K48
$$ 918854 932693 945639 957617 968486 977806 985467 992103 998441 1004507 1009751 1013625 1015758 1016006
52223A016006j265k070k652l804n435o691p232p588q216q946r519r898j0021r937
$$ 1016006 1014741 1012671 1010019 1006215 1000780 994089 986857 979269 971053 962107 952588 942690 932669 922732
52209I22732j0158j1036j1880j1595j0266r077q569q050o961n711m773l988l207
$$ 922732 912574 901538 889658 878063 867797 858720 850151 842101 835140 829429 824656 820668 817461
52196H17461k732k571k186j372o53l74k19ON3lK40M56k23j450j544RJ417J082
$$ 817461 814729 812158 809972 808600 807947 807573 807354 807360 807413 807410 807650 808106 807883 806433 804889 804898 806315 807397
52178H07397j7m6P46O17p62j945k144k157k610k929k632k344k752l468l703l409
$$ 807397 807380 807334 808080 808697 807935 805990 803846 801689 799079 796150 793518 791174 788422 784954 781251 777842
52162G77842l042k733k375k262k851l937m577m146l074k282k051j885j463j257
$$ 777842 774800 772067 769692 767430 764579 760642 756065 751919 748845 746563 744512 742627 741164 739907
52148G39907j820k863l644l961m210m517m602m487m526m587m047k857j843j563
$$ 739907 738087 735224 731580 727619 723409 718892 714290 709803 705277 700690 696643 693786 691943 690380
52134F90380j644j693j963k632l192l246l172l318l242k549j819j741j935j647
$$ 690380 688736 687043 685080 682448 679256 676010 672838 669520 666278 663729 661910 660169 658234 656587
52120F56587j058q83j054r00l28K89J164K831M852O110O476P096Q616J0267J1195
$$ 656587 655529 654646 653592 652692 652364 652653 653817 656648 661500 667610 674086 681182 689798 700065 711260
52105G11260J1750J2787J4386J6003J7370J8666J9953K0984K1523K1566K1416
$$ 711260 723010 735797 750183 766186 783556 802222 822175 843159 864682 886248 907664
52094I07664K1581K2285K3014K2929K1904K0698J9888J9074J7504J5177J2893
$$ 907664 929245 951530 974544 997473 1019377 1040075 1059963 1079037 1096541 1111718 1124611
52083A124611J1321J0382R450P918N598K815J49k029l734n118o226p067p743q391
$$ 1124611 1135932 1146314 1155764 1163682 1169280 1172095 1172244 1170215 1166481 1161363 1155137 1148070 1140327 1131936
52069A131936r016r529r863r965r796r447r094q745q114p013n815n115m869m235
$$ 1131936 1122920 1113391 1103528 1093563 1083767 1074320 1065226 1056481 1048367 1041354 1035539 1030424 1025555 1021320
52055A021320k613m92J201K398L809N537O644O570O164O574P590Q113P931P966
$$ 1021320 1018707 1018215 1019416 1021814 1025623 1031160 1037804 1044374 1050538 1057112 1064702 1072815 1080746 1088712
52041A088712Q696R356R152Q353P652P102O292N108L740K237N85q94j740j929
$$ 1088712 1097408 1106764 1115916 1124269 1131921 1139023 1145315 1150423 1154163 1156400 1156985 1156091 1154351 1152422
52027A152422k009k669m207o219p882q786r410j0317j1169j1169j0513j0430j1512
$$ 1152422 1150413 1147744 1143537 1137318 1129436 1120650 1111240 1100923 1089754 1078585 1068072 1057642 1046130
52014A046130j2934j3736j4093j4661j5506j6357j7236j8096j8362j7748j7034
$$ 1046130 1033196 1019460 1005367 990706 975200 958843 941607 923511 905149 887401 870367
52003H70367j7153j7909j8478j8761j9275j9998k0403k0551k0994k1583k1430
$$ 870367 853214 835305 816827 798066 778791 758793 738390 717839 696845 675262 653832
51992F53832k0323j9204j8886j9075j9119j8928j8667j8209j7449j6707j6266
$$ 653832 633509 614305 595419 576344 557225 538297 519630 501421 483972 467265 450999
51981D50999j5834j4995j3852j2807j1958j1188j0580j0229r856r123q297p988
$$ 450999 435165 420170 406318 393511 381553 370365 359785 349556 339700 330577 322280 314292
51969C14292q209q226p591o755o319o073n345m148l283l267l715l918l609k900
$$ 314292 306083 297857 290266 283511 277192 271119 265774 261626 258343 255076 251361 247443 243834 240934
51955B40934k011j349j422k169k771k680k454k901l736l948l319k667k505k372
$$ 240934 238923 237574 236152 233983 231212 228532 226078 223177 219441 215493 212174 209507 207002 204630
51941B04630j799j176j182j874k764l320l192k361j344p60n96l94k32p10j775
$$ 204630 202831 201655 200473 198599 195835 192515 189323 186962 185618 184858 184262 183868 183636 182926 181151
51926A81151k432k065j268q18o12k42J24K24M24J068J549J004l37j362j552j478
$$ 181151 178719 176654 175386 174568 173956 173714 173838 174062 174486 175554 177103 178107 177770 176408 174856 173378
51910A73378j745k171k134j420m92j14n92j385j747j703j854k272k350j963j823
$$ 173378 171633 169462 167328 165908 165416 165302 164710 163325 161578 159875 158021 155749 153399 151436 149613
51895A49613k186k174j180r9j10r68j493j320j054j031j005r22r93j070q25m17
$$ 149613 147427 145253 144073 143974 143864 142896 141403 140083 139029 137998 136993 136071 135078 134008 133183 132766
51879A32766k09NO36J345J440J043Q79J004Q18L65N03J497K494K771K596K419
$$ 132766 132557 132562 133198 134543 135983 137026 137905 138909 139727 140092 140595 142092 144586 147357 149953 152372
51863A52372K053J240L91J39M79P97N74k04j089j468j051j90M29M68J06l37n92
$$ 152372 154425 155665 156056 156195 156674 157471 158045 157841 156752 155284 154233 154043 154472 154940 155046 154709 154117
51846A54117m75j7M27N45M34L56L78N39R99J657J943J512Q34N37N35L59L6o7L5
$$ 154117 153642 153625 154052 154597 155031 155387 155765 156304 157303 158960 160903 162415 163249 163786 164321 164680 164716 164649 164684
51827A64684J38M16R75J224N70m72q42m16K8J98N40J035R94K39m58n00j89j2L0
$$ 164684 164822 165238 166213 167437 168007 167535 166693 166277 166305 166503 167043 168078 169072 169311 168853 168353 168164 168152 168182
51808A68182R4J69L42P06Q62K07j057j908j666n71Q46K182K872K442J321O21P67
$$ 168182 168276 168445 168787 169493 170355 170562 169505 167597 165931 165360 166206 168388 171260 173702 175023 175644 176411
51791A76411J079R50O12M43M05N06J000J638J606P12r7j2O05J029J328J901K499
$$ 176411 177490 178440 179052 179495 179900 180406 181406 183044 184650 185362 185265 185253 185858 186887 188215 190116 192615
51774A92615K566K274K347K995L664L840L649L522L644L796L662L233K872K804
$$ 192615 195181 197455 199802 202797 206461 210301 213950 217472 221116 224912 228574 231807 234679 237483
51760B37483K709K114J044q6j053j815k146j922j632j853k236j882q07q4k15l30
$$ 237483 240192 242306 243350 243264 242211 240396 238250 236328 234696 232843 230607 228725 227918 227834 227619 227289
51744B27289M32J562J837R18l74j084r70m56r4J9L00J035J847K162K045K005K207
$$ 227289 227721 229283 231120 232038 231664 230580 229610 229154 229060 229079 229379 230414 232261 234423 236468 238473 240680
51727B40680K487K955L679L955K908R77l35l12L63J037J895K884L099K039M42
$$ 240680 243167 246122 249801 253756 256664 257641 257306 256994 257357 258394 260289 263173 266272 268311 268753
51712B68753q26j852k818l066k020m13M58L49Nj23k56o09j068j518j893k026j788
$$ 268753 267927 266075 263257 260191 258171 257758 258216 258565 258570 258447 258191 257582 256514 254996 253103 251077 249289
51695B49289j248n19L77J266J916K418K973L339L144K841L380M785N994O436O517
$$ 249289 248041 247522 247899 249165 251081 253499 256472 259811 262955 265796 269176 273961 279955 286391 292908
51680B92908O151M223M76l385n649o687p775q780q545o998n321m294l798l717
$$ 292908 299059 303282 303758 300373 294724 288037 280262 271482 262937 255939 250618 246324 242526 238809
51666B38809m032m050k923r93M71J074J690K823L733L535K407J118o0j441l224
$$ 238809 234777 230727 227804 226811 227282 228356 230046 232869 236602 240137 242544 243662 243602 242161 238937
51651B38937n074o264o253n256m141l490l039k349j612j357j576j775j636j142
$$ 238937 233863 227599 221346 216090 211949 208459 205420 203071 201459 200102 198526 196751 195115 193973
51637A93973l36M76N92k78j355j657j307j229j625j740j125k79J48J51R2J47K92
$$ 193973 193637 194113 194705 194427 193072 191415 190108 188879 187254 185514 184389 184110 184258 184409 184501 184648 184940
51620A84940M43M78L63K79L08K28j9Q0R33J945K027J124M31R39K249L176L085
$$ 184940 185383 185861 186224 186503 186811 187039 187020 187100 188033 189978 192005 193129 193560 194499 196748 199924 203009
51603B03009K390J979K375L307M025M078L716L401L235L017K658K126J317L16
$$ 203009 205399 207378 209753 213060 217085 221163 224879 228280 231515 234532 237190 239316 240633 240949
51589B40949l91m60j80r8l45p19j143j559j669j275p01l02J54J045K029K362K020
$$ 240949 240558 240098 239918 239820 239475 238756 237613 236054 234385 233110 232409 232107 232261 233306 235335 237697 239717
51572B39717J808K265L117L850M298M442M088L101J729N02j66l15m51j002j746
$$ 239717 241525 243790 246907 250757 255055 259497 263585 266686 268415 268917 268751 268436 267985 266983 265237
51557B65237k091j969j849j727q73Q19K070J704L47l53Q5O34M56j17m48m72m49
$$ 265237 263146 261177 259328 257601 256728 257547 259617 261321 261668 261315 261400 262034 262490 262373 261925 261453 261004
51540B61004m82o67j132j830k519l008l128k629j626q56r16j436j600j342j218
$$ 261004 260522 259855 258723 256893 254374 251366 248238 245609 243983 243127 242211 240775 239175 237833 236615
51525B36615j290j026l27K33L15J64n2m70r23q80l60j69q49j930k542k335j543
$$ 236615 235325 234299 233972 234205 234520 234684 234632 234162 233239 232359 231999 231830 230981 229051 226509 224174 222631
51508B22631o10O0L44N25Q35R42M58k00j55O06J176J063P96Q88J047R15Q59J404
$$ 222631 222021 222081 222425 222950 223785 224727 225185 224985 224830 225436 226612 227675 228471 229359 230406 231321 232180 233584
51490B33584K401L289L770L798L387K826K622K823K910K777L191M541N796N615
$$ 233584 235985 239274 243044 246842 250229 253055 255677 258500 261410 264187 267378 271919 277715 283330
51476B83330M222L163L228L631L436K922K860L136K911J933R44N69N34K36k45
$$ 283330 287552 290715 293943 297574 301010 303932 306792 309928 312839 314772 315716 316285 316819 317055 316810
51461C16810k72M37J435K003J682M09j418k989l683l640l424l196k752k342k581
$$ 316810 316538 316975 318410 320413 322095 322504 321086 318097 314414 310774 307350 304154 301402 299060 296479
51446B96479l404l900l603l149l125l096k495j737j563j749j569j109j068j393
$$ 296479 293075 289175 285572 282423 279298 276202 273707 271970 270407 268658 267089 265980 264912 263519
51432B63519j163j1J237J558R05J74L83J681K941K715R89n62p06k47o14j593j910
$$ 263519 262356 262345 263582 265140 266045 266219 266602 268283 271224 273939 274928 274366 273660 273413 272799 271206 269296
51415B69296j521j642k556l075k599k164k810m098n009n275n117m573l787l271
$$ 269296 267775 266133 263577 260502 257903 255739 252929 248831 243822 238547 233430 228857 225070 221799
51401B21799l200l052k560k264k608l089l028k567k295k349k503k732l054l154
$$ 221799 218599 215547 212987 210723 208115 205026 201998 199431 197136 194787 192284 189552 186498 183344
51387A83344k745k046j484j148r26q60j037j320j469j333q11QO36N98J66J31O71
$$ 183344 180599 178553 177069 175921 174995 174135 173098 171778 170309 168976 168165 168173 168809 169407 169573 169704 170375
51370A70375J084Q23J70m19r61j543j937k030k163k565k916k849k433j820r15
$$ 170375 171459 172282 172452 172033 171072 169529 167592 165562 163399 160834 157918 155069 152636 150816 149901
51355A49901K64J357K067K336K022R99j69m89J91R63J293J775K873L815L652K762
$$ 149901 150165 151522 153589 155925 157947 158946 158777 158288 158479 159442 160735 162510 165383 169198 172850 175612
51339A75612K294K626L147L269K802J670J03j087j227o93m84j011j894k749l551
$$ 175612 177906 180532 183679 186948 189750 191420 191523 190436 189209 188516 188032 187021 185127 182378 178827
51324A78827m228m527m337l805l108k433k046k118k517k977l263l124k471j708
$$ 178827 174599 170072 165735 161930 158822 156389 154343 152225 149708 146731 143468 140344 137873 136165
51310A36165j425j548j397q51o54j162j538r46J23N56J32n20j041j561k021k154
$$ 136165 134740 133192 131795 130944 130290 129128 127590 126644 126767 127323 127455 126935 125894 124333 122312 120158
51294A20158j933j355j44J550K485J510o93k092j663l48M55M84L93P05J485K398
$$ 120158 118225 116870 116726 118276 120761 122271 121578 119486 117823 117475 117930 118414 118807 119512 120997 123395
51278A23395K825K307J135J48k11k69m03n06l85j91j86l63o12r17j221j324j142
$$ 123395 126220 128527 129662 129810 129599 129330 128927 128421 128036 127845 127659 127296 126684 125767 124546 123222 122080
51261A22080q89q05q69r13q76q39q88j015j032o84O6Q68J296J239Q78M06j6k12
$$ 122080 121191 120386 119517 118604 117728 116889 116001 114986 113954 113270 113336 114204 115500 116739 117617 118023 118007 117795
51243A17795j55j01k66m93m64k05j7m9j67k45k38o3L31P27Q39O90O01O93P57O40
$$ 117795 117640 117539 117273 116780 116316 116111 116094 116045 115878 115633 115395 115332 115663 116390 117229 117919 118520 119213 119970 120610
51223A20610N71Q43J326J500J030K81L0N91J361J533J110Q63J205J648J618J342
$$ 120610 121181 122024 123350 124850 125880 126161 126191 126782 128143 129676 130786 131649 132854 134502 136120 137462
51207A37462J476K138K742K722K092J307P93O08M62J42j20P9O61J019O78k60j334
$$ 137462 138938 141076 143818 146540 148632 149939 150732 151340 151802 151944 151824 151903 152564 153583 154261 154001 152667
51190A52667j989j699m49Q00Q05m38j559j535q44n39q25j270j682j989j802j001
$$ 152667 150678 148979 148530 149330 150135 149697 148138 146603 145759 145220 144395 143125 141443 139454 137652 136651
51174A36651l44o49j566k078j929j701j660j495j135q67n83J72J253J897J863
$$ 136651 136307 135658 134092 132014 130085 128384 126724 125229 124094 123227 122644 122816 124069 125966 127829
51159A27829J712J749J508P45J10K47Q42J089P14L9n94r41q01l16j13o32j468
$$ 127829 129541 131290 132798 133543 133653 133900 134742 135831 136545 136584 135990 135049 134248 133932 133819 133187 131719
51142A31719j837j613j427j730k187k198j681j117r24j040j130j027q37p07o88
$$ 131719 129882 128269 126842 125112 122925 120727 119046 117929 117005 115965 114835 113808 112971 112264 111576
51127A11576p95r58q96l34M73Q07L20m01m97J05O47N36K4k08J73Q64J303J265
$$ 111576 110781 109823 108927 108593 109066 109873 110193 109792 109295 109400 110047 110583 110607 110399 110572 111436 112739 114004
51109A14004J032R66J044R83Q02Q03R74Q71L76N0L38R03J256J624K391L013K456
$$ 114004 115036 116002 117046 118029 118831 119634 120608 121479 121855 121905 122243 123146 124402 126026 128417 131430 133886
51092A33886P55o35m75Q96K132K406J979J491J164P36K9o49p62k07N24R61J151
$$ 133886 134641 134006 133531 134427 136559 138965 140944 142435 143599 144335 144364 143715 142953 142746 143270 144231 145382
51075A45382J276J192P76M57P77J498J804J445J073J265J784K118K264K496K697
$$ 145382 146658 147850 148626 149083 149860 151358 153162 154607 155680 156945 158729 160847 163111 165607 168304
51060A68304K415J583P12K53M8l91j154j720j537o71L09R10J029P42J53m71p20
$$ 168304 170719 172302 173014 173267 173315 172924 171770 170050 168513 167842 168151 169061 170090 170832 170985 170514 169794
51043A69794m40J17N92Q23P50L65o5o7M74J060J144P00P8m30o21l37K77P28O60
$$ 169794 169354 169471 170063 170886 171636 172001 171936 171869 172343 173403 174547 175247 175325 174895 174274 173937 174214 174942 175602
51024A75602J65n82j605k706l166k445r80J96N20K53m7k4L48P61Q29O17O94J377
$$ 175602 175767 175185 173580 170874 167708 165263 164283 164479 164999 165252 165205 165181 165529 166290 167119 167736 168430 169807
51006A69807K247K721K787K771K782K845L188L829M281M227M151M626N321N504
$$ 169807 172054 174775 177562 180333 183115 185960 189148 192977 197258 201485 205636 210262 215583 221087
50992B21087N258N320N839O230O224O247O603P047P396P866Q585R349J0056J0860
$$ 221087 226345 231665 237504 243734 249958 256205 262808 269855 277251 285117 293702 303051 313107 323967
50978C23967J1817J2859J4189J6166J8666K1088K3125K5088K7348K9995L3093
$$ 323967 335784 348643 362832 378998 397664 418752 441877 466965 494313 524308 557401
50967E57401L6745M0735M4695M8671N2930N7091O0203O1999O3405O5331O7394
$$ 557401 594146 634881 679576 728247 781177 838268 898471 960470 1023875 1089206 1156600
50956A156600O8288O7031O3485N8063N1462M4535L7907L1623K5327J8778J2082
$$ 1156600 1224888 1291919 1355404 1413467 1464929 1509464 1547371 1578994 1604321 1623099 1635181
50945A635181N583l66n528r766j2894j4653j4920j3881j1922r540p420o262o287
$$ 1635181 1640764 1640398 1634870 1625104 1612210 1597557 1582637 1568756 1556834 1547294 1539874 1533612 1527325
50932A527325p166q732j1333j5154j9565k3775k7738l1929l6439m0965m5389m9656
$$ 1527325 1520159 1511427 1500094 1484940 1465375 1441600 1413862 1381933 1345494 1304529 1259140 1209484
50920A209484n3270n5621n6675n6651n5272n2246m8384m5138m2884m0562l7316
$$ 1209484 1156214 1100593 1043918 987267 931995 879749 831365 786227 743343 702781 665465
50909F65465l3518k9886k6414k2795j9260j6378j4379j3056j2027j0803r033o864
$$ 665465 631947 602061 575647 552852 533592 517214 502835 489779 477752 466949 457916 451052
50897D51052m869l406k457j962j888j851j349n10l8k03m73k91K49P81J174J442
$$ 451052 446183 442777 440320 438358 436470 434619 433270 432760 432722 432519 432046 431755 432004 432785 433959 435401
50881D35401J671K200L379M901N928O112O012O332P142Q127R080R904J0592J1368
$$ 435401 437072 439272 442651 447552 453480 459592 465604 471936 479078 487205 496285 506189 516781 528149
50867E28149J2486J3798J4952J6064J7610J9672K1919K4385K7487L1185L4896
$$ 528149 540635 554433 569385 585449 603059 622731 644650 669035 696522 727707 762603
50856G62603L8523M2733M7952N3895O0401O7888P6489Q5490R4233J02901J11892
$$ 762603 801126 843859 891811 945706 1006107 1073995 1150484 1235974 1330207 1433108 1545000
50845A545000J20982J29560J37205J43517J47992J50530J51445J50431J46068
$$ 1545000 1665982 1795542 1932747 2076264 2224256 2374786 2526231 2676662 2822730
50836B822730J37008J23266J05934Q6193O5165M4107K4068N593j0824k4480l4967
$$ 2822730 2959738 3083004 3188938 3275131 3340296 3384403 3408471 3414064 3403240 3378760 3343793
50825C343793m2357m6411m6416m2433l5948k8506k0324j1399l287J440J518k358
$$ 3343793 3301436 3255025 3208609 3166176 3130228 3101722 3081398 3069999 3066712 3068152 3069670 3067312
50813C067312r177j8736l0885m4638n8749p2675q6381r9406j10590j18848j23953
$$ 3067312 3058135 3039399 3008514 2963876 2905127 2832452 2746071 2646665 2536075 2417227 2293274
50802B293274j26419j26583j24052j18375j10090j00666r1237q1874p2175o2137
$$ 2293274 2166855 2040272 1916220 1797845 1687755 1587089 1495852 1413978 1341803 1279666
50792A279666n2110m2324l2813k3570j4564n858K152Q951J4474J9016K2490K4293
$$ 1279666 1227556 1185232 1152419 1128849 1114285 1108427 1110579 1119530 1134004 1153020 1175510 1199803
50780A199803K4120K2327J9389J5577J1415P695M572J357k349n906q473j0107
$$ 1199803 1223923 1246250 1265639 1281216 1292631 1300326 1304898 1306255 1303906 1298000 1289527 1279420
50768A279420j1393j2623j3814j5135j6669j8204j9710k1525k3633k5319k6076
$$ 1279420 1268027 1255404 1241590 1226455 1209786 1191582 1171872 1150347 1126714 1101395 1075319
50757A075319k6253k6286k5902k4742k3110k1325j9023j5879j2536r740p071l510
$$ 1075319 1049066 1022780 996878 972136 949026 927701 908678 892799 880263 870523 863452 859942
50745H59942R97N531R495J3040J6385J9664K3368K8041L3484L9009M4430N0149
$$ 859942 860939 866470 875965 889005 905390 925054 948422 976463 1009947 1048956 1093386 1143535
50733A143535N6362O2907O9784P7059Q4278R0595R5399R8305R8817R6817R3115
$$ 1143535 1199897 1262804 1332588 1409647 1493925 1584520 1679919 1778224 1877041 1973858 2066973
50722B066973Q8635Q3170P5745O6090N4788M2067K7557J1506m695j9612l2679
$$ 2066973 2155608 2238778 2314523 2380613 2435401 2477468 2505025 2516531 2511836 2492224 2459545
50711B459545m3690n2026n6802n7478n4233m8124m0848l3705k6767j9572j2471
$$ 2459545 2415855 2363829 2307027 2249549 2195316 2147192 2106344 2072639 2045872 2026300 2013829
50700B013829o598k565k13K08k334q357j6881k6342l5904m5430n4570o2480o8245
$$ 2013829 2007231 2004666 2004453 2004661 2002327 1993970 1977089 1950747 1914843 1869413 1814843 1752363 1684118
50687A684118p1284p1558o9538o5843o0792n4552m7584m0372l2777k4283j5070
$$ 1684118 1612834 1541276 1471738 1405895 1345103 1290551 1242967 1202595 1169818 1145535 1130465
50676A130465o144J863R453J7444K6034L5062M4585N4541O4202P2605P9378Q4489
$$ 1130465 1124321 1126184 1135637 1153081 1179115 1214177 1258762 1313303 1377505 1450110 1529488 1613977
50664A613977Q7436Q7289Q3736P7542O9797O1060N1518M1618L2104K3344J5068
$$ 1613977 1701413 1788702 1872438 1949980 2019777 2080837 2132355 2173973 2206077 2229421 2244489
50653B244489O951o67p015j1857j5872j9883k3889k7084k8683k8515k6948k4535
$$ 2244489 2251440 2250773 2243758 2231901 2216029 2196146 2172257 2145173 2116490 2087975 2061027 2036492
50641B036492k1744j8739j5305j1104o108o95M634R606J4191J8266K1338K2731
$$ 2036492 2014748 1996009 1980704 1969600 1963492 1962797 1967431 1977037 1991228 2009494 2030832 2053563
50629B053563K2209K0238J7504J4273J0552O631L044Qk619m757n945n870m612
$$ 2053563 2075772 2096010 2113514 2127787 2138339 2144970 2148014 2148022 2145403 2140646 2134701 2128831 2124219
50616B124219k282J147N539J0563J5997K1485K6016K8366K8278K6476K3345J8608
$$ 2124219 2121937 2123084 2128623 2139186 2155183 2176668 2202684 2231050 2259328 2285804 2309149 2327757
50604B327757J2564O523J173m581j2187k1578l1620m1754n2022o1893p0265p6580
$$ 2327757 2340321 2346844 2348017 2343436 2331249 2309671 2278051 2236297 2184275 2122382 2052117 1975537
50592A975537q0995q3571q4077q2594p9627p5688p1322o7142o3200n8689n3150
$$ 1975537 1894542 1810971 1726894 1644300 1564673 1488985 1417663 1350521 1287321 1228632 1175482
50581A175482m7549m3194l9875l6215l1710k7219k3396j9807j5957j2185r041
$$ 1175482 1127933 1084739 1044864 1008649 976939 949720 926324 906517 890560 878375 869334
50570H69334o491m119j583J359M777Q281J1326J3911J6539J9504K2756K6341L0389
$$ 869334 862843 858724 857141 858500 863277 871558 882884 896795 913334 932838 955594 981935 1012324
50557A012324L4574L8384M1931M5876N0462N5284O0085O4990O9842P3952P6744
$$ 1012324 1046898 1085282 1127213 1173089 1223551 1278835 1338920 1403910 1473752 1547704 1624448
50546A624448P8028P7402P4134O7986N9810N0916M2156L3821K6226K0183J6837
$$ 1624448 1702476 1779878 1854012 1921998 1981808 2032724 2074880 2108701 2134927 2155110 2171947
50535B171947J6739J8991K1743K3983K6358K9766L3764L7273M0356M4192M9419
$$ 2171947 2188686 2207677 2229420 2253403 2279761 2309527 2343291 2380564 2420920 2465112 2514531
50524B514531N5483O1564O7252P2265P6383P9702Q2193Q3167Q1865P8439P3365
$$ 2514531 2570014 2631578 2698830 2771095 2847478 2927180 3009373 3092540 3174405 3252844 3326209
50513C326209O6225N6173M3536K9610J4919j052j8094l4725m9860o3750p6614
$$ 3326209 3392434 3448607 3492143 3521753 3536672 3535620 3517526 3482801 3432941 3369191 3292577
50502C292577q7388r4637r7921r7572r3877q7036p7402o5275n0933l5176j9211
$$ 3292577 3205189 3110552 3012631 2915059 2821182 2734146 2656744 2591469 2540536 2505360 2486149
50491B486149l848J0459K2812L2085L8168M1842M2993M0012L1523J7793Q6k0266
$$ 2486149 2482301 2492760 2515572 2547657 2585825 2627667 2670660 2710672 2742195 2759988 2760074 2739808
50479B739808m1594o1871p9851r5379j07996j16345j19811j19675j17590j13761
$$ 2739808 2698214 2636343 2556492 2461113 2353117 2236772 2116961 1997286 1879696 1765935
50469A765935j07679r9835r1503q3325p5310o7814o1358n5719n0175m4499l8966
$$ 1765935 1658256 1558421 1466918 1383593 1308283 1240469 1179111 1123392 1073217 1028718 989752
50458I89752l3634k8408k3527j9264j5363j1484p897m984k371N61L630O095P826
$$ 989752 956118 927710 904183 884919 869556 858072 850175 845191 842820 843381 847011 853106 860932
50445H60932R387J1060J2646J4213J6187J8540K0584K1804K2413K2951K3712K4725
$$ 860932 870319 881379 894025 908238 924425 942965 963549 985353 1007766 1030717 1054429 1079154
50433A079154K5996K7507K9113L0481L1219L1234L0973L1025L1396L1556L1235
$$ 1079154 1105150 1132657 1161770 1192251 1223470 1254704 1285677 1316702 1348098 1379654 1410889
50422A410889L0728L0293K9816K9245K8800K8498K8144K8063K9109L1482L4189
$$ 1410889 1441617 1471910 1501726 1530971 1559771 1588269 1616413 1644476 1673585 1705067 1739256
50411A739256L6321L8171M0462M3002M4894M5622M5271M4037M2243M0379L8425
$$ 1739256 1775577 1813748 1854210 1897212 1942106 1987728 2032999 2077036 2119279 2159658 2198083
50400B198083L5477L0776K4847J8807J2850O219j568j0281j9656k9693m0160n0463
$$ 2198083 2233560 2264336 2289183 2307990 2320840 2327059 2325491 2315210 2295554 2265861 2225701 2175238
50388B175238o0133o8901p6208q1180q3270q2697q0154p6212p0910o3815n4719
$$ 2175238 2115105 2046204 1969996 1888816 1805546 1722849 1642695 1566483 1495573 1431758 1377039
50377A377039m4354l4038k4467j5328o318K133R543J5982K1337K4570K4622K1633
$$ 1377039 1332685 1298647 1274180 1258852 1252534 1254667 1264210 1280192 1301529 1326099 1350721 1372354
50365A372354J6500R573P27r458j9581k8490l5781m1308m4984m7142m8320m8516
$$ 1372354 1388854 1398427 1399154 1389696 1370115 1341625 1305844 1264536 1219552 1172410 1124090 1075574
50353A075574m7260m4543m1145l7895l5066l2614l0455k8333k5850k2926k0010
$$ 1075574 1028314 983771 942626 904731 869665 837051 806596 778263 752413 729487 709477
50342G09477j7624j5783j4000j1786r214o980n682n012l971k010L82K484M232
$$ 709477 691853 676070 662070 650284 641070 634090 628408 623396 619425 617415 617797 620281 624513
50329F24513O012P916R729J1382J2942J4333J5397J6144J6662J6941J6992J6942
$$ 624513 630525 638441 648170 659552 672494 686827 702224 718368 735030 751971 768963 785905
50317G85905J6842J6730J6958J7989J9655K1177K2148K2896K3509K3329K1960
$$ 785905 802747 819477 836435 854424 874079 895256 917404 940300 963809 987138 1009098
50306A009098K0159J9005J8600J8271J7555J6409J4818J2875J0905Q884O206K617
$$ 1009098 1029257 1048262 1066862 1085133 1102688 1119097 1133915 1146790 1157695 1166579 1172785 1175402
50294A175402j082l934n903p399q321q568r005j0820j4020j7562k0784k3747k6283
$$ 1175402 1174320 1170386 1164483 1157084 1148763 1140195 1131190 1120370 1106350 1088788 1068004 1044257 1017974
50281A017974k7692k7628k6578k5211k3847k2529k1149j9519j7736j6272j5330
$$ 1017974 990282 962654 936076 910865 887018 864489 843340 823821 806085 789813 774483
50270G74483j4447j3232j2070j1385j0684r171p009n139m008l272k552j723o90
$$ 774483 760036 746804 734734 723349 712665 703494 696485 691346 687338 684066 681514 679791 679101
50257F79101L70Q57N30R5J74K54l87j231j306j002j606l197m534n104n736o870
$$ 679101 679471 680328 680858 680953 681127 681381 680994 679763 678457 677455 675849 672652 668118 663014 657278 650408
50241F50408p649p327o383n665n389n415n604n455m454l089k527k884k905j939
$$ 650408 642759 635432 629049 623384 617995 612580 606976 601521 597067 593978 591451 588567 585662 583723
50227E83723r54r24j257q02M90J844K936L883M500M513M214M158M406M642M694
$$ 583723 582769 581845 580588 579786 580276 582120 585056 588939 593439 597952 602166 606324 610730 615372 620066
50212F20066M470L785K746J894J455Q76l60j876k920l377l731m456n834p872r888
$$ 620066 624536 628321 631067 632961 634416 635292 634932 633056 630136 626759 623028 618572 612738 604866 594978
50197E94978j0677r866q553p893p573o610n234m695n265n682m997l887l480l691
$$ 594978 584301 574435 565882 557989 550416 543806 538572 533877 528612 522930 517933 514046 510566 506875
50183E06875l552k778k075k063k597l248l802m034l577k411j181n55m73m26l24
$$ 506875 503323 500545 498470 496407 493810 490562 486760 482726 479149 476738 475557 475002 474529 474103 473779
50168D73779m89r11j124r46p34p53q90j215k174l721m928n038m469m076l908l451
$$ 473779 473290 472379 471255 470309 469575 468822 467932 466717 464543 460822 455894 450856 446387 442311 438403 434952
50152D34952k718k269k227k153j831j428r55k48N07Q79R12J037J260J197R67J280
$$ 434952 432234 429965 427738 425585 423754 422326 421371 421123 421630 422509 423421 424458 425718 426915 427882 429162
50136D29162K348L432L774L459L058K948L283M113N171N881N894N431M960M765
$$ 429162 431510 434942 438716 442175 445233 448181 451464 455577 460748 466629 472523 477954 482914 487679
50122D87679M944N426N922O075N793N324M995N062N520N866N413M210L240L206
$$ 487679 492623 498049 503971 510046 515839 521163 526158 531220 536740 542606 548019 552229 555469 558675
50108E58675L545L364K825K765L271L708M009M757N901O518O149N471N330N871
$$ 558675 562220 565584 568409 571174 574445 578153 582162 586919 592820 599338 605487 610958 616288 622159
50094F22159O862P985Q602Q172P261P297Q839J0856J2110J2583J2980J3575J4133
$$ 622159 629021 637006 645608 653780 661041 668338 677177 688033 700143 712726 725706 739281 753414
50081G53414J4544J5044J6097J8221K1523K5375K9090L2913L7619M3186M8832
$$ 753414 767958 783002 799099 817320 838843 864218 893308 926221 963840 1007026 1055858
50070A055858N4456O0959O8692P6635Q3581Q9228R3364R4987R2988Q7150P7877
$$ 1055858 1110314 1171273 1239965 1316600 1400181 1489409 1582773 1677760 1770748 1857898 1935775
50059A935775O5712N1860L8515K7705K0016J4926J1832J0285R692R390Q639O169
$$ 1935775 2001487 2053347 2091862 2119567 2139583 2154509 2166341 2176626 2186318 2195708 2204347 2210516
50047B210516N26q684k0453l3742m8208o2965p5716q4383q8952r0642q9833q6190
$$ 2210516 2211042 2202358 2181905 2148163 2099955 2036990 1961274 1876891 1787939 1697297 1607464 1521274
50035A521274q0396p4189o8501o2782n6503n0187m4492l9181l3776k8598k4426
$$ 1521274 1440878 1366689 1298188 1235406 1178903 1128716 1084224 1045043 1011267 982669 958243
50024I58243k1308j8346j4809j1054q127o584n974n470m758m066l574l181k838
$$ 958243 936935 918589 903780 892726 884599 878015 872041 866571 861813 857747 854173 850992 848154
50011H48154k675k788l216m061n270o320o680o569o727p401q131q591q956r279
$$ 848154 845479 842691 839475 835414 830144 823824 817144 810575 803848 796447 788316 779725 770769 761490
49997G61490r239q765q260p918p467o798o236n885n444m893m577m305l269j327
$$ 761490 752251 743486 735226 727308 719841 713043 706807 700922 695478 690585 686008 681703 678434 677107
49983F77107N02J464K103L203M483N216N538O160P229Q337R299J0229J1075J1749
$$ 677107 677609 679073 681176 684379 688862 694078 699616 705776 713005 721342 730641 740870 751945 763694
49969G63694J2467J3422J4478J5566J6964J8694K0223K1397K3023K5827K9431
$$ 763694 776161 789583 804061 819627 836591 855285 875508 896905 919928 945755 975186
49958I75186L3248L7749M3857N1451N9601O8068P7511Q8131R9033J08994J17148
$$ 975186 1008434 1046183 1090040 1141491 1201092 1269160 1346671 1434802 1533835 1642829 1759977
49947A759977J22718J24716J22221J14866J03233Q9105P4982O2816N3243M6202
$$ 1759977 1882695 2007411 2129632 2244498 2347731 2436836 2511818 2574634 2627877 2674079
49937B674079M1755L9794L9416L9158L7643L3509K5344J2476m344k3534m3604
$$ 2674079 2715834 2755628 2795044 2834202 2871845 2905354 2930698 2943174 2938830 2915296 2871692
49926B871692o3055q0094r3459j03227j10070j14084j15138j13925j11626j08701
$$ 2871692 2808637 2728543 2635084 2531857 2421787 2307703 2192565 2078640 1967014 1858313
49916A858313j04938j00473r5801r0871q5175p8727p2114o5609n9169n3224m8472
$$ 1858313 1753375 1652902 1557101 1466230 1381055 1302328 1230214 1164605 1105436 1052212 1003740
49905A003740m4744m1019l6825l2791k9630k7339k5594k4137k2505k0231j7727
$$ 1003740 958996 917977 881152 848361 818731 791392 765798 741661 719156 698925 681198
49894F81198j6151j5906j5885j4878j3212j2291j2720j3525j3296j1672r529p948
$$ 681198 665047 649141 633256 618378 605166 592875 580155 566630 553334 541662 532133 524185
49882E24185p268p186p391p706p692o807n235m027l944m479m557l850k896k182
$$ 524185 516917 509731 502340 494634 486942 480135 474900 470873 466929 462450 457893 454043 451147 448965
49868D48965j687j205n49M57J693K578K653K265K222K791L485L760L544L180L139
$$ 448965 447278 446073 445524 445981 447674 450252 452905 455170 457392 460183 463668 467428 470972 474152 477291
49853D77291L665M439M842M836N157O215P304P502P026O978P940R539J1220J2879
$$ 477291 480956 485395 490237 495073 500230 506445 513749 521251 528277 535255 543195 552734 563954 576833
49839E76833J4692J6927J9886K3661K7960L2524L7552M3338M9851N6933O4533
$$ 576833 591525 608452 628338 651999 679959 712483 750035 793373 843224 900157 964690
49828I64690P2313P9408Q5073Q9022R0589Q8292Q1173P0195N7446M4305L1392
$$ 964690 1037003 1116411 1201484 1290506 1381095 1469387 1550560 1620755 1678201 1722506 1753898
49817A753898J9821J1237O443M918N765Q141J0761J1925J0312N177m148j7933
$$ 1753898 1773719 1784956 1791399 1796317 1802082 1810223 1820984 1832909 1843221 1848398 1844250 1826317
49805A826317l4934n2483o8026q0224q8531r2623r2658q9528q4411p8257p1737
$$ 1826317 1791383 1738900 1670874 1590650 1502119 1409496 1316838 1227310 1142899 1064642 992905
49794I92905o5191n8628n2066m5927m0683l6239l2119k8242k4980k2486k0502
$$ 992905 927714 869086 817020 771093 730410 694171 662052 633810 608830 586344 565842
49783E65842j8757j7150j5509j3679j1801j0195q951p988p269o759o366o169o276
$$ 565842 547085 529935 514426 500747 488946 478751 469800 461812 454543 447784 441418 435249 428973
49770D28973o308n673m634m209m542m371k959j480j312j965k093j693j702j990
$$ 428973 422665 416992 412358 408149 403607 399236 396277 394797 393485 391520 389427 387734 386032 384042
49756C84042j604o46r8O7P66J769J732N91J3Q48J812J575O75L62P55J151J298
$$ 384042 382438 381792 381694 381761 382527 384296 386028 386619 386632 387480 389292 390867 391542 391904 392659 393810 395108
49739C95108J375J387J284J201J084P19L82P28J697K394K380K246K468K623K219
$$ 395108 396483 397870 399154 400355 401439 402158 402540 403268 404965 407359 409739 411985 414453 417076 419295
49724D19295J477P96J41n95j190j450j401j029m48k73r30j633j182K41J244J315
$$ 419295 420772 421568 421709 421114 419924 418474 417073 416044 415596 415323 414393 412760 411578 411819 413063 414378
49708D14378J304J574J296J57p09l88M63Q89J104J674K316K506K461K521K358
$$ 414378 415682 417256 418552 418709 418000 417612 418075 418964 420068 421742 424058 426564 429025 431546 433904
49693D33904J637Q14M23L20L64J002K337L477L646L195K741K153J264P21J044
$$ 433904 435541 436355 436778 437098 437462 438464 440801 444278 447924 451119 453860 456013 457277 457998 459042
49678D59042J622J646J300J093Q05J74j54M32J266J369J040J160J416P39o62j288
$$ 459042 460664 462310 463610 464703 465508 465682 465528 465960 467226 468595 469635 470795 472211 472950 472288 471000
49662D71000m31Q76J348Q58J54q4L59J151J563J153L33j46j13O8J76K18Q8k34
$$ 471000 470569 471445 472793 473651 473805 473721 474080 475231 476794 477947 478280 478134 478021 478089 478265 478483 478571 478337
49644D78337l34J63Q98J097N43k18n80m27j37l03j105j828j513l26M36R4m21j0
$$ 478337 478003 478166 479064 480161 480704 480486 479906 479479 479342 479039 477934 476106 474593 474267 474703 474797 474376 474366
49626D74366R93J457J128O55M25L67O72J702L213M488N165N373N182M587L920
$$ 474366 475359 476816 477944 478599 479024 479391 480063 481765 484978 489466 494631 500004 505186 509773 513693
$$ [...]
##END NTUPLES=NMR SPECTRUM
##END=
