
##TITLE=AC1216_HNAAH12057_6672246_mh7D5xwUAd
##JCAMPDX= 6.0         $$ Bruker NMR JCAMP-DX V2.0
##DATA TYPE= NMR SPECTRUM
##DATA CLASS= NTUPLES
##ORIGIN= BRUKER
##OWNER= Administrator
$$ 1.72 TOPSPIN		Version 2.1
$$ 2012-08-14 15:46:28.437 -0500  Administrator@TOPSPIN
$$ Compression mode = diff/dup
##.OBSERVE FREQUENCY= 400.02188249412
##.OBSERVE NUCLEUS= ^1H
##.ACQUISITION MODE= SIMULTANEOUS (DQD)
##.ACQUISITION SCHEME= undefined
##.AVERAGES= 8
##.DIGITISER RES= 22
##SPECTROMETER/DATA SYSTEM= spect
##.PULSE SEQUENCE= zg30
##.SOLVENT NAME= COFFEE_meoh
##.SHIFT REFERENCE= INTERNAL, COFFEE_meoh, 1, 14.98509
##AUDIT TRAIL= $$ (NUMBER, WHEN, WHO, WHERE, PROCESS, VERSION, WHAT)
$$ ##TITLE= Audit trail, TOPSPIN		Version 2.1
$$ ##JCAMPDX= 5.01
$$ ##ORIGIN= Bruker BioSpin GmbH
$$ ##OWNER= Administrator
$$ $$ C:\Bruker\TOPSPIN/data/COFFEE/nmr/AC1216_HNAAH12057_6672246_mh7D5xwUAd/10/pdata/1/auditp.txt
$$ ##AUDIT TRAIL=  $$ (NUMBER, WHEN, WHO, WHERE, PROCESS, VERSION, WHAT)
(   1,<2012-08-14 15:46:15.078 -0500>,<Administrator>,<TOPSPIN>,<go>,<TOPSPIN 2.1>,
      <created by zg
	started at 2012-08-14 15:45:08.500 -0500,
	POWCHK enabled, PULCHK disabled,
       configuration hash MD5:
       6B 1B 68 BB D9 2E 58 E2 7F 35 AD 54 07 DF 0E 41
       data hash MD5: 64K
       CB F7 B6 88 40 9F 3B 9F 9D AE 35 C7 83 D7 4E 85>)
(   2,<2012-08-14 15:46:23.328 -0500>,<Administrator>,<TOPSPIN>,<proc1d>,<TOPSPIN 2.1>,
      <Start of raw data processing
       efp LB = 0 FT_mod = 6 PKNL = 1 PHC0 = 0 PHC1 = 0 SI = 32K 
       data hash MD5: 32K
       73 58 3C B0 1F 6E 5D 71 25 94 65 D6 14 02 E6 25>)
(   3,<2012-08-14 15:46:23.734 -0500>,<Administrator>,<TOPSPIN>,<proc1d>,<TOPSPIN 2.1>,
      <pk PHC0 = 173.2928 PHC1 = 0 
       data hash MD5: 32K
       04 50 79 71 9A 15 2E 82 C9 C0 72 A5 36 0B C5 BA>)
(   4,<2012-08-14 15:46:23.953 -0500>,<Administrator>,<TOPSPIN>,<proc1d>,<TOPSPIN 2.1>,
      <abs ABSG = 1 
       data hash MD5: 32K
       76 B6 78 6B 99 E4 A8 13 4B 38 41 88 E3 EE AC E4>)
(   5,<2012-08-14 15:46:23.984 -0500>,<Administrator>,<TOPSPIN>,<proc1d>,<TOPSPIN 2.1>,
      <abs ABSG = 2 
       data hash MD5: 32K
       61 A9 05 0A BD 10 F1 21 2B 5F 87 C5 42 01 8C 00>)
(   6,<2012-08-14 15:46:24.015 -0500>,<Administrator>,<TOPSPIN>,<proc1d>,<TOPSPIN 2.1>,
      <abs ABSG = 3 
       data hash MD5: 32K
       E7 39 C1 BB 85 BF 50 F5 2B 16 35 D3 98 D1 50 4D>)
(   7,<2012-08-14 15:46:24.046 -0500>,<Administrator>,<TOPSPIN>,<proc1d>,<TOPSPIN 2.1>,
      <abs ABSG = 4 
       data hash MD5: 32K
       8D AB 4A DE 47 B6 27 D1 61 A1 7C CD 1A AC F2 17>)
(   8,<2012-08-14 15:46:24.078 -0500>,<Administrator>,<TOPSPIN>,<proc1d>,<TOPSPIN 2.1>,
      <abs ABSG = 5 
       data hash MD5: 32K
       04 CE 59 EC E7 61 44 18 5A D7 93 70 D3 9D 3B B1>)
$$ ##END=
$$ 
$$ $$ hash MD5
$$ $$ 79 A6 A4 AC 2B 77 A2 48 B6 77 67 6E 92 EA 73 AC
##$RELAX= 
##$RELAX= 
##$RELAX= 
##$RELAX= 
##$RELAX= 
##$RELAX= 
##$RELAX= 
$$ Bruker specific parameters
$$ --------------------------
$$ [...]
150 150 150 150 150 150 150 150
##$TP07= 0
##$TPNAME0= <>
##$TPNAME1= <>
##$TPNAME2= <>
##$TPNAME3= <>
##$TPNAME4= <>
##$TPNAME5= <>
##$TPNAME6= <>
##$TPNAME7= <>
##$TPOAL= (0..7)
0.5 0.5 0.5 0.5 0.5 0.5 0.5 0.5
##$TPOFFS= (0..7)
0 0 0 0 0 0 0 0
##$TUNHIN= 0
##$TUNHOUT= 0
##$TUNXOUT= 0
##$USERA1= <user>
##$USERA2= <user>
##$USERA3= <user>
##$USERA4= <user>
##$USERA5= <user>
##$V9= 5
##$VALIST= <valist>
##$VCLIST= <CCCCCCCCCCCCCCC>
##$VD= 0
##$VDLIST= <DDDDDDDDDDDDDDD>
##$VPLIST= <PPPPPPPPPPPPPPP>
##$VTLIST= <TTTTTTTTTTTTTTT>
##$WBST= 1024
##$WBSW= 4
##$XGAIN= (0..3)
0 0 0 0
##$XL= 0
##$YL= 0
##$YMAX_a= 481312
##$YMIN_a= -594012
##$ZGOPTNS= <>
##$ZL1= 120
##$ZL2= 120
##$ZL3= 120
##$ZL4= 120
##$ABSF1= 14.98509
##$ABSF2= -5.573092
##$ABSG= 5
##$ABSL= 3
##$ALPHA= 0
##$AQORDER= 0
##$ASSFAC= 0
##$ASSFACI= 0
##$ASSFACX= 0
##$ASSWID= 0
##$AUNMP= <proc_prof1d_extract_pilot.lims>
##$AXLEFT= 0
##$AXNAME= <>
##$AXNUC= <1H>
##$AXRIGHT= 0
##$AXTYPE= 0
##$AXUNIT= <>
##$AZFE= 0.1
##$AZFW= 0.1
##$BCFW= 0
##$BC_mod= 0
##$BYTORDP= 0
##$COROFFS= 0
##$CY= 15
##$DATMOD= 1
##$DC= 0
##$DFILT= <>
##$DTYPP= 0
##$F1P= 0
##$F2P= 0
##$FCOR= 0.5
##$FTSIZE= 32768
##$FT_mod= 6
##$GAMMA= 0
##$GB= 0
##$INTBC= 1
##$INTSCL= 1
##$ISEN= 128
##$LB= 0
##$LEV0= 0
##$LPBIN= 0
##$MAXI= 10000
##$MC2= 0
##$MEAN= 0
##$ME_mod= 0
##$MI= 0
##$NCOEF= 0
##$NC_proc= -8
##$NLEV= 6
##$NOISF1= 0
##$NOISF2= 0
##$NSP= 0
##$NTH_PI= 0
##$NZP= 0
##$OFFSET= 14.98509
##$PC= 1
##$PHC0= 173.2928
##$PHC1= 0
##$PH_mod= 1
##$PKNL= yes
##$PPARMOD= 0
##$PPDIAG= 0
##$PPIPTYP= 0
##$PPMPNUM= 2147483647
##$PPRESOL= 1
##$PSCAL= 4
##$PSIGN= 0
##$PYNMP= <proc.py>
##$REVERSE= no
##$SF= 400.02
##$SI= 32768
##$SIGF1= 0
##$SIGF2= 0
##$SINO= 400
##$SIOLD= 32768
##$SPECTYP= <>
##$SREGLST= <1H.CDCl3>
##$SSB= 0
##$STSI= 32768
##$STSR= 0
##$SW_p= 8223.68421052631
##$SYMM= 0
##$S_DEV= 0
##$TDeff= 65536
##$TDoff= 0
##$TI= <>
##$TILT= no
##$TM1= 0
##$TM2= 0
##$TOPLEV= 0
##$USERP1= <user>
##$USERP2= <user>
##$USERP3= <user>
##$USERP4= <user>
##$USERP5= <user>
##$WDW= 1
##$XDIM= 32768
##$YMAX_p= 482557821
##$YMIN_p= -754963
##$CURPLOT= <Network HP LaserJet P1505>
##$CURPRIN= <$Network HP LaserJet P1505>
##$DFORMAT= <normdp>
##$LAYOUT= <+/1D_H.xwp>
##$LFORMAT= <normlp>
##$PFORMAT= <normpl>
##$SURQMSG= 1
$$ End of Bruker specific parameters
$$ ---------------------------------
##NTUPLES= NMR SPECTRUM
##VAR_NAME=  FREQUENCY,     SPECTRUM/REAL,   SPECTRUM/IMAG
##SYMBOL=    X,             R,               I
##VAR_TYPE=  INDEPENDENT,   DEPENDENT,       DEPENDENT
##VAR_FORM=  AFFN,          ASDF,            ASDF
##VAR_DIM=   32768,         32768,           32768
##UNITS=     HZ,            ARBITRARY UNITS, ARBITRARY UNITS
##FACTOR=    0.250966925370066, 1,           1
##FIRST=     8223.43324360094, 97634,        -128604
##LAST=      0,             49613,           -105409
##MIN=       0,             -754963,         0
##MAX=       8223.43324360094, 482557821,    0
$$ Real data points
##PAGE= N=1
##DATA TABLE= (X++(R..R)), XYDATA
$$ [...]
19547d5468a9119j66739a5060k09911G2246c0202j75935A968i207k02307A33219
19535i9177A42820J98295G7874a5420k92125C2771h8246k5758A93703a12841A7230
19523B9972L7007a43730f9848k74841B4082J89020H984J23500e7705B0283J34633
19512A54916c57683a6498B26668D6097J05796g6204C69575d55537F456b10001
19501i2829B3215J55100L2835m1650a53162L7102j04609b7677o0869E3591e0830
19489f3593A18798M3298f3120B66968i3100r3001j3498i5836o662N0801B32962
19477b22941j38107J05436d1000R51B21284c0272k99530E0616J9712A2505M53209
19466D65714j66163b60233a12306A96042q8648b26911C30748A59333a89785k3515
$$ plain form
19547 -45468 -19119 -185858 -15060 -224971 72246 -30202 -206137 1968 -9207 -211514 133219
19535 -99177 142820 341115 77874 -15420 -307545 32771 -88246 -114004 193703 -112841 17230
19523 29972 66979 -143730 -69848 -344689 24082 213102 8984 132484 -57705 20283 154916
19512 154916 -357683 -16498 226668 46097 151893 -76204 369575 -455537 6456 -210001
19501 -92829 23215 178315 211150 169500 -153162 -116060 -220669 -27677 -88546 53591 -50830
19489 -63593 118798 162096 -63120 266968 -93100 -186101 -199599 -95836 -102498 -51697 232962
19477 -222941 -361048 -255612 -41000 -40049 221284 -30272 -329802 50616 70328 12505 465714
19466 465714 299551 -260233 -112306 196042 107394 -226911 330748 159333 -189785 -213300
19456b13300j11366A53963J04758F2952b05502c7251k26694R7105D169b18128
19445i4675A3902b00784g3973m1897G9370b19322h6395A19829b3930G1963j0765
19434F1198M7377B8758a88765N684A59149a73021l4831j45042b2140j64006P969
19423a78177N5047B20296j6020A3705J13175a92194A474a62008d9039k60364J22917
19412a86486C88730e2384a6285P923p5451j53666R5955j6447e7571A69601D6679
19400i4002D2039a4262k31044e7629n7967o3858B9177j4539R5088c15149l2197
19389c47346a57648A19035c48570H0553a59550c285q0868E3740c02415d6217M744
19378d1473q5967B7154M7091a30603m9212A64260a37593j0357P82A12125a8990
$$ plain form
19456 -213300 -324666 153963 258721 62952 -205502 -37251 -263945 -166840 4169 -218128
19445 -94675 13902 -200784 -73973 -115870 79370 -219322 -86395 119829 -23930 71963 61198
19434 61198 108575 28758 -188765 -183081 159149 -173021 -207852 -352894 -22140 -186146 -178177
19423 -178177 -123130 220296 204276 13705 126880 -192194 1474 -162008 -49039 -309403 -186486
19412 -186486 388730 -52384 -16285 -8362 -83813 -237479 -141524 -157971 -57571 169601 46679
19400 -94002 42039 -14262 -245306 -57629 -115596 -179454 29177 14638 109726 -315149 -347346
19389 -347346 -157648 119035 -348570 80553 -159550 -3285 -84153 53740 -302415 -46217 -41473
19378 -41473 -127440 27154 74245 -130603 -179815 164260 -137593 -147950 -147168 112125 -18990
19366A52185j4965e9078H3616a6790E5881a40254m0928n3958j19869R1603B90074
19354b01263g7802k04619F5300r001a54305O0592J4769p8749A6996g3245b3546
19342h9812B5977b40638A27305P6710i0375o4845j68650G6462g2201A73027b26638
19330c29805f327j19826j03820M9211E3871A89g2198j81400A40357c19105a11191
19318B45437a86686C10753I8631b99000j29975K07820J5735R1448B01798b52379
19307d2204j467G5886e52016i2785j0479A98623a39486O8598c0370l47731F6841
19295B18918D720b73141a20489j24888J03924E7182J7756A7540K17147m8896a32969
19283i2064A44009a14195C3681a56804f3984k41140e96m9449B68961A9015b1351
$$ plain form
19366 152185 137220 -59078 83616 -16790 55881 -140254 -181182 -235140 -355009 -263406 290074
19354 -201263 -77802 -282421 65300 56299 -154305 -93713 -78944 -157693 16996 -73245 -23546
19342 -89812 25977 -240638 127305 204015 -90375 -155220 -323870 76462 -72201 173027 -226638
19330 -329805 -6327 -126153 -229973 -180762 53871 189 -72198 -253598 140357 -319105 -111191
19318 245437 -186686 310753 98631 -299000 -428975 -221155 -205420 -113972 201798 -252379
19307 -42204 -43671 75886 -552016 -92785 -103264 198623 -139486 -70888 -30370 -378101 66841
19295 218918 4720 -273141 -120489 -245377 -141453 57182 74938 17540 234687 185791 -132969
19283 -92064 144009 -114195 33681 -156804 -63984 -305124 -596 -50045 268961 19015 -21351
19271c55008J56204I4806P8556E8476A9583c1968C1620b18787b9637G7299B5358
19259f2765B77135a81315p7803A07640b44559i5267c1202k46904A77915b43933
19248D8606J69009b03604Q7370n4413B34048a15478B19987A08060a90338R2115
19238i8223k42568A98332b43890d4190k78548g2908b4360j95167n0755A21532
19227h0812l45113B79869o0626k7872c44089J60840q833B1383i5182A69915h1688
19215c0007j32916G5558J71682p9450m2334E5949a65940o2435a02126K1027K8676
19204e2423B72123I8674K18875C4991J2207P4502l9229a79215D0784j1824b25619
19192b3687k41501i494k98159C98705g8421G6959g7912j81923C25769B9529e78791
$$ plain form
19271 -355008 -198804 94806 173362 58476 19583 -31968 31620 -218787 -29637 77299 25358
19259 -62765 277135 -181315 -259118 107640 -244559 -95267 -31202 -278106 177915 -243933
19248 48606 217615 -203604 -116234 -170647 234048 -115478 219987 108060 -190338 -98223
19238 -98223 -340791 198332 -243890 -44190 -322738 -72908 -24360 -219527 -270282 121532
19227 -80812 -425925 279869 219243 191371 -344089 -183249 -192082 21383 -95182 169915 -81688
19215 -30007 -162923 75558 247240 167790 125456 55949 -165940 -228375 -102126 -81099 -52423
19204 -52423 272123 98674 317549 34991 47198 121700 82471 -179215 40784 28960 -225619
19192 -23687 -265188 -9494 -307653 398705 -78421 76959 -77912 -259835 325769 29529 -578791
19180A23955a91119c8746n4326L8347I9272h1404j25522F7012L04336i8441j46071
19169b44512A40430e8051H4089M5105A6529J18882a04700r1149g9746q3817a156
19157d8629F8115c16059C6930K36529c01926a02440p4029e1861b3065D532a99657
19145c17105F6098h791B58963G1242n864b90999J44510A33660Q3967E5534c2596
19133B5887a58601l9727d6565k71599A22961A9861N2213b69488a24092k13160
19123c37252e6350k77594e3402k69751b509j06882A8858b61585A42532d5127B5130
19111E7221A8633f9595j26307c6587A96783b27546I619P8378n598J58035e03142
19099A65946b10735D1777b66306a22899h503C9541a31779j32941b0979j40621
$$ plain form
19180 123955 -191119 -38746 -93072 -54725 99272 -81404 -206926 67012 371348 -98441 -244512
19169 -244512 140430 -58051 84089 129194 16529 135411 -104700 -195849 -79746 -163563 -1156
19157 -48629 68115 -316059 36930 273459 -301926 -102440 -176469 -51861 -23065 4532 -199657
19145 -317105 66098 -8791 258963 71242 65378 -290999 -146489 133660 217627 55534 -32596
19133 25887 -158601 -198328 -46565 -318164 122961 19861 72074 -269488 -124092 -337252
19123 -337252 -56350 -333944 -53402 -323153 -2509 -109391 18858 -261585 142532 -45127 25130
19111 57221 18633 -69595 -195902 -36587 196783 -227546 9619 87997 82399 240434 -503142
19099 165946 -210735 41777 -266306 -122899 -8503 39541 -131779 -264720 -20979 -161600
19089a61600A7769O3032c47703a02246j89424C8619K73856K02890B12829h9640
19078a30080j0888n894C5733a86899A80867a50830e0410k82036a33538N1635A8815
19066a82282A27291D3061J90338b77401d0058A43535b75994A21385c15366A45367
19055a61295r7470Q4937k03669A87395o7868b35942a4318n9773I9357g6402K6984
19044d9418A1288a12341l5579M823c7575I225i8404A16259A7605K47517a69633
19032B21133q7511b42244C53004A34184f4460G9134a1028A07540J407K61349b55996
19020c2718E3181B0191f7592k55550C1173i6186c7660j27668F0946J99171H5827
19008b77881a23066H3470C6986b72316C3587b68036J1195a02478L4156A722a85066
$$ plain form
19089 -161600 17769 80801 -347703 -102246 -291670 38619 312475 515365 212829 -89640
19078 -130080 -140968 -146862 35733 -186899 180867 -150830 -50410 -332446 -133538 -81903 18815
19066 -182282 127291 43061 233399 -277401 -40058 143535 -275994 121385 -315366 145367
19055 -161295 -258765 -173828 -377497 187395 119527 -235942 -14318 -74091 99357 -76402 -49418
19044 -49418 11288 -112341 -147920 -143097 -37575 9225 -98404 116259 17605 265122 -169633
19032 221133 133622 -242244 353004 134184 -64460 79134 -11028 107540 108947 370296 -255996
19020 -32718 53181 20191 -67592 -323142 31173 -96186 -37660 -165328 60946 260117 85827
19008 -277881 -123066 83470 36986 -272316 33587 -268036 -256841 -102478 -68322 1722 -185066
18996A43896a77094c8847j16533l5787L1361B9517f9215p8310b5672q1624A78910
18984b72466D0393q099e7739A26830J39535A05280e7461p836k73638J12080B23906
18972D9266a51644f9941C27397C6623q70K06191c9139g06j98525Q2022B63952
18960B20011b81769A30890D0170b91582g8421A02243K80925c57513f062n3821
18950e9883E5209b14496c9048G1619e3019D3529Q4932b71H0031L9898l6969a19274
18937a50988m5809C5003c51971a23805j24505b5944j9640F377a41443d8800k3045
18926g1845H2589f3771B3477f4373j71951i3901j25799r3814d4120p8146I9867
18914a91198B36846C4153K87580f5345E1493i058m2978a2612l06444A1718J77661
$$ plain form
18996 143896 -177094 -38847 -155380 -191167 -159806 29517 -69215 -147525 -25672 -107296 178910
18984 -272466 40393 32294 -57739 126830 266365 105280 -57461 -65297 -338935 -226855 223906
18972 49266 -151644 -69941 327397 36623 35753 241944 -39139 -706 -199231 -117209 263952
18960 220011 -281769 130890 40170 -291582 -78421 102243 383168 -357513 -6062 -59883
18950 -59883 55209 -214496 -39048 71619 -53019 43529 128461 -271 80031 119929 82960 -119274
18937 -150988 -196797 35003 -351971 -123805 -248310 -25944 -45584 6377 -141443 -48800 -71845
18926 -71845 82589 -63771 23477 -64373 -236324 -93901 -219700 -313514 -44120 -122266 99867
18914 -191198 236846 34153 321733 -65345 51493 -9058 -52036 -12612 -319056 11718 189379
18903A89379b10754N7755O4197k19623J21521d4522l5623a3213p293k02103d5565
18891a49023A06213a79100M2133p9549g1813j84330n7503B50447b08728j58521
18881c67249d280D4878g6532q8051q8624A24699a91143d1588j00060F2367J4695
18870G7062k0196b56365D6708E344K8955e1028K4344G6497a57757q5792L0768
18859b12781O2983B08960g0203m133a4198A24025b31211j5455Q6554O3446N927
18848i0739m9871C69566b0142A52730h6583c5277n8505k08229H298L1481a47537
18836g6948k96467E6560b44955o4385a37370d1437r3616q5932l5234J12706C5127
18824b3531I7369f5310J5245C17532F8555a27040D00391k6857f6611A60942J0495
$$ plain form
18903 189379 -210754 -152999 -88802 -308425 -186904 -44522 -80145 -13213 -20506 -222609 -45565
18891 -149023 106213 -179100 -136967 -216516 -71813 -256143 -313646 250447 -208728 -367249
18881 -367249 -4280 44878 -76532 -164583 -253207 124699 -191143 -41588 -141648 62367 77062
18870 77062 56866 -256365 46708 5344 34299 -51028 -26684 76497 -157757 -243549 -212781
18859 -212781 -149798 208960 -70203 -74336 -14198 124025 -231211 -246666 -160112 -96666 -90739
18848 -90739 -140610 369566 -20142 152730 -86583 -35277 -93782 -302011 8298 39779 -147537
18836 -76948 -373415 56560 -244955 -309340 -137370 -41437 -135053 -220985 -256219 -143513 35127
18824 -23531 97369 -65310 -50065 317532 68555 -127040 400391 373534 -66611 160942 171437
18813A71437b4868A01809J19108R5188h0315L8319o461A58838c40407O7841j13419
18802c85985F6578k42c1985j15132A00288P9307a05974M9880j9305c4886k63481
18791b98367i0726B40273H8567J02068b85654A49815a53684n3784A80713a92658
18780h3223j62132j06629G4049a8069C033J72240c2428A68714G8229a53345k00856
18769c54201F057h1953k49455a65264n4606L7683e1355A05054a79136M8031j31839
18758b62944A08500e1234l37148J31593a17293H8603a12072j37317A55811a42446
18747e0565J9705A34838b14510k24226a87420D8694J77314i3538M4932F6545a12342
18735a16076M0624C9051K9833j7983b27393J09548N067d098j69195m2674a1577
$$ plain form
18813 171437 -24868 101809 220917 316105 -80315 -41996 -48457 158838 -340407 -272566 -385985
18802 -385985 66578 66336 -31985 -147117 100288 179595 -105974 -56094 -75399 -34886 -298367
18791 -298367 -90726 240273 88567 190635 -285654 149815 -153684 -207468 180713 -192658
18780 -83223 -245355 -351984 74049 -18069 3033 175273 -32428 168714 78229 -153345 -354201
18769 -354201 6057 -81953 -331408 -165264 -219870 -182187 -51355 105054 -179136 -131105 -262944
18758 -262944 108500 -51234 -388382 -256789 -117293 88603 -112072 -249389 155811 -142446
18747 -50565 -30860 134838 -214510 -438736 -187420 48694 226008 -93538 -48606 66545 -112342
18735 -116076 -75452 39051 68884 50901 -227393 -117845 -112778 -4098 -173293 -215967 -11577
18723D1120i4199A22299a78875I0511a47608A00641a89241A0126c13729L1777
18713b81952j2804A44130b24320k66093K24813j6053h4839h479C45155c18787
18702e8772J0135j77925e1719j15199C8941c91721A02551R3911a52190r8857R4455
18691a56592a8334m05088a39394m737k7822B4159a10137j9082G7149O4023H154
18679a30593B11087A02704O936a13153A69762M6646b77369J09251j42119n3446
18669c63683a32405b242j44353J733j08985a20525D2437a02339k51803e7196A94448
18657a62004B54111a37198c8987j66108B49060j9908q8190f5133o7315j1629n9251
18646b03328j28025B13371r7274Q9524e4444A03870a87880H4010K23199F2396
$$ plain form
18723 41120 -94199 122299 -178875 90511 -147608 100641 -189241 10126 -313729 -281952
18713 -281952 -294756 144130 -224320 -490413 -265600 -281653 -84839 -8479 345155 -318787
18702 -58772 -48637 -226562 -51719 -166918 38941 -391721 102551 196462 -152190 -251047 -156592
18691 -156592 -18334 -423422 -139394 -144131 -171953 24159 -110137 -129219 77149 141172 8154
18679 -130593 211087 102704 109640 -113153 169762 216408 -277369 -168118 -310237 -363683
18669 -363683 -132405 -2242 -146595 -144862 -253847 -120525 42437 -102339 -354142 -57196 194448
18657 -162004 254111 -137198 -38987 -205095 249060 229152 140962 -65133 -132448 -144077 -203328
18646 -203328 -331353 213371 116097 205621 -54444 103870 -187880 84010 307209 62396
18635b4932o9641G5095g8338H7820a41083B09588C5198q827i6036F4531d6879
18623b93375K5943b5881j63127b4565B3424b65386H4720N4597l1098b65070J25859
18612a39211b7431j62777B92245I2326g2334r8893j00172a13211N4623P075l48672
18601d00185i492l4629C24366c3961n1389K6907k62828J44114A83914H8922D831
18589c17828N2012F1431i9790q9084A28547a80553e5208B14568d41771C06026
18578A24861a23853A48135a36219j26130g3391b5263q2074k2363m3761A49485
18567b3450F5679i2402B793a74375A47540b3706k19767J15736J9954q5168A05372
18555g163B78862c9080E566M766f07A39111a26477B95652K7751b1363g660k22980
$$ plain form
18635 -24932 -94573 75095 -78338 87820 -141083 209588 35198 26371 -96036 64531 -46879
18623 -293375 -267432 -25881 -189008 -24565 23424 -265386 84720 139317 108219 -265070 -139211
18612 -139211 -27431 -190208 292245 92326 -72334 -171227 -271399 -113211 -58588 -51513 -400185
18601 -400185 -9492 -44121 324366 -33961 -85350 -58443 -321271 -177157 183914 88922 4831
18589 -317828 -265816 61431 -99790 -188874 128547 -180553 -55208 214568 -441771 306026
18578 124861 -123853 148135 -136219 -262349 -73391 -25263 -107337 -129700 -173461 149485
18567 -23450 65679 -92402 2793 -174375 147540 -23706 -243473 -127737 -107783 -192951 105372
18555 -7163 278862 -39080 5566 10332 -607 139111 -126477 295652 323403 -21363 -7660 -230640
18543b30640C0674a20315H2034b53008Q9316F3523O4430C1844a03623j15594C1072
18531a2733j36777e5688r5545C0918b41635A70978B7521b98628a33843L2864l9835
18520a40814M9022L1720l8506l0759D4413b68005B55895D6846J39787a4721j63937
18509a78658p393c350F8988j7913J84440F2558b44501A92244C6568J86809e86298
18497a86269L7572b5244A34214i0652c1641o3909D8783f7109j19037A5620N1568
18486F7188I045e0150q3640M1217B99631A38464d7387G3871e6174B34541a85808
18474C5282e7226j39025a8364k19404c1678j14046d8823J896j07831A56940b71862
18462b79464a10609e4073G0522L2895a11626b6734l83236a58240n3619M3335k9700
$$ plain form
18543 -230640 30674 -120315 82034 -253008 -163692 63523 127953 31844 -103623 -219217 31072
18531 -12733 -149510 -55688 -151233 30918 -241635 170978 27521 -298628 -133843 -100979 -140814
18520 -140814 -91792 -60072 -98578 -129337 44413 -268005 255895 46846 186633 -14721 -178658
18509 -178658 -186051 -3350 68988 51075 235515 62558 -244501 192244 36568 223377 -586298
18497 -186269 -148697 -25244 134214 -90652 -31641 -95550 48783 -67109 -186146 15620 67188
18486 67188 9045 -50150 -133790 -92573 299631 138464 -47387 73871 -56174 234541 -185808
18474 35282 -57226 -196251 -18364 -237768 -31678 -145724 -48823 -46927 -154758 156940 -271862
18462 -279464 -110609 -54073 70522 103417 -111626 -26734 -409970 -158240 -211859 -168524 -198224
18451a98224H3495J2819k2629m640R221a83896k66010A32573a41988k05080A87093
18439a02464q5937f7098k62882J11809a02025D25301g3101j75617L971I5745E249
18427b59781B64792a26821A61099N114d55700a14575A11194f4244E9603f695A35762
18415d5142k01584A06986N8829d2953j38343A24105h9838j52393a1604j58434
18405a70038A42324L7564F8368J1805h979k23186f7061j06640f2368B7622b37505
18393d7104a0498p3637j40670m0255M9225B3403c00607A81840c1662A45646n7569
18382H8077J52852D08a87503H0996J16417F130a61678N6596A46722J39075c89125
18370B84318r0293C1048J3215d97192K06046B32279a89218B17800a58742A1438
$$ plain form
18451 -198224 83495 96314 73685 69045 78266 -183896 -449906 132573 -141988 -347068 187093
18439 -102464 -188401 -67098 -329980 -218171 -102025 425301 -73101 -248718 -244747 95745 5249
18427 -259781 264792 -126821 161099 166213 -455700 -114575 111194 -64244 59603 -6695 135762
18415 -45142 -246726 106986 165815 -42953 -181296 124105 -89838 -242231 -11604 -170038
18405 -170038 142324 179888 68368 80173 -8979 -232165 -67061 -173701 -62368 27622 -237505
18393 -47104 -10498 -84135 -224805 -265060 -215835 23403 -300607 181840 -31662 145646 88077
18382 88077 240929 408 -187503 80996 197413 6130 -161678 -105082 146722 285797 -389125
18370 284318 194025 31048 44263 -497192 -291146 232279 -189218 217800 -158742 11438
18359a33438A00990E778J0617d21188a49359L9324C8851c6545E4091c05549A14483
18347b09195L8537d1492j18886O1926G3927a1186q6129B7219J9210b98435A19342
18335a54541A0155a10295l8923N878B48523f483A58130o6836c68312p5831J31779
18324c12364P7112K6064G0814c87931J00673d0833j05597b6523j3969A16061a08837
18312f7294D7904a39795A54560b58499a5873f445A5829J75835A1833E353h4826
18300i0982j6482K7658A1502M45b6145D5879b35060g1385F5976N1426f4003C47865
18287a36260q7783A77630g8843k23857q35G5371C4804e47501D04826b92787D7361
18275a77566L3915G1171a22228I5213b25106h2537p1692A41918d11243a0376B41224
$$ plain form
18359 -133438 100990 5778 16395 -421188 -149359 -110035 38851 -36545 54091 -305549 114483
18347 -209195 -170658 -41492 -160378 -98452 73927 -11186 -97315 27219 46429 -298435 119342
18335 -154541 10155 -110295 -149218 -143340 248523 -6483 158130 91294 -368312 -444143 -312364
18324 -312364 -235252 -209188 70814 -387931 -287258 -40833 -146430 -26523 -40492 116061 -108837
18312 -67294 47904 -139795 154560 -258499 -15873 -6445 15829 191664 11833 5353 -84826
18300 -90982 -107464 -79806 11502 11947 -26145 45879 -235060 -71385 65976 117402 -64003 347865
18287 -136260 -224043 177630 -78843 -302700 -303535 75371 34804 -547501 404826 -292787 47361
18275 -177566 -143651 71171 -122228 95213 -225106 -82537 -154229 141918 -411243 -10376 241224
18263C2908f1869r7461j4470D5989J0642b88363B6355J13462f6365C1315i6752
18251c8637A70171J39341b05113J9046A0150R3737a25443I4578a86137M6036l9909
18240a80010n1556B03737g9586A98764D0242c86340a17591M0341E6016A4946J51615
18229A66561e3488j30300Q2636p3561k94649c7917k31094J14389j05770a06157
18218E829J70863d56970I9030k1053b64659A09953D6140a58991A85631I1034R4733
18207A85767o9569B8958a30348R673d0152r1326a2880L507B47819n2633a76429
18195A23376a1009j68051A09274c27731e1480j3952E1469K4252i9869M4109A78090
18183A06902E1797a55924B11062d2068G129J36209F4756e4898b6661A29813K8317
$$ plain form
18263 32908 -61869 -159330 -173800 45989 56631 -288363 26355 139817 -66365 31315 -96752
18251 -38637 170171 309512 -205113 -186067 10150 103887 -125443 94578 -186137 -140101 -180010
18240 -180010 -231566 203737 -79586 198764 40242 -386340 -117591 -77250 56016 14946 166561
18229 166561 -53488 -183788 -101152 -174713 -469362 -37917 -269011 -154622 -260392 -106157
18218 5829 176692 -456970 99030 77977 -264659 109953 46140 -158991 185631 91034 185767
18207 185767 116198 28958 -130348 -120675 -40152 -131478 -12880 -9373 247819 195186 -176429
18195 123376 -11009 -179060 109274 -327731 -51480 -65432 51469 75721 -99869 -55760 178090
18183 106902 51797 -155924 211062 -42068 7129 143338 64756 -54898 -26661 129813 158130
18172A58130A5769K20800b60490a10037I5074a41068A74656a92210I241b50966
18161e3420B68875l6756a27306b2446D8330b96614A39923c1215j46009b8564H1337
18149b45998B36184C7119b26676A03128K2675k0128b98620j73793a612j69362
18139a70974h3515j98717k95930I4026l9625f6033j62703D4902a62231d5599k63096
18128c08695A66988b14699a03882F4584e0347k29376K6111P4649D7010c3341A93838
18116b7054A88566H949a42660B12428e6914b7008k0171h677j05904B32781c07635
18104H6391e091A51945a42752k09443E7719K85343c85113a79424P0178A12103
18093c01978l1010a05124A26217c7840n5525m2996A13953C0540c1445E7723k3422
$$ plain form
18172 158130 15769 236569 -260490 -110037 95074 -141068 174656 -192210 9241 -250966
18161 -53420 268875 232119 -127306 -22446 48330 -296614 139923 -31215 -177224 -28564 81337
18149 -245998 236184 37119 -226676 103128 125803 105675 -298620 -472413 -1612 -170974
18139 -170974 -83515 -282232 -578162 94026 54401 -66033 -228736 44902 -162231 -45599 -308695
18128 -308695 166988 -214699 -103882 64584 -50347 -279723 -253612 -178963 47010 -33341 193838
18116 -27054 188566 8949 -142660 212428 -56914 -27008 -47179 -8677 -114581 232781 -307635
18104 86391 -5091 151945 -142752 -352195 57719 343062 -385113 -179424 -109246 112103
18093 -301978 -332988 -105124 126217 -37840 -93365 -136361 113953 30540 -31445 57723 34301
18082C4301q395J86925E8800i9123F9940b71453B378a44528M2169A09632c9191
18070A48406J4154c74821c8525C3733c07881f9906m8629D069Q748a20859G0001
18058a49237D5677a47979H7976K28730Q176f1841C9953N3435h1898j4159B15790
18046c8701A39174b35261B8104L44016a96007B00896A7436M7476c34106g7051
18035a01477H0783R3154C1572Q0128i4604C23665j8873a74683p7411O0236m7836
18024b39694C7714E664L9359a2915j2824B23900a41630m5367m7484q7743J08619
18013b13605j4102i8291j90090J17251f4700B6281b82830B42619a91318K9246
18003a62072O2008A0676d08575e8953k88846a15438B2284a25829G4931A2628c5064
$$ plain form
18082 34301 25906 212831 58800 -99123 69940 -271453 2378 -144528 -102359 109632 -39191
18070 148406 162560 -374821 -38525 33733 -307881 -69906 -118535 4069 12817 -120859 70001
18058 -149237 45677 -147979 87976 316706 324882 -61841 39953 93388 -81898 -96057 215790
18046 -38701 139174 -235261 28104 372120 -196007 200896 17436 64912 -334106 -77051
18035 -101477 80783 173937 31572 111700 -94604 323665 304792 -174683 -252094 -191858 -239694
18024 -239694 37714 5664 45023 -12915 -25739 223900 -141630 -186997 -234481 -322224 -213605
18013 -213605 -227707 -98291 -288381 -171130 -64700 26281 -282830 242619 -191318 -162072
18003 -162072 -100064 10676 -408575 -58953 -347799 -115438 22284 -125829 74931 12628 -35064
17991I2703a36059L4167c9606A02775R0803B8376L4232a62873a6521B04593a07350
17979A69376l2603J78667b30635J14417m421C81048c7159H0205N9597L1363m2586
17968A28579b17376D4279b62348j00859a07423j03382M8075f7932p3488D6124
17957D3595N4891a87150n0090A53319A374J49496m494n3243g4732b7990k63053
17946b91043I50h7B32918E1594c901n45031a4939l24089a16555B47255N4676a47851
17933A8947f0361B41376C7996J11780h3185A61832f2639B24682G8736q981a26450
17921b46636A96714P661a32817B67795a98030C0864a51211I8433l7252c94501
17910B70792A8959a54401l1183F5399J59438D1549a88582C4592K6774f2343l17017
$$ plain form
17991 92703 -136059 -101892 -39606 102775 193578 28376 62608 -162873 -16521 204593 -107350
17979 169376 136773 315440 -230635 -116218 -120639 381048 -37159 80205 139802 171165 128579
17968 128579 -217376 44279 -262348 -363207 -107423 -210805 -162730 -67932 -141420 46124
17957 43595 98486 -187150 -237240 153319 1374 150870 146376 93133 -74732 -27990 -291043
17946 -291043 950 -87 232918 51594 -3901 -548932 -14939 -339028 -116555 247255 301931 -147851
17933 18947 -60361 241376 37996 149776 -83185 161832 -62639 224682 78736 69755 -126450
17921 -246636 196714 204375 -132817 267795 -198030 30864 -151211 98433 61181 -394501
17910 270792 18959 -154401 -185584 65399 224837 41549 -188582 34592 61366 -62343 -379360
17899c79360B34674e9152a9488B9533d8717A13870i3962o4007A62172O8726E3977
17887A6168a00445K211d7385A06299L9550F5097e5283m614K7090h364j06728A13431
17874b94639B8971a25778A81882a43891k66665C29612b41571J7721C73591a58441
17863a38127C3602i2877C3589c09010A03106a88044C12391j53603J18745a7598
17852C68714g6724k057j31812G614a50382B47368g4032a4021j40069M9029K1940
17841h3121o7603j1842g8340A20033a38465E9368a10088j19375a5516j38540o3665
17830b17721f6409p4770A78344G7380b20400B2900O9295b63247H6644d7443e066
17818a40698B33412M1537g6267D35688a62986e4216K6755C5740c2691k25666A0120
$$ plain form
17899 -379360 234674 -59152 -19488 29533 -48717 113870 -93962 -157969 162172 230898 53977
17887 16168 -100445 -98234 -47385 106299 145849 65097 -55283 -59897 -32807 -8364 -115092 113431
17874 -294639 28971 -125778 181882 -143891 -410556 329612 -241571 -223850 373591 -158441
17863 -138127 33602 -92877 33589 -309010 103106 -188044 312391 158788 277533 -17598
17852 368714 -76724 -78781 -210593 7614 -150382 247368 -74032 -14021 -154090 -105061 -83121
17841 -83121 -150724 -162566 -78340 120033 -138465 59368 -110088 -229463 -15516 -154056 -217721
17830 -217721 -66409 -141179 178344 77380 -220400 22900 92195 -263247 86644 -47443 -5066
17818 -140698 233412 274949 -76267 435688 -162986 -54216 -27461 35740 -32691 -258357 10120
17806A34226E3001K34878j26812a55340n7179a3870L019n6009j92012B1820R5728
17795A17548N1436A4341J76837a32220D9106b24354p6689c5780j02199b6588G4861
17783a01264A84006O3210r6101b56132A72288b54925C59092J84707D9785i0025
17772D535J671b16032G2516a76389F3105b19479j72048A17341a7273A2628Q1021
17761I3649L96726a83890o4374q8393J65704H9357a71720N3235H3466a14716A10034
17749I7469m886O6259G5961a30073H3509a95415d0045A49453p780J37588F34P8039
17737G8673b7949G9957a20485F0316a17606B70622a10956l1162j5443B6174e9049
17725B326c2344A64568p7498a64737P3231B08287a07625j81886I9437G636L56824
$$ plain form
17806 134226 53001 287879 161067 -155340 -212519 -13870 -10851 -66860 -258872 21820 117548
17795 117548 168984 14341 191178 -132220 49106 -224354 -301043 -35780 -137979 -26588 74861
17783 -101264 184006 247216 151115 -256132 172288 -254925 359092 543799 49785 -90025
17772 4535 6206 -216032 72516 -176389 63105 -219479 -391527 117341 -17273 12628 93649
17761 93649 490375 -183890 -248264 -336657 -170953 89357 -171720 -118485 83466 -114716 110034
17749 97469 92583 158842 75961 -130073 83509 -195415 -40045 149453 141673 279261 634 78673
17737 78673 -27949 79957 -120485 60316 -117606 270622 -110956 -142118 -157561 26174 -59049
17725 2326 -32344 164568 87070 -164737 -91506 208287 -107625 -289511 99437 7636 364460
17714C64460E6363j1432L9991b03693d5551j81094f1330J4314j86745E9114e8136
17702C81790A51947e3723j03728I7495a98844G4277c24345I8691K7374a35805
17691d377l68110f8343A50483P928a71303b7170j75921L555N7391O0138A25489
17679b69394O7393A02704a82507A58383k3234c15680a427q7322A08995A4168K96961
17668C11129a28505j6314d0002B12047C83J86203m020J64809h3982j79632A55948
17656a81586C6808j0743J72713J4958a92015B22807C6122j3591a00661B3492f332
17644C31271j07817a79648A86000g1267A85963a71728b5602m07417C2079J25360
17634A57439b41329A21924k4269J62945a15931M9705B3359a76826b9190A34651
$$ plain form
17714 364460 56363 44931 84922 -203693 -45551 -226645 -61330 -47016 -233761 59114 -58136
17702 381790 151947 -53723 -157451 97495 -198844 74277 -324345 98691 126065 -135805
17691 -4377 -372487 -68343 150483 158411 -171303 -27170 -203091 -199536 -142145 -82007 125489
17679 -269394 -202001 102704 -182507 158383 135149 -315680 -1427 -88749 108995 14168 311129
17668 311129 -128505 -144819 -40002 212047 383 186586 182566 347375 -83982 -263614 155948
17656 -181586 36808 26065 198778 213736 -192015 222807 36122 22531 -100661 23492 -6332
17644 331271 223454 -179648 186000 -71267 185963 -171728 -25602 -433019 32079 157439
17634 157439 -241329 121924 97655 260600 -115931 -66226 23359 -176826 -29190 134651
17623B19202d3190j11350P6757l01056A36896b32247j22466G3194a42262d10E6108
17611A9833g6070E4455P3787a09932A02558J39376H7983j7011O8284b15890b666
17599a28540d2594B06120o4504a54176A88505f6981H5401g582G2197M994A3589
17587E238Q2804a14250B0395a74908A10575a18571C95743i7766A78245i502p8295
17576h7797A67678M0371b66468B04152l2482c12525F7649C0814J13832e8191C16949
17564A27452J21285j18307c8739p1929M1169k17933F3187c4496j3150F5100f7069
17552c1573B86565a35101r2196b6546G8267a61453B28429a6581A32030R4834A04393
17540b77343R9045k07099J89746A14031J38255a26563A55627Q3322I9773A7139
$$ plain form
17623 219202 -43190 -154540 -77783 -378839 136896 -232247 -354713 73194 -142262 -410 56108
17611 19833 -76070 54455 128242 -109932 102558 241934 87983 70972 139256 -215890 -2666
17599 -128540 -42594 206120 141616 -154176 188505 -66981 85401 -7582 72197 77191 13589
17587 5238 88042 -114250 20395 -174908 110575 -118571 395743 -97766 178245 -9502 -87797
17576 -87797 167678 208049 -266468 204152 171670 -312525 67649 30814 144646 -58191 316949
17564 127452 248737 130430 -38739 -110668 -69499 -287432 63187 -34496 -47646 65100 -67069
17552 -31573 286565 -135101 -227297 -26546 78267 -161453 228429 -16581 132030 226864 104393
17540 -277343 -178298 -385397 -195651 114031 252286 -126563 155627 238949 99773 17139
17529a090B42671e0147E5892J8944e8426A55214J54964I2418a1403q1327p4952
17518a67682j8967A51227J04364E2102a29969p4669r6740F9849J67240J9081A1706
17506A97183J39956q8723j5165A779K77220E7780L8582J70863a75861F6982P567
17495G4549A053M25928D6333R4233f1250r5986l756A99886O7585a94188m5540
17484b39728B3381J31605m1858h0772m3913i459j09218A57012a57511A35664a37576
17472F4672J25343E276J61654J59017A21760j1160h294k36331A33661m8605L36471
17461D21527A96671F1940L41263h0101p5397C06649A18610b2032C3736M15279
17451D49015A34023K96575J59696H4708K86642Q1139j49760L6633K2772B8520
$$ plain form
17529 -1090 242671 -50147 55892 74836 -58426 155214 310178 92418 -11403 -92730 -167682
17518 -167682 -186649 151227 255591 52102 -129969 -204638 -301378 69849 237089 256170 11706
17506 197183 337139 248416 233251 1779 278999 57780 96362 267225 -175861 66982 74549
17495 74549 1053 426981 46333 140566 -61250 -157236 -160992 199886 267471 -194188 -239728
17484 -239728 23381 154986 113128 -80772 -124685 -9459 -118677 157012 -157511 135664 -137576
17472 64672 190015 5276 166930 325947 121760 110600 -8294 -244625 133661 85056 421527
17461 421527 196671 61940 403203 -80101 -155498 306649 118610 -22032 33736 449015
17451 449015 134023 430598 590294 84708 371350 452489 302729 339362 362134 28520
17440a4200B08546l2084p1039K11850A5682M4717B9928K25403G8737K335K92741
17429C73813A11606a63973D4159J33688L74101A58869F2810J23472h4570B01226
17418A61614R5456J47402k806H9778B6144J65658D9289N37R2690N1110m8152Q7039
17406B32513p3349m6905N6902b57589C3845L4487i173B4311J73301n3121M5667
17395A90158m6295J70324j08518L92860G4561P660R5719J91883A68685a6981C04818
17383A05334c9078B64457p0970L7300Q2116e3610C9718J28841J9779H487L52898
17372C61385j13911j5152C6842J57233o437p2619J95265H8581a35406D0043J73523
17361B13566E6656B0407R1721k4388M61832G0717J58042m234A07559b00971C73226
$$ plain form
17440 -14200 208546 176462 105423 317273 15682 60399 29928 255331 78737 81072 373813
17429 373813 111606 -163973 44159 177847 551948 158869 62810 186282 -84570 201226
17418 161614 257070 404472 401666 89778 26144 191802 49289 49826 142516 193626 145474 232513
17406 232513 159164 112259 169161 -257589 33845 68332 -9173 24311 197612 144491 190158
17395 190158 143863 314187 205669 598529 74561 82221 177940 369823 168685 -16981 304818
17383 105334 -39078 264457 193487 230787 312903 -53610 39718 168559 188338 8487 361385
17372 361385 247474 232322 36842 194075 187638 115019 310284 88581 -135406 40043 213566
17361 213566 56656 20407 112128 87740 549572 70717 228759 224525 107559 -200971 373226
17349d2685A92972j2951p8192L778K09783j12412G8738K14402a18410d3894C71968
17337H5365a7755E29297I1683a23757K6479F0471J35054a03408C03830j01807
17327B02023L35834j06498M9192d8022C9665J15160P1973G713b141j3985a330
17315b43561d2245o8990B34016D9878J08220d0422A70843n037h7982C42088b3329
17303f5325F3757h7474L6326l9896B39063l951j15384j0808i1050B05734H1513
17291C80627c42252G757J56255p509C5337L60723i0655A25567e5382C20743J04006
17280D24749A24559b75109C70764A11774J47253k9835n2605H5467J20006b1381
17269H8172J33185C5431J57734P4812j17328A5268a29719I6697K19031A33074
$$ plain form
17349 -42685 192972 180021 101829 105607 315390 202978 78738 293140 -118410 -43894 371968
17337 85365 -17755 529297 91683 -123757 -97278 60471 195525 -103408 303830 202023
17327 202023 537857 431359 480551 -48022 39665 154825 226798 7713 -2141 -16126 -1330
17315 -243561 -42245 -111235 234016 49878 158098 -40422 170843 165806 -87982 342088 -23329
17303 -65325 63757 -87474 -51148 -91044 239063 235112 119728 108920 -91050 205734 81513
17291 380627 -342252 7757 164012 156503 35337 396060 -90655 125567 -55382 320743 424749
17280 424749 124559 -275109 370764 111774 259027 229192 176587 85467 205473 -21381
17269 88172 221357 35431 193165 267977 150649 15268 -129719 96697 315728 133074
17258B88973C3976K07684n0651J07019a652G9298K40768A40967N11742b28791
17247c12788D52689j59109C7824A613O0537J32125i3312A47112O2286J22413G983
17235B00349L345H3146Q7005j9984K13736Q6245I8044L67984k4916g2044C61704
17223F3268J06873K35385M132A37587m0776m4130J22684e5167I4112J74215m3357
17212B24970A9580R452J01830n7221L22404m0448G996K13115K34092l1852j39673
17201B83678a19607B88500r7523d2862j5419B60576D9749c54256b8365B06606
17190A36413A3127O78620B98746P445a700A63183J48156c8120B00620a05274B40196
17178A09432O1229J70151j56790P4902J93039j49577j8375R2315j24251N4949
$$ plain form
17258 288973 33976 241660 191009 298028 -1652 79298 320066 140967 652709 -228791
17247 -312788 452689 293580 37824 1613 62150 194275 -93312 147112 209398 331811 7983
17235 200349 203694 83146 170151 150167 363903 450148 98044 466028 441112 -72044 361704
17223 63268 170141 405526 409658 137587 96811 52681 175365 -55167 94112 268327 224970
17212 224970 19580 29032 130862 73641 396045 355597 7996 221111 455203 423351 283678
17201 283678 -119607 288500 190977 -42862 -58281 260576 49749 -354256 -28365 206606
17190 136413 13127 691747 298746 306191 -1700 163183 311339 -38120 200620 -105274 240196
17178 109432 170661 340812 184022 258924 451963 302386 284011 376326 252075 307024
17168C07024N6907F7995a43309B80452j09237G0640J55469M6914j6708J62587
17158D18902d8822A57748A4318K20839J36047A58083Q0093R9669n4920Q8893A58209
17146B38614q9842K1640D6402J91603J67516J19962j40159G8986J40236D2419
17135C03466J06185q3442B3551K62771K29065k41929q744r6411N9183K49188A45318
17123E82207k198A87349K58677J05210D1516M55135j31351q5484K22612j19263
17113C83165j91434J9628J33271j03985J13148J73780N6066j49792o032j42105
17103B85710F9850K74199N6281j79924J23084C3280M01388J23367k39074P2570
17093C91531M0334j35181J4987m0944m0512P7256P7635j83128M61071A25780K66174
$$ plain form
17168 307024 363931 67995 -143309 280452 171215 70640 226109 273023 256315 418902
17158 418902 -48822 157748 14318 235157 371204 158083 238176 337845 282925 371818 158209
17146 238614 148772 170412 46402 238005 405521 525483 385324 78986 219222 42419
17135 303466 409651 326209 23551 286322 515387 273458 264714 168303 227486 476674 145318
17123 582207 580009 187349 446026 551236 41516 496651 365300 279816 502428 383165
17113 383165 191731 211359 344630 240645 353793 527573 583639 433847 427815 285710
17103 285710 69850 344049 400330 220406 343490 33280 434668 558035 318961 391531
17093 391531 431865 296684 311671 270727 230215 307471 385106 201978 663049 125780 391954
17082C91954Q9289A98916L49060j16217j54830L49179j16033k5846m0788K13846
17072F57287l05457K27062k27623L6152j14293K33429j32417K55098j31211J43307
17062F41334C11442J98855n3109I5278N4500N01857r4550j34196p6838j18891
17052B27160N56582k41835j11403K5460M8761J04010m4578k39507K25282o5484
17042D84448J35228o3232G3866P54355l69727K42349l01967J32181n7086j24063
17032C49908K11807j86083J61346j55536j59021N36683P3242k02845O6662k24232
17022D71931J46908B20531K03346K95422q7370j65518L7766O1474K2432k1791
17012E66292J20483O7181j70029j27715J49091K04999j16329k42357L34034j48566
$$ plain form
17082 391954 481243 198916 547976 431759 276929 626108 510075 484229 443441 657287
17072 657287 351830 578892 351269 387421 273128 506557 374140 629238 498027 641334
17062 641334 311442 510297 457188 95278 149778 651635 557085 422889 346051 227160
17052 227160 783742 541907 430504 455964 504725 608735 564157 324650 549932 484448
17042 484448 619676 556444 73866 828221 458494 700843 398876 531057 473971 349908
17032 349908 561715 375632 536978 381442 222421 759104 832346 629501 696163 471931
17022 471931 618839 220531 423877 719299 631929 466411 504177 565651 588083 566292
17012 566292 686775 753956 583927 456212 605303 810302 693973 451616 785650 637084
17002F37084M44138C85520m081J89439n9512K50726j10287N0046j51461M65529
16992A015919m50584J99047L0969j98411R1943J95269j22495j59115K88913m8386
16982H43069j77605L92142C84290Q24914l05606L905j32034J95620q3915j75411
16972G11763N4031J10860k82373L84758l5288K9472Q7076l07247N26714E41738
16961H78678m5771M6500K57360M907K52471m32998l41961N91641l74331J08323
16951I44819J55922P4626p4945k14983Q0508k57657J71899K36987j28307L66357
16941A355226m43549R5822K39276j55363J24786k22632o072j6720K64419K22259
16931A457452k55910L01336n53089L07091j2354J96975l85865M10435l47313L37457
$$ plain form
17002 637084 1081222 385520 381439 570878 511366 762092 651805 701851 550390 1015919
16992 1015919 565335 764382 795351 596940 688883 884152 761657 602542 891455 843069
16982 843069 665464 1057606 384290 1209204 903598 907503 775469 971089 887174 711763
16972 711763 765794 876654 594281 979039 943751 973223 1060299 753052 1279766 541738
16961 878678 832907 879407 1136767 1141674 1394145 961147 619186 1210827 836496 944819
16951 944819 1100741 1175367 1100422 885439 965947 708290 880189 1117176 988869 1355226
16941 1355226 911677 1007499 1246775 1091412 1216198 993566 987494 970774 1235193 1457452
16931 1457452 1201542 1502878 949789 1256880 1244526 1441501 1055636 1466071 1118758 1456215
16921A456215j98534r425K30270n0948k65101P6409J75960J028J36816j76387
16911A376303L04392l57086J92606J15631k87361K79593R6727j08170n5256j34880
16901A422499Q5894K23346k11351J50962M7617j50803K82418k8489n35721N28595
16891A814967K60680j38045j53109J94011j87480P3174J283J60614k57528Q4186
16881A852753L79227l64445J07952J86957Q339l69371L05680N696J54646O6866
16871B334300l7273L00930k91910J71712r245N9036K79247k78658J85377j92030
16861B521486J68929M157p7024K40283p9509o4644N41279Q8795m12863p9220L03385
16850C155054j7351n9435L47209l77704K41332R2079J10052J35194k4132O1942
$$ plain form
16921 1456215 1257681 1248256 1478526 1427578 1162477 1238886 1414846 1415874 1552690 1376303
16911 1376303 1680695 1323609 1516215 1631846 1344485 1624078 1720805 1612635 1557379 1422499
16901 1422499 1508393 1731739 1520388 1671350 1718967 1568164 1850582 1822093 1286372 1814967
16891 1814967 2075647 1937602 1784493 1978504 1791024 1864198 1865481 2026095 1768567 1852753
16881 1852753 2231980 1867535 1975487 2162444 2170783 1801412 2107092 2112788 2267434 2334300
16871 2334300 2297027 2597957 2306047 2477759 2468514 2527550 2806797 2528139 2713516 2521486
16861 2521486 2690415 2694572 2617548 2857831 2778322 2713678 3254957 3343752 2930889 2851669 3155054
16850 3155054 3137703 3078268 3425477 3047773 3289105 3381184 3491236 3626430 3602298 3664240
16840C664240m3451K40104p3273K22061m3103N4179M9010j30472L82404l7105
16830D284594J22749J11185R32J13888M1337K42222N3407P2694j56476K25654
16820E112186J6194K51799j45105L23062J46340L83775j80231K50890R0943M2924
16810F292777M46083l87201K08840J41875L60918J13496L24911K16838k5790J0627
16800G703374R9393L11701M43563P9785O97359l05145J09191O33572J2554L47224
16790A0132571K88476K61320k40141N63179N83895M58058k01483K77428O78091
16781A2801394L53271K15920J063592q5132O17997M63864L94540L81392N55481
16772A6762319P07293O94563N26959M74601M33745J167696R40776J089590P11136
$$ plain form
16840 3664240 3620789 3860893 3787620 4009681 3966578 4020757 4069767 3939295 4321699 4284594
16830 4284594 4407343 4518528 4519460 4633348 4674685 4916907 4970314 5043008 4886532 5112186
16820 5112186 5128380 5380179 5235074 5558136 5704476 6088251 5908020 6158910 6249853 6292777
16810 6292777 6738860 6351659 6560499 6702374 7063292 7176788 7501699 7718537 7692747 7703374
16800 7703374 7802767 8114468 8558031 8637816 9335175 9030030 9139221 9772793 9785347 10132571
16790 10132571 10421047 10682367 10442226 11005405 11589300 12047358 11845875 12123303 12801394
16781 12801394 13154665 13370585 14434177 14349045 14967042 15430906 15825446 16206838 16762319
16772 16762319 17469612 18164175 18691134 19165735 19599480 20767176 21707952 22797542 23508678
16763B3508678R87714N61276J121380J077026J283695R32922J508191J418961
16755C2399843J482786J274599J813410J977206J505600J931417K479461K086335
16747D6950657K866314K039435L034577K747198L635594L116379M151508L736842
16739G2278504M139816M477808M762284N122946N253006N815895O343737O051720
16731A14245716O510542O466550P416985O925368O786541O471301O459437N920483
16723A67202923N746251N010556L302584K563414J475132M23967p86023j801422
16715A83137382k675482m290824m710900n741273o292535o375762o833376p075807
16707A39141423o932479o943564o639626o465252o491449o000086n376032n805715
$$ plain form
16763 23508678 24496392 25057668 26179048 27256074 28539769 29472691 30980882 32399843
16755 32399843 33882629 35157228 36970638 38947844 40453444 42384861 44864322 46950657
16747 46950657 49816971 51856406 54890983 57638181 61273775 64390154 68541662 72278504
16739 72278504 76418320 80896128 85658412 90781358 96034364 101850259 108193996 114245716
16731 114245716 120756258 127222808 134639793 141565161 148351702 154823003 161282440 167202923
16723 167202923 172949174 177959730 181262314 183825728 185300860 185724827 184938804 183137382
16715 183137382 180461900 176171076 171460176 165718903 159426368 153050606 146217230 139141423
16707 139141423 132208944 125265380 118625754 112160502 105669053 99668967 94292935 88487220
16699H8487220m623677m837089m917160l957481l769921l733352k930584l609323
16691E6108633k726057k463930l017753k344212k109057k137824j880980k316305
16683C7112515j475572j489351j874784j134555j283113j643467j157957q52465
16675B6201251q19439j318065q42990r38122r63992l91556j030072p79444l69225
16666A8748346q39438o18859o40528l53666q07528k96918q25743k03274n64228
16657A3598164m90283k97796n45934k59864k74846P0380r55844K44051q04315
16648A0283713k53945k73828j51157r5210o13881K78992m71833k67661p7428m71355
16638G886407J28281r7526l14043j81400l01012p1423j52244m07396L03620k48583
$$ plain form
16699 88487220 83863543 79026454 74109294 70151813 66381892 62648540 59717956 56108633
16691 56108633 53382576 50918646 47900893 45556681 43447624 41309800 39428820 37112515
16683 37112515 35636943 34147592 32272808 31138253 29855140 28211673 27053716 26201251
16675 26201251 25381812 24063747 23220757 22282635 21318643 20927087 19897015 19117571 18748346
16666 18748346 17908908 17290049 16649521 16295855 15488327 15191409 14365666 14162392 13598164
16657 13598164 13107881 12810085 12264151 12004287 11729441 11799821 10843977 11088028 10283713
16648 10283713 10029768 9755940 9604783 9509573 8895692 9174684 8702851 8435190 8357762 7886407
16638 7886407 8014688 7917162 7603119 7421719 7120707 7049284 6897040 6489644 6793264 6544681
16628F544681k21080m2872k33138k45913l00869O7350P9365l99929K57082k79731
16618E224946m11806L13791j09681k04846l11575Q6559j54643R5091l3706m34897
16608D059233K90176k38958l20574J43906j13916L7303j38838k32545J6014O8629
16598C570430J26517l26529n5101q6829K36102k26261p3589K3592r4105k58995
16588B835232M34479k08998j61839j12024L054O1651j44442j41925p139k76631
16578B281418N11311j53988J08054m60854K69384l78690L88172k64421k27669
16569B072717J24133k29486k2953K90736m53786K51508P9591l7900l01603K10233
16559A983190L24866n93940K07625J83153k48581N5400J2265m10439M42438j09873
$$ plain form
16628 6544681 6323601 6280729 6047591 5801678 5500809 5568159 5647524 5247595 5504677 5224946
16618 5224946 4813140 5126931 5017250 4812404 4500829 4587388 4432745 4527836 4494130 4059233
16608 4059233 4349409 4110451 3789877 3933783 3819867 3857170 3718332 3485787 3501801 3570430
16598 3570430 3696947 3370418 3315317 3228488 3464590 3238329 3164740 3188332 3094227 2835232
16588 2835232 3269711 3060713 2898874 2786850 2789904 2851555 2707113 2565188 2558049 2281418
16578 2281418 2792729 2638741 2746795 2285941 2555325 2176635 2564807 2300386 2072717
16569 2072717 2196850 1967364 1944411 2235147 1781361 2032869 2112460 2074560 1772957 1983190
16559 1983190 2308056 1714116 1921741 2104894 1856313 1911713 1923978 1513539 1955977 1846104
16549A846104q950j66820R9090k62529K18171j74299M4521J27510j03893J07828
16539A726733L9965l66827k73288K98660O7731l23127K98083j60165k32315L17028
16529A392478Q3307m30651M88215N3442l06134J9242j17978K0912K80298l69592
16519A113539N8696j43927J35509k4922j04926O8684k14708N84798G11274O96079
16509A407353k12998l30216K76669K32339o17655K77128J4851l1379J90783j74019
16499A032856J17793k85270K06206K66376j61756m29459M32842j86132J58267
16490A151723J12658l80349N4105K25416n06533K33942j90396K50839B64665N48146
16480H12811M0050l37450L61177j95900O4030l460n3622K00488K18470k43460
$$ plain form
16549 1846104 1837154 1670334 1769424 1506895 1725066 1550767 1595288 1722798 1618905 1726733
16539 1726733 1766698 1399871 1126583 1425243 1492974 1169847 1467930 1307765 1075450 1392478
16529 1392478 1475785 1045134 1533349 1586791 1280657 1299899 1181921 1202833 1483131 1113539
16519 1113539 1172235 1028308 1163817 1138895 1033969 1102653 887945 1472743 711274 1407353
16509 1407353 1194355 864139 1140808 1373147 755492 1032620 1047471 1016092 1206875 1032856
16499 1032856 1150649 865379 1071585 1337961 1176205 746746 1179588 993456 1151723
16490 1151723 1264381 884032 938137 1163553 657020 890962 700566 951405 264665 812811
16480 812811 852861 515411 876588 680688 744718 741258 687636 888124 1106594 863134
16470H63134q5638j91218M4188Q5451k9636m7541J24835k43643J26225K60583
16460I06740N5441j83669J07524j8275j63005k02518L0852F5739M65525K04078
16450G35342k29861J77672j14550O7961k72277O36743D78333M0203L1258o0859
16440D88935M7735k5848K8549M793J82051r9723B99857J37893n8332K31094J7977
16429F28489B63591J65817L40784k1284O6511k49360Q3336j37820j20433P0361
16419D61503O9066j48780M69981k87809B68350M08468k5293j50441m1699J077
16409D60462d4922F18430I3895L47381K6931G8161K13108L05320j78484m4871
16399C73234j45550J55149G0937J93426J61385J016J02237J2994N7507o8825j89397
$$ plain form
16470 863134 777496 586278 630466 715917 686281 638740 763575 519932 646157 906740
16460 906740 962181 778512 886036 867761 704756 502238 533090 65739 531264 735342
16450 735342 505481 683153 568603 636564 364287 1001030 478333 518536 549794 488935
16440 488935 536670 510822 539371 544164 726215 626492 299857 437750 379418 610512 628489
16429 628489 263591 429408 770192 748908 815419 566059 649395 511575 391142 461503
16419 461503 530569 381789 851770 563961 268350 676818 651525 501084 459385 460462
16409 460462 -44922 618430 93895 441276 468207 78161 291269 596589 418105 373234
16399 373234 227684 382833 70937 264363 425748 426764 529001 541995 599502 530677 341280
16388C41280J02044P1661q4182J83700k19010j2004q1098j25749L93141A51192
16377E99877A81102D8697a4851C83268O8985N1471k01267e0707C39508L25719
16367F65227I4467J88817L45833C12970p8662H8464N07749j45885q7653h48B14476
16355a43000B81288P7604K0977p3539G4391m148C3583J84868o0981P5135O0799
16344B93404J9311q9441K16189J60538A56900n8597J75654n6924o9867R7984Q5702
16333C30852o6252p1657m9940L01007q6743O9607k09279p1519a50823F7739N9751
16322A27490J57335D4587K68776n6575K7141a63173C52902I6574K08356C5477
16311B17867p7061J01903j00976A7597K41143b01312A3698J69744d5411D29386
$$ plain form
16388 341280 443324 514985 430803 614503 395493 383489 302391 176642 569783 151192
16377 599877 181102 48697 -14851 383268 452253 503724 302457 -50707 339508 665227
16367 665227 94467 283284 629117 312970 234308 88464 596213 450328 362675 -848 214476
16355 -143000 281288 358892 379869 306330 74391 70243 33583 218451 157470 232605 293404
16344 293404 312715 223274 439463 600001 156900 98303 273957 217033 147166 245150 330852
16333 330852 264600 192943 143003 444010 357267 426874 217595 146076 -150823 67739 127490
16322 127490 284825 44587 313363 256788 283929 -163173 352902 96574 304930 35477
16311 217867 140806 242709 141733 17597 258740 -201312 13698 183442 -45411 429386
16300A74947B4735J76233D3399J62105N67396A60194K62051A89831B6894J40708
16290A67602J08854j17612K26042A41812K12305f5434A05586a16499B76247J03662
16280C79909j36526r1101P96M9413J38122f7991F8648P6973O272K7404a9472A18454
16267C37686A28634K66383L06582I5363d0561A65770F2589J84988o9961J20900
16257B98516J1546G4718k4080J35019o2139a85864H2657M39301C5055J32929J14432
16246B82416l8260D7763J44391K7350A01104C0051J03240J39787G1052M7217n4524
16235F3745a45529D8572Q531M38507a11409d5132A8106J40089Q5094J5694J46010
16224D04993j80882R407p8706M8238r357J60619A57180K7419J18439C7397J81338
$$ plain form
16300 174947 24735 200968 43399 205504 772900 160194 422245 189831 26894 167602
16290 167602 276456 158844 384886 141812 354117 -65434 105586 -116499 276247 379909
16280 379909 243383 152282 153078 202491 340613 -67991 68648 145621 151893 179297 -19472 118454
16267 337686 128634 395017 701599 95363 -40561 165770 62589 247577 177616 298516
16257 298516 310062 74718 50638 185657 123518 -185864 82657 521958 35055 167984 282416
16246 282416 244156 47763 192154 219504 101104 30051 133291 273078 71052 118269 63745
16235 63745 -145529 48572 57103 495610 -111409 -45132 18106 158195 243289 258983 404993
16224 404993 224111 233518 154812 203050 193693 354312 157180 184599 303038 37397 218735
16213B18735J52606A3087M40313A71500H4035K6240K1168O1362O4622E4137P5454
16202A29591D1658d1027A59642R3782j8827Q2117h4239B18077r6537c71329C32898
16190g9565H6718c0624k5008A18863n0728C0798g0922C1504K09823p9519a20029
16178H0014K08159N1457m7412b90918A20438O9177a8446A0378M6437P8746a71200
16166B57672A03218j7617a35157A69847K5849C2953E02L19658b722I9309b36253
16154B04126g6642F525K19630J7044O8884j18729F3738i1495C39515L2260g5768
16142I5291O2857O5287a99889A36089l1858b22866C7804a26557a5604j36069b2098
16130D6060O1322B3738f314E1114g1192C58869a24835A94711B1109e2398C8630
$$ plain form
16213 218735 371341 13087 453400 171500 84035 110275 131443 192805 257427 54137 129591
16202 129591 41658 -41027 159642 253424 234597 316714 -84239 218077 121540 -371329 332898
16190 -79565 86718 -30624 -55632 118863 68135 30798 -70922 31504 241327 161808 -120029
16178 80014 288173 339630 292218 -290918 120438 189615 -18446 10378 56815 135561 -171200
16166 257672 103218 85601 -135157 169847 195696 32953 502 320160 -2722 99309 -236253
16154 204126 -76642 6525 226155 243199 312083 193354 63738 -91495 339515 371775 -75768
16142 95291 158148 223435 -199889 136089 104231 -222866 37804 -126557 -15604 -151673 -22098
16130 46060 107382 23738 -6314 51114 -71192 358869 -124835 194711 21109 -52398 38630
16118A19380a92636D96930k27578i6967B84738A6147a02870D75624e1059k8800
16108g9859a4457E6129K10496b53869D5175K00o63b47105H9489J19571D391a31619
16095A96507e2479G890O9115i9481A0278J4060K33557a00942j60122B51162b16447
16083i9516B40163c2564A247a21161k43511a01444M6883D6623i1235L7627K2139
16072c1469A66123b05776R7292A56359j4198E3962K66579a22218C4918J93182
16062B28100c36489h4769j50527A59183d5242B17689H2265a9586k8644j30266
16052a78496B80167i6766r5563B77327E6941e2237j33151K3307b5823j13677B35930
16040a8395I1807J81536b10280d350m2286E2361b11636m5904K332C60914H8745
$$ plain form
16118 119380 -192636 496930 269352 -96967 284738 16147 -102870 475624 -51059 -79859
16108 -79859 -14457 56129 266625 -253869 45175 45375 44712 -247105 89489 209060 4391 -131619
16095 196507 -52479 7890 77005 -99481 10278 24338 257895 -100942 -261064 251162 -216447
16083 -99516 240163 -32564 1247 -121161 -364672 -101444 -54561 46623 -91235 -53608 -31469
16072 -31469 166123 -205776 -108484 156359 142161 53962 320541 -122218 34918 228100
16062 228100 -336489 -84769 -235296 159183 -45242 217689 82265 -19586 -48230 -178496
16052 -178496 280167 -96766 -192329 277327 56941 -52237 -185388 -162081 -25823 -139500 235930
16040 -18395 91807 273343 -210280 -4350 -46636 52361 -211636 -257540 -255208 360914 88745
16028b39154A38799b47947J10958B09172c5208q5328G0388c21471A18154c17159
16017I7262k1809j8566a9887k84873E257L3406J89889j9640J07792H7061a6877
16005I689J98053d54975a7617A32741A3755a75070A08604c8643I0269J04698b50003
15993b25221D7049K16974G1509e1263E9855R4819J3464o3355a06991A31630j9295
15982A12335J2251L09695j66309p5064K2030E2908b22153G1924L78187a38529
15971i7636j493j07646B7291J10750e49770B38733a25802B65229a82962P6846
15961a06116B25776f2425a3082B11654G0800b84966D29944e4841j12774e342k4584
15950b9926l3685B90331b43160j52001c1921i109r7186I7159k9403B1951b96937
$$ plain form
16028 -239154 138799 -247947 -136989 209172 -35208 -120536 70388 -321471 118154 -317159
16017 97262 75453 56887 -19887 -304760 5257 38663 228552 208912 316704 87061 -16877
16005 9689 207742 -454975 -17617 132741 13755 -175070 108604 -38643 90269 194967 -250003
15993 -225221 47049 264023 71509 -51263 59855 154674 168138 104783 -106991 131630 112335
15982 112335 124586 434281 267972 192908 214938 52908 -222153 71924 450111 -138529
15971 -97636 -99129 -206775 27291 138041 -549770 238733 -125802 265229 -182962 -106116
15961 -106116 225776 -62425 -13082 211654 70800 -284966 429944 -54841 -167615 -5342 -29926
15950 -29926 -63611 290331 -243160 -395161 -31921 -9109 -106295 97159 67756 21951 -296937
15938E2205d3486j4988H6373c44891P5221a17514C16047F8467R712K09398a14512
15926c48001d3684A38405b69059A67929b85356A44497a77685m3905J01534Q481
15916a11575B23479l1929p5511a43530H5044b38428B77087a44330A56844a29313
15905c95889O3236J29498q043A69938J65664g6081j51598B05625B3248R5406j2751
15894A05903a54701B49224a09729k49382J30986F7971a91990d8892o3528k05825
15884c18245a02058d4689Q655I1942b0424l01449c384l7616j38829b4800A7272
15872c3280k23579P9724m1333A44208J79903I3146g8406C14950a51843A01839
15861E1601c72757E2969c4198A26264a51176n5983h066I5733J2667J20404I2722
$$ plain form
15938 52205 -43486 -58474 86373 -344891 -269670 -117514 316047 68467 78179 287577 -114512
15926 -348001 -43684 138405 -269059 167929 -285356 144497 -177685 -221590 -120056 -111575
15916 -111575 223479 191550 116039 -143530 85044 -238428 277087 -144330 156844 -129313
15905 -395889 -332653 -203155 -211198 169938 335602 -76081 -227679 205625 23248 118654 105903
15894 105903 -154701 249224 -109729 -359111 -228125 67971 -191990 -48892 -112420 -318245
15884 -318245 -102058 -44689 -36034 91942 -20424 -321873 -3384 -41000 -179829 -24800 17272
15872 -33280 -256859 -177135 -218468 144208 324111 93146 -78406 314950 -151843 101839
15861 51601 -372757 52969 -34198 126264 -151176 -207159 -8066 95733 108400 228804 92722
15849B45770j5594n8706d7030j33625A07485a29286q0535Q3631M05C5170g1658
15837I7173k0172d8257A88085a43717M7447d4498j36651Q8842j3138A33128D9926
15825H2997B8541J34150Q391b22301r688J8922c0868A10561J10240A05152c20314
15813B675J97182b3381k2065J2345r2084A5663Q3566b55976a8236j84593B8908
15801c92483A87470a20723A3044J93007n1107b890B56888b15410A16576J18155
15791B34731o4115a30574q8717R010r2897A1532J00243k7256k1399c27956j04201
15780d32157f4922D8389j8502g4183I0587i7092H2911K4691g2251k8111a5386
15768A71448g4546m5964B42216b65177d67j23784j28775a1996j70878E9346a1620
$$ plain form
15849 245770 230176 171470 -47030 -180655 107485 -129286 -209821 -126190 -125785 35170 -71658
15837 97173 77001 -48257 188085 -143717 -96270 -44498 -181149 -92307 -105445 133128 49926
15825 82997 28541 162691 171082 -222301 -231989 -213067 -30868 110561 220801 105152 -320314
15813 2675 199857 -23381 -45446 -33101 -125185 15663 99229 -255976 -18236 -202829 28908
15801 -392483 187470 -120723 13044 206051 154944 -2890 256888 -215410 116576 234731
15791 234731 170616 -130574 -219291 -210281 -303178 11532 111775 84519 63120 -327956 -432157
15780 -432157 -64922 48389 29887 -74183 90587 -97092 82911 107602 -72251 -100362 -15386
15768 171448 -74546 -120510 242216 -265177 -467 -124251 -253026 -11996 -182874 59346 -11620
15756b9759A81781R1933i646p4738l10420P4502d0782F9929b71001N3785b4491
15744g4552K8032B92762a55786A97551c27757G3368a25584B7231M52769b86816
15733b13C8423R2503B3255a34769B05026i9705A3754c98276i3339H6114a68190
15721b35930b4892H6942e947H3318b54977I1401a09963m1733J3260B71176b5938
15709a47823A44563B8142c6568E4592b41819E0092Q0726c56869J36003a05662
15698c8590k3146F9149l0442d3353r8152o4833K0471J6017d3199A64813D3517
15686G2258d8922j66683d8612A41869e1557k04913f3557A63917a65954h555H1445
15674C4156K05142e2185A71898b30065G8594J37109F5771b97483B37025b54586
$$ plain form
15756 -29759 181781 273714 -9646 -84384 -394804 -320302 -40782 69929 -271001 -217216 -24491
15744 -74552 -46520 292762 -155786 197551 -327757 73368 -125584 27231 480000 -286816
15733 -213 38423 130926 23255 -134769 205026 -99705 13754 -398276 -93339 86114 -168190
15721 -235930 -24892 86942 -5947 83318 -254977 91401 -109963 -151696 -138436 271176 -25938
15709 -147823 144563 28142 -36568 54592 -241819 50092 130818 -356869 -220866 -105662
15698 -38590 -61736 69149 38707 -43353 -141505 -206338 -185867 -169850 -43199 164813 43517
15686 72258 -48922 -215605 -48612 141869 -51557 -256470 -63557 163917 -165954 -8555 81445
15674 34156 239298 -52185 171898 -230065 78594 215703 65771 -297483 237025 -254586
15663C65739j54223A1700J48932J37218b72728m3476b2645m39514A97197J30996
15653C28193b136j92031A7746N2186a89674c0046a2346B93820b94815B4381c6907
15641a41279j5382G0755a89772A18704i5007j22496A84614F9233b80791a12900
15630A61670a04036d6293k01895c1113A98682b3951B5828b82844B27637J7550
15620B45187i1600C37924g8884L1760A63958a07988G7250B8240i6442d2883A98770
15608C37341b2181B117J69897a5959j36407j57178E3705a3083E2380c31753R0344
15597b41409g1845C64564a15013j17695A65708c1010l01003J1500q744e5550j3051
15586f8601j70168i0408E8003p288J87344j00701f0920B39429G8886J05405a19095
$$ plain form
15663 365739 211516 11700 160632 297850 -272728 -316204 -22645 -462159 197197 328193
15653 328193 -2136 -194167 17746 69932 -189674 -30046 -12346 293820 -294815 24381 -36907
15641 -141279 -156661 70755 -189772 118704 -95007 -217503 184614 69233 -280791 -112900
15630 161670 -104036 -46293 -248188 -31113 198682 -23951 25828 -282844 227637 245187
15620 245187 -91600 337924 -78884 -47124 163958 -107988 77250 28240 -96442 -42883 198770
15608 337341 -22181 2117 172014 -15959 -152366 -309544 53705 -13083 52380 -331753 -241409
15597 -241409 -71845 364564 -115013 -232708 165708 -31010 -332013 -320513 -329257 -55550 -68601
15586 -68601 -238769 -90408 58003 50715 238059 137358 -60920 239429 78886 184291 -119095
15574c8923A0769J40012L5887D1683R8761f8152n9947j26230G9445A1475a44478
15562B14570a46887A83241c89725C89804c35317C40431c77324D8492Q7225a31847
15551A69101a5951j09346l88115J87017d1242A90641a36492A15465J88945E9306
15540e0539o5597k8531M4794A32621F1362b23365C6585c81085a29751A71743c36080
15528b35388E52J32185E434a99129A68078B5356a6523k14565J12118L772B4680
15516A81458A3580K87951f6262H9922A3335J66345a34906K386L7886J8844k33590
15505c09380A10716e1184H7920f9932L4281B73014b5729D6038a45910C5262a03059
15493A24876c6315m2437j79466h0697j01776M7184N2303A75401b66745a13329
$$ plain form
15574 -38923 10769 150781 186668 41683 140444 -68152 -128099 -254329 79445 11475 -144478
15562 214570 -146887 183241 -389725 389804 -335317 340431 -377324 48492 135717 -131847
15551 169101 -15951 -125297 -513412 -326395 -41242 190641 -136492 115465 304410 59306
15540 -50539 -116136 -144667 -99873 132621 61362 -223365 36585 -381085 -129751 171743 -336080
15528 -235388 552 132737 5434 -199129 168078 25356 -16523 -231088 -118970 -115198 24680
15516 181458 13580 301531 -66262 89922 13335 179680 -134906 -132520 -94634 -75790 -309380
15505 -309380 110716 -51184 87920 -69932 -35651 273014 -25729 46038 -145910 35262 -103059
15493 124876 -36315 -78752 -258218 -80697 -182473 -135289 -82986 175401 -266745 -113329
15482a33461A89112G40J50074a34248G9939J55969a95785K812K9000F8180a6574
15470D5077O6941j0214C5783L6725b68392a05502J2344k25043a17319B86805b1777
15458D2761i2921k03526R5533B19325p3315a18115l1543G2640a25846E0948e03397
15446A19472e7724e471A24065c26364c1272J5620A167a5594B78743b04104e4658
15434C55364j37037f9945j14514a8296q2337M1195o00L076n1958D2921J01102
15423A44023a13007J3515B49637D1722J29549E5368f9068B46922d7953A00468
15412C2132a12239d4830r3228A5669R0794b00566k67468A60162c292j74357n2814
15401b30463D7511a93973A41485b75167B11485n9152c07908g6625l761c7105k07187
$$ plain form
15482 -133461 189112 740 150814 -134248 79939 235908 -195785 -192973 -163973 68180 -16574
15470 45077 112018 101804 35783 72508 -268392 -105502 -93158 -318201 -117319 286805 -21777
15458 42761 -92921 -296447 -200914 219325 146010 -118115 -149658 72640 -125846 50948 -503397
15446 119472 -57724 -5471 124065 -326364 -31272 -15652 1167 -15594 278743 -204104 -54658
15434 355364 218327 -69945 -184459 -18296 -100633 -59438 -60038 -56962 -108920 42921 144023
15423 144023 -113007 -99492 249637 41722 171271 55368 -69068 246922 -47953 100468
15412 32132 -112239 -44830 -138058 15669 106463 -200566 -468034 160162 -3292 -177649 -230463
15401 -230463 47511 -193973 141485 -275167 211485 152333 -307908 -76625 -80386 -37105 -244292
15390b44292C26756G7143g0520j6020L3688A81403b20553g2973j29427A92892
15379B3971h6219l31241K8585c069p1976A93596B5833m818a0126p3766B20636
15367d0843D0599K21694a100k41056a16566j04355C9810L0398k1598K04700n7444
15356A95866a54730c4965j97657I2772J65897a58839k24804A5272b18982g796
15345F6827R0522a71422A34507a72486D555J4406J88102m0129B4792O1312K35597
15334C21701j27576b58419e6918I1930A2813a9432H1161h967k59814B04731L2233
15323B36964d869A20322n9962J3577g1854A88718L099C2030j903b3876a994B53684
15310A00629a67528n5816i910o8449A7486a78710Q0827b9964j23390j3762A32523
$$ plain form
15390 -244292 326756 77143 -70520 -86540 -52852 181403 -220553 -72973 -202400 192892
15379 23971 -86219 -417460 -388875 -3069 -75045 193596 25833 21015 -10126 -83892 220636
15367 -40843 40599 262293 -1100 -242156 -116566 -220921 39810 70208 48610 253310 195866
15356 195866 -154730 -34965 -232622 92772 258669 -158839 -383643 15272 -218982 -7796
15345 66827 157349 -171422 134507 -172486 4555 18961 207063 166934 24792 86104 321701
15334 321701 194125 -258419 -56918 91930 12813 -19432 81161 -8967 -268781 204731 236964
15323 236964 -4869 120322 60360 73937 -71854 188718 191817 32030 30127 -23876 -1994 253684
15310 100629 -167528 -223344 -9910 -78359 17486 -178710 -97883 -29964 -153354 -167116 132523
15298A89302g8852A64002G4226b73352G7481a22407I5420b39494J04249J0732
15288a24513A30453b5266a0977C12318O1247D7924h0678A00417Q4316i2489C9339
15276B08244J42421g7644k39654A27928Q173o6895c49840C21288b58983m6317
15266c05300B25716N6104F8307a16990B06719q5137J99661a11819A97560l5737
15256A61823n1994K7232O6438o7554j1052k1778M31961M93470K50459j82384K12355
15245A308976m80414l35710k33900j25987P7898b956J048k6288A75429a74144
15234A59348L2667a55563E131J28827F4060d5353K2127D6480k371a39417b0838
15222a89561J277D2257f9999Q112a1675G310L17558j30086G7326J19196o9926
$$ plain form
15298 189302 -78852 164002 74226 -273352 77481 -122407 95420 -239494 -135245 -124513
15288 -124513 130453 -25266 -10977 312318 373565 47924 -80678 100417 184733 -92489 39339
15276 208244 350665 -77644 -317298 127928 136101 69206 -349840 321288 -258983 -305300
15266 -305300 225716 281820 68307 -116990 206719 121582 321243 -111819 197560 161823
15256 161823 109829 137061 203499 135945 124893 103115 535076 1028546 1279005 1096621 1308976
15245 1308976 828562 492852 258952 132965 210863 -2956 -1908 -28196 175429 -174144
15234 159348 192015 -155563 5131 133958 64060 -45353 -23226 46480 44109 -139417 -20838
15222 -189561 -188284 42257 -69999 -61887 -11675 7310 324868 194782 77326 196522 126596
15211A26596J80385b21049A83964a59639I510J12935c5844p3489d6615E2066j2588
15200C9478Q6646a71670g7356A46786M4815a43527e9031n1231j90047E4961d8109
15188A89700q283M6414r8951C1718R0096k2658a0935l381H6544a86519B67084
15176B99455j22130a01629D6204a33214e2672j41652A10803J16113a90444j61652
15166c52096B93926i9405a0381I6541R0051a28414A48082a4581A04613P5464m8317
15155A31760b55514n129A80302c45729g5284q120A41820c0955o7981b3238q2003
15144a05241n05005G2745J60058a31446e4392J373B54018O3043E8511b12742f7700
15132C42019j15243a10226A58192A807J21218K0944f2303G7247J62720d61175
$$ plain form
15211 126596 306981 -221049 183964 -159639 9510 122445 -35844 -109333 -46615 52066 39478
15200 39478 126124 -171670 -77356 146786 191601 -143527 -59031 -110262 -300309 54961 -48109
15188 189700 181417 227831 128880 31718 121814 99156 -10935 -14316 86544 -186519 267084
15176 299455 177325 -101629 46204 -133214 -52672 -194324 110803 226916 -190444 -352096
15166 -352096 293926 -99405 -10381 96541 186592 -128414 148082 -14581 104613 180077 131760
15155 131760 -255514 -260643 180302 -345729 -75284 -83404 141820 -30955 -98936 -23238 -105241
15144 -105241 -610246 72745 232803 -131446 -54392 -53019 254018 317061 58511 -212742 -67700
15132 342019 226776 -110226 158192 1807 123025 143969 -62303 77247 239967 -461175
15121C3799J23247J54116f6771C0619c58780B55205N4999K452b5343A20700l7370
15110H3330e2002B14053J34583c4411B51821K53730A3294K90545K34020A02567
15099E3680J57074A0890E037L4306K4756B959J58214b02691B55070F2151R5596
15088A57747J0682G7856K14873q3573a62558B45474F0083J00742K2488F0332M8549
15077A08881n4438J86533K14522j85648o4502r2772a00799A65639e8605D04583
15066C05780A00858N2421a56970C14488m3565A17604K59156b58088C27553o6378
15056B61175H9872j7618K4755L02584H3970c4412A86297J33232a22148j37616
15046b59764B26355P8443j30817J32114h5855A09099N346b2036A31832k5656D0946
$$ plain form
15121 33799 157046 311162 -66771 30619 -358780 255205 310204 312656 -25343 120700 83330
15110 83330 -52002 214053 348636 -34411 251821 505551 13294 303839 537859 102567
15099 53680 210754 10890 5037 39343 64099 2959 161173 -202691 255070 62151 157747
15088 157747 168429 77856 292729 209156 -162558 245474 60083 160825 183313 60332 108881
15077 108881 54443 240976 455498 269850 205348 112576 -100799 165639 -58605 404583
15066 305780 100858 153279 -156970 314488 270923 117604 376760 -258088 327553 261175
15056 261175 89872 72254 97009 399593 83970 -34412 186297 319529 -122148 -259764
15046 -259764 226355 304798 173981 306095 -85855 109099 114445 -22036 131832 106176 40946
15034B15038K21873H6630c23254A26068N3475F1525J98513A2591d0505A39700
15023c96878F3124J21083p7291L592K47856l5298j43024b66923d641B9566K71043
15012C00609l5242r8644J51853j02283a8134B856J01536m3298M37186a0306n3892
15001f4198B35481J06122c90873B94870H7240L08106A48127J05322j15527J44495
14991B82417m1578F1322j1833g4975A23804J23908m1220a17400B48855K39249
14981D88104j70421p3637J40129Q2963k30054J13930M2630o7199A37611J17047
14971B54658A15737J03718L91933A89421O5266c916j73544C60778D1063L78386
14961D19449i665B38690H1101L2867R3561j8977o0775L17309k09743B6632L45130
$$ plain form
15034 215038 436911 86630 -323254 126068 179543 61525 260038 12591 -40505 139700
15023 -396878 63124 184207 106916 110508 358364 323066 180042 -266923 -4641 29566 300609
15012 300609 265367 166723 318576 216293 -18134 2856 104392 61094 498280 -10306 -64198
15001 -64198 235481 341603 -390873 294870 87240 395346 148127 253449 137922 282417
14991 282417 240839 61322 49489 -74975 123804 247712 206492 -117400 248855 488104
14981 488104 317683 244046 384175 467138 237084 351014 393644 326445 137611 254658
14971 254658 115737 219455 611388 189421 254687 -3916 -177460 360778 41063 419449
14961 419449 -9665 238690 81101 113968 207529 188552 127777 445086 235343 26632 371762
14950C71762j12836K80247A88849A4779L86367D1342M43018m6955j96894I3118
14939A57193K0135J92920q2451p2654N3602J71652a7943n2712B65720P5622O02
14928C41944j56428M20563B56968j00824J7742a00359F41513h94A59871m8563
14918A11308M18619j74424j31663R0948q1337K61776j85998K2868j841q851j47590
14907A73815E3092J24208P6943j5738M19887j93137A85745L11617j97017j40916
14897A59429K98565j01743q1189c8681C61997R3918j30728p2235K97910q0654
14887D70208B22325r2157K44926j64387n6032L82197k05654G3180K48795p9631
14877B42344L85612k06526j93935J9659P7490j3496K77556k36150j42267N8034
$$ plain form
14950 371762 258926 539173 188849 14779 401146 41342 484360 437405 240511 93118
14939 157193 177328 370248 287797 215143 268745 440397 -17943 -70655 265720 341342 341944
14928 341944 185516 606079 256968 156144 173886 -100359 641513 -894 159871 111308
14918 111308 529927 355503 223840 314788 233451 495227 309229 332097 330256 321405 173815
14907 173815 53092 177300 254243 238505 658392 465255 185745 497362 300345 159429
14897 159429 457994 356251 275062 -38681 361997 455915 325187 252952 550862 470208
14887 470208 222325 130168 375094 210707 154675 536872 331218 73180 321975 242344
14877 242344 627956 421430 227495 247154 324644 311148 588704 352554 210287 268321
14867B68321M15I7630L82567N5502A77407K85470j48051K67658k51333Q9191j43461
14856B76881L2286L92806B0005M77146N4407J62868A73906L5022J87510J32452
14846E28890A0588J83875K02583J10647j25750j46528K53486j0000k29730L51370
14836F00541B6255L13436K19513k00662j72235L58804O7043B5407M43456A07708
14825G81480k91254j77261P4245N7740j87888j15514M02186j03819k07897L45072
14815E77090k18429n4612j11329K39389n471I8803L10533N0843A97630L52397
14805E50027j73353K20144Q0236j23590K21308l68955O5739J30326k50666K48457
14795E99673a7396D46877K91583r5429j34784K9048J14305L3141k67765J17630
$$ plain form
14867 268321 268736 97630 480197 535699 177407 462877 314826 582484 331151 420342 276881
14856 276881 309167 701973 20005 497151 551558 714426 173906 208928 396438 528890
14846 528890 10588 194463 397046 507693 381943 235415 488901 478901 249171 600541
14836 600541 26255 339691 559204 358542 186307 545111 612154 25407 468863 107708
14825 781480 490226 312965 387210 444950 257062 141548 543734 439915 232018 577090
14815 577090 358661 304049 192720 432109 426638 98803 409336 460179 197630 550027
14805 550027 376674 596818 677054 553464 774772 405817 471556 601882 351216 599673
14795 599673 -17396 446877 738460 643031 508247 537295 651600 684741 416976 534606
14785E34606j20486A71940L96957j47496l8249j31884J7415J67919j26174K68769
14775E79197J68176l71676J26138K86043C16550k4949J71124m1895K00409J1302
14765F32541B36570K37570q3734l1144M99134l86824K20075j33904q5064Q6352
14755E59031B76032P6249L08856j2289N405P3447j68439J95543j83949J58677
14745G29532Q1627j87543j13552K27063m4118J063k34586L66516j81405j20438
14735E24159M39445k27140j23281L31182n7265m25715J98791J23902K5247J28527
14725I37852m1786k60102J8606R3414J17643n7651k83039k160J10008J59823j51305
14714F41303q2072R8934L6658M7946j41926K73597j43410j03909K02201n0042
$$ plain form
14785 534606 414120 171940 568897 421401 383152 251268 268683 436602 310428 579197
14775 579197 747373 375697 501835 787878 316550 291601 462725 420830 621239 632541
14765 632541 236570 474140 390406 359262 858396 471572 691647 557743 472679 559031
14755 559031 276032 352281 661137 648848 654253 727700 559261 754804 570855 729532
14745 729532 811159 623616 510064 737127 693009 694072 459486 826002 644597 524159
14735 524159 963604 736464 613183 944365 887100 461385 660176 784078 809325 937852
14725 937852 896066 635964 654570 747984 865627 807976 524937 522777 632785 792608 641303
14714 641303 559231 658165 694823 742769 600843 874440 731030 627121 829322 779280
14704G79280P8637k72592j07598K30913J80602j23936j7467j88459M32077k67735
14694G23722J5758O9963K70554l54873j00829L44054k10479Q5597j8741M6111
14684H70837k47887K36016j72008J46281j17051M57812m27438J75338P894j62818
14674G66976K99041m34712K18113J96126j36719j66115k21659M01529K87139k72237
14664I37482J35783P0217m04678N74797k77377j4575l5515N2961K32175m68977
14654H02293K16499k08890M22687k57089J2200K90187j92452j49912l2088j62169
14644G41266N26703l18279R3181L14066j91965J05272l01433L12508m24652L41175
14634A197842J58162J3990j48308l6346k82037J20329J49115K12423k02119j75831
$$ plain form
14704 779280 857917 585325 477727 708640 889242 765306 747839 559380 991457 723722
14694 723722 739480 809443 1079997 725124 624295 968349 757870 843467 824726 870837
14684 870837 622950 858966 686958 833239 716188 1174000 746562 921900 929794 766976
14674 766976 1066017 631305 849418 1045544 908825 742710 521051 922580 1209719 937482
14664 937482 1073265 1143482 738804 1313601 1036224 1021649 986134 1039095 1271270 802293
14654 802293 1018792 809902 1232589 975500 987700 1277887 1085435 935523 903435 741266
14644 741266 1267969 949690 1042871 1356937 1164972 1270244 968811 1281319 856667 1197842
14634 1197842 1356004 1369994 1221686 1185340 903303 1023632 1172747 1385170 1183051 1007220
14624A007220K25388o3491j85567J55250K85172l62834L07720j56049l3563K58197
14614A437443l28939K1215M85232j13266r3709l80605J37570M24910m10916J39550
14604A318485k26064M03378l3591O928J79468k86303L0971L39383r8003k39164
14594A395488N6801L47841j76002L34891j21652k8305J90260l95542o0872j1150
14584A531758K01781k09596K47648J75814k23975J97274k12215n1522K32838m07240
14574A482565O52292j22164k60894K9460O9107J63427P9097j67777L95890j30412
14564B190591k7404K14600j72006k2244K39674K03718L51791j51786j85375L00031
14554B941590J38646N15831Q3921M07779Q02897J602642L983830J0310664J8589983
$$ plain form
14624 1007220 1232608 1169117 983550 1138800 1423972 1061138 1368858 1212809 1179246 1437443
14614 1437443 1108504 1129719 1614951 1501685 1407976 1027371 1164941 1589851 1178935 1318485
14604 1318485 1092421 1495799 1462208 1469136 1648604 1362301 1393272 1732655 1634652 1395488
14594 1395488 1452289 1800130 1624128 1959019 1837367 1809062 1999322 1603780 1542908 1531758
14584 1531758 1733539 1523943 1771591 1947405 1723430 1920704 1708489 1656967 1889805 1482565
14574 1482565 2134857 2012693 1751799 1781259 1850366 2013793 2092890 1925113 2321003 2190591
14564 2190591 2163187 2377787 2205781 2183537 2423211 2626929 2978720 2826934 2641559 2941590
14554 2941590 3080236 3596067 3679988 4087767 4890664 6493306 10477136 20787800 39377783
14545C9377783L696287j9635631A0571995E009852j798420q86544j98769j75994
14537A950125k24992L9113j5917J99652L0463L0971o185k7154N31616j91918j07693
14526B208081k06372J49047j27762J84054J79832j38598L26155l03422M4643N7612
14516B373270q2452O1046q3898N57873k92150p702k3431O6835R7000k77807M78611
14505B867195l06982K10630j12390m960K46944l2303j68766J15371k12236O49585
14495C252088j07436j67000J58167M4851K38658l80451J15646j17468K42310r2253
14485C187112M17641j98623n576m6079J47653J86032k33520K19462l72886M36734
14475C737950k63840K55574L11653J45558l89588j64965k6520K89444O5378J80432
$$ plain form
14545 39377783 43074070 23438439 10571995 5009852 3211432 2324888 2126119 1950125
14537 1950125 1725133 1764246 1748329 1947981 1978444 2009415 2003230 1976076 2507692 2315774 2208081
14526 2208081 2001709 2150756 2022994 2207048 2386880 2248282 2574437 2271015 2315658 2373270
14516 2373270 2290818 2351864 2267966 2825839 2533689 2525987 2502556 2569391 2666391 2388584 2867195
14505 2867195 2560213 2770843 2658453 2653493 2900437 2868134 2699368 2814739 2602503 3252088
14495 3252088 3144652 2977652 3135819 3180670 3419328 3038877 3154523 3037055 3279365 3187112
14485 3187112 3604753 3406130 3400554 3354475 3502128 3688160 3454640 3674102 3301216 3737950
14475 3737950 3474110 3729684 4041337 4186895 3797307 3632342 3605822 3895266 3960644 4141076
14465D141076j05218J10783j7057K49536l84845J83053N16950k86401L2097J28546
14455D568520Q321M28280m1972r0326k0289J29171Q2924K80247p0169j28447j23317
14444E022943K87957R1016K00476k54038L95339k15828m1433J26246K56021K46733
14434F115432r9035k41971N37638O0590k1414M7099M75483k73396K04931K63438
14424G068795l09806L11804j22675M04426j13299j56987M43359j28199J32977
14415G530395J19798K96781J28839J64279o7022J96559K02994K51344L1713Q5741
14405H941421L74404L2783P1893r0581L85720J71824K22717j83320p942M07842
14395A0326761K10161j32847L20988O83579P9871m0466M42796l6152M68637N38048
$$ plain form
14465 4141076 4035858 4146641 4129584 4379120 3994275 4177328 4694278 4407877 4439974 4568520
14455 4568520 4576841 5005121 4963149 4872823 4852534 4981705 5064629 5344876 5274707 5146260 5022943
14444 5022943 5310900 5401916 5602392 5348354 5743693 5527865 5486432 5612678 5868699 6115432
14434 6115432 6016397 5774426 6312064 6372654 6351240 6398339 6873822 6600426 6805357 7068795
14424 7068795 6758989 7070793 6948118 7352544 7239245 7082258 7525617 7397418 7530395
14415 7530395 7650193 7946974 8075813 8240092 8173070 8369629 8572623 8823967 8855680 8941421
14405 8941421 9315825 9348608 9420501 9329920 9715640 9887464 10110181 9926861 9918919 10326761
14395 10326761 10536922 10404075 10725063 11408642 11488513 11448047 11890843 11854691 12323328 12861376
14385A2861376m71594J96091L70091L36389L54733O8965K40826K54160L83894
14376A4594931K2151N65211j80649M77291P22952J31862J84396M80975N19644
14367A7518764L47134K50113O83289q2107Q69118K68044J85791P62966N75399
14358B1378511J48607N68723M25571O73183N68860K96642P14591M23791Q62930
14349B6061409Q48543N70989Q01047M20520J123562M76570J083522O53751O60393
14340C2700306R34597P94531J362997J102127Q69603J376600R50659J099843J379020
14331D2570283J538272J361287J255516J367352J972425J294682K030933J809044
14323E5199794J864920J724824K330195K326508J975479L181143K228313K898153
$$ plain form
14385 12861376 12389782 12585873 12955964 13292353 13647086 13716051 13956877 14211037 14594931
14376 14594931 14617082 15182293 15001644 15478935 16201887 16333749 16518145 16999120 17518764
14367 17518764 17865898 18116011 18799300 18717193 19586311 19854355 20040146 20803112 21378511
14358 21378511 21527118 22095841 22521412 23194595 23763455 24060097 24774688 25198479 26061409
14349 26061409 26909952 27480941 28281988 28702508 29826070 30302640 31386162 32039913 32700306
14340 32700306 33634903 34429434 35792431 36894558 37764161 39140761 40091420 41191263 42570283
14331 42570283 44108555 45469842 46725358 48092710 50065135 51359817 53390750 55199794
14323 55199794 57064714 58789538 61119733 63446241 65421720 68602863 70831176 73729329
14315G3729329K577426L282516L204975L285267M044104L506101M393798M200551
14307A02224067M655866M983516N140514N520634O268229N974380O699772P018885
14299A48485863P871115P702816Q696813R275763R685985R856503J1397243J1196113
14291B24168214J2233908J2678140J3906384J4086999J4563513J5498648J5894683
14284C23030489J6414616J6572532J6852440J6671580J5994370J5763727J4594376
14277D35894130J3166827J1957299R427070P765399M138033K09063l874280p737367
14269D70946174m545284n949521n675549p951218j0587638j3830670j5259678
14262D07146616j6477507j7134436j7040086j7101420j6683920j6457968j5112181
$$ plain form
14315 73729329 76306755 79589271 82794246 86079513 90123617 93629718 98023516 102224067
14307 102224067 106879933 111863449 117003963 122524597 128792826 134767206 141466978 148485863
14299 148485863 156356978 164059794 172756607 182032370 191718355 201574858 212972101 224168214
14291 224168214 236402122 249080262 262986646 277073645 291637158 307135806 323030489
14284 323030489 339445105 356017637 372870077 389541657 405536027 421299754 435894130
14277 435894130 449060957 461018256 470445326 478210725 482348758 482557821 478683541 470946174
14269 470946174 466400890 460451369 454775820 446824602 436236964 422406294 407146616
14262 407146616 390669109 373534673 356494587 339393167 322709247 306251279 291139098
14255B91139098j4601183j4568021j3771045j2795925j2336487j1656555j0884176
14248B00525706j0444489r532336r092258q635220p364613p751771p053905o523991
14240A34127123o363022n724045n095966m884290n250521m605384m465416m069727
14232I3668752l702314l610479k941751l828565l092914k882983k838246k774634
14224F7996866k565257k153945j866987k296121k094037j412558j827543j815644
14216E1964774k205553j569594p58755j642064j603389j253306j160872j274213
14208D0497028j246840l01944j224247j264040j584838q42038o77778q24407n82957
14199C1947939j118381p73414q40521p84968n91670n61996p41642m78135q15020
$$ plain form
14255 291139098 276537915 261969894 248198849 235402924 223066437 211409882 200525706
14248 200525706 190081217 180548881 171456623 162821403 155456790 147705019 140651114 134127123
14240 134127123 127764101 122040056 116944090 112059800 106809279 102203895 97738479 93668752
14232 93668752 89966438 86355959 83414208 79585643 76492729 73609746 70771500 67996866
14224 67996866 65431609 63277664 61410677 59114556 57020519 55607961 53780418 51964774
14216 51964774 49759221 48189627 47430872 45788808 44185419 42932113 41771241 40497028
14208 40497028 39250188 38948244 37723997 36459957 34875119 34033081 33355303 32530896 31947939
14199 31947939 30829558 30056144 29215623 28430655 27838985 27276989 26535347 26057212 25242192
14190B5242192o69823n82224n23473p54709l44765o56179k38213o00368n66326
14181B0306112K48290r78269k7542r27118L300k65411n37172n82775k44909k32406
14171A6762100p7460o84246k02479n80090o9598k98789k44711l96200l72161J72404
14161A4008770m10650m4282m40485n6061l81960j12153m28286K04267j21695l75804
14151A1841661k00936k62571j70722m12400J72555n67226J64873j56399m3030
14142A0365805k03582l53454k99573m9926l02681k40771l5060J13284p1131l84924
14132H537987J40442k51230k7276o2087r0817k27675J47600j50058m55261j18098
14122G443527k55192L27329k15179j99311j79534L476J11638k01979j85180K75711
$$ plain form
14190 25242192 24572369 23990145 23466672 22711963 22367198 21711019 21472806 20872438 20306112
14181 20306112 20554402 19576133 19548591 18621473 18624773 18359362 17822190 17239415 16994506 16762100
14171 16762100 16684640 16000394 15797915 15217825 15148227 14849438 14604727 14208527 13836366 14008770
14161 14008770 13598120 13553838 13113353 13057292 12675332 12563179 12134893 12339160 12217465 11841661
14151 11841661 11640725 11378154 11207432 10795032 10967587 10400361 10565234 10408835 10365805
14142 10365805 10162223 9808769 9509196 9459270 9156589 8915818 8880758 8994042 8922911 8537987
14132 8537987 8678429 8427199 8399923 8337836 8247019 8019344 8166944 8016886 7561625 7443527
14122 7443527 7188335 7515664 7300485 7101174 6921640 6925116 7036754 6834775 6649595 6925306
14112F925306k94211k13018r9270M10811n82508Q3704k59330L65394o10189j36746
14102E589943K54438p906M6858j95299l37398j34300K27771p375j04681K18749
14092E550800m7133l53210L7276P7888j47685O0127k68464J7113j30195l03576
14082D492941M03793j87801k85749j55470L60981n805k10594k51183L13794j72419
14072D302488m61061o836K38506O1181l47573N99522o57075J09193o8692J99905
14062C969558k7280m49531J81754J09663K71276m72565M91955n12458J28651m25890
14052C265133N50469k46555N7909J27520o90059J90656j08997J75637q4666j73319
14042C063728l81862N63798j01282k51004L2148J3808k69863L62147p2123M4352
$$ plain form
14112 6925306 6631095 6418077 6318807 6729618 6147110 6230814 5971484 6336878 5726689 5589943
14102 5589943 5844381 5836475 5883333 5688034 5350636 5216336 5444107 5436732 5332051 5550800
14092 5550800 5503667 5150457 5187733 5265621 5117936 5178063 4909599 4926712 4796517 4492941
14082 4492941 4896734 4708933 4423184 4267714 4628695 4622890 4412296 4161113 4474907 4302488
14072 4302488 3841427 3834591 4073097 4134278 3786705 4386227 3729152 3838345 3769653 3969558
14062 3969558 3942278 3492747 3674501 3784164 4055440 3582875 4074830 3562372 3691023 3265133
14052 3265133 3815602 3569047 3626956 3754476 3064417 3255073 3146076 3321713 3237047 3063728
14042 3063728 2681866 3245664 3144382 2893378 2925526 2939334 2669471 3031618 2959495 3003847
14032C003847N9516l06385J29202o4201J45823k59488L49127m26605k23964J60646
14022B567518Q4339j34782j46120m4709j97972L68364Q1731k94999m9178N4150
14012B288342J78448m06184L56610j2614k71248L2474j3117j46103P4628N0503
14002B131739J26196k1129k98127J56114o979j78601K9640O0126j48968J64981
13992B014992J83517j82829J09387J160887K139866P904729J8412394J0595017
13984D2337960j5296315j1751897o404070k864625j258139o89251q80798K90539
13976C483404o93656n1695q26j6602o22485K02994L73747p8162m19036J64200
13966B341883l5421o29812M12451q9608K0604j67211J93841k88900N82878m56510
$$ plain form
14032 3003847 3063363 2756978 2886180 2821979 2967802 2708314 3057441 2630836 2406872 2567518
14022 2567518 2651857 2517075 2370955 2326246 2128274 2496638 2578369 2283370 2234192 2288342
14012 2288342 2466790 2060606 2417216 2404602 2133354 2165828 2152711 2006608 2081236 2131739
14002 2131739 2257935 2236806 1938679 2094793 2087814 1909213 1938853 1998979 1850011 2014992
13992 2014992 2198509 2015680 2125067 3285954 5425820 13330549 31742943 42337960
13984 42337960 27041645 15289748 8885678 6021053 4762914 4073663 3192865 3483404
13976 3483404 2789748 2738053 2737227 2720625 2098140 2301134 2674881 2596719 2177683 2341883
13966 2341883 2306462 1676650 2089101 1999493 2020097 1852886 2046727 1757827 2340705 1884195
13956A884195K53388o375L7977k30136j0664M8056l15997M08274m67996N6376
13946A657098K59672l03403K26116j3976m5336M9928j96161J90776j84789j94449
13936A445476K06602m28237J80717j7116R8312L8151Q7032j81655J96221J74757
13926A800260k63130l18517m9580M47406k62515K29943l17379K44599q7903j51690
13916A271494Q9620R9906J62566k33664J39507j51942K6948q2214l44149M14068
13906A392140k133k60941K35352K3308k72830K46120j49573L19674j30880M8916
13896A449153q4557k6692j14142k29690K10645k66027P2882K70579n1438j83341
13886A047372J32764l01342K60304k0145j44647J50437J72885j21101j79721K97260
$$ plain form
13956 1884195 2137583 2131208 2169185 1939049 1928385 1976441 1660444 2068718 1600722 1657098
13946 1657098 1916770 1613367 1839483 1825507 1780171 1830099 1633938 1824714 1639925 1445476
13936 1445476 1652078 1223841 1404558 1387442 1485754 1523905 1610937 1429282 1625503 1800260
13926 1800260 1537130 1218613 1169033 1616439 1353924 1583867 1266488 1511087 1423184 1271494
13916 1271494 1361114 1461020 1623586 1389922 1529429 1377487 1404435 1322221 978072 1392140
13906 1392140 1390007 1129066 1364418 1387726 1114896 1361016 1211443 1531117 1400237 1449153
13896 1449153 1364596 1337904 1223762 994072 1204717 938690 1011572 1282151 1230713 1047372
13886 1047372 1180136 878794 1139098 1118953 974306 1124743 1297628 1176527 996806 1294066
13876A294066j62811k24963K00434k25797K64292m6692Q0976o0197k67759r2390
13866G59159L94399j79547j7521j5243L6745J027K5654j68567j11115K97907j04207
13855I18691R8110K03884k02948J48864n1206j44547m2359K09674j53084L8857
13845A023936K621j9190M8700q8460J09870m5983j72369j05849L93358m38368
13835G08266N7719J57974N5121K09979n25295R9213L19052n25899M86816j05284
13825I37662k16329K3972K96930J13437J53512m47806l1303K57272m71161J10736
13815G26922K33993n038K90395l82944j12852m6882K75514j41513l4618j71993
13805F30984N20732D74211M50618r9916j36635m9302n9525J97152k38427K47734
$$ plain form
13876 1294066 1131255 906292 1106726 880929 1145221 1098529 1179505 1119308 851549 759159
13866 759159 1153558 974011 956490 941247 977992 979019 1004673 836106 724991 1022898 918691
13855 918691 1016801 1220685 1017737 1166601 1115395 970848 928489 1138163 985079 1023936
13845 1023936 1026557 1007367 1056067 967607 1077477 1031494 859125 753276 1146634 708266
13835 708266 765985 923959 979080 1189059 663764 762977 1082029 556130 1042946 937662
13825 937662 721333 745305 1042235 1155672 1309184 861378 830075 1087347 616186 726922
13815 726922 960915 955877 1246272 863328 750476 703594 979108 837595 802977 630984
13805 630984 1151716 474211 924829 824913 688278 638976 579451 776603 538176 785910
13795G85910J87711l55187j8608J92824J25434k72993O8045J02151k13587n6804
13785E44896J72637r2791J47022K05230k21318R5889P3629l89869M4759J01326
13775F81410m7393k45625L60288j91149K97126j23777q8590P6504J93763m0521
13765H72036j49803k98876J92896J76483n0691k94707L84303k12852L76120m81679
13755E13230J19672K92888l59999j9103L4648k58577M75636j75867O7440L537
13745F93505l34689J32427m7802L02803j40607J03164p6807N5656k68632K09424
13735F28442q7624j13106j43857J8059K35781L27373C85086L16050j87991j89237
13725C23908L52184k22262J09293P5185k39460j33649N33604j30834k37691k4715
$$ plain form
13795 785910 973621 618434 599826 792650 918084 645091 713136 815287 601700 544896
13785 544896 717533 624742 771764 976994 755676 851565 925194 535325 580084 681410
13775 681410 634017 388392 748680 557531 854657 730880 642290 718794 912557 872036
13765 872036 722233 423357 616253 792736 742045 447338 831641 618789 994909 513230
13755 513230 632902 925790 565791 546688 581336 322759 798395 622528 689968 693505
13745 693505 358816 491243 443441 746244 605637 708801 631994 687650 419018 628442
13735 628442 540818 427712 283855 301914 537695 865068 385086 701136 513145 323908
13725 323908 676092 453830 563123 638308 398848 265199 798803 667969 430278 405563
13715D05563K45263J17724k96100K3180j31910J52219o8743K321J09081J30893
13705F89491B70590J90006A28023N03706A65885M24882R5860O7048k25790q1623
13695D46262j50052K90141B80657J37665a9022C58944L70383j34686E3784M69381
13685E23165j89366L06272l11679J33984l3993j58409R4524k9679J38761K87474
13675G61054k45036k5337j98930K16908q8215B01064K3J73689r9363Q1958m9660
13664C07711L77199l15869J85893k00249j5985L53831k81612M43485B10756o6896
13654A43860N34769k50385R6418k30010m4074J51977J13748B48068L7741j01838
13644A83971M5081K62909j94923L09157B31066K62959p6011L09630j78757B26244
$$ plain form
13715 405563 650826 768550 472450 495630 363720 515939 447196 449517 558598 689491
13705 689491 270590 460596 128023 631729 165885 590767 686627 753675 527885 446262
13695 446262 296210 586351 280657 418322 -19022 358944 729327 594641 53784 523165
13685 523165 333799 640071 328392 462376 428383 269974 364498 334819 473580 761054
13675 761054 516018 490681 291751 508659 420444 201064 201087 374776 275413 357371 307711
13664 307711 684910 369041 554934 354685 338700 692531 410919 854404 210756 143860
13654 143860 678629 428244 524662 294652 250578 402555 516303 248068 285809 183971
13644 183971 229052 491961 297038 606195 231066 494025 418014 727644 548887 226244
13633D80511j5070j95519j11549n5228J93528N7032N3737J10686L6594k67702
13623B87020j08719O7141n2640J10228R311m7676J93704j88315f8424B34457J88898
13612D23355J42573K415n6593B33631k1314K11179j6967q2186H9079K01873G1407
13600B78681F8476L06355N4098N4855A60352L72455M7954j2394q9959j84154q6671
13589B07583P8499Q4033b6025D07046l4651p6776A47563L81161k43452O9415j33701
13578B20986J49666H6700K91002j68699L25466j05130A88043M2854J60660A90584
13567B96087J94709A16215D7888N09859A25326j6183B8417L66768A71630K75148
13557D46778k6531K59594C25685A00972L40275k4503A17956O96L0322M97677A07524
$$ plain form
13633 480511 465441 269922 158373 103145 296673 353705 407442 518128 554722 287020
13623 287020 178301 245442 192802 303030 312341 264665 458369 270054 -68424 234457 423355
13612 423355 565928 568343 511750 233631 212317 423496 406529 324343 89079 290952 71407
13600 278681 68476 374831 428929 483784 160352 532807 580761 568367 478408 294254 207583
13589 207583 286082 370115 -26025 407046 372395 295619 147563 528724 285272 354687 220986
13578 220986 370652 86700 377702 209003 534469 429339 188043 230897 391557 190584
13567 296087 490796 116215 47888 557747 125326 109143 28417 395185 171630 446778
13557 446778 420247 679841 325685 100972 441247 416744 117956 118652 148974 646651 107524
13545A06498O7885L81069g4888A42220K40122A86061K76429B05538K41022j30670
13535C15890K5889Q430J215O3757k7722l6484P8854a51832D42063E0534L63499
13524D14033C1610O2845L33077j81094K24903o473k00921A21781m0124J23746
13514B05403E1225M32328B02513P7941K84672k62053o4987o0186q0503K34688
13504C32085C9620K26746K11225a810B60489P3128I8493J44464M11891i0569A15892
13492B02722R0827C1002M78798l2587B15101N521j07562K82930A02894L31896
13482D34790A56575Q1248r7249J64191H570L61733j01900o3884p5138L56060M4563
13471E30004h9392D7720M68453c6936B03519J91490L9531j98806K3504m6373G3034
$$ plain form
13545 106498 174383 555452 -74888 142220 382342 186061 462490 205538 446560 315890
13535 315890 341779 350209 351424 415181 387459 350975 429829 -151832 442063 50534 414033
13524 414033 31610 94455 427532 246438 471341 464868 263947 121781 81657 205403
13514 205403 51225 483553 202513 280454 565126 303073 238086 177900 97397 332085
13504 332085 39620 266366 477591 -1810 260489 333617 98493 242957 654848 -90569 115892
13492 202722 293549 31002 509800 477213 215101 220622 113060 395990 102894 434790
13482 434790 156575 237823 140574 304765 8570 370303 268403 204519 129381 485441 530004
13471 530004 -89392 47720 516173 -36936 203519 395009 434540 235734 259238 212865 73034
13459H0656K23765h162C44488a46343A74711J32176N8552A3331L71677q6596A0261
13447A20986K87246p4334p5029i0620B39772l6058D8690d641H0713J86969A892
13435I8325L82738A78677k5619R1002j16176n6795O2014D6428K15125N6984P5289
13424C93826A92387J26524M18501E4242K13562p6815N0413F2961J36228J95518
13414C94707j45462A10362J08552n5706n5062K40209a8220B89983O2089n5647
13404B96425F6162K99075a02545B15161K08761A48388M9212R2888j18023l5824
13394A36641M64771B19013K73879F4126i0198A67092N6285J52423n1405m1622
13384B82773I1929j8955K35511J53476A38551L35832j27422m0227J419c7598m5329
$$ plain form
13459 80656 304421 -8162 344488 -146343 174711 306887 365439 13331 385008 298412 10261
13447 120986 408232 333898 258869 -90620 239772 203714 48690 -4641 80713 267682 1892
13435 98325 481063 178677 153058 244060 127884 71089 133103 46428 261553 318537 393826
13424 393826 192387 318911 737412 54242 267804 190989 241402 62961 199189 394707
13414 394707 249245 110362 218914 163208 108146 348355 -18220 289983 352072 296425
13404 296425 66162 365237 -102545 215161 423922 148388 197600 290488 172465 136641
13394 136641 601412 219013 492892 64126 -90198 167092 223377 375800 324395 282773
13384 282773 91929 72974 308485 461961 138551 474383 346961 306734 308153 -37598 -82927
13373h2927d0299p582B82910J78242j81242k414J03181C4088J87691j02712E0093
13361C55565A35848C5613K80334H6277K73429l6910A47107d02465A12331K19650
13351C31981p0192Q2353D0266a15881D59843A76766n7257J60316o8681a73465
13340C10205l9805L2412o6953J92745B12000m1717l7138B9271K01304C9374J77912
13329B17286H9634e280C01128A46518J22297j02125D0698b28894C55118n3283
13319C01835G3133K76094A39458J06192A18351a1518k5730A95230L42475A33432
13308a60175A62543J26173A11023l0342i8132I7089L00322A17605K18335G0729
13297A99490K57958B11625o4173A8146L24484A06641J94290K0009a19633A92649
$$ plain form
13373 -82927 -40299 -47881 282910 461152 279910 277496 380677 34088 221779 119067 50093
13361 355565 135848 35613 315947 86277 359706 322796 147107 -402465 112331 331981
13351 331981 261789 344142 40266 -115881 459843 176766 119509 279825 211144 -173465
13340 310205 270400 302812 235859 428604 212000 170283 133145 29271 230575 39374 217286
13329 217286 89634 -5280 301128 146518 268815 166690 40698 -228894 355118 301835
13319 301835 73133 349227 139458 245650 118351 -11518 -37248 195230 537705 133432
13308 -160175 162543 288716 111023 80681 -98132 97089 397411 117605 335940 70729
13297 199490 457448 211625 147452 18146 342630 106641 300931 320940 -119633 192649
13286B90999A16558J350J39460o2656J43724q5896c185A3250L15368k7981j22510
13275A78127N5324o6558k3043C1665e0551A45824Q7567a30162e2198B76704D5434
13263A78930m3548J64250C1095J27662J11530a42232A30935h2051A48045J42674
13253B90719r8187J37470A26217K9995J54655n2108B474J05138K7977L0837m6816
13242A19610K17244c30547B74382A33223L2388n3199J61836E8879K13297q0645
13232A91531F8415a05614A17060J56447A11305C3236a31156j79843a1343C8184
13221C28429a63542G6194a3950k19691F2125h0598j73178e790n0190k59908a36376
13209I4565K3694a76428B63616H311J64297J60064N181D1593J14169F6995P0300
$$ plain form
13286 290999 116558 117908 257368 194712 338436 252540 -3185 13250 328618 300637 178127
13275 178127 233451 166893 143850 31665 -50551 145824 233391 -130162 -52198 276704 45434
13263 178930 135382 299632 31095 158757 270287 -142232 130935 -82051 148045 290719
13253 290719 192532 330002 126217 156212 310867 258759 2474 107612 135589 166426 119610
13242 119610 336854 -330547 274382 133223 165611 112412 274248 58879 272176 191531
13232 191531 68415 -105614 117060 273507 111305 33236 -131156 -310999 -11343 38184
13221 328429 -163542 76194 -13950 -233641 62125 -80598 -253776 -5790 -55980 -315888 -136376
13209 94565 118259 -176428 263616 8311 172608 332672 337853 41593 155762 66995 137295
13198A37295j4260J5446I542M8115J92123N9952a48631A87651m087A9431a85469
13186a18848A13507m1324K10070E6354J47821h6793A04223a7069B12181n6115
13176A56066E349J2645b03187C5861G030K48L48855N9469f273A17438J60380c827
13163e0590j67078J05904A23431N2121G0577J94655L4912b87997B69895b40136
13152e2406C87618b0400k08523f8005B61620a17570M5912k5663A26215N7978a73491
13140A86848J40936B2272J03606a002E5404P2869K55917a57220O9170a1552B42479
13128i8717B85785h8637J8483k36904A68870a80407D56644A10300J06322M4078
13118B60700P1998i9381A10154g22A5963M39227G9495f4710D24722d5192B47558
$$ plain form
13198 137295 123035 138481 9542 57657 249780 309732 -148631 187651 183564 19431 -185469
13186 -118848 113507 72183 282253 56354 204175 -86793 104223 -17069 212181 156066
13176 156066 5349 17994 -203187 35861 7030 7278 356133 415602 -6273 117438 277818 -3827
13163 -50590 -217668 -111764 123431 175552 70577 265232 300144 -287997 269895 -240136
13152 -52406 387618 -20400 -228923 -68005 261620 -117570 -71658 -97321 126215 184193 -173491
13140 186848 327784 22272 125878 -1002 55404 128273 384190 -157220 -88050 -11552 242479
13128 -98717 285785 -88637 -70154 -307058 168870 -180407 456644 110300 216622 260700
13118 260700 332698 -99381 110154 -722 15963 455190 79495 -64710 424722 -45192 247558
13106B3916C593R7458J05700b18595A55861a87175A68828P4785L11202A39169
13095A77321c7028A84989p5602b1340B51115F4533j7568e4364K6512C6441a86755
13083D15463A11229f2110B84908C2371L28426f1323A05321D2792K34025J22210
13073C99027a9899p3850k10362F0604J88487d0761A46630N7684b03401B35713
13062G1980M8116A580J24551K12814a04682L2442A83194E3607c01779a09216A02862
13050C62027b06172A85386a56621g3441C6295N3919J78615a46033B13628f1122
13039A09283Q5123I4268P3831h1383H9281J44889K53223A35755D5162J30586J58685
13028C34433A64472a37745F9766B12h1324A52915F8510J09094C0199L5320L15312
$$ plain form
13106 23916 3593 101051 206751 -218595 155861 -187175 168828 243613 554815 139169
13095 177321 -37028 184989 109387 -21340 251115 64533 46965 -54364 -27852 36441 -186755
13083 415463 111229 -62110 284908 32371 360797 -61323 105321 42792 276817 399027
13073 399027 -19899 -93749 -304111 60604 249091 -40761 146630 204314 -203401 235713
13062 71980 120096 1580 126131 338945 -104682 -72240 183194 53607 -301779 -109216 102862
13050 362027 -206172 185386 -156621 -73441 36295 90214 268829 -146033 213628 -61122
13039 109283 194406 94268 168099 -81383 89281 234170 487393 135755 45162 175748 334433
13028 334433 164472 -137745 69766 212 -81324 152915 68510 177604 30199 65519 380831
13017C80831A82361E6431J82628R2884G1904B9746N50434A46581m2286b33876
13006A87766H2547J08098J67818j18077K7694q7207K03284f3996B92697q3735
12996B08962J89908A40936J28878B0561Q9589P1005b4530j30050B04849a77736
12985C44380d9689C19606p5974c11206c1303D1011C786K05971F7597J20869k8180
12974A60286c1741A687i8446D5210j4565J34375b33937b4044A53817l8385J49762
12963B65194h2976A5950N16168B21843G929J20722J28348B6101e7426G3222J12043
12952A85265b0003m75383d1704j21898m760A68822J15372j11760d8945F6815a95005
12940E361L3980c79941A12219a34031r0810h4794p2972B64675b02190H742M7559
$$ plain form
13017 380831 182361 56431 239059 331943 71904 29746 580180 146581 104295 -233876
13006 187766 82547 190645 358463 240386 268080 180873 384157 -63996 292697 208962
12996 208962 398870 140936 269814 20561 110150 181155 -24530 -154580 204849 -177736
12985 344380 -49689 319606 243632 -311206 -31303 41011 3786 209757 67597 188466 160286
12974 160286 -31741 1687 -98446 45210 30645 165020 -233937 -24044 153817 115432 265194
12963 265194 -82976 15950 532118 221843 7929 128651 256999 26101 -57426 73222 185265
12952 185265 -20003 -495386 -41704 -163602 -168362 168822 284194 172434 -48945 66815 -195005
12940 5361 39341 -379941 112219 -134031 -224841 -84794 -157766 264675 -202190 8742 56301
12929E6301Q8659D9127d53400B93e0604A94121a47077J1878B55117A20899a05272
12917b37005B11468B2543L7376b90327E9569g21j21681D39133A07130a42757f2463
12905H969K7431K54069b00030B00638j00290a39636A01632K35811A42049a50587
12894a49828B25547g9533k7963M8023q3597K4927E1605h4522C91341b2272A48457
12882C46075e2675C1368J81233E6314N2639i6357E9819b00494C952b23926L8349
12871a85577c6389J6779D3602e7541K5738o1610C76873L2745G5947N8900O7117
12860B01964a38910N5488k3238j78816J6283C22763b0860B82694K27258a54758
12849D2395e2620l9798I7114b06951I1732K9204K58573A73014n1792f9374A15842
$$ plain form
12929 56301 144960 49127 -453400 293 -50604 194121 -147077 -135199 255117 120899 -105272
12917 -237005 211468 22543 59919 -290327 59569 -721 -122402 439133 107130 -142757 -62463
12905 8969 36400 290469 -200030 200638 100348 -139636 101632 337443 142049 -150587
12894 -149828 225547 -79533 -107496 -59473 -143070 -118143 51605 -84522 391341 -22272 148457
12882 346075 -52675 31368 212601 56314 108953 -96357 59819 -200494 3952 -223926 -185577
12871 -185577 -36389 -19610 43602 -57541 -31803 -93413 376873 409618 75947 134847 201964
12860 201964 -138910 -83422 -106660 -285476 -269193 322763 -20860 282694 509952 -154758
12849 42395 -52620 -92418 97114 -206951 91732 120936 379509 173014 121222 -69374 115842
12837a34535C03973j7164q1028L2380k0015P3823b54930i5363J7414j08589A61046
12825H2306O5499J6281G6830e4196C5253e0236A19880J67851j33467J04407e0027
12813B95522B5274O1742L39977a94357Q4851G8172l7815e045G1826k1458d6844
12801i7279m8k16034C15549d9443B81960a92596P5039F0307b68995A01982l8855
12790F3127a52275A63849G266J72163f9439k45619K0074g1258G2117J92596g0592
12778c4890j75139B12476I1680O8475F5158A3078L1184J84624j3986J47892a40403
12766B69366J05796j53399D8109c0031A88644r0234r81A0190c868A98806p4243
12755A24563J07804o7642m035E7258R9684c2318D6903K12012p5685Q3534j489
$$ plain form
12837 -134535 303973 286809 205781 238161 218146 291969 -254930 -95363 -77949 -186538 161046
12825 82306 147805 164086 76830 -54196 35253 -50236 119880 287731 154264 258671 -50027
12813 295522 25274 87016 426993 -194357 -109506 78172 40357 -5045 71826 50368 -46844
12801 -97279 -97327 -313361 315549 -49443 281960 -192596 -117557 60307 -268995 101982 63127
12790 63127 -152275 163849 7266 179429 -69439 -315058 -294984 -71258 72117 264713 -70592
12778 -34890 -210029 212476 91680 160155 65158 13078 44262 228886 214900 362792 -140403
12766 269366 375162 221763 48109 -30031 188644 98410 97429 10190 -3868 198806 124563
12755 124563 232367 164725 160690 57258 156942 -32318 46903 258915 183230 266764 265275
12744B65275d3470n1147I3893j1283a05448L7297A20527l2552a2756C16102j39081
12733A77021B4751L2519b10592a2835k8657B3253A0555a82022B76286A06419L0098
12722A36517h1373G8622P0401F2686J22516q5593a06884A27038b48584C51670
12711f5797K0461A21721a41740C64467N3951E9923J55538j7263n7373j6720K21235
12700C45340D3344f0953B90663A8884a26670B27242a40359L4991A28832l722a41908
12688B82741b08764G555M704K419M04784D1370j2011K14490L11508H5924a74900
12676b65539C41192P2485A1412a33357A25760J74140A4894J48839m8198b6465
12665a05796A34581P5980l0519A7066J27082J12447b52058I4902C0463J02103
$$ plain form
12744 265275 -43470 -94617 93893 82610 -105448 -68151 120527 87975 -12756 316102 177021
12733 177021 24751 57270 -210592 -12835 -41492 23253 10555 -182022 276286 106419 136517
12722 136517 -81373 78622 149023 62686 185202 99609 -106884 127038 -248584 351670
12711 -65797 -45336 121721 -141740 364467 418418 59923 215461 198198 140825 124105 345340
12700 345340 43344 -60953 290663 18884 -126670 227242 -140359 -105368 128832 125110 -141908
12688 282741 -208764 7555 12259 14678 419462 41370 29359 243849 555357 85924 -174900
12676 -265539 341192 413677 11412 -133357 125760 299900 14894 163733 115535 -26465
12665 -105796 134581 210561 180042 17066 144148 256595 -252058 94902 30463 132566
12655A32566n3051a25806C70453d735A25102h8555A75846B050F01L9043L08547
12644C48191F9290A455P5254A9650K01007A02195D2246N6593l1997J56464a43197
12632I5621d5943B62046A04164K66653j11302A8871J58329c8438F1347P6245P8456
12621B16048K75607B23379A8210J34599a15959C0347b05346B24308d4226B244
12610A25674J90630D716J42812l5937M1510a74379D78646A23356a77425B84255
12599D24720A33552J91260J19495i474D5445M05925b07999A18695J05163j07128
12589A16730d9405F5520b52689B4393d8734d478A92258A582O9324g0684A46023
12577e2263A18775M6111a35764c7775j11918q5146A51754c68460a1709D312c18807
$$ plain form
12655 132566 79515 -125806 370453 -4735 125102 -88555 175846 2050 601 39644 348191
12644 348191 69290 1455 76709 19650 220657 102195 42246 98839 66842 223306 -143197
12632 95621 -45943 262046 104164 370817 259515 18871 177200 -38438 61347 137592 216048
12621 216048 491655 223379 18210 152809 -115959 30347 -205346 224308 -44226 2244
12610 125674 316304 4716 147528 111591 153101 -174379 478646 123356 -177425 284255
12599 424720 133552 324812 444307 -9474 45445 451370 -207999 118695 223858 116730
12589 116730 -49405 65520 -252689 24393 -48734 -4478 192258 1582 70906 -70684 146023
12577 -52263 118775 164886 -135764 -37775 -149693 -234839 151754 -368460 -11709 4312 -318807
12565D4558g6480D14573A6013O5841e1014A00103e2821F9296a29706B02016k7871
12554A74145a73647F1461b23008G7673J87467k433A0431D514N497f3597o5345
12543a28942B88443f9121I800J54675D0913Q9462o1935g8586A17596a30303j79935
12532c10238B65640a92957A402N6843b09106A84037C2111i2105a6806p1298B2035
12520a80297O3426A43191K8406a56500C1620a49972K6482C2427b76961B04424
12509E4904c59491o542F3914f6551A01740k6482Q8496d02326B94675b30A00374
12497D88877B17792j04728c09032B41474A05642e5626A61372d10186c316D2112
12486B00051K31615j90091G9890h3915A06587a63525j58174c1839q6511A28387
$$ plain form
12565 44558 -76480 414573 16013 81854 -51014 100103 -52821 69296 -129706 202016 174145
12554 174145 -173647 61461 -223008 77673 265140 262707 10431 4514 10011 -63597 -128942
12543 -128942 288443 -69121 9800 164475 40913 130375 68440 -78586 117596 -130303 -310238
12532 -310238 265640 -192957 1402 58245 -209106 184037 32111 -92105 -16806 -88104 22035
12520 -180297 -116871 143191 171597 -156500 31620 -149972 -123490 32427 -276961 204424
12509 54904 -359491 -366033 63914 -66551 101740 75258 163754 -402326 294675 -230 100374
12497 488877 217792 113064 -309032 241474 105642 -55626 161372 -410186 -3316 42112
12486 200051 431666 241575 79890 -83915 106587 -163525 -321699 -31839 -118350 128387
12475D1070b13661A66619M3277r4666O6200f9556A45357G550f192j08045P541
12464a06696B07084n3800a07461j05073d336n4297j16350A08941J96109j45766
12454A59284F930L42577c5816k16336j3151A74686G8767c259G0415a14825a8915
12442A14452c69109A12014D8487e8235C91343a8124A41780k1894c27095f1920
12431B1991m741N2247K2943e4849a5930m23217b00194A88856f4355A47678J01333
12420B49011i3993J647A54537a26564G7966a56221F2684h9875K7715K6962k12354
12409b47552J9334A32267g5798b0801q25A109N0112P2685D3717a31595e3952A4054
12396b39413d6684j47378P5126j45878d3759B92425j32702O310c4782E8492b8235
$$ plain form
12475 41070 -213661 166619 209896 115230 181430 -69556 145357 7550 -6192 -114237 -106696
12464 -106696 207084 153284 -107461 -212534 -4336 -58633 -174983 108941 305050 159284
12454 159284 6930 349507 -35816 -252152 -265303 174686 78767 -3259 70415 -114825 -18915
12442 114452 -369109 112014 48487 -58235 391343 -18124 141780 119886 -327095 -61920
12431 21991 17250 69497 92440 -54849 -15930 -439147 -200194 188856 -64355 147678 249011
12420 249011 -93993 -92346 154537 -126564 77966 -156221 62684 -89875 -62160 -35198 -247552
12409 -247552 -228218 132267 -75798 -20801 -21626 1109 51221 123906 43717 -131595 -53952 14054
12396 -239413 -46684 -194062 -118936 -264814 -43759 292425 159723 166033 -34782 58492 -28235
12384c920p1143A03862K6452b74603A0808f4481A05180a28988r4778J05282F2968
12372B91812I8639d0651A25224E4586a63152P8002A86257g0036A81636o1561E119
12360i6455c755j48409E2536b89330G0854J47916B8583J44968D5531b96676B0152
12348b1906A25927A3023B384a56706D83133A23930A2165J08529J89856f2973H6037
12336a94414A07733L0428c29004D0651j1173a58857A45258l15b60908A7226g2707
12324b19628A81136Q1102F0182j3067C510R5755J30545h0944Q497J3374o960A75743
12311g6807n4816A57356m5817k7431a12964A55719A1284a99012d7353j30033B0377
12299E5993b85598J23249A17897P0086a22143j02164H5159d4689I7235a32359
$$ plain form
12384 -3920 -75063 103862 130314 -274603 10808 -64481 105180 -128988 -223766 -118484 62968
12372 291812 98639 -40651 125224 54586 -163152 -85150 186257 -70036 181636 120075 5119
12360 -96455 -3755 -152164 52536 -289330 70854 218770 28583 173551 45531 -296676 20152
12348 -21906 125927 13023 2384 -156706 483133 123930 12165 120694 310550 -62973 86037
12336 -194414 107733 138161 -329004 40651 29478 -158857 145258 144943 -260908 17226 -72707
12324 -219628 181136 262238 60182 47115 3510 99265 229810 -80944 -72447 -59073 -66033 175743
12311 -76807 -131623 157356 111539 84108 -112964 155719 11284 -199012 -47353 -177386 20377
12299 55993 -285598 -162349 117897 187983 -122143 -224307 85159 -44689 97235 -132359
12288f5538A1143a55274K2776B26864f3418j8348J4377B26568a09406n8570A94879
12276H8015g1100D8560a74011B34918M982G3809M988J48097J91103F8093J41666
12265B09759H2510r393M0662N1709o4682R3112p2430D4437P1116N2416H2259e1808
12252c51905D56363A30216J36550K67836b90812F0529K620B4104a95690g3950
12241C22864f8338A10257e6107B23880n2954i804A50048i1085D49501F5928J10624
12230A76552a76859A37579O9562p3147N06320H2673O5557k05L0267g2788B66309
12218C07490A23799J0848j4533J88961N8614f279A82738E0997e045C55852H7481
12206A56118p730J53873b3041j23622B08175C1597a49433C73024l8421L4299j2305
$$ plain form
12288 -65538 11143 -155274 -132498 226864 -63418 -81766 -67389 226568 -109406 -167976 194879
12276 88015 -71100 48560 -174011 234918 239900 73809 78797 226894 417997 68093 209759
12265 209759 82510 73117 113779 165488 100806 193918 121488 44437 115553 167969 82259 -51808
12252 -351905 456363 130216 266766 534602 -290812 60529 63149 24104 -195690 -73950
12241 322864 -68338 110257 -56107 223880 170926 -9804 150048 -91085 449501 65928 176552
12230 176552 -176859 137579 207141 133994 640314 82673 148230 148025 178292 -72788 266309
12218 307490 123799 134647 120114 309075 367689 -6279 182738 50997 -5045 355852 87481
12206 156118 148388 302261 -23041 -146663 208175 31597 -149433 373024 334603 368902 356597
12195C56597K13430A55889J0238N668J59861j26128E9712J01284f7258A46119
12184b04776A42520a20893k7170J9894A57914m0963b02813B83789j07125J627
12174A78291k683p53i4531c2193Q892C37989A09001J21823H6759K13365F5598
12162A7174a66164H0046i7546A32180f4236A21393c89270a19410h165A56366B0668
12150G5786J34887q8849P5623J01463C6965J33555a04460E3970b4365A61299N9033
12139B20332c54401B59656I0777f2104n4839j45394A24937J02782a30484F1371
12128F5181K06188a68009I527J96452l0246b1253p2703B22499c7597l8868B38290
12116B80511a601m9787D9727b7232C1745a63268e2173K1471A8188Q8235b23459
$$ plain form
12195 356597 570027 155889 166127 171795 331656 205528 59712 160996 -67258 146119
12184 -204776 142520 -120893 -148063 -128169 157914 116951 -202813 283789 176664 178291
12174 178291 175608 174855 -94531 -32193 -23301 337989 109001 230824 86759 300124 65598
12162 17174 -166164 80046 -97546 132180 -64236 121393 -389270 -119410 -8165 156366 20668
12150 75786 210673 121824 197447 298910 36965 170520 -104460 53970 -24365 161299 220332
12139 220332 -354401 259656 90777 -62104 -116943 -262337 124937 227719 -130484 61371
12128 65181 271369 -168009 9527 205979 175733 -21253 -93956 222499 -37597 -76465 238290
12116 280511 -1601 -51388 49727 -27232 31745 -163268 -52173 -30702 18188 106423 -223459
12104f0672j43269O7264D0061a45742c7797j69522M8866k25909B30047p0609b69574
12092d04844A23039d54068C6106J2791b11117B9455J72834e9949A80015b52527
12081e3108A04488c38604J32447e7569E7221J32486D3806a6218G9335K17115M85517
12070G81967Q77432p17250C69317A61892J40787e3128A14024C9707g322H8815
12059A45359N8888a73329B48478A18767a27035E3251J50694r4731J21631b14531
12048b7719E5058c27172e6752k28831R7642H8976a01414r0837L4675d1702j71817
12037b13519o037E9013b63514k0277A32452f9293j19635A59143b6604A52572a15894
12025a61802P83P9669j4739C07081D6143a07771H9042R7210J59907D0220L03002
$$ plain form
12104 -60672 -203941 -136677 40061 -145742 -37797 -207319 -158453 -384362 230047 159438 -269574
12092 -404844 123039 -454068 36106 48897 -211117 29455 202289 -59949 180015 -252527
12081 -53108 104488 -338604 -206157 -57569 57221 189707 43806 -16218 79335 296450 781967
12070 781967 1659399 942149 369317 161892 302679 -53128 114024 39707 -7322 88815
12059 145359 204247 -173329 248478 118767 -127035 53251 203945 109214 230845 -214531
12048 -27719 55058 -327172 -56752 -285583 -187941 88976 -101414 -192251 -157576 -41702 -213519
12037 -213519 -219556 59013 -263514 -283791 132452 -69293 -188928 159143 -26604 152572 -115894
12025 -161802 -161019 -81350 -96089 307081 46143 -107771 89042 186252 346159 40220 343222
12014C43222j34308b18942o0542g272j46027r5124B6401J96639k9184G5774N2889
12003A28663d4343A24023b13489A32348b31371J2788j45091A5141a10599M1394
11993f9205C896b01681D4849d582C782L11417b49176a11377j99774J40611O3854
11982a06686k75320B50789K02188a40488a4283C24948A539a46146e9631k89738
11972c49369A40478c01128A20611i7248j7500e3558A37337D9573J17684c01095
11961I559a12763N0205D9324J60254n6883a28646A84423p2654b88684j2704B65204
11949C0624J12312P1708Q969b86752M5733M4939R0527j15232g5606D18317A35090
11937A775J29573k28a28924k88808A27314b04931J4801C57314i6448j35189f3939
$$ plain form
12014 343222 208914 -218942 -279484 -7272 -153299 -248423 26401 223040 193856 75774 128663
12003 128663 -44343 124023 -213489 132348 -231371 -218583 -363674 15141 -110599 -69205
11993 -69205 3896 -201681 44849 -4582 3782 315199 -249176 -111377 -311151 -170540 -106686
11982 -106686 -382006 250789 452977 -140488 -14283 324948 1539 -146146 -59631 -349369
11972 -349369 140478 -301128 120611 -97248 -114748 -53558 137337 49573 167257 -301095
11961 9559 -112763 -62558 49324 209578 152695 -128646 184423 111769 -288684 -301388 265204
11949 30624 142936 214644 223613 -286752 -241019 -196080 -105553 -220785 -75606 418317 135090
11937 1775 131348 131120 -128924 -417732 127314 -204931 -190130 357314 -96448 -231637 -63939
11925d6760A6886L3981c8404B03191n8292h2882A15756h9557A05068P5111F9463
11913A15421E2127e8364A77636d6234l3568j18054C07707A21548l1982b8129n1359
11902g9488G0422b44753c3511F7895b16894N5138g6092E7636b05291g114j17300
11891a24414C16798j51352p7659c58318B68176o6128J06005a0757r8647d5891
11880a56222E0498J77199q7012c6525p6604A29162P8060d28966c0944I5091B5051
11868C8109L09717c0038a3054k45999i5818B9803b48624L6413f6714A50391c51139
11856A77762f09289c4725H1189A8096j31K29442a65555C1555c63722K9034D6201
11844b01458K8099B86264h0769k54571A05777C2403J06219b89457a38145e2073
$$ plain form
11925 -46760 16886 50867 -38404 203191 144899 -82882 115756 -89557 105068 180179 69463
11913 115421 52127 -58364 177636 -46234 -79802 -197856 307707 121548 89566 -28129 -79488
11902 -79488 70422 -244753 -33511 67895 -216894 -161756 -76092 57636 -205291 -7114 -124414
11891 -124414 316798 165446 87787 -358318 268176 202048 308053 -10757 -109404 -45891
11880 -156222 50498 227697 140685 -36525 -113129 129162 207222 -428966 -30944 95091 25051
11868 38109 347826 -30038 -13054 -259053 -95818 29803 -248624 -212211 -66714 150391 -351139
11856 177762 -609289 -34725 81189 18096 17965 247407 -165555 31555 -363722 -334688 46201
11844 -201458 -173359 286264 -80769 -335340 105777 32403 138622 -289457 -138145 -52073
11833b22959r9041a41915H1727l7395N0395f0506m0451o7204M073a5128C8470
11821d0577A9557J57732d31119a85072r4292M9387A19951b45271a2122A52272
11810D7056A7289b16836B67842j19107J42741a41918O1710F9117a81664N8813
11800a22851A69355a7940A573a37474M044E022K06436a88545D55948A2450c15084
11788E4833b03586r5707b7966j74387r4253A94743D0035c05110A07595g2379j07725
11777a80104o1844k05079a28383A25980a65997c1403I7591b1434l61939C6780
11766F5316L0924h085l7424B2422a09830A64668K07997B7051M0585c92171a43303
11754A1629d00971A50581b34017a07953C5442g8702B00786K1769G1653b13649
$$ plain form
11833 -222959 -322000 -141915 81727 44332 94727 -60506 -100957 -168161 -164088 -15128 38470
11821 -40577 19557 177289 -431119 -185072 -279364 -229977 119951 -245271 -12122 152272
11810 47056 17289 -216836 267842 148735 291476 -141918 -80208 69117 -181664 -122851
11800 -122851 169355 -17940 1573 -137474 -133430 5022 211458 -188545 455948 12450 -315084
11788 54833 -203586 -299293 -27966 -202353 -296606 194743 40035 -305110 107595 -72379 -180104
11777 -180104 -241948 -447027 -128383 125980 -165997 -31403 97591 -21434 -383373 36780
11766 65316 96240 -8085 -45509 22422 -109830 164668 372665 27051 67636 -392171 -143303
11754 11629 -400971 150581 -234017 -107953 35442 -78702 200786 222555 71653 -213649
11743b49139i1544l05183J92030A02403K05050f8687j32149A95523c7033A83821
11732a42483B96165p8109c57088C0282I483a4784j84043M8614A2252L08487B6811
11720c28933c41A66528D7201J04244d2007A09132K1195D8611M8990B6915P0711
11709I7626j4608b6315E4386e7767n4913A13283b12286b4167I8909A9737J06571
11698A26308l3091R9827A0487b79542A29975O1764h1961C7604J39954h662B05237
11686h968l6779G2886N1884B7408L82939A15102k6842K9923g1494k00998C41356
11674A3469b95804B34538F1841a6078F9293a66158A88904a21268e0602k604E712
11662B14705D9486a36337l2086A16473a9408A60864a21232d5543B0255b62301
$$ plain form
11743 -249139 -91544 -396727 -204697 102403 307453 -68687 -200836 195523 -37033 183821
11732 -142483 296165 218056 -357088 30282 9483 -14784 -198827 -150213 12252 320739 26811
11720 -328933 -341 166528 47201 151445 -42007 109132 130327 48611 97601 26915 97626
11709 97626 83018 -26315 54386 -57767 -112680 113283 -212286 -24167 98909 19737 126308
11698 126308 93217 193044 10487 -279542 129975 191739 -81961 37604 177558 -8662 205237
11686 -8968 -45747 72886 124770 27408 410347 115102 88260 118183 -71494 -272492 341356
11674 13469 -295804 234538 61841 -16078 69293 -166158 188904 -121268 -50602 -53206 5712
11662 214705 49486 -136337 -168423 116473 -19408 160864 -121232 -45543 20255 -262301
11651A05824B8574R1247a7438q880B14342h218l9513I5657c4318a3392k4704r331
11639d7427j6577A19955a94609N4680C15714A8677L4787J65814a69894n394A30515
11627a39802A15505J29650A12514K49763A9132J07270R426b4727m2026B95081
11616f2912K7699F5378J43974P4148j41610m9848J97L4538e2673G7748K02959
11605B80707a17867E6325K5364b78267J28795B41334I0732f1423E1764a1237C47739
11593A53696B812R5875b17114A01618a17168B35483L6487J18628h2086I6212m5087
11582E1125K30511i2721a9445j70972g5921A49348a18156H7274c009A97779J1665
11571B09444a16056b4499E03710F6173J12178J05619h6957A45697c4119E95399
$$ plain form
11651 105824 28574 119821 -17438 -26318 214342 -8218 -47731 95657 -34318 -13392 -38096 -47427
11639 -47427 -64004 119955 -194609 -139929 315714 18677 53464 219278 -169894 -175288 130515
11627 -139802 115505 245155 112514 362277 19132 126402 135828 -24727 -66753 295081
11616 -62912 -35213 65378 209352 283500 141890 92042 92239 126777 -52673 77748 280707
11605 280707 -117867 56325 81689 -278267 -149472 241334 90732 -61423 51764 -11237 347739
11593 153696 2812 98687 -217114 101618 -117168 235483 271970 390598 -82086 96212 51125
11582 51125 281636 -92721 -19445 -190417 -75921 149348 -118156 87274 -3009 197779 209444
11571 209444 -116056 -24499 503710 66173 178351 283970 -86957 145697 -34119 595399
11560B44694a56935a9934C407b6820q2956D09213F7094a28901l2596L0697e8725
11548A09771k4538K73139j53502j3240b3523D4454a44368j05972f380B21022B5250
11536A37418o3284J57092A11655C2867A4815e3087A12725Q3666b28671B40778
11525E2667N5312c2216D31029e2620A25203e2370j22337K3359C99109F3995N7248
11514A21243m5697a92187q0129a29108b3452B00184K2780E9757J48658F2127K64346
11503C26473b4751o1915I216L86863j62018b50526D59666a47980F187J57599p2339
11492I1447b42183e9185o7886B64941I422b9405B09894m5474d361F6490M2933
11481A09423J07564i9143a9125I3702K26000J20198I1686c73248E2505M05853
$$ plain form
11560 244694 -156935 -19934 3407 -26820 -109776 409213 67094 -128901 -161497 -130800 -58725
11548 109771 85233 358372 204870 191630 -23523 44454 -144368 -250340 -6380 221022 25250
11536 137418 74134 231226 111655 32867 14815 -53087 112725 196391 -228671 240778
11525 52667 107979 -32216 431029 -52620 125203 -52370 -174707 -151348 399109 63995 121243
11514 121243 75546 -192187 -272316 -129108 -23452 200184 222964 59757 208415 62127 326473
11503 326473 -24751 -86666 9216 396079 234061 -250526 459666 -147980 6187 163786 91447
11492 91447 -242183 -59185 -127071 264941 9422 -29405 209894 164420 -4361 66490 109423
11481 109423 216987 -99143 -19125 93702 319702 439900 91686 -373248 52505 458358
11471D58358b1755C8357J9017j9312K782a38583f2200H338L3487N9125M042j7208
11459H7784D3635a63361A03316k5009J73826a12239E8994i7404A09456J58946
11449B68402E67Q6494b4960A03827l6863a56100C88467b51604A76655p3425b75171
11437B2297K63150a01688B47474o7763b56513E9508K07308J06759b45614h5668
11426A15598a88369c8935n0101J4754E3504J211g4631B47380A6493d2257C0554
11414c2556j8455C01443F3141M8888g940o2003A86380d6920B4297M25058c2537
11402A776L98392e1953A563d4048a5921H9864a57755D9361K9863j6503a29099
11390a76191A27074r262P388C2884K16208h440A02784J38953F1081b76109A70840
$$ plain form
11471 458358 -21755 38357 57374 38062 40844 -138583 -62200 8338 41825 100950 104992 87784
11459 87784 43635 -163361 103316 78307 252133 -112239 58994 -97404 109456 268402
11449 268402 567 87061 -24960 103827 66964 -156100 388467 -251604 176655 103230 -275171
11437 22297 285447 -101688 247474 179711 -256513 59508 266816 373575 -245614 -85668
11426 115598 -188369 -38935 -89036 -74282 53504 54715 -74631 247380 16493 -42257 30554
11414 -32556 -51011 301443 63141 112029 -7940 -69943 186380 -46920 24297 449355 -32537
11402 1776 400168 -51953 1563 -44048 -15921 89864 -157755 49361 79224 62721 -129099
11390 -176191 127074 117812 125200 32884 249092 -8440 102784 241737 61081 -276109 170840
11378h4784E7744e8792A3180J75202a0354m7799m47242C77221H0325N6613J2408
11367A49346j4920J658a2142r5412A20112b15906q4111J00077L6216A27995a20599
11355A70444H0934g9222j56113I4872a12289c8706j0662k04731i295B16017q3794
11344A32223a54426k1759C0764g486B20398i4804J6102A88267c95828D33017a62683
11332e2024q5790B0222L19077H1128k5468b6281B08725b03967A23194b8485j03479
11321a31964d9724o0186G4408J4250M0331K8283p5665J47116N5196a79373I9772
11309B15377B1718a63726g2827j11961I4501a29739H7273c06085b5917G4875b24832
11297C5596A5796a57850j9048N6786p2606B44055j05334i551q5975j14037a4140
$$ plain form
11378 -84784 57744 -58792 13180 188382 -10354 -58153 -505395 377221 80325 136938 149346
11367 149346 134426 136084 -12142 -107554 120112 -215906 -300017 -199940 -163724 127995 -120599
11355 170444 80934 -79222 -235335 94872 -112289 -38706 -49368 -254099 -9295 216017 132223
11344 132223 -154426 -176185 30764 -7486 220398 -94804 -78702 188267 -395828 433017 -162683
11332 -52024 -137814 20222 339299 81128 55660 -26281 208725 -203967 123194 -28485 -131964
11321 -131964 -49724 -109910 74408 88658 128989 157272 81607 228723 283919 -179373 99772
11309 215377 21718 -163726 -72827 -184788 94501 -129739 87273 -306085 -25917 74875 -224832
11297 35596 15796 -157850 -176898 -120112 -192718 244055 138721 -9551 -95526 -209563 -14140
11285b13051f7079J6936k03097E4589a75906B2152a59092R451b7374q3197E119
11273B3025q919b70439e9463A72945b16035d7151A95038Q4584j14558k202N2424
11262B15286b98065C87072A35710b85011B02493e1794a4248o5787A01155j7725
11252H3430h3065k58755A25712a23885A43269D5276a76125H2560d4784j41290
11242a86074p8246h5630l669j50429D75628f4537i367k97360a7177H5306g6026
11230A79256F4661a78194n0753A7895a15045k11949a23651N9177B4604d2697F9755
11218b2255k44388K4082Q9500j6832B55629a29727A44929K809a47455D9529A419
11206d984A78801c90925a18577j94151a2910C5315K4041J47732J48476g9398E5492
$$ plain form
11285 -213051 -67079 -50143 -253240 54589 -175906 22152 -159092 -149641 -27374 -110571 5119
11273 23025 14106 -270439 -59463 172945 -216035 -47151 195038 279622 165064 162862 215286
11262 215286 -298065 387072 135710 -285011 202493 -51794 -14248 -80035 101155 83430
11252 83430 -83065 -341820 125712 -123885 143269 45276 -176125 82560 -44784 -186074
11242 -186074 -264320 -85630 -89299 -239728 475628 -64537 -9367 -306727 -17177 85306 -76026
11230 179256 64661 -178194 -228947 17895 -115045 -326994 -123651 -64474 24604 -42697 69755
11218 -22255 -266643 -242561 -153061 -169893 255629 -129727 144929 147738 -147455 49529 1419
11206 -4984 178801 -390925 -118577 -312728 -12910 35315 59356 207088 355564 -79398 55492
11194a93743P5653j33643K7482D2338b54251a21058N8643l96070b16393G1284
11183A89459a04452l3960A16661a34701j2029E1870O5443c96852q3312a92227
11172c3703D7446d3388B60640b95840B54107b29307c2224E8743i3609d4150n2436
11161i6586M107B52708j08795n1189a70513N4025A73185G6885b7700l7531K4297
11150d0934B50820f6019I8501b9632j27407e5985B70733a31822N5366A4945N9400
11139G4345a95194I9208a23745B3947K22971a78562a1901p908H6328J67942a73757
11127c40540B1967J7706H205J01932C543L39658b33864B57787a04737B77566H5339
11115a89323A16979P4214c9928k8788A78560j8832p6917a03171C28191A4831a0681
$$ plain form
11194 -193743 -118090 -251733 -224251 42338 -254251 -121058 -62415 -458485 -216393 71284
11183 189459 -104452 -138412 116661 -134701 -146730 51870 117313 -396852 -480164 -192227
11172 -33703 47446 -43388 260640 -295840 254107 -229307 -32224 58743 -93609 -44150 -96586
11161 -96586 -92479 252708 143913 92724 -170513 -116488 173185 76885 -27700 -65231 -40934
11150 -40934 250820 -66019 98501 -29632 -157039 -55985 270733 -131822 -76456 14945 74345
11139 74345 -195194 99208 -123745 23947 246918 -178562 -11901 -19809 86328 254270 -173757
11127 -340540 21967 39673 8205 110137 3543 343201 -233864 257787 -104737 277566 85339
11115 -189323 116979 191193 -39928 -68716 178560 159728 82811 -103171 328191 14831 -10681
11103A80819J62652H0853l768K4620J09288N2390q6694j8669f5213A17872I313
11091A00351J49454l3844J61972j05124A05193e6551B32280a43820A41837P4825
11081B16662c7600R712E3683J77544J09691j47032q9833H946L86320n5330r7928
11070B42008m5749J96470A18511L02721k05285J17573K07811j56352K75095J20865
11060G80939C51019K83523l06240m4077K72964J1839L2516B18099N38829l48928
11050D08000K20844J68944m0851k6942J52207q8612k54987m5604P8169k85507
11040B85661J50555K03989k32837M90188D04225M98606k56699Q4137L9820B89273
11029H06638o7357k21623o1472L73634M6695k97379K05688k95618j7471K3424
$$ plain form
11103 180819 343471 80853 77085 101705 210993 263383 176689 158020 -65213 117872 9313
11091 100351 249805 215961 377933 272809 105193 -56551 232280 -143820 141837 216662
11081 216662 -37600 -27888 53683 231227 340918 193886 104053 8946 395266 339936 242008
11070 242008 196259 392729 118511 421232 215947 333520 541331 384979 660074 780939
11060 780939 351019 634542 328302 284225 557189 569028 601544 218099 756928 408000
11050 408000 628844 797788 756937 729995 882202 793590 538603 492999 571168 285661
11040 285661 436216 640205 407368 897556 404225 902831 646132 730269 770089 289273
11029 806638 739281 517658 456186 829820 876515 579136 784824 489206 471735 495159
11019D95159J2918j8731k2117p1710J63054J67286j71418j13066L12754l32879
11009D21250J46222j22032J03008j09732J50791n7290M930j43705P4814r3739
10999C74517N41458B87266N26623C70107L56575k65111L60129J11952q7279l82110
10989D64263L38384L0129p8243K44348L600j4849m2334J0732K27270j82080J21450
10978A122670J90067K43416J18002M22813R7509K05047J95484L8053j03802k2293
10968B506966J21531l10842n23176Q5400k79660k1547j11859j5243R6382p326
10958A540626k0633K47680P7696k44398j00445m09578K04749l85654k23582M9595
10948G36056l36589K29715B93884J89626j43553J13409j59312l3546C8527J444
$$ plain form
11019 495159 508077 489346 467229 395519 558573 725859 554441 441375 754129 421250
11009 421250 567472 445440 548448 438716 589507 532217 537147 393442 468256 374517
10999 374517 915975 287266 813889 370107 726682 461571 821700 933652 846373 464263
10989 464263 802647 832776 754533 998881 1002481 987632 945298 956030 1183300 1001220 1122670
10978 1122670 1312737 1556153 1674155 2096968 2194477 2399524 2595008 2633061 2529259 2506966
10968 2506966 2628497 2317655 1794479 1879879 1600219 1578672 1466813 1451570 1547952 1540626
10958 1540626 1519993 1767673 1845369 1600971 1500526 1090948 1295697 910043 686461 736056
10948 736056 399467 629182 293884 483510 339957 453366 294054 260508 38527 39971
10938C9971J93520J7199k8885R5420A31487k2336d7591B38340j04643l3480a2810
10926a33854B92988b6985j19346I5881b69169i9027m8747G9443H607J52378e0438
10914c87065a6932k92515A38222J8936g3921G0295h4583C8842M54900A71318b6153
10902D0265J4476f3561D3025N28068A22170b00041d7758r5046N1192c2765A05385
10890B27927H6463l149k1338K3831a47965E9011b6781G1188j907p717N8686c518
10877a96424b9107H5574b03038A25443a24832j65557e0303E64949h7074k05110
10867b92184g3284m3932A60553n6279b10442M6536A85770G4977J8947c4372r3762
10856a28134O1862o9089k3905e8320D1575J89994a59517A8094b53233E4797a7808
$$ plain form
10938 39971 233491 250690 221805 317225 131487 109151 -47591 238340 133697 100217 -12810
10926 -133854 292988 -26985 -146331 95881 -269169 -99027 -147774 79443 8607 160985 -50438
10914 -387065 -16932 -309447 138222 157158 -73921 70295 -84583 38842 493742 171318 -26153
10902 40265 54741 -63561 43025 571093 122170 -200041 -47758 -142804 -91612 -32765 105385
10890 227927 86463 83314 61976 85807 -147965 59011 -26781 71188 69281 61564 120250 -3518
10877 -196424 -29107 85574 -203038 125443 -124832 -290389 -50303 564949 -87074 -292184
10867 -292184 -73284 -117216 160553 104274 -210442 -163906 185770 74977 93924 -34372 -128134
10856 -128134 -66272 -135361 -159266 -58320 41575 231569 -159517 18094 -253233 54797 -17808
10844E7235k3177a46783a5455C00403K1376a37770j62113a16908A37691F7471
10833C29198g7037A84005b05512F4006K641i3820k02206i2724C8873c12829B77203
10821A9705J39106F078f5551o8599j94931G0398a07635d3115j3507C27801D2418
10809f5592A0310i7876F8534J46458H3676C0988b64583d0557j30383F4815l0630
10798C4185b63083a03482d5628G5394a5688k48060B25904L0043c24656a51005
10787b54576C09222e8883E4353Q136a27101G0037b15982A41719a30003F2851M0772
10776A03623k7008a09997A87596a78962b3698r1564B16160h7101o8772F7335c84921
10764A41717c21458f001I5235f4560C44584G9228a7938A28274M1451l5273a28745
$$ plain form
10844 57235 34058 -146783 -15455 300403 321779 -137770 -299883 -116908 137691 67471
10833 329198 -77037 184005 -205512 64006 66647 -93820 -296026 -92724 38873 -312829 277203
10821 19705 158811 6078 -65551 -134150 -329081 70398 -107635 -43115 -56622 327801 42418
10809 -65592 10310 -97876 68534 214992 83676 30988 -264583 -40557 -170940 64815 34185
10798 34185 -263083 -103482 -45628 75394 -15688 -263748 225904 255947 -324656 -151005
10787 -254576 309222 -58883 54353 62489 -127101 70037 -215982 141719 -130003 62851 103623
10776 103623 76615 -109997 187596 -178962 -23698 -115262 216160 -87101 -155873 67335 -384921
10764 141717 -321458 -6001 95235 -64560 344584 79228 -17938 128274 169725 134452 -128745
10752D239K55743q6181E6013b08561F520K74057a88527C68247f8721l4802n6980
10741a60503B05515G5503a4305C4112a01938j82067J01272j52632B22377i3727
10730A23414h1492j92822e4007G4201b37168J02353M2760j4147g232H9815a02858
10718A45723h1423j77283J24107G2261A5016a48457L8618b2766E8544K1450e6030
10706b61109J5096P505q1427E790h024k7705H1279a42078A0428Q7334d4836m8149
10694i2985M6439k7922A62915b27864A9962h9486G479c12748B1795J11657C6802
10682A08970g7713B02582a72189A33628a02245j9928B15109a4520j86568g0957
10671b59266m7125F8153K58482A38872a86686A94576a01812C17870a78313C7054
$$ plain form
10752 4239 259982 173801 56013 -208561 6520 280577 -188527 368247 -68721 -103523 -160503
10741 -160503 205515 75503 -14305 34112 -101938 -284005 -182733 -335365 222377 -93727
10730 123414 -81492 -274314 -54007 74201 -237168 -134815 -92055 -106202 -7232 89815 -102858
10718 145723 -81423 -258706 -134599 72261 15016 -148457 -109839 -22766 58544 79994 -56030
10706 -261109 -246013 -238508 -319935 5790 -8024 -35729 81279 -142078 10428 97762 -44836 -92985
10694 -92985 -46546 -74468 162915 -227864 19962 -89486 7479 -312748 21795 133452 36802
10682 108970 -77713 202582 -172189 133628 -102245 -122173 215109 -14520 -201088 -70957
10671 -259266 -306391 68153 326635 138872 -186686 194576 -101812 317870 -178313 37054
10660C35525l4082a3479n8991o1668c7312I9011b22968k7020H3631a96536A25631
10648i6025A00487K0457J40714b70602N7997l2106c7426A58768C5436a6724k08287
10637b25011e6756j80981a6673j57607H2195c5423m01389a41054d3312B49291
10626a40848o4868M8267A04802e2014j23212A6256i4649L7501B93344b35454N114
10615b30340O4419j86136J52915N2246L8503o9646B01893G5151d0899B2529c16856
10603i4600J43d5859l48920B30438g7093B09538j9025a50578E550d2485o4720
10592a07205j5978D8788L16989d0117G7900J65133l7311a66924C28174I0557b29853
10580D7066k441j623i948k36838G1646c3796p0840l1591l3129A18994a18603n4247
$$ plain form
10660 335525 301443 -13479 -72470 -134138 -37312 99011 -222968 -249988 83631 -196536 125631
10648 -96025 100487 120944 261658 -270602 -212605 -244711 -37426 158768 35436 -16724 -225011
10637 -225011 -56756 -237737 -16673 -174280 82195 -35423 -436812 -141054 -43312 249291
10626 -140848 -205716 -157449 104802 -52014 -175226 16256 -94649 -57148 293344 -235454 -230340
10615 -230340 -165921 -352057 -199142 -146896 -108393 -178039 201893 75151 -40899 22529 -316856
10603 -94600 -94457 -45859 -394779 230438 -77093 209538 190513 -150578 5550 -42485 -107205
10592 -107205 -123183 48788 365777 -40117 77900 243033 205722 -166924 328174 90557 -229853
10580 47066 44625 43002 -9948 -246786 71646 -33796 -104636 -136227 -169356 118994 -118603 -172850
10568a72850A77239h7480B48147I9057J30697c9406A01072A4738c2327k30313
10558b62640I261b9079l96496a01779j05704B22107f2086A49637a58895k66182
10548d25077d6838l39944a50783C6990a05206E9545B8287c32139E8749J25410
10538A84159n8885a42158r137B9482a23542b9295e803m2153l0807j32142A61891
10526b41228I8592J21326b49671g1466k62657I0817a07400j1587l7332A81703
10515e4483F5262K67924g6999A22019c6278k40618J07116E6341b81234J24260
10505a56974A26925g005H8570J49591b87792J23910e0541k39402f1992A35877
10494a0218m4314q3044k6376g1689j81534C49190A52836b1238A21605c8111H9415
$$ plain form
10568 -172850 177239 -87480 248147 99057 229754 -39406 101072 14738 -32327 -262640
10558 -262640 9261 -29079 -425575 -101779 -207483 222107 -62086 149637 -158895 -425077
10548 -425077 -46838 -386782 -150783 36990 -105206 59545 28287 -332139 58749 184159
10538 184159 125274 -142158 -151295 29482 -123542 -29295 -5803 -47956 -78763 -210905 161891
10526 -241228 98592 219918 -249671 -71466 -334123 90817 -107400 -118987 -156319 181703
10515 -54483 65262 333186 -76999 122019 -36278 -276896 -169780 56341 -281234 -156974
10505 -156974 126925 -7005 88570 238161 -287792 -163882 -50541 -289943 -61992 135877
10494 -10218 -54532 -137576 -163952 -71689 -253223 349190 152836 -21238 121605 -38111 89415
10482C18456k1666P5079o1025J90141B0791M50468I9023l0870P8173a6896k5864
10471d2760B47639c527p9725B0903b13969K7960A07118b78927C286a40847h932
10459i3533j27215k9466J10908N1235j05056f0055E0357a62292A13137l7746a12052
10447F9823c6433B2879b48774F1535m728L3812a7741I1345J04596C8636a10881
10435a36108A52175J01330C5905a83508j09524j4272b8746l17969a4731A13824
10424H9900O057b1496q6684A06742J37932d86243J94640g6066B88189I2723d30272
10412B47854l0950C701c64506d8494k06827a6551k18340M4452A17760a69861B04711
10400C1845a07700D22294H4220M8102Q1127L4423j10310C688J78542K22862A24823
$$ plain form
10482 318456 296790 371869 310844 500985 20791 471259 99023 68153 146326 -16896 -42760
10471 -42760 247639 -3527 -83252 20903 -213969 -186009 107118 -278927 3286 -140847 -8932
10459 -93533 -220748 -250214 -139306 -88071 -193127 -60055 50357 -162292 113137 75391 -112052
10447 69823 -36433 22879 -248774 61535 56807 90619 -17741 91345 195941 38636 -110881
10435 -136108 152175 253505 35905 -183508 -293032 -307304 -28746 -346715 -14731 113824
10424 89900 95957 -21496 -108180 106742 244674 -486243 -291603 -76066 288189 92723 -430272
10412 247854 216904 3701 -364506 -48494 -255321 -16551 -234891 -190439 117760 -169861 204711
10400 31845 -107700 422294 84220 132322 213449 247872 137562 3688 182230 405092 124823
10388F3086L67105b737k09912R176b607A6296K08444a00865D1604J81979b53835
10376B41630A8694M33593F2208K04751h1893A06758B6299J46176L03600k11417
10366B64658L59847k25253j57388E9290L18719j54124M3683A14232a47863c879
10355a3520B40668j14244K18139K06K44783B84969K65445j51876A93561D8372
10344A93394A0380M61781j41767j43055G2398J33561J482a1994B00994A890J76339
10333A78229J52363j64745p3508P1463C7639R1176m2482R6508N0847E3671L64456
10322D18127a10501G2989e5205H5435N0125J61573K34101A43502J48905K8599
10312C21006A693J41183R1491J0472g1138c4794r6309l22053C43285B8962l792
$$ plain form
10388 63086 430191 -2737 -212649 -203473 -2607 16296 224740 -100865 41604 223583 -253835
10376 241630 18694 452287 62208 266959 -81893 106758 26299 172475 476075 264658
10366 264658 624505 399252 241864 59290 378009 223885 267568 114232 -147863 -3879
10355 -13520 240668 126424 344563 344769 589552 284969 550414 398538 193561 48372
10344 193394 10380 472161 330394 187339 72398 205959 207441 -11994 200994 1890 178229
10333 178229 330592 165847 92339 163802 37639 128815 86333 182841 233688 53671 418127
10322 418127 -110501 72989 -55205 85435 135560 297133 531234 143502 292407 321006
10312 321006 1693 142876 234367 244839 -71138 -34794 -131103 -453156 343285 28962 25170
10301B5170J46193i6872m9261C9760J92212a52840D10615F1354K73035i7645A12197
10289A10929Q2389a57940a4200D5137K14772b56152I2179a04559a9978D33894
10278b63909B44318a644j33312A46437a64252A63072a54313b5603o6186F4773
10267C54P4848a98602B1708a11975B45845J25310G8823M1021P1100J20257O4203
10256C75404K3349K62857A49853F6093b22698f2522A18188A9946J11630i3835
10245G5143J44204k6734b83614B14502a20757K5412o978G3991b1953F0708a81083
10233b95628a32176l27018a10768d3941q8041A13886d65747B66634f10250b76584
10222B5341c5274o053a6855F8067c5809m6655C2425M2792b50949B49310p2848
$$ plain form
10301 25170 171363 -96872 -146133 39760 231972 -152840 410615 61354 334389 -97645 112197
10289 110929 193318 -157940 -14200 45137 259909 -256152 92179 -104559 -19978 433894
10278 -263909 244318 -1644 -134956 146437 -164252 163072 -154313 -25603 -91789 64773
10267 354 75202 -198602 21708 -111975 245845 371155 78823 119844 190944 311201 375404
10256 375404 398753 661610 149853 66093 -222698 -62522 118188 19946 131576 -93835
10245 75143 219347 192613 -283614 214502 -120757 -95345 -102323 73991 -21953 60708 -181083
10233 -295628 -132176 -459194 -110768 -43941 -131982 113886 -465747 266634 -610250 -276584
10222 25341 -35274 -41327 -16855 68067 -35809 -82464 32425 75217 -250949 249310 176462
10211A76462F696a01335m171j3693k46163B29465C7435b76523R0852n571n4502
10200b45744K4523j96642a40970B8003P6109e6524b5662j63614A48119l9347O51
10189A09423b9943k68548R4480F1219b28661G5381J68015a37159j13002m9380
10179b99541G2445l3137a86327A92820H2126a1772B0026b2340k45947b9366j16259
10168a45625A67617a60625q561P0216C5642g2195o8466k54769h5300p4704B41283
10156b41634a00762E7043i8808K507E8225a21296B1406a93703B1507a70812A2950
10144c8964A48943J2700a15476j10714e3152j5588q8275J964H1822e5585l02209
10133c57794c4580j73421l8345b8968k72267B7609J37242Q550b02226c6954C2959
$$ plain form
10211 176462 6696 -101335 -105506 -119199 -365362 229465 37435 -276523 -185671 -191242 -245744
10200 -245744 -221221 -417863 -140970 28003 104112 -56524 -25662 -189276 148119 108772 109423
10189 109423 -29943 -298491 -204011 61219 -228661 75381 243396 -137159 -250161 -299541
10179 -299541 72445 39308 -186327 192820 82126 -11772 20026 -22340 -268287 -29366 -145625
10168 -145625 167617 -160625 -169186 -98970 35642 -72195 -140661 -395430 -85300 -160004 241283
10156 -241634 -100762 57043 -98808 -96301 58225 -121296 21406 -193703 21507 -170812 12950
10144 -38964 148943 161643 -115476 -226190 -53152 -68740 -157015 -155051 81822 -55585 -357794
10133 -357794 -34580 -208001 -246346 -28968 -301235 27609 164851 173401 -202226 -36954 32959
10121a77219j01107a22863m7071D0831A8358b60601f6775b1813l29037J70162
10111a80688E7332g0666k76744A06226a46650j23604e172j3298k42329A35567
10100h4393e17m08441J97336E6299b95433H9676a32667K1352A27814M1639G9145
10088i2523p2194A05486a33282A16373a36654A89269b88268M073d7656n4758H5605
10076A56092a41724o9135A4654i8709I8808e2044E7189A1763P4646C5446e349
10064a2015J184A27418a62035A2016a07693C9232R638a92018a0823m7082n367
10053f3272B86648c2858l28681H593b28093R8522e11I615f8963F5824a52504a2693
10040c4817m187k86849c8939p9504b9610A31686a91881b6038p4055j53569j11897
$$ plain form
10121 -177219 -278326 -122863 -169934 40831 18358 -260601 -66775 -21813 -350850 -180688
10111 -180688 57332 -70666 -347410 106226 -146650 -270254 -5172 -18470 -260799 135567
10100 -84393 -517 -408958 -211622 56299 -295433 89676 -132667 -111315 127814 169453 79145
10088 -92523 -164717 105486 -133282 116373 -136654 189269 -288268 -284195 -47656 -102414 85605
10076 156092 -141724 -210859 14654 -98709 98808 -52044 57189 11763 86409 35446 -5349
10064 -12015 -10831 127418 -162035 12016 -107693 39232 48870 -192018 -10823 -57905 -63272
10053 -63272 286648 -32858 -361539 8593 -228093 -129571 -511 9615 -68963 65824 -152504 -12693
10040 -34817 -39004 -325853 -38939 -118443 -29610 131686 -191881 -26038 -100093 -253662 -365559
10029c65559d5968F9139K3794b6186C626b16094f6920j28538A26625A6613e2775
10017B67794A09679a00705M5910G7696B9393a63605d9383J4093F0563a20288a6770
10005d319p3113n7021R760c4523C7702J06099E2156b45604G2912a54708j00276
9994b54984R3515I5406D2207a70287f1107K7929A22726b02406A1800g8597A48967
9982A0612e467A29321a47495e0789k71351J22143m0050p7753J9892P6314A11453
9970c4729B81365c9464C4920g1772G7056c3915A54601J09431a7412k21870E1822
9958b37311B49476f7291o5769G4158e547k9016D0404C177e15837b34276C0101
9946c95554A10900a45658e4596K4051H7498R6514a75997A28859j861b08360h5622
$$ plain form
10029 -365559 -45968 69139 92933 -26186 3626 -216094 -66920 -195458 126625 16613 -52775
10017 267794 109679 -100705 -54795 77696 29393 -163605 -49383 -35290 60563 -120288 -16770
10005 -4319 -77432 -134453 -124693 -34523 37702 143801 52156 -245604 72912 -154708 -254984
9994 -254984 -161469 95406 42207 -170287 -61107 -33178 122726 -202406 11800 -78597 148967
9982 10612 -5467 129321 -147495 -50789 -322140 -199997 -240047 -317800 -297908 -221594 111453
9970 -34729 281365 -39464 34920 -71772 77056 -33915 154601 264032 -17412 -239282 51822
9958 -237311 249476 -67291 -133060 74158 -5547 -34563 40404 3177 -515837 -234276 30101
9946 -395554 110900 -145658 -54596 -30545 87498 184012 -175997 128859 126998 -208360 -85622
9934E3522i7650j82135a3022B47215C6698A4087c10350e8820k4280A21523a95894
9922b5155A9751J18244K296n6511c17205C31150A2735b47645A40220c03568d4425
9910f6161C3244b76129b2720k28035A41014e6043J4633A70621d6021n2803b3732
9898A71747a79601a7111q2196F1608J65573a78978k60154K04216R0741A99517
9887C05867a92041G6163c22673i4937j04381F3190a3430A76162b08520D0853b75635
9875a15581k254K862A262e79213f1172B8468L1469J22149H4948a72161d3533H885
9862d8767r971b5226j20128Q027p5484D2928d3736j88241h8896A91090d2709j90409
9850b33118f6295j4468K4645E7608L0601a51449p1293J4169A64984f9564p7802
$$ plain form
9934 53522 -97650 -279785 -13022 247215 36698 14087 -310350 -58820 -83100 121523 -195894
9922 -25155 19751 137995 140291 83780 -317205 331150 12735 -247645 140220 -303568 -44425
9910 -66161 33244 -276129 -22720 -250755 141014 -56043 -41410 170621 -46021 -98824 -23732
9898 171747 -179601 -17111 -99307 61608 227181 -178978 -439132 -234916 -144175 199517
9887 305867 -192041 76163 -322673 -94937 -199318 63190 -13430 176162 -208520 40853 -275635
9875 -115581 -117835 -114973 1262 -579213 -61172 28468 59937 182086 84948 -172161 -43533 8885
9862 -48767 -58738 -25226 -145354 -137327 -212811 42928 -43736 -231977 -88896 191090 -42709 -233118
9850 -233118 -66295 -80763 -56118 57608 88209 -151449 -222742 -208573 164984 -69564 -147366
9839a47366p2115c2747A28653c90949a14223F4810a5222k02959R7675B38034a61596
9827f4218J4225j416j3655l3362B17569o3962C4049a56204m3927R3638j22231
9816b28724j3404B86824B3693e0727j68237A85683a14963n1163r3868d4066n3217
9805i7283b8969j02662q6764K8623m8677E4778b06165A65162h5943D8122a67661
9793h1198d565k10258l16090A97456d2143H808L0706g3341A534P7029J2341a51623
9780d7461A9530N9925a63068f5884j20876a764j45036A23262c42591a50266p7247
9769b27513B51432A12218A3052c15949C2483b02229i3141j78333J13050K9232
9759a29192j17296O5545M3034k4514q4868K4483b3196D7572b70278A67420a48463
$$ plain form
9839 -147366 -219481 -32747 128653 -390949 -114223 64810 -15222 -218181 -120506 238034 -161596
9827 -64218 -49993 -51409 -65064 -98426 217569 153607 34049 -156204 -200131 -106493 -228724
9816 -228724 -242128 286824 23693 -50727 -218964 185683 -114963 -166126 -259994 -44066 -97283
9805 -97283 -28969 -131631 -218395 -189772 -238449 54778 -206165 165162 -85943 48122 -167661
9793 -81198 -4565 -214823 -530913 197456 -42143 8808 39514 -73341 1534 78563 90904 -151623
9780 -47461 19530 79455 -163068 -65884 -186760 -1764 -146800 123262 -342591 -150266 -227513
9769 -227513 251432 112218 13052 -315949 32483 -202229 -93141 -271474 -158424 -129192
9759 -129192 -246488 -180943 -137909 -162423 -247291 -222808 -23196 47572 -270278 167420 -148463
9747a17951A5264J24621a7015l8226a1940B60146E8969b10835h8893R85A10907
9735a5034C63128f2211k51210B8012a03670k1981k9461i598k40139M5714A74628
9723B68685r4048b52273m5391g0200r204H1255C1156K3060L57976B6433a63975
9711B042J01287b34401J06000k32584A72515e5499l1029a0707C2947Q9781a89649
9699c8372j46675j2250I2892A3940a30530F7430a616k07677j62491P8452J16041
9688a77291A31422a33951q7793D04396a48640C36426j15722a30218k94611A19848
9677B17696h2131k17846a25288j52501a17554j75177A90959a32981p2885J02495
9667a03371A48259n3623i5370A22912a9425H4365a85747A08358C6329a58742B6182
$$ plain form
9747 -117951 15264 139885 -17015 -55241 -11940 260146 58969 -210835 -88893 -87908 110907
9735 -15034 363128 -62211 -313421 28012 -103670 -125651 -155112 -9598 -249737 -204023 174628
9723 268685 174637 -252273 -297664 -70200 -79404 81255 31156 54216 412192 26433 -163975
9711 2042 103329 -234401 -128401 -360985 172515 -55499 -86528 -10707 32947 122728 -189649
9699 -38372 -185047 -197297 92892 13940 -130530 67430 -1616 -209293 -371784 -293332 -177291
9688 -177291 131422 -133951 -221744 404396 -148640 336426 220704 -130218 -424829 119848
9677 217696 -82131 -299977 -125288 -277789 -117554 -292731 190959 -132981 -205866 -103371
9667 -103371 148259 94636 -95370 122912 -19425 84365 -185747 108358 36329 -158742 26182
9655d5318n3140E0019c49468P9243J05991A2194b62651H563R6054f92m8309A0092
9642e8512j01600j5832B7617a4408p2555j36256p2772A7748a68851f4878p6614
9631a41492e4502G5216i5022K7016j4425a7110q2318m3788B15679a38428B2980
9619a83267D017b15956a3042j58882p1927e6574l31180J3624a19774k52432e5244
9607B57210b08801E6197N4797M8485o4786b67386A29052L5988i3421l79945a66294
9595a0205C10291G5921a87577g1461A3037J12365H039a91886h831A87888b35942
9583G0992h477B0450K9984e1964A71626b17340h9788j93817a1709A5857d01606
9571c20114J45936N4472H5774a205B62854c8559G6826a1163k34604J11541A40699
$$ plain form
9655 -45318 -98458 50019 -349468 -270225 -164234 12194 -262651 8563 104617 -692 -49001 10092
9642 -58512 -160112 -175944 27617 -14408 -86963 -223219 -295991 17748 -168851 -64878 -141492
9631 -141492 -54502 75216 -95022 -68006 -82431 -17110 -99428 -143216 215679 -138428 22980
9619 -183267 4017 -215956 -13042 -171924 -243851 -56574 -387754 -374130 -119774 -372206 -55244
9607 257210 -208801 56197 110994 159479 94693 -267386 129052 165040 -93421 -473366 -166294
9595 -10205 310291 75921 -187577 -71461 13037 125402 8039 -191886 -8831 187888 -235942
9583 70992 -8477 20450 50434 -51964 171626 -217340 -89788 -283605 -11709 15857 -401606
9571 -320114 -174178 -119706 85774 -1205 262854 -38559 76826 -11163 -245767 -134226 140699
9559F0364b06457B62664c10950k55167a22393j95175F8308i637o5328n5597j19098
9548b49660A63b10372h3312j40353i5074j02086j766A90768c03165B36648i4409
9536I4438l2290A5596J47223b31514A50875j956E491c992k80670i4390B00345
9524a90725C6313c74296L8737I2939a35398k804J8513A18226a85693o850q8787
9513b81330B23949F6366a42238c7934l79681e7646r649A11873K7820D9151e5494
9501g8821B54288A4443J3680c09231A97089G9814A5240b10611B22850E8948d7503
9489A7533h202k02617A63314c7144j12088g4328j87118B9707b68160C1493a61389
9477b97819R6238A7066a61220A0402a36770A87592E8798b79531J32206q1111A63971
$$ plain form
9559 60364 -206457 262664 -310950 -566117 -122393 -317568 68308 -9637 -74965 -130562 -249660
9548 -249660 163 -210372 -83312 -223665 -95074 -197160 -198926 190768 -303165 236648 -94409
9536 94438 62148 15596 162819 -231514 150875 148919 5491 -3992 -284662 -94390 200345
9524 -190725 36313 -374296 -335559 92939 -135398 -138202 -119689 118226 -185693 -192543 -281330
9513 -281330 223949 66366 -142238 -37934 -417615 -57646 -67295 111873 139693 49151 -55494
9501 -78821 254288 14443 28123 -309231 197089 79814 15240 -210611 222850 58948 -47503
9489 17533 -8202 -210819 163314 -37144 -149232 -74328 -261446 29707 -268160 31493 -161389
9477 -297819 -201581 17066 -161220 10402 -136770 187592 58798 -279531 -147325 -228436 163971
9465e4298j85172A85863a01339b4825B24234n8902E1479c32202A51414k0561g4505
9453b74028J05383A52799E6013M1005J01074e12940e2843k21424b2553m825j47429
9442a74807g2793A01729M39635A0715J39889b05242A09613m9361b14140N7640
9432a56500C6736c35640J47631e2850j3858m08103K16435c1754F9384J11734n732
9421A75386G4427a2665q8007j50252A10100B6354K38118a26665n7700e6799n18255
9410e75054A499C29b28009A53345G987b7774A41809g3137A375J11346K4627E0875
9397F4970a83040A7741b30116I7814d5762F3328c35789j3394M7919H78b06364
9385b70163A7010c61664a05313n10354A04981b46508a08557A01533K85055o3816
$$ plain form
9465 -54298 -239470 185863 -101339 -24825 224234 165332 51479 -332202 151414 130853 -74505
9453 -274028 -168645 152799 56013 97018 198092 -512940 -52843 -274267 -22553 -27378 -174807
9442 -174807 -72793 101729 541364 10715 150604 -205242 109613 60252 -214140 -156500
9432 -156500 36736 -335640 -188009 -52850 -66708 -474811 -258376 -31754 69384 181118 175386
9421 175386 74427 -12665 -100672 -250924 110100 26354 264472 -126665 -184365 -56799 -575054
9410 -575054 1499 329 -228009 153345 7987 -27774 141809 -73137 1375 112721 137348 50875
9397 64970 -183040 17741 -230116 97814 -45762 63328 -335789 -349183 -301264 878 -206364
9385 -270163 17010 -361664 -105313 -615667 104981 -246508 -108557 101533 386588 322772
9375C22772b32573o962A7890a06353A70833i6547D4655J22437a37374j9598K3611
9364a33361f5508l2895E5659c59488c1611B67456a33073E5764b48570l4414b9509
9352a65962m1478e7199D8237J15719b10196A2354J48675k8983a98764C4056L23925
9341C57981a46308F9360a26474B11097r8649B4516a60744i710E3376L2476i9267
9329i9530r5474A00262a95540d9556F1970N1953c2659A22745c85393e572j8824
9318b4396p6368K5896l11952a22690A7295i7665l9417A6860h5727A3413L1687
9307D5100M25578i5903b3792A16040i9985P189a8043k30883c8230A49467F7320
9295D460b0353I0700i0311l6624o0202E2680c3874A18647h2195A93876a01864
$$ plain form
9375 322772 -232573 -239535 17890 -106353 170833 -96547 44655 167092 -137374 -156972 -133361
9364 -133361 -65508 -98403 55659 -359488 -31611 267456 -133073 55764 -248570 -282984 -29509
9352 -165962 -207440 -57199 48237 163956 -210196 12354 161029 132046 -198764 34056 357981
9341 357981 -146308 69360 -126474 211097 112448 24516 -160744 -9710 53376 85852 -99267
9329 -99530 -195004 100262 -195540 -49556 61970 113923 -32659 122745 -385393 -5572 -24396
9318 -24396 -100764 -74868 -386820 -122690 17295 -97665 -137082 16860 -85727 13413 45100
9307 45100 470678 -95903 -23792 116040 -99985 -92796 -18043 -248926 -38230 149467 67320
9295 4460 -20353 90700 -90311 -126935 -187137 52680 -33874 118647 -82195 193876 -101864
9283I1100a87103A26391o1030I602b76671a3902j76521c6226H2513g3584c2613
9271a10997B50185d58785g5983j04590h1854B6891b59031A00466b3454j06762
9261a30216G7775M0242B1451a42958j56358b2938B61755b34171M741p6285g6724
9249I8266J9531b00018I2504K41334e4058r5146N4862p3455k79827B2406f7848
9237c48019r1972G5309a20947M3404B43087b2128o23380a14399J7201k3256A68543
9225d6425A827a17764g447j95828B2842b28262A31151a26850M5896k77339A31518
9213a93175C0148c1400A14236a337D0325a52536b1226G534c9438p8673l71516
9202d89627C39839b89066B64685G7369k6491J70775c08809B40431d4315H0888
$$ plain form
9283 91100 -187103 126391 65361 9602 -276671 -13902 -190423 -36226 82513 -73584 -32613
9271 -110997 250185 -458785 -75983 -180573 -81854 26891 -259031 100466 -23454 -130216
9261 -130216 77775 118017 21451 -142958 -299316 -22938 261755 -234171 -229430 -305715 -76724
9249 98266 117797 -200018 92504 333838 -54058 -149204 -94342 -167797 -447624 22406 -67848
9237 -348019 -439991 75309 -120947 -77543 243087 -22128 -645508 -114399 -97198 -120454 168543
9225 -46425 1827 -117764 -7447 -203275 22842 -228262 131151 -126850 -80954 -358293 131518
9213 -193175 30148 -31400 114236 -1337 40325 -152536 -21226 7534 -39438 -118111 -489627
9202 -489627 339839 -289066 264685 77369 50878 221653 -308809 240431 -44315 80888
9191a59290L855c9279A19828i968k29191d924j61204K1419D3957q395c13679a18177
9178c36969P2783A11469B2631a17285A17108C4270R1788a33019N3603B24090e4695
9166E6331a15037r4616f6175j78902d5543j72648A41572b29052C22591j22869
9156A99722b33722A49375f7914p0590c6409J0273r0501M1573a1164l13165J54312
9145a70017A35385h8381E41965h9377l51535A34458l2723B3243a91369C32535
9134D8172b08231n905M1012h2861H5036J0560c52159a46877o7397B12876n9048
9123A53828d10534J58997J00850a4638M791A02927i5487C12755E5331i0131B23467
9111b18832A35423K53620o6006c53317n3849N75A78445f7031p0113C8122J26716
$$ plain form
9191 -159290 -155435 -39279 119828 -9968 -239159 -4924 -166128 -144709 43957 35562 -313679 -118177
9178 -336969 -264186 111469 22631 -117285 117108 34270 126058 -133019 -79416 224090 -54695
9166 56331 -115037 -209653 -66175 -245077 -45543 -218191 141572 -229052 322591 199722
9156 199722 -233722 149375 -67914 -138504 -36409 -26136 -116637 -75064 -11164 -324329 -170017
9145 -170017 135385 -88381 541965 -89377 -440912 134458 101735 23243 -191369 332535
9134 48172 -208231 -214136 -173124 -82861 85036 95596 -352159 -146877 -214274 212876 153828
9123 153828 -410534 -251537 -150687 -14638 -9847 102927 -95487 312755 55331 -90131 223467
9111 -218832 135423 389043 323037 -353317 -407166 -406591 178445 -67031 -137144 38122 164838
9100A64838a19849J219A2319c543l10463A36811a43206A12829a23147A93977m1598
9089A52379c97097A67210d21158d9231j52393M2812K4741j18205L0938a4907A72382
9077a89827f8162A07000D576J15335b31736A48159B8539b65356R9549H7466L7319
9066A24785a4889j40391B6935d11185g7950q4545P7281p551k2945A27818a09867
9054a08917C4675M00862g7155B65172k3954a40270B05123a458n5194o3928L865
9043a16715N4846j01857j25922A8967R6528b56847A10488i9092j41419c2285r9759
9032a32044D1819a81322N0333A64605c21113A72567c02998A47423b77989C0118
9021b98882H9001c84896A15856R4607a34237N7530B99310c7952D14813b48781
$$ plain form
9100 164838 -119849 -118630 12319 -3543 -314006 136811 -143206 112829 -123147 193977 152379
9089 152379 -397097 167210 -421158 -49231 -201624 -158812 -134071 -252276 -221338 -14907 172382
9077 -189827 -68162 107000 4576 119911 -231736 148159 28539 -265356 -165807 87466 124785
9066 124785 -14889 -155280 26935 -411185 -77950 -162495 -85214 -92765 -115710 127818 -109867
9054 -108917 34675 435537 -77155 265172 241218 -140270 205123 -1458 -56652 -120580 -116715
9043 -116715 -61869 -163726 -289648 18967 115495 -256847 110488 -99092 -240511 -32285 -132044
9032 -132044 41819 -181322 -130989 164605 -321113 172567 -302998 147423 -277989 30118
9021 -298882 89001 -384896 115856 210463 -134237 -76707 299310 -37952 414813 -248781
9010g0966l04093C32743a43421A92872b6657j3200j29189m6899A32774K07775
9000C40549b69214a28520C26087e62226K24461a26431g760E76070a89849D6746
8989a83038j1530o2672C5032J79919j1893d3800q3674f3372m03038E25519h401
8977D2239c68847D6800c27250J22139A1036b44293A34831a47097B9993a8196A24915
8965c0760n7667j06063O5014I9664b32006k0021B61942b18896q6193a9581k97836
8954c17417B53978B7043c40826A92721F0066N1873d24268g5694b0896m41163a2740
8942A19342D2280a7174A11176p920O8072b106C47754j3734R9581a65105J2559
8931a52546k5054j78890A85776J43072m0319Q8636R7111K75700L217455O981607
$$ plain form
9010 -70966 -375059 332743 -143421 192872 -26657 -39857 -169046 -215945 132774 340549
9000 340549 -269214 -128520 326087 -562226 -337765 -126431 -7760 576070 -189849 46746
8989 -183038 -194568 -257240 35032 214951 203058 -43800 -127474 -63372 -466410 525519 -8401
8977 42239 -368847 46800 -327250 -205111 11036 -244293 134831 -147097 29993 -18196 124915
8965 -30760 -88427 -194490 -129476 99664 -232006 -252027 261942 -218896 -305089 -19581 -317417
8954 -317417 253978 27043 -340826 192721 60066 111939 -424268 -75694 -20896 -462059 -12740
8942 119342 42280 -17174 111176 103256 171328 -2106 347754 334020 433601 -165105 -152546
8931 -152546 -177600 -356490 185776 328848 288529 377165 474276 749976 3967431 10949038
8921A0949038p58462C825533A262429E61491Q3761B98075R2153A4870J0532J05901
8911A31303k2814J636A7092L94608A74890L477b03701n1215C2012K82105b34068
8899D2901f06573a28485k69430a62319k84125b14746D12291j15259b56981h2285
8888A90193o7053e16861a41820e5047k09920b017j10795j75257A13323K247J15265
8877B30835a33795E5580P367N4459O1071i6409I4262a22105a702k21223B97459
8865b53187b1704k28844e8081q5111j23777A41557B2246e6246l90316a33736D7538
$$ plain form
8921 10949038 10190576 3825533 1262429 561491 645252 298075 390228 14870 25402 131303
8911 131303 108489 110125 17092 411700 174890 178367 -203701 -254916 32012 314117 -234068
8899 42901 -606573 -128485 -397915 -162319 -446444 -214746 412291 297032 -256981 -82285
8888 190193 123140 -516861 -141820 -55047 -264967 -2017 -112812 -288069 113323 115570 230835
8877 230835 -133795 55580 62947 117406 178477 -96409 94262 -122105 -1702 -222925 297459
8865 -253187 -21704 -250548 -58081 -143192 -266969 141557 22246 -56246 -446562 -133736 47538
$$ [...]
##END NTUPLES=NMR SPECTRUM
##END=
