
##TITLE=AC1218_CiNAH12059_6667049_dl3JWW661S
##JCAMPDX= 6.0         $$ Bruker NMR JCAMP-DX V2.0
##DATA TYPE= NMR SPECTRUM
##DATA CLASS= NTUPLES
##ORIGIN= BRUKER
##OWNER= Administrator
$$ 1.72 TOPSPIN		Version 2.1
$$ 2012-08-14 11:52:47.968 -0500  Administrator@TOPSPIN
$$ Compression mode = diff/dup
##.OBSERVE FREQUENCY= 400.02188249412
##.OBSERVE NUCLEUS= ^1H
##.ACQUISITION MODE= SIMULTANEOUS (DQD)
##.ACQUISITION SCHEME= undefined
##.AVERAGES= 8
##.DIGITISER RES= 22
##SPECTROMETER/DATA SYSTEM= spect
##.PULSE SEQUENCE= zg30
##.SOLVENT NAME= COFFEE_meoh
##.SHIFT REFERENCE= INTERNAL, COFFEE_meoh, 1, 14.98509
##AUDIT TRAIL= $$ (NUMBER, WHEN, WHO, WHERE, PROCESS, VERSION, WHAT)
$$ ##TITLE= Audit trail, TOPSPIN		Version 2.1
$$ ##JCAMPDX= 5.01
$$ ##ORIGIN= Bruker BioSpin GmbH
$$ ##OWNER= Administrator
$$ $$ C:\Bruker\TOPSPIN/data/COFFEE/nmr/AC1218_CiNAH12059_6667049_dl3JWW661S/10/pdata/1/auditp.txt
$$ ##AUDIT TRAIL=  $$ (NUMBER, WHEN, WHO, WHERE, PROCESS, VERSION, WHAT)
(   1,<2012-08-14 11:52:40.156 -0500>,<Administrator>,<TOPSPIN>,<go>,<TOPSPIN 2.1>,
      <created by zg
	started at 2012-08-14 11:51:33.359 -0500,
	POWCHK enabled, PULCHK disabled,
       configuration hash MD5:
       6B 1B 68 BB D9 2E 58 E2 7F 35 AD 54 07 DF 0E 41
       data hash MD5: 64K
       C2 52 30 F8 F5 E7 35 77 DD E9 2E 41 11 B5 08 E8>)
(   2,<2012-08-14 11:52:43.671 -0500>,<Administrator>,<TOPSPIN>,<proc1d>,<TOPSPIN 2.1>,
      <Start of raw data processing
       efp LB = 0 FT_mod = 6 PKNL = 1 PHC0 = 0 PHC1 = 0 SI = 32K 
       data hash MD5: 32K
       13 54 D6 5A 7B 98 84 74 AF 6B 4F A4 1F 21 8A 8A>)
(   3,<2012-08-14 11:52:43.968 -0500>,<Administrator>,<TOPSPIN>,<proc1d>,<TOPSPIN 2.1>,
      <pk PHC0 = 182.3181 PHC1 = 0 
       data hash MD5: 32K
       AD 3A E0 5B D4 A7 52 08 5C 0F 4A 76 50 93 0D 36>)
(   4,<2012-08-14 11:52:44.187 -0500>,<Administrator>,<TOPSPIN>,<proc1d>,<TOPSPIN 2.1>,
      <abs ABSG = 1 
       data hash MD5: 32K
       FF 2B 00 32 F5 0C B0 2D D1 60 AE 6B A9 91 5E 2E>)
(   5,<2012-08-14 11:52:44.250 -0500>,<Administrator>,<TOPSPIN>,<proc1d>,<TOPSPIN 2.1>,
      <abs ABSG = 2 
       data hash MD5: 32K
       C1 34 78 A4 B6 85 C0 78 18 26 9A CD C6 23 49 66>)
(   6,<2012-08-14 11:52:44.281 -0500>,<Administrator>,<TOPSPIN>,<proc1d>,<TOPSPIN 2.1>,
      <abs ABSG = 3 
       data hash MD5: 32K
       20 6F DB 87 76 61 0E 87 09 DA 9F 2E A0 CA C3 83>)
(   7,<2012-08-14 11:52:44.312 -0500>,<Administrator>,<TOPSPIN>,<proc1d>,<TOPSPIN 2.1>,
      <abs ABSG = 4 
       data hash MD5: 32K
       75 B7 F2 28 DF 6F ED 56 59 4C 31 29 D7 46 41 4E>)
(   8,<2012-08-14 11:52:44.343 -0500>,<Administrator>,<TOPSPIN>,<proc1d>,<TOPSPIN 2.1>,
      <abs ABSG = 5 
       data hash MD5: 32K
       98 65 44 F8 5B B8 17 FA BE 17 65 AA 08 09 D8 DC>)
$$ ##END=
$$ 
$$ $$ hash MD5
$$ $$ FB BC 6F 61 DA 3B D7 7F D3 D9 36 DF C3 24 AE C8
##$RELAX= 
##$RELAX= 
##$RELAX= 
##$RELAX= 
##$RELAX= 
##$RELAX= 
##$RELAX= 
$$ Bruker specific parameters
$$ --------------------------
$$ [...]
##$TP= (0..7)
150 150 150 150 150 150 150 150
##$TP07= 0
##$TPNAME0= <>
##$TPNAME1= <>
##$TPNAME2= <>
##$TPNAME3= <>
##$TPNAME4= <>
##$TPNAME5= <>
##$TPNAME6= <>
##$TPNAME7= <>
##$TPOAL= (0..7)
0.5 0.5 0.5 0.5 0.5 0.5 0.5 0.5
##$TPOFFS= (0..7)
0 0 0 0 0 0 0 0
##$TUNHIN= 0
##$TUNHOUT= 0
##$TUNXOUT= 0
##$USERA1= <user>
##$USERA2= <user>
##$USERA3= <user>
##$USERA4= <user>
##$USERA5= <user>
##$V9= 5
##$VALIST= <valist>
##$VCLIST= <CCCCCCCCCCCCCCC>
##$VD= 0
##$VDLIST= <DDDDDDDDDDDDDDD>
##$VPLIST= <PPPPPPPPPPPPPPP>
##$VTLIST= <TTTTTTTTTTTTTTT>
##$WBST= 1024
##$WBSW= 4
##$XGAIN= (0..3)
0 0 0 0
##$XL= 0
##$YL= 0
##$YMAX_a= 458488
##$YMIN_a= -594648
##$ZGOPTNS= <>
##$ZL1= 120
##$ZL2= 120
##$ZL3= 120
##$ZL4= 120
##$ABSF1= 14.98509
##$ABSF2= -5.573092
##$ABSG= 5
##$ABSL= 3
##$ALPHA= 0
##$AQORDER= 0
##$ASSFAC= 0
##$ASSFACI= 0
##$ASSFACX= 0
##$ASSWID= 0
##$AUNMP= <proc_prof1d_extract_pilot.lims>
##$AXLEFT= 0
##$AXNAME= <>
##$AXNUC= <1H>
##$AXRIGHT= 0
##$AXTYPE= 0
##$AXUNIT= <>
##$AZFE= 0.1
##$AZFW= 0.1
##$BCFW= 0
##$BC_mod= 0
##$BYTORDP= 0
##$COROFFS= 0
##$CY= 15
##$DATMOD= 1
##$DC= 0
##$DFILT= <>
##$DTYPP= 0
##$F1P= 0
##$F2P= 0
##$FCOR= 0.5
##$FTSIZE= 32768
##$FT_mod= 6
##$GAMMA= 0
##$GB= 0
##$INTBC= 1
##$INTSCL= 1
##$ISEN= 128
##$LB= 0
##$LEV0= 0
##$LPBIN= 0
##$MAXI= 10000
##$MC2= 0
##$MEAN= 0
##$ME_mod= 0
##$MI= 0
##$NCOEF= 0
##$NC_proc= -8
##$NLEV= 6
##$NOISF1= 0
##$NOISF2= 0
##$NSP= 0
##$NTH_PI= 0
##$NZP= 0
##$OFFSET= 14.98509
##$PC= 1
##$PHC0= 182.3181
##$PHC1= 0
##$PH_mod= 1
##$PKNL= yes
##$PPARMOD= 0
##$PPDIAG= 0
##$PPIPTYP= 0
##$PPMPNUM= 2147483647
##$PPRESOL= 1
##$PSCAL= 4
##$PSIGN= 0
##$PYNMP= <proc.py>
##$REVERSE= no
##$SF= 400.02
##$SI= 32768
##$SIGF1= 0
##$SIGF2= 0
##$SINO= 400
##$SIOLD= 32768
##$SPECTYP= <>
##$SREGLST= <1H.CDCl3>
##$SSB= 0
##$STSI= 32768
##$STSR= 0
##$SW_p= 8223.68421052631
##$SYMM= 0
##$S_DEV= 0
##$TDeff= 65536
##$TDoff= 0
##$TI= <>
##$TILT= no
##$TM1= 0
##$TM2= 0
##$TOPLEV= 0
##$USERP1= <user>
##$USERP2= <user>
##$USERP3= <user>
##$USERP4= <user>
##$USERP5= <user>
##$WDW= 1
##$XDIM= 32768
##$YMAX_p= 462694695
##$YMIN_p= -766059
##$CURPLOT= <Network HP LaserJet P1505>
##$CURPRIN= <$Network HP LaserJet P1505>
##$DFORMAT= <normdp>
##$LAYOUT= <+/1D_H.xwp>
##$LFORMAT= <normlp>
##$PFORMAT= <normpl>
##$SURQMSG= 1
$$ End of Bruker specific parameters
$$ ---------------------------------
##NTUPLES= NMR SPECTRUM
##VAR_NAME=  FREQUENCY,     SPECTRUM/REAL,   SPECTRUM/IMAG
##SYMBOL=    X,             R,               I
##VAR_TYPE=  INDEPENDENT,   DEPENDENT,       DEPENDENT
##VAR_FORM=  AFFN,          ASDF,            ASDF
##VAR_DIM=   32768,         32768,           32768
##UNITS=     HZ,            ARBITRARY UNITS, ARBITRARY UNITS
##FACTOR=    0.250966925370066, 1,           1
##FIRST=     8223.43324360094, -303592,      16681
##LAST=      0,             -100410,         -111537
##MIN=       0,             -766059,         0
##MAX=       8223.43324360094, 462694695,    0
$$ Real data points
##PAGE= N=1
##DATA TABLE= (X++(R..R)), XYDATA
$$ [...]
19481a85890e3607I9382o385l6179f6781D11584b34953m6403a16525C4631c21814
$$ -185890 -53607 99382 92997 56818 -66781 411584 -234953 -281356 -116525 34631 -321814
19469g9040b5892q179C010b0167b956l12303E9172J77980a2644k70876O8533C0047
$$ -79040 -25892 -34071 3010 -20167 -2956 -315259 59172 237152 -12644 -283520 -214987 30047
19456f1730j31655j9737q3909i1641A88009a27859j72104f6846G3982e8071k40502
$$ -61730 -193385 -213122 -297031 -91641 188009 -127859 -299963 -66846 73982 -58071 -298573
19445b98573h3934j23978K2144g0335A05777r113b25919A21460d7136l0913F1391
$$ -298573 -83934 -207912 -185768 -70335 105777 96664 -225919 121460 -47136 -78049 61391
19433b42894f3966H6739a12002L0052A23955d2595l698o5941d7837k17696J22966
$$ -242894 -63966 86739 -112002 -81950 123955 -42595 -46293 -112234 -47837 -265533 -142567
19422a42567K491j31206G4901f8273C65846b01073R7663G0947J1447b08785f3759
$$ -142567 -140076 -271282 74901 -68273 365846 -201073 -103410 70947 82394 -208785 -63759
19410A36892a39398l79636A49003J01890m9105a33464N0411b4518m027H0060b05561
$$ 136892 -139398 -519034 149003 250893 201788 -133464 -83053 -24518 -28545 80060 -205561
19398a18731a0777r7854K0506h867j10696j83046L9144m6162A11389a26542O159
$$ -118731 -10777 -108631 -88125 -8867 -119563 -302609 -263465 -309627 111389 -126542 -120383
19387a20383o1434P8627p525j14167a02221B54795b37353e2616m9471j0036j5538
$$ -120383 -181817 -103190 -110715 -224882 -102221 254795 -237353 -52616 -102087 -112123 -127661
19376a27661r9322H4669c24453E3292i747k80614b9999j12934e6854n3858A82320
$$ -127661 -226983 84669 -324453 53292 -9747 -290361 -29999 -142933 -56854 -110712 182320
19364C3474h5933k75877d2097j27660C1150a30462L8031o8108P752C3260O3030
$$ 33474 -85933 -361810 -42097 -169757 31150 -130462 -92431 -160539 -152787 33260 96290
19353I6290A2818a33748M0498F5596e21368b28831n1110C07918b99427A25644
$$ 96290 12818 -133748 -93250 65596 -521368 -228831 -279941 307918 -299427 125644
19342g0984n3462D7548A2643R4327K1625a04749j89028A22719J73241a53580l7082
$$ -70984 -124446 47548 12643 106970 128595 -104749 -293777 122719 295960 -153580 -190662
19331a90662m35A60182e8606B13776I0254o214j7754a1577I6243a06771j82897
$$ -190662 -191097 160182 -58606 213776 90254 84040 66286 -11577 96243 -106771 -289668
19320b89668B12057d20959d7732j10313k24060C9431a22921A90398Q6417A03520
$$ -289668 212057 -420959 -47732 -158045 -382105 39431 -122921 190398 276815 103520
19309a83712b193j08160N3150n0933K0897l3962q5233g5961A34586b62616P1937
$$ -183712 -2193 -110353 -57203 -108136 -87239 -121201 -206434 -75961 134586 -262616 -190679
19298a90679B31482C5803b31642e0198n1737A05057b09223N8815j64801N3453
$$ -190679 231482 35803 -231642 -50198 -101935 105057 -209223 -150408 -315209 -261756
19288b61756r2193J48704b4278j04790A96252c96421B64101D7099c13870b3398
$$ -261756 -353949 -205245 -24278 -129068 196252 -396421 264101 47099 -313870 -23398
19277A84352a68005F6L89e66010D2806J96361F4947b62813J00477C6129J0995
$$ 184352 -168005 66 455 -566010 42806 239167 64947 -262813 -162336 36129 47124
19266D7124R513a36937l12165A1627b70672I7452d26518g4695N449j93893d837
$$ 47124 56637 -136937 -449102 11627 -270672 97452 -426518 -74695 -69246 -263139 -4837
19254b18941E4549b162C90522g749k5595j59432q2522H1711a33978M9204k23259
$$ -218941 54549 -2162 390522 -7749 -33344 -192776 -275298 81711 -133978 -84774 -308033
19243c08033L3861N8197A206a21281k5560C12216A24492D1974b25517A52009l1784
$$ -308033 -274172 -215975 1206 -121281 -146841 312216 124492 41974 -225517 152009 120225
19232A20225b52073A99515p3346b7706k3199C68888j60334q7312l6286a66020
$$ 120225 -252073 199515 126169 -27706 -50905 368888 208554 121242 84956 -166020
19221a12516B4919a41631E14149e9912q8411L0563j71043j34327E6638a90521
$$ -112516 24919 -141631 514149 -59912 -148323 -117760 -288803 -423130 56638 -190521
19210c0132H9106J34321a56597B14219a42361b2846H6442a09838C03704A48257
$$ -30132 89106 223427 -156597 214219 -142361 -22846 86442 -109838 303704 148257
19199b85505h8137B08443c72009A20383b09062A02954C4953b36709A39994J3149
$$ -285505 -88137 208443 -372009 120383 -209062 102954 34953 -236709 139994 153143
19189A53143a12532L6729C00626b08808A45100b73328B10662i6071C3015J13745
$$ 153143 -112532 -75803 300626 -208808 145100 -273328 210662 -96071 33015 146760
19179A46760E694c58730L8557A37384i4671k8062j67802C029b64423n715C8130
$$ 146760 5694 -358730 -320173 137384 -94671 -122733 -290535 3029 -264423 -270138 38130
19167g2818j40651i221j38727C0560L04924b4498B46523b1582m30058b1594j38706
$$ -72818 -213469 -9221 -147948 30560 335484 -24498 246523 -21582 -451640 -21594 -160300
19156a60300r7877B3366a1761G2617b97267g724H7236c20429A76415g6175n3136
$$ -160300 -258177 23366 -11761 72617 -297267 -7724 87236 -320429 176415 -76175 -129311
19145a29311j9494B6428a48649j30049c999j80405L2232j20379G3781d09683G0190
$$ -129311 -148805 26428 -148649 -278698 -3999 -184404 -152172 -272551 73781 -409683 70190
19133i957j6950A51205D6166b46120j2875g8439E0073c1223k20488H2703a10476
$$ -9957 -26907 151205 46166 -246120 -258995 -78439 50073 -31223 -251711 82703 -110476
19121H2715e8403f645m3980l5780q6247j97706R4718P9533G0367M634a6819j63922
$$ 82715 -58403 -6645 -50625 -86405 -172652 -370358 -275640 -196107 70367 75001 -16819 -180741
19109a80741I5420b577D9030d8038p8842d6890r4607n1107b8962G5376h6466j16329
$$ -180741 95420 -2577 49030 -48038 -126880 -46890 -141497 -192604 -28962 75376 -86466 -202795
19097b02795I5454g7174j53305R3243J1352j58444A55036c33833I3149K5403i9154
$$ -202795 95454 -77174 -230479 -137236 -125884 -284328 155036 -333833 93149 118552 -99154
19085A08374b1130A32544o4796Q5860J55820H6352a89618o4401B79211c2719B51128
$$ 108374 -21130 132544 67748 153608 309428 86352 -189618 -254019 279211 -32719 251128
19073H7537B3153b26357A50748l5682a9065G094R2180j8211K13600a27568N4878
$$ 87537 23153 -226357 150748 115066 -19065 7094 99274 81063 294663 -127568 -72690
19062g2690k02865R1123A00338L9619l0369d29134B43R22b11249E3585A9157c26005
$$ -72690 -275555 -184432 100338 139957 109588 -429134 243 1165 -211249 53585 19157 -326005
19049b27601g080j10335C01106f3305A82660e2680j45564l4170a2396A14743a34011
$$ -227601 -7080 -117415 301106 -63305 182660 -52680 -198244 -232414 -12396 114743 -134011
19037a48231A9921f3104A25489R4783D7985q089c87191J31481H3330P3385c17004
$$ -148231 19921 -63104 125489 220272 47985 39896 -387191 -255710 83330 156715 -317004
19025d8148j42570p3329C14030a47855A3188d2829A05771e597j95594E9078N7149
$$ -48148 -190718 -264047 314030 -147855 13188 -42829 105771 -5597 -201191 59078 116227
19014A16227A3709a32222L8331K4667H958b12746B59111D5483j6642K2590K42
$$ 116227 13709 -132222 -93891 -69224 8958 -212746 259111 45483 28841 51431 51673
19003E1673a03265B12244e3812A72388b94253D3457J46164a91547e2639E40199
$$ 51673 -103265 212244 -53812 172388 -294253 43457 189621 -191547 -52639 540199
18992B47002G4186l4408A9571J65956a33641j75918J7324A71913C128K53720a93090
$$ 247002 74186 39778 19571 185527 -133641 -309559 -292235 171913 3128 256848 -193090
18980d0283A9070M2565a37735A30250D7611a8028m7588A58767L37139K59877j45356
$$ -40283 19070 61635 -137735 130250 47611 -18028 -65616 158767 495906 755783 610427
18969F10427k98422j41512a75726F337j362M7424h3394L9635j04153j5814q9162
$$ 610427 312005 170493 -175726 6337 4975 52399 -83394 -43759 -147912 -163726 -252888
18958b52888I1140m3513K32083e09147F5106k3454a93870B6086h6835G0681d08527
$$ -252888 91140 47627 279710 -509147 65106 41652 -193870 26086 -86835 70681 -408527
18946F9751e4720q1774j48740b88m28976K08392A35505d7633k0691B40969a13378
$$ 69751 -54720 -136494 -285234 -288 -429264 -220872 135505 -47633 -68324 240969 -113378
18934b61127A82381P88a61610M1742A64389a75570L7985F8415a1770A09392l1524
$$ -261127 182381 183169 -161610 -119868 164389 -175570 -137585 68415 -11770 109392 77868
18923G7868l6014a09890j4006j72307B3254N5391l1377b04210A38071D8461R5980
$$ 77868 41854 -109890 -123896 -296203 23254 78645 47268 -204210 138071 48461 144441
18912A44441l6188l4062N2706D7731L85947I4197J73617d2526n500E27609A68994
$$ 144441 108253 74191 126897 47731 433678 94197 267814 -42526 -48026 527609 168994
18900a43213b6000A04509C0513a15477k25015L0638e4634l45074J67008e9191
$$ -143213 -26000 104509 30513 -115477 -340492 -309854 -54634 -399708 -232700 -59191
18889a33649e2338A3567a9193A66338a61304f5538j98758D7644f2567D9628b19520
$$ -133649 -52338 13567 -19193 166338 -161304 -65538 -264296 47644 -62567 49628 -219520
18877A97448e8749A15646r361h4955I4622J2345b42254b1933k50587Q3584D0692
$$ 197448 -58749 115646 106285 -84955 94622 106967 -242254 -21933 -272520 -188936 40692
18865G0929b64040A3523b53379A87377a72607G3904a76142p3716A05662d3053
$$ 70929 -264040 13523 -253379 187377 -172607 73904 -176142 -249858 105662 -43053
18854b7135k35317B25472c10995H3580N332c80596I6097J0694f028k0690j19883
$$ -27135 -262452 225472 -310995 83580 88912 -380596 96097 106791 -6028 -26718 -146601
18843a46601j36452c2105p3585M0266K1717B85516g8548j58103c329A65245c28928
$$ -146601 -283053 -32105 -105690 -65424 -43707 285516 -78548 -236651 -3329 165245 -328928
18831g7164A09587e5891B51434b11640B78037f2978C10327l579I1202K64047b13627
$$ -77164 109587 -55891 251434 -211640 278037 -62978 310327 306748 91202 355249 -213627
18819c1817j26326K1068A47045J49455b63494A79262D7020J04808G2652e8597
$$ -31817 -158143 -137075 147045 296500 -263494 179262 47020 151828 72652 -58597
18808A05429J35858j06318E3504L6803p327A5795a59351A36340a21679A39657
$$ 105429 241287 134969 53504 90307 82980 15795 -159351 136340 -121679 139657
18797A62973m1145j5782g7778j18036k1982f6639J3094n3896K3034j77097m0421
$$ 162973 121828 106046 -77778 -195814 -217796 -66639 -53545 -107441 -84407 -261504 -301925
18786c01925I9720a17753E0278L8589j6716d68481c0627k4196B65468a85880D615
$$ -301925 99720 -117753 50278 88867 72151 -468481 -30627 -54823 265468 -185880 4615
18774B28871c89015a78972d6276p6011l6301B63782b40864R6445L5953A67399
$$ 228871 -389015 -178972 -46276 -122287 -158588 263782 -240864 -144419 -108466 167399
18763D90975F5111J08138a39167G8018a53467k92098a31221k19760A52219a93682
$$ 490975 65111 173249 -139167 78018 -153467 -445565 -131221 -350981 152219 -193682
18752E4463a14107k95298a93008B32772b54430a4026E8296J22040c7448l01943
$$ 54463 -114107 -409405 -193008 232772 -254430 -14026 58296 180336 -37448 -339391
18742c39391a9871j82761J5776A0903L48243B8482J72392a75755A26037c39507
$$ -339391 -19871 -202632 -186856 10903 359146 28482 200874 -175755 126037 -339507
18731A92069b2055j0244n561A62503a4339I876a03206A12063b50266m7963k7024
$$ 192069 -22055 -32299 -37860 162503 -14339 9876 -103206 112063 -250266 -298229 -325253
18720c25253A8370b06695d289j49834j89944A91131d9185A17473d15516a94723
$$ -325253 18370 -206695 -4289 -154123 -344067 191131 -49185 117473 -415516 -194723
18709h5478A32046B872O195a01075J5387B35794c70903a42973M1876B13352c0661
$$ -85478 132046 2872 9067 -101075 -85688 235794 -370903 -142973 -101097 213352 -30661
18697e2189A69133d6052j2864j10671k44024E332h4007k49092a21356A42761B9918
$$ -52189 169133 -46052 -58916 -169587 -413611 5332 -84007 -333099 -121356 142761 29918
18685A16083b5005j65610M1191A04005b5501m610A0682b83471B50954a33028d1998
$$ 116083 -25005 -190615 -149424 104005 -25501 -30111 10682 -283471 250954 -133028 -41998
18673b6997j76210E6908d91474F5438M10532a71505j83507a4174k05315m9632
$$ -26997 -203207 56908 -491474 65438 475970 -171505 -355012 -14174 -219489 -269121
18663b69121D0409c46815b9499j575B33870a73711B90296E858K37641A9881H018
$$ -269121 40409 -346815 -29499 -31074 233870 -173711 290296 5858 243499 19881 8018
18651a63673i697j32167B61720j8838c14966a00453j70891N4278b0061k3792n7018
$$ -163673 -9697 -141864 261720 242882 -314966 -100453 -271344 -217066 -20061 -43853 -100871
18640a00871q8866O395A93555c61012m0133a62152A45433e6089F2630O6635a19422
$$ -100871 -189737 -183342 193555 -361012 -401145 -162152 145433 -56089 62630 129265 -119422
18628A78641Q5030d27783i244q0399H9787a35719B062h8307D5991e033m9261K5330
$$ 178641 263671 -427783 -9244 -89643 89787 -135719 2062 -88307 45991 -5033 -54294 -28964
18616b8964k31389M3846o146A35953g763j72329C897M8343b03627N5358q9592
$$ -28964 -260353 -216507 -222653 135953 -7763 -180092 3897 52240 -203627 -148269 -237861
18605b37861J8765a153H5695O8243a21759F6127J26597b27087d2519o8523J662
$$ -237861 -219096 -1153 85695 153938 -121759 66127 192724 -227087 -42519 -111042 -109380
18594a09380L5465j78698L8803E9997b31288K2235B11063r6165f5341m0455A03525
$$ -109380 -73915 -252613 -213810 59997 -231288 -209053 211063 114898 -65341 -105796 103525
18582a53900K5203e5679k81338E5926K9239g9910C1750K974i1160I9439a66624
$$ -153900 -128697 -55679 -337017 55926 85165 -79910 31750 34724 -91160 99439 -166624
18570a63321p0115j2374O3344I7381b0137l87390i2273d0860A40649e1335p2296
$$ -163321 -233436 -245810 -182466 97381 -20137 -407527 -92273 -40860 140649 -51335 -123631
18559a23631R590c7449J1342n2666F2073b86981G2913a48820B14847a01266H5342
$$ -123631 -114041 -37449 -26107 -78773 62073 -286981 72913 -148820 214847 -101266 85342
18547c4873j57288A51658b33098g7635C9792d4372C8522a65091B74751D4435j1529
$$ -34873 -192161 151658 -233098 -77635 39792 -44372 38522 -165091 274751 44435 32906
18536C2906g36707B10789d1520l62575J90177Q9760E9660L24863b0599G8783b7852
$$ 32906 -736707 210789 -41520 -404095 -213918 -124158 59660 384523 -20599 78783 -27852
18524A25277a99582Q9087n0642d7835B27851b49599A96146L9286Q8155A2561P5114
$$ 125277 -199582 -110495 -161137 -47835 227851 -249599 196146 235432 323587 12561 87675
18513H7675E487a39659b3326k10598C07186a43849j3941P0119A94170K04490a96997
$$ 87675 5487 -139659 -23326 -233924 307186 -143849 -157790 -87671 194170 398660 -196997
18501B58582j07716b9773o8487o5406J6857k08118B81539j06639F9915B5471C166
$$ 258582 150866 -29773 -98260 -163666 -146809 -354927 281539 174900 69915 25471 3166
18489E2753M4550k292a12240A33784o879b8774m33489L629h7183j7393k10903
$$ 52753 97303 95011 -112240 133784 126905 -28774 -462263 -458634 -87183 -104576 -315479
18478c15479G3965b18269j09409a32369D0961a38565j5509A08725J9697i1509
$$ -315479 73965 -218269 -327678 -132369 40961 -138565 -154074 108725 128422 -91509
18467a41327A7463J1536O3350a32524e9721j28346A64648i6259k19516C59569
$$ -141327 17463 28999 92349 -132524 -59721 -188067 164648 -96259 -315775 359569
18456a17007o0888B38048q3513J50589A10784b31756J02757a4186H0924c8234
$$ -117007 -177895 238048 154535 305124 110784 -231756 -128999 -14186 80924 -38234
18445b03965a0996A7290g1110A76725n0611K268h8792M0477B1704P8558m9316
$$ -203965 -10996 17290 -71110 176725 126114 128382 -88792 -48315 21704 100262 50946
18434E0946b5710E2441L19426a25083B15761C242a03121J0509b0151B52659b33936
$$ 50946 -25710 52441 371867 -125083 215761 3242 -103121 -92612 -20151 252659 -233936
18422i750q9647A35049a36390j98226J50116A19487J7822B9870d00293a94513
$$ -9750 -99397 135049 -136390 -334616 -184500 119487 137309 29870 -400293 -194513
18411a7519A14039a3775B36928e7614j49308K1693Q7500j91236a30851B83201
$$ -17519 114039 -13775 236928 -57614 -206922 -185229 -97729 -288965 -130851 283201
18400b86796A07372h4782L2446b1074l67033c4657B46318A04258c69j25887r3269
$$ -286796 107372 -84782 -52336 -21074 -388107 -34657 246318 104258 -369 -126256 -219525
18389b19525B7659c5387j52654G5333f3260j97294L6999N1905D0244K15567j14166
$$ -219525 27659 -35387 -188041 75333 -63260 -260554 -223555 -171650 40244 255811 141645
18378A41645N8965a92060n1263B46934D8186a37133o8198J4675b3371B42681b03152
$$ 141645 200610 -192060 -243323 246934 48186 -137133 -205331 -190656 -23371 242681 -203152
18366G7596b6970p173B7653c84533c5296r5429B41101j08126f9174j15613f333
$$ 77596 -26970 -34143 27653 -384533 -35296 -130725 241101 132975 -69174 -184787 -6333
18354f4614A21260O2841a97862b5816o1560B7261a29897H4587b16564C1004g2852
$$ -64614 121260 184101 -197862 -25816 -87376 27261 -129897 84587 -216564 31004 -72852
18342B57729e8797A8054a94550L8006f1601E3417a2890A76480G5869a53693H8395
$$ 257729 -58797 18054 -194550 -156544 -61601 53417 -12890 176480 75869 -153693 88395
18330c4740r9287B03445K29663d01947a42805b9446D23968E3793a25600L801D288
$$ -34740 -134027 203445 433108 -401947 -142805 -29446 423968 53793 -125600 -121799 4288
18318e7132k28544B14276b3237A64353b18285A35580c7014k44240l2409H1384
$$ -57132 -285676 214276 -23237 164353 -218285 135580 -37014 -281254 -313663 81384
18307D7239J35270a78011o0791Q0697E6028a22609o7407B2114O4191Q2100b61197
$$ 47239 182509 -178011 -238802 -158105 56028 -122609 -190016 22114 86305 168405 -261197
18295d56994A0905O3909b3502m15008E1120M578a93922B4169J5305a63001k07107
$$ -456994 10905 74814 -23502 -438510 51120 55698 -193922 24169 39474 -163001 -370108
18284c70108b251l34529F8438J05343l2639F7377N1222R2681a21866q7624D5483
$$ -370108 -2251 -336780 68438 173781 141142 67377 118599 211280 -121866 -209490 45483
18272b20502B2543a4696B0707J10746b21206a5454j12441A69807p0908f7070l0203
$$ -220502 22543 -14696 20707 131453 -221206 -15454 -127895 169807 98899 -67070 -97273
18261i7273E0280a1355n29907b11729C8677b14716f5573B1134b15242A1012g8758
$$ -97273 50280 -11355 -541262 -211729 38677 -214716 -65573 21134 -215242 11012 -78758
18249A70611i8736A00460b04390n0709j80258a49999G9534i5492D3815L12325
$$ 170611 -98736 100460 -204390 -255099 -435357 -149999 79534 -95492 43815 356140
18239C56140g0506j10511M7529n3030A67046a50646k00601B51423C8710J47667
$$ 356140 -70506 -181017 -133488 -186518 167046 -150646 -351247 251423 38710 186377
18229A86377a43881c3430A16399b32572J09888j1713G6420k8518J10652L5518
$$ 186377 -143881 -33430 116399 -232572 -122684 -134397 76420 47902 158554 194072
18219A94072l6965c01811d5921l32762G7631L1743J04419a18375a7497p7693k7370
$$ 194072 157107 -301811 -45921 -378683 77631 109374 213793 -118375 -17497 -95190 -122560
18208a22560F9005c52918a46B32762d49047B02810P8642a10016l8238A66091J03035
$$ -122560 69005 -352918 -146 232762 -449047 202810 281452 -110016 -148254 166091 269126
18197B69126b3555B5860h9480E974J91146a86470K8097D8403I091L42789A16799
$$ 269126 -23555 25860 -89480 5974 197120 -186470 -158373 48403 9091 351880 116799
18185a43723f3867A49894D5444K1433a25533q4096k56972I0575C4427O1101c01730
$$ -143723 -63867 149894 45444 66877 -125533 -209629 -466601 90575 34427 95528 -301730
18173A91158E3017R3237m3261a56973J3087B98573e8214I0850k0643L9287a17118
$$ 191158 53017 146254 102993 -156973 -143886 298573 -58214 90850 70207 109494 -117118
18161H7009M6151b35534R4756b9608A5415R4736M3438b65529A96912f9165E0542
$$ 87009 133160 -235534 -140778 -29608 15415 110151 153589 -265529 196912 -69165 50542
18149H99a85543D1516i5224B33548m8973g6372A52941e1269B04474b36667q347
$$ 899 -185543 41516 -95224 233548 184575 -76372 152941 -51269 204474 -236667 -245014
18138b45014B37345E0526a49040I9236h7631c4294B66272I9622A9769J53577a26498
$$ -245014 237345 50526 -149040 99236 -87631 -34294 266272 99622 19769 173346 -126498
18126B56027I0191O5778o0734o230d5557B03627b04258B40222j16885a43647d8114
$$ 256027 90191 155969 95235 89005 -45557 203627 -204258 240222 123337 -143647 -48114
18114A43481f2484C9463J25548G1050K80034j03418a26655o5894C5952A7247O9286
$$ 143481 -62484 39463 165011 71050 351084 247666 -126655 -192549 35952 17247 86533
18103H6533i6451C6998J09283J30086a68288B29968A0937a57136j6342Q118A10674
$$ 86533 -96451 36998 146281 276367 -168288 229968 10937 -157136 -173478 -165360 110674
18091f7142K0323H9705J34949J2590c60464F0098f8076L0878p7146H3991b83410
$$ -67142 -46819 89705 224654 237244 -360464 60098 -68076 -37198 -114344 83991 -283410
18079c1642j29677g7275a4974g124A33513e3361D34107A6402J52519q2102R5536
$$ -31642 -161319 -77275 -14974 -7124 133513 -53361 434107 16402 168921 86819 182355
18068A82355b7087n8028d600k85522G4614B3099N9313l1099L9243h8569G752O6326
$$ 182355 -27087 -85115 -4600 -290122 74614 23099 82412 51313 90556 -88569 7752 74078
18056G4078l900g9154a333n0756j69219r3308F7882a54013B66459c87977h9037
$$ 74078 70178 -79154 -1333 -52089 -221308 -314616 67882 -154013 266459 -387977 -89037
18044d5477k45366R4026I1610r536e9278A69141a41972k55445a29779B23039k1945
$$ -45477 -290843 -196817 91610 82074 -59278 169141 -141972 -397417 -129779 223039 201094
18033B01094e05448G9614K1108k8280a52186G2476B3504i8783j2879C38597m4189
$$ 201094 -505448 79614 100722 72442 -152186 72476 23504 -98783 -111662 338597 294408
18022B94408a08717r4048I4977N6409b56831C20121a08277d3267j94917J12766
$$ 294408 -108717 -202765 94977 151386 -256831 320121 -108277 -43267 -238184 -125418
18012a25418A99283L03266d8047C8483j8512i8124b4311B46898b92517A95336
$$ -125418 199283 502549 -48047 38483 19971 -98124 -24311 246898 -292517 195336
18001B714e2758B9560b85700F9292a67994m3336b73H5942D0113b43683Q8898D1362
$$ 2714 -52758 29560 -285700 69292 -167994 -211330 -273 85942 40113 -243683 -154785 41362
17988A38104a19547A96520j0330b56899e9731G0410K4184l2540L537J10431a37909
$$ 138104 -119547 196520 186190 -256899 -59731 70410 94594 62054 65591 176022 -137909
17976e8860D7235L63997A17456Q0689O748c0812B5551a01809c6660B6556c00480
$$ -58860 47235 411232 117456 198145 204893 -30812 25551 -101809 -36660 26556 -300480
17964b46733c2296A13759b53149A74037a94422i6253a0354B37463b19459f2024
$$ -246733 -32296 113759 -253149 174037 -194422 -96253 -10354 237463 -219459 -62024
17953D5100J20872c8774j05159j0042Q682D426a82100E0953b7582A23761a57975
$$ 45100 165972 -38774 -143933 -153975 -145293 4426 -182100 50953 -27582 123761 -157975
17941C35941a50115n070a3334E0704b13803F691K22919c47940G5488a55397k43148
$$ 335941 -150115 -155185 -13334 50704 -213803 6691 229610 -347940 75488 -155397 -398545
17930c98545J72537J7324d6722o6683E1364f2665j11980j12531B7259e9265B65590
$$ -398545 -226008 -208684 -46722 -113405 51364 -62665 -174645 -287176 27259 -59265 265590
17918B74269f9397G0059J73341O4556j02029d31983a83606m4465D44320a29547
$$ 274269 -69397 70059 243400 307956 205927 -431983 -183606 -228071 444320 -129547
17907a39719A91006a87924B9763N49J36357K39413f0528j02532B30674J59051
$$ -139719 191006 -187924 29763 30312 166669 406082 -60528 -163060 230674 389725
17897C89725b1044m4648K4064o2426E920J07381b12096J05036B7319J28390J08416
$$ 389725 -21044 -65692 -41628 -104054 5920 113301 -212096 -107060 27319 155709 264125
17886B64125J03378a42378A0704P3194A3537f2755k26414h5587D02812j64586
$$ 264125 367503 -142378 10704 83898 13537 -62755 -289169 -85587 402812 238226
17876B38226B4971J40110c1532k2468A21144O059a55237B18331D1139b61870A82203
$$ 238226 24971 165081 -31532 -54000 121144 127203 -155237 218331 41139 -261870 182203
17864b94852B58558D5459b76424B2783K7334L7822a1626A54362R1499i2219C3771
$$ -294852 258558 45459 -276424 22783 50117 87939 -11626 154362 245861 -92219 33771
17852F0517O4556J98091P0341A82542f7491C96113A55750a33916D1983b87019
$$ 60517 125073 323164 393505 182542 -67491 396113 155750 -133916 41983 -287019
17841a87677A97845K47263A4926b91013g941I2378c1539J1282l3085o6936I7077
$$ -187677 197845 445108 14926 -291013 -7941 92378 -31539 -20257 -53342 -120278 97077
17829A94483a79018j70015R7049A02406M86623A9001c9058q2896G7358e1583A92125
$$ 194483 -179018 -349033 -251984 102406 589029 19001 -39058 -121954 77358 -51583 192125
17817b16004A52616J75144b34663D6243J65112r3934a10374K4114A4135d7125
$$ -216004 152616 327760 -234663 46243 211355 117421 -110374 -86260 14135 -47125
17806E0923J84020f857B66468A19157g1765c0191D5173h5020k4966I5767C4953
$$ 50923 234943 -6857 266468 119157 -71765 -30191 45173 -85020 -109986 95767 34953
17794C9824a77255C04449q3594A03747m0803h3054H4575a18782R554D32953A93040
$$ 39824 -177255 304449 220855 103747 62944 -83054 84575 -118782 -109228 432953 193040
17782B06349b37337B66232a5146M42A03927a07867A00432J17218j04477a70164
$$ 206349 -237337 266232 -15146 -14704 103927 -107867 100432 217650 113173 -170164
17771I0131D4419R0209a26004j90734G7847a03690G0376Q0453B7512R8910P9134
$$ 90131 44419 134628 -126004 -316738 77847 -103690 70376 150829 27512 126422 205556
17760B05556L2925J30226A9252b89466B12362p7748E8675L1373l8396j681K92402
$$ 205556 238481 368707 19252 -289466 212362 134614 58675 90048 51652 49971 342373
17749C42373e6662j45287C9249a04332j42263B22579A5571a208j67977g599b85
$$ 342373 -56662 -201949 39249 -104332 -246595 222579 15571 -1208 -169185 -7599 -285
17737A99961c5833A33688B8129J19261l066B673J22047L5905J16039J94381A84021
$$ 199961 -35833 133688 28129 147390 144324 2673 124720 160625 276664 471045 184021
17725F8094R031l3863R521J80812A03683A0770J19456M6790d8540B22361E1180
$$ 68094 77125 43262 52783 233595 103683 10770 130226 177016 -48540 222361 51180
17713a99041A72188a16722B1371J03313b87788B55900f9418C32950A17984K29254
$$ -199041 172188 -116722 21371 124684 -287788 255900 -69418 332950 117984 347238
17703C47238j56057e7290j55546c8143j02560D00623f8798I1123K33926j39176
$$ 347238 191181 -57290 -212836 -38143 -140703 400623 -68798 91123 325049 185873
17693A85873a53755C21334a85706C83430A60655b3841l40159F2801a30245B79850
$$ 185873 -153755 321334 -185706 383430 160655 -23841 -364000 62801 -130245 279850
17682b75581n5242c6774C60742i1614d0460A57320k5210j2689a12243G06J37746
$$ -275581 -330823 -36774 360742 -91614 -40460 157320 132110 119421 -112243 706 138452
17671A38452N5966K8907n4234F3226K81763c7229f729A10603i0681j0412A88629
$$ 138452 194418 223325 169091 63226 344989 -37229 -6729 110603 -90681 -101093 188629
17659A52445K27366j1531b25452e1719k24545B1618L6955M835a40184A75164d5958
$$ 152445 379811 368280 -225452 -51719 -276264 21618 58573 63408 -140184 175164 -45958
17647H8993j479O2021e4272A34845f6972A23671C9900b14135I0848P8993L8753
$$ 88993 87514 149535 -54272 134845 -66972 123671 39900 -214135 90848 169841 208594
17636B08594a77898C04535a3795k63331I5325J23711p1445C4146O30677A13378
$$ 208594 -177898 304535 -13795 -277126 95325 219036 147591 34146 664823 113378
17625A8452K27913A19257e7857q9217A92292b64045G9463a82838A44870e463A71231
$$ 18452 246365 119257 -57857 -147074 192292 -264045 79463 -182838 144870 -5463 171231
17613B1879a55592A63066J99443d5106G2651c7540a8667A09753K58393b6145j2606
$$ 21879 -155592 163066 362509 -45106 72651 -37540 -18667 109753 368146 -26145 -38751
17602c8751p6138A40493L16619B25715a61652L8005C22279j52293a57183G02M21253
$$ -38751 -114889 140493 457112 225715 -161652 -123647 322279 169986 -157183 702 421955
17591D21955j68399M3786J9622B8267a59562D693P8209b89241C29769b4234G7273
$$ 421955 253556 297342 316964 28267 -159562 4693 82902 -289241 329769 -24234 77273
17579B89896b44508g5846C86771C2808N12839j49058a50737A07667J9247L3900
$$ 289896 -244508 -75846 386771 32808 545647 396589 -150737 107667 126914 160814
17569A60814a24518D6778M18157E188g2235A04700e9445o2952j41261C13511r1884
$$ 160814 -124518 46778 464935 5188 -72235 104700 -59445 -122397 -263658 313511 221627
17558B21627K06841j84294A624J4168c1388A32771K54399e155k04281A11141a10739
$$ 221627 428468 244174 1624 15792 -31388 132771 387170 -5155 -209436 111141 -110739
17546C55402G8056R6119J08154b3129C26089A29888l4462J18685n0662J16429
$$ 355402 78056 174175 282329 -23129 326089 129888 95426 214111 163449 279878
17536B79878m1990R5938p4376a6586B64970n3478J7204q389K94578M2050r0696
$$ 279878 237888 333826 259450 -16586 264970 211492 228696 220307 514885 556935 466239
17525D66239R3490M67493K27423L1277E65737J52209n4134k99096K0109A77539
$$ 466239 559729 1027222 1254645 1285922 565737 717946 663812 364716 384825 177539
17514A60755J87541K33944k50325J56409O62317K80652q1185k07858m31737B85401
$$ 160755 348296 582240 331915 488324 1150641 1431293 1350108 1142250 710513 285401
17503D42557j43460K71144j66715r8233A37898L24867A97343M21798k65813k2551
$$ 442557 299097 570241 403526 305293 137898 462765 197343 619141 353328 330777
17493C30777L742J14573k14454J43952A24748d5134C47021J3430k4949j14220
$$ 330777 334519 449092 234638 378590 124748 -45134 347021 360451 335502 221282
17483B21282O9154J65483A66751K97170j69809r2428M21879E4533J40563H8855
$$ 221282 290436 455919 166751 463921 294112 201684 623563 54533 195096 88855
17472B07156M165J21766i6086I1529K72648j44568A02010J58872J2504c7144D69225
$$ 207156 211321 333087 -96086 91529 364177 219609 102010 260882 273386 -37144 469225
17460B41378l0220n4255K0591L12945j68757p033I5841K44292n2147C5460K67570
$$ 241378 211158 156903 177494 490439 321682 314649 95841 340133 287986 35460 303030
17449C03030J257P9834o9851Q978r7427O457J89120n5726j4927O3391A09798K53647
$$ 303030 304287 384121 314270 323248 225821 232278 421398 365672 350745 414136 109798 363445
17437C63445j79971r0296M58301B40397K40763A82547L71820j02048A87412e4434
$$ 363445 183474 93178 551479 240397 481160 182547 554367 452319 187412 -54434
17426G4439K95485p7446B2654M14233P3289n506Q020L8836q1522j07592r29J49158
$$ 74439 369924 292478 22654 436887 510176 504670 512690 551526 470004 362412 361483 510641
17414E10641j55998J23978j94947L90967A01822K8575o0616N88503k53717P007
$$ 510641 354643 478621 283674 674641 101822 130397 69781 658284 404567 411574
17404D11574A67199L86851A06287K66026j28956F2499f7549B8432d8784E7890
$$ 411574 167199 554050 106287 372313 243357 62499 -67549 28432 -48784 57890
17393F1502L37841m8396j13736a72896E65011A83975M96518B64940C0864K17692
$$ 61502 399343 350947 237211 -172896 565011 183975 680493 264940 30864 248556
17383B48556b43033D57948J93235C14684M3245a23720B05908K50360i2009D33726
$$ 248556 -243033 457948 651183 314684 357929 -123720 205908 456268 -92009 433726
17372D35739A70878J88388E0626L6255J05120J22912I4808A0186K70824A2590
$$ 435739 170878 359266 50626 86881 192001 314913 94808 10186 281010 12590
17361C32253a27614A31549N8893G5667R1899L5921d2037D9035N5208N00755I5717
$$ 332253 -127614 131549 190442 75667 167566 203487 -42037 49035 104243 604998 95717
17349H9461J51954n4685H6782M21919j84720j56840C8770J53614K5122D5384M09824
$$ 89461 241415 186730 86782 508701 323981 167141 38770 192384 217506 45384 455208
17338D55208H1532L74082k08299J61114g6149D12305j83246J35836j75145q2240
$$ 455208 81532 455614 247315 408429 -76149 412305 229059 364895 189750 107510
17328A07510L36770k21865J06860j2013j01838J9696K736J64608e4456C8527g9693
$$ 107510 444280 222415 329275 317262 215424 235120 237856 402464 -54456 38527 -79693
17316E17403k30279k3006K2036L1915n1034l9118j0188k078O5126K95339j87678
$$ 517403 287124 264118 286154 318069 267035 227917 217729 215651 280777 576116 388438
17305C88438j72270O6776A38044N84036A86269K53038j49738m0117J54978A56978
$$ 388438 216168 282944 138044 722080 186269 439307 289569 249452 404430 156978
17294A0536O1035h7716E06786j51889j45049F9632K52705I8935A6595J06081M1600
$$ 10536 71571 -87716 506786 354897 209848 69632 322337 98935 16595 122676 164276
17283A64276j0416N5699K28511a82339B31855j9287J86367j55426l9219K50841
$$ 164276 153860 209559 438070 -182339 231855 212568 398935 243509 204290 455131
17273D55131k00902M35214l10078O9378j87718q0083J0535o7669J81805r6898
$$ 455131 254229 689443 379365 448743 261025 180942 191477 123808 305613 208715
17263B08715J55943i2131B82601p891J40994J40992J28896C31885k194J46733
$$ 208715 364658 -92131 282601 274710 415704 556696 685592 331885 329691 476424
17253D76424q1755F5706Q3054M33155k25131A74702j4601K63205p169J29527l2461
$$ 476424 394669 65706 148760 581915 356784 174702 160101 423306 416137 545664 513203
17242E13203R4183A88766J91566J78265j41631o5597p9255K17061C1154K75922
$$ 513203 607386 188766 380332 558597 416966 351369 272114 489175 31154 307076
17232C07076J8756j08926n2760k8498K45621K29340B21689J78903j4302A01048
$$ 307076 325832 216906 164146 135648 381269 610609 221689 400592 386290 101048
17221A52090L12220j48768M16209o7254C05685K26313G8415J07316J3908J03175
$$ 152090 464310 315542 731751 664497 305685 531998 78415 185731 199639 302814
17211C02814K82634k09365J9916Q5187A32291j425J29880G941N59375k52493J57847
$$ 302814 585448 376083 395999 481186 132291 130866 260746 7941 567316 314823 472670
17200D72670O2901j3381A71103J78601O7094J39736j8470j61242A24775J87104
$$ 472670 535571 522190 171103 349704 416798 556534 538064 376822 124775 311879
17190C11879j2418A5843N26825K7258j5317Q0350J41129l31888J37673k6880k9170
$$ 311879 299461 15843 542668 569926 554609 634959 776088 444200 581873 554993 525823
17179E25823A93972J90747l9867K120K37879l8159J26104B29917j6344K70716
$$ 525823 193972 384719 344852 346972 584851 546692 672796 229917 213573 484289
17169D84289A27324M03751j45124J13007r039K65572J14470m31592j00882L07571
$$ 484289 127324 531075 385951 498958 489919 755491 869961 438369 337487 645058
17159F45058k72723J00783L5736m1996p8552J50325k27587m7428L25670q8281
$$ 645058 372335 473118 508854 466858 388306 538631 311044 263616 589286 501005
17149E01005J71710l0065j74892H3814K70834L48686l6272j64096r5714j13636
$$ 501005 672715 642650 467758 83814 354648 703334 667062 502966 407252 293616
17139B93616K76798J37170K86688l61130k71478Q9748P8096j07996J46979j02012
$$ 293616 570414 707584 994272 633142 361664 451412 529508 421512 568491 466479
17129D66479M4922o8803M56139l38452k39582O5531L06110p3876j38258K80290
$$ 466479 511401 442598 898737 560285 320703 386234 692344 618468 480210 760500
17119G60500l28781N2957L08061k84033L9419j05109J75849j21949j60781L21819
$$ 760500 431719 484676 792737 508704 548123 443014 618863 496914 336133 657952
17109F57952R2375k93506J03652j34794L83403j44769p6058R2548j95291O6860
$$ 657952 750327 456821 560473 425679 809082 664313 588255 680803 485512 552372
17099E52372J63516R4742j17662j06678N32807N0160D66065K29095M6797A18599
$$ 552372 715888 810630 692968 586290 1119097 1169257 466065 695160 741957 118599
17088E73676J53950k67826o3396J46700K24956A89306P23682k69028j91626J84219
$$ 573676 727626 459800 396404 543104 768060 189306 912988 643960 452334 636553
17078F36553J2464K56793C69087L63166j5440j21160o5172J38419k26426B15977
$$ 636553 649017 905810 369087 732253 716813 595653 530481 668900 442474 215977
17067E42440J5014K26036k3588J1571j30594J93416q3127J48108k23039N1233
$$ 542440 557454 783490 759902 771473 640879 834295 751168 899276 676237 727470
17057G27470J94354J7494j06455j60348M92777m12631L40250j90644l70493M15472
$$ 727470 921824 939318 832863 672515 1165292 752661 1092911 902267 531774 947246
17047I47246k0865j69899N5159L678J12827N8585j84137j61180j28658J73814
$$ 947246 926381 756482 811641 815319 928146 986731 802594 641414 512756 686570
17037F86570K95324j17663J00521J5460j79466L18919k21794n8584P2555L47969
$$ 686570 981894 864231 964752 980212 800746 1119665 897871 839287 911842 1259811
17027A259811l70032J56034J3327j41610q2434K11292n5693j32592J88423K3969
$$ 1259811 889779 1045813 1059140 917530 835096 1046388 990695 858103 1046526 1070495
17017A070495l55880M00859k76483j05757K07302L0685k40979j6947J49329N4095
$$ 1070495 714615 1115474 838991 733234 940536 971221 730242 713295 862624 916719
17007I16719l1858L68698P4741j78432m47892K20794K00612K50427j74468o8003
$$ 916719 884861 1253559 1328300 1149868 701976 922770 1123382 1373809 1199341 1131338
16997A131338j17601J78407j56190L16274k22492J63619l59310K31166P1613L8
$$ 1131338 1013737 1192144 1035954 1352228 1129736 1293355 934045 1165211 1236824 1236862
16987A236862K48280k81868L40477l41893K3441j4716L14619k53623O4809p341
$$ 1236862 1485142 1203274 1543751 1201858 1225299 1210583 1525202 1271579 1336388 1329047
16977A329047J94746k62313K29159m11404L55950o8552K2653j66893L17188P1146
$$ 1329047 1523793 1261480 1490639 1079235 1435185 1366633 1389286 1222393 1539581 1610727
16967A610727m41737K11715K7390J46434j46679J70296j28248p7327J34913K23365
$$ 1610727 1168990 1380705 1408095 1554529 1407850 1578146 1449898 1372571 1507484 1730849
16957A730849l59980N1142O9058K19879m15137M52951k88233J77846p23m70260
$$ 1730849 1370869 1422011 1491069 1710948 1295811 1748762 1460529 1638375 1637652 1167392
16947A167392L41575K75077j1731J6824m9746J972m72153K25313L61029K03490
$$ 1167392 1508967 1784044 1772313 1789137 1739391 1741363 1269210 1494523 1855552 2059042
16937B059042m44294J74146j03128Q0807K50594J30595m53891M5032K26906p8087
$$ 2059042 1614748 1788894 1685766 1766573 2017167 2147762 1693871 1738903 1965809 1887722
16927A887722J71023k35598L96868m95783K94438j2922l3107j16083J62362J01243
$$ 1887722 2058745 1823147 2220015 1724232 2018670 2005748 1972641 1856558 2018920 2120163
16917B120163q0257J14251N8811J54798J14408n63110J53141M19734k84599L09703
$$ 2120163 2039906 2154157 2212968 2367766 2482174 1919064 2072205 2491939 2207340 2517043
16907B517043j2844o971j12152R3005k78914P33638o26799L16530k05598J38528
$$ 2517043 2504199 2497228 2385076 2478081 2199167 2932805 2306006 2622536 2416938 2555466
16897B555466M7534R3817Q4493K6912j88442O03367l44203J72349l37377K21965
$$ 2555466 2603000 2696817 2781310 2808222 2619780 3223147 2878944 3051293 2713916 2935881
16887B935881M44923m04975j54616J03785J5035K28321o5714j22563N63390l3807
$$ 2935881 3380804 2975829 2821213 2924998 2940033 3168354 3102640 2980077 3543467 3509660
16877C509660j72635Q3995K07168j42786j5649J50041j79547L04293k15534L23493
$$ 3509660 3337025 3421020 3628188 3485402 3469753 3619794 3440247 3744540 3529006 3852499
16867C852499r9915L84190P9305l75877J89740K93040l94891K44504P7154r9105
$$ 3852499 3752584 4136774 4216079 3840202 4029942 4322982 3928091 4172595 4249749 4150644
16857D150644J61602j9106J81757J3393L9768M786q320J78583K25935J24459K2264
$$ 4150644 4312246 4293140 4474897 4488290 4528058 4532844 4524524 4703107 4929042 5053501 5075765
16846E075765k09111O81589k81217M8642K16530L46513n42645L54866K0208K40226
$$ 5075765 4866654 5548243 5267026 5315668 5532198 5878711 5336066 5690932 5711140 5951366
16836E951366k60344M10914J94823J26410Q5302J81416n5139K22138k55375R8974
$$ 5951366 5691022 6101936 6296759 6423169 6508471 6689887 6634748 6856886 6601511 6700485
16826F700485L43081K32288j07145J73053K81143J84008m0747r672N27542j52283
$$ 6700485 7043566 7275854 7168709 7341762 7622905 7806913 7766166 7756494 8284036 8131753
16816H131753L68806J62759q7274M48060J97354k31910K23477O25212L1733K11241
$$ 8131753 8500559 8663318 8576044 9024104 9221458 8989548 9213025 9838237 9869970 10081211
16806A0081211J44015O51019j4258J17204M37472R9035M00469k03474N76669J56513
$$ 10081211 10225226 10876245 10861987 10979191 11416663 11515698 11916167 11712693 12289362 12445875
16796A2445875K98282M64076L47621K63841L05859K21179N36122J55867N82397
$$ 12445875 12744157 13208233 13555854 13819695 14125554 14346733 14882855 15038722 15621119
16787A5621119K49738L97117O29786N16121M48169Q89312K07580L23512M00100
$$ 15621119 15870857 16267974 16897760 17413881 17862050 18751362 18958942 19282454 19682554
16778A9682554Q88238N53146O28349L13546P80190R20937N65075J003502M35958
$$ 19682554 20570792 21123938 21752287 22065833 22846023 23766960 24332035 25335537 25771495
16769B5771495J083332P63451R39910Q80139O95317J630179Q81814J242442J130886
$$ 25771495 26854827 27618278 28558188 29438327 30133644 31763823 32645637 33888079 35018965
16760C5018965J241364J222168J584289Q96011J832396J337632J832046J791661
$$ 35018965 36260329 37482497 39066786 39962797 41795193 43132825 44964871 46756532
16752D6756532J596933J988439J979847J869378K158627K162457K026876K311281
$$ 46756532 48353465 50341904 52321751 54191129 56349756 58512213 60539089 62850370
16744F2850370K734831K495364K558288L015149K035282K700976L200804K781257
$$ 62850370 65585201 68080565 70638853 73654002 75689284 78390260 81591064 84372321
16736H4372321L106295K724901K918083K872744K633314K772050K585426K144408
$$ 84372321 87478616 90203517 93121600 95994344 98627658 101399708 103985134 106129542
16728A06129542K659032J766335J949854J031353J904261P57567M47204J58137
$$ 106129542 108788574 110554909 112504763 113536116 115440377 116197944 116645148 116803285
16720A16803285N93968m76430j363246q35624j213444j808954j871674k045210
$$ 116803285 117397253 116920823 115557577 114721953 113508509 111699555 109827881 107782671
16712A07782671k449370k203942k731151l065141k482083k964397k804068l181832
$$ 107782671 105333301 103129359 100398208 97333067 94850984 91886587 89082519 85900687
16704H5900687k933821l167884k479019l013032k413859k895535k700940k373766
$$ 85900687 82966866 79798982 77319963 74306931 71893072 68997537 66296597 63922831
16696F3922831k200734k472169k424762k363393j906323k418198j306141k001997
$$ 63922831 61722097 59249928 56825166 54461773 52555450 50137252 48831111 46829114
16688D6829114j886255j600340j343944k066517j364331j406808j185829j378805
$$ 46829114 44942859 43342519 41998575 39932058 38567727 37160919 35975090 34596285
16680C4596285j034620j173887j386389r74201o69562j305920r89519n53863j311981
$$ 34596285 33561665 32387778 31001389 30027188 29357626 28051706 27062187 26508324 25196343
16671B5196343n31486p13293p74048p88215m45671r08921p96520m61719o57044
$$ 25196343 24664857 23951564 23177516 22389301 21943630 21034709 20238189 19776470 19119426
16662A9119426m37333l24290q52809n76046k08246m31233n46444k33595r351j005415
$$ 19119426 18682093 18357803 17504994 16928948 16720702 16289469 15743025 15509430 15500079 14494664
16652A4494664n79645k13815j5829l04537m97092j81418o36967l12117l71566
$$ 14494664 13915019 13701204 13685375 13380838 12883746 12702328 12065361 11753244 11381678
16643A1381678N8756l50105l30006J02559o00590j56512l24156k57448P7395n28474
$$ 11381678 11440434 11090329 10760323 10862882 10262292 10105780 9781624 9524176 9601571 9073097
16633I073097j03325k78356L0490n9346n2822m11664j57499l8990l38286m74969
$$ 9073097 8969772 8691416 8721906 8662560 8609738 8198074 8040575 8001585 7663299 7188330
16623G188330M04385n51178k07593J47325l17101J40390m89934m865N5779P7701
$$ 7188330 7592715 7041537 6833944 6981269 6664168 6804558 6314624 6309759 6365538 6443239
16613F443239j70563l7464n05378j69380K95758k99011J4816p5587k92024o6054
$$ 6443239 6272676 6235212 5729834 5560454 5856212 5557201 5572017 5496430 5204406 5138352
16603E138352K4654k18760n9643K62349m32700p0062j30638L92953l00982l493
$$ 5138352 5163006 4944246 4884603 5146952 4714252 4644190 4513552 4906505 4605523 4602030
16593D602030N8825j80297l62938J91072k35566m09641J59450R6141k665l26186
$$ 4602030 4660855 4480558 4117620 4308692 4073126 3663485 3822935 3919076 3916411 3590225
16583C590225N9582K40846k29545j15048J03461k06007L9991j2543k12990K44517
$$ 3590225 3649807 3890653 3661108 3546060 3649521 3443514 3483505 3470962 3257972 3502489
16573C502489k22022j71463j3382J8697J07434k46465K89152j85506j13640k92379
$$ 3502489 3280467 3109004 3095622 3114319 3221753 2975288 3264440 3078934 2965294 2672915
16563B672915L51983R2345k8692j74891K1465j33934l83796K07861j21284j14435
$$ 2672915 3024898 3117243 3088551 2913660 2935125 2801191 2417395 2625256 2503972 2389537
16553B389537J33908j05219J46807L5167m21932L06215k67659K21970j20976L7610
$$ 2389537 2523445 2418226 2565033 2600200 2178268 2484483 2216824 2438794 2317818 2355428
16543B355428j28518k20278J89793J23869N0088K94437p96086L39494k65172J56747
$$ 2355428 2226910 2006632 2196425 2320294 2370382 2664819 1868733 2208227 1943055 2099802
16533B099802L07549j28767m29525M40169k81921l01943q0083K37324Q1276j55370
$$ 2099802 2407351 2278584 1849059 2289228 2007307 1705364 1625281 1862605 1943881 1788511
16523A788511j54237K94655j17033L2679k68684M8582K14493L533l8720j51763
$$ 1788511 1634274 1928929 1811896 1844575 1575891 1624473 1838966 1842499 1803779 1652016
16513A652016k02976L94282m89639K81774L16373n39882J16789m8765n1035m6859
$$ 1652016 1449040 1843322 1353683 1635457 1951830 1411948 1528737 1479972 1428937 1382078
16503A382078J15167J24683m34269L19440K3213K8961j4343j17455l34818J31469
$$ 1382078 1497245 1621928 1187659 1507099 1530312 1559273 1544930 1427475 1092657 1224126
16493A224126Q7298L0893l69954K54315N5730K60436k49029p5777n3656P5416
$$ 1224126 1311424 1342317 972363 1226678 1282408 1542844 1293815 1218038 1164382 1239798
16483A239798J9549P9249m35886J55652j94989J80957m4781J18903L8267k60298
$$ 1239798 1259347 1338596 902710 1058362 863373 1044330 999549 1118452 1156719 896421
16473H96421L08102r2107j04013R5232Q3364j35278O626q2587Q6246J05429k73474
$$ 896421 1204523 1112416 1008403 1103635 1186999 1051721 1058347 975760 1062006 1167435 893961
16462H93961R362M14777m15435N167J55219Q0384l21909J7407O1971j7375K57535
$$ 893961 903323 1318100 902665 907832 1063051 1143435 821526 838933 900904 883529 1141064
16451A141064m07224M51090l64410j4516J70290k93323J95256L96987n33883K72432
$$ 1141064 733840 1184930 820520 806004 976294 682971 878227 1275214 741331 1013763
16441A013763K9909D15927O35020l50766R5865m4595k65001K92311J29149k07812
$$ 1013763 1043672 415927 1050947 700181 796046 751451 486450 778761 907910 700098
16431G00098P7567J04607j6437k99865L41549J8898l18392k28086O85684j14273
$$ 700098 777665 882272 865835 565970 907519 926417 608025 379939 1065623 951350
16421I51350l54438m5990j65896K94490L53407K23819E23868M38985k91823K42730
$$ 951350 596912 550922 385026 679516 1032923 1256742 523868 962853 671030 913760
16411I13760k5415C34434O14935j57282j74424L87583j49752l03044K3162J32862
$$ 913760 888345 334434 949369 792087 617663 1005246 855494 552450 575612 708474
16401G08474j30129K64326o4216l00163K1892j74364K44722B31005K97619J95074
$$ 708474 578345 842671 778455 478292 500184 325820 570542 231005 528624 723698
16391G23698L4559k82286L71272K0994l81956J53099j94535L87508l01601j15941
$$ 723698 758257 475971 847243 868237 486281 639380 444845 832353 530752 414811
16381D14811J04538j73125J31505K54939k73934L41157l14456J39559j03216j31232
$$ 414811 519349 346224 477729 732668 458734 799891 485435 624994 521778 390546
16371C90546k7165J91542P5845C06151L19689m1700j06557K99714k41589k03150
$$ 390546 363381 554923 630768 306151 625840 584140 477583 777297 535708 332558
16361C32558J43558j4133o5350K90944k70397M98704D55015m9950j20084N56309
$$ 332558 476116 461983 396633 687577 417180 915884 455015 405065 284981 841290
16351H41290G1163K46335M4133J06928K7152K17460B14075H7592O10041p2767
$$ 841290 71163 317498 361631 468559 495711 713171 214075 87592 697633 624866
16341F24866L53030C94963j06402j18887K82381j07037L99500l70939K02874J16336
$$ 624866 977896 394963 288561 169674 452055 345018 744518 373579 576453 692789
16331F92789B64289L35771j02744L1271j95969l9528J73898M2286A89534K10129
$$ 692789 264289 600060 497316 528587 332618 293090 466988 509274 189534 399663
16321C99663M0255k8712j33098N9353J87031q1932P0748B03801K07912P4711j67008
$$ 399663 439918 411206 278108 337461 524492 442560 513308 203801 411713 486424 319416
16310C19416J3176A33438K72698L85707m5537B83772J48390q9199m0239A48854
$$ 319416 332592 133438 406136 791843 746306 283772 432162 342963 302724 148854
16299F75448j05255A21783K85386h2957C04572o653o1484A16124M42737A71946
$$ 675448 570193 121783 407169 -82957 304572 297919 236435 116124 558861 171946
16288B12577Q5946J18257C3552J63797F3152L52692j10511J9019Q2897l5811L9829
$$ 212577 298523 416780 33552 197349 63152 415844 305333 324352 407249 371438 411267
16277D11267j92367H6299P23351A36860E2384M3985L86697B27919q3799d3056
$$ 411267 218900 86299 809650 136860 52384 96369 483066 227919 144120 -43056
16266D6883J10366L53543B23268J54563p183A82581N6376M1825I6278K14642e5027
$$ 46883 157249 510792 223268 377831 370648 182581 238957 280782 96278 310920 -55027
16254B80195A34612J0675c4554A11693K41708C5590J62541J06910J50198B26973
$$ 280195 134612 145287 -34554 111693 353401 35590 198131 305041 455239 226973
16243C08953M7870M0787d2162C50165L6404K5956A3073L7513Q7026E6974r862
$$ 308953 356823 397610 -42162 350165 386569 412525 13073 50586 137612 56974 47112
16232D7112b53048B35208D8156N7560N09980k287A38610L15949A793K28318m0610
$$ 47112 -253048 235208 48156 105716 615696 613409 138610 454559 1793 230111 189501
16221A89501B3689L79072j71846n6900l3724L25360B20489J72524b6620C62863
$$ 189501 23689 402761 230915 174015 140291 465651 220489 393013 -26620 362863
16210A78571g5951A27903b4277A86700Q057O3054N5584j08422i6849c7884B26285
$$ 178571 -75951 127903 -24277 186700 194757 257811 313395 204973 -96849 -37884 226285
16198A13743b25898C67151C6445K04937J77848A55447J34777b1351A71932J69467
$$ 113743 -225898 367151 36445 241382 419230 155447 290224 -21351 171932 341399
16188C41399A11391K13909a01173B07414r212P8389G5176N3718k489P9511q6155
$$ 341399 111391 325300 -101173 207414 198202 276591 75176 128894 126405 205916 119761
16177A19761J9768J23547a52904n6367B3294J12085L7248J51157c4723B19395
$$ 119761 139529 263076 -152904 -209271 23294 135379 172627 323784 -34723 219395
16166E3451k2609P1589j7493i8575B73484A06680J40790E4814L1069K26564l6039
$$ 53451 30842 102431 84938 -98575 273484 106680 247470 54814 85883 312447 276408
16155B76408P9489j69728j5394J01050b47894q9591A99583o0700o8923K99318
$$ 276408 355897 186169 170775 271825 -247894 -337485 199583 138883 69960 369278
16145C69278a44605E9895d6947C77197B9778J49864O2335o3011o4258k6543l4284
$$ 369278 -144605 59895 -46947 377197 29778 179642 241977 178966 114708 88165 53881
16134E3881f4920p1473E8007k3724J3790M4380k5390C0188Q0491K5424A0946K71794
$$ 53881 -64920 -136393 58007 34283 48073 92453 67063 30188 110679 136103 10946 282740
16122B82740F8319J5511J58892K52120C6334j8115b6383j91620A62077H982J36987
$$ 282740 68319 83830 242722 494842 36334 18219 -26383 -218003 162077 8982 145969
16111A45969m4614b7713A38945M4156m3969K38336j31172p1755d3638A64180L19003
$$ 145969 101355 -27713 138945 183101 139132 377468 246296 174541 -43638 164180 483183
16100D83183D5236J65394D774K16802A06386J31887c2109A99781d996j33200C76408
$$ 483183 45236 210630 4774 221576 106386 238273 -32109 199781 -4996 -138196 376408
16088d05370B11718b33503g4022A06933a93730A57615J74780H7070R793K40754
$$ -405370 211718 -233503 -74022 106933 -193730 157615 332395 87070 96863 337617
16078C37617I5790B3493J7110K16958A393a44955D9145K98841B7783H979e50200
$$ 337617 95790 23493 40603 257561 1393 -144955 49145 347986 27783 8979 -550200
16066D5158a06829C79268g9777k8252l1823A87252C4763J98708b9745j69560A59402
$$ 45158 -106829 379268 -79777 -108029 -139852 187252 34763 233471 -29745 -199305 159402
16054B58427C2623a27065M3608k29196E7698J25296l783i925j11168A0626a52094
$$ 258427 32623 -127065 -83457 -312653 57698 182994 179211 -9925 -121093 10626 -152094
16042F5717L9284a71304B42599A00348g4922A28665a43051C27003A41910B7573
$$ 65717 105001 -171304 242599 100348 -74922 128665 -143051 327003 141910 27573
16031b7213A43603J09735R7658d9554E8063J6995b2750j30237B71277G8214i6818
$$ -27213 143603 253338 350996 -49554 58063 75058 -22750 -152987 271277 78214 -96818
16019D7980L06894d660G8436C310a51537f9540J7402k1910j122A72167c771C39198
$$ 47980 354874 -4660 78436 3310 -151537 -69540 -52138 -74048 -75170 172167 -3771 339198
16006C1010c74657A35753c52603A49051h8919B25921b77532G6718A552a40585
$$ 31010 -374657 135753 -352603 149051 -88919 225921 -277532 76718 1552 -140585
15995B355L86560A04077a39078A04649O4847G6811K33117J35893L40413j42765
$$ 2355 388915 104077 -139078 104649 169496 76811 309928 445821 786234 643469
15985F43469L13183L81953m52296M94118m95561D07984D0493a87518I6648P4010
$$ 643469 956652 1338605 886309 1380427 884866 407984 40493 -187518 96648 170658
15975A70658a4014C51091j08595b80181G3350K42931B5851b51783q7614A6383
$$ 170658 -14014 351091 242496 -280181 73350 316281 25851 -251783 -339397 16383
15964a76183H4266f582j26671f6436G0164a20587h889A27334b9895A7280R2412
$$ -176183 84266 -6582 -133253 -66436 70164 -120587 -8889 127334 -29895 17280 109692
15953A09692c12289B17010H9174a72191B97019n6341i9327I5279k2110J5976P0777
$$ 109692 -312289 217010 89174 -172191 297019 240678 -99327 95279 73169 89145 159922
15942A59922B6495J87373C4610A5269n429J3608b08920Q4743j19176g3506n8852
$$ 159922 26495 213868 34610 15269 9840 23448 -208920 -124177 -243353 -73506 -132358
15931a32358j14482A32345J93746g0231a7731O886j41993C0373a28241k4136A58718
$$ -132358 -246840 132345 326091 -70231 -17731 -10845 -152838 30373 -128241 -152377 158718
15919f3676A68348e9331A77905a20817E1740A0465K34140b40501A0988c9084A00644
$$ -63676 168348 -59331 177905 -120817 51740 10465 244605 -240501 10988 -39084 100644
15907A46777d6389j47793d393A42249L04015A1752b66012D9534J21106a64373
$$ 146777 -46389 -194182 -4393 142249 446264 11752 -266012 49534 170640 -164373
15896e6854k25313h4312p0226C04495a41108C70823G634a28486H9618a5742F060
$$ -56854 -282167 -84312 -154538 304495 -141108 370823 7634 -128486 89618 -15742 6060
15884A28523a04768E0790K63645H5b88571A22622Q6722b62562N8656b7884n610
$$ 128523 -104768 50790 314435 85 -288571 122622 209344 -262562 -203906 -27884 -33494
15873c3494A03529A9346J38864J02375G4424h1297l8698A57914a12375C81197
$$ -33494 103529 19346 158210 260585 74424 -81297 -119995 157914 -112375 381197
15862d3555n6835a5161j59471O0848J2672j93543A01491D8222f6549A39485a70501
$$ -43555 -100390 -15161 -174632 -113784 -101112 -294655 101491 48222 -66549 139485 -170501
15850A54494M7715q2142a321r3860C3831h1344k24824A35565M6488h5024m4578
$$ 154494 202209 120067 -1321 -95181 33831 -81344 -306168 135565 182053 -85024 -129602
15839a29602J2843B6556b22589a9701p0539B37707p7857R7179b37102m3240A78273
$$ -129602 -116759 26556 -222589 -19701 -90240 237707 159850 257029 -237102 -280342 178273
15827c11608e6688B8111j0438L13952a18980B04725C7139Q505J53133r8658a09320
$$ -311608 -56688 28111 17673 331625 -118980 204725 37139 45644 198777 100119 -109320
15815e4245j75031G2015c83583H8244c4308N409A25804b28272q8163J33064B1308
$$ -54245 -229276 72015 -383583 88244 -34308 -28899 125804 -228272 -316435 -183371 21308
15803E7782K0144N8826L0919b92484A49030C2904p124b85033B43290L3157a24753
$$ 57782 77926 136752 167671 -292484 149030 32904 25780 -285033 243290 276447 -124753
15791e9151j43018D86779D2320b15067j83947J61014J10310k4229B3269g7925
$$ -59151 -202169 486779 42320 -215067 -399014 -238000 -127690 -151919 23269 -77925
15780A89126a17050A79929e5564F417b03278l5981F0230d5090j31719n4383A63467
$$ 189126 -117050 179929 -55564 6417 -203278 -239259 60230 -45090 -176809 -231192 163467
15768A70552c33845f4795j73623p8197B35883e4139B57438j04644B6175J43953
$$ 170552 -333845 -64795 -238418 -316615 235883 -54139 257438 152794 26175 170128
15758A70128g2287J0381A5331L6423K98913e3051r1441c3770l87583E6406J80943
$$ 170128 -72287 -61906 15331 51754 350667 -53051 -144492 -33770 -421353 56406 237349
15747B37349a544D4175h4370A00650c97982A18963d17502J77174e7520C03607
$$ 237349 -1544 44175 -84370 100650 -397982 118963 -417502 -240328 -57520 303607
15736f0427K7694E0072R6016b48308B79421a44997A95799m6085p1388J7544J20019
$$ -60427 -32733 50072 146088 -248308 279421 -144997 195799 149714 78326 95870 215889
15725B15889b15597M1677G6294a30145b8714A98642a1469j62831M9848c3390B4509
$$ 215889 -215597 -173920 76294 -130145 -28714 198642 -11469 -174300 -124452 -33390 24509
15713b85580l9509a17199B14746e1246B9668f2151F5493K67088A2493M0044a4394
$$ -285580 -325089 -117199 214746 -51246 29668 -62151 65493 332581 12493 52537 -14394
15701b79207A48264F3611d5962N220k68018B02383a02856M6477n5059A21369b67240
$$ -279207 148264 63611 -45962 -40742 -308760 202383 -102856 -56379 -111438 121369 -267240
15689A58852k1314e76F1610a88442A45369b53390a14252C57674g4908q9317d6710
$$ 158852 137538 -576 61610 -188442 145369 -253390 -114252 357674 -74908 -164225 -46710
15677H3208E82b26552b1109j54778Q3454j91507d4868A28845F2460g5865D70831
$$ 83208 582 -226552 -21109 -175887 -92433 -283940 -44868 128845 62460 -75865 470831
15665b00438D694M5346B4180J7229K66039b99765a10624C1177c84959a90068i533
$$ -200438 4694 50040 24180 41409 307448 -299765 -110624 31177 -384959 -190068 -9533
15653C7054c19910a09665l58800c8893A05927B0192N3503a30676K5990a9247h974
$$ 37054 -319910 -109665 -468465 -38893 105927 20192 73695 -130676 -104686 -19247 -8974
15641b07636M4582D9950k2163e3366p8677j60742a30571c4727B8783i1099g064
$$ -207636 -163054 49950 27787 -53366 -132043 -292785 -130571 -34727 28783 -91099 -7064
15629a37718a5028P095A4803b1973q7824A61149d1270B37939a61036g9407H2013
$$ -137718 -15028 -7933 14803 -21973 -109797 161149 -41270 237939 -161036 -79407 82013
15617b90238A11698M194d00335J05083a25214D03261A95795b38298I2385P2750
$$ -290238 111698 115892 -400335 -295252 -125214 403261 195795 -238298 92385 165135
15607A65135a59634k6911H4287e62493A16883j3834a41294D6592J77137a66595
$$ 165135 -159634 -186545 84287 -562493 116883 103049 -141294 46592 223729 -166595
15596B7203a17265F2458a4546A57197b8695a4202k56593a13454n9196D9724J34513
$$ 27203 -117265 62458 -14546 157197 -28695 -14202 -270795 -113454 -172650 49724 184237
15585A84237f4060J8065d159k8551A62000h5093A01197d0568k55779I3565d3560
$$ 184237 -64060 -45995 -4159 -32710 162000 -85093 101197 -40568 -296347 93565 -43560
15573C27599a56120A94396A7823a32638M9517C54850b5602G845J3591a95216B08165
$$ 327599 -156120 194396 17823 -132638 -83121 354850 -25602 7845 21436 -195216 208165
15561B01935c9065A60354a12896m475A59070p6454L8720b02390A96473B4235a00323
$$ 201935 -39065 160354 -112896 -117371 159070 82616 121336 -202390 196473 24235 -100323
15549c57963P0220e1580o1839j82437J24920n7906D0378a69398N3229B05285a02589
$$ -357963 -287743 -51580 -113419 -295856 -170936 -228842 40378 -169398 -116169 205285 -102589
15537a16399i053A86929k0235a05412j52891A2088c15151J31695I5760c6328D03482
$$ -116399 -9053 186929 166694 -105412 -258303 12088 -315151 -183456 95760 -36328 403482
15525A69448b3332A67613J37436H9905g6512p9146E2184M22043G9746K26071g5660
$$ 169448 -23332 167613 305049 89905 -76512 -155658 52184 474227 79746 305817 -75660
15513B02375F0879J67443c6263j46708c7759D14992j41891B2744J32016A4380
$$ 202375 60879 228322 -36263 -182971 -37759 414992 273101 22744 154760 14380
15502C56124A16161D0273J54557a86412B15153K5030G0507B547K03792a61695
$$ 356124 116161 40273 194830 -186412 215153 240183 70507 2547 206339 -161695
15491G3522b67296B34894a12230k1796D1515Q442J39983h7924E8667a10277A02454
$$ 73522 -267296 234894 -112230 -134026 41515 49957 189940 -87924 58667 -110277 102454
15479C85810G3338P4998D1552K34988K9038L49602N6557K47669m12664O6076k16763
$$ 385810 73338 148336 41552 276540 305578 655180 711737 959406 546742 612818 396055
15468C96055a80000g1335B02260K1059f070b599A02452G492L98842d2818A24462
$$ 396055 -180000 -71335 202260 223319 -6070 -2599 102452 7492 406334 -42818 124462
15456B60503b41543O9490f0253I7119a47319L9407d7205A87420J74839E9767Q6925
$$ 260503 -241543 -172053 -60253 97119 -147319 -107912 -47205 187420 362259 59767 146692
15445A46692d723C77810C4548L19927Q42767R4862j69656l54831j05968k66513
$$ 146692 -4723 377810 34548 354475 1197242 1292104 1122448 767617 661649 395136
15435C95136A01356b94196A99365O3902i3620E95574a3813A19724b52751A18972
$$ 395136 101356 -294196 199365 263267 -93620 595574 -13813 119724 -252751 118972
15424i2914c7369G5123K07620A089R2916K65465j08426b0852B08543a87294B21010
$$ -92914 -37369 75123 282743 1089 94005 359470 251044 -20852 208543 -187294 221010
15412e9945N915A35861K2923b46804A10768c4912A72152J60800a9131E7856J7723
$$ -59945 -54030 135861 158784 -246804 110768 -34912 172152 332952 -19131 57856 75579
15401G5579J4596J0072a23993H8932a12117j23148A47868j8264b59664A57539
$$ 75579 90175 100247 -123993 88932 -112117 -235265 147868 129604 -259664 157539
15390A30650Q9338b63146B73185E9704g6302C8480a68438G8934a14813A36560
$$ 130650 219988 -263146 273185 59704 -76302 38480 -168438 78934 -114813 136560
15379A3925L1045J47776J32728j42232e5922C43420A13071L03553A80711o99L1153
$$ 13925 44970 192746 325474 183242 -55922 343420 113071 416624 180711 180012 211165
15368B11165e5245D9752a16224G6913K02962c6810C59608a18403B91730Q6499
$$ 211165 -55245 49752 -116224 76913 279875 -36810 359608 -118403 291730 378229
15358C78229J4387L6235A56973p8451L82592B03094p6917b59566g65k345n7088
$$ 378229 392616 428851 156973 78522 461114 203094 126177 -259566 -765 -3110 -60198
15347f0198A06778e9519A50377K94270j48630L5918o4840M182A13694A3911K04362
$$ -60198 106778 -59519 150377 444647 296017 331935 267095 271277 113694 13911 218273
15336B18273d98380A81994K6498J58785C2383K47979M3789J39398j30524j19396
$$ 218273 -498380 181994 208492 367277 32383 280362 324151 463549 333025 213629
15326B13629K3609M02190k34937I6797Q4342J94313E5570M3135C9446a34708B65939
$$ 213629 237238 639428 404491 96797 181139 375452 55570 98705 39446 -134708 265939
15314h0870H3574a47715B1183L05492O447n2006n0544l2181c4524D8924J31787
$$ -80870 83574 -147715 21183 326675 333122 281116 230572 198391 -34524 48924 180711
15303A80711O3221a39958A15834K93360j65898c45539A95684g5672H4072b00828
$$ 180711 243932 -139958 115834 409194 243296 -345539 195684 -75672 84072 -200828
15292D2375P7491C2755J79499d5434J8531B87117l5066l6418c10052c7687m0951
$$ 42375 119866 32755 212254 -45434 -26903 287117 252051 215633 -310052 -37687 -78638
15281g8638L2903B41705a18106E4323K95926i1038q426M1190C5230b01186G9245
$$ -78638 -45735 241705 -118106 54323 350249 -91038 -99464 -58274 35230 -201186 79245
15269B34430a24303A20001K8659C0664b47476A45393J20034B3623a09699b029
$$ 234430 -124303 120001 148660 30664 -247476 145393 265427 23623 -109699 -2029
15258A57904K21L6094p0936O4416g0443k2267F8959K14432r5697g812j4768I1314
$$ 157904 158125 194219 123283 187699 -70443 -92710 68959 283391 187694 -7812 -22580 91314
15245A89996k5237L40306p6812L78469J181860l78010J71992o22046C05754I683
$$ 189996 164759 505065 428253 806722 1988582 1610572 1782564 1160518 305754 9683
15234a7986c04A13469b0875a835B94318j7966j14357P2278J56337a81781l8993
$$ -17986 -304 113469 -20875 -1835 294318 276352 161995 234273 390610 -181781 -220774
15223b20774O4749A36642D6699a87696A59671J13708g028l63274C0721b91996
$$ -220774 -156025 136642 46699 -187696 159671 273379 -7028 -370302 30721 -291996
15212C42647i4008A09960J38721A4191a14518j6993q2924B75261g0403B19735
$$ 342647 -94008 109960 248681 14191 -114518 -131511 -214435 275261 -70403 219735
15201c44107B41625j0509m510h8610a8339C22168A07024Q7565a23668k48491B56606
$$ -344107 241625 231116 226606 -88610 -18339 322168 107024 194589 -123668 -372159 256606
15189h8231C6767O5639A0473J99009K21245a48167j02674B686Q4203K72071b3537
$$ -88231 36767 102406 10473 209482 430727 -148167 -250841 2686 86889 358960 -23537
15177b4982E9788J60644K24125K3477A52061J56502a44067D630J57571j7470d6393
$$ -24982 59788 220432 444557 468034 152061 308563 -144067 4630 162201 144731 -46393
15165C15210r3892K2185D7194g9883L3383A00186j6759K0339C7111L46730A39480
$$ 315210 221318 243503 47194 -79883 -46500 100186 83427 103766 37111 383841 139480
15153d46D5663j5266L47791A31147o2194a88972q334B8670K59434f736A10685
$$ -446 45663 30397 378188 131147 68953 -188972 -197306 28670 288104 -6736 110685
15141A37988B2967J98789J32446a35104F5030a54392D50175j99022E6972J83759
$$ 137988 22967 221756 354202 -135104 65030 -154392 450175 251153 56972 240731
15131B40731q6560b41544a0432B5551K96390j02567l5134M0447n0754q4821J40659
$$ 240731 154171 -241544 -10432 25551 321941 219374 184240 224687 173933 89112 229771
15120B29771J70648J6254l1613p3405J20643J50167i1064B78277b98101a03753
$$ 229771 400419 416673 385060 311655 432298 582465 -91064 278277 -298101 -103753
15109A34247b7972B93453h4140A31272F3002L45099A32762l4468l9942J87669
$$ 134247 -27972 293453 -84140 131272 63002 408101 132762 98294 58352 246021
15099B46021r0644K48751A90266J43682j48007o3019R1375N4643B0264K25260
$$ 246021 155377 404128 190266 333948 185941 122922 214297 268940 20264 245524
15089B45524j14985O8864D8985J01223B3293c3984A38600J32306a24672C06305
$$ 245524 130539 199403 48985 150208 23293 -33984 138600 270906 -124672 306305
15078B23867E0526K85767m7751j10106n0609a72645F7770L99278k28828K66363
$$ 223867 50526 336293 288542 178436 127827 -172645 67770 467048 238220 504583
15068E04583a6340j00637A43787c8635B16778B4277P3352j5468L69972J13221
$$ 504583 -16340 -116977 143787 -38635 216778 24277 97629 82161 452133 565354
15058E65354A75628J15783j6975K35340e011E01044k10370L149N6293j15865K55426
$$ 565354 175628 291411 274436 509776 -5011 501044 290674 293823 350116 234251 489677
15047D89677J06691r3804J9303j65473J16049j94865J59750m0690j36907p4899
$$ 489677 596368 502564 521867 356394 472443 277578 437328 396638 259731 184832
15037A84832K07758r6544O7210n82J22504r6589p6368M80454K55251l81985L5907
$$ 184832 392590 296046 363256 362674 485178 388589 312221 792675 1047926 665941 701848
15026G01848j79514j07798k06280R4621M86893k48559L5561K42440l07997M9519
$$ 701848 522334 414536 208256 302877 789770 541211 576772 819212 511215 560734
15016E60734j50083J01943j74355j65345j7210O61617k43095J61884B59279J3269
$$ 560734 410651 512594 338239 172894 155684 817301 574206 736090 259279 272548
15006B72548K2397j29063K72786B05841M6749L7711Q9532J16995B05741J90793
$$ 272548 294945 165882 438668 205841 252590 290301 379833 496828 205741 396534
14996C96534L27340j37824k07714N2357j13831K72966A64845O7200J48493A25894
$$ 396534 723874 586050 378336 430693 316862 589828 164845 232045 380538 125894
14985C15095N02583r557j86767j03417N93124m9708k11172l31563k04778K98893
$$ 315095 817678 808121 621354 517937 1111061 1061353 850181 518618 313840 612733
14975F12733j05625p022q6259J46299O8585N867J05926C31858E4979J73607K68902
$$ 612733 507108 500086 413827 560126 628711 634578 740504 331858 54979 228586 497488
14964D97488r4598B8050N01908k33112p5086L4432Q2554O9621A28795P5299K70716
$$ 497488 402890 28050 529958 296846 221760 256192 338746 408367 128795 204094 474810
14953D74810j32097j30041L11805D9294L05895p5095K06104k14273l3714K80857
$$ 474810 342713 212672 524477 49294 355189 280094 486198 271925 238211 519068
14943E19068J37431j67996J65091J49499l31186j96958K50123B26570K41658K7706
$$ 519068 656499 488503 653594 803093 471907 274949 525072 226570 468228 495934
14933D95934j90750J68055L56470K78949l071K91782K68958k42969L93100r9722
$$ 495934 305184 473239 829709 1108658 1105587 1397369 1666327 1423358 1816458 1716736
14923A716736n8139L82451n35012K32318p1988J31326K77146J91833K27147m93576
$$ 1716736 1658597 2041048 1506036 1738354 1666366 1797692 2074838 2266671 2493818 2000242
14913B000242n78695j95650j60263J91895k00859m70104J36269A36947K67999
$$ 2000242 1421547 1225897 1065634 1257529 1056670 586566 722835 136947 404946
14904D04946n6570J1042P9180J1937J78638J43292B20065O2329J447K05254k06691
$$ 404946 348376 359418 438598 450535 629173 772465 220065 282394 283841 489095 282404
14893B82404L61431M1653l31744A65076M96773k47616K14823M91426j69232j20824
$$ 282404 643835 685488 353744 165076 661849 414233 629056 1120482 951250 830426
14883H30426N4485R7733l09954L29490m8826j79327o2958P7579l61961n0901p0638
$$ 830426 884911 982644 672690 1002180 953354 774027 711069 788648 426687 375786 305148
14872C05148q6496N59999k97212j8969J24005J73315o0705k6822j36387J90901
$$ 305148 218652 778651 481439 462470 586475 759790 699085 672263 535876 726777
14862G26777N2813l78086A45146L39624j70392J43280j85840L29432n8996k5506
$$ 726777 779590 401504 145146 484770 314378 457658 271818 601250 542254 516748
14852E16748B38351L71101A64201K03740M86957k82491R5021L34435J33498j96427
$$ 516748 238351 609452 164201 367941 854898 572407 667428 1001863 1135361 938934
14842I38934j17455M81565j57702m9700O6843l37894K20789l97682J32217k59128
$$ 938934 821479 1303044 1145342 1095642 1162485 824591 1045380 647698 779915 520787
14832E20787n8258Q1042L0280E7999K47985Q9468L5799L8253Q2733K35159q9993
$$ 520787 462529 543571 573851 57999 305984 395452 431251 469504 552237 787396 697403
14821F97403q0682O684k24983K35841K05522j74524L66232j72778k66984J24581
$$ 697403 616721 623405 398422 634263 839785 665261 1031493 858715 591731 716312
14811G16312J1258N0581j13162k26539L37307J29791J03259J72837k12889k91612
$$ 716312 727570 778151 664989 438450 775757 905548 1008807 1181644 968755 677143
14801F77143K12994q9237k38814j80245M99487l92695k06388J39992J8737j44381
$$ 677143 890137 800900 562086 381841 881328 488633 282245 422237 440974 296593
14791B96593N08011j44922j77110P8749k32796k1271L09876K32943j87557L23024
$$ 296593 804604 659682 482572 561321 328525 307254 617130 850073 662516 985540
14781I85540D21635K51774M783K74101k77826Q6081J02658K59792k01110j81057
$$ 985540 421635 673409 678192 952293 674467 760548 863206 1122998 921888 740831
14771G40831l47087O3943L84164j2172C68465M78724l52935K79682k56806J85265
$$ 740831 393744 457687 841851 829679 368465 847189 494254 773936 517130 702395
14761G02395B68134L49583B78847K85304O1360o154j02360K45218l40494L32797
$$ 702395 268134 617717 278847 564151 625511 619357 516997 762215 421721 754518
14751G54518k82392J21584k51352L06388J99966j74081m2156m9770R5250k66931
$$ 754518 472126 593710 342358 648746 848712 674631 632475 582705 677955 411024
14741D11024M51525J17136j23777m21845L66216k74076K68670p6527K58517o5184
$$ 411024 862549 979685 855908 434063 800279 526203 794873 718346 976863 911679
14731I11679K73789L1596K04167M20671K00279l17414P0533K39513p09126m74804
$$ 911679 1185468 1217064 1421231 1841902 2042181 1724767 1795300 2034813 1325687 850883
14721H50883K97513k78432Q8165j67618L04692j62208r7731j9196J4676j27354
$$ 850883 1148396 869964 958129 790511 1095203 932995 835264 816068 830744 703390
14711G03390k54332O65409l03137N9037p7950P5992K34821J26814j77430P90378
$$ 703390 449058 1114467 811330 870367 792417 868409 1103230 1230044 1052614 1842992
14701A842992j17802p8687J39436N6571n00775q0539j91185l72542M36528k37458
$$ 1842992 1725190 1646503 1785939 1842510 1341735 1261196 1070011 697469 1133997 896539
14691H96539m8508q9115j96326L92071k15499J32019P8158l32088L15529o2449
$$ 896539 848031 758916 562590 954661 739162 871181 949339 617251 932780 870331
14681H70331K46330E20415L68032m350j40943J21691O0607R2802j39238j91516
$$ 870331 1116661 520415 888447 884097 743154 864845 925452 1018254 879016 687500
14671F87500L37739l75795R7457k5797J85048K23953l87939O6394J48030n6432
$$ 687500 1025239 649444 746901 721104 906152 1130105 742166 808560 956590 900158
14661I00158j98055O3685J52947j2505J30511J74806J40666m96118J18523J74468
$$ 900158 702103 765788 918735 906230 1036741 1211547 1352213 856095 974618 1149086
14651A149086K23008l4340k6132j59604j3321m7986k04896m618N18112l49060
$$ 1149086 1372094 1337754 1311622 1152018 1138697 1090711 885815 881197 1399309 1050249
14641A050249j9519k23988J23743J1498N1885K3781L11807k33089l03481K04126
$$ 1050249 1030730 806742 930485 941983 993868 1017649 1329456 1096367 792886 997012
14631I97012J23173J61257k13941k29701N11498j24362L31353l27244j50002M62194
$$ 997012 1120185 1281442 1067501 837800 1349298 1224936 1556289 1229045 1079043 1541237
14621A541237m47777j36101K05757O1181L41600l80252L18951k64574j79492J74549
$$ 1541237 1093460 957359 1163116 1224297 1565897 1185645 1504596 1240022 1060530 1235079
14611A235079r2561R9185q9052j80327J14930J05673L00595j62187R5562l81488
$$ 1235079 1142518 1241703 1152651 972324 1087254 1192927 1493522 1331335 1426897 1045409
14601A045409K46999K43837J24740k39646K80247k60313k3020j48543K81019q8110
$$ 1045409 1292408 1536245 1660985 1421339 1701586 1441273 1418253 1269710 1550729 1462619
14591A462619l30009L06477o2516K85086p6873j6184n6270J88120k28435L50232
$$ 1462619 1132610 1439087 1376571 1661657 1584784 1568600 1512330 1700450 1472015 1822247
14581A822247k07273j8284M5925j14566L87898m5854j37326P9729k33211L93081
$$ 1822247 1614974 1596690 1642615 1528049 1915947 1870093 1732767 1812496 1579285 1972366
14571A972366r6774N1342K39303j84861j0484R4913k44994K18768o5301L26031
$$ 1972366 1875592 1926934 2166237 1981376 1970892 2065805 1820811 2039579 1974278 2300309
14561B300309p8496J3332K11306P4899r560J27018J87842K00875K6321M93807
$$ 2300309 2221813 2235145 2446451 2521350 2511790 2638808 2826650 3027525 3053846 3547653
14551C547653J055063Q65353K136845L775788Q026234J8967685Q59614A7270513
$$ 3547653 4602716 5468069 7604914 11380702 19406936 38374621 39234235 17270513
14542F841504C027592p22687j25193L1008R49356J847859j523308j232708n51443
$$ 6841504 3027592 2304905 2179712 2210720 3160076 5007935 3484627 2251919 1700476
14533A700476R8852K38975j98221K6955n868j0500m5807K03419K6047k7934L1785
$$ 1700476 1799328 2038303 1840082 1867037 1861169 1850669 1804862 2008281 2034328 2006394 2038179
14522B038179Q6203m6691J83137k0839l7761J23299J76504k23178n2177K09287
$$ 2038179 2124382 2077691 2260828 2239989 2202228 2325527 2502031 2278853 2226676 2435963
14512B435963J60157m75684N12788q3393j32412K24475n831k1544m4153K0037
$$ 2435963 2596120 2120436 2633224 2549831 2417419 2641894 2636063 2614519 2570366 2590403
14502B590403m3323J17182J54765l67853K44801Q7267j81151j20280N28746n44136
$$ 2590403 2547080 2664262 2819027 2451174 2695975 2783242 2602091 2481811 3010557 2466421
14492B466421L08480j09326M73378K9002K8325k03525P621k58741J93405k07506
$$ 2466421 2774901 2665575 3138953 3167955 3196280 2992755 3000376 2741635 2935040 2727534
14482B727534L24477K11476k92522L43993o0530J10449l1883J39262k06779J52539
$$ 2727534 3052011 3263487 2970965 3314958 3254428 3364877 3332994 3472256 3265477 3418016
14472C418016p796P8673R8169O3144l29005N26669R3703J93293l02323J86023
$$ 3418016 3410220 3488893 3587062 3650206 3321201 3847870 3941573 4134866 3832543 4018566
14462D018566j86173J11339J29174l64989L31311j69649M84650l1313M3331j04359
$$ 4018566 3832393 3943732 4072906 3707917 4039228 3869579 4354229 4322916 4366247 4261888
14452D261888K24634k17637j13641O13944l85113L69672o9820J30720K32660k2084
$$ 4261888 4486522 4268885 4155244 4769188 4384075 4753747 4683927 4814647 5047307 5025223
14442E025223p4881K05034O6312J84821j39166J68956k30743L37263K42166m30908
$$ 5025223 4950342 5155376 5221688 5406509 5267343 5436299 5205556 5542819 5784985 5354077
14432E354077J18213J22023K80960j9625N1998Q9880p5918N67339n8506J16706
$$ 5354077 5472290 5594313 5875273 5855648 5907646 5997526 5921608 6488947 6430441 6547147
14422F547147J46232k1710J53355Q38265k82050J03462l67813J43383l5748R4518
$$ 6547147 6693379 6671669 6825024 7663289 7381239 7484701 7116888 7260271 7224523 7319041
14412G319041K86848L30608n57480N38450M27648j14314o0681M20045L72583P5522
$$ 7319041 7605889 7936497 7379017 7917467 8345115 8230801 8170120 8590165 8962748 9038270
14402I038270l92327O12842m86569K07369L48910J31888O6357J70058O1355K27472
$$ 9038270 8645943 9258785 8772216 8979585 9328495 9460383 9526740 9696798 9758153 9985625
14392I985625K46378J6767K67293J48307M54573q5087K22111N24781R5378L40041
$$ 9985625 10232003 10248770 10516063 10664370 11118943 11033856 11255967 11780748 11876126 12216167
14382A2216167N75L42209M15319o926J88119P8499K28280O76551j79372J30010
$$ 12216167 12216742 12558951 12974270 12967344 13155463 13233962 13462242 14138793 13959421 14089431
14372A4089431L14477M83283L12889M63316N36321J94736j2172Q50749M1114K80469
$$ 14089431 14403908 14887191 15200080 15663396 16199717 16394453 16382281 17233030 17274144 17554613
14362A7554613N10210n2445J43430N35974N51239J63393M40838P29918M30235
$$ 17554613 18064823 18012378 18155808 18691782 19243021 19406414 19847252 20577170 21007405
14353B1007405N26235O55437K01098Q99069K60770Q12274P67101M09411R19901
$$ 21007405 21533640 22189077 22390175 23289244 23550014 24362288 25129389 25538800 26458701
14344B6458701O93565P21962P15420M56489N68295J048843R64845R74851J001945
$$ 26458701 27152266 27874228 28589648 29046137 29614432 30663275 31628120 32602971 33604916
14335C3604916Q78330R44011J098681J239429J493561M59794J597035J312906
$$ 33604916 34483246 35427257 36525938 37765367 39258928 39718722 41315757 42628663
14327D2628663J517774J401564J295820J810488J669617J649049K217667J967628
$$ 42628663 44146437 45548001 46843821 48654309 50323926 51972975 54190642 56158270
14319E6158270J695557K243103K265538K226892K316021K826562K892157K697717
$$ 56158270 57853827 60096930 62362468 64589360 66905381 69731943 72624100 75321817
14311G5321817L358721L249651L631407L922876L750403M269244M667481M604658
$$ 75321817 78680538 81930189 85561596 89484472 93234875 97504119 102171600 106776258
14303A06776258M993396N459825O036691O186901O570488O833608P761253P818355
$$ 106776258 111769654 117229479 123266170 129453071 136023559 142857167 150618420 158436775
14295A58436775Q507535Q988937R950342J0158832J0986152J1639964J2335414
$$ 158436775 166944310 175933247 185883589 196042421 207028573 218668537 231003951
14288B31003951J2802123J4166073J4017696J5543268J5489568J6268796J6605776
$$ 231003951 243806074 257972147 271989843 287533111 303022679 319291475 335897251
14281C35897251J6817118J6899061J6844671J6164263J5912542J4178821J1450117
$$ 335897251 352714369 369613430 386458101 402622364 418534906 432713727 444163844
14274D44163844O042104M264741L442933K755457K025616j915695j574176k919684
$$ 444163844 450205948 454470689 457913622 460669079 462694695 460779000 459204824 456285140
14266D56285140n493697j0723774j2512722j4191492j5785044j6786396j7100750
$$ 456285140 450791443 440067669 427554947 413363455 397578411 380792015 363691265
14259C63691265j7107665j7126747j7088756j5884730j6046254j5135445j4362854
$$ 363691265 346583600 329456853 312368097 296483367 280437113 265301668 250938814
14252B50938814j3540618j3024149j2486597j1353818r399858r528276r891015
$$ 250938814 237398196 224374047 211887450 200533632 191133774 181605498 171714483
14245A71714483q914011p949230p742350p496186o930806o422117n876569n427898
$$ 171714483 162800472 154851242 147108892 139612706 132681900 126259783 120383214 114955316
14237A14955316n261329m967467m819510m425918m163449l918316l070659l447119
$$ 114955316 109693987 104726520 99907010 95481092 91317643 87399327 84328668 80881549
14229H0881549l609253l063296l219145k176592l128252k426250k133690k401060
$$ 80881549 77272296 74209000 70989855 68813263 65685011 63258761 61125071 58724011
14221E8724011k030959j795107j793286k057019j631119k192776r68529j281926
$$ 58724011 56693052 54897945 53104659 51047640 49416521 47223745 46255216 44973290
14213D4973290j300443j619096j225470j615135q09466j337239k48632j118615
$$ 44973290 43672847 42053751 40828281 39213146 38403680 37066441 36817809 35699194
14205C5699194j483477p33570j640813m05267q02480k57090j125501r53549r66975
$$ 35699194 34215717 33482147 31841334 31436067 30633587 30376497 29250996 28297447 27330472
14196B7330472p02155o45082j2438p92163j025404k90378r89174o80330p8209
$$ 27330472 26628317 25983235 25970797 25178634 24153230 23862852 22873678 22193348 22115139
14187B2115139r45913j41867m44070n55437o29198m77316j33283n52469m6552
$$ 22115139 21169226 21027359 20583289 20027852 19398654 18921338 18788055 18235586 18189034
14178A8189034n97701l36811o71193R5114m69827m40755l54085k20855l75777
$$ 18189034 17591333 17254522 16583329 16678443 16208616 15767861 15413776 15192921 14817144
14169A4817144o95989J10876p9121l49136k69154n48354J8044j22030o69736K1373
$$ 14817144 14121155 14232031 14152910 13803774 13534620 12986266 13004310 12882280 12212544 12233917
14159A2233917O879k50911l35891l03707n36614j89576J80162m68023j66876N06021
$$ 12233917 12240796 11989885 11653994 11350287 10813673 10624097 10804259 10336236 10169360 10675381
14149A0675381m12735k93367j03913L20388j076106J22003J0122k27985j4508
$$ 10675381 10262646 9969279 9865366 10185754 9109648 9231651 9241773 9013788 8999280
14140H999280l01134K60448k15216j23872l54000j62777J06346n14118K3992m3533
$$ 8999280 8698146 8958594 8743378 8619506 8265506 8102729 8209075 7694957 7718949 7675416
14130G675416j32673j62391J34664o561l59028M78173l43915k89941k44219j3486
$$ 7675416 7542743 7380352 7515016 7508455 7149427 7627600 7283685 6993744 6749525 6736039
14120F736039J25406k71021K88887p33702K50039m9364j35379k05399o009l7277
$$ 6736039 6861445 6590424 6879311 6145609 6395648 6346284 6210905 6005506 5999497 5962220
14110E962220J99524k55296j72516n8984K25886m86603k52856J35897j5357r5086
$$ 5962220 6161744 5906448 5733932 5674948 5900834 5414231 5161375 5297272 5281915 5186829
14100E186829p4731R7409l12150J30545q2056k83776J74850j6472J6567j33767
$$ 5186829 5112098 5209507 4897357 5027902 4945846 4662070 4836920 4820448 4837015 4703248
14090D703248j09824J37626j84553j94947p6263M6674J16785l10318M22584j89098
$$ 4703248 4593424 4731050 4546497 4351550 4275287 4321961 4438746 4128428 4551012 4361914
14080D361914k56099j60160J13361K47665k37838k09851J71832M6075p57182L92712
$$ 4361914 4105815 3945655 4059016 4306681 4068843 3858992 4030824 4076899 3319717 3712429
14070C712429k11328J76031l72708L82817n6797r7836l12533M81392j88459L0809
$$ 3712429 3501101 3677132 3304424 3687241 3630444 3532608 3220075 3701467 3513008 3543817
14060C543817M9654J282J29754o5592k40996Q3468P762j67450k88363j0305J01456
$$ 3543817 3593471 3594753 3724507 3658915 3417919 3501387 3509149 3341699 3053336 3043031 3144487
14049C144487k54725P9147K69207l52817k76615L27160K54035m01308N2088j63415
$$ 3144487 2889762 2968909 3238116 2885299 2608684 2935844 3189879 2788571 2840659 2677244
14039B677244N1496J76017m73671n5931L37790j84273N054O4239M1312p133R3875
$$ 2677244 2728740 2904757 2431086 2375155 2712945 2528672 2533726 2597965 2639277 2632144 2726019
14028B726019r0961J0856j57942M2702q3267j16469M3074Q3641O6353l92703M7087
$$ 2726019 2635058 2645914 2487972 2530674 2447407 2330938 2374012 2457653 2524006 2131303 2178390
14017B178390l8025K22304m52166L45484j89344n2308J68048n02122K10085L18538
$$ 2178390 2140365 2362669 1910503 2255987 2066643 2014335 2182383 1680261 1890346 2208884
14007B208884j29118k53434L06624l83911N24495k66761k21532K22234o91756
$$ 2208884 2079766 1826332 2132956 1749045 2273540 2006779 1785247 2007481 1315725
13998A315725O42316n01599M44432j15343l17646L67841k60792M05006R10838
$$ 1315725 1958041 1456442 1900874 1785531 1467885 1835726 1574934 1979940 2890778
13989B890778J172379K716984O585021J8075827J1291454j8640084A1223961m529120
$$ 2890778 4063157 6780141 13365162 31440989 42732443 24092359 11223961 6694841
13981F694841j969418q29978r45830L40236k99318l98426j25494l07159L40170
$$ 6694841 4725423 3895445 2949615 3289851 2990533 2592107 2466613 2159454 2499624
13972B499624n5187m93950K21675J827k08616p6200o8618j12359J14735L0119
$$ 2499624 2444437 1950487 2172162 2173989 1965373 1889173 1820555 1708196 1822931 1853050
13962A853050q638L40209k23541k32497J56936j75943N2745J72794l34540k9653
$$ 1853050 1844412 2184621 1961080 1728583 1885519 1709576 1762321 1935115 1600575 1570922
13952A570922j99077N78751m37010M7175j16323r8345K89231k53149L04729P6564
$$ 1570922 1371845 1950596 1513586 1560761 1444438 1346093 1635324 1382175 1686904 1763468
13942A763468l64757j5081O4927K2584j72620m5945N05266k24274J6406j39577
$$ 1763468 1398711 1383630 1448557 1471141 1298521 1252576 1757842 1533568 1549974 1410397
13932A410397J2316J03811l01578J58591J73144j45247k29915P8436K09530k76673
$$ 1410397 1422713 1526524 1224946 1383537 1556681 1411434 1181519 1259955 1469485 1192812
13922A192812K19008j61203p2830N2174J12011j17530k1793N17111n87171p3251
$$ 1192812 1411820 1250617 1177787 1229961 1341972 1224442 1202649 1719760 1132589 1059338
13912A059338p9225K87727L35331m16378K34843M5346m4382m32456J84172r7518
$$ 1059338 980113 1267840 1603171 1186793 1421636 1466982 1422600 990144 1174316 1076798
13902A076798P9606j27162L13054j28035l20378M44464m94227K97107k45268L06958
$$ 1076798 1156404 1029242 1342296 1214261 893883 1338347 844120 1141227 895959 1202917
13892A202917m8442j98402L21677l77368K57012l14674L62180l41508J76134Q7512
$$ 1202917 1154475 956073 1277750 900382 1157394 842720 1204900 863392 1039526 1127038
13882A127038o929j87461K38909P7041l58929K111N732j2994K87398j28750j31478
$$ 1127038 1120109 932648 1171557 1248598 889669 891780 897512 884518 1171916 1043166 911688
13871I11688L31272l36479n1905r1044K54164j25877j5412o3110K67809k67135
$$ 911688 1242960 906481 854576 763532 1017696 891819 876407 813297 1081106 813971
13861H13971L12980m01088J91496P4852j25005k84121R3136J77019j45702J7379
$$ 813971 1126951 725863 917359 992211 867206 583085 676221 853240 707538 724917
13851G24917q4334M22302k88718L8835k20612K29885k39931L97239J20810k84431
$$ 724917 640583 1062885 774167 813002 592390 822275 582344 979583 1100393 815962
13841H15962p979j58998K13270k50569M17542k40356k24026N13388E16460J32220
$$ 815962 807983 648985 862255 611686 1029228 788872 564846 1078234 516460 648680
13831F48680K0973n4973R894M55582L1599l08152k07923j44914L64147q3572k33264
$$ 648680 669653 614680 624574 1080156 1111755 803603 595680 450766 814913 731341 498077
13820D98077L04265J03131j8108k46898J7113K92467o6164j24441k17255K30242
$$ 498077 802342 905473 887365 640467 657580 950047 883883 759442 542187 772429
13810G72429j5821k33254L68686j966l0497n6875p004o1989j39740L4746B62208
$$ 772429 756608 523354 892040 890074 859577 802702 795698 733709 593969 628715 262208
13798G46721C20476M0029N02299k48794M56027m59498J42900C02788L41428J5085
$$ 746721 320476 360505 862804 614010 1070037 610539 753439 302788 644216 659301
13788F59301j6931j71459P2219l3019K23595C19041K03340j396J42241C24641
$$ 659301 642370 470911 543130 510111 733706 319041 522381 520985 663226 324641
13777D43488P9519l9155J61090J03070k54228L559o5992J32648n6240K1755K6275
$$ 443488 523007 483852 644942 748012 493784 497343 431351 563999 507759 529514 555789
13766E55789J92126k4798l29375P9930n150n8074L89504A88395N31298r5079l0989
$$ 555789 747915 723117 393742 473672 468522 410448 799952 188395 719693 624614 593625
13755E93625j79629B02546L29784R4683B13589J38133L54984j14949j8145k84871
$$ 593625 413996 202546 532330 627013 213589 351722 706706 591757 573612 288741
13745B88741K26378K15995M7545j42762k57783J49803j26715j45807K82059j34691
$$ 288741 515119 731114 778659 635897 378114 527917 401202 255395 537454 402763
13735D02763q3368m5707J80764j32757K56723L2004r2839k06823J31148j30605
$$ 402763 319395 273688 454452 321695 578418 610422 517583 310760 441908 311303
13725C11303J71876j58203J76501L2157n1414O513l4181R5051q5902J06187J72963
$$ 311303 483179 324976 501477 533634 482220 488733 454552 549603 463701 569888 742851
13714G42851o9998A83143L93800J96041C73488R8005Q7736k27326o2908O30764
$$ 742851 672853 183143 576943 772984 373488 471493 559229 331903 268995 899759
13704H99759l29279K5872J13617A28793J21327P8419o1573R2087K00657J62419
$$ 899759 570480 596352 709969 128793 250120 328539 266966 359053 559710 722129
13694G22129B24426K42894n2416j26400f2462C78124j58388K13077N490n5050
$$ 722129 224426 467320 414904 288504 -62462 378124 219736 432813 438303 383253
13684C83253j04124K45313r5976q3974L9537M32216l32570B26127O5864j01687
$$ 383253 279129 524442 428466 344492 384029 816245 483675 226127 291991 190304
13674A90304P8912f4055G69093l54044j89632J03061j9655K52778A46047J57867
$$ 190304 269216 -64055 769093 415049 225417 328478 308823 561601 146047 303914
13664C03914p2683J43595j08159L02301J67003k80693m7318A81900J78779L3105
$$ 303914 231231 374826 266667 568968 735971 455278 407960 181900 360679 393784
13654C93784r5508K20538j56442n975J21965j07878Q0839j16661k4112L74621
$$ 393784 298276 518814 362372 356397 478362 370484 451323 334662 310550 685171
13644F85171A16706L37104D3701J12768K02860J00979j27353K48928B23345K39124
$$ 685171 116706 453810 43701 156469 359329 460308 332955 581883 223345 462469
13634D62469k12129O3383D2875L48436N131A56583L73445A56257J61665A32679
$$ 462469 250340 313723 42875 391311 396442 156583 530028 156257 317922 132679
13623F40688j19498l4180A03752K18046J49097A41052a80373A12642K57884J59917
$$ 640688 521190 487010 103752 321798 470895 141052 -180373 112642 370526 530443
13613E30443j91138l0550P2477j11515I7815j3865K13354Q4946K9756j74181j35
$$ 530443 339305 308755 381232 269717 97815 83950 297304 382250 412006 237825 237690
13602B37690G5239R5175n9042L62564B13518a18639I1577L77247k03232M3712
$$ 237690 75239 170414 111372 473936 213518 -118639 91577 468824 265592 309304
13592C09304m9799k1618n157j15588J5454J40009J29813K46650B46800N3896F0883
$$ 309304 259505 237887 232730 117142 132596 272605 402418 649068 246800 300696 60883
13580D60912A64201L23391A15937N42707A3410M41881A67308K48155j97985J81965
$$ 460912 164201 487592 115937 658644 13410 455291 167308 415463 217478 399443
13570C99443Q1528A08330O9657K97532A55129K48566q7482j25129L55852I2528
$$ 399443 480971 108330 177987 475519 155129 403695 316213 191084 546936 92528
13559A77419J32607m9998b50114A41790K30439F8217J31580f4227B86823m6517
$$ 177419 310026 260028 -250114 141790 372229 68217 199797 -64227 286823 240306
13549B40306O0190M0994l5367D7926R5445O0313L9057J09784k6203h4551B91662
$$ 240306 300496 341490 306123 47926 143371 203684 242741 352525 326322 -84551 291662
13537A3871N47749k20947j07571a89143D4982f3555A40289L79883A75616E0000
$$ 13871 561620 340673 233102 -189143 44982 -63555 140289 520172 175616 50000
13526D89499n9307B08444J59760J2269a226E6674J39325J6993P5173D9392B2461
$$ 489499 430192 208444 368204 380473 -1226 56674 195999 212992 288165 49392 22461
13514a20712G7006K17665O7335J21821a11520A87612L1782J07292c2445D3302
$$ -120712 77006 294671 362006 483827 -111520 187612 219394 326686 -32445 43302
13503E00137G4038L13067C1286L16490n9950J33164m3742A87344A1855c6737B30124
$$ 500137 74038 387105 31286 347776 287826 420990 377248 187344 11855 -36737 230124
13491E23406A63296d0143I0224A872K29189J99374n3359d0752G2608J45859a56410
$$ 523406 163296 -40143 90224 1872 231061 430435 377076 -40752 72608 218467 -156410
13479C30919K21084h8744p2468B47500M1270K3426K5356a5451n838B323J87505
$$ 330919 552003 -88744 -161212 247500 288770 312196 337552 -15451 -21289 2323 189828
13468A89828j139J06363a94219I0017B9043J65413P8713L9504j51092M01285g5844
$$ 189828 188689 295052 -194219 90017 29043 194456 273169 312673 161581 562866 -75844
13456C37638j40848J14892P1036p4958P0874o864d7042D12825H073K78192A3427
$$ 337638 196790 311682 382718 307760 378634 371770 -47042 412825 8073 286265 13427
13444a04144I332N77185G2447J56612l0350H1893a05674B36096J65565L3734k03888
$$ -104144 9332 586517 72447 229059 198709 81893 -105674 236096 401661 435395 231507
13433B31507A12053K81994A47630L13757a21213C453g5655C58247C7841b96226
$$ 231507 112053 394047 147630 461387 -121213 3453 -75655 358247 37841 -296226
13422b06213A84328M8401K7374L8484N1078n5418M6329d604A933J75475J43597
$$ -206213 184328 232729 260103 298587 349665 294247 340576 -4604 1933 177408 321005
13411C21005q4423q1517L0578n649q0268m9686K94825j72312k1964J01977j8576
$$ 321005 236582 155065 185643 179994 99726 50040 344865 172553 150589 252566 233990
13400B33990n4386O0236a03626A75802F060K8910i2713l01956a6005g66B07310
$$ 233990 179604 239840 -103626 175802 6060 34970 -92713 -394669 -16005 -766 207310
13388D29158F051K60996j06297a6368B7848L56745g4093m4771D57576I8553i9319
$$ 429158 6051 267047 160750 -16368 27848 384593 -74093 -118864 457576 98553 -99319
13376A58810a22728A76861a14104C77332A41573a56485a945C06722P9032j72812
$$ 158810 -122728 176861 -114104 377332 141573 -156485 -1945 306722 385754 212942
13366B12942J50212j32906a15162A47038J43125B5057L08515R6383j57141k8618
$$ 212942 363154 230248 -115162 147038 290163 25057 333572 429955 272814 244196
13356B44196H7122D699J60559R4326P8479l3505N4841b78957F4193J98213p5460
$$ 244196 87122 4699 165258 259584 338063 304558 359399 -278957 64193 262406 186946
13345A86946L32757A37279E2278g9075C08961J40078A07354J71726p6903N111
$$ 186946 519703 137279 52278 -79075 308961 449039 107354 279080 202177 207288
13335B07288q6940N56435B29994J32966I2128O9251B3706J07938d2993A51666
$$ 207288 120348 676783 229994 362960 92128 161379 23706 131644 -42993 151666
13324D05038Q7316n0669q4314B5402J48596g230B05714r6679J13465k6769r0106
$$ 405038 492354 441685 357371 25402 173998 -7230 205714 109035 222500 195731 105625
13313A05625c03515B22060Q6258j03656N6707j23203j9516Q6467P1792c17036
$$ 105625 -303515 222060 308318 204662 261369 138166 118650 205117 276909 -317036
13302D90540A4874d38174c1170A24940O8912O4689C0488a34733A05282i3901B06570
$$ 490540 14874 -438174 -31170 124940 193852 258541 30488 -134733 105282 -93901 206570
13290G8550c9757C5169e4061l74379a9579B03870K4587C0446n493p183M1808M009
$$ 78550 -39757 35169 -54061 -428440 -19579 203870 228457 30446 24953 17770 59578 63587
13278F3587J90741I0645a5836l5895C61117D6473J08098d518B55445A24782i1604
$$ 63587 254328 90645 -15836 -51731 361117 46473 154571 -4518 255445 124782 -91604
13266F3019J5118e8135E28028A20154K78745e9999B49469a5607o1592q5224A3457
$$ 63019 78137 -58135 528028 120154 398899 -59999 249469 -15607 -77199 -162423 13457
13254D3744f3238I2420h7641B83312H1507a03157a0161A37030K8916a25102n2341
$$ 43744 -63238 92420 -87641 283312 81507 -103157 -10161 137030 165946 -125102 -177443
13243a77443B26354a9741F2461h8319A17278a20431A0892h732A15694l9753j9675
$$ -177443 226354 -19741 62461 -88319 117278 -120431 10892 -8732 115694 75941 56266
13232E6266R31b0449G0354a05679D29060A49138L27774c8408A11755a57389j06654
$$ 56266 57197 -20449 70354 -105679 429060 149138 476912 -38408 111755 -157389 -264043
13221b64043F6278K34460g6460A95140k6554G792K89458E6145J88506R7251c9754
$$ -264043 66278 300738 -76460 195140 168586 7792 297250 56145 244651 341902 -39754
13209A59381J3600m4177J16033R5891A23294J939C1067b33495A15867b3573B29442
$$ 159381 172981 128804 244837 340728 123294 125233 31067 -233495 115867 -23573 229442
13197B39770o1017J53129g3628q2918B07820a16901g136C48074E7063d6144r0209
$$ 239770 178753 331882 -73628 -156546 207820 -116901 -7136 348074 57063 -46144 -136353
13186a36353A12892L596Q9178D695K1281a8604k2514A28073J45896a17853E1872
$$ -136353 112892 116488 205666 4695 25976 -18604 -41118 128073 273969 -117853 51872
13174I6625b31557A25139C3523a018j29584k1938N9457C14070g9543M210b9626
$$ 96625 -231557 125139 33523 -1018 -130602 -152540 -93083 314070 -79543 -75333 -29626
13162B0655L2943a13060B50443P6665b0861r8801I0075I388i3898A5759i3139
$$ 20655 53598 -113060 250443 327108 -20861 -119662 90075 9388 -93898 15759 -93139
13150F3448k5047a5069C93113f6588k9992k27561a00947E24882r7637j0158a2376
$$ 63448 38401 -15069 393113 -66588 -96580 -324141 -100947 524882 427245 417087 -12376
13138A86949a77317A45264B1177q235J37217b4607A01808a6761l95683B56817
$$ 186949 -177317 145264 21177 12942 150159 -24607 101808 -16761 -412444 256817
13127B4760K1621J7782a51585r0012I8173f8187p8599N8186B82690a05186C9039
$$ 24760 46381 64163 -151585 -241597 98173 -68187 -146786 -88600 282690 -105186 39039
13115A65880M5357i0879B2287O0749C7282K0372J27601K6925a52602C8892K273
$$ 165880 211237 -90879 22287 83036 37282 57654 185255 212180 -152602 38892 41165
13104D1165a09424j49436h7019j84263J34965C09812a31798B78371c0713B4688
$$ 41165 -109424 -258860 -87019 -271282 -136317 309812 -131798 278371 -30713 24688
13093G1473a23777j6527A24598k6198N4428b52368C08054j082b46975C1679N1539
$$ 71473 -123777 -140304 124598 98400 152828 -252368 308054 306972 -246975 31679 83218
13082H3218J57149A00979D0130a27249e6134B28144H8344b87252B57767e9425
$$ 83218 240367 100979 40130 -127249 -56134 228144 88344 -287252 257767 -59425
13071B14376o3316a28515A97019D8490Q3667m5056J11591e891A58869f0935F1593
$$ 214376 151060 -128515 197019 48490 132157 87101 198692 -5891 158869 -60935 61593
13059b06359R0065B40766e5257A15115J9938D6090Q9882J10667b60444B82010
$$ -206359 -116294 240766 -55257 115115 135053 46090 135972 246639 -260444 282010
13048A95455H7857M6224J33839a91736B38356J676i2446J8594A12052a23552A16887
$$ 195455 87857 134081 267920 -191736 238356 240032 -92446 -73852 112052 -123552 116887
13036d0056A33654J55815E0252J33266c2851A76963c62461A99970b35516A63784
$$ -40056 133654 289469 50252 183518 -32851 176963 -362461 199970 -235516 163784
13025h4849A32720L6923L9405k4487b52285P1500A76976K2170P0551o6774a67502
$$ -84849 132720 169643 209048 184561 -252285 -180785 176976 199146 269697 202923 -167502
13013e9620a213I6090a61335A58542a66542P8613B1473L3890J78152R9700a39666
$$ -59620 -1213 96090 -161335 158542 -166542 -87929 21473 55363 233515 333215 -139666
13001B35392c80488b4179A99465m5361K3767b24824g526l6055F4161N8618J3108
$$ 235392 -380488 -24179 199465 154104 177871 -224824 -7526 -43581 64161 122779 135887
12990A35887R6798D596a00619B89396g2363j44561a5208o7019l6536e5275B04651
$$ 135887 232685 4596 -100619 289396 -72363 -216924 -15208 -82227 -118763 -55275 204651
12978B97195d6171G6007a39759C1112f153n0706k75895e5853j01151A08853a23090
$$ 297195 -46171 76007 -139759 31112 -6153 -56859 -332754 -55853 -157004 108853 -123090
12966F6007H648d3179C58684C3507b4619I7821l5684Q756J7989l0879a26339M0437
$$ 66007 8648 -43179 358684 33507 -24619 97821 62137 70893 88882 58003 -126339 -85902
12954h5902j70580A29346b10289d8809B3107a76751F1293a63367m8511A9841g0290
$$ -85902 -256482 129346 -210289 -48809 23107 -176751 61293 -163367 -211878 19841 -70290
12942A88694q7817a15078K3932B4695h8040C41710H7160a65043D0992b00672C83346
$$ 188694 100877 -115078 -91146 24695 -88040 341710 87160 -165043 40992 -200672 383346
12930D33426a37110B00734a7411B7184f3210k3028G5876d28037B16039a05303
$$ 433426 -137110 200734 -17411 27184 -63210 -86238 75876 -428037 216039 -105303
12919a23090A99958a0945m8219C12441A41668J569n6997l7464d7828H6596K40769
$$ -123090 199958 -10945 -59164 312441 141668 143237 86240 48776 -47828 86596 327365
12908C27365G3525a64344n1452B91908k9751j13149a24223C28359b89354E4325
$$ 327365 73525 -164344 -215796 291908 262157 149008 -124223 328359 -289354 54325
12897H0173Q3743F1377a13981j78050Q8693J2053c3779j81951a971A54813J33423
$$ 80173 163916 61377 -113981 -292031 -203338 -191285 -33779 -215730 -1971 154813 288236
12886B88236b34014A42100a41592A05131C1832J36038i442E9932J0785J35292
$$ 288236 -234014 142100 -141592 105131 31832 167870 -9442 59932 70717 206009
12876B06009n4629f368b938k24362A82291c6630k79541B8092K20305G0065a20559
$$ 206009 151380 -6368 -2938 -227300 182291 -36630 -316171 28092 248397 70065 -120559
12864a03934A97551b4364A13628l7165b04011j51070A19553b81829i5884B19476
$$ -103934 197551 -24364 113628 76463 -204011 -355081 119553 -281829 -95884 219476
12853D9742N3030B1604i481n5020l24495g832B0367h4682a4753B72170f1620o6778
$$ 49742 102772 21604 -9481 -64501 -388996 -7832 20367 -84682 -14753 272170 -61620 -128398
12841a28398M3564A34742J30245B2812a38610A86269H3157j1956A9708a75014
$$ -128398 -84834 134742 264987 22812 -138610 186269 83157 71201 19708 -175014
12830A09334b82502a16313D5253k375d354n987k34718M1822A50368o1657J44271
$$ 109334 -282502 -116313 45253 42878 -4354 -10341 -245059 -203237 150368 88711 232982
12819B32982k4912c82330B69349j05167a01399A9101J98865F4651R5457B2881
$$ 232982 208070 -382330 269349 164182 -101399 19101 217966 64651 160108 22881
12808c2944A8351h5007K4350m8478C00505b01352F6757b28463e3895A38785K4184
$$ -32944 18351 -85007 -60657 -109135 300505 -201352 66757 -228463 -53895 138785 162969
12797A62969D1909a88414J4674D3688h4930A64113b86283J39001K6467H205R9066
$$ 162969 41909 -188414 -173740 43688 -84930 164113 -286283 -147282 -120815 8205 107271
12786A07271c76069f3737A38489a38106a6772A39277D7395J8001M4228a31035
$$ 107271 -376069 -63737 138489 -138106 -16772 139277 47395 65396 109624 -131035
12775C2121K05307b12991p9801C2666O1531c19122a57795A5462J92707I729b73765
$$ 32121 237428 -212991 -292792 32666 94197 -319122 -157795 15462 208169 9729 -273765
12763A94093I6864Q5798b66490B7363a69425B07326K26147g1447E9886J19816
$$ 194093 96864 182662 -266490 27363 -169425 207326 433473 -71447 59886 179702
12753A79702B2104i9158k50037D0543J28039b1772A29526b07825F2672a12357
$$ 179702 22104 -99158 -349195 40543 168582 -21772 129526 -207825 62672 -112357
12742B56533C1715A5018N963a18614d184k01867f0244p0229A73179G1703J20554
$$ 256533 31715 15018 20981 -118614 -4184 -206051 -60244 -130473 173179 71703 192257
12731A92257I1217b30335K7805I9175h9129l7007H1930D283J84959a00644c1119
$$ 192257 91217 -230335 -202530 99175 -89129 -126136 81930 4283 189242 -100644 -31119
12719A76043b20524I5812j2179J12812C9084f1260E7554e0898r7164B93129e6456
$$ 176043 -220524 95812 83633 196445 39084 -61260 57554 -50898 -148062 293129 -56456
12707B62516B1423R0590p483B0072J52960c79911f0052l44880B16644A2264L92569
$$ 262516 21423 112013 104530 20072 173032 -379911 -60052 -404932 216644 12264 404833
12696D04833c54163A01582b42678k635B50073A3448h182A69913e2932j15493j65467
$$ 404833 -354163 101582 -242678 -245313 250073 13448 -8182 169913 -52932 -168425 -333892
12685c33892A49389f6966C29645b03435d1131A66062O2205j4262K7962f8251A7254
$$ -333892 149389 -66966 329645 -203435 -41131 166062 228267 214005 241967 -68251 17254
12673C76769L3301A45683N0010I4945b36911o3615I3323a44662a0122G6997k9513
$$ 376769 410070 145683 195693 94945 -236911 -300526 93323 -144662 -10122 76997 47484
12662D7484a76078f755G8776a07745A8857a06904C4459K64744G9341d6610B43429
$$ 47484 -176078 -6755 78776 -107745 18857 -106904 34459 299203 79341 -46610 243429
12650B34601G0535B6711N6614a71318i820p777A43934p711J49127b00537J1805
$$ 234601 70535 26711 83325 -171318 -9820 -17597 143934 136223 285350 -200537 -188732
12639a88732G3689K18528b92014C06843A29403i4639C0810J03103J29332f8322
$$ -188732 73689 292217 -292014 306843 129403 -94639 30810 133913 263245 -68322
12628A93207n7669M9056q7242D7353a6760q2715k6697c8806A90917c33431J41553
$$ 193207 135538 184594 97352 47353 -16760 -99475 -126172 -38806 190917 -333431 -191878
12617a91878d3760A31995b69150j8578N6260j5698C36688E444L18870H7628a56591
$$ -191878 -43760 131995 -269150 -287728 -231468 -247166 336688 5444 324314 87628 -156591
12605A79853B041b26500c5856L813O843C62687e7094J4554E3298b00743B0588
$$ 179853 2041 -226500 -35856 -32043 -25200 362687 -57094 -42540 53298 -200743 20588
12593a9846k32524q2138A18640c00320A67335g63j40296d4021j21362F7702K09439
$$ -19846 -252370 -334508 118640 -300320 167335 -763 -141059 -44021 -165383 67702 277141
12582B77141A35092b23802k42743a7000A88537i6077A35522F0779J64985e0591
$$ 277141 135092 -223802 -466545 -17000 188537 -96077 135522 60779 225764 -50591
12571f8765k36254C32629n6978L2329r0294F2835g0466B35487J3499a83173e6271
$$ -68765 -305019 332629 275651 307980 217686 62835 -70466 235487 248986 -183173 -56271
12559d3360C00220a47839A38054a20640E50c1437q5779J3868C5864O2402K64279
$$ -43360 300220 -147839 138054 -120640 550 -31437 -117216 -103348 35864 98266 362545
12548C62545i5596q0713B3803g5743o4043d9775b1801k26492A66829a79546m698
$$ 362545 -95596 -176309 23803 -75743 -139786 -49775 -21801 -248293 166829 -179546 -184244
12537a84244G9105J06765h752j86896e7550b0446G1377a14692A39144F3004b6643
$$ -184244 79105 185870 -8752 -195648 -57550 -20446 71377 -114692 139144 63004 -26643
12525A72055c63491a62076d4009H8510C32K7183b74597J37032D8133M8427b00652
$$ 172055 -363491 -162076 -44009 88510 332 27515 -274597 -137565 48133 96560 -200652
12513b7523C09842b65993f595j33965D29135E6187c69956k696B6370a02228b1377
$$ -27523 309842 -265993 -6595 -140560 429135 56187 -369956 -372652 26370 -102228 -21377
12501c5523A20472b3646A46471a17909o5744c558A20596c95652P5406A64202a89467
$$ -35523 120472 -23646 146471 -117909 -183653 -3558 120596 -395652 -320246 164202 -189467
12489b01694C0516J48964L9846a21584L8732C381c75126d4903l31947b554B10454
$$ -201694 30516 179480 219326 -121584 -82852 3381 -375126 -44903 -376850 -2554 210454
12477H1573N3729D1507e8256r0096H3671K11703b98997n0423h2657K0022j52640
$$ 81573 135302 41507 -58256 -148352 83671 295374 -298997 -349420 -82657 -62635 -215275
12466b15275A2558J18435J17213h0474q8154j1139A53035m0499L2860E0500K87324
$$ -215275 12558 130993 248206 -80474 -168628 -179767 153035 112536 145396 50500 337824
12455C37824B5761b36751r6457a23057B2628b89336l07491A16539B7014K90931
$$ 337824 25761 -236751 -333208 -123057 22628 -289336 -596827 116539 27014 317945
12445C17945a19079q8016A12009J4626E3771a35390A43651b3396A70354b92467
$$ 317945 -119079 -207095 112009 126635 53771 -135390 143651 -23396 170354 -292467
12434A77207K76019F3067K16836K2861d4554H9389Q7614n0372a81786D8700c03850
$$ 177207 453226 63067 279903 302764 -44554 89389 177003 126631 -181786 48700 -303850
12422c8231A19575c82783A69810a9000j98576P8189A04112d4120G7044d9930k11773
$$ -38231 119575 -382783 169810 -19000 -217576 -139387 104112 -44120 77044 -49930 -261703
12411b61703A50190a50415H839e9042j16157M0993L3749l6956a5118j23641d1325
$$ -261703 150190 -150415 8839 -59042 -175199 -134206 -100457 -137413 -15118 -138759 -41325
12399E7397J20206D9788O6620J92384a334r864A20726a47025B5026b84957J38735
$$ 57397 177603 49788 116408 308792 -1334 -11198 120726 -147025 25026 -284957 -146222
12388a46222b4934A54509R8611j17573a55582A84600b54019J20395q5167i3603
$$ -146222 -24934 154509 253120 135547 -155582 184600 -254019 -133624 -218791 -93603
12377b9135B03246d08563A24284K74408B0775a25240L7379l0373B4706J13612
$$ -29135 203246 -408563 124284 398692 20775 -125240 -87861 -118234 24706 138318
12367A38318J06816F0532j1873a08914A01751c25693J25690B737a8599A12397
$$ 138318 245134 60532 48659 -108914 101751 -325693 -200003 2737 -18599 112397
12356B3609J32981D0307l584K01133o9416p8570a26457b8025C4676b99601a18059
$$ 23609 156590 40307 36723 237856 168440 89870 -126457 -28025 34676 -299601 -118059
12344B53518a39390N9701A74219j2977m3920n6448a27625H0906j2297B7646b13238
$$ 253518 -139390 -79689 174219 161242 117322 60874 -127625 80906 68609 27646 -213238
12332I8194J11185l4228b16357j52181A24210J95010B5292J75780N4524R2057
$$ 98194 209379 175151 -216357 -368538 124210 319220 25292 201072 255596 347653
12322C47653j61323J23728J3079p4992b5694B04007q9767E1145L34823i6227A04801
$$ 347653 186330 310058 323137 248145 -25694 204007 114240 51145 385968 -96227 104801
12310D4010b8584N414A41043D5301O0454J44280I1511K66891D8201c7942A58694
$$ 44010 -28584 -23170 141043 45301 105755 250035 91511 358402 48201 -37942 158694
12298g0191G7206L71385k14303G4427a78467A41J3593R2288k7195a32992m2859
$$ -70191 77206 448591 234288 74427 -178467 141 13734 106022 78827 -132992 -175851
12287a75851B15865b60672B83675a29244A55161E8731K07930a82824E1079b14074
$$ -175851 215865 -260672 283675 -129244 155161 58731 266661 -182824 51079 -214074
12276B73529R1741C4913J01849O0653c5761A78467p5863a9539D6088J06086P4228
$$ 273529 365270 34913 136762 197415 -35761 178467 102604 -19539 46088 152174 226402
12265B26402a09694p1486A61097a6684m5896E90788a16835K1782B06185B5203
$$ 226402 -109694 -181180 161097 -16684 -62580 590788 -116835 -95053 206185 25203
12254A94741l1037C0567d2823k35619A79062a28639B1856K5122J5827O7499a7352
$$ 194741 163704 30567 -42823 -278442 179062 -128639 21856 46978 62805 130304 -17352
12242c8902G0457l1701b50040a04210M5045A59120Q3220J25853j66713a2217A66165
$$ -38902 70457 38756 -250040 -104210 -59165 159120 242340 368193 201480 -12217 166165
12230c03288A35980K5104O1793M135A10870K34826r9423H618J51081a25009E26056
$$ -303288 135980 161084 222877 227012 110870 345696 246273 8618 159699 -125009 526056
12218d4293C32928h0764A03783O641L62800a95363B20480L9939g5427B26429a19922
$$ -44293 332928 -80764 103783 110424 473224 -195363 220480 260419 -75427 226429 -119922
12206c786o9683p2470P0987B56442a77303B47117A22652M55972k60596n1783K0797
$$ -3786 -73469 -145939 -74952 256442 -177303 247117 122652 578624 318028 266245 287042
12195B87042A34315J52494K6856c5121A17013d3634B73028o1490C1698d9938B39097
$$ 287042 134315 286809 313665 -35121 117013 -43634 273028 211538 31698 -49938 239097
12183B8903J11177a4322E7487J6920Q4988d9380E04729j80930a96033A45781e3470
$$ 28903 140080 -14322 57487 74407 159395 -49380 504729 323799 -196033 145781 -53470
12171E5982K36324r0944i1056A43280n141n2368K20972J25442j49491B6198K55200
$$ 55982 292306 201362 -91056 143280 138139 85771 306743 432185 282694 26198 281398
12160B81398G8132K49275b48271B38713B5967b3514H5859h2803c2060A12279Q4954
$$ 281398 78132 327407 -248271 238713 25967 -23514 85859 -82803 -32060 112279 197233
12149A97233k2388a78369A45360R936J01768G3793l4158K26366a93749A53326
$$ 197233 174845 -178369 145360 155296 257064 73793 39635 266001 -193749 153326
12138B55172I7247d264j19749F3663J24923n5222i583A95683K6158H5441L5141
$$ 255172 97247 -4264 -124013 63663 188586 133364 -9583 195683 221841 85441 120582
12127A20582a10928A39661F5867J84926p5646J0141J78604a1590q7851K8642D14698
$$ 120582 -110928 139661 65867 250793 175147 185288 363892 -11590 -99441 -70799 414698
12115B90565k6276c3584B45957j02279c34331C0844a47491k07295A9393L40904
$$ 290565 264289 -33584 245957 143678 -334331 30844 -147491 -354786 19393 360297
12105C60297I7082a6343r7833B27451E1666R597d65187e3958C78006a29119B10035
$$ 360297 97082 -16343 -114176 227451 51666 61263 -465187 -53958 378006 -129119 210035
12093E1688K3540R0568a75577C9651c8595F5532i8068K1260B04708J67841I8892
$$ 51688 75228 165796 -175577 39651 -38595 65532 -98068 -76808 204708 372549 98892
12081B31938b04780G6733K1831J94192a51892B53008D4866a23566E3006a76827
$$ 231938 -204780 76733 98564 292756 -151892 253008 44866 -123566 53006 -176827
12070E81964A84757K79440i0774F0406P9987E7913b30130F5681b24778D97549
$$ 581964 184757 464197 -90774 60406 140393 57913 -230130 65681 -224778 497549
12059A5453O5141b25830B0776J83684a84627A9963a93657D4466K51666j31439
$$ 15453 80594 -225830 20776 204460 -184627 19963 -193657 44466 296132 164693
12049A64693D0876m977c0045A14499d13230C0643g467j77056A37831m621M0461
$$ 164693 40876 35899 -30045 114499 -413230 30643 -7467 -184523 137831 133210 173671
12038A73671N7799a54964F3281b25065J05733q767G9540b6716j34536B18914a22420
$$ 173671 231470 -154964 63281 -225065 -119332 -128099 79540 -26716 -161252 218914 -122420
12026c5861J4099E12683b73263D6273J54532r2399R9664p010a35483A60902E3843
$$ -35861 -21762 512683 -273263 46273 200805 108406 208070 201060 -135483 160902 53843
12014D0705a1613o8802A68109m459m6960a07438a2145B43008H858b4378o3577
$$ 40705 -11613 -80415 168109 163650 116690 -107438 -12145 243008 8858 -24378 -87955
12003h7955L114k24964Ic68616d6156B7428a14445j25496B31208a26496o7301
$$ -87955 -84841 -309805 9 -368616 -46156 27428 -114445 -239941 231208 -126496 -193797
11992a93797f9783G2675c11965c7243C8301L3350c93405b4923k7676j8572j4332
$$ -193797 -69783 72675 -311965 -37243 38301 71651 -393405 -24923 -52599 -71171 -85503
11981h5503A64135d11575e2223A76046f5796j3578l4014A19474b38017C78119
$$ -85503 164135 -411575 -52223 176046 -65796 -79374 -113388 119474 -238017 378119
11970A8699c19936F0049J34772l9454a35177o5279H6957a85930h2919C13498I9440
$$ 18699 -319936 60049 194821 155367 -135177 -200456 86957 -185930 -82919 313498 99440
11958a89468k5617R3846o4537F909a49540f5961A80314D4798J90695b7054j07561
$$ -189468 -215085 -121239 -185776 6909 -149540 -65961 180314 44798 235493 -27054 -134615
11947a34615D3018a53355A09083a6038C3782c16164C6776J93457e9911i54l44035
$$ -134615 43018 -153355 109083 -16038 33782 -316164 36776 230233 -59911 -954 -344989
11936c44989E728J38776e5006H9352J25259p7820C3849b88727i1767D8223M7986
$$ -344989 5728 144504 -55006 89352 214611 136791 33849 -288727 -91767 48223 96209
11925I6209a86706h7771J6854d183D0524m017e7390j83232A15519c7656B6545
$$ 96209 -186706 -87771 -70917 -4183 40524 36507 -57390 -240622 115519 -37656 26545
11913C08525a74378I672a16602K7592G8265f5737A227b6746I8775g5093l6588
$$ 308525 -174378 9672 -116602 -89010 78265 -65737 1227 -26746 98775 -75093 -111681
11902a11681A1692f8133b0894C6448b36386A16740a74898j72539A06471b18232
$$ -111681 11692 -68133 -20894 36448 -236386 116740 -174898 -347437 106471 -218232
11891A87089b07791b5209C0482a11952c5064A05156n1191d3676o4977A86820a59919
$$ 187089 -207791 -25209 30482 -111952 -35064 105156 53965 -43676 -108653 186820 -159919
11879b72370J33001B38635M7436a30555A44951a94501d5917k19552J0239A04096
$$ -272370 -139369 238635 286071 -130555 144951 -194501 -45917 -265469 -255230 104096
11868a1339j9548j53271f2111j1820E0610c29676C02515b14900j14071d7235j99854
$$ -11339 -30887 -184158 -62111 -73931 50610 -329676 302515 -214900 -328971 -47235 -247089
11857b47089m20m960a02857N1018n5988m921A00620J79698a84001O3313q1791
$$ -247089 -247509 -252469 -102857 -51839 -107827 -112748 100620 280318 -184001 -120688 -202479
11846b02479o9326A71165a78198c836A08857a56983j0495k9898I8322c19573B10518
$$ -202479 -271805 171165 -178198 -3836 108857 -156983 -167478 -197376 98322 -319573 210518
11834F7852a31247n4637B33694d3944b1214j7886j43054o7523H4212c506j68293
$$ 67852 -131247 -185884 233694 -43944 -21214 -39100 -182154 -249677 84212 -3506 -171799
11823a71799E7366c28362a50310E0676K26692B3288h1790K8429j54123J01917
$$ -171799 57366 -328362 -150310 50676 277368 23288 -81790 -53361 -207484 -105567
11813a05567B16246c3768A48461l56g0187n5035c7626B14200D3217a67104j5564
$$ -105567 216246 -33768 148461 148105 -70187 -125222 -37626 214200 43217 -167104 -182668
11802a82668k25994a29212J1275R720K0827c5537p7092K3976b6727A87447a02743
$$ -182668 -408662 -129212 -117937 -108217 -87390 -35537 -112629 -88653 -26727 187447 -102743
11790H6920a93198a8166r3961B21452a99099E1890N5285d5358j36075Q3131B3431
$$ 86920 -193198 -18166 -112127 221452 -199099 51890 107175 -45358 -181433 -98302 23431
11778A65536L5580a16245r4435J3925A37165a32403f0579G8736d2657D1294K54360
$$ 165536 201116 -116245 -210680 -196755 137165 -132403 -60579 78736 -42657 41294 295654
11767B95654E2411J7175d82424C5991M8478N3923a80556O1719E1871k063f4665
$$ 295654 52411 69586 -482424 35991 84469 138392 -180556 -118837 51871 49808 -64665
11755A77300K1217a81609A95931N5547E3637b01987n3387A38719J15037k0050
$$ 177300 198517 -181609 195931 251478 53637 -201987 -255374 138719 253756 233706
11745B33706c2614A54637C2907A2203g7581D953a90130N8376A88480A4153a37333
$$ 233706 -32614 154637 32907 12203 -77581 4953 -190130 -131754 188480 14153 -137333
11733A2148a52014q428a6693k85884R7988A3751a7245A95413I6171b58261B37494
$$ 12148 -152014 -160442 -16693 -302577 -204589 13751 -17245 195413 96171 -258261 237494
11721a34022Q253A39089C3182c23256O1173I3742g3110C553J12946b25238f3584
$$ -134022 -125769 139089 33182 -323256 -262083 93742 -73110 3553 116499 -225238 -63584
11709A44932a45809B05837a35880D2228b78688B10092b6572C6987J14112b27171
$$ 144932 -145809 205837 -135880 42228 -278688 210092 -26572 36987 151099 -227171
11698b70229c17n0526D1854J29305a19775c787A25804B6834f3643r4155A98238
$$ -270229 -317 -50843 41854 171159 -119775 -3787 125804 26834 -63643 -157798 198238
11686A25262d1989m6182F6752a31690A60649B1011e5742B49583R7682j37106a35209
$$ 125262 -41989 -88171 66752 -131690 160649 21011 -55742 249583 347265 210159 -135209
11674a01945A33340c02392P5649k5022a07110A70704f6323E7197a36676A99194
$$ -101945 133340 -302392 -226743 -251765 -107110 170704 -66323 57197 -136676 199194
11663g1446c3899C79847F2718J72359H0557f0585G1615a79203F9460L6794L1615
$$ -71446 -33899 379847 62718 235077 80557 -60585 71615 -179203 69460 106254 137869
11652A37869a13932j15922k0009d8262o7305c2450D22367G9065K9079a43221O2709
$$ 137869 -113932 -229854 -249863 -48262 -115567 -32450 422367 79065 108144 -143221 -80512
11641h0512p9213k7995A45441C0471d4412n6867K090k43308Q4122C8515b18421
$$ -80512 -159725 -187720 145441 30471 -44412 -101279 -99189 -342497 -258375 38515 -218421
11629h1482F5480J79873b39613a13804l30579b14292I2140F59Q7198a71839B11258
$$ -81482 65480 245353 -239613 -113804 -444383 -214292 92140 659 87857 -171839 211258
11617C6369Q5617k6572c51591h3414c3335k14898h299B8883J07950a68842A14380
$$ 36369 121986 95414 -351591 -83414 -33335 -248233 -8299 28883 136833 -168842 114380
11605h7324C973a40592B11411m5567N0873k5265C8195b82188B49128H9637A9723
$$ -87324 3973 -140592 211411 165844 216717 191452 38195 -282188 249128 89637 19723
11593b99380A85588a3675B10249a9751j24620K401G4396f4869k407l9360A52244
$$ -299380 185588 -13675 210249 -19751 -144371 -141970 74396 -64869 -67276 -106636 152244
11581a99755N514A98375a9281j92707N724B42075a5350B44839m570d171j22198
$$ -199755 -194241 198375 -19281 -211988 -206264 242075 -15350 244839 240269 -4171 -126369
11570a26369A63823o7898a8700D1866B0831a75285r5101a19321b0681k0564B06127
$$ -126369 163823 95925 -18700 41866 20831 -175285 -270386 -119321 -20681 -41245 206127
11558c27815A80783c68584d9651k29896B5115a84996e4874K2644C70008b03269
$$ -327815 180783 -368584 -49651 -279547 25115 -184996 -54874 -32230 370008 -203269
11547A54998K41336G0468J24938B0147J43509k6192d25172a18231G4780j0452
$$ 154998 396334 70468 195406 20147 163656 137464 -425172 -118231 74780 64328
11537F4328b42594b8130p1753k83650i4386A01432a15524j17632C7876K3982J73680
$$ 64328 -242594 -28130 -99883 -383533 -94386 101432 -115524 -233156 37876 61858 235538
11526B35538r2467k0933J38784G8273J2248h2561l9542A18903f6178k5673B9972
$$ 235538 143071 122138 260922 78273 90521 -82561 -122103 118903 -66178 -91851 29972
11514D2457B0206f9749C14273j47096a4828j07130F0962L64049j32378j07153
$$ 42457 20206 -69749 314273 167177 -14828 -121958 60962 425011 292633 185480
11504A85480n1322M8585G5340h5349B918h7153L2420A52177J61358q0153B129
$$ 185480 134158 182743 75340 -85349 2918 -87153 -54733 152177 313535 233382 2129
11492A42049m4334K11849G1646b18714H1622a62010B55748N3338f9739B49633
$$ 142049 97715 309564 71646 -218714 81622 -162010 255748 309086 -69739 249633
11481C25713Q9976b29067A24294J49008b45651B62575d1259A84124q4438c1755
$$ 325713 415689 -229067 124294 273302 -245651 262575 -41259 184124 99686 -31755
11470g7917j15711A76210J60911a65608C22352G3798c6184j36696A13190d0448
$$ -77917 -193628 176210 337121 -165608 322352 73798 -36184 -172880 113190 -40448
11459A1277K631g0078A17025L85933A51917n4404k7850L8002j2519E906K45001
$$ 11277 13908 -70078 117025 502958 151917 97513 69663 107665 95146 5906 250907
11448B50907a50718I3428c420A81460i385o7464l3244K3060C67578j74929O7286
$$ 250907 -150718 93428 -3420 181460 -9385 -76849 -110093 -87033 367578 192649 259935
11437B59935a0824B53085a22761A45288b18705d3653A93397c1850a5770B995J02162
$$ 259935 -10824 253085 -122761 145288 -218705 -43653 193397 -31850 -15770 2995 105157
11426A05157C4844K34303b65396M41a25191i641p5127B3245c76252b781B35597
$$ 105157 34844 269147 -265396 -264955 -125191 -9641 -84768 23245 -376252 -2781 235597
11414E9711b43181A75799c8213I5197a13354B8610M6883d53460C17953e3307A93779
$$ 59711 -243181 175799 -38213 95197 -113354 28610 75493 -453460 317953 -53307 193779
11402A96320a00303A25889P292L8033j8035B5696J32355a55048K2420A07463a76748
$$ 196320 -100303 125889 133181 171214 153179 25696 158051 -155048 -132628 107463 -176748
11390A27009K3252c35209h696o8270c4842G0572a07881b9277n1531D3669a4095
$$ 127009 150261 -335209 -8696 -76966 -34842 70572 -107881 -29277 -80808 43669 -14095
11378A8685a536B86035f0077n5090j36257b4796A10447B3602e5610F3162b57322
$$ 18685 -1536 286035 -60077 -115167 -251424 -24796 110447 23602 -55610 63162 -257322
11366F1304J61067h3744q4282F7215K9635c40275j19041A42286e2338B17536c54
$$ 61304 222371 -83744 -168026 67215 96850 -340275 -459316 142286 -52338 217536 -354
11354C17894I77a46274B38810f4455B07747c53535B27697D945i3064m4902k3073
$$ 317894 977 -146274 238810 -64455 207747 -353535 227697 4945 -93064 -137966 -161039
11343a61039G2367b76245Q546A54971n9822J31235j07368R2765j00100P3514a19646
$$ -161039 72367 -276245 -267699 154971 95149 226384 119016 211781 111681 185195 -119646
11331A78072J11039I5477J91932j28602n7614h0520C78741a68160A69356d7826
$$ 178072 289111 95477 287409 158807 101193 -80520 378741 -168160 169356 -47826
11320b18364B54673K5172M1470c29077B0816K3117b46403e3490j6240j06250m8886
$$ -218364 254673 279845 321315 -329077 20816 43933 -246403 -53490 -69730 -175980 -224866
11309b24866N8783J1138P6155j47024l1151j30167C8723a52121c0114E6448J62381
$$ -224866 -166083 -154945 -78790 -225814 -256965 -387132 38723 -152121 -30114 56448 218829
11298B18829a90054F3521e6974j44698e3918C02432c60698a48748c3591F8531
$$ 218829 -190054 63521 -56974 -201672 -53918 302432 -360698 -148748 -33591 68531
11287b37679A2391c44471A63353c22854B30593F1868a47640k0183L3268M9116
$$ -237679 12391 -344471 163353 -322854 230593 61868 -147640 -167823 -134555 -85439
11277h5439a4392A29068a77309C7563b21426A95487c12977J01178n2936m5286
$$ -85439 -14392 129068 -177309 37563 -221426 195487 -312977 -211799 -264735 -310021
11267c10021M7231J23705B45095p6669P7829A3537a69287l1882d2504l2356k18729
$$ -310021 -262790 -139085 245095 168426 246255 13537 -169287 -201169 -42504 -74860 -293589
11256b93589J28433A31767a03446N0803B26106g6596o5668j25330l4581a01875
$$ -293589 -165156 131767 -103446 -52643 226106 -76596 -142264 -267594 -302175 -101875
11245e9803q6835M4516K464q7652B31286b80861B0663b46712C40295j66054b8991
$$ -59803 -146638 -102122 -99658 -187310 231286 -280861 20663 -246712 340295 174241 -28991
11233a51296d1117E43903A09998R512c36686C4733j4064J71704a14446A22127
$$ -151296 -41117 543903 109998 119510 -336686 34733 20669 192373 -114446 122127
11222e0602A23196J51651c39240A30773h2178a8855l18495a67219o574C690b9520
$$ -50602 123196 274847 -339240 130773 -82178 -18855 -337350 -167219 -173793 3690 -29520
11210G8801B49a10559a2885q0211k06317J03672A77297K694C4465J32784m0380
$$ 78801 249 -110559 -12885 -93096 -299413 -195741 177297 179991 34465 167249 126869
11199A26869n5080a77837B64512C218R1844c1826J2109l7863l468o8714j00819
$$ 126869 71789 -177837 264512 3218 95062 -31826 -19717 -57580 -61048 -129762 -230581
11188b30581b0486m26487J83633f2011k20199e7049m4955N0452A39806B5097a03472
$$ -230581 -20486 -446973 -263340 -62011 -282210 -57049 -102004 -51552 139806 25097 -103472
11176d2555o536j62011N4027E3780d93621A10372J04605j1956a73701B3031c57624
$$ -42555 -49091 -211102 -157075 53780 -493621 110372 214977 203021 -173701 23031 -357624
11164A27859a08913o0607e3160l45337G0309J46452a06228C618J37389c9273C92843
$$ 127859 -108913 -169520 -53160 -398497 70309 216761 -106228 3618 141007 -39273 392843
11152a33936m12639a59973E1859c47742N2427C29460a98376k02920a65392L9700
$$ -133936 -546575 -159973 51859 -347742 -295315 329460 -198376 -401296 -165392 -125692
11142a25692K5560j55645E1335a79023A77316a01463H5725K07J35122a30800B72031
$$ -125692 -100132 -255777 51335 -179023 177316 -101463 85725 85932 221054 -130800 272031
11130a98256a0631A37978L36483a17165A28666N2657F8108k8773f1237B19864
$$ -198256 -10631 137978 474461 -117165 128666 181323 68108 39335 -61237 219864
11119a31710C311e24947A37818b01646k4918D8971J27152e5972j9720B88601A6407
$$ -131710 3311 -524947 137818 -201646 -226564 48971 176123 -55972 -75692 288601 16407
11107a31961I3666O9195J5089b6134B05246i5572B39991P2205b59489a10207C32497
$$ -131961 93666 162861 177950 -26134 205246 -95572 239991 312196 -259489 -110207 332497
11095C04877K00404b6334B20014A162K11588j2706r0965J33630J05228K1822a25931
$$ 304877 505281 -26334 220014 1162 212750 200044 109079 242709 347937 369759 -125931
11083B97043A02399J84900C6777h779B6943J74634Q062n2585K82784d2388D96738
$$ 297043 102399 287299 36777 -8779 26943 201577 209639 157054 439838 -42388 496738
11071A74192D2005L1994L69875A0587M5747L89713A11936J98427n7139K340p6814
$$ 174192 42005 73999 443874 10587 56334 446047 111936 310363 253224 255564 178750
11060A78750D8956P3774K02123L47986l0697B41014J17723K11493O7921j14479
$$ 178750 48956 122730 324853 672839 642142 241014 358737 570230 638151 523672
11050E23672N6347J09839j94476k11957J07960J54612A48972N31199j46771m0860
$$ 523672 580019 689858 495382 283425 391385 545997 148972 680171 533400 492540
11040D92540L83239k80705O2297J67601k49353P0890B99362J75609J0216Q8115
$$ 492540 875779 595074 657371 824972 575619 646509 299362 474971 485187 573302
11030E73302k22235K26555r4795M46363l96643J82681A23519J78491J56548J48169
$$ 573302 351067 577622 482827 929190 532547 715228 123519 302010 458558 606727
11020F06727K44854D19097N78j74959J23611m7799N04515l13101K36785j47804
$$ 606727 851581 419097 419675 244716 368327 320528 825043 511942 748727 600923
11010F00923j07362o1116D0347L68998j12357J669o8879J21723l9358L29313k50688
$$ 600923 493561 432445 40347 409345 296988 298657 229778 351501 312143 641456 390768
10999C90768J60914k21497n2910J97827Q0333J49364k34626B19322L20799l038
$$ 390768 551682 330185 277275 475102 555435 704799 470173 219322 540121 537083
10989E37083l767K17550C27749K84363L9251j2363O7200Q1943l01372L42895l65336
$$ 537083 533316 750866 327749 612112 651363 639000 706200 788143 486771 829666 464330
10978D64330M78264Q3280k9959K18228L4027K41340K03138L47905Q5903k03685
$$ 464330 942594 1025874 995915 1214143 1248170 1489510 1692648 2040553 2126456 1922771
10968A922771Q922l05435R3017l06652K11104m55115L63184n50094L11917l43307
$$ 1922771 1931693 1626258 1719275 1412623 1623727 1168612 1531796 981702 1293619 950312
10958I50312K09462o0706k3572J3096N9166M54156j27650j23610n11156j08638
$$ 950312 1159774 1099068 1075496 1088592 1147758 1601914 1474264 1350654 839498 730860
10948G30860j70774L76154k01744l37124J92897k55794O2943A52577j1635D3409
$$ 730860 560086 936240 734496 397372 590269 334475 397418 152577 140942 43409
10937C77047A05340c6333j10675A16064J06621b92018a4411C49814g7167j70579
$$ 377047 105340 -36333 -147008 116064 222685 -292018 -14411 349814 -77167 -247746
10927b47746A95641a11222j13400f9486o837j41546A14418E2736c37064K4076
$$ -247746 195641 -111222 -224622 -69486 -76323 -217869 114418 52736 -337064 -312988
10917c12988B73224A36040N5266b46246j32755h4323k695C02K82591b06825M5361
$$ -312988 273224 136040 191306 -246246 -379001 -84323 -87018 302 282893 -206825 -161464
10906a61464i631o5785k85661H4239Q8972q1078J28057A4877d3481B21193b60810
$$ -161464 -9631 -75416 -361077 84239 173211 92133 220190 14877 -43481 221193 -260810
10894g9971j708E4063A8241f5465A0445c43090C2122i594G4278J36440a22410
$$ -79971 -81679 54063 18241 -65465 10445 -343090 32122 -9594 74278 210718 -122410
10882h3489m01549g9366k78029F359d52129b17751r7548A42154d33318c3984k02808
$$ -83489 -485038 -79366 -357395 6359 -452129 -217751 -315299 142154 -433318 -33984 -236792
10871b36792B21376d8717k16805p0293J37265b3645M30D6612g6271j29218j35913
$$ -236792 221376 -48717 -265522 -335815 -198550 -23645 -23215 46612 -76271 -205489 -341402
10860c41402a34316B25489c33580C12979j42172F4828A2794h9995n9267d805j47930
$$ -341402 -134316 225489 -333580 312979 170807 64828 12794 -89995 -149262 -4805 -152735
10849a52735j86271a51307A2976b54367A08519A7140L8626b0957B51517A18657
$$ -152735 -339006 -151307 12976 -254367 108519 17140 55766 -20957 251517 118657
10838B3047i9504A66480a54885l5221h6462A08567a00243B8189e5078j39273D8030
$$ 23047 -99504 166480 -154885 -190106 -86462 108567 -100243 28189 -55078 -194351 48030
10826a07573l5670c0241l22267a02542l3404a3367j58031C1150e2072A5446J02897
$$ -107573 -143243 -30241 -352508 -102542 -135946 -13367 -171398 31150 -52072 15446 118343
10815A18343D69b1294E9111b3420B46080C0484L29182a1002B60102G80b47803
$$ 118343 469 -21294 59111 -23420 246080 30484 359666 -11002 260102 780 -247803
10803c48067R621a44831f703k44562A93088g022j05991A13538b6981k12836I4211
$$ -348067 -338446 -144831 -6703 -251265 193088 -7022 -113013 113538 -26981 -239817 94211
10791B02794b5468k9439m20633A06140i0750A52423D0965Q8921J67094p7779a10885
$$ 202794 -25468 -54907 -475540 106140 -90750 152423 40965 129886 296980 219201 -110885
10779a57016Q223l5473C6645J05962a48031j18655j81026a95623M3595B3042L4532
$$ -157016 -148793 -184266 36645 142607 -148031 -266686 -447712 -195623 -152028 23042 57574
10768E7574A1779a4522F597b35376R9003j26521H9548j1051a76812A69334f3997
$$ 57574 11779 -14522 6597 -235376 -136373 -262894 89548 78497 -176812 169334 -63997
10756f2625B1047i037G5475d08278h0937B4563b81810a21385j34918h41l0432
$$ -62625 21047 -9037 75475 -408278 -80937 24563 -281810 -121385 -256303 -841 -31273
10745c1273C10649b92432A12877m3476k6163L8551c69088K7994J66458n0807h7536
$$ -31273 310649 -292432 112877 69401 43238 81789 -369088 -341094 -174636 -225443 -87536
10733h2674m3304B19282b97809B4568a75545B4454L2814a97587P7684H2840h9297
$$ -82674 -125978 219282 -297809 24568 -175545 24454 57268 -197587 -119903 82840 -89297
10721a0707j55246O1212k17738J15122A76815K16623C467c66482J02790p4651
$$ -10707 -165953 -104741 -322479 -207357 176815 393438 3467 -366482 -263692 -338343
10711c38343a20253n4975g3133N920B15787N5437b15509J4168B29915a76104B07940
$$ -338343 -120253 -175228 -73133 -67213 215787 271224 -215509 -201341 229915 -176104 207940
10699A46324c49775A27769c65124J66387j59913i2151B658g713B9630b74312f5562
$$ 146324 -349775 127769 -365124 -198737 -358650 -92151 2658 -7713 29630 -274312 -65562
10687b53105a09171m1413A93719b69347P5928A12373k7786P7480a5957B00159
$$ -253105 -109171 -150584 193719 -269347 -193419 112373 84587 162067 -15957 200159
10676b85281j05011a68243B53635h637j0471O269k63776H5992a77127o6136A32812
$$ -285281 -390292 -168243 253635 -8637 -19108 -12839 -276615 85992 -177127 -243263 132812
10664F5865K22088b94175a20653j6115m7354Q7839q5974O7004D4943N1314N9473
$$ 65865 287953 -294175 -120653 -136768 -184122 -96283 -182257 -115253 44943 96257 155730
10653A55730e06727D22254j39701b7676r7405C6162e1004A97954i3050J411B25841
$$ 155730 -506727 422254 282553 -27676 -125081 36162 -51004 197954 -93050 -91639 225841
10641a14672j48706Q5317G4130O0574b94299B67391c26286c257F4231C0843J49195
$$ -114672 -263378 -178061 74130 134704 -294299 267391 -326286 -3257 64231 30843 180038
10630A80038l8902a04854j9749j44728A13373a87577A94400b75599m7318A52669
$$ 180038 141136 -104854 -124603 -269331 113373 -187577 194400 -275599 -322917 152669
10619G7192j1341E030d138B18693h9360A60963b57974e4211r7374p0295J424A76316
$$ 77192 65851 5030 -4138 218693 -89360 160963 -257974 -54211 -151585 -221880 -220456 176316
10606A34578b45507R8837j90423E0697a28711j78971A46340a61557a3868A86981
$$ 134578 -245507 -146670 -337093 50697 -128711 -307682 146340 -161557 -13868 186981
10595b9336B59594a70739C50020c57617B1197a39023e2130A33006b62517c5529
$$ -29336 259594 -170739 350020 -357617 21197 -139023 -52130 133006 -262517 -35529
10584b25292g3681k4686e636j98110l9219a20276j11283K4517a01354m6741C8567
$$ -225292 -73681 -98367 -5636 -203746 -242965 -120276 -231559 -207042 -101354 -148095 38567
10572b61875J06611k02308a74245H7795b03800A6789J45887b43599M284d2361
$$ -261875 -155264 -357572 -174245 87795 -203800 16789 162676 -243599 -239315 -42361
10561A92632l2060a79526j7722C65514A17095C0573b22295c189D66589f0338A00605
$$ 192632 160572 -179526 -197248 365514 117095 30573 -222295 -3189 466589 -60338 100605
10549e2209l8949m0124c3842A28355n9151A6289d5227k37785e5441A30451b38175
$$ -52209 -91158 -131282 -33842 128355 69204 16289 -45227 -283012 -55441 130451 -238175
10537a07973m557B5909J45958a6925k9140C11480a55812A48731B2355K09000b03929
$$ -107973 -112530 25909 171867 -16925 -46065 311480 -155812 148731 22355 231355 -203929
10525c49248A38115c0478B45143c7086k2455A78454D9664a12153j32327B21259
$$ -349248 138115 -30478 245143 -37086 -59541 178454 49664 -112153 -244480 221259
10514c39491a65912J6440B2823a79183A2225a45796H0893B5643M7376h0069a4822
$$ -339491 -165912 -149472 22823 -179183 12225 -145796 80893 25643 73019 -80069 -14822
10502a06865m4344q8156B9016L2479b21640L0853I6046a61169G8467d9309J8327
$$ -106865 -151209 -239365 29016 61495 -221640 -190787 96046 -161169 78467 -49309 -30982
10491c0982I1278b21608C19543i1627A15086N4321b55568g7712k42957A03563
$$ -30982 91278 -221608 319543 -91627 115086 169407 -255568 -77712 -320669 103563
10480c32158A22320K64363E7822J63593M8556N8715e229E52107B20393k8925J91990
$$ -332158 122320 386683 57822 221415 269971 328686 -5229 552107 220393 191468 383458
10469C83458a13733j03569B872O1046J1275f1281A17228b04794B07415f6696A80357
$$ 383458 -113733 -217302 2872 63918 75193 -61281 117228 -204794 207415 -66696 180357
10457b08336B26218B6942a24089A81373G8773g3297j70970Q6460j62964g2893
$$ -208336 226218 26942 -124089 181373 78773 -73297 -244267 -157807 -320771 -72893
10446C5513a38792A54080G3527c8756r8757N1592I0614a68401k5482h4549c6707
$$ 35513 -138792 154080 73527 -38756 -137513 -85921 90614 -168401 -193883 -84549 -36707
10434a84277A17263b66459o0054D43792d7232A83360a91967b5994l3646f590D6577
$$ -184277 117263 -266459 -326513 443792 -47232 183360 -191967 -25994 -59640 -6590 46577
10422H5312f0228J4807q2477D2834A6578e929k78892A01139m3715b9269k5009
$$ 85312 -60228 -45421 -127898 42834 16578 -5929 -284821 101139 57424 -29269 -54278
10411e4278k19186c244A43828J67092c11692e4096m9062B76623h1238c495A52679
$$ -54278 -273464 -3244 143828 310920 -311692 -54096 -103158 276623 -81238 -3495 152679
10399A57752a66880G0717M8650C9562K84383b30582E0718c2240j04901A41832
$$ 157752 -166880 70717 119367 39562 323945 -230582 50718 -32240 -137141 141832
10388c59790d326k3113F987f467o1351H2698d7482B33581i0578b2193B2447L06845
$$ -359790 -4326 -27439 6987 -6467 -67818 82698 -47482 233581 -90578 -22193 22447 329292
10376C29292c5701A29595K16034A52207K96594a69203B17820a5155B59366L7760
$$ 329292 -35701 129595 345629 152207 448801 -169203 217820 -15155 259366 297126
10366B97126b52851B35712K08236M25280B85893A18245K21090J68139A93558m3117
$$ 297126 -252851 235712 443948 869228 285893 118245 339335 507474 193558 150441
10356A50441r873g8352I7721J53516A01432P3428K5395P938D9826K76334C0989
$$ 150441 140568 -78352 97721 251237 101432 174860 200255 208193 49826 326160 30989
10344B25628n7134k9702b19B08813j2033c415C04040j00947c4985B63092p9578
$$ 225628 168494 138792 -219 208813 196780 -3415 304040 203093 -34985 263092 183514
10333A83514L0175L558C5802J553K80326a48517F9841b6750C95761b18793A30100
$$ 183514 213689 217247 35802 37355 317681 -148517 69841 -26750 395761 -218793 130100
10321B09501a41134K9810C25866E842K56541p9929a9658k63737A71545Q1929C3260
$$ 209501 -141134 -111324 325866 5842 262383 182454 -19658 -283395 171545 253474 33260
10309a00542k37950A25199J04295c57902B24506f3429p1731A49264P4451d06879
$$ -100542 -338492 125199 229494 -357902 224506 -63429 -135160 149264 223715 -406879
10298G7545O6589E4440j1013N4249j5168A4601Q6751e0593C7103A6911a06399
$$ 77545 144134 54440 43427 97676 82508 14601 101352 -50593 37103 16911 -106399
10286H1555K6654K9599J73004h2410j06566f2933b8166e475p8717F6037d5209
$$ 81555 108209 137808 310812 -82410 -188976 -62933 -28166 -5475 -84192 66037 -45209
10274A45795b69006a11627B51851d4719m09523h408k19545D2492c3761j00335
$$ 145795 -269006 -111627 251851 -44719 -454242 -8408 -227953 42492 -33761 -134096
10264a34096k13095A43509l2410K82013a28459k7972A14442i8871j38773I2487
$$ -134096 -347191 143509 111099 393112 -128459 -156431 114442 -98871 -237644 92487
10253f6864A82470F824b65997A84765g5627K3231D5699c39089a7647m5702k36501
$$ -66864 182470 6824 -265997 184765 -75627 -52396 45699 -339089 -17647 -63349 -299850
10242b99850B79842b35281a01366A5180a18539j19621J802m152k4436O295J00869
$$ -299850 279842 -235281 -101366 15180 -118539 -238160 -236358 -240510 -264946 -258651 -157782
10231a57782F2777c55219a65588A80155b86766A95211E2361B1108b74781B25g0889
$$ -157782 62777 -355219 -165588 180155 -286766 195211 52361 21108 -274781 225 -70889
10219C2088i5551L4011A01735a40546k52159a64586f1124k96953J71891L7982
$$ 32088 -95551 -61540 101735 -140546 -392705 -164586 -61124 -358077 -186186 -148204
10209a48204G0613J5123k4976a62401j75594a35496A95503D7695b84023C59329
$$ -148204 70613 85736 60760 -162401 -337995 -135496 195503 47695 -284023 359329
10198b06129P3098l7191F5937e03079H0584a97665g4313j98565E156f844o9276
$$ -206129 -133031 -170222 65937 -503079 80584 -197665 -74313 -272878 5156 -6844 -76120
10187g6120E0593B0364D873K0001b04450M7325j25466A16400e8332E3727c50095
$$ -76120 50593 20364 4873 24874 -204450 -157125 -282591 116400 -58332 53727 -350095
10175A23746D3186D359J06611d19188a53362C9856b772j55200L1096o5575q7057
$$ 123746 43186 4359 110970 -419188 -153362 39856 -2772 -157972 -126876 -192451 -279508
10164b79508G3743g6258k51176A85290b83123e3816j25969A76764J88010a76628
$$ -279508 73743 -76258 -327434 185290 -283123 -53816 -179785 176764 364774 -176628
10153a12169j02633C02423b84940c0547B33890B7278J84131G9119K19825a20848
$$ -112169 -214802 302423 -284940 -30547 233890 27278 211409 79119 298944 -120848
10142a07277j60312J22202n8292f6281l02358l5011E8818b34743q6147i3483A47405
$$ -107277 -267589 -145387 -203679 -66281 -368639 -403650 58818 -234743 -320890 -93483 147405
10130a8088j03118j49024D7188P0887a27193k77216e8284A23799a61521F2200
$$ -18088 -121206 -270230 47188 118075 -127193 -404409 -58284 123799 -161521 62200
10119f137j59202f7002m40153h3643E2537c49523A09759k2165a4315m6565D3727
$$ -6137 -165339 -67002 -507155 -83643 52537 -349523 109759 87594 -14315 -60880 43727
10107d5270j2451F0851a58273j6761b3939C5376N0377P4224a28452c7596j07197
$$ -45270 -57721 60851 -158273 -175034 -23939 35376 85753 159977 -128452 -37596 -144793
10096a44793B03918a77216f7951G8738b05343P8180k0418a7504j62745j21610
$$ -144793 203918 -177216 -67951 78738 -205343 -127163 -147581 -17504 -180249 -301859
10086c01859i0216B4791e3398k33000j18174a20363L2671a4613B47330D3393Q2518
$$ -301859 -90216 24791 -53398 -286398 -404572 -120363 -87692 -14613 247330 43393 125911
10075A25911d96910K44368J24041B96072a08544K3458B916f4080n729G1055b58977
$$ 125911 -496910 -252542 -128501 296072 -108544 -85086 2916 -64080 -69809 71055 -258977
10063G3423j4377b27579C2415f8026D4763l04a47069c7599k229l943j01543A28099
$$ 73423 59046 -227579 32415 -68026 44763 44459 -147069 -37599 -39828 -43771 -145314 128099
10050C7567c9589k78430d515j28393A20821f7337A02411B1721a74409c4180A89431
$$ 37567 -39589 -318019 -4515 -132908 120821 -67337 102411 21721 -174409 -34180 189431
10038a36107K2081l26883f911o0668k87996f2007D823d9632B82723B1134d9962
$$ -136107 -114026 -440909 -6911 -67579 -355575 -62007 4823 -49632 282723 21134 -49962
10026F6723a2041l87648h3110j81328f8197E2238N0336a75529h1487A3307d26372
$$ 66723 -12041 -399689 -83110 -264438 -68197 52238 102574 -175529 -81487 13307 -426372
10014D01220j59364b26737B0431c62887F4188b73501i9722o90j5968j5846d2922
$$ 401220 241856 -226737 20431 -362887 64188 -273501 -99722 -100412 -116380 -132226 -42922
10002E3689d6449B77651I1324i894k356j03651B5658a27906o5639C0636b24733
$$ 53689 -46449 277651 91324 -9894 -12250 -115901 25658 -127906 -193545 30636 -224733
9990A1972d39052a28647k92003a30127L7813k20075E3139c05941J11598G7977
$$ 11972 -439052 -128647 -420650 -130127 -92314 -312389 53139 -305941 -194343 77977
9979g2137D4015b09456J5299i0587j45339M9394B316K93658a76502Q7804r9502
$$ -72137 44015 -209456 -194157 -90587 -235926 -186532 2316 295974 -176502 -88698 -188200
9968a88200A8421a53255N9680k742J0906c7168A6809d75979B32360d9504j07999
$$ -188200 18421 -153255 -93575 -96317 -85411 -37168 16809 -475979 232360 -49504 -157503
9957a57503K2312j7544p0359f8013D329i0987j90118H9626j5219e4143A3324f2630
$$ -157503 -135191 -152735 -223094 -68013 4329 -90987 -281105 89626 74407 -54143 13324 -62630
9944A20506c82007J78981f4247n4245A03192h8024H4938K91979a92104L3910j55026
$$ 120506 -382007 -203026 -64247 -118492 103192 -88024 84938 376917 -192104 -158194 -313220
9933c13220B5027a38401p8067q5887L2533a32631k06285c6927k41033r1958A72371
$$ -313220 25027 -138401 -216468 -302355 -269822 -132631 -338916 -36927 -277960 -369918 172371
9921a64001l7038G0374N4784o0000a28198D1936a83358P1201A16338c86577K7112
$$ -164001 -201039 70374 125158 65158 -128198 41936 -183358 -112157 116338 -386577 -359465
9910c59465A79156a19793n6307j6415A22271f2634J9246i015q5624c1198j20800
$$ -359465 179156 -119793 -176100 -192515 122271 -62634 -43388 -9015 -94639 -31198 -151998
9899a51998q1778A89526b86536A00727D6423D84h7076A14857A1908a21202j00205
$$ -151998 -233776 189526 -286536 100727 46423 484 -87076 114857 11908 -121202 -221407
9888b21407I1559d1499j41556j42128J16232k9669J15723k2431A75282b13803
$$ -221407 91559 -41499 -183055 -325183 -208951 -238620 -122897 -145328 175282 -213803
9877c24990A45778c1712m23964a68302c0911j53453j01131g8815J9363B3169a97441
$$ -324990 145778 -31712 -455676 -168302 -30911 -184364 -285495 -78815 -59452 23169 -197441
9865a18371c4798B08032q4636J2783i3101A19780h2191A14890c9078J4448k00988
$$ -118371 -34798 208032 123396 136179 -93101 119780 -82191 114890 -39078 -24630 -225618
9854b25618a5821A0516b21964A02346d4042j54711H1809b55538B16639a32476
$$ -225618 -15821 10516 -221964 102346 -44042 -198753 81809 -255538 216639 -132476
9843a69684j58868L6604J07118C3881a81988e1972H4467O0669i1506j75586l0827
$$ -169684 -328552 -291948 -184830 33881 -181988 -51972 84467 145136 -91506 -267092 -297919
9832b97919C0778M2048N2161k8371a30384A04828b07928P8638G1134A27J30096
$$ -297919 30778 72826 124987 96616 -130384 104828 -207928 -129290 71134 127 130223
9821A30223f9438A24945b57400D0690R1416m1962a70907g1289B56482a16370C3006
$$ 130223 -69438 124945 -257400 40690 132106 90144 -170907 -71289 256482 -116370 33006
9809a62903G1566a45756E1831c71546J57142a3306A75005K72158a43464k08500
$$ -162903 71566 -145756 51831 -371546 -214404 -13306 175005 447163 -143464 -351964
9799c51964A62608C0059c04072M7513B2306a58584l31197g4718l74424b06517
$$ -351964 162608 30059 -304072 -256559 22306 -158584 -489781 -74718 -449142 -206517
9788a15896b9253A69284a583k7475D5345a58574A67912C5460b06785J258l9778
$$ -115896 -29253 169284 -1583 -29058 45345 -158574 167912 35460 -206785 -205527 -245305
9777b45305p7452l2828J71060a8285p5123j74585B16650n2863d81638A59733C3377
$$ -245305 -322757 -355585 -184525 -18285 -93408 -267993 216650 163787 -481638 159733 33377
9765d0795a9941n443o6357A36814l3438a6966j63702j09234a30176i160m67255
$$ -40795 -19941 -25384 -91741 136814 103376 -16966 -180668 -289902 -130176 -9160 -476415
9754d76415a52387c834l95388a00293k09565f7866k45894l5025A54765b44533
$$ -476415 -152387 -3834 -399222 -100293 -309858 -67866 -313760 -348785 154765 -244533
9743i7961J337B63920B6984a96701e1899C2757c29520A55266c13555A6341N8714
$$ -97961 -96624 263920 26984 -196701 -51899 32757 -329520 155266 -313555 16341 75055
9732G5055K84777A75716o2941h6391n9876P747I7950J68068a85743d8275j17365
$$ 75055 359832 175716 112775 -86391 -146267 -138520 97950 266018 -185743 -48275 -165640
9721a65640D60252A93941q7068d1730A52158a42587F896b57314B33734c24761
$$ -165640 460252 193941 106873 -41730 152158 -142587 6896 -257314 233734 -324761
9710C62818b6437A08276G679a01432A05422P0174H4930g1608j31033d9984l10371
$$ 362818 -26437 108276 7679 -101432 105422 175596 84930 -71608 -202641 -49984 -360355
9699c60355a55066K8221b4964q9417k27556a30160j29737b8595A60439M7662I6182
$$ -360355 -155066 -126845 -24964 -114381 -341937 -130160 -259897 -28595 160439 208101 96182
9687b18250E7243a4014j58032a5349C47481b2670k23638a6117m3910B70078b32653
$$ -218250 57243 -14014 -172046 -15349 347481 -22670 -246308 -16117 -60027 270078 -232653
9675e96563G351K11846l7516b44983d7138A14781h8681A14613c17477A48314a13633
$$ -596563 7351 219197 181681 -244983 -47138 114781 -88681 114613 -317477 148314 -113633
9663c1618k70359a45649C03068B0851a05323j40367E808h8185q2877Q2831A53500
$$ -31618 -301977 -145649 303068 20851 -105323 -245690 5808 -88185 -171062 -88231 153500
9651A65998b05120B41784a34139n4364A14304a53403b2294m3072r425l00962i9611
$$ 165998 -205120 241784 -134139 -188503 114304 -153403 -22294 -65366 -74791 -375753 -99611
9639g24331b36641f2937p7574A08022K06051j22747b42433k10316a91401k8002
$$ -724331 -236641 -62937 -140511 108022 314073 191326 -242433 -452749 -191401 -219403
9629b19403r3344a42623k52191A24184c79645a1211k92472J21461q093A99849
$$ -219403 -312747 -142623 -394814 124184 -379645 -11211 -303683 -182222 -190315 199849
9618a75290r1806J21240N1322A70776H0698K78135f983k5720K426A74745a38824
$$ -175290 -267096 -145856 -94534 170776 80698 358833 -6983 -32703 -30277 174745 -138824
9606b8536e861A47368d5446C52396h6436r6458c8799I5036c57199B57721m5144
$$ -28536 -5861 147368 -45446 352396 -86436 -182894 -38799 95036 -357199 257721 212577
9595B12577a3908l57183B18911e5260r0157j78670B07893f4365a7524C1772R5326
$$ 212577 -13908 -371091 218911 -55260 -145417 -324087 207893 -64365 -17524 31772 127098
9584A27098b32127j01227C8075d47885i1065I5430J25651d8525F0873B8612R70
$$ 127098 -232127 -333354 38075 -447885 -91065 95430 221081 -48525 60873 28612 29582
9573B9582J12216a98747L6027A11842p346b62509B865b53482I3532k7415P6869
$$ 29582 141798 -198747 -162720 111842 104496 -262509 2865 -253482 93532 66117 142986
9562A42986I657J85637i5606B12158B9090b95600d0998j38422a2941j83083H4056
$$ 142986 9657 195294 -95606 212158 29090 -295600 -40998 -179420 -12941 -196024 84056
9550a85619E7259a85113B01736e4958a5443j19131B4859a10551K8168A01210d15729
$$ -185619 57259 -185113 201736 -54958 -15443 -134574 24859 -110551 -82383 101210 -415729
9538b66580l5737A21015B987c3025B69675a42695p232M4381a0814k3305J323k15979
$$ -266580 -302317 121015 2987 -33025 269675 -142695 -149927 -105546 -10814 -34119 -32796 -248775
9526b48775A04266c9348C24696a28313J8026K3759j18977j64741a62169e7856
$$ -248775 104266 -39348 324696 -128313 -110287 -86528 -205505 -370246 -162169 -57856
9515c96475a48848n6016n4065a14453d1061A43710a98802G0695a74720l2935A51722
$$ -396475 -148848 -204864 -258929 -114453 -41061 143710 -198802 70695 -174720 -207655 151722
9503a61562O3852J7754h413j50985j14460E4495a86768k8846J7638Q0956A67638
$$ -161562 -97710 -79956 -8413 -159398 -273858 54495 -186768 -215614 -197976 -117020 167638
9491g014m06862J17481J44357e1821j08994C5722b4144k33982h4822B99254A06251
$$ -7014 -413876 -296395 -152038 -51821 -160815 35722 -24144 -258126 -84822 299254 106251
9479b54819B40679g7427L5233B03303a65274J1640I0317a3744j50574d3802m0463
$$ -254819 240679 -77427 -42194 203303 -165274 -153634 90317 -13744 -164318 -43802 -84265
9468h4265k16190F5186l2186a69725C6630a80901A4549J03554a14417l4261a3804
$$ -84265 -300455 65186 33000 -169725 36630 -180901 14549 118103 -114417 -148678 -13804
9456A69845a7918k20445F493K06593a72047k75115g741G3553a06414j76865b4702
$$ 169845 -17918 -238363 6493 213086 -172047 -447162 -7741 73553 -106414 -283279 -24702
9444C9775K53513j3320c7307B94097a28766j4958A2008K56379D8710B70L5639
$$ 39775 293288 279968 -37307 294097 -128766 -143724 12008 268387 48710 270 35909
9433C5909b58366A64923K4683a03817k05547A73147a39027F8916d921B31248E0116
$$ 35909 -258366 164923 189606 -103817 -309364 173147 -139027 68916 -4921 231248 50116
9421D302J3425d49318C44455c32480A4081J19079K1190g9071O992E0445c9282
$$ 4302 17727 -449318 344455 -332480 14081 133160 154350 -79071 -72079 50445 -39282
9409d80515a66635B21253B6570a13331B1046f3290J6899G5352P3186i0958P433
$$ -480515 -166635 221253 26570 -113331 21046 -63290 -46391 75352 148538 -90958 -83525
9398h3525K8306p0781C29806c0951B6142J8570J72403E4389a17688j7021l0458
$$ -83525 -55219 -126000 329806 -30951 26142 44712 217115 54389 -117688 -134709 -165167
9387a65167I1662Q5901f3850q6497l04456K06525i6130A76066A6848R823b13126
$$ -165167 91662 177563 -63850 -150347 -454803 -248278 -96130 176066 16848 26671 -213126
9375d942H9243a78411d3626p0403j7775B0701a72497K0485A40224a83500H0991
$$ -4942 89243 -178411 -43626 -114029 -131804 20701 -172497 -152012 140224 -183500 80991
9363a76662D365b12141d3712D0439Q8173n9755f7165A91209m6705n815m259a49836
$$ -176662 4365 -212141 -43712 40439 128612 68857 -67165 191209 144504 138689 134430 -149836
9350a43656j46670d3931B79287b02892A89645a77476d206p4709A20561j3397c2183
$$ -143656 -290326 -43931 279287 -202892 189645 -177476 -4206 -78915 120561 107164 -32183
9338a17887A56585B7702c67182C316h7547A49164Q5004d44588J03245i2779l19772
$$ -117887 156585 27702 -367182 3316 -87547 149164 234168 -444588 -341343 -92779 -412551
9327d12551a62300l8883A60156d3099B20029b17877E5332c26011A93101a14712
$$ -412551 -162300 -201183 160156 -43099 220029 -217877 55332 -326011 193101 -114712
9316d45006J83581F3384a86362A66418m4262j0004C4304a40812j35701l3828M4449
$$ -445006 -261425 63384 -186362 166418 122156 112152 34304 -140812 -276513 -310341 -265892
9305b65892n1898Q1106e1534A73267J38358A25116a74014l1382d8711d982m2846
$$ -265892 -317790 -236684 -51534 173267 311625 125116 -174014 -205396 -48711 -4982 -47828
9294d7828b3288j15012B53402c1658A19817d822l69775h9581k09471J09873A00077
$$ -47828 -23288 -138300 253402 -31658 119817 -4822 -374597 -89581 -299052 -189179 100077
9282a199A99314c90113J32120i0144k30324A54730a42539c1842j71055F2009K06005
$$ -1199 199314 -390113 -257993 -90144 -320468 154730 -142539 -31842 -202897 62009 268014
9271B68014B5863a87552R0363j75291B85525q3909b18790M8337A45906a68182
$$ 268014 25863 -187552 -97189 -272480 285525 201616 -218790 -170453 145906 -168182
9260A38462e12615d3843A5846M7463c15874a8479j15731D5847a89123j70922O3420
$$ 138462 -512615 -43843 15846 63309 -315874 -18479 -134210 45847 -189123 -360045 -296625
9249b96625a22282L8082k209A10540B8372i8083j75245A63532j2038c609j47699
$$ -296625 -122282 -84200 -86409 110540 28372 -98083 -273328 163532 151494 -3609 -151308
9238a51308a4385j92426A70172f7930l83913H0589i7240j06210R760A65849b79614
$$ -151308 -14385 -206811 170172 -67930 -451843 80589 -97240 -203450 -193690 165849 -279614
9226I4366c68886A21804a24863J9330A48559N9707a68651F613c3842k36097d6599
$$ 94366 -368886 121804 -124863 -105533 148559 208266 -168651 6613 -33842 -269939 -46599
9214c41339I0778A6046b02664n3530i3815l3203k18037J66700A52508b21685j1597
$$ -341339 90778 16046 -202664 -256194 -93815 -127018 -345055 -178355 152508 -221685 -233282
9203b33282a1420k09361A08279K22765j32281p8495K61841b02595A41188b55632
$$ -233282 -11420 -220781 108279 331044 198763 120268 382109 -202595 141188 -255632
9192d49875B9894b92647O7423a6251p6955A09355b38752l99d6671H8572a29362
$$ -449875 29894 -292647 -225224 -16251 -93206 109355 -238752 -239151 -46671 88572 -129362
9180B32058f563k52365R4584j08395C06236a86069A45156E4100e7097A8660J7611
$$ 232058 -6563 -258928 -164344 -272739 306236 -186069 145156 54100 -57097 18660 36271
9169C6271d8973o8220A09647J88961G5683K49557B4820b45872A85739I2258n232
$$ 36271 -48973 -117193 109647 298608 75683 325240 24820 -245872 185739 92258 87026
9158H7026j7198d82422J37824a331n285k54419c5436F7672K8899J33666k2158
$$ 87026 69828 -482422 -344598 -1331 -6616 -261035 -35436 67672 96571 230237 208079
9147B08079b82168F9066f8608A02961a55301k32250J31232b5512E549a47274N698
$$ 208079 -282168 69066 -68608 102961 -155301 -387551 -256319 -25512 5549 -147274 -141576
9136a41576c971j85096J1925m3008Q9924A79199d44148a32168A99576b42026O8811
$$ -141576 -3971 -189067 -177142 -220150 -130226 179199 -444148 -132168 199576 -242026 -173215
9125a73215I6120a29636A36173f1188F0020k5984A2104L908a21384e2242o0767
$$ -173215 96120 -129636 136173 -61188 60020 34036 12104 16012 -121384 -52242 -113009
9114a13009A6825a28E0278c45157b3657C465f5104k2229J4859j6638F017J13873
$$ -113009 16825 -128 50278 -345157 -23657 3465 -65104 -87333 -72474 -89112 6017 119890
9102A19890h8361A03062g5298G7026b41564l5846a25025j95960I6197J74492g1717
$$ 119890 -88361 103062 -75298 77026 -241564 -277410 -125025 -320985 96197 270689 -71717
9090h8177n4481b7198m22307H8269b2549k3054n6613j15461K5086J4931B62033
$$ -88177 -142658 -27198 -449505 88269 -22549 -45603 -102216 -217677 -192591 -177660 262033
9078a6707C36770G3292c3730l42593I8896l0354b76272B45153d4972G3500K33969
$$ -16707 336770 73292 -33730 -376323 98896 68542 -276272 245153 -44972 73500 307469
9067C07469b61379k43847a55118e4632l2129p4501A49337G184e0031G0256a61373
$$ 307469 -261379 -505226 -155118 -54632 -86761 -161262 149337 7184 -50031 70256 -161373
9055e00437a85622j40096a42833a8749m1020j11068P2040l8454L8638A76115c18052
$$ -500437 -185622 -325718 -142833 -18749 -59769 -170837 -98797 -137251 -98613 176115 -318052
9043g2612J1264b296E9459K61772i1918j8754L5920H9670L5557a03358j01711
$$ -72612 -61348 -2296 59459 321231 -91918 -110672 -74752 89670 125227 -103358 -205069
9032b05069K6404o6940B01984I5474n693c2827l1233n2223n6500G4152a35134
$$ -205069 -178665 -245605 201984 95474 89781 -32827 -64060 -116283 -172783 74152 -135134
9020a21893l4477I6195J47888h6834C6364b53186b7863j12007G650a76193A23030
$$ -121893 -156370 96195 244083 -86834 36364 -253186 -27863 -139870 7650 -176193 123030
9008A12393K1573K392b16696p5118a45280l0198A09149Q8815I5449C5717c52823
$$ 112393 133966 136358 -216696 -291814 -145280 -175478 109149 197964 95449 35717 -352823
8996D2415c6374A00954l2797i2061D02080a09903c6031I4022R5762A4915J3548
$$ 42415 -36374 100954 68157 -92061 402080 -109903 -36031 94022 189784 14915 28463
8985B8463J67965H155K34230F1974b43623C60481i3736C8194J8244j6133g695
$$ 28463 196428 8155 242385 61974 -243623 360481 -93736 38194 56438 40305 -7695
8973b49066k6024B2418K2281a08569A2466a31034l6928j66994a02144j52075A00451
$$ -249066 -275090 22418 44699 -108569 12466 -131034 -167962 -334956 -102144 -254219 100451
8961b03294n1265B36436a4121m13893B02247a70053C6251c00773A10392J12358
$$ -203294 -254559 236436 -14121 -428014 202247 -170053 36251 -300773 110392 222750
8951B22750d8067l3927j74222f8487C2290A3500b71283a34093e7955m3803l46852
$$ 222750 -48067 -81994 -256216 -68487 32290 13500 -271283 -134093 -57955 -101758 -448610
8940d48610b4487n0043j92317a1814l9862i716A70294J25517j11751a64561I7298
$$ -448610 -24487 -74530 -266847 -11814 -51676 -9716 170294 295811 184060 -164561 97298
8928B8502L1667c00499A30667J41789D0689N83736P96088J206875O288323M640751
$$ 28502 60169 -300499 130667 272456 40689 624425 1420513 2627388 8915711 13556462
8918A3556462D713313A249688C24705N2333A80554J8277A5866c9250r0146K4994
$$ 13556462 4713313 1249688 324705 377038 180554 198831 15866 -39250 -129396 -104402
8908a04402A07911A7191L04352H1048J11419a18631A34467N5662G0156h2057b3061
$$ -104402 107911 17191 321543 81048 192467 -118631 134467 190129 70156 -82057 -23061
8896E2574J3250c08442K9083G2350B00e22006e8696j6814A96620E1087R809a26330
$$ 52574 65824 -308442 -279359 72350 200 -522006 -58696 -75510 196620 51087 60896 -126330
8883h073A73181a47000K9665n7385H860b19965B00889b77680J01093b0570p3442
$$ -8073 173181 -147000 -117335 -174720 8860 -219965 200889 -277680 -176587 -20570 -94012
8872i4012B09698a6749j51621C4919F464a92475B5381i1547k29136M9497K9466
$$ -94012 209698 -16749 -168370 34919 6464 -192475 25381 -91547 -320683 -271186 -241720
8861b41720A20060Q6464C7386b93828A38456a42220b7973A07820L8427C6038K69440
$$ -241720 120060 206524 37386 -293828 138456 -142220 -27973 107820 146247 36038 305478
$$ [...]
##END NTUPLES=NMR SPECTRUM
##END=
