
##TITLE=AC1219_Punto_6074594_2hvtUaqCzT
##JCAMPDX= 6.0         $$ Bruker NMR JCAMP-DX V2.0
##DATA TYPE= NMR SPECTRUM
##DATA CLASS= NTUPLES
##ORIGIN= BRUKER
##OWNER= Administrator
$$ 1.72 TOPSPIN		Version 2.1
$$ 2012-05-07 19:27:06.515 -0500  Administrator@TOPSPIN
$$ Compression mode = diff/dup
##.OBSERVE FREQUENCY= 400.13188235
##.OBSERVE NUCLEUS= ^1H
##.ACQUISITION MODE= SIMULTANEOUS (DQD)
##.ACQUISITION SCHEME= undefined
##.AVERAGES= 8
##.DIGITISER RES= 22
##SPECTROMETER/DATA SYSTEM= spect
##.PULSE SEQUENCE= zg30
##.SOLVENT NAME= COFFEE_meoh
##.SHIFT REFERENCE= INTERNAL, COFFEE_meoh, 1, 14.98061
##AUDIT TRAIL= $$ (NUMBER, WHEN, WHO, WHERE, PROCESS, VERSION, WHAT)
$$ ##TITLE= Audit trail, TOPSPIN		Version 2.1
$$ ##JCAMPDX= 5.01
$$ ##ORIGIN= Bruker BioSpin GmbH
$$ ##OWNER= Administrator
$$ $$ C:\Bruker\TOPSPIN/data/COFFEE/nmr/AC1219_Punto_6074594_2hvtUaqCzT/10/pdata/1/auditp.txt
$$ ##AUDIT TRAIL=  $$ (NUMBER, WHEN, WHO, WHERE, PROCESS, VERSION, WHAT)
(   1,<2012-05-07 19:26:58.781 -0500>,<Administrator>,<TOPSPIN>,<go>,<TOPSPIN 2.1>,
      <created by zg
	started at 2012-05-07 19:25:52.140 -0500,
	POWCHK enabled, PULCHK disabled,
       configuration hash MD5:
       AF F2 23 6B 01 CD 40 DD E5 A1 38 A0 06 EA F7 77
       data hash MD5: 64K
       D1 33 8C 8C 37 6F 0B 4E 8A 0C 3F 59 EB 1B 83 77>)
(   2,<2012-05-07 19:27:01.671 -0500>,<Administrator>,<TOPSPIN>,<proc1d>,<TOPSPIN 2.1>,
      <Start of raw data processing
       efp LB = 0 FT_mod = 6 PKNL = 1 PHC0 = 0 PHC1 = 0 SI = 32K 
       data hash MD5: 32K
       B7 70 A8 03 07 21 7B 91 0E D9 70 0F 1B 5E EB 64>)
(   3,<2012-05-07 19:27:02.000 -0500>,<Administrator>,<TOPSPIN>,<proc1d>,<TOPSPIN 2.1>,
      <pk PHC0 = 206.7023 PHC1 = 0 
       data hash MD5: 32K
       B6 4F EE 00 45 78 29 7D 73 76 FE 12 56 45 E5 EE>)
(   4,<2012-05-07 19:27:02.062 -0500>,<Administrator>,<TOPSPIN>,<proc1d>,<TOPSPIN 2.1>,
      <abs ABSG = 1 
       data hash MD5: 32K
       20 B2 A5 58 A8 B1 2F D3 1C 6B C3 1F 66 26 5E 36>)
(   5,<2012-05-07 19:27:02.093 -0500>,<Administrator>,<TOPSPIN>,<proc1d>,<TOPSPIN 2.1>,
      <abs ABSG = 2 
       data hash MD5: 32K
       E1 BB 15 47 2E 7E B2 97 2F FA 17 9A 7D DE 86 CF>)
(   6,<2012-05-07 19:27:02.125 -0500>,<Administrator>,<TOPSPIN>,<proc1d>,<TOPSPIN 2.1>,
      <abs ABSG = 3 
       data hash MD5: 32K
       E1 3D 91 B9 97 58 46 A8 77 CB 74 34 9B 61 1C 78>)
(   7,<2012-05-07 19:27:02.156 -0500>,<Administrator>,<TOPSPIN>,<proc1d>,<TOPSPIN 2.1>,
      <abs ABSG = 4 
       data hash MD5: 32K
       E5 7A 45 41 E9 3F 61 C3 C6 F4 5B 89 2D D6 7C A5>)
(   8,<2012-05-07 19:27:02.187 -0500>,<Administrator>,<TOPSPIN>,<proc1d>,<TOPSPIN 2.1>,
      <abs ABSG = 5 
       data hash MD5: 32K
       B6 B4 F3 98 B6 C5 48 A0 0A 1C F2 2D A9 E3 B1 05>)
$$ ##END=
$$ 
$$ $$ hash MD5
$$ $$ F9 D8 64 3E 82 02 DD 79 9F 07 EC 90 46 96 85 DF
##$RELAX= 
##$RELAX= 
##$RELAX= 
##$RELAX= 
##$RELAX= 
##$RELAX= 
##$RELAX= 
$$ Bruker specific parameters
$$ --------------------------
$$ [...]
##$TP= (0..7)
150 150 150 150 150 150 150 150
##$TP07= 0
##$TPNAME0= <>
##$TPNAME1= <>
##$TPNAME2= <>
##$TPNAME3= <>
##$TPNAME4= <>
##$TPNAME5= <>
##$TPNAME6= <>
##$TPNAME7= <>
##$TPOAL= (0..7)
0.5 0.5 0.5 0.5 0.5 0.5 0.5 0.5
##$TPOFFS= (0..7)
0 0 0 0 0 0 0 0
##$TUNHIN= 0
##$TUNHOUT= 0
##$TUNXOUT= 0
##$USERA1= <user>
##$USERA2= <user>
##$USERA3= <user>
##$USERA4= <user>
##$USERA5= <user>
##$V9= 5
##$VALIST= <valist>
##$VCLIST= <CCCCCCCCCCCCCCC>
##$VD= 0
##$VDLIST= <DDDDDDDDDDDDDDD>
##$VPLIST= <PPPPPPPPPPPPPPP>
##$VTLIST= <TTTTTTTTTTTTTTT>
##$WBST= 1024
##$WBSW= 4
##$XGAIN= (0..3)
0 0 0 0
##$XL= 0
##$YL= 0
##$YMAX_a= 514500
##$YMIN_a= -634587
##$ZGOPTNS= <>
##$ZL1= 120
##$ZL2= 120
##$ZL3= 120
##$ZL4= 120
##$ABSF1= 14.98061
##$ABSF2= -5.57192
##$ABSG= 5
##$ABSL= 3
##$ALPHA= 0
##$AQORDER= 0
##$ASSFAC= 0
##$ASSFACI= 0
##$ASSFACX= 0
##$ASSWID= 0
##$AUNMP= <proc_prof1d_extract_pilot.lims>
##$AXLEFT= 0
##$AXNAME= <>
##$AXNUC= <1H>
##$AXRIGHT= 0
##$AXTYPE= 0
##$AXUNIT= <>
##$AZFE= 0.1
##$AZFW= 0.1
##$BCFW= 0
##$BC_mod= 0
##$BYTORDP= 0
##$COROFFS= 0
##$CY= 15
##$DATMOD= 1
##$DC= 0
##$DFILT= <>
##$DTYPP= 0
##$F1P= 0
##$F2P= 0
##$FCOR= 0.5
##$FTSIZE= 32768
##$FT_mod= 6
##$GAMMA= 0
##$GB= 0
##$INTBC= 1
##$INTSCL= 1
##$ISEN= 128
##$LB= 0
##$LEV0= 0
##$LPBIN= 0
##$MAXI= 10000
##$MC2= 0
##$MEAN= 0
##$ME_mod= 0
##$MI= 0
##$NCOEF= 0
##$NC_proc= -8
##$NLEV= 6
##$NOISF1= 0
##$NOISF2= 0
##$NSP= 0
##$NTH_PI= 0
##$NZP= 0
##$OFFSET= 14.98061
##$PC= 1
##$PHC0= 206.7023
##$PHC1= 0
##$PH_mod= 1
##$PKNL= yes
##$PPARMOD= 0
##$PPDIAG= 0
##$PPIPTYP= 0
##$PPMPNUM= 2147483647
##$PPRESOL= 1
##$PSCAL= 4
##$PSIGN= 0
##$PYNMP= <proc.py>
##$REVERSE= no
##$SF= 400.13
##$SI= 32768
##$SIGF1= 0
##$SIGF2= 0
##$SINO= 400
##$SIOLD= 32768
##$SPECTYP= <>
##$SREGLST= <1H.CDCl3>
##$SSB= 0
##$STSI= 32768
##$STSR= 0
##$SW_p= 8223.68421052632
##$SYMM= 0
##$S_DEV= 0
##$TDeff= 65536
##$TDoff= 0
##$TI= <>
##$TILT= no
##$TM1= 0
##$TM2= 0
##$TOPLEV= 0
##$USERP1= <user>
##$USERP2= <user>
##$USERP3= <user>
##$USERP4= <user>
##$USERP5= <user>
##$WDW= 1
##$XDIM= 32768
##$YMAX_p= 454091691
##$YMIN_p= -776049
##$CURPLOT= <Network HP LaserJet P1505>
##$CURPRIN= <$Network HP LaserJet P1505>
##$DFORMAT= <normdp>
##$LAYOUT= <+/1D_H.xwp>
##$LFORMAT= <normlp>
##$PFORMAT= <normpl>
##$SURQMSG= 1
$$ End of Bruker specific parameters
$$ ---------------------------------
##NTUPLES= NMR SPECTRUM
##VAR_NAME=  FREQUENCY,     SPECTRUM/REAL,   SPECTRUM/IMAG
##SYMBOL=    X,             R,               I
##VAR_TYPE=  INDEPENDENT,   DEPENDENT,       DEPENDENT
##VAR_FORM=  AFFN,          ASDF,            ASDF
##VAR_DIM=   32768,         32768,           32768
##UNITS=     HZ,            ARBITRARY UNITS, ARBITRARY UNITS
##FACTOR=    0.250966925370066, 1,           1
##FIRST=     8223.43324360095, -152060,      -143432
##LAST=      0,             32812,           -45434
##MIN=       0,             -776049,         0
##MAX=       8223.43324360095, 454091691,    0
$$ Real data points
##PAGE= N=1
##DATA TABLE= (X++(R..R)), XYDATA
$$ [...]
19553b16619r3342a32683j00681q1124G695J73409h6462F7195n13i2224D2112
$$ -216619 -309961 -132683 -233364 -314488 7695 181104 -86462 67195 66682 -92224 42112
19541b76795R7227L0641I6089b15170n6694F5986e2519A82704m4301q723k5526
$$ -276795 -179568 -148927 96089 -215170 -271864 65986 -52519 182704 138403 129680 104154
19530A04154d68142e7131j16009f663C04959p3132b79392b2746j15587B2179J66486
$$ 104154 -468142 -57131 -173140 -6663 304959 231827 -279392 -22746 -138333 22179 188665
19519A88665i1814I8495e0508k3448b664p8075A56632d65142A4720c14444K6409
$$ 188665 -91814 98495 -50508 -73956 -2664 -80739 156632 -465142 14720 -314444 -288035
19508b88035h3955m1050p606h699j16662c3629j03913l9583e0113A82848o9887
$$ -288035 -83955 -125005 -132611 -8699 -125361 -33629 -137542 -177125 -50113 182848 112961
19497A12961a34347k50394A76496a44433A17462K7551a66253B42935A20866c6932
$$ 112961 -134347 -384741 176496 -144433 117462 145013 -166253 242935 120866 -36932
19486a43422D12097c7238l5915j65864N014J5846O0622g1370o8124j10480A39827
$$ -143422 412097 -37238 -73153 -239017 -234003 -218157 -157535 -71370 -139494 -249974 139827
19474H7352K12936c44208A02524a95585j00833g486n4334B78836b72878J09593
$$ 87352 300288 -344208 102524 -195585 -296418 -7486 -61820 278836 -272878 -163285
19464a63285j02367G7311L51136c4963m28188A68976n0415b29676h7435a4258
$$ -163285 -265652 77311 428447 -34963 -463151 168976 118561 -229676 -87435 -14258
19453a81505B7125J0156c42386e7926E8061L1444a22384D88265a45021k7899A4301
$$ -181505 27125 37281 -342386 -57926 58061 89505 -122384 488265 -145021 -172920 14301
19441B32287c58169B9702g9515k58525I8179b61154A45255o0331a00055o5886
$$ 232287 -358169 29702 -79515 -338040 98179 -261154 145255 84924 -100055 -165941
19431a65941g3604A64687a86823j14049P6025H7183l3521b40255K0345o7627B04268
$$ -165941 -73604 164687 -186823 -300872 -224847 87183 53662 -240255 -219910 -287537 204268
19419A03056Q60J34137E0959d06564A63595j1386D8069c26178A50321J9308A4267
$$ 103056 103916 238053 50959 -406564 163595 152209 48069 -326178 150321 169629 14267
19407a06418q3136O6215e1770m18691d6530l23372a09712l7157o521K5823a1034
$$ -106418 -189554 -123339 -51770 -470461 -46530 -369902 -109712 -146869 -153390 -127567 -11034
19395b05166i0517F0241c26295J24533c6154C34674i0944M0340n8931D7585I530
$$ -205166 -90517 60241 -326295 -201762 -36154 334674 -90944 -50604 -109535 47585 9530
19383a62686M1023n0668c0224o4274c8394k79399P3057a14034C25169F6256K1270
$$ -162686 -121663 -172331 -30224 -94498 -38394 -317793 -244736 -114034 325169 66256 87526
19372H7526a21675i929j61486I5525d5266j34501B5633e0331A89614j3317A8441
$$ 87526 -121675 -9929 -171415 95525 -45266 -179767 25633 -50331 189614 176297 18441
19360b14224d4825F3570a32388A07657A9948b49218G4952a28106r7156g1031o6066
$$ -214224 -44825 63570 -132388 107657 19948 -249218 74952 -128106 -225262 -71031 -137097
19349a37097I5940c29201a12092B0109b37389D7846a96498g5545a2474p6742K1889
$$ -137097 95940 -329201 -112092 20109 -237389 47846 -196498 -75545 -12474 -89216 -67327
19338f7327D3275A444a33082F511a31120M6390C2691J71806l423p0790d80352
$$ -67327 43275 1444 -133082 6511 -131120 -84730 32691 204497 201074 130284 -480352
19326A33814k4328a46050j41353E58L12946h2263E3439a5727c025j93081B87671
$$ 133814 109486 -146050 -287403 558 313504 -82263 53439 -15727 -3025 -196106 287671
19314c51959a17946j68246A42958a2794j05519A39452a26722N4292k66801B15540
$$ -351959 -117946 -286192 142958 -12794 -118313 139452 -126722 -72430 -339231 215540
19303B55635c1655B95373a67973j0539n7363h6944a3851j04364m07470B2150R8692
$$ 255635 -31655 295373 -167973 -178512 -235875 -86944 -13851 -118215 -525685 22150 120842
19292A20842E0645a38164e1303j17461n9135h9257B19518c056G1998a303k1754
$$ 120842 50645 -138164 -51303 -168764 -227899 -89257 219518 -3056 71998 -1303 -23057
19281b3057j31700B27617b39527A42895i7494C9995a2767j08994A23086a64078
$$ -23057 -154757 227617 -239527 142895 -97494 39995 -12767 -121761 123086 -164078
19270c66465e9861A57533k9606e3697p5386j45862A42118D3723M14078A57484
$$ -366465 -59861 157533 127927 -53697 -129083 -274945 142118 43723 457801 157484
19259C58640e0152F4127a72362j6727a4096q785j57615j10169d6492j92839c244
$$ 358640 -50152 64127 -172362 -189089 -14096 -22881 -180496 -290665 -46492 -239331 -3244
19247A94719q3408D2441b32902a7631E2467b20568k2512b4950m5002j9465E2879
$$ 194719 111311 42441 -232902 -17631 52467 -220568 -243080 -24950 -69952 -89417 52879
19235b07043O2900d1126A76483i3080n3731C39811F407K0854g5717h634A62153
$$ -207043 -144143 -41126 176483 -93080 -146811 339811 6407 27261 -75717 -8634 162153
19223a28040O567a1299k20896i0690G1480f4081k5224r8002A78414h2872j01596
$$ -128040 -121473 -11299 -232195 -90690 71480 -64081 -89305 -187307 178414 -82872 -184468
19212a84468f2174j20395g8983j25274B09742a03401H996M391c08978R0173N8203
$$ -184468 -62174 -182569 -78983 -204257 209742 -103401 8996 13387 -308978 -218805 -160602
19201a60602g0816G6622j6953N4439b65551a4966j0079j10689A51218a44147N1175
$$ -160602 -70816 76622 59669 114108 -265551 -14966 -25045 -135734 151218 -144147 -92972
19190i2972F57a36259H5970Q9152J1473a45477A4687a4345j1190n5449E0450b16582
$$ -92972 657 -136259 85970 175122 186595 -145477 14687 -14345 -25535 -80984 50450 -216582
19177b05331j011h2584l58411a01777o254b7078j7314F7149M9657C2582d59508
$$ -205331 -206342 -82584 -440995 -101777 -108031 -27078 -44392 67149 116806 32582 -459508
19165b22367G3909b865B01423G4867b1093k81418j875J21931N0273B94936H1010
$$ -222367 73909 -2865 201423 74867 -21093 -302511 -304386 -182455 -132182 294936 81010
19153A43151a64992Q0592a5544A06928g9597C9910F81b04255A92787D1929J9085
$$ 143151 -164992 -84400 -15544 106928 -79597 39910 681 -204255 192787 41929 61014
19142F1014b67415N3312h9664a006j30441A56483b26827a03271J235d7024A33222
$$ 61014 -267415 -214103 -89664 -1006 -131447 156483 -226827 -103271 -102036 -47024 133222
19130A61707a83246C7932b33317G8302b66956j04138O0925d046j72388A16122
$$ 161707 -183246 37932 -233317 78302 -266956 -371094 -310169 -4046 -176434 116122
19119c9086A11127l0034a54914B0063A775M9099Q0517c8003k3621l5394E6870
$$ -39086 111127 81093 -154914 20063 1775 50874 131391 -38003 -61624 -97018 56870
19107F2351L1481A3037c31660b5106j78345H0219F482J09690a08386k11447H9426
$$ 62351 93832 13037 -331660 -25106 -203451 80219 6482 116172 -108386 -319833 89426
19095a328m4920j49363g3238A16141e0575B52416b7658o7075b5971j02663J9908
$$ -1328 -46248 -195611 -73238 116141 -50575 252416 -27658 -94733 -25971 -128634 -108726
19084a08726J7476A90572b66696H4743b53777O2865A1840a62334k27313J81202
$$ -108726 -91250 190572 -266696 84743 -253777 -190912 11840 -162334 -389647 -208445
19074b08445A17739f4778M157m0470L8792A31818b12267j3420D3797N8301i394
$$ -208445 117739 -64778 -60621 -101091 -62299 131818 -212267 -225687 43797 102098 -9394
19062A40662e0876b4445j74561K2306h2261R622j3486C81308b00832j0110j73006
$$ 140662 -50876 -24445 -199006 -176700 -82261 -72639 -86125 381308 -200832 -210942 -383948
19051c83948c6730G5146a3203k94946D28023a07685j58566B91153c3141k16373
$$ -383948 -36730 75146 -13203 -308149 428023 -107685 -266251 291153 -33141 -249514
19041b49514e9816o2585A14750b24503C79699A70432b12623Q7805j51620B16198
$$ -249514 -59816 -122401 114750 -224503 379699 170432 -212623 -124818 -276438 216198
19030b06741A30623l4488K69609h6565k51584a44745A75441a97770j66677J63545
$$ -206741 130623 96135 365744 -86565 -338149 -144745 175441 -197770 -364447 -200902
19020b00902Q0004A71528N7772d406A55381G4045R8039J14881o3695i1707f271
$$ -200902 -120898 171528 229300 -4406 155381 74045 172084 286965 223270 -91707 -6271
19008D51711a36040j5717c8648j27709a3120F2249b46880A48910E6821K60838
$$ 451711 -136040 -151757 -38648 -166357 -13120 62249 -246880 148910 56821 317659
18998C17659C5457b93040B55495G9671J13223a78527H2843J6527b90121A6042
$$ 317659 35457 -293040 255495 79671 192894 -178527 82843 99370 -290121 16042
18987B9841J33475a53868f7776H5708b81570P6035e3922A88014b16965K1620H6922
$$ 29841 163316 -153868 -67776 85708 -281570 -205535 -53922 188014 -216965 -195345 86922
18975H5450a5999k99270f542l58887J76309k4724l01074J62561A0260a54346A32440
$$ 85450 -15999 -315269 -6542 -365429 -189120 -213844 -514918 -352357 10260 -154346 132440
18963a50539B49929c2075I2266a10303o5202j77016f5819H6767b12199G8003b16718
$$ -150539 249929 -32075 92266 -110303 -175505 -352521 -65819 86767 -212199 78003 -216718
18951b11568M9302k0214p3261i2891j38988k8465a21446n8002D1444K5294b8212
$$ -211568 -162266 -182480 -255741 -92891 -231879 -260344 -121446 -179448 41444 66738 -28212
18939B9896M0293K9913a90396A62406a91328q0294o8444A46788G982c04076E156
$$ 29896 70189 100102 -190396 162406 -191328 -271622 -340066 146788 7982 -304076 5156
18927C605a71800A02166m4675J75982g7445M46m080C0079c50613o0293i7374A14510
$$ 3605 -171800 102166 57491 233473 -77445 -76999 -81079 30079 -350613 -410906 -97374 114510
18914a51489L1211b9524r305G1869m437n385i577l03632g2935j96641a16710A59
$$ -151489 -120278 -29524 -38829 71869 67432 62047 -9577 -313209 -72935 -269576 -116710 159
18901I0360b24440A06411a2576r8192k32339H2715a56930f1793A91005b76880
$$ 90360 -224440 106411 -12576 -110768 -343107 82715 -156930 -61793 191005 -276880
18890f9541m2073j78798a15040l31406A02337e5985j41186e2657m9892j44257
$$ -69541 -111614 -290412 -115040 -446446 102337 -55985 -197171 -52657 -102549 -246806
18880b46806a19325G4369K1510b9559n4116A7059i5537d4319A66428h3935C1128
$$ -246806 -119325 74369 95879 -29559 -83675 17059 -95537 -44319 166428 -83935 31128
18868c5075B7947c36275f0179j06194c5532j34938N5740j67774A38597H621b13197
$$ -35075 27947 -336275 -60179 -166373 -35532 -170470 -114730 -282504 138597 8621 -213197
18856a29219c1748A86898b89030f6099A10554P8461I2940m0675L5144b10942I1600
$$ -129219 -31748 186898 -289030 -66099 110554 189015 92940 52265 87409 -210942 91600
18844B22254p7945b14312e9217A12987d2543r9416b3175I1635a28373B4553C183
$$ 222254 144309 -214312 -59217 112987 -42543 -141959 -23175 91635 -128373 24553 3183
18832h5415b7507k52381G9476L3887j6701K8543f9053k26717A81308A8276a44691
$$ -85415 -27507 -279888 79476 113363 96662 125205 -69053 -295770 181308 18276 -144691
18820d06617g4258A53486a98029d9513r1747f3225H2458Q1509h5441B92627a58849
$$ -406617 -74258 153486 -198029 -49513 -141260 -63225 82458 163967 -85441 292627 -158849
18808b60564E8235b43813d1490k14290F4531J03961i3625C19473a54042e1103
$$ -260564 58235 -243813 -41490 -255780 64531 168492 -93625 319473 -154042 -51103
18797B75291i0399K0655G9949K08084b48923m2153A94633I0170c18971H1332B5634
$$ 275291 -90399 -69744 79949 288033 -248923 -291076 194633 90170 -318971 81332 25634
18785B5671b60009B75924O1982e30112F6744a96920R3640a5974j59729C47403
$$ 25671 -260009 275924 337906 -530112 66744 -196920 -103280 -15974 -175703 347403
18774e5368j5244b2094A08176Q1874e02317A75914a38942A43607J6644a37441
$$ -55368 -70612 -22094 108176 190050 -502317 175914 -138942 143607 160251 -137441
18763I6184a36616c417D6831a12061j91384J9117b0047n9063k07703I7574C5099
$$ 96184 -136616 -3417 46831 -112061 -303445 -284328 -20047 -79110 -286813 97574 35099
18751a54049p0335a6951F6952c10936P6454A12053h259l13269J43919L4764B8333
$$ -154049 -224384 -16951 66952 -310936 -234482 112053 -8259 -321528 -177609 -142845 28333
18739b86216I1769B9554b46881g4936a6791k4865k24365B21412g5749K1331o8979
$$ -286216 91769 29554 -246881 -74936 -16791 -41656 -266021 221412 -75749 -54418 -123397
18728a23397n8004H782K6504a05455q428C24826c9007n9752F272a08130j85450
$$ -123397 -181401 8782 35286 -105455 -113883 324826 -39007 -98759 6272 -108130 -293580
18717b93580a9296M783A57487f0595K3674j98993a2463M913l34139M2585a2219
$$ -293580 -19296 -14513 157487 -60595 -36921 -235914 -12463 -7550 -341689 -299104 -12219
18705a4011A1563O5559h0772m6618G5754a34000B08794J33755b82179a20218D4291
$$ -14011 11563 77122 -80772 -127390 75754 -134000 208794 342549 -282179 -120218 44291
18693I6914a85040e4485q8617O7847A62604O221d634j64272K9875m7944B76756
$$ 96914 -185040 -54485 -143102 -75255 162604 168825 -4634 -168906 -139031 -186975 276756
18681d4364n4414j03783l9602B8755L8446b39833B14357g9452B79223A3292J30983
$$ -44364 -98778 -202561 -242163 28755 67201 -239833 214357 -79452 279223 13292 144275
18670A44275F9770h5333o2886F84a84002Q4657k43d7306h259m2710R735A11556
$$ 144275 69770 -85333 -148219 684 -184002 -99345 -99588 -47306 -8259 -50969 -41234 111556
18657B92371a22076J1028A94281d67409f0544B68111G943b39572I1063f047B9955
$$ 292371 -122076 -111048 194281 -467409 -60544 268111 7943 -239572 91063 -6047 29955
18645f4074l076j54923i1121A04277a52376G5739M6974B5521J50459J7897a69255
$$ -64074 -67150 -222073 -91121 104277 -152376 75739 122713 25521 175980 193877 -169255
18633b04853o4250D09558A23509b13420A19718d32473g7886L5017n9008m3382
$$ -204853 -269103 409558 123509 -213420 119718 -432473 -77886 -42869 -101877 -145259
18623a45259j9139e6175J7277q2827C3521b55468r1963A91795a89843d0370C5894
$$ -145259 -164398 -56175 -38898 -121725 33521 -255468 -347431 191795 -189843 -40370 35894
18611a95747j54294a07487A39835c9017o3109i230j55337l92406B74804a27203
$$ -195747 -350041 -107487 139835 -39017 -102126 -9230 -164567 -556973 274804 -127203
18600A99966I9271e1204n4083A14183b50934i6862n6369C6684a51641r4914i3452
$$ 199966 99271 -51204 -105287 114183 -250934 -96862 -153231 36684 -151641 -246555 -93452
18588a3803k90707a43039F4545O5442F936b46637a11779B68000b93041a14834
$$ -13803 -304510 -143039 64545 129987 6936 -246637 -111779 268000 -293041 -114834
18577B0345J83018a62861e0810k1565j42791M3837B9013b57395l5645R2325Q0519
$$ 20345 203363 -162861 -50810 -72375 -215166 -171329 29013 -257395 -293040 -200715 -120196
18566a20196j48080c5084B92283C4153c1830j63709B02122a23365j29034n0855
$$ -120196 -268276 -35084 292283 34153 -31830 -195539 202122 -123365 -252399 -303254
18556c03254G9802C438J9828J5328b3324k45154b8670l6150F4370e5384r3256
$$ -303254 79802 3438 23266 38594 -23324 -268478 -28670 -64820 64370 -55384 -148640
18545a48640N3966C2808a19185B07849e46607g5401G4144f4082E1403R8506b66466
$$ -148640 -94674 32808 -119185 207849 -546607 -75401 74144 -64082 51403 149909 -266466
18533G5348a50576d1321D743J49697a40071o0114I2235D2260j4876l102g5300
$$ 75348 -150576 -41321 4743 154440 -140071 -200185 92235 42260 27384 24282 -75300
18521d0756J1400j22730A13632h1878D6386a90279H8296J9008i8576M0732B00032
$$ -40756 -29356 -152086 113632 -81878 46386 -190279 88296 107304 -98576 -57844 200032
18509a96641A19360J35117F2760J16733J1861p817b30501a03254j62440i8314
$$ -196641 119360 254477 62760 179493 191354 183537 -230501 -103254 -265694 -98314
18498C3813b79500B17579B1816b131A90975b18550k84999E6715j3938J14375e8324
$$ 33813 -279500 217579 21816 -2131 190975 -218550 -503549 56715 42777 157152 -58324
18486C0933a54141E6628a02038j4748N0082C8411N3292b39854g4742q0868A20693
$$ 30933 -154141 56628 -102038 -116786 -66704 38411 91703 -239854 -74742 -155610 120693
18474F9163a12597k39229e321n2780J5411j68801a9453j09438C6016e9819C2258
$$ 69163 -112597 -351826 -5321 -58101 -42690 -211491 -19453 -128891 36016 -59819 32258
18462A41174n0835a26006j54276a9564A57370b23983B03281F3151Q4741d8B09314
$$ 141174 90339 -126006 -280282 -19564 157370 -223983 203281 63151 147892 -48 209314
18450e13905G6001a26363a9612m8922A51366b1959r8234j03047A4100K3873b27005
$$ -513905 76001 -126363 -19612 -68534 151366 -21959 -120193 -223240 14100 37973 -227005
18438c3582n9709A24528b43483f9358I549c6450j31358p5157H665b91422R1310
$$ -33582 -93291 124528 -243483 -69358 9549 -36450 -167808 -242965 8665 -291422 -200112
18427b00112e948r8475E7018K24837A23434a214C4638j7162M1770a1094j85411
$$ -200112 -5948 -104423 57018 281855 123434 -1214 34638 17476 59246 -11094 -196505
18416a96505k5130P1711C84974a72490L3173L8645m5647E1044d79705a94500h8471
$$ -196505 -221635 -149924 384974 -172490 -139317 -100672 -146319 51044 -479705 -194500 -88471
18404b39415a16324L5342k132B5954a62283A72687c80874D29052h3490B45239
$$ -239415 -116324 -80982 -83114 25954 -162283 172687 -380874 429052 -83490 245239
18393b12953A4042O0479g8944j91517A1691d16471R3462B7311b86405C0623b11429
$$ -212953 14042 74521 -78944 -270461 11691 -416471 -323009 27311 -286405 30623 -211429
18381B2739b30276B5371f6076A93053a7388B26032m7820h3690A34108k1082b63970
$$ 22739 -230276 25371 -66076 193053 -17388 226032 178212 -83690 134108 113026 -263970
18369I2736d7147n0918b6131k08078J03417b5868A58104a49270B20650R525c0174
$$ 92736 -47147 -98065 -26131 -234209 -130792 -25868 158104 -149270 220650 230175 -30174
18357g6540O5o7472A36091b85726J34370j45322I3050b31897J02818A60654a05569
$$ -76540 -76475 -143947 136091 -285726 -151356 -296678 93050 -231897 -129079 160654 -105569
18345a02825E4657J53522b25125A42749c30603f187I3147b14685m4605L2249f8941
$$ -102825 54657 208179 -225125 142749 -330603 -6187 93147 -214685 -259290 -227041 -68941
18333c35618e7268A438a18313E7519a12689G3065J4387e7119C4726b46159A01132
$$ -335618 -57268 1438 -118313 57519 -112689 73065 87452 -57119 34726 -246159 101132
18321b14394P8884n645j31790I0975i9958E2533a26942B84045G6407j7253R86
$$ -214394 -135510 -141155 -272945 90975 -99958 52533 -126942 284045 76407 59154 60140
18310F0140a65636N410A80918G8638R0132a92390h7424j91843c9770A42487F0195
$$ 60140 -165636 -160226 180918 78638 168770 -192390 -87424 -279267 -39770 142487 60195
18298d211k34474Q6968j58415K7467B01145k1394a08403C4884a558G5726a81408
$$ -4211 -238685 -151717 -310132 -282665 201145 179751 -108403 34884 -1558 75726 -181408
18286A64401l4294a40103B57369b524j04415d867H5333a2691m69508a45489a1407
$$ 164401 130107 -140103 257369 -2524 -106939 -4867 85333 -12691 -482199 -145489 -11407
18274I7426a36820j02186R1562B29649c4018B0696J14615J2070h5359D9841a87387
$$ 97426 -136820 -239006 -147444 229649 -34018 20696 135311 147381 -85359 49841 -187387
18262D0050L159c64338J66930C373b40926J11830j68356a17093G0668b81090C11031
$$ 40050 43209 -364338 -197408 3373 -240926 -129096 -297452 -117093 70668 -281090 311031
18250a35631j46345C9581b4025I5585e4840A51848K3880a07825B37773b01934
$$ -135631 -281976 39581 -24025 95585 -54840 151848 175728 -107825 237773 -201934
18239b2497j233j34775j5773k39291a83738B50040n4065h7284E0770N4253e1797
$$ -22497 -23730 -158505 -174278 -413569 -183738 250040 195975 -87284 50770 105023 -51797
18227a56522B56732D7271b8741k46437B06582f3336j06679A10737k0466d6110
$$ -156522 256732 47271 -28741 -275178 206582 -63336 -170015 110737 90271 -46110
18216b12376F0065a6207H2758k7097a21243H8658K19988G1272g0572j03210B71066
$$ -212376 60065 -16207 82758 55661 -121243 88658 308646 71272 -70572 -173782 271066
18204a49880k26605I3530h0414B40085r1011b01729I96c42373a68248J2429N3588
$$ -149880 -376485 93530 -80414 240085 149074 -201729 996 -342373 -168248 -155819 -102231
18193a02231C37504a1428j30297j57540A38978D4241a33979j42676C08279A47023
$$ -102231 337504 -11428 -141725 -299265 138978 44241 -133979 -276655 308279 147023
18182C38622B9118J68530N953i4487I205f3088m18448A03371a08029B49660i4177
$$ 338622 29118 197648 203601 -94487 9205 -63088 -481536 103371 -108029 249660 -94177
18170G2215k1478J16949b90325A03030a34553L211L0421J4374r7700a1724A26027
$$ 72215 50737 167686 -290325 103030 -134553 -131342 -100921 -86547 -184247 -11724 126027
18158b59691f6496j51126J03352C10654a09390A38920a21713G9201J25300c3114
$$ -259691 -66496 -217622 -114270 310654 -109390 138920 -121713 79201 204501 -33114
18147a34965k89041d3492j07054B29288o2658M6507a42949c3463k52599B06403
$$ -134965 -424006 -43492 -150546 229288 166630 213137 -142949 -33463 -286062 206403
18136a55691c2038A3096J51696l0275e9013G3397b62809A27033h4946l07931g3514
$$ -155691 -32038 13096 164792 134517 -59013 73397 -262809 127033 -84946 -392877 -73514
18124a01686A25082N6741E4320a04972a1165j83155R5869M1782A24641f3665C9693
$$ -101686 125082 181823 54320 -104972 -11165 -194320 -98451 -56669 124641 -63665 39693
18112a95453M9541A27173a13133a2303A97252q4526m6755f2559A38907a57468
$$ -195453 -145912 127173 -113133 -12303 197252 112726 65971 -62559 138907 -157468
18101a24874A16328a37132p9290N9687L75A10765a459j12247q101J8595A11849
$$ -124874 116328 -137132 -216422 -156735 -156360 110765 -1459 -113706 -121807 -103212 111849
18089f9153j15605B75503c19713B89636a14057j58794i5776B805b74615A3412
$$ -69153 -184758 275503 -319713 289636 -114057 -272851 -95776 2805 -274615 13412
18078F8573Q6111a44022d0199P814A53211a08880I0452a18647F2341J4560b25561
$$ 68573 154684 -144022 -40199 -32385 153211 -108880 90452 -118647 62341 76901 -225561
18066C58909A01887f8995B24075c17452J42155E6454c4005C4569a95950L6822
$$ 358909 101887 -68995 224075 -317452 -175297 56454 -34005 34569 -195950 -159128
18056a59128G9572c323j3196m47700A40410g9171p4120B72917I6604R9494a07779
$$ -159128 79572 -3323 -16519 -464219 140410 -79171 -153291 272917 96604 196098 -107779
18044e2542E9727J79458e8863g945E7544O892b20138j23307a53130M6859q2347
$$ -52542 59727 239185 -58863 -7945 57544 64436 -220138 -343445 -153130 -106271 -188618
18033a88618A68955E9630b15870n6989F757O8135J43756K4197b62942g8268G9632
$$ -188618 168955 59630 -215870 -272859 6757 74892 218648 242845 -262942 -78268 79632
18021b15319B4244d262j97703m9056J01786A30079E8275b57757O0110Q6405A06952
$$ -215319 24244 -4262 -201965 -251021 -149235 130079 58275 -257757 -197647 -111242 106952
18009B08969m0724c20468a31684B70142d49777a29924N9669p5802j2467A68032
$$ 208969 168245 -320468 -131684 270142 -449777 -129924 -70255 -146057 -158524 168032
17998I221g4346k49260A26314b1425k72019K3287E6936J09378J20481A2554L08456
$$ 9221 -74346 -323606 126314 -21425 -293444 -270157 56936 166314 286795 12554 321010
17987C21010a98316c2051p1382m8511d5136E670N2621a01788A17741K099a41789
$$ 321010 -198316 -32051 -103433 -151944 -45136 5670 58291 -101788 117741 119840 -141789
17975A17860c8848k477k360j2154F1181g8377l03942F7504e9134k22022A21694
$$ 117860 -38848 -41325 -43685 -55839 61181 -78377 -382319 67504 -59134 -281156 121694
17963B6408L16975f2522H9208a50733A77505q0798c8682A36300b50994b4049G3190
$$ 26408 343383 -62522 89208 -150733 177505 96707 -38682 136300 -250994 -24049 73190
17951a30174A51446a95118M7426r5361F463a67390D5308Q7946k0612a40792j29308
$$ -130174 151446 -195118 -147692 -243053 6463 -167390 45308 133254 112642 -140792 -270100
17940b70100G7748K4362J77979a7933D5538a66573j30253A95298q2190J6010b94937
$$ -270100 77748 102110 280089 -17933 45538 -166573 -296826 195298 113108 129118 -294937
17928c03852A31477h232C3636J61147a62453K3692O4747r7288A31667d3j82844
$$ -303852 131477 -8232 33636 194783 -162453 -138761 -74014 -171302 131667 -43 -182887
17917a82887Q0902E3990b34744c5288o7222A44074a35203O0159A02495D529c2645
$$ -182887 -101985 53990 -234744 -35288 -102510 144074 -135203 -75044 102495 4529 -32645
17905H0087c34541a52582B2943a21657M4895A31546d9837B0413a18187G0384b51733
$$ 80087 -334541 -152582 22943 -121657 -76762 131546 -49837 20413 -118187 70384 -251733
17893a21340B5169J10524a41278L4508j36188K0667A82630F3015J16965g6373
$$ -121340 25169 135693 -141278 -106770 -242958 -222291 182630 63015 179980 -76373
17882I5322c15508H0072R1544a38057c0837E3227a48535j07182A09461R3915J7297
$$ 95322 -315508 80072 171616 -138057 -30837 53227 -148535 -255717 109461 203376 220673
17871B20673a33655a4176j03769C22005q9880Q3661E9156H748b09868A50116G2218
$$ 220673 -133655 -14176 -117945 322005 232125 315786 59156 8748 -209868 150116 72218
17859B03437C3606a71910B87267I5887a86657B6771e5609K4254B43351b36754
$$ 203437 33606 -171910 287267 95887 -186657 26771 -55609 -31355 243351 -236754
17848A96443j119M0604i8160A35855b74134D6787K4711l68F277L1041c42770J09457
$$ 196443 195324 235928 -98160 135855 -274134 46787 71498 71130 6277 37318 -342770 -233313
17836b33313J13643n4044j7478d6001j73373D7889e2851e745c35n658I6983c82184
$$ -233313 -119670 -173714 -191192 -46001 -219374 47889 -52851 -5745 -335 -5993 96983 -382184
17823f6471B29884p8799H807M99606G6390l1685a89906g4150q87C16766h8822
$$ -66471 229884 151085 8807 508413 76390 44705 -189906 -74150 -75037 316766 -88822
17811b889k689A35618A4192c74158A47853a91087R0721A66487a1360m6360K5640
$$ -2889 -5578 135618 14192 -374158 147853 -191087 -100366 166487 -11360 -57720 -32080
17800c2080D6964b45148A53957E8546j0218R301b31016H9501l0281c6936B65509
$$ -32080 46964 -245148 153957 58546 48328 57629 -231016 89501 59220 -36936 265509
17788c26234B6126a0164m43577E07941B22205r2786e9942j58013G9665a67363
$$ -326234 26126 -10164 -453741 507941 222205 129419 -59942 -217955 79665 -167363
17777c33940D40912D6619b04180J9242B0681K10436n3858a09236p3239A087K34247
$$ -333940 440912 46619 -204180 -184938 20681 231117 177259 -109236 -182475 1087 235334
17766B35334f5593H537d2012F4801J31901i9268d131A7062e1504m7849B881K89121
$$ 235334 -65593 8537 -42012 64801 196702 -99268 -4131 17062 -51504 -99353 2881 292002
17754B92002I0365a47007O2250j90414l6909a34998A23389O4341h376l28349b7042
$$ 292002 90365 -147007 -84757 -275171 -312080 -134998 123389 187730 -8376 -336725 -27042
17742e7406A73040c6112j48754j21478a8230A06231g7217D8039b13875b7000k0827
$$ -57406 173040 -36112 -184866 -306344 -18230 106231 -77217 48039 -213875 -27000 -47827
17731d7827A51173N6186h8459l3891e079k53176A08138l0464c68654A75274b02508
$$ -47827 151173 207359 -88459 -122350 -5079 -258255 108138 77674 -368654 175274 -202508
17719C3212i7749k32189B49563g3847A58441A6942M6452a6981B19192r8803l1298
$$ 33212 -97749 -329938 249563 -73847 158441 16942 63394 -16981 219192 120389 89091
17708H9091m820c102p3884A72289m1081c32476A6616Q467J5121f4479r5264m1378
$$ 89091 84271 -3102 -76986 172289 131208 -332476 16616 25083 40204 -64479 -159743 -201121
17696b01121C2177b86534a00122k8020C57301o4111a18456m4192A26937b95870
$$ -201121 32177 -286534 -100122 -128142 357301 293190 -118456 -162648 126937 -295870
17685i3740l499F5434a46318E2547J38995A8779b9771A30671d1444B47717K3278
$$ -93740 -97239 65434 -146318 52547 191542 18779 -29771 130671 -41444 247717 270995
17674B70995j28671Q0639I28a58622H4613K15299C0183b45746a08218F3162g823
$$ 270995 142324 222963 928 -158622 84613 299912 30183 -245746 -108218 63162 -7823
17662A03305H274J25501a63831d7324B36268b94495A5966g7330A8282c0284o9996
$$ 103305 8274 133775 -163831 -47324 236268 -294495 15966 -77330 18282 -30284 -100280
17651a00280j32059G3163K93868C7624g4770j44513G9954a13730j78318H983K26133
$$ -100280 -232339 73163 367031 37624 -74770 -219283 79954 -113730 -292048 8983 235116
17640B35116a02703B57555f7427G5473j9840J97262d2200B68862f8436B35275
$$ 235116 -102703 257555 -67427 75473 55633 252895 -42200 268862 -68436 235275
17629b29837B17019o6817a88548A19769P9389D8056a72621K4367n1758b9008j74122
$$ -229837 217019 150202 -188548 119769 199158 48056 -172621 -148254 -200012 -29008 -203130
17618b03130E6130f6444n6484a6822G0290J4378a6896A66128b92910f9420B7829
$$ -203130 56130 -66444 -122928 -16822 70290 84668 -16896 166128 -292910 -69420 27829
17606A8255b8387I8164h1097I1019B7834b24012D4984M66418a72374H0347n748
$$ 18255 -28387 98164 -81097 91019 27834 -224012 44984 511402 -172374 80347 74599
17595G4599b728j25830A10092J33510a38246C1695K8396b19023A79123f8479C24932
$$ 74599 -2728 -128558 110092 243602 -138246 31695 60091 -219023 179123 -68479 324932
17583A30328c41284J04781a07000B3685m467b27401f3970j52047H1580c9491C9679
$$ 130328 -341284 -236503 -107000 23685 19218 -227401 -63970 -216017 81580 -39491 39679
17571a5796A0799b09309i8373p8907c5606l70659H8328k408B3158a53899A25261
$$ -15796 10799 -209309 -98373 -177280 -35606 -406265 88328 85920 23158 -153899 125261
17559D13589A43206B1199n035J21477J907k9980m4112g9740B72786A27368K68161
$$ 413589 143206 21199 16164 137641 139548 109568 65456 -79740 272786 127368 395529
17548C95529a50250D9462J09707J14778r9080a31209B86935a52603B17096d18232
$$ 395529 -150250 49462 159169 273947 174867 -131209 286935 -152603 217096 -418232
17537c0556A12125m0729b08524A2592L95289c21885E0058a52101B7436a17005
$$ -30556 112125 71396 -208524 12592 407881 -321885 50058 -152101 27436 -117005
17526A35311b16421j43799A88785G391O2418P260J88012E3216J66606G5824K1598
$$ 135311 -216421 -360220 188785 7391 69809 77069 265081 53216 219822 75824 97422
17515I7422a8423A12178e7418b4132j77498m6663A50776L4710G9858A6147J69037
$$ 97422 -18423 112178 -57418 -24132 -201630 -248293 150776 185486 79858 16147 185184
17504A85184B3295n029a01344m2119k76730B05390K6503b1759C06877j35223a28844
$$ 185184 23295 18266 -101344 -143463 -420193 205390 231893 -21759 306877 171654 -128844
17492A13648J16048o1567b573j09294A67700P1976l3410a85092c7798B99245c1165
$$ 113648 229696 168129 -2573 -111867 167700 239676 206266 -185092 -37798 299245 -31165
17480c4136C79042p6094a5435l90283B95555b0643B26889a73961C51703j29825
$$ -34136 379042 302948 -15435 -405718 295555 -20643 226889 -173961 351703 221878
17470B21878l0717M4343p9890R5031j11414e4623A13366Q4824C8585J40846E8198
$$ 221878 191161 235504 155614 250645 139231 -54623 113366 198190 38585 179431 58198
17458A69519j9076J98304H7922J66323D9475J94981r1814a73017A05886J13195
$$ 169519 150443 348747 87922 254245 49475 244456 152642 -173017 105886 219081
17448B19081P9079p9524A5603J75234J41819J20985H6022L02505j12763q5407
$$ 219081 298160 218636 15603 190837 332656 453641 86022 388527 275764 190357
17438A90357M2611K98422e8891C37820l172j20987j185n0488F5043L45809n3573
$$ 190357 232968 531390 -58891 337820 334648 213661 212476 161988 65043 410852 357279
17427C57279a21986B75672q4087M0037B4727a10337A94410a46366B60625K48367
$$ 357279 -121986 275672 191585 231622 24727 -110337 194410 -146366 260625 508992
17417E08992a30915D03910j80686B0120f826B25553J96431j48810A9538L80717
$$ 508992 -130915 403910 223224 20120 -6826 225553 421984 273174 19538 400255
17407D00255H9344J59979K52699b8240A81011n2623M33120G3028l2693J71120
$$ 400255 89344 249323 502022 -28240 181011 128388 561508 73028 40335 211455
17397B11455J4693n1438p3632J04662J87182j65580b1959C33618j38766a17842
$$ 211455 226148 174710 101078 205740 392922 227342 -21959 333618 194852 -117842
17386a775A34270a24835C78560H4837I972J15413h8217m5267A49672j5729J30330
$$ -1775 134270 -124835 378560 84837 9972 125385 -88217 -133484 149672 133943 264273
17375B64273q8069A5046a92376A41420J34293a89478H3983d2449q4717A36477
$$ 264273 176204 15046 -192376 141420 275713 -189478 83983 -42449 -127166 136477
17364c6567A13956j5306J3966E5713B0385g8378J0592j39983A14025m4982O66
$$ -36567 113956 98650 112616 55713 20385 -78378 -67786 -207769 114025 69043 69709
17353F9709i8087I5921m5855c0756A71806j6988A1590K40691A23093N1710J49884
$$ 69709 -98087 95921 50066 -30756 171806 154818 11590 252281 123093 174803 324687
17342C24687C2815K47811j355a83413K9394A15554J81795a5945A89839m8423a17642
$$ 324687 32815 280626 279271 -183413 -154019 115554 297349 -15945 189839 141416 -117642
17330I1629J37108A05657i2646G2148L23059q1769A6953J72002p8443M14711j33062
$$ 91629 228737 105657 -92646 72148 395207 313438 16953 188955 110512 525223 392161
17319C92161A63703h4770G1207L9418b33659C41952j31720L7457O198e6952B49999
$$ 392161 163703 -84770 71207 110625 -233659 341952 210232 247689 253887 -56952 249999
17307A66863j6051f6036B19508B1295L03917G8820m716B1999b058I8718e8865
$$ 166863 150812 -66036 219508 21295 325212 78820 74104 21999 -2058 98718 -58865
17295A77066o4283b46236C08381j4248l4076E2807J52982D5305J79631p5316b5234
$$ 177066 112783 -246236 308381 294133 260057 52807 205789 45305 224936 149620 -25234
17283B74626A34496A6407M55769B07320n0560d6550C7442b53601E16723A25656
$$ 274626 134496 16407 472176 207320 156760 -46550 37442 -253601 516723 125656
17272A8021K19822A15090l0543B7182J63042R7738a98877A25495K08576e4252
$$ 18021 237843 115090 84547 27182 190224 287962 -198877 125495 334071 -54252
17261A19538O6712p5338K30509a25502D31994j63377G4437O6693D2998M6234b7251
$$ 119538 186250 110912 341421 -125502 431994 268617 74437 141130 42998 89232 -27251
17249d79A52063F6903J70170J26431d8020A878L68098A71196J78363b16583C0547
$$ -479 152063 66903 237073 363504 -48020 1878 369976 171196 349559 -216583 30547
17237A57806j2321J02744L5159r8592a03782C00353r8697G6609N0473K42018j60404
$$ 157806 145485 248229 283388 184796 -103782 300353 201656 76609 127082 369100 208696
17226B08696L5028D1467J78713c28949B4048L23597b062G5835a50485A88847K22070
$$ 208696 243724 41467 220180 -328949 24048 347645 -2062 75835 -150485 188847 410917
17215D10917j08630g4013A84034m4117J45563N4892L5534A69514N6227Q4592I2374
$$ 410917 302287 -74013 184034 139917 285480 340372 375906 169514 225741 310333 92374
17203C80585A73483K24852A7331M00506G7361C4925M17501j55790o1326N0315
$$ 380585 173483 398335 17331 417837 77361 34925 452426 296636 235310 285625
17193B85625a53547B05821l7476f8674B03552a11382C24070j09015o2311J22607
$$ 285625 -153547 205821 168345 -68674 203552 -111382 324070 215055 152744 275351
17183B75351j12509m9932J64433m1404Q8400a16370B62622j01777a20534A13017
$$ 275351 162842 112910 277343 235939 324339 -116370 262622 160845 -120534 113017
17172A70857K43280p6539A41123K8486M6726J48983r366A70267M7100a86221P5195
$$ 170857 414137 337598 141123 169609 216335 365318 355952 170267 217367 -186221 -111026
17161a11026D33376F0450K37814J3014G5002M17627A87414M36053j29134j36908
$$ -111026 433376 60450 298264 311278 75002 492629 187414 623467 494333 357425
17151C57425A52082L4079L51763k34894n9766G9507J32291l8094L74587k65398
$$ 357425 152082 186161 537924 303030 243264 79507 211798 173704 548291 282893
17141B82893L1364j10370K09907A32476J22475m0330J62446o7341P4754A01219
$$ 282893 314257 203887 413794 132476 254951 214621 377067 309726 384480 101219
17130B42216M2507N2052j65412Q5008L8990A2159J95331J9453k6573L33264k16957
$$ 242216 284723 336775 171363 256371 295361 12159 207490 226943 200370 533634 316677
17119C16677n1507j28738M54158B15259L23937A33216N4694R8428a8751C72789
$$ 316677 265170 136432 590590 215259 539196 133216 187910 286338 -18751 372789
17108B01312J61709P9561j60217K85557q6562j64569K25040A24051J83466J42034
$$ 201312 363021 442582 282365 567922 481360 316791 541831 124051 307517 449551
17098D49551J40703B67404A27806K22934A47290j9792K20907j15885J25818o4184
$$ 449551 590254 267404 127806 350740 147290 127498 348405 232520 358338 294154
17088B94154K28527j45769K39557B53530J51996l9517l6736G1082M6653L2316
$$ 294154 522681 376912 616469 253530 405526 366009 329273 71082 117735 150051
17078A50051J46335M3687J14573O0692o7646A62846J76575O5684J26178J18372
$$ 150051 296386 340073 454646 515338 447692 162846 339421 405105 531283 649655
17068F49655B16251L44727k77442K5910K28833r6894j66812p8J97185k25604J40123
$$ 649655 216251 560978 283536 309446 538279 441385 274573 274495 471680 246076 386199
17057C86199R0789G6170K80682O4507J41598j8026p1150P0058k46650K34888A97969
$$ 386199 476988 76170 356852 421359 562957 544931 473781 543839 297189 532077 197969
17045D52184q4350J71705o0509k08544J54636l4170A1333L07812J16022j05010
$$ 452184 367834 539539 479030 270486 425122 390952 11333 319145 435167 330157
17035C30157J71869k01862n559J86625o2034O7997B15090N83606C66363K19394
$$ 330157 502026 300164 294605 481230 419196 487193 215090 798696 366363 585757
17025E85757J56500k27067J81990k17266k00769J57353L2254R3243j15631K63141
$$ 585757 742257 515190 697180 479914 279145 436498 468752 561995 446364 709505
17015G09505k62827m7037J29345p5131K96683B38233K69129j83544R0886K60575
$$ 709505 446678 399641 528986 453855 750538 238233 507362 323818 414704 675279
17005F75279j14849n6676J56180m9169J3164B18717N53751q2208L0029N9323m5503
$$ 675279 560430 503754 659934 610765 623929 218717 772468 690260 720289 779612 734109
16994G34109r9558C02499L08289K34965j23212j60836K7344p8491L99222q2374
$$ 734109 634551 302499 610788 845753 722541 561705 589049 510558 909780 827406
16984H27406j97759M6237J5680p7088J15438K12161m14473L46097L7751l76773
$$ 827406 629647 675884 691564 614476 729914 942075 527602 873699 911450 534677
16974E34677L79450k99377K12225q2859J75910m17801K67569j73159M5059J77041
$$ 534677 914127 614750 826975 744116 920026 502225 769794 596635 641694 818735
16964H18735o5738r5040L81004l05635K63594l9029K18943J570l07715l58057
$$ 818735 752997 657957 1038961 733326 996920 957891 1176834 1178404 870689 512632
16954E12632J65006J85613j58589J01962p3852M42831k19297O490r3063K08648
$$ 512632 677638 863251 704662 806624 732772 1175603 956306 962796 869733 1078381
16944A078381l53761j78864L58996J49655j16429j82969m0728M50934l70725L68603
$$ 1078381 724620 545756 904752 1054407 937978 755009 714281 1165215 794490 1163093
16934A163093m87031M08439L10613m54721J21550l00184k25976M31896j8713M4107
$$ 1163093 676062 1084501 1395114 940393 1061943 761759 535783 967679 948966 993073
16924I93073r033K01538J0852p061R619J2309k01660L4975J673K31234j58239
$$ 993073 984040 1185578 1196430 1189369 1198988 1211297 1009637 1044612 1046285 1277519 1119280
16913A119280r3786K18679O6170n5502n1967R8582N0559j35447K82901l09531
$$ 1119280 1025494 1244173 1310343 1254841 1202874 1301456 1352015 1216568 1499469 1189938
16903A189938O8453K26929j7738L6567j19633M5522k88451K32795M9489n7452
$$ 1189938 1258391 1485320 1467582 1504149 1384516 1430038 1141587 1374382 1423871 1366419
16893A366419K7175k1665J5599L00644K4615J31790k24841j36017K17J6718K82528
$$ 1366419 1393594 1371929 1387528 1688172 1712787 1844577 1619736 1483719 1483936 1500654 1783182
16882A783182k55850J41690J06287M2320K73901n35157O40149n94051o8059o4930
$$ 1783182 1527332 1669022 1775309 1817629 2091530 1556373 2196522 1602471 1534412 1469482
16872A469482M94552j21050L37094j32458K3096k8479q0504k3960P7164L44286
$$ 1469482 1964034 1842984 2180078 2047620 2070716 2042237 1961733 1937773 2014937 2359223
16862B359223k39908j09373J34295J51846Q5148k710k11293n345J19982J29978
$$ 2359223 2119315 2009942 2144237 2296083 2381231 2378521 2167228 2161883 2281865 2411843
16852B411843P5492p5870k13154L30145k8829j44855L83569l51757K61466R3419
$$ 2411843 2487335 2411465 2198311 2528456 2499627 2354772 2738341 2386584 2648050 2741469
16842B741469m4231m0640K72318j6356J63475l8200K60160j59876P3089l60644
$$ 2741469 2697238 2656598 2928916 2912560 3076035 3037835 3297995 3138119 3211208 2850564
16832B850564K74592L35468l88319L49857J18211l1460M1996p7306J00821J89556
$$ 2850564 3125156 3460624 3072305 3422162 3540373 3508913 3550909 3473603 3574424 3763980
16822C763980K19421K07455l83343j831O1246J84119L24577r2094Q2358J43767
$$ 3763980 3983401 4190856 3807513 3805682 3866928 4051047 4375624 4283530 4365888 4509655
16812D509655K97063q79j51375j49710M75931J52043m48389O10343J91649m56086
$$ 4509655 4806718 4805839 4654464 4504754 4980685 5132728 4684339 5294682 5486331 5030245
16802E030245M50776n1890L26538M6547N4216M7222K80590j61555K65863L43192
$$ 5030245 5481021 5429131 5755669 5802216 5856432 5903654 6184244 6022689 6288552 6631744
16792F631744K3726o484K64364N09606r7921K95161J25023j62941L51709L73988
$$ 6631744 6655470 6648986 6913350 7422956 7325035 7620196 7745219 7582278 7933987 8307975
16782H307975J00487L72174J51068j8534K29176J46619N66720N0497K11897K62396
$$ 8307975 8408462 8780636 8931704 8913170 9142346 9288965 9855685 9906182 10118079 10380475
16772A0380475P90381K6990L34365L79721K40071M87791J60565N95069N48669
$$ 10380475 11170856 11197846 11532211 11911932 12152003 12639794 12800359 13395428 13944097
16763A3944097L9046Q80323N2588O02471N57800O97507N43134O20957Q25897M61198
$$ 13944097 13983143 14863466 14916054 15518525 16076325 16773832 17316966 17937923 18763820 19225018
16753A9225018Q58860O36742R34642J16048J189711Q51438R50471J166810J187409
$$ 19225018 20083878 20720620 21655262 21771310 22961021 23812459 24762930 25929740 27117149
16744B7117149J164325J343356J233865J168936J529386J504269J725430J748632
$$ 27117149 28281474 29624830 30858695 32027631 33557017 35061286 36786716 38535348
16736C8535348K022072J888880K014518K636792K502801K703145K706212L195804
$$ 38535348 40557420 42446300 44460818 47097610 49600411 52303556 55009768 58205572
16728E8205572L823255L117426L757957M084365M413516M613917M995331N348774
$$ 58205572 62028827 65146253 68904210 72988575 77402091 82016008 87011339 92360113
16720I2360113N747877N889759O652288O696436O852063O964329P617825P511549
$$ 92360113 98107990 103997749 110650037 117346473 124198536 131162865 138780690 146292239
16712A46292239P347379P476184P022815O498155O356788N538089M080347L641320
$$ 146292239 153639618 161115802 168138617 174636772 180993560 186531649 190611996 194253316
16704A94253316J734610J062059n26150k054029k783953m710180n481910n690561
$$ 194253316 195987926 197049985 196523835 194469806 191685853 186975673 181493763 175803202
16696A75803202p292163p153479p390684p831155p582017p665064p206305p502102
$$ 175803202 168511039 161357560 153966876 146135721 138553704 130888640 123682335 116180233
16688A16180233o634717o728336n808641o237141n219772n370059m946571m184535
$$ 116180233 109545516 102817180 97008539 90771398 85551626 80181567 75234996 71050461
16680G1050461m510349l954387l691504l016753l091707k976550k738835k725223
$$ 71050461 66540112 62585725 58894221 55877468 52785761 49809211 47070376 44345153
16672D4345153k277281k224868k043097j883403j487722j522656j716066j575735
$$ 44345153 42067872 39843004 37799907 35916504 34428782 32906126 31190060 29614325
16664B9614325j554792j156598j017248j412779o92039j098986q13642r76282
$$ 29614325 28059533 26902935 25885687 24472908 23780869 22681883 21868241 20891959
16656B0891959o47574j064099p88071k19126p75351o67868p03990k75703q89070
$$ 20891959 20244385 19180286 18392215 18173089 17397738 16729870 16025880 15750177 14861107
16647A4861107m15693m14889n28923n32617k97114r07845J97756n59660n04683
$$ 14861107 14445414 14030525 13501602 12968985 12671871 11764026 11961782 11402122 10897439
16638A0897439R0101p63659k47527j68331j17837p7518m53548k07003m70337k10229
$$ 10897439 10987540 10223881 9976354 9808023 9690186 9612668 9159120 8952117 8481780 8271551
16628H271551j72064k20831k48486M5386l02174j79720j99448k21019l57147r5423
$$ 8271551 8099487 7878656 7630170 7675556 7373382 7193662 6994214 6773195 6416048 6320625
16618F320625l5955l03726J18453k78447J24719m38724O430m37920K22493j40824
$$ 6320625 6284670 5980944 6099397 5820950 5945669 5506945 5513375 5075455 5297948 5157124
16608E157124j01135j96262M505l878j1085p84873O20401l01123k62790k58917
$$ 5157124 5055989 4859727 4864232 4860354 4849269 4064396 4684797 4383674 4120884 3861967
16598C861967K09565p7000j20276P5108O6742n83395j07640J64056k17327N2384
$$ 3861967 4071532 3994532 3874256 3949364 4016106 3432711 3325071 3489127 3271800 3324184
16588C324184K59156l11725n1743k60637K99374k88472o2867M64271m09891m3798
$$ 3324184 3583340 3271615 3219872 2959235 3258609 2970137 2907270 3371541 2961650 2917852
16578B917852k6516k71484M8017l9297M113k6305N4630l387j19216p7496R6742
$$ 2917852 2891336 2619852 2667869 2628572 2632685 2606380 2661010 2657623 2538407 2460911 2557653
16567B557653m73119Q8018l146L3515R9664j10611J7664j36484K53239j76775
$$ 2557653 2084534 2172552 2169406 2202921 2302585 2191974 2209638 2073154 2326393 2149618
16557B149618l11371L56425j25295m25110J25840P4068k52000J2998K87450o14661
$$ 2149618 1838247 2194672 2069377 1644267 1770107 1844175 1592175 1605173 1892623 1277962
16547A277962L92015K52969j47888J58134m57922K55374m11048L17667Q4424m14332
$$ 1277962 1669977 1922946 1775058 1933192 1475270 1730644 1319596 1637263 1721687 1307355
16537A307355N64124k86467j14488L69679m00427k28967l7310J36949L23562j79575
$$ 1307355 1871479 1585012 1470524 1840203 1439776 1210809 1173499 1310448 1634010 1454435
16527A454435l1004L14151k38181l25377O914M3605k26895L28264J45423l97354
$$ 1454435 1423431 1737582 1499401 1174024 1180938 1224543 997648 1325912 1471335 1073981
16517A073981j77755N81689j31551K1705k54293j02135K44582N7453j49963k66174
$$ 1073981 896226 1477915 1346364 1368069 1113776 1011641 1256223 1313676 1163713 897539
16507H97539K10543k04834K02712l34997J53370Q5960j96065J59936l86751K88892
$$ 897539 1108082 903248 1105960 770963 924333 1010293 814228 974164 587413 876305
16497H76305P9619m9768j03339j77427J32220M33067m47966K19251k37067J01125
$$ 876305 955924 906156 802817 625390 757610 1190677 742711 961962 724895 826020
16487H26020m3330K95325j26728j32018K65822N8564j60327o6728k77911J41507
$$ 826020 782690 1078015 951287 819269 1085091 1143655 983328 916600 638689 780196
16477G80196m0955J90783j95690J36978k7485k86292J81071j65918J4393K20812
$$ 780196 739241 930024 734334 871312 843827 557535 738606 572688 587081 807893
16467H07893l68769K99210j73653j788J70811J07586C72167R2356L28624k06006
$$ 807893 439124 738334 564681 562893 733704 841290 372167 464523 793147 587141
16457E87141j36469Q7129j91284L46836r8529j03480L68069D13813L02556C40533
$$ 587141 450672 537801 346517 693353 594824 491344 859413 413813 716369 340533
16446E73488K68304l77556j58188N82733k23194l3785j18333J00079G2563L98881
$$ 573488 841792 464236 306048 888781 665587 631802 513469 613548 72563 471444
16436D71444J19257Q469k98265K83865J2087k24472L1635o3420K58864M7851k8286
$$ 471444 590701 599170 300905 584770 596857 372385 404020 340600 599464 647315 619029
16425F19029N1291j68852J85107j75610j08215L72347k82895j10830l8387R2619
$$ 619029 670320 501468 686575 510965 402750 775097 492202 381372 342985 435604
16415D35604J2979M1912j5584j907K16773q1277j23873B29700L31316k71411M60381
$$ 435604 448583 490495 474911 473004 689777 608500 484627 229700 561016 289605 749986
16404G49986C65691J82624A26908K20994N1434J24840j8700n5693P385j71264
$$ 749986 365691 548315 126908 347902 399336 524176 505476 449783 457168 285904
16394B85904j7254J32913L6969H4870M73567A05345J84150p5669K54626A52692
$$ 285904 268650 401563 438532 84870 558437 105345 289495 213826 468452 152692
16383D15738n8333i744G16580B76857r0533J72456o3029A03480J70243j22466
$$ 415738 357405 -9744 716580 276857 186324 358780 295751 103480 273723 151257
16373A51257K86806j51859j30855O6701K41931j39545j23091J62737a15220B61944
$$ 151257 438063 286204 155349 222050 463981 324436 201345 364082 -115220 261944
16362B83081a2174E7844L55491A50699Q0270G9744J94206O8834J74909k12904
$$ 283081 -12174 57844 413335 150699 230969 79744 273950 342784 517693 304789
16352C04789j45586P6616A6154L23278H494K47953f2876A7345J84685J83673M222
$$ 304789 159203 235819 16154 339432 8494 256447 -62876 17345 202030 385703 389925
16341C89925j7336j66784K8222J71235r2587N1602J56995F3431K28157J04185
$$ 389925 372589 205805 234027 405262 312675 364277 521272 63431 291588 395773
16331C95773r3025d7412r923B09988a14924D71019A27230J6501L1524o5191J89117
$$ 395773 302748 -47412 -57335 209988 -114924 471019 127230 143731 175255 110064 299181
16320B99181n9920p3406K44364A18230P6216l2641n6648J51344j21704K09493
$$ 299181 239261 165855 410219 118230 194446 161805 105157 256501 134797 344290
16310C44290A54824J5436a19314D57625k08411D5209K05183k8969C5320J77834
$$ 344290 154824 170260 -119314 457625 249214 45209 250392 221423 35320 213154
16300B13154N753i8769B5299K80221a18750B13777R5912C0469R1497J64609A2076
$$ 213154 218907 -98769 25299 305520 -118750 213777 309689 30469 121966 286575 12076
16288I1238M13008a39624A28204j0931J56277c4522H0110e2070j28957B68955
$$ 91238 504246 -139624 128204 117273 273550 -34522 80110 -52070 -181027 268955
16277A44685J87367A35851J44468a71632A43095B5887J9485J13978J61505j31414
$$ 144685 332052 135851 280319 -171632 143095 25887 45372 159350 320855 189441
16267A89441k3478J2851P9362b5216B8059M0534K2523e837F0463L15197A07821
$$ 189441 165963 178814 258176 -25216 28059 68593 91116 -5837 60463 375660 107821
16255E0564b25390A01894J27838G1761J04026D4575a43089K9408k4935E8280N10477
$$ 50564 -225390 101894 229732 71761 175787 44575 -143089 -113681 -138616 58280 568757
16244E68757A56993N289A8029J72093q2740J92913f723B08031R164i9980m8276
$$ 568757 156993 162282 18029 190122 107382 300295 -6723 208031 217195 -99980 -148256
16233a48256E0271a978A36224f5957A36217o1422J29884B4158K66409j27235a94643
$$ -148256 50271 -1978 136224 -65957 136217 74795 204679 24158 290567 163332 -194643
16221A21491a96411Q0790A7205J19803B1911e6722j70200A75707m7008K26446
$$ 121491 -196411 -115621 17205 137008 21911 -56722 -226922 175707 128699 355145
16211C55145A61958a56792b8429k6515A42659e0256A52428R7795r9437J74220
$$ 355145 161958 -156792 -28429 -54944 142659 -50256 152428 250223 150786 325006
16201C25006a24943B93584a7833A07650a19232B21992n5360N0326h2644p9154
$$ 325006 -124943 293584 -17833 107650 -119232 221992 166632 216958 -82644 -161798
16191a61798A20231e0598C26078a88745D2877g8432C65826n5312J5606c7891A67456
$$ -161798 120231 -50598 326078 -188745 42877 -78432 365826 310514 326120 -37891 167456
16179F6970a76850A32312m8062K63165A00364J9315J03247a29244B26139j9311
$$ 66970 -176850 132312 84250 347415 100364 119679 222926 -129244 226139 206828
16169B06828K9651l3849b44370A85293a33701B85241n4673a02471C0691J21447
$$ 206828 236479 202630 -244370 185293 -133701 285241 230568 -102471 30691 152138
16159A52138m2187J28747a3953k27714B83000l7955p7171i3648C7978b40114E2042
$$ 152138 109951 238698 -13953 -241667 283000 245045 167874 -93648 37978 -240114 52042
16147E7322J28452a99678N6757A18654M0757K15352j31250h8717j5372j76679
$$ 57322 185774 -199678 -142921 118654 159411 374763 243513 -88717 -104089 -280768
16137b80768j07404a12287e4891A4312J45915a73981B21638g49A08172a93177
$$ -280768 -388172 -112287 -54891 14312 160227 -173981 221638 -749 108172 -193177
16126b9823C49609a47847b0886C5515N6960N3659D6384a94624A08819L9230A2119
$$ -29823 349609 -147847 -20886 35515 92475 146134 46384 -194624 108819 148049 12119
16114I87L92572A5758i5167c3248j88177d4965B88845A20296e4356p3101j58798
$$ 987 393559 15758 -95167 -33248 -221425 -44965 288845 120296 -54356 -127457 -286255
16103b86255B2662a66012i131j460l2107A80506d7877A08525n3240r055c34904
$$ -286255 22662 -166012 -9131 -10591 -42698 180506 -47877 108525 55285 46230 -334904
16091G8109Q9696J5184b89321A87701J58476H7032K71709a55647C09809C5416
$$ 78109 167805 182989 -289321 187701 346177 87032 358741 -155647 309809 35416
16080b7922A90041L4154a10691q4451H8549b09876f580k40779A2294J23894J34210
$$ -27922 190041 224195 -110691 -195142 88549 -209876 -6580 -247359 12294 136188 270398
16069B70398b19955g7168j02100o3819B35925g0060j11078l0925B4840L2997J70772
$$ 270398 -219955 -77168 -179268 -243087 235925 -70060 -181138 -212063 24840 57837 228609
16058B28609A0813C137K9916b15361B5798h7460D17928l9935j04304p6489f2949
$$ 228609 10813 3137 33053 -215361 25798 -87460 417928 377993 273689 197200 -62949
16046c229j5662j83650L6405A39632C4683O1190O41K0113K868b01216d3732k25908
$$ -3229 -18891 -202541 -166136 139632 34683 95873 96514 116627 119495 -201216 -43732 -269640
16034b69640g9004k04174f0701m91368A26584f3987B48520c20023b215j38694
$$ -269640 -79004 -283178 -60701 -552069 126584 -63987 248520 -320023 -2215 -140909
16024a40909L1193l6040m9672C14042A0954a57074b1360j05352j00743A55656
$$ -140909 -109716 -145756 -195428 314042 10954 -157074 -21360 -126712 -227455 155656
16013c1330p7632B13598K65511A73172p8967d9833m2484J2662M153c4732r1650
$$ -31330 -108962 213598 479109 173172 94205 -49833 -92317 -79655 -75502 -34732 -126382
16002a26382E7791j9197h3691a9957D8240a57801A18462b94437n9999C81235j63078
$$ -126382 57791 38594 -83691 -19957 48240 -157801 118462 -294437 -354436 381235 218157
15991B18157j05054b5931j11431j2611e3772k07437c6122n7271r8446A3611K70708
$$ 218157 113103 -25931 -137362 -149973 -53772 -261209 -36122 -93393 -191839 13611 284319
15980B84319A4783a58902F1876b6316r9496A28078h4582o0204g157A13020M45392
$$ 284319 14783 -158902 61876 -26316 -125812 128078 -84582 -144786 -7157 113020 558412
15969E58412G5489J28871E9569J41893l2013h7930F1836J38921I9373c14584R4248
$$ 558412 75489 204360 59569 201462 169449 -87930 61836 200757 99373 -314584 -220336
15958b20336a7028j80217C7301c7274B37356a20881k07877A70432C1370a83682
$$ -220336 -17028 -197245 37301 -37274 237356 -120881 -328758 170432 31370 -183682
15947B31184A07862f3915K4600C9629J62771J54283f1392o3449k7876A725N7418
$$ 231184 107862 -63915 -39315 39629 202400 356683 -61392 -124841 -152717 1725 59143
15936E9143c57839A01013b22761c5898O793C15756b82603a06278B8162a10818
$$ 59143 -357839 101013 -222761 -35898 -29105 315756 -282603 -106278 28162 -110818
15925a37813B12304a67462C2637e9728j23889e5360j26130F5084a90859k2238
$$ -137813 212304 -167462 32637 -59728 -183617 -55360 -181490 65084 -190859 -213097
15915b13097A06411e8453b6578m9996B6069g3994c1257k36251B93472a61674g6477
$$ -213097 106411 -58453 -26578 -76574 26069 -73994 -31257 -267508 293472 -161674 -76477
15903D5277a74481A8239a84811a4641l01075H4102Q641d08331A20177g1025j51594
$$ 45277 -174481 18239 -184811 -14641 -315716 84102 92743 -408331 120177 -71025 -222619
15892b22619J697A32995J32239c69593a66138o4465h5662I4690n501j4385a36006
$$ -222619 -220922 132995 265234 -369593 -166138 -230603 -85662 94690 89189 74804 -136006
15880h6828j13237A0979L24458F1783a5535k2120k4472r1169p3828A72339G3184
$$ -86828 -200065 10979 335437 61783 -15535 -37655 -62127 -153296 -227124 172339 73184
15868A93098c14656d2712m33125e6238p5096O5144a9044A33576C7057j5475b55271
$$ 193098 -314656 -42712 -475837 -56238 -131334 -66190 -19044 133576 37057 21582 -255271
15856c17090A9156b6892k84546A44692a13392q79B2305a19908B914a08702D3122
$$ -317090 19156 -26892 -311438 144692 -113392 -114271 22305 -119908 2914 -108702 43122
15844c09400A67621e6528p3515l7379f6455g121b990l8591A67563c5278A38277
$$ -309400 167621 -56528 -130043 -167422 -66455 -7121 -2990 -41581 167563 -35278 138277
15832a21006J4457M0970j41601D3587b09258r3987o894A49310d6632m3332f875
$$ -121006 -106549 -65579 -207180 43587 -209258 -303245 -310139 149310 -46632 -89964 -6875
15820g4821G7292l7806b03083j54951D40312j86592a9227H4372M121l1733a56765
$$ -74821 77292 39486 -203083 -358034 440312 253720 -19227 84372 88493 56760 -156765
15808a23480C05009a63528C0096b11055m8871C2993J34105C6631N1968j9174e3063
$$ -123480 305009 -163528 30096 -211055 -259926 32993 167098 36631 88599 69425 -53063
15796b8507n1620k4111B3407b72295a26377A67459d5976I4779B3562g991I2977
$$ -28507 -80127 -104238 23407 -272295 -126377 167459 -45976 94779 23562 -7991 92977
15784A31386N193r565J5877J41781d4700J3590n5752m0500o9039Q1974A49965
$$ 131386 136579 127014 142891 284672 -44700 -31110 -86862 -127362 -196401 -114427 149965
15772A07877b05266A9291R0039b45086g7951F0693c2180B92723E1369N9423a28449
$$ 107877 -205266 19291 109330 -245086 -77951 60693 -32180 292723 51369 110792 -128449
15760i9712a0654j87865b2169j1789j08550A60432e0615n1023k10305B2404I450
$$ -99712 -10654 -198519 -22169 -33958 -142508 160432 -50615 -101638 -311943 22404 9450
15748g6809q9593B42769c2822A72622a04578b0449n0749I5432a45761n5897B08395
$$ -76809 -166402 242769 -32822 172622 -104578 -20449 -71198 95432 -145761 -201658 208395
15736b8942j46613A65356f4732l63157f2859k0707B9073h0417c3893A25320c88433
$$ -28942 -175555 165356 -64732 -427889 -62859 -83566 29073 -80417 -33893 125320 -388433
15724b09172C8391N1978A2832K6052L20678a92436A64645b28410c0367A69399
$$ -209172 38391 90369 12832 38884 359562 -192436 164645 -228410 -30367 169399
15713a0103A2876a53202B29882h7782k16086M7868A10658b04494q1352c737l9530
$$ -10103 12876 -153202 229882 -87782 -303868 -256000 110658 -204494 -285846 -3737 -43267
15702d3267A45886a71314B27764a1113k38391Q7591k4518r423B3892G421h3275
$$ -43267 145886 -171314 227764 -11113 -249504 -161913 -186431 -195854 23892 7421 -83275
15690d1999A9282J3751b2126A39303Q8829E6143a83488N3213J8829B4254a62728
$$ -41999 19282 33033 -22126 139303 228132 56143 -183488 -130275 -111446 24254 -162728
15678a84769e0507j01348B78538a25784I3768P0838M659a9B71622G1878C2679
$$ -184769 -50507 -151855 278538 -125784 93768 164606 169265 -19 271622 71878 32679
15666a26886c4900J7161D7604K52769b65710M0472H104c70294a01315A48630J21990
$$ -126886 -34900 -17739 47604 300373 -265710 -225238 8104 -370294 -101315 148630 270620
15655B70620k6029p8860P2506c5179H8958O6406h9090I0580a02201k5690F433
$$ 270620 244591 165731 238237 -35179 88958 155364 -89090 90580 -102201 -127891 6433
15643d47317A3924c12926J24919A26411k2188a37349H5730a18565C128K51330
$$ -447317 13924 -312926 -188007 126411 104223 -137349 85730 -118565 3128 254458
15633B54458d84608G7336M4275b01568A06894e3926b3162k06867f1310K4709k8471
$$ 254458 -484608 77336 121611 -201568 106894 -53926 -23162 -230029 -61310 -36601 -65072
15622f5072b0558k68685c664C0912J04480a49891A87058D6659b43900G4601M2888
$$ -65072 -20558 -289243 -3664 30912 135392 -149891 187058 46659 -243900 74601 117489
15611A17489c94622A36212a23531I6436B304K21646Q6759n0799A2434c5251B15682
$$ 117489 -394622 136212 -123531 96436 2304 223950 310709 259910 12434 -35251 215682
15599a8022p3557I0258L8859E4640c17557i0307c6760k38271B79299A07151i8570
$$ -18022 -91579 90258 129117 54640 -317557 -90307 -36760 -275031 279299 107151 -98570
15587C5578c6337B3024n409d5501j42697P6179j73074d3486A07457i6110p9922
$$ 35578 -36337 23024 17615 -45501 -188198 -112019 -285093 -43486 107457 -96110 -176032
15576a76032B65836f6265k04696a16562I538J1778J59146E0507J23874g0631m8406
$$ -176032 265836 -66265 -270961 -116562 9538 21316 180462 50507 174381 -70631 -119037
15565a19037M8353i868A42173a12025A15895a75022b6432q4357j19630a14962
$$ -119037 -70684 -9868 142173 -112025 115895 -175022 -26432 -110789 -230419 -114962
15554C7406K03467a05328B72799H0363J61519D603d04531F8163R9056H2063a79570
$$ 37406 240873 -105328 272799 80363 241882 4603 -404531 68163 167219 82063 -179570
15542b7304O333A31060J14724o7039c32238H2582J37J82053j21182b70846a22202
$$ -27304 -20971 131060 245784 178745 -332238 82582 82719 264772 143590 -270846 -122202
15530a36191A54802f5505C0862h9342a7611p7430A16959a10908G4496f207A55684
$$ -136191 154802 -65505 30862 -89342 -17611 -95041 116959 -110908 74496 -6207 155684
15518A40994n4661e4726j30072n7626A5805b7705D5197L58228A0170g2381b5326
$$ 140994 86333 -54726 -184798 -242424 15805 -27705 45197 403425 10170 -72381 -25326
15506a4096j09790F9145M7763c3870k49319I4127Q224C8433b07264E3723a33608
$$ -14096 -123886 69145 116908 -33870 -283189 94127 102351 38433 -207264 53723 -133608
15494a2648A51171M1613K78519a59119g0661n4484k92228K584i1054B6971g7123
$$ -12648 151171 192784 471303 -159119 -70661 -125145 -417373 -414789 -91054 26971 -77123
15482a87947A59474C3983J02414n7441H21a00630j24055p3291H6003M3899a06833
$$ -187947 159474 33983 136397 78956 821 -100630 -224685 -297976 86003 129902 -106833
15470b64676Q2541C9192b10448B64960g9203H4885c18544c2874j85608a07069
$$ -264676 -182135 39192 -210448 264960 -79203 84885 -318544 -32874 -218482 -107069
15459c08158D5979e5361j84184P3075J2522H5074j5716b22014G2682e2971A72238
$$ -308158 45979 -55361 -239545 -166470 -153948 85074 69358 -222014 72682 -52971 172238
15447b2467B99611C2921a99741A51198h1835A17322J02396m9660a832A02286J02246
$$ -22467 299611 32921 -199741 151198 -81835 117322 219718 170058 -1832 102286 204532
15436B04532G6274r026J5020a05386c5139E406K45297j07002a07914k43741C77668
$$ 204532 76274 67248 82268 -105386 -35139 5406 250703 143701 -107914 -351655 377668
15424A98929a97284f0125l4153n9646j76368h87l1045E347a64920A26714g7367
$$ 198929 -197284 -60125 -94278 -153924 -330292 -887 -31932 5347 -164920 126714 -77367
15412h2027B19091l1796a72681a6949O143q0556C7032A4151M1712i5941L0550
$$ -82027 219091 187295 -172681 -16949 -10806 -91362 37032 14151 55863 -95941 -65391
15401f5391b9246j09482B50575b75497H4315P4958c82771A84663c4801B7498h0120
$$ -65391 -29246 -138728 250575 -275497 84315 159273 -382771 184663 -34801 27498 -80120
15389d4733A27522L8211h2719F1832b80790A08192E1678a82549l6058B15472F3385
$$ -44733 127522 165733 -82719 61832 -280790 108192 51678 -182549 -218607 215472 63385
15377A10321J5686b2271A40524o7382Q8315p8368J11843a02002G1701a61419B66135
$$ 110321 126007 -22271 140524 73142 161457 83089 194932 -102002 71701 -161419 266135
15365a2230m6075a9692A20841b84340J12535g3340n6917A28682n7356J9273b06627
$$ -12230 -58305 -19692 120841 -284340 -171805 -73340 -130257 128682 71326 90599 -206627
15353b07826A15493a09118D43421B6942b8258m6438D9583c1290j25203n7925A18666
$$ -207826 115493 -109118 443421 26942 -28258 -74696 49583 -31290 -156493 -214418 118666
15341h4743J7526B12356m8999q0422G188J25300C8347J36154d81700B45928q1307
$$ -84743 -67217 212356 163357 82935 7188 132488 38347 174501 -481700 245928 164621
15330A64621c2320D03562A61559B8078a28713D52601j94180g0446J129j03522
$$ 164621 -32320 403562 161559 28078 -128713 452601 258421 -70446 -69317 -172839
15320a72839g5446A79748c8017j20054I1095A5192J09146J1782d8250l840J047
$$ -172839 -75446 179748 -38017 -158071 91095 15192 124338 136120 -48250 -52090 -51043
15309e1043C91416a98699E5155a18326M3700D34652a67218A53813o2034l7827
$$ -51043 391416 -198699 55155 -118326 -74626 434652 -167218 153813 91779 53952
15299E3952P1306c8705k5145D4913c59722D5982J54440l353a5916A46522e7463
$$ 53952 125258 -38705 -63850 44913 -359722 45982 200422 197069 -15916 146522 -57463
15287b2773G6836c51148F3691J40120C7021b67126P5033A05549J91f9404H4518
$$ -22773 76836 -351148 63691 203811 37021 -267126 -192093 105549 105740 -69404 84518
15275A75375j6602A2522N6648L5215K9283i9770B13975a02395l793K2863D4410
$$ 175375 158773 12522 69170 104385 133668 -99770 213975 -102395 -106188 -83325 44410
15263a10843G4648A3863i6808C01375b81783J31141H2855b78395a13684E0359
$$ -110843 74648 13863 -96808 301375 -281783 -150642 82855 -278395 -113684 50359
15252a72922j84824d9774A99613f0918A34511k5860M9469p0568N3432K95326a35731
$$ -172922 -357746 -49774 199613 -60918 134511 108651 158120 87552 140984 436310 -135731
15240B10586M90370k35423j71367A03130J88515j16239P64892j80714O12662m20028
$$ 210586 700956 465533 294166 103130 291645 175406 940298 759584 1372246 952218
15230I52218l35038k82710D3842P7643A6041L34671j54278l3542m8498j6326m3974
$$ 952218 617180 334470 43842 121485 16041 350712 196434 162892 114394 98068 54094
15219E4094J62791i3488m7589f2451A85993a14948B63963b2218j35238A86642
$$ 54094 216885 -93488 -141077 -62451 185993 -114948 263963 -22218 -157456 186642
15208F8375g9070A27375M35364A75562K49535e29310a79490h4288A14267C1662
$$ 68375 -79070 127375 562739 175562 425097 -529310 -179490 -84288 114267 31662
15197D0124a00180A97260K4294p3656a66966A67640d3372A25858a43457a5439
$$ 40124 -100180 197260 221554 147898 -166966 167640 -43372 125858 -143457 -15439
15186A94452K2881e3813a930j85011A85573b2148A68032i9913A82201Q9644c85142
$$ 194452 217333 -53813 -1930 -186941 185573 -22148 168032 -99913 182201 271845 -385142
15174a98867c5889n3674B6752K64359G073d7324A85324J20705A36689l1350l9083
$$ -198867 -35889 -89563 26752 291111 7073 -47324 185324 306029 136689 105339 66256
15163F6256g9728A40262J03733c8497c562H8165M948a87072A72908R8647N5148
$$ 66256 -79728 140262 243995 -38497 -3562 88165 93113 -187072 172908 271555 326703
15152C26703A8411K15612b29021k9341A06174L37856b4821B96a56969A46170J27039
$$ 326703 18411 234023 -229021 -258362 106174 444030 -24821 296 -156969 146170 273209
15141B73209M8336J6895b3866E4805b38419E8174g3434C09268B0558L15683a36745
$$ 273209 321545 338440 -23866 54805 -238419 58174 -73434 309268 20558 336241 -136745
15129E5763k1989a3820A97229D9228P2572l3605a39179h68B4049O7815k2495K62862
$$ 55763 33774 -13820 197229 49228 121800 88195 -139179 -868 24049 91864 69369 332231
15117C32231A34440N1108F2669L17938j21894D2001f0559A23386c9993E5246A9944
$$ 332231 134440 185548 62669 380607 258713 42001 -60559 123386 -39993 55246 19944
15105A41537K51789c5173j72278C33824A55339d3123B71777D0766J24017K1017
$$ 141537 393326 -35173 -207451 333824 155339 -43123 271777 40766 164783 185800
15095A85800K13184j49359e3677C70196b01941C31269k2521n1273N6360j41249
$$ 185800 398984 249625 -53677 370196 -201941 331269 308748 257475 313835 172586
15085A72586C0206J46724D8577N9966J72320J3060A27546J18033h649M129D6704
$$ 172586 30206 176930 48577 108543 280863 293923 127546 245579 -8649 -4520 46704
15073A31239K88374A46430M3407a52084C58137B8816L38374A63039o7109N6548
$$ 131239 419613 146430 189837 -152084 358137 28816 367190 163039 95930 152478
15063A52478c3943a6124C73460c5094i514B43164K37634F9145L9124J34742j20540
$$ 152478 -33943 -16124 373460 -35094 -9514 243164 480798 69145 108269 243011 122471
15052A22471d1065B13977a12998d3538D19490q2520N4606d8024A18681J68145
$$ 122471 -41065 213977 -112998 -43538 419490 336970 391576 -48024 118681 286826
15042B86826A16553M1547K9179J29658E3646L58004A08713D7332A8506J26835
$$ 286826 116553 158100 187279 316937 53646 411650 108713 47332 18506 145341
15032A45341C3447K5423a5595B23886J33214A49732R4243C8073J88330F8842b44505
$$ 145341 33447 58870 -15595 223886 357100 149732 243975 38073 226403 68842 -244505
15020H6139C9408O8329b6545l1801J2309C5388b2415B17109p9452C8469a43474
$$ 86139 39408 107737 -26545 -58346 -46037 35388 -22415 217109 137657 38469 -143474
15008A18094K73457A03651J945J91232k2447J55430j00784R626n6484P6895j00888
$$ 118094 391551 103651 105596 296828 274381 429811 329027 338653 282169 359064 258176
14997B58176P3393A5805O4489J4238B6629a6134A35368J47976E9708L79264A64782
$$ 258176 331569 15805 80294 94532 26629 -16134 135368 283344 59708 438972 164782
14985a37827H2126L45632j78994g680B38638p3089N4407K2709J34739j447j72912
$$ -137827 82126 427758 248764 -7680 238638 165549 219956 242665 377404 375957 203045
14974B03045F3226K02281i0371B01133J18422D9119L60488A84502J97193O0629
$$ 203045 63226 265507 -90371 201133 319555 49119 409607 184502 381695 442324
14964D42324A34677m7187a16865A3643L0752P6532K38032A59907o8547K73787
$$ 442324 134677 87490 -116865 13643 44395 120927 358959 159907 91360 365147
14954C65147j48730Q8204A30731J8558P0398D1382K17305j726J6073A15875J32093
$$ 365147 216417 304621 130731 149289 219687 41382 258687 256961 273034 115875 247968
14943B47968F1411Q9656N6177J25047j20932p6729D2686L56128j66978P7890K04301
$$ 247968 61411 151067 207244 332291 211359 134630 42686 398814 231836 309726 514027
14932E14027j77349A54741B8404K29684G3976b09924C45957J36333A04442j5989
$$ 514027 336678 154741 28404 258088 73976 -209924 345957 482290 104442 88453
14922H8453O5183P8746P9067j20357K57648q2169J22349A84149j5081J76019A17590
$$ 88453 153636 232382 311449 191092 448740 366571 488920 184149 169068 345087 117590
14910A10302J40657a33037G8025K85426A54574J44950p5510K08277j41244J32512
$$ 110302 250959 -133037 78025 363451 154574 299524 224014 432291 291047 423559
14900D23559j69480L24287A84113p0899R1664M4204A19736K05690L21052l02535
$$ 423559 254079 578366 184113 113214 204878 249082 119736 325426 646478 343943
14890C43943C263J68621J55029n8265M8403R3295J2033j99588o6084j0897k2572
$$ 343943 3263 171884 326913 268648 317051 410346 422379 222791 156707 145810 123238
14879A23238J9613N6081Q5226l06J9395R1093r2557L75341l17975j05526K07119
$$ 123238 142851 198932 284158 283852 303247 394340 301783 677124 359149 253623 460742
14868D60742P0143k04839o376K00368j31334k5802C9892m528M68945k13395J02370
$$ 460742 530885 326046 319670 520038 388704 362902 39892 35364 504309 290914 393284
14857C93284j35641E5929K89775A27206N2101J36386j12538J11671R970D7217
$$ 393284 257643 55929 345704 127206 179307 315693 203155 314826 324796 47217
14846C51296A29485L35377l2070Q7044B02169K22015l8413m1830J50190j37290
$$ 351296 129485 464862 432792 519836 202169 424184 385771 343941 494131 356841
14836C56841j22511K63339j20551Q6232j0435J48252k63323L5912J24771A63668
$$ 356841 234330 497669 377118 463350 452915 601167 337844 373756 498527 163668
14825B14893J48807P723K19401A70098L0624K3131o9155M91644j49951j21668
$$ 214893 363700 371423 590824 170098 200722 223853 154698 646342 496391 374723
14815C74723j63205L23996J1944N8019H9891L17559o7266j19324K95844J84300
$$ 374723 211518 535514 547458 605477 89891 407450 340184 220860 516704 701004
14805G01004l43655A08201N79977l28647J26467m1576j65016j29560J55625L2059
$$ 701004 357349 108201 688178 359531 485998 444422 279406 149846 305471 337530
14795C37530O1061j30285K84320o3854q5549J74433A66339K13659J93804k0111
$$ 337530 398591 268306 552626 488772 403223 577656 166339 379998 573802 553691
14785E53691o7653J87485l7793n1009N1775j09053j68198n0979J54527J85406
$$ 553691 486038 673523 635730 584721 636496 527443 359245 308266 462793 648199
14775F48199o5578k06099K07217K2703k9946r9072k17984M169J42199J87199n7119
$$ 648199 582621 376522 583739 606442 576496 477424 259440 263609 405808 593007 535888
14764E35888j35772k6921n6766n56A40195N29362k5296O6285j16288m1251K64125
$$ 535888 400116 373195 316429 315873 140195 669557 644261 710546 594258 553007 817132
14753H17132q1679l01479J88464k20816K65674j54121K29642l18473K79901l3042
$$ 817132 735453 433974 622438 401622 667296 513175 742817 424344 704245 671203
14743F71203L41271m46628K68004l63599J59683K3291M4876l42499L08816k37427
$$ 671203 1012474 565846 833850 470251 629934 653225 698101 355602 664418 426991
14733D26991K54016J10988K21593m64631K16871J10586j45619j92261j22683L78610
$$ 426991 681007 791995 1013588 548957 765828 876414 730795 538534 415851 794461
14723G94461j33373j45141N2963J8518J0163J25250k12849K30071l1563k25221
$$ 794461 661088 515947 568910 587428 597591 722841 509992 740063 708500 483279
14713D83279N10510l02709j24499K10617l15612M32805j48652K89978k15507P5728
$$ 483279 993789 691080 566581 777198 461586 894391 745739 1035717 820210 895938
14703H95938D11036M96790n4038n356o8757J06393p1251j38601K28708j71189
$$ 895938 411036 907826 853788 848432 779675 886068 814817 676216 904924 733735
14693G33735Q2818l3623M9608m4737L1985p8939j12054L19907K848J01574l62915
$$ 733735 816553 782930 832538 787801 819786 740847 628793 948700 951548 1053122 690207
14682F90207K01447j46582L53039k47969K75848l02082J56218r097j57690J95984
$$ 690207 891654 745072 1098111 850142 1125990 823908 980126 971029 813339 1009323
14672A009323j53302j3208n1537R821J55610J03826m18337M57158j58764J36309
$$ 1009323 856021 842813 791276 801097 956707 1060533 642196 1099354 940590 1076899
14662A076899j68134r1537j58242O11239n75753J46006j28503M25103k4201k32477
$$ 1076899 908765 817228 658986 1270225 694472 840478 711975 1137078 1112877 880400
14652H80400J9788R2173J22459k32131J06250K2423Q673k29900K14170j19895
$$ 880400 900188 992361 1114820 882689 988939 1011362 1020035 790135 1004305 884410
14642H84410K02705K11657J6217j50821K48280l39101R0804k84140K82632L7844
$$ 884410 1087115 1298772 1314989 1164168 1412448 1073347 1164151 880011 1162643 1200487
14632A200487l3213j19002L13454l84618q351M13730k12061k35080L58342j88897
$$ 1200487 1167274 1048272 1361726 977108 968757 1382487 1170426 935346 1293688 1104791
14622A104791k31320M41740R1415m79955M31490m0274o1357J75402l51042l7074
$$ 1104791 873471 1315211 1406626 926671 1358161 1317887 1256530 1431932 1080890 1043816
14612A043816J22665J91153k33043M19114m50810L56418j18553p8032q2884R6315
$$ 1043816 1166481 1357634 1124591 1543705 1092895 1449313 1330760 1252728 1169844 1266159
14602A266159Q8872K30839k75849j33189K27003J23270J19227l21273m913R4655
$$ 1266159 1355031 1585870 1310021 1176832 1403835 1527105 1646332 1325059 1320146 1414801
14592A414801K21995m39536K33476L29482l55453M23197l46678k56182K87395
$$ 1414801 1636796 1197260 1430736 1760218 1404765 1827962 1481284 1225102 1512497
14583A512497q8621M08097l86959L04795k85166N2245M28980o00640N58636j98794
$$ 1512497 1423876 1831973 1445014 1749809 1464643 1516888 1945868 1345228 1903864 1705070
14573A705070K00027j77739J56212K69158k73890N4117K3270k57068L62047q6832
$$ 1705070 1905097 1727358 1883570 2152728 1878838 1932955 1956225 1699157 2061204 1974372
14563A974372m996K47166l63203K63612J35465j53209K90318l40801M12590j321
$$ 1974372 1969376 2216542 1853339 2116951 2252416 2099207 2389525 2048724 2461314 2459993
14553B459993k76195j50029L03543j07370L41126K91998l10270J24321j6613M53354
$$ 2459993 2183798 2033769 2337312 2229942 2571068 2863066 2552796 2677117 2660504 3113858
14543C113858k36790N11494J64411L52196K57934N81570M46232N89124J586151
$$ 3113858 2877068 3388562 3552973 3905169 4163103 4744673 5190905 5780029 7366180
14534G366180K007926L364013O352491J0151931K969035j2713011p990280l810733
$$ 7366180 9374106 12738119 19090610 29242541 32211576 19498565 11508285 7697552
14526G697552k352398j452916l34698l84038j76200j37061m96288O7786j34691
$$ 7697552 5345154 3892238 3557540 3173502 2997302 2860241 2363953 2431739 2297048
14517B297048L75232k27958j87740K4921l30880K22109J0096K88079k07112l9027
$$ 2297048 2672280 2444322 2256582 2281503 1950623 2172732 2182828 2470907 2263795 2224768
14507B224768J85722j5717j0235k33303M52577J4687K11229Q3391j31182l40207
$$ 2224768 2410490 2394773 2384538 2151235 2603812 2618499 2829728 2913119 2781937 2441730
14497B441730K67344N2957M1207j04551K6586J4326Q2693K4864J26302K1280j59978
$$ 2441730 2709074 2762031 2803238 2698687 2725273 2739599 2822292 2847156 2973458 2994738 2834760
14486B834760Q0456J97038j36824L73423m45118L62045J57603j94058K89443l71669
$$ 2834760 2915216 3112254 2975430 3348853 2903735 3265780 3423383 3229325 3518768 3147099
14476C147099K18575J4869M3172J58953N4926r4085J10977N2310M2821j71044
$$ 3147099 3365674 3380543 3423715 3582668 3637594 3543509 3654486 3706796 3749617 3578573
14466C578573q6523M71597l97351L74854r8929Q3273J76701j94964R2761M3578
$$ 3578573 3492050 3963647 3566296 3941150 3842221 3925494 4102195 3907231 3999992 4043570
14456D043570R3940N03013k12386k71742r2563M35726K01377n56352O58053k14127
$$ 4043570 4137510 4640523 4428137 4156395 4063832 4499558 4700935 4144583 4802636 4588509
14446D588509J51368J16847k717K2720L82000l73116K23580k25356K0758N66091
$$ 4588509 4739877 4856724 4854007 4876727 5258727 4885611 5109191 4883835 4904593 5470684
14436E470684j10531k62213M74798q4667J90649m38969M20089R4094r1043J98452
$$ 5470684 5360153 5097940 5572738 5488071 5678720 5239751 5659840 5753934 5662891 5861343
14426E861343R7539J60927k32116M69605M68174m05109j723L82099l78494J59326
$$ 5861343 5958882 6119809 5887693 6357298 6825472 6420363 6418640 6800739 6422245 6581571
14416F581571L59042j68548N21225j42621J32442N4676J51380k63415K05477L41085
$$ 6581571 6940613 6772065 7293290 7150669 7283111 7337787 7489167 7225752 7431229 7772314
14406G772314K15970m82574N55066K1112J53043K81088k5921n8046K53423n1621
$$ 7772314 7988284 7505710 8060776 8081888 8234931 8516019 8490098 8432052 8685475 8633854
14396H633854N2825M16497j58353O54515J53225j58615K35560K12002K50670J65838
$$ 8633854 8686679 9103176 8944823 9599338 9752563 9593948 9829508 10041510 10292180 10458018
14386A0458018K70998l92384M81980K5737L60566P9562O39920J0460k3249K59344
$$ 10458018 10729016 10336632 10818612 10844349 11204915 11284477 11924397 11934857 11911608 12170952
14376A2170952K02062J73525M34133p5809K55150l8557P34782K2662L17200J87263
$$ 12170952 12373014 12546539 12980672 12904863 13160013 13121456 13856238 13878900 14196100 14383363
14366A4383363R993M28410K66838M88921L63832J43494K42245K72776R8502P55330
$$ 14383363 14393356 14821766 15088604 15577525 15941357 16084851 16327096 16599872 16698374 17453704
14356A7453704L84426K30800L95536N60030K82589L96094L09703O46511N88042
$$ 17453704 17838130 18068930 18464466 19024496 19307085 19703179 20012882 20659393 21247435
14347B1247435L2758N30629P16156K33734J068237K68676L90766N03331O57663
$$ 21247435 21280193 21810822 22526978 22760712 23828949 24097625 24488391 24991722 25649385
14338B5649385J114689R6887R72087L01608J259369N15206R50969P32691O78413
$$ 25649385 26764074 26860961 27833048 28134656 29394025 29909231 30860200 31592891 32271304
14329C2271304J130176O46942R47041J034179R69605Q57934J318861J014310J212848
$$ 32271304 33401480 34048422 34995463 36029642 36999247 37857181 39176042 40190352 41403200
14320D1403200J425730J186092J210213J486211J421272J632756J876261J529634
$$ 41403200 42828930 44015022 45225235 46711446 48132718 49765474 51641735 53171369
14312E3171369K011434J733914K221212J783391K403823K015231K304148K373832
$$ 53171369 55182803 56916717 59137929 60921320 63325143 65340374 67644522 70018354
14304G0018354K731541K675018K818714L132876L085615L554489L555376L648999
$$ 70018354 72749895 75424913 78243627 81376503 84462118 88016607 91571983 95220982
14296I5220982M266529M039089M503872M346475N112604N625402N604830N816754
$$ 95220982 99487511 103526600 108030472 112376947 117489551 123114953 128719783 134536537
14288A34536537O104082O431301P180031P508360P805438Q592893Q853780R327116
$$ 134536537 140640619 147071920 154251951 161760311 169565749 178158642 187012422 196339538
14280A96339538R672627J0671729J1163345J1803472J2252761J2840921J3590784
$$ 196339538 206012165 216683894 227847239 239650711 251903472 264744393 278335177
14273B78335177J3754520J4427421J4788470J3966171J4493492J4186620J3421772
$$ 278335177 292089697 306517118 321305588 335271759 349765251 363951871 377373643
14266C77373643J2719849J1520151J0667108R641729Q500017P511122P002059
$$ 377373643 390093492 401613643 412280751 421922480 430422497 437933619 444935678
14259D44935678N611530L275692K68791l13801m43474l565593r951431p890580
$$ 444935678 450547208 453822900 454091691 453777890 453334416 449768823 439817392 431926812
14251D31926812j0470078j0956664j1623106j3562010j2964022j3746852j3467826
$$ 431926812 421456734 410500070 398876964 385314954 372350932 358604080 345136254
14244C45136254j3845324j4248149j3509707j3134317j3393300j2887317j2476060
$$ 345136254 331290930 317042781 303533074 290398757 277005457 264118140 251642080
14237B51642080j2169380j1510779j1336434j1308768j0212224j0346729r942609
$$ 251642080 239472700 227961921 216625487 205316719 195104495 184757766 174815157
14230A74815157q635124q282095p743058p402368o437510o574528o003519n467909
$$ 174815157 166180033 157897938 150154880 142752512 136315002 129740474 123736955 118269046
14222A18269046m840620n162242m862392m219245m147872l893739l150509l659899
$$ 118269046 113428426 108266184 103403792 99184547 95036675 91142936 87992427 84332528
14214H4332528l171264l246500l396148k350771k813774k508303k386532k345295
$$ 84332528 81161264 77914764 74518616 72167845 69354071 66845768 64459236 62113941
14206F2113941j977386j791569k017241j765829j871068j627322j480310j723360
$$ 62113941 60136555 58344986 56327745 54561916 52690848 51063526 49583216 47859856
14198D7859856j210878j517556j049461j575414j215191p68072j432787n82500
$$ 47859856 46648978 45131422 44081961 42506547 41291356 40523284 39090497 38507997
14190C8507997j225926j347155p84628r65431q97691o24619q79619q65310q30040
$$ 38507997 37282071 35934916 35150288 34184857 33287166 32662547 31782928 30917618 30087578
14181C0087578r95996q75281j48457o61122o35498o40712r03013m46558q40414
$$ 30087578 29091582 28216301 28067844 27406722 26771224 26130512 25227499 24780941 23940527
14172B3940527o27547k33788k84176m73906p64768o22739r5323p06623l60922
$$ 23940527 23312980 23079192 22795016 22321110 21556342 20933603 20838280 20131657 19770735
14163A9770735o24831n9177m53056l95044n72615j04828k98450n07038m56676
$$ 19770735 19145904 19086727 18633671 18238627 17666012 17561184 17262734 16755696 16299020
14154A6299020L5146n87209k80939l63505L5379l85489o5918n25691j46562l70439
$$ 16299020 16334166 15746957 15466018 15102513 15137892 14752403 14686485 14160794 14014232 13643793
14144A3643793n2862k42312l01659j33680k91266l21277j60807l9387l35221j48491
$$ 13643793 13590931 13348619 13046960 12913280 12622014 12300737 12139930 12100543 11765322 11616831
14134A1616831L6466n11100k74933J59484l66405k94691n9663N8594l30412r8908
$$ 11616831 11653297 11142197 10867264 11026748 10660343 10365652 10305989 10364583 10034171 9935263
14124I935263m5507o06919L65557q2791l04138k26514l16422l6910K08201n15939
$$ 9935263 9889756 9282837 9648394 9565603 9261465 9034951 8718529 8681619 8889820 8373881
14114H373881L90972n67237K24081k75039j11288J05569n23394J2789p3439m6889
$$ 8373881 8764853 8197616 8421697 8146658 8035370 8140939 7617545 7630334 7556895 7510006
14104G510006k26665N8296l442k92702J60406l43002j63523k6541l01610j26360
$$ 7510006 7283341 7341637 7338195 7045493 7205899 6862897 6699374 6672833 6371223 6244863
14094F244863J89531J65986m7374n22354L35005n10336L62247j08375m04409N6217
$$ 6244863 6434394 6600380 6553006 6030652 6365657 5855321 6217568 6109193 5704784 5761001
14084E761001p2647J18709j35950j48637l38882K07167j48139J36104n513l93760
$$ 5761001 5688354 5807063 5671113 5522476 5183594 5390761 5242622 5378726 5373213 4979453
14074D979453K07420R1611l99687N0859M5343l43089L61378k67581q8227K98832
$$ 4979453 5186873 5278484 4878797 4929656 4974999 4631910 4993288 4725707 4637480 4936312
14064D936312n05679r960J46643L2628j05180k13518m0664J18057J12441q8661
$$ 4936312 4430633 4420673 4567316 4599944 4494764 4281246 4240582 4358639 4471080 4382419
14054D382419N0883l81492N3647j84232n4079J30884j75042J49940J14094l52553
$$ 4382419 4433302 4051810 4105457 3921225 3867146 3998030 3822988 3972928 4087022 3734469
14044C734469L40561j77m61802J52366J24393m72593J18191p5634Q9634j90455
$$ 3734469 4075030 4074853 3613051 3765417 3889810 3417217 3535408 3459774 3549408 3358953
14034C358953L54591m51637J55565l16480M27184m18695K39734j50101j52980
$$ 3358953 3713544 3261907 3417472 3100992 3528176 3109481 3349215 3199114 3046134
14025C046134M44489m69258m5768p1733K81514k21377K64419l79616L55774k76853
$$ 3046134 3490623 3021365 2975597 2903864 3185378 2964001 3228420 2848804 3204578 2927725
14015B927725q8315j08470L98796k40386o3514o9833J92994n97212J57901L21366
$$ 2927725 2839410 2730940 3129736 2889350 2825836 2756003 2948997 2351785 2509686 2831052
14005B831052l75242J10841K06396k0932k13054j42738k47555L71372m8489j62196
$$ 2831052 2455810 2566651 2773047 2752115 2539061 2396323 2148768 2520140 2471651 2309455
13995B309455J45348j1379J27981m35303L39600l03619Q7638j28896L35921l21512
$$ 2309455 2454803 2443424 2571405 2136102 2475702 2172083 2259721 2130825 2466746 2145234
13985B145234j58J81467J37529l16256O53315p1629k88273N11874K36443Q05207
$$ 2145234 2145076 2326543 2464072 2147816 2801131 2729502 2441229 2953103 3189546 3994753
13975C994753L71854J738455K898691N152616R561641P608928j0036490p021345
$$ 3994753 4366607 6105062 9003753 14156369 23718010 31326938 21290448 14269103
13967A4269103m162870k485175j683715q30754n55025l28030n15297m65389j73041
$$ 14269103 10106233 7621058 5937343 5106589 4551564 4223534 3708237 3242848 3069807
13958C069807j67153o4809J4120l25203k14007K81559k73997k9379K54784l24507
$$ 3069807 2902654 2837845 2851965 2526762 2312755 2594314 2320317 2290938 2545722 2221215
13948B221215Q8298j09788j83224l1809J26625J65902l02438K14818j96744O8189
$$ 2221215 2309513 2199725 2016501 1984692 2111317 2277219 1974781 2189599 1992855 2061044
13938B061044l6665l50625L62856l01364L85605m38391O0828L33543O5489n44776
$$ 2061044 2024379 1673754 2036610 1735246 2120851 1682460 1743288 2076831 2142320 1597544
13928A597544L29067k32284N9635L384J40448m77961L20278Q6938k42354j43619
$$ 1597544 1926611 1694327 1753962 1757346 1897794 1419833 1740111 1827049 1584695 1441076
13918A441076L42532k04582j22642P5327L30271l58342J10814o8467R0231j45483
$$ 1441076 1783608 1579026 1456384 1531711 1861982 1503640 1614454 1545987 1636218 1490735
13908A490735j90684O45980l15167k58532K70189o9386k48184j8670L79716q5522
$$ 1490735 1300051 1946031 1630864 1372332 1642521 1573135 1324951 1306281 1685997 1600475
13898A600475m88468L64874l34113L07955Q77n9872J49356m04666M5718L43228
$$ 1600475 1112007 1476881 1142768 1450723 1451600 1391728 1541084 1136418 1182136 1525364
13888A525364k41493K85487j55810j98807P4090M5735L38668n80804J08662J35029
$$ 1525364 1283871 1569358 1413548 1214741 1288831 1334566 1673234 1092430 1201092 1336121
13878A336121K66353m66406K16649j40149m0030p9645K14481n2349J71749k5412
$$ 1336121 1602474 1136068 1352717 1212568 1172538 1092893 1307374 1255025 1426774 1401362
13868A401362m28038O72651l81433k41527M44750l59202k12488K906J56821L45125
$$ 1401362 973324 1645975 1264542 1023015 1467765 1108563 896075 898981 1055802 1400927
13858A400927j87905K00267k25679J39016k70158l3766J27692k13024J84290Q6566
$$ 1400927 1213022 1413289 1187610 1326626 1056468 1022702 1150394 937370 1121660 1208226
13848A208226q0535K4944J53803j22637q5211J49393l98129J90749Q0183n7517
$$ 1208226 1127691 1152635 1306438 1183801 1098590 1247983 849854 1040603 1120786 1063269
13838A063269k73945L51842j6651m5536l56059L03149L11525m27419K22635k71185
$$ 1063269 789324 1141166 1124515 1078979 722920 1026069 1337594 910175 1132810 861625
13828H61625q8279l6419J20595N0945P2026k3342J60244l433j93239J43571k2337
$$ 861625 773346 736927 857522 908467 980493 957151 1117395 1113962 920723 1064294 1041957
13817A041957l12376J28178J99116m4954K3328k56297L29851k22513M4921L80055
$$ 1041957 729581 857759 1056875 1011921 1035249 778952 1108803 886290 931211 1311266
13807A311266l46028j33121J37212M5551l62051K47629j36390J42634N2576N8213
$$ 1311266 965238 832117 969329 1014880 652829 900458 764068 906702 959278 1017491
13797A017491J02348K161l81904l7938J11423j3595J05406J50968k44902j81394
$$ 1017491 1119839 1122000 740096 702158 813581 799986 905392 1056360 811458 630064
13787F30064L31915l22595J1237K22537K64968l08693q638K77149k44827m10260
$$ 630064 961979 639384 650621 873158 1138126 829433 820795 1097944 853117 442857
13777D42857M38795J90221n12996J68807j7051K80320m58901M04724K0095J35375
$$ 442857 881652 1071873 558877 727684 710633 990953 532052 936776 956871 1092246
13767A092246m86921O0847J1311r2023p7993J60658q1195O1329k00714p140M77525
$$ 1092246 605325 666172 677483 585460 507467 668125 586930 648259 447545 440405 917930
13756I17930k54556M8212k57264N6159P4530K5928J19767k08958J95071k20266
$$ 917930 663374 711586 454322 510481 585011 610939 730706 521748 716819 496553
13746D96553L18206M2662j9597N9737p184j76036J0238B30135Q35761l52281J68042
$$ 496553 814759 857421 837824 897561 890377 714341 724579 230135 1065896 713615 881657
13735H81657n3458k64681N16822m69737j15579J14345M7303k0299k31248J01848
$$ 881657 828199 563518 1080340 610603 495024 609369 656672 636373 405125 506973
13725E06973N5952K24440k5553n3775B33520N34438O7396C69009J27931k0587
$$ 506973 562925 787365 761812 708037 233520 767958 835354 369009 496940 476353
13715D76353L89326N0197k37584l01700M7063L61482k65114L6043J18537n3646
$$ 476353 865679 915876 678292 376592 423655 785137 520023 556066 674603 620957
13705F20957J52719B99240K23883J56416j58463k06101M46423k95949L16788k26503
$$ 620957 773676 299240 523123 679539 521076 314975 761398 465449 782237 555734
13695E55734B71931J91491J92981j31659J33377K02907D26348q5144k2301n5358
$$ 555734 271931 463422 656403 524744 658121 861028 426348 341204 318903 263545
13685B63545K71319J17648C09424M87159j24121j81023O7529k10668K70531k42375
$$ 263545 534864 652512 309424 796583 672462 491439 558968 348300 618831 376456
13675C76456j48791r9340L01285J07240K67400j04897B51960N21422l16575Q2584
$$ 376456 227665 128325 429610 536850 804250 699353 251960 773382 456807 539391
13665E39391k05917J94683K50940B99095K2894A34174J30123K58004L8450M2681
$$ 539391 333474 528157 779097 299095 321989 134174 264297 522301 560751 603432
13655F03432B72480M02094k58023L8787k18145L32806Q691k85392O7157K59179
$$ 603432 272480 674574 416551 455338 237193 569999 578690 293298 360455 619634
13645F19634A39100M70379A31541Q5328J79586j90674L03323q9499Q5770o9994
$$ 619634 139100 609479 131541 216869 396455 205781 509104 419605 505375 435381
13635D35381M6076j13955q2183J2473J77896N206A52405K83428K6997j33490K54761
$$ 435381 481457 367502 285319 297792 475688 480894 152405 435833 462830 329340 584101
13624E84101C9946L20584K87951j50184j47834p1213K63058k25283J39479J36522
$$ 584101 39946 360530 648481 498297 350463 279250 542308 317025 456504 593026
13614E93026p9927R3810p8071P98l4317B37201L62909R3190q3170R918q7572m5273
$$ 593026 513099 606909 528838 529636 495319 237201 600110 693300 610130 620048 532476 487203
13602D87203J32457l01767j32469k0471Q0603e9529E14678p7385l2262o2365J22901
$$ 487203 619660 317893 185424 164953 245556 -59529 514678 437293 405031 342666 465567
13591D65567R2488j00815B17763F6484O99552A06686P2559J56847L6747j50878
$$ 465567 558055 457240 217763 66484 766036 106686 179245 336092 372839 221961
13581B21961M11184B64030K08981j20118H9700J56144O6156K20032B63223K10515
$$ 221961 633145 264030 473011 352893 89700 245844 312000 532032 263223 473738
13571D73738A91037M33134F2367L40328F4220J56005J50925Q4439Q3696i1212
$$ 473738 191037 624171 62367 402695 64220 220225 371150 455589 539285 -91212
13560B17742E6961N96463j26178F3348K58546A09869L01970L11979j94168J6073
$$ 217742 56961 653424 527246 63348 321894 109869 411839 723818 529650 545723
13550E45723j32501J08372k12650q5623L40158j08724j5041j74359J80924j78597
$$ 545723 413222 521594 308944 223321 563479 454755 439714 265355 446279 267682
13540B67682K1589K13111J08349B50289P7996A63611K90240A95260L05631A83299
$$ 267682 289271 502382 610731 250289 328285 163611 453851 195260 500891 183299
13529C79973j11539K49762A39837J29016B1647K56583C9649K45414J02601j07367
$$ 379973 268434 518196 139837 268853 21647 278230 39649 285063 387664 280297
13519B80297J7184j22529L57970G5195J70843b7672D64908E0512N04884A39480
$$ 280297 297481 174952 532922 75195 246038 -27672 464908 50512 555396 139480
13508e4194C35161B4740J68275N14410l17834D9438J80754J15632G2259M29803
$$ -54194 335161 24740 193015 707425 389591 49438 230192 345824 72259 502062
13498E02062j62066R4152A92448k5605Q8433D704K05099K77255C1074Q4740J92081
$$ 502062 339996 434148 192448 166843 255276 4704 209803 487058 31074 115814 307895
13487C07895O2522I3037L25249q9555D3839L59867p1500q8229J74489a92047A43119
$$ 307895 370417 93037 418286 328731 43839 403706 332206 243977 418466 -192047 143119
13475C3865K64342K6838J00100m0416e2891C67235A12186O3373M5979m2905l4615
$$ 33865 298207 325045 425145 384729 -52891 367235 112186 175559 221538 178633 144018
13464A44018K98704j5849k8680b0196B28573J24335j0946J79371k03380m0344
$$ 144018 442722 426873 398193 -20196 228573 352908 341962 521333 317953 277609
13454B77609n2271q5713K38672N06636C59912Q752J01546j06919o360e0050n9933
$$ 277609 225338 139625 378297 884933 359912 368664 470210 363291 356931 -50050 -109983
13443a09983C67528J06754A66634a62344I0068K33498p6139J01967r8806o4688
$$ -109983 367528 474282 166634 -162344 90068 323566 247427 349394 250588 185900
13433A85900P4194J58470j47970L3682E2802K22719n2685J55529j5139j13691
$$ 185900 260094 418564 270594 304276 52802 275521 222836 378365 363226 249535
13423B49535K02177A96023J10683q8193A06535J66302a13763A90187J63746k0414
$$ 249535 451712 196023 306706 218513 106535 272837 -113763 190187 353933 333519
13413C33519J33188e4811E24345j65812Q9361C2266L40821E8481M866J99291p2946
$$ 333519 466707 -54811 524345 358533 447894 32266 373087 58481 63347 262638 189692
13402A89692L4378P6479J13976j57482a6449B97424R5284Q8687j29345a17184
$$ 189692 224070 300549 414525 257043 -16449 297424 392708 481395 352050 -117184
13391E88332b1286h211A40849J02200J36934a02495A42677o7750J2871L10806
$$ 588332 -21286 -8211 140849 243049 379983 -102495 142677 74927 87798 398604
13381C98604E5119e8877I7679K72290J53372A79170b5305B41018A19685K60172
$$ 398604 55119 -58877 97679 369969 523341 179170 -25305 241018 119685 379857
13371C79857j03035L374H2413a90392B53981J42a07436B53873m5985n3369J60746
$$ 379857 276822 280196 82413 -190392 253981 254123 -107436 253873 207888 154519 315265
13360C15265D1854K19065A19752K18265A13664K0705J23442B4467J24530J26584
$$ 315265 41854 260919 119752 338017 113664 134369 257811 24467 148997 275581
13350B75581n220M479A7798K96281g3940A79398K47716G0978M1655k7018k4769
$$ 275581 270361 274840 17798 314079 -73940 179398 427114 70978 112633 85615 60846
13339F0846c0510A88719Q8807N8130A05846Q5685K04182A68867J768L16657r6784
$$ 60846 -30510 188719 277526 335656 105846 191531 395713 168867 170635 487292 390508
13328C90508J82870k31066j5631L13976B0577c5163E72456E3357L05568N5586
$$ 390508 573378 342312 326681 640657 20577 -35163 572456 53357 358925 414511
13318D14511O948A67472L0858N3925A10172j8574J17991c8958j36746B48367j2227
$$ 414511 421459 167472 198330 252255 110172 91598 209589 -38958 -175704 248367 236140
13307B36140L513K42844k12933A18380P6529J07078r1535j01062k6678g061A17971
$$ 236140 239653 482497 269564 118380 194909 301987 210452 109390 82712 -7061 117971
13295b06058K4788G0496J95501a78849B95749J24923j58861a2777D4722O5859
$$ -206058 -181270 70496 265997 -178849 295749 420672 261811 -12777 44722 110581
13285A10581a03159B81108b78288I2881P4849G1291l2297K45369o7749q7004g3531
$$ 110581 -103159 281108 -278288 92881 167730 71291 38994 284363 216614 129610 -73531
13273A51961M72921A79554m2837J30391a10331e5034A87525O0941h4478C09609
$$ 151961 624882 179554 136717 267108 -110331 -55034 187525 248466 -84478 309609
13262B96221k9231Q8214B2624J08144A1089K85803j02316O2780r2622K03572j59301
$$ 296221 266990 355204 22624 130768 11089 296892 194576 257356 164734 368306 209005
13251B09005d9068C37681i3077j39675A04758D3997J32294h0142A18909a38199
$$ 209005 -49068 337681 -93077 -232752 104758 43997 176291 -80142 118909 -138199
13240B88373I918M08285B05438H96J13020l6370B7788J78980K3464k236k0108
$$ 288373 9918 418203 205438 896 113916 77546 27788 206768 230232 227996 207888
13229B07888k8782i3472C61464J58316A43032m553N3572n3726a0563A10251k079
$$ 207888 179106 -93472 361464 519780 143032 138479 192051 138325 -10563 110251 108172
13218A08172a6874p1100B31883J21609A33186P7962a26021A10212a6507A92250
$$ 108172 -16874 -87974 231883 353492 133186 211148 -126021 110212 -16507 192250
13207a86351A63449o8665E267L85785j45218G8135l1989J67336c8159a8472k2148
$$ -186351 163449 94784 5267 391052 245834 78135 46146 213482 -38159 -18472 -40620
13196d0620C64419A50047e7096C8138c08975A36526a65313A78715d2544k6742
$$ -40620 364419 150047 -57096 38138 -308975 136526 -165313 178715 -42544 -69286
13186f9286D40031F8483Q2964K24210j53791b04384A72116N32664B21801e6883
$$ -69286 440031 68483 151447 375657 221866 -204384 172116 704780 221801 -56883
13175A44757J00485j10289a34307A37753N5700q1447J44620O8152J11991a53439
$$ 144757 245242 134953 -134307 137753 193453 112006 256626 324778 436769 -153439
13164G6203J63550A17761A6842a99114B20032J11682I82K10645g3506c5166B00791
$$ 76203 239753 117761 16842 -199114 220032 331714 982 211627 -73506 -35166 200791
13152H4063e867o4929C6942A0485P875b5502k1471I2627a7655B04393o031L1623
$$ 84063 -5867 -70796 36942 10485 18360 -25502 -46973 92627 -17655 204393 198362 229985
13140B29985E4127h4436A28646J47637b11929B21192q871l2818m9271J56630j05505
$$ 229985 54127 -84436 128646 276283 -211929 221192 212321 179503 130232 286862 181357
13129A81357M741m7186k2398K54429m9185O2105a17340B3936a1937M165a499k7645
$$ 181357 186098 138912 116514 370943 321758 383863 -117340 23936 -11937 -7772 -1499 -29144
13117b9144j17907H515P8745j3362q657F236L3981R444f7779H4713J0393B041
$$ -29144 -147051 8515 87260 73898 65241 6236 40217 49661 -67779 84713 95106 2041
13104A87308N363m8481D9907P1317D0617L25420A39323b10680g4268C40239I6529
$$ 187308 192671 144190 49907 121224 40617 366037 139323 -210680 -74268 340239 96529
13092e7487C95436A72287L45717A41455b27980J10521A75034E1784K7799K14546
$$ -57487 395436 172287 518004 141455 -227980 -117459 175034 51784 79583 294129
13082B94129G8691F423L25486f3911B16481J67981a23979G111g7059m6064B7522
$$ 294129 78691 6423 331909 -63911 216481 384462 -123979 7111 -77059 -123123 27522
13070C6087K2856J5341P4666A1397J59699C0868J84197K1601B3480K26266a80188
$$ 36087 58943 74284 148950 11397 171096 30868 215065 236666 23480 249746 -180188
13058A87279J00572h5606A42823Q9335b2433E9402q94L65173a16124A63945M9975
$$ 187279 287851 -85606 142823 232158 -22433 59402 58508 423681 -116124 163945 213920
13047B13920a160j57442A30153M3076M1755j1930r6105m8996d2217G1905A1539
$$ 213920 -1160 -158602 130153 173229 214984 203054 106949 57953 -42217 71905 11539
13035H0303a02450C31523D4808B1152J82912h4844j27144B4913h1335A53957b38728
$$ 80303 -102450 331523 44808 21152 204064 -84844 -211988 24913 -81335 153957 -238728
13023b4635D7991O1482J69564R5392H4683d1589A18696a90422a1970D3261g5230
$$ -24635 47991 109473 279037 374429 84683 -41589 118696 -190422 -11970 43261 -75230
13011C06879C4077b23172h0603A97626J5074G0719J10654L4560p5616N5749I0715
$$ 306879 34077 -223172 -80603 197626 212700 70719 181373 215933 140317 196066 90715
12999g5525B04621M067Q8568F148L13069D840Q2196M0058D8119O9583L19924A43865
$$ -75525 204621 208688 297256 6148 319217 4840 87036 127094 48119 117702 437626 143865
12986F9613K89911A12608C3841J8854B1556K9033J8662a10745B42976c23289f9194
$$ 69613 359524 112608 33841 52695 21556 50589 69251 -110745 242976 -323289 -69194
12974F9551c82866A75531J02131a84553h420m5340A0526a47846H0048J93272j06673
$$ 69551 -382866 175531 277662 -184553 -8420 -53760 10526 -147846 80048 273320 166647
12963A66647a22995M7119j99903H93b0640C05721j15829m8213J40860a68448c0755
$$ 166647 -122995 -75876 -275779 893 -20640 305721 189892 141679 282539 -168448 -30755
12951A04582K9558b06389H4334b363C53706a57229B1885E207Q9675e3011A75733
$$ 104582 134140 -206389 84334 -2363 353706 -157229 21885 5207 94882 -53011 175733
12939A41977Q7534a87590d8820J4140D42014B7823N0207E862O1093J0394e540
$$ 141977 229511 -187590 -48820 -34680 442014 27823 78030 5862 66955 77349 -5540
12927e343j088k19262e2414B32356a5751j47230e8946G1067a84292G248d0455
$$ -5343 -6431 -225693 -52414 232356 -15751 -162981 -58946 71067 -184292 7248 -40455
12915f5331A42530L01722n3341j15413d7086j8544o5143A33831J96377c5111A567
$$ -65331 142530 444252 390911 275498 -47086 -65630 -130773 133831 330208 -35111 1567
12903I6130J4739f5323f483j13107J1936j36423a18251a5646q4525O306G9722
$$ 96130 110869 -65323 -6483 -119590 -107654 -244077 -118251 -15646 -100171 -93865 79722
12891B57796h4300E3001e1939A47122J20261A08077J93971B7883e1675A84447
$$ 257796 -84300 53001 -51939 147122 267383 108077 302048 27883 -51675 184447
12880b31235A80053P768b18177b7446A99520R909D78K72769C5925M061J71737
$$ -231235 180053 187821 -218177 -27446 199520 209429 478 273247 35925 39986 211723
12869B11723i5247A15315R6472a10440A30733b04163j02552D53750B593b1584
$$ 211723 -95247 115315 211787 -110440 130733 -204163 -306715 453750 2593 -21584
12858b2697D2836A4856g1869m0724L7299j70785A38163H887K63436E4951a43115
$$ -22697 42836 14856 -71869 -112593 -75294 -246079 138163 8887 272323 54951 -143115
12846C01943f6938A72616G5533N5207a57396E3333J19320E872J4273c8371k90078
$$ 301943 -66938 172616 75533 130740 -157396 53333 172653 5872 20145 -38371 -328449
12835c28449i3477M706K3635C47332A15447a84125C48579L2071j51574q8114E9601
$$ -328449 -93477 -88771 -65136 347332 115447 -184125 348579 380650 229076 140962 59601
12823D2341M2088f1237l9326j5614B7431K05595o4057p8204m1802J7715c06003
$$ 42341 84429 -61237 -100563 -116177 27431 233026 168969 90765 48963 66678 -306003
12811e3506B735c92236I6626L56412E2165a4007J980p17A10281g6387A46725q615
$$ -53506 2735 -392236 96626 453038 52165 -14007 -12027 -12744 110281 -76387 146725 138110
12799A38110h1784b7900A62157b3079A59788E9440b575l1770A38402J0437B7337
$$ 138110 -81784 -27900 162157 -23079 159788 59440 -2575 -34345 138402 148839 27337
12787A58464a93026A8510f132A95194m5346C0154Q6102g3017E7769a395A14183
$$ 158464 -193026 18510 -6132 195194 149848 30154 116256 -73017 57769 -1395 114183
12775b04296L3668C05624B477a9527H0436e2439j46555E2125b13066A01985d3540
$$ -204296 -170628 305624 2477 -19527 80436 -52439 -198994 52125 -213066 101985 -43540
12763d4784A43971J40321j09984E7801K3415a74693A92105b52692E4528N9310
$$ -44784 143971 284292 174308 57801 81216 -174693 192105 -252692 54528 113838
12753A13838e5245m0516c8657C4317L63108j79207L7773J49574a50155A7872i759
$$ 113838 -55245 -95761 -38657 34317 397425 218218 255991 405565 -150155 17872 -9759
12741A28914m4021B1349J33481J73406A15402a95079C45708a27156L5212M1561
$$ 128914 84893 21349 154830 328236 115402 -195079 345708 -127156 -91944 -50383
12731e0383A09532B4249a87421B49736E0851r332Q268k1847a27474A3611K82792
$$ -50383 109532 24249 -187421 249736 50851 41519 49787 27940 -127474 13611 296403
12720B96403a8728C82771a55718A41225a3651H9106d3296A9980J34721c9786o3031
$$ 296403 -18728 382771 -155718 141225 -13651 89106 -43296 19980 154701 -39786 -102817
12709a02817C342a54538B63436a12768B44814g4143B28894q5996a79753J3781
$$ -102817 3342 -154538 263436 -112768 244814 -74143 228894 142898 -179753 -165972
12699a65972c0826D3106a45199A87820j8681P0878a0162A72932n3956h2576C65146
$$ -165972 -30826 43106 -145199 187820 169139 240017 -10162 172932 118976 -82576 365146
12687B25774j7697C7892J10154p672a67700A70265d4924a2838B22648N7736K4808
$$ 225774 208077 37892 148046 140374 -167700 170265 -44924 -12838 222648 280384 305192
12676C05192a46274C30590B2130g2723j9184b5416k07292B59625G1626B705J55220
$$ 305192 -146274 330590 22130 -72723 -91907 -25416 -232708 259625 71626 2705 157925
12665A57925l1442a86433A46918m0506K72665g2280B89626A30544f756B36965
$$ 157925 126483 -186433 146918 106412 379077 -72280 289626 130544 -6756 236965
12654B88038F4979e2686B12130b87510B2431a76110A9865J77441J65779a81031
$$ 288038 64979 -52686 212130 -287510 22431 -176110 19865 197306 363085 -181031
12643C9907J12564o892p018a26842A50664A0505K2994i5504I5493f0130k2319
$$ 39907 152471 145579 138561 -126842 150664 10505 33499 -95504 95493 -60130 -82449
12632h2449G6118P5313a02651B44026P6179E3500a64964H0503K72227b0421A19234
$$ -82449 76118 151431 -102651 244026 320205 53500 -164964 80503 352730 -20421 119234
12620B27604a3421r2487c9120j49152R0746A455R7280J56403j25772J67849d6024
$$ 227604 -13421 -105908 -39120 -188272 -97526 1455 98735 255138 129366 297215 -46024
12608A16186J70075F4426J1119b8458C68974A14128k3050a22720B44328O2643
$$ 116186 286261 64426 75545 -28458 368974 114128 91078 -122720 244328 306971
12598C06971a5904B76018i4491C12131a67801O6217M9377j35093C90609j09823
$$ 306971 -15904 276018 -94491 312131 -167801 -101584 -52207 -187300 390609 280786
12588B80786I8318j8536g4408B11402k0360M575J62069p0731F5405J95958c65
$$ 280786 98318 79782 -74408 211402 191042 195617 357686 286955 65405 261363 -365
12576B25975A04677b404r4937j56326c2820A39684a04879A49595R2471a55518
$$ 225975 104677 -2404 -97341 -253667 -32820 139684 -104879 149595 242066 -155518
12565A67787M6134A06917a40440m1672O7750M9340l18373a2196H2131d066B08227
$$ 167787 213921 106917 -140440 -182112 -114362 -65022 -383395 -12196 82131 -4066 208227
12553E1757J74885d2222j24082n0911H5207B1825J74379J1894L4986p3785k2001
$$ 51757 226642 -42222 -166304 -217215 85207 21825 196204 208098 243084 169299 147298
12542A47298J0561j8226Q0249a75855d7613I3382N2697i0935B78538a81151A79422
$$ 147298 157859 139633 219882 -175855 -47613 93382 146079 -90935 278538 -181151 179422
12530C65022A07489a55212b8284j91404B16597h3946B45946I3517J96016q7265
$$ 365022 107489 -155212 -28284 -219688 216597 -83946 245946 93517 289533 202268
12520B02268C9330e879H2505e11I3611q370R418B8815e0137G9781A1874Q0586
$$ 202268 39330 -5879 82505 -511 93611 85241 94659 28815 -50137 79781 11874 92460
12508I2460a7705A34026a33409j1097G8719Q9947M0472a07674J8144j89959A77781
$$ 92460 -17705 134026 -133409 -144506 78719 168666 209138 -107674 -89530 -279489 177781
12496i5522j12200A07532A6836b1479M835C03614E7546J30241f4383B19207A07336
$$ -95522 -207722 107532 16836 -21479 -16644 303614 57546 187787 -64383 219207 107336
12484a74907j56454D43157b65086i7559A7245J23862a420l3131j30198G7974k1723
$$ -174907 -331361 443157 -265086 -97559 17245 141107 -1420 -34551 -164749 77974 56251
12473E6251J27836a89029M2986A5897K0657a7142p5426j22331g0333l017j21694
$$ 56251 184087 -189029 -146043 15897 36554 -17142 -92568 -214899 -70333 -73350 -195044
12462a95044j20647J05880h5977A14131r302m0387b0627j73325B3739b33343A01765
$$ -195044 -315691 -209811 -85977 114131 104829 64442 -20627 -193952 23739 -233343 101765
12450A47225J86339E7746c458B2857b01243F7115Q9402b60127N0017I7183a48253
$$ 147225 333564 57746 -3458 22857 -201243 67115 156517 -260127 -210110 97183 -148253
12438c3514C7192M8937J05669b09669l5961B43497p6371N7489a25785b9066G3318
$$ -33514 37192 86129 191798 -209669 -245630 243497 167126 224615 -125785 -29066 73318
12426H6629N620D473M5654a76806A71033o6005c5733k7051n8448D7085K99086
$$ 86629 92249 4473 50127 -176806 171033 105028 -35733 -62784 -121232 47085 346171
12415C46171c05545B227K35173P1886b2602A10960a02477d8654j62819R6058j18721
$$ 346171 -305545 2227 237400 309286 -22602 110960 -102477 -48654 -211473 -115415 -234136
12404b34136j1334A00446a20618A19895n9541b05609I3460C5800N8342d2980n0733
$$ -234136 -245470 100446 -120618 119895 60354 -205609 93460 35800 94142 -42980 -93713
12393i3713d4530A04750J13595b92748C06284a85792M3736B37877A0998a65640
$$ -93713 -44530 104750 218345 -292748 306284 -185792 -142056 237877 10998 -165640
12382D62876a17865d6440j33399h5778D2142a80704b9395A12745M7633L37846
$$ 462876 -117865 -46440 -179839 -85778 42142 -180704 -29395 112745 160378 498224
12372D98224j89961G0505J89140E2585a30211o9641A46479P7568B035L22357q4333
$$ 498224 308263 70505 259645 52585 -130211 -199852 146479 224047 2035 324392 240059
12361B40059f2222q7499E52857d0387F3293K96308g1854H3833K31760C5142a78602
$$ 240059 -62222 -149721 552857 -40387 63293 359601 -71854 83833 315593 35142 -178602
12349a26452B11471g043j5613k14700b1306h60A43859a9933l6005B5135b11550
$$ -126452 211471 -7043 -22656 -237356 -21306 -860 143859 -19933 -55938 25135 -211550
12337H9468a04344d0630f589G2922J80944A09770J46134a06224A21244b73151
$$ 89468 -104344 -40630 -6589 72922 253866 109770 255904 -106224 121244 -273151
12326b74803B84702j32613b09786E5983f0283A26491m9255c60632B7760e8014
$$ -274803 284702 152089 -209786 55983 -60283 126491 77236 -360632 27760 -58014
12315a71523C23642I0011k0542c0797C1899d2411j32985H6334c38261A9772d83441
$$ -171523 323642 90011 69469 -30797 31899 -42411 -175396 86334 -338261 19772 -483441
12303a1125k03460B96082d05024B2392K1281L15032a24893l749L1684A88320f2862
$$ -11125 -214585 296082 -405024 22392 43673 358705 -124893 -128642 -96958 188320 -62862
12291a4216p7401K2081J1961n0455d7132B8783J3576O2675b35173a8966A43398
$$ -14216 -91617 -69536 -57575 -108030 -47132 28783 42359 105034 -235173 -18966 143398
12279B52284E2064K85230A22562P1732i4653L5799E2423j114k4418b40551G3801
$$ 252284 52064 337294 122562 194294 -94653 -58854 52423 51309 26891 -240551 73801
12267a13405A25296A3645b41066E3423K16489j31681n576a891H5672J03818H7158
$$ -113405 125296 13645 -241066 53423 269912 138231 132655 -1891 85672 189490 87158
12255A95369b7862A00929l1408K24793j17499g2716A35460J9239R3853i6373E750
$$ 195369 -27862 100929 69521 294314 176815 -72716 135460 154699 248552 -96373 5750
12243A84628q0319c6281j63572E8203K45133G0108K1746Q451a07304H4493C54
$$ 184628 104309 -36281 -199853 58203 303336 70108 91854 100305 -107304 84493 354
12231B73168q4601d2645p2072A683Q5569K52177F017a51316C37387A57705o0052
$$ 273168 188567 -42645 -114717 1683 87252 339429 6017 -151316 337387 157705 97653
12220I7653l4999L997R3370a37051b069D8203M0745L8741D4531K02285j7607r6038
$$ 97653 62654 66651 160021 -137051 -2069 48203 88948 127689 44531 246816 229209 133171
12208A33171F5193J06897L10061k27061K0568l7303G68g7222K1399B98288b65976
$$ 133171 65193 172090 482151 255090 275658 238355 768 -77222 -55823 298288 -265976
12196A35071A0465J80194J96404G9194J41469e4191B94229A30740C6311L08656
$$ 135071 10465 190659 387063 79194 220663 -54191 294229 130740 36311 344967
12186C44967a45624B43395a64305F9505K26650c9861B73694b8936e333p320C80114
$$ 344967 -145624 243395 -164305 69505 296155 -39861 273694 -28936 -5333 -12653 380114
12174B9966Q3201J00992E6311J56307r9660L45000j89366C8889J94651i4462G1733
$$ 29966 113167 214159 56311 212618 112958 457958 268592 38889 233540 -94462 71733
12162B56221r3988a71903p6846C39399F5156g6316C2267A982K91706m7826C3930
$$ 256221 162233 -171903 -248749 339399 65156 -76316 32267 1982 293688 245862 33930
12150D5796K05598j1098H9629K37859D9993K30816A13714D8813J32984a31173
$$ 45796 251394 240296 89629 327488 49993 280809 113714 48813 181797 -131173
12139A02425l1707d7793A09875a01298C17778j6563j35604h1772B52968e8015
$$ 102425 70718 -47793 109875 -101298 317778 301215 165611 -81772 252968 -58015
12128a06124q1068J2082K8593A68159A5030P621J8658J52733q8688M6985n5102
$$ -106124 -187192 -175110 -146517 168159 15030 22651 41309 194042 105354 152339 97237
12117I7237J95747f5242B46771o1004a3270A54149i5385I8870Q597n402J82310
$$ 97237 292984 -65242 246771 185767 -13270 154149 -95385 98870 107467 102065 284375
12106B84375A32939h4029A09303N7725C5144J23688H798b74912g8857m085D36290
$$ 284375 132939 -84029 109303 167028 35144 158832 8798 -274912 -78857 -82942 436290
12094a01928C42344D3262g8288q8657Q84G1080a45734E9450J39815a354E1156
$$ -101928 342344 43262 -78288 -166945 -166061 71080 -145734 59450 199265 -1354 51156
12082a70452j66762B34211f2552j90955Q0814f0790B9324J63692g9244k54679
$$ -170452 -337214 234211 -62552 -253507 -172693 -60790 29324 193016 -79244 -333923
12072c33923a38130j6011G5608b62612d3018A05775n1389k0573K70350l4980n4464
$$ -333923 -138130 -154141 75608 -262612 -43018 105775 54386 33813 304163 269183 214719
12061B14719p0659M06853P14202r2849C86368m0170A27930k6915L2259b2533B33312
$$ 214719 144060 550913 1265115 1172266 386368 346198 127930 101015 133274 -22533 233312
12049a36068E4401b72472F5430a23796B95690O7752A02089J2115b5666k32902
$$ -136068 54401 -272472 65430 -123796 295690 363442 102089 114204 -25666 -258568
12039b58568A61376H024a58811d8392E554N9771a99556A9830a23108E5554a38109
$$ -258568 161376 8024 -158811 -48392 5554 65325 -199556 19830 -123108 55554 -138109
12027A39132g2426E4417a54213j32321a7067p3167f175A56899d3399B85012a45067
$$ 139132 -72426 54417 -154213 -286534 -17067 -90234 -6175 156899 -43399 285012 -145067
12015B16860a25373j57472J11661j3359K6444A3501a09591j67865G5360Q3505
$$ 216860 -125373 -282845 -171184 -184543 -158099 13501 -109591 -277456 75360 158865
12005A58865J70386b01865B36833a64743n8081I2850k7482a19084G5219a46260
$$ 158865 329251 -201865 236833 -164743 -222824 92850 65368 -119084 75219 -146260
11994c70408C31616B5056L82055a2360j59990G5406j6689J55513j6368n3415i2028
$$ -370408 331616 25056 407111 -12360 -172350 75406 58717 214230 197862 144447 -92028
11982a46678k2078J1163A59673b08742A37977f6164j52107c1069E5774k696b51711
$$ -146678 -168756 -157593 159673 -208742 137977 -66164 -218271 -31069 55774 53078 -251711
11970B32124q4679f4784A54741o0969a22189j11788d0508j33104E4444i8396b7255
$$ 232124 147445 -64784 154741 93772 -122189 -233977 -40508 -173612 54444 -98396 -27255
11958g9946H9827N4537c05361d4788r6224l57740A61352a62936g7673k17356a1529
$$ -79946 89827 144364 -305361 -44788 -141012 -498752 161352 -162936 -77673 -295029 -11529
11946a10906H0104k2325J77711C2516a52474A28565c27001F2555d3032H1722L9726
$$ -110906 80104 57779 235490 32516 -152474 128565 -327001 62555 -43032 81722 121448
11935A21448J46864a13964A08111E0159Q8916q260J01186A9295b89715B60839
$$ 121448 268312 -113964 108111 50159 139075 130815 232001 19295 -289715 260839
11924E5136a50206B1144a15348L7022c4429m2301F6935a25182F5994k4303b261
$$ 55136 -150206 21144 -115348 -78326 -34429 -76730 66935 -125182 65994 41691 -2261
11912A26194A5810a49975N6967c2203D8595O46L6095A8514b29392C0484J56663
$$ 126194 15810 -149975 -93008 -32203 48595 49241 85336 18514 -229392 30484 187147
11901A87147a17013A31873a39615b3228r4484A01425i144m56298A87229o6621
$$ 187147 -117013 131873 -139615 -23228 -117712 101425 -9144 -465442 187229 120608
11891A20608b59945A51859g4603A33039E3753B3802J15755M2160a58891A29233
$$ 120608 -259945 151859 -74603 133039 53753 23802 139557 181717 -158891 129233
11880h9871q7571C36783E8825J56728A7089J59297d5445A89495a1863k58549b2425
$$ -89871 -177442 336783 58825 215553 17089 176386 -45445 189495 -11863 -270412 -22425
11868c48645a2126B14470b6800B24611g4113B46217a8650c86A32877C8225J08294
$$ -348645 -12126 214470 -26800 224611 -74113 246217 -18650 -386 132877 38225 146519
11857A46519J5072f5518L096A32853b1501C0993i5287A31664a01897E3472K03076
$$ 146519 161591 -65518 -62422 132853 -21501 30993 -95287 131664 -101897 53472 256548
11846B56548H3131B9306R9113b7939j66503D4918c34444B90602A32847k0444b53044
$$ 256548 83131 29306 128419 -27939 -194442 44918 -334444 290602 132847 112403 -253044
11834a9760j76171R470M6664A36119b779A8292K47803n7328F8144A4697b60179
$$ -19760 -195931 -186461 -139797 136119 -2779 18292 266095 208767 68144 14697 -260179
11822B31139c20693B24250c43482d9627j25616P2980D8666J55862a88758g4984
$$ 231139 -320693 224250 -343482 -49627 -175243 -102263 48666 204528 -188758 -74984
11811H9081R951a53328j31623A37396F3292c5623j31448E9613k128a21891J9795
$$ 89081 99032 -153328 -284951 137396 63292 -35623 -167071 59613 57485 -121891 -102096
11800a02096j74499P7623G0039B6099a73239Q4352a5527l31424B29515a56301
$$ -102096 -276595 -198972 70039 26099 -173239 -88887 -15527 -346951 229515 -156301
11789I6433K45980b01076g9730B32738E4402c8012j12745A3203K61779a47948
$$ 96433 342413 -201076 -79730 232738 54402 -38012 -150757 13203 274982 -147948
11778A36339o1020b50411A10676f4287A48468A8415g9079o8620a4640j77102c2783
$$ 136339 75319 -250411 110676 -64287 148468 18415 -79079 -147699 -14640 -191742 -32783
11766A69651K18345A89172a46702C7254J3409d6113l7912q735Q076m1642J1053
$$ 169651 387996 189172 -146702 37254 50663 -46113 -84025 -92760 -84684 -126326 -115273
11755a15273b1036r452F457a3774B4566b50144J04423n4518D6871a18825C95396
$$ -115273 -21036 -30488 6457 -13774 24566 -250144 -145721 -200239 46871 -118825 395396
11743b50305E2122a96112i7510E610K11026B8873i9889G1535b6314M470j45278
$$ -250305 52122 -196112 -97510 5610 216636 28873 -99889 71535 -26314 -21844 -167122
11732a67122A04565a22624A31067b32501O2643A4186b12618A05835b753A03138
$$ -167122 104565 -122624 131067 -232501 -169858 14186 -212618 105835 -2753 103138
11721F6239J06795b2556A37842B2356J70035C0772J3371B478M9485j9482j1092
$$ 66239 173034 -22556 137842 22356 192391 30772 44143 2478 51963 32481 21389
11710B1389K05178a73290B7389P9676R4911E6356a81173J6491K8407c9194A68483
$$ 21389 226567 -173290 27389 107065 201976 56356 -181173 -164682 -136275 -39194 168483
11698H3658J67054E6897J26475J85533a1364B95513b13571J05875c3543l11661
$$ 83658 250712 56897 183372 368905 -11364 295513 -213571 -107696 -33543 -345204
11688c45204f06o2320B0172J44023J06320A9291c1243l0173A57518p3777N3071
$$ -345204 -606 -62926 20172 164195 270515 19291 -31243 -61416 157518 83741 136812
11677A36812a43168C22563G3814L6947D3515f2409A76409n4605O4058A3796K00216
$$ 136812 -143168 322563 73814 110761 43515 -62409 176409 121804 185862 13796 214012
11666B14012E5a96129B2772c9061E5185J17546L3866D7077O3675K18837j11987
$$ 214012 55 -196129 22772 -39061 55185 172731 206597 47077 110752 329589 217602
11655B17602i2038b2717A13055c84368J38225A91692Q6018i2468j36877o6187
$$ 217602 -92038 -22717 113055 -384368 -246143 191692 277710 -92468 -229345 -295532
11645b95532R4251B67502F7995b56311N1711B38790j7183a42614A31430n9927
$$ -295532 -201281 267502 67995 -256311 -204600 238790 221607 -142614 131430 71503
11635G1503e5850B96464G8007M87284a13724B04015a2425j58566D6263L6166a24761
$$ 71503 -55850 296464 78007 565291 -113724 204015 -12425 -170991 46263 82429 -124761
11623C2337R7603a98307a2028B13657c10805H8491b51265A87840b74564A67138
$$ 32337 129940 -198307 -12028 213657 -310805 88491 -251265 187840 -274564 167138
11612B75709A36709d2497B08345h2056q8104L5862A99194e7180B22804a6218A72703
$$ 275709 136709 -42497 208345 -82056 -170160 -134298 199194 -57180 222804 -16218 172703
11600a27306A30081C0715a2543o8413j13891Q4576B79158b4695q702A30415a37597
$$ -127306 130081 30715 -12543 -80956 -194847 -110271 279158 -24695 -33397 130415 -137597
11588d01118C46660g78A31061B1879J17302K9507n9699f1759F28778A24758J25340
$$ -401118 346660 -778 131061 21879 139181 168688 108989 -61759 628778 124758 250098
11577B50098a36529M8030a5701j3657A41467l3327N7673F6231F516a3872A91409
$$ 250098 -136529 -88499 -15701 -29358 141467 108140 165813 66231 6516 -13872 191409
11565i0897L3860B3804Q9558l6693M0944i3403C8445i6611j5106m7232B38470
$$ -90897 -57037 23804 113362 76669 117613 -93403 38445 -96611 -111717 -158949 238470
11553C45991f137j44661B82466d7203E8088b50207A14965N9709b57089j0364f4008
$$ 345991 -6137 -150798 282466 -47203 58088 -250207 114965 174674 -257089 -267453 -64008
11541B2649b43139h7409G2463l0936K01323F1535f4429F1207j4597a77977D63148
$$ 22649 -243139 -87409 72463 41527 242850 61535 -64429 61207 46610 -177977 463148
11529g6035K7134G5718B729b27966g8687O533j65326A00240J700a97231b4627
$$ -76035 -48901 75718 2729 -227966 -78687 -72154 -237480 100240 101940 -197231 -24627
11517e7811D4841j3037J02119k1928J1002K03235M9506a03318B92701N6345A2297
$$ -57811 44841 31804 133923 111995 122997 326232 375738 -103318 292701 349046 12297
11505C81772A32501H969g7261k4095N091M5543E1649i4836A89171E9950K92953
$$ 381772 132501 8969 -77261 -101356 -96265 -50722 51649 -94836 189171 59950 352903
11494C52903e7781C18464j42651N7349a03939j55957H6168l6905N2790k1422N9984
$$ 352903 -57781 318464 175813 233162 -103939 -259896 86168 49263 102053 80631 140615
11483A40615C8570a96628E1669K12690e7494F9287J37617J25041n1004j33297
$$ 140615 38570 -196628 51669 264359 -57494 69287 206904 331945 280941 147644
11473A47644b331A13738J67246d7562B62373c39401B2546N1330a38392K7847B87088
$$ 147644 -2331 113738 280984 -47562 262373 -339401 22546 73876 -138392 -110545 287088
11461C5740a730A28952k5923f1481C09492f2020C15181a28493B93195r894G7078
$$ 35740 -1730 128952 103029 -61481 309492 -62020 315181 -128493 293195 283301 77078
11449d9852j1325J5209j94887B8919O9501E581Q9908B0581J42427b02428A49839
$$ -49852 -61177 -45968 -240855 28919 98420 5581 95489 20581 163008 -202428 149839
11437A64113o2557C8040J33820m2838J03282b96351A26974Q4455h1854C24594
$$ 164113 101556 38040 171860 129022 232304 -296351 126974 211429 -81854 324594
11426B84831l5505R0931g7453A28786h3008A24042f9425F0846b24952i8695l2623
$$ 284831 249326 340257 -77453 128786 -83008 124042 -69425 60846 -224952 -98695 -131318
11415a31318b7182N017I7431K0670a18201k73966h1051C6123O49J637a5400j81356
$$ -131318 -27182 -22165 97431 118101 -118201 -392167 -81051 36123 36772 38409 -15400 -196756
11403a96756b5737q3826d4102r6772E66613A07734a24746I9089I627Q1713B5092
$$ -196756 -25737 -109563 -44102 -140874 566613 107734 -124746 99089 9627 91340 25092
11391H7140C6084a8208A51975p731K5794A1055c32874d8807A13g5121j33485R4820
$$ 87140 36084 -18208 151975 144244 170038 11055 -332874 -48807 113 -75121 -208606 -113786
11379a13786A51352a9112C48036a23881A08860J04450G6705B5018P477K6254a72959
$$ -113786 151352 -19112 348036 -123881 108860 213310 76705 25018 32495 58749 -172959
11367A8625c25358i1054F7477R6649a0403A42471a25835k51714D2406M1913c19075
$$ 18625 -325358 -91054 67477 164126 -10403 142471 -125835 -377549 42406 84319 -319075
11355a13966J6389C2285a18274m1226c3820J2926j67613A71957n3500D3202b85416
$$ -113966 -97577 32285 -118274 -159500 -33820 -20894 -188507 171957 118457 43202 -285416
11343A46143a51616d2069G438g7417r0874K9065A08685J0107a27520C0391J29967
$$ 146143 -151616 -42069 7438 -77417 -168291 -139226 108685 118792 -127520 30391 160358
11332A60358m7452L08670b0765j9696j83722m1958j6679J36185F5726K77309a49809
$$ 160358 112906 421576 -20765 -40461 -224183 -266141 -282820 -146635 65726 343035 -149809
11320B94773d36305E6515a33573f6747b8376o8805a7612j43216A41723f3334F1369
$$ 294773 -436305 56515 -133573 -66747 -28376 -97181 -17612 -160828 141723 -63334 61369
11308b67259A31382a40487M2542j11069A17085b2040k07457b6856o9101C4182
$$ -267259 131382 -140487 -97945 -209014 117085 -22040 -229497 -26856 -95957 34182
11297e673F6358f576l70386j9567b3094A32847c43542A32093a46608j21552J4566
$$ -5673 66358 -6576 -376962 -396529 -23094 132847 -343542 132093 -146608 -268160 -253594
11286b53594B76672B6457b36571l5789B21159c32079B66993b24627e6079m009
$$ -253594 276672 26457 -236571 -272360 221159 -332079 266993 -224627 -56079 -60088
11276f0088o3418A80413e0127I5128c9629j05634m69002a18860A51204a8437j98591
$$ -60088 -123506 180413 -50127 95128 -39629 -145263 -614265 -118860 151204 -18437 -217028
11265b17028n7775A745b69363D5323b13996j59081C026R960f0222R609q3785j13834
$$ -217028 -274803 1745 -269363 45323 -213996 -373077 3026 12986 -60222 -50613 -134398 -248232
11253b48232A59981o8671B3548K64921A03508a51497A3383b18519M1874C66501
$$ -248232 159981 91310 23548 288469 103508 -151497 13383 -218519 -176645 366501
11242A10979f4938m1532L0160B24364i2016G887P9692C6349b07508h2150B36733
$$ 110979 -64938 -106470 -76310 224364 -92016 7887 87579 36349 -207508 -82150 236733
11230F4814a69461B64647d9888j43247f4147a3107q4897A66558e1570k3475A58578
$$ 64814 -169461 264647 -49888 -193135 -64147 -13107 -98004 166558 -51570 -75045 158578
11218a12215r2029e9588n2919r5708c2162C18389a31520A12674J45301a79799
$$ -112215 -204244 -59588 -112507 -208215 -32162 318389 -131520 112674 257975 -179799
11207g8295o0171K6564j30933N8805m9064c3155A62168e0961j2765l2185K0114
$$ -78295 -138466 -111902 -242835 -184030 -233094 -33155 162168 -50961 -63726 -95911 -75797
11196g5797j97306h9833F7552k2639a38202C59108c30309b183j36938m1869B18540
$$ -75797 -273103 -89833 67552 44913 -138202 359108 -330309 -2183 -139121 -180990 218540
11184G0517l0029O4712a48959d3239k4480j21731f7833n3615k8753e277A86661
$$ 70517 40488 105200 -148959 -43239 -67719 -189450 -67833 -121448 -150201 -5277 186661
11172a66954P0094C7517e5830o7186N3693B9921a77192f5173r5276k891I922a50572
$$ -166954 -96860 37517 -55830 -123016 -69323 29921 -177192 -65173 -160449 -163340 9922 -150572
11159h9737A51187C2027g1267l0119j52264d333A5917K03526a56628b6252B76799
$$ -89737 151187 32027 -71267 -101386 -253650 -4333 15917 219443 -156628 -26252 276799
11147A42425b96108a9068A11659a59070K7354O3965C4249a49877m6385b1031k7483
$$ 142425 -296108 -19068 111659 -159070 -131716 -67751 34249 -149877 -196262 -21031 -48514
11136d8514k39656J12869P4576A65830o8788c7333C22362e6822I3654g5535C13291
$$ -48514 -288170 -175301 -100725 165830 97042 -37333 322362 -56822 93654 -75535 313291
11124G8095c7128r978j1508A99613F0605J9653b0899c865j47010b3420C21478
$$ 78095 -37128 -47106 -58614 199613 60605 80258 -20899 -3865 -150875 -23420 321478
11112C43660b19422f5191A60154J40917a24001F2570J00542P4422A09483J2465
$$ 343660 -219422 -65191 160154 301071 -124001 62570 163112 237534 109483 121948
11102A21948J39473b159B60230r8481k7309o335b74718F5195g0082B9717K8338
$$ 121948 261421 -2159 260230 161749 134440 128105 -274718 65195 -70082 29717 58055
11091E8055d62975B53782a03084B20804H7046A8471J15468a28064c8774j38200
$$ 58055 -462975 253782 -103084 220804 87046 18471 133939 -128064 -38774 -176974
11081a76974B78446c3886C97428q0331J41011j90263A01030K92934j14095A08885
$$ -176974 278446 -33886 397428 317097 458108 267845 101030 393964 279869 108885
11070I2841b0311A61340A7133J50738K8707n9951f0950a6787A05322J10349D121
$$ 92841 -20311 161340 17133 167871 196578 136627 -60950 -16787 105322 215671 4121
11058C72329j51920L68198k23623j59874L05425k53459L6207R7377J87812j43795
$$ 372329 220409 588607 364984 205110 510535 257076 293283 390660 578472 434677
11048D34677L19122B07716L85617J96704B59777K91906J73513j30447r3907k7253
$$ 434677 753799 207716 593333 790037 259777 551683 725196 594749 500842 473589
11038D73589J83088j74063P2725L99682l55787k64896J75576O7599J58318J4282
$$ 473589 656677 482614 555339 955021 599234 334338 509914 577513 735831 750113
11028G50113k5952j45538K26636m00376J49447p7300J95915J79521j95758L8739
$$ 750113 724161 578623 805259 404883 554330 477030 672945 852466 656708 695447
11018F95447n7605L97323m30348J36540j71591L65846m20031J77873p0L150K2346
$$ 695447 637842 1035165 604817 741357 569766 935612 515581 693454 693384 696534 718880
11007G18880m6258j30456J57985k88039L1491Q5917J73691R5827q3945B77331
$$ 718880 672622 542166 700151 412112 443603 529520 703211 799038 715093 277331
10996E57961P3270j00751k0900K5909j02717J51633j23266J86294B49143N09190
$$ 557961 631231 530480 509580 535489 432772 584405 461139 647433 249143 758333
10986G58333k56522K88350q3293k56441J15532J46534O7504l48068J51118M79025
$$ 758333 501811 790161 706868 450427 565959 712493 779997 431929 583047 1062072
10976A062072j17250j5026L7857k21346M2982j7346n0371J91973J91960j20983
$$ 1062072 944822 929796 967653 746307 789289 771943 721572 913545 1105505 984522
10966I84522n5178N1854M57177P0976k54937K57909K47461J72719J70652N23915
$$ 984522 929344 981198 1438375 1509351 1254414 1512323 1759784 1932503 2103155 2627070
10956B627070Q0995m73969j48798L45927n59627K43842n99940j21876O7868N6799
$$ 2627070 2708065 2234096 2085298 2431225 1871598 2115440 1515500 1393624 1461492 1518291
10946A518291k85065L92046j1673p1608r2241p4877l60652M2395J44808r5305
$$ 1518291 1233226 1625272 1613599 1541991 1449750 1374873 1014221 1056616 1201424 1106119
10936A106119j96929k41860l20368M34015l23990M1463j4969L2261r7483j28424
$$ 1106119 909190 667330 346962 780977 456987 498450 483481 515742 418259 289835
10926B89835a11544A49380o1253d2073E1424f3450l74777B07653L09340D7527
$$ 289835 -111544 149380 88127 -42073 51424 -63450 -438227 207653 516993 47527
10915c8470E3771J70688e09005H303J78040F73K13396a0529A84701c20305B9234
$$ -38470 53771 224459 -509005 8303 186343 673 214069 -10529 184701 -320305 29234
10903H3788e365F7258h7129D2718e2532o3511A13313d23857B00634A5480N8593
$$ 83788 -5365 67258 -87129 42718 -52532 -116043 113313 -423857 200634 15480 74073
10892G4073l5649e2800k53849A96154N89i0790a0607c372k0374n3599k00375q0543
$$ 74073 38424 -52800 -306649 196154 196743 -90790 -10607 -3372 -23746 -77345 -277720 -358263
10880c58263G3378b47534J18580A2918P9801k745I359b57291h1811l07661a08298
$$ -358263 73378 -247534 -128954 12918 92719 89974 9359 -257291 -81811 -389472 -108298
10868a95720a2868j13397N269G6599l3490J9701g6435B29929a16794H3257l4152
$$ -195720 -12868 -126265 -120996 76599 43109 62810 -76435 229929 -116794 83257 49105
10857D9105J14393D6403a3025p0156C7001d2335l4857j47932e3280j3747E53b43804
$$ 49105 163498 46403 -13025 -83181 37001 -42335 -77192 -225124 -53280 -67027 553 -243804
10844c0207E2294J43982K3285H7175Q2138a1702j23718d888p4415A21085K6271
$$ -30207 52294 196276 219561 87175 169313 -11702 -135420 -4888 -79303 121085 147356
10833A47356i4874l3696m1653J3003D1326M14102b87820N4418D3670b56453J11500
$$ 147356 -94874 -128570 -170223 -157220 41326 455428 -287820 -233402 43670 -256453 -144953
10822a44953F784O8183b16818d3035A59728a38882E5890a16224N1443K7863o4741
$$ -144953 6784 74967 -216818 -43035 159728 -138882 55890 -116224 -64781 -36918 -101659
10811a01659D801J09568J10139B0470O4274d7072j03435d0660D4489j1231h6916
$$ -101659 4801 114369 224508 20470 84744 -47072 -150507 -40660 44489 33258 -86916
10799b12511E0233b9100I81K01332a33654N7044r3499B79047j01245b81252I5309
$$ -212511 50233 -29100 981 202313 -133654 -76610 -170109 279047 177802 -281252 95309
10787F3709a30929A03597J87708h2783j22231c8166r9781A14675c04478a04306
$$ 63709 -130929 103597 291305 -82783 -205014 -38166 -137947 114675 -304478 -104306
10776C31017a86146F775b35142E8728r347N6364b54763a12166j59438a8231C07034
$$ 331017 -186146 6775 -235142 58728 49381 105745 -254763 -112166 -271604 -18231 307034
10764i9887q6474d2202A98860b1417A51766C1917J3452A5833a54564N2119G5632
$$ -99887 -186361 -42202 198860 -21417 151766 31917 45369 15833 -154564 -102445 75632
10752i5135A95028b11151A13594h6706m344I0140N3990b64180j3098Q4493b4506
$$ -95135 195028 -211151 113594 -86706 -91050 90140 144130 -264180 -277278 -192785 -24506
10740a51449C3601N5288K10305a15552k17q67D0165g7595J3243A91047b14851
$$ -151449 33601 88889 299194 -115552 -115769 -116636 40165 -77595 -64352 191047 -214851
10728b40498C09292b28435A7236c01035D5623a04606a9695j18522D2495f8452
$$ -240498 309292 -228435 17236 -301035 45623 -104606 -19695 -138217 42495 -68452
10717a34956B72214q6770c07500D8003J42326b01124B4746J42428b16141P597
$$ -134956 272214 185444 -307500 48003 190329 -201124 24746 167174 -216141 -208544
10707b08544O8660k06928F6873J19666A8049a51453O3572L5322j18661P7015j70023
$$ -208544 -139884 -346812 66873 186539 18049 -151453 -87881 -52559 -171220 -94205 -264228
10696b64228K2974A8088f1278A0397b2712A49696a37985G9511L60608j99245G9302
$$ -264228 -241254 18088 -61278 10397 -22712 149696 -137985 79511 440119 240874 79302
10684a7933m03594J94086J03852j33135R2347l9414O1623C36153b12032H3732
$$ -17933 -421527 -227441 -123589 -256724 -164377 -203791 -142168 336153 -212032 83732
10673A34081J83153j31740k2052f8880A30246d54144a02097L8968p8211d4717
$$ 134081 317234 185494 163442 -68880 130246 -454144 -102097 -63129 -141340 -44717
10662a29731B53333a18928a4576k42980a10162l01279C8803e4817I5697D4657
$$ -129731 253333 -118928 -14576 -257556 -110162 -411441 38803 -54817 95697 44657
10651a2670k20976k2491F7123d4562A47179g844j69622H5652a04564D2887m568
$$ -12670 -233646 -256137 67123 -44562 147179 -7844 -177466 85652 -104564 42887 38319
10640C8319b8996C0831K40655b05329j76438J46024Q6685b5914j53964A63027
$$ 38319 -28996 30831 271486 -205329 -381767 -235743 -149058 -25914 -179878 163027
10629a37039E2177d07621B91160b33749A00076N8988b22826F5931k1388A4339
$$ -137039 52177 -407621 291160 -233749 100076 159064 -222826 65931 44543 14339
10618B24953n1951a72653N4261p4357d0385D43257j78930F6622i8496k87046C1272
$$ 224953 173002 -172653 -118392 -192749 -40385 443257 264327 66622 -98496 -385542 31272
10606c47192B23608I3684a76404B67202c5337q1367B12920i4171j43246N7040
$$ -347192 223608 93684 -176404 267202 -35337 -116704 212920 -94171 -237417 -180377
10596a80377Q7416A72449e7320j97755C5414L6478b05009d564d01H1764c41016
$$ -180377 -92961 172449 -57320 -255075 35414 71892 -205009 -4564 -401 81764 -341016
10584a95211k33400B88494a87913C5255a84654k10350J58455A7601J17839b28922
$$ -195211 -428611 288494 -187913 35255 -184654 -395004 -236549 17601 135440 -228922
10573I1803L617B6997b26726A82236b87297B49319h0261k17831l5495L1072J00211
$$ 91803 95420 26997 -226726 182236 -287297 249319 -80261 -298092 -333587 -302515 -202304
10562b02304c4345I5484K23187A23947F304M1676J52572r6963B4572Q3161c04673
$$ -202304 -34345 95484 318671 123947 6304 47980 200552 103589 24572 107733 -304673
10550B21223b39321e1009D7668a3026m59421a79301I9067J21168h6694B29436
$$ 221223 -239321 -51009 47668 -13026 -472447 -179301 99067 220235 -86694 229436
10539G6247a21039E9669g0635C14998b21689A64981b18479L1221A42548E4452
$$ 76247 -121039 59669 -70635 314998 -221689 164981 -218479 -187258 142548 54452
10528C3482i0106F4894B8241R9970b06000J5503A00066b11464J8801g4573D9970
$$ 33482 -90106 64894 28241 128211 -206000 -190497 100066 -211464 -192663 -74573 49970
10516E4771J25019K3118C8662R106a03950F5252c5520j08551I7907b66829a12299
$$ 54771 179790 202908 38662 47768 -103950 65252 -35520 -144071 97907 -266829 -112299
10504a0930j12162L7452j41324A71821a18229N6597p011J6840l29017N7113P9364
$$ -10930 -123092 -85640 -226964 171821 -118229 -61632 -68643 -51803 -380820 -323707 -244343
10493b44343B43371h5653a4457G5474e5810A19739d67660J64890A56514a96031
$$ -244343 243371 -85653 -14457 75474 -55810 119739 -467660 -302770 156514 -196031
10482C9523a05846J1073H2163k3056J8776h2045A44676R2305a8801B81602j07748
$$ 39523 -105846 -94773 82163 59107 77883 -82045 144676 236981 -18801 281602 173854
10471A73854b17814g2187k7066D40440j89872m8933K55201j09700F1481J01555
$$ 173854 -217814 -72187 -99253 440440 250568 201635 456836 347136 61481 163036
10461A63036n9817b11997b5844C3928a56442A28918E7938b12893O973l7954B6612
$$ 163036 103219 -211997 -25844 33928 -156442 128918 57938 -212893 -205920 -243874 26612
10449D58342A1687a7463A29646c12773B41970o3946J38848c462m5111R180q8983
$$ 458342 11687 -17463 129646 -312773 241970 178024 316872 -3462 -48573 -39393 -128376
10438a28376A59435f3993j09403A36053B5626a62313d4997k64377e6251G9791
$$ -128376 159435 -63993 -173396 136053 25626 -162313 -44997 -309374 -56251 79791
10427A33553c83940c1391k09735O4880A07735k4809J14618B1370a24462j73558
$$ 133553 -383940 -31391 -241126 -176246 107735 82926 197544 21370 -124462 -298020
10417b98020l4938I0613A9623J04904B4735L77717c1302k1343C09873j17489A4161
$$ -298020 -332958 90613 19623 124527 24735 402452 -31302 -52645 309873 192384 14161
10405C1556Q7386a36656A16928A0463c7994A9329L0670L8096a03943I9078g6624
$$ 31556 118942 -136656 116928 10463 -37994 19329 49999 88095 -103943 99078 -76624
10393a59448B05671F6773c59601A43679a49559M1358D3651e6265B41981G1993
$$ -159448 205671 66773 -359601 143679 -149559 -108201 43651 -56265 241981 71993
10382c7130A64755o9693K38188E1892j5942L14435e1995D879M67299f708A76667
$$ -37130 164755 95062 333250 51892 35950 350385 -51995 4879 472178 -6708 176667
10370d1547B25698D0070K0716k4693j2267J43940p4170a31187C84221j06240K41763
$$ -41547 225698 40070 60786 36093 23826 167766 93596 -131187 384221 277981 519744
10359E19744A92357j3607L18565k43022F4816J31869P8589K63802j3232B62253
$$ 519744 192357 178750 497315 254293 64816 196685 275274 539076 525844 262253
10348A94514J30781D8742J18309C9748J23324E7406J30417O4642B3834L26614
$$ 194514 325295 48742 167051 39748 163072 57406 187823 252465 23834 350448
10338C50448b67872D04425K02733M1969j46844j28438A85503N1241g4410C79973
$$ 350448 -267872 404425 607158 649127 502283 373845 185503 236744 -74410 379973
10327A88254J59654j06681K46219j94865L22359A00933b1255B47048q4384h0383
$$ 188254 347908 241227 487446 292581 614940 100933 -21255 247048 162664 -80383
10316i3708k7288M221A18971a17817a5587B42540E2023J8338R2507E9507J209
$$ -93708 -120996 -116775 118971 -117817 -15587 242540 52023 70361 162868 59507 60716
10305F0716e6348A27045D7052J45447p8039a92255D0911K75509C6396b29529R9804
$$ 60716 -56348 127045 47052 192499 114460 -192255 40911 316420 36396 -229529 -129725
10294a29725M820A53475E6159J45973g5328j8595j30186C17508A42732l0457C2635
$$ -129725 -124905 153475 56159 202132 -75328 -93923 -224109 317508 142732 112275 32635
10282E3711J71811i2173F4558K4437J41268a20073I9841c81354A2791a86749E52506
$$ 53711 225522 -92173 64558 88995 230263 -120073 99841 -381354 12791 -186749 552506
10270H1272e5499n5763q1295R5998L0572a5445A03907e193k54965a14260d8978
$$ 81272 -55499 -111262 -192557 -96559 -65987 -15445 103907 -5193 -260158 -114260 -48978
10258D34039b7051j7082B3173a42934n7543E4384C374L7634J38140o5046A890
$$ 434039 -27051 -44133 23173 -142934 -200477 54384 3374 41008 179148 114102 1890
10246a48372C8560M1215q337M5181P8998J999a30045I3130b14081A47858F1245
$$ -148372 38560 79775 71438 116619 195617 197616 -130045 93130 -214081 147858 61245
10234b47308A80452G196L82966b23858J08935b2106k92729A34254e6383o3045
$$ -247308 180452 7196 390162 -223858 -114923 -22106 -314835 134254 -56383 -119428
10224a19428C86668b48242A25030Q5275g4190b8143k70207e9428G4754a90625
$$ -119428 386668 -248242 125030 210305 -74190 -28143 -298350 -59428 74754 -190625
10213a74718j15241A22773J22975c1495a2304H5389b14179I2357e542A60444j7125
$$ -174718 -289959 122773 245748 -31495 -12304 85389 -214179 92357 -5542 160444 143319
10202A43319b21494m8625J03132A53674a87569Q6751b8000l32137a4124l53970
$$ 143319 -221494 -270119 -166987 153674 -187569 -100818 -28000 -360137 -14124 -368094
10192c68094A22563b58364d1063F4103Q2591e6490B9307a89435B9895a62059f9661
$$ -368094 122563 -258364 -41063 64103 146694 -56490 29307 -189435 29895 -162059 -69661
10180h4367j36186K5888i1256k64123D9374b32873A2723b9322I0154J00660a73170
$$ -84367 -220553 -194665 -91256 -355379 49374 -232873 12723 -29322 90154 190814 -173170
10168a47727e5704E3573J0858a03282B53781a77449b7051B54905F1754h5707a4194
$$ -147727 -55704 53573 64431 -103282 253781 -177449 -27051 254905 61754 -85707 -14194
10156D9202c78922a62095l8079k0626i262j16756A57426c22154D6493L2354R7889
$$ 49202 -378922 -162095 -200174 -220800 -9262 -126018 157426 -322154 46493 78847 176736
10145A76736a20915j72357h7650A95319B0759J38965i1877A7585J2078K18511
$$ 176736 -120915 -293272 -87650 195319 20759 159724 -91877 17585 29663 248174
10135B48174P3878d4905A91979n0648D8122R235L3213i8968A24281a21741B9285
$$ 248174 322052 -44905 191979 141331 48122 57357 90570 -98968 124281 -121741 29285
10123B31959g7989B46825q3170f6669H3790B0117a38970C2680J743a8565H4800
$$ 231959 -77989 246825 163655 -66669 83790 20117 -138970 32680 34423 -18565 84800
10111H0580b62571b7990r1738r4788P2773d0387D63727d7117B04531c57825A75079
$$ 80580 -262571 -27990 -119728 -214516 -141743 -40387 463727 -47117 204531 -357825 175079
10099b36740i2765j49677n2940J9827a33253m330B69181a29282j6515H4442b35100
$$ -236740 -92765 -242442 -295382 -275555 -133253 -137583 269181 -129282 -145797 84442 -235100
10087d59178B2594L41K38043a3691l17733A81075b67783g826D10716I9611a37038
$$ -459178 22594 22935 260978 -13691 -331424 181075 -267783 -7826 410716 99611 -137038
10075e2368a9143k99865R3748h2238C3435J00008A6100J86015a28162d0921j04770
$$ -52368 -19143 -319008 -225260 -82238 33435 133443 16100 202115 -128162 -40921 -145691
10064a45691G2176N1300j3135b42275H2599J8000J80690h1340A9386M6268b16862
$$ -145691 72176 123476 110341 -242275 82599 100599 281289 -81340 19386 65654 -216862
10052d4202j01521A80353C0231a019A69474J99157a66784A38764P8606a0737j31951
$$ -44202 -145723 180353 30231 -1019 169474 368631 -166784 138764 217370 -10737 -142688
10041a42688o668D4396K22578a58509k68927B34309B5380d92249g2412j22025
$$ -142688 -149356 44396 266974 -158509 -427436 234309 25380 -492249 -72412 -194437
10031a94437h7156j60484J17960M2424J8960r0015o6518O5057K8995f1718F4790
$$ -194437 -87156 -247640 -129680 -87256 -68296 -158311 -224829 -159772 -130777 -61718 64790
10019a72936j6315j44472a42178B85791b32991L8717g9197j30230e389k5388j60733
$$ -172936 -189251 -333723 -142178 285791 -232991 -194274 -79197 -209427 -5389 -30777 -191510
10008a91510Q6038b3676l01951A5561b8787Q891j76494O6581H2860b58314R4047
$$ -191510 -105472 -23676 -325627 15561 -28787 -19896 -196390 -129809 82860 -258314 -164267
9997a64267A38964L0618D8464B1037a4594A5185i723j09563d7565j2137n9248
$$ -164267 138964 169582 48464 21037 -14594 15185 -9723 -119286 -47565 -59702 -118950
9986a18950J3989l37876b11241a0974j77874Q0627Q1p9524J0220N5408A88956
$$ -118950 -104961 -442837 -211241 -10974 -188848 -108221 -108140 -187664 -177444 -122036 188956
9974A48168b04191b2739M797A60195i3683A0395c20956a20556j14339j43518a85296
$$ 148168 -204191 -22739 -17942 160195 -93683 10395 -320956 -120556 -234895 -378413 -185296
9962a19440K6447k52907a31039B15438b90475B95460b518A80853h0210A49916
$$ -119440 -92993 -345900 -131039 215438 -290475 295460 -2518 180853 -80210 149916
9951b08438J01582C725O635a03682B23402H1447O2755F2687a4481e231l69876
$$ -208438 -106856 3725 10360 -103682 223402 81447 144202 62687 -14481 -5231 -375107
9940c75107J81286Q4644a8590k17942J0485J3698j25674A45025b10297G6452a81348
$$ -375107 -193821 -109177 -18590 -236532 -226047 -212349 -338023 145025 -210297 76452 -181348
9928a8335G4600O7814f6281j26984H984J11925Q972f1792F4808f7130l24460G3344
$$ -18335 74600 142414 -66281 -193265 8984 120909 129881 -61792 64808 -67130 -391590 73344
9915H6907e8748j35669N2197n6259J4706M027m216A96413D4101i053j34402D09551
$$ 86907 -58748 -194417 -142220 -198479 -183773 -179746 -183962 196413 44101 -9053 -143455 409551
9902H4151c10583a7580G2602A4612M2275j5380K49971p4020H9260L9797k6560
$$ 84151 -310583 -17580 72602 14612 56887 41507 291478 217458 89260 129057 102497
9891A02497b18536e0374k61669a21810A2460b66788K5331m1149A55761A9417K4895
$$ 102497 -218536 -50374 -312043 -121810 12460 -266788 -241457 -282606 155761 19417 44312
9880D4312c7210A42230a48367D5993N9636a99034A04613c2013n3901o1628A35957
$$ 44312 -37210 142230 -148367 45993 105629 -199034 104613 -32013 -85914 -147542 135957
9868B12599F4419J20198J527g082k58892A45335b65882P3824M9804A9339a42574
$$ 212599 64419 184617 186144 -7082 -265974 145335 -265882 -192058 -142254 19339 -142574
9856a23297B41895d01704I0468a65355k16380C2193b65668h5845j80664a06025
$$ -123297 241895 -401704 90468 -165355 -381735 32193 -265668 -85845 -266509 -106025
9845a55529j94664e8421B26314a63015k15009D6715g0191F0520b19328i7374m7815
$$ -155529 -350193 -58421 226314 -163015 -378024 46715 -70191 60520 -219328 -97374 -145189
9834a45189j54385j02186A3888R6299E2999a32623j50096C06661i0523E2109i8044
$$ -145189 -299574 -401760 13888 110187 52999 -132623 -282719 306661 -90523 52109 -98044
9822c8887j87248B22822f4224G6107O0870b0223k8921J6369d774j09261A2120
$$ -38887 -226135 222822 -64224 76107 136977 -20223 -49144 -32775 -4774 -114035 12120
9810H3438a42378A9892c9252q3454j52545k09839J95150A02023d71760A8135J2666
$$ 83438 -142378 19892 -39252 -122706 -275251 -485090 -289940 102023 -471760 18135 30801
9799C0801J4476a62169I9431J61665c14212A10905a40287m30925A54234C4904
$$ 30801 45277 -162169 99431 261096 -314212 110905 -140287 -571212 154234 34904
9788A8636a62733B46952e2830j90629b1131j25786O2370j91197O8423B695J5918
$$ 18636 -162733 246952 -52830 -243459 -21131 -146917 -84547 -275744 -207321 2695 18613
9777A8613a0956A48903F0068P9163b26247C80662a53268c6684A42451a73934e5401
$$ 18613 -10956 148903 60068 139231 -226247 380662 -153268 -36684 142451 -173934 -55401
9765a22645H6445A3141a98275R8141A39465o7354a06203j83314J12499P6955k38246
$$ -122645 86445 13141 -198275 -100134 139465 72111 -106203 -289517 -177018 -100063 -338309
9754c38309C7576a34150D1107R3258N60J20715A7729b97126M9015I6646g5150
$$ -338309 37576 -134150 41107 134365 134925 255640 17729 -297126 -248111 96646 -75150
9742C9N0761a48749p996B24608c29796c8570j74112r0300C1195g8725G9986a73465
$$ 39 50800 -148749 -156745 224608 -329796 -38570 -212682 -302982 31195 -78725 79986 -173465
9729i9580K7935A62276c5970k58595a7990k36434A02761n1067B3285c2115r95
$$ -99580 -71645 162276 -35970 -294565 -17990 -254424 102761 51694 23285 -32115 -33110
9718c3110I8596a56033e6530n0710k7533f6639j08606k1924e7616A17965b06299
$$ -33110 98596 -156033 -56530 -107240 -134773 -66639 -175245 -197169 -57616 117965 -206299
9706B04814C0129i9866A12034c68983J32023B92726G1355g3300p5129d7976j56718
$$ 204814 30129 -99866 112034 -368983 -236960 292726 71355 -73300 -148429 -47976 -204694
9695b04694R929n3380G3027e85014A55256G4157a26519A6212a29864C6960b11007
$$ -204694 -194765 -248145 73027 -585014 155256 74157 -126519 16212 -129864 36960 -211007
9683a05187J3338j42851B40067b46966e0227l4712K2379m7638k9323j9093e6571
$$ -105187 -91849 -234700 240067 -246966 -50227 -84939 -62560 -110198 -139521 -158614 -56571
9671A0593a60459l944A56975n9070P8970n4956b40056e0438a7998j0181j64810
$$ 10593 -160459 -164403 156975 97905 176875 121919 -240056 -50438 -17998 -28179 -192989
9660a92989b5659r9771L0663B47404N234j24834c0422a4457p1705b0368j0004
$$ -192989 -25659 -125430 -94767 247404 252638 127804 -30422 -14457 -86162 -20368 -30372
9649c0372j5312g395j15270k18453B34808f8914p6992l0517L282L760K9770c7220
$$ -30372 -45684 -7395 -122665 -341118 234808 -68914 -145906 -176423 -173141 -169381 -139611 -37220
9636g7993f172k95308a5958A95889a32341F4461a16343j83780C9520J0377N4908
$$ -77993 -6172 -301480 -15958 195889 -132341 64461 -116343 -300123 39520 49897 104805
9625A04805h9482L0770A73680C2401g4194A69973a32455j12557B02248a37373
$$ 104805 -89482 -58712 173680 32401 -74194 169973 -132455 -245012 202248 -137373
9614A42852l6555b09122H2079b70659j26078a63058J6310k723a574k18656h0469
$$ 142852 106297 -209122 82079 -270659 -396737 -163058 -146748 -149471 -1574 -220230 -80469
9602F0592A6307N8390a8903A22074J19487i3956A87928L4079a85210C4716i2347
$$ 60592 16307 74697 -18903 122074 241561 -93956 187928 222007 -185210 34716 -92347
9590i0500B22465b39840K4970I9422l9170a23738j226B08028G2272K11802a18400
$$ -90500 222465 -239840 -214870 99422 60252 -123738 -124964 208028 72272 284074 -118400
9578d3858B8926a518C6025J14976f7319B91961h7299p8653B2770K89593A08720
$$ -43858 28926 -1518 36025 151001 -67319 291961 -87299 -165952 22770 312363 108720
9566b09579Q8754L913A76342a14951a1609B07220o4700b37946R6146B8209i8028
$$ -209579 -120825 -116912 176342 -114951 -11609 207220 142520 -237946 -141800 28209 -98028
9554a89381g1808j97692c1444A60142J05840h0305r21A23264E558a75957I0910
$$ -189381 -71808 -269500 -31444 160142 265982 -80305 -81226 123264 5558 -175957 90910
9542A05127k0632l5827K94947h0927A4489a05725a8947B58801E0301N6211a40355
$$ 105127 84495 48668 343615 -80927 14489 -105725 -18947 258801 50301 106512 -140355
9530H8734c76078F0944M2498g9945j51801a4912F1719b50848O8851k34838h3702
$$ 88734 -376078 60944 103442 -79945 -231746 -14912 61719 -250848 -181997 -416835 -83702
9518a6569k20886r5731A6027d74992b3767C4091c92503h7591M2000A52429B0121
$$ -16569 -237455 -333186 16027 -474992 -23767 34091 -392503 -87591 -45591 152429 20121
9506H1275A1841c76744J39428I401J34104a80131D3787O0692K6109d70720B47223
$$ 81275 11841 -376744 -237316 9401 143505 -180131 43787 104479 130588 -470720 247223
9494c0552j08815M8249B37241a6385A3955K17527a3788k64518A62066L9812G2598
$$ -30552 -139367 -91118 237241 -16385 13955 231482 -13788 -278306 162066 201878 72598
9482a32771j01074E0507b84052b864j72182O0264I1924O7720b01078k06429B54437
$$ -132771 -233845 50507 -284052 -2864 -175046 -114782 91924 159644 -201078 -407507 254437
9470a11884D7951N5712H525H7d4026B5014g4066D2867a39177G5110p353k0221
$$ -111884 47951 103663 8525 87 -44026 25014 -74066 42867 -139177 75110 67757 47536
9458D7536o852L7478c51535P6740O0573m0680G3325B5799c38267J52856A21445
$$ 47536 40684 78162 -351535 -274795 -214222 -254902 73325 25799 -338267 -185411 121445
9446e2153k48101A17063b58831C2915P8955b79418a10564p8935j54726b5341D4632
$$ -52153 -300254 117063 -258831 32915 111870 -279418 -110564 -189499 -344225 -25341 44632
9434a56915B73697a58432M5051j65226A41450A7900c30211J37890k20657E2167
$$ -156915 273697 -158432 -113381 -278607 141450 17900 -330211 -192321 -412978 52167
9423G3342h0789j59659A00075B7153Q2000g1175m3295F5831M1192a9565P79F6556
$$ 73342 -80789 -240448 100075 27153 109153 -71175 -114470 65831 107023 -19565 -18786 66556
9410C9287M2205H396c29042d635k1298j20021E7114e0383j1152j30567L9703J482
$$ 39287 81492 8396 -329042 -4635 -25933 -145954 57114 -50383 -61535 -192102 -152399 -150917
9398a50917B7398b59556n2188f8991E1553h2414A08955K57617b5233n353B6900
$$ -150917 27398 -259556 -311744 -68991 51553 -82414 108955 366572 -25233 -30586 26900
9386A7620b79190A08832g3794m3647k7513K1307A27160G723a36474G197c7158
$$ 17620 -279190 108832 -73794 -117441 -144954 -123647 127160 7723 -136474 7197 -37158
9374b06872B8187a10225B3609b08461M0833b0978A33363N5916a54509c9660A66679
$$ -206872 28187 -110225 23609 -208461 -167628 -20978 133363 189279 -154509 -39660 166679
9362b35006h7107k87357J01184N5053O0276J7721n2073o6138d7009I4401b516
$$ -235006 -87107 -374464 -273280 -218227 -157951 -140230 -192303 -258441 -47009 94401 -2516
9350c3156q7420p4971A51311k0289c42372C6011j1182a28233f2625m2434H8678
$$ -33156 -120576 -195547 151311 131022 -342372 36011 24829 -128233 -62625 -105059 88678
9338h3052E7683h6504m866D1448a15954q5103D9458h5250j42604G9294b1409A11709
$$ -83052 57683 -86504 -91370 41448 -115954 -201057 49458 -85250 -227854 79294 -21409 111709
9325f6050B11588b64086A39113e1610L369j02133r5444F9590k4074a9974j83994
$$ -66050 211588 -264086 139113 -51610 -48241 -150374 -245818 69590 45516 -19974 -203968
9314b03968a2621B54436b2747k5847A77081b31792a4736D1982d650r334f835E4411
$$ -203968 -12621 254436 -22747 -48594 177081 -231792 -14736 41982 -4650 -13984 -6835 54411
9301A52494d4340I5515b82602g9412A0992e6741j72086B23951h2819E3667b8197
$$ 152494 -44340 95515 -282602 -79412 10992 -56741 -228827 223951 -82819 53667 -28197
9289a81537d8278A57753a35481j16408B2575d9786k53037a9688A11818d414p0091
$$ -181537 -48278 157753 -135481 -251889 22575 -49786 -302823 -19688 111818 -4414 -74505
9278g4505k8649J9571q647D9241a50663g3544j52142Q6363r3059m7238R3058e2671
$$ -74505 -103154 -83583 -92230 49241 -150663 -73544 -225686 -139323 -232382 -279620 -186562 -52671
9265b70470G6637A968a01695d2676F7725Q8150h7281A61042b88497D4623c41216
$$ -270470 76637 1968 -101695 -42676 67725 155875 -87281 161042 -288497 44623 -341216
9253a06701A25282E5786b14670a6834H1259B0219J17742i8285j42758P4269A83059
$$ -106701 125282 55786 -214670 -16834 81259 20219 137961 -98285 -241043 -166774 183059
9241e7667k68127F7291b82412P9549c8154J4552o9442A8713K09905i2358c5958
$$ -57667 -325794 67291 -282412 -202863 -38154 -23602 -93044 18713 228618 -92358 -35958
9229b29077K5351k7493R7611a862G107b73937A12140D9180L3514J24470B2548
$$ -229077 -203726 -231219 -133608 -1862 7107 -273937 112140 49180 82694 207164 22548
9217A80884i2271b9018B14021a78029A68082G101M7252J35689i4696a5573m1541
$$ 180884 -92271 -29018 214021 -178029 168082 7101 54353 190042 -94696 -15573 -57114
9206e7114B60989f5368p9135O8850j35745C1751K42343E7826i9184j479b1301
$$ -57114 260989 -65368 -144503 -75653 -211398 31751 274094 57826 -99184 -100663 -21301
9194a8940B8802b37793i6067l90017D5766a74127l51812h3719l47648B23602k7954
$$ -18940 28802 -237793 -96067 -486084 45766 -174127 -525939 -83719 -431367 223602 195648
9183A95648A7852a19926L6742o933a4515j23760b5206A23301a52573j06286a15399
$$ 195648 17852 -119926 -83184 -90117 -14515 -138275 -25206 123301 -152573 -258859 -115399
9171a06879C09305a87017A81001A5845E354L1154i6333r156A5483N0745c57798
$$ -106879 309305 -187017 181001 15845 5354 36508 -96333 -105489 15483 66228 -357798
9159i496A32977E4108J39284A6452b18610j32066Q9563O693C97380j21249f0826
$$ -9496 132977 54108 193392 16452 -218610 -350676 -261113 -254420 397380 276131 -60826
9147c3369B6621c8040k6434k9287j81264A1076a86558k54032i4723j54897I0696
$$ -33369 26621 -38040 -64474 -93761 -275025 11076 -186558 -440590 -94723 -249620 90696
9135d64107a77298A5959K0650N2132c8970o7574A40054a60491A75336f6639B3378
$$ -464107 -177298 15959 36609 88741 -38970 -106544 140054 -160491 175336 -66639 23378
9123a66377A49377B3897b32318h0800q9926A01920J20233b16278n3294C07900
$$ -166377 149377 23897 -232318 -80800 -170726 101920 222153 -216278 -269572 307900
9112B74939P6717A32471a41615A94022h4788E2781a61930n1782B1954K83310F1037
$$ 274939 351656 132471 -141615 194022 -84788 52781 -161930 -213712 21954 305264 61037
9100a37249N2287A77497h1856j61422A9856b09220l4597j2246g0566c2495B45993
$$ -137249 -84962 177497 -81856 -243278 19856 -209220 -243817 -256063 -70566 -32495 245993
9088b19872A45801j9523d36713A8647c78646e3255A80617b77353K8120E4293b99561
$$ -219872 145801 126278 -436713 18647 -378646 -53255 180617 -277353 -249233 54293 -299561
9076a23633m7988m1659M0300j70726A23534c12075G2354a40735B0314b59476A4913
$$ -123633 -171621 -213280 -172980 -343706 123534 -312075 72354 -140735 20314 -259476 14913
9064i678F9357h5186I3511b59555f7208q0377p4055J10270j3898L4416C5535G553
$$ -9678 69357 -85186 93511 -259555 -67208 -147585 -221640 -111370 -125268 -90852 35535 7553
9051a44706k6713A1846L8997i9803A09473a97690d8224O853l92592C29072c14195
$$ -144706 -171419 11846 50843 -99803 109473 -197690 -48224 -41371 -433963 329072 -314195
9039b59711K9688A34560d4616j00054f3678C1616H206c08222J3234Q8207A7456
$$ -259711 -230023 134560 -44616 -144670 -63678 31616 8206 -308222 -294988 -206781 17456
9027e2468B17094i2443R087j96439A14310a88773d9470k26430e4535j81478P8575
$$ -52468 217094 -92443 -83356 -279795 114310 -188773 -49470 -275900 -54535 -236013 -157438
9016a57438f845r177B01466b14928H724M0017d9460F7945b2168A10201c06953
$$ -157438 -6845 -16022 201466 -214928 8724 48741 -49460 67945 -22168 110201 -306953
9004a14614j39646b172m7530j85596d4371B292a72071P972A16836a42886e4611
$$ -114614 -254260 -2172 -49702 -235298 -44371 2292 -172071 -164099 116836 -142886 -54611
8992b30507M8016F0344P4747a09835j10361e1826j10520A3764a9498A41456j5699
$$ -230507 -182491 60344 135091 -109835 -220196 -51826 -162346 13764 -19498 141456 125757
8981A25757a41699D4196a897A55506h4601j45577k056O6159N4663I1327P6978
$$ 125757 -141699 44196 -1897 155506 -84601 -230178 -232234 -166075 -111412 91327 168305
8970A68305N1934C0477c03030E7776a00987C01435a61248A19931C4624e287A7519
$$ 168305 220239 30477 -303030 57776 -100987 301435 -161248 119931 34624 -5287 17519
8958D6259c5591C39945r4462f0848J3515I1239c19741B11226d2164D1478Q2476
$$ 46259 -35591 339945 245483 -60848 -47333 91239 -319741 211226 -42164 41478 123954
8947A23954L3742c79833D6868h1677C46392i3605a0310j10736c3452k04258b2400
$$ 123954 157696 -379833 46868 -81677 346392 -93605 -10310 -121046 -33452 -237710 -22400
8935a61401g7459A71856H1537B5649b83812G2915k8500a31682i735n0991B28097
$$ -161401 -77459 171856 81537 25649 -283812 72915 44415 -131682 -9735 -60726 228097
8923b25893C4737K31498a52643r7381B24111j06934b8534j84155h4420K5575A10655
$$ -225893 34737 266235 -152643 -250024 224111 117177 -28534 -212689 -84420 -58845 110655
8911f3241J5686B16023q3442K61916O45935Q31890P74339H25838C28687O0778
$$ -63241 -47555 216023 132581 394497 1040432 1872322 2646661 825838 328687 389465
8901C89465j41470J4016I97O9237J29362a08707k6712A9066a57893M2582G6491
$$ 389465 247995 262011 997 70234 199596 -108707 -135419 19066 -157893 -115311 76491
8889a14097B1812b65822G929J66234J63883b86768A55217A1805a38343l1985M5964
$$ -114097 21812 -265822 7929 174163 338046 -286768 155217 11805 -138343 -170328 -124364
8878a24364k37061a33295l38L6672M8216j29564m6776j70150a67605a410m282
$$ -124364 -361425 -133295 -133633 -96961 -48745 -178309 -225085 -395235 -167605 -1410 -5692
8867e692k78820A30725g3425j5828j06125D5027b38012a16184b2926C1698a5737
$$ -5692 -284512 130725 -73425 -89253 -195378 45027 -238012 -116184 -22926 31698 -15737
8855b86725B78089H9627a44585L4979E0653J8375r02b5620j65243H9811e7320
$$ -286725 278089 89627 -144585 -109606 50653 69028 68126 -25620 -190863 89811 -57320
8843h5604d0028j28939p9487A97053H6575E596d4138a0892C70936B0318e3128
$$ -85604 -40028 -168967 -248454 197053 86575 5596 -44138 -10892 370936 20318 -53128
$$ [...]
##END NTUPLES=NMR SPECTRUM
##END=
