
##TITLE=AC1221_Punto_6074838_avRdzygsig
##JCAMPDX= 6.0         $$ Bruker NMR JCAMP-DX V2.0
##DATA TYPE= NMR SPECTRUM
##DATA CLASS= NTUPLES
##ORIGIN= BRUKER
##OWNER= Administrator
$$ 1.72 TOPSPIN		Version 2.1
$$ 2012-05-07 20:33:47.703 -0500  Administrator@TOPSPIN
$$ Compression mode = diff/dup
##.OBSERVE FREQUENCY= 400.13188235
##.OBSERVE NUCLEUS= ^1H
##.ACQUISITION MODE= SIMULTANEOUS (DQD)
##.ACQUISITION SCHEME= undefined
##.AVERAGES= 8
##.DIGITISER RES= 22
##SPECTROMETER/DATA SYSTEM= spect
##.PULSE SEQUENCE= zg30
##.SOLVENT NAME= COFFEE_meoh
##.SHIFT REFERENCE= INTERNAL, COFFEE_meoh, 1, 14.98061
##AUDIT TRAIL= $$ (NUMBER, WHEN, WHO, WHERE, PROCESS, VERSION, WHAT)
$$ ##TITLE= Audit trail, TOPSPIN		Version 2.1
$$ ##JCAMPDX= 5.01
$$ ##ORIGIN= Bruker BioSpin GmbH
$$ ##OWNER= Administrator
$$ $$ C:\Bruker\TOPSPIN/data/COFFEE/nmr/AC1221_Punto_6074838_avRdzygsig/10/pdata/1/auditp.txt
$$ ##AUDIT TRAIL=  $$ (NUMBER, WHEN, WHO, WHERE, PROCESS, VERSION, WHAT)
(   1,<2012-05-07 20:33:39.750 -0500>,<Administrator>,<TOPSPIN>,<go>,<TOPSPIN 2.1>,
      <created by zg
	started at 2012-05-07 20:32:33.171 -0500,
	POWCHK enabled, PULCHK disabled,
       configuration hash MD5:
       AF F2 23 6B 01 CD 40 DD E5 A1 38 A0 06 EA F7 77
       data hash MD5: 64K
       84 49 7C F0 93 FD C0 A9 93 83 53 24 8E 89 8D 19>)
(   2,<2012-05-07 20:33:43.218 -0500>,<Administrator>,<TOPSPIN>,<proc1d>,<TOPSPIN 2.1>,
      <Start of raw data processing
       efp LB = 0 FT_mod = 6 PKNL = 1 PHC0 = 0 PHC1 = 0 SI = 32K 
       data hash MD5: 32K
       85 1B 35 73 1F 6D ED 87 7E 1C 4C 50 9D EA 51 0E>)
(   3,<2012-05-07 20:33:43.765 -0500>,<Administrator>,<TOPSPIN>,<proc1d>,<TOPSPIN 2.1>,
      <pk PHC0 = 210.3223 PHC1 = 0 
       data hash MD5: 32K
       AA 56 2B 44 9A DB A6 67 9C D0 69 C5 1A C8 7D 3F>)
(   4,<2012-05-07 20:33:43.843 -0500>,<Administrator>,<TOPSPIN>,<proc1d>,<TOPSPIN 2.1>,
      <abs ABSG = 1 
       data hash MD5: 32K
       B4 FB 27 98 EC C5 2C F3 58 C5 7B 2B 55 B8 9D 45>)
(   5,<2012-05-07 20:33:43.875 -0500>,<Administrator>,<TOPSPIN>,<proc1d>,<TOPSPIN 2.1>,
      <abs ABSG = 2 
       data hash MD5: 32K
       D1 0B FF BC 39 6F 4C 60 F7 2D 84 DE D8 58 CA C0>)
(   6,<2012-05-07 20:33:43.906 -0500>,<Administrator>,<TOPSPIN>,<proc1d>,<TOPSPIN 2.1>,
      <abs ABSG = 3 
       data hash MD5: 32K
       3C 35 A9 73 B8 18 FE 40 6B 61 2F E1 77 C0 C5 8C>)
(   7,<2012-05-07 20:33:43.937 -0500>,<Administrator>,<TOPSPIN>,<proc1d>,<TOPSPIN 2.1>,
      <abs ABSG = 4 
       data hash MD5: 32K
       5A BC 12 CE 44 FB 72 DC 90 57 54 28 7F DD 9D 3E>)
(   8,<2012-05-07 20:33:43.968 -0500>,<Administrator>,<TOPSPIN>,<proc1d>,<TOPSPIN 2.1>,
      <abs ABSG = 5 
       data hash MD5: 32K
       F4 5B 43 77 A3 9F D3 B0 F4 02 3F 29 31 23 B7 0F>)
$$ ##END=
$$ 
$$ $$ hash MD5
$$ $$ 91 4B 1C 1D AF 0F DD E6 4A 2A B0 6D 66 19 74 E0
##$RELAX= 
##$RELAX= 
##$RELAX= 
##$RELAX= 
##$RELAX= 
##$RELAX= 
##$RELAX= 
$$ Bruker specific parameters
$$ --------------------------
$$ [...]
##$TP= (0..7)
150 150 150 150 150 150 150 150
##$TP07= 0
##$TPNAME0= <>
##$TPNAME1= <>
##$TPNAME2= <>
##$TPNAME3= <>
##$TPNAME4= <>
##$TPNAME5= <>
##$TPNAME6= <>
##$TPNAME7= <>
##$TPOAL= (0..7)
0.5 0.5 0.5 0.5 0.5 0.5 0.5 0.5
##$TPOFFS= (0..7)
0 0 0 0 0 0 0 0
##$TUNHIN= 0
##$TUNHOUT= 0
##$TUNXOUT= 0
##$USERA1= <user>
##$USERA2= <user>
##$USERA3= <user>
##$USERA4= <user>
##$USERA5= <user>
##$V9= 5
##$VALIST= <valist>
##$VCLIST= <CCCCCCCCCCCCCCC>
##$VD= 0
##$VDLIST= <DDDDDDDDDDDDDDD>
##$VPLIST= <PPPPPPPPPPPPPPP>
##$VTLIST= <TTTTTTTTTTTTTTT>
##$WBST= 1024
##$WBSW= 4
##$XGAIN= (0..3)
0 0 0 0
##$XL= 0
##$YL= 0
##$YMAX_a= 523097
##$YMIN_a= -631381
##$ZGOPTNS= <>
##$ZL1= 120
##$ZL2= 120
##$ZL3= 120
##$ZL4= 120
##$ABSF1= 14.98061
##$ABSF2= -5.57192
##$ABSG= 5
##$ABSL= 3
##$ALPHA= 0
##$AQORDER= 0
##$ASSFAC= 0
##$ASSFACI= 0
##$ASSFACX= 0
##$ASSWID= 0
##$AUNMP= <proc_prof1d_extract_pilot.lims>
##$AXLEFT= 0
##$AXNAME= <>
##$AXNUC= <1H>
##$AXRIGHT= 0
##$AXTYPE= 0
##$AXUNIT= <>
##$AZFE= 0.1
##$AZFW= 0.1
##$BCFW= 0
##$BC_mod= 0
##$BYTORDP= 0
##$COROFFS= 0
##$CY= 15
##$DATMOD= 1
##$DC= 0
##$DFILT= <>
##$DTYPP= 0
##$F1P= 0
##$F2P= 0
##$FCOR= 0.5
##$FTSIZE= 32768
##$FT_mod= 6
##$GAMMA= 0
##$GB= 0
##$INTBC= 1
##$INTSCL= 1
##$ISEN= 128
##$LB= 0
##$LEV0= 0
##$LPBIN= 0
##$MAXI= 10000
##$MC2= 0
##$MEAN= 0
##$ME_mod= 0
##$MI= 0
##$NCOEF= 0
##$NC_proc= -8
##$NLEV= 6
##$NOISF1= 0
##$NOISF2= 0
##$NSP= 0
##$NTH_PI= 0
##$NZP= 0
##$OFFSET= 14.98061
##$PC= 1
##$PHC0= 210.3223
##$PHC1= 0
##$PH_mod= 1
##$PKNL= yes
##$PPARMOD= 0
##$PPDIAG= 0
##$PPIPTYP= 0
##$PPMPNUM= 2147483647
##$PPRESOL= 1
##$PSCAL= 4
##$PSIGN= 0
##$PYNMP= <proc.py>
##$REVERSE= no
##$SF= 400.13
##$SI= 32768
##$SIGF1= 0
##$SIGF2= 0
##$SINO= 400
##$SIOLD= 32768
##$SPECTYP= <>
##$SREGLST= <1H.CDCl3>
##$SSB= 0
##$STSI= 32768
##$STSR= 0
##$SW_p= 8223.68421052632
##$SYMM= 0
##$S_DEV= 0
##$TDeff= 65536
##$TDoff= 0
##$TI= <>
##$TILT= no
##$TM1= 0
##$TM2= 0
##$TOPLEV= 0
##$USERP1= <user>
##$USERP2= <user>
##$USERP3= <user>
##$USERP4= <user>
##$USERP5= <user>
##$WDW= 1
##$XDIM= 32768
##$YMAX_p= 463255851
##$YMIN_p= -648637
##$CURPLOT= <Network HP LaserJet P1505>
##$CURPRIN= <$Network HP LaserJet P1505>
##$DFORMAT= <normdp>
##$LAYOUT= <+/1D_H.xwp>
##$LFORMAT= <normlp>
##$PFORMAT= <normpl>
##$SURQMSG= 1
$$ End of Bruker specific parameters
$$ ---------------------------------
##NTUPLES= NMR SPECTRUM
##VAR_NAME=  FREQUENCY,     SPECTRUM/REAL,   SPECTRUM/IMAG
##SYMBOL=    X,             R,               I
##VAR_TYPE=  INDEPENDENT,   DEPENDENT,       DEPENDENT
##VAR_FORM=  AFFN,          ASDF,            ASDF
##VAR_DIM=   32768,         32768,           32768
##UNITS=     HZ,            ARBITRARY UNITS, ARBITRARY UNITS
##FACTOR=    0.250966925370066, 1,           1
##FIRST=     8223.43324360095, -1303,        -12257
##LAST=      0,             -356076,         -176435
##MIN=       0,             -648637,         0
##MAX=       8223.43324360095, 463255851,    0
$$ Real data points
##PAGE= N=1
##DATA TABLE= (X++(R..R)), XYDATA
$$ [...]
19540g2393C2373c50601I6122g9993O121A1081K6516a22140B817i284H944e2179
19527b58124j40790J92532O6332A0756a84168A84457a72177j5166A22219a71903
19516a01333h177p4426j01906A47003a00158d9619A82068d7039l19417a50396
19505e04596B0814g5119j18937M3656K8966D3853b04800F931J43274F3758a43894
19493b43563g202A50151b7927l60612B09739P3511b5801m5834k4559A4154M6378
19482F0532a57349K250d7907j60073Q1940A43218a7496A27998a82221n875P0121
19471a17975d6154E64383B48093e0012D7213h0685n14902a77590B64265C2568
19460f9079D2689b84351f8038j96527C4096b37964P7316p0528d9759A7056d3884
$$ y = [-72393, 32373, -350601, 96122, -79993, -73872, 11081, 37597, -122140, 2817, -9284, 8944, -52179, -258124, -398914, -206382, -140050, 10756, -184168, 184457, -172177, -187343, 122219, -171903, -101333, -8177, -82603, -184509, 147003, -100158, -49619, 182068, -47039, -366456, -150396, -504596, 20814, -75119, -194056, -150400, -121434, 43853, -204800, 6931, 150205, 63758, -143894, -243563, -7202, 150151, -27927, -388539, 209739, 283250, -25801, -71635, -96194, 14154, 60532, -157349, -155099, -47907, -207980, -126040, 143218, -17496, 127998, -182221, -188096, -117975, -46154, 564383, 248093, -50012, 47213, -80685, -595587, -177590, 264265, 32568, -69079, 42689, -284351, -68038, -264565, 34096, -237964, -160648, -231176, -49759, 17056, -43884]
19448a09569F1193a52001j15752J19828A7610P2279b04614A76680H3532f1387
19437c14819J02424B74484b30813g3776K8526j00599D1597O6067b24853I1926
19426A92021b60532B6442F968h0642a6979B09365h5384A55252b19100j05215J26773
19415a97542A56575a34455H8827b26625G5318N3035d1309j27524A49179A4041
19404b25616j7149H9736h8901j64670G9359P6997f5181j12276e3667r0670D34369
19392F0809J79371E272d0092j01066M5340E3742a65313D3124a90999K2145k05998
19381c74852i606a476n066l1180a8759k02752J5248C1308R7397m9070a20024j8544
19369a38568n9753l499C5660N3463B232O0902b15772Q0893A81154I982k319N4987
$$ y = [-109569, 61193, -152001, -267753, -147925, 17610, 89889, -204614, 176680, 83532, -61387, -314819, -212395, 274484, -230813, -73776, -45250, -145849, 41597, 107664, -224853, 91926, 192021, -260532, 26442, 6968, -80642, -16979, 209365, -85384, 155252, -219100, -324315, -197542, 156575, -134455, 88827, -226625, 75318, 128353, -41309, -168833, 149179, 14041, -225616, -242765, 89736, -88901, -253571, 79359, 156356, -65181, -177457, -53667, -144337, 434369, 60809, 240180, 5272, -40092, -141158, -95818, 53742, -165313, 43124, -190999, -168854, -374852, -9606, -1476, -6542, -37722, -18759, -221511, -206263, 31308, 128705, 79635, -120024, -138568, -198321, -201820, 35660, 89123, 2232, 63134, -215772, -134879, 181154, 9982, 7663, 62650]
19357F2650a34399J2346j54559A39285J0603c00065C8673b37334A37815I627J40346
19346A49973B7987b36073E7937c3515j00290A6525J35354o5930b42057P9725j18626
19335b80958l1216m9355B2516P7790m3449b03933k514D01872b94230A90776o1590
19324A29186J94624j59850b4681B1326h4342j37207A22187c4027B8206e9863B0637
19312f0079A18984J01421q2446Q8095g4565f927m9152j96871G4231i5944k24892
19301c20836A87491i2804J3197A13639b51555O7274j05364J36899M3518p0829
19291a80057E8751b1313A02324c81428B39426c3927A40623b13100h6888j28527
19281b15415B2963a20589j35314H1622a77240B0381J77671d76058c677j20379
$$ y = [62650, -134399, -122053, -276612, 139285, 149888, -300065, 38673, -237334, 137815, 9627, 149973, 27987, -236073, 57937, -33515, -133805, 16525, 151879, 85949, -242057, -162332, -280958, -312174, -361529, 22516, 100306, 56857, -203933, -206447, 401872, -294230, 190776, 129186, 323810, 163960, -24681, 21326, -84342, -221549, 122187, -34027, 28206, -59863, 20637, -60079, 118984, 220405, 137959, 226054, -74565, -6927, -56079, -252950, 74231, -95944, -320836, 187491, -92804, -79607, 113639, -251555, -184281, -289645, -152746, -109228, -180057, 58751, -21313, 102324, -381428, 239426, -33927, 140623, -213100, -86888, -215415, 22963, -120589, -255903, 81622, -177240, 20381, 198052, -476058, -3677, -124056]
19271a24056o3491d5667o2450B9499g1900E656e3937j06054j85640J16287d6076
19259d6824J573k9008B21815A9332K1878a86975B75661h5480j47466A68947e0697
19247a84622H4590c75079B07012c55076A82867D7010f6792J3068A3273b86586
19236D2095a71912B29610I2586b01661E9120a2554j94403j46663J37435N6768
19226a59417A05803J71135A34042e7271j8597G590a48781B8846b4473j06534r9889
19215b30896l2733A7418a8573c348H5527a18589l8272l4718D1436c2147A6946
19203a52136A49768e7455a4104n3594p8764k0324B59383a69024A22315a92777
19192B22276m081J3082d57605J21781d4016D8963a71386H7490Q9981b31582h2566
$$ y = [-124056, -187547, -45667, -108117, 29499, -71900, 5656, -53937, -159991, -345631, -229344, -46076, -46824, -45251, -74259, 221815, 19332, 41210, -186975, 275661, -85480, -232946, 168947, -50697, -184622, 84590, -375079, 207012, -355076, 182867, 47010, -66792, -53724, 13273, -286586, 42095, -171912, 229610, 92586, -201661, 59120, -12554, -206957, -353620, -216185, -159417, 105803, 276938, 134042, -57271, -75868, 7590, -148781, 28846, -24473, -131007, -230896, -263629, 17418, -18573, -3348, 85527, -118589, -156861, -191579, 41436, -32147, 16946, -152136, 149768, -57455, -14104, -67698, -146462, -166786, 259383, -169024, 122315, -192777, 222276, 218195, 231277, -457605, -335824, -44016, 48963, -171386, 87490, 177471, -231582, -82566]
19180b65290l1364d1095p0645B01753a02614d3780B56102D7029A705K02563e3104
19168B33118E857b1700I3493f7890n7736C7430j7476b48652A6330J45175j4343
19157A47162a93968M3552H3096m836A6463b5812j20841D0116a61883J4380e7701
19145h8099M1746q0997j06883j17734a6215j87866H2028j499a38469N4598A05307
19133C07964c03808a14300q0465e1234B21820c55095h5152j30390b5304a0992
19122A23796a80414A7146e0972k95584e1416C4234K35032A23729c17995J30238
19112a87757D8558P0381g2977j88733f4166k96784F5013B7193a01776K7200j43696
19101b18272L2821r6555B08517A4990f8812B43882f5376i926r3042B38790i8861
$$ y = [-265290, -296654, -41095, -111740, 201753, -102614, -43780, 256102, 47029, 1705, 204268, -53104, 233118, 5857, -21700, 93493, -67890, -125626, 37430, 19954, -248652, 16330, 161505, 147162, -193968, -150416, 83096, 78260, 16463, -25812, -146653, 40116, -161883, -147503, -57701, -88099, -46353, -127350, -234233, -351967, -16215, -204081, 82028, 80529, -138469, -83871, 105307, 307964, -303808, -114300, -194765, -51234, 221820, -355095, -85152, -215542, -25304, -10992, 123796, -180414, 17146, -50972, -346556, -51416, 34234, 269266, 123729, -317995, -187757, 48558, 118939, -72977, -261710, -64166, -360950, 65013, 27193, -101776, -74576, -218272, -185451, -282006, 208517, 14990, -68812, 243882, -65376, -9926, -102968, 238790, -98861]
19089b80776f6331c2248c991j61489C7021K596b80290J28423c5871j50916L8108
19078a48679I8967M39591G186O3808a43786L0750M3601C98331B1252J83990b8968
19066a28917k5488b0856i075k93610b063n8191k27532B16061C5881J15074J67343
19055C18298a15994K5087k5221j33451p5808J40858e3143C3422a4304o5713L4938
19044d5079p2517j62103J8400a6689l48342A04500C1122a76566A05726O4172h8299
19032a51351B51869d6144m1760F7890c60741P8712j3567e3049a5055k41179a10353
19020A24371k4722F604a85051A04454b45882l0378A0419J03047c1167C33064j13303
19009B19761o6078c7758a7490m0113D1339K49745a80465A43501h7581j8055C01224
$$ y = [-280776, -66331, -32248, -3991, -165480, 37021, 39617, -280290, -151867, -35871, -186787, -148679, 98967, 538558, 7186, 70994, -143786, -113036, -69435, 398331, 21252, 205242, -28968, -128917, -154405, -20856, -9075, -302685, -2063, -60254, -287786, 216061, 35881, 150955, 318298, -115994, -90907, -116128, -249579, -325387, -184529, -53143, 33422, -14304, -80017, -45079, -117596, -279699, -261299, -16689, -365031, 104500, 31122, -176566, 105726, 169898, -88299, -151351, 251869, -46144, -87904, 67890, -360741, -282029, -295596, -53049, -15055, -256234, -110353, 124371, 99649, 6604, -185051, 104454, -245882, -276260, 10419, 113466, -31167, 333064, 219761, 153683, -37758, -17490, -57603, 41339, 291084, -180465, 143501, -87581, -105636, 301224]
18997c16901F7068J46775q2783n8004K5884E446b19970H7117a42991b8769l0856
18986e9625m0431n4086d4373r1916c1955n1873F9245j9493J34184h5884D8379
18974e9596E5534R3473C4427K4469H403g0038a6897j72303Q383B76602a11114
18962g7893A51414i5595q0160L4567b1827n1462r6917A00307a13620A2461J38979
18951A51440a09697L3497E664e6816l7807l7529A59790c23413h7825j21578j79226
18940c88629B055a56411a0791j86041Q4239A37932N3673g0912N141C6216J02455
18929A38671Q3323a19997b0620j10269f1989A1501b58818A44941a51845A82009
18918d8579k0393l68030a26375B23394i3050L587f663A07247D3067a97796B6563
$$ y = [-316901, 67068, 213843, 131060, 73056, 98940, 5446, -219970, 87117, -142991, -28769, -59625, -100056, -154142, -44373, -136289, -31955, -83828, 69245, 49752, 183936, -85884, 48379, -59596, 55534, 149007, 34427, 58896, 8403, -70038, -16897, -189200, -180817, 276602, -111114, -77893, 151414, -95595, -175755, -141188, -21827, -73289, -170206, 100307, -113620, 12461, 151440, -109697, -76200, 5664, -56816, -94623, -132152, 159790, -323413, -87825, -209403, -388629, 2055, -156411, -10791, -196832, -112593, 137932, 191605, -70912, -65771, 36216, 138671, 221994, -119997, -20620, -130889, -61989, 11501, -258818, 144941, -151845, 182009, -48579, -68972, -437002, -126375, 223394, -93050, -89463, -6663, 107247, 43067, -197796, 26563]
18906A2379J4877A0028N6744d7683a9461C8498O4723a10014A1565M1244d5443
18894b30144a01021o3313k13780a11479M2137B77902a48661d4105B3547J9881
18884D3428a47021c2394k16464e1082m7235M4387j72523L414j45385A08513a01397
18872d18794J81391i6892A84860i9049l1617B059J3579a71786B91740d1022B91515
18860D3604K75865C2792a83817B55940g0551j93067A29368b42578i433p10l13095
18849c23238f9714j6840A28112i7604I2321K1246b8791F2867J83275d25613H6319
18837d06460C37216b3268A81257F3477N6677l2847a95975b6743k16145O7586A8968
18825h8923q0729A27136e3738A7469R2410N2484c15486J40598g869D8507i6985
$$ y = [12379, 27256, 10028, 66772, -47683, -19461, 38498, 103221, -110014, 11565, 52809, -45443, -230144, -101021, -164334, -378114, -111479, -69342, 277902, -148661, -44105, 23547, 43428, -147021, -32394, -248858, -51082, -98317, -53930, -226453, -223039, -368424, 108513, -101397, -418794, -237403, -96892, 184860, -99049, -130666, 2059, 15638, -171786, 291740, -41022, 291515, 43604, 319469, 32792, -183817, 255940, -70551, -263618, 129368, -242578, -9433, -10143, -323238, -69714, -86554, 128112, -97604, 92321, 113567, -28791, 62867, 246142, -425613, 86319, -406460, 337216, -23268, 181257, 63477, 120154, 87307, -195975, -26743, -242888, -175302, 18968, -88923, -169652, 127136, -53738, 17469, 109879, 162363, -315486, -174888, -7869, 48507, -96985]
18813D556A928b3431n0713b8315j97526K9840A9162a44308I1060j266a66638A29972
18800F336K30418A10598a36649n4365A9415J0516a4394G071K95488a07172c0955
18788I6027B012a2723E4999b10815N6398l6461j0269A16561J43651h3837j67719
18777b51556f1647B9037b74424J03194G7442a12518A6856g9121H9775a29373l57553
18766d86926C3287b23833N7458n2547p7142C72879E6354d95074G7703b08627i6229
18754b90824b5903d407j15264j67660P613A38236C7623d0547B50791b50926B05873
18742F6270k0636f2035K1542l7463n28p7079K4171m8527A86560j7743G37a15561
18729E1982o509R4324b65056J00648c6075G8372b94495f5313B40562q5780a17164
$$ y = [4556, 1928, -23431, -74144, -28315, -225841, -196001, 19162, -144308, 91060, 89794, -166638, 129972, 6336, 236754, 110598, -136649, -191014, 19415, 29931, -14394, 7071, 302559, -107172, -30955, 96027, 2012, -12723, 54999, -210815, -154417, -190878, -201147, 116561, 260212, -83837, -251556, -61647, 29037, -274424, -171230, 77442, -112518, 16856, -79121, 89775, -129373, -486926, 33287, -223833, -166375, -218922, -296064, 372879, 56354, -495074, 77703, -208627, -96229, -290824, -25903, -4407, -119671, -287331, -279718, 138236, 37623, -40547, 250791, -250926, 205873, 66270, 45634, -62035, -40493, -77956, -78484, -155563, -131392, -179919, 186560, 168817, 737, -115561, 51982, 45473, 139797, -265056, -164408, -36075, 78372, -294495, -65313, 240562, 154782, -117164]
18717b26171H9810J77132a70061a3255Q76C5405Q4338M7744J07475b04236a503
18705A70704O3475D5075f0733D0510g5308j83583A2610a60300J8110k39468g4957
18693C55630a44836A74079b4247n8356A3767e791D4570a11436q0055f9503C0083
18681d4005k5885o0945A66368a73674D4542M2099a17440k3674r9603M7695c2017
18669b60113Q4482b9443j45959j02913L2925h3404j88388Q4408g6846j41117O8051
18658a49912J5620d846q2850A43453D3054a57673b945B17520A6407b6800B12196
18646a04813j09139A98574C2534e2488j39110g0212A87402p3316b24796f3571
18635c07395a48009c715j58745d406k91532F7437g7509l7955c3235D5798A9861
$$ y = [-226171, 89810, 266942, -170061, -13255, -12379, 35405, 119743, 167487, 274962, -204236, -1503, 170704, 234179, 45075, -60733, 40510, -75308, -258891, 12610, -160300, -142190, -381658, -74957, 355630, -144836, 174079, -24247, -82603, 13767, -5791, 44570, -111436, -191491, -69503, 30083, -44005, -69890, -130835, 166368, -173674, 44542, 86641, -117440, -141114, -240717, -193022, -32017, -260113, -175631, -29443, -175402, -278315, -245390, -83404, -271792, -187384, -76846, -217963, -149912, -134292, -4846, -87696, 143453, 43054, -157673, -2945, 217520, 16407, -26800, 212196, -104813, -213952, 198574, 32534, -52488, -191598, -70212, 187402, 114086, -224796, -63571, -307395, -148009, -3715, -162460, -4406, -295938, 67437, -77509, -115464, -33235, 45798, 19861]
18623a3285o8942j10574P1422j3630L3397G3759b11670A1801M0975K28009b3813
18611c05604M5132b7199I011f0644A35589h6617j71471A1871J92245a62007b5615
18599b40212i7604B32363a4005l3144G0094k9047a86985c1956A77375M5858g2572
18587C56034e8049l0078j40486Q9272j70841N0202c4128A50039a80946p9604M50
18576b60100a19653A8948b40266N0330B36254a51491P1326F9973C0282g4362l57831
18565d32193D647f2506B17597m2033Q9836e56674i6949a9874j07064E7201b3109
18553A138e1210k46456i2474j83543a22960H966g5230E6093K96932a54256L4890
18542a19366B8538R181c8348C12761j19767a61292n7689K4304d8221B52294a57388
$$ y = [-13285, -82227, -192801, -121379, -135009, -101612, 73759, -211670, 11801, 52776, 280785, -23813, -305604, -260472, -27199, 9011, -60644, 135589, -86617, -258088, 11871, 204116, -162007, -25615, -240212, -97604, 232363, -14005, -47149, 70094, 41047, -186985, -31956, 177375, 223233, -72572, 356034, -58049, -88127, -228613, -139341, -310182, -259980, -34128, 150039, -180946, -260550, -260100, -119653, 18948, -240266, -189936, 236254, -151491, -80165, 69973, 30282, -74362, -432193, 4647, -62506, 217597, 175564, 265400, -556674, -96949, -19874, -126938, 57201, -23109, 1138, -51210, -297666, -92474, -276017, -122960, 8966, -75230, 56093, 353025, -154256, -119366, 28538, 37719, -38348, 312761, 192994, -161292, -218981, -194677, -48221, 252294, -157388]
18530b13544a03021r2430h3030C0217a3813j50592L5099c1270G7542j6668J14980
18519A75854a84607A66530a33202B5855N3239k1897P3337m1677a10405l8385g0137
18507c31170a22631j11630i4090A29621d5383j58328G5315b34721A0295b89381
18496c23202B21774c924k37183A30675E94a06703A99687D5475j5373b40129F7071
18484a14972j01104j23849c1548m2144l0969J094m08941f5283H2063a60920b2614
18472a64739n0035D1004J508e1459j31472L7545C6170h4781k0043j22263f3655
18460A16742b89270a17548C70004E016M401J30313J67899b47461L0499C75370
18449e6896m5910d5084k86583h8702B71602d11495A31080c09339C132J07008a34766
$$ y = [-213544, -103021, -195451, -83030, 30217, -13813, -164405, -129306, -31270, 77542, 60874, 175854, -184607, 166530, -133202, 25855, 79094, 57197, 130534, 88857, -110405, -148790, -70137, -331170, -122631, -234261, -94090, 129621, -45383, -203711, 75315, -234721, 10295, -289381, -323202, 221774, -3924, -241107, 130675, 594, -106703, 199687, 45475, 30102, -240129, 67071, -114972, -216076, -339925, -31548, -73692, -104661, -103567, -512508, -65283, 82063, -160920, -22614, -164739, -214774, 41004, 42512, -51459, -182931, -145386, 36170, -84781, -104824, -227087, -63655, 116742, -289270, -117548, 370004, 5016, 9417, 139730, 307629, -247461, -216962, 375370, -56896, -102806, -45084, -331667, -88702, 271602, -411495, 131080, -309339, 3132, 110140, -134766]
18437e2827A42253h3393o6619E4555a67306k52627I3688i9974A84747n1835b7361
18425a7282b19A57190l3930E1006J03328o0891a35249e930A64139a47657A80485
18413B86247i6319A0810K9298Q154c30914A87064a16696j5467B34595j06777a85112
18401A83319C4443K37115n4496o7236a30315D981c1743j80728g387A50793c0534
18389A59708K43821E4720d5421n5934d477B96971a37955G5973c02275B00983r2018
18378A08965a36305A72798a1952p8914q3567j9468A26792d31875K14101G4601
18367c72990a61387A87066J24886e0197A06712J11337b6100k89065J9150a29470
18356a32941N2584A98435n3121c00997A07772J71670C1654b53955a9854B45977
$$ y = [-52827, 142253, -83393, -150012, 54555, -167306, -419933, 93688, -99974, 184747, 132912, -27361, -17282, -219, 157190, 123260, 51006, 154334, 93443, -135249, -5930, 164139, -147657, 180485, 286247, -96319, 10810, 40108, 48262, -330914, 187064, -116696, -132163, 234595, 127818, -185112, 183319, 34443, 271558, 217062, 149826, -130315, 4981, -31743, -212471, -7387, 150793, -30534, 159708, 403529, 54720, -45421, -101355, -4477, 296971, -137955, 75973, -302275, 200983, 108965, -136305, 172798, -11952, -90866, -174433, -193901, 126792, -431875, -217774, 74601, -372990, -161387, 187066, 311952, -50197, 106712, 218049, -26100, -315165, -296015, -129470, -132941, -80357, 198435, 145314, -300997, 107772, 279442, 31654, -253955, -19854, 245977]
18345h4150D6902O8868b34907d1457j32582P1569G8910f1839k80732A2570M0865
18334E3435J86598j03023a22837C979O3443M2735f585k34255D6456j5203C408
18322b33020A5284c76928e9976j86785J04064A54926p2194c0881A06176d65805
18311b78128C1378a76500j80997I2455R2193L1887a80002G9628b05700P6868N0292
18300g8540B16002a09891l2562K5646j18958h6839A95613f3134I4922a73568A32211
18288A34006D2078b48726I1233b72332K8332J17060E6363a30188I2473k9338a00975
18276B2844P0245c65671C3264R8201a45417k5925C1165a07254j00752A81059b1247
18264A10985l2353J11246E9318J28109b08302D02145a35868J8054B69196d9051
$$ y = [-84150, 46902, 115770, -234907, -41457, -174039, -102470, 78910, -61839, -342571, 12570, 53435, 240033, 137010, -122837, 3979, 67422, 110157, -6585, -240840, 46456, 31253, 3408, -233020, 15284, -376928, -59976, -246761, -142697, 154926, 82732, -30881, 106176, -465805, -278128, 31378, -176500, -357497, 92455, 184648, 216535, -180002, 79628, -205700, -128832, -78540, 216002, -109891, -142453, -116807, -235765, -86839, 195613, -63134, 94922, -173568, 132211, 134006, 42078, -248726, 91233, -272332, -244000, -126940, 56363, -130188, 92473, 63135, -100975, 22844, 93089, -365671, 33264, 131465, -145417, -171342, 31165, -107254, -208006, 181059, -21247, 110985, 78632, 189878, 59318, 187427, -208302, 402145, -135868, -117814, 269196, -49051]
18253a38769B3452a60088A66140c09744i0573B8917a4547E0555A2909K44431d8710
18241C5236K87731a61190b9584j52824g3568A88576P832C7530g8804l12926G8887
18229e9047G0333R3980G6644e2059R305C1298J9843a09882b1472j53500k18390
18218c93362a62428a0524j62444r514E5833J37999b00804O7213j89242i5545E0581
18206b5307j02336r328f1282A46785e2873m7001P683j18059A32516i8898j4096
18195a12994D5711b08729i7198j30421E4445K3465N029F507i5418G8265A0655
18183a17178k10070J23981D4682i6627c4426k33812c8167E8541n504b4605G3448
18171a71653B2631b4244k55474a26778A33852b87984j0394R6643Q4982M8181I258
$$ y = [-138769, 23452, -160088, 166140, -309744, -90573, 28917, -14547, 50555, 12909, 257340, -48710, 35236, 322967, -161190, -29584, -182408, -73568, 188576, 196408, 37530, -78804, -391730, 78887, -59047, 70333, 164313, 76644, -52059, -42754, 31298, 51141, -109882, -21472, -174972, -393362, -162428, -10524, -172968, -182482, 55833, 193832, -200804, -133591, -322833, -95545, 50581, -25307, -127643, -136971, -61282, 146785, -52873, -99874, -92191, -210250, 132516, -98898, -112994, 45711, -208729, -97198, -227619, 54445, 77910, 82939, 6507, -95418, 78265, 10655, -117178, -327248, -203267, 44682, -96627, -34426, -268238, -38167, 58541, 53037, -24605, 73448, -171653, 22631, -24244, -279718, -126778, 133852, -287984, -298378, -201735, -116753, -68572, 9258]
18159A08316a20408l7422M4674j6507A52420O573M2414L31744B4639J34313c5128
18147i2593a3461e515C02686d1504E0957b38241J1376f3415k76905a68721D1804
18135A82847B6035b93707O0385N8755A07381g0922B64042j06801b3004j55772
18125a78776M3500l7326L8928A20318K0716l4486J01471j5713A9435b12091J705
18114b10386f4883j80194G801b95486J11888G7793K9999a39668A83182o7031A5847
18102f2895G128J11590d43688h1807c9658l4574q0872N5224r302C9440M6183q190
18090G7433k6718d92970B49215a172l69948B29019c8058A1339e3580p386G5315
18078A7636a6043D1462N8754N7312O290h1565l59393J46787b2678o8985k05470
$$ y = [108316, -120408, -157830, -113156, -129663, 152420, 158993, 201407, 533151, 24639, 158952, -35128, -92593, -13461, -5515, 302686, -41504, 50957, -238241, -226865, -63415, -340320, -168721, 41804, 182847, 26035, -293707, -233322, -174567, 107381, -70922, 264042, 157241, -23004, -178776, -135276, -172602, -133674, 120318, 141034, 106548, 208019, 192306, 19435, -212091, -210386, -64883, -245077, 7801, -295486, -183598, 77793, 107792, -139668, 183182, 116151, 15847, -62895, 7128, 118718, -443688, -81807, -39658, -74232, -155104, -99880, -109182, 39440, 85623, 77433, 50715, -492970, 249215, -1172, -371120, 229019, -38058, 11339, -53580, -60966, 75315, 17636, -16043, 41462, 100216, 157528, 163818, -81565, -440958, -294171, -22678, -91663, -297133]
18067b97133C04918B5093L4024k3640P9171P6442b33633a2479D7306d2564j85
18056d2749A27613J8390D5688J72862a23586B26866J15737q507A24655b97805
18045a30492A4173c50304J68902A99060b61476f6543B98274C7983e0508C04287
18034c15148A42533K1371b31665M3915D8437b54258M8860A46022a73483m7463
18024b20946c115k33195D5396K2868c6724j18667j25010l5520J56372j09988H8351
18012I2067J3068Q31b20107I0974e0150j94236F8848h9472k0859l162j12333j10569
18000c36395a42831B11188r6840h5339A20749b50496a222k69841B4522i6429j01418
17989a97847L619H5808K35611h040A19998D6332O9469n3458c26443F1440b08847
$$ y = [-297133, 304918, 25093, 59117, 35477, 114648, 191090, -233633, -12479, 47306, -42564, -42749, 127613, 146003, 45688, 218550, -123586, 226866, 342603, 334096, 124655, -297805, -130492, 14173, -350304, -181402, 199060, -261476, -66543, 298274, 37983, -50508, 304287, -315148, 142533, 163904, -231665, -187750, 48437, -254258, -205398, 146022, -173483, -220946, -3115, -236310, 45396, 68264, -36724, -155391, -280401, -315921, -159549, -269537, 88351, 92067, 105135, 105966, -220107, 90974, -50150, -244386, 68848, -89472, -110331, -113493, -225826, -336395, -142831, 211188, 114348, -85339, 120749, -250496, -1222, -271063, 24522, -96429, -197847, -194228, 85808, 321419, -8040, 119998, 46332, 115801, 62343, -326443, 61440, -208847]
17977A6452c07773d612q8934A10515A4919a2129A69862L691G3228b95697B45109
17965b03022A7335C913d8222A05192a46544B0517M0628a72831O7990A30355c8191
17953B1152i2585E63475E8355J80194b49514E4689L3767c5386B3833h2850A34200
17941H47P0628J09220m2017j5229m3163P0739e801A56300a58497g1545q635J1846
17929f8334q6729o6703a3708D48596B00223A9331J36301g0521a1436A6184J87062
17918B03246a12657b4656F672J7926R7989g6881l92195D00613E7482J02292a10792
17906A46456N5724A8837h628n2343j00381c5398B62469d1441c288A63549n5142
17895A08407J31813r7684a95932N0462J869A48997a83658j04544J32916a1955
$$ y = [16452, -307773, -4612, -93546, 110515, 14919, -12129, 169862, 173553, 73228, -295697, 245109, -203022, 17335, 3913, -48222, 105192, -146544, 20517, 61145, -172831, -104841, 130355, -38191, 21152, -92585, 563475, 58355, 238549, -249514, 54689, 88456, -35386, 23833, -82850, 134200, 847, 71475, 180695, 138678, 123449, 80286, 151025, -5801, 156300, -158497, -71545, -80180, -68334, -155063, -221766, -13708, 448596, 200223, 19331, 155632, -70521, -11436, 16184, 203246, -112657, -24656, 6672, 24598, 122587, -76881, -469076, 400613, 57482, 159774, -110792, 146456, 202180, 18837, -8628, -60971, -161352, -35398, 262469, -41441, -3288, 163549, 108407, 240220, 142536, -195932, -145470, -143601, 148997, -183658, -288202, -155286, -11955]
17884a20417A39547b0384C593B2a66903g8286B1529a5166A88881J80102a79011
17872B11348M9327A5733J30129a91390N9137j2223O9571A91564m3861h1879G9947
17860f4780H045J12J89124j6694A9741h2909j20231e3574A68559a79520O6570
17849a12950A71936d7977B81642b22793B66664i782m5550q2818A02609c6763n7090
17838i3853I8478c8951A1958d9655B57410j18193e2203A54605l9572R3194E6440
17826a98868d2828n9301k82420A22438a10071B66044A13438m2186B7372J11649
17816A39021d867j10412A12897Q4545q1088a47638k0440A10332e764B22751N2632
17805B75383n822A18208d73513C6862A5504K52701B6241R6321b3118j4721j15959
$$ y = [-120417, 139547, -20384, 3593, 22, -166903, -78286, 21529, -15166, 188881, 368983, -179011, 211348, 260675, 15733, 145862, -191390, -132253, -144476, -74905, 191564, 147703, -81879, 79947, -64780, 8045, 8157, 197281, 180587, 19741, -82909, -203140, -53574, 168559, -179520, -112950, 171936, -47977, 281642, -222793, 266664, -9782, -55332, -138150, 102609, -36763, -93853, 98478, -38951, 11958, -49655, 257410, 139217, -52203, 154605, 115033, 208227, 56440, -198868, -42828, -102129, -384549, 122438, -110071, 266044, 113438, 71252, 27372, 139021, -4867, -115279, 112897, 197442, 116354, -147638, -168078, 110332, -5764, 222751, 275383, 269561, 118208, -473513, 36862, 15504, 268205, 26241, 122562, -23118, -37839, -153798]
17794a53798p7089m864H1790i4008j82223B29763G3662h0501l9737j86691L1085
17783b75844a17606H8413J9444D9437Q5245a61248C406i8104d8459G9562J84308
17772B63870a71025d558q073k0250q5453C6072a75369A96148b55091A27814m9420
17761G8394k7343K03445E3206b81072A35926C4407d0275A44447a61369B2628J48458
17750A71086k6155A244b13190D01968b17106P9369A27685J33008j5582c67618
17739b06510K9433o5865F7532a21182m0441r5394F8118J06473e909C54946H4670
17727h9492C2291a92409B10028a07656A64799c0752l0891A05572i9600j10518
17717b10118A61270a02646M0055j30986G4759L1246N2334h122m4390j25001G1216
$$ y = [-153798, -230887, -235751, 81790, -94008, -276231, 229763, 73662, -80501, -120238, -306929, -275844, -117606, 88413, 107857, 49437, 134682, -161248, 3406, -98104, -48459, 79562, 263870, -171025, -4558, -12631, -32881, -118334, 36072, -175369, 196148, -255091, 127814, 78394, 51051, 254496, 53206, -281072, 135926, 34407, -40275, 144447, -161369, 22628, 171086, 144931, 1244, -213190, 401968, -217106, -137737, 127685, 260693, 245111, -367618, -206510, -177077, -242942, 67532, -121182, -161623, -257017, 68118, 174591, -5909, 354946, 84670, -89492, 32291, -192409, 210028, -107656, 164799, -30752, -61643, 105572, -99600, -210118, 161270, -102646, -62591, -193577, 74759, 106005, 158339, -8122, -52512, -177513, 71216]
17705B45208A00812a03409M3265A06453L4711a53433c5470q4445b6199a0236A59211
17693B47921a32472f6192J9032j2494H3975M8926d20365d5063j70336a9170D4060
17681b7843A6294N7773M9382d3803B27364k8476N3610a85234A9071L27287j51634
17670A94724r4464J83557p9161p3218c6047j1143k18283B70139e3515A68020a0922
17658a20879A91424a40809q3402G9075f804I6997b38942C09463a09452H2630k9162
17647E3468i1863B43901I901a6098n4547l2414j94404j2539A05157b1835A8565
17635i4021j6099A39674J21119I3035c18649a3886A13052P1098l0658D7690J64740
17624B12430D217b0723A765i6492k65741A39290c0591C14276b8011j70979A37323
$$ y = [245208, 100812, -103409, -60144, 106453, 141164, -153433, -35470, -119915, -26199, -10236, 159211, 247921, -132472, -66192, -47160, -59654, 83975, 132901, -420365, -45063, -215399, -19170, 44060, -27843, 16294, 74067, 123449, -43803, 227364, 198888, 252498, -185234, 19071, 346358, 194724, 100260, 283817, 204656, 131438, -36047, -47190, -265473, 270139, -53515, 168020, -10922, -120879, 191424, -140809, -224211, 79075, -6804, 96997, -238942, 309463, -109452, 82630, 53468, -91863, 243901, 9901, -16098, -70645, -103059, -297463, -310002, 105157, -21835, 18565, -94021, -110120, 139674, 260793, 93035, -318649, -13886, 113052, 184150, 153492, 47690, 212430, 4217, -20723, 1765, -96492, -362233, 139290, -30591, 314276, -28011, -198990, 137323]
17612a32865d0592D1551K66557N5759A31228J14698K3549h8115o9263C6518N3850
17601I0368J38076o2600O8449a76954a374A43671M6503F8515L2777O1443Q6356
17590B49091a94674Q7543n221C1460Q8191g8090k19166a39934e2620I1141a33415
17578b16924j4250A15616g5758A75027h998A22598A6388J15560P6854P4631C7275
17566B2527J05110c04917R5511A0107b71948B4372a79649b6535A58324j8748n9215
17555H0361J36756h7111p319l0629k9534B33534d4981J1041F0812K72201q2209
17544B50804q5757L05092a80276I9384j5366K3975b238A70909f6661A05989R5773
17533B01762l1301K50930I8754M451J09072J03455G5196R3836d1997k99381A82610
$$ y = [-132865, -40592, 41551, 308108, 363867, 131228, 245926, 269475, -88115, -157378, 36518, 90368, 228444, 165844, 234293, -176954, -1374, 143671, 190174, 68515, 101292, 162735, 249091, -194674, -107131, -112352, 31460, 119651, -78090, -297256, -139934, -52620, 91141, -133415, -216924, -231174, 115616, -75758, 175027, -8998, 122598, 16388, 131948, 208802, 283433, 37275, 22527, 127637, -304917, -209406, 10107, -271948, 24372, -179649, -26535, 158324, 139576, 80361, 217117, -87111, -94430, -125059, -154593, 233534, -44981, -33940, 60812, 333013, 250804, 165047, 470139, -180276, 99384, 84018, 107993, -2238, 170909, -66661, 105989, 201762, 170461, 421391, 98754, 103205, 212277, 315732, 75196, 169032, -41997, -341378, 182610]
17521B51968K7641n2439F086b111j59860A84824D5429g9267C04218C4800a60200
17509D3585J58492b82944B04725k5793a18660D3144e7291k04424P3158B28236
17498i9609o107A18374O8092o1720N3414b65992A89510a13457B18114c86647A9830
17486e7238G6469P3987f3481I2670C9724J33602B2105J16926a40417A16453K54552
17475C71005A6461Q8828R0221D4738K47970a4087A20991E5843K7957l7892J2229
17464E8137N3182A5942O1638a65731g0315A78166p2962J93118A03275J05055A307
17452b4495k9179p8397D33433a04762a1466I0098a8523j30947f5484C65278D9368
17440E8578L35849r7529K01883j98103J1143L2723j24271b1483B60215q9309K80318
$$ y = [251968, 279609, 227170, 6086, -2111, -161971, 184824, 45429, -79267, 304218, 34800, -160200, 43585, 202077, -282944, 204725, 178932, -118660, 43144, -57291, -261715, -188557, 228236, -99609, -105716, 118374, 186466, 124746, 178160, -265992, 189510, -113457, 218114, -386647, 19830, -57238, 76469, 150456, -63481, 92670, 39724, 173326, 22105, 139031, -140417, 116453, 371005, 16461, 105289, 195510, 44738, 292708, -14087, 120991, 55843, 83800, 45908, 58137, 111319, 15942, 77580, -165731, -70315, 178166, 105204, 298322, 103275, 208330, 1307, -24495, -53674, -132071, 433433, -104762, -11466, 90098, -18523, -149470, -65484, 365278, 49368, 58578, 394427, 296898, 498781, 300678, 311821, 344544, 220273, -21483, 260215, 170906, 451224]
17429D51224B19967M1193c0544A69452h003G0481d0486A08341K29242R7696J0235
17418D45514l1510r1185D1409j950M12521B03679J03863a48598C22790m4352J11470
17407C89908j13227L27819A9566N11749B27104J37954j20904l4361J56355J37093
17397E03241E2208K4672P1652j6840j5118K06230b6133C55541j71935a02554A63715
17385A16374L08565c6465C26540L4226m1684A29960J03612a26231B55912A13406
17374A63996o0062A4615a11811C7102f9084A81745J87460j09949d68535C79293
17363A43720F8987i8436B18904L8082r5362F8410L88518H765M5843P9008M03779
17352E37395A6057J82297G2006a18407D18324j16734q9620a82729P3059c5961
$$ y = [451224, 219967, 261160, -30544, 169452, -8003, 70481, -40486, 108341, 337583, 435279, 445514, 414004, 322819, 41409, 39459, 451980, 203679, 307542, -148598, 322790, 278438, 389908, 276681, 604500, 19566, 531315, 227104, 365058, 244154, 209793, 366148, 503241, 52208, 76880, 148532, 131692, 116574, 322804, -26133, 355541, 183606, -102554, 163715, 116374, 424939, -36465, 326540, 360766, 319082, 129960, 233572, -126231, 255912, 113406, 163996, 103934, 14615, -111811, 37102, -69084, 181745, 369205, 259256, -468535, 379293, 143720, 68987, -98436, 218904, 256986, 161624, 68410, 456928, 8765, 54608, 133616, 537395, 16057, 198354, 72006, -118407, 418324, 301590, 211970, -182729, -109670, -35961]
17341B21704l7774Q7749a72337g0557K6619A13725J3830e3005D8369a71842r0266
17330b62108a05569D90473a39970C26894F388a22152c1217a4165A07742b50728
17319C07160A52525J89407A66687J13092L3771A7810K3960L21495G6791J57033
17309B33824B7674Q254n101d7093A80839o010j6401Q1598O0687J95281B11635
17297G5724a62650B05732A01598d6620C9565L40694G226J28255b16447F3515M01375
17286D64890j95829R3531j43963Q6219Q68k4740N4986B811K64616J85752b0342
17274A89775i9442j04029C06587l9692b235A29940J53265K4459A38213g3461p5142
17263a48603D65247C8700a6704D92370g383o3643C70397C7499g3225A48195L6937
$$ y = [221704, 183930, 271679, -172337, -70557, -43938, 113725, 127555, -53005, 48369, -171842, -262108, -105569, 490473, -139970, 326894, 6388, -122152, -31217, -14165, 107742, -250728, 307160, 152525, 341932, 166687, 279779, 313550, 17810, 41770, 363265, 76791, 233824, 27674, 35928, 30827, -47093, 180839, 174829, 158428, 240026, 300713, 495994, 211635, 75724, -162650, 205732, 101598, -46620, 39565, 380259, 7226, 135481, -216447, 63515, 464890, 269061, 362592, 218629, 304848, 305716, 280976, 335962, 2811, 267427, 453179, -20342, 189775, -99442, -203471, 306587, 266895, -2235, 129940, 283205, 307664, 138213, -73461, -148603, 465247, 38700, -16704, 492370, -7383, -71026, 370397, 37499, -73225, 148195, 185132]
17252A85132l2974J75932j22944K40658A43480K0296P465J12629A01801J3092
17242A14893J29337J30347C7685J69088I5628C3063N5888L60758J34626k73774
17232C10561j50449R2961p8415L9918M96683f4907A94500a00850A92430c6920
17221I340e1435B2448O9559L83963g8409B22182J9414l8084a42004I93Q767Q407
17209A8167J66682m4142F8681C2468G559K289M7096P1271h8701A24076d2959C58351
17196A97967J04880a02264C32053I6528J12309m0250J65452f4796B63474k1747
17186B41727h9153C39402A56003J6137K18729F0125M38680I2387K33232K62940
17176E88559I0653K19799G7382k7340K33909J67524j44153G8929a596G4307J62696
$$ y = [185132, 152158, 328090, 205146, 445804, 143480, 163776, 171241, 283870, 101801, 114893, 244230, 374577, 37685, 206773, 95628, 33063, 88951, 449709, 584335, 310561, 160112, 253073, 174658, 214576, 711259, -64907, 194500, -100850, 192430, -36920, 9340, -51435, 22448, 92007, 475970, -78409, 222182, 241596, 203512, -142004, 993, 9760, 18167, 184849, 140707, 68681, 32468, 7559, 9848, 56944, 128215, -88701, 124076, -42959, 358351, 197967, 302847, -102264, 332053, 96528, 208837, 168587, 334039, -64796, 263474, 241727, -89153, 339402, 156003, 172140, 390869, 60125, 498805, 92387, 325619, 588559, 90653, 310452, 77382, 50042, 283951, 451475, 307322, 78929, -1596, 74307, 237003]
17165B37003A10705K17366K5930D0988K31258K99743A6106K34090J31390A56189
17154C91279J27924A07256K13741P0901r3538J06306b8969G7752M39436k06617
17144C10571K14952J52560k21511B02357P8029J16820j45302J87434o3080j38262
17134B37996M05392B23817K7878A22473J81455Q1899J74741k60559A19501O627
17124A26128K67752A32577N5218K92370A88084q3568N8353J9776f5841A98116
17113B39352J00708J4667J34280q2110j20067Q8334A26918L51056J97754B41192
17102A65886K36095A48725L00444A33373K99735j58507J67158Q557k3326j73640
17092B53350K77565k02775q8033K23376j78643K49935k12545K40165A64447J22205
$$ y = [237003, 110705, 328071, 354001, 40988, 272246, 571989, 16106, 250196, 381586, 156189, 391279, 519203, 107256, 320997, 391898, 298360, 404666, -28969, 77752, 517188, 310571, 525523, 678083, 456572, 202357, 280386, 397206, 251904, 439338, 376258, 237996, 643388, 223817, 251695, 122473, 303928, 385827, 560568, 300009, 119501, 126128, 393880, 132577, 187795, 480165, 188084, 104516, 162869, 182645, -65841, 198116, 239352, 340060, 354727, 489007, 406897, 286830, 375164, 126918, 477974, 675728, 241192, 165886, 401981, 148725, 449169, 133373, 433108, 274601, 441759, 450316, 426990, 253350, 530915, 328140, 240107, 463483, 284840, 534775, 322230, 562395, 164447, 286652]
17082B86652p0826K19626k6788M6581A10968J71934K68838A77745L5650K32869
17072D46264k4466A63110K73772A13427N13768k22617B01362J68761J53218j94799
17062C28542L52770C10077k1216n4792p350Q5477N8713J28058j62178K73706k96421
17051C14074J12916M5171j2656A23233M35379J48632k6757K05339C77068J63590
17041E40658J24531k60982A99660J14018J04386J11572A74377F1222L71503j76572
17031B56153M65097k01748A43099N69410C05497Q0861K81383B62843K27645L7277
17021E27765R4188k446J7127j58411j1199l5542j91430L48717J20918k15607K7504
17010E21584J48272k37699L43687l11493K74164j67150J44187l00436K62774j70177
$$ y = [286652, 215826, 435452, 408664, 455245, 110968, 282902, 551740, 177745, 213395, 446264, 421798, 163110, 436882, 113427, 627195, 404578, 201362, 370123, 523341, 328542, 681312, 310077, 288861, 234069, 226719, 312196, 370909, 498967, 336789, 610495, 314074, 426990, 472161, 459505, 123233, 558612, 707244, 680487, 885826, 377068, 540658, 665189, 404207, 199660, 313678, 418064, 529636, 174377, 61222, 432725, 256153, 721250, 519502, 143099, 712509, 305497, 386358, 667741, 262843, 490488, 527765, 621953, 619507, 636634, 478223, 467024, 431482, 240052, 588769, 709687, 494080, 521584, 669856, 432157, 775844, 464351, 738515, 571365, 715552, 415116, 677890, 507713]
17000E07713R6895L5155j35518L57365B56599K95223J63563J49084j23203k29117
16990E12149k44979L58138J86704k42635j13030M46666C50529M60833l27907R914
16980D93369K04211R8255k99880j25803K95524J68744l8204j77189N4178K55953
16970I29158n0672l07746J57760J19263p4791M6977k53893L33409k79706K91220
16960I10979K2798l38137R6892J29113J08397j91092J74829J12989R2770k44798
16950H74740k02337K00785J006N460O5720j85242j49522J15165j67564L37628
16940H95839N7902j47969k57269K28832N9807L88221m69646K71562J76910k20425
16930I83764k80496N06300j32281j9277O5367K3907K5955k39492L43803k17169
$$ y = [507713, 604608, 639763, 504245, 861610, 256599, 551822, 715385, 864469, 741266, 512149, 267170, 625308, 812012, 569377, 456347, 903013, 350529, 811362, 483455, 493369, 697580, 795835, 495955, 370152, 665676, 834420, 796216, 619027, 673205, 929158, 878486, 570740, 728500, 847763, 772972, 819949, 566056, 899465, 619759, 910979, 933777, 595640, 692532, 821645, 930042, 738950, 913779, 1026768, 1119538, 874740, 672403, 873188, 874194, 879654, 945374, 760132, 610610, 725775, 558211, 895839, 953741, 805772, 548503, 777335, 837142, 1225363, 755717, 1027279, 1204189, 983764, 703268, 1209568, 1077287, 1058010, 1123377, 1147284, 1173239, 933747, 1277550, 1060381]
16920A060381M4969J68352k46839L91020m73515R6781P2820O5664K91599n25827
16910I45405N47021k96927j49057k0102M85390k94413p0803K0718J04603K45919
16900A517754j78448j64169N5460J91067j76050J67779l25219M93937l40589L03086
16890A544608l43298L1898M9283N0072Q50278m25526j46173R498l3653N2239j95752
16879A443474P86J70665r7891l6377K49456j29257K65471p9589j08366J51814
16869A830186p1829L67271k01933k0115J13923n3459p2529j31940L78407J43875
16859B281857l92298L37361J09487J56029j21256J92614k05033K09706o3881p7914
16849B426672j34499Q2173P4291M76006n57361J84333j53137J25807L38547r5732
$$ y = [1060381, 1105350, 1273702, 1026863, 1417883, 944368, 1041149, 1113969, 1179633, 1471232, 945405, 1492426, 1195499, 1046442, 1026340, 1511730, 1217317, 1146514, 1167232, 1271835, 1517754, 1339306, 1175137, 1230597, 1421664, 1245614, 1413393, 1088174, 1582111, 1241522, 1544608, 1201310, 1233208, 1282491, 1332563, 2182841, 1757315, 1611142, 1620640, 1586987, 1639226, 1443474, 1444260, 1614925, 1517034, 1480657, 1730113, 1600856, 1866327, 1786738, 1678372, 1830186, 1758357, 2125628, 1923695, 1903580, 2017503, 1964044, 1891515, 1759575, 2137982, 2281857, 1889559, 2226920, 2336407, 2492436, 2371180, 2563794, 2358761, 2568467, 2504586, 2426672, 2292173, 2374346, 2448637, 2924643, 2367282, 2551615, 2398478, 2524285, 2862832, 2767100]
16839B767100L7370j5280J36889m80219O27727N4641l30678L93054k27021L65405
16829C328988L1215M6768k89139K75243K96657l19619K74991N4946J47926K69786
16819D117762k52789j13933N70006r3368j54514K78255j11349L86644j51775r8495
16809D376444L50193J53455j86876K19842J62248K32272K0069l87749M74294K60926
16799E675118K1783l5717k64697O94833P1216M03440k08938K55226K11492J24446
16789F948202L11800O831K44046J59659j43604J82265M41211R0483P8614M78256
16779H797763J93566J23607L71260M56702j04647L05740L05813O09240m93N09135
16769A1567686J49698K43100K41207O40351L1839Q34100P4594M69336M90975L83412
$$ y = [2767100, 2804470, 2789190, 2926079, 2445860, 3073587, 3128228, 2797550, 3190604, 2963583, 3328988, 3360203, 3406971, 3117832, 3393075, 3689732, 3370113, 3645104, 3700050, 3847976, 4117762, 3864973, 3751040, 4321046, 4227678, 4073164, 4351419, 4240070, 4626714, 4474939, 4376444, 4726637, 4880092, 4693216, 4913058, 5075306, 5307578, 5327647, 4939898, 5414192, 5675118, 5696901, 5661184, 5396487, 6091320, 6162536, 6565976, 6357038, 6612264, 6823756, 6948202, 7260002, 7266833, 7510879, 7670538, 7526934, 7709199, 8150410, 8240893, 8319507, 8797763, 8991329, 9114936, 9486196, 9942898, 9838251, 10143991, 10449804, 11059044, 11058551, 11567686, 11717384, 11960484, 12201691, 12842042, 12873881, 13707981, 13782575, 14251911, 14742886, 15126298]
16759A5126298P12600M73969J005280l8586Q64069P21528J55667J456246K46105
16750B0723176R84335R42595N98776J156927Q23661R94057J159196J313159J144545
16741B9840427J144183J779829J374014J993717J564401J595191K160600K140067
16733D3592429K247194K227091K457015K926245L153908L185233L405418L918024
16725F7112557L735642M430902M700223N075529M891360O249078N976286O829448
16717A09001025O432035P440776P380849P755754P940642P934642Q148865P701514
16709A69736102O845012P187160O256733N053077L887139K715969J403144l05773
16701B02778563j580862l073027m396667n259018o458130o669079q170364p506340
$$ y = [15126298, 15838898, 16312867, 17318147, 17279561, 18143630, 18865158, 19020825, 20477071, 20723176, 21707511, 22650106, 23248882, 24405809, 25229470, 26223527, 27382723, 28695882, 29840427, 30984610, 32764439, 34138453, 36132170, 37696571, 39291762, 41452362, 43592429, 45839623, 48066714, 50523729, 53449974, 56603882, 59789115, 63194533, 67112557, 70848199, 75279101, 79979324, 85054853, 89946213, 96195291, 102171577, 109001025, 115433060, 122873836, 130254685, 138010439, 145951081, 153885723, 162034588, 169736102, 176581114, 183768274, 190025007, 195078084, 198965223, 201681192, 203084336, 202778563, 201197701, 198124674, 193728007, 188468989, 182010859, 175341780, 167171416, 159665076]
16693A59665076p962103q148880q056352p458135p862810p185168o619326o529391
16685I9842911o247239n641831n460693n147414m609013m253987m143923l810767
16677F0528044l888315l076302l211712k478125k637654k785904k211546j784378
16669C8454108k393661j550789j745483j634150j310721j464661j637359j141916
16661B5575368j062829j223730q59787j107650j061792o28262o91976o83889p67000
16652A7488453n02299l14067n09955q35783n71202p68154j63340o76747o41339
16643A2505567o63448K69140o95384k46002o33774k8744j26176j91182m64783
16634I725214n67832j43029k35174n22997m28727K45219m68982r708k8534m35355
$$ y = [159665076, 151702973, 143554093, 135497741, 128039606, 120176796, 112991628, 106372302, 99842911, 93595672, 87953841, 82493148, 77345734, 72736721, 68482734, 64338811, 60528044, 56639729, 53563427, 50351715, 47873590, 45235936, 42450032, 40238486, 38454108, 36060447, 34509658, 32764175, 31130025, 29819304, 28354643, 26717284, 25575368, 24512539, 23288809, 22429022, 21321372, 20259580, 19631318, 18939342, 18255453, 17488453, 16986154, 16672087, 16162132, 15326349, 14755147, 13986993, 13823653, 13146906, 12505567, 11842119, 12111259, 11415875, 11169873, 10536099, 10507355, 10381179, 10189997, 9725214, 9157382, 9014353, 8779179, 8256182, 7827455, 8072674, 7603692, 7593984, 7565450, 7130095]
16624G130095Q287l51411M7808r0339K1865o95070K5741k66684j93516K27111
16614E863887J27062m26888k56621r8399k24301k81130K21647n04891J64509l15371
16604D269504J58141r2357j33320l88573K91825k96775j16755J42789l18695J4620
16594C530404j06469K10738k09308j57982L3698J78377m4308l46930l742q6465
16584B998013l2194L5109J89052l12602k353P9626j85488m1586j93700K14236
16574B748113k80835K34800k18385j56906J37556l37623K80669m6058j93655Q474
16564B176150L23509j49603n26163K64290J51034l50248K37218j06130J15242
16555B135299m40186K31462J60311j85241M8345R3105J31453o09223o2038K73550
$$ y = [7130095, 7138382, 6786971, 6834779, 6744440, 6766305, 6071235, 6096976, 5830292, 5636776, 5863887, 5990949, 5564061, 5307440, 5209041, 4984740, 4703610, 4925257, 4420366, 4584875, 4269504, 4427645, 4335288, 4201968, 3813395, 4105220, 3808445, 3691690, 3834479, 3515784, 3530404, 3423935, 3634673, 3425365, 3267383, 3301081, 3479458, 3435150, 3088220, 3084478, 2998013, 2965819, 3000928, 3189980, 2877378, 2875025, 2954651, 2769163, 2727577, 2533877, 2748113, 2467278, 2702078, 2483693, 2326787, 2464343, 2126720, 2407389, 2361331, 2167676, 2176150, 2499659, 2350056, 1823893, 2088183, 2239217, 1888969, 2126187, 2020057, 2135299, 1695113, 1926575, 2086886, 1901645, 1949990, 2043095, 2174548, 1565325, 1503287, 1776837]
16545A776837r1991l52951N54231j54007o1244L8867k62752J65051k45314L98023
16535A764750k13676k99790L00492k96374J48797j53771Q4152j25718J90307J9899
16525A419068o8789j63039j58439O1502O4700l48471P54339n77204M77027l16862
16515A143832q6775J13335k24993K24585j74964L07077j81136k4082M4847M9404
16505A191130k33532K24968J33568n69139J90347J32063l82677K31369K25993
16496A144090k16589l2946K44886k13814l7079m6210P0309J57429j35012m9043
16486H86021O0548k17633k89985L48378k40124N05844p7568k14214j26278M11068
16476A046057l52573J83615k36080K09466M6158l11503J89582J9137P4693p0639
$$ y = [1776837, 1684846, 1331895, 1886126, 1732119, 1670875, 1709742, 1446990, 1612041, 1366727, 1764750, 1551074, 1251284, 1551776, 1255402, 1404199, 1250428, 1334580, 1208862, 1399169, 1419068, 1350279, 1187240, 1028801, 1090303, 1155003, 806532, 1560871, 983667, 1460694, 1143832, 1057057, 1170392, 945399, 1169984, 995020, 1302097, 1120961, 1096879, 1141726, 1191130, 957598, 1182566, 1316134, 746995, 937342, 1069405, 686728, 918097, 1144090, 927501, 894555, 1139441, 925627, 888548, 842338, 912647, 1070076, 935064, 886021, 946569, 728936, 438951, 787329, 547205, 1053049, 975481, 761267, 634989, 1046057, 693484, 877099, 641019, 850485, 896643, 585140, 774722, 793859, 868552, 797913]
16466G97913k73212J88290k36209K65656n0407R0024J42535C00193K96761k90762
16456C06192K15600K09052n781J44135j828l76616L18333k50665J09372k46873
16446D20921A64285N16514k20295n1588K21555k26868o1502L72584k87564J79164
16436F06285K91979p2112p2676B89300J77616j33059L68220J66277C41474J17217
16426D58691J5207j43222P9382K41270j43065F3791L83421j2680K29120K38887
16416I02539B90750j11444L1704L29316K55905B14608j05287N67848k07932O6145
16406E35382j38328j32513K890M4485n515J3149J11121l5068k9380K50915k83141
16395C33997J88114p6932A64008K04673r9909j3074j23713L1280L86271I4633
$$ y = [797913, 524701, 712991, 476782, 742438, 692031, 782055, 924590, 300193, 596954, 306192, 521792, 730844, 725063, 869198, 867370, 490754, 809087, 558422, 667794, 420921, 164285, 680799, 460504, 408916, 630471, 403603, 342101, 714685, 427121, 606285, 898264, 826152, 753476, 289300, 466916, 333857, 702077, 868354, 341474, 458691, 473898, 330676, 410058, 651328, 508263, 63791, 447212, 434532, 663652, 902539, 290750, 179306, 211010, 540326, 796231, 214608, 109321, 677169, 469237, 535382, 397054, 264541, 267431, 311916, 306401, 319550, 430671, 395603, 366223, 617138, 333997, 522111, 445179, 164008, 368681, 268772, 255698, 131985, 163265, 549536, 94633]
16384A35821M01217B19568a22126D79587A63635K10830j25269L22331k63582K96829
16374F04774j0035j99750p0402J41141j85107K01593B29213j494M98140A53850
16363D87595M3192B00782K43475A27816J43709J51936M0995Q3230k46391J30955
16353D32250a57590C04526a24447c1133D32493G5979M42281j04384j93853O9300
16343B89323H5388K52072M4880j17299h5711B62453p6689J8812F4321L94704k06698
16332B52327d6893B27598m236K87668f3306J3306D97745B37348N0604J01579K7784
16321D17315k222a36515b227G980M85442b8285D01479A87364K16333P8297j0834
16310D71160B7403J37632Q8242A24367K66465A27040a45417B05445M0465m6023
$$ y = [135821, 537038, 219568, -122126, 479587, 163635, 374465, 249196, 571527, 307945, 604774, 594739, 394989, 324587, 465728, 280621, 482214, 229213, 227719, 725859, 153850, 487595, 530787, 200782, 444257, 127816, 271525, 423461, 464456, 547686, 301295, 432250, -157590, 304526, -124447, -31133, 432493, 75979, 518260, 413876, 220023, 289323, 85388, 337460, 382340, 265041, -85711, 262453, 185764, 204576, 64321, 459025, 252327, -46893, 227598, 223362, 511030, -63306, -50000, 497745, 237348, 287952, 389531, 417315, 415093, -136515, -2227, 7980, 493422, -28285, 401479, 187364, 403697, 481994, 471160, 27403, 165035, 253277, 124367, 390832, 127040, -145417, 205445, 245910, 199887]
16300A99887L19724B16158E4971J62175A899L19099C6647J07996j8797O5090I2134
16288a81738B50417a43243D89942B20775C1014K16168k3909a6997C6143a36289
16277b4692B35275r0952F5304b24686D48356n4982j37676Q6623b81214B06844
16266A13757Q567j1670l6977c36721C88088g9630A15417J22100H9724J02760L8731
16255B31215d3589B08751o0525J09633F9912J72218C0634K02826C1862J76322
16245B08184l6176n2072m5968a12143k02924D1973K75930A8689J70367b0002B49215
16233A58869G5680J49225j5512C0636g8719A26222n9545Q2914J8382Q6399A4451
16221d4524F6769A3555J46128R4995c58232h8296j25161B71172p8194k162P6276
$$ y = [199887, 519611, 216158, 54971, 217146, 1899, 320998, 36647, 144643, 125846, 190936, 92134, -181738, 250417, -143243, 489942, 220775, 31014, 247182, 223273, -16997, 36143, -136289, -24692, 235275, 144323, 65304, -224686, 448356, 393374, 255698, 342321, -281214, 206844, 113757, 122324, 110654, 73677, -336721, 388088, -79630, 115417, 237517, 89724, 192484, 231215, -43589, 208751, 148226, 257859, 69912, 242130, 30634, 233460, 31862, 208184, 172008, 119936, 73968, -112143, -315067, 41973, 317903, 18689, 189056, -20002, 249215, 158869, 75680, 224905, 209393, 30636, -78719, 126222, 66677, 149591, 167973, 254372, 14451, -44524, 66769, 13555, 159683, 254678, -358232, -88296, -213457, 271172, 192978, 190816, 267092]
16210B67092b7684G6789c0944A92228d6293i204A06755P6206a69601A39412c4429
16198B72529j13513a795B5274m299K28634a89081B80775e60j5405j64046C2859
16186g4272L578A2813b1868E72138F2240R3817d5592F7485h0226D03233j37573
16175B65660a00934B74891C5727M9544k2812j5587b9682M104M635A0643P0085
16164H0728K18894j23302a35218J04j84029A39108a28977G0592J95195j29618
16154A36169J7656K25106e9291A15748M1160p1228b14100B48588m8071d6744n4535
16143a01279c1504A48248o2532P509a37670D7334j3075J76413K46300g1084B13466
16131e4678j52630o302g9654H7807C6651Q6115J49060E1633K49936b5483q1241
$$ y = [267092, -27684, 76789, -30944, 192228, -46293, -9204, 106755, 182961, -169601, 139412, -34429, 272529, 159016, -1795, 25274, 20975, 249609, -189081, 280775, -560, -15965, -180011, 32859, -74272, -70694, 12813, -21868, 572138, 62240, 156057, -45592, 67485, -80226, 403233, 265660, -100934, 274891, 35727, 85271, 62459, 46872, -29682, -25578, -20943, 10643, 80728, 299622, 176320, -135218, -135114, -319143, 139108, -128977, 70592, 265787, 136169, 153825, 378931, -59291, 115748, 156908, 85680, -214100, 248588, 200517, -46744, -101279, -31504, 148248, 85716, 93225, -137670, 47334, 34259, 210672, 456972, -71084, 213466, -54678, -207308, -213610, -79654, 87807, 36651, 122766, 271826, 51633, 301569, -25483, -106724]
16120a06724B03727G8551k0897d8514C03473b14330R3106H3073f7991I9452K7061
16109A26513P6364b13568A17734b53093A80107n1368O149O0189J52124a32706
16098b56475a14632b528j10646j44116D91670h1706E9119Q4352k9052a05589E4869
16086B9501K65460A06753K17906D8463J03911b51353a06622A20831e897C416d6911
16074B5487k097b39401K8722d8223k74529J14535D2334K95702I2807K06446A5013
16062B09169E588L69449c6255B2381a2814q377j16518j0291O8486J3568l2766
16051i8712L3169D9452d1018C3947Q5157D7136b9904j04758A41091J56967A27592
16039E083a38702j20456E1070f002k18879H9144d2338D5014b31845O363i9314
$$ y = [-106724, 203727, 78551, 57654, -48514, 303473, -214330, -121224, 83073, -67991, 99452, 126513, 202877, -213568, 117734, -253093, 180107, 128739, 134888, 195077, 347201, -132706, -256475, -114632, -2528, -113174, -257290, 491670, -81706, 59119, 143471, 114419, -105589, 54869, 29501, 294961, 106753, 324659, 48463, 152374, -251353, -106622, 120831, -5897, 3416, -46911, 25487, 23390, -239401, -210679, -48223, -322752, -208217, 42334, 338036, 92807, 299253, 15013, 209169, 5588, 375037, -36255, 22381, -12814, -21191, -137709, -148000, -79514, -65946, -98712, -65543, 49452, -41018, 33947, 119104, 47136, -29904, -134662, 141091, 298058, 127592, 5083, -138702, -259158, 51070, -6002, -224881, 89144, -42338, 45014, -231845, -225482, -99314]
16027h8474o0152j40456I6212d80055b14639j96523a75436j3453P7O2867B9114
16015A10565c05687d0630m4469B3461d21836a31054F0482c24320H8534b79950
16004b20317e9967k2588J0805A94076d09847J75152q3648a51141m053D3519b6866
15992e2690B4225d8805G1066J04794e1827A22946q294h2052l7429k49890B8664
15980F9833K0261d18690a88851A15760h6384A23788J49791A27841a6452A40268
15969B12568H6565K0256K6313K19707a08108J7314F7191K54959F400d9578J9252
15958c0326j39470A41948E9777a39541A10510A9190b3214j83174n8052B3837J0295
15947C4132O3363B0793d3466I9912d3986j00665d7548n9740A624d9910B27984
$$ y = [-88474, -148626, -289082, 96212, -480055, -214639, -411162, -175436, -188889, -188812, -125945, 29114, 110565, -305687, -40630, -85099, 23461, -421836, -131054, 60482, -324320, 88534, -279950, -220317, -59967, -82555, -71750, 194076, -409847, -234695, -318343, -151141, -155194, 43519, -26866, -52690, 24225, -48805, 71066, 175860, -51827, 122946, 114652, -82052, -119481, -369371, 28664, 69833, 90094, -418690, -188851, 115760, -86384, 123788, 273579, 127841, -16452, 140268, 212568, 86565, 106821, 133134, 352841, -108108, -90794, 67191, 322150, 6400, -49578, -30326, -169796, 141948, 59777, -139541, 110510, 19190, -23214, -206388, -264440, 23837, 34132, 97495, 20793, -43466, 99912, -43986, -144651, -47548, -107288, 1624, -49910, 227984]
15935a47868a5411m07807a64489k77705i6557m2641k3555r1278P0916I5848B0271
15923a44350A75473a98677L4709I7314f0405k69282J53708B6663b40897Q5240
15913a55657G0306e2519a8324H573L4690a16672A49185Q1199D3450b05989f8070
15901a29044m71892c0449j91407B52279b16395A72385a31669G9726C3015J74731
15891B07746j01749R1437f9100p350B5387J93970c92312A2156a65609C4949b41583
15879G1980Q7094a39763B42486G6490h5621A59302a84407I1347b62047O0346A45450
15867A64846e9767A09691D4750a27184A61569c4845B6105O4006O7182K0926h1231
15855b2323F2454c6219A8924N7578h165A91379h1803k32567a31176G2940b07022
$$ y = [-147868, -15411, -423218, -164489, -442194, -96557, -139198, -162753, -254031, -183115, 95848, 20271, -144350, 175473, -198677, -163968, 97314, -60405, -329687, -175979, 26663, -240897, -155657, 70306, -52519, -18324, 8573, 43263, -116672, 149185, 230384, 43450, -205989, -68070, -129044, -600936, -30449, -221856, 252279, -216395, 172385, -131669, 79726, 33015, 207746, 105997, 197434, -69100, -76450, 25387, 219357, -392312, 12156, -165609, 34949, -241583, 71980, 159074, -139763, 242486, 76490, -85621, 159302, -184407, 91347, -262047, -201701, 145450, 164846, -59767, 109691, 44750, -127184, 161569, -34845, 26105, 90111, 157293, 178219, -81231, -22323, 62454, -36219, 18924, 76502, -8165, 191379, -81803, -314370, -131176, 72940, -207022]
15843G2539a76994A19363K17132d2839n6133F0611b64632B71063i9392C5829c19184
15831b69299B062N23668a27849G741h2947j44048C40302j39551a67448C42614
15820d82700A07068j5718e1579k44943D3289c175E160a27432o2545j44279A00618
15808B8473i6265j19118N9790m790p7540J16102J0331j97588i7787j85295C15822
15796a38632l48032c6996A81079h5647k64323g5406D1764e82126b12417A86563
15785b719j09880p8186B7890i1342l12150F5054d7323o8211a6129k3313C913L41181
15773C45094j12224a26352k39476a15375D3080c33867A73652h8707A55796b46406
15762I9039N4749i4768D00383a22140r3506M6742k26047C23140F1006a66285I9512
$$ y = [72539, -176994, 119363, 336495, -42839, -98972, 60611, -264632, 271063, -99392, 35829, -319184, -269299, 2062, 525730, -127849, 7741, -82947, -226995, 340302, 200751, -167448, 342614, -482700, 107068, 91350, -51579, -296522, 43289, -3175, 5160, -127432, -189977, -334256, 100618, 28473, -96265, -215383, -155593, -160383, -237923, -121821, -111490, -309078, -97787, -283082, 315822, -138632, -486664, -36996, 181079, -85647, -349970, -75406, 41764, -582126, -212417, 186563, -2719, -112599, -190785, 27890, -91342, -403492, 65054, -47323, -115534, -16129, -39442, 3913, 345094, 232870, -126352, -365828, -115375, 43080, -333867, 173652, -88707, 155796, -246406, 99039, 153788, -94768, 400383, -122140, -215646, -168904, -394951, 323140, 61006, -166285, 99512]
15750A31364a11275A49824a09924A43042L6851a61098G195K32876a3370A51973
15739d4769A11936C7905b14911e2977l5335m8538F5541f3862B39907a58821A83763
15727C4992c21479J47047K6822p3987E708h6200a4819j45524M5196l483N8192
15716f0438C0316K1495F625b5740a0587B0030R5329b70521A63407b22606O5271
15705a57335C39890b0017m51386a29910c8388l641G3423R3604a90997P95A9979
15693b50049E2907J20059K9835m9394n3258a16796j00921D1884J8709J37103I0288
15681F5465k9529D343K05007b0017A18170d9067C49698A58899b56107i2612M2573
15670e0039j20670A19855a00709A3580J27107b207k40897C81610b14537F8214
$$ y = [131364, -111275, 149824, -109924, 143042, 179893, -161098, 7195, 240071, -13370, 151973, -44769, 111936, 37905, -214911, -52977, -88312, -136850, 65541, -63862, 239907, -158821, 183763, 34992, -321479, -174432, -147610, -221597, 5708, -86200, -14819, -160343, -115147, -118630, -60438, 30316, 51811, 6625, -25740, -10587, 20030, 115359, -270521, 163407, -222606, -157335, 339890, -20017, -471403, -129910, -38388, -42029, 73423, 167027, -190997, -190202, 19979, -250049, 52907, 172966, 202801, 153407, 100149, -116796, -217717, 41884, 60593, 197696, 90288, 65465, 35936, 4343, 209350, -20017, 118170, -49067, 349698, 158899, -256107, -92612, -50039, -170709, 119855, -100709, 13580, 140687, -2207, -243104, 381610, -214537, 68214]
15659b76946A25173a78668b2191B10962k6549f1157r5132M9559k12388J09123
15649b09995a8504j78680L5157a3348A79150K07170c35376H7594i9858k4099p7755
15638b01712B50011G4221c5890o9568c3565j24060a423B22306b06152M6804N2626
15627a06722j06130f5716F8338a23107I9443b02751j13400R7125C5959q221g5211
15615A66988E5187m812a30359a7105A45441g4317D25009F1812f1772q6791C5852
15603A29716B1620B80P7693c65907f6767G1431d1084l6257a1523n167G4785g764
15590c23264N8875P8230h2516n0072C67306j21503b01198L0522b3002j41589b1985
15578I0898N0147j3921n1957B5723M3847a30214k00200F1293J06710g6455A91583
$$ y = [-276946, 125173, -178668, -22191, 210962, 184413, -61157, -156289, -106730, -319118, -209995, -18504, -197184, -162027, -13348, 179150, 386320, -335376, 87594, -99858, -123957, -201712, 250011, 74221, -35890, -105458, -33565, -157625, -1423, 222306, -206152, -159348, -106722, -212852, -65716, 68338, -123107, 99443, -202751, -316151, -219026, 35959, 27738, -75211, 166988, 55187, 50375, -130359, -17105, 145441, -74317, 425009, 61812, -61772, -148563, 35852, 129716, 21620, 280, 77973, -365907, -66767, 71431, -41084, -77341, -11523, -16690, 74785, -7764, -323264, -264389, -186159, -82516, -132588, 367306, 245803, -201198, -170676, -23002, -164591, -21985, 90898, 141045, 127124, 75167, 25723, 69570, -130214, -330414, 61293, 168003, -76455, 191583]
15566C68942b76103D9747j7411N6560b84627d4029o7729d016A36830a33926j87576
15555c21502H6044a09990j49349q2001a05926A9431P240a11685B36053a0844j13844
15544a24688D7672a27173K3575A34765e4936p3773B8090b35179F5442f5802j81404
15533b47206g5387A18862h1284o4064J2621j82636J28738F1967h9371j6841D26905
15521I6980H83L31291H1408a96268f0943C333a04502F5036b08133Q1612A21140
15509e5071o8805E3849k1371J61377d4323B07242A3000K61515q2828C9902b37296
15497a37383A56550a30410F6964J01928h9846A18796c4557B18099k6604r338b51056
15485a04759m8858b6486A06971a26957G7173c29767a0810B14001E3179g4316I895
$$ y = [368942, -276103, 49747, 32336, 88896, -284627, -44029, -111758, -4016, 136830, -133926, -321502, 86044, -109990, -259339, -341340, -105926, 19431, 26671, -111685, 236053, -10844, -124688, 47672, -127173, -103598, 134765, -54936, -128709, 28090, -235179, 65442, -65802, -247206, -75387, 118862, -81284, -145348, -132727, -315363, -186625, 61967, -89371, -106212, 426905, 96980, 883, 332174, 81408, -196268, -60943, 3333, -104502, 65036, -208133, -126521, 121140, -55071, -123876, 53849, 32478, 193855, -44323, 207242, 13000, 274515, 191687, 39902, -237296, -137383, 156550, -130410, 66964, 168892, -89846, 118796, -34557, 218099, 191495, 182157, -251056, -104759, -153617, -26486, 106971, -126957, 77173, -329767, -10810, 214001, 53179, -74316, 9895]
15473c0164B76012O95q771a43013I4832N112K7527i8245K9885D0788a54802N3872
15461a00930H9424i8273A63374E6367J97755H9485b60654g2582B49747b38118
15450H3889b90622d4515D0349a33233C72426j56600D9832i0991d0291j57253f7132
15438B8324b09603D2281A8261l299P8425a40852B2829h0383L2990A17712a71742
15426a43568K818b3449k6332q4397o3481N5855C8628J33218a78485e8402M690
15415e3712j41999C10993j02874N4943a81938e1270P440o0181j54502G4448i8483
15403A23354a65663d0563j03396A53850p2693j6000c15386a48169q7127h0143
15392C77938a7374k91293J4956A65445J9986i4469C1986A5612a80203D34175I2422
$$ y = [-30164, 276012, 276707, 267936, -143013, 94832, 99944, 127471, -98245, -68360, 40788, -154802, -100930, 89424, -98273, 163374, 56367, 254122, 89485, -260654, -72582, 249747, -238118, 83889, -290622, -44515, 40349, -133233, 372426, 215826, 49832, -90991, -40291, -197544, -67132, 28324, -209603, 42281, 18261, 14962, 93387, -140852, 22829, -80383, -47393, 117712, -171742, -143568, -140750, -23449, -49781, -134178, -197659, -141804, 38628, 171846, -178485, -58402, -53712, -195711, 310993, 208119, 263062, -181938, -51270, -43830, -104011, -258513, 74448, -98483, 123354, -165663, -40563, -143959, 153850, 81157, 65157, -315386, -148169, -235296, -80143, 377938, -17374, -308667, -293711, 165445, 185431, -94469, 31986, 15612, -180203, 434175, 92422]
15380C24481l0688n7872j12724b00349C06241c5460j4241A14737b11126H5705
15369G0008b52031H1037a91851I5934b22494B37712b45486h9787q1124E4258b64368
15357d603A77364g0438k00859e7348I1348c01626A38908M5854a72901K2998L3410
15346a16493A50503a94477H8484J6654G388a6574k745A4978P749i383B30772Q1655
15334C12427g2943o0263F0779N3426e0199A59012P4265a14392b0763j28220A67441
15322b0929B9361J20935a38051j81613B09497a54174M1528m775c3535r9520D1856
15310A38351a13418F0659R8931d2316K406A62631r402a70888A5938g5968B00109
15298C39788r8164E1045J36520J26259a67927g1666A36191K2834b6387k17665
$$ y = [324481, 293793, 235921, 123197, -200349, 306241, -35460, -49701, 114737, -211126, 85705, 70008, -252031, 81037, -191851, 95934, -222494, 237712, -245486, -89787, -170911, 54258, -264368, -4603, 177364, -70438, -271297, -57348, 91348, -301626, 138908, 184762, -172901, -149903, -116493, 150503, -194477, 88484, 105138, 7388, -16574, -19319, 14978, 22727, -9383, 230772, 312427, -72943, -133206, 60779, 114205, -50199, 159012, 233277, -114392, -20763, -148983, 167441, -20929, 29361, 150296, -138051, -319664, 209497, -154174, -112646, -117421, -33535, -133055, 41856, 138351, -113418, 60659, 159590, -42316, -39910, 162631, 153229, -170888, 15938, -75968, 200109, 339788, 241624, 51045, 187565, 313824, -167927, -71666, 136191, 159025, -26387, -244052]
15288b44052A40396K5478n7005g751n6268K9660C01112q1649b6734A74390D0762
15276A27751B9914J18779J09425d0949A3421N7789K06894H8971R4719a1178E5115
15264C05474B4793R5273a25325B92425a02368I1036J76364j23191j6145A7617
15253A10026f760l7223j11626B91165a18837A26714a29241A60921C6840K69207
15243C06047l2506b25075A4794J72698J03782q213j39054J69704K61680M75748
15233A051139K9695l09460K44533j20183B31329N1995D0580Q3549j4647L29f6573
15221h7890A0599K08206B0571a82509B88023I3456J3376k9858a40249A4928a99398
15209a82925A96134J47544A52060J49451b41814k0819A53619D9041A2462h7697
$$ y = [-244052, 140396, 165874, 108869, -7751, -64019, -34359, 301112, 219463, -26734, 174390, 40762, 127751, 29914, 148693, 258118, -40949, 13421, 71210, 278104, 88971, 183690, -11178, 55115, 305474, 24793, 120066, -125325, 292425, -102368, 91036, 267400, 144209, 128064, 17617, 110026, -6760, -43983, -155609, 291165, -118837, 126714, -129241, 160921, 36840, 306047, 273541, -225075, 14794, 187492, 291274, 283061, 144007, 313711, 575391, 1051139, 1080834, 771374, 1015907, 895724, 231329, 283324, 40580, 124129, 109482, 109811, -66573, -87890, 10599, 218805, 20571, -182509, 288023, 93456, 106832, 76974, -140249, 14928, -199398, -182925, 196134, 343678, 152060, 301511, -241814, -262633, 153619, 49041, 12462, -87697]
15198B36302a39998B97583j7297a82826b9702r8050r7444i8091D03461H7710N1134
15187A38844K57649a2423A06401a11538I9753J93400O0705i3569D70272a36199
15176B46593a42027A47188a1106l2070p2227F3358J23749A5813M12640a49707
15165h5618B62402a0762A30923N3999a51513B06733a84599C45176E3632R4214
15155A47846P9361B8092K0375f4902C94124E7560k0729P1606d0380d610B34958
15143D531K76063j26755B0501b26536N1272A55413l2310c1007A33189m952c41826
15131b111l795A25417P114j5685B1009b9848B00718I5655A639J95386J65950p850
15119C55125I1920D0608K14398a73614B45041i2951L1608B21547j02054L07835
$$ y = [236302, -139998, 297583, 280286, -182826, -29702, -127752, -225196, -98091, 403461, 87710, 138844, 396493, -12423, 106401, -111538, 99753, 293153, 353858, -93569, 470272, -136199, 246593, -142027, 147188, -11106, -43176, -115403, 63358, 187107, 15813, 428453, -149707, -85618, 262402, -10762, 130923, 184922, -151513, 206733, -184599, 345176, 53632, 147846, 227207, 28092, 48467, -64902, 394124, 57560, 36831, 108437, -40380, -4610, 234958, 4531, 280594, 153839, 20501, -226536, -175264, 155413, 123103, -31007, 133189, 128237, -341826, -2111, -5906, 125417, 132531, 116846, 21009, -29848, 200718, 95655, 1639, 197025, 362975, 355125, 91920, 40608, 255006, -173614, 245041, -92951, -61343, 221547, 119493, 427328]
15109D27328g0402C01976j13021B5983K18879O3819G8490i7882j9405A25709K330
15098A28039J27824a19492H3332C244L11080H2812J07616R1108a1154B35199j06381
15087A28818J76733A02048m6168M5080k7957c87542B44069a8970A55617F4611
15076a9429C84254A58178G8129L41912G0313c96988A42837L2955L3643P6527g649
15064e7961J8599E19780K01241A69331i164H1825J60385c0240A17539J92282G0848
15052C87182q9746J234C4166P2142b81933C01460A6838f5780A0589J49309a46420
15040B83889A18741K5388J1400K06713A41827J28363A04036a62560E1857K18031
15030B69888L37735h9418A20551j5199K37935j24312a14591b0976G8049g704F8674
$$ y = [427328, -70402, 301976, 188955, 25983, 244862, 308681, 78490, -97882, -117287, 125709, 128039, 255863, -119492, 83332, 3244, 314324, 82812, 190428, 281536, -11154, 235199, 128818, 305551, 102048, 55880, 100960, 73003, -387542, 244069, -18970, 155617, 64611, -19429, 384254, 158178, 78129, 420041, 70313, -396988, 142837, 175792, 209435, 285962, -7649, -57961, -39362, 519780, 721021, 169331, -9164, 81825, 242210, -30240, 117539, 309821, 70848, 387182, 297436, 298670, 34166, 106308, -281933, 301460, 16838, -65780, 10589, 159898, -146420, 283889, 118741, 144129, 155529, 362242, 141827, 270190, 104036, -162560, 51857, 269888, 607623, -89418, 120551, 105352, 343287, 218975, -114591, -20976, 78049, -7704, 68674]
15018A01564M826d696o9141B96051a32583C61344j7292r8597J84792a9920E0069
15006E58269a1686F76670h1644G4820J42368b4247C48810R1063j00553A9490O3768
14995H3258C9936J62262F9405e4244E6761L15166j53154K27932A08500L23028
14985D31528m4201e185C00517b4318B94458K657j05894C997L92938K4166k5328
14974C95773j7069I8555K24127A28662O4819L27177B38792b3359C4107N38699
14964E72806j59625j33275K8706d3141A75558e7596I1869N9668J33811q4650B432
14952B26778m1428n613m2831F6087L97971j72381m8720H9308M7434M7246J60344
14941C44332p1657o888K9636A03668J07819n3736J81875P3927Q577j03035J21577
$$ y = [101564, 106390, -4696, -73837, 296051, -132583, 361344, 344052, 245455, 430247, -19920, 50069, 558269, -11686, 676670, -81644, 74820, 217188, -24247, 348810, 439873, 339320, 19490, 83258, 39936, 202198, 69405, -54244, 56761, 371927, 218773, 446705, 108500, 431528, 387327, -5185, 300517, -24318, 294458, 297115, 191221, 3997, 396935, 421101, 395773, 378704, 98555, 322682, 128662, 193481, 520658, 238792, -23359, 34107, 572806, 413181, 279906, 308612, -43141, 175558, -57596, 91869, 151537, 285348, 200698, 2432, 226778, 185350, 179737, 136906, 66087, 464058, 291677, 242957, 89308, 136742, 183988, 344332, 272675, 265787, 295423, 103668, 211487, 157751, 339626, 413553, 422130, 319095, 440672]
14930D40672a18918B77532C7696J79160G9471g9263D62325A16916q537n0367J36178
14919A94190J05191n7004J26724j84181J46013h207E56112I3467I543K85973r9408
14908A96108L86914B16768k8840J55903n750K57942C5165M05913r6896j00117
14898B44065L07871j64739L9672K11720k73871k0462k9788j172k1062J5025a05213
14886D9891M74331M8642o2819J0086A21266K07445Q8425J97310j43353A41439
14875B67792A22266h3585B73823b160F48638C03493J51670j25517K97322k37764
14865C89204j05488J3158M10735C3578L39709J44232k56065K09646D7879K29463
14855B77342j28761M76212j20849m9454A95817L01084A99227L9486M97547j39781
$$ y = [440672, -118918, 277532, 37696, 216856, 79471, -79263, 462325, 116916, 108379, 58012, 194190, 299381, 242377, 369101, 184920, 330933, -8207, 556112, 93467, 9543, 295516, 196108, 583022, 216768, 187928, 343831, 338081, 596023, 35165, 441078, 344182, 244065, 551936, 387197, 426869, 638589, 364718, 344256, 314468, 313296, 292234, 307259, -105213, 49891, 524222, 572864, 510045, 520131, 121266, 328711, 417136, 614446, 471093, 141439, 267792, 122266, -83585, 273823, -2160, 648638, 303493, 455163, 329646, 626968, 389204, 283716, 296874, 707609, 33578, 373287, 517519, 261454, 471100, 47879, 277342, 148581, 624793, 503944, 454490, 195817, 496901, 199227, 238713, 736260, 596479]
14845E96479O2858j03170M7637B33549L06228k04558A41262L55514L2738k20348
14835C09166P2248n2472K20497B20556J44363j3591L02748k41535j98840n8412
14825A55289K18937P3811R9553q5005p07j83044J83365o8698N6477j19795K54625
14814E84808B10426L10941k55151P2864J09330A36928O03589k69582O8956j43287
14804C96604Q5907L005B04196L00743L0142j682p8547K0656p9368r9472K28698
14793E25366j9360R9933o0638Q7616j23368J01683A87311M37760B20733J83568
14783D04301n1723K01405j28956L0421m2218J364L15057j54135r2490Q4577p2398
14772D95205J80990k28531J35613B34344L51046l9342O13J17614j7554R6931l38249
$$ y = [596479, 659337, 556167, 603804, 233549, 539777, 335219, 141262, 496776, 529514, 309166, 381414, 328942, 549439, 220556, 364919, 351328, 654076, 412541, 213701, 155289, 374226, 448037, 547590, 462585, 461878, 278834, 462199, 393501, 449978, 330183, 584808, 210426, 521367, 266216, 339080, 448410, 136928, 740517, 470935, 539891, 396604, 482511, 485516, 204196, 504939, 535081, 533399, 454852, 475508, 396140, 296668, 525366, 506006, 605939, 545301, 632917, 509549, 611232, 187311, 625071, 220733, 404301, 352578, 553983, 425027, 455448, 413230, 414594, 729651, 575516, 483026, 567603, 495205, 676195, 447664, 583277, 234344, 585390, 546048, 546661, 664275, 646721, 743652, 405403]
14761D05403K53358O9759k11365j35639J53912Q4337r0347J86050j72363J70926
14751G14031j10636L86283m61057J51873k96381M26418k69674J27137j48989K39115
14741G58120l07636J20411L00798j62024Q4152C13274K09129K01094m9530k08380
14731D65587J35739J02667l9160j43492K70569n1617J60594J1186o0543R746m9376
14720H11900k783p5559j76327J83919K9891J87690l04067Q7532B80747L17804
14710E98551J10877O8872K23710p5530l47547J42014M15372k46386n4923N97J55748
14699I91355m66547N08900l32100O3581L3151J31829k95788O83261m82201D14378
14688I97088l82456L19694j89234J61578J86205p6101N5227L4274l39979L11295
$$ y = [405403, 658761, 728520, 517155, 381516, 535428, 619765, 529418, 715468, 543105, 714031, 603395, 989678, 528621, 680494, 384113, 810531, 540857, 667994, 519005, 758120, 450484, 570895, 871693, 709669, 793821, 313274, 522403, 723497, 673967, 465587, 601326, 703993, 664833, 521341, 791910, 740293, 900887, 912073, 851530, 861276, 811900, 809117, 733558, 557231, 741150, 771041, 958731, 654664, 742196, 280747, 598551, 709428, 778300, 1002010, 926480, 578933, 720947, 1136319, 889933, 835010, 835607, 991355, 524808, 1033708, 701608, 765189, 798340, 930169, 634381, 1317642, 835441, 414378, 997088, 614632, 934326, 745092, 906670, 1092875, 1016774, 1072001, 1106275, 766296, 1077591]
14678A077591l29939K87466k86674J49160j82518J99079j61935O6169J97543j72499
14668H43443M5502J49728J62669l12912m6225J52591K61426k86701P7679l05894
14658G41306J50226J79776K32644m02355j1818J24196j87084J44151j89813J52377
14648I33606j33497P0475L37757k88848M20187l61795P6160K98836F14661O62258
14638A276919l41316m7585J99182o6645j2419o8834J38629k35551K15920n9551
14628I98749L60277j02265J26909J43043k74328j0514j72804K64425m2559J94368
14618A485301l430l35531K20840L947P5402K3318n09613M87629q9008L15583j24587
14607A549851l29351r8859J98482K18781l63780K27701k56875M05165j96484j04888
$$ y = [1077591, 747652, 1035118, 748444, 897604, 715086, 914165, 752230, 818399, 1015942, 843443, 888945, 1038673, 1201342, 888430, 842205, 994796, 1256222, 969521, 1047200, 741306, 891532, 1071308, 1303952, 901597, 889779, 1013975, 826891, 971042, 781229, 933606, 800109, 870584, 1208341, 919493, 1339680, 977885, 1054045, 1352881, 614661, 1276919, 935603, 888018, 1087200, 1020555, 1008136, 939302, 1077931, 842380, 1058300, 998749, 1359026, 1256761, 1383670, 1526713, 1252385, 1241871, 1069067, 1333492, 1290933, 1485301, 1481871, 1146340, 1367180, 1371127, 1446529, 1469847, 960234, 1447863, 1358855, 1674438, 1549851, 1220500, 1121641, 1320123, 1538904, 1175124, 1402825, 1145950, 1551115, 1354631, 1249743]
14597A249743L49914j53611K59294m47367J25911P6538L0665J89838j18006J22934
14587A685853k71648P8532k7894L14289m18219N35061k24920J01639j6058J47461
14577A904096L1038j67505m8476J62948k7374m0095J13J49195j22597j08966j69543
14566A562834N00173P4274Q9842m18386J06990J79060K48902l48783J1686K96832
14556B303424m42028M04036J66771k10518M5687j50601M13296Q1906q0193J85712
14546B717492K73123k28235L06449j61134M41447p4702M58391O55336l9155N97697
14536D946709Q92894J012736K151220L332983O546086R235956N088171j2438155
14528B0768600q328563m166752k565337j183580m96928j134776M06212m12556
$$ y = [1249743, 1599657, 1446046, 1705340, 1257973, 1383884, 1460422, 1491087, 1680925, 1562919, 1685853, 1414205, 1492737, 1464843, 1779132, 1360913, 1895974, 1671054, 1772693, 1756635, 1904096, 1935134, 1767629, 1719153, 1882101, 1854727, 1814632, 1814745, 1963940, 1841343, 1732377, 1562834, 2063007, 2137281, 2227123, 1808737, 1915727, 2094787, 2343689, 1994906, 2006592, 2303424, 1861396, 2265432, 2432203, 2221685, 2267372, 2116771, 2530067, 2611973, 2531780, 2717492, 2990615, 2762380, 3068829, 2907695, 3349142, 3274440, 3732831, 4388167, 4349012, 4946709, 5839603, 6852339, 9003559, 12336542, 18882628, 28118584, 33206755, 20768600, 12440037, 8273285, 5707948, 4524368, 4027440, 2892664, 3298876, 2886320]
14520B886320k78177k8670k76784j54445K61623q3919r8743m1916K36799k36358
14510B185730K58672j34783L27911j50436K23585l55456l5664J71255J26635J40556
14500B758005j61211q2306L05681j00766M9564k6574M61184n12697J98371k32094
14490B657157O7324N59425o50658M07904k9920L7920J41371L1857k84021J84432
14480C122791K72071k73244J66965J5890K72860k56827j01814J70298r8915L32286
14470C622361j23905L35553j02952L05618l21860j7224l66251P17652n10267N40333
14460D079058k57460L84015k07159J903R8784Q0957P6850J8156K03728J37705
14450D616537j60313l7647J32952J84714m06291K39196J15132K9906O2509L82933
$$ y = [2886320, 2608143, 2579473, 2302689, 2148244, 2409867, 2325948, 2227205, 2185289, 2422088, 2185730, 2444402, 2309619, 2637530, 2487094, 2710679, 2355223, 2319559, 2490814, 2617449, 2758005, 2596794, 2514488, 2820169, 2719403, 2768967, 2742393, 3203577, 2690880, 2889251, 2657157, 2724481, 3283906, 2633248, 3041152, 3011232, 3049152, 3190523, 3222380, 2938359, 3122791, 3394862, 3121618, 3288583, 3304473, 3577333, 3320506, 3218692, 3388990, 3290075, 3622361, 3498456, 3834009, 3731057, 4036675, 3714815, 3697591, 3331340, 4048992, 3538725, 4079058, 3821598, 4205613, 3998454, 4000357, 4099141, 4180098, 4256948, 4275104, 4478832, 4616537, 4456224, 4418577, 4551529, 4736243, 4329952, 4569148, 4684280, 4714186, 4776695, 5159628]
14440E159628q8887O1103J79998m35665K32931j7290l08083O79385K40342j62276
14430E541186J17958M25148j08l09101R1265O5673L69190j11337k04569L25651
14420F310956L21822j69339J02493J13611R1320j13080L65233k9119O3822L3114
14410G090833K75088r4515M04513j93146Q9504L18901j56908L10713M75345j54944
14400H365384L22634q9988J01663J25151k12226K13889K77000P8662K95538J66357
14390I644064K89537K05789j62729M65500N4457R79J13200J83720K84784K53244
14380A1332545L17715L4307l0376N38374J95452K06656J00884L86075L54766J98667
14370A3635065K78142K11838L98160P2070j74012R11164L9946M84810L73077l5460
$$ y = [5159628, 5070741, 5131844, 5311842, 4876177, 5109108, 5091818, 4783735, 5463120, 5703462, 5541186, 5659144, 6084292, 6084184, 5775083, 5866348, 5932021, 6301211, 6189874, 5985305, 6310956, 6632778, 6463439, 6565932, 6679543, 6770863, 6657783, 7023016, 6993897, 7057719, 7090833, 7365921, 7271406, 7675919, 7482773, 7572277, 7891178, 7734270, 8044983, 8520328, 8365384, 8688018, 8598030, 8699693, 8824844, 8612618, 8826507, 9103507, 9182169, 9477707, 9644064, 9933601, 10139390, 9976661, 10442161, 10496618, 10497597, 10610797, 10794517, 11079301, 11332545, 11650260, 11684567, 11654191, 12192565, 12388017, 12594673, 12695557, 13081632, 13436398, 13635065, 13913207, 14125045, 14523205, 14595275, 14421263, 15332427, 15372373, 15857183, 16230260, 16194800]
14360A6194800L57828Q4034O10567M60992O2020L61850N04419K67107N77120J98311
14350A9679048L05940P45961R8087Q42009K43810K49188P11662M83460R16688
14341B4275853L98990N31091N08310N60787Q64139J91187J092526O51125Q34053
14332B9908061M01780R65976P93700R62865M44264J120973J147400J004619R62483
14323C7712121J179573J207884J161629J181366J178125O36950J696516J453902
14315D7408066J578863J500917J833264J584604J682889K026047J797674K194211
14307F1606535K212881K137035K624495K570674K735579K944819K659572K985313
14299H2476903L212436L248166L705882L955391M165355M123555M840886M233109
$$ y = [16194800, 16552628, 16636662, 17247229, 17708221, 17770241, 18132091, 18636510, 18903617, 19480737, 19679048, 19984988, 20730949, 20829036, 21671045, 21914855, 22164043, 22875705, 23359165, 24275853, 24674843, 25205934, 25714244, 26275031, 27139170, 27330357, 28422883, 29074008, 29908061, 30309841, 31275817, 32069517, 33032382, 33476646, 34597619, 35745019, 36749638, 37712121, 38891694, 40099578, 41261207, 42442573, 43620698, 44257648, 45954164, 47408066, 48986929, 50487846, 52321110, 53905714, 55588603, 57614650, 59412324, 61606535, 63819416, 65956451, 68580946, 71151620, 73887199, 76832018, 79491590, 82476903, 85689339, 88937505, 92643387, 96598778, 100764133, 104887688, 109728574, 113961683]
14291A13961683N290386N084316N545041O074962O415220O610289P083133Q077207
14283A64142237Q098352Q574143Q804673R700979J0411838J0633438J1529033
14276B31894693J1927103J2752256J3500978J3508528J4625612J4768044J5218216
14269C28195430J5013002J4989212J4605291J3988619J2588018J1717536J0876119
14262D21973227J0009444R696106P961011O857835M641820K116408k07387j69970
14254D62878494k420297q872165q075314q527916j1430251j1465665j2330912
14247C99755974j3035369j4060393j4098678j4021630j3982135j4146966j3653305
14240C02757498j2653090j3092731j2401971j3271926j1976448j1106214j0722897
$$ y = [113961683, 119252069, 124336385, 129881426, 135956388, 142371608, 148981897, 156065030, 164142237, 172240589, 180814732, 189619405, 199320384, 209732222, 220365660, 231894693, 243821796, 256574052, 270075030, 283583558, 298209170, 312977214, 328195430, 343208432, 358197644, 372802935, 386791554, 399379572, 411097108, 421973227, 431982671, 441678777, 449639788, 456497623, 461139443, 463255851, 463048464, 462878494, 460458197, 451586032, 443510718, 434982802, 423552551, 412086886, 399755974, 386720605, 372660212, 358561534, 344539904, 330557769, 316410803, 302757498, 290104408, 277011677, 264609706, 251337780, 239361332, 228255118, 217532221]
14233B17532221j0866416r882352j0124166r828407q964601q761415q261139p430058
14225A43413667o963242o767156n889401n328584n473933n591906m366034m313490
14217I8719921m208965l649177m104148l209649l207647l460452k921336k836242
14209G1122305k468665k632198k364987k054238k253485j701242k126189j872000
14201E3649301j852485j356936j257170j633617j425486j511326j318424j593539
14193D1700318q67417o70900j206496j217344j265677j240406j196059m12831
14185C3623188m29827j154371r78629m85525r95911j022550o02987n74047r66408
14176B6412933k00395o01101j281422o769o83727n71279n04317q50887k40488
$$ y = [217532221, 206665805, 196783453, 186659287, 176830880, 167866279, 159104864, 150843725, 143413667, 136450425, 129683269, 123793868, 118465284, 112991351, 107399445, 103033411, 98719921, 94510956, 90861779, 86757631, 83547982, 80340335, 76879883, 73958547, 71122305, 68653640, 66021442, 63656455, 61602217, 59348732, 57647490, 55521301, 53649301, 51796816, 50439880, 49182710, 47549093, 46123607, 44612281, 43293857, 41700318, 40832901, 40162001, 38955505, 37738161, 36472484, 35232078, 34036019, 33623188, 33193361, 32038990, 31060361, 30574836, 29578925, 28556375, 27953388, 27379341, 26412933, 26212538, 25611437, 24330015, 24323246, 23639519, 23068240, 22563923, 21713036, 21472548]
14167B1472548l88061k96501k71521n10655q16928l32273n17291j02401m73761
14158A7763156r534o71006k37393n68873k90292l29115n39221J68485n37825k99801
14148A4448581k42703J28656k14161n11606j55692l04239k95394k5069k6886l80416
14138A2421071J29334p46594L99327n45136k30995l26855M8250N5742l78691k38999
14128A0586454j4358o4667m62561k07151l11846J80763J02321l61835q52l24898
14118I121370j06982j98525k3230J31733k33116m99938L85214m40468K32193l41119
14108H027132l93169K81961j83503k66083j82746J23788j94933l33297L59065
14099G238215k88115J05328p9466O3822k43244k36742J7650R5051l45968L6423
$$ y = [21472548, 21084487, 20787986, 20516465, 20005810, 19188882, 18856609, 18339318, 18236917, 17763156, 17753622, 17082616, 16845223, 16276350, 15986058, 15656943, 15117722, 15286207, 14748382, 14448581, 14205878, 14334534, 14120373, 13608767, 13453075, 13148836, 12853442, 12828373, 12801487, 12421071, 12550405, 11803811, 12203138, 11658002, 11427007, 11100152, 11148402, 11204144, 10825453, 10586454, 10572096, 10507429, 10044868, 9837717, 9525871, 9706634, 9808955, 9447120, 9446268, 9121370, 9014388, 8815863, 8792633, 8924366, 8691250, 8191312, 8576526, 8136058, 8368251, 8027132, 7633963, 7915924, 7732421, 7466338, 7283592, 7407380, 7212447, 6879150, 7238215, 6950100, 7055428, 6975962, 7039784, 6796540, 6559798, 6577448, 6672499, 6326531, 6362954]
14089F362954N9928j10814k19959j94273L24007k54944p6623r8480l7866l09654
14079E444276J51980K3858l81574L8323Q658r8176j67817R7405K3987j45332L7594
14068E033182l79330K50664j00106P5436l79751K36353K43766l61689l39378J07192
14058D386339m9399K3182j67069j17024q4220K86495j44013k26236r7365R1585
14048C902275K8787k03017L86903J28795j52749k30308j0151J00109l83990j98
14038C566456j6740p5740L30496Q9682o43355P6055q8679K13839N4922m27797
14028C079139L38893k38876J93959p1572k8182l95690M98123J944k56995R0302
14018C211045m48120M8266L6532J50820j27233M6813j14245K64728l15714k20588
$$ y = [6362954, 6422882, 6312068, 6092109, 5897836, 6221843, 5966899, 5890276, 5791796, 5753930, 5444276, 5596256, 5620114, 5238540, 5276863, 5285521, 5187345, 5019528, 5116933, 5140920, 4995588, 5033182, 4653852, 4904516, 4804410, 4879846, 4500095, 4736448, 4980214, 4618525, 4279147, 4386339, 4336940, 4360122, 4193053, 4076029, 3991809, 4278304, 4134291, 3908055, 3810690, 3902275, 3931062, 3728045, 4114948, 4243743, 4090994, 3860686, 3850535, 3950644, 3566654, 3566456, 3549716, 3473976, 3804472, 3894154, 3250799, 3326854, 3238175, 3452014, 3506936, 3079139, 3418032, 3179156, 3373115, 3301543, 3273361, 2877671, 3375794, 3377738, 3120743, 3211045, 2762925, 2811191, 2847723, 2998543, 2871310, 2918123, 2803878, 3068606, 2752892, 2532304]
14008B532304K42070Q8594j45269j91791K16620j61530J15219l3780O0749k49898
13998B473288P1091l15974L30004k22134j14702q408r5830K12548J7225j19526
13988B227582K26255j5376m22212L05298K8708J23042m5607j5194O9467M02456
13978B884419O4511J03916N49956J084897P70588L156424M833995R712502Q509514
13969C1670722r106379p471349m719376k522810j438071r85928j017274k88517
13961D121018n67366R2725n08124j72108j04451k60508J25338r6804j20676j46521
13951B362523L9521o1437K20985l85371J25998k57779j13383K49130j55055M378
13941B029510j63899Q5097P7004k4909j53931J99546o7702j96342K64933j57215
$$ y = [2532304, 2774374, 2862968, 2717699, 2525908, 2742528, 2580998, 2696217, 2662437, 2723186, 2473288, 2544379, 2228405, 2558409, 2336275, 2221573, 2213165, 2117335, 2329883, 2347108, 2227582, 2453837, 2438461, 2016249, 2321547, 2350255, 2473297, 2427690, 2412496, 2481963, 2884419, 2948930, 3052846, 3602802, 4687699, 5458287, 8614711, 13448706, 23161208, 31670722, 22564343, 15092994, 10373618, 7850808, 6412737, 5426809, 4409535, 4121018, 3553652, 3646377, 3138253, 2966145, 2861694, 2601186, 2726524, 2629720, 2509044, 2362523, 2402044, 2340607, 2561592, 2176221, 2302219, 2044440, 1931057, 2180187, 2025132, 2029510, 1865611, 1950708, 2027712, 2002803, 1848872, 2048418, 1980716, 1784374, 2049307, 1892092]
13931A892092J02835q0796k48018J24031r8328K76006k99488l608R0175k93731
13921A461170M39257k87949j9405L5517L67191n59385K15327o0312l18878N4096
13911A326629J53806l4865J59666l8876j82370K41530j72960J52164k92883o353
13901A305488J55840J81580j00183j45649l02618L69093j58012P8873K00555l18172
13891A266795K69333P5494k23434p8931k14348L4981R545K24786J14175k62771
13881A215625M4088K48583r2705o6296o3205J28735l23476M6011p6217K14157
13871A275300O3339J44918r1490j11975R5802j65346j5662j40041M5619J04131
13861A204595M8025n2013M6055j06683J53888O1973q3322O4545l66156j56065
$$ y = [1892092, 1994927, 1914131, 1666113, 1790144, 1691816, 1967822, 1668334, 1664726, 1754901, 1461170, 1900427, 1612478, 1593073, 1628590, 1995781, 1436396, 1651723, 1591411, 1272533, 1326629, 1480435, 1445570, 1605236, 1566360, 1383990, 1625520, 1452560, 1604724, 1311841, 1305488, 1461328, 1642908, 1542725, 1397076, 1094458, 1463551, 1305539, 1384412, 1584967, 1266795, 1536128, 1611622, 1388188, 1309257, 1094909, 1129890, 1139435, 1364221, 1478396, 1215625, 1259713, 1508296, 1415591, 1349295, 1286090, 1414825, 1091349, 1137360, 1061143, 1275300, 1338639, 1483557, 1392067, 1280092, 1375894, 1210548, 1194886, 1054845, 1100464, 1204595, 1252620, 1200607, 1246662, 1139979, 1293867, 1355840, 1272518, 1337063, 970907, 814842]
13851H14842k19611L87563l72218N97190j87928k68N00960n47542N5560k23091
13841H05457R3914J8892K13335k14608j42378J58870K38849k38789L05412m08825
13831H30129L25199J4152l43344J54246l3650j83195K31776K9206j46653O0146
13821I38012L65237n22386j14315M34326n19804K89595j24902N90j16240R8734
13811G28847J93863L0692K4109p2848n1007j00679R2606K13280m45032J12474
13801G26305K7137J20316k2432j47580j02164J69363K4419p9937J6137k24399
13791E07165K92235m3426o3138P0395j94086j20201N56828l01088L28624l00960
13781G32348J91924k53310J26791q4308Q7157J61372N367k39608K08045k27777
$$ y = [814842, 595231, 982794, 610576, 1207766, 1019838, 1019570, 1520530, 972988, 1028548, 805457, 899371, 918263, 1131598, 916990, 774612, 933482, 1172331, 933542, 1238954, 830129, 1155328, 1169480, 826136, 980382, 946732, 763537, 995313, 1024519, 877866, 938012, 1303249, 780863, 666548, 1100874, 581070, 870665, 745763, 746353, 630113, 728847, 922710, 953402, 977511, 904663, 853656, 752977, 845583, 1058863, 613831, 726305, 753442, 873758, 851326, 703746, 601582, 770945, 795364, 715427, 731564, 507165, 799400, 755974, 692836, 763231, 569145, 448944, 1005772, 704684, 1033308, 732348, 924272, 670962, 797753, 713445, 800602, 961974, 967341, 727733, 935778, 708001]
13771G08001J90515j8734k69578K02760n1088P1620l73138j9702N65622l61625
13761F44653k54531N79155k26250J50173k17081o0780q3146K40787L5115B60389
13750H02750o2035k58157K66547J83213k83752L0841J28259q509o9397N168k82045
13739D52883K48136k48990K53051J0169j67660P3260J29795j74106m6560K1749
13729E51727O8636J49828o1649j00009o0300n2768M26984r2355C98449m903L67419
13718G60965k9409R897M5063l1275j93327J46574P1870l42286J47244r9588l666
13707D82062J80885j3495j07361N6133O9421J7959j78744j15706J01903J24800
13697F17857L14697A86864M75147P1991j97001O970J83065k65803n7283j8227
$$ y = [708001, 898516, 879782, 610204, 812964, 761876, 833496, 460358, 440656, 1006278, 644653, 390122, 969277, 743027, 893200, 676119, 615339, 532193, 772980, 808095, 260389, 802750, 740715, 482558, 749105, 932318, 648566, 679407, 807666, 799157, 729760, 734928, 452883, 701019, 452029, 705080, 715249, 547589, 620849, 750644, 576538, 529978, 551727, 620363, 770191, 708542, 608533, 548233, 495465, 922449, 830094, 398449, 393546, 760965, 731556, 741453, 786516, 755241, 561914, 708488, 780358, 438072, 585316, 485728, 482062, 662947, 649452, 542091, 598224, 667645, 685604, 506860, 391154, 493057, 617857, 932554, 186864, 662011, 734002, 537001, 543971, 727036, 461233, 403950, 385723]
13687C85723j51984L49389q3017q9717J53568j90087K48984j53165N7915r7756
13677D29853K10149k7861M867J0391K5374j22950N5913j11999k01874K42958A00069
13665D99594R5294k89865P4778O9983K00130m3836k62473K96627k17678K54919
13655F77473q3887B49020R5598N1082j63755J20144J39517j06111r265k5252K09198
13644E60176j73993M684M8295A45894K45868J53268i779B74891M8995N5459n1040
13633C28305I2246M94347A90150C8030K47668K38261P5466k68278G6288L17050
13623C93338p511j08318Q5219Q7076p4679J09586j79215K30795j49072p8270N7374
13612C66323Q3385J44646B62842K03645M63790C01614a09896E60952j62020J220
$$ y = [385723, 233739, 583128, 500111, 410394, 563962, 373875, 622859, 469694, 527609, 429853, 640002, 612141, 617008, 627399, 652773, 529823, 585736, 473737, 271863, 514821, 100069, 499594, 594888, 305023, 379801, 449784, 649914, 606078, 343605, 640232, 422554, 677473, 593586, 249020, 344618, 395700, 231945, 352089, 491606, 385495, 376230, 350978, 560176, 386183, 390867, 439162, 145894, 391762, 545030, -9779, 274891, 323886, 379345, 328305, 92246, 586593, 190150, 38030, 285698, 523959, 599425, 331147, 76288, 393338, 385827, 277509, 362728, 449804, 375125, 484711, 305496, 536291, 387219, 308949, 366323, 449708, 594354, 262842, 466487, 930277, 301614, -109896, 560952, 398932, 400152]
13602D00152G0599J87685R2966A41556J68027J27821k4561A80542P8592r6788
13592A62346N140p1849L72026O9031A40691K62072O1569j35424J16917d9492C24779
13580H8468L98932A35820J61231G2748L96135K27238j38004g3700C26839P8759
13570D05598k4381n9968J21733A62240J56576J10482j03838H6249K94042o1928
13560C18363J23469m8243K38220j63514A53797J135J39129K35763j67880N9284
13550D21228j89613K24050A19153L18144k05163K717o8824K3988L3038o1322o7886
13539I3845K38268j48321M9402K98648B32795p88a06483C33412Q9919k0080j45340
13528B57911q5979J01216Q0939J46675F660L11073J81290k25219k7564d3933D9437
$$ y = [400152, 70599, 258284, 351250, 141556, 309583, 437404, 412843, 180542, 259134, 162346, 167486, 95637, 467663, 536694, 140691, 402763, 464332, 328908, 445825, -49492, 324779, 88468, 487400, 135820, 297051, 72748, 468883, 696121, 558117, -73700, 326839, 405598, 381217, 321249, 442982, 162240, 318816, 429298, 325460, 86249, 380291, 318363, 441832, 393589, 631809, 468295, 153797, 154932, 294061, 529824, 361944, 421228, 231615, 455665, 119153, 437297, 232134, 234851, 166027, 190015, 223053, 161731, 93845, 332113, 183792, 233194, 531842, 232795, 232007, -106483, 333412, 423331, 403251, 257911, 171932, 273148, 354087, 500762, 6660, 317733, 499023, 273804, 246240, -43933, 49437]
13516B14965R6388m3869K2809p9702R9057R4160J517A81486J93133K01830A0148
13504b3207D94641O953q5775p8017J19375p1650A69151N431L3595L26513c850
13492B65875P792P9139K18406j17151A32323K43600A20843Q9244J28981j61434
13482A77634J31106r0203M3497J25250A51175J29291J68254I6580L59536a62113
13471A44297l0683L30881r7951b6791A39497F5366R0174k178D4744L66023A36439
13459A97993J64246n2409J68885A7068J41578o2674D7182a57204D75434F4345
13448C5078J27674l9825K33047A67044o8404L55202j2721k16804j05065K61674
13438C80926j20301P8818A10098L6306J59109K3406m0541n8587K0806m4434J97819
$$ y = [214965, 311353, 267484, 290293, 210591, 309648, 403808, 405325, 181486, 374619, 576449, 10148, -23207, 494641, 501594, 415819, 337802, 457177, 385527, 169151, 174582, 208177, 534690, -3850, 265875, 273667, 352806, 571212, 454061, 132323, 375923, 120843, 210087, 339068, 177634, 308740, 218537, 262034, 387284, 151175, 280466, 448720, 96580, 456116, -162113, 144297, 113614, 444495, 346544, -26791, 139497, 65366, 155540, 153362, 44744, 410767, 136439, 197993, 362239, 309830, 478715, 17068, 158646, 95972, 47182, -157204, 475434, 64345, 35078, 162752, 122927, 355974, 167044, 98640, 453842, 441121, 224317, 119252, 380926, 260625, 339443, 110098, 146404, 305513, 328919, 288378, 229791, 250597, 206163, 403982]
13427D03982A38431M2148J47201G0710L17814d0119B84507K04875B31748J50593
13417C82341a6691o1981C42664j26097n3011K75445j05620f8117B48141a09221
13406C98138n9658J13248A44479d3609A37684J44657A38813K07894j61672K77558
13396D62593B9410K93421A25273L30569P2062A06007d2966F07497A0780J34126
13386A44906a02025I9901f988A83694K00848J12183c7214B17131j07763J28523
13376B37891A2656J4924N94643D1449b29879B62742G9219i7248C82911j65946
13366B16965m8612L31403k44078m5438l9225B7735K36885J61986j46426A26908
13355D01766A32309K15996j06741F8476J2941K06498J97426d8592C33436l1403
$$ y = [403982, 138431, 180579, 327780, 70710, 388524, -40119, 284507, 489382, 231748, 382341, -16691, -78672, 342664, 216567, 163556, 439001, 333381, -68117, 248141, -109221, 398138, 338480, 451728, 144479, -43609, 137684, 282341, 138813, 346707, 185035, 462593, 29410, 322831, 125273, 455842, 527904, 106007, -42966, 607497, 10780, 144906, -102025, 99901, -6988, 183694, 384542, 496725, -37214, 217131, 109368, 237891, 12656, 27580, 622223, 41449, -229879, 262742, 79219, -97248, 382911, 216965, 168353, 499756, 255678, 210240, 171015, 27735, 264620, 426606, 280180, 126908, 401766, 132309, 348305, 241564, 68476, 81417, 287915, 485341, -48592, 333436, 302033]
13345C02033H4501K95435p5693M192r2284E242K76944j2470B1462K10248R3538
13334C25248R2565k8018d043A27043J56120A15921K72679j46844h1786E56550
13323E4442J37262o8722J51522A11888J65069J81890M4091j81266L2833J40378
13313D94883B09926C5064K05321B6966Q3803J28775J15784l8294j9061j41058
13303A56915K62303j7601J8802C5606K72452B9699J48724L2564J52052C9844K84597
13292C24441j53760J48099K79107B82155F1335b1534B44786i6017G8400C3143
13281E8979L31766a79135A8569K63651C240a37021A66178a14407B56850p5822
13271A81028J61821A65750M09449a0924B82353k1144a25631A07971J11100M5338
$$ y = [302033, 84501, 379936, 304243, 308435, 216151, 5242, 282186, 269716, 21462, 231710, 325248, 417813, 389795, -4043, 127043, 283163, 115921, 388600, 241756, -81786, 556550, 54442, 191704, 122982, 274504, 111888, 276957, 458847, 502938, 321672, 354505, 494883, 209926, 35064, 240385, 26966, 110769, 239544, 355328, 317034, 297973, 156915, 419218, 401617, 420419, 35606, 308058, 29699, 178423, 210987, 363039, 39844, 324441, 170681, 318780, 597887, 282155, 61335, -21534, 244786, -96017, 78400, 33143, 58979, 390745, -179135, 18569, 282220, 3240, -137021, 166178, -114407, 256850, 181028, 342849, 165750, 575199, -10924, 282353, 261209, -125631, 107971, 219071, 264409]
13261B64409J66207k11564M37424A70563b9739G1537J90675J08185B8551a67861
13250C42700c10772r2987A5503l664J28746R2115J28855k955E2109h1664E519
13238A68097K09187M2545a324j54523B27788L72231A18947B8525g1328l0462j26310
13227b28100B7874J52098L2643r4452J46267C3962L17391A60937l2504A4406J49388
13216A63794A9435K42843H4618k4356J83355a76979B00263L3159k6333G6410e146
13204c225k58046C61222a4413N353A08993f6987A95791f007D01905q7295l5923
13193B78687H563K30805b26436g8590i761A75908o5191a77626A83724a57826C10186
13181B8035M7807j2861g3506F6373d8575B71998K946G6683a22839c4131L58A05963
$$ y = [264409, 430616, 219052, 656476, 170563, -29739, 71537, 262212, 370397, 28551, -167861, 342700, -310772, -403759, 15503, 11839, 140585, 232700, 361555, 358600, 52109, -81664, 5519, 168097, 377284, 419829, -1324, -155847, 227788, 600019, 118947, 28525, -71328, -101790, -228100, 27874, 179972, 212615, 118163, 264430, 33962, 351353, 160937, 128433, 14406, 163794, 19435, 262278, 84618, 60262, 243617, -176979, 200263, 233422, 207089, 76410, -5146, -3225, -261271, 361222, -14413, -9060, 108993, -66987, 195791, -6007, 401905, 314610, 278687, 8563, 239368, -226436, -78590, -9761, 175908, 110717, -177626, 183724, -157826, 310186, 28035, 75842, 62981, -73506, 66373, -48575, 271998, 274944, 76683, -122839, -34131, -33773, 105963]
13168C69291j69564f1925B06706R3235N8323j37186N5650a6866r9933B23328D1582
13156A41792R5039G9993J09589b22065C2688N5834i6334D74285G4447d2812n6731
13145i9543q3833A44732G0488L21987i0234A06836a58845J4411C80574J98116
13135E78690B6460J7121A6975M05983G4417L61640A92804Q108B9889J82931b39767
13123B36822p5973b69545J2756a24812K2291b4104D2860J50474r2834l367a45788
13111B0104K2212O926O4230c73851B02839L4118d4354B11727b34524M1629f4122
13099b1469m6487L1688n663A93542J46247r2543A1780h3031F4091l1963f9581
13087b42817d8072A46136J9731j2528H405M1321h949A88326F4858J26183J678
$$ y = [369291, 199727, -61925, 206706, 299941, 358264, 221078, 276728, -16866, -116799, 223328, 41582, 141792, 236831, 79993, 189582, -222065, 32688, 88522, -96334, 474285, 74447, -42812, -99543, -183376, 144732, 70488, 392475, -90234, 106836, -158845, -144434, 380574, 578690, 26460, 43581, 16975, 422958, 74417, 436057, 192804, 200912, 29889, 212820, -239767, 236822, 160849, -269545, -256789, -124812, -102521, -24104, 42860, 193334, 100500, 97133, -145788, 20104, 42316, 49242, 113472, -373851, 202839, 236957, -44354, 211727, -234524, -192895, -64122, -21469, -67956, -36268, -41931, 193542, 339789, 247246, 11780, -83031, 64091, 32128, -69581, -242817, -48072, 146136, 165867, 153339, 8405, 49726, -8949, 188326, 64858, 191041, 192719]
13076A92719K44180c87928C00059m4917b6582n2375A32916l955J76459r5817b1540
13064b2945B46735J88759A49796a65771I0010j8762h6815A85284H1434d603J073
13053c530k30788N9145g2080A05569b6703B24892I6913c8635B61749K432A07624
13041C16717p4199q3860J78412k6873j40538c7812B13309F7038k5185K076e6406
13029b5112F9051b03797A63545b7206A52770j3455a57973I6442k5154A9977e2343
13017c4588n2288R646B1670J93879A8753J3793K972a48183B10751N4122j8279
13006B46594A6005K05756E442e3632g294F5409R1077L35357H5092K26573A39166
12994C54798r7651a53A00897c608C30303p9765H9881J96173h9961B37043k5405
$$ y = [192719, 436899, -387928, 300059, 255142, -26582, -78957, 132916, 128961, 305420, 209603, -21540, -22945, 246735, 435494, 149796, -165771, 90010, 71248, -86815, 185284, 81434, -4603, -3530, -234318, -175173, -72080, 105569, -26703, 224892, 96913, -38635, 261749, 264181, 107624, 316717, 242518, 158658, 337070, 310197, 169659, -37812, 213309, 67038, 41853, 43929, -56406, -25112, 69051, -203797, 163545, -27206, 152770, 139315, -157973, 96442, 71288, 19977, -52343, -34588, -86876, -77230, 21670, 215549, 18753, 32546, 35518, -148183, 210751, 264873, 246594, 16005, 221761, 5442, -53632, -7294, 65409, 156486, 491843, 85092, 311665, 139166, 354798, 257147, -153, 100897, -3608, 330303, 250538, 89881, 286054, -89961, 237043, 211638]
12983B11638i115G3284A8543K8087d0166m1035B77484G6653L04937a60616d0734
12971A56795P1553f2085F7960a11326A79865J51855j23272J91678f6893B94910
12960f8678B7465g8680m4671B02649f7809f066I8560P0780d1354A67166m2757
12949A24409l2702Q6501j6469B9387b41380A88322H4754J36184B7747A0562P5817
12938H6379b78497d1491j11745I8742b81436A52353m5279B795a14020K3518k1581
12927a12083A98131h7268r3637m8825B10005J142A8301c6255B07224I6141N4943
12916A51084j2024J80520C9166c5758G0523h050C11860J29720E9373M2102l1011
12905G0464K09856i7306B21074o0419R3161A10617L46349j45879B2623F308J7168
$$ y = [211638, -9115, 73284, 18543, 46630, -40166, -81201, 277484, 76653, 381590, -160616, -40734, 156795, 228348, -62085, 67960, -111326, 179865, 331720, 208448, 400126, -66893, 294910, -68678, 27465, -78680, -123351, 202649, -67809, -6066, 98560, 169340, -41354, 167166, 124409, 91707, 178208, 161739, 29387, -241380, 188322, 84754, 220938, 27747, 10562, 86379, -278497, -41491, -153236, 98742, -281436, 152353, 107074, 2795, -114020, -90502, -112083, 198131, -87268, -180905, -229730, 210005, 211147, 18301, -36255, 207224, 96141, 151084, 139060, 319580, 39166, -35758, 70523, -8050, 311860, 441580, 59373, 101475, 70464, 280320, -97306, 221074, 160655, 253816, 110617, 456966, 311087, 22623, 6308, 23476]
12894B3476J68283R9257b95805R0446H7678M88417a24077A23558f3824K8541A87757
12882B17980J0544C5587K70459A37057o7909N8226E311f1049j48497B79408O698
12871B86106C5348J29607H1093k086c0719I549f9818q4508A89244a66352j04557
12860b70909A9220L98476C1266N1839J90614h5762A1444a49069d3334B89347h9346
12848a05910E0899c7695C7915J28667o7295j9556f0356g382A30829B9401a6603
12836b00562f662J193B81189I5648O9311E0280C104K13071k0092a37946f3261
12824c20030B80236m489f2013B51194A02925J4997b88170a26099j53527J00441
12814a79185C41880b15241G6746b57212A80294E9526J52712b0560q652n8312j31911
$$ y = [23476, 191759, 291016, -295805, -205359, 87678, 576095, -124077, 123558, -63824, -35283, 187757, 217980, 228524, 35587, 306046, 137057, 69148, 127374, 5311, -61049, -209546, 279408, 286106, 35348, 164955, 81093, 79007, -30719, 9549, -69818, -154326, 189244, -166352, -270909, 19220, 417696, 31266, 83105, 273719, -85762, 11444, -149069, -43334, 289347, -89346, -105910, 50899, -37695, 37915, 166582, 99287, 79731, -60356, -7382, 130829, 29401, -16603, -200562, -6662, -5469, 281189, 95648, 164959, 50280, 3104, 216175, 196083, -137946, -63261, -320030, 280236, 275747, -62013, 251194, 102925, 117922, -288170, -126099, -279626, -179185, 341880, -215241, 76746, -257212, 180294, 59526, 212238, -20560, -29212, -87524, -219435]
12803b19435Q7258A75527b06768A41717a6950j06105A33708d1911r2044A43888
12792c0097r4066A09378K65659a39186A7099J1587j803K96596a54704d5350k31940
12781b77290I616a48892F7622j8655b2775I086k532J9248L7427O1006K13724A1264
12768B06275O0157E1714J46406a60114j05404F9022b93648J21674D3728N6351
12758A00079J60523G0855A0422a72032A08843l2383A2843R6894a20820k18895
12748c39715A05689P7814J06766b94981g3906B76380a79312E2039h6589A06698
12737C43106h1937B18799O297e9151A88668B8849K80597g8313A30218B7678d284
12725h874o072l7439A25262K00268B1968b95393G5876K34328h8403C305M1250
$$ y = [-219435, -132177, 175527, -206768, 141717, -16950, -123055, 133708, -41911, -133955, 143888, -30097, -124163, 109378, 375037, -139186, 17099, 28686, 26883, 323479, -154704, -45350, -277290, 9616, -148892, 67622, 48967, -22775, 9086, 6554, 25802, 63229, 124235, 337959, 11264, 206275, 266432, 51714, 198120, -160114, -265518, 69022, -293648, -171974, 43728, 100079, 260602, 70855, 10422, -172032, 108843, 76460, 12843, 109737, -120820, -339715, 105689, 183503, 290269, -294981, -73906, 276380, -179312, 52039, -86589, 106698, 343106, -81937, 218799, 225096, -59151, 188668, 28849, 309446, -78313, 130218, 27678, -4284, -8874, -14946, -52385, 125262, 325530, 21968, -295393, 75876, 310204, -88403, 3305, 44555]
12714D4555J08416d9073B95249b84137B9158a98136e475E8233a6333D20960k06962
12703B13998Q5696E8222J85720b81032J33309o314B09242a23602A12031J35903
12693B47934A22424Q3802h8242I980c1672A62150F5710J06356Q5089q3135I318
12681A29324n0675R6377b44477J16378C2949J79536A2512a1312A04459K62336
12671C66795j68530J62625a19668A71522p1200i1499A16226A9682J99116e0986
12660b24644c9484B53631b575j31695D2631Q9608J36519g5092C5604a20728A18902
12648F5875J60807A9012L75539A00583b06682B74437E4427J84756R8115B2359
12637B98213A18902C7230K32989j17636a13776p4546H7068O941f9187B28583B2084
$$ y = [44555, 152971, -49073, 295249, -284137, 29158, -198136, -5475, 58233, -16333, 420960, 213998, 299694, 58222, 243942, -281032, -147723, -154037, 209242, -123602, 112031, 247934, 122424, 206226, -88242, 9980, -31672, 162150, 65710, 172066, 257155, 174020, 9318, 129324, 78649, 175026, -244477, -128099, 32949, 212485, 12512, -11312, 104459, 366795, 198265, 360890, -119668, 171522, 100322, -91499, 116226, 19682, 218798, -50986, -224644, -39484, 253631, -2575, -134270, 42631, 132239, 268758, -75092, 35604, -120728, 118902, 65875, 226682, 19012, 394551, 100583, -206682, 274437, 54427, 239183, 337298, 22359, 298213, 118902, 37230, 270219, 152583, -113776, -188322, 87068, 94009, -69187, 228583, 22084]
12625c178k03979e461C75412g099J106E9620a34171A58826K03331H4540L11628
12614C96168J91037B76263J71942n6143a7131D7046J98325K5007o3671M6714B9911
12602B85948d5761I8423A9599G771f2797A1080b52376c4351l0374b2218N362k06344
12590b23200m2339h9116B0462e2540a0229A93490J37179j31377B6963J76934R9768
12579C03665o118F6461J90794J38713c006H9567i3376A31164D4354L1157Q1200
12568A56711E5421h7033A80429j2735m1595a75570b9123j12302A28141J2539F9511
12556B00755c5974D2750J98704a31246o4920r7476A8497a58811O2537J8328k4934
12545a02880j46986j5691A60816a46191H6541J31338k3477C1332g7759c1661f466
$$ y = [-3178, -207157, -5461, 375412, -7099, -5993, 59620, -134171, 158826, 362157, 84540, 396168, 587205, 276263, 448205, 392062, -17131, 47046, 245371, 270378, 206707, 253421, 29911, 285948, -45761, 98423, 19599, 7771, -62797, 11080, -252376, -34351, -64725, -22218, -16856, -223200, -265539, -89116, 20462, -52540, -10229, 193490, 330669, 199292, 26963, 203897, 303665, 297547, 66461, 257255, 395968, -3006, 89567, -93376, 131164, 44354, 75511, 156711, 55421, -87033, 180429, 167694, 126099, -175570, -29123, -141425, 128141, 140680, 69511, 200755, -35974, 42750, 241454, -131246, -196166, -293642, 18497, -158811, -96274, -77946, -102880, -249866, -265557, 160816, -146191, 86541, 217879, 194402, 31332, -77759, -31661, -6466]
12533a208l068B18573j4194j4579b15446A6095K47245B594c42399c9438k04771
12522b44209P3245E2713a42837q1619F5602b02916C5390a31213H2648a09764L3784
12511g5980A31400J9242J17998M6001b12328R1830A73027m295C0011K22492c0810
12499c04204A9916J03922a04332B17458a96401e9316K2954C31189g7691B4124
12488A94133Q9614q0402i6409I6377L95230A63067K2910b26794A42977f1228M656
12477e6572k37403H2824P7112a8663j9557q3376A75946m6875m9482K9454n856
12466A03187i7926a0631F4489f6964k3332B182c1478j77006b5169A57723J22788
12455B80511f6239E2306a56748j25607H4479K9815h8988A06382d40040C65760
$$ y = [-1208, -4276, 218573, 204379, 189800, -215446, 16095, 263340, 2594, -342399, -39438, -244209, -170964, 52713, -142837, -224456, 65602, -202916, 35390, -131213, 82648, -109764, -75980, 131400, 150642, 268640, 314641, -212328, -120498, 173027, 168732, 30011, 252503, -30810, -304204, 19916, 123838, -104332, 217458, -196401, -59316, -36362, 331189, -77691, 24124, 194133, 283747, 203345, -96409, 96377, 491607, 163067, 185977, -226794, 142977, -61228, -56572, -293975, 82824, 159936, -18663, -38220, -121596, 175946, 129071, 79589, 109043, 103187, -97926, -10631, 64489, -66964, -90296, 2182, -31478, -208484, -25169, 157723, 280511, -66239, 52306, -156748, -282355, 84479, 114294, -88988, 106382, -440040, 365760]
12444b4477k0778A63649e5386E609c40932A70218a09297k8841j15195a10587p6052
12433a86639A55781O3018H9969c0318B54152h638C82029a42772r9122C98342e1659
12421B85758a3336G3554a15327A09325c22090A54313D0242a5952B04078m4343
12411A59735E4888N9367i9566K5547B60435a34184R881C7258J3885c2328A01042
12399a83805j00320a364k24660I9903F522e89672a7216A54646l3871K21692c2847
12387a18502j11936b3084M672j05784F4943b07471A55775D6832G881K08752d3528
12375a15843l2659a5526B38780a25702L4861j9643d6260k5445E7252M6242E078
12363D1934K47702f310A62638J36144j22602O58g3630B6809G921K1213J82297
$$ y = [-24477, -45255, 163649, -55386, 5609, -340932, 170218, -109297, -138138, -253333, -110587, -186639, 155781, 218799, 89969, -30318, 254152, -8638, 382029, -142772, -241894, 398342, -51659, 285758, -13336, 73554, -115327, 109325, -322090, 154313, 40242, -15952, 204078, 159735, 54888, 114255, -99566, -74019, 260435, -134184, -124303, 37258, 51143, -32328, 101042, -183805, -284125, -1364, -226024, 99903, 6522, -589672, -17216, 154646, 120775, 342467, -32847, -118502, -230438, -23084, -18412, -124196, 64943, -207471, 155775, 46832, 7881, 216633, -43528, -115843, -148502, -15526, 238780, -125702, -90841, -110484, -46260, -71705, 57252, 103494, 5078, 41934, 289636, -6310, 162638, 298782, 176180, 176838, -73630, 26809, 7921, 29134, 211431]
12352B11431A5628N1142q430D318a29911C01401D0786J47817b06140q5337B19752
12340c6478l98232A50307e6572A85044J22526A4078J50198C9037L9658C1024c24057
12328f5135A92094n1071a75783o4011H3041c4711j79074r360F3775b21469f1199
12316a03825A45427b88790C98062d39581D2103f194B53845b86068A40628J3322
12306A53950K7562L6663J56394c5623g094j13287q352j4584N6981A38266b38237
12294C63367D0629a9345F4736b50106h2478b5493A5306b20232N8859C1634J89593
12283B21227A0848L87007j67313f2288G0284c15156C4110k189M2142J23593a11859
12271a41300n1932k8435C84965A79791J22424a19267A39947M6781G7642l965K72413
$$ y = [211431, 15628, 66770, 58340, 4318, -129911, 301401, 40786, 188603, -206140, -291477, 219752, -36478, -434710, 150307, -56572, 185044, 307570, 14078, 164276, 39037, 78695, 31024, -324057, -65135, 192094, 141023, -175783, -239794, 83041, -34711, -213785, -223145, 63775, -221469, -61199, -103825, 145427, -288790, 398062, -439581, 42103, -6194, 253845, -286068, 140628, 153950, 181512, 218175, 374569, -35623, -7094, -120381, -128733, -143317, -86336, 138266, -238237, 363367, 40629, -19345, 64736, -250106, -82478, -25493, 15306, -220232, -161373, 31634, 221227, 10848, 397855, 230542, -62288, 70284, -315156, 34110, 31921, 74063, 197656, -111859, -141300, -193232, -221667, 384965, 179791, 302215, -119267, 139947, 186728, 77642, 73677, 346090]
12260C46090A67261J2814K89701D6767J17011E366M10762c6478j06125O3786B19554
12248a82998N7190A80723J21350p6680j8491E4796J98758h2542j42270O5779j10533
12237b69566a187F661K56729d2223I0053L52712K1180H9766a43587A64274E1303
12225G1032J11221F4435f9094O187G3386Q6595d7357j64370i3034I8830P5993
12214A74823F7433L431K57285J69554k02693A26666e3539F1227K24290G4072O0944
12203A35016J72292E7784c1576A98606G5874J85692A1949J08615B148O1807J84515
12192B48470b86942G8299a03493A51296m984j5760b13755A87287a03591M6122
12182e7469A58157R5334J37564J1519j34549D8890K92363C5514P2148M6140Q4290
$$ y = [346090, 167261, 180075, 469776, 46767, 163778, 5366, 416128, -36478, -142603, -78817, 219554, -182998, -125808, 180723, 302073, 225393, 206902, 54796, 253554, -82542, -224812, -159033, -269566, -1187, 6661, 263390, -42223, 90053, 442765, 463945, 89766, -143587, 164274, 51303, 71032, 182253, 64435, -69094, -62907, 73386, 159981, -47357, -211727, -93034, 98830, 174823, 67433, 70864, 328149, 497703, 295010, 126666, -53539, 61227, 285517, 74072, 135016, 307308, 57784, -31576, 198606, 75874, 261566, 11949, 120564, 2148, 63955, 248470, -286942, 78299, -103493, 151296, 146312, 130552, -213755, 187287, -103591, -57469, 158157, 253491, 391055, 402574, 268025, 48890, 341253, 35514, 107662, 153802, 238092]
12171B38092J51922a22591F135J42122J13528A0461a2186j7710A58988m1962L58412
12160D75438C0419A3109b28890D0191K69575O5820D2138O7902J92061j12223B531
12148A06124J252l3661d9420A04492L77548A89889K6521G9678Q7450b4361D0038
12136G3018K42740q7655p8895J8262C9152L06852J12941b20010i7799B35398b52203
12124G9625J48263b0600D946e9818A13517E122K80229A34619d12167a39273o3215
12113b02488A64393o1854e2167j26716A06668a15162j12013H1837b77982R6914
12103a81068B8425b61942P7236I7634i0115c503F1588g156k96425b8550F6557
12091A75607K3956E36L21933D4148b8716o1678e400m5106B3413c3154A60821a35399
$$ y = [238092, 390014, -122591, 6135, 148257, 261785, 10461, -12186, -29896, 158988, 117026, 475438, 30419, 13109, -228890, 40191, 309766, 375586, 42138, 110040, 302101, 189878, 2531, 106124, 107376, 73715, -49420, 104492, 482040, 189889, 216410, 79678, 167128, -24361, 40038, 73018, 315758, 228103, 149208, 167470, 39152, 346004, 458945, -220010, -97799, 235398, -252203, 79625, 227888, -20600, 4946, -59818, 113517, 5122, 285351, 134619, -412167, -139273, -202488, 164393, 102539, -52167, -178883, 106668, -115162, -227175, 81837, -277982, -181068, 28425, -261942, -184706, 97634, -90115, -3503, 61588, -7156, -303581, -28550, 66557, 175607, 199563, 536, 322469, 44148, -28716, -90394, -5400, -50506, 23413, -33154, 160821, -135399]
12078e2299q8019A4448a23404J3337k4241G8575N50063e7314A56648b2285B75694
12066d2721r7725c9365m04163a81169g4078k43289e2074a6754n0538B963J50939
12055A53902C052P2237J36852a3822n3130A69475J53500Q9356Q02767K03815m51851
12044I67062l50702A28234M2160j4106R6219K0247h3827F6991a93699A7048J2398
12033B9446a90891G1375K77966j02146c51862B10075B6435J80277i7099d3433
12022a03476m8186p6560A29183Q159J13885a36707j738M8852A29003N1789n3641
12011A27151c8783A11091a2295G9792a87382C24635b80889A49604l3609Q0935
12001A96930p7432b20309J01836B33262A06645N2907d06815B6221b71261D3600
$$ y = [-52299, -140318, 14448, -123404, -110067, -134308, 78575, 628638, -57314, 156648, -22285, 275694, -42721, -140446, -39365, -443528, -181169, -74078, -317367, -52074, -16754, -67292, 2963, 153902, 3052, 75289, 212141, -13822, -66952, 169475, 322975, 412331, 1215098, 1418913, 967062, 616360, 128234, 170394, 156288, 252507, 272754, -83827, 66991, -193699, 17048, 29446, -190891, 71375, 349341, 247195, -351862, 210075, 26435, 206712, -97099, -43433, -103476, -151662, -228222, 129183, 137342, 251227, -136707, -138445, -89593, 129003, 180792, 127151, -38783, 111091, -12295, 79792, -187382, 324635, -280889, 149604, 115995, 196930, 119498, -220309, -118473, 233262, 106645, 159552, -406815, 26221, -271261, 43600]
11990D11633h1294F8485M6899A0643b54227G196a94842c8852E1758j1811c7208
11978b55461A58919c49437E2586a21246A10772J82313H0472b53805A13765K4160
11968A37925J65444b56902I1043J9244c16307A0893f2622F4247g9774B14415d2134
11956A10403b95314c7382j01749B33835j0910c59280a57926A83404b99128A77587
11945a0450A51976J42496a22697C71273h3349k0430F1851a44537j43171J01228
11935a86480A4157J68602f2870B16342A1848L79298r7554A15931L6769a02298
11924f597D3537b83553e3377B73396b34098B2575a23828n080B53802b64551p6982
11913c41533a59360B83941B2779a63104O2145G823R4746O6681q3220K08533b02035
$$ y = [411633, -81294, 68485, 115384, 10643, -254227, 7196, -194842, -38852, 51758, 39947, -37208, -255461, 158919, -349437, 52586, -121246, 110772, 293085, 80472, -253805, 113765, 137925, 303369, -256902, 91043, 110287, -316307, 10893, -62622, 64247, -79774, 214415, -42134, 110403, -295314, -37382, -139131, 233835, 222925, -359280, -157926, 183404, -299128, 177587, -10450, 151976, 294472, -122697, 371273, -83349, -103779, 61851, -144537, -287708, -186480, 14157, 182759, -62870, 216342, 11848, 391146, 293592, 115931, 152700, -102298, -6597, 43537, -283553, -53377, 273396, -234098, 22575, -123828, -128908, 253802, -264551, -341533, -159360, 283941, 22779, -163104, -100959, 7823, 102569, 169250, 86030, 294563, -202035]
11901A381J29129b28029h6774A31254J15011k3988a27081B71560R4656a36625
11890a23204j7182l50046d3694C1135i4616j94253P8486N4246D08713A99130B8902
11878C0610K02712h0504H8173j0391b1833E5460A7578a35952M3486j09309A41536
11866f6816A35404N6602k7079o4962b72334C35045b7415q1803M7340A27463K55828
11855C83291p9789a3189B03917b60016O222b6514p9621Q091j8100H4122e8872
11843C2679j1664J48596a93725L6901M0665q3773H1349b18869C447Q8944i0491
11831f6942r6655A9012L90710d63481F9661b51021l0936J31660n5001A2940J07014
11820A19954g5259D0975a41704r3862e674A12430a90757I5030L8903b34153D18514
$$ y = [1381, 130510, -228029, -86774, 131254, 246265, 222277, -127081, 271560, 366216, -136625, -123204, -140386, -490432, -43694, 31135, -94616, -288869, -210383, -156137, 408713, 199130, 28902, 30610, 233322, -80504, 88173, 77782, -21833, 55460, 17578, -135952, -92466, -201775, 141536, -66816, 135404, 192006, 164927, 99965, -272334, 335045, -27415, -109218, -61878, 127463, 383291, 303502, -13189, 203917, -260016, -253794, -26514, -106135, -98044, -116144, 84122, -58872, 32679, 21015, 169611, -193725, -156824, -116159, -199932, 81349, -218869, 3447, 92391, -90491, -66942, -163597, 19012, 409722, -463481, 69661, -251021, -281957, -150297, -205298, 12940, 119954, -75259, 40975, -141704, -235566, -5674, 112430, -190757, 95030, 133933, -234153, 418514]
11808I385b04201e6515q1461A96920o6069c8802j46894g9372J3301p366m10162
11797d83599J80215A43226l3255c04135E533b08847A58172g9175k32590H2961
11786a28341l7967F2010a72292A91631n3423A6793K024K19243A3629Q3927a36473
11774g4710B8384O7830J6784a28192O0578B87437a97995J0469A55112J40087a7029
11762I890J00143c44518a0374j14407j25990B67818E1437a40749j86409E1159
11751h425B12473a54954b1982j2617k55955A79066b01210A77725a93374f7347
11740b47641A00208a60599g4516A10125D4447J05586c4708A68917D8680a29890
11729B39521J11785D0937K7204M9351K2068a40244L0505A99762b786A37603b9187
$$ y = [9385, -204201, -56515, -137976, 196920, 130851, -38802, -185696, -79372, -66071, -73437, -483599, -303384, 143226, 109971, -304135, 5533, -208847, 158172, -79175, -311765, 82961, -128341, -166308, 62010, -172292, 191631, 138208, 16793, 18817, 238060, 13629, 97556, -136473, -74710, 28384, 96214, 112998, -128192, -67614, 287437, -197995, -187526, 155112, 295199, -17029, 9890, 110033, -344518, -10374, -124781, -250771, 267818, 51437, -140749, -327158, 51159, -8425, 212473, -154954, -21982, -34599, -290554, 179066, -201210, 177725, -193374, -67347, -247641, 100208, -160599, -74516, 110125, 44447, 150033, -34708, 168917, 48680, -129890, 239521, 351306, 40937, 68141, 117492, 139560, -140244, -109739, 199762, -2786, 137603, -29187]
11717b96508H6876a50865N0385d0029r0582n73A78988e3852B6115M6795A5916
11705A50165P2153A01515i815C6546J5868J4289j2477b28431H1674f2460C13989
11693a14237q5470P6179A05734C7001L12236A09856b13906e3777C05275G031k127
11682D904R7983a1512q4342j07043A2645M6201i0432A34116e2843m3034a8507
11670C1866K56147f9962j99897F3166g5914B68535j19016e7919b4577A00732c46810
11658C25086d9042a1415j10327o692A26134g7141n2524E8777N0012A4242a16872
11646a01134D13222k3308a96875b7834A25983Q4378D2416b4659B41343c3416A13525
11634f3397k8334j5583A41358B8446J84064a57152C86561j50092o5803a55601
$$ y = [-296508, 86876, -150865, -100480, -40029, -130611, -131184, 178988, -53852, 26115, 72910, 15916, 150165, 222318, 101515, -9815, 36546, 52414, 66703, 54226, -228431, 81674, -62460, 313989, -114237, -199707, -123528, 105734, 37001, 349237, 109856, -213906, -53777, 305275, 7031, 4904, 102887, -11512, -95854, -202897, 12645, 58846, -90432, 134116, -52843, -95877, -18507, 31866, 288013, -69962, -269859, 63166, -75914, 268535, 149519, -57919, -24577, 100732, -346810, 325086, -49042, -11415, -121742, -128434, 126134, -77141, -129665, 58777, 108789, 14242, -116872, -101134, 413222, 389914, -196875, -27834, 125983, 210361, 42416, -24659, 241343, -33416, 113525, -63397, -91731, -107314, 141358, 28446, 212510, -157152, 386561, 236469, 170666, -155601]
11623A09247f8009A05699e1916m8411A6886b87237P995a701o4450C0454J54804
11612A85258J10875k7982f961p6004E8677a19564J2845k24431C3102L3872K78485
11601C45459j63310E4249f4916J4005B97432b46645C6320O9265l7126b84214A5759
11589B50032a52452I1256D5564c07659h5288A21129c75164C0326H581J12261a60783
11577A80266j815E2991K74085c8670j31397B06113D0134K71734j54908o8855C409
11565B81994a14672A97295c8818D1424J43203b55059b2643C37236j16105l8604
11555A82527J8404A2503J09459m191a25829E94218i1539J4174k23475A72540i4272
11543A70053J11483E8704B200a82587b082B10724r442b33444F606J19878B0168
$$ y = [109247, -68009, 105699, -51916, -100327, 16886, -287237, -279242, -1701, -66151, 30454, 185258, 296133, 268151, -6961, -82965, 58677, -119564, -106719, -331150, 33102, 66974, 345459, 182149, 54249, -64916, -50911, 297432, -246645, 36320, 105585, 68459, -284214, 15759, 250032, -152452, 91256, 45564, -307659, -85288, 121129, -375164, 30326, 8581, 120842, -160783, 180266, 178451, 52991, 327076, -38670, -170067, 206113, 40134, 311868, 156960, 88105, 3409, 281994, -114672, 197295, -38818, 41424, 184627, -255059, -22643, 337236, 221131, 182527, 200931, 12503, 121962, 117771, -125829, 594218, -91539, -77365, -300840, 172540, -94272, 170053, 281536, 58704, 2200, -182587, -2082, 210724, 201282, -233444, 6606, 126484, 20168]
11531a34511C04242J15326A79976d7635A49835a9525B27802P78a78738N733H1271
11519G8785d5390H0442L32666j87845a99344K4204H2680R2428P430a69023d0241
11507A61334K61040A11210O5538l7314J65570j44827K51407b09130A43548K99719
11497D43267A71291n4161J52815A08947m7934K37325E1056B5248K38885n5286
11487B08847Q0338q9456k247o2707J05890j16620n487b3119k14539A51154J65876
11476C17030j04289M9481A00526f1663C02424j08565H6740a2041B06317e1817
11465C14569A54171b6119A57870f6155C07180k3266a8267A28545c8069B98169
11454g1586A13110a21510I9181J13511M6493j05954E2211a58585O6026C47323
$$ y = [-134511, 304242, 419568, 179976, -47635, 149835, -19525, 227802, 228580, -178738, -173005, 81271, 78785, -45390, 80442, 413108, 225263, -199344, -175140, 82680, 175108, 182538, -169023, -40241, 161334, 422374, 111210, 176748, 139434, 305004, 160177, 411584, -209130, 143548, 443267, 171291, 117130, 269945, 108947, 61013, 298338, 51056, 25248, 264133, 208847, 289185, 199729, 197482, 134775, 240665, 124045, 118558, -23119, -237658, 151154, 317030, 212741, 262222, 100526, -61663, 302424, 193859, 86740, -12041, 206317, -51817, 314569, 154171, -26119, 157870, -66155, 307180, 283914, -18267, 128545, -38069, 298169, -71586, 113110, -121510, 99181, 212692, 259185, 153231, 52211, -158585, -92559, 347323]
11443a51128C38474c32710A2436d8621E17184G4352K11206a4668H4115b4503A29906
11431B08515F2581L6239O4981c5615B44325b1595F1718g3599D73121D113Q0225
11420H4338o496A1356M5032f8379j91061h6002A46816d3114B26863b28658G5038
11408G0457j9082c3470p8965B14048C7522J59562D3683a15685C52992b83216I6456
11396H1956M0283d42322a26470F1017c1318A62147f7594E04614B43298A07285
11385A02884b23140b0375B74155b33172A08603L6469a44685b7586k1608m3564
11375i2758B1114a03721D9704b18163d4536j64132r2095F5914a2532E0731J16067
11364A66798A8322J88466e6194p4182C7170K9619O7746l0558i1967A46334F9847
$$ y = [-151128, 338474, -332710, 12436, -48621, 517184, 74352, 285558, -14668, 84115, -24503, 129906, 208515, 62581, 98820, 163801, -35615, 244325, -21595, 61718, -73599, 473121, 4113, 84338, 77842, 11356, 56388, -68379, -259440, -86002, 146816, -43114, 226863, -228658, 75038, 70457, 51375, -33470, -112435, 214048, 37522, 197084, 43683, -115685, 352992, -283216, 96456, 81956, 122239, -442322, -126470, 61017, -31318, 162147, -67594, 504614, 243298, 107285, 102884, -223140, -20375, 274155, -233172, 108603, 145072, -144685, -27586, -49194, -92758, 21114, -103721, 49704, -218163, -44536, -208668, -300763, 65914, -12532, 50731, 166798, 18322, 206788, -56194, -130376, 37170, 66789, 134535, 103977, -91967, 146334, 69847]
11352b1529o9899A28927b27294P1890B20479a15353L6291j8632J1601a6587g546
11340b59286R8293b3204n749I2744b45477C1201b35045O4111a5605A15176K00776
11329C15952c59237A7498a85270C26641A58503F2636l0717e7440q1965D3439h9802
11317d34540A30089d3169j13145C4376I421a52325q8899J05892A8311b01990R9235
11306a02755k30598a10637j54445D3333a77513P7875R818H7484b2991k7633l06915
11295c57539A30579d1003a175j4843k26569h6207r6246A82918b24861A14803N2417
11284A67220f8818A02540h0594I0352o760b82734A89614a15832j93922C0129J3283
11273D3412a10467M4776m8183q9467D9151J67830M5512B6554d48362c6664o7167
$$ y = [-21529, -91428, 128927, -227294, -155404, 220479, -115353, -79062, -97694, -86093, -16587, -7546, -259286, -160993, -23204, -28953, 92744, -245477, 31201, -235045, -170934, -15605, 115176, 315952, -359237, 17498, -185270, 326641, 158503, 62636, 31919, -57440, -139405, 43439, -89802, -434540, 130089, -43169, -156314, 34376, 9421, -152325, -241224, -135332, 18311, -201990, -102755, -333353, -110637, -265082, 43333, -177513, -99638, -89820, 87484, -22991, -50624, -357539, 130579, -41003, -1175, -16018, -242587, -86207, -182453, 182918, -224861, 114803, 167220, -68818, 102540, -80594, 90352, 83592, -282734, 189614, -115832, -309754, 30129, 43412, -110467, -65691, -113874, -203341, 49151, 216981, 262493, 26554, -448362, -36664, -103831]
11262a03831I6352j8704I848J4050L7658h1907b0486O310D2684d95986A92082
11250a4153B85049a92327d3603A54334J02198b26654a8782D70786A52820a17774
11239h3326k46790A41451a58218A72162p0279a26717J1649k0419k7514A1831a78340
11227c23464b2044C33479a65029k25190a49388L149G0083M3670a50603A55246
11216A20348c58794F886K01429b4441j25023g4637l65910N7284A85847J64416
11206C50263g6035q0327A34833B1735i0573h788k72397f3343J6320j38267i1649
11194A09040b32692P4968d4714j66534i3859B26054c5894j12391K3406j41350
11184b66229b2151B0059R979d30043H8560a90684d8845j25845H4878J48938b5175
$$ y = [-103831, 96352, 77648, 9848, 23898, 61556, -81907, -20486, -14176, 42684, -495986, 192082, -14153, 285049, -192327, -43603, 154334, 256532, -226654, -18782, 470786, 152820, -117774, -83326, -330116, 141451, -158218, 172162, 101883, -126717, -115068, -135487, -163001, 11831, -178340, -323464, -22044, 333479, -165029, -390219, -149388, -146239, 70083, 113753, -150603, 155246, 120348, -358794, 6886, 208315, -24441, -149464, -74637, -440547, -383263, 185847, 350263, -76035, -156362, 134833, 21735, -90573, -8788, -281185, -63343, -47023, -185290, -91649, 109040, -232692, -157724, -44714, -211248, -93859, 226054, -35894, -148285, -124879, -266229, -22151, 20059, 30038, -430043, 88560, -190684, -48845, -174690, 84878, 233816, -25175]
11172b01725C6964I784N1292R3762R3375a22451C3936J25423b19813A41943c8635
11160a44078E9081K205B5808J01897a66196F5756c21891N0943c0358e039k10858
11149b15897C06864b0142h891A57780F8773D868M57K33810K5936a62865f6145
11137B4531a09526b1554D6266g1772K2272F1911g1433j874A00764J36839a6341
11125A11317b32776j7946e9269A33150e5950A32853J74301G4927e4921B93129
11114B26646K09787n8335a81434i578C97011b66859B66354H7092a2793j16517
11104a29310A55849e2516F3993J21771h9582A70770M2693i6964n7613L9815J3636
11093a01126D8223K5232e9468A17929J07934j6442J42248r7462A00802b9289C53511
$$ y = [-201725, 36964, 9784, 61076, 154838, 248213, -122451, 33936, 159359, -219813, 141943, -38635, -144078, 59081, 61286, 25808, 127705, -166196, 65756, -321891, -270948, -30358, -5039, -215897, 306864, -20142, -8891, 157780, 68773, 4868, 5325, 239135, 265071, -162865, -66145, 24531, -109526, -21554, 46266, -71772, -49500, 61911, -71433, -73307, 100764, 237603, -16341, 111317, -232776, -250722, -59269, 133150, -55950, 132853, 307154, 74927, -54921, 293129, 226646, 436433, 378098, -181434, -9578, 397011, -266859, 266354, 87092, -12793, -129310, 155849, -52516, 63993, 185764, -89582, 170770, 213463, -96964, -154577, -114762, -101126, 48223, 73455, -59468, 117929, 225863, 209421, 351669, 254207, 100802, -29289, 353511]
11081d8657C25145A8422L10731A30843a31802A14072c4849D44547h5898d232B40772
11069D78318A43833K53488a3170B19365K4514I247J06133J56518J85784j56358
11059C01324K3623G678L42551O5056P3600J87532C05806N6348j72235n6064M31210
11048E65065k39492O7030M9166j91767K66806n363r6197J11387J56476n7349N7052
11037F82814r2446O0867j89206k8076K47066J74199K09195j90003j35931K19590
11027I58069k92877Q8396J31566J40228l03775J33358j07205N3987j20151k45959
11017D35637J5156M5626J50525j17883Q3129J43233J20441k78508L03905k79160
11007F22101K74566J22524L4474l64862j9708o1960o1070M4229q9273K98545A71472
$$ y = [-48657, 325145, 18422, 329153, 130843, -131802, 114072, -34849, 444547, -85898, -4232, 240772, 478318, 143833, 397321, -13170, 219365, 243879, 9247, 115380, 271898, 457682, 301324, 324947, 7678, 350229, 415285, 488885, 676417, 305806, 362154, 189919, 133855, 565065, 325573, 392603, 441769, 250002, 516808, 511445, 415248, 526635, 683111, 625762, 682814, 590368, 651235, 462029, 433953, 681019, 855218, 1064413, 874410, 738479, 958069, 665192, 753588, 885154, 1025382, 721607, 854965, 747760, 801747, 681596, 435637, 450793, 496419, 646944, 529061, 612190, 755423, 875864, 597356, 901261, 622101, 896667, 1019191, 1053665, 688803, 669095, 607135, 546065, 590294, 501021, 799566, 171472]
10995E77343J79742k86723L64666J30824l49378J16585j60679J05811R5171j28069
10985F45293q3366K02562P0191n6529k29830M5531K17691j32296M08348l63835
10975G23760j52273K57138P1503J0339j78769L62852k21283L72945k40836K10749
10965A216125j75015J68014L37050J44255L9108M21836J8873L00940N19719o380
10955B984525j61420l20951M2202j93891k21415n10342J93088p8998M59654n48705
10945A643747L073k37922J5767K62015Q8975k54835q1968m02542j47302o2232
10935H26776R5447k4295D00062J19982r8077H7640J37513K86148j60601qA08473
10923A30759K43097M9151A03725L14036A06486N110J27000G8186K14796i0H5854
$$ y = [577343, 757085, 470362, 835028, 965852, 616474, 733059, 572380, 678191, 773362, 645293, 561927, 764489, 834680, 778151, 548321, 593852, 811543, 679247, 1087595, 723760, 571487, 828625, 900128, 910467, 731698, 1094550, 873267, 1246212, 1005376, 1216125, 1041110, 1209124, 1546174, 1690429, 1729537, 2151373, 2170246, 2471186, 2990905, 2984525, 2823105, 2502154, 2544356, 2350465, 2129050, 1618708, 1811796, 1732798, 2192452, 1643747, 1646820, 1408898, 1424665, 1686680, 1775655, 1520820, 1438852, 1036310, 889008, 826776, 922223, 897928, 400062, 520044, 421967, 87640, 225153, 511301, 350700, 350692, 108473, 130759, 373856, 423007, 103725, 417761, 106486, 111596, 238596, 78186, 292982, -90, 85854]
10911a77978B4842N1388a2525B53567j03239m9447g835A03072a01080A12306c10446
10899b53158N2187A33582a00901K8799B87155b4136k6173A23197k2821M7842O7438
10888B15656F7050B7568L33328c29327J08984A15173c3268k02870i584D1529e7470
10876B56717I7925d0049k91142Q3616d5496j87384Q6026C3682J36882F5874d5508
10864g479E0212R0811r581L2120b964l15531c7065J964k5504r4360D8817a92980
10851b02840A49417A8087c73676a01036A20419K41882a21759B0240b94095J29181
10841a64914B2599Q3692J03931l2604L1669d6954C492i6425D6886b16609e2493
10829a4104K835A0775O5075a81651j8186E4737J10574K009A0852b08020f9706
$$ y = [-177978, 24842, 76230, -12525, 253567, 150328, 100881, -7835, 103072, -101080, 112306, -310446, -253158, -200971, 133582, -100901, -72102, 287155, -24136, -50309, 123197, 100376, 148218, 215656, 67050, 27568, 360896, -329327, -220343, 115173, -33268, -236138, -9584, 41529, -57470, 256717, 97925, -40049, -331191, -247575, -45496, -232880, -146854, 33682, 170564, 65874, -45508, -7479, 50212, 141023, 131442, 163562, -2964, -318495, -37065, -35101, -60605, -154965, 48817, -192980, -202840, 149417, 18087, -373676, -101036, 120419, 362301, -121759, 20240, -294095, -164914, 22599, 106291, 210222, 177618, 209287, -46954, 3492, -96425, 46886, -216609, -52493, -14104, -11269, 10775, 75850, -181651, -199837, 54737, 165311, 167320, 10852, -208020, -69706]
10817a0301H9074c04643J06593E0098a42786A88784b19355f6083A66998b49203
10806D1105a15343a105F9296l0750Q1415J243b65663i2171q6693a774C4191M19716
10794D53907a02149A35565o6458K53311b77765b297n1745D1076d0641l7629a4868
10782f1647k87228B52650a07269A63621D9691J57098A5776f3893j25865B77450
10771B26893k8505q337c8950l826A81420a91019l05R5334b4477j93067b4883B91911
10758d3206B40773C0051b34901c3565A4972Q0285b08228L3386A65719b26160C7008
10746a08647A06908J0936L1323c20203a29899A09517k4510c1693C805J2376c5480
10734A4922h0782l6606O410B92741c8442A89681F1533b12979M9757E0688a12982
$$ y = [-10301, 89074, -304643, -198050, 50098, -142786, 188784, -219355, -66083, 166998, -249203, 41105, -115343, -1105, 69296, 38546, 119961, 121204, -265663, -92171, -178864, -1774, 34191, 453907, -102149, 135565, 69107, 322418, -277765, -2297, -54042, 41076, -40641, -78270, -14868, -61647, -348875, 252650, -107269, 163621, 49691, 206789, 15776, -63893, -189758, 277450, 226893, 198388, 190051, -38950, -42776, 181420, -191019, -191324, -95990, -24477, -217544, -24883, 291911, -43206, 240773, 30051, -234901, -33565, 14972, 95257, -208228, -174842, 165719, -226160, 37008, -108647, 106908, 117844, 149167, -320203, -129899, 109517, 85007, -31693, 3805, 16181, -35480, 14922, -80782, -117388, -110978, 292741, -38442, 189681, 61533, -212979, -163222, 50688, -112982]
10722B25085a88067B43351b81695m5276J24753e0854A00413a9508j49069p6343
10712b44920P1166j87464a34001k67483B01309b4801q8012R170d2951a5943k73878
10701b89821h699j20268r0613B98829a02591A3386a60039B10107a61675e7667
10690b30729J10624I0723a01639J3665b4151k8753H5040a39047D8683O3178c5177
10678a81549d7736D03853b55794b6278k2977q7726m27482A53206a14259k1400
10668a35659A49790d9228k13858A9051a91750b4053k11218i7233B1871a60043
10657A70047M6086D2373a0327B6951c54462d6965r7047G0826h961G1920i0330
10645A94896p1442E5093h8109k1668A66004a25330k15711J16547d4275h604k8241
$$ y = [225085, -188067, 243351, -281695, -326971, -202218, -50854, 100413, -19508, -168577, -244920, -173754, -361218, -134001, -401484, 201309, -24801, -112813, -103643, -42951, -15943, -289821, -8699, -128967, -219580, 298829, -102591, 13386, -160039, 210107, -161675, -57667, -230729, -120105, 90723, -101639, -87974, -24151, -52904, 85040, -139047, 48683, 111861, -35177, -181549, -47736, 403853, -255794, -26278, -49255, -136981, -564463, 153206, -114259, -135659, 149790, -49228, -263086, 19051, -191750, -24053, -235271, -97233, 21871, -160043, 170047, 216133, 42373, -10327, 26951, -354462, -46965, -144012, 70826, -8961, 71920, -90330, 194896, 123454, 55093, -88109, -109777, 166004, -125330, -341041, -224494, -44275, -8604, -36845]
10634c6845B31766a77478q9215L9603B6342Q5510a45938K9241j39311j11027B73350
10622G2680a93133j70606A78500o1917b00982i4854j70131f7234k42588j37563
10612d47385A6035N4376A9431a69483b1882L30E4545e3794j91510A44525b6619
10600a98825A23849c5057l41724A33918E6346J56793b50885h1103A8555a800j99559
10589b01359B45042a05037k49840a66102d7023l1798o89L0898n8562r3354f4144
10577A23973a35735B13962p8811a04505A98639C9325K48938j18036m3533b32944
10566e9832n882A65879M8034a38641e0792R616q1204j21133a0438k4002k55075
10555b89515n2652a25297A91225a04124F5380O0107G762b4571o20m7256F3658
$$ y = [-36845, 231766, -177478, -266693, -227090, 26342, 111852, -145938, -116697, -256008, -367035, 273350, 72680, -193133, -363739, 178500, 116583, -200982, -94854, -264985, -67234, -309822, -447385, 16035, 70411, 19431, -169483, -21882, -21552, 54545, -53794, -245304, 144525, -26619, -198825, 123849, -35057, -376781, 133918, 56346, 213139, -250885, -81103, 18555, -1800, -201359, 245042, -105037, -354877, -166102, -47023, -78821, -79510, -48612, -107174, -200528, -64144, 123973, -135735, 213962, 135151, -104505, 198639, 39325, 288263, 170227, 126694, -232944, -59832, -65714, 165879, 213913, -138641, -50792, -41176, -122380, -243513, -10438, -34440, -289515, -342167, -125297, 191225, -104124, 65380, 125487, 7762, -24571, -25191, -72447, 63658]
10543B04743c32001G7093J56403F5398K839e32077e2351j33685e8735b0323r9215
10532a19538C129b53242e7472A05125c08880c8855A49140a59911h444C3745b70015
10520C3660c46546e0076B56094I5128M240h0894L2172j92799G6558E532O1138
10509F6670O5703Q752H778a99298b943j66485o7155D82186a71530A6038a20374
10497C51016a0423j65512A46010a10672G6362b16976j6062C5248J3943e9612k38378
10486b97990d4334p8711j53037a22964C19965c51025A46126d8852k84903j16320
10476d50075J68311A85349a43407C096J84513a95111M314A48666C5360J39556
10466A74916J50576J77438O1440k60379E2914K08217a56696A16508c8312k3197
$$ y = [204743, -332001, 77093, 233496, 65398, 68237, -532077, -52351, -186036, -58735, -20323, -119538, 3129, -253242, -57472, 105125, -308880, -38855, 149140, -159911, -8444, 33745, -270015, 33660, -346546, -50076, 256094, 95128, 99368, -80894, -48722, -241521, 76558, 5532, 66670, 132373, 141125, 8778, -199298, -2943, -169428, -236583, 482186, -171530, 16038, -120374, 351016, -10423, -175935, 146010, -110672, 76362, -216976, -233038, 35248, 49191, -59612, -297990, -44334, -123045, -276082, -122964, 319965, -351025, 146126, -48852, -333755, -450075, -281764, 185349, -143407, 3096, 187609, -195111, -190797, 148666, 35360, 174916, 325492, 502930, 564370, 303991, 52914, 261131, -156696, 116508, -38312, -61509]
10456f1509l39947e98p287p1688l7634a6890k477C04704a80809J7746E2979K6462
10444G9441C6962a72353f0868m6205d052B59395r9147n7006M6598d4841j14744
10433a59585E0567b75545A0956K04139b39846A08398a51789d488A09683a06218
10422i9530G6309a06280A30882a92405l9115G5700P5202b27530b9629M646C4063
10410c7520C2915a48448B25498c71131i0608I6779J34115o2869a56526C15720
10399f97j40158e7520A89255p0522b09797B04526C0068a30726e6783j0531K9295
10388c8019c86m0236B5615i4388C84256A38656J98775b33486f7714Q364H5592
10376A3647J16908g0473C34589J11541A31185j3612J77078J8130o8006o4154l7780
$$ y = [-61509, -401456, -598, -7885, -79573, -117207, -16890, -19367, 304704, -180809, -163063, 52979, 79441, 36962, -172353, -60868, -107073, -4052, 259395, 160248, 103242, 149840, -44841, -159585, 50567, -275545, 10956, 215095, -239846, 108398, -151789, -4488, 109683, -106218, -99530, 76309, -106280, 130882, -192405, -231520, 75700, 150902, -227530, -29629, -24983, 34063, -37520, 32915, -148448, 225498, -371131, -90608, 96779, 230894, 168025, -156526, 315720, -697, -140855, -57520, 189255, 118733, -209797, 204526, 30068, -130726, -56783, -67314, -38019, -386, -40622, 25615, -94388, 384256, 138656, 337431, -233486, -67714, -59350, 85592, 13647, 130555, -70473, 334589, 446130, 131185, 117573, 294651, 312781, 244775, 180621, 142841]
10365A42841D2818L54171j67945E7168O7397L18891J88650j03116A74723J25856
10355C00579j09012K57376A97736N96748l02819A03053J07236k318f8184C41763
10344D87743p6933j92716r7520c6996j87124C46360K64760j34969J69492B35345
10333C78401N0745A38596N3891p5492L66286B02834N46348E2144K90447p4629
10323B67962J39691q4062A24878b7063I2543K71884A32715m2054J34703A08851
10312C82303j10896o0247e7849H6242L77771j21872A02025K03581L22840B25619
10301C92846C4517K44158j32074J98127h2345D53846A66031B7892c15007G129
10290f6436C4313M7695j5614m334R5055g3561l1475A01842b85606B13647f5428
$$ y = [142841, 42818, 396989, 229044, 57168, 124565, 443456, 632106, 528990, 174723, 300579, 191567, 448943, 197736, 794484, 491665, 103053, 210289, 207971, -68184, 341763, 487743, 410810, 218094, 120574, -36996, -224120, 346360, 611120, 476151, 645643, 235345, 378401, 429146, 138596, 192487, 116995, 483281, 202834, 749182, 52144, 342591, 267962, 407653, 323591, 124878, -27063, 92543, 364427, 132715, 90661, 225364, 108851, 382303, 271407, 211160, -57849, 86242, 464013, 342141, 102025, 305606, 628446, 225619, 392846, 34517, 278675, 146601, 344728, -82345, 453846, 166031, 27892, -315007, 7129, -66436, 34313, 82008, 66394, 62060, 157115, -73561, -105036, 101842, -285606, 213647, -65428]
10278A2738N4629J2558f645n3319A42784c58383A38010g921l6219n1471n2354
10267a47965F3421a65211I4284b17072C5496L64467H3163b6021B4901J00172K0689
10256A45762n7640l8686b33950A70819o7825m5577b0194A77492j961q3677e237
10244B5298K32435J21633g408A63024J71210h4320C2762L41816a51137A84573
10233b00514q3779B1994J26279H512P0042B6075c14934a24518q5620A41060J44578
10222B85638f579j46065N7193j64380l9807B24867d2115C95059a73467B28403
10211a43848j02650C1726J50749a56401I3433d857n8549J8114A35185c16739a54550
10199h6835r7002g7316O709L2819o1235N867J3659G886b25168R7862A7928c71250
$$ y = [12738, 67367, 79925, -6645, -59964, 142784, -358383, 138010, -7921, -44140, -95611, -147965, 63421, -165211, 94284, -217072, 35496, 399963, 83163, -26021, 24901, 125073, 145762, 88122, 49436, -233950, 170819, 102994, 57417, -20194, 177492, 175531, 91854, -5237, 25298, 257733, 379366, -7408, 163024, 334234, -84320, 32762, 374578, -151137, 184573, -200514, -284293, 21994, 148273, 8512, 78554, 26075, -314934, -124518, -210138, 141060, 285638, -6579, -152644, -95451, -259831, -299638, 224867, -42115, 395059, -173467, 228403, -143848, -246498, 31726, 182475, -156401, 93433, -4857, -63406, -45292, 135185, -316739, -154550, -86835, -183837, -77316, -70607, -37788, -99023, -93156, -79497, 7886, -225168, -127306, 17928, -371250]
10186d05462a72065B10094g1780j25471A07284b49750E1466g803A3521i1038j12773
10175b03811Q5237M3860k56801E669a55527o5458J03909p977A03117h4924n9405
10164a44329G605b13021B6878K07681o9718Q2222a68959j45575d8815j42479C3980
10152a59670A02476a11217G5356k4575M6805a19702j82591J26872j44905A75709
10141B11433K3946a72341C4486b06980J02825D5447J21150d869q6477J1715A01774
10129a97417L8065B62014j25317b37875a05287A86216G997a49727C7906b15387
10118a25171N1400c046H5051d1341j47973K6972o0033i5126a2805k61495f1387
10106a63435E5852c13958a4179j16532E084e5352F3193b19036K1020A6128a98937
$$ y = [-405462, -172065, 210094, -71780, -197251, 107284, -249750, 51466, -7803, 13521, -91038, -203811, -118574, -74714, -331515, 5669, -155527, -220985, -117076, -125053, 103117, -84924, -144329, 7605, -213021, 26878, 234559, 164841, 247063, -168959, -314534, -48815, -191294, 33980, -159670, 102476, -111217, 75356, 50781, 97586, -119702, -302293, -175421, -320326, 175709, 211433, 235379, -172341, 34486, -206980, -104155, 45447, 166597, -4869, -91346, -79631, 101774, -197417, -159352, 262014, 136697, -237875, -105287, 186216, 7997, -149727, 37906, -215387, -125171, -73771, -3046, 85051, -41341, -189314, -162342, -222375, -95126, -12805, -274300, -61387, -163435, 55852, -313958, -14179, -130711, 5084, -55352, 63193, -219036, -198016, 16128, -198937]
10094a68355A5399a31860A18373l9442a9251j72367o1892h8881G812b9311j49116
10083a78427B57257g2126j43505l4472b7652h109o8179k26950J38905D5347b00282
10071a81176g1305j40352g8255C7129H76a68771e842B51512p4109l4864b64541
10059d0764l6755J0424b5116l6760B09566A04004M4400a12130j22172C17736F2664
10047H0377h7591m7265M1760A1716L19783C6897i8504A88301B6482d09409C46964
10035G2137e7957K1469k65432A3843O0011a6162c401q9291F8058K5475a10024
10023a60873N6456A36722b35567D9404h0122F0638c33767a39129o2749b8349j57987
10012a86336d2058k14820P6373b3515k17384A01553b0037G3184f6215B79301a29062
$$ y = [-168355, 15399, -131860, 118373, 78931, -19251, -191618, -253510, -88881, 7812, -29311, -178427, 257257, -72126, -215631, -250103, -27652, -8109, -76288, -303238, -164333, 45347, -200282, -181176, -71305, -211657, -78255, 37129, 876, -168771, -5842, 251512, 177403, 142539, -264541, -40764, -77519, -67095, -25116, -61876, 209566, 104004, 148404, -112130, -234302, 317736, 62664, 80377, -87591, -134856, -93096, 11716, 331499, 36897, -98504, 188301, 26482, -409409, 346964, 72137, -57957, -36488, -301920, 13843, 73854, -16162, -3401, -92692, 68058, 93533, -110024, -160873, -104417, 136722, -235567, 49404, -80122, 60638, -333767, -139129, -201878, -28349, -186336, -42058, -256878, -180505, -23515, -240899, 101553, -20037, 73184, -66215, 279301, -129062]
10000b03040E2257B6100K37817k3907G0696g5001k3581J9444G5060a25626l9230
9989a64856r8502a10568j13219i8494j45381E4519c22482a4505m02413F6660a11409
9977g1378n5014J1K0625I2735a93215b7177k0070a8260p5647g305j56667a6648
9964b21086B52852b02322o1788A35078K4349K6895h5603A35041E2954Q7450m6853
9953I3551e02C4362f0690k35590a39330d1490l35766e3557p59a9635j50031N130
9941a64536f9484B9244a26175E6503L3129a53433B96679b90040I8771a73317G2111
9929b06611e0727j70653A09478c6862F2940b94642B78915m5094C0746a3039j66542
9918a79581h4106j82945h350E7724a85218A98576p3757a81118J990j23618C1253
$$ y = [-203040, 52257, 26100, 263917, 240010, 70696, -75001, -98582, -79138, 75060, -125626, -164856, -263358, -110568, -223787, -98494, -243875, 54519, -322482, -14505, -416918, 66660, -111409, -71378, -126392, -126381, -105756, 92735, -193215, -27177, -47247, -18260, -93907, -7305, -163972, -16648, -221086, 252852, -202322, -264110, 135078, 159427, 186322, -85603, 135041, 52954, 140404, 93551, -502, 34362, -60690, -296280, -139330, -41490, -377256, -53557, -54316, -19635, -169666, -164536, -69484, 29244, -126175, 56503, 89632, -153433, 296679, -290040, 98771, -173317, 72111, -206611, -50727, -221380, 109478, -36862, 62940, -294642, 278915, 233821, 30746, -13039, -179581, -84106, -267051, -8350, 57724, -185218, 198576, 124819, -181118, -179128, -302746, 31253]
9906B13816a25788J6030e248l8040l7684A34008a04363I6810B7533b10881i9513
9894b213l23767J57333j87507A24195e6545A58208a3653D5592L6514a78872G4843
9882g5330o8294O1564b5495q9494r2379g0530o5838j0741K8125A52920M4119n5929
9870A41110a14810A11862E496a86774h1389c4710k10591e6151r1055c0467A97212
9858E4685a58125j07908C8718c04613A79708a29833A27014a09431j31809A32637
9847C953b46939q8024F5483P6537J51177a54011a4334a012C35800d9044k27625
9836b76669d9936A60834a7910o9957A53805a19005c846J02l81231b4372A1758
9824b72309A48098A027f3770f967k81667a07194b1375j9154i484E6480b73969
$$ y = [213816, -125788, -109758, -5248, -43288, -80972, 134008, -104363, 96810, 27533, -210881, -99513, -2213, -325980, -168647, -356154, 124195, -56545, 158208, -13653, 45592, 82106, -178872, 74843, -75330, -143624, -82060, -25495, -114989, -207368, -70530, -136368, -147109, -118984, 152920, 197039, 141110, -114810, 111862, 5496, -186774, -81389, -34710, -245301, -56151, -147206, -30467, 197212, 54685, -158125, -266033, 38718, -304613, 179708, -129833, 127014, -109431, -241240, 132637, 3953, -246939, -334963, 65483, 142020, 293197, -154011, -14334, -1012, 335800, -49044, -276669, -49936, 160834, -17910, -87867, 153805, -119005, -3846, -3744, -384975, -24372, 11758, -272309, 148098, 1027, -63770, -6967, -288634, -107194, -21375, -40529, -9484, 56480, -273969]
9812a25055j26648r666Q8345k13912a32206m001K921k95491J57849f2073A24184
9800a63688A58416o4417l0926c3298l26898a21135G7454a36726j0627D5262b66677
9788i8945c7527o8408k67289p9849c4477m1649B21202b48374C3092o414a12828
9776D8603I995J91968I5433A935h1926G4878a01843A55501g625B4321c35292M1683
9764b93609a31663O2157F7947J23982d0865k31672J28408C23296A57270b04338
9753a99600g4049D3212f7305A27921A5659b20278d7413j48270c1611L442C8597
9741a60981k57628F8951a5284B55065b97810a0193F3164c82165J70694d8598p6594
9730a25192L4402k4031e2548B2138d8480n8369G9257J358b51358J8106f7531G5139
$$ y = [-125055, -251703, -261369, -173024, -386936, -132206, -136207, -133286, -428777, -270928, -62073, 124184, -163688, 158416, 93999, 63073, -33298, -360196, -121135, 77454, -136726, -147353, 45262, -266677, -98945, -37527, -105935, -373224, -453073, -34477, -76126, 221202, -248374, 33092, 26678, -112828, 48603, 9995, 201963, 95433, 1935, -81926, 74878, -101843, 155501, -7625, 24321, -335292, -293609, -131663, -69506, 67947, 191929, -40865, -272537, -144129, 323296, 157270, -204338, -199600, -74049, 43212, -67305, 127921, 15659, -220278, -47413, -195683, -31611, -28169, 38597, -160981, -418609, 68951, -15284, 255065, -297810, -10193, 63164, -382165, -211471, -48598, -125192, -90790, -114821, -52548, 22138, -48480, -106849, 79257, 80615, -251358, -233252, -67531, 75139]
9717g6145D2598i0232a4029e842q8908j00548E0736d9273j52126A03744b36999
9705B58009e53316a71396b2954A62064a60269B35227q1760J5683a52687H3444
9694C2332g988m5327A4685d87980C7748e7556n2725A65691b2428j08613d2276
9682c14184h312j82337h2390l3519k00939F2496a1453F4833a66898A91733b24970
9670b11737A19003e6241j09299j4669O9751C38766a91579j3627A21295d3268A02098
9658b98058A56619b0162k47096g730k52284a25302G6527P1020c5274j44489j06281
9647b86044f4326j17077G1023c9099j63904b4744C866f9854j36356I2344i3917
9635G6444b34519d5481l57096g3203H9747a47067A28345E382a12302L7392k15088
$$ y = [-76145, 42598, -90232, -14029, -5842, -94750, -195298, 50736, -49273, -201399, 103744, -236999, 258009, -553316, -171396, -22954, 162064, -160269, 235227, 153467, 169150, -152687, 83444, 32332, -7988, -53315, 14685, -487980, 37748, -57556, -110281, 165691, -22428, -131041, -42276, -314184, -8312, -190649, -82390, -115909, -316848, 62496, -11453, 64833, -166898, 191733, -224970, -211737, 119003, -56241, -165540, -180209, -110458, 338766, -191579, -205206, 121295, -43268, 102098, -298058, 156619, -20162, -267258, -7730, -260014, -125302, 76527, 147547, -35274, -179763, -286044, -64326, -181403, 71023, -39099, -203003, -24744, 3866, -69854, -206210, 92344, -93917, 76444, -234519, -45481, -402577, -73203, 89747, -147067, 128345, 5382, -112302, -74910, -289998]
9624b89998i4907C25409A19785a35876D0444e2879l4148B10925a71462j37209
9614c08671C04253b01941M4284P4439F4767K2435O065a01286l99264a66647q295
9603a74942A41877e9024A07018a7197o7502B4117R1090c22680a0405l2968j43818
9592a87191g1680B14388b82905a1796j6874m55054a58321j35730G0976O6469m5189
9581I2256g1987H2074a06544A69894c45713a3071A68296B0126O1165h3280H7678
9569I961a26201c4330B3183K53495b3611D1368a18840m0353F4461b77117e7106
9557d0225F443a40617E7823b37331c3125A6523K41283j15919e1456j29611n216
9546a86283H8325A5474N839b1654B12872K7323I910a51685A19360a53138A17302
$$ y = [-289998, -94907, 325409, 119785, -135876, 40444, -52879, -87027, 210925, -171462, -308671, 304253, -201941, -157657, -83218, 64767, 87202, 93267, -101286, -500550, -166647, -174942, 141877, -59024, 107018, -17197, -84699, 24117, 115207, -322680, -10405, -43373, -187191, -71680, 214388, -282905, -11796, -28670, -483724, -158321, -294051, 70976, 137445, 92256, -71987, 82074, -106544, 169894, -345713, -13071, 168296, 20126, 81291, -83280, 87678, 9961, -126201, -34330, 23183, 276678, -23611, 41368, -118840, -159193, 64461, -277117, -57106, -40225, 6443, -140617, 57823, -237331, -33125, 16523, 257806, 141887, -51456, -181067, -186283, 88325, 15474, 21313, -21654, 212872, 240195, 9910, -151685, 119360, -153138, 117302]
9534a40323A58005b86845a4573j26229g852C49314F4918a75754F833d24560n1257
9523d75817g4480M688G6749N6409i1771j53886a1207D405N3032a66737p927A43406
9510a11442B75247a21861j54112A87515a57390p6241A84066a23844j22998a08869
9499b55664B4657h1476j10893j04791B58222e4241E8605a98648q8286E9922M9863
9488A09785K646e10j16339E7637g0319I6101h121C00179g4457J9250q0905n8494
9476a94606R3377p2875b0048p0039A98173e1139j06936L9716D5371m584e3589
9464c37115F1255K73725D6480a17121q0767H7739P6973q1272C4347e7477A52876
9452a25264j35569c5452p1306L7138C7200a50304k51576a45075p2599E4835k301
$$ y = [-140323, 158005, -286845, -14573, -140802, -7852, 349314, 64918, -175754, 6833, -424560, -475817, -74480, -69792, 76749, 133158, -91771, -245657, -11207, 4405, 57437, -166737, -174664, 143406, -111442, 275247, -121861, -275973, 187515, -157390, -233631, 184066, -123844, -246842, -108869, -255664, 24657, -81476, -192369, -297160, 258222, -54241, 58605, -198648, -286934, 59922, 109785, 112431, -510, -116849, 57637, -70319, 96101, -8121, 300179, -74457, -55207, -136112, -194606, -101229, -174104, -20048, -90087, 198173, -51139, -158075, -118359, 45371, 40787, -53589, -337115, 61255, 334980, 46480, -117121, -197888, 87739, 164712, 83440, 34347, -57477, 152876, -125264, -260833, -35452, -106758, -69620, 37200, -150304, -401880, -145075, -217674, 54835, 52534]
9441E2534J67137a02812B9645e1143j0964C4053f1072j5669j8167B8941J48902
9430A77843a7456I108J34481e2035C6570J73827c08371C3782J24837a90062m7744
9419b37806f7948k919b9241C5805J7950f0655k97475A2755c02253R294O0218H6335
9406A7364M8051L27746d859l21565i1968p0386j47827Q2842A76302b2325E6676
9394h24B22539a57957n3026P7840M3291C3225h1432j03336n6808b2131j17288
9383a39419F5959n116b47071C2260a91741K2640p7686L4830R3140A92382a89764
9371e7470j09269D4709b53538i6258E1874a92804O2067j9877r6610B05787b5744
9359I8911a0090j10335b5958j4022r8017D4136J41806b4960G2907A8150M020a31706
$$ y = [52534, 219671, -102812, 29645, -51143, -62107, 34053, -61072, -76741, -94908, 28941, 177843, -17456, 9108, 143589, -52035, 36570, 210397, -308371, 33782, 158619, -190062, -237806, -67948, -70867, -29241, 35805, 53755, -60655, -358130, 12755, -302253, -292959, -232741, 86335, 17364, 65415, 393161, -4859, -326424, -91968, -162354, -310181, -227339, 176302, -22325, 56676, -824, 222539, -157957, -210983, -133143, -89852, 33225, -81432, -184768, -241576, -22131, -139419, 65959, 60843, -247071, 32260, -191741, -169101, -246787, -211957, -118817, 192382, -189764, -57470, -166739, 44709, -253538, -96258, 51874, -192804, -130737, -150614, -247224, 205787, -25744, 98911, -10090, -120425, -25958, -39980, -137997, 44136, 185942, -24960, 72907, 18150, 22170, -131706]
9346A08870a26819F0421P2179I874e1461l2646A93951k7815c3993j20399k00213
9335c54605A77049G0485f5616K9210B09404g940j13270D24302G6280a56224A8869
9323C0305e8083q0291E4649c2019A35509F78d239l22378i6655B52348A23338M6211
9311A69549b45412A665a86390B86363d6130l82644a73464C6582d6091A07103a68385
9299A2676h0773p8837h43B1326i8084A74926a07498C6132b42218I9578J9675J03189
9287B22442i4381d0266B24037a30450B48023a2595C7066b78720J37539M9209a1105
9275I9812c93793Q9753R402O08L2787H3319a06174I5864c2248A6312h1050P49
9263h0301l76072h7270L2373L535n9452j56769A29229m6621P1177o3936J18427
$$ y = [108870, -126819, 60421, 132600, 9874, -51461, -84107, 193951, 166136, -33993, -154392, -354605, 177049, 70485, -65616, -36406, 209404, -7940, -121210, 424302, 76280, -156224, 18869, 30305, -58083, -138374, 54649, -32019, 135509, 678, -4239, -326617, -96655, 252348, 123338, 169549, -245412, 1665, -186390, 286363, -46130, -428774, -173464, 36582, -46091, 107103, -168385, 12676, -80773, -159610, -843, 21326, -98084, 174926, -107498, 36132, -242218, 99578, 119253, 222442, -94381, -40266, 224037, -130450, 248023, -12595, 37066, -278720, -141181, -91972, -11105, 99812, -393793, -304040, -294638, -294030, -261243, 83319, -106174, 95864, -32248, 16312, -81050, -80301, -456373, -87270, -54897, -51362, -110814, -267583, 129229, 82608, 153785, 89849, 208276]
9252B08276F2050J69119a15591n3612k9317i3371a8610p428j51956J3898A9606
9240A96449F2568j3685a01884b0716D9191J20875b21350B4532e1398H3437J00627
9229A84064h0944F6449a04791A62761a72045c6043j39938G0295a74798P6799D5621
9217h5140G2485a45454g1671p9025a8546j6556j48895M5065A65178a7367j15636
9206a33003q2063F6694i840A64534p6989h6522n7179A281f6125j92790h4129r2817
9194a76946k4629n2540e0573B55224h9080m6955f4794a7259j69390A94170E8178
9182d2514r7202k65511a23174A80205h216k196C5493K19436a02385R269H6878
9170B8072K09814j02531c74500Q8486f2384l11147c8423B88558c56894a53732
$$ y = [208276, 62050, 231169, -115591, -169203, -198520, -93371, -18610, -26038, -177994, -164096, 19606, 196449, 62568, 48883, -101884, -20716, 49191, 170066, -221350, 24532, -51398, 83437, 184064, -80944, 66449, -104791, 162761, -172045, -36043, -175981, 70295, -174798, -97999, 45621, -85140, 72485, -145454, -71671, -150696, -18546, -35102, -183997, -138932, 165178, -17367, -133003, -215066, 66694, -9840, 164534, 87545, -86522, -143701, 1281, -66125, -258915, -84129, -176946, -201575, -254115, -50573, 255224, -89080, -136035, -64794, -17259, -186649, 194170, 58178, -42514, -139716, -405227, -123174, 180205, -8216, -10412, 35493, 254929, -102385, -93116, 86878, 28072, 237886, 135355, -374500, -286014, -62384, -373531, -38423, 288558, -356894, -153732]
9159a36909m3270A15501d4325j53629M1648C4890a72436O3701A72794d2092j70252
9148b12344n5307A62516O5818a94551j72262B21676c08717h1739H2546M3844d36504
9136a95049A1708J89235m1851a34116o688K5676c9535l4300A85606l2321E1215
9124B55928A9007J21960a38453l07849h4097K405B0468b2491B43577F2554h1502
9112c9844k09804I747a85628C05125A5726b38569k0305B16743c01180d4172q9131
9101a33303a7990l17684h7121A2938i7460m9318k43632A72727a40042I6933a33915
9089i2759A15062b23567A54676b82140A47727o0347f6436g564j64022A94256E7341
9077A5184a65782M919P6916c4554C4822J2742f653o7382b4256d514I4641B4664
$$ y = [-136909, -180179, 115501, -44325, -197954, -156306, 34890, -172436, -108735, 172794, -42092, -212344, -267651, 162516, 228334, -194551, -366813, 221676, -308717, -81739, 82546, 126390, -436504, -195049, 11708, 200943, 159092, -134116, -140804, -115128, -39535, -73835, 185606, 153285, 51215, 255928, 19007, 140967, -138453, -446302, -84097, -81692, 20468, -22491, 243577, 62554, -81502, -39844, -249648, 9747, -185628, 305125, 15726, -238569, -258874, 216743, -301180, -44172, -133303, -17990, -335674, -87121, 12938, -97460, -146778, -390410, 172727, -140042, 96933, -133915, -92759, 115062, -223567, 154676, -282140, 147727, 87380, -66436, -7564, -171586, 194256, 57341, 15184, -165782, -160863, -83947, -34554, 34822, 47564, -6653, -74035, -24256, -4514, 94641, 24664]
9064e2305j95938o1626R9470A96275a58932j28578E0176b5198k1674r4002M1953
9053i8921I8330C3947b47376a17861H3302J36686C9284c9382j44361C5715a49737
9041a42161E8640a03566p5107b9455k57673A94593c12127a31195k4926A0218J12746
9030A22964F548b37369J12795j58809L3147C2889b81588j8829e9912B4781a22038
9018d0045j1041H2929a32503e5452j28725d7998j07166m7319A8914a94578f4398
9006B0241a06508m17619A84536l7967d0195D3118K3650e4422B21045a86169h9427
8994d3565D4723b47756K7969A53919C9201K8205B5037J79863I4578b53622e7090
8982d9192j8936j63187F0130c40370a7475k17731A26514b012j44095j16794A57858
$$ y = [-52305, -248243, -309869, -210399, 196275, -158932, -287510, 50176, -25198, -46872, -140874, -98921, 98330, 33947, -247376, -117861, 83302, 219988, 39284, -39382, -183743, 35715, -149737, -142161, 58640, -103566, -178673, -29455, -287128, 194593, -312127, -131195, -156121, 10218, 122964, 6548, -237369, -124574, -283383, -250236, 32889, -281588, -300417, -59912, 24781, -122038, -40045, -51086, 82929, -132503, -55452, -184177, -47998, -155164, -202483, 18914, -194578, -64398, 20241, -106508, -524127, 184536, 146569, -40195, 43118, 66768, -54422, 221045, -186169, -89427, -43565, 44723, -247756, -219787, 153919, 39201, 67406, 25037, 204900, 94578, -253622, -57090, -49192, -68128, -231315, 60130, -340370, -17475, -235206, 126514, -2012, -146107, -262901, 157858]
8970g7581j17428A7132L6934L3302J46946a26427d0595H2742a06894A42884F9254
8958b22218J02872H2572c98745a52811j70755h0035D4282c9200j64342N9985C69026
8946B4750b38404f1741j91644B3891K6915c65636b0831I3836C9601g7239A89565
8934e8395p8778A08365k1110d5092j42274A41122E2775F219a36275n1300A76123
8922a73454A19200Q564J30156b4553A62748g2694L1969j21057A70681J03135c5537
8910b04283B64016m0999K56878K88567J026487o25875D62358j3120o8492C015
8899H3048b1569A79150b00611A58977f0045a3058p3330A29444b5365C7751a49815
8887C1580c9803p0393K4154e324I5879b35758R4792j28785a17023A3695a98518
$$ y = [-77581, -195009, 17132, 54066, 87368, 234314, -126427, -40595, 82742, -106894, 142884, 69254, -222218, -119346, 82572, -398745, -152811, -323566, -80035, 44282, -39200, -203542, -143557, 369026, 24750, -238404, -61741, -253385, 23891, 50806, -365636, -20831, 93836, 39601, -77239, 189565, -58395, -137173, 108365, 87255, -45092, -187366, 141122, 52775, 6219, -136275, -187575, 176123, -173454, 119200, 127764, 257920, -24553, 162748, -72694, -40725, -161782, 170681, 273816, -35537, -204283, 264016, 223017, 479895, 768462, 1794949, 1169074, 462358, 449238, 380746, 3015, 83048, -21569, 179150, -200611, 158977, -60045, -13058, -86388, 129444, -25365, 37751, -149815, 31580, -39803, -110196, -86042, -5324, 95879, -235758, -140966, -269751, -117023, 13695, -198518]
8875a30561j01680M9939m15909h8059p4212A62620p4345a89549h2295B2624a01716
8863a72947C0647c7254m60949A95867O4695a64545a6087o6869A92779g9041A4477
8851b13416l6406f6781k83256D9032J21591D4884c2596f411I3564a40001L3882
8840a06119r9254d2982j13490a6934A52319N3487A6726b92430C8045b04849D50204
$$ y = [-130561, -232241, -182302, -598211, -88059, -162271, 162620, 88275, -189549, -82295, 22624, -101716, -172947, 30647, -37254, -498203, 195867, 260562, -164545, -16087, -82956, 192779, -79041, 14477, -213416, -249822, -66781, -350037, 49032, 170623, 44884, -32596, -6411, 93564, -140001, -106119, -205373, -42982, -156472, -16934, 152319, 205806, 16726, -292430, 38045, -204849, 450204]
$$ [...]
##END NTUPLES=NMR SPECTRUM
##END=
