
##TITLE=AC1222_Punto_6074794_1Xs9jaGfa0
##JCAMPDX= 6.0         $$ Bruker NMR JCAMP-DX V2.0
##DATA TYPE= NMR SPECTRUM
##DATA CLASS= NTUPLES
##ORIGIN= BRUKER
##OWNER= Administrator
$$ 1.72 TOPSPIN		Version 2.1
$$ 2012-05-07 21:07:20.359 -0500  Administrator@TOPSPIN
$$ Compression mode = diff/dup
##.OBSERVE FREQUENCY= 400.13188235
##.OBSERVE NUCLEUS= ^1H
##.ACQUISITION MODE= SIMULTANEOUS (DQD)
##.ACQUISITION SCHEME= undefined
##.AVERAGES= 8
##.DIGITISER RES= 22
##SPECTROMETER/DATA SYSTEM= spect
##.PULSE SEQUENCE= zg30
##.SOLVENT NAME= COFFEE_meoh
##.SHIFT REFERENCE= INTERNAL, COFFEE_meoh, 1, 14.98061
##AUDIT TRAIL= $$ (NUMBER, WHEN, WHO, WHERE, PROCESS, VERSION, WHAT)
$$ ##TITLE= Audit trail, TOPSPIN		Version 2.1
$$ ##JCAMPDX= 5.01
$$ ##ORIGIN= Bruker BioSpin GmbH
$$ ##OWNER= Administrator
$$ $$ C:\Bruker\TOPSPIN/data/COFFEE/nmr/AC1222_Punto_6074794_1Xs9jaGfa0/20/pdata/1/auditp.txt
$$ ##AUDIT TRAIL=  $$ (NUMBER, WHEN, WHO, WHERE, PROCESS, VERSION, WHAT)
(   1,<2012-05-07 21:07:13.203 -0500>,<Administrator>,<TOPSPIN>,<go>,<TOPSPIN 2.1>,
      <created by zg
	started at 2012-05-07 21:06:06.406 -0500,
	POWCHK enabled, PULCHK disabled,
       configuration hash MD5:
       AF F2 23 6B 01 CD 40 DD E5 A1 38 A0 06 EA F7 77
       data hash MD5: 64K
       3D 06 B3 23 D4 89 48 50 E2 3C 90 A5 FA 45 46 25>)
(   2,<2012-05-07 21:07:16.187 -0500>,<Administrator>,<TOPSPIN>,<proc1d>,<TOPSPIN 2.1>,
      <Start of raw data processing
       efp LB = 0 FT_mod = 6 PKNL = 1 PHC0 = 0 PHC1 = 0 SI = 32K 
       data hash MD5: 32K
       19 98 54 94 C6 D3 E1 F3 CE A3 DB 6E E0 A1 6C F7>)
(   3,<2012-05-07 21:07:16.531 -0500>,<Administrator>,<TOPSPIN>,<proc1d>,<TOPSPIN 2.1>,
      <pk PHC0 = 207.6965 PHC1 = 0 
       data hash MD5: 32K
       94 1C 24 26 EA 18 A6 2D 10 C0 B0 61 2F D2 EE 7F>)
(   4,<2012-05-07 21:07:16.593 -0500>,<Administrator>,<TOPSPIN>,<proc1d>,<TOPSPIN 2.1>,
      <abs ABSG = 1 
       data hash MD5: 32K
       41 16 A0 24 ED 94 CD D2 E7 49 B9 FF A5 02 68 C1>)
(   5,<2012-05-07 21:07:16.625 -0500>,<Administrator>,<TOPSPIN>,<proc1d>,<TOPSPIN 2.1>,
      <abs ABSG = 2 
       data hash MD5: 32K
       C1 F7 B6 ED 44 03 7B AF 48 09 B1 AB A3 B0 E9 2E>)
(   6,<2012-05-07 21:07:16.656 -0500>,<Administrator>,<TOPSPIN>,<proc1d>,<TOPSPIN 2.1>,
      <abs ABSG = 3 
       data hash MD5: 32K
       5B 05 0D D9 CA 51 26 37 19 05 E3 E8 B2 44 15 1C>)
(   7,<2012-05-07 21:07:16.687 -0500>,<Administrator>,<TOPSPIN>,<proc1d>,<TOPSPIN 2.1>,
      <abs ABSG = 4 
       data hash MD5: 32K
       57 02 D9 10 AD F1 83 5F 92 1C 19 F3 7B 6F 7A FA>)
(   8,<2012-05-07 21:07:16.718 -0500>,<Administrator>,<TOPSPIN>,<proc1d>,<TOPSPIN 2.1>,
      <abs ABSG = 5 
       data hash MD5: 32K
       A8 11 4C D3 D0 FC DC 98 00 36 E6 3C BC CE 8C 20>)
$$ ##END=
$$ 
$$ $$ hash MD5
$$ $$ E3 C9 BD 15 A9 D0 00 39 B7 48 80 35 E0 C1 E6 67
##$RELAX= 
##$RELAX= 
##$RELAX= 
##$RELAX= 
##$RELAX= 
##$RELAX= 
##$RELAX= 
$$ Bruker specific parameters
$$ --------------------------
$$ [...]
150 150 150 150 150 150 150 150
##$TP07= 0
##$TPNAME0= <>
##$TPNAME1= <>
##$TPNAME2= <>
##$TPNAME3= <>
##$TPNAME4= <>
##$TPNAME5= <>
##$TPNAME6= <>
##$TPNAME7= <>
##$TPOAL= (0..7)
0.5 0.5 0.5 0.5 0.5 0.5 0.5 0.5
##$TPOFFS= (0..7)
0 0 0 0 0 0 0 0
##$TUNHIN= 0
##$TUNHOUT= 0
##$TUNXOUT= 0
##$USERA1= <user>
##$USERA2= <user>
##$USERA3= <user>
##$USERA4= <user>
##$USERA5= <user>
##$V9= 5
##$VALIST= <valist>
##$VCLIST= <CCCCCCCCCCCCCCC>
##$VD= 0
##$VDLIST= <DDDDDDDDDDDDDDD>
##$VPLIST= <PPPPPPPPPPPPPPP>
##$VTLIST= <TTTTTTTTTTTTTTT>
##$WBST= 1024
##$WBSW= 4
##$XGAIN= (0..3)
0 0 0 0
##$XL= 0
##$YL= 0
##$YMAX_a= 524287
##$YMIN_a= -643394
##$ZGOPTNS= <>
##$ZL1= 120
##$ZL2= 120
##$ZL3= 120
##$ZL4= 120
##$ABSF1= 14.98061
##$ABSF2= -5.57192
##$ABSG= 5
##$ABSL= 3
##$ALPHA= 0
##$AQORDER= 0
##$ASSFAC= 0
##$ASSFACI= 0
##$ASSFACX= 0
##$ASSWID= 0
##$AUNMP= <proc_prof1d_extract_pilot.lims>
##$AXLEFT= 0
##$AXNAME= <>
##$AXNUC= <1H>
##$AXRIGHT= 0
##$AXTYPE= 0
##$AXUNIT= <>
##$AZFE= 0.1
##$AZFW= 0.1
##$BCFW= 0
##$BC_mod= 0
##$BYTORDP= 0
##$COROFFS= 0
##$CY= 15
##$DATMOD= 1
##$DC= 0
##$DFILT= <>
##$DTYPP= 0
##$F1P= 0
##$F2P= 0
##$FCOR= 0.5
##$FTSIZE= 32768
##$FT_mod= 6
##$GAMMA= 0
##$GB= 0
##$INTBC= 1
##$INTSCL= 1
##$ISEN= 128
##$LB= 0
##$LEV0= 0
##$LPBIN= 0
##$MAXI= 10000
##$MC2= 0
##$MEAN= 0
##$ME_mod= 0
##$MI= 0
##$NCOEF= 0
##$NC_proc= -8
##$NLEV= 6
##$NOISF1= 0
##$NOISF2= 0
##$NSP= 0
##$NTH_PI= 0
##$NZP= 0
##$OFFSET= 14.98061
##$PC= 1
##$PHC0= 207.6965
##$PHC1= 0
##$PH_mod= 1
##$PKNL= yes
##$PPARMOD= 0
##$PPDIAG= 0
##$PPIPTYP= 0
##$PPMPNUM= 2147483647
##$PPRESOL= 1
##$PSCAL= 4
##$PSIGN= 0
##$PYNMP= <proc.py>
##$REVERSE= no
##$SF= 400.13
##$SI= 32768
##$SIGF1= 0
##$SIGF2= 0
##$SINO= 400
##$SIOLD= 32768
##$SPECTYP= <>
##$SREGLST= <1H.CDCl3>
##$SSB= 0
##$STSI= 32768
##$STSR= 0
##$SW_p= 8223.68421052632
##$SYMM= 0
##$S_DEV= 0
##$TDeff= 65536
##$TDoff= 0
##$TI= <>
##$TILT= no
##$TM1= 0
##$TM2= 0
##$TOPLEV= 0
##$USERP1= <user>
##$USERP2= <user>
##$USERP3= <user>
##$USERP4= <user>
##$USERP5= <user>
##$WDW= 1
##$XDIM= 32768
##$YMAX_p= 468898808
##$YMIN_p= -745091
##$CURPLOT= <Network HP LaserJet P1505>
##$CURPRIN= <$Network HP LaserJet P1505>
##$DFORMAT= <normdp>
##$LAYOUT= <+/1D_H.xwp>
##$LFORMAT= <normlp>
##$PFORMAT= <normpl>
##$SURQMSG= 1
$$ End of Bruker specific parameters
$$ ---------------------------------
##NTUPLES= NMR SPECTRUM
##VAR_NAME=  FREQUENCY,     SPECTRUM/REAL,   SPECTRUM/IMAG
##SYMBOL=    X,             R,               I
##VAR_TYPE=  INDEPENDENT,   DEPENDENT,       DEPENDENT
##VAR_FORM=  AFFN,          ASDF,            ASDF
##VAR_DIM=   32768,         32768,           32768
##UNITS=     HZ,            ARBITRARY UNITS, ARBITRARY UNITS
##FACTOR=    0.250966925370066, 1,           1
##FIRST=     8223.43324360095, -273407,      -150844
##LAST=      0,             -70420,          -259643
##MIN=       0,             -745091,         0
##MAX=       8223.43324360095, 468898808,    0
$$ Real data points
##PAGE= N=1
##DATA TABLE= (X++(R..R)), XYDATA
$$ [...]
19546a15560H0167a25478j58601A85249c35195A97554f0287A4696b04702A47423
19535a18107g833B79066b31491d3779I9249A070J29528K25208p5329E394b3149
19523a29913G5689b67781b609A18636K13884a9981j24377A904a34989A15525j4274
19512A01251a11862k19150J04010A62792b10206A60377d6003A09683a79152A42182
19501F9309c1212J5135H786P4785b75492E4382h5115G6590j0354K4045r91Q5982
19489A75272d807k53044M0152A80982a58442b6537r8015F1650O4624a45946j3023
19478a58969N7586A32428e5464A048a6843a412k8001o9830A35310h9433e195k33145
19466b38340G5262g2617A61075i6432n9726d0148R137C3398N4063L04709c29578
$$ y = [-115560, 80167, -125478, -284079, 185249, -335195, 197554, -60287, 14696, -204702, 147423, -118107, -7833, 279066, -231491, -43779, 99249, 1070, 130598, 355806, 280477, 5394, -23149, -129913, 75689, -267781, -2609, 118636, 332520, -19981, -144358, 1904, -134989, 115525, 101251, -111862, -331012, -227002, 162792, -210206, 160377, -46003, 109683, -179152, 142182, 69309, -31212, -16077, 8786, 83571, -275492, 54382, -85115, 76590, 66236, 90281, 89290, 175272, -4807, -257851, -217699, 180982, -158442, -26537, -124552, 61650, 126274, -145946, -158969, -101383, 132428, -55464, 1048, -16843, -1412, -29413, -99243, 135310, -89433, -5195, -238340, 75262, -72617, 161075, -96432, -156158, -40148, -31011, 33398, 87461, 392170, -329578]
19454G6769d6654l15395B96749b68185R8745A46121e1189j39279g0251o3360c4519
19442b8693A75959c95718R175B7601b9907B61304b14152R2314m4682g4409m7271
19431a21680j27973C17222a22332L6881j0621K592q5778L627g3398k02472d9693
19419a89031l831d9676F0954a63223F4933J34059b0925D4168a44384f2525C93308
19407E4595N0921a43462k21073C22144b65268M4908Q3526D553a34613n2519K4996
19396a62136c789j83790e5072A84617h9231j95546a35795a3839j72227j0266g4012
19384E0730a69783e356p404N131I3479d35144E4381L6775R8067b55311I6033l0621
19372F5412b02423k551P9340H0949a38347c8957j67146g5265L3439B0276J93274
$$ y = [76769, -46654, -362049, 296749, -268185, -169440, 146121, -51189, -190468, -70251, -133611, -34519, -28693, 175959, -395718, -386543, 27601, -29907, 261304, -214152, -121838, -166520, -74409, -121680, -249653, 317222, -122332, -85451, -96072, -93480, -179258, -175631, -73398, -275870, -49693, -189031, -192862, -49676, 60954, -163223, 64933, 198992, -20925, 44168, -144384, -62525, 393308, 54595, 105516, -143462, -364535, 322144, -265268, -220360, -136834, 4553, -134613, -187132, -162136, -3789, -187579, -55072, 184617, -89231, -284777, -135795, -13839, -186066, -196332, -74012, 50730, -169783, -5356, -12760, -7629, 93479, -435144, 54381, 91156, 189223, -255311, 96033, 65412, -202423, -204974, -125634, 80949, -138347, -38957, -206103, -75265, -41826, 20276, 213550]
19361B13550b8897o9154k1211C18130b1770E1688K8885Q7221b15762a01736C65611
19349b45671P5437A24193a74036K2158D13461H9779N3268G661a14870H9899c54964
19337c90943J67459d6599A60990b42281a1602C5299c60223A11680b40860J07486
19327a33374c8945l21095E2814b6994l45349A7640a01600e830j24666K6949j95659
19316b99206J13717j67528a40993E8960L0529C2989b20134R4427k19694D464b65266
19304g3740c6280l9174C9247B651P5816d43691B18941m1323B9423Q5200a29462
19292d7849A30324b86068J30455G910a96530a9831q8548C599N0762a49653b9040
19280D18b63419h398j6850j9400A74978a0640k43353I5533b12784p3868M6381
$$ y = [213550, -28897, -98051, -119262, 318130, -21770, 51688, 80573, 167794, -215762, -101736, 365611, -245671, -170234, 124193, -174036, -151878, 413461, 89779, 143047, 7661, -114870, 89899, -354964, -390943, -223484, -46599, 160990, -242281, -11602, 35299, -360223, 111680, -240860, -133374, -38945, -360040, 52814, -26994, -372343, 17640, -101600, -5830, -130496, -103547, -299206, -185489, -353017, -140993, 58960, 89489, 32989, -220134, -125707, -345401, 4464, -265266, -73740, -36280, -75454, 39247, 2651, 78467, -443691, 218941, 177618, 29423, 114623, -129462, -47849, 130324, -286068, -155613, 7910, -196530, -19831, -108379, 3599, 54361, -149653, -29040, 418, -263419, -8398, -25248, -44648, 174978, -10640, -253993, 95533, -212784, -286652, -240271]
19269b40271d91m13164B41247q3245f8550j21923A18905a16178D2026a94490j09928
19258c04418a01472j03320g5627F1783N5288a86270G6594b95811a3119B29355
19247A02678c54332f0895o4011K2673n7962C05105I7996K33644A46148D9012c0690
19235g6880C1346a33722k3559a4357k32321F4406b19101D9670A439e1230A61419
19223b86195i9625d5484F4208i4140B4805a86853C4680b52284a19922p0409d0096
19211B2040J31758a30401A51133a86657n5483B02069n2248k5128j2472J19037
19201B31258n6696J9855o1809N7054b39290a70B19653F6635i7507F0152c18611
19189a2678r8279j96878l208k53337B9900a48613k7969j3895L4448C17958g9086
$$ y = [-240271, -491, -413655, 241247, 158002, -68550, -190473, 118905, -116178, 42026, -194490, -304418, -101472, -204792, -75627, 61783, 117071, -186270, 76594, -295811, -13119, 229355, 102678, -354332, -60895, -124906, -102233, -160195, 305105, 97996, 331640, 146148, 49012, -30690, -76880, 31346, -133722, -157281, -14357, -246678, 64406, -219101, 49670, 1439, -51230, 161419, -286195, -99625, -45484, 64208, -94140, 24805, -186853, 34680, -252284, -119922, -190331, -40096, 22040, 153798, -130401, 151133, -186657, -242140, 202069, 149821, 124693, 112221, 231258, 174562, 194417, 132608, 189662, -239290, -170, 219653, 66635, -97507, 60152, -318611, -12678, -110957, -307835, -311043, -564380, 29900, -148613, -176582, -190477, -156029, 317958, -79086]
19177B549e7265j67250j08306g5004K2154j87134B14442a06806j62750D1769d2020
19165B7366g3804k16756g6179k13625K7368C0600a05188G5142d0989k6590j90445
19154b58024G0263c0553E160a61071l46064G1464a9056n20459a81236M870A36138
19142h5091O402A71670l7453J14325c7173p0640D9194a52217p3634C3334c6703
19130H4408a80197B6385N4255a50974E6617b71945C32696c82379A14359P2314
19120A86673c40989B0690f0603E907k041b12924J05352A21852a82402I9086d5129
19108a68901k6650b1670j35124D310L82261b255B2566a6153m7622A8260i2149
19096d8234D6158d0065q6627D8735Q15H682b35739N1666N028A97329o2211J94321
$$ y = [2549, -57265, -224515, -332821, -75004, -52850, -239984, 214442, -106806, -269556, 41769, -42020, 27366, -73804, -290560, -76179, -289804, -262436, 30600, -105188, 75142, -40989, -67579, -258024, 70263, -30553, 5160, -161071, -507135, 71464, -19056, -539515, -181236, -176366, 136138, -85091, -78689, 171670, 134217, 248542, -37173, -107813, 49194, -152217, -225851, 33334, -36703, 84408, -180197, 26385, 80640, -150974, 56617, -271945, 332696, -382379, 114359, 186673, -340989, 20690, -60603, 5907, 3866, -212924, -107572, 121852, -182402, 99086, -45129, -168901, -195551, -21670, -156794, 4310, 386571, -2255, 22566, -16153, -63775, 18260, -92149, -48234, 46158, -40065, -126692, 48735, 49550, 8682, -235739, -184073, -179045, 197329, 135118, 329439]
19084C29439a05675l3728C1089a69185C654a5791A6836b25988R4081J9578C0925
19072a82705M0967p7957B01294M5871a02022j08637b0250n3439E1894A8305e7147
19060c37820B0058N0746L62292C1677b33019N4013P1750j71287H9453k1976P7665
19049A45142c09704e049D04867L0818A04706B3159d87548a51361p8401a08088
19038a47054J0802O220k76822J56177e5828j47845E2626a69291d0026B20201b38621
19026a16388C58849A61067K3229K04962c3589k30828A81700e6223I5840l6744
19016E9096J81756b35932B90294a22523J5559L7934A12718M9636a74032c0976
19005f137E1235O6372b42567b2676o1015L9312J0279E3594c36319a06447B1597
$$ y = [329439, -105675, -139403, 31089, -169185, 3654, -15791, 16836, -225988, -131907, -112329, 30925, -182705, -141738, -219695, 201294, 247165, -102022, -210659, -20250, -73689, 51894, 18305, -57147, -337820, 20058, 70804, 433096, 31677, -233019, -179006, -107256, -278543, 89453, 67477, 145142, -309704, -5049, 404867, 435685, 104706, 23159, -487548, -151361, -229762, -108088, -147054, -136252, -130032, -406854, -250677, -55828, -203673, 52626, -169291, -40026, 220201, -238621, -116388, 358849, 161067, 184296, 389258, -33589, -264417, 181700, -56223, 95840, 59096, 240852, -235932, 290294, -122523, -106964, -69030, 112718, 162354, -174032, -30976, -6137, 51235, 117607, -242567, -22676, -83691, -44379, -34100, 53594, -336319, -106447, 21597]
18993h252m8084N545j50816H8019N1827m2500J4759m6911d88n6188A6936a99559
18980A12124c34469h9506c5730B78734c86371F0569J04663a12320B11766b00291
18969e8659j00183a478l11268A73597c66573c4418A26814l5623a43459b0529A71187
18957G4342Q5393J70023A01540f5252A25059a10718j19214n022A53494h4541E9242
18945g6492E857e5129k2080j05143M7303j41407O6669G0840I466c02038C8835
18933a73105q2139l5711F6746d71356d5465k69307i5672l41461C6506a13428p5737
18922a89165H7931C9956e812n4114B99922a20697l8126J1984N1133A9911R092
18911B9003P9910e6003k05367A91990q8065h4638b2607k40328J27303p0128E2392
$$ y = [-8252, -56336, -50791, -201607, 88019, 139846, 97346, 112105, 65194, -488, -56676, 16936, -199559, 112124, -334469, -89506, -35730, 278734, -386371, 60569, 165232, -112320, 211766, -200291, -58659, -158842, -1478, -312746, 173597, -366573, -34418, 126814, 91191, -143459, -20529, 171187, 74342, 159735, 329758, 101540, -65252, 125059, -110718, -229932, -234954, 153494, -84541, 59242, -76492, 5857, -55129, -77209, -182352, -135049, -276456, -209787, 70840, 9466, -302038, 38835, -173105, -255244, -290955, 66746, -471356, -45465, -314772, -95672, -437133, 36506, -113428, -189165, 87931, 39956, -5812, -59926, 299922, -120697, -158823, -146839, -95706, 19911, 29003, 108913, -56003, -261370, 191990, 103925, -84638, -22607, -262935, -135632, -205760, 52392]
18899a58652C341a32566N7521A2444a15335B97525a23499j53739A56433J9717
18889A76150Q668b39799f6671j48180B27979h6059G8527e991l3089m7663k10123
18878b96866A07525O6086a18602j3943A92472M9009J17766b9719j50027L0726
18868a49020d4381k24165A023b96517A5181c03188A58855K8156a58867A06485
18857A23071b31512P5980E4548J74431a31802j38522Q0834C5824c14956a51449
18846b42445b7305q2496A68861d5385A97778a71460O7153B36766a22517j96380
18836c18897P4544K1536M1260j38077C47245a7489j58091N0278j40749J07740
18826a58311k04315D1650L0287J36542b83990a19990B79977r6633a36211m0039
$$ y = [-158652, 3341, -132566, -75045, 12444, -115335, 297525, -123499, -277238, 156433, 176150, 184818, -239799, -66671, -214851, 227979, -86059, 78527, -5991, -39080, -86743, -296866, 107525, 173611, -118602, -132545, 192472, 241481, 359247, -29719, -179746, -149020, -44381, -268546, 1023, -296517, 15181, -303188, 158855, 187011, -158867, 106485, 123071, -231512, -155532, 54548, 228979, -131802, -270324, -189490, 35824, -314956, -151449, -242445, -27305, -109801, 168861, -45385, 197778, -171460, -104307, 236766, -122517, -318897, -244353, -222817, -181557, -319634, 347245, -17489, -175580, -125302, -266051, -158311, -362626, 41650, 71937, 208479, -283990, -119990, 279977, 183344, -136211, -176250]
18816a76250k3063p1133b3680A11716f1548H2824e4308k71219J53952c543A23669
18804h5494a1450p6762K0383A39778a02128K2418C40354D0961L7549k9817a1282
18792a78637A65108h9068j28723b7555C6180i3952F3496J4267J17526A9222K6672
18781D5894F148c93448G2537K6856D6352M9909B9720a2810A16352a09742B1067
18769A7229c13509a14163C0147L7212g3319B4369a34269e2051E80746A01137m6926
18758E4211d4867j02314B15139p3497A206b31872B11877b4567j41631c9866C1338
18746g2901m7426d045G8220a51080I1306h2712L4437j88591D11965c00970b7111
18734a27272j00539A03646c5501q4221o4244O026e0452Q712j08853l1518O1458
$$ y = [-176250, -199313, -270446, -23680, 111716, -61548, 82824, -54308, -325527, -171575, -3543, 123669, -85494, -11450, -88212, -67829, 139778, -102128, -79710, 340354, 40961, 78510, 48693, -11282, -178637, 165108, -89068, -217791, -27555, 36180, -93952, 63496, 77763, 195289, 19222, 45894, 6148, -393448, 72537, 99393, 46352, 96261, 29720, -12810, 116352, -109742, 21067, 17229, -313509, -114163, 30147, 67359, -73319, 24369, -134269, -52051, 580746, 101137, 54211, -44867, -147181, 215139, 141642, 1206, -231872, 211877, -24567, -166198, -39866, 31338, -72901, -120327, -4045, 78220, -151080, 91306, -82712, -48275, -236866, 411965, -300970, -27111, -127272, -227811, 103646, -35501, -119722, -183966, -177940, -50452, -41740, -150593, -182111, -120653]
18723a20653d8038m9661j63709A13640c8349A88059a43469c9664h284A04764k1736
18712H3028j8262o292j1277L7170f9933b1358k58535D6979h331G1642c8731B2357
18699H0720f1362e842A48108a1491k13799A9425c8654j71142E903K81177O6724
18688C53804p5247a91820c7397C2128J93946g6150F1373e581k39650B98358b11872
18676A15931a47902r5046A7567b59314R3651K4701b4098j14297C2080b22243A39043
18664B8760P340J95797g0133j33048A53861a84264j5517f6835a5504j1189k1603
18653d8296A1027f8525k49839F2591K43325a57625r2518i3225k98743E788a67964
18641a00638n2426m7305A48394f3371H5397M1154i2589A58875b0109m5378m0583
$$ y = [-120653, -48038, -97699, -261408, 113640, -38349, 188059, -143469, -39664, -8284, 104764, 83028, 64766, 58474, 47197, 84367, -69933, -21358, -279893, 46979, -8331, 71642, -38731, 22357, 80720, -61362, -5842, 148108, -11491, -225290, 19425, -38654, -209796, 5903, 287080, 353804, 278557, -191820, -37397, 32128, 226074, -76150, 61373, -5581, -245231, 298358, -211872, 115931, -147902, -242948, 17567, -259314, -165663, -140962, -24098, -138395, 32080, -222243, 139043, 28760, 36100, 231897, -70133, -203181, 153861, -184264, -199781, -66835, -15504, -26693, -48296, 11027, -68525, -318364, 62591, 305916, -157625, -250143, -93225, -391968, 5788, -167964, -100638, -153064, -200369, 148394, -63371, 85397, 126551, -92589, 158875, -20109, -65487, -106070]
18630a06070j19918J01417A37925a02188C32960j37813I1107c58002J7318h1839
18619H0676a057p7479F330f7101A17257h4570B2764r353a68245A04675a28917
18607b8440C3248b50923P0623g6307B12276a81051D12996a10836q8149H6729b24928
18595A45546c95003a56563j21434B64607c39438o9059L4591B0O7639h1448G2674
18583d8945Q939k56996M6089A3136h0190L0582p8159B36019r3408p0458b04195
18571a25608D1714a97247b063l12801A10872b75972a18156B02210a15887G2549
18560h6142A97712I7915a33630j25384E2098a54006c107o1818k34400b1562k07841
18549b29403J08058j11781b2042j99274A59790a85501A11627e0900B27611f4197
$$ y = [-106070, -225988, -124571, 137925, -102188, 332960, 195147, 91107, -358002, -340684, -81839, 80676, -1057, -78536, 6330, -67101, 117257, -84570, 22764, 13411, -168245, 104675, -128917, -28440, 33248, -250923, -180300, -76307, 212276, -181051, 412996, -110836, -198985, 86729, -224928, 145546, -395003, -156563, -277997, 264607, -339438, -408497, -373906, 20, 67659, -81448, 72674, -48945, -40006, -297002, -250913, 13136, -80190, -49608, -127767, 236019, 142611, 72153, -204195, -125608, 41714, -197247, -2063, -314864, 110872, -275972, -118156, 202210, -115887, 72549, -86142, 197712, 97915, -133630, -259014, 52098, -154006, -3107, -64925, -299325, -21562, -229403, -121345, -233126, -22042, -221316, 159790, -185501, 111627, -50900, 227611, -64197]
18538a17075A8647a70547j51978J31482N4707A95592a55460B0386M9841b45126
18527B03680g2949b6833B75501b14518m0340L6526b1311m4144j69851a0490j38241
18516a48731C33232c8563j15477F8061b8817i462o9120A52191E543h7637j17784
18505b05421o4854A04021b28907P0162j10742J31925A64269J60740a57768P4294
18495h3474L867A31303e25035J98661m8735j31130A15641N8130o6217g1477b192
18483c61238J41037m6597H5471d988p352F4816a72201F4060l930b19741f3986
18471a19682A45668b5846j65758o5761A66939a30964A50267g6143A03377c2541
18460h1112A90243i2933l31752f3251K4117b764q1116A81448a63624e9386J0513
$$ y = [-117075, 18647, -170547, -322525, -191043, -136336, 195592, -155460, 20386, 70227, -245126, 203680, -72949, -26833, 275501, -214518, -254858, -218332, -21311, -65455, -235306, -10490, -148731, 333232, -38563, -154040, 68061, -28817, -9462, -78582, 152191, 5543, -87637, -205421, -270275, 104021, -228907, -158745, -269487, -137562, 164269, 325009, -157768, -83474, -79607, 131303, -525035, -326374, -375109, -506239, 115641, 173771, 107554, -71477, -2192, -361238, -220201, -266798, 85471, -4988, -12340, 64816, -172201, 64060, 60130, -219741, -63986, -119682, 145668, -25846, -191604, -257365, 166939, -130964, 150267, -76143, 103377, -32541, -81112, 190243, -92933, -424685, -63251, -39134, -2764, -83880, 181448, -163624, -59386, -48873]
18449d8873i697G3932J44576l7893F7360a76687j27082m7461a66299O720a8023
18437B26158a27452o1624H0682o960K0166c66718g6029A8635b2155A76145a61463
18425H4473K68258i4586A35419e0982G6313e9112A48813e984m435I3063a1688
18413a244A56538c8429A38216c92099H4401c38921C6752a48520D5024j5896b95872
18401e44H2067I725K2756J27748d4628C44239d8104A42797j3474P8206L2491h2000
18388a56641o569A09110J79483F9836a20515B68097E6049a3515A14147a87530
18377g1881j38114A80542c21396B55135d230j46825O8304l01317E1308h5654A7267
18365A67254d9495m5576A6862e592k03083A48044a97572A11475C5025N024b20166
$$ y = [-48873, -9697, 73932, 218508, 180615, 67360, -176687, -303769, -351230, -166299, -159579, -18023, 226158, -127452, -189076, 80682, 73722, 93888, -366718, -76029, 18635, -22155, 176145, -161463, 84473, 352731, -94586, 135419, -50982, 76313, -59112, 148813, -5984, -10419, 93063, -11688, -1244, 156538, -38429, 138216, -392099, 84401, -338921, 36752, -148520, 45024, 29128, -295872, -544, 82067, 9725, 32481, 160229, -44628, 344239, -48104, 142797, 129323, 207529, 240020, -82000, -156641, -163210, 109110, 288593, 69836, -120515, 268097, 56049, -13515, 114147, -187530, -71881, -209995, 180542, -321396, 255135, -4230, -151055, -82751, -384068, 51308, -85654, 17267, 167254, -49495, -95071, 16862, -5592, -208675, 148044, -197572, 111475, 35025, 40049, -220166]
18353c8588j59842L8645j05879k2496D16968C7316b64885a21667B48683c75249
18342C33518A26719b82871E5984L01786B2518J31226R3747b5577k19506d8689
18331C3102O9381J92504b98794D2281a13696A92329k2730H4267b88094a21849
18320h750I073M36068b3363k7202B39817I2568a809A96563b38069h013j09088
18309a17101j8450k7594k6020A08499I720P4753C953J69615o4234K24109N1572
18298C85015b7781p4928j86258B04946c6978k41589B52326b54157L9541F1782
18287B8595c48203B18597r2168D642K34526c52822a1808k93106D2113g5571k46927
18276c22498E5618J95591d01689h1392p5288a2235I7388L5665b83928A36739K79454
$$ y = [-38588, -198430, -159785, -265664, -288160, 416968, 37316, -264885, -121667, 248683, -375249, 333518, 126719, -282871, 55984, 357770, 22518, 153744, 247491, -25577, -245083, -48689, 33102, 102483, 294987, -298794, 42281, -113696, 192329, 169599, 84267, -288094, -121849, -8750, 9073, 445141, -23363, -50565, 239817, 92568, -1809, 196563, -238069, -8013, -117101, -135551, -163145, -189165, 108499, 9720, 84473, 3953, 173568, 109334, 333443, 385015, -27781, -102709, -288967, 204946, -36978, -278567, 252326, -254157, -214616, 61782, 28595, -348203, 218597, 126429, 4642, 239168, -352822, -11808, -304914, 42113, -75571, -322498, 55618, 251209, -401689, -81392, -156680, -12235, 97388, 133053, -283928, 136739, 416193]
18265D16193b89491r0212B32248a13376J7897j58368G8150J26677m2371a7512
18254d5342j42436J1265A77963b01110B07198d95092b2027k58101B8083h1462
18243C59474a13337B85443b32608j73741a9022j2389n0408F7556a43372a0808
18232a39839B29196b5286k68013B15380b69820D8459J73140a43929j05764b3290
18221e5283B06077a69691K3721A59381J17979q6573a48689f143m26946B72238
18210I0394a2480j65218r6665h730k66843M6883A67866K8623i5882B42359q2208
18199A60151a44211B25397g8210B52391b97384M801B37376c9770k17603c327B36445
18187c81811B08119e3878j14702g2859m9994E9736a71970c5855j75254K4841g824
$$ y = [416193, -289491, -379703, 232248, -113376, -95479, -253847, 78150, 204827, 162456, -17512, -45342, -187778, -176513, 177963, -201110, 207198, -495092, -22027, -280128, 28083, -81462, 359474, -113337, 285443, -232608, -406349, -19022, -31411, -81819, 67556, -143372, -10808, -139839, 229196, -25286, -293299, 215380, -269820, 48459, 221599, -143929, -249693, -23290, -55283, 206077, -169691, -145970, 159381, 277360, 190787, -148689, -6143, -433089, 272238, 90394, -12480, -177698, -274363, -8730, -275573, -228690, 167866, 196489, -95882, 242359, 160151, -144211, 225397, -78210, 252391, -297384, -292583, 237376, -39770, -257373, -3327, 236445, -381811, 208119, -53878, -168580, -72859, -122853, 59736, -171970, -35855, -211109, -186268, -7824]
18175c51778D7222J66220a75106N8119E6463b2058o558H4253c89498A39579a71707
18163b2032C39283b7385A34656J2751a00071B74392A13398a07922L4211B30869
18152b69692k0987a38999L0492k15751E4960B4851L07614r5147a34692O0167J9631
18141e4894A22906a8801p5848A46530J4694b41795l5220C7144J19274g4799a6183
18129B24624k7518O1067L8432b40593Q5077g4558m0268C22247a84566g0103p6714
18118a46817k30196a16137k72996B17083b74384g2621m3837B44477a57994F7222
18107B17424e1642B29272J176E3210b99617a15979r0531e1883I3110k6868J10484
18096A76726j6013m1643J39335e7049o8866C1978b31162J7187R7441C0321b01881
$$ y = [-351778, 47222, 213442, -175106, -116987, 56463, -22058, -28616, 84253, -389498, 139579, -171707, -22032, 339283, -27385, 134656, 147407, -100071, 274392, 113398, -107922, -73711, 230869, -269692, -290679, -138999, -108507, -324258, 54960, 24851, 332465, 237318, -134692, -74525, -54894, 122906, -18801, -94649, 146530, 161224, -241795, -277015, 37144, 156418, -74799, -16183, 224624, 197106, 258173, 296605, -240593, -155516, -74558, -114826, 322247, -184566, -70103, -146817, -377013, -116137, -389133, 217083, -274384, -72621, -116458, 244477, -157994, 67222, 217424, -51642, 229272, 230448, 53210, -299617, -115979, -206510, -51883, 93110, 66242, 176726, 160713, 119070, 258405, -57049, -125915, 31978, -231162, -213975, -116534, 30321, -201881]
18084A14172a479j11306m1254J7959F9287a68480j02196i5068l5986k37608H391
18072i5555a7709A3022c90797C1101K62392K31440c9293A68920b14577B50502
18061a78136F8207L4901a63796a2156A06274J63960j20873a61603m3649l2115
18051b37367B97238g4815C3761J17618A8799R2711b48910a7194F9194b27060J12179
18040a14881m9430k97477b13166I4092h0349j44835E9011M0581k6921B5343b54418
18028b24306A32034a8286p989j13556B7206O1147l4117b01804f5625j26688J6479
18017a75834A6487a67942O1070o9951C4706Q8815c2778A61348a12332A25673a1969
18005b1085k96377A07157h1131M776D34389h4492m2794j12329H250b43684g7383
$$ y = [114172, -1479, -112785, -154039, -136080, 69287, -168480, -270676, -95068, -131054, -368662, 8391, -95555, -17709, 13022, -390797, 31101, 293493, 524933, -39293, 168920, -214577, 250502, -178136, 68207, 103108, -163796, -12156, 106274, 270234, 149361, -161603, -205252, -237367, 297238, -74815, 33761, 151379, 18799, 111510, -248910, -17194, 69194, -227060, -114881, -164311, -461788, -213166, 94092, -80349, -225184, 59011, 99592, 72671, 25343, -254418, -224306, 132034, -18286, -26275, -139831, 27206, 88353, 54236, -201804, -65625, -192313, -175834, 16487, -167942, -106872, -176823, 34706, 123521, -32778, 161348, -112332, 125673, -11969, -21085, -317462, 107157, -81131, -76355, 434389, -84492, -127286, -239615, 8250, -243684, -77383]
17993D0160L37264I1395a71617a4021E1045J73155b62895A53460j4220F0020a45393
17981A01906c8263j45782o7447b2737B73416R5315g9318r0006K1513e0831a0752
17969h5928r0836O1612j60034H1942b11647B36595a93450Q0262B04722f4814A05394
17957B9809a14911J2070H246K28374a66458c7735B76103I3437a28601G6839a96090
17945B21275c68389J65647d9435D0142R9378C4961b69898a8175I1040c9739j77239
17934b16978b2020C95809j78540c31005F693K71054b31008F1017B7876K76693
17924C04569j42020j8291e6435h036A32329C7267b5214p7794k4528J1603f254
17912a39956M2213d8440A92765k8223k3058a2146B1906c52447B72530c42160J15388
$$ y = [40160, 377424, 91395, -171617, -14021, 51045, 224200, -262895, 153460, 139240, 60020, -145393, 101906, -38263, -184045, -251492, -22737, 273416, 368731, -79318, -169324, -147811, -50831, -10752, -85928, -176764, -115152, -275186, 81942, -211647, 236595, -193450, -113188, 204722, -64814, 105394, 29809, -114911, -102841, 8246, 236620, -166458, -37735, 276103, 93437, -128601, 76839, -196090, 221275, -368389, -202742, -49435, 40142, 139520, 34961, -269898, -18175, 91040, -39739, -216978, -22020, 395809, 217269, -331005, 6693, 277747, -231008, 61017, 27876, 304569, 162549, 144258, -56435, -8036, 132329, 37267, -25214, -103008, -127536, -115933, -6254, -139956, -97743, -48440, 192765, 164542, 141484, -12146, 21906, -352447, 272530, -342160, -226772]
17901b26772e5769K5683A52455a55101C81963i3882j02322b2992C3823j4297N1363
17890G0889K800h7185D1238b6048p0163l4735A7439K32136m153c0696F0571b35263
17877c7170m5105G2126a82729g9463j80494R5794O4537A66715a11612k7482B96497
17865b36082f2185l380q2391J3842f1043B23735f8400A04435P7367E4918J42159
17854A97077b18530R2852B82109A30446a72522l5352H078e116G4000B6822a10728
17842A83417a87049N9877L9373B03562C5973d3371j05360E0567J3495f3243C66334
17830b33427E2754M9522b52463J73M1008M8072A530P8250O0556f7686A40500I430
17817a91687H9103h9320k72017o2415A61284a66691b271l5847J6916B9752c92409
$$ y = [-226772, -55769, -30086, 152455, -155101, 381963, -93882, -196204, -22992, 33823, 19526, 70889, 73689, -87185, 41238, -26048, -96211, -130946, 17439, 249575, 245422, -30696, 60571, -235263, -37170, -82275, 72126, -182729, -79463, -259957, -164163, -99626, 166715, -111612, -139094, 296497, -236082, -62185, -65565, -147956, -134114, -61043, 223735, -68400, 104435, 181802, 54918, 197077, -218530, -125678, 282109, 130446, -172522, -207874, 8078, -5116, 74000, 26822, -110728, 183417, -187049, -127172, -87799, 203562, 35973, -43371, -148731, 50567, 64062, -63243, 366334, -233427, 52754, 102276, -252463, -252290, -211282, -163210, 1530, 79780, 140336, -67686, 140500, 9430, -191687, 89103, -89320, -361337, -423752, 161284, -166691, -2271, -38118, -21202, 29752, -392409]
17805c23403l5673J72853A42693a20494E8951P8737j5679b84265a07309A51195
17794A9196J66013c51223C0931a12126N3196k31514m7048G2982R6345a50658f0180
17782I831O0977J7801H283c0662F2501k3468c41613c8672A61429E2211j2362a02476
17769h1318C33705b0894B75579a87582f6823C21488b01453j04836A81902p3350
17759A08552b73057N8823A61298m760J80797A52773r603J7073c711F3360c9048
17747A07828b27779A94731J3857b50384F075a30086M3396L9683a0742k39815C5246
17735H3125b05662G2616J1488b0677B35489a32512A6996M45453A34475a53158
17724B82952J09860e9174j87753B94709a49220e7034b3472l4340B69244j438j02455
$$ y = [-323403, -359076, -186223, 142693, -120494, 58951, 137688, 122009, -284265, -107309, 151195, 19196, 185209, -351223, 30931, -112126, -58930, -290444, -337492, 72982, 169327, -150658, -60180, 9831, 70808, 88609, 8283, -30662, 62501, 39033, -341613, -38672, 161429, 52211, 39849, -102476, -81318, 333705, -20894, 275579, -187582, -66823, 321488, -201453, -306289, 181902, 108552, -273057, -214234, 161298, 156538, 337335, 152773, 143170, 160243, -3711, 63360, -39048, 107828, -227779, 194731, 208588, -250384, 6075, -130086, -86690, -47007, -10742, -250557, 35246, 83125, -205662, 72616, 84104, -20677, 235489, -132512, 16996, 462449, 134475, -153158, 282952, 392812, -59174, -246927, 294709, -149220, -57034, -23472, -57812, 269244, 267806, 165351]
17713A65351q1527J56704P7907C3355g0507A95415I6258C2509J30269Q3860b22684
17701B78063a36694K7054d3619E1452a50670a4285A79957c3149A57269L1969n8105
17690A31133J82644j31243b24322J03360B9842c2811A23593d0725j15744d3995
17679A97510c38801a4190j57591E4392c68799F3029M586a23470k0972F1337J09021
17668A70358f9962j36913A72390c80829a9365k06380f7567G6394d8776L887A59036
17656G298K37131o3685G2087h7342o3073L9629H990J5936J04925N3497E4248J38561
17644A92809a21795B20145b78990l6879a12049E5033a85323k53A87171b35938
17633f9288A59825K56295A2350J23700E7951P6527M1704f9617l2158D25293A49906
$$ y = [165351, 83824, 240528, 318435, 33355, -70507, 195415, 96258, 32509, 162778, 246638, -222684, 278063, -136694, -109640, -43619, 51452, -150670, -14285, 179957, -33149, 157269, 189238, 131133, 313777, 182534, -224322, -120962, 29842, -32811, 123593, -40725, -156469, -43995, 197510, -338801, -14190, -171781, 54392, -368799, 63029, 67615, -123470, -144442, 61337, 170358, -69962, -206875, 172390, -380829, -19365, -225745, -67567, 76394, -48776, -44889, 159036, 7298, 244429, 180744, 72087, -87342, -150415, -110786, 8990, 24926, 129851, 183348, 54248, 192809, -121795, 220145, -278990, -315869, -112049, 55033, -185323, -185576, 187171, -235938, -69288, 159825, 416120, 12350, 136050, 57951, 134478, 176182, -69617, -101775, 425293, 149906]
17621D4316R6262g4756c6888G4031a29094E2180J4347b942j8659o6072r8243B82511
17608b01790N1872J1771A60842a86640G1820g0690r074A21813b7240A38477f6797
17596B00318b27444Q2265q33G1657b17316E273L18186A7371L15104j65326D1963
17584b74438M2069A45286J84029E6535J42125f7035G2104a72973r1762B5161c90965
17572B35119J5392b68714B20137f9009A43605O1048C9086b31815A24269Q1932
17562B06201I1073A4828K33530j18453f6899A15514b08434A78071E8627b04189
17551B61480G4604a07487a4802k03956O3909f452j3352E9835a00572k75692A43980
17539a5515B14136B9373a75347B14844J20044A23784J5443e590B15645E1219M9409
$$ y = [44316, 140578, -74756, -36888, 74031, -129094, 52180, 66527, -2942, -21601, -87673, -185916, 282511, -201790, -149918, -138147, 160842, -186640, 71820, -70690, -79764, 121813, -27240, 138477, -66797, 200318, -227444, -145179, -146012, 71657, -217316, 5273, 323459, 17371, 332475, 167149, 41963, -274438, -232369, 145286, 329315, 56535, 198660, -67035, 72104, -172973, -264735, 25161, -390965, 235119, 250511, -268714, 220137, -69009, 143605, 204653, 39086, -231815, 124269, 206201, 91073, 14828, 248358, 129905, -66899, 115514, -208434, 178071, 58627, -204189, 261480, 74604, -107487, -14802, -218758, -154849, -6452, -19804, 59835, -100572, -376264, 143980, -15515, 214136, 29373, -175347, 214844, 334888, 123784, 139227, -5590, 215645, 51219, 100628]
17528A00628j5635b38304D51680A94000M41228A2297c12422I8935Q6037o8622
17518A16350e2411A19534a33919A12298C8048N1136l4808O7317k2802a52613A01018
17506F5965d6652I3990d8174C6901j4404a10040e547o9264J3699o4455d5121A0691
17493A08058e4722B01871b01654j12480B68394J15429a13270e2502A03826P6930
17483A80756F8529c4920A98765h8480A11148c2166C02377B3425K51832J12913
17473C88170j52997E8180i7592h354l38922A24959J38171q211m2559b05992B71625
17461A94630K10788n7490p3747b49044A21436B587d0210F529P1303k4336o34f6842
17448G85098B55032K8777j08323e6840A43688K38088H0773a9823A76110k699m770
$$ y = [100628, 84993, -238304, 451680, 194000, 635228, 12297, -312422, 98935, 184972, 116350, -52411, 119534, -133919, 112298, 38048, 89184, 54376, 121693, 98891, -152613, 101018, 65965, -46652, 93990, -48174, 36901, 22497, -110040, -5547, -74811, -61112, -125567, -45121, 10691, 108058, -54722, 201871, -201654, -314134, 268394, 383823, -113270, -52502, 103826, 180756, 68529, -34920, 198765, -88480, 111148, -32166, 302377, 23425, 275257, 388170, 235173, 58180, -97592, -8354, -347276, 124959, 263130, 254919, 212360, -205992, 271625, 194630, 405418, 347928, 274181, -249044, 121436, 2587, -40210, 6529, 77832, 53496, 52862, -66842, 785098, 255032, 283809, 175486, -56840, 143688, 381776, 80773, -19823, 176110, 173411, 168641]
17437A68641l6190M1168L27190k5279A06680J53529A00295B6205K11529Q1670
17427C19404G6110Q0444k8047R4207N7086j06711a27399I9181J26090Q8217q9545
17416B23943B772L834O5985a55826A81099G2722J27088F836M22006A68807K20841
17405C89648j90928j5254K44561A49140Q8927J02809A19289J97882A43755J04987
17395B48742A05689f3649A34445a42755a1117B94926g5506C29120a5629I4539
17384B48740m6983D563K09472G0347a04549B9278M03276l2998A21277P6803O5443
17373B63523J6833a9827C73237A21198J58410o595J5240K2992b90937A97830K36953
17362D34783A49429C3719J73576a71585C7411L55501m7444O8347A06957B1482
$$ y = [168641, 132451, 173619, 500809, 475530, 106680, 260209, 100295, 26205, 237734, 319404, 76110, 156554, 128507, 222714, 279800, 173089, -127399, 99181, 225271, 313488, 223943, 2772, 6606, 72591, -155826, 181099, 72722, 199810, 6836, 428842, 168807, 389648, 198720, 183466, 428027, 149140, 238067, 340876, 119289, 317171, 143755, 248742, 105689, -63649, 134445, -142755, -11117, 294926, -75506, 329120, -15629, 94539, 248740, 201757, 4563, 214035, 70347, -104549, 29278, 432554, 399556, 121277, 198080, 263523, 280356, -19827, 373237, 121198, 279608, 273013, 288253, 311245, -290937, 197830, 434783, 149429, 33719, 207295, -171585, 37411, 392912, 345468, 413815, 106957, 21482]
17351b05371c6401m2067C92883A77472k4910J10510c18232P4027c0286B92393
17340b16620J08232C45665e020C17220i6951D36838j14696j43140G0798L07895
17330C78693B4724c6089j17811A87261n1522R9014r6512i3245B13534l4032c5059
17318d7034C1943N7078j0698J50821p8857R9575p4566n6183b7649D30186j75062
17307B55124A07589D9268R7838p84K21466j6190q5800B0930J40091b65721R8074
17296a67647A71299N916e29B75739J12798j86160J53162G5606b9338B0290L9909
17285F0199a40234I8873a8212A1039J32821J52044G5799K06501o4661h9144B95084
17273E90182b3462A3886b3316A95709a60339B0426K05551e4827D35845N6326g5256
$$ y = [-205371, -36401, -78468, 392883, 177472, 152562, 263072, -318232, -244205, -30286, 292393, -216620, -108388, 345665, -5020, 317220, -96951, 436838, 322142, 179002, 70798, 378693, 24724, -36089, -153900, 187261, 135739, 234753, 138241, -93245, 213534, 179502, -35059, -47034, 31943, 89021, 78323, 229144, 150287, 249862, 175296, 119113, -27649, 430186, 255124, 107589, 49268, 147106, 146322, 367788, 351598, 265798, 20930, 161021, -265721, -167647, 171299, 177215, -529, 275739, 388537, 202377, 355539, 75606, -29338, 20290, 60199, -140234, 98873, -18212, 11039, 143860, 295904, 75799, 282300, 217639, -89144, 295084, 590182, -23462, 13886, -23316, 195709, -160339, 20426, 225977, -54827, 435845, 492171, -75256]
17261A92988J05649K3273a33730B98758a72108B73768j08661J12598A7353J50941
17251A68294J14068j33342J11301J65082k7933m6833q1714a8930j21855H5356
17240G1000J34741j00698P458a14779B00462I7573Q8197O7529A3923J50876J12034
17229B76833n7453L14426j30024D9171J7789K78373D2301A2297b1560A29211O0175
17218A89386H6220L19951D6212K51844k6010j9615a71044A77639P0350A23042
17207A06980E614K48663r2870j1891k8108a93228D02312P4027A01443N9067e3384
17195F6819M7212L04755A09466h6782A67554m2763J81447O8462J66574k39339
17185C01935g0533C3428j6640K90209N5470A75217J77023J97669k30856k0773
$$ y = [192988, 298637, 321910, -133730, 298758, -172108, 273768, 165107, 277705, 17353, 168294, 282362, 149020, 260321, 425403, 397470, 350637, 268923, -18930, -140785, 85356, 71000, 205741, 105043, 112501, -114779, 200462, 97573, 185770, 253299, 13923, 164799, 276833, 219380, 533806, 403782, 49171, 66960, 345333, 42301, 12297, -21560, 129211, 189386, 86220, 406171, 46212, 298056, 272046, 252431, -171044, 177639, 247989, 123042, 106980, 5614, 254277, 161407, 149516, 121408, -193228, 402312, 476339, 101443, 160510, -53384, 66819, 114031, 418786, 109466, -86782, 167554, 124791, 306238, 374700, 541274, 301935, -70533, 33428, 16788, 306997, 362467, 175217, 352240, 549909, 319053, 298280]
17175B98280c8373B60354l0133J09862j3732A41703d0424A13130j7343C6437J55368
17164A91805r3667K69846a22113A89570Q7286k7538M7197o7173b01658i0697D02513
17152I7216K18714K66526K444l7838B2115J00545J47702P1409R9196j45727J28491
17141D23731C2493J15798K14878A15833C8279Q2457l1809K8929J65846j02697
17131A81005J37583j41439P3794l2601D2986N99159D5082K20299J3166K89678
17121E68225B47293J55517F9754K24124k7368j5182N3996m4564O7350j02414A02771
17109C58007o7473L28404J30062C14517Q4875R8887B9438M72349j39452K6177
17099C88512m8672j55785q0704M14472P5637k76692J60080K99928k54637P4432
$$ y = [298280, -38373, 260354, 230221, 340083, 326351, 141703, -40424, 113130, 95787, 36437, 191805, 98138, 367984, -122113, 189570, 276856, 249318, 296515, 229342, -201658, -90697, 402513, 97216, 315930, 582456, 584900, 547062, 22115, 122660, 270362, 341771, 440967, 295240, 423731, 32493, 148291, 363169, 115833, 38279, 120736, 88927, 117856, 283702, 181005, 318588, 177149, 250943, 218342, 42986, 642145, 45082, 265381, 278547, 568225, 247293, 402810, 69754, 293878, 266510, 251328, 305324, 260760, 328110, 225696, 102771, 358007, 290534, 618938, 749000, 314517, 399392, 498279, 29438, 501787, 362335, 388512, 339840, 184055, 103351, 517823, 593460, 316768, 476848, 776776, 522139, 596571]
17089E96571B07129j805K09473J49963R137k49146m2993K03286G3813K43604O1200
17078C78617A81828J14032p2531J39411L46627B69818r9855J51562N39499I6006
17067B00823K58076l9008l7628B1675L95263J44935j80018m0224K2003K6623K23126
17056F13383B14942J86241O8055J67005j60689J1837K35900C23917J63997r1618
17046C96296p6812K05946K24093k56454K32154k09485o1972J58764K787j78889
17036D36428j18472J38193K29617k24882J742m1971J97709F0978N02407p7157
17026D86228K95028k796k16596L9617r1851Q6566B71948J16913Q8084J63061l06872
17015C33134r2781M35567B94740O11496m34507J75986L3745j90200J49143K7163
$$ y = [596571, 207129, 205324, 414797, 564760, 573897, 324751, 281758, 485044, 73813, 317417, 378617, 181828, 295860, 223329, 362740, 709367, 269818, 169963, 321525, 861024, 96006, 200823, 458899, 419891, 382263, 21675, 416938, 561873, 381855, 341631, 363634, 390257, 613383, 214942, 401183, 469238, 636243, 475554, 487391, 723291, 323917, 487914, 396296, 319484, 525430, 749523, 493069, 725223, 515738, 453766, 612530, 615317, 436428, 317956, 456149, 685766, 460884, 462626, 420655, 618364, 60978, 563385, 486228, 781256, 778460, 561864, 601481, 509630, 596196, 271948, 388861, 476945, 640006, 333134, 240353, 675920, 294740, 906236, 471729, 647715, 681460, 491260, 640403, 667566]
17005F67566k45212K77497k67715J84838m1299n8898o1225M32685l20653J32613
16995G00197m5569C16702M49348l419p0673L5907C59360L28463K13152l17159
16985E83816N6264J18786m0105j67154K09035j05890q1346p230K87809j60252
16975F93733j84873j10434N13103l28773K13219j21184k2245j44688J85850j67613
16965E26095K55836K64442D96372L8375K39430J34721J70947m53662K23418j6832
16955H32769l70099M53849k78107L10767J0465K40950m66823R2625J24635l7767
16945I13264j26913K86327l54189J70733J81078J66163j35195l72717N1975J41670
16935I22196J47176J42905k46705k9152K6340J60462M3354J03670p4969K4937
$$ y = [667566, 422354, 699851, 432136, 616974, 575675, 516777, 455552, 888237, 567584, 700197, 654628, 316702, 766050, 762631, 691958, 727865, 359360, 687823, 900975, 583816, 640080, 758866, 718761, 551607, 760642, 654752, 573406, 566176, 853985, 693733, 508860, 398426, 911529, 582756, 795975, 674791, 652546, 507858, 693708, 526095, 781931, 1046373, 496372, 534747, 774177, 908898, 1079845, 626183, 849601, 832769, 462670, 916519, 638412, 949179, 959644, 1200594, 733771, 826396, 951031, 913264, 786351, 1072678, 718489, 889222, 1070300, 1236463, 1101268, 728551, 780526, 922196, 1069372, 1212277, 965572, 936420, 962760, 1123222, 1166576, 1270246, 1195277, 1220214]
16925A220214k85011M4908K65156j23930L3745L58643k47334m53259L84175J52745
16915A350052l25015K09729J21657J87366n43653K29612K06275j44501J24714
16906A416236p9145j1215P0850k32944O5046J46999l34884L76409n5965J96652
16896A558039n3446K2426m3804R3573J95075q9036J15962k22279P7933n367J55675
16885A804751m77844K31028N7477K31807k97156O6555r5846J81220J42428k1960
16875A822460J22187K27940o07225J8425L04635K9122l78733L88688j01531M79156
16865B305124j87570L90127l29099q9372N1802J55080j99579J63072L01756j22101
16855B439240m03598J99564Q6599J0082K97422k0817j13224Q9983p2286q2095
$$ y = [1220214, 935203, 980111, 1245267, 1121337, 1155082, 1513725, 1266391, 813132, 1197307, 1350052, 1025037, 1234766, 1356423, 1543789, 1000136, 1229748, 1436023, 1291522, 1416236, 1337091, 1325876, 1396726, 1163782, 1228828, 1375827, 1040943, 1417352, 1361387, 1558039, 1504593, 1527019, 1483215, 1576788, 1771863, 1682827, 1798789, 1576510, 1654443, 1649076, 1804751, 1326907, 1557935, 1615412, 1847219, 1550063, 1616618, 1520772, 1701992, 1844420, 1822460, 1944647, 2172587, 1565362, 1583787, 1888422, 1917544, 1538811, 1927499, 1825968, 2305124, 2117554, 2507681, 2178582, 2089210, 2141012, 2296092, 2096513, 2259585, 2561341, 2439240, 2035642, 2235206, 2321805, 2331887, 2629309, 2608492, 2495268, 2585251, 2512965, 2430870]
16845B430870L04339j73195M60935n17810J63205J53922J18829k27418K32707
16836B946384m8435P9650N17584j21902j12489j72676Q0340L65715K2131j63219
16826C393083J94514n0092L23157j96871J84949K54751Q2123k28557L45852M2545
16816D345454k79004K99935J06120J53302J6896J46800k644J9041J96093L35234
16806E337227k15212Q6311N2646L21059L11231j92720R7226M13365l90892K74333
16796F094574M02602m0769M29380p6274M4094L06124l38477K98762M36085L60293
16786G916394j72685M1603L10963L45610K45389J45800L94298j6923L85491R7413
16776I693353N24210N2206J85301O17841r3775Q22424j57483L68942K65458L36310
$$ y = [2430870, 2735209, 2562014, 3022949, 2505139, 2668344, 2822266, 2941095, 2713677, 2946384, 2897949, 2977599, 3495183, 3373281, 3260792, 3088116, 3168456, 3534171, 3556302, 3393083, 3587597, 3537505, 3860662, 3663791, 3848740, 4103491, 4185614, 3957057, 4302909, 4345454, 4066450, 4366385, 4472505, 4625807, 4642703, 4789503, 4786859, 4805900, 5001993, 5337227, 5122015, 5208326, 5260972, 5582031, 5893262, 5700542, 5797768, 6211133, 5820241, 6094574, 6497176, 6456407, 6885787, 6809513, 6853607, 7159731, 6821254, 7120016, 7556101, 7916394, 7743709, 7785312, 8096275, 8441885, 8687274, 8833074, 9227372, 9210449, 9595940, 9693353, 10217563, 10269769, 10455070, 11072911, 10979136, 11801560, 11644077, 12013019, 12278477, 12614787]
16766A2614787K03260M93448O23434L80736K46697J118468q7246N40649L09771
16757A6444004P97466O90385N97057N93722O61819R52404O07373Q22731R84906
16748B3151867P08084Q80288J661835J25171J497852J186197J114252J279143
16740C1604689J908856J345802J490279J778541J592332K061855K024445K199032
16732D6005831K771240K460937K424571L050586L500983L430743L523644L978174
16724G1146709M501752M094440M675845N425168N485967O096856O336869O827547
16716A14591153O705024P705341P282019P745222P673836P755012P738811O785458
16708A73981876O711637O153733N147691L733463K589753J423926k9848j515459
$$ y = [12614787, 12818047, 13311495, 13934929, 14315665, 14562362, 15680830, 15593584, 16134233, 16444004, 17241470, 17931855, 18528912, 19122634, 19784453, 20736857, 21344230, 22166961, 23151867, 23859951, 24740239, 26402074, 26527245, 28025097, 29211294, 30325546, 31604689, 33513545, 34859347, 36349626, 38128167, 39720499, 41782354, 43806799, 46005831, 48777071, 51238008, 53662579, 56713165, 60214148, 63644891, 67168535, 71146709, 75648461, 79742901, 84418746, 89843914, 95329881, 101426737, 107763606, 114591153, 121296177, 129001518, 136283537, 144028759, 151702595, 159457607, 167196418, 173981876, 180693513, 186847246, 191994937, 195728400, 198318153, 199742079, 199712231, 198196772]
16700A98196772k489010m320331m923013n712963o454613o807706p422823p889710
16692A52176603p604861p655140p515994p161443o905713o770220o343936o436823
16684I5782473n009858n741646n286295m412099m638148l982142l694790l543918
16676E9473577l787874k975942k908074k394501k706164k722313j895289k173661
16668C7909759j810601j672718j546879j781300j333125q92574j527565j050101
16660B6294896j057472j204997r36214j139026q48806o11786r85709j031494l22235
16651A8157157o04079q70742n01253n71941n92038l73772p72824l41653l0196
16642A3498659m59341p22769l73479o02405l8851m93812l57940P4575r37717L14535
$$ y = [198196772, 195707762, 191387431, 186464418, 180751455, 174296842, 167489136, 160066313, 152176603, 144571742, 136916602, 129400608, 122239165, 115333452, 108563232, 102219296, 95782473, 90772615, 85030969, 79744674, 75332575, 70694427, 66712285, 63017495, 59473577, 55685703, 52709761, 49801687, 47407186, 44701022, 41978709, 40083420, 37909759, 36099158, 34426440, 32879561, 31098261, 29765136, 28872562, 27344997, 26294896, 25237424, 24032427, 23096213, 21957187, 21108381, 20496595, 19510886, 18479392, 18157157, 17553078, 16682336, 16181083, 15609142, 15017104, 14643332, 13870508, 13528855, 13498659, 13039318, 12316549, 11943070, 11340665, 11301814, 10808002, 10450062, 10524637, 9586920, 9901455]
16632I901455n16493m52556n64759J91494r4384l95654J17577m30443k95124o8002
16622G393111q4977p7313q64150L82958Q5539l56712m80696q2958N5165k32851
16612E737116n58156K19181k47507L56662m56365p1506m1487k49869K59293l01533
16602D645829j85536L39615m19297l78446L16098m09290J27817M7597m25687J48275
16592C806975j47317J73940j61387k02140j39504J79543Q4236k55761j21119k10539
16582C006927Q0653J55412j9156k15426L20364l80351K2729N1083l95002j58394
16572B468839O4729K66997j75603O5636J53333n67750J32365j6575j4754n5204
16562B322013j46338J04978n87294L48313N5867L32022l83509J58585k93552J23058
$$ y = [9901455, 9384962, 8932406, 8367647, 8559141, 8464757, 8069103, 8186680, 7756237, 7461113, 7393111, 7308134, 7230821, 6366671, 6749629, 6835168, 6478456, 5997760, 5914802, 5969967, 5737116, 5178960, 5398141, 5150634, 5507296, 5050931, 4979425, 4937938, 4688069, 4947362, 4645829, 4460293, 4799908, 4380611, 4002165, 4318263, 3908973, 4036790, 4084387, 3658700, 3806975, 3659658, 3833598, 3672211, 3470071, 3330567, 3510110, 3594346, 3338585, 3217466, 3006927, 3087580, 3242992, 3223836, 3008410, 3328774, 2948423, 2971152, 3022235, 2627233, 2468839, 2533568, 2800565, 2624962, 2690598, 2843931, 2276181, 2408546, 2391971, 2377217, 2322013, 2175675, 2280653, 1693359, 2041672, 2097539, 2429561, 2046052, 2204637, 1911085, 2034143]
16552B034143j94610K29485j35412O8853j50500n3291m7360p6062r070K80283
16542A946459K452k2204l68628K5117J8735j38932K11371k61929m7351K14436
16532A579526j37347j06074K04289j3482K7342J04547k24642J6634j17832K10943
16522A543904l69989L20324O4866m01271j26774P9081J19403o7868k31484R2955
16512A023147P761J1181l5345j93862P4675n557R4976j17592M01778l99607M13986
16501A275541n41665M87004n8344k44428m477j75984J25027O4586j8136M6933
16491I56057l15557O1543l9024L11394j55893p6761J68366k44596K17346L6457
16481I19332N2161k11288k14324M67455m90916J74101R5395j05120K63047k71217
$$ y = [2034143, 1839533, 2069018, 1933606, 2002459, 1851959, 1798668, 1751308, 1675246, 1666176, 1946459, 1948911, 1926707, 1558079, 1583196, 1601931, 1462999, 1674370, 1412441, 1365090, 1579526, 1442179, 1336105, 1540394, 1526912, 1554254, 1658801, 1434159, 1450793, 1332961, 1543904, 1173915, 1494239, 1559105, 1157834, 1031060, 1110141, 1229544, 1161676, 930192, 1023147, 1030908, 1042089, 1006744, 812882, 887557, 882000, 976976, 859384, 1261162, 861555, 1275541, 733876, 1220880, 1162536, 918108, 913631, 737647, 862674, 927260, 909124, 956057, 640500, 702043, 663019, 974413, 818520, 741759, 910125, 665529, 882875, 919332, 971493, 760205, 545881, 1013336, 522420, 696521, 791916, 686796, 949843, 678626]
16471F78626L36410k11160M4555o8536j15201J61099j0635O9860j56437j35999
16461E92582L07530N1672m02522J40870K70093j88856k28408K56027l02539J74004
16451F70453J90400j28350l00589K34881k71582J27375k6625l1028P2256J22936
16441F60127o2360j91385J39958R5471L1029j70817j62561L46054j59241m5175
16431D81100O8472k22669K68866j49394J97884j05711M2443j35585j65789O7277
16421C46894K41692j90264J10866L5161J0506B68042J83277l6975R644Q783Q1743
16410E14514j7840G3989K10814K52432J5769j42955j2060q3608K24947k56482
16400B82846L60857l14114L44812j27312G2890J99898p8631j6625J31131J35677
$$ y = [678626, 1015036, 803876, 848431, 779895, 664694, 825793, 815158, 885018, 728581, 592582, 900112, 951784, 549262, 690132, 960225, 771369, 542961, 798988, 496449, 670453, 860853, 732503, 431914, 666795, 395213, 522588, 495963, 464935, 537191, 660127, 597767, 406382, 546340, 641811, 672840, 502023, 339462, 685516, 526275, 481100, 549572, 326903, 595769, 446375, 644259, 538548, 580991, 445406, 279617, 346894, 588586, 398322, 509188, 544349, 554855, 268042, 451319, 414344, 423988, 432771, 514514, 496674, 73989, 284803, 537235, 553004, 410049, 397989, 314381, 539328, 282846, 643703, 329589, 674401, 547089, 72890, 272788, 194157, 177532, 308663, 444340]
16390D44340B00551A1160M62167j00372J79228A72380L30893N704k19663M6947
16380C36261n5332J75717J20045j58960l6718q7295q8859R1410Q9179l3251A66138
16368F5613N1941L22907j5551k4706A81061i9595E92808A39810P2649b8365C49758
16356B44302J46379C1284L14258R4135A88175O7143N9078J46041p3870O7906k02486
16345B51987L84871B27609m5I9604J09181a1965j41824C46402J30229e3173C0280
16333B05328b6549B34235K9413A28967F3880K02995j12440K9699c0708A99185
16322A17222J38067j05877M4408j3579K2144J80398j71136K39299e096E1255M65039
16311E16294I155N2591B0160K53293j29134D2684J25221l2734b75651A19128L5932
$$ y = [444340, 200551, 11160, 473327, 372955, 552183, 172380, 503273, 508977, 289314, 336261, 280929, 456646, 576691, 417731, 381013, 293718, 204859, 296269, 385448, 352197, 166138, 65613, 117554, 440461, 424910, 400204, 181061, -99595, 592808, 139810, 212459, -28365, 349758, 244302, 390681, 31284, 345542, 439677, 188175, 255318, 314396, 460437, 386567, 454473, 251987, 636858, 227609, 227564, 99604, 208785, -11965, -153789, 346402, 476631, -53173, 30280, 205328, -26549, 234235, 263648, 128967, 63880, 266875, 154435, 184134, -30708, 199185, 117222, 255289, 149412, 193820, 180241, 202385, 382783, 211647, 450946, -5096, 51255, 516294, 9155, 61746, 20160, 273453, 144319, 42684, 167905, 135171, -275651, 119128, 155060]
16300A55060J4726e9122b4177A93382O7691J10401j45322K5357P27J7750q7789
16289A82197l7500J48018c1041l75422B28633L1306q4570Q3476k6022N1045j19739
16278A64129J08346R426J04986A40916L01241A81460P8469c06372a29656B87315
16267D15192a66207Q1707C22800P3214j77810G5680K18427n9932E3602e655B64356
16255C04018D388J53890F6466O4173L45939a0035A75170K1170J9118A1893d6718
16243a90118A21348C8284c47993b8287B05350g5545F008a37011C00057A17328
16232D94279a09829A08978a67901A66732b1255q925A81127r618b3823A5597M3344
16221E8941c05843A64137A5490J54700h6858a9829A35283i6605b1377A95599I2103
$$ y = [155060, 169786, -59122, -24177, 193382, 261073, 371474, 226152, 251509, 252236, 269986, 182197, 144697, 292715, -31041, -406463, 228633, 259939, 175369, 258845, 232823, 283868, 164129, 272475, 281901, 386887, 140916, 442157, 181460, 259929, -306372, -129656, 287315, 415192, -166207, -84500, 322800, 396014, 218204, 75680, 294107, 234175, 53602, -5655, 264356, 304018, 4388, 158278, 66466, 130639, 476578, -10035, 175170, 196340, 215458, 11893, -46718, -190118, 121348, 38284, -347993, -28287, 205350, -75545, 6008, -137011, 300057, 117328, 494279, -109829, 108978, -167901, 166732, -21255, -30180, 181127, 171509, -23823, 15597, 58941, -305843, 164137, 15490, 170190, -86858, -19829, 135283, -96605, -21377, 195599, 92103]
16209D26903e6502k20684A20955n7009N3750A4416a89900H939a41871M0603F7960
16197A08787K68589c3137A23881n4659A9316N5001J04245e1460n5785a3193l8485
16186e1678B25234q5341L38131d0128B01211C5442c00614d7136l82354B1548O4658
16175H6206J7300C6745K24494j10359g8478A17343m6618O844a07044j9722B59403
16163B1128J72748Q8627H5308a82868C4479R8289E5647a16895B22518C1593h377
16151B05407a44597A58777F2135L8780G90b00242j7983M6305A18306a11773A06536
16139a26221k0849A57774H874J54404q1126L3590K8306J18441a41309J7152f93
16127A20298a35047o8971B46363J79326H2923A158a45567A83999J8769a01078
$$ y = [426903, -56502, -277186, 120955, 63946, 117696, 14416, -189900, 8939, -141871, -101268, 67960, 108787, 377376, -33137, 123881, 69222, 19316, 74317, 178562, -51460, -107245, -13193, -51678, 225234, 139893, 478024, -40128, 201211, 35442, -300614, -47136, -429490, 21548, 86206, 103506, 36745, 261239, 150880, -78478, 117343, 70725, 77569, -107044, -126766, 259403, 21128, 193876, 282503, 85308, -182868, 34479, 132768, 55647, -116895, 222518, 31593, -8377, 205407, -144597, 158777, 62135, 100915, 790, -200242, -218225, -171920, 118306, -111773, 106536, -126221, -147070, 157774, 8874, 163278, 82152, 115742, 144048, 262489, -141309, -124157, -693, 120298, -135047, -204018, 246363, 425689, 82923, 1158, -145567, 183999, 202768, -101078]
16116C17645j8059H3382p509l7288A4962Q9417d8073k02516Q4962F2471K639d0236
16103C03520h4209A15630b34181R9180K5555G5539J55413b82842Q5178F9612b8374
16091g9221E2282N13067D0672K3206f5071R274F7971J50395R9611G5320Q4736
16080A60056E6914J24105F5672m131a84535A13105E0686L7802A8839g3190m0014
16069a13204D06604a50909D28904a92758A91400b57515B4460J5450b39239r1582
16059c30821F330L1329j2667L7955b5827o0515l8871C5077a83650G1082d9450
16047a80060B9510b85880B8223d8537A05413b41724c5533k88281B41650G5287
16036A10423e9437A13849c35895f1527n4625J3127k02623B7879f6938j30616O2350
$$ y = [317645, 299586, 83382, 75873, 38585, 14962, 104379, -48073, -250589, -165627, 62471, 65110, -40236, 303520, -84209, 115630, -234181, -135001, -109446, 75539, 230952, -282842, -197664, 69612, -28374, -79221, 52282, 565349, 40672, 63878, -65071, -55797, 67971, 218366, 317977, 75320, 160056, 56914, 181019, 65672, 61541, -184535, 113105, 50686, 88488, 18839, -73190, -113204, 406604, -150909, 428904, -192758, 191400, -257515, 24460, 39910, -239239, -330821, 6330, 37659, 24992, 62947, -25827, -86342, -125213, 35077, -183650, 71082, -49450, -180060, 29510, -285880, 28223, -48537, 105413, -241724, -35533, -323814, 241650, 75287, 110423, -59437, 113849, -335895, -61527, -116152, -103025, -305648, 27879, -66938, -197554, -135204]
16025a35204k7093A85964R9663c0295p1524B15766c63628B00604F2251a34168
16014B31988a65680E5577b05166j90291a50037b640A4802b01210L9185A05507
16003B25233A8554J07113b15106G2427a19631j64121g3090l100b1300A9343K33087
15992B52430g0888j10327l3771c2211n6245k70260J8008DJ28410l7525L67600
15981D58489B7135b4987D0109N7727M9401n827J14300F0370a0136a75o6026n907
15969g2108B67160b9527A82887N0192e4024m034k18571H7113d32924f2194j39995
15958b02189A41897a52451I7702J02346F7506J79320a75476B58489a29224k06276
15948c35500J29316m2393F5516b45228B2276c5359F7019d8872k04592i1829A71454
$$ y = [-135204, -162297, 185964, 285627, -30295, -101819, 215766, -363628, 200604, 62251, -134168, 231988, -165680, 55577, -205166, -395457, -150037, -2640, 14802, -201210, -162025, 105507, 225233, 18554, 125667, -215106, 72427, -119631, -283752, -73090, -76190, -21300, 19343, 252430, -70888, -181215, -214986, -32211, -88456, -358716, -340708, 4, 128414, 90889, 458489, 27135, -24987, 40109, 97836, 147237, 141410, 255710, 60370, -10136, -175, -66201, -72108, 267160, -29527, 182887, 233079, -54024, -58058, -276629, 87113, -432924, -62194, -202189, 141897, -152451, 97702, 200048, 67506, 246826, -175476, 258489, -129224, -335500, -206184, -248577, 65516, -245228, 22276, -35359, 67019, -48872, -253464, -91829, 171454]
15936a23352M4107j46124K0761A10417Q5896b49828N252h5972H5857L0151J04204
15925B20212c75752J43499B73505q1334a84464f3419G1060b05010O3141c5564
15914B73947F3186a26402Q713K7472q6208G8516C8470c48485B19656D0122b0482
15902b45377e7883p5350p0307B83628A22019J80816B2040a37446A73360a63842
15891c1191D985d7641B05956a42029j38575J35139m708n2780B03149b69821F9068
15879g5374B94422b05357b5518l3919I4869M0136k435g5585k003j04488A23878
15867H8090J1983J34156e6852I1789a45268A26451a83834a4290I684L09135q0345
15856B38474f1909C80938j09151F4582b99943J23343B56377e8161k08901e5376
$$ y = [-123352, -79245, -225369, -204608, 110417, 196313, -249828, -244576, -85972, 85857, 116008, 220212, -375752, -232253, 273505, 192171, -184464, -63419, 71060, -205010, -141869, -35564, 273947, 63186, -126402, -117689, -90217, -176425, 78516, 38470, -348485, 219656, 40122, -20482, -245377, -57883, -133233, -203540, 283628, 122019, 302835, 22040, -137446, 173360, -163842, -31191, 4985, -47641, 205956, -142029, -280604, -145465, -150173, -202953, 203149, -269821, 69068, -75374, 294422, -205357, -25518, -59437, 94869, 135005, 132570, -75585, -77588, -182076, 123878, 88090, 100073, 234229, -56852, 91789, -145268, 126451, -183834, -14290, 9684, 318819, 238474, -61909, 380938, 271787, 64582, -299943, -176600, 256377, -58161, -267062, -55376]
15845a35187j94362I2053i2448B23435C311L62989r8873i715A2434J60370c5105
15833a10411b6053j00320L1322E9933a05820o8661k4007j10117d2252k7878A10326
15821C03801a50585A2573a05537M5023n0520r7971P8035c2330B9087a6955k67687
15810b84642a7051m2627B03914a47056E617c17785h867k35260j55596A23260b68044
15798B12849M8776a26624A16909J86215a7042j23521e5486O598J330C32704c86894
15786c9458B36196e6537D22177g5273j00504H5951b9150o5712j02024R6111L7615
15775f3160A55123o1694b07717A95019B1313a82982P5397r0785A7516K1291E267
15763C2185b67274j7249B10311o9463a65195N4884n5231r0852H354P8362d62530
$$ y = [-135187, -329549, 92053, -92448, 223435, 3311, 366300, 267427, -9715, 12434, 172804, -35105, -110411, -26053, -126373, -95051, 59933, -105820, -174481, -198488, -308605, -42252, -70130, 110326, 303801, -150585, 12573, -105537, -60514, -111034, -209005, -130970, -32330, 29087, -16955, -284642, -17051, -59678, 203914, -147056, 5617, -317785, -8867, -244127, -399723, 123260, -268044, 212849, 261625, -126624, 116909, 303124, -17042, -140563, -55486, -48888, -47558, 332704, -386894, -39458, 236196, -56537, 422177, -75273, -175777, 85951, -29150, -94862, -196886, -100775, -63160, 155123, 93429, -207717, 195019, 21313, -182982, -107585, -198370, 17516, 38807, 5267, 32185, -267274, -284523, 210311, 140848, -165195, -110311, -165542, -256394, 8354, 86716, -462530]
15751A30143a4484B16238A5206O67J28315J7389a91581d4448j03337B879K05691
15740B08570m658n1742A8317d18531f8005A00985N1320a09354A38069a76729A03234
15728b87164A57362p2832b49823J01069N4192A38683E7699a59982j6692q0277
15718b56951I6024A6467J37447L9559c38378j283C588J15297k6440a19014p3090
15707a92104b4516n1340l23924B69348e12976a28878a2139k41830O0973G4264
15696i7590j14136F3694d2621E8486D566a21046L0256p032j36087e1853j72053
15685b23906A78825A6565L7211d4013B93329D5965b31048a4115j04606C03755
15674B07507k2157c60820c9958r3259c5540l4396E3701h7384c972k43109d0231
$$ y = [130143, -14484, 216238, 15206, 15873, 144188, 161577, -191581, -44448, -147785, 2879, 208570, 203912, 152170, 18317, -418531, -68005, 100985, 152305, -109354, 138069, -176729, 103234, -287164, 157362, 84530, -249823, -148754, -94562, 138683, 57699, -159982, -176674, -256951, 96024, 16467, 153914, 193473, -338378, -339661, 3588, 118885, 92445, -119014, -192104, -24516, -75856, -399780, 269348, -512976, -128878, -12139, -253969, -192996, 74264, -97590, -211726, 63694, -42621, 58486, 4566, -121046, -90790, -97822, -233909, -51853, -223906, 178825, 16565, 53776, -44013, 293329, 45965, -231048, -14115, -118721, 303755, 207507, 185350, -360820, -39958, -133217, -35540, -69936, 53701, -87384, -3972, -247081, -40231]
15662c9232A47781f8240F6362J34892M157b02254K4156Q1146A69627a62500N5532
15651a06968A59263l493i0287A0887d5319a7909j46710b9135F926L372e0792k9895
15639h0687B07374b20738C36302j29766a30849C9108b39435A54290a40821A69358
15628B18725h8091k21661c3209A05477i5930P250A04569A8242c3385j86962B5592
15616c5552A39709b35106a10560q4922C5619Q0374J03962a44875A75805c18363
15605a93100G6896Q2485a31850A75195i9268k0373B26707k0575i3748C79032i1731
15593B4665b57695L1710a09843M14A6776h7176j10267f5632L1050B01995a50528
15581a459j55313k28987o6229A02148a70382C2527J6931K25954K2139C591J64273
$$ y = [-39232, 147781, -68240, 66362, 201254, 205411, -202254, -178098, -96952, 169627, -162500, -106968, 159263, 155770, -90287, 10887, -45319, -17909, -164619, -29135, 6926, 10298, -50792, -80687, 207374, -220738, 336302, 206536, -130849, 39108, -239435, 154290, -140821, 169358, 218725, -88091, -309752, -33209, 105477, -95930, -88680, 104569, 18242, -33385, -220347, 25592, -35552, 139709, -235106, -110560, -195482, 35619, 115993, 219955, -144875, 175805, -318363, -193100, 76896, 159381, -131850, 175195, -99268, -119641, 226707, 206132, -93748, 379032, -91731, 24665, -257695, -225985, -109843, -109429, 16776, -87176, -197443, -65632, -34582, 201995, -150528, -1459, -156772, -385759, -451988, 102148, -170382, 32527, 49458, 275412, 297551, 3591, 167864]
15570A67864J13117c82660A71974n152b0996r6458l8491m1617A03963C7318c4288
15558B6440A0325b52005i8781p278r0598p0751k5750e9126o7808A46753l3642
15547A13111J01677a0554B57959b9913A9443Q3305d9740m251H6366B9641a29531
15535G4017b11563E3092K421J7314b70418n4936P8264J11414G4261K9792g2853
15523a0768k50058I7655i9552j11051J7114D91146a58548a6273A13950c04854
15512a36783k03541g4498j8293E3083A2686a69512b7677A10601J86638i4690A42443
15500b59262J19933L5106F9542b8953A67687A1143g8354m3126G8843a37554M5355
15489i2199r1605C239Q5270B6619i6609P265B53928I4234l1106L5706k4119b192
$$ y = [167864, 280981, -382660, 171974, 166822, -20996, -117454, -155945, -197562, 103963, 37318, -34288, 26440, 10325, -252005, -98781, -106059, -196657, -267408, -293158, -59126, -126934, 146753, 113111, 214788, -10554, 257959, -29913, 19443, 102748, -49740, -53991, 86366, 29641, -129531, 74017, -211563, 53092, 55513, 72827, -270418, -325354, -247090, -135676, 74261, 104053, -72853, -10768, -260826, 97655, -99552, -210603, -193489, 491146, -158548, -16273, 113950, -304854, -136783, -340324, -74498, -92791, 53083, 12686, -169512, -27677, 110601, 297239, -94690, 142443, -259262, -139329, -104223, 69542, -28953, 167687, 11143, -78354, -121480, 78843, -137554, -92199, -183804, 3239, 88509, 26619, -96609, -89344, 253928, 94234, 63128, 98834, 74715, -2192]
15476A49679b11854A25396a61172A29919n2158a12026A62665d7271B36532a54594
15465e7223j48221B35503g0416E0568k0260L2675J80379a54054C07789A24095
15454f5242a0556B70422A32657b92784a6660o74B42107J02604n9758a10774k6098
15443a36872a6056B35434b53540R4709f533A05794a73131A8749J49454A5834J84564
15432B00398c3858A3347a87444j8677J8314A01875j868O5720G6894j9701a82867
15420a97022B38212E9560M19995A3670b11477A40389a88915N2059A67592b24960
15409c36624A07636b66906e3097k27512E2857f5686A02220a91006B27112a38985
15398a32569G5285a7072B82181A01919A6099e8232C432M6809J4879a35376n2500
$$ y = [149679, -211854, 125396, -161172, 129919, 77761, -112026, 162665, -47271, 236532, -154594, -57223, -205444, 235503, -70416, 50568, 30308, 62983, 243362, -154054, 307789, 124095, -65242, -10556, 270422, 132657, -292784, -16660, -17334, 242107, 344711, 284953, -110774, -136872, -16056, 235434, -253540, -158831, -6533, 105794, -173131, 18749, 168203, 15834, 200398, -33858, 13347, -187444, -206121, -187807, 101875, 100007, 165727, 76894, 57193, -182867, -197022, 238212, 59560, 479555, 13670, -211477, 140389, -188915, -136856, 167592, -224960, -336624, 107636, -266906, -53097, -280609, 52857, -65686, 102220, -191006, 227112, -138985, -132569, 75285, -17072, 282181, 101919, 16099, -58232, 3432, 50241, 65120, -135376, -187876]
15387a87876B93714H0919J14256Q6972g8220l6646B02141a01706A6043d06727
15376b29428G5621Q1985d15017G3556c56559A34880F4572J07069D8426a39642
15365B21158F5654k1560j9138K7063g8781m3987H3397Q321R4898p3363b36223
15353C02486f9364O843B09866d8675G3655b4242D6457c13498e9388E3240b19342
15341h3511A34442Q109d10050A72285A6573a12457A4812Q1975b03211h2220A82764
15329c0994F9801e4234n559j7659b0149G754g6964K26F1582J95498b9681B03200
15316b09097D189g6714B04725C2909K80592b245H7938a04970a3471G1139J15690
15305A86829L0634r0812b31946A21609E5922J72045C323h8179B5308L7764J03925
$$ y = [-187876, 293714, 80919, 195175, 282147, -78220, -114866, 202141, -101706, 16043, -406727, -229428, 75621, 157606, -415017, 73556, -356559, 134880, 64572, 171641, 48426, -139642, 221158, 65654, 44094, 24956, 52019, -78781, -122768, 83397, 91718, 186616, 113253, -236223, 302486, -69364, -62521, 209866, -48675, 73655, -24242, 46457, -313498, -59388, 53240, -219342, -83511, 134442, 142551, -410050, 172285, 16573, -112457, 14812, 96787, -203211, -82220, 182764, -30994, 69801, -54234, -59793, -77452, -20149, 7754, -76964, -76738, 61582, 257080, -29681, 203200, -209097, 4189, -76714, 204725, 32909, 313501, -2245, 87938, -104970, -13471, 71139, 186829, 217463, 126651, -231946, 121609, 55922, 227967, 3323, -88179, 25308, 63072, 166997]
15294A66997e101n4716A17857e3634l0454b3238k01613q0407M6455A24632f876
15282h8733A38654a06558a1385A57396M6579B2381L6361a34696r5366B36558j08849
15271A27709i5077d738B06283D4245b9959I6893B144a07528B29438a0936j12273
15260a23209C354J00454O7868k9116O8514E2490K96081c40446a57438C41775f9816
15248B40471b17316B76622h2039A39908b90620c4046C74733A33384L63160p1306
15238D25238j16040J08805N579K97005O19887n65026N64505n61594A73264K48853
15228D22117h5943C41777A64162L3739R080K50600a09812d7502k01243C92623
15217b3235J180C4369a18896B37608a43578A06489L9215G0225J67799d6861I8863
$$ y = [166997, -5101, -59817, 117857, -53634, -84088, -23238, -224851, -305258, -258803, 124632, -6876, -88733, 138654, -106558, -11385, 157396, 203975, 22381, 58742, -134696, -230062, 236558, 127709, -95077, -4738, 206283, 44245, -29959, 96893, 2144, -107528, 229438, -10936, -123209, 3354, 103808, 171676, 142560, 211074, 52490, 348571, -340446, -157438, 341775, -69816, 240471, -217316, 276622, -82039, 139908, -290620, -34046, 374733, 133384, 496544, 425238, 309198, 418003, 423582, 720587, 1340474, 775448, 1339953, 778359, 173264, 422117, -85943, 341777, 164162, 197901, 206981, 457581, -109812, -47502, -248745, 392623, -23235, -22055, 34369, -118896, 237608, -143578, 106489, 145704, 70225, 238024, -46861, 98863]
15205b26214A98762h5924A11580a2872A4885J62974b88811B01465N1496g0098
15194d68578C7559J8316J6434a51310B75630D6532g0249A66983b27331O8460G7074
15182b088A04846c7616I167J98494b16699A31560a03528A17867K24443b50385
15171C3054R1352m6739a30712h031G5977Q2513E6664f0472B72918F8932M1560
15160A10492a101k6310B05241J82820A78551f2096k15145B71507j17938B7266
15149A6476J49518b68440A82784p4074f3361D9355K45670a01061I1773c0817C02817
15137A28728B1564J25531L6796a47898B47636C703L0473K6958E27N5243K32244
15126B88014b8625A42611J32680A28148B2639c1005B18956F8070J19052g7023
$$ y = [-226214, 198762, -85924, 111580, -12872, 14885, 177859, -288811, 201465, 252961, -70098, -468578, 37559, 55875, 72309, -151310, 275630, 46532, -70249, 166983, -227331, -158871, 77074, -2088, 104846, -37616, 9167, 207661, -216699, 131560, -103528, 117867, 342310, -250385, 33054, 124406, 77667, -130712, -8031, 75977, 158490, 56664, -60472, 272918, 68932, 110492, -1101, -27411, 205241, 388061, 178551, -62096, -277241, 271507, 153569, 27266, 16476, 165994, -268440, 182784, 108710, -63361, 49355, 295025, -101061, 91773, -30817, 302817, 128728, 21564, 147095, 183891, -147898, 247636, 3703, 34176, 61134, 527, 55770, 288014, -28625, 142611, 275291, 128148, 22639, -31005, 218956, 68070, 187122, -77023]
15115B15607h9319C03380I4171j4784N6202K11817j08369D8813j4257R3153m5862
15104H1847N7147J37816a78679I1696G405L29423G8067B5085J60361J02218e6574
15092B51577p0746H6551K12739j18737J2375n1497o3782k5267J71232p6670g65
15080F8549g5388a6446e296C41819a01152B79489G8501J25351J46201k128j37421
15069B10504d338B40218A14198C1234K45171p5303J72678j60986Q0681K7544A43948
15057A17698J09554j07119J6932l4017i6375E775J74929D509a1020C4682b9828
15045A53767a68418J5891A62590I603Q3992q68J80162I8908L65906a23360A48712
15033B36045J3740A07681J5189A3794M33518A10895J83617K91099b1462A39849
$$ y = [215607, -89319, 303380, 94171, 79387, 135589, 347406, 239037, 48813, 34556, 127709, 81847, 138994, 276810, -178679, 91696, 7405, 336828, 78067, 25085, 185446, 287664, -56574, 251577, 180831, 86551, 299290, 180553, 192928, 141431, 77649, 52382, 223614, 146944, -765, 68549, -75388, -16446, -5296, 341819, -101152, 279489, 78501, 203852, 350053, 347925, 210504, -4338, 240218, 114198, 31234, 276405, 201102, 373780, 212794, 293475, 321019, 143948, 117698, 227252, 120133, 137065, 103048, -96375, 5775, 180704, 4509, -11020, 34682, -29828, 153767, -168418, -152527, 162590, 9603, 93595, 92727, 272889, 98908, 464814, -123360, 148712, 236045, 249785, 107681, 122870, 13794, 447312, 110895, 294512, 585611, -21462, 139849]
15022B86721D0808K51719j03930m1943K20235A20382R4740i4799A55510P9841
15012B35351J76186m3751G6016K30652C9821L65346j40392G3013K17492r2438
15002A98067J78203j33494N308m68J79704E5406J18703K05733b6518C48492E041
14990A73425H18L03613p17j31575J8641i5143B26364G4945L12428A24578d5217
14978D46377j98807R5775a0230D62599A30697C5422J60651a62384I4356O13821
14968G08177B66454H9091K8266K07894a594m8485B02460n4474J07948p2748l7467
14957A45719L5559b1565C92344A61151K57420r2253I4673J82679j041B0817c0224
14945A95143a20255D08432j64610J53565q6807O926Q3421j20943J38039j53288
$$ y = [286721, 40808, 292527, 188597, 146654, 366889, 120382, 215122, -94799, 155510, 235351, 411537, 367786, 76016, 306668, 39821, 405167, 264775, 73013, 290505, 198067, 376270, 242776, 248084, 247616, 427320, 55406, 174109, 379842, -26518, 348492, 5041, 173425, 818, 304431, 303714, 172139, 190780, -95143, 226364, 74945, 387373, 124578, -45217, 446377, 247570, 343345, -10230, 462599, 130697, 35422, 196073, -162384, 94356, 708177, 266454, 89091, 117357, 325251, -1594, -50079, 202460, 147986, 255934, 183186, 145719, 181278, -21565, 392344, 161151, 418571, 326318, 94673, 277352, 276311, 20817, -30224, 195143, -120255, 408432, 243822, 397387, 310580, 317506, 400927, 279984, 418023, 264735]
14935B64735Q072N4574N473j63867o023E3625M07639J5015A57930J4336J43513
14924C15779K32914A51658J37712J64706F9498P3415l4675D0420J69624r0400
14914A19644M9290K39288M1235j98649r7246K7853j1299J95520m7846A51408K76166
14903D27574j48287l3357K51593C8130K92148l2155J00584A22891J02632J00362
14893C25885K22234j88612B2177J66167e4821A72838J87281o4410j19774J82973
14883C58908D0624K19841L69084j15631k55949E5788M98076B02877J90672a19169
14872E51291j92479o3684n3911J13583j5469i2851D20094e5836F39689C6583M51698
14861D88281I7308K42562j63276K63480B01985K26712J92589k52426j50098K24309
$$ y = [264735, 272807, 327381, 332854, 168987, 162964, 53625, 461264, 476279, 157930, 172266, 315779, 548693, 151658, 289370, 454076, 69498, 142913, 108238, 40420, 210044, 119644, 168934, 408222, 449457, 250808, 153562, 181415, 170116, 365636, 317790, 151408, 427574, 279287, 245930, 497523, 38130, 330278, 298123, 398707, 122891, 225523, 325885, 548119, 359507, 22177, 188344, -54821, 172838, 360119, 295709, 175935, 358908, 40624, 260465, 629549, 513918, 257969, 55788, 553864, 202877, 393549, -119169, 551291, 358812, 295128, 241217, 354800, 339331, -92851, 420094, -55836, 639689, 36583, 488281, 97308, 339870, 176594, 440074, 201985, 428697, 621286, 368860, 218762, 443071]
14851D43071l2186q7522r7244K67925k13083c9790E62173p9881K04119j88729
14841D97682o8087q7443l1048L7930j2641K39974j9972n2306M35871C80007L54300
14830G34307k36795r148o346A53030M94581k45515O3584j45642K03253B26128
14819D03183M164k0711J59934j45841p7546Q5133o354P9193j37162K99495C16396
14807D95947N4684A60853L05545p4415M64501D21352J5321L26619R1399k53930
14797F00761p7445L9472j00929j13188K26538j62597j99627L66555j17898j36751
14787C24891J32392P207n0537J47387K8534k57477M15323l71389K59852N4244
14777F90427A21098K83244l615n327R5750K3832j61913P01757m66072R6396j11909
$$ y = [443071, 410885, 323363, 226119, 494044, 280961, -39790, 562173, 482292, 686411, 497682, 429595, 342152, 311104, 349034, 336393, 576367, 556395, 504089, 939960, 380007, 734307, 497512, 488364, 482018, 153030, 647611, 402096, 465680, 320038, 523291, 226128, 403183, 407347, 386636, 546570, 400729, 323183, 408316, 401962, 481155, 343993, 643488, 316396, 495947, 550631, 160853, 466398, 391983, 856484, 421352, 436673, 763292, 854691, 600761, 523316, 562788, 461859, 348671, 575209, 412612, 212985, 579540, 461642, 324891, 457283, 464490, 413953, 561340, 589874, 332397, 747720, 376331, 636183, 690427, 121098, 404342, 400727, 395400, 491150, 514982, 353069, 1054826, 588754, 685150, 573241]
14766E73241m7421O4788j78273K31282K55120C60852L87633J7968j18718j51647
14756D96088J57519j52254K0805j7369K44018l57397j51070K71809J0305A10061
14745G92771k26733j41808K82961o8587k36569M6644K84429k63088L91097k99109
14735E62008j84601L62855k69428K85834j50781m0454J87488k44583O1904Q3780
14725F54022J26782j57044J18776R803J47730D45341N07402l72397K18562k88064
14715E10844K66770k06974J86405C77707L57480k20873R8817P6917J26964L76043
14705A193055l52435p5235N3188j09551J33814m1253k2006q8796J00344K3375
14695H14500K4374m1362l41212J65008M42695k09177k34416L36125m31547J98572
$$ y = [573241, 525820, 590608, 412335, 643617, 898737, 360852, 748485, 766453, 647735, 496088, 653607, 501353, 522158, 504789, 748807, 391410, 240340, 512149, 522454, 110061, 792771, 566038, 424230, 707191, 638604, 402035, 448679, 733108, 470020, 861117, 562008, 377407, 740262, 470834, 756668, 605887, 565433, 752921, 508338, 570242, 654022, 780804, 623760, 742536, 752339, 900069, 445341, 952743, 580346, 798908, 510844, 777614, 570640, 757045, 377707, 735187, 514314, 613131, 690048, 817012, 1193055, 840620, 765385, 818573, 709022, 842836, 801583, 779577, 690781, 791125, 814500, 838874, 797512, 456300, 621308, 1064003, 854826, 620410, 956535, 524988, 723560]
14685G23560R7084L15251k14546k02635O8219L79627E75702L67655j66795J42270
14675I18832j36640K76243j64110J1711j47238K13281m11324K80048K15918m6302
14665A010419j3303j41956l5675j4617K81973K8049K37196o19641L45879k7063
14655A051261Q7946j96683n7588K0778q2728M17669j73203m9515Q7006K21425
14645A326368j61235l49829J78841K73629k21444K54512J26959k86495j10040
14636A031266J76822n91048O53936j1763o4077j18305K92523k99713J16941j60674
14626A025908K29509r025n1228q700J00014P4845j09689L03067N7997l60879L54382
14615A606201l74342J87171P7283k9056k13656K30607k11485K12733j34363J402
$$ y = [723560, 820644, 1135895, 921349, 718714, 786933, 1166560, 575702, 943357, 776562, 918832, 782192, 1058435, 894325, 906036, 758798, 972079, 560755, 840803, 1056721, 1010419, 997116, 855160, 819485, 804868, 1086841, 1114890, 1352086, 732445, 1078324, 1051261, 1139207, 942524, 884936, 905714, 822986, 1240655, 1067452, 1017937, 1104943, 1326368, 1165133, 815304, 994145, 1267774, 1046330, 1300842, 1427801, 1141306, 1031266, 1208088, 617040, 1270976, 1259213, 1195136, 1076831, 1369354, 1069641, 1186582, 1025908, 1255417, 1246392, 1195164, 1186464, 1286478, 1361323, 1251634, 1554701, 1612698, 1251819, 1606201, 1231859, 1419030, 1496313, 1467257, 1253601, 1484208, 1272723, 1485456, 1351093, 1352495]
14605A352495O1771J60219j24407k74962K99524M7420j83506N40883k52137k07109
14595A420191N4252L2513l3999J52509J6638n4463j68752K88475k23487J98919
14585A682796k8090l3767L1330k75189n5414M12856J01524m6620R409j77756K31447
14574A852526K20826o187m36029J2657K43765Q4803J85265j59933j6706j805k25449
14563A753733J9549N77312l21349q499p2382K87338j95247K35360L08295l21444
14553B262666J27156L5549K15873K3887l92639N63086o7795m3773J07547o4436
14543B767121L47353P7805M40785L46118j33432N09823O92024O74201J421950
14534G143748K350157L941086O453047R897847K583631j2439657q186915m360632
$$ y = [1352495, 1414266, 1574485, 1450078, 1175116, 1474640, 1522060, 1338554, 1879437, 1627300, 1420191, 1474443, 1506956, 1472957, 1625466, 1642104, 1587641, 1418889, 1707364, 1483877, 1682796, 1654706, 1620939, 1652269, 1377080, 1321666, 1734522, 1836046, 1789426, 1798835, 1621079, 1852526, 2073352, 2067165, 1631136, 1643793, 1887558, 1972361, 2157626, 1997693, 1980987, 1979182, 1753733, 1773282, 2350594, 2029245, 2020746, 1948364, 2235702, 2040455, 2275815, 2584110, 2262666, 2389822, 2425371, 2641244, 2665131, 2272492, 2835578, 2767783, 2724010, 2831557, 2767121, 3114474, 3192279, 3633064, 3979182, 3845750, 4355573, 5047597, 5721798, 7143748, 9493905, 13434991, 19888038, 29785885, 32369516, 19929859, 11742944, 7382312]
14526G382312j958818j202027n82022m52393k59544j13883j88792J74034k39140
14517B559727m36051J04894J09088M70088j92004m81040N38818m05734o8476K14584
14507B413894K16133m24790L88633O3264p9961r3914J06627K21256n53550N45986
14497B803578L29697k21538k39911K79087l2232k29336J47553o385M35981m74928
14487B791566O2522M19156j49891R4982j93004K55877Q213J65436K0J84852l7675
14476C602054k38721J05700J25609J233j96799j41271L91473j05919R5540R8843
14466C737742N72090n92888L34808j49306L69430j25592j59111K46462q1137K62534
14456D415032j77952K48442O9994j57859J801L8363P7678K48718Q1160k36152
$$ y = [7382312, 5423494, 4221467, 3639445, 3187052, 2927508, 2813625, 2624833, 2798867, 2559727, 2123676, 2228570, 2337658, 2807746, 2615742, 2134702, 2673520, 2267786, 2199310, 2413894, 2630027, 2205237, 2593870, 2657134, 2577173, 2483259, 2589886, 2811142, 2257592, 2803578, 3133275, 2911737, 2671826, 2950913, 2918681, 2689345, 2836898, 2830513, 3266494, 2791566, 2854088, 3273244, 3123353, 3218335, 3025331, 3281208, 3289421, 3454857, 3454877, 3639729, 3602054, 3363333, 3469033, 3594642, 3595875, 3399076, 3257805, 3649278, 3543359, 3638899, 3737742, 4309832, 3716944, 4051752, 3902446, 4271876, 4146284, 3987173, 4233635, 4152498, 4415032, 4237080, 4485522, 4555516, 4397657, 4399458, 4437821, 4515499, 4764217, 4845377, 4609225]
14446D609225N59580J30897k32102l46412L56260k4165K75802m8922K53822l099
14436E530886J09664j33849J70401J2460p947j21672K03754K83102k18892K95976
14426F123883Q0058J19911k06949M30288j94894M0970J99375L70798o7579j15338
14416F780523n6769K50750J34895K15225O7704Q8257J96198j05075L53292j77458
14406G747542R5517K80296o7537L31432j4263n2581M46397q7040M53875J15949
14396I249587R6804k04972L50182J15836J30683K01881K1422K19693K07983n5612
14386A0333487N68168J89897l5319J90923J97405k22569N39728P8664M18174K12748
14376A2471306J74287L5114K60460M70361K79125L48569n3778K65623K56513M36034
$$ y = [4609225, 5168805, 5299702, 5067600, 4721188, 5077448, 5053283, 5329085, 5280163, 5533985, 5530886, 5640550, 5506701, 5677102, 5689562, 5681615, 5559943, 5763697, 6046799, 5827907, 6123883, 6203941, 6323852, 6116903, 6547191, 6352297, 6393267, 6592642, 6963440, 6895861, 6780523, 6723754, 6974504, 7109399, 7324624, 7392328, 7480585, 7676783, 7571708, 7925000, 7747542, 7843059, 8123355, 8055818, 8387250, 8372987, 8320406, 8766803, 8679763, 9133638, 9249587, 9346391, 9141419, 9491601, 9607437, 9738120, 9940001, 9961423, 10181116, 10389099, 10333487, 10901655, 11091552, 11056233, 11247156, 11444561, 11221992, 11761720, 11840384, 12258558, 12471306, 12645593, 12680707, 12941167, 13411528, 13690653, 14039222, 13985444, 14251067, 14507580, 14943614]
14366A4943614J66047L78210M33652p050N74964L84017K01620M55716J12245J27471
14356A7770506P38782L76888K00125M78678O48059L52361J26124R70032L45414
14347B2006969J02227P51134K86226L94049P01109Q42917L52347J26075R27159
14338B6490212J184828L27947P40145M98791Q03103M69919J042890J072344P00882
14329C3331061P89714O90766R73233J159560O65685J241062J129212R60093J372036
14320D2312422R99796J178511J401661J914010J207725J290183J861766J580494
14312E3746568J436054K139375J877556J970228K165334K089566K692853J683742
14304F9801276K995559K935169K194574M019767K541523L457487L455523L369729
$$ y = [14943614, 15109661, 15487871, 15921523, 15914473, 16489437, 16873454, 17075074, 17530790, 17643035, 17770506, 18509288, 18886176, 19086301, 19564979, 20213038, 20565399, 20691523, 21661555, 22006969, 22109196, 22860330, 23146556, 23540605, 24241714, 25084631, 25436978, 25563053, 26490212, 27675040, 28002987, 28743132, 29241923, 30045026, 30514945, 31557835, 32630179, 33331061, 34120775, 34811541, 35784774, 36944334, 37610019, 38851081, 39980293, 40940386, 42312422, 43312218, 44490729, 45892390, 47806400, 49014125, 50304308, 52166074, 53746568, 55182622, 57321997, 59199553, 61169781, 63335115, 65424681, 68117534, 69801276, 72796835, 75732004, 77926578, 81946345, 84487868, 87945355, 91400878, 94770607]
14296I4770607M044106M196396M001090M623457N340833N031642N225537O052874
14288A33286542O153249O234958O885015P588232P680805Q123448Q771565Q885374
14280A93609188R875051J0583290J0983675J1421727J1724289J3406792J3561428
14273B75165440J4002421J4843655J5188965J5530109J5937734J5838397J6132179
14266C82638900J5727430J4302368J3078466J0602049R018902P721281O359774
14259D59449170N772066L516631J60941j178274j163859m714538r726235r600224
14251D42515678j0496747j2986688j3483859j3359936j2985177j3316707j3100312
14244C52786252j3133016j3752467j3850916j3240850j3271851j3102361j2493296
$$ y = [94770607, 98814713, 103011109, 107012199, 111635656, 116976489, 122008131, 127233668, 133286542, 139439791, 145674749, 152559764, 160147996, 167828801, 175952249, 184723814, 193609188, 203484239, 214067529, 225051204, 236472931, 248197220, 261604012, 275165440, 289167861, 304011516, 319200481, 334730590, 350668324, 366506721, 382638900, 398366330, 412668698, 425747164, 436349213, 445368115, 453089396, 459449170, 465221236, 468737867, 468898808, 467720534, 466556675, 461842137, 452115902, 442515678, 432018931, 419032243, 405548384, 392188448, 379203271, 365886564, 352786252, 339653236, 325900769, 312049853, 298809003, 285537152, 272434791, 259941495]
14237B59941495j1940016j1502179j1689185j1230762j0468883r961848r511475
14230A83637147r344711q840446q395959p755815p685060o756003o297749n552113
14222A23009291n678793n006530n388520m257768m734081l789942l575233l568508
14214H7009916l429476l786536k963318k767318l023581k543936k194764k802415
14206F3498572j870615k201949j988588j782723j687667j873875j589657j676630
14198D8826868j511334j300207j542065j155887j152425j172487r15128j281891
14190C8795444j095547j394735m50312j647763p75712l83527j004830q51511r50337
14181C0241170p33248p36520q53503n15365p82772n91348m76175q61111m80045
$$ y = [259941495, 248001479, 236499300, 224810115, 213579353, 203110470, 193148622, 183637147, 174292436, 165451990, 157056031, 149300216, 141615156, 134859153, 128561404, 123009291, 117330498, 112323968, 106935448, 102677680, 97943599, 94153657, 90578424, 87009916, 83580440, 79793904, 76830586, 74063268, 71039687, 68495751, 66300987, 63498572, 61627957, 59426008, 57437420, 55654697, 53967030, 52093155, 50503498, 48826868, 47315534, 46015327, 44473262, 43317375, 42164950, 40992463, 40077335, 38795444, 37699897, 36305162, 35854850, 34207087, 33431375, 33047848, 32043018, 31191507, 30241170, 29507922, 28771402, 27917899, 27402534, 26619762, 26028414, 25552239, 24691128, 24211083]
14172B4211083m90162n36020n06538o38304l79911m29559m77246p38862j14083
14163A9900398n62868n86098j44479l82525l76505k74153k08609n70424k91859
14154A6502878l37637j5630m79915k23007k89373k43783l76733j16633l62688
14145A4057479k65378j26895l47507l31687r8956j48976l09433J28305j57066
14136A2399886p17442j12805P7401j98986m12194k79192K02343j83318k14984
14127A0560709n9060o6278l99172l35232J14190m6000l0081n53132k26753j74217
14117H784974K57939l75210J72952l22167p0161m338k67339l553L0365l76989
14107G826473Q5613l9692m77424J39361P8271n19799R5360j94406J61870k65852
$$ y = [24211083, 23720921, 23184901, 22678363, 22040059, 21660148, 21230589, 20753343, 20014481, 19900398, 19337530, 18751432, 18606953, 18224428, 17847923, 17573770, 17365161, 16794737, 16502878, 16165241, 16149611, 15669696, 15446689, 15157316, 14913533, 14536800, 14420167, 14057479, 13792101, 13665206, 13317699, 12986012, 12887056, 12738080, 12428647, 12556952, 12399886, 11682444, 11569639, 11647040, 11448054, 11035860, 10756668, 10959011, 10775693, 10560709, 10501649, 10435371, 10036199, 9700967, 9815157, 9769157, 9739076, 9185944, 8959191, 8784974, 9042913, 8667703, 8840655, 8518488, 8448327, 8443989, 8176650, 8173097, 8203462, 7826473, 7912086, 7872394, 7394970, 7534331, 7612602, 7092803, 7188163, 6993757, 7155627, 6889775]
14097F889775l43192J46052J50466k69755l4562o2135l92074j4531J03269l4545
14087F138768r0688p6288J23299J3185k43621k71731J20531j04321k92497J49122
14077E465759k15217R7270p7616J02222k59366J7753j44662K42212k27760j05831
14067D894764J14627K445M1434l60059j16163K6833o4284j23081m5327q4521m9392
14056D237276J19622R8318m3828l12722J05727P2017j54468k44731J73966j40900
14046C910277K09868o9928k58620p008L56236j54281l47418n3037j00039R2890
14036C578940L4504m13639O50346l48025k36074J64407K03001O0700m03246K97132
14026C588046m58412L6046k70011L66317j53921K1414j17871l8035R5580J58562
$$ y = [6889775, 6546583, 6692635, 6843101, 6573346, 6538784, 6476649, 6084575, 6070044, 6173313, 6138768, 6048080, 5971792, 6095091, 6108276, 5864655, 5592924, 5713455, 5609134, 5316637, 5465759, 5250542, 5347812, 5270196, 5372418, 5113052, 5130805, 4986143, 5228355, 5000595, 4894764, 5009391, 5011836, 5053270, 4693211, 4577048, 4603881, 4539597, 4416516, 4371189, 4286668, 4237276, 4356898, 4455216, 4411388, 4098666, 4204393, 4276410, 4121942, 3877211, 4051177, 3910277, 4120145, 4050217, 3791597, 3784589, 4140825, 3986544, 3639126, 3586089, 3486050, 3578940, 3613444, 3199805, 3850151, 3502126, 3266052, 3430459, 3633460, 3694160, 3290914, 3588046, 3129634, 3165680, 2895669, 3261986, 3108065, 3129479, 3011608, 2973573, 3069153, 3227715]
14016C227715j83039j01236Q7621k70098K7129k9069j20395L68165m62281L30055
14006B874567l13631K66111j4329l29477q7804P4893j13763M49121j24096m22035
13996B259557P7500L18474k39771J2106r0177n5026l3010J34153m4109J15809
13986B455506N861l91135l516L75273l16277K11006K11445J26272Q0114J75102
13976B929651R58022K66634J579461L286217N131671R812321P555766r615964
13968B1903779p399171m443882k462283j863627n39545m18207q46709l74380j67172
13959C388803K34572n36871r8402j2927l27252J6831k6781j15919k92517M11089
13949B640626l90893L96586m86636J66805o5222q8902j13167P6394k72227K21559
$$ y = [3227715, 3044676, 2943440, 3031061, 2760963, 2788092, 2759023, 2638628, 3006793, 2544512, 2874567, 2560936, 2827047, 2812718, 2483241, 2395437, 2470330, 2356567, 2805688, 2681592, 2259557, 2337057, 2655531, 2415760, 2427866, 2337689, 2282663, 2249653, 2383806, 2339697, 2455506, 2461367, 2070232, 2066716, 2441989, 2125712, 2336718, 2548163, 2674435, 2754549, 2929651, 3887673, 4154307, 5733768, 9019985, 14151656, 23963977, 31519743, 21903779, 14504608, 10060726, 7598443, 5734816, 5195271, 4777064, 3930355, 3555975, 3388803, 3623375, 3086504, 2988102, 2975175, 2647923, 2664754, 2637973, 2522054, 2229537, 2640626, 2249733, 2646319, 2159683, 2326488, 2261266, 2172364, 2059197, 2135591, 1863364, 2084923]
13939B084923m24586K31107o1575J96836m9806j93747n3848K33627j56502o4579
13929A741850q0075K84667k88833Q3846M7745r91l01154J45630n02646M46601
13919A576640J53549m4413j45625j76162P4479K88158q3728J5418m32313K9952
13909A255955J25379j32866k19141O59734m23594J63436L9251O9321n9535N9823
13899A537763J53220m74038L55564r6490J25506n55763L41229K8055j72092k21797
13889A021157N53447k57827k70694L84929p8950k62956M88688n32695M041L91415
13879A440555L4322k51402K39322L4291j00570l62835l2736L65623j65981J78636
13869A379225k20759Q9945J29575k50239j85605L09608K0650k7002j86762J93889
$$ y = [2084923, 1660337, 1891444, 1829869, 2026705, 1976899, 1783152, 1729304, 1962931, 1806429, 1741850, 1661775, 1946442, 1657609, 1741455, 1789200, 1788209, 1487055, 1632685, 1130039, 1576640, 1730189, 1685776, 1540151, 1363989, 1438468, 1726626, 1642898, 1658316, 1226003, 1255955, 1381334, 1248468, 1029327, 1689061, 1265467, 1428903, 1468154, 1537475, 1477940, 1537763, 1690983, 1216945, 1572509, 1476019, 1601525, 1045762, 1386991, 1415046, 1242954, 1021157, 1574604, 1316777, 1046083, 1431012, 1352062, 1089106, 1577794, 1045099, 1049140, 1440555, 1474877, 1223475, 1462797, 1497088, 1396518, 1033683, 1000947, 1366570, 1200589, 1379225, 1158466, 1248411, 1377986, 1127747, 942142, 1251750, 1272400, 1245398, 1058636, 1252525]
13859A252525k9264o2833j80906M60390m23771L427K03288n6235q7079k00415
13849H79127L16804l48864N94802o11035K49922j63832J79009R6449k81268Q3711
13839I94825R7197J01619k1863j76969L35549n42376J46870o7692L15110j61670
13829A020600J8170n7640K8888j77668J69092j98912m9811K04514l2044J32241
13819A057430j26414p9247K45303m16800L54722k7149j89252l7314P7912K60217
13809A119408j26788n1606j89849j04575L11745j28903K28663j09095k60996P3726
13799G61730P8603J48104l44589j5000k9212J63756L39346D23398J92732Q8058
13789G04188j76509J70212p1617L59809B55318N99816O6700K22226E35935J91654
$$ y = [1252525, 1223261, 1160428, 979522, 1439912, 1016141, 1019568, 1222856, 1166621, 1079542, 879127, 1195931, 847067, 1441869, 830834, 1080756, 916924, 1095933, 1192382, 911114, 994825, 1092022, 1193641, 1171778, 994809, 1330358, 787982, 934852, 867160, 1182270, 1020600, 1038770, 981130, 1010018, 832350, 1001442, 802530, 752719, 957233, 925189, 1057430, 931016, 851769, 1097072, 680272, 1034994, 1007845, 818593, 781279, 859191, 1119408, 992620, 941014, 751165, 646590, 958335, 829432, 1058095, 949000, 688004, 761730, 840333, 988437, 643848, 628848, 599636, 763392, 1102738, 423398, 616130, 704188, 527679, 697891, 626274, 986083, 255318, 855134, 921834, 1144060, 535935, 727589]
13779G27589o2664r5011J40473K88775R5349n45667J57713n7165P3363C29012
13768G94994l81194N91478j95275l5125L35759E44029j46105K71944J52529O913
13758H29310j82940R7322M9341j57461m1987N2990j09j970q5180M09342m73759
13747D94899L8116o622N25496k51550L8828J4707l41079q707K7016J92682o7836
13736F55950l16113L33783m5644Q6930B86270L08288j2304L05549J22595q180
13726A002218k25925k28803N84132D92756J44923K60790j57386l13220Q553Q514
13716D44930K7255j30888P4576J15420j51608K06936r4787M27153C99787Q8892
13706D88679J84768K17590l32643k31130M13529k28086J30265q6472B37479N99292
$$ y = [727589, 664925, 569914, 710387, 999162, 1094511, 548844, 706557, 649392, 722755, 329012, 794994, 413800, 1005278, 810003, 774878, 1110637, 544029, 397924, 669868, 822397, 829310, 646370, 743692, 793033, 635572, 593585, 646575, 646466, 644496, 559316, 968658, 494899, 533015, 526393, 1051889, 800339, 839167, 853874, 512795, 504088, 531104, 723786, 655950, 339837, 673620, 627976, 714906, 286270, 594558, 582254, 887803, 1010398, 1002218, 776293, 547490, 1131622, 492756, 637679, 898469, 741083, 427863, 436416, 444930, 472185, 341297, 415873, 531293, 379685, 586621, 491834, 918987, 399787, 488679, 673447, 891037, 558394, 327264, 740793, 512707, 642972, 556500, 237479, 836771]
13696H36771m04893J95361p0772p086k9630A26779L97084J31578j54638B29629
13685D87199j99652M30761k13573r6556J99480j43024m1573J00411j59607P2427
13675D36293P4240O5744j89115j3770L4403K09670o70k20818O6610J52035K8511
13664F43133B35937J38064K59713q1900J58279k12435j97232K30708j54672J94313
13654E70775B29011J57129P1491J92899j33567L52889l83128k6057R3033Q4663
13644F38363k58657J16997Q3245B62983N2040J74659j068J7210L8838j37919N5742
13633D62485o6747R6069J33807B69574J28848D9433L18407R2341A75699J89379
13623C65078M60657j19659l48047K5089l9620J89127j56615m573r9129O2551P328
$$ y = [836771, 431878, 627239, 556467, 549381, 519751, 126779, 523863, 655441, 500803, 229629, 487199, 287547, 718308, 504735, 408179, 607659, 464635, 423062, 523473, 363866, 436293, 510533, 576277, 387162, 373392, 407795, 617465, 616795, 395977, 462587, 614622, 643133, 235937, 374001, 633714, 551814, 710093, 497658, 300426, 531134, 376462, 570775, 229011, 386140, 457631, 650530, 516963, 869852, 486724, 460667, 553700, 638363, 379706, 496703, 579948, 262983, 315023, 489682, 488614, 505824, 544662, 406743, 462485, 395738, 491807, 625614, 269574, 398422, 49433, 367840, 460181, 175699, 365078, 825735, 706076, 358029, 383118, 343498, 532625, 376010, 371437, 272308, 334859, 342187]
13612C42187j35349K77421k32980R4554K53260j39500q929j11681N5176J22194
13602E16353Q5180B95038M94149k94603p3247J4386D650J23379R3036P4031K56818
13591E51914j54621j45138K71370A06338J86621J83472r7951K29664r2340j71365
13581C44439N8284I8147J83745M9700l403K91260B51330J06885J44521I112L41671
13570C50783Q7679G6172J56813J3054J28127J8702j95052K51432Q813j68178J7427
13559C07310A25113M042J87231a00117A52589l6593K0867J6920N1981l8404J72123
13548C39483K50435j32553r5945m8449K84828k40838p4294M6118j44756L5252
13538B19281a07032A01766N42683A72338J0483H3007J42746M51203k06985a67022
$$ y = [342187, 206838, 484259, 251279, 345833, 599093, 459593, 450664, 338983, 394159, 516353, 601533, 295038, 789187, 494584, 421337, 435723, 4650, 128029, 221065, 295096, 551914, 397293, 252155, 523525, 106338, 292959, 476431, 378480, 608144, 515804, 344439, 402723, 98147, 281892, 331592, 328189, 619449, 251330, 358215, 502736, 9112, 350783, 438462, 76172, 232985, 246039, 374166, 392868, 197816, 449248, 458061, 289883, 307310, 125113, 129155, 316386, -100117, 152589, 115996, 136863, 153783, 205764, 167360, 339483, 589918, 457365, 361420, 312971, 597799, 356961, 282667, 328785, 184029, 219281, -107032, 101766, 644449, 172338, 182821, 83007, 225753, 676956, 469971, -167022]
13527C23279A21672J32448r1813J12430n3095K65255j49713A59408J26410J97409
13517D83227A09169J29837G9025J29686L6909K77380B50802J75554G3978J8312
13507I2290L0946B2561L79440L5750B06432J67328J48462j85434D3232M67662
13497E10894j69468L664m1291M2131A39775J93846l0888j7122R5601j16444K41476
13486E06244A07819J25116m7891p2269K17525R9302q7174b1528B48269l6345Q2676
13475B94600j17384M0762J28125l5193J65902J20353j55547B05355c9523B71618
13464A22762R0358m5429N19221A65171K57785j53011D9466b9640B72738g8646
13453A22049j2858J02954G0541K9240M7385Q917J97059q8452B7155n129M9432
$$ y = [323279, 121672, 254120, 162307, 274737, 221642, 486897, 337184, 159408, 285818, 483227, 109169, 239006, 79025, 208711, 245620, 523000, 250802, 426356, 73978, 92290, 123236, 22561, 402001, 437751, 206432, 373760, 522222, 336788, 43232, 510894, 341426, 345090, 303799, 345930, 139775, 333621, 302733, 285611, 381212, 264768, 506244, 107819, 232935, 185044, 112775, 330300, 429602, 342428, -21528, 248269, 211924, 294600, 177216, 217978, 346103, 310910, 476812, 597165, 441618, 205355, -39523, 271618, 122762, 213120, 167691, 686912, 165171, 422956, 269945, 49466, -29640, 272738, -78646, 122049, 109191, 212145, 70541, 99781, 147166, 156083, 353142, 264690, 27155, 22026, 71458]
13442G1458K68551r9239a22446D3477K55188L5940h339A15629K82570q2134J15506
13431D31571B04125J66554O6543A54535A4315M8313L26193j85591M7546H5157
13420A5423K80327F7099K74971o7740j458N4982r6994J4651N9147I3394K06816
13409C00210m7147l465R3989r6715G176J62548D0968K12475B5323K08353p410
13398B26266j3566E9455L97770j37807H827N5570J39484J17712k1292J6805F8193
13386A76803p6947J60315J87572k8137A25429n0036K73324J9835A83748L9301
13376B23049n4549C3110K14471K31987B02683p4395h6154A19184M11749B39321
13365E3224K14825b0270A46293L5884L7786m8604J10372A26269J06545E4191R3715
$$ y = [71458, 340009, 240770, -122446, 43477, 298665, 334605, -8339, 115629, 398199, 316065, 431571, 204125, 370679, 437222, 154535, 14315, 62628, 388821, 203230, 250776, 85157, 15423, 295750, 67099, 342070, 274330, 272872, 327854, 230860, 245511, 304658, 93394, 300210, 253063, 249598, 343587, 246872, 7176, 169724, 40968, 253443, 25323, 233676, 226266, 212700, 59455, 457225, 319418, 8827, 64397, 203881, 321593, 300301, 317106, 68193, 176803, 99856, 260171, 447743, 419606, 125429, 75393, 348717, 368552, 183748, 223049, 168500, 33110, 247581, 479568, 202683, 128288, -86154, 119184, 530933, 239321, 53224, 268049, -20270, 146293, 182177, 219963, 171359, 281731, 126269, 232814, 54191, 147906]
13354A47906b7000D01128A413K23501J00690Q5548A29038L12323n6951a66765
13343A67153N8324I4085J49933r3717N2602k8421J00357P0745D6594J18322J98449
13332C63365o8013L17343k47623A9176O6780M17664j16550j48214G7116M60150
13322E37266k37457m2525K00814a37332F0730K42234r4749J91552I2661J12808
13312B05469m7646K6836J5365J42425r5544R7981K19085j99653j13129J29167
13302C80356J33974J81837A15659a75805Q0627B91407d2282C47264m5237e4212
13291C76380j16420G5920c36588A78348R3599H4281H643L00155B9653O6493O6409
13280A62555L2255j832r2502J08296b2075B99903r7647P1630c2362C23051b0613
$$ y = [147906, -27000, 401128, 1413, 224914, 325604, 411152, 129038, 441361, 384410, -166765, 167153, 225477, 94085, 244018, 150301, 202903, 174482, 274839, 345584, 46594, 164916, 363365, 295352, 612695, 365072, 19176, 85956, 503620, 387070, 238856, 77116, 537266, 299809, 257284, 458098, -137332, 60730, 302964, 208215, 399767, 92661, 205469, 157823, 184659, 200024, 342449, 246905, 344886, 563971, 364318, 251189, 380356, 514330, 696167, 115659, -175805, -95178, 291407, -42282, 347264, 302027, -54212, 376380, 259960, 75920, -336588, 178348, 271947, 84281, 8643, 308798, 29653, 96146, 162555, 194810, 192978, 100476, 208772, -22075, 299903, 202256, 273886, -32362, 323051, -20613]
13268A46725A1879R8513Q0223e8139k14762a05825A66709l6041j5409j4090P7075
13257A78244Q4309o8537p6318O0890A9374J56270R475m8946n7234Q5321k3692
13246A40568E4866e9791A08839d6133A09111A4864p01a87220B57683I3371j3771
13235G9600O8305d8903A61056k1564M7681a5086D350M3162Q2245R9601F1166g4528
13222B36364l487p9309m9397l4037P9931I419L2709J25823q3243B7227J28674
13211A55901P3501C3617J11745M746l1234e6657D7525A5559L39194i7152A57052
13199D7468A4912g190D3667a04623A94485c7145A50440A1568K29932F0557J96558
13188B57115a50106G7620a35999D2267J76787g9503A76983D2562J30128J10952
$$ y = [146725, 11879, 110392, 190615, -58139, -272901, -105825, 166709, 130668, 115259, 101169, 178244, 262553, 194016, 117698, 178588, 19374, 175644, 185119, 136173, 78939, 164260, 140568, 54866, -59791, 108839, -46133, 109111, 14864, 14163, -187220, 257683, 93371, 79600, 147905, -48903, 161056, 139492, 187173, -15086, 4350, 47512, 129757, 229358, 61166, -74528, 236364, 232877, 153568, 104171, 70134, 150065, 9419, 42128, 167951, 84708, 27227, 155901, 229402, 33617, 145362, 150108, 118874, -56657, 47525, 15559, 354753, -97152, 157052, 47468, 14912, -7190, 43667, -104623, 194485, -37145, 150440, 11568, 241500, 60557, 257115, -150106, 77620, -135999, 42267, 219054, -79503, 176983, 42562, 172690, 283642]
13178B83642H519a17400A82982D7334b4453k33114G6053a04302q1819C84744e5743
13166D83676D4682a15703B87741R3639G4573K3792K09617c2867r42B9384a01054
13154A87172b08403A28262d808n9689j56389A66654J57851j29237M8645D2622
13143i4466A47108N1147o254J30311I557J55555G9357Q0475D7465h328A01542
13131A9499b0959l2459D15604i7757k741m6059B32706l4373c37276A00310J78306
13120B78616a30962B86248a1525B14430o4447o3930a43917A65621k3877a4089
13109C63822k2732A9740d73531c5749C4393J50184c2827i168q6187F7370a67081
13097D69308k06727N3456j06845m825a05546I3766c9409B0014f2233B95228H2469
$$ y = [283642, 8519, -117400, 182982, 47334, -24453, -257567, 76053, -104302, -186121, 384744, -55743, 483676, 44682, -115703, 287741, 381380, 74573, 98365, 307982, -32867, -33809, 29384, -101054, 187172, -208403, 128262, -4808, -64497, -220886, 166654, 324505, 195268, 243913, 42622, -94466, 147108, 198255, 192001, 322312, 9557, 165112, 79357, 159832, 47465, -8328, 101542, 19499, -20959, -53418, 415604, -97757, -100498, -146557, 232706, 198333, -337276, 100310, 278616, -130962, 286248, -11525, 214430, 149983, 86053, -143917, 165621, 141744, -14089, 363822, 341090, 19740, -473531, -35749, 34393, 184577, -32827, -9168, -95355, 67370, -167081, 469308, 262581, 316037, 209192, 204367, -105546, 93766, -39409, 20014, -62233, 295228, 82469]
13085a73433D8688M1823D2114P5295N297d8191q5226C52058I4646a5039B58089
13073H6490L3540d2493A23230c2015A98623r109n448b8918A41421d3718m5365
13062h9083D35328A8219h1559A15831J18926J12030C9053K5751R7810d217A50640
13050b9100A98183Q2447b78737B56425I5063N2119l5057M2045a27227C57576i6780
13038B30482a15007A67453N116h529E1336B881J18133c3287B00334c52641A34186
13026B9614f3427K2961C35807j13251h6020B2879K40610A4596f3910A61638J3082
13015A74720B311J51862L89709F1439K15537K136K11776h390A20396d9811A850
13003e0166l1051B7085J36625C6900M7455k1664R2163C4285L48832E0445J28832
$$ y = [-173433, 48688, 90511, 42114, 117409, 122706, -48191, -133417, 352058, 94646, -15039, 258089, 86490, 120030, -42493, 123230, -32015, 198623, 189514, 184066, -28918, 141421, -43718, -89083, 435328, 18219, -81559, 115831, 234757, 346787, 39053, 64804, 162614, -4217, 150640, -29100, 198183, 280630, -278737, 256425, 95063, 147182, 112125, 154170, -127227, 357576, -96780, 230482, -115007, 167453, 172569, -8529, 51336, 2881, 121014, -33287, 200334, -352641, 134186, 29614, -63427, -40466, 335807, 222556, -86020, 22879, 263489, 14596, -63910, 161638, 174720, 2311, 154173, 543882, 61439, 276976, 279112, 490888, -8390, 120396, -49811, 1850, -50166, -81217, 27085, 163710, 36900, 84355, 62691, 154854, 34285, 383117, 50445, 179277]
12992A79277b3657j97915C2182a39335F7720J26906b29308A0092R1104D7123Q792
12981E5915K4823K12598a9716A65576a11285A70921a62164b6779A55492a08409
12970A70397m5886b7085C08912a1553E737J58829a15946A06587e416k20617B77381
12958D0420a05189E6394a83484B72990h4190H663b8225k04215d1115E8533J4721
12947G3254c56166d3279r032o6966C82492J46554b50274A2069K15045r6196K21648
12936C52566b4348A38966C1055a35348j45687C3170L0727a47577A80192n6488
12926A23704a74428H569J08125l31a237q4930A65846b11567Q0993B07874L061
12915B10935J0650I566L5178c3675A83960k1537B1995K06425a40875e0275a9826
$$ y = [179277, -23657, -221572, 32182, -139335, 67720, 194626, -229308, 10092, 101196, 47123, 55915, 80738, 293336, -19716, 165576, -111285, 170921, -162164, -26779, 155492, -108409, 170397, 124511, -27085, 308912, -11553, 5737, 164566, -115946, 106587, -5416, -226033, 277381, 40420, -105189, 56394, -183484, 272990, -84190, 8663, -28225, -232440, -41115, 58533, 73254, -356166, -43279, -52311, -119277, 382492, 529046, -250274, 12069, 227114, 130918, 352566, -24348, 138966, 31055, -135348, -281035, 33170, 63897, -147577, 180192, 123704, -174428, 8569, 116694, 116363, -1237, -86167, 165846, -211567, -130574, 207874, 210935, 221585, 9566, 44744, -33675, 183960, 162423, 21995, 228420, -140875, -50275, -19826]
12903A40146C2568K36139n0880A03260O8382a59220A5455a33637d0681B38138
12892G1868B6110h8191c7333q6903b1057E8966a1000D40148A59789e3844A77234
12880A99188l4110n5939C5848K27503A1054M9291f4154m4068C1278J54807f9241
12868B40130o7190G0865P1969O57D2022Q4231b9359B76924d8607q6966B6054f2523
12855I9270J33280G7049a74071Q2366k469j11174D9302R9100D0152b35018D04748
12843A71499b65108J22414B32899h5567R205B15234c5581A43324l2375D6054b16610
12831b1714A84838m5697b37922E8822c89993J70044B22579o8293O7498p214n742
12820B08828N7243D7543a5132A61614K130E5897N6968h0545k2164M4928C81521
$$ y = [140146, 32568, 268707, 217827, 103260, 171642, -159220, 15455, -133637, -40681, 238138, 71868, 26110, -88191, -37333, -124236, -21057, 58966, -11000, 440148, 159789, -53844, 177234, 199188, 165078, 109139, 35848, 263351, 11054, 60345, -64154, -108222, 31278, 186085, -69241, 240130, 172940, 70865, 142834, 143491, 42022, 126253, -29359, 276924, -48607, -135573, 26054, -62523, 99270, 232550, 77049, -174071, -91705, -94174, -205348, 49302, 148402, 40152, -235018, 404748, 171499, -265108, -142694, 232899, -85567, -76362, 215234, -35581, 143324, 110949, 46054, -216610, -21714, 184838, 139141, -237922, 58822, -389993, -219949, 222579, 154286, 221784, 214570, 208828, 266071, 47543, -15132, 161614, 163744, 55897, 112865, -80545, -102709, -57781, 381521]
12808h4915b749C869J66865J03274i7275A66854d511q5479b4867D23885F0477
12796b28081h8352n2680A43950F0460a35556J6276A99009i9252l637A52733K7293
12785A80026O8358a98945B4511R5182B2422a3687G7658Q9793p3294b90155D1522
12773A951a65608j04818B59266A22950g5832E7562M2489a99490R1182j28003N2728
12762a83583A2035J59666n9769D4034J44683c06525A67339b41737g1400J4651
12752e6749l4850j2997B43669h1648A61010k9498N572J27346j1751B0647J47397
12741A68044O014f9249a202B7705J18442k6262c6179B8409P0922m671h070j74575
12729a82645A83373D0071J94899b0516A2761P5569J22496E339K02651h6997E2020
$$ y = [-84915, -2749, 3869, 170734, 274008, -97275, 166854, -4511, -89990, -24867, 423885, 60477, -228081, -88352, -141032, 143950, 60460, -135556, -119280, 199009, -99252, -102889, 152733, 180026, 248384, -198945, 24511, 119693, 22422, -13687, 77658, 167451, 94157, -290155, 41522, 1951, -165608, -270426, 259266, 122950, -75832, 57562, 100051, -199490, -108308, -236311, -183583, 12035, 171701, 111932, 44034, 188717, -306525, 167339, -241737, -71400, -56749, -91599, -104596, 243669, -81648, 161010, 131512, 137084, 264430, 252679, 20647, 168044, 174058, -69249, -1202, 27705, 146147, 119885, -36179, 28409, 99331, 94660, -8070, -182645, 183373, 40071, 234970, -20516, 12761, 88330, 210826, 5339, 207990, -86997, 52020]
12717C83417A88997C8934q692b46216B19541B6167a0141B7654D37b32753i4463
12705H8905a5222j06111A21069f008m5241k01829E15114B46214I5738b1607A38997
12693A61057Q6728K361A13632j8936O4322A5111b60143f533j32764f8738C766
12681A28519K30564D078a44638L5716B5584J08730J02707L8221b48041B36963
12670g0867j06322j18235D8511o047L14432A5007f83j16514e3205C33144D8742
12658B0750K58236b03002I0434a93730J3439A17432l2083N5376R4130f6392G1732
12646C2140l057M73373A54450P5665j8510G9782L57389E3380J65382E1134K64709
12635C15843F2631J90751A7826f2348B04408c3345A59189C028J66498a37222A21519
$$ y = [383417, 188997, 38934, 30242, -246216, 219541, 26167, -10141, 27654, 437, -232753, -94463, 88905, -15222, -121333, 121069, -6008, -51249, -253078, 515114, 246214, 95738, -21607, 138997, 161057, 247785, 250146, 113632, 94696, 159018, 15111, -260143, -6533, -139297, -68738, 3766, 128519, 359083, 4078, -144638, -108922, 25584, 134314, 237021, 275242, -248041, 236963, -70867, -177189, -295424, 48511, 42464, 356896, 15007, -683, -117197, -53205, 333144, 48742, 20750, 278986, -203002, 90434, -193730, -180291, 117432, 85349, 140725, 234855, -66392, 71732, 32140, 29083, 502456, 154450, 230115, 211605, 79782, 437171, 53380, 218762, 51134, 315843, 62631, 253382, 17826, -62348, 204408, -33345, 159189, 3028, 169526, -137222, 121519]
12623C00885a4750I7475l1630o122a48036A63400D6504a71806A35318L89682r1802
12612D33198A74910G6665R1589J16362j31080O3126M0008M8074n0475c6985i89
12600C78418J048E2502N1726m6195J68222I6041J58185H0415L88993a92697H4839
12588A30063E3681N9006k7401P5279G69K01806I0333h3769A4463J30450o4006
12577H0907M2568k3911L5842a20679A13978R4067A7873J01597a4336B36797q5949
12566A50848L0162D9137n236K29084n9527N3694B6141J61019G0371o776e4699
12554H5476a91788B07609c57486l3988A58511b9911A29803P8340K88421b72214
12543g3894A36473B8544J23305A3227K69976A40689l7702g0520A42831m3092i6024
$$ y = [300885, -14750, 97475, 65845, 59723, -148036, 163400, 46504, -171806, 135318, 525000, 433198, 174910, 76665, 168254, 284616, 153536, 216662, 256670, 304744, 254269, -36985, -989, 378418, 379466, 52502, 104228, 58033, 226255, 96041, 254226, 80415, 469408, -192697, 84839, 130063, 53681, 112687, 85286, 160565, 769, 202575, 90333, -83769, 14463, 144913, 80907, 123475, 99564, 135406, -120679, 113978, 208045, 17873, 119470, -14336, 236797, 150848, 181010, 49137, 43901, 272985, 213458, 267152, 26141, 187160, 70371, 63595, -54699, 85476, -191788, 207609, -357486, -391474, 158511, -29911, 129803, 208143, 496564, -272214, -73894, 136473, 28544, 151849, 13227, 283203, 140689, 102987, -70520, 142831, 99739, -96024]
12531F5334a17420I3099h3764B17698d1532r7682b5752k42200a05825K7839A60500
12519E2652K56601E5278J73752a36542E3911j028a79722L6330A00797K82832a43976
12507A72954a01049D2888j0116g9903A1345b45648c2440l13533b067E6381B1907
12495c13694i655B00175h0671m5235c858j6666C9837J17092A6941a37417C09548
12483C04699A8540J37043c06596J52685c2821j95004B09238B902L1046K29065
12473B63013f8468p7098B71342c32948b9267q166k04845A18967b84901C9599J54595
12462A94194d09443A12301E5116q43J22107C129b65125h1032A51061C3140a23932
12450h8008b1901E8722a79930G4525g1520E6688b62815A26880J18775a0188j21083
$$ y = [65334, -117420, 93099, -83764, 217698, -41532, -139214, -25752, -267952, -105825, -77986, 160500, 52652, 309253, 55278, 229030, -136542, 53911, 52883, -179722, -143392, 100797, 383629, -143976, 172954, -101049, 42888, 32772, -79903, 11345, -245648, -32440, -345973, -2067, 56381, 21907, -313694, -9655, 200175, -80671, -125906, -3858, -20524, 39837, 156929, 16941, -137417, 309548, 304699, 18540, 155583, -306596, -153911, -32821, -227825, 209238, 2902, 33948, 263013, -68468, -145566, 271342, -332948, -29267, -37433, -242278, 118967, -284901, 39599, 194194, -409443, 112301, 55116, 54273, 176380, 3129, -265125, -81032, 151061, 33140, -123932, -88008, -21901, 58722, -179930, 74525, -71520, 56688, -262815, 126880, 245655, -10188, -131271]
12439a31271d2966H9308a65631n6492i6456A13817b22307P2947G331a96705G615
12427B34575A1060e5167A23932n2691J87952F0834b14496D59936e2865n366C62541
12415B95098I8261P9140a19367M0144j11857C22373e8944r5797N2788B15125c84281
12403D6513K6923c26910C54950a5496J878A01013e4631j80784H0671b74171I5137
12391a5873B22142c2245j57793B88418A03026O6762b87635A90909a07514A83023
12380d2595j26303G6867b33734a8637A36786d8468A20453R0494e98993a41772
12369B20725a84381Q0942M713k65919J43220A68018i3867A28316b08699P2065
12359a36634k75250A375K32496r3483g8058C2255a48874j57879B16395a0155I9803
$$ y = [-131271, -42966, 89308, -165631, -222123, -96456, 113817, -222307, -149360, 7331, -196705, 7615, 234575, 11060, -55167, 123932, 71241, 259193, 60834, -214496, 459936, -52865, -58231, 362541, 295098, 98261, 177401, -119367, -79223, -191080, 322373, -58944, -154741, -101953, 215125, -384281, 46513, 73436, -326910, 354950, -15496, -13618, 101013, -54631, -235415, 80671, -274171, 95137, -15873, 222142, -32245, -190038, 288418, 103026, 169788, -287635, 190909, -107514, 183023, -42595, -168898, 76867, -233734, -18637, 136786, -48468, 120453, 210947, -598993, -141772, 220725, -184381, -103439, -98726, -364645, -221425, 168018, -93867, 128316, -208699, -136634, -411884, 1375, 233871, 140388, -78058, 32255, -148874, -306753, 216395, -10155, 99803]
12347e6832m36906e028k9032I7566k6654J59190q0811j511J00518a69407B33013
12335f8045H3001a8317l4197D6098c41624B58588E6693a88041B18818F3120J73903
12324B37023j13279c17724A37251L6946b2023G0531a73941f1079K5710l8009B44797
12312f7630j97593a1137A39996K83793A25848j1742a29679B78350j39163e9960
12301A20198b46449B9174b55348J21632a5276D9319J67320e14680d1306A74254
12290B69019j27881O3975d03755B56517c88338J60701B11746H7459P5620d9359
12279D52817j91190b1060A45928C9046L15643d1535j27440l0148g7114K7777j7442
12268f6779G8842a4375k24014D0692F331K30336e1956b0785k7836C89856R2404
$$ y = [-56832, -493738, -5028, -34060, 97566, 70912, 230102, 149291, 147780, 248298, -169407, 233013, -68045, 83001, -18317, -52514, 46098, -341624, 258588, 56693, -188041, 218818, 63120, 237023, 123744, -317724, 137251, 174197, -22023, 70531, -173941, -61079, -35369, -73378, 244797, -67630, -265223, -11137, 139996, 423789, 125848, 114106, -129679, 278350, 139187, -59960, 120198, -246449, 29174, -255348, -133716, -15276, 49319, 216639, -514680, -41306, 174254, 269019, 141138, 205113, -403755, 256517, -388338, -227637, 211746, 87459, 163079, -49359, 452817, 261627, -21060, 145928, 39046, 354689, -41535, -168975, -199123, -77114, -49337, -66779, 78842, -14375, -238389, 40692, 6331, 236667, -51956, -20785, -48621, 389856, 482260]
12257D82260F0177j8655A9843i4054J2601C0757d6367A7679k096o54J86698o4635
12245A36992E042K40634a14946C2291j2447J05031C1558j5186L35049b25847C08094
12233B8995K52347a88573i740F4670K31920m3282e071B12499r6869A3892K80995
12222B94887P0295j31384j9990q9936e2584E4881J07368J13221F7463b7575k11543
12211b39118A79075J2736M2992j02289P5363J79348F0715O5108a49279A67067
12200A92812M4031a17692A01389K11651A37326K6882B4557J22494I801M04241
12190D14042A24228A8445J47653a46651D2115J17994D8783K0747d3590I9101P0064
12179A69165L5299J28427A8983i7299A65849g3867A56948p2819b72682B71745
$$ y = [482260, 60177, 41522, 19843, -94054, -81453, 30757, -46367, 17679, 15583, 14929, 201627, 136992, 5042, 245676, -114946, 32291, 19844, 124875, 31558, 16372, 351421, -225847, 308094, 28995, 281342, -188573, -9740, 64670, 296590, 253308, -5071, 212499, 115630, 13892, 294887, 365182, 233798, 213808, 123872, -52584, 54881, 162249, 275470, 67463, -27575, -239118, 179075, 191811, 234803, 132514, 207877, 387225, 60715, 125823, -149279, 167067, 192812, 236843, -117692, 101389, 313040, 137326, 164208, 24557, 147051, 9801, 414042, 124228, 18445, 166098, -146651, 42115, 160109, 48783, 69530, -43590, 99101, 169165, 204464, 332891, 18983, -97299, 165849, -73867, 156948, 84129, -272682, 271745]
12168A37781b27676A97295g5156j29301F3484J35755N1394J01153d11463h1537
12157a94820a8188B79506c5744B85693R3507A51488K4144j4239a85997D28644
12146b3213j73961B15567k2153d364A04549a7638D38061D6249M7651c5688r71
12135c6659a5865B43691f7198F1045J78024G7229J90878b1488D3148a83609C48376
12123A81437C3932a92856R0886A77460f5520B58064d2665A58714n9075m9701d25219
12111c38880E8621Q2731k9660h1068B58241J21655f1407K3622j8191B17828c25493
12099A73172a85606B07949a90446C67317I967i3252j48068H5634b76861a30278
12088e6408F4653a22933B59748G4981b0613j4576I2319N3179a58702B48078J27896
$$ y = [137781, -227676, 197295, -75156, -204457, 63484, 199239, 250633, 351786, -411463, -81537, -194820, -18188, 279506, -35744, 285693, 379200, 151488, 175632, 161393, -185997, 428644, -23213, -197174, 215567, 193414, -4364, 104549, -17638, 438061, 46249, 93900, -35688, -36659, -15865, 243691, -67198, 61045, 239069, 77229, 268107, -21488, 43148, -183609, 348376, 181437, 33932, -192856, -101970, 177460, -65520, 258064, -42665, 158714, 99639, 49938, -425219, -338880, 58621, 141352, 111692, -81068, 258241, 379896, -61407, -37785, -55976, 217828, -325493, 173172, -185606, 207949, -190446, 367317, 9967, -93252, -241320, 85634, -276861, -130278, -56408, 64653, -122933, 259748, 74981, -20613, -35189, 92319, 145498, -158702, 248078, 375974]
12077C75974A10212a12628I9907a81264L1604A43924f4358j23629n6237A52464
12066I4979j9108A3194b223D25306k03088a32637A41501M60590Q04911n23626
12056H83376C62288M4247d1374j29609A14716k502b6017A05325J994a44896A42379
12044B00427a29078D8172L08521A29015b79684e6417A13448b3342k30837a00235
12033a43046O4430m27107c0949I4504c15988a34326k0944O2581j73373D544K13796
12022B18340d8804o8131A22157B1822a2127j73880F4868Q0526b17809E0135i5599
12010a97384b491B2710J10459F1355j6544a09453K5805F884b745j22066q7880
11999b12691B90639B3729J23060M297f6957A98827a34772m393A06655a1273E3695
$$ y = [375974, 110212, -112628, 99907, -181264, -149660, 143924, -64358, -187987, -244224, 152464, 94979, 75871, 13194, -2223, 425306, 222218, -132637, 141501, 602091, 1407002, 883376, 362288, 406535, -41374, -170983, 114716, 112214, -26017, 105325, 107319, -144896, 142379, 200427, -129078, 48172, 356693, 129015, -279684, -56417, 113448, -23342, -254179, -100235, -143046, -78616, -505723, -30949, 94504, -315988, -134326, -155270, -92689, -266062, 4544, 218340, -48804, -116935, 122157, 21822, -12127, -186007, 64868, 145394, -217809, 50135, -95599, -197384, -2491, 22710, 133169, 61355, 44811, -109453, -83648, 6884, -2745, -124811, -212691, 290639, 23729, 146789, 151086, -66957, 198827, -134772, -139165, 106655, -11273, 53695]
11987e5622b5516j12042e7835a1151A96616c30873A50150F3590J11664f3143p9770
11976a42913f7467I1472d8780A49597b2219j59027d9814l7675A90993d6040A27539
11964A31979L1857i6964c430A6438g0388k1747H6766c24312A47273o6476b93639
11952a50245B75562I4164g5734r7522B42056F1026M7428e4040A52068G4575L8835
11941A13410a9830k51220C588Q110a48723a5651L848I1699a40006B68009a66732
11929B85278A36791k8531c7403B04940c9391m9713k04166A33771b17395B62798
11918D7884b61075F2890a15364A3608b65204A01126h5912A26102J36554n4259
11908B08397e5891b2078l93517c9690A20629l6183a07893L4681A64897F7874a40063
$$ y = [-55622, -25516, -137558, -57835, -11151, 196616, -330873, 150150, 63590, 175254, -63143, -142913, -67467, 91472, -48780, 149597, -22219, -181246, -49814, -87489, 190993, -46040, 127539, 131979, 163836, -96964, -3430, 16438, -70388, -92135, 86766, -324312, 147273, 80797, -293639, -150245, 275562, 94164, -75734, -173256, 242056, 61026, 108454, -54040, 152068, 74575, 113410, -19830, -271050, 3588, 11698, -148723, -15651, -11803, 91699, -140006, 268009, -166732, 285278, 136791, 108260, -37403, 204940, -39391, -89104, -293270, 133771, -217395, 262798, 47884, -261075, 62890, -115364, 13608, -265204, 101126, -85912, 126102, 262656, 208397, -55891, -22078, -415595, -39690, 120629, 84446, -107893, -73212, 164897, 67874, -140063]
11896a91040C8508R4132a7602A94306c02385a15228b7867j75700k63010H8598
11885I9884a61876e3642B2563d7125l386j1686k80387a04739B54395a35341B40289
11873b97776h5285b7840A62283i789D8327J04293A1970b98163J22777H3971K35734
11862C19705B3919J49773A7699b03204c6413k02845Q7652m1738A45283B5825i1307
11850e1287F7946a14128E6273g7168J2682B74568B9163J11245J02143a55664d8746
11838I1517a53059o5958L9715l7815b1760A17773h6648C3341R529J12698L0335
11827A85903k2271a80473J2956j5774j16293h6164p132M6553k66217J46500L1646
11816a34814G2219e9509j11110j24481I3753c38359b104A7907K37309i8097j61136
$$ y = [-191040, 38508, 132640, -17602, 194306, -302385, -115228, -27867, -203567, -466577, 88598, 99884, -161876, -53642, 22563, -47125, -50511, -62197, -342584, -104739, 254395, -135341, 240289, -297776, -85285, -27840, 162283, -9789, 48327, 152620, 11970, -298163, -175386, 83971, 319705, 23919, 173692, 17699, -203204, -36413, -239258, -151606, -193344, 145283, 25825, -91307, -51287, 67946, -114128, 56273, -77168, -64486, 274568, 29163, 140408, 242551, -155664, -48746, 91517, -153059, -219017, -179302, -217117, -21760, 117773, -86648, 33341, 42870, 155568, 185903, 163632, -180473, -167517, -183291, -299584, -86164, -93296, -46743, -312960, -166460, -134814, 72219, -59509, -170619, -295100, 93753, -338359, -2104, 17907, 255216, -98097, -259233]
11805b59233B13179D8188a7274l19053D5145N9773i0627H3399J83085b32035H0657
11793b11669L937A05966K12192c2342a1299k05240m3491H2748j0015c24715a31375
11781A79638b55710H0969a2013j15271b8766N869A51325G0345c85632b4761A30819
11769f4023A45434a5905G0862J29468J00067d4630o5750j5885H6660a42996f1500
11757a26263j05404p9191a4598k41743e660o3907C26163A04270e9701K2748k79913
11746c16866B8695a01842b6142i135j40989L4164d1737B44037I9968d8948f913
11734A29114a25524L0715B21723b13617R2842D0561a82267k7573N9615C2054J60644
11723A92698F6055M3066a33302a1292B29929q6123c9368k35173B9530J80830a94108
$$ y = [-259233, 213179, 48188, -17274, -336327, 45145, 104918, -90627, 83399, 266484, -232035, 80657, -211669, -207732, 105966, 318158, -32342, -11299, -216539, -260030, 82748, 72733, -324715, -131375, 179638, -255710, 80969, -12013, -127284, -28766, -22897, 151325, 70345, -385632, -24761, 130819, -64023, 145434, -15905, 70862, 200330, 300397, -44630, -110380, -126265, 86660, -142996, -61500, -126263, -231667, -310858, -14598, -256341, -5660, -69567, 326163, 104270, -59701, -36953, -316866, 28695, -101842, -26142, -9135, -150124, -115960, -41737, 244037, 99968, -48948, -6913, 129114, -125524, -94809, 221723, -213617, -120775, 40561, -182267, -209840, -150225, 32054, 192698, 66055, 109121, -133302, -11292, 229929, 143806, -39368, -274541, 29530, 210360, -194108]
11711A2403K51399a15010C465a9217r7144E6634m461O4238f106C40240a42647
11699c7616m42335D24410E3088d9925G0508R5151p4002K4202C9092b13351R4895
11688a18456h118C49410q3597a16871D5032c34414h376j82528f1627G4489J0216
11677H4705a52476j19361H4337a58610q0655P3345C10343E0027b2943J316r2968
11666a14595A17037K16545b54091A74668o2063a89245I5487c00246G1095a05587
11655D22410B6496a08680k42706J65534D8386h6178C2982e5518j53891C60700
11644B71921G5650O0490g5701D4369K43726a12029e3402A23558M4031d3310D55357
11632a06338B95264j40456c9544C341L0265L1004J24202f6750j03493O6857A64399
$$ y = [12403, 263802, -115010, 3465, -19217, -116361, 56634, 52173, 116411, -6106, 340240, -142647, -37616, -479951, 424410, 53088, -49925, 70508, 165659, 91657, 115859, 39092, -213351, -118456, -8118, 349410, 265813, -116871, 45032, -334414, -8376, -190904, -61627, 74489, 84705, -152476, -271837, 84337, -158610, -239265, -165920, 310343, 50027, -22943, -21627, -114595, 117037, 333582, -254091, 174668, 112605, -189245, 95487, -300246, 71095, -105587, 422410, 26496, -108680, -351386, -185852, 48386, -86178, 32982, -55518, -209409, 360700, 271921, 75650, 136140, -75701, 44369, 288095, -112029, -53402, 123558, 167589, -43310, 455357, -106338, 295264, 154808, -39544, 3341, 33606, 64610, 188812, -66750, -170243, -103386, 164399]
11620e5621A30607J9102a83067p4098J01439H8233J452f3740p0192e6384J922
11609e4462A37550E1120a7331G3572K24252d4043j28127j187C09364i3B43476
11597b7497A52612a26592A32706M6540p8909b8033B60859B3001a71248k7225A49363
11585I1987e3216D27621A90734H2842c41884D13985I9767R5600g2415E5891Q9218
11574A45109n9365k2565J86272k2008F4874L53991a10240E20034G4399K6924D1369
11562B76113a30268K1407B31288H0386O230r11j0783g3239o8492A083J86265J50219
11550C37567A33653N4232N7482D5307K29644a81344A15421b98055D66476H4767
11539i5424A95699a48215E398h7330G8534K09282A28633Q9448c82598P8264B25380
$$ y = [-55621, 130607, 149709, -183067, -257165, -155726, 88233, 89685, -63740, -133932, -56384, -54462, 137550, 51120, -17331, 73572, 297824, -44043, -172170, -173357, 309364, -93, 243476, -27497, 152612, -126592, 132706, 179246, 100337, -28033, 260859, 23001, -171248, -198473, 149363, 91987, -53216, 427621, 190734, 82842, -341884, 413985, 99767, 195367, -72415, 55891, 145109, 85744, 63179, 249451, 227443, 64874, 418865, -110240, 520034, 74399, 101323, 41369, 276113, -130268, -108861, 231288, 80386, 86616, 85705, 74922, -73239, -141731, 1083, 187348, 337567, 133653, 187885, 245367, 45307, 274951, -181344, 115421, -298055, 466476, 84767, -95424, 195699, -148215, 5398, -87330, 78534, 287816, 128633, 218081, -382598, -304334, 225380]
11527f9966D00141A83958c58881C0687i0284B8116L0557K34280h5018A14379P9838
11516A94217R5766A01094L94640A39537C4055K54800b44620A54529b17651A01928
11505H9010f1302D2120R6476N9316o3320E1b33277f5191a5617k9547a9278B28365
11492B14773k6401l9262K1730m1150E6756J38050P2118J05299L0735b330C04482
11480B09613b52395A45278B8962a03746b5583B96520a03786D2974M71420j19816
11470C94578A85632p5060c2925A9424J77221f2997A34644J66623a62552E12505
11459C02958J00366A88425d1498A74846J2007a70700A0950b1179G2046P4716c4399
11447c1236G3519b03952H1485b70101C4165f3077j55494a1280c48n7291D03228
$$ y = [-69966, 400141, 183958, -358881, 30687, -90284, 28116, 58673, 292953, -85018, 114379, 194217, 289983, 101094, 495734, 139537, 34055, 288855, -244620, 154529, -217651, 101928, 89010, -61302, 42120, 138596, 197912, 134592, 51, -233277, -65191, -15617, -45164, -19278, 228365, 214773, 188372, 149110, 170840, 129690, 56756, 194806, 266924, 372223, 402958, -2330, 304482, 209613, -252395, 145278, 28962, -103746, -25583, 296520, -103786, 42974, 514394, 394578, 185632, 110572, -32925, 19424, 196645, -62997, 134644, 301267, -162552, 512505, 302958, 403324, 188425, -41498, 174846, 186853, -170700, 10950, -21179, 72046, 146762, -34399, -31236, 73519, -203952, 81485, -270101, 34165, -63077, -218571, -11280, -348, -57639, 403228]
11435b147A07799n0320a52908A60618a15870L7026I865J21328J57681G7288c9254
11423C20066i6957k05065B25963j04798a17517m1296D24269A02642I002a10188
11412B0564L1193b55232B73721b87083C5626d1723A91292H1492i1643m08336a0795
11400a42755j53896J41742I8387D0180b10807E2187b09999a6480A51203a57490
11389A11787n4734K55738A41092O4233f5990j45558A52384a15407F2713K01353
11379B64066H4201a18888N8955C10230A11672A0686J5329M806g8061F4192l0244
11368C3948a28093j48426A52305m1356K81639e7743A42484a34737G3403B3628
11357G5793h01k5921F4505K42078j31065h4832L659k68904C9768b200B6338b4301
$$ y = [-2147, 107799, 57479, -152908, 160618, -115870, -78844, 9865, 131193, 288874, 77288, -39254, 320066, -96957, -302022, 225963, 121165, -117517, -158813, 424269, 102642, 9002, -110188, 20564, 51757, -255232, 273721, -287083, 35626, -41723, 191292, 81492, -91643, -499979, -10795, -142755, -296651, -154909, 98387, 40180, -210807, 52187, -209999, -16480, 151203, -157490, 111787, 57053, 312791, 141092, 205325, -65990, -211548, 152384, -115407, 62713, 264066, 84201, -118888, -59933, 310230, 111672, 10686, 26015, 30821, -78061, 64192, 33948, -128093, -276519, 152305, 110949, 392588, -57743, 142484, -134737, 73403, 23628, 75793, -801, -26722, 64505, 306583, 175518, -84832, -81173, -350077, 39768, -2200, 26338, -24301]
11344C30941A6337a82420N29M6093A60465j4204J39848a47165K0186B47953a0505
11332f1174D06206e9453B8136a03155D3471h9615D35628A21057a33460F0502a93003
11320f7759A69900d4094k14449A35472a01303B807a11539H501b70778d3458l3885
11309g7343E6538a62446m9265b002B41299J70538G7203B6440b84162C18473q4081
11298B34392g2364F6614b8446C6044K06869G0057a99009m2591B12893a17897b256
11286b23495d7005j02521m8081f5803p4045j75432a6755F8611K29327a55377R164
11275a46213L5586b0148f163o9085j7754I113a54808D9148B0148J84004B6686
11263E5109B4894a0611B79344d014I469e463I3233a76962D85605H4439a01603
$$ y = [330941, 16337, -182420, -181891, -135798, 160465, 146261, 286109, -147165, -126979, 247953, -10505, -61174, 406206, -59453, 28136, -103155, 43471, -89615, 435628, 121057, -133460, 60502, -193003, -67759, 169900, -44094, -258543, 135472, -101303, 2807, -111539, 8501, -270778, -43458, -77343, 56538, -162446, -211711, -2002, 241299, 411837, 77203, 26440, -284162, 318473, 234392, -72364, 66614, -28446, 36044, 242913, 70057, -199009, -241600, 212893, -117897, -2256, -223495, -47005, -149526, -197607, -65803, -139848, -315280, -16755, 68611, 297938, -155377, -146213, -110627, -20148, -6163, -75248, -93002, 9113, -154808, 49148, 20148, 204152, 26686, 55109, 24894, -10611, 279344, -4014, 9469, -5463, 93233, -176962, 485605, 84439, -101603]
11251c1974l50275A06797C5567P1935a59017H1277b04746L1577h0668j66373E0054
11239a28253A71356n6094L1412b91595A07556a30806m294A38617c6566k39603
11229b76169A66010b8739A49036n2219c9516k0915A37915c31038B91144j00362
11219A90782J9007l0308C6863a07837B41679a54187N9369E1148h3304A02771a45586
11207A08498c55075R5271R9847J7414B4804a48359A70320b58047B30214d72240
11196h5016o9218K7778H880J21461a9663j34071r6394B5943P870g8017H809M6551
11184E5360A3866J32799b58503A23109b09373K0935b8303A82629h2788B41268
11173A3676b55832H611a00342j25505O3580M8187C2458b67951a23761I7668b94739
$$ y = [-31974, -382249, 106797, 35567, 107502, -159017, 81277, -204746, -173169, -80668, -247041, 50054, -128253, 171356, 115262, 146674, -291595, 107556, -130806, -135100, 138617, -36566, -276169, 166010, -28739, 149036, 96817, -39516, -60431, 137915, -331038, 291144, 190782, 209789, 179481, 36863, -107837, 241679, -154187, -94818, 51148, -83304, 102771, -145586, 108498, -355075, -259804, -159957, -142543, 24804, -148359, 170320, -258047, 230214, -472240, -85016, -154234, -126456, 8880, 130341, -19663, -153734, -250128, 25943, 33813, -78017, 8809, 55360, 13866, 146665, -258503, 123109, -209373, -188438, -28303, 182629, -82788, 241268, 13676, -255832, 8611, -100342, -225847, -162267, -114080, 32458, -267951, -123761, 97668, -294739]
11161A49934A9636b10798A14768a30354J8045r885j10858c0481a1670n4627j53170
11150b19467A33488l8847O4677f822F9354q784c09108a07845A26613Q9818c08195
11138d64501b20694h7035I015a96815o9256B97246h1161j45H1176f7796j08967
11127a76763a2338k25283B77842A06122b6065E3473l151c451F2143J58329a9228
11115C11915H4785A2247h8585B32659J17060G3264h2175b7016A06946b1554A11025
11103A79931q2084a1333m694P759B00144G2236b911B66461b9435A72797C1306
11091h4394B95030j04186E4493K2066J47663r1410a21254A084P5165B4418L83029
11080D07447H7153K03387K7045A7743e1940N791B20420o1761J2651M9094L4493
$$ y = [149934, 19636, -210798, 114768, -130354, -112309, -122194, -233052, -30481, -11670, -66297, -219467, 133488, 94641, 159318, -6822, 69354, 60570, -309108, -107845, 126613, 216431, -308195, -464501, -220694, -87035, 9015, -196815, -266071, 297246, -81161, -81306, 81176, -67796, -176763, -12338, -237621, 277842, 106122, -26065, 53473, 50322, -3451, 62143, 220472, -19228, 311915, 84785, 12247, -88585, 232659, 349719, 73264, -82175, -27016, 106946, -21554, 111025, 179931, 97847, -11333, -16027, -8268, 200144, 72236, -2911, 266461, -29435, 172797, 31306, -84394, 295030, 190844, 54493, 76559, 224222, 132812, -121254, 1084, 76249, 24418, 407447, 87153, 290540, 317585, 17743, -51940, -46149, 220420, 158659, 171310, 220404, 254897]
11069B54897J20875A51245E776M10289A37218J24792e2597A8324d8747j26747
11059a75494C39714j08459Q7641e0260B98689J03476N7409B01879L6165P7938
11049C15982K19227A53155A5955M32169L72933l49640J04385j25060j33757L21638
11039F38623m7693q4698K0356J59872n4328J4559n3166r1890J44489L47664k73560
11028G20228j61882P8792J24239J08426K67386k33589q2657J15505m50975J58044
11018F43517k6574J975K27369l49671K42773K7211k97928J85380l516M5424B32315
11006E56980k65552M07414A78373N05003k33735L17029k16700J07443N8324l4953
10996F80784k48072q4403L52039m6320j5539k226k44083J28824L05825j83857
$$ y = [254897, 375772, 151245, 5776, 416065, 137218, 262010, -52597, 18324, -48747, -175494, 339714, 231255, 318896, -50260, 298689, 402165, 459574, 201879, 238044, 315982, 535209, 153155, 15955, 448124, 821057, 471417, 575802, 450742, 316985, 638623, 590930, 506232, 526588, 686460, 632132, 646691, 593525, 501635, 646124, 993788, 720228, 558346, 637138, 761377, 869803, 1137189, 903600, 820943, 936448, 485473, 643517, 616943, 618918, 846287, 496616, 739389, 766600, 468672, 654052, 650536, 695960, 232315, 556980, 291428, 698842, 178373, 683376, 449641, 766670, 549970, 657413, 715737, 680784, 432712, 348309, 700348, 654028, 638489, 636263, 392180, 521004, 826829, 642972]
10986F42972k04252K58278k51073L37622n9682j80710k732M3091J811l7019q864
10975E39442L894K31305o166L07889l6113J69858j32083l36823J62457L64665
10965A268325j91379L46730K23480l49480K64849M97506J80269J83163L15139
10956B738602J41107q43710M42137l09393K75703o32896j85740K61968m52617
10947A435161J99940l01904Q3596J49528o4392q1266j37806j3287l8024l76177
10937H55369J96917j77935O9622l88893k727q2626j93901J51604j88529k7849
10927B11052c3412A93984K11325A87818N4977j06335h7333C61219b26853L9311
10917a87542H2438L8682k0412k4267k7354J13775p2223c3420E7296J73679b84038
$$ y = [642972, 438720, 696998, 445925, 783547, 723865, 543155, 540423, 583514, 585325, 548306, 539442, 543336, 774641, 768475, 1076364, 1040251, 1210109, 1078026, 741203, 903660, 1268325, 1076946, 1423676, 1647156, 1297676, 1562525, 2060031, 2240300, 2423463, 2738602, 2879709, 2035999, 2478136, 2168743, 2444446, 1811550, 1625810, 1887778, 1435161, 1635101, 1333197, 1416793, 1566321, 1501929, 1420663, 1282857, 1269570, 1231546, 855369, 1052286, 874351, 943973, 555080, 552353, 469727, 275826, 427430, 238901, 211052, -33412, 193984, 405309, 187818, 242795, 136460, -87333, 361219, -226853, -187542, 82438, 121120, 100708, 76441, 49087, 162862, 90639, -33420, 57296, 230975, -284038]
10905c6445i91r914B9242J69457q4965b70051M3535J00202A18509g5399A51364
10893c9600H0146P910P3075D0885h7812j2549C4283K2791N7466g8875A68907J06759
10881B75666a47235E435b09481R3378F7181g8529r7249H6497c19409a5899r5064
10870a10963H561a64020I9668b97762J43453L8999C33447A13685B6695O5638a39659
10858G4150a63343H4495d22596B2624K7577f8624B8536a10618j13742j22258B51156
10846I0732a87877k6397a3876J58A7615a7644j41024N9336c0655j6313p404q08
10834e5180H9641c43893a34105H5476a53022k62463E8722A8322g5505c2626a4406
10822B01757b6998q0036k63382b1031p2496L7453k6215A41436g4457F2691K00338
$$ y = [-36445, -991, -10905, 29242, 198699, 113734, -270051, -226516, -126314, 118509, -75399, 151364, -39600, 80146, 88056, 161131, 40885, -87812, -100361, 34283, 57074, 114540, -78875, 168907, 275666, -147235, 5435, -209481, -116103, 67181, -78529, -175778, 86497, -319409, -15899, -110963, 8561, -164020, 99668, -297762, -154309, -115310, 333447, 113685, 26695, 92333, -139659, 74150, -163343, 84495, -422596, 22624, 50201, -68624, 28536, -110618, -224360, -346618, 251156, 90732, -187877, -214274, -13876, -13718, 17615, -17644, -158668, -99332, -30655, -46968, -54372, -55180, 89641, -343893, -134105, 85476, -153022, -415485, 58722, 18322, -75505, -32626, -14406, 201757, -26998, -107034, -370416, -21031, -93527, -56074, -82289, 141436, -74457, 62691, 263029]
10811B63029A26136c65870a16058k61849f9786A93249b2261D9955A2976L7188
10801E0164c3281I260J90592p2484c5124m5691j20337q4929J17284L8964B44218
10789g8713J9458I3151a04741p058k179r91A12581c6796G6949P3374c08006R3822
10777b14184A68083c44546i4946D6846b15980g8518B18128j15b92278a34482J5173
10766a19309A77102a53231o762g4363K2734m9591j65830d1050j71267b1253j45096
10755a66349N9898G8349B7093J64223j1004c22007f8825q9337f8989A29243b15980
10743d45923B1068b09251A73830d0804F4009J00889J1531d2246G8817g131A6115
10731E1008M3716g441A66305I752i9229o998L0384K623l15702f0829l47472a45623
$$ y = [263029, 126136, -365870, -116058, -377907, -69786, 193249, -22261, 49955, 12976, 50164, -33281, 9260, 199852, 127368, -35124, -80815, -201152, -286081, -168797, -129833, 244218, -78713, -59255, 93151, -104741, -111799, -113978, -114969, 112581, -36796, 76949, 150323, -308006, -214184, 168083, -344546, -94946, 46846, -215980, -78518, 218128, 218013, -292278, -134482, -119309, 177102, -153231, -159993, -74363, -51629, -101220, -267050, -41050, -212317, -21253, -166349, -106451, 78349, 27093, 191316, 180312, -322007, -68825, -158162, -68989, 129243, -215980, -445923, 21068, -209251, 173830, -40804, 64009, 164898, 176429, -42246, 78817, -7131, 16115, 51008, 94724, -7441, 166305, 9752, -99229, -106227, -75843, -73220, -388922, -60829, -408301, -145623]
10718B61456a73192f6347I7284m4748b53118k5580H9657c70753A58212j8550a66588
10706A05682a23070k3385B03217a50204j17477E0889b09969A70171A0487a11342
10695a79890B14446G9129N0081q636n5469J08624c5239A07950h7008b3893A03526
10683a81800A9922e991j94298A18716a96279A88186a61203d9747R735r3451j19901
10672b53364A00862a66812A37425a90182M0182A34188B253P9996a39112d121I9833
10660b47957l0352n9346g2861B2852b41705B7462a17905D7282b2575n9906J7136
10649f5345C4857c61498H8067a14062k5260L049H754J69785b72238l7838H1371
10637D1072a94802A45048o4025b20006g8932m8146C7747b36785B42854f6867A91021
$$ y = [261456, -173192, -66347, 97284, 52536, -253118, -278698, 89657, -370753, 158212, 139662, -166588, 105682, -123070, -146455, 203217, -150204, -267681, 50889, -209969, 170171, 10487, -111342, -179890, 214446, 79129, 129210, 120574, 65105, 173729, -35239, 107950, -87008, -23893, 103526, -181800, 19922, -5991, -200289, 118716, -196279, 188186, -161203, -49747, -40012, -133463, -253364, 100862, -166812, 137425, -190182, -150000, 134188, 2253, 82249, -139112, -4121, 99833, -247957, -278309, -337655, -72861, 22852, -241705, 27462, -117905, 47282, -22575, -82481, -65345, 34857, -361498, 88067, -114062, -139322, -136273, 8754, 178539, -272238, -310076, 81371, 41072, -194802, 145048, 81023, -220006, -78932, -127078, 37747, -236785, 242854, -66867, 191021]
10625I8449b60347P1486A07329j6403a56524H2846a30417D2673a0846B73696C744
10613A27761a7394j82186p2673d3629G2804B9364R1620a58758m9768E5245L44363
10602C99608a78067B39422l6724F2437K9538L70947B0221e4153b0989k78250f9803
10590i0948J1270j76087A51632b18230k4129r7005c4154j33830E8085g6756N741
10579g1015G6755J1457A2621c02182R8502B55521b65935A54577j230a44363B24707
10567A06393G003a65917H5789f9489F1941D47K6601c80450C5676f1318q7520a2053
10554b9854k60095J37731C98462a38964j40248d9608l32735B34507F1882i2348
10543E9604a18128K7823m9791i562m4439j26487I3899L4483d0624l0310A66285
$$ y = [98449, -260347, -188861, 107329, 90926, -156524, 82846, -130417, 42673, -10846, 273696, 3744, 127761, -17394, -199580, -272253, -43629, 72804, 29364, 120984, -158758, -208526, 55245, 399608, -178067, 239422, 202698, 62437, 91975, 462922, 20221, -54153, -20989, -299239, -69803, -90948, -79678, -255765, 151632, -218230, -242359, -339364, -34154, -167984, 58085, -76756, -71015, 76755, 88212, 12621, -302182, -203680, 255521, -265935, 154577, 153347, -144363, 224707, 106393, 7003, -165917, 85789, -69489, 61941, 447, 27048, -380450, 35676, -61318, -148838, -12053, -29854, -289949, -152218, 398462, -138964, -279212, -49608, -382343, 234507, 61882, -92348, 59604, -118128, -90305, -140096, -9562, -54001, -180488, 93899, 128382, -40624, -70934, 166285]
10531D6929a82533k2563D2349N8027a45331N7744j0684A12394a63854j34097A17396
10519a80475m4167P6334G231g1829j87493j29451J64045c7788j34684H339J00734
10508A09073e1872C29613h2433A87537R4680g4258a2290A13876E6529K46938a45046
10496b3066j13427O78j92977a03368q3152A0250b16150c1130m8015G7070J54033
10485B31103d6242e524n4817j9750A86118a92999b9261A9510J6335L33633A07388
10473B15343R25P5212p3877C6568g1394A56820J75587j27848L07301B44237L8419
10462B82656E6449M4113J27336b77884A74660a81153B23668H5966J4320M0880
10452A41166b07450B18131e6600a4278o4474L7095j23271j67099R6445A16595
$$ y = [46929, -182533, -205096, 42349, 100376, -145331, -87587, -98271, 112394, -163854, -297951, 117396, -180475, -224642, -148308, 7231, -71829, -259322, -388773, -224728, -37788, -172472, 8339, 109073, -51872, 329613, -82433, 187537, 282217, -74258, -12290, 113876, 56529, 303467, -145046, -23066, -136493, -135815, -328792, -103368, -186520, 10250, -216150, -31130, -79145, 77070, 231103, -46242, -5524, -60341, -80091, 186118, -192999, -29261, 19510, 35845, 369478, 107388, 215343, 216268, 291480, 217603, 36568, -71394, 156820, 332407, 204559, 511860, 244237, 282656, 56449, 100562, 227898, -277884, 174660, -181153, 223668, 85966, 100286, 141166, -207450, 218131, -56600, -14278, -78752, -41657, -164928, -332027, -235582, 116595]
10441D0006K0210A925c3611k52155A35896j4866m5524C2503a47867f0452j28067
10430a88519A493J60521F9135e159o2446j05237M5900j00294i7427k6103k59210
10419c82740f959j00138r8213d8425j84091R9590G3403d0461K702B46417b3056
10407I9970a13710B16454a1242r9990A6204f4765l8379G9847F366a15654j3598
10396a29252A52221c9076I0646O5896a69791e753p9180J1009r3858H291a95343
10384a63147C4931d727l0115m3538a9563k3656n3967b6936j0636B36548H7698
10372h6792E4670K00892b36384A51960K18185H250P6495a42396H4812d047j5110
10361a9157j30247d68B43061I0669K79406J12655G2819O07227l22499A24716K81448
$$ y = [40006, 60216, 1925, -33611, -285766, 135896, 121030, 75506, 32503, -147867, -60452, -188519, 1493, 162014, 69135, -5159, -67605, -172842, -126942, -227236, -97427, -123530, -382740, -6959, -107097, -205310, -48425, -232516, -132926, 73403, -40461, -37759, 246417, -23056, 99970, -113710, 216454, -11242, -111232, 16204, -64765, -103144, 79847, 6366, -115654, -129252, 152221, -39076, 90646, 156542, -169791, -5753, -84933, -73924, -167782, 8291, -195343, -163147, 34931, -4727, -34842, -78380, -19563, -43219, -97186, -26936, -37572, 236548, 87698, -86792, 54670, 255562, -236384, 151960, 370145, 8250, 84745, -142396, 84812, -4047, -19157, -149404, -468, 243061, 90669, 370075, 482730, 72819, 680046, 357547, 124716, 406164]
10350D06164J47162A67526b3092C18188e8785D06128j64238k6252F6097J25925
10340A92022d9176B26187k0002N1506K59601k8185P6606j94902A71655J28019
10330B99674A38485M2363C6282N55944E4106J11878L22742j42588e2141A56741
10319B52525D5338K09994A07411m5312J45360C2977K28932F6535i8211b1931A48705
10307B04355O7383b463G65h7449I6348K08090b99721A67485A2272J17842k5321
10296A04793P5574a45633b982q8943q2579K0554j44559h0087K1725J3565B18508
10284g7037H0445R2422A3368J9085c0540rJ1829C1578J53047p6279a16152k70825
10272c86977a52665A33481a04561o9570J2114P8777A88817E1646g3803A240J94199
$$ y = [406164, 553326, 167526, -23092, 318188, -58785, 406128, 241890, 215638, 66097, 192022, -49176, 226187, 206185, 257691, 517292, 489107, 565713, 370811, 171655, 299674, 138485, 180848, 36282, 592226, 54106, 165984, 488726, 346138, -52141, 156741, 252525, 45338, 255332, 107411, 62099, 207459, 32977, 261909, 66535, -98211, -21931, 148705, 204355, 271738, -2463, 765, -87449, 96348, 304438, -299721, 167485, 12272, 130114, 104793, 180367, -145633, -2982, -91925, -174504, -153950, -298509, -80087, -58362, -44797, 218508, -77037, 80445, 172867, 13368, 32453, -30540, -30549, -18720, 31578, 184625, 108346, -116152, -386977, -152665, 133481, -104561, -174131, -162017, -83240, 188817, 51646, -73803, 1240, 195439]
10261A95439a39734q2393A53789g6604b0540A22940d13603A87980J200a78692
10250A46860b1891B36695q0518n1842h4742C46604A69914j9732O1575b22195A41075
10238B42873c59510i3441B04901o5756a68216B8520j3692K4126R809K39365a30573
10226b68456B3113c23247A74997b0948q5509D6331a08613M3062P142A65760D9815
10214a75238G9711c6973B2783J94684a63809M6520j18582p4917P7041B9046R5926
10203A24972c7747p2411j77751J8443P0082a5136A61682D5594a71238o0620K3205
10192b08653g9397j80464g0231j67633A35979d2836B2205i0140K2153o4679q9928
10181b22594B09698a78525j7015E9686a63949j32604L5497O2963Q7893A14855
$$ y = [195439, -139734, -222127, 153789, -76604, -20540, 122940, -413603, 187980, 189180, -178692, 146860, -21891, 236695, 156177, 104335, -84742, 346604, 169914, 150182, 211757, -222195, 141075, 242873, -359510, -93441, 204901, 139145, -168216, 28520, 14828, 38954, 48763, 288128, -130573, -268456, 23113, -323247, 174997, -20948, -106457, 46331, -108613, -65551, -58409, 165760, 49815, -175238, 79711, -36973, 22783, 217467, -163809, -117289, -235871, -310788, -233747, 29046, 124972, -37747, -110158, -287909, -269466, -199384, -15136, 161682, 45594, -171238, -231858, -208653, -79397, -259861, -70231, -237864, 135979, -42836, 22205, -90140, -67987, -132666, -222594, 209698, -178525, -195540, 59686, -163949, -296553, -261056, -198093, -110200, 114855]
10170a60578j68222g6683B4914J44774a16851g759p8234A48672c9351j65673A37921
10158a05952A75956b9414J4209r0593H141c7367j39490h6600i354j24998j82931
10147c17283g8213B066b16050G7874b0774l45309J20643h979j54196D9737N0029
10136I9766b42720A51853b05499A14984E2742L8048k5687h7683b443k38709l6722
10125b77874A37207J45365d18460J40404J04640g4458C10114a82603c9884k03586
10115b43470B2926b07403C5518i100j31402B80365J37479a38241G5488a1131j06934
10104a18065D8794J0215a73653A11874a04865r4496O3035A04206i5881B37648
10093a74794G6092c35313K8119N0275J17403d1054k39689B10340b88228A90221
$$ y = [-160578, -328800, -76683, 24914, 169688, -116851, -7759, -85993, 148672, -39351, -205024, 137921, -105952, 175956, -29414, -15205, -105798, 8141, -37367, -176857, -86600, -9354, -134352, -317283, -78213, 2066, -216050, 77874, -20774, -366083, -245440, -8979, -163175, 49737, 99766, -242720, 151853, -205499, 114984, 52742, 90790, 65103, -87683, -2443, -241152, -277874, 137207, 282572, -418460, -278056, -173416, -74458, 310114, -182603, -39884, -243470, 22926, -207403, 35518, -9100, -140502, 280365, 417844, -138241, 75488, -11131, -118065, 48794, 59009, -173653, 111874, -104865, -199361, -136326, 104206, -95881, 237648, -174794, 76092, -335313, -307194, -256919, -139516, -41054, -280743, 210340, -288228, 190221]
10082A26839J15686P2693j31996C6888c75155I2716a41991A1400M3966a34382
10071g1181I3098G302c8725j33850G3459B6883b89196C26337f7193m1369m8116
10060a56678a3415j57383A30704K28491A27995a45905J6156n3516M2649B7062
10049a96724A09065K35037g2056p6771j19434l2610o8788a16156F7057a42865
10038f8724k3922F6790b21925j38386f267G1836Q0795a91133P5742l5036d7703
10026e9804m7146A4043c9501o460J3791j48673A02532a95862j17596D6597d3457
10014c5321p6128A69888a50586M7482a7119m3386j55609p817A31320b24954a04749
10002c8897C6629a68392B16675c12301A5176a05592H2433l9678d4106A58343F1710
$$ y = [126839, 242525, 315218, 183222, 36888, -375155, 92716, -141991, 11400, 55366, -134382, -71181, 93098, 7302, -38725, -172575, 73459, 26883, -289196, 326337, -67193, -108562, -156678, -13415, -170798, 130704, 359195, 127995, -145905, -129749, -183265, -140616, 27062, -196724, 109065, 344102, -72056, -148827, -268261, -300871, -369659, -116156, 67057, -142865, -68724, -92646, 66790, -221925, -360311, -6267, 71836, 152631, -191133, -115391, -150427, -47703, -59804, -106950, 14043, -39501, -45961, -32170, -180843, 102532, -195862, -313458, 46597, -43457, -35321, -111449, 169888, -150586, -103104, -17119, -60505, -216114, -223931, 131320, -224954, -104749, -38897, 36629, -168392, 216675, -312301, 15176, -105592, 82433, 42755, -44106, 158343, 61710]
9990c9609j51938P8084A10272b54216D5378a14449m3755G2186c30686A55584D5089
9978A72103p2104b80494L7332G8334M2967b21699a06781M0701A98452c7922G187
9966b54734R0661k79393h2462o6977j24830m9594h9262K6916G686R5786c56457
9954C25243a87029b469m67660i8064c0475J4060N248j12489B42694C7428J69554
9943B06982i2519j73074Q8023N0349A5200a68295P0214C0728L33224q8299G7719
9931B79967n4054J8886a81389o4057K2819d5961A55694f6658A9739a14040R63
9920a13077Q065C3413c595k17884b6522r2527L7276A7372R0563a69947P0057M9238
9908e0652A56704b03098f4031k80076C2867K5005b45537f2322l46164a41743A14023
$$ y = [-39609, -191547, -113463, 110272, -254216, 45378, -114449, -158204, 72186, -330686, 155584, 45089, 172103, 99999, -280494, -243162, 78334, 121301, -221699, -106781, -66080, 198452, -37922, 7187, -254734, -164073, -443466, -82462, -149439, -274269, -323863, -89262, -62346, 7686, 103472, -356457, 325243, -187029, -2469, -470129, -98064, -30475, -16415, -11167, -123656, 242694, 37428, 206982, -92519, -265593, -177570, -127221, 15200, -168295, -98081, 30728, 363952, 275653, 77719, 279967, 225913, 244799, -181389, -245446, -222627, -45961, 155694, -66658, 19739, -114040, -113077, -105012, 33413, -3595, -221479, -26522, -119049, -81773, 17372, 107935, -169947, -99890, -50652, 156704, -203098, -64031, -344107, 32867, 57872, -245537, -62322, -408486, -141743, 114023]
9896i0633A62683B3566e39389B4636b24296B72090a1983B2527J7581c49379L9322
9885c10057F2621J07599e3626A26776d09925A15392N3226c9831j7231A8838b34317
9873i1911n6517j09798a1583A05962B1963a30093B156R3327C8255c61391A43712
9861a68421n8004j41719P4780J45814q5625D4500b75834D26559a32222F7963b4390
9849a45958A05045D4433a48160j78240E4783a46056K3034A781a3954B42650c71486
9837e0043A93406e06267a89146e8536p4169d1898r5651n690e1216j12383k57140
9826d20739C7070J21303c81682J37629A7442a14411e5996k40267m8982J6342a21169
9814a76962O9514l48960d3337q6282d2434l534m36269a75233B8715a4278A2793
$$ y = [-90633, 162683, 23566, -539389, 24636, -224296, 272090, -11983, 22527, 40108, -349379, -310057, 62621, 170220, -53626, 126776, -409925, 115392, 168618, -39831, -57062, 18838, -234317, -91911, -148428, -258226, -11583, 105962, 21963, -130093, 2156, 95483, 38255, -361391, 143712, -168421, -226425, -368144, -293364, -147550, -233175, 44500, -275834, 426559, -132222, 67963, -24390, -145958, 105045, 44433, -148160, -326400, 54783, -146056, -123022, 1781, -13954, 242650, -371486, -50043, 193406, -506267, -189146, -58536, -132705, -41898, -137549, -143239, -51216, -163599, -420739, 37070, 158373, -381682, -244053, 17442, -114411, -55996, -296263, -345245, -328903, -121169, -176962, -107448, -456408, -43337, -129619, -42434, -45968, -482237, -175233, 28715, -14278, 12793]
9802C390J95971g996k6485m1760D3489K4678a61187N2985k66944e4939A10321
9790B8795e75741a45508d2312A02439g4213k47459C9500O4380a84007j53992A17999
9778C7249K11224a79236f1014B065J43146c16419Q4887h4317j36646c5786I5247
9766f8032D1462N9447c200j99182o5507E0509h0037R37k23801b0314D118a49182
9753a20191k7611j7101j08538a22958k8713O6103q0746B68411h7034B1944d1471
9741D1634c4631j2415C4913O9048a63007B09280I8595h7631A47016a18664q0547
9730a99211b2771j16614b3749k4903j02290L6463A32432H817a69452q3035B42215
9718C8122e0778m62381A2184J5640a55847d5458o3394b4508B7894g584A67100
$$ y = [3390, 199361, -7996, -34481, -76241, 43489, 68167, -161187, -108202, -375146, -54939, 110321, 28795, -575741, -145508, -42312, 102439, -74213, -321672, 39500, 103880, -184007, -337999, 117999, 37249, 248473, -179236, -61014, 2065, 145211, -316419, -231532, -84317, -220963, -35786, 95247, -68032, 41462, 100909, -3200, -202382, -267889, 50509, -80037, -79100, -302901, -20314, 4118, -149182, -120191, -147802, -164903, -273441, -122958, -151671, -85568, -166314, 268411, -87034, 21944, -41471, 41634, -34631, -47046, 34913, 103961, -163007, 209280, 98595, -87631, 147016, -118664, -199211, -22771, -139385, -23749, -48652, -150942, -114479, 132432, 8817, -169452, -252487, 242215, 38122, -50778, -513159, 12184, 27824, -155847, -45458, -108852, -24508, 27894, -7584, 167100]
9706a19893k60004F2811a33556J9213j01920d1218q0279N7228F0200d5521A65806
9694A61935A3384c46010A78568b01838D0051d5396C13763K3436b6489A36064c8738
9682a81454g7850q9872f636j62544J6123f572B4840a55342H9550c32274N0212
9671b82062A10035M0505h8150b9484j45164f3601j00647j05c1840k57901A34863
9659c4943j48854j2952D362f5814j22363L1172K764A33069J57826D8913h6110
9647B03600a65285M7840d3769F0973b09798g5298E7978A7828b36428a0051j20549
9636a30600R113j8904j04948g4204o8563G222R6635M1486b03472h9616D8983a48394
9623b00201a1505n119q8262o6483j42006B2430O7032i8766j4467j18408d3762
$$ y = [-119893, -379897, 62811, -133556, -114343, -216263, -41218, -121497, -64269, 60200, -45521, 165806, 161935, 13384, -346010, 178568, -201838, 40051, -45396, 313763, 337199, -26489, 136064, -38738, -181454, -77850, -167722, -6636, -169180, -153057, -6572, 24840, -155342, 89550, -332274, -282062, 110035, 150540, -88150, -29484, -174648, -63601, -164248, -164353, -31840, -289741, 134863, -34943, -183797, -196749, 4362, -65814, -188177, -157005, -154241, 133069, 290895, 48913, -86110, 203600, -165285, -117445, -43769, 60973, -209798, -75298, 57978, 17828, -236428, -10051, -130600, -121487, -140391, -245339, -74204, -142767, 7222, 103857, 145343, -203472, -89616, 48983, -148394, -200201, -11505, -16624, -104886, -171369, -313375, 22430, 89462, -98766, -113233, -231641, -43762]
9611a80684A18456j3701K0638E9879a39229o5979A04018a28836D0431b91077a97
9599h1601k36938d6201A8694K7044K3169M4672c90261a40925b6534a1683k02761
9588b14444C32732C0537P0714K3440c11697O2957A55665c04967A0087R9559a62953
9576a75497Q4640K6307n3221G4639J28780a11945B4433b24377A9462K51276b40146
9564a52708K9869G3929K7632J27485a7846j65914j67183A457c64688A08341c10933
9552I9378a15861l6641e5292J1068j67090l7076d6951A51397b27844A77572b51186
9540c00000K9670a6880A60989c3707J1812E39g6708A56625e409j23307f2385F9747
9527a34813L8494d504C4426e8085o3646L2501A64642b28050A2108j763Q7263a57555
$$ y = [-180684, 118456, 104755, 125393, 59879, -139229, -205208, 104018, -128836, 40431, -291077, -197, -81601, -318539, -46201, 18694, 45738, 68907, 113579, -390261, -140925, -26534, -11683, -214444, 332732, 30537, 101251, 124691, -311697, -248740, 155665, -304967, 10087, 109646, -162953, -175497, -90857, -64550, -117771, 74639, 203419, -111945, 24433, -224377, 19462, 270738, -240146, -152708, -122839, 73929, 101561, 229046, -17846, -183760, -350943, 1457, -364688, 108341, -310933, 99378, -115861, -152502, -55292, -44224, -211314, -248390, -46951, 151397, -227844, 177572, -251186, -300000, -270330, -16880, 160989, -33707, -21895, 539, -76708, 156625, -5409, -128716, -62385, 69747, -134813, -96319, -4504, 34426, -58085, -121731, -89230, 164642, -228050, 12108, 10345, 97608, -157555]
9514A34941b64547c7122j30974j52538B26029a5710l91282B41036b01114C53186
9503B22187a41756l7863K7826C816a65832d0232H8358C0648a52768A13856b53691
9491c04704J35267D4824b06036n4814F4159a10629j63876J4628f1603b7001k6246
9480e3247k4637k9104F5678e6555D366Q715C036K12740J03374D3144j5002g4800
9467f5984j31872A74694h515k38262B315f0823A31575D0323b18621R5722e1116
9455a65290a2426j43000A79900B6229a62692k43610C23485i3542A13384a41654
9444B347K03497a72610f5987j49762m6816L0041b3824k6874m71643d7511l23043
9433c70554B8457d5601A05661h3302m5567j57125h5367A5098a23835B1310b36068
$$ y = [134941, -264547, -37122, -168096, -320634, 226029, -15710, -406992, 241036, -201114, 353186, 222187, -141756, -179619, -151793, 3816, -165832, -40232, 88358, 30648, -152768, 113856, -253691, -304704, -169437, 44824, -206036, -260850, 64159, -110629, -274505, -259877, -61603, -27001, -53247, -77884, -106988, 65678, -56555, 4366, 13081, 3036, 215776, 319150, 43144, 28142, -74800, -65984, -197856, 174694, -8515, -246777, 2315, -60823, 131575, 40323, -218621, -122899, -51116, -165290, -12426, -155426, 179900, 26229, -162692, -406302, 323485, -93542, 113384, -141654, 2347, 205844, -172610, -65987, -215749, -262565, -232524, -23824, -50698, -522341, -47511, -370554, 28457, -45601, 105661, -83302, -128869, -285994, -85367, 15098, -123835, 21310, -236068]
9421a12128E448J11742b4971r5805C8810j2829e0488A04406i331l07504a08398
9409A57012a58858C5208j2069K2095L7069b00544A9161c05471a26944j60876j36531
9398d24351C2071L83855a49497a4822j00799c8307J2848m0784F3108b68342A2060
9386B64564c9637C6418b02617O8591A45780j0333b04396k72942I0130g4461o3199
9375a37660d4312j4674m5680k3800B49280b50867j883A13264N0637e1253B7836
9363A07098c8405j92555F6038a30673M5858m6425M5258H6565c0547j84043b751
9351a83961h7424E667e02342B99959j22190l1630a41956A54240a26034a5226k24793
9340b40019L3475R3106A24815b98722d367B01477J34189A5956a5075k55983a8066
$$ y = [-112128, 5448, 117190, -24971, -120776, 38810, 25981, -50488, 104406, -9331, -316835, -108398, 157012, -158858, 35208, 23139, 45234, 82303, -200544, 19161, -305471, -126944, -287820, -424351, 32071, 415926, -149497, -14822, -115621, -38307, -25459, -66243, 63108, -268342, 12060, 264564, -39637, 36418, -202617, -134026, 145780, 135447, -204396, -477338, 90130, -74461, -137660, -44312, -58986, -104666, -128466, 249280, -250867, -252750, 113264, 163901, -51253, 27836, 107098, -38405, -230960, 66038, -130673, -84815, -131240, -85982, 86565, -30547, -214590, -2751, -183961, -87424, 5667, -502342, 299959, 177769, 146139, -141956, 154240, -126034, -15226, -240019, -206544, -113438, 124815, -298722, -4367, 201477, 335666, 15956, -15075, -271058, -18066]
9328F0291j9023b01573A43234b22230j09488g4873E006J19531b3234k91690E3477
9316A8940K608n742h9653A3925O7021P9135F5795a4047A16935D7417a58513r8855
9304b57368e6346Q499j3457p950l2303m0539a4832k51800A43035a10597D8569
9292b45811J5340H0083a79924Q0783B45513q0253e5407k66196B68534b17911c9805
9280b9387j35300A51081a20710m7327O4067A03861c2083o853j63759j09960A47102
9268B10769r4467m9430L28333h7179k0265j75161D29021b98783B5042a89682A26440
9256H6455e7533A22458D8798d2447A38769d45288A55998a71467B14915E8486J61319
9245B19805a95217B86655C6337R3923B4023a07955K3937b5455j70093b5340C2256
$$ y = [60291, 41268, -201573, 143234, -222230, -331718, -74873, 5006, 124537, -23234, -314924, 53477, 18940, 21548, 15806, -89653, 13925, 80946, 160081, 65795, -14047, 116935, 47417, -158513, -257368, -56346, -47847, -61304, -69254, -101557, -142096, -14832, -266632, 143035, -110597, 48569, -245811, -230471, 80083, -179924, -99141, 245513, 165260, -55407, -321603, 268534, -217911, -39805, -29387, -164687, 151081, -120710, -168037, -103970, 103861, -32083, -38936, -202695, -312655, 147102, 210769, 116302, 66872, 395205, -87179, -107444, -282605, 429021, -298783, 25042, -189682, 126440, 86455, -57533, 122458, 48798, -42447, 138769, -445288, 155998, -171467, 214915, 58486, 219805, -195217, 286655, 36337, 130260, 24023, -107955, -84018, -25455, -195548, -25340, 32256]
9233B5629b64742d0740H3333a00345L6599p0720e4313k50146B51934i6503D4376
9221c27497n7132J70650E2366J42873q3085b7673j43719j1143h7484B0885b36856
9209b86545R259J4789D6464c58593C58795a2727l5389B10445a3387C22853b16873
9197C158h9716E62809I6696e991j96040O3918p0081P6138A15843a3484Q02k99901
9185c12583k1559D9237K39167i5556K0383m8394F6426P8546c07236A09102B8878
9173C4648b70100N329K3083L032i3535L8883l4076A64970f725A45688I484e9439
9160a14653e6451E3149c8151B78830A07807P5638a49965j08265m2545O9572L1122
9149b00081Q011e6516A98700f0208p3293j29054i2708p0731P0258k50515C3929
$$ y = [25629, -264742, -40740, 83333, -100345, -63746, -134466, -54313, -304459, 251934, -96503, 44376, -327497, -384629, -213979, 52366, 195239, 112154, -27673, -171392, -182535, -87484, 20885, -236856, -286545, -277286, -262497, 46464, -358593, 358795, -12727, -48116, 210445, -13387, 322853, -216873, 3158, -89716, 562809, 96696, -5991, -202031, -138113, -208194, -132056, 115843, -13484, -12682, -312583, -334142, 49237, 288404, -95556, -75173, -123567, 66426, 144972, -307236, 109102, 28878, 34648, -270100, -264771, -241688, -238656, -93535, -54652, -88728, 164970, -6725, 145688, 9484, -59439, -114653, -56451, 53149, -38151, 278830, 107807, 183445, -149965, -258230, -300775, -231203, -200081, -192070, -56516, 198700, -60208, -133501, -262555, -92708, -163439, -93181, -343696, 33929]
9137c6671E7598a30048j49567A1417a55741k48338J14614A08560N504C2156c9717
9125A25209c3518A28896C594a46117f8689A38332b81003D3672J81202a09181d4434
9113D1316a65410O7183k01063a39604H8182b32002i3160j6499l1637j88640a13956
9101a62379M1069j13442j19910A22549b34247A92931c5128D2232I527J32161f9201
9089b6141o654j57708o8836P5458Q9554C7568b0917j8035I9710B8046K2130A1386
9076b1304o5562j8017A32743m5653b47611Q7086k05479c3284C7781a31299p9633
9065b10932A05895l5164g8777B70704b77948O621P3680c0851j59415k5616H862
9053a47194M5660j45352R1451B68786e0467k4746A604b21397d8865l72763B60237
$$ y = [-36671, 57598, -130048, -279615, 11417, -155741, -404079, -289465, 108560, 114064, 32156, -39717, 125209, -33518, 128896, 3594, -146117, -68689, 138332, -281003, 43672, 224874, -109181, -44434, 41316, -165410, -98227, -299290, -139604, 88182, -232002, -93160, -109659, -141296, -329936, -113956, -162379, -121310, -234752, -354662, 122549, -234247, 192931, -35128, 42232, 9527, 141688, -69201, -26141, -32795, -190503, -259339, -183881, -94327, 37568, -20917, -38952, 99710, 28046, 50176, 11386, -21304, -86866, -104883, 132743, 87090, -247611, -160525, -366004, -33284, 37781, -131299, -210932, 105895, 70731, -78777, 270704, -277948, -271327, -197647, -30851, -190266, -215882, 8862, -147194, -101534, -246886, -155435, 268786, -50467, -75213, 1604, -221397, -48865, -421628, 260237]
9041g4914p602k44398C5433a15929j86729e9314A86350b61460E8386P2085h9241
9029b37032Q7161b394B63665e5783j25364a5382E1737R11a51772a1248k95518
9018c06766J5945d7059j7489l36261a64416B87818n0579a11460A07167c583l4132
9007c7715A36989i5673a2838C0372a14005q8001B86782H0259Q27a94705C04187
8995A84847a87808C2458K2769a90018B76061I6672a71872B3398J04099a56151
8984A78884C6484N03988A61083a30320e2343A36021a54255b3809k60661R7651
8974a86819m4868B9831a21062H9018a42339B7097e5511D8842a53721H2587A8833
8962d69065a79767f2620C06167a9428A23392J20409A3100P0606a37237q5736b2873
$$ y = [-74914, -82516, -326914, 35433, -115929, -302658, -59314, 186350, -261460, 58386, 130471, -89241, -237032, -149871, -2394, 263665, -55783, -181147, -15382, 51737, 52648, -151772, -11248, -306766, -290821, -47059, -64548, -400809, -164416, 287818, 237239, -111460, 107167, -3583, -37715, 136989, -95673, -12838, 30372, -114005, -202006, 286782, 80259, 81086, -194705, 304187, 184847, -187808, 32458, 55227, -190018, 276061, 96672, -171872, 23398, 127497, -156151, 178884, 36484, 540472, 161083, -130320, -52343, 136021, -154255, -23809, -284470, -186819, -231687, 29831, -121062, 89018, -142339, 27097, -55511, 48842, -153721, 82587, 18833, -469065, -179767, -62620, 306167, -19428, 123392, 243801, 13100, 83706, -137237, -222973, -22873]
8950B0462e94320g4576n5520B90728c4947E9308a4848k94749e4241D7840a5564
8938a03212l8319D7143a74234M9022a0102l77073B33164G0817c48721A8803J3191
8927C1994k749J17952E794a23880K4802r5049B60757m2611k9528a95402L8663
8916a56739k83761a70828e8315A31207A9279a39533C1670K36015M61927O96745
8906A426357J354992q88890F20110o0221B40901j12400K32094a51296a152C29643
8895I3572b0086j31001B6812P4651a00625j98993C9726J28470D721b08997A73490
8883c4521A52317f3365A46683f7041A3647b74986B03313q2991L9967d4129j88043
8872b32172i5132m6652o5609a9990j10783A04670J61207a90321A25339d4278k16891
$$ y = [20462, -594320, -74576, -130096, 290728, -34947, 59308, -14848, -309597, -54241, 47840, -15564, -103212, -141531, 47143, -174234, -125212, -10102, -387175, 233164, 70817, -348721, 18803, 31994, 29245, 147197, 5794, -123880, -99078, -194127, 260757, 218146, 188618, -195402, -156739, -440500, -170828, -58315, 131207, 19279, -139533, 31670, 267685, 729612, 1426357, 2781349, 1892459, 620110, 559889, 240901, 128501, 360595, -151296, -1152, 329643, 93572, -20086, -151087, 26812, 101463, -100625, -299618, 39726, 168196, 4721, -208997, 173490, -34521, 152317, -63365, 146683, -67041, 13647, -274986, 203313, 120322, 160289, -44129, -232172, -95132, -141784, -207393, -19990, -130773, 104670, 265877, -190321, 125339, -44278, -261169]
8861b61169j59146g3883H8576m3759c01879a50565M8317F1250i4176h215A44761
8849c46015A34186b03001D9066R6634a71263P9141d014k88224D24121A35746R2832
8838B28578h2535c5838A46865a05159b6578j50451E2966O4416k4499A5997L2565
8827D8562a49725p5976A37483F2355a15825o0041O060g8531C706c52593D4773
$$ y = [-261169, -420315, -73883, 88576, 44817, -301879, -150565, -102248, 61250, -94176, -8215, 144761, -346015, 134186, -203001, 49066, 145700, -171263, -92122, -4014, -292238, 424121, 135746, 228578, -82535, -35838, 146865, -105159, -26578, -177029, 52966, 117382, 92883, 15997, 48562, -149725, -225701, 137483, 62355, -115825, -175866, -169806, -78531, 3706, -352593, 44773]
$$ [...]
##END NTUPLES=NMR SPECTRUM
##END=
