
##TITLE=AC1222_Punto_6074794_1Xs9jaGfa0
##JCAMPDX= 6.0         $$ Bruker NMR JCAMP-DX V2.0
##DATA TYPE= NMR SPECTRUM
##DATA CLASS= NTUPLES
##ORIGIN= BRUKER
##OWNER= Administrator
$$ 1.72 TOPSPIN		Version 2.1
$$ 2012-05-09 01:20:21.843 -0500  Administrator@TOPSPIN
$$ Compression mode = diff/dup
##.OBSERVE FREQUENCY= 400.13188235
##.OBSERVE NUCLEUS= ^1H
##.ACQUISITION MODE= SIMULTANEOUS (DQD)
##.ACQUISITION SCHEME= undefined
##.AVERAGES= 64
##.DIGITISER RES= 22
##SPECTROMETER/DATA SYSTEM= spect
##.PULSE SEQUENCE= noesygpps1d.comp
##.SOLVENT NAME= COFFEE_meoh
##.SHIFT REFERENCE= INTERNAL, COFFEE_meoh, 1, 14.96668
##AUDIT TRAIL= $$ (NUMBER, WHEN, WHO, WHERE, PROCESS, VERSION, WHAT)
$$ ##TITLE= Audit trail, TOPSPIN		Version 2.1
$$ ##JCAMPDX= 5.01
$$ ##ORIGIN= Bruker BioSpin GmbH
$$ ##OWNER= Administrator
$$ $$ C:\Bruker\TOPSPIN/data/COFFEE/nmr/AC1222_Punto_6074794_1Xs9jaGfa0/102/pdata/1/auditp.txt
$$ ##AUDIT TRAIL=  $$ (NUMBER, WHEN, WHO, WHERE, PROCESS, VERSION, WHAT)
(   1,<2012-05-09 01:20:17.156 -0500>,<Administrator>,<TOPSPIN>,<go>,<TOPSPIN 2.1>,
      <created by zg
	started at 2012-05-09 01:08:47.093 -0500,
	POWCHK enabled, PULCHK disabled,
       configuration hash MD5:
       AF F2 23 6B 01 CD 40 DD E5 A1 38 A0 06 EA F7 77
       data hash MD5: 64K
       26 F3 71 33 3A 11 84 03 BD A0 36 C7 A6 EC D5 BE>)
(   2,<2012-05-09 01:20:19.812 -0500>,<Administrator>,<TOPSPIN>,<proc1d>,<TOPSPIN 2.1>,
      <Start of raw data processing
       efp LB = 0.3 FT_mod = 6 PKNL = 1 PHC0 = 0 PHC1 = 0 SI = 128K 
       data hash MD5: 128K
       99 1C 07 3E 93 52 34 E8 CF B1 4E 4D CE 33 AF EA>)
(   3,<2012-05-09 01:20:21.093 -0500>,<Administrator>,<TOPSPIN>,<proc1d>,<TOPSPIN 2.1>,
      <pk PHC0 = 35.17273 PHC1 = 0 
       data hash MD5: 128K
       FE 6E 5F 61 ED DF 0C 32 9C 96 78 E1 59 24 B4 E2>)
(   4,<2012-05-09 01:20:21.328 -0500>,<Administrator>,<TOPSPIN>,<proc1d>,<TOPSPIN 2.1>,
      <abs ABSG = 1 
       data hash MD5: 128K
       E2 1A 9C 93 BB 71 7A 01 55 08 87 2B 43 D4 6C 6E>)
(   5,<2012-05-09 01:20:21.390 -0500>,<Administrator>,<TOPSPIN>,<proc1d>,<TOPSPIN 2.1>,
      <abs ABSG = 2 
       data hash MD5: 128K
       30 01 CD F9 13 B3 63 86 17 C1 A0 B1 10 46 D9 47>)
(   6,<2012-05-09 01:20:21.531 -0500>,<Administrator>,<TOPSPIN>,<proc1d>,<TOPSPIN 2.1>,
      <abs ABSG = 3 
       data hash MD5: 128K
       0C 52 C6 F6 27 16 4B B0 35 25 9A E5 E0 AB 72 95>)
(   7,<2012-05-09 01:20:21.703 -0500>,<Administrator>,<TOPSPIN>,<proc1d>,<TOPSPIN 2.1>,
      <abs ABSG = 4 
       data hash MD5: 128K
       88 2B 08 DA 7C D1 B4 B9 EE FB 6C 3B 14 6A 67 6D>)
(   8,<2012-05-09 01:20:21.750 -0500>,<Administrator>,<TOPSPIN>,<proc1d>,<TOPSPIN 2.1>,
      <abs ABSG = 5 
       data hash MD5: 128K
       03 F6 75 8A 6F 02 27 39 F9 56 A0 35 D5 DC 35 0B>)
$$ ##END=
$$ 
$$ $$ hash MD5
$$ $$ 81 07 1E 6F 26 8C 2E 83 89 D3 4A A6 EA F0 8F 83
##$RELAX= 
##$RELAX= 
##$RELAX= 
##$RELAX= 
##$RELAX= 
##$RELAX= 
##$RELAX= 
##$RELAX= 
$$ Bruker specific parameters
$$ [...]
##$TP07= 0
##$TPNAME0= <>
##$TPNAME1= <>
##$TPNAME2= <>
##$TPNAME3= <>
##$TPNAME4= <>
##$TPNAME5= <>
##$TPNAME6= <>
##$TPNAME7= <>
##$TPOAL= (0..7)
0.5 0.5 0.5 0.5 0.5 0.5 0.5 0.5
##$TPOFFS= (0..7)
0 0 0 0 0 0 0 0
##$TUNHIN= 0
##$TUNHOUT= 0
##$TUNXOUT= 0
##$USERA1= <user>
##$USERA2= <user>
##$USERA3= <user>
##$USERA4= <user>
##$USERA5= <user>
##$V9= 5
##$VALIST= <valist>
##$VCLIST= <CCCCCCCCCCCCCCC>
##$VD= 0
##$VDLIST= <DDDDDDDDDDDDDDD>
##$VPLIST= <PPPPPPPPPPPPPPP>
##$VTLIST= <TTTTTTTTTTTTTTT>
##$WBST= 1024
##$WBSW= 4
##$XGAIN= (0..3)
0 0 0 0
##$XL= 0
##$YL= 0
##$YMAX_a= 11069630
##$YMIN_a= -6049465
##$ZGOPTNS= <>
##$ZL1= 120
##$ZL2= 120
##$ZL3= 120
##$ZL4= 120
##$ABSF1= 14.96668
##$ABSF2= -5.585851
##$ABSG= 5
##$ABSL= 3
##$ALPHA= 0
##$AQORDER= 0
##$ASSFAC= 0
##$ASSFACI= 0
##$ASSFACX= 0
##$ASSWID= 0
##$AUNMP= <proc_prof1d_extract.lims>
##$AXLEFT= 0
##$AXNAME= <>
##$AXNUC= <1H>
##$AXRIGHT= 0
##$AXTYPE= 0
##$AXUNIT= <>
##$AZFE= 0.1
##$AZFW= 0.1
##$BCFW= 0
##$BC_mod= 0
##$BYTORDP= 0
##$COROFFS= 0
##$CY= 15
##$DATMOD= 1
##$DC= 0
##$DFILT= <>
##$DTYPP= 0
##$F1P= 0
##$F2P= 0
##$FCOR= 0.5
##$FTSIZE= 131072
##$FT_mod= 6
##$GAMMA= 0
##$GB= 0
##$INTBC= 1
##$INTSCL= 1
##$ISEN= 128
##$LB= 0.3
##$LEV0= 0
##$LPBIN= 0
##$MAXI= 10000
##$MC2= 0
##$MEAN= 0
##$ME_mod= 0
##$MI= 0
##$NCOEF= 0
##$NC_proc= -3
##$NLEV= 6
##$NOISF1= 0
##$NOISF2= 0
##$NSP= 0
##$NTH_PI= 0
##$NZP= 0
##$OFFSET= 14.96668
##$PC= 1
##$PHC0= 35.17273
##$PHC1= 0
##$PH_mod= 1
##$PKNL= yes
##$PPARMOD= 0
##$PPDIAG= 0
##$PPIPTYP= 0
##$PPMPNUM= 2147483647
##$PPRESOL= 1
##$PSCAL= 4
##$PSIGN= 0
##$PYNMP= <proc.py>
##$REVERSE= no
##$SF= 400.130005573841
##$SI= 131072
##$SIGF1= 0
##$SIGF2= 0
##$SINO= 400
##$SIOLD= 131072
##$SPECTYP= <>
##$SREGLST= <1H.CDCl3>
##$SSB= 0
##$STSI= 131072
##$STSR= 0
##$SW_p= 8223.68421052632
##$SYMM= 0
##$S_DEV= 0
##$TDeff= 65536
##$TDoff= 0
##$TI= <>
##$TILT= no
##$TM1= 0
##$TM2= 0
##$TOPLEV= 0
##$USERP1= <user>
##$USERP2= <user>
##$USERP3= <user>
##$USERP4= <user>
##$USERP5= <user>
##$WDW= 1
##$XDIM= 131072
##$YMAX_p= 426599212
##$YMIN_p= -96961983
##$CURPLOT= <Network HP LaserJet P1505>
##$CURPRIN= <$Network HP LaserJet P1505>
##$DFORMAT= <normdp>
##$LAYOUT= <+/1D_H.xwp>
##$LFORMAT= <normlp>
##$PFORMAT= <normpl>
##$SURQMSG= 1
$$ End of Bruker specific parameters
$$ ---------------------------------
##NTUPLES= NMR SPECTRUM
##VAR_NAME=  FREQUENCY,     SPECTRUM/REAL,   SPECTRUM/IMAG
##SYMBOL=    X,             R,               I
##VAR_TYPE=  INDEPENDENT,   DEPENDENT,       DEPENDENT
##VAR_FORM=  AFFN,          ASDF,            ASDF
##VAR_DIM=   131072,        131072,          131072
##UNITS=     HZ,            ARBITRARY UNITS, ARBITRARY UNITS
##FACTOR=    0.0627417313425165, 1,          1
##FIRST=     8223.62146879498, 6393,         -101002
##LAST=      0,             2782,            -99427
##MIN=       0,             -96961983,       0
##MAX=       8223.62146879498, 426599212,    0
$$ Real data points
##PAGE= N=1
##DATA TABLE= (X++(R..R)), XYDATA
$$ [...]
63706C46709l691m131l334q77K186M036M012L085K199J201j21r39k49J670L416
63691C55172L822K715Q86k12O25K878M322L390J225L77J729L754M744M609M237
63676C94273M167M462N073N607N241L602J551N74J367L279M958N395M559L356
63662D47464K765K901L124L214L909N787P946Q458O362K634r18l337m691n037
63648D80581m009j743M12R10k28j365j269o07q02j862k220q44J410K819K628J461
63632D75272M47L64J257K316K503J751J249K004L488M417M523M662N139N029L592
63617E18013J559K95J67L96M03O60J940M019N436M734K095n40j398p32k45p62
63601E36040j380j111l77j56m58p17j157k506m420n311m111j427J268K917L142
$$ plain form
63706 346709 343018 338887 335553 334676 336862 340898 344910 347995 350194 351395 351274 350335 350086 351756 355172
63691 355172 358994 361709 362595 362383 363008 365886 370208 373598 374823 375200 376929 380683 385427 390036 394273
63676 394273 398440 402902 407975 413582 418823 422425 423976 424550 425917 429196 434154 439549 444108 447464
63662 447464 450229 453130 456254 459468 463377 469164 477110 485568 491930 494564 493646 490309 485618 480581
63648 480581 476572 474829 475241 476151 475923 474558 473289 472682 471880 470018 467798 466954 468364 471183 473811 475272
63632 475272 475719 476083 477340 479656 482159 483910 485159 487163 490651 495068 499591 504253 509392 514421 518013
63617 518013 519572 519867 520034 520430 520833 521493 523433 527452 532888 537622 539717 539177 537779 537047 536802 536040
63601 536040 534660 533549 533172 533016 532558 531841 530684 528178 523758 518447 514336 512909 514177 517094 520236
63586E20236K204J210J549L502N777P034P235P132P086P232Q136J0094J2055J2486
63572F12968J1484J0873J1815J3321J3791J3251J3169J4495J6728J8839K0418
63561G71152K1757K3298K5233K7462K9868L2605L5842L9158M1665M3120M4461
63550A135621M6625M9040N0205M9691M8629M7913M6695M3324L7248K9370K0970
63539A605331J2939N758n27o200j1194j4730j6377j7195j8768k1128k2902k3873
63527A471134k5963l0580l6104l9500l9925l9088l8195l6318l2448k7667k4032
63516A101314k2082k0594j8433j5554j2297q770n157j941O36K899N244P516R244
63503A022025J0440J1917J4634J8636K2763K5641K7072K8163L0022L2746L5819
$$ plain form
63586 520236 522440 523650 525199 528701 534478 541512 548747 555879 562965 570197 578333 588427 600482 612968
63572 612968 624452 635325 647140 660461 674252 687503 700672 715167 731895 750734 771152
63561 771152 792909 816207 841440 868902 898770 931375 967217 1006375 1048040 1091160 1135621
63550 1135621 1182246 1231286 1281491 1331182 1379811 1427724 1474419 1517743 1554991 1584361 1605331
63539 1605331 1618270 1624028 1623501 1617301 1606107 1591377 1575000 1557805 1539037 1517909 1495007 1471134
63527 1471134 1445171 1414591 1378487 1338987 1299062 1259974 1221779 1185461 1153013 1125346 1101314
63516 1101314 1079232 1058638 1040205 1024651 1012354 1003584 998427 996486 997122 1000021 1005265 1012781 1022025
63503 1022025 1032465 1044382 1059016 1077652 1100415 1126056 1153128 1181291 1211313 1244059 1279878
63492A279878L8993M2207M5075M7145M8640N0328N2520N4483N4811N2090M5458
63481A811628L5224K2990J0757j56r130j5669j9594k1612k2733k3105k2375k1361
63469A724864k2164k5962l1558l6821m0898m4340m7733n0999n3554n4465n2969
63458A263401m9688m6710m5470m4956m3146l9863l6820l4923l3053k9966k6108
63447H32698k2733k0055j7265j4011j1082r639j0020j1259j1772j0794r111q008
63435F76949p645p141o045m733l265j088J518K889J938n9p23O39K494L177K599
63420F61504J861J913K848L998M537M230L480K592J375j63j303j605j906l359
63406F80002n474o253m658k120r53j754k908k496k21K544M263M686M832N770P581
$$ plain form
63492 1279878 1318871 1361078 1406153 1453298 1501938 1552266 1604786 1659269 1714080 1766170 1811628
63481 1811628 1846852 1869842 1880599 1880443 1871313 1855644 1836050 1814438 1791705 1768600 1746225 1724864
63469 1724864 1702700 1676738 1645180 1608359 1567461 1523121 1475388 1424389 1370835 1316370 1263401
63458 1263401 1213713 1167003 1121533 1076577 1033431 993568 956748 921825 888772 858806 832698
63447 832698 809965 789910 772645 758634 747552 737913 727893 716634 704862 694068 684957 676949
63435 676949 669304 662163 656118 651385 648120 647032 648550 651439 653377 653318 652595 653234 655728 658905 661504
63420 661504 663365 665278 668126 672124 676661 680891 684371 686963 688338 688175 686872 685267 683361 680002
63406 680002 674528 668275 663617 661497 660544 658790 655882 653386 653165 655709 659972 664658 669490 675260 682841
63391F82841R549J0992J1720J1988J2357J3369J5075J7045J9024K1228K3664K5798
63379H74650K7425K9308L2132L5311L7861M0059M2837M5590M6037M2899L7610
63368A291719L2712K9421K7498K6690K7318K9749L3948L9379M4973M9601N3000
63357A686008N5777N8205N9522N8843N6054N1273M4110L4422K3300J2464K784
63346B142762n811j3185j8601k1616k2801k3507k5219k8727l3519l8266m2421
63335A869089m6800n1927n6399n8070n6608n3699n0714m7517m3860m0571l8441
63324A324483l6773l4021k9529k4014j8661j4276j0976q110m644j98M373P874
63312A155528J0185J2366J5302J8731K1821K4360K6965L0149L3614L6727L9431
$$ plain form
63391 682841 692390 703382 715102 727090 739447 752816 767891 784936 803960 825188 848852 874650
63379 874650 902075 931383 963515 998826 1036687 1076746 1119583 1165173 1211210 1254109 1291719
63368 1291719 1324431 1353852 1381350 1408040 1435358 1465107 1499055 1538434 1583407 1633008 1686008
63357 1686008 1741785 1799990 1859512 1918355 1974409 2025682 2069792 2104214 2127514 2139978 2142762
63346 2142762 2136951 2123766 2105165 2083549 2060748 2037241 2012022 1983295 1949776 1911510 1869089
63335 1869089 1822289 1770362 1713963 1655893 1599285 1545586 1494872 1447355 1403495 1362924 1324483
63324 1324483 1287710 1253689 1224160 1200146 1181485 1167209 1156233 1148123 1143479 1143281 1147654 1155528
63312 1155528 1165713 1178079 1193381 1212112 1233933 1258293 1285258 1315407 1349021 1385748 1425179
63301A425179M2231M5386M8731N2293N6232N9802O1323O0022N7120N3977M9721
63290B012017M2237L1252J8898P142l607j2876j9134k1759k2583k3913k5994k7923
63278A953757l0166l4184l9899m5468m9720n3046n5654n6742n6105n4957n4060
63267A423756n2319m8477m3254l8477l4750l1358k7963k5005k2615k0621j9750
63256A059167k1312k5050k8478k9258k7607k5564k4456k3904k2921k1104j8723
63245G90790j6417j4897j4381j4164j3217j1421r835r386r652r235p387m890l235
63232F52673l128m044n126o023o560o192m708l305l793o130p812o648l510j151
63218E84543p54j059q08l75n17r29r64p91p92o15K11J313K137L035M599O187O476
$$ plain form
63301 1425179 1467410 1512796 1561527 1613820 1670052 1729854 1791177 1851199 1908319 1962296 2012017
63290 2012017 2054254 2085506 2104404 2111546 2107939 2095063 2075929 2054170 2031587 2007674 1981680 1953757
63278 1953757 1923591 1889407 1849508 1804040 1754320 1701274 1645620 1588878 1532773 1477816 1423756
63267 1423756 1371437 1322960 1279706 1241229 1206479 1175121 1147158 1122153 1099538 1078917 1059167
63256 1059167 1037855 1012805 984327 955069 927462 901898 877442 853538 830617 809513 790790
63245 790790 774373 759476 745095 730931 717714 706293 696458 687072 677420 668185 660798 655908 652673
63232 652673 649545 645501 640375 634352 627792 621600 616892 613587 609794 603664 595852 589204 585694 584543
63218 584543 583789 582730 581922 581547 581030 580101 579137 578346 577554 576939 577150 578463 580600 583635 588234 594421 600897
63201F00897N393M391M593N536O140O171O346P444R546J1866J3334J3734J4074
63188G09465J5349J7168J8327J8575J8924K0207K2166K4074K5500K6293K6616
63177I42664K7169K8595L0542L2039L2845L3460L3821L3258L2026L1442L1848
63166A289709L1850L0489K8956K8876K9892L0286K9285K7467K5413K3289K1284
63155A596796J9132J5549R575K256m398r957j5597k1596k6529k9432l1139l2657
63143A472003l3526l2799l0770k8550k6623k4702k2625k0356j7395j3140q018
63132A213499l461m97J359L525O825J0641J3593J5058J5856J7324J9799K2343
63120A335864K3802K3769K2468K0243J7436J4558J2333J1391J1676J1988J0532
$$ plain form
63201 600897 606290 610681 615274 620810 626950 633121 639467 646911 656457 668323 681657 695391 709465
63188 709465 724814 741982 760309 778884 797808 818015 840181 864255 889755 916048 942664
63177 942664 969833 998428 1028970 1061009 1093854 1127314 1161135 1194393 1226419 1257861 1289709
63166 1289709 1321559 1352048 1381004 1409880 1439772 1470058 1499343 1526810 1552223 1575512 1596796
63155 1596796 1615928 1631477 1641052 1643308 1638910 1628953 1613356 1591760 1565231 1535799 1504660 1472003
63143 1472003 1438477 1405678 1374908 1346358 1319735 1295033 1272408 1252052 1234657 1221517 1213499
63132 1213499 1210038 1209541 1210900 1214425 1221250 1231891 1245484 1260542 1276398 1293722 1313521 1335864
63120 1335864 1359666 1383435 1405903 1426146 1443582 1458140 1470473 1481864 1493540 1505528 1516060
63109A516060O468P56m925r865j4341j8422k1729k4432k7346l0713l3733l5688
63097A302090l6711l7020l6246l4200l1713k9947k9225k9046k8776k7786k5391
63086I56029k1551j7420j4454j3011j2331j1693j0933r928q364o330m610l867
63074H21537l758l217j744q6O85O08P31J438J776J086M80J507L810N654O515P375
63058H44397Q258P645N364L888N067P101O965M725L117L443M391M849N351O218
63044I20779O506N814N215N332N199M192L534M333N421M985L394K638L388M439
63030I85169M852M955N017M554L499K845L411M774O043P044Q250J0065J2544J5276
63016A078298J7216J7333J6047J5471J7462K1564K5545K7831K8856L0058L2139
$$ plain form
63109 1516060 1522528 1523284 1518359 1508494 1494153 1475731 1454002 1429570 1402224 1371511 1337778 1302090
63097 1302090 1265379 1228359 1192113 1157913 1126200 1096253 1067028 1037982 1009206 981420 956029
63086 956029 934478 917058 902604 889593 877262 865569 854636 844708 836344 830014 825404 821537
63074 821537 817779 814562 812818 812732 813417 814025 814756 816194 817970 819056 819536 821043 824853 830507 837022 844397
63058 844397 852655 860300 865664 869552 874619 881720 888685 893410 896527 899970 904361 909210 914561 920779
63044 920779 927285 933099 938314 943646 948845 953037 956571 960904 966325 971310 974704 977342 980730 985169
63030 985169 990021 994976 999993 1004547 1008046 1010891 1014302 1019076 1025119 1032163 1040413 1050478 1063022 1078298
63016 1078298 1095514 1112847 1128894 1144365 1161827 1183391 1208936 1236767 1265623 1295681 1327820
63005A327820L4571L6371L7129L7523L8997M2636M8073N3583N7588O0123O2631
62994A837045O6382P1210P5854P9291Q1475Q2849Q3480Q2891Q0888P8356P6841
62983B696562P7064P7949P7567P5244P2294P0457O9943O9413O7418O3150N5988
62972C473049M5520L2460J8759N929o366j9406l3403m7099n9208o9353p7336q2425
62960C181121q4102q3142q1208p9233p6670p2392o5964n7833m8695l9237l0309
62949B462336k2718j6364j0032k664N152J1573J5528J7951K0570K3932K7133K9274
62937B561671L0401L0885L0561K9118K7049K5400K4380K2736J9155J4010Q966
62926B824332M657m09p922j7392k6802l5324m4018n3395o1874o7656p1149p4059
$$ plain form
63005 1327820 1362391 1398762 1435891 1473414 1512411 1555047 1603120 1656703 1714291 1774414 1837045
62994 1837045 1903427 1974637 2050491 2129782 2211257 2294106 2377586 2460477 2541365 2619721 2696562
62983 2696562 2773626 2851575 2929142 3004386 3076680 3147137 3217080 3286493 3353911 3417061 3473049
62972 3473049 3518569 3551029 3569788 3575717 3569351 3549945 3516542 3469443 3410235 3340882 3263546 3181121
62960 3181121 3097019 3013877 2932669 2853436 2776766 2704374 2638410 2580577 2531882 2492645 2462336
62949 2462336 2439618 2423254 2413222 2410558 2415710 2427283 2442811 2460762 2481332 2505264 2532397 2561671
62937 2561671 2592072 2622957 2653518 2682636 2709685 2735085 2759465 2782201 2801356 2815366 2824332
62926 2824332 2828989 2828580 2820658 2803266 2776464 2741140 2697122 2643727 2581853 2514197 2443048 2368989
62914B368989p6652p7546p6154p3740p1639o9691o7105o3720n9740n5136n0192
62903A627674m5841m2646m0053l7470l5397l4380l3555l1598k8801k6794k6154
62892A244985k5669k4296k2607k1674k1600k1796k1953k1962k1524k0497j9236
62881A002171j8036j6815j5692j5171j5063j4085j1537q740p654q326q949q294
62869H53809o841n468m358l626l805m947o106o445o155n594m394k410r07j432
62855G91321l588n183m765l102j775j284j173j309k045l324m414m743m539m397
62841G45680m500m583m418m012l319k147o36L91R8j216k024j042J356L472M015
62826G27115L136J829P79jp22j359j563r67M20J938K668K235J166K51k42m98m67
$$ plain form
62914 2368989 2292337 2214791 2138637 2064897 1993258 1923567 1856462 1792742 1733002 1677866 1627674
62903 1627674 1581833 1539187 1499134 1461664 1426267 1391887 1358332 1326734 1297933 1271139 1244985
62892 1244985 1219316 1195020 1172413 1150739 1129139 1107343 1085390 1063428 1041904 1021407 1002171
62881 1002171 984135 967320 951628 936457 921394 907309 895772 887032 879378 871052 862103 853809
62869 853809 846968 841500 837142 833516 829711 824764 818658 812213 806058 800464 796070 793660 792753 791321
62855 791321 787733 782550 777785 774683 772908 771624 770451 769142 767097 763773 759359 754616 750077 745680
62841 745680 741180 736597 732179 728167 724848 722701 722065 722456 722554 721338 719314 718272 719628 723100 727115
62826 727115 730251 732080 732859 732858 732136 730777 729214 728247 728667 730605 733273 735508 736674 736925 736683 736185 735718
62809G35718K22J483K333J766Q8j080m28J590L251L429K569J694J030J21q45p36
62793G52205J103L584M688L509J145n82q25K0J382L228N448O998O403L544M65
62778G92315m61P49J623L79j611j542R93L326L222J732J543L311N116N377M828
62763H20900N140O546P822Q013P405O834O727O929P107P175P454Q393J0024J1826
62749I28295J3297J4458J5538J6383J6677J6700J7342J9121K1471K3325K4360
62738A126967K5369K7353L0316L3160L4938L6073L8013M1621M6347N1177N5922
62727A547256O1033O6532P1946P7303Q3345R0352R7292J02687J06084J08265J10035
62716B522130J11194J10643J07307J00786R1297P9218O4909M8899L1901J4372
$$ plain form
62809 735718 735940 737423 739756 741522 741610 740530 740102 741692 744943 748372 750941 752635 753665 753786 752941 752205
62793 752205 753308 756892 761580 765089 766234 765652 764827 764847 766229 769457 774905 781903 788306 791850 792315
62778 792315 791854 792603 794226 794605 792994 791452 792445 795771 798993 800725 802268 805579 810695 816072 820900
62763 820900 826040 832586 840408 848421 855826 862660 869387 876316 883423 890598 898052 906445 916469 928295
62749 928295 941592 956050 971588 987971 1004648 1021348 1038690 1057811 1079282 1102607 1126967
62738 1126967 1152336 1179689 1210005 1243165 1278103 1314176 1352189 1393810 1440157 1491334 1547256
62727 1547256 1608289 1674821 1746767 1824070 1907415 1997767 2095059 2197746 2303830 2412095 2522130
62716 2522130 2633324 2743967 2851274 2952060 3043357 3122575 3187484 3236383 3268284 3282656
62706C282656l705k2240m0380n6818p0773q2354r1950r9561j04724j06917j06292
62695B496942j04245j02756j02455j01651r8177r1982q4969p8430p2070o5778
62685A594429o0671n7348n4438n0212m4952m0360l7126l4404l1439k8360k5353
62674A129766k2225j9108j6556j4674j2840j0601q217o085m221k458o51J445L933
62661A017508O301P749Q239Q799J0593J3821J7530K0354K1802K3100K6110L0926
62649A212832L5374L7818L9637M3389M9158N4607N8558O2418O7450P2671P6520
62638A810432P9044Q1093Q2482Q2290Q0248P6669P1603O4992N6998M7381L5385
62627B568617K1130O271p806k1472l5319m8145n8153o5562p2209p8717q3715q5944
$$ plain form
62706 3282656 3278951 3256711 3216331 3159513 3088740 3006386 2914436 2814875 2710151 2603234 2496942
62695 2496942 2392697 2289941 2187486 2085835 1987658 1895676 1810707 1732277 1660207 1594429
62685 1594429 1533758 1476410 1421972 1371760 1326808 1286448 1249322 1214918 1183479 1155119 1129766
62674 1129766 1107541 1088433 1071877 1057203 1044363 1033762 1025545 1019460 1015239 1012781 1012130 1013575 1017508
62661 1017508 1023809 1031558 1039797 1048596 1059189 1073010 1090540 1110894 1132696 1155796 1181906 1212832
62649 1212832 1248206 1286024 1325661 1369050 1418208 1472815 1531373 1593791 1661241 1733912 1810432
62638 1810432 1889476 1970569 2053051 2135341 2215589 2292258 2363861 2428853 2485851 2533232 2568617
62627 2568617 2589747 2596018 2588212 2566740 2531421 2483276 2425123 2359561 2287352 2208635 2124920 2038976
62615B038976q5629q3602q0552p7354p4687p1939o7857o2727n8452n5754n2812
62604A267611m7918m2295l8671l7499l6313l3003k8452k5141k3945k3290k1419
62593I09665j8558j6231j5045j4078j2563j1069j0452j0484j0281r588q696p507
62581G65113n698l626k121j379r19m81j93J01O98J179P50m59j283r55J88J512
62565G52427K737L629L965M076M526N238N770O549Q428J0767J1473R895Q354R666
62551H47500J3858J8483K1529K2875K3275K3197K2957K3218K4859K8256L2691
62540A102698L6689L9399M1539M4345M7750N0474N1867N2525N2815N2013M9440
62529A621554M5388M0242L3692K5532J6408P088k246j1457k0067k7935l5307m1666
$$ plain form
62615 2038976 1953347 1869745 1789193 1711839 1637152 1565213 1497356 1434629 1376177 1320423 1267611
62604 1267611 1219693 1177398 1138727 1101228 1064915 1031912 1003460 978319 954374 931084 909665
62593 909665 891107 874876 859831 845753 833190 822121 811669 801185 790904 781316 772620 765113
62581 765113 759415 755789 753668 752289 751370 750889 750696 750797 751495 752674 753424 752965 751682 750727 750915 752427
62565 752427 755164 758793 762758 766834 771360 776598 782368 788917 797345 808112 819585 829480 837834 847500
62551 847500 861358 879841 901370 924245 947520 970717 993674 1016892 1041751 1070007 1102698
62540 1102698 1139387 1178786 1220325 1264670 1312420 1362894 1414761 1467286 1520101 1572114 1621554
62529 1621554 1666942 1707184 1740876 1766408 1782816 1789904 1787658 1776201 1756134 1728199 1692892 1651226
62517A651226m5750m7407m8170m9129m9630m9008m8034m7260m5550m1994l7974
62506A141320l5357l3737l1590k9113k7534k6363k3967k0593j8211j7264j6054
62495H61537j3627j1051r286p944o695n922n366m124k614k520l972m800l519j127
62481G78970J053L345O153Q322Q645P640O380M953L507L351N187P482Q478Q884
62467H62350J0622J3727J6537J8576K1179K5158K9556L3125L5758L8065M0492
62456A145145M3165M5901M8179M9581N0238N0456N0163M9089M7029M3677L8801
62445A661424L2995K7330K1795J5184P308k0n342r592j4127j7845j8328j5430
62433A685352j1721r374q259p109m937j123M439J0886J7177K3352K9880L6050
$$ plain form
62517 1651226 1605476 1558069 1509899 1460770 1411140 1362132 1314098 1266838 1221288 1179294 1141320
62506 1141320 1105963 1072226 1040636 1011523 983989 957626 933659 913066 894855 877591 861537
62495 861537 847910 836859 827573 819629 812934 807012 801646 797522 794908 792388 788416 783616 780097 778970
62481 778970 780023 783368 789521 797843 806488 814128 820508 825461 828968 832319 837506 844988 853466 862350
62467 862350 872972 886699 903236 921812 942991 968149 997705 1030830 1066588 1104653 1145145
62456 1145145 1188310 1234211 1282390 1331971 1382209 1432665 1482828 1531917 1578946 1622623 1661424
62445 1661424 1694419 1721749 1743544 1758728 1766036 1766016 1760674 1751082 1736955 1719110 1700782 1685352
62433 1685352 1673631 1664257 1655998 1648889 1643952 1642829 1647268 1658154 1675331 1698683 1728563 1764613
62421A764613M0545M3457M6103M8744N0376N0995N1957N3089N1416M4358L3062
62410B278715K1172J1013K275o254j5119k4310l3822m3591n3150o1452o7277p0347
62398A937853p1944p3622p5176p4725p1196o5760o0337n5594n1117m6762m2707
62387A248913l8675l4035k8776k3725j9783j7191j5419j3606j1282q895p322o786
62375A023418o616o192n631n342n495o243p835j0003j1736j2231j1879j1767j2310
62362I10138j2789j2287j0887r690r639j0354j0559r715q583p844o990n408l889
62349G91504l737m792n576n339m568l620k308j075r15j687j870o58J050K253L095
62334G61757L830M089M020M708O299P176O311N237O084Q620J0779J1543J1695
$$ plain form
62421 1764613 1805158 1848615 1894718 1943462 1993838 2044833 2096790 2149879 2201295 2245653 2278715
62410 2278715 2299887 2310900 2313175 2306921 2291802 2267492 2233670 2190079 2136929 2075477 2008200 1937853
62398 1937853 1865909 1792287 1717111 1642386 1571190 1505430 1445093 1389499 1338382 1291620 1248913
62387 1248913 1210238 1176203 1147427 1123702 1103919 1086728 1071309 1057703 1046421 1037526 1030204 1023418
62375 1023418 1016802 1010610 1004979 999637 994142 987899 980064 970061 958325 946094 934215 922448 910138
62362 910138 897349 885062 874175 864485 854846 844492 833933 824218 815635 807791 800801 795393 791504
62349 791504 787767 782975 777399 772060 767492 763872 761564 760489 759574 757887 756017 755359 756409 758662 761757
62334 761757 765587 769676 773696 778404 784703 791879 798190 803427 809511 818131 828910 840453 852148
62321H52148J2288J3639J5547J7394J8421J8861K0055K2556K4999K5990K5964
62310A067862K5961K6033K6573K9654L6335M3765M8102M9925N3486O0440O7755
62299A535891P2718P6555Q1239Q5745Q8044Q8719Q9653R0235Q7607Q0358O9768
62288B446532N7458M3816K9013J4007Rj2238k2495l1174l9409m8065n6577o3494
62276B317383o8269p1676p4385p5904p5186p1819o6410o0172n4264m9215m4848
62265A605235m0858l7363l4708l2992l2057l1672l1415l0752k9686k9039k9457
62254A245236l0404l0758l0269k9593k8876k7177k3894k0062j7444j6433j5670
62243I74656j3906j1541r835r084q423p307o213n524m660k985q72J019K901N128
$$ plain form
62321 852148 864436 878075 893622 911016 929437 948298 968353 990909 1015908 1041898 1067862
62310 1067862 1093823 1119856 1146429 1176083 1212418 1256183 1304285 1354210 1407696 1468136 1535891
62299 1535891 1608609 1685164 1766403 1852148 1940192 2028911 2118564 2208799 2296406 2376764 2446532
62288 2446532 2503990 2547806 2576819 2590826 2590835 2578597 2556102 2524928 2485519 2437454 2380877 2317383
62276 2317383 2249114 2177438 2103053 2027149 1951963 1880144 1813734 1753562 1699298 1650083 1605235
62265 1605235 1564377 1527014 1492306 1459314 1427257 1395585 1364170 1333418 1303732 1274693 1245236
62254 1245236 1214832 1184074 1153805 1124212 1095336 1068159 1044265 1024203 1006759 990326 974656
62243 974656 960750 949209 939374 930290 921867 914560 908347 902823 898163 895178 894306 895325 898226 903354
62229I03354O689N941L084O51R83M104Q398J2329J4901J5535J4552J3338J3244
62216A017103J4462J6233J7681J8263J8207J8832K1444K5477K8851L0844L3333
62205A260730L8081M4032M8834N2148N5684O0461O5895P1411P7138Q2786Q7516
62194A944716R1209R4334R6222R4979Q9699Q1323P0802N7975M3179K8348J5106
62183B707892K795j0104k3348l5259m5110n3721o1839o9243p5410p9886q2036
62172B174731q1539p9318p6823p4267p0621o5612o0578n6830n4184n1717m8972
62161A454270m5748m1692l7198l3922l2995l3101l1667k7952k3685k0592j8608
62150A107110j6996j5776j5069j4057j1891r133p132o217n521m452l273k095l58
$$ plain form
62229 903354 910043 915984 919068 919719 920702 924806 933204 945533 960434 975969 990521 1003859 1017103
62216 1017103 1031565 1047798 1065479 1083742 1101949 1120781 1142225 1167702 1196553 1227397 1260730
62205 1260730 1298811 1342843 1391677 1443825 1499509 1559970 1625865 1697276 1774414 1857200 1944716
62194 1944716 2035925 2130259 2226481 2321460 2411159 2492482 2563284 2621259 2664438 2692786 2707892
62183 2707892 2710687 2700583 2677235 2641976 2596866 2543145 2481306 2412063 2336653 2256767 2174731
62172 2174731 2093192 2013874 1937051 1862784 1792163 1726551 1665973 1609143 1554959 1503242 1454270
62161 1454270 1408522 1366830 1329632 1295710 1262715 1229614 1197947 1169995 1146310 1125718 1107110
62150 1107110 1090114 1074338 1059269 1045212 1033321 1024188 1017056 1010839 1005318 1000866 997593 995498 995140
62137I95140K246N075P148Q087Q301Q673J0022J2286J4303J5060J5148J6016J7897
62124A135402J9597K0482K1220K2140K2522K2319K2956K4962K6417K5570K3884
62113A387471K4275K7150L0571L3885L8370M4093M9011N2300N5977O1602O7390
62102A872095P0435P0223O7901O3448N5885M5731L4930K4432J3641K340q542j8271
62090B294248k6898l4253l9739m3552m6865n0311n3295n5123n5788n5224n2921
62079A780279m8906m4242l9932l6015l2090k7941k3400j8452j3881j0745q791
62068A475884o558l637j531j323j836j376j76M18K59M4o99l028o062p165n327
62053A437887k708j994l560n994q256j0217j1912j3295j4306j4571j3576j1564
$$ plain form
62137 995140 997386 1002461 1009609 1017696 1025997 1034670 1044692 1056978 1071281 1086341 1101489 1117505 1135402
62124 1135402 1154999 1175481 1196701 1218841 1241363 1263682 1286638 1311600 1338017 1363587 1387471
62113 1387471 1411746 1438896 1469467 1503352 1541722 1585815 1634826 1687126 1743103 1804705 1872095
62102 1872095 1942530 2012753 2080654 2144102 2199987 2245718 2280648 2305080 2318721 2321061 2312519 2294248
62090 2294248 2267350 2233097 2193358 2149806 2102941 2052630 1999335 1944212 1888424 1833200 1780279
62079 1780279 1731373 1687131 1647199 1611184 1579094 1551153 1527753 1509301 1495420 1484675 1475884
62068 1475884 1469326 1465689 1464158 1462835 1460999 1459623 1459447 1459865 1460124 1460168 1459469 1456441 1450379 1443214 1437887
62053 1437887 1435179 1433185 1429625 1423631 1415375 1405158 1393246 1379951 1365645 1351074 1337498 1325934
62041A325934r567q027o229l664j056P94K229L785M909M926M651N502P308Q573
62027A340068Q925R707J1626J3341J3411J2727J3756J7500K2116K4928K5488K6060
62015A539653K8799L2868L5420L5456L5327L7514M1257M3947M4918M5753M7255
62004A968167M8527M9260N0471N2086N1951M8542M2845L6164K7935J7465O213
61993B399626l852j2869k1913l0339l6924m2819n0264n8478o3977o5591o6131
61982A946469o7912o9385o8010o4176o0018n6182n2122m8437m6175m4399m1002
61971A328651l6027l1934l0136k9173k7134k4230k1932k0718j9868j8887j8018
61960A050594j7510j7098j6288j4920j3464j2743j3072j3678j3350j1776r835
$$ plain form
62041 1325934 1316367 1308340 1302111 1298447 1297391 1298185 1300414 1304199 1309108 1314034 1318685 1324187 1331495 1340068
62027 1340068 1348993 1358700 1370326 1383667 1397078 1409805 1423561 1441061 1463177 1488105 1513593 1539653
62015 1539653 1568452 1601320 1636740 1672196 1707523 1745037 1786294 1830241 1875159 1920912 1968167
62004 1968167 2016694 2065954 2116425 2168511 2220462 2269004 2311849 2348013 2375948 2393413 2399626
61993 2399626 2395774 2382905 2360992 2330653 2293729 2250910 2200646 2142168 2078191 2012600 1946469
61982 1946469 1878557 1809172 1741162 1676986 1616968 1560786 1508664 1460227 1414052 1369653 1328651
61971 1328651 1292624 1260690 1230554 1201381 1174247 1150017 1128085 1107367 1087499 1068612 1050594
61960 1050594 1033084 1015986 999698 984778 971314 958571 945499 931821 918471 906695 896860
61949H96860q523p992p699p059n801m152k812k330k405k193j374m82p2j52o32
61934H43182j630k944l795l616k710j709q53l16p36k573n129o994p619p842q664
61919G86052j0045j1107j1244j0662r987r462q622o885m565k986l114m201m440
61906F88732l064j256o05j140j546j038l20l90r99r26L25J837K534K693L495N259
61890F93591O896P442P443Q167R755J1048J1252J0955J1077J1577J1951J2583
61878H13737J4527J7745K0465K0899J9216J7183J6092J5736J5331J4585J3564
61867I99080J2198J0602R401Q952Q369O130J874k890o093o748n362l308j950j666
61853A028589j331O52M288P563Q716Q427Q837J0630J2246J2187J0957J0077R868
$$ plain form
61949 896860 888337 880345 872646 865587 859786 855634 852822 850492 848087 845894 844520 844038 843966 843814 843182
61934 843182 841552 838608 834813 831197 828487 826778 825925 825609 824873 822300 817171 810177 802558 794716 786052
61919 786052 776007 764900 753656 742994 733007 723545 714923 708038 703473 700487 697373 693172 688732
61906 688732 685668 684412 683807 682667 681121 680083 679763 679373 678374 677448 677773 679610 682144 684837 688332 693591
61890 693591 700487 707929 715372 723539 733294 744342 755594 766549 777626 789203 801154 813737
61878 813737 828264 846009 866474 887373 906589 923772 939864 955600 970931 985516 999080
61867 999080 1011278 1021880 1031281 1040233 1048602 1054732 1056606 1053716 1047623 1040875 1035513 1032205 1030255 1028589
61853 1028589 1027258 1027910 1032198 1039761 1048477 1056904 1065741 1076371 1088617 1100804 1111761 1121838 1131706
61840A131706R116O852L625O76j725m452p977j1227j2659j2289j1761j2142j2527
61827A065216j1624r958r336j0328j1561j1747j1315j1443j2273j2879j2549j1540
61815I28663j0686j0590j1064j1276j0737j0037r827r219o402j398L100M648M010
61802H49185L863N234O778P462Q227J0367J3509J6101J7329J7729J8341J9819
61790I93944K2197K4861K6834K7477K7033K6271K5655K4950K3572K1148J7693
61779A261635J3424Q618L776l27l111m805o137p244p395o171m357l003j871K58
61765A243290L725P195Q969Q591O947N231M022K899Q03k856p282j0997j3594j6202
61751A240741j9811k3698k6243k6973k6988k7327k7656k7000k5272k3393k2005
$$ plain form
61840 1131706 1140822 1147674 1151299 1151975 1150250 1145798 1137821 1126594 1113935 1101646 1089885 1077743 1065216
61827 1065216 1053592 1043634 1034298 1023970 1012409 1000662 989347 977904 965631 952752 940203 928663
61815 928663 917977 907387 896323 885047 874310 864273 854446 845227 838825 837427 840527 845175 849185
61802 849185 853048 858282 865060 872522 880749 891116 904625 920726 938055 955784 974125 993944
61790 993944 1016141 1041002 1067836 1095313 1122346 1148617 1174272 1199222 1222794 1243942 1261635
61779 1261635 1275059 1283677 1287453 1287126 1284015 1279210 1273073 1265829 1258434 1252263 1247906 1244903 1243032 1243290
61765 1243290 1247015 1254210 1263179 1271770 1278717 1283948 1287970 1290869 1291672 1288816 1281534 1270537 1256943 1240741
61751 1240741 1220930 1197232 1170989 1144016 1117028 1089701 1062045 1035045 1009773 986380 964375
61740I64375k0750j9083j7170j5511j4126j2865j2103j2181j2230j0874q397o861
61728H02224p315q083p029m503k608k241k533k859l621m841n629n379m358k843
61714G38382j017K19j73j540j956j057p64k137l303k074O59K111J447N08R30K235
61698G32470L096L066K573K052J668J438J386J588J978K113J550O45K32K83j82
61683G55956j288j601k91J110O07j335k432j832r32r98j609j982k279k861l235
61668G34998k582q32J250K664K712J545L27K65J386K624L083K677J797J045J050
61653G54009J649J601J73j331j029O31J127o50k827l266k332j874k646l986n232
61638G34017o074o032m871l365k693l000l367l111k562k509l268m360m834m125
$$ plain form
61740 964375 943625 924542 907372 891861 877735 864870 852767 840586 828356 817482 809085 802224
61728 802224 794909 786826 779797 775294 772686 770445 767912 765053 761432 756591 750962 745583 741225 738382
61714 738382 737365 737584 737411 735871 733915 732858 732094 729957 726654 724580 725239 727350 728797 729305 730235 732470
61698 732470 735566 738632 741205 743257 744925 746363 747749 749337 751315 753428 754978 755623 755855 756138 755956
61683 755956 754668 753067 752776 753886 754493 753158 750726 748894 747962 746964 745355 743373 741094 738233 734998
61668 734998 732416 731584 732834 735498 738210 739755 740082 740347 741733 744357 747440 750117 751914 752959 754009
61653 754009 755658 757259 757432 756101 755072 755703 756830 756180 753353 750087 747755 745881 743235 739249 734017
61638 734017 727943 721911 717040 713675 710982 707982 704615 701504 698942 696433 693165 688805 683971 679846
61624F79846k678j526j211j542k387l860n517o252n570m243l162k313j547j400
61610F36638k122k664j856k99K59o57j702j737j232j217j714j904j267RJ458K660
61594F22653L347L535L528L493L096J893J35j085p92Q04K430L085K869K393J790
61579F53174R24K22M47J533K404K154Q81q49k611l964m452m223l985l959l620
61564F34076k930k895m046n155m603k577q34n74j537k929m088m317l292j871j496
61549E90932k501l842m711n423o322o850o395n380m653m304l857l283l013l121
61535E27277l209l177l367l875m250m213m156m523n018n005m488m205m507m683
61521D68601l770j765K91J337J115J14q54j196j022j092j864k630k235p25M03
$$ plain form
61624 679846 677168 675642 674431 672889 670502 666642 661125 654873 649303 645060 641898 639585 638038 636638
61610 636638 634516 631852 629996 629697 629956 629299 627597 625860 624628 623411 621697 619793 618526 618535 619993 622653
61594 622653 626000 629535 633063 636556 639652 641545 641680 640595 639803 640607 643037 646122 648991 651384 653174
61579 653174 654098 654320 654767 656300 658704 660858 661739 660890 658279 654315 649863 645640 641655 637696 634076
61564 634076 631146 628251 624205 619050 614447 611870 611036 610462 608925 605996 601908 597591 594299 592428 590932
61549 590932 588431 584589 579878 574455 568133 561283 554888 549508 544855 540551 536694 533411 530398 527277
61535 527277 524068 520891 517524 513649 509399 505186 501030 496507 491489 486484 481996 477791 473284 468601
61521 468601 464831 463066 463357 464694 465809 465923 465069 463873 462851 461759 459895 457265 455030 454305 454708
61506D54708l1j408k120j413Q9J412K111K237K023J815J902K204K317K028J677
61491D69551J804K372K554J631J40l69Q36K538K930J866Q49Q89J359J309Q46N51
61475D91656L37k60j088j487j158m04K74M49j22j201k143k532k448j994j164l37
61459D76378j99p18r75m68K13N54J018J993K803K756K344K142J413p10l170l794
61443D81580k099J34J162Q83J33l50q8Q27J419Q80j31k78M18P16K85J20N27M70
61425D86608m45q82K87K124K855K095R15M02R34K256L471L689L178L189M023M248
61409E18947K593k68k717m000m132k953p07J161J306K57l24J66J038J901K887
61394E15155L375K213k65j959j435M00J810K329K456K256J524Q81J282K377K672
$$ plain form
61506 454708 454677 453269 451149 449736 449825 451237 453348 455585 457608 459423 461325 463529 465846 467874 469551
61491 469551 471355 473727 476281 477912 478052 477683 478519 481057 483987 485853 486702 487591 488950 490259 491105 491656
61475 491656 491993 491733 490645 489158 488000 487596 487870 488319 488197 486996 484853 482321 479873 477879 476715 476378
61459 476378 476179 475461 474486 474018 474231 474785 475803 477796 480599 483355 485699 487841 489254 488544 485374 481580
61443 481580 479481 479615 480777 481660 481793 481443 481355 482182 483601 484481 484350 484072 484490 485206 485491 485611 486138 486608
61425 486608 486163 485281 485568 487692 490547 492642 493557 493959 494893 497149 500620 504309 507487 510676 514699 518947
61409 518947 521540 521272 518555 514555 510423 507470 506763 507924 509230 509487 509163 509329 510367 512268 515155
61394 515155 518530 520743 520478 518519 517084 517484 519294 521623 524079 526335 527859 528740 530022 532399 535071
61379E35071J736J139K337M360M803K950O61o6O44J402J669J868K033J702J192
61364E63501J586L077M296L951K277M67o44p44K34J628J994N06j785l040k785
61349E74519k150k088k350k365k240k295k230j447j41M68o24k810m162l344j024
61334E45717J047K106K813L647L946L114J898J496J852J831R24j51o07n28m24
61319E68681m23k79K79J385K980M701N961O271N435L623J465q1l08P71K590M489
61303F07540N850O201N592M612L719K837K017J938L072M747N939O693P782R062
61289F77601R426Q656Q060Q559R142Q275O185M598M461N016N206M996M969N228
61275G70378N316M806L641K087O87K4J39L44n4q64j199n75N14J185R65n5j404
$$ plain form
61379 535071 536807 537946 540283 544643 549446 552396 553057 552991 553635 555037 556706 558574 560607 562309 563501
61364 563501 565087 568164 572460 576411 578688 579155 578511 577767 578001 579629 581623 582129 580344 577304 574519
61349 574519 572369 570281 567931 565566 563326 561031 558801 557354 557213 557681 557057 554247 550085 546741 545717
61334 545717 546764 548870 551683 555330 559276 562390 564288 565784 567636 569467 570391 570240 569633 569105 568681
61319 568681 568258 567979 568258 569643 572623 577324 583285 589556 594991 598614 600079 599998 599690 600461 603051 607540
61303 607540 613390 619591 625183 629795 633514 636351 638368 640306 643378 648125 654064 660757 668539 677601
61289 677601 687027 695683 703743 712302 721444 729719 735904 740502 744963 749979 755185 760181 765150 770378
61275 770378 775694 780500 784141 786228 786915 786939 787078 787422 787368 786504 785305 784730 785244 786429 787394 787339 785935
61258G85935k313j971k62J947L680M937O432Q296R727J0141J0161J0946J2716
61245H60372J4408J4824J3829J2333J1121R986Q131N319K149q62l835o702q437
61232I32636q120o580n826o687p953q213p511o663n870m956m258m278m714m738
61218H46269m052l044k056j098j5J598M221P260Q721P142L787J605J908L262L887
61203H79395L893M405N670P087Q343R397R717Q685O692M975M185L850L334K604
61189I62232J862J162P36J112K288L229K862J376n7q33j439k312k885k379j089
61174I65865k06m16j267j914j955j337K6K034M042N235N358M903M511M490M856
61159I94225N551O403P034P133O776O265N582M507L377L222M436N795N750M617
$$ plain form
61258 785935 783622 781651 781389 783336 787016 791953 798385 806681 816408 826549 836710 847656 860372
61245 860372 874780 889604 903433 915766 926887 936873 945004 950323 952472 951610 947775 941073 932636
61232 932636 924516 917936 912110 905423 897470 889257 881746 875083 869213 864257 859999 855721 851007 846269
61218 846269 842217 839173 837117 836019 836004 837602 841823 849083 857804 864946 868733 870338 872246 875508 879395
61203 879395 883288 887693 893363 900450 908793 918190 927907 936592 943284 948259 952444 956294 959628 962232
61189 962232 964094 965256 965992 967104 969392 972621 975483 976859 976802 975969 974530 972218 969333 966954 965865
61174 965865 965659 965243 963976 962062 960107 958770 958796 960830 964872 970107 975465 980368 984879 989369 994225
61159 994225 999776 1006179 1013213 1020346 1027122 1033387 1038969 1043476 1046853 1050075 1054511 1060306 1066056 1070673
61145A070673M289N581P149P723P992R037J0089R676Q337Q119R479J0736J0967
61132A179847J1358J2780J3859J2874J0205P453N103K698O51J15J108K076J587
61119A261714l34k592m084m406m121m265n187o213o728p039p502p532o540n315
61105A189856n341o832q504r245r149q880q853r137r445r268q620q424r377j0520
61091A068261j0042p551m721l454m085n641p077p918q152q007p730p527p588p846
61077I70922p656o390m627l742l799k936j4L236M387L896M445O974R636J1046
61063I85378J2330J4901J7968J9763K0007J9908K0402K1607K3369K5287K6618
61052A207538K7088K7462K8509K9759L0119K9358K8190K6997K5431K3278K1048
$$ plain form
61145 1070673 1074962 1080543 1087692 1095415 1103407 1112444 1122533 1132209 1140546 1148665 1158144 1168880 1179847
61132 1179847 1191205 1203985 1217844 1230718 1240923 1248376 1253479 1256177 1256828 1256943 1258051 1260127 1261714
61119 1261714 1261380 1258788 1254704 1250298 1246177 1241912 1236725 1230512 1223784 1216745 1209243 1201711 1195171 1189856
61105 1189856 1184515 1177683 1169179 1159934 1150785 1141905 1133052 1123915 1114470 1105202 1096582 1088158 1078781 1068261
61091 1068261 1058219 1050668 1045947 1042493 1038408 1032767 1025690 1017772 1009620 1001613 993883 986356 978768 970922
61077 970922 963266 956876 952249 948507 944708 941772 941758 944994 949381 953277 957722 964696 974332 985378
61063 985378 997708 1012609 1030577 1050340 1070347 1090255 1110657 1132264 1155633 1180920 1207538
61052 1207538 1234626 1262088 1290597 1320356 1350475 1379833 1408023 1435020 1460451 1483729 1504777
61041A504777J9335J7895J5710J2006P197K597r75m030p428j0897j3273j4111
61029A528803j4188j4275j4387j4528j5131j6195j6787j6237j5234j4881j5042
61018A361918j4447j2420r791p997p591p725p007m857k059K11J709L115M863O743
61004A304665Q704J1222J4504J7927K0747K2931K4930K6985K9040L1072L3218
60993A545945L5778L9114M3138M6903M9384N0879N3044N7218O3116O9393P5031
60982B128943P9969Q4831R0219R6017J01544J06753J12838J20742J29460J37069
60972C188385J43333J49749J56918J63688J69598J76540J86795K00662K17133
60963D752801K35840K56859K79405L02316L25869L52300L84697M25901M78002
$$ plain form
61041 1504777 1524112 1542007 1557717 1569723 1576920 1579517 1578542 1574512 1567084 1556187 1542914 1528803
61029 1528803 1514615 1500340 1485953 1471425 1456294 1440099 1423312 1407075 1391841 1376960 1361918
61018 1361918 1347471 1335051 1325260 1317263 1309672 1301947 1294940 1290083 1288024 1288235 1289944 1293059 1297922 1304665
61004 1304665 1313369 1324591 1339095 1357022 1377769 1400700 1425630 1452615 1481655 1512727 1545945
60993 1545945 1581723 1620837 1663975 1710878 1760262 1811141 1864185 1921403 1984519 2053912 2128943
60982 2128943 2208912 2293743 2383962 2479979 2581523 2688276 2801114 2921856 3051316 3188385
60972 3188385 3331718 3481467 3638385 3802073 3971671 4148211 4335006 4535668 4752801
60963 4752801 4988641 5245500 5524905 5827221 6153090 6505390 6890087 7315988 7793990
60954G793990N42091O18619P07975Q10113R24042J049097J186748J339210J506600
60945A6478485J687470J878530K061601K182571K154086J904752J445108Q85289
60937C0677892L77157L0254j25989j19764m917J39973K04265P7461k82609q08312
60927C0165411j355888j788748k039822k114554k056730j917819j743144j565103
60919A5583603j398927j246258j105153r76268q61048p58813o68046n88642n21127
60910G459321m64931m18645l80918l50124l24098l01194k80944k63069k46440
60901D428958k29641k11867j93121j74244j57099j43702j34513j28114j22763
60892B933894j17570j12093j05969r9445r3321q7764q2002p5693o9698o4902o1048
$$ plain form
60954 7793990 8336081 8954700 9662675 10472788 11396830 12445927 13632675 14971885 16478485
60945 16478485 18165955 20044485 22106086 24288657 26442743 28347495 29792603 30677892
60937 30677892 31055049 31085303 30959314 30839550 30834633 30974606 31178871 31256332 30973723 30165411
60927 30165411 28809523 27020775 24980953 22866399 20809669 18891850 17148706 15583603
60919 15583603 14184676 12938418 11833265 10856997 9995949 9237136 8569090 7980448 7459321
60910 7459321 6994390 6575745 6194827 5844703 5520605 5219411 4938467 4675398 4428958
60901 4428958 4199317 3987450 3794329 3620085 3462986 3319284 3184771 3056657 2933894
60892 2933894 2816324 2704231 2598262 2498817 2405496 2317732 2235730 2160037 2090339 2025437 1964389
60881A964389n7407n3888n0872m8532m6902m6019m5453m4387m2706m1285m0545
60870A446393l9500l7133l4096l2076l1752l2223l2225l1215k9359k7056k4507
60859A095251k1545j8188j5369j4311j4779j4894j3474j1656j1075j1275j0367
60848I38318q004n904n273n183m220k450q79J22Q51J339J411J440K020K874K937
60833I19399J749J42q15j047j380k553m666p305r759j1256j1401j0421q985p876
60819H43826p844r241j1327j2398j1290q762o739o220o543o654o207n214l527
60806G41860j294O86J633J586J082N07K8l30q89j963k964k644q91N76J82j516
60790G35649k829l270l625m126l946k578n59J356K757L226K457R38m36j541k916
$$ plain form
60881 1964389 1906982 1853094 1802222 1753690 1706788 1660769 1615316 1570929 1528223 1486938 1446393
60870 1446393 1406893 1369760 1335664 1303588 1271836 1239613 1207388 1176173 1146814 1119758 1095251
60859 1095251 1073706 1055518 1040149 1025838 1011059 996165 982691 971035 959960 948685 938318
60848 938318 930314 924410 919137 913954 909734 907284 906405 906527 907378 908717 910128 911568 913588 916462 919399
60833 919399 921148 921290 920475 919428 918048 915495 910829 903524 893765 882509 871108 860687 851702 843826
60819 843826 835982 826741 815414 803016 791726 782964 776225 770005 763462 756808 750601 745387 741860
60806 741860 740566 741252 742885 744471 745553 746060 746088 745758 744869 742906 739942 737298 736407 736983 737165 735649
60790 735649 732820 729550 725925 721799 717853 715275 714716 716072 718829 722055 724512 725450 725014 723473 720557
60775G20557m299m491l070j355r22j849k979l356k855j876r88o53q88j215j172
60760F88589p14k08j18o60j491k047k381l145m321m763l838k727k934m066m564
60745F50612m148l888m067l932l638m327n771o021m349k702k934m236m770m405
60731E91424m176m154l669l038l238m121m379l304j542j68J93l67r59m93J010
60716E59019K320K847L601N366O961O802N324M224L844L069J568K97j72k28M2
60701F04884J038K333K749K243K173L074L543K221k25k028k372j683o51K08M37
60686F17944j8o84j087j148r00m95o62k292n032p194p704p368p410p600o911n455
60670E55984m441m335m270l516k529k192k639l270l396k637j122K84M65p86k311
$$ plain form
60775 720557 716258 711767 708697 707342 706420 704571 701592 698236 695381 693505 692517 691864 690976 689761 688589
60760 688589 687875 687667 687549 686889 685398 683351 680970 677825 673504 668741 664903 662176 659242 655176 650612
60745 650612 646464 642576 638509 634577 630939 626612 620841 614820 610471 607769 604835 600599 595829 591424
60731 591424 587248 583094 579425 576387 573149 569028 564649 561345 559803 559635 559828 559461 558502 558009 559019
60716 559019 561339 564186 567787 573153 580114 586916 592240 596464 600308 603377 604945 605242 605070 604842 604884
60701 604884 605922 608255 611004 613247 615420 618494 622037 624258 624033 622005 619633 617950 617299 617507 617944
60686 617944 617926 617242 616155 615007 614107 613612 612950 610658 605626 598432 590728 583360 575950 568350 561439 555984
60670 555984 551543 547208 542938 539422 536893 534701 532062 528792 525396 522759 521637 521921 522386 521600 519289
60655E19289k703j783n75J6J43N80J643K685K666J258n46j170j11J413J803R03
60639E25511m6k20j03l04l36O48K449M060N077N963O874P188O492N292M317L664
60623E76526L090K706K818L374L987M390M461L993K824J266K1m91o31j208k540
60608F04586l969m530m117l554l425l400l116k960l283l453k807k024k268l014
60594E58666k336K67K760L025J406NK69J999L965M792L813J728p1j174k412m076
60578E72626m981m118k250r82j001k031l666n175n293l421o05J555K449K197R17
60563E46221o39q69P21K161J438m04o19J189K614K124R38N78P43O05N99J372K179
60546E60951J790M98l1J178L268M445L657J557l8J24J519K697L014K904K659K023
$$ plain form
60655 519289 516586 514803 514228 514244 514387 514967 516610 519295 521961 523219 522673 521503 521392 522805 524608 525511
60639 525511 525465 525245 525142 524838 524502 525150 527599 531659 536736 542699 549573 556761 563253 568545 572862 576526
60623 576526 579616 582322 585140 588514 592501 596891 601352 605345 608169 609435 609456 608965 608334 607126 604586
60608 604586 600617 596087 591970 588416 584991 581591 578475 575515 572232 568779 565972 563948 561680 558666
60594 558666 556330 556597 559357 562382 563788 563793 564062 566061 570026 574818 578631 580359 580288 579114 576702 572626
60578 572626 567645 563527 561277 560295 559294 557263 553597 548422 543129 539708 539103 540658 543107 545304 546221
60563 546221 545582 544713 545434 547595 549033 548629 548010 549199 551813 553937 554875 555453 556196 556801 557400 558772 560951
60546 560951 562741 563239 563208 564386 567654 572099 575756 577313 577275 577399 578918 581615 584629 587533 590192 592215
60530E92215J075M60M25M71L40M68J105J881K573L477M515M917M445M072M781
60515F27220O196P219P571Q019R359J1665J4284J6187J6631J5732J4208J2429
60503G66720J0193P411M407J435j345l279l548k480j603j792k106j162J089L646
60489G77586N899P870R479J0538J1333J2443J4010J5689J7271J8816K0297K1546
60477I42777K2464K2839K1997J9122J4174Q264K983p33l088m834o268p048p004
60464A025645o580o143n463m453l810l963l891k287L25K069K408K751M022N267
60450A005897N677O466R378J4217J9276K3629K7649L1594L5069L7993M1072M4960
60438A302877M9365N3175N5170N4862N2884N0260M7067M2245L4960K5502J4499
$$ plain form
60530 592215 593290 593750 594175 594646 594986 595454 596559 598440 601013 604490 609005 613922 618367 622439 627220
60515 627220 633416 640635 648206 656225 665584 677249 691533 707720 724351 740083 754291 766720
60503 766720 776913 784324 788731 790166 788821 785542 781994 779514 777911 776119 774013 772851 773940 777586
60489 777586 783485 791355 800834 811372 822705 835148 849158 864847 882118 900934 921231 942777
60477 942777 965241 988080 1010077 1029199 1043373 1051637 1054620 1053887 1050799 1045965 1039697 1032649 1025645
60464 1025645 1019065 1012922 1007459 1003006 999196 995233 991342 989055 989380 991449 993857 996608 1000630 1005897
60450 1005897 1011574 1018040 1027418 1041635 1060911 1084540 1112189 1143783 1178852 1216845 1257917 1302877
60438 1302877 1352242 1405417 1460587 1515449 1568333 1618593 1665660 1707905 1742865 1768367 1782866
60427A782866K104j1295k4274l5300m4130n1400n7189o0862o2192o1735o0068
60416A316525n7397n3941n0082m5985m1639l7343l3814l1505k9982k8090k5033
60405H81714k1424j8922j8275j8083j6464j3627j1480j0628r538p412n921o693
60393G23247q535r086q199p577p589o754m536k549k262l105l728l962m559n721
60379F45085o742o776n483l270j184j74j77k59J57N95J89j217k824l536k975j811
60363F09598r02j52J114K483K365K45j985k249j006k13j00J046L751O004N840
60348F25839L916K489K659L571L855K997J552M98M13J120K117L079L639L311K354
60333F63409K140L451M880M367K313J349K667M340M220K945K697L970N177M983
$$ plain form
60427 1782866 1784970 1773675 1749401 1714101 1669971 1618571 1561382 1500520 1438328 1376593 1316525
60416 1316525 1259128 1205187 1155105 1109120 1067481 1030138 996324 964819 934837 906747 881714
60405 881714 860290 841368 823093 805010 788546 774919 763439 752811 743273 735861 729940 723247
60393 723247 714712 705626 697427 689850 682261 675507 670971 668422 666160 663055 659327 655365 650806 645085
60379 645085 638343 631567 626084 622814 621630 621456 621279 621020 621177 621772 621961 620744 617920 614384 611409 609598
60363 609598 608696 608544 609658 612141 614506 614751 612766 610517 609511 609298 609198 610244 613995 619999 625839
60348 625839 629755 632244 634903 638474 642329 645326 646878 647376 647789 648909 651026 654105 657744 661055 663409
60333 663409 665549 669000 673880 678247 680560 681909 684576 688916 693136 696081 698778 702748 707925 712908
60319G12908L693K401J824K140L150M340N194N613N787N737N164L876K268J319
60305G65414J815L397M725M998M858N231N910O265O712P980R224Q776P100O887
60291H49292R354J2197J2547J0428P807N632L619J907Q07n44l189o151p281o470
60277H89955o030p288q717q406o908o239p006p902p653o246m271k205n89j52j132
60262H09211k639l152j862N35K572L568M280N740P827R457J0192J0986J2948J5814
60248H85477J8163J9069J8963J8710J8285J6834J3897R973N774J318l725r096
60236A013642j3918j7529j9917k1265k1500k0510j8463j5820j3175j1037r539
60225H30969q475p867q164r294r954q737n923l188j491l11Q78J596J336M41o84
$$ plain form
60319 712908 716601 719002 720826 722966 726116 730456 735650 741263 747050 752787 757951 761827 764095 765414
60305 765414 767229 770626 775351 780349 785207 790438 796348 802613 809325 817305 826529 835305 842405 849292
60291 849292 858646 870843 883390 893818 901625 907257 910876 912783 913590 913046 909857 903706 896425 889955
60277 889955 883925 876637 867920 859514 852606 846367 839361 831459 823806 817560 813289 811084 810495 810343 809211
60262 809211 806572 803420 801558 802093 804665 808233 812513 818253 826080 835537 845729 856715 869663 885477
60248 885477 903640 922709 941672 960382 978667 995501 1009398 1019371 1025145 1026463 1022738 1013642
60236 1013642 999724 982195 962278 941013 919513 899003 880540 864720 851545 840508 830969
60225 830969 822494 814627 806463 797169 787215 778478 772555 769367 767876 767565 768443 770039 771375 771816 771132
60210G71132k229m030n054m757m121m236m649m288l302k693k706k939l478m429
60196G18221m777l405j162j60q69j588j090j12M49J145K696M408N062M597L847
60181G27262L157K293J364R23J219J878K183J590L09n24M4J356J665M70o37p7
60165G44475J714L136L416K884K031J373J688L279N226O345O629O867P272P460
60151H03795P524P952Q605Q880Q836R103R697J0050J0253J0877J1362J0143P158
60138I24235M806N161P213Q282P471O215N719N554N026M344L772K748R23p97j411
60123I89261j528k609m685o071n738m760m762n844o913p432p724p859p428o407
60109I09501n351m472l491k594k627l838n134n200l904k108o91j48n83j512k079
$$ plain form
60210 771132 768903 764873 759819 755062 750941 746705 742056 737768 734466 731773 729067 726128 722650 718221
60196 718221 713444 710039 708877 708717 707848 706260 705170 705058 705507 706652 709348 713756 718818 723415 727262
60181 727262 730419 732712 734076 734999 736218 738096 740279 741869 742178 741654 741698 743054 744719 745189 744552 744475
60165 744475 746189 749325 752741 755625 757656 759029 760717 763996 769222 775567 782196 789063 796335 803795
60151 803795 811319 819271 827876 836756 845592 854695 864392 874442 884695 895572 906934 917077 924235
60138 924235 929041 934202 941415 949697 957168 963383 969102 974656 979682 984026 987798 990546 991469 990672 989261
60123 989261 987733 985124 980439 974368 968630 963870 959108 953264 946351 938919 931195 923336 915908 909501
60109 909501 904150 899678 896187 893593 890966 887128 881994 876794 872890 870782 870091 869943 869360 867848 865769
60094H65769j961j592j177k39J249K161J682P27P45J622K157K242K912M191M625
60079H85113L588K593L313N312O690O410N100M021M060N297O900P578O784N265
60065I58024M128L716L762M140M733M921M059K471J351J461K316K795K385J626
60051A001888J395J825K146J750J030P81J019J137R51P78M37p75k760m388n048
60036A002166n439o160o498n602l970k760k238k046k310l277m268m304l581l125
60022I46588l147k969k445k204k421k645k892l660m636m779m036l667m358n284
60008H97445n686o109p152q077p822o728o123o565p327p377o311m652l663m285
59994H09568n823o357m983k843j316k27J091K030J547K53m7J140K471K954L164
$$ plain form
60094 865769 863808 862216 861039 860800 862049 864210 865892 866619 867364 868986 871143 873385 876297 880488 885113
60079 885113 888701 891294 894607 899919 906609 913019 918119 922140 926200 931497 938397 945975 952759 958024
60065 958024 962152 965868 969630 973770 978503 983424 987483 989954 991305 992766 995082 997877 1000262 1001888
60051 1001888 1003283 1005108 1007254 1009004 1010034 1010815 1011834 1012971 1013922 1014700 1015137 1014362 1011602 1007214 1002166
60036 1002166 996727 990567 984069 978467 974497 971737 969499 967453 965143 961866 957598 953294 949713 946588
60022 946588 943441 940472 938027 935823 933402 930757 927865 924205 919569 914790 910754 907087 902729 897445
60008 897445 891759 885650 878498 870421 862599 855871 849748 843183 835856 828479 822168 817516 813853 809568
59994 809568 803745 797388 792405 789562 788246 788019 789110 791140 792687 792940 792893 794033 796504 799458 802622
59979H02622L795M370M153L388K778K519K666L628N323O355N325K752N45o26k045
59964H47548m557o688o462m421l295m547o730p828p886q208q859q633p323o423
59950G55688p072q442q922q086o740n542m412l217k362k407l219l715k806p52
59936F87994R01J105N58M70P56O55O20J763L428L366J022j239j277J74J331K106
59920G03733L192L781K674R08Q08K445L300J790q45k615k996k376r63P76J741
59905G15353J377M74J04L65O93P18L73j89m18J82J095J032m59k333l283k898j322
59888G10864J166L736N034M422K656Q84m70j446k040k435k908l030j902K05J492
59873G16228Q61l84l19Q77J405P34M07J732L931N352N685O099P389Q696Q470O473
$$ plain form
59979 802622 806417 810787 814940 818328 821106 823625 826291 829919 835242 841597 846922 849674 850219 849593 847548
59964 847548 842991 836303 829841 825420 822125 817578 810848 803020 795134 786926 778067 769434 762111 755688
59950 755688 748616 740174 731252 723166 716426 710884 706472 703255 700893 698486 695267 691552 688746 687994
59936 687994 688895 690000 690558 691028 691784 692439 693059 694822 698250 701616 702638 701399 700122 700296 701627 703733
59920 703733 706925 710706 713380 714288 715096 717541 720841 722631 721786 719171 716175 713799 712836 713612 715353
59905 715353 716730 717204 717308 717673 718366 719084 719457 719268 718850 719032 720127 721159 720700 718367 715084 712186 710864
59888 710864 712030 715766 720800 725222 727878 728762 728292 726846 724806 722371 719463 716433 714531 714736 716228
59873 716228 717089 716705 716386 717263 718668 719402 719809 721541 725472 730824 736509 742608 749997 758693 767163 773636
59857G73636M350L810M594M906L878K798L418N522O867N582K227o03q08J163L068
59842H24408L681M040N299O378N291K437N71J145K541K673J741J169J321J739
59828H64434K572M121N680O367O618P336P971P189N322M481N773P750Q081O014
59814I49709K832N34J75Q93O59j454l956m679l384j630m70K58O09K30k58O85L254
59797I44007N556O127O020P065R003R915R011P355N819L828P96k384m272m661
59783A003185m455m025k896j343j116l612p874j1427j2921j2871j2024j0434q490
59770I09697p332p253o956n553m246m491n406m795k401k83K2r90k318l680m724
59755H49291m698l730l024k951k256k35J562J180j004k887l392l195k994k505
$$ plain form
59857 773636 777986 781796 786390 791296 795174 797972 801390 806912 813779 819361 821588 820985 820177 821340 824408
59842 824408 828089 832129 837428 843806 849097 851534 852105 853250 855791 858464 860205 861374 862695 864434
59828 864434 867006 871127 876807 883174 889792 897128 905099 912288 917610 922091 927864 935614 943695 949709
59814 949709 952541 953075 953250 954143 954802 953348 949392 944713 941329 939699 939229 939487 940096 940326 940068 940753 944007
59797 944007 949563 955690 961710 968775 977778 987693 996704 1004059 1009878 1013706 1014502 1012118 1007846 1003185
59783 1003185 998730 994705 991809 990466 989350 985738 977864 966437 953516 940645 928621 918187 909697
59770 909697 902365 895112 888156 882603 878357 873866 868460 863665 861264 860981 861003 860013 857695 854015 849291
59755 849291 844593 840863 837839 834888 832632 832397 833959 835139 834135 831248 827856 824661 821667 819162
59741H19162j457l82jm10j211k023k569k712k579k458k397k069j081N93K424L551
59725H04381L403K216P50n20j644k654l276l307k742j493L95J956J782p9j556
59710G97612r07R78J876J424J507L295N468O144N388M699M739M867M634M516M939
59695H51179N643O429P726R722J1605J2401J2243J1993J1903J1506J0703R931
59683I72984R178P983O731O673P880Q405O657L714J798J099p1k214l710l400k305
59668A021402j873j957j683j289j738l133m679n804o337n975m662l224k539k225
59654I74284j259J11K40j700m338n507m445k171j41Q57Q35L76L80J538L593N212
59638I67865M983K868N04k85P37K267L220L740M227M207K981R46p07j530k133
$$ plain form
59741 819162 817705 817323 817322 816912 815701 813678 811109 808397 805818 803360 800963 798894 797813 798406 800830 804381
59725 804381 807784 810000 810750 810230 808586 805932 802656 799349 796607 795114 795509 797465 799247 799168 797612
59710 797612 796705 797683 799559 800983 802490 805785 811253 817397 822785 827484 832223 837090 841724 846240 851179
59695 851179 856822 863251 870977 880699 892304 904705 916948 928941 940844 952350 963053 972984
59683 972984 982162 990145 996876 1003549 1011429 1019834 1026491 1030205 1032003 1033102 1033031 1030817 1027107 1023707 1021402
59668 1021402 1019529 1017572 1015889 1014600 1012862 1009729 1005050 999246 992909 986934 982272 979048 976509 974284
59654 974284 973025 973136 973376 971676 967338 961831 957386 955215 955074 955931 956766 957142 957522 959060 962653 967865
59638 967865 972848 975716 976220 975935 976672 978939 982159 985899 990126 994333 997314 998260 997553 996023 993890
59623I93890k917l425l285l053l406m030m004l166k418k612l580m447m653m478
59609I44416m674n675p066p841p373o086m995m514m107l185j915o76P66K746M521
59594H94342M688L082J303P46R00N10k90k16R69J949J692P08o5o62j678l021l912
59577I01045l851l163k540k447k828l286l605l976m505m800m617m546n211n959
59563H45711n426l620k229k470l718m808n513n977n797m777l767l599l827l532
59549G86651k740k041j485j013j192k153k537j085J177K164J781J739K398K100
59535G83764J34j773j935q18M48J894L537M007K228m88j935j923j895k218j874
59520G81153q24o34k265m676o307o583n457k911K08J963J306l54p16N53J555O90
$$ plain form
59623 993890 990973 987548 984263 981210 977804 973774 969770 966604 964186 961574 957994 953547 948894 944416
59609 944416 939742 934067 927001 919160 911787 905701 900706 896192 892085 888900 886985 886309 887075 889821 894342
59594 894342 899030 902112 903415 904161 905061 905571 905281 905065 906034 907983 909675 910383 910318 909656 907978 904957 901045
59577 901045 897194 894031 891491 889044 886216 882930 879325 875349 870844 866044 861427 856881 851670 845711
59563 845711 840285 836665 834436 831966 828248 823440 817927 811950 806153 801376 797609 794010 790183 786651
59549 786651 783911 781870 780385 779372 778180 776027 773490 772405 773582 775746 777527 779266 781664 783764
59535 783764 783898 782125 780190 779372 779820 781714 785251 789258 791486 790998 789063 787140 785245 783027 781153
59520 781153 780329 779695 777430 772754 766447 759864 754407 751496 751704 753667 754973 754619 753903 754456 756011 756701
59504G56701j464k939k487o60Q65J001M02P19K477M150L990K355J272J742K712
59489G70836K991L042L968N552O508O391O168O745P893Q930R870J1487J4454J8397
59475H83232K1435K0908J5516O995j013o105q590r768r921q762o884n360m175
59462H87508k310M37K748L327K363R78j80j193k110k570k353j852j822k654m032
59447H76285n326o219o738o835o350n593n373o011o620o059m509l445l837m904
59433G98466m976l348r46P88J440J912L174M925N860N268L907L009K903L102L285
59418H28769L593M127M837N816P048P948P819O832N899N460M985L834K131O04
59404H99702oO29K072L134K879J750J112J537K311K781L375M694O348P419P665
$$ plain form
59504 756701 755237 752298 749811 749151 750016 751017 751419 752138 754615 758765 762755 765110 766382 768124 770836
59489 770836 773827 776869 780837 786389 792897 799288 805456 812201 820094 829024 838894 850381 864835 883232
59475 883232 904667 925575 941091 948086 947073 940968 932378 922610 912689 903927 897043 891683 887508
59462 887508 885198 885635 888383 891710 894073 895051 894871 893678 891568 888998 886645 884793 882971 880317 876285
59447 876285 870959 864740 858002 851167 844817 839224 833851 827840 821220 815161 810652 807207 803370 798466
59433 798466 793490 790142 789196 789984 791424 793336 796510 801435 807295 812563 816470 819479 822382 825484 828769
59418 828769 832362 836489 841326 847142 854190 862138 869957 876789 882688 888148 893133 896967 899098 899702
59404 899702 899696 900325 902397 905531 908410 910160 911272 912809 915120 917901 921276 925970 932318 939737 947402
59389I47402P610P747Q198Q932R706R878Q767O284L031j01k320l340l732m557
59375A003505o247p991q513p384n280l215j761q61j33O00J106J258J653L193N926
59360I75856Q882J1288J3361J5653J8235K0973K4002K7369L0671L3385L4960L4099
59348A248734K8941J9039O783m062j1106j4055j3566j0558o252j493L935R920
59336A256260J3815J1382J021j3618k6216l2755l3616l1516k8421k4642k0141
59325A071553j5777j2698j0802q731n829l264k383k629k285q51P10J846K970L971
59311A015801L855K522J446J804L094M444N976P734Q562P537N826N476O803Q332
59297A089212Q956Q825Q315P523O830O669O745O636P068R179J2417J4690J5026
$$ plain form
59389 947402 955012 962759 970957 979889 989595 999473 1008240 1014524 1017555 1017454 1015134 1011794 1008062 1003505
59375 1003505 997258 989267 980754 973370 968090 964875 963114 962253 962120 962720 963826 965084 966737 969930 975856
59360 975856 984738 996026 1009387 1025040 1043275 1064248 1088250 1115619 1146290 1179675 1214635 1248734
59348 1248734 1277675 1296714 1303497 1299435 1288329 1274274 1260708 1250150 1243898 1242405 1246340 1256260
59336 1256260 1270075 1281457 1282478 1268860 1242644 1209889 1176273 1144757 1116336 1091694 1071553
59325 1071553 1055776 1043078 1032276 1023545 1017716 1014452 1012069 1009440 1007155 1006304 1007014 1008860 1011830 1015801
59311 1015801 1019656 1022178 1023624 1025428 1028522 1032966 1038942 1046676 1055238 1062775 1068601 1074077 1080880 1089212
59297 1089212 1098168 1106993 1115308 1122831 1129661 1136330 1143075 1149711 1156779 1165958 1178375 1193065 1208091
59284A208091J4641J4719J4551J2968J0469Q645Q113Q191Q205Q008P294N458K324
59271A331677j448m806o944p633p432p287p663q218q575q954r652j0344j0540
59258A232181j0340j0033r257p429m930l036k421k404j922p44O04J701K612L608
59244A188190M677N276M467J472l710j0095j5979j9594k0054j8156j5919j4811
59232A085764j4481j3594j1764j0064r602j0174j0616j0156r031p933p010n693
59220I65646l517r69R35J966L042N004P560R808J1237J1628J0743R074Q335R841
59206A050333J2507J3758J2648J0815R927R547Q267N894L386J328m29j973l257
59193A132751m645o650q947j0383j0137q508o438m647l273k126j102m03k56m42
$$ plain form
59284 1208091 1222732 1237451 1252002 1264970 1275439 1284084 1292197 1300388 1308593 1316601 1323895 1329353 1331677
59271 1331677 1330229 1325423 1318479 1310846 1303414 1296127 1288464 1280246 1271671 1262717 1253065 1242721 1232181
59258 1232181 1221841 1211808 1202551 1195122 1190192 1187156 1184735 1182331 1180409 1179665 1180269 1181970 1184582 1188190
59244 1188190 1192867 1198143 1202610 1204082 1200372 1190277 1174298 1154704 1134650 1116494 1100575 1085764
59232 1085764 1071283 1057689 1045925 1035861 1026259 1016085 1005469 995313 986282 978349 971339 965646
59220 965646 962129 961160 962095 964061 967103 972107 979667 989475 1000712 1012340 1023083 1032157 1040492 1050333
59206 1050333 1062840 1076598 1089246 1100061 1109988 1119535 1127802 1133696 1137082 1138410 1137981 1136008 1132751
59193 1132751 1128106 1121456 1112509 1102126 1091989 1083481 1077043 1072396 1069123 1066997 1065895 1065492 1065236 1064794
59179A064794l21N28J915L243L828L179J548L06R46L235N022M538K444R53J211
59164A097369K236K287O21k040m284n126m661l816l488m064n560p542q851q203
59150A044878n662k930j642j790k306k558k647k732k891l251l619l371k376j480
59136A005623j295j165l32N27J82j043j439k41J478K392K258J505O40L15J012
59121A010417K287L151L456M070N439O804P194O429N029L912M146N979P983Q261
59107A084557O819N568N711O431O636O557O792O938O286N000L615K081J58j826
59093A151323l467m961o583q124r404j0557j1261j0763r365q743r743j0999j0907
59080A036446r889r200q667p368n766n145n403n269m489l864l312k001m68l29
$$ plain form
59179 1064794 1064473 1065001 1066916 1070159 1073987 1077166 1078714 1079020 1079966 1083201 1088223 1092761 1095205 1096158 1097369
59164 1097369 1099605 1101892 1102513 1100473 1096189 1091063 1086402 1082586 1079098 1075034 1069474 1061932 1053081 1044878
59150 1044878 1039216 1036286 1034644 1032854 1030548 1027990 1025343 1022611 1019720 1016469 1012850 1009479 1007103 1005623
59136 1005623 1004328 1003163 1002831 1003358 1003540 1002497 1001058 1000817 1002295 1004687 1006945 1008450 1009090 1009405 1010417
59121 1010417 1012704 1015855 1019311 1023381 1028820 1035624 1042818 1049247 1054276 1058188 1062334 1068313 1076296 1084557
59107 1084557 1091376 1096944 1102655 1109086 1115722 1122279 1129071 1136009 1142295 1147295 1150910 1152991 1153149 1151323
59093 1151323 1147856 1142895 1136312 1128188 1118784 1108227 1096966 1086203 1076838 1068095 1058352 1047353 1036446
59080 1036446 1026557 1017357 1008690 1001322 995556 990411 985008 979739 975250 971386 968074 966073 965605 965276
59066I65276j505j846k89J604K229K175K754L982N365P189R474J0909J0562R608
59052A027487R683J0391J0224R271Q937R324Q976P354N611M505L410K036J410
59039A118619K087K809K177P04j56k79p95k045l010k794j702o03r3m88j871l774
59023A108786n283n880n808n529n251n265o122p972r915j0647r781q263p412p720
59009A007938q591r058q648p732p003o661o203n097l551k389k187k694l107k803
58995I32214j821p75l52o82j163r79J13J457K011J330Q7m35L44J556J752O06o39
58978I34624o12O56J984K514K388K120J968K061K702M138O131P959Q873Q729Q264
58963I94499Q528R893J1709J3140J3999J4445J4281J3260J1860J0971J0702J0247
$$ plain form
59066 965276 963771 961925 961636 963240 965469 967644 970398 974380 979745 986934 996408 1007317 1017879 1027487
59052 1027487 1037170 1047561 1057785 1067056 1075993 1085317 1094293 1101647 1107258 1111763 1115173 1117209 1118619
59039 1118619 1120706 1123515 1125692 1126396 1126240 1125961 1125166 1123121 1120111 1117317 1115615 1115012 1114919 1114431 1112560 1108786
59023 1108786 1103503 1097623 1091815 1086286 1081035 1075770 1069648 1061676 1051761 1041114 1031333 1023070 1015658 1007938
59009 1007938 999347 990289 981641 973909 966906 960245 954042 948945 945394 943005 940818 938124 935017 932214
58995 932214 930393 929618 929266 928584 927421 926442 926555 928012 930023 931353 931440 931005 931349 932905 934657 935263 934624
58978 934624 934012 934668 936652 939166 941554 943674 945642 947703 950405 954543 960674 968633 977506 986235 994499
58963 994499 1003027 1012920 1024629 1037769 1051768 1066213 1080494 1093754 1105614 1116585 1127287 1137534
58951A137534R028P358N766M313K910J683O82k57r75r37j42N37N31O49K125M860
58935A175665P324Q236P670O462N181M007L097K563K157J389J15j157j723j325
58921A219661j66J620L984O438Q114Q849R614J1231J3139J4197J4305J4221J4131
58908A339338J3654J3173J3669J4921J5263J3725J1265R313Q311Q287R416J0924
58896A481259J0789P938L813M24k158m928p495q503q034p755q588r894j0929j1561
58882A424378j1331r538o728m725m519n259n826o304p232q417r173r115q259o880
58868A321072n628n039m727l884k756k662m095n826o355n425l653j579K27J072
58854A270742Q97N78P68J097J203J754L504N836P299P465P512Q866J1705J4779
$$ plain form
58951 1137534 1146562 1153920 1159686 1163999 1166909 1168592 1169274 1169017 1168042 1167105 1166963 1167500 1168031 1168680 1170805 1175665
58935 1175665 1182989 1191225 1198895 1205357 1210538 1214545 1217642 1220205 1222362 1223751 1223866 1222709 1220986 1219661
58921 1219661 1219495 1221115 1225099 1231537 1239651 1248500 1258114 1269345 1282484 1296681 1310986 1325207 1339338
58908 1339338 1352992 1366165 1379834 1394755 1410018 1423743 1435008 1444321 1452632 1460919 1470335 1481259
58896 1481259 1492048 1499986 1503799 1504223 1502065 1497137 1489642 1481139 1473105 1465350 1456762 1446868 1435939 1424378
58882 1424378 1413047 1403509 1396781 1392056 1387537 1382278 1376452 1370148 1362916 1354499 1345326 1336211 1327952 1321072
58868 1321072 1315444 1310405 1305678 1301794 1299038 1296376 1292281 1286455 1280100 1274675 1271022 1269443 1269670 1270742
58854 1270742 1271639 1272217 1272985 1274082 1275285 1277039 1280543 1286379 1293678 1301143 1308655 1317521 1329226 1344005
58840A344005J6443J6121J4895J4363J4753J4729J3255J0923R061Q274Q332Q788
58828A493942Q971Q204O876O715Q906J2055J3173J0805O508L043J617J094l93
58815A581516l273o017o998o669p220r825j3063j4699j4395j3728j3926j4554
58803A457149j4448j3206j1519j0419j0298j0480r981q874q475r729j1931j3656
58791A324133j4493j5003j5302j4808j3493j2393j2300j2561j1844r887q044p811
58779A176194r065j0127r804q963r388j1161j2263j1152q700o802n858m873l501
58766A064537k579k588k826k546j917j438j070l98P38K179L548M219L527J433
58752A064819j176k970k980j200J180K361J386q71k608l010k882l466n141p256
$$ plain form
58840 1344005 1360448 1376569 1391464 1405827 1420580 1435309 1448564 1459487 1468548 1476822 1485154 1493942
58828 1493942 1502913 1511117 1517993 1524708 1533614 1545669 1558842 1569647 1576155 1579198 1580815 1581909 1581516
58815 1581516 1578243 1572226 1565228 1558559 1551339 1541514 1528451 1513752 1499357 1485629 1471703 1457149
58803 1457149 1442701 1429495 1417976 1407557 1397259 1386779 1376798 1367924 1359449 1349720 1337789 1324133
58791 1324133 1309640 1294637 1279335 1264527 1251034 1238641 1226341 1213780 1201936 1192049 1184005 1176194
58779 1176194 1167129 1157002 1147198 1138235 1128847 1117686 1105423 1094271 1085571 1078769 1072911 1068038 1064537
58766 1064537 1061958 1059370 1056544 1053998 1052081 1050643 1049573 1049175 1049913 1052092 1055640 1059859 1063386 1064819
58752 1064819 1063643 1060673 1057693 1056493 1057673 1060034 1061420 1060549 1057941 1054931 1052049 1048583 1043442 1036186
58738A036186q638q261o205m097l938n977q308q838p305n068l496k933k890k725
58724I57507k278j967k114k150j081J166L453M775N204N136M378K767J004j81
58710I75619j179k779m537n262n056n362o470o590m557k174k093m045n114l777
58696I16624j759j192j747j831j240r27q58K7J782L123L484L952N418O975P056
58681I38887N473L496K416K706M147N971P148P172O462N710N185M934N150N713
58667A010570N911N297M553M776O057P316P319N563K546j87p98J137L875N243
58653A069178M964M531N056O090O512N624L408O13j270j159J12J48k721p898j3236
58638A079952j6686j7347j5838j3975j3364j3988j4687j4876j4906j4639j3092
$$ plain form
58738 1036186 1027548 1019287 1013082 1008985 1005047 999070 990762 981924 974619 969551 966055 963122 960232 957507
58724 957507 955229 953262 951148 948998 947917 949083 952536 957311 962515 967651 972029 974796 975800 975619
58710 975619 974440 971661 967124 961862 956806 951444 944974 938384 933827 931653 929560 925515 920401 916624
58696 916624 914865 913673 911926 910095 908855 907928 907070 907097 908879 912002 915486 919438 924856 931831 938887
58681 938887 944360 947856 950272 952978 957125 963096 970244 977416 983878 989588 994773 999707 1004857 1010570
58667 1010570 1016481 1021778 1026331 1031107 1037164 1044480 1051799 1057362 1059908 1059721 1058923 1060060 1063935 1069178
58653 1069178 1074142 1078673 1083729 1089819 1096331 1101955 1105363 1105976 1104706 1103547 1103659 1103807 1101086 1093188 1079952
58638 1079952 1063266 1045919 1030081 1016106 1002742 988754 974067 959191 944285 929646 916554
58627I16554j0143p440o597p239p771p515p042o799o526o009n520n280m989m150
58613H23534k643r83l6j18l89K99J784K696K622L087N335Q092Q943P495N618M634
58597H69970L799J920r41l884o121o984o186m718m332n226n484l908k107k226
58583H23572l618l914k859k553l681m162k692j220j917l461k836K5K129J853Q81
58568G95547J084J791J498M81J10O56J368K013K760L069K284J144J253K907M735
58553H22700N700O128O550O761O614O602O910O842O004N228N300N476M468K589
58539I03872J631K456L814L959K710J304P58J039J592K024K184K138K310L269
58525I35060N039O833P915Q566R628J1052J1665J0806R571R568J0766J1536J0897
$$ plain form
58627 916554 906411 898971 892374 885135 877364 869849 862807 856008 849482 843473 837953 832673 827684 823534
58613 823534 820891 819908 819872 819754 819365 819664 821448 824144 826766 829853 835188 843280 852223 859718 865336 869970
58597 869970 873769 875689 874748 870864 864743 857759 851573 846855 842523 837297 831813 827905 825798 823572
58583 823572 819954 816040 813181 810628 806947 802785 800093 798873 796956 793495 790659 790684 792813 794666 795547
58568 795547 796631 798422 799920 800401 800511 801167 802535 804548 807308 810377 812661 813805 815058 817965 822700
58553 822700 828400 834528 841078 847839 854453 861055 867965 874807 880811 886039 891339 896815 901283 903872
58539 903872 905503 907959 911773 915732 918442 919746 920504 921543 923135 925159 927343 929481 931791 935060
58525 935060 940099 946932 954847 963413 973041 984093 995758 1006564 1016135 1025703 1036469 1048005 1058902
58512A058902R785R766J1201J3199J4869J5939J6553J7007J7695J8834K0338K2118
58500A246206K4269K6558K8104K8205K7360K6720K6355K4796K0768J4925R288
58489A503554N065J628k170o202r001r525q486p763q580j0545j2389j3350j3734
58476A408502j4424j6114j8850k1944k4292k5026k4078k2102j9822j7650j5797
58465A188403j4450j3568j2722j1503j0005q630p477o299n146m537m811n644o468
58452A077143o999p026o193m558l034k447k285j272P23K244K078P05n74j262j621
58437A045622j530m17J643L569M305L916L345L372L890M294M382M729N888P448
58423A094456Q381Q446Q642R984J2207J4183J5284J5837J6343J6789J6805J6231
$$ plain form
58512 1058902 1068687 1078453 1089654 1102853 1117722 1133661 1150214 1167221 1184916 1203750 1224088 1246206
58500 1246206 1270475 1297033 1325137 1353342 1380702 1407422 1433777 1458573 1479341 1494266 1503554
58489 1503554 1508619 1510247 1508077 1501875 1492874 1483349 1474863 1467100 1458520 1447975 1435586 1422236 1408502
58476 1408502 1394078 1377964 1359114 1337170 1312878 1287852 1263774 1241672 1221850 1204200 1188403
58465 1188403 1173953 1160385 1147663 1136160 1126155 1117525 1110048 1103749 1098603 1094066 1089255 1083611 1077143
58452 1077143 1070144 1063118 1056925 1052367 1049333 1046886 1044601 1043329 1044052 1046296 1048374 1049079 1048505 1047243 1045622
58437 1045622 1044092 1043675 1045318 1048887 1053192 1057108 1060453 1063825 1067715 1072009 1076391 1081120 1087008 1094456
58423 1094456 1102837 1111283 1119925 1129909 1142116 1156299 1171583 1187420 1203763 1220552 1237357 1253588
58411A253588J5256J3964J1942Q747M839J433r36k982n074n994m667k412j526
58398A286178j777o76K356M745M777M405O021Q611R572Q760P955P398N749K956
58384A357030K40k504o271r898j0588q208o085o447p776p949p208o198l670J165
58370A275633N801O885M715K767L134M739N915O509O951O998O352N518N319N926
58356A353162O613O258M177Q89k272m485o041p193p289n882m030l291l734l928
58342A322954k912j228R0O93R26J177J541J907K308L221N098P348Q368P247N096
58327A363834M037N027P202R253J0651J1411J1397J0503R370R266J0703J2304
58315A474958J1937R337O773O371P444P788O999O898Q625J1140J3057J4335J5378
$$ plain form
58411 1253588 1268844 1282808 1294750 1303497 1308336 1309769 1308833 1305851 1300777 1294783 1290116 1287704 1286178
58398 1286178 1284401 1283725 1286081 1290826 1295603 1300008 1306029 1314640 1324212 1332972 1340927 1348325 1354074 1357030
58384 1357030 1357270 1354766 1348495 1338597 1328009 1319801 1313716 1307269 1299493 1291544 1284336 1278138 1274468 1275633
58370 1275633 1281434 1288319 1293034 1295801 1298935 1303674 1309589 1316098 1323049 1330047 1336399 1341917 1347236 1353162
58356 1353162 1359775 1366033 1370210 1371099 1368827 1364342 1358301 1351108 1343819 1337937 1333907 1330616 1326882 1322954
58342 1322954 1320042 1318814 1318904 1319597 1320523 1321700 1323241 1325148 1327456 1330677 1335775 1343123 1351491 1358738 1363834
58327 1363834 1367871 1372898 1380100 1389353 1400004 1411415 1422812 1433315 1442685 1451951 1462654 1474958
58315 1474958 1486895 1496232 1503005 1509376 1516820 1524608 1531607 1538505 1547130 1558270 1571327 1585662 1601040
58302A601040J5905J5799J5840J6512J7039J6673J5989J5893J6132J5940J5338
58291A778100J4766J4082J3000J1898J1266J0943J0817J1396J2727J3735J3836
58280A916566J4357J6832K0542K3301K4273K4491K4926K5540K6204K7135K8208
58269B172375K8943K9308K9704L0106L0062K9367K8181K6672K5243K4636K5048
58258B479645K5570K5328K4697K4609K5244K6249K7553K9024L0037L0496L1447
58247B779899L3523L5662L6739L7560L9493M1894M2954M2737M3198M5174M7381
58236C226214M8721M9734N1105N2340N2847N3224N4639N7411O0674O3127O4224
58225C834260O4980O7294P1784P6804Q0347Q2367Q4353Q7194R0600R4093R7456
$$ plain form
58302 1601040 1616945 1632744 1648584 1665096 1682135 1698808 1714797 1730690 1746822 1762762 1778100
58291 1778100 1792866 1806948 1819948 1831846 1843112 1854055 1864872 1876268 1888995 1902730 1916566
58280 1916566 1930923 1947755 1968297 1991598 2015871 2040362 2065288 2090828 2117032 2144167 2172375
58269 2172375 2201318 2230626 2260330 2290436 2320498 2349865 2378046 2404718 2429961 2454597 2479645
58258 2479645 2505215 2530543 2555240 2579849 2605093 2631342 2658895 2687919 2717956 2748452 2779899
58247 2779899 2813422 2849084 2885823 2923383 2962876 3004770 3047724 3090461 3133659 3178833 3226214
58236 3226214 3274935 3324669 3375774 3428114 3480961 3534185 3588824 3646235 3706909 3770036 3834260
58225 3834260 3899240 3966534 4038318 4115122 4195469 4277836 4362189 4449383 4539983 4634076 4731532
58214D731532J00629J04002J08214J12838J16323J18403J21320J27169J35145
58205E775575J43090J50563J58352J66139J73020J79729J87897J97587K07737
58196G339689K18516K30769K43639K55332K66205K78599K93574L09972L26787
58187I763082L44244L62581L81727M02124M24008M46269M67835M89473N12200
58178A3593543N35168N57640N81707O09976O41800O75293P11864P54717Q03799
58169A9465507Q56610R13416R76901J046575J118460J190772J265234J342364
58161B8175839J420438J500084J585158J677848J777343J884140K001125K129915
58153D2151890K271363K430454K615011K828246L068096L334852L633590L968466
$$ plain form
58214 4731532 4832161 4936163 5044377 5157215 5273538 5391941 5513261 5640430 5775575
58205 5775575 5918665 6069228 6227580 6393719 6566739 6746468 6934365 7131952 7339689
58196 7339689 7558205 7788974 8032613 8287945 8554150 8832749 9126323 9436295 9763082
58187 9763082 10107326 10469907 10851634 11253758 11677766 12124035 12591870 13081343 13593543
58178 13593543 14128711 14686351 15268058 15878034 16519834 17195127 17906991 18661708 19465507
58169 19465507 20322117 21235533 22212434 23259009 24377469 25568241 26833475 28175839
58161 28175839 29596277 31096361 32681519 34359367 36136710 38020850 40021975 42151890
58153 42151890 44423253 46853707 49468718 52296964 55365060 58699912 62333502 66301968
58145F6301968M341914M761478N240997N793923O432913P176961Q049921R069743
58137A17169818J0246765J1591356J3110188J4793300J6618666J8572772K0656084
58130B22758949K2872140K5213839K7587718K9600436L0338103K8495174K3032195
58123D09898554J3982719K717939q624780j8117341k4716873k8329435k9470378
58116C17340405k8874993k7236860k5082946k2752271k0438264j8243069j6212895
58109A58499107j4361766j2693856j1214473r924996q817246p877247p088486
58102H6521037o428501n868814n383409m954624m569465m215456l883065l568131
58094D7649572l269011k984435k715889k468327k245807k048668j876260j728999
$$ plain form
58145 66301968 70643882 75405360 80646357 86440280 92873193 100050154 108100075 117169818
58137 117169818 127416583 139007939 152118127 166911427 183530093 202102865 222758949
58130 222758949 245631089 270844928 298432646 328033082 358371185 386866359 409898554
58123 409898554 423881273 426599212 417974432 399857091 375140218 346810783 317340405
58116 317340405 288465412 261228552 236145606 213393335 192955071 174712002 158499107
58109 158499107 144137341 131443485 120229012 110304016 101486770 93609523 86521037
58102 86521037 80092536 74223722 68840313 63885689 59316224 55100768 51217703 47649572
58094 47649572 44380561 41396126 38680237 36211910 33966103 31917435 30041175 28312176
58086B8312176j605641j501064j408855j324594j245591j169618j095424j023239
58078A7938150r53958q88843q29665p77262p30177o86633o47156o12853n81804
58069A1229799n50308n17583m86190m57780m31618m07405l86108l67155l47964
58060G277688l27390l07081k88703k72268k57768k45651k34911k23587k11836
58051D908493k01802j93623j84727j74235j64859j58709j53980j47820j40067
58042C388671j32159j24374j16267j08325j01290r5048q9399q4557p9852p3786
58032B383614o6617o1038n8721n7894n5872n2482m9343m7145m5340m3456m1267
58021A804439l8532l5685l3747l2778l1701l0397l0197l1305l1744l0246k8356
$$ plain form
58086 28312176 26706535 25205471 23796616 22472022 21226431 20056813 18961389 17938150
58078 17938150 16984192 16095349 15265684 14488422 13758245 13071612 12424456 11811603 11229799
58069 11229799 10679491 10161908 9675718 9217938 8786320 8378915 7992807 7625652 7277688
58060 7277688 6950298 6643217 6354514 6082246 5824478 5578827 5343916 5120329 4908493
58051 4908493 4706691 4513068 4328341 4154106 3989247 3830538 3676558 3528738 3388671
58042 3388671 3256512 3132138 3015871 2907546 2806256 2711208 2621809 2537252 2457400 2383614
58032 2383614 2316997 2255959 2197238 2139344 2083472 2030990 1981647 1934502 1889162 1845706 1804439
58021 1804439 1765907 1730222 1696475 1663697 1631996 1601599 1571402 1540097 1508353 1478107 1449751
58010A449751k7926k8339k8072k7348k7154k6956k5593k3498k1879k0635j8997
57999A173354j7506j7242j7726j7571j6717j6131j5792j4888j3664j3169j3359
57988I99589j3288j2943j3095j3433j2780j1369j0965j2150j3137j2137r773q266
57976H56253q792j0292j0666r000o630n780p048q958j0116j0725j1264j1113r865
57963G36004q832r484j1138j1958j1685j1382j0994r298o474m539m743o096p079
57950F22302p219o534m979l184k446l172m342n039n365n384m490k708j441j759
57936E64240k778k800j606o69j321l317n133n292l694j885j602k951m430m733
57922E22029l906k764k093k529m151n859o135m939l832l744l760k839j555j030
$$ plain form
58010 1449751 1421825 1393486 1365414 1338066 1310912 1283956 1258363 1234865 1212986 1192351 1173354
57999 1173354 1155848 1138606 1120880 1103309 1086592 1070461 1054669 1039781 1026117 1012948 999589
57988 999589 986301 973358 960263 946830 934050 922681 911716 899566 886429 874292 864519 856253
57976 856253 847461 837169 826503 817503 810873 805093 798045 789087 778971 768246 756982 745869 736004
57963 736004 727172 717688 706550 694592 682907 671525 660531 651233 644759 640220 635477 629381 622302
57950 622302 615083 608549 603570 600386 597940 594768 590426 585387 580022 574638 570148 567440 565999 564240
57936 564240 561462 558662 557056 556387 555066 551749 546616 541324 537630 535745 534143 531192 526762 522029
57922 522029 518123 515359 513266 510737 506586 500727 494592 489653 485821 482077 478317 475478 473923 472893
57908D72893j117r41o20j022k018k373j437O0J063J256Q98L38j30m90j081j975
57892D63304k442j741l92J73o46j983k793k966k787k114q18N39J285J710K704
57877D51033M310N423N250M460M352N197O038N986N075L719K088L37j078k086
57863E00104l453n786q236r199q360p071o395n851m734l695l804m566m241k258
57849D22455j77K07r92k035j607o7J198J266M93m2K50J014J645J934J828J168
57833D28538L22M44K074L842L745J770o1n77q36k006l306l308k260j547j541j647
57817D23646k035l474n280n235k403J303L228K676P64j365l126l994l758l000
57803C97947k419j850p24O36J164N98K3O83K713N200P002P363O260M470L006K217
$$ plain form
57908 472893 471776 470835 470215 469193 467175 464802 463365 463425 464488 465744 466642 466980 466850 466360 465279 463304
57892 463304 460862 459121 458729 458902 458256 456273 453480 450514 447727 445613 444795 445334 446619 448329 451033
57877 451033 455343 460766 466016 470476 474828 480025 486063 492049 497124 500843 502931 503268 502190 500104
57863 500104 496651 490865 482629 473430 465070 457999 451604 445753 441019 437324 433520 428954 424713 422455
57849 422455 422278 422485 421493 419458 417851 417784 418982 420248 420741 420699 420949 421963 423608 425542 427370 428538
57833 428538 428860 429304 431378 435220 438965 440735 440674 440097 439261 437255 433949 430641 428381 426834 425293 423646
57817 423646 421611 418137 412857 407622 405219 406522 409750 412426 413190 411825 408699 404705 400947 397947
57803 397947 395528 393678 392954 393590 394754 395352 395375 396058 398771 403971 410973 418336 424596 429066 432072 434289
57787D34289J641Q97L21M27Q76N45j166l311m223l427k305k477l887n141n397
57772D07662n060m613l833k614j659j622k097k126j235L92K257L507L293J823
57758C94075M46N5k0p41j938l055m416o390p965p824o495n815o346o862o452n467
57742C24790m218k489p51k15r95j671j425j226j956k718k100j52J950L348L779
57727C13951L211K129J427J342J218R04J292K751M326N342O492Q108Q748P169
57713C68410M638L443L816M152L702L111K533J144j179l334m363m152k798o73
57699C78450R94J082K77K84J281J769J189Q37J516K124J648J013J553K776L118
57684C99911K280J396J241J461J448J020K14p56j267o74P82J898J586k0j587j767
$$ plain form
57787 434289 435930 436827 437148 437575 438451 438996 437830 434519 430296 426869 424564 422087 418200 413059 407662
57772 407662 402602 397989 394156 391542 389883 388261 386164 384038 382803 383195 385452 388959 392252 394075
57758 394075 394521 394576 394556 393815 391877 388822 384406 378016 370051 362227 355732 349917 343571 336709 330257 324790
57742 324790 320572 318083 317332 317117 316122 314451 313026 311800 309844 307126 305026 304874 306824 310172 313951
57727 313951 317162 319291 320718 322060 323278 324182 325474 328225 332551 337893 344385 352493 361241 368410
57713 368410 373048 376491 380307 384459 388161 391272 393805 394949 393770 390436 386073 381921 379123 378450
57699 378450 379444 380526 380803 381087 382368 384137 385326 386163 387679 389803 391451 392464 394017 396793 399911
57684 399911 402191 403587 404828 406289 407737 408757 408971 408215 406948 406274 407056 408954 410540 410520 408933 407166
57668D07166m53J154J900J921K150K695K527J022q08j304j46J269J499O88J65
57653D21445O11J166O85n78j355j249j232j961k755k841k544k359j866q24l20
57638D04023j192k099j176P92J079r75k943l022k520l421n265o055n052l076q17
57623C68281J631M050O058P557Q379Q057O812O195P711J1201J5349J9221K2410
57610D92912K4500K5750K7716L1595L5842L6752L1833K1813R286l496j5194k4854
57598F94455l1743l5388l5512l2300k7066k2149j9400j8665j8115j6288j3644
57587D24185j1805j1401j1270j0017p716n366l268j097P18J172M52O3N71O84m97
57572C65408j692j365l06m98j974k737j790m87l32r62j208j022j218j783j589
$$ plain form
57668 407166 406713 407867 409767 411688 413838 416533 419060 420082 419274 417970 417824 419093 420592 421280 421445
57653 421445 422056 423222 423907 423329 421974 420725 419493 417532 414777 411936 409392 407033 405167 404343 404023
57638 404023 402831 400732 399556 400348 401427 400452 397509 394487 391967 388546 383281 377226 372174 369098 368281
57623 368281 369912 373962 380020 387577 395956 404013 410825 417020 424731 435932 451281 470502 492912
57610 492912 517412 543162 570878 602473 638315 675067 706900 728713 737999 734503 719309 694455
57598 694455 662712 627324 591812 559512 532446 510297 490897 472232 454117 437829 424185
57587 424185 412380 400979 389709 379692 371976 366610 363342 362245 362963 364135 364587 364650 365221 365905 365408
57572 365408 363716 362351 362045 361547 359573 356836 355046 354559 354227 353265 352057 351035 349817 348034 346445
57557C46445k4J822K198Q38m67J04K134L378K438K57j305j516r79n63p40j417
57541C52603j879j439o02q00k324l468k783j237q63j794k236j216J06K17q47j755
57525C29683j411O3J519J958J742K214L749M965M538K936J383J12j039j327k31
57510C50854R33N73m44J0J670K055O35j02J311K911K574J292J098J646J277K63
57494C68556M13K067L662M143L853L224K386K054L025M548M817L501K306K529
57480D11084L375L383K482J843K414M199O366P664P336O011N083M908M437L058
57466D73643J863K204L818N332O112O474O376N320L706K953L594M258L391J362
57452E30406j41l59p2j53n43p77n20N44K358L800L472J756Q76K105L965M302L166
$$ plain form
57557 346445 346421 348243 350441 351279 350812 350916 353050 356428 358866 359123 357818 356302 355323 354760 354020 352603
57541 352603 350724 349285 348683 347883 345559 342091 339308 338071 337208 335414 333178 331962 332068 332285 331438 329683
57525 329683 328272 328335 329854 331812 333554 335768 339517 344482 349020 351956 353339 353451 352412 351085 350854
57510 350854 351787 352360 351916 351926 353596 355651 356286 356184 357495 360406 362980 364272 365370 367016 368293 368556
57494 368556 368969 371036 374698 378841 382694 385918 388304 390358 393383 397931 402748 406249 408555 411084
57480 411084 414459 417842 420324 422167 424581 428780 435146 442810 450146 456157 461240 466148 470585 473643
57466 473643 475506 477710 481528 486860 492972 499446 505822 511142 514848 517801 521395 525653 529044 530406
57452 530406 530265 529906 529834 529681 529138 528361 527841 528385 530743 534543 538015 539771 540647 542752 546717 551019 554185
57435E54185K139J669Q83k63o07J99J065J370J943L405M931N515N453N538N766
57420E93191N644N250N145N649O667P588P234N000K386J973M168O298N972L935
57406F66100K486K429L235M772O872Q086P208N566N562P084P658O306M908N116
57392G43388O137O559O501O692O865O533O228O685P625Q369Q951R497R363Q110
57378H47503O706O570P715Q912R346R147Q645Q117Q062Q782R793J0504J1185J2296
57364I73283J3138J2374J0059Q003P717Q797R820J0066R942J0141J0840J1526
57352A095706J1514J0926J0940J2450J4521J5031J3186J0683R903J1426J3765
57341A230051J5085J4728J3439J2545J2760J3580J4171J4650J5755J7147J7241
$$ plain form
57435 554185 556324 557993 558876 558613 558006 558205 559270 560640 562583 565988 570919 576434 581887 587425 593191
57420 593191 598835 604085 609230 614879 621546 629134 636368 641368 643754 645727 649895 656193 662165 666100
57406 666100 668586 671015 674250 679022 685894 693980 701188 706754 712316 719400 727058 733364 738272 743388
57392 743388 749525 756084 762585 769277 776142 782675 788903 795588 803213 811582 820533 830030 839393 847503
57378 847503 854209 860779 868494 877406 886752 895899 904544 912661 920723 929505 939298 949802 960987 973283
57364 973283 986421 998795 1008854 1016857 1024574 1033371 1043191 1053257 1063199 1073340 1084180 1095706
57352 1095706 1107220 1118146 1129086 1141536 1156057 1171088 1184274 1194957 1204860 1216286 1230051
57341 1230051 1245136 1259864 1273303 1285848 1298608 1312188 1326359 1341009 1356764 1373911 1391152
57330A391152J5467J3669J4082J6543J9027K0331K0799K0615J9244J7003J5557
57319A583489J5968J7302J8102J8282J8627J9207J9430J9186J8958J8988J9155
57308A786694J9362J9341J8487J6748J5256J5181J6238J7279J7954J8695J9359
57297A980594J9358J9066J9558K0689K0971J9948J9244K0221K1885K2337K1454
57286B205325K0826K1574K3406K5529K7252K7903K7303K6471K6869K8652L0443
57275B491553L1073L0877L0920L1550L2177L2248L1946L1904L2417L2985L2733
57264B842383L1288K9151K7176K5960K5697K6306K7459K8798L0223L1654L2493
57253C158588L1976L0400K9264K9781L1695L4073L6347L7850L7321L4336L0825
$$ plain form
57330 1391152 1406619 1420288 1434370 1450913 1469940 1490271 1511070 1531685 1550929 1567932 1583489
57319 1583489 1599457 1616759 1634861 1653143 1671770 1690977 1710407 1729593 1748551 1767539 1786694
57308 1786694 1806056 1825397 1843884 1860632 1875888 1891069 1907307 1924586 1942540 1961235 1980594
57297 1980594 1999952 2019018 2038576 2059265 2080236 2100184 2119428 2139649 2161534 2183871 2205325
57286 2205325 2226151 2247725 2271131 2296660 2323912 2351815 2379118 2405589 2432458 2461110 2491553
57275 2491553 2522626 2553503 2584423 2615973 2648150 2680398 2712344 2744248 2776665 2809650 2842383
57264 2842383 2873671 2902822 2929998 2955958 2981655 3007961 3035420 3064218 3094441 3126095 3158588
57253 3158588 3190564 3220964 3250228 3280009 3311704 3345777 3382124 3419974 3457295 3491631 3522456
57242C522456K9509L0684L1995L1773L1192L2240L4836L7157L8185L8520L8858
57231C897405L8892L8193L7282L7109L7768L8340L8114L7522L7596L8738M0395
57220D317354M1929M3293M4580M5326M4792M2804L9836L6334L2487K8732K5875
57209D743342K4343K3687K3318K3448K4815K7436L0234L2278L3950L6277L9249
57198E062377M1494M1989M1475M1503M2519M3538M3527M2334M0328L7880L5180
57187E514144L1920K7385K1782J7160J5531J5958J5419J3177J2238J5140K0107
57176E719961K3611K5397K8447L4485M2159M9722N6851O3113O7089O8524O9696
57165F249055P3002P8065Q2598Q5408Q7284Q9333R1568R3011R2465Q9261Q3808
$$ plain form
57242 3522456 3551965 3582649 3614644 3646417 3677609 3709849 3744685 3781842 3820027 3858547 3897405
57231 3897405 3936297 3974490 4011772 4048881 4086649 4124989 4163103 4200625 4238221 4276959 4317354
57220 4317354 4359283 4402576 4447156 4492482 4537274 4580078 4619914 4656248 4688735 4717467 4743342
57209 4743342 4767685 4791372 4814690 4838138 4862953 4890389 4920623 4952901 4986851 5023128 5062377
57198 5062377 5103871 5145860 5187335 5228838 5271357 5314895 5358422 5400756 5441084 5478964 5514144
57187 5514144 5546064 5573449 5595231 5612391 5627922 5643880 5659299 5672476 5684714 5699854 5719961
57176 5719961 5743572 5768969 5797416 5831901 5874060 5923782 5980633 6043746 6110835 6179359 6249055
57165 6249055 6322057 6400122 6482720 6568128 6655412 6744745 6836313 6929324 7021789 7111050 7194858
57154G194858P7320P0773O4352N7991N1904M6310M1261L7022L3978L1840K9682
57143G737291K7178K5107K4122K3628K2579K0727J8499J6095J3301R783N046j362
57131G941994r156j7252k4807l1678l7590m1853m4542m6902m9582n1440n1267
57120G535925m9861m8872m8224m6482m3583m1335m0924m1602m2396m3615m5782
57109G043249m8323n0396n2119n3833n4781n3747n0765m7122m3702m0228l6243
57098F511990l2066k8449k5866k4466k4251k4999k6221k7564k9047l0771l2619
57087F205671l4460l6387l8457m0536m2806m6085n0891n6372o1118o5268p0932
57076E662359q0058r2640j07652j24651j43331j62189j79287j94456k09529k26045
$$ plain form
57154 7194858 7272178 7342951 7407303 7465294 7517198 7563508 7604769 7641791 7675769 7707609 7737291
57143 7737291 7764469 7789576 7813698 7837326 7859905 7880632 7899131 7915226 7928527 7938310 7943356 7941994
57131 7941994 7932838 7915586 7890779 7859101 7821511 7779658 7735116 7688214 7638632 7587192 7535925
57120 7535925 7486064 7437192 7388968 7342486 7298903 7257568 7216644 7175042 7132646 7089031 7043249
57109 7043249 6994926 6944530 6892411 6838578 6783797 6730050 6679285 6632163 6588461 6548233 6511990
57098 6511990 6479924 6451475 6425609 6401143 6376892 6351893 6325672 6298108 6269061 6238290 6205671
57087 6205671 6171211 6134824 6096367 6055831 6013025 5966940 5916049 5859677 5798559 5733291 5662359
57076 5662359 5582301 5489661 5382009 5257358 5114027 4951838 4772551 4578095 4368566 4142521
57066D142521k43768k61602k78829k95109l10506l26374l45238l68726l96122
57057A316247m25660D33803e6597n27668n69609o17752o73876p38867q12426q94245
57047d891040r85102j086785j201217j329647j472254j628257j796242j974388
57039a6364932k160633k353285k551588k755074k961402l164546l355404l524985
57031c9191849l668285l787248l893399m011594m180727m439469m790333n160912
57023g3123816n401984n343044m873780l992060k791427j415655k0217J251803
57015i5710180K293194L053940L542825L806991L909605L919733L906139L923695
57007f7354058L998227M123283M270219M402537M487765M505375M449009M322584
$$ plain form
57066 4142521 3898753 3637151 3358322 3063213 2752707 2426333 2081095 1712369 1316247
57057 1316247 890587 433803 -56597 -584265 -1153874 -1771626 -2445502 -3184369 -3996795 -4891040
57047 -4891040 -5876142 -6962927 -8164144 -9493791 -10966045 -12594302 -14390544 -16364932
57039 -16364932 -18525565 -20878850 -23430438 -26185512 -29146914 -32311460 -35666864 -39191849
57031 -39191849 -42860134 -46647382 -50540781 -54552375 -58733102 -63172571 -67962904 -73123816
57023 -73123816 -78525800 -83868844 -88742624 -92734684 -95526111 -96941766 -96961983 -95710180
57015 -95710180 -93416986 -90363046 -86820221 -83013230 -79103625 -75183892 -71277753 -67354058
57007 -67354058 -63355831 -59232548 -54962329 -50559792 -46072027 -41566652 -37117643 -32795059
56999c2795059M134954L897807L625090L330340L023942K714216K410199K121003
56991g537508J852481J606878J386047J192766d71241D18055P71927O72985N90885
56982B453852N23006M64891M12087L62218L15281K72651K35872K05769J82050
56973E427677J63706J49687J38584J27223J10191Q2401M3386j149m2983p6774
56963F121949j01893j19902j31918j38649j41534j42545j43100j43716j44382
56954D914310j44744j44286j42761j40312j37081j33190j29356j26852j26418
56945C689310j27676j29975j33040j36337j38631j39149j38534j37787j36599
56936B471582j33723j28644j21951j14200j05536r6407q7661p9635p1896o4165
$$ plain form
56999 -32795059 -28660105 -24762298 -21137208 -17806868 -14782926 -12068710 -9658511 -7537508
56991 -7537508 -5685027 -4078149 -2692102 -1499336 -471241 418055 1189982 1862967 2453852
56982 2453852 2976858 3441749 3853836 4216054 4531335 4803986 5039858 5245627 5427677
56973 5427677 5591383 5741070 5879654 6006877 6117068 6199469 6242855 6241706 6198723 6121949
56963 6121949 6020056 5900154 5768236 5629587 5488053 5345508 5202408 5058692 4914310
56954 4914310 4769566 4625280 4482519 4342207 4205126 4071936 3942580 3815728 3689310
56945 3689310 3561634 3431659 3298619 3162282 3023651 2884502 2745968 2608181 2471582
56936 2471582 2337859 2209215 2087264 1973064 1867528 1771121 1683460 1603825 1531929 1467764
56926A467764n6789n0126m4123l8841l4779l2247l0879l0075k9583k9356k9268
56915A061698k9277k9506k9726k9018k6471k2178j7301j3158j0379q720p327n273
56903H33364k275R85L433M647N224N893O494O117M281J544j272m123p503j1216
56889H45593j4047j4868j3735j1671r663q297p900q354q691p541m480p48J908
56876G37506L135M269O447Q958J0127R650Q935Q719P393K774m824j2519j7802
56863G72768k0563k2036k2783k2368k0348j7094j3859j2085j2005j1987j0112
56852E87528o621l701k562k056q94K79L65J49J236L274M236L410K279K166K832
56837E91920L928O103R478J2415J3285J2716J2688J3735J4473J3928J3108J3590
$$ plain form
56926 1467764 1410975 1360849 1316726 1277885 1243106 1210859 1179980 1149905 1120322 1090966 1061698
56915 1061698 1032421 1002915 973189 944171 917700 895522 878221 865063 854684 845964 838637 833364
56903 833364 831089 832074 835507 840154 845378 851271 857765 863882 868163 869707 868435 864312 856809 845593
56889 845593 831546 816678 802943 791272 781609 773312 765412 757058 748367 740826 736346 735598 737506
56876 737506 740641 744910 751357 760315 770442 780092 789027 797746 805139 807913 803089 790570 772768
56863 772768 752205 730169 707386 685018 664670 647576 633717 621632 609627 597640 587528
56852 587528 580907 577206 574644 572588 571694 571973 572338 572487 573723 576997 581233 584643 586922 589088 591920
56837 591920 595848 601951 611429 623844 637129 649845 662533 676268 690741 704669 717777 731367
56825G31367J5174J5564J2470N913j587p191j0161j1903j3766j5485j6050j5335
56813F89010j3990j2182r388n485j123L086O967J0281J2737J4973J8491K3673
56801G37050K8606L0881L0218K8139K5279K0483J2904L715n029j2235j7573k0393
56789H62045k0141j7517j3944r890m865Q82N895R230J1762J5064J9588K4547K9136
56776I11792L3187L6815L9899M1814M1405L7459K9456J7926M108j0207k2616l0733
56764A130305l3784l3308l1771l0446k8900k6153k1877j6636j1421o993l344K65
56752H85937M576R653J4905J9547K2989K4914K5114K3088J8073R890k92j0620
56740A047774j9901k7796l3774l6875l6782l4343l0664k6416k2184j8487j4981
$$ plain form
56825 731367 746541 762105 774575 780488 778901 771710 761549 749646 735880 720395 704345 689010
56813 689010 675020 662838 653450 647965 646842 649928 656895 667176 679913 694886 713377 737050
56801 737050 765656 796537 826755 854894 880173 900656 913560 917275 912246 900011 882438 862045
56789 862045 841904 824387 810443 800553 795688 796570 802465 811695 823457 838521 858109 882656 911792
56776 911792 944979 981794 1021693 1063507 1104912 1142371 1171827 1189753 1193861 1183654 1161038 1130305
56764 1130305 1096521 1063213 1031442 1000996 972096 945943 924066 907430 896009 889016 885672 885937
56752 885937 890513 900166 915071 934618 957607 982521 1007635 1030723 1048796 1058686 1058394 1047774
56740 1047774 1027873 1000077 966303 929428 892646 858303 827639 801223 779039 760552 745571
56729G45571j0798o297l294k555k265k94K948N461O682P679Q538P466L058l846
56715G58054j0970j6420j9447k0465k0709k1200k1828k1912k1415k0794j9935
56704E42959j8340j6280j4559j3158j1349r247p952p861q109p980p641p063n660
56691D07760l608k251k382l210l810m472n663o657o300m534k317o19j11r27j976
56676C58923j479P91K667K066l19j962j496L06J912K280J161o75j770j428n05
56661C60472p6n1K4k35j080j391j30J629J963J021O94J479J816P89n70j214j400
56644C63740j304j84J944L419L007J599O73J95p27k067l066l469l444l004k483
56629C54829k783m054m973m516l525l199l042j989o54m24q89m63N24o1k523m254
$$ plain form
56729 745571 734773 728476 725182 722627 720362 720068 723016 728477 735159 742838 751376 758842 761900 758054
56715 758054 747084 730664 711217 690752 670043 648843 627015 605103 583688 562894 542959
56704 542959 524619 508339 493780 480622 469273 460026 452074 444213 436104 428124 420483 413420 407760
56691 407760 404152 401901 399519 396309 392499 388027 382364 375707 369407 364873 362556 361937 361826 360899 358923
56676 358923 357444 358235 360902 362968 362649 360687 359191 359497 361409 363689 364850 364175 362405 360977 360472
56661 360472 360396 360345 360369 360134 359054 357663 357533 359162 361125 362146 362840 364319 366135 366924 366354 365140 363740
56644 363740 362436 362252 364196 367615 370622 372221 372894 373089 372362 370295 367229 363760 360316 357312 354829
56629 354829 352046 347992 343019 338503 334978 331779 328737 326748 326094 325670 324781 324318 324842 324781 322258 318004
56613C18004l411j585j218k068k083q51o6q40k230k670j721j06J184J557J082
56598C02978L00l67q51r94m75N37J311J726K783N077P332P527N325K417N79K97
56582C35502J139K407L363L613L521L569L463K626J342M27j32j014j938j715k51
56567C55922R17Q57O70J586K760K340J60j965k408j187O43K001K226J311j03j332
56551C64398k148k411j781l94P05O80K7k67l00q76j807j858o02Q83J503J430J445
56534C58627J825K396L009L432L288K572J792J200L68r72k233k622k224j744j310
56519C67404k65J758L972N047M425K796J281M17J45M70J559L075M047L851L049
56504D03031K848L927O059Q436J0034J0143R126Q248Q136P825O074L116K57j812
$$ plain form
56613 318004 314593 313008 311790 309722 307639 306788 306722 305882 303652 300982 299261 299155 300339 301896 302978
56598 302978 303278 302911 302060 301066 300591 301128 302439 304165 306948 312025 319357 326884 332209 334626 335205 335502
56582 335502 336641 339048 342411 346024 349545 353114 356577 359203 360545 360972 360840 359826 357888 356173 355922
56567 355922 356839 357696 358366 359952 362712 365052 365212 363247 360839 359652 360295 362296 364522 365833 365730 364398
56551 364398 362250 359839 358058 357664 358369 359049 359076 358809 358509 357633 355826 353968 353366 354249 355752 357182 358627
56534 358627 360452 362848 365857 369289 372577 375149 376941 378141 378509 377537 375304 372682 370458 368714 367404
56519 367404 367139 368897 372869 377916 382341 385137 386418 386835 386980 387450 389009 392084 396131 399982 403031
56504 403031 405879 409806 415865 424301 434335 444478 453604 461852 469988 477813 483887 487003 487260 485448
56490D85448l152l425k131o9R38K54p69q17k41j12o34j265j689j983k353l175
56474D64825m604n797n420l360j028M77J440K121J691k87k397k835j728o84n87
56459D41827j116j910k783l111k438j634k067l569m482l814k146l18J438K702
56445D16579K577R24j038k057k094j777j351p60k43j45m56q42r05l17Q55J749
56429D10699J356k91j956k479j685q7J543K201J244n59j407m70J165K018J878
56414D13170J367P55J58J90J231K426K519J585Q59R36J107O15l05q72o26K62R85
56397D26362M82j353k925k412o6J948K286J795J669J557O41m35k29J343K864L308
56381D36835K894K092J021K6l50l37q89k136k932k389j042J80J201K217K680J926
$$ plain form
56490 485448 482296 478871 476740 476671 477609 477863 477094 476277 476036 475924 475290 474025 472336 470353 468000 464825
56474 464825 460221 454424 449004 445644 444616 445093 446533 448654 450345 450058 447661 444826 443098 442414 441827
56459 441827 440711 438801 436018 432907 430469 428835 426768 423199 418717 414903 412757 412439 413877 416579
56445 416579 419156 420080 419042 416985 414891 413114 411763 411003 410760 410615 410159 409317 408412 408095 408950 410699
56429 410699 412055 411764 409808 407329 405644 405557 407100 409301 410545 409986 408579 408109 409274 411292 413170
56414 413170 414537 415292 415450 415640 416871 419297 421816 423401 424260 425196 426303 426918 426613 425741 425115 425377 426362
56397 426362 426844 425491 422566 420154 420088 422036 424322 426117 427786 429343 429984 429549 429320 430663 433527 436835
56381 436835 439729 441821 442842 442868 442518 442181 441292 439156 436224 433835 432793 432973 434174 436391 439071 440997
56365D40997L61r29j497j602j381q65n28q09j231q89K12J227J734K014K104J650
56349D40568P22j01o45j168j452q76L48J099P29l71j631k595k260K48L730N295
56333D41640L662Q78l24L91J567K351K713K475J816J963L526M826L880J671J138
56318D74173K958M654M445L666M203N477N642M583L784L859L904L186K173J638
56304E28345J740K249K904L262K890K076J827K623L467K746K11k412l026j289
56290E47613J213K684K693K009J528J621K068K239J534J62p21j9K131M429N585
56275E76769N333M515M276M932N582N205M137L671M049L870K221L89L28J946L217
56260F30440K860J738J464K582M292N268M663K913J492J329J715J592J425K600
$$ plain form
56365 440997 441358 440429 438932 437330 435949 435084 434556 433747 432516 431627 431839 433066 434800 436814 438918 440568
56349 440568 441290 441189 440544 439376 437924 437048 437396 438495 439224 438853 437222 434627 432367 432615 436345 441640
56333 441640 445302 446180 445856 446247 447814 450165 452878 455353 457169 459132 462658 467484 471364 473035 474173
56318 474173 477131 481785 486230 489896 494099 499576 505218 509801 513585 517444 521348 524534 526707 528345
56304 528345 530085 532334 535238 538500 541390 543466 545293 547916 551383 554129 554340 551928 548902 547613
56290 547613 548826 551510 554203 556212 557740 559361 561429 563668 565202 565364 564643 564624 566755 571184 576769
56275 576769 582102 586617 590893 595825 601407 606612 610749 614420 618469 622339 624560 624949 625277 627223 630440
56260 630440 633300 635038 636502 639084 643376 648644 653307 656220 657712 659041 660756 662348 663773 666373
56246F66373N026O822O726N552M704M428M383M948O744R190J0608J0066Q516P804
56232G61890Q661R954J0234R740J0127J1935J3413J2747J0720R799J1046J3293
56220H93559J5204J6537J7355J7648J8111J9758K2159K3567K3543K3890K6061
56209A117392K9063L1127L2095L2783L3316L3784L5533L9693M4978M9043N1925
56198A530732N6036O2359O8777P3150P6385Q1118Q8438R7318J06610J15837J24180
56187B480940J30393J34469J38256J43314J48626J51448J50245J45794J39334
56178C762819J30745J19086J03903Q5242O3118L8185J2574j1193l2236n1364o9184
56167D151695q5136r8505j09245j17467j23029j26174j27764j28458j28204j26773
$$ plain form
56246 666373 671399 678221 684947 690499 695203 699631 704014 708962 715706 724896 735504 745570 754086 761890
56232 761890 770551 780505 790739 800479 810606 822541 835954 848701 859421 869220 880266 893559
56220 893559 908763 925300 942655 960303 978414 998172 1020331 1043898 1067441 1091331 1117392
56209 1117392 1146455 1177582 1209677 1242460 1275776 1309560 1345093 1384786 1429764 1478807 1530732
56198 1530732 1586768 1649127 1717904 1791054 1867439 1948557 2036995 2134313 2240923 2356760 2480940
56187 2480940 2611333 2745802 2884058 3027372 3175998 3327446 3477691 3623485 3762819
56178 3762819 3893564 4012650 4116553 4201795 4264913 4303098 4315672 4304479 4272243 4220879 4151695
56167 4151695 4066559 3968054 3858809 3741342 3618313 3492139 3364375 3235917 3107713 2980940
56157B980940j24107j19945j13970j06756r9754r3885q8878q4325q0399p7000
56147A991921p3149o8204o2983n8759n5583n2314m8118m3325l8980l5835l3621
56136A421050l1257k8150k5090k3022k1334j8706j5604j4030j4259j3869j1168
56125A204561p724n833n131l842k212k113l653m617l598j641k78M72J457K968
56111A168816M639O030O878P312P896Q948J0033J0808J1946J4146J6655J8093
56099A292200J8513J9228K0644K1770K2148K2757K4454K6862K9420L2432L6364
56088A566792M1062M6340N2490N9440O6182P1928P7307Q3582R0932R7916J02415
56077B356386J02764R8470R0388Q0190O9532N9837N2456M8138M6123M4442M1458
$$ plain form
56157 2980940 2856833 2736888 2622918 2516162 2416408 2322523 2233645 2149320 2068921 1991921
56147 1991921 1918772 1850568 1787585 1728826 1673243 1620929 1572811 1529486 1490506 1454671 1421050
56136 1421050 1389793 1361643 1336553 1313531 1292197 1273491 1257887 1243857 1229598 1215729 1204561
56125 1204561 1196837 1191004 1185873 1182031 1179819 1177706 1174053 1169436 1165838 1164197 1163919 1164391 1165848 1168816
56111 1168816 1173455 1179485 1186363 1193675 1201571 1210519 1220552 1231360 1243306 1257452 1274107 1292200
56099 1292200 1310713 1329941 1350585 1372355 1394503 1417260 1441714 1468576 1497996 1530428 1566792
56088 1566792 1607854 1654194 1706684 1766124 1832306 1904234 1981541 2065123 2156055 2253971 2356386
56077 2356386 2459150 2557620 2648008 2728198 2797730 2857567 2910023 2958161 3004284 3048726 3090184
56066C090184L6800L0796K3840J6557R808L856k114r353j8666l0182m3347n6865
56054C051314o9098p8804q5281q8055q7149q3571p8606p2461o4552n5343m6774
56043B241620m0286l5321l0418k5085j9889j5384j1672q470n061q81L221N207
56031B057581M326K681L039N652Q540J0572J2616J5405J7940J8883J8511J8292
56019B194038J9078K0572K2175K3626K4972K6453K8331L0439L2086L2807L2968
56008B487545L3196L3587L3993L4812L6728L9687M2846M5458M7249M8043M7867
55997B931011M7517M8080M9653N1369N2850N4485N6123N6837N6708N7342N9537
55986C521512O1790O2594O2894O4502O7133O9236P1101P4492P9294Q3127Q4916
$$ plain form
56066 3090184 3126984 3157780 3181620 3198177 3207985 3211841 3209727 3200374 3181708 3151526 3108179 3051314
56054 3051314 2982216 2903412 2818131 2730076 2642927 2559356 2480750 2408289 2343737 2288394 2241620
56043 2241620 2201334 2166013 2135595 2110510 2090621 2075237 2063565 2055095 2050034 2049153 2052374 2057581
56031 2057581 2061907 2064588 2067627 2073279 2081819 2092391 2105007 2120412 2138352 2157235 2175746 2194038
56019 2194038 2213116 2233688 2255863 2279489 2304461 2330914 2359245 2389684 2421770 2454577 2487545
56008 2487545 2520741 2554328 2588321 2623133 2659861 2699548 2742394 2787852 2835101 2883144 2931011
55997 2931011 2978528 3026608 3076261 3127630 3180480 3234965 3291088 3347925 3404633 3461975 3521512
55986 3521512 3583302 3645896 3708790 3773292 3840425 3909661 3980762 4055254 4134548 4217675 4302591
55975D302591Q6527Q9985R4997J00282J05513J10730J15347J19113J22994J27959
55965E376038J33728J39588J45487J51687J58220J65262J73029J80945J88262
55956F812246J95708K05011K16503K28954K42234K57807K75791K93823L10060
55947I038137L25295L41024L57704L75995L97014M19741M40907M59416M78210
55938A2633443M99726N22405N44375N67595N95003O26097O59106O95492P38298
55929A8081540P87516Q40928Q98191R60316J026150J093235J161509J232728J307141
55920B7389254J384021J464545J550724J642626J740099J846034J964622K097898
55912D1079823K247457K417579K612683K833821L082019L362630L681761M041436
$$ plain form
55975 4302591 4389118 4479103 4574100 4674382 4779895 4890625 5005972 5125085 5248079 5376038
55965 5376038 5509766 5649354 5794841 5946528 6104748 6270010 6443039 6623984 6812246
55956 6812246 7007954 7212965 7429468 7658422 7900656 8158463 8434254 8728077 9038137
55947 9038137 9363432 9704456 10062160 10438155 10835169 11254910 11695817 12155233 12633443
55938 12633443 13133169 13655574 14199949 14767544 15362547 15988644 16647750 17343242 18081540
55929 18081540 18869056 19709984 20608175 21568491 22594641 23687876 24849385 26082113 27389254
55920 27389254 28773275 30237820 31788544 33431170 35171269 37017303 38981925 41079823
55912 41079823 43327280 45744859 48357542 51191363 54273382 57636012 61317773 65359209
55904F5359209M444297M900896N426562O034205O736799P553586Q505538R606939
55896A18568031J0868369J2302931J3919486J5713441J7673004J9785060K2016491
55889B30846813K4283125K6414816K8071963K8615000K7107802K2675565J5119936
55882D03135020N306921n084357j4311401k1247378k5575676k7568182k7763989
55875B86890958k6743157k5002654k2902827k0676689j8472842j6385954j4466851
55868A42239984j2735980j1202637r870914q733644p773373o970649o304449n746864
55860G2901474n267355m843846m464158m118133l795384l490159l201451k927973
55852D0793015k668454k426270k207833k015906j848810j705081j583545j479439
$$ plain form
55904 65359209 69803506 74704402 80130964 86165169 92901968 100455554 108961092 118568031
55896 118568031 129436400 141739331 155658817 171372258 189045262 208830322 230846813
55889 230846813 255129938 281544754 309616717 338231717 365339519 388015084 403135020
55882 403135020 408441941 403357584 389046183 367798805 342223129 314654947 286890958
55875 286890958 260147801 235145147 212242320 191565631 173092789 156706835 142239984
55868 142239984 129504004 118301367 108430453 99696809 91923436 84952787 78648338 72901474
55860 72901474 67634119 62790273 58326115 54207982 50412598 46922439 43720988 40793015
55852 40793015 38124561 35698291 33490458 31474552 29625742 27920661 26337116 24857677
55844B4857677j385977j299998j221482j148133j075781j004235r37355q76572
55836A5908144q19216p64069p13806o70333o31815n95931n62545n31754n02447
55827A0116228m74242m48185m24601m02727l82929l66285l51453l35130l16536
55818F614140k98320k82114k66329k49733k34208k22083k13038k05300j97998
55809D445017j90858j83262j75006j66617j58110j48895j39423j31053j23689
55800C028104j15626j06522r8433r2841q8663q4300p9738p5331p0484o5097o0668
55789B090401n8271n6625n3810n0056m7246m6263m6137m5530m4070m2266m0549
55778A559578l8531l5435l1675k9229k9234k9894k8501k5222k2793k2494k2728
$$ plain form
55844 24857677 23471700 22171702 20950220 19802087 18726306 17722071 16784716 15908144
55836 15908144 15088928 14324859 13611053 12940720 12308905 11712974 11150429 10618675 10116228
55827 10116228 9641986 9193801 8769200 8366473 7983544 7617259 7265806 6930676 6614140
55818 6614140 6315820 6033706 5767377 5517644 5283436 5061353 4848315 4643015 4445017
55809 4445017 4254159 4070897 3895891 3729274 3571164 3422269 3282846 3151793 3028104
55800 3028104 2912478 2805956 2707523 2614682 2526019 2441719 2361981 2286650 2216166 2151069 2090401
55789 2090401 2032130 1975505 1921695 1871639 1824393 1778130 1731993 1686463 1642393 1600127 1559578
55778 1559578 1521047 1485612 1453937 1424708 1395474 1365580 1337079 1311857 1289064 1266570 1243842
55767A243842k1989k0833j9981j8791j7011j5958j6443j7153j6727j5994j6429
55756A046533j7634j8020j7092j5486j3636j1904j1195j1924j2908j2659j1199
55745H92876r461p659n650m078l549l184j639P38K306K549K411K247J196q35k138
55730H66130j207J043K157J002j024j824j127p41k265n134p494q689r789j1552
55716H19486j3080j3088j1647r710p653n322l052j667j613k870n437r052j2741
55703G22554j5484j7276j8591j8934j7036j2835q407o318p349j0129j2609j3547
55691E64039j2986j1858j1185j1308j1584j0967r089o769n249m872m758l920k399
55678D57095r77k24k80j171k631l846m170m023m287m917n141m979n402o660p533
$$ plain form
55767 1243842 1221853 1201020 1181039 1162248 1145237 1129279 1112836 1095683 1078956 1062962 1046533
55756 1046533 1028899 1010879 993787 978301 964665 952761 941566 929642 916734 904075 892876
55745 892876 883415 875756 870106 866028 862479 859295 857656 858394 860700 863249 865660 867907 869103 868268 866130
55730 866130 864923 865966 868123 869125 868101 866277 865150 864409 862144 857010 849516 840827 831038 819486
55716 819486 806406 793318 781671 771961 764308 758986 755934 754267 752654 749784 744347 735295 722554
55703 722554 707070 689794 671203 652269 635233 622398 613991 607673 600324 590195 577586 564039
55691 564039 551053 539195 528010 516702 505118 494151 485062 478293 473044 468172 463414 459494 457095
55678 457095 456118 455894 455614 454443 451812 447966 443796 439773 435486 430569 425428 420449 415047 408387 400854
55663D00854o865n018l223k295k395l292m143l756j739J080L770O072P734Q065
55649C94849O955N382M066K497J96k035l269m006n183o290o136n156n197o863
55635C69810q575q640p130n289m048l543l279k476r42K51k05j980l195k699j366
55620C16694o36o77o38j7Q92J628J890J572Q97M10M16N68L19m30j376k308l213
55603C15991l969m195l479j740N87K727M066M488M164L214J792K92q63j563j887
55588C19625j805j384r84q24n13L76J425J689R03l52j619k908m023m408m009l479
55572B97710l145k604j809j725k954m445m645l690l314m548o386p000n678l268
55558B42499j254n79j002j389j036o50j475l361m641m285l339l300l805l247j469
$$ plain form
55663 400854 393989 388971 385748 383453 381058 377766 373623 369867 368128 369208 372978 379050 386784 394849
55649 394849 401804 407186 411252 413749 413945 411910 408641 404635 399452 393162 387026 381870 376673 369810
55635 369810 361235 352595 345465 340176 336128 332585 329306 326830 325888 326139 325934 323954 320759 318060 316694
55620 316694 316058 315381 314743 314726 315618 317246 319136 320708 321605 322015 322431 322999 323318 322888 321512 319204 315991
55603 315991 312022 307827 304348 302608 303195 305922 309988 314476 318640 321854 323646 323938 323075 321512 319625
55588 319625 317820 316436 315452 314628 314115 314491 315916 317605 318508 318156 316537 313629 309606 305198 301189 297710
55572 297710 294565 291961 290152 288427 285473 281028 276383 272693 269379 264831 258445 251445 245767 242499
55558 242499 241245 240666 239664 238275 237239 236589 235114 231753 227112 222827 219488 216188 212383 209136 207667
55543B07667l14r87k184j899j87J088R16J89M7L68L38l78j487k396k236n04J864
55526A99905K815J513l37m15J446L449M343M392M041L258K656L641O318Q470P998
55511B53493N870N085O762Q749Q556O382M338L427K620P77j695l611m597n217
55497B90939n934o739p712r042j0282j0269q385n523l280k463k744l488m272m739
55483B06067m637m128l550k741j168J016K511J980m97l252m336l099p27Q82R71
55468A85292N54Q52J521J229k40j538j671j151p06J4J445K787K949K221J786J836
55452A97180J630J107R21P45p03l404n341m984l185j717j047p73j084k256l358
55437A73731l215k238j803j926j297L77J670J507M24p46j972l030k919j363K13
$$ plain form
55543 207667 207353 206366 204182 202283 202096 203184 204100 204289 204336 204704 205042 204664 203177 200781 198545 198041 199905
55526 199905 202720 204233 203896 203481 204927 208376 212719 217111 221152 224410 227066 230707 237025 245495 253493
55511 253493 259363 264448 271210 279959 288515 294897 299235 302662 305282 306059 304364 300753 296156 290939
55497 290939 285005 278266 270554 261512 251230 240961 232576 227053 223773 221310 218566 215078 210806 206067
55483 206067 201430 197302 193752 191011 189843 190859 193370 195350 194853 191601 187265 184166 183439 184321 185292
55468 185292 185846 186698 188219 189448 189208 187670 185999 184848 184142 184156 185601 188388 191337 193558 195344 197180
55452 197180 198810 199917 200838 201583 200880 197476 192135 187151 183966 182249 181202 180429 179345 177089 173731
55437 173731 170516 168278 166475 164549 163252 163629 165299 166806 167230 166484 164512 161482 158563 157200 157413
55422A57413M61p0j48n4j001k778l604k426j70J529J845R04n88j652j716j230
55406A46715j003r82m54M77O73m18j773j881l78J714K921K356M40j313j709j167
55390A44218r14j015k74J659L201K660L13k031l008k548j312r5N11M44J00k54
55374A41655o35q06l12O23R77K50q02j273j163p85p6O09J56j485k165KL527M969
55356A43266L568K243L313N153M628J464j597k445j755j437k294l610m260l676
55342A42561k130n01L87M13P2j92k90k14Q5L52J17m93m46Q79K260J618j168l377
55324A39933k369J075L500K780K67j270p68O63J450Q97o34j941j705J96K130K243
55308A46447N11j230j390j47J223J920K051J846J094l23j746k281k057k171k912
$$ plain form
55422 157413 157874 157804 157656 157602 156601 153823 150219 147793 147623 149152 150997 151901 151313 149661 147945 146715
55406 146715 145712 144730 144276 144753 145426 145008 143235 141354 140976 142690 145611 147967 148407 147094 145385 144218
55390 144218 143304 142289 142015 143674 146875 149535 149848 147817 144809 142261 140949 140854 141365 141809 141909 141655
55374 141655 141020 140214 139902 140525 141502 141752 140950 139677 138514 137729 137653 138262 138418 136933 134768 134770 138297 143266
55356 143266 146834 149077 152390 157543 162171 163635 162038 159593 157838 156401 154107 150497 146237 142561
55342 142561 140431 139930 140317 140730 140802 140610 140320 140106 140191 140543 140660 140167 139721 140600 142860 144478 143310 139933
55324 139933 137564 138639 142139 144919 145186 143916 143148 143811 145261 146158 145524 143583 141878 142074 144204 146447
55308 146447 146958 145728 144338 144191 145414 147334 149385 151231 152325 152002 150256 147975 145918 143747 140835
55293A40835l007j601j36n31j948j546J226L465L003J396J010J192j34k438l110
55278A37676j523K61R14J330K243K751K182J369J021N50m55j037m07O40Q10j17
55262A48208j598k995l302j683Q25J690Q9j779j920j375k058l274k776l61J979
55247A29670L103L531L355J818n99j827q36R65J744J264J48j347k810l107j601
55232A33471P24K286K545J942R05j99p38l98K11L85M22J056J955J827J75j803
55216A44766k473j494K8Q97J002J073J493J676R14l94j029o30l32j154k265j884
55200A40194K47K298K626J747J349J907K272J507M0j229k098k620k210k78K386
55185A48138L919L391J741L39o48j777k825k739j178P21J497R59K56L67R22Q50
$$ plain form
55293 140835 137828 136227 136091 135560 133612 132066 133292 136757 139760 141156 142166 143358 143224 140786 137676
55278 137676 136153 136414 137328 138658 140901 143652 145834 147203 148224 148774 148319 147282 146875 147515 148325 148208
55262 148208 146610 143615 140313 138630 139455 141145 141234 139455 137535 136160 134102 130828 128052 127691 129670
55247 129670 132773 136304 139659 141477 140878 139051 138215 139180 140924 142188 142336 140989 138179 135072 133471
55232 133471 134195 136481 139026 140968 141873 141674 140936 140538 140749 141134 141556 142612 144567 146394 146569 144766
55216 144766 142293 140799 140827 141724 142726 143799 145292 146968 147882 147488 146459 145829 145497 144343 142078 140194
55200 140194 140441 142739 145365 147112 148461 150368 152640 154147 154187 152958 150860 148240 146030 145752 148138
55185 148138 152057 155448 157189 157528 156880 155103 152278 149539 148361 149082 150579 151538 151794 152161 153083 153933
55169A53933M1k88N54J250m7k834m409l316j277o17j135j051j39K18k66k63N90
55152A40944Q04l26j172l63P22l3j950k345n32J230J072p5l48M04J048J189J365
55135A41634J670J501O93k4J4N81R09N73p7k13N48J445J155m80j851j332N98J784
55117A49128Q99j219k730k526p30J582K872K242O06n6Q87J861J336M4k19O87J236
55100A55900O97J9jo0j040k409k921k262j179k82L79P23M73k26n99m5J066J696
55082A49929J348O56O08J242J615J179N38L88K86n95j867k214j380o22q27j150
55066A49134l51J289K290J850O49q7J97J061J557J242P61J052J908K030Q25n76
55050A64831p64J42Q87Q16L59P4K2R5K13K31L0l29q16j550k281k254j162J27N11
$$ plain form
55169 153933 153974 153686 154240 155490 155443 152609 148200 144884 143607 142990 141855 140804 140665 140883 140617 140354 140944
55152 140944 141748 141422 140250 139887 140609 140576 138626 136281 135749 136979 138051 137976 137628 138032 139080 140269 141634
55135 141634 143304 144805 145498 145474 145488 146069 146978 147551 147474 147261 147809 149254 150409 149929 148078 146746 147344 149128
55117 149128 150027 148808 146078 143552 142822 144404 147276 149518 150124 150068 150955 152816 154152 154196 153977 154664 155900
55100 155900 156597 156616 156615 156555 155515 153106 150185 147923 146744 146462 146841 147564 148037 147811 147212 147167 148233 149929
55082 149929 151277 151933 152541 153783 155398 156577 157115 157503 157789 157194 155327 153113 151733 151111 150284 149134
55066 149134 148783 150072 152362 154212 154861 154774 154971 156032 157589 158831 159592 160644 162552 164582 165407 164831
55050 164831 164067 164209 165096 165912 166271 166345 166367 166462 166675 166906 166936 166607 165791 164241 161960 159706 158544 158671 159182
55031A59182P7j38M02J207J549J152K04o89p29K36J330J725J785K326L057K875
55015A75551J674P27R01J470J223N6j082j403j018o67r19j545j753j217m86q7
54999A71425K16N75K33j338k884k523m83Q52J22j237j135M07J682J575M12j037
54983A66862k284k950k696j505J71J596K092J583Q15O00Q51Q57M68J84J8p24k185
54966A63753l328l190j984n51O09J237J109O34Q34J941K683J851N4r57m13Q70
54950A65152J733J792J420J274J694K200J829L04j479k513k654k173j129J89R06
54935A68545O19J88N91J449J631R95M29M85R32J452J834J661Q09J32N72J685K019
54918A86028J056k68j013j211j168q42k58K75P22J419K309K697K082Q03l95j021
$$ plain form
55031 159182 159259 159121 159523 160730 162279 163431 163635 162946 162217 162453 163783 165508 167293 169619 172676 175551
55015 175551 177225 177952 178853 180323 181546 181602 180520 179117 178099 177432 176513 174968 173215 171998 171512 171425
54999 171425 171641 172216 172449 171111 168227 165704 165221 166073 166195 164958 163823 164230 165912 167487 167899 166862
54983 166862 164578 161628 158932 157427 157598 159194 161286 162869 163684 164284 165135 165992 166460 166644 166662 165938 163753
54966 163753 160425 157235 155251 154700 155309 156546 157655 158289 159123 161064 163747 165598 165652 164695 164282 165152
54950 165152 166885 168677 170097 171371 173065 175265 177094 177398 175919 173406 170752 168579 167450 167639 168545
54935 168545 169164 169352 169943 171392 173023 174018 174447 174932 175864 177316 179150 180811 181620 181752 182324 184009 186028
54918 186028 187084 186816 185803 184592 183424 182582 182324 182599 183321 184740 187049 189746 191828 192631 192236 191215
54902A91215j077j060j590k488k602j277L92Q63L97N51J508J677L54r82j022n88
54886A84271j002j693j194L12J143O12k52n15m39m15l0J074K253K574K101J842
54870A90642K361L021K723J291k28p38k33N34J272K343L735M684M678M141L673
54855B23899L255K823K955M098N566O234N927N214M190K469L39j331k477l926
54841B59235n674o299m941k967k463l479m079l108j741j666k658k934j684j83
54827B15359K4p73r76P5J346J700J209M76l24r13k78K123M919O071N484M944N296
54810B45762N326M101K851L134M268M247K669J106O51N72l41k176m076n188n199
54795B57707m582m358m939n376m624l301k969l729m113l557l219l711l870k879
$$ plain form
54902 191215 190138 189078 187488 185000 182398 181121 181513 182376 182773 183324 184832 186509 186863 185881 184859 184271
54886 184271 183269 181576 180382 180694 181837 182449 182197 181682 181243 180828 180798 181872 184125 186699 188800 190642
54870 190642 193003 196024 198747 200038 199810 199072 198839 199373 200645 202988 206723 211407 216085 220226 223899
54855 223899 227154 229977 232932 237030 242596 248830 254757 259971 264161 266630 266969 265638 263161 259235
54841 259235 253561 247262 242321 239354 236891 233412 229333 226225 224484 222818 220160 217226 215542 215359
54827 215359 215383 214610 213634 213709 215055 216755 217964 218440 218116 217203 216925 219048 223967 230038 235522 240466 245762
54810 245762 251088 255189 258040 261174 265442 269689 272358 273464 274115 274687 274346 272170 268094 262906 257707
54795 257707 253125 248767 243828 238452 233828 230527 227558 223829 219716 216159 212940 209229 205359 202480
54781B02480j919k185k734k149j098j089j617j022L28L82j054j799q40K63M25
54766A86372R03K569L624K139p84k660l130l482l624k179N77K463K537K359L321
54751A91005M486M180K424N58o89j564k111j771l86J019R55r19l055l370j549
54736A89213N32J051L24p7L27N82J33l35o4P57J566K158K396J827K60j604k537
54719A96509j794J35J681J589N40P57L141N550N302K937J620K738M154L556J590
54704B30005L61L31M34M19J178L081N373P264Q446Q602P462N509L706K355R25
54689B85451r67l103n136o774p499o914n661n193o137p403p341n534l116j510
54675B13163j176j470j452p89Q0N89P51J162K320L951N068M803L386K114K032
$$ plain form
54781 202480 200561 198376 195642 193493 192395 191306 189689 188667 188995 189377 188323 186524 185684 185947 186372
54766 186372 187275 189844 193468 195607 194823 192163 189033 185551 181927 179748 180325 182788 185325 187684 191005
54751 191005 195491 199671 202095 202653 201964 200400 198289 196518 196132 197151 198106 197187 194132 190762 189213
54736 189213 189745 190796 191120 191043 191370 191952 192085 191750 191686 192443 194009 196167 198563 200390 200650 199046 196509
54719 196509 194715 194850 196531 198120 198660 199417 202558 208108 213410 216347 217967 220705 224859 228415 230005
54704 230005 230366 230697 231131 231550 232728 235809 241182 248446 256892 265494 272956 278465 282171 284526 285451
54689 285451 284484 281381 276245 269471 261972 255058 249397 244204 238067 230664 223323 217789 214673 213163
54675 213163 211987 210517 209065 208276 208356 208945 209696 210858 213178 217129 222197 227000 230386 232500 234532
54660B34532K713K799J786P56J074K809M754N661N138L669K098R89K26o55j734
54645B66615k634l153l451l581l409l196l567m492m920l992k155o88m53j454l013
54630B22457l990l542k234j718k587l256j921R22K957K773J078p05j971k769k981
54615B02513k213m90J189J362k86j988j652J94O35j679m272m034j423M74L21l82
54599A88269l74k42m36N7J781L263K797P17j275k155j875n55J322K466J813o3
54583A95510j427j268r6R51J280J134J152J582J927J642J025P45N43o07k643l892
54567A97558l122j270k39o08j458j927j876j388m88N83J515K266K750K516J395
54552A96207K05L8Q82J615J276J1j205j335j16J487J977J017q8q2N42M20o34j609
$$ plain form
54660 234532 237245 240044 241830 242586 243660 246469 251223 256884 262022 265691 267789 268778 269004 268349 266615
54645 266615 263981 260828 257377 253796 250387 247191 243624 239132 234212 230220 228065 227377 226924 225470 222457
54630 222457 218467 214925 212691 210973 208386 205130 203209 204131 207088 209861 210939 210234 208263 205494 202513
54615 202513 200300 199810 200999 202361 202075 200087 198435 198629 199264 197585 193313 189279 187856 188330 188651 188269
54599 188269 187895 187653 187217 187274 189055 192318 195115 195832 194557 192402 190527 189972 191294 193760 195573 195510
54583 195510 194083 192815 192719 193670 194950 196084 197236 198818 200745 202387 203412 204157 204700 204093 201450 197558
54567 197558 194436 193166 192927 192319 190861 188934 187058 185670 185182 185765 187280 189546 192296 194812 196207
54552 196207 196412 196450 197332 198947 200223 200234 199029 197694 197578 199065 201042 202059 201971 201889 202431 202851 202217 200608
54534B00608j941j981j827j052J40Q01P56J130K469L446K560N09n15K55J278J018
54518B07654q3o17k91J26M24J159K193K344J154j59m83n99j821l458l467j623
54502B02453q9k70q56k4J796K831K501J522K92j205k231j750O4J947L204M028
54486B14213M399L991L099K294J254o37k497k550p96P53R69Q66J157O30j503l470
54470B22172l121j114K00K67M21R37M39j416k804k283p97q7k31M7J307K727L208
54453B19872K346N50j225k058j808j139o52l55j43j22j63K23R42J026m5j308j574
54436B14367j152j100j229l32J553K825K796K806L798M293K476p15k581k412k132
54421B23261l008l805k933p95J215K609L421L081J367k97k26J145J858J280O94
$$ plain form
54534 200608 198667 196686 194859 193807 193947 194748 195504 196634 199103 202549 205109 205618 205103 205358 206636 207654
54518 207654 207571 206954 206663 206789 207213 208372 210565 212909 214063 213904 213421 212822 211001 207543 204076 202453
54502 202453 202364 202094 201238 201214 203010 205841 208342 209864 210156 208951 206720 204970 205034 206981 210185 214213
54486 214213 218612 222603 225702 227996 229250 228613 226116 223566 222770 223523 224492 225358 226515 227145 225642 222172
54470 222172 219051 217937 218137 218404 218825 219762 220201 218785 215981 213698 212901 212814 212583 212630 213937 216664 219872
54453 219872 222218 222768 221543 219485 217677 216538 215886 215531 215388 215266 215103 215326 216268 217294 217249 215941 214367
54436 214367 213215 212115 210886 210554 212107 214932 217728 220534 224332 228625 231101 230386 227805 225393 223261
54421 223261 220253 216448 213515 212720 213935 216544 219965 223046 224413 224116 223890 225035 226893 228173 228867
54406B28867R99J501J435J166J165J050N09K9j06n64j663k327j440L99J648J794
54390B34462J372O47l73r87m11O54N90p95j941j979j923k664l142j911M97K157
54374B24253K201J352L33p35j356p43O97J327O11J81J435L057K641K37j531j078
54358B32882L04Q69R83J921L294L526K411J418J293R52n64k275k327l77J943K794
54342B49047J941P62O32J350J457L32p21j62J494K314J651P78P68J144J144R04
54326B64835O37n3j075j273o3J274J118m28k007k747k412q79J327K801K872K596
54310B66523K787K221k76l020l197q81J235J918K490L653M125L231K286K145J692
54295B86932K22q82m18N43O40M39Q33P99r25l235m060l533l413m012m072l440
$$ plain form
54406 228867 229866 231367 232802 233968 235133 236183 236692 236721 236615 236051 234388 232061 230621 231020 232668 234462
54390 234462 235834 236481 236108 235121 234710 235364 235954 235159 233218 231239 229316 226652 223510 221599 222096 224253
54374 224253 226454 227806 228139 227404 226048 225305 226002 227329 227940 228121 229556 232613 235254 235491 233960 232882
54358 232882 233186 234055 235038 236959 240253 243779 246190 247608 248901 249853 249289 247014 244687 244310 246253 249047
54342 249047 250988 251750 252382 253732 255189 255521 254800 254638 256132 258446 260097 260875 261643 262787 263931 264835
54326 264835 265472 265419 264344 263071 263008 264282 265400 264972 262965 260218 257806 256927 258254 261055 263927 266523
54310 266523 269310 271531 271255 268235 265038 264157 265392 267310 269800 273453 277578 280809 283095 285240 286932
54295 286932 287154 286272 285854 286397 287037 287476 288309 289108 288183 284948 280888 277355 273942 269930 265858 262418
54279B62418l375m053l952k244n6J247J532J178K86q19j478j633j923k478k586
54264B42064j850p53L01J518K883L681L306J979L90p47p69M34J882K220J219r2
54248B57666p95r01p80o55o76p89n37K96J109J238R09N01l92j883k637j585j79
54231B49910o22k191k042J10J190m43k466k434j416j495j993r60J145K152J655
54216B40100J138J163R29L91L95P28K11j028j382j98J295J955K027K052J903J460
54200B53139J120J136J355J699K023J634J27j364j129Q23K740L435L233K563J273
54185B73807k73r86o96n86j425k551l215l569l632k657m72J716K733K705K128
54170B63027Q53r92k230k045j262j090j338j040j14Q06J514K008J746M42q51r53
$$ plain form
54279 262418 259043 254990 251038 248794 248738 249985 251517 252695 252981 252162 250684 249051 247128 244650 242064
54264 242064 240214 239461 239762 241280 244163 247844 251150 253129 253519 252772 252003 252437 254319 256539 257758 257666
54248 257666 256871 255970 255190 254535 253859 253070 252533 252829 253938 255176 256085 256586 256194 254311 251674 250089 249910
54231 249910 249288 247097 245055 245165 246355 245912 243446 241012 239596 238101 236108 235148 236293 238445 240100
54216 240100 241238 242401 243330 243721 244116 244844 245055 244027 242645 242447 243742 245697 247724 249776 251679 253139
54200 253139 254259 255395 256750 258449 260472 262106 262233 260869 259740 260563 263303 266738 269971 272534 273807
54185 273807 273534 272548 271852 271266 269841 267290 264075 260506 256874 254217 253745 255461 258194 260899 263027
54170 263027 263880 262888 260658 258613 257351 256261 254923 253883 253769 254575 256089 258097 259843 260285 259434 258481
54154B58481m70j034k720l755k985j255L1N19M96K9q06j489j601j335r76l76N52
54137B41306J222R37j61j156j411j059m87K62J323K484L163L024K384J854J607
54122B55292J244L53r58k145k585j978o23O25J042O99K55Q4J7q3k5K68M75K91
54104B52248k18q19j205q01P97K789L364J666q79k018j220k5R6o04r34n27j78
54087B51532n06q48j3J970L462K905O02j733k839k688j678r8J567K734L450M209
54071B62028M739L967J605j077k623k826k334j685j242j152q12O37K604L029J089
54056B65947j212j487n8Q80L53q46k010k957k871q50K095L452K224J37p30j14
54040B61953J099K352L282L341K508J704J668J997J916J409R77Q07Q56J235J961
$$ plain form
54154 258481 258011 256977 254257 250502 247517 246262 246293 246812 247308 247337 246531 245042 243441 242106 241130 240754 241306
54137 241306 242528 243465 243304 242148 240737 239678 239191 239453 240776 243260 246423 249447 251831 253685 255292
54122 255292 256536 256889 255931 253786 251201 249223 248600 249225 250267 250966 251221 251305 251322 251239 251214 251482 251957 252248
54104 252248 252030 251211 250006 249205 250002 252791 256155 257821 256942 254924 253704 253679 253775 253171 252237 251710 251532
54087 251532 251026 250178 250165 252135 255597 258502 259104 257371 254532 251844 250166 250068 251635 254369 257819 262028
54071 262028 266767 270734 272339 271262 268639 265813 263479 261794 260552 259400 258588 259225 261829 264858 265947
54056 265947 264735 263248 263190 264070 264423 263577 261567 258610 255739 254889 256984 260436 262660 262797 262067 261953
54040 261953 263052 265404 268686 272027 274535 276239 277907 279904 281820 283229 284206 285013 285869 287104 289065
54025B89065K652K866K527J886J463K032M008O541P984P465N560L245R88q84j801
54010C35597j558q22n67j263k799m617n835n732m432k599o29J264K410K215J328
53995C11961J050J461J414N61n3J63M80M92R33J955K291J481J283L150N627O252
53979C40501N104M327M735N159M923M799N314O007O660P616Q460Q061O481N281
53965D23428N392N971O048N873N884N658M856M064L669K857Q73j546l145l909
53951D65973m720n796o704p460q311q594p230m617k670k527l242l433l278l838
53937C93553n076n851n817n987o903p277n531k201K95L41j284k705k939k216j108
53922C39294j14K38l47j508k435k545j743l44J066J998K497K827K634J245q12
$$ plain form
54025 289065 291717 294583 297110 298996 300459 302491 306499 313040 321024 328489 334049 337294 338282 337398 335597
54010 335597 334039 333217 332650 331387 328588 323971 318136 312404 307972 305373 304744 306008 308418 310633 311961
53995 311961 313011 314472 315886 316447 316394 316557 317037 317529 318462 320417 322708 324189 325472 328622 334249 340501
53979 340501 345605 349932 354667 359826 364749 369548 374862 380869 387529 395145 403605 411666 418147 423428
53965 423428 428820 434791 440839 446712 452596 458254 463110 467174 470843 473700 474573 473027 469882 465973
53951 465973 461253 455457 448753 441293 432982 424388 417158 412541 409871 407344 404102 400669 397391 393553
53937 393553 388477 382626 376809 370822 363919 356642 351111 348910 349205 349546 348262 345557 342618 340402 339294
53922 339294 339180 339418 339071 337563 335128 332583 330840 330496 331562 333560 336057 338884 341518 342763 341951
53907C41951j646k43J948K792K178J598J646J618J404J823K704K522P83p71l97
53892C59910J411L035M135N563P607R544J0693J0998J0860J1057J2305J4092J4644
53879D75854J2942J0234Q392P397N747K971J86j765l179m235m357l363k020q03
53865E04001P32K641L737L118J725J233J901K685L134L983N641P239P519O291
53851E55580M592L719M146N025M802K750j6j529j056K03N73l99k010l530m815
53836E68035n973p054q042q841r199q934q248p618p297p119o849o529o347o298
53822D63687o139n677n035m546m483m824n271n380m797l567k366k171l371n153
53808D00907o152n794m738l869l306k787k525k955l715l641k145j11R76M90r57
$$ plain form
53907 341951 340305 340062 342010 344802 346980 348578 350224 351842 353246 355069 357773 360295 361078 360307 359910
53892 359910 361321 364356 368491 374054 381661 391205 401898 412896 423756 434813 447118 461210 475854
53879 475854 488796 499030 507422 514819 520566 523537 523723 521958 518779 514544 510187 506824 504804 504001
53865 504001 504733 507374 511111 514229 515954 517187 519088 521773 524907 528890 534531 541770 549289 555580
53851 555580 560172 563891 568037 573062 577864 580614 580598 579069 578013 578216 578789 578390 576380 572850 568035
53836 568035 562062 555008 546966 538125 528926 519992 511744 504126 496829 489710 482861 476332 469985 463687
53822 463687 457548 451871 446836 442290 437807 432983 427712 422332 417535 413968 411602 409431 406060 400907
53808 400907 394755 388961 384223 380354 377048 374261 371736 368781 365066 361425 359280 359169 360145 360635 359678
53793C59678k320k953k814k277j768j427j166r87j027j095o24N98J786J807M53
53778C45864j219j935j289J89J643K334J763j09k482l800k822O4K774L376K035
53763C46386P36R39K134K969L129L360L991M319L663K285R93K66J41N46J402K432
53747C79691L188L334K990K826L649N508P212P297N717M191M342N677O082M377
53733D46081J772M07R30K199L054L433L514K891J366j33n50k89p37k217l553l838
53717D54330l517l406l621m044m775n526n525m800m568n474o368n933m649l951
53703C88173m129m440m636m845m520l169j752j579k097j604j07O94L20J88Q46
53688C57343R18k50j234j028q48j690k139o35J662K559K211K412L380L722L147
$$ plain form
53793 359678 357358 354405 351591 349314 347546 346119 344953 343966 342939 341844 341220 341818 343604 345411 345864
53778 345864 344645 342710 341421 341610 343253 345587 347350 347241 344759 340959 338137 338201 340975 344351 346386
53763 346386 347122 348061 350195 353164 356293 359653 363644 367963 371626 373911 374904 375170 375311 375857 377259 379691
53747 379691 382879 386213 389203 392029 395678 401186 408398 415695 421412 425603 429945 435622 441704 446081
53733 446081 447853 448260 449190 451389 454443 457876 461390 464281 465647 465514 464964 464675 463938 461721 458168 454330
53717 454330 450813 447407 443786 439742 434967 429441 423916 419116 414548 409074 402706 396773 392124 388173
53703 388173 384044 379604 374968 370123 365603 362434 360682 359103 357006 355402 355295 355989 356309 356497 357343
53688 357343 358261 358011 356777 355749 354901 353211 351072 350437 352099 354658 356869 359281 362661 366383 369530
53673C69530K738K679K087J204J440K707L015J521J5K88J681K467K313K117K465
53658C98267L336M503N197M316K098P31J940M487N532M236K672L001M936O531
53644D51783O666N919N288M766L622J780K67k5N08R28J228K115L441M064L600
53629D95950L169L668M330L840K275Q60K13j38o38r97q45n13q35k173l686l825
53613E00655k040Q9L56j298k606k024p45o43j398j276l3P67K77n73q48q55j069
53596D86736j092n65j01l38p69m14Q18K126K820K703J950J201J414K899M716N625
53580E09729N466N016M733M377L795L323L195L130K843K600K946M053N573O998
53566E67777P985Q360Q068P297O582O456O837O945O148M775L704L244K911K424
$$ plain form
53673 369530 372268 374947 377034 378238 379678 382385 385400 386921 386936 387224 388905 391372 393685 395802 398267
53658 398267 401603 406106 411303 415619 417717 418448 420388 424875 430407 434643 437315 440316 445252 451783
53644 451783 458449 464368 469656 474422 478044 479824 480091 480066 480574 481502 482730 484845 488286 492350 495950
53629 495950 499119 502787 507117 510957 513232 514092 514305 514167 513529 512532 511687 511174 510339 508166 504480 500655
53613 500655 498615 498704 499060 497762 495156 493132 492387 491744 490346 489070 489037 489804 490081 489508 488660 487805 486736
53596 486736 485644 485079 484978 484640 483871 483457 484275 486401 489221 491924 493874 495075 496489 499388 504104 509729
53580 509729 515195 520211 524944 529321 533116 536439 539634 542764 545607 548207 551153 555206 560779 567777
53566 567777 575762 584122 592190 599487 606069 612525 619362 626307 632455 637230 640934 644178 647089 649513
53552F49513K278L077M714O533P915Q405P756O264M677L374K096Q99O65J804L072
53537G13042K726P62j106j698j454j195j023r23j316k207k627j811m09K89j45
53522G00905j275k697l996m285k986r89J21O3M4P23J124K13j319j705k17K088
53506F85812L470L005J177n74j018k06Q07J333J701K294K706K598K738M050N831
53491G15724O242M836L368L448M462M865M676N302P162Q999R887J0523J1777J3075
53477H14346J3408J3252J4105J6235J8183J8787J8639J8904J9601J9967K0014
53466A005441K0717K2626K5011K6690K7299K7496K8140K9508L1229L2803L4048
53455A311008L5096L6106L7144L8185L9036L9407L9439L9912M1305M2752M2729
$$ plain form
53552 649513 651791 654868 659582 666115 674030 682435 690191 696455 701132 704506 706602 707501 708166 709970 713042
53537 713042 715768 716530 715424 713726 712272 711077 710054 709131 707815 705608 702981 701170 700761 701050 700905
53522 700905 699630 696933 692937 688652 685666 684677 684798 684861 684905 685628 686752 686965 685646 683941 683724 685812
53506 685812 689282 692287 693464 692890 691872 691666 692473 693806 695507 697801 700507 703105 705843 709893 715724
53491 715724 721966 726802 730170 733618 738080 742945 747621 752923 760085 769084 778971 789494 801271 814346
53477 814346 827754 841006 855111 871346 889529 908316 926955 945859 965460 985427 1005441
53466 1005441 1026158 1048784 1073795 1100485 1127784 1155280 1183420 1212928 1244157 1276960 1311008
53455 1311008 1346104 1382210 1419354 1457539 1496575 1535982 1575421 1615333 1656638 1699390 1742119
53444A742119M1011L9043L7985L7322L6123L4776L4343L4790L5006L4281L2714
53433B139513L0526K8220K7206K8612L1289L2474L0987K8457K6814K5917K4533
53422B454548K2466K0492J8926J7383J5439J2719Q952M760J638J75j003l372o460
53409B566663r018j1446j5125j9526k2238k2370k2054k3544k6327k8392k9184
53398B337439k9778l0737l1384l1221l0788l0690l0719l0413k9882k9384k8454
53387B003989k6213k2627j8900j6128j4043j1641q817o509n127l807j726O39K446
53374A871536L923N896Q289J0281J1823J3756J6321J8707K0408K2032K4274K7004
53362B054250K9859L2905L6093L8798M0551M1735M3020M4674M6920N0168N4203
$$ plain form
53444 1742119 1783130 1822173 1860158 1897480 1933603 1968379 2002722 2037512 2072518 2106799 2139513
53433 2139513 2170039 2198259 2225465 2254077 2285366 2317840 2348827 2377284 2404098 2430015 2454548
53422 2454548 2477014 2497506 2516432 2533815 2549254 2561973 2570925 2575685 2577323 2577498 2576495 2573123 2566663
53409 2566663 2557645 2546199 2531074 2511548 2489310 2466940 2444886 2421342 2395015 2366623 2337439
53398 2337439 2307661 2276924 2245540 2214319 2183531 2152841 2122122 2091709 2061827 2032443 2003989
53387 2003989 1977776 1955149 1936249 1920121 1906078 1894437 1885620 1879111 1873984 1870177 1868451 1869090 1871536
53374 1871536 1875459 1881355 1889644 1899925 1911748 1925504 1941825 1960532 1980940 2002972 2027246 2054250
53362 2054250 2084109 2117014 2153107 2191905 2232456 2274191 2317211 2361885 2408805 2458973 2513176
53351B513176N7805O0083O1761O4197O7512P0565P2592P3928P5184P6607P8407
53340C271817Q0854Q3732Q6188Q7397Q7169Q6000Q4887Q4784Q5643Q6149Q5066
53329D209686Q2648P9961P6878P2021O5055N7866N2634M9264M5656M0091L2572
53318D864332K4084J5507P371o2o883j3396j9797k6330l3584m2097n1467o0416
53306D657262o7942p3900p8275q0692q1318q1596q3028q5298q6594q5829q3667
53295C769123q1222p8774p6273p4125p2615p1218o9427o7774o7059o6814o5565
53284B978257o2643n8830n5141n1815m8669m5692m2930m0336l7899l5465l2525
53273B466312k8862k5349k3299k2917k3237k3475k3448k2645k0378j7285j5191
$$ plain form
53351 2513176 2570981 2631064 2692825 2757022 2824534 2895099 2967691 3041619 3116803 3193410 3271817
53340 3271817 3352671 3436403 3522591 3609988 3697157 3783157 3868044 3952828 4038471 4124620 4209686
53329 4209686 4292334 4372295 4449173 4521194 4586249 4644115 4696749 4746013 4791669 4831760 4864332
53318 4864332 4888416 4903923 4911294 4911232 4904349 4890953 4871156 4844826 4811242 4769145 4717678 4657262
53306 4657262 4589320 4515420 4437145 4356453 4275135 4193539 4110511 4025213 3938619 3852790 3769123
53295 3769123 3687901 3609127 3532854 3458729 3386114 3314896 3245469 3177695 3110636 3043822 2978257
53284 2978257 2915614 2856784 2801643 2749828 2701159 2655467 2612537 2572201 2534302 2498837 2466312
53273 2466312 2437450 2412101 2388802 2365885 2342648 2319173 2295725 2273080 2252702 2235417 2220226
53262B220226j4699j4188j2272r845q337p214n055k380j145j520j157J714O109
53249B150237R840J2040J3336J4453J5596J6783J8173K0154K3172K7014L0494
53238B351292L2508L3456L4708L6659L8303L8899L8904L8635L7252L3989K9633
53227B744238K5731K2825K0324J7682J4773J1375P269K810j403n501j0214j5623
53215B834286k0642k4139k6148k7791l0098l3098l6001l8181l9924m2021m4601
53204B471642m6753m7594m7383m7188m7674m8684m9841n0826n1046m9827m7394
53193A937432m5282m5004m6349m7397m6486m3859m1077l9145l7724l6193l4759
53182A474157l3955l3482l2363l0287k8096k6702k6041k5441k4401k2711k0353
$$ plain form
53262 2220226 2205527 2191339 2179067 2169222 2160885 2153671 2148616 2146236 2145091 2143571 2142414 2144128 2150237
53249 2150237 2160077 2172117 2185453 2199906 2215502 2232285 2250458 2270612 2293784 2320798 2351292
53238 2351292 2383800 2417256 2451964 2488623 2526926 2565825 2604729 2643364 2680616 2714605 2744238
53227 2744238 2769969 2792794 2813118 2830800 2845573 2856948 2864217 2867027 2865624 2860123 2849909 2834286
53215 2834286 2813644 2789505 2763357 2735566 2705468 2672370 2636369 2598188 2558264 2516243 2471642
53204 2471642 2424889 2377295 2329912 2282724 2235050 2186366 2136525 2085699 2034653 1984826 1937432
53193 1937432 1892150 1847146 1800797 1753400 1706914 1663055 1621978 1582833 1545109 1508916 1474157
53182 1474157 1440202 1406720 1374357 1344070 1315974 1289272 1263231 1237790 1213389 1190678 1170325
53171A170325j7967j6913j7962j9991k0852j9743j7989j7164j7200j7036j6568
53160I70940j6953j8894k1456k2999k2839k1548j9968j8460j7043j5714j4563
53149G60503j3822j3778j4296j4611j4155j3451j3462j4017j3807j2285j0596
53138F12223r942r972r715r254r241r342q738p823p758q271p722n828m504n074
53124D99039o202n927m488l481l220k671j655j237j884k807l424m092m845m670
53110D48436k977r47m18j679l102k972j258M89P57n50k365l825m921n685n489
53095D13494l888j684j99L24P82J607K124J696O07n64j555k024j348M39K119K391
53079D14321J187n70k012k626k106p45M17N98K34K21M53L9j105j865j347KJ098
$$ plain form
53171 1170325 1152358 1135445 1117483 1097492 1076640 1056897 1038908 1021744 1004544 987508 970940
53160 970940 953987 935093 913637 890638 867799 846251 826283 807823 790780 775066 760503
53149 760503 746681 732903 718607 703996 689841 676390 662928 648911 635104 622819 612223
53138 612223 602281 592309 582594 573340 564099 554757 546019 538196 530438 522167 514445 508617 504113 499039
53124 499039 492837 486910 482422 478941 475721 473050 471395 470158 468274 465467 462043 457951 453106 448436
53110 448436 445459 444512 444094 442415 439313 436341 435083 435572 436329 435779 433414 429589 424668 418983 413494
53095 413494 409606 407922 407723 408047 408829 410436 412560 414256 414863 414299 412744 410720 409372 409811 411930 414321
53079 414321 415508 414938 412926 410300 408194 407449 407866 408464 408698 408919 409372 409411 408306 406441 405094 405096 406194
53062D06194J447J388J506K155L170L821L401K106R79P38J034J093O57n2q97j765
53046D26975k319k352k258k573l047k757j319M10J132M34q61j510j046k15j26
53031D08568r07j544j295q05j138k033k123r21N03J073R44O09j59j431k097j056
53015C96188Q39J496K57j247j269N6J222J043n74k709l862l128j411p12j667k620
52999C81902j913k22N19q9o13j90K92n4l78Q64L538N546N045K472j2q55m99m41
52981C94912j286k253k407j806j130o74j14Q54J997K618K098N91q05j042l40J19
52965C91332j39k68M30J254J110K18j71M90J445J718J076K7n86k09P78J293R38
52948D00736O59J265K021J703N73j63m00j099k251k581j678p12m76j87Q87K068
$$ plain form
53062 406194 407641 409029 410535 412690 415860 419681 423082 425188 426167 426905 427939 429032 429689 429637 428740 426975
53046 426975 424656 422304 420046 417473 414426 411669 410350 410760 411892 412326 411465 409955 408909 408694 408568
53031 408568 407661 406117 404822 404017 402879 400846 398723 397802 398305 399378 400322 400931 400772 399341 397244 396188
53015 396188 397027 398523 398780 397533 396264 396320 397542 398585 398011 395302 391440 388312 386901 386189 384522 381902
52999 381902 379989 379767 380286 380197 379584 379394 379686 379632 379254 380118 383656 389202 394247 396719 396707 395852 395353 394912
52981 394912 393626 391373 388966 387160 386030 385356 385242 386096 388093 390711 392809 393400 392595 391553 391213 391332
52965 391332 391193 390925 391355 392609 393719 393937 393766 394256 395701 397419 398495 398522 397936 397727 398505 399798 400736
52948 400736 401395 402660 404681 406384 406957 406794 406394 405295 403044 400463 398785 398073 397597 397410 398297 400365
52932D00365K481K512K852L108K470J065l70j490k000j214Q34K598K668J678J305
52917D18862J742J663N13o02l85J376M053O587P618O397L853J804R25M38k16n36
52901D54092j61K67P9m05m62PN00N56j9j158k446l400l913m067l695k769k007
52884D30999k176k798k604j501r22j785l163l589k755j287L09J629K064J339P1
52869D13831r31j485j808j997k166k440k443j615m30k18j122j447o5J731K119
52854C99514J373R38Q73K99k40O51K237J919p53k765j689Q88J772N61n08k57J33
52837D04946m18j123p03O39J502J014l53j400j295k08R44J406J231R27P78P69
52821D08656Q94J159J418J606J922K397K486J704M27n36j094j794k572k514j231
$$ plain form
52932 400365 402846 405358 408210 411318 413788 414853 414483 412993 410993 409779 410613 413211 415879 417557 418862
52917 418862 420604 422267 422780 422178 421793 423169 427222 433809 441427 447824 451677 453481 454406 454844 454628 454092
52901 454092 453931 454198 454277 453872 453410 453417 453917 454473 454454 453296 450850 447450 443537 439470 435775 433006 430999
52884 430999 428823 426025 423421 421920 420998 419213 416050 412461 409706 408419 408728 410357 412421 413760 413831
52869 413831 412900 411415 409607 407610 405444 403004 400561 398946 398516 398298 397176 395729 395664 397395 399514
52854 399514 400887 401825 402698 402997 402757 403408 405645 407564 406811 404046 402357 403245 405017 405578 405070 404813 404946
52837 404946 404528 403405 402702 403341 404843 405857 405504 404104 402809 402601 403545 404951 406182 407109 407887 408656
52821 408656 409550 410709 412127 413733 415655 418052 420538 422242 422669 422133 421039 419245 416673 414159 412928
52806D12928L30J037R16P67R43J205J368J317O95n67j608j466m77J38J46M65J172
52789D19309Q09j335l567l946l199l662n626o748n442l055j783j973k587l114
52775C74081l558l418k179m97M07L92L49P43J339K090L065L550K688J067L11O35
52759C81065K65j960m700n821n039l657k424r78P83K072K268J788J525J765J877
52744C68829J109l06j019O9K295L653K917Q10j108j878j270M38J993J523j329
52729C76726m181m191j447J107J166o63k234k375j460k95Q04J936L081L781L463
52714C75218K200P31m75j680k910l259k047j49R28R59Q39P80J43j017j707j591
52698C66963j405j353o73O27J158K94n29M1J110J099M25P81K267L153K563J715
$$ plain form
52806 412928 413258 414295 415211 415978 416921 418126 419494 420811 421506 420939 419331 417865 417388 417526 417672 418137 419309
52789 419309 420118 418783 415216 411270 408071 404409 398783 392035 386593 383538 381755 379782 377195 374081
52775 374081 370523 367105 364926 364429 364836 365228 365577 366320 367659 369749 372814 376364 379052 380119 380430 381065
52759 381065 381330 379370 374670 368849 363810 360153 357729 356751 357534 359606 361874 363662 365187 366952 368829
52744 368829 369938 369632 368613 368682 370977 374630 377547 378357 377249 375371 374101 374539 376532 378055 376726
52729 376726 372545 368354 366907 368014 369180 368517 366283 363908 362448 362153 362957 364893 367974 371755 375218
52714 375218 377418 378149 377674 375994 373084 369825 367778 367629 368557 369516 370355 371135 371278 370261 368554 366963
52698 366963 365558 364205 363532 364159 365317 365611 365082 365123 366233 367332 367757 368538 370805 373958 376521 378236
52682C78236K051L462M891N721N934N552M557L161J897J465K175L209K986R74
52668D26271j192j406L26J899J759M11q28j431j557j339j004j100j900k936l483
52653D12490l244k396j377q24j082j562j211L4R73P74J30J06M71K44m87l93J125
52636D03771K722K501L35j848k159p38P07J060Q20Q52R63M84l37n90k13j21o56
52619D07553j088r80j063k024l296l766l072j548L53J897K076Q57j66M86K167
52604C98386K967K378J765K102K595K024N01q58j377j199n20Q62L028N317O529
52589D24500O001M335K680J273n64k683l460j880M59R07r45l001l678l501l317
52574D17126k615p42J476K718L016L341L931M317M677N669O857O715M634J930
$$ plain form
52682 378236 380287 383749 388640 394361 400295 405847 410404 413565 415462 416927 419102 422311 425297 426271
52668 426271 425079 423673 423999 425898 427657 428068 427240 425809 424252 422913 421909 420809 418909 415973 412490
52653 412490 409246 406850 405473 404649 403567 402005 400794 400828 401801 402575 402705 402811 403282 403526 403039 402646 403771
52636 403771 406493 408994 409329 407481 405322 404584 405291 406351 407171 408023 408986 409470 409133 408543 408330 408209 407553
52619 407553 406465 405485 404422 402398 399102 395336 392264 390716 391069 392966 395042 395899 395733 396219 398386
52604 398386 401353 403731 405496 407598 410193 412217 412718 411860 410483 409284 408764 409626 412654 417971 424500
52589 424500 430501 434836 437516 438789 438225 435542 432082 430202 430661 431568 430623 427622 423944 420443 417126
52574 417126 414511 413769 415245 417963 420979 424320 428251 432568 437245 442914 449771 456486 461120 463050
52560D63050K14m98j319k758m131m534l746k273r95p94j969l760m800m319k828
52545D24540j384m05L90J064J130M18l71n19l27n09q45l53J028J983J523M41K99
52528D28103J437K797L370L032K088P93m62j199j352j323j342j206q17m98n41
52513D32880p24o34k03L04O22M73m48k045l474l729k663j076K12R67J139N30o28
52496D21503j260n00R51J401L58q07q42l85q36k059k516j571m11k87r56j390j212
52479D09181o14N00K308M226N071M165J978k82j364o55J362L243L645K312L5k048
52463D33063k995k395p13Q96J535J254O96L76M97R87J484J698J985K849L741L423
52447D48381K056J621L137M710L922J328m27m71m61j424k134j406r7L27k47j095
$$ plain form
52560 463050 463264 462766 461447 458689 454558 450024 446278 444005 443010 442216 440247 436487 431687 427368 424540
52545 424540 423156 422751 423141 424205 425335 425753 425382 424863 424536 424027 423182 422829 423857 425840 427363 427804 428103
52528 428103 429540 432337 435707 438739 440827 441620 441158 439959 438607 437284 435942 434736 433919 433421 432880
52513 432880 432156 431522 431319 431623 432245 432718 432270 430225 426751 423022 420359 419283 419495 420462 421601 422131 421503
52496 421503 420243 419743 420694 422095 422453 421646 420804 420419 419583 417524 415008 413437 413026 412739 411783 410393 409181
52479 409181 408567 409067 411375 415601 420672 424837 426815 426533 425169 424514 425876 429119 432764 435076 435111 433063
52463 433063 430068 427673 426960 427856 429391 430645 431341 431717 432214 433201 434685 436383 438368 441217 444958 448381
52447 448381 450437 452058 455195 459905 463827 465155 464728 464257 463796 462372 460238 458832 458735 459062 458815 457720
52431D57720k009k939l311k804k063j695j377q59q00j504j730k03K268L621L100
52416D45415J731N68j37k53L16Q33J66j590k855k287q4K528M436N074M507L425
52400D61793K627K360K438K732L172L436L197K426J092r98l437n004n100m772
52386D65962n181n702m924l063j720j413j171n65l30n75l93K07j51j707k429p81
52370D36064J855L068K542J699J172M53l69k95J142L236M893N278M043J883M80
52355D67144Q60K089K566K099J698J820K245L310N746R127J1781J2493J1294Q685
52341E42957N338K573J521J415J79k750n433o043n158m450m255l725k744k217
$$ plain form
52431 457720 455711 452772 449461 446657 444594 442899 441522 440663 439863 438359 436629 436426 438694 442315 445415
52416 445415 447146 447714 447577 447324 447640 448473 448639 447049 444194 441907 441823 444351 448787 453861 458368 461793
52400 461793 464420 466780 469218 471950 475122 478558 481755 484181 485273 484275 480838 475834 470734 465962
52386 465962 460781 455079 450155 447092 445372 443959 442788 442223 441893 441318 440925 441132 440981 439274 436845 436064
52370 436064 437919 440987 443529 445228 446400 446853 446484 446189 447331 450567 455460 460738 464781 466664 467144
52355 467144 468004 470093 472659 474758 476456 478276 480521 483831 489577 498704 510485 522978 534272 542957
52341 542957 548295 550868 552389 553804 553983 551233 545800 539757 534599 530149 525894 522169 519425 517208
$$ [...]
##END NTUPLES=NMR SPECTRUM
##END=
