
##TITLE=AC1222_Punto_6074794_1Xs9jaGfa0
##JCAMPDX= 6.0         $$ Bruker NMR JCAMP-DX V2.0
##DATA TYPE= NMR SPECTRUM
##DATA CLASS= NTUPLES
##ORIGIN= BRUKER
##OWNER= Administrator
$$ 1.72 TOPSPIN		Version 2.1
$$ 2012-05-09 01:39:05.125 -0500  Administrator@TOPSPIN
$$ Compression mode = diff/dup
##.OBSERVE FREQUENCY= 400.13188235
##.OBSERVE NUCLEUS= ^1H
##.ACQUISITION MODE= SIMULTANEOUS (DQD)
##.ACQUISITION SCHEME= undefined
##.AVERAGES= 64
##.DIGITISER RES= 22
##SPECTROMETER/DATA SYSTEM= spect
##.PULSE SEQUENCE= noesygpps1d.comp
##.SOLVENT NAME= COFFEE_meoh
##.SHIFT REFERENCE= INTERNAL, COFFEE_meoh, 1, 14.96684
##AUDIT TRAIL= $$ (NUMBER, WHEN, WHO, WHERE, PROCESS, VERSION, WHAT)
$$ ##TITLE= Audit trail, TOPSPIN		Version 2.1
$$ ##JCAMPDX= 5.01
$$ ##ORIGIN= Bruker BioSpin GmbH
$$ ##OWNER= Administrator
$$ $$ C:\Bruker\TOPSPIN/data/COFFEE/nmr/AC1222_Punto_6074794_1Xs9jaGfa0/112/pdata/1/auditp.txt
$$ ##AUDIT TRAIL=  $$ (NUMBER, WHEN, WHO, WHERE, PROCESS, VERSION, WHAT)
(   1,<2012-05-09 01:39:00.390 -0500>,<Administrator>,<TOPSPIN>,<go>,<TOPSPIN 2.1>,
      <created by zg
	started at 2012-05-09 01:27:30.125 -0500,
	POWCHK enabled, PULCHK disabled,
       configuration hash MD5:
       AF F2 23 6B 01 CD 40 DD E5 A1 38 A0 06 EA F7 77
       data hash MD5: 64K
       48 8A F8 49 02 AA 3A D7 B3 E4 F4 7B 2F 72 69 BB>)
(   2,<2012-05-09 01:39:03.046 -0500>,<Administrator>,<TOPSPIN>,<proc1d>,<TOPSPIN 2.1>,
      <Start of raw data processing
       efp LB = 0.3 FT_mod = 6 PKNL = 1 PHC0 = 0 PHC1 = 0 SI = 128K 
       data hash MD5: 128K
       29 15 F9 37 7A DB 1C D5 C2 26 E4 CA 08 16 AC 49>)
(   3,<2012-05-09 01:39:04.343 -0500>,<Administrator>,<TOPSPIN>,<proc1d>,<TOPSPIN 2.1>,
      <pk PHC0 = 34.4751 PHC1 = 0 
       data hash MD5: 128K
       A5 D0 7A 23 CA CD F2 A2 BA 6F A4 CE C4 58 04 B7>)
(   4,<2012-05-09 01:39:04.562 -0500>,<Administrator>,<TOPSPIN>,<proc1d>,<TOPSPIN 2.1>,
      <abs ABSG = 1 
       data hash MD5: 128K
       83 45 A5 EB F2 EF A3 B4 9C 95 E5 B5 CC 55 8B 2F>)
(   5,<2012-05-09 01:39:04.640 -0500>,<Administrator>,<TOPSPIN>,<proc1d>,<TOPSPIN 2.1>,
      <abs ABSG = 2 
       data hash MD5: 128K
       FD 1D 17 7A DD F2 F3 E5 1D 81 2E C4 B4 D4 DB 51>)
(   6,<2012-05-09 01:39:04.687 -0500>,<Administrator>,<TOPSPIN>,<proc1d>,<TOPSPIN 2.1>,
      <abs ABSG = 3 
       data hash MD5: 128K
       0A BB FC 1A 6E 44 04 AD A1 13 AE 3A 51 8B 45 6B>)
(   7,<2012-05-09 01:39:04.812 -0500>,<Administrator>,<TOPSPIN>,<proc1d>,<TOPSPIN 2.1>,
      <abs ABSG = 4 
       data hash MD5: 128K
       97 C6 08 CD EE 56 36 F6 45 DB 15 04 11 D5 48 47>)
(   8,<2012-05-09 01:39:05.046 -0500>,<Administrator>,<TOPSPIN>,<proc1d>,<TOPSPIN 2.1>,
      <abs ABSG = 5 
       data hash MD5: 128K
       50 A1 E1 17 00 E3 B5 40 97 0C 76 D7 47 43 F9 EB>)
$$ ##END=
$$ 
$$ $$ hash MD5
$$ $$ 60 97 76 E7 AB 29 41 CF 11 66 19 3F 7E CC 86 03
##$RELAX= 
##$RELAX= 
##$RELAX= 
##$RELAX= 
##$RELAX= 
##$RELAX= 
##$RELAX= 
##$RELAX= 
$$ Bruker specific parameters
$$ [...]
##$TP07= 0
##$TPNAME0= <>
##$TPNAME1= <>
##$TPNAME2= <>
##$TPNAME3= <>
##$TPNAME4= <>
##$TPNAME5= <>
##$TPNAME6= <>
##$TPNAME7= <>
##$TPOAL= (0..7)
0.5 0.5 0.5 0.5 0.5 0.5 0.5 0.5
##$TPOFFS= (0..7)
0 0 0 0 0 0 0 0
##$TUNHIN= 0
##$TUNHOUT= 0
##$TUNXOUT= 0
##$USERA1= <user>
##$USERA2= <user>
##$USERA3= <user>
##$USERA4= <user>
##$USERA5= <user>
##$V9= 5
##$VALIST= <valist>
##$VCLIST= <CCCCCCCCCCCCCCC>
##$VD= 0
##$VDLIST= <DDDDDDDDDDDDDDD>
##$VPLIST= <PPPPPPPPPPPPPPP>
##$VTLIST= <TTTTTTTTTTTTTTT>
##$WBST= 1024
##$WBSW= 4
##$XGAIN= (0..3)
0 0 0 0
##$XL= 0
##$YL= 0
##$YMAX_a= 10997524
##$YMIN_a= -6059671
##$ZGOPTNS= <>
##$ZL1= 120
##$ZL2= 120
##$ZL3= 120
##$ZL4= 120
##$ABSF1= 14.96684
##$ABSF2= -5.58569
##$ABSG= 5
##$ABSL= 3
##$ALPHA= 0
##$AQORDER= 0
##$ASSFAC= 0
##$ASSFACI= 0
##$ASSFACX= 0
##$ASSWID= 0
##$AUNMP= <proc_prof1d_extract.lims>
##$AXLEFT= 0
##$AXNAME= <>
##$AXNUC= <1H>
##$AXRIGHT= 0
##$AXTYPE= 0
##$AXUNIT= <>
##$AZFE= 0.1
##$AZFW= 0.1
##$BCFW= 0
##$BC_mod= 0
##$BYTORDP= 0
##$COROFFS= 0
##$CY= 15
##$DATMOD= 1
##$DC= 0
##$DFILT= <>
##$DTYPP= 0
##$F1P= 0
##$F2P= 0
##$FCOR= 0.5
##$FTSIZE= 131072
##$FT_mod= 6
##$GAMMA= 0
##$GB= 0
##$INTBC= 1
##$INTSCL= 1
##$ISEN= 128
##$LB= 0.3
##$LEV0= 0
##$LPBIN= 0
##$MAXI= 10000
##$MC2= 0
##$MEAN= 0
##$ME_mod= 0
##$MI= 0
##$NCOEF= 0
##$NC_proc= -3
##$NLEV= 6
##$NOISF1= 0
##$NOISF2= 0
##$NSP= 0
##$NTH_PI= 0
##$NZP= 0
##$OFFSET= 14.96684
##$PC= 1
##$PHC0= 34.4751
##$PHC1= 0
##$PH_mod= 1
##$PKNL= yes
##$PPARMOD= 0
##$PPDIAG= 0
##$PPIPTYP= 0
##$PPMPNUM= 2147483647
##$PPRESOL= 1
##$PSCAL= 4
##$PSIGN= 0
##$PYNMP= <proc.py>
##$REVERSE= no
##$SF= 400.13000551208
##$SI= 131072
##$SIGF1= 0
##$SIGF2= 0
##$SINO= 400
##$SIOLD= 131072
##$SPECTYP= <>
##$SREGLST= <1H.CDCl3>
##$SSB= 0
##$STSI= 131072
##$STSR= 0
##$SW_p= 8223.68421052632
##$SYMM= 0
##$S_DEV= 0
##$TDeff= 65536
##$TDoff= 0
##$TI= <>
##$TILT= no
##$TM1= 0
##$TM2= 0
##$TOPLEV= 0
##$USERP1= <user>
##$USERP2= <user>
##$USERP3= <user>
##$USERP4= <user>
##$USERP5= <user>
##$WDW= 1
##$XDIM= 131072
##$YMAX_p= 424117616
##$YMIN_p= -78317110
##$CURPLOT= <Network HP LaserJet P1505>
##$CURPRIN= <$Network HP LaserJet P1505>
##$DFORMAT= <normdp>
##$LAYOUT= <+/1D_H.xwp>
##$LFORMAT= <normlp>
##$PFORMAT= <normpl>
##$SURQMSG= 1
$$ End of Bruker specific parameters
$$ ---------------------------------
##NTUPLES= NMR SPECTRUM
##VAR_NAME=  FREQUENCY,     SPECTRUM/REAL,   SPECTRUM/IMAG
##SYMBOL=    X,             R,               I
##VAR_TYPE=  INDEPENDENT,   DEPENDENT,       DEPENDENT
##VAR_FORM=  AFFN,          ASDF,            ASDF
##VAR_DIM=   131072,        131072,          131072
##UNITS=     HZ,            ARBITRARY UNITS, ARBITRARY UNITS
##FACTOR=    0.0627417313425165, 1,          1
##FIRST=     8223.62146879498, -3993,        -109849
##LAST=      0,             -970,            -111104
##MIN=       0,             -78317110,       0
##MAX=       8223.62146879498, 424117616,    0
$$ Real data points
##PAGE= N=1
##DATA TABLE= (X++(R..R)), XYDATA
$$ [...]
63687C57520K47J465J362J252K134L032K875K323K576L514M121M060L736L368
63673C93585K963K850L353M046M117L477K873K937L571M246M453L944L034K665
63659D42114L562N222O216N750M455L408K726J640j88j942k494j711o85n58j389
63644D66126k285k514k089j429r06q40j363j932j574q9J493K253K667L628M705
63629D65851M674L686L319M150M823M277L453L587M082L590K339J680J825J819
63615E13155J447J385J526J032K76P68K528L515K642J528J897K856K486Q90l37
63600E37594q57j717l084l844l500k846k466k111j844k308l364l804l003j739
63586E01107p37M32K266M128N117N334N362N083M077K910K953M776P396R299R837
$$ y = [357520, 357767, 359232, 360594, 361846, 363980, 367012, 369887, 372210, 374786, 378300, 382421, 386481, 390217, 393585, 396548, 399398, 402751, 406797, 410914, 414391, 417264, 420201, 423772, 428018, 432471, 436415, 439449, 442114, 445676, 450898, 457114, 462864, 467319, 470727, 473453, 475093, 474905, 472963, 470469, 468758, 468073, 467515, 466126, 463841, 461327, 459238, 457809, 456903, 456063, 454700, 452768, 451194, 451105, 452598, 454851, 457518, 461146, 465851, 470525, 474211, 477530, 481680, 486503, 490780, 494233, 497820, 501902, 505492, 507831, 509511, 511336, 513155, 514602, 515987, 517513, 518545, 518821, 519589, 522117, 525632, 528274, 529802, 531699, 534555, 537041, 537931, 537594, 536737, 535020, 531936, 528092, 524592, 521746, 519280, 517169, 515325, 513017, 509653, 505849, 502846, 501107, 500370, 500802, 503068, 507196, 512313, 517647, 523009, 528092, 532169, 535079, 538032, 542808, 550204, 559503, 569340]
63571E69340R631R773J0775J2162J3159J3676J4336J5590J7191J8625J9696K0565
63559G44519K1631K3342K5785K8433L0792L3110L5872L8761M1100M3291M6499
63548A113135N0505N3231N3177N1305M9427M7653M4566L9260L2035K3646J5214
63537A573154Q400M131J202k394o675r704j0636j1194j3360j7029k0935k4826
63525A470134k9255l3849l7257l8838l9258l9150l8240l6167l3407l0664k7819
63514A086230k4316k0454j7477j5951j4734j2111p883l615p54Q55K357M463P171
63501I83781J0409J4140J7969K1296K3913K5970K7475K8420K9374L1100L3518
63490A247365L5851L8123M1535M6767N2642N7299N9995O0735N8626N2200M1683
$$ y = [569340, 578971, 588744, 599519, 611681, 624840, 638516, 652852, 668442, 685633, 704258, 723954, 744519, 766150, 789492, 815277, 843710, 874502, 907612, 943484, 982245, 1023345, 1066636, 1113135, 1163640, 1216871, 1270048, 1321353, 1370780, 1418433, 1462999, 1502259, 1534294, 1557940, 1573154, 1581554, 1585685, 1586887, 1584493, 1577818, 1568114, 1557478, 1546284, 1532924, 1515895, 1494960, 1470134, 1440879, 1407030, 1369773, 1330935, 1291677, 1252527, 1214287, 1178120, 1144713, 1114049, 1086230, 1061914, 1041460, 1023983, 1008032, 993298, 981187, 973304, 969689, 968935, 969790, 972147, 976610, 983781, 994190, 1008330, 1026299, 1047595, 1071508, 1097478, 1124953, 1153373, 1182747, 1213847, 1247365, 1283216, 1321339, 1362874, 1409641, 1462283, 1519582, 1579577, 1640312, 1698938, 1751138, 1792821]
63479A792821K9684J8875R765J450o154j1875j4879j5682j5569j5719j7035k0008
63467A735674k4312k9058l3878l9294m5530n1412n5052n5609n3924n1645n0040
63456A245920m9370m8828m7183m4045m0403l7422l4984l2195k9099k6785k5595
63445H30011k4450k2486k0269j8614j7121j5010j2745j1525j1424j1255j0228
63434F54884q632o886m948k969j503p10j56L02K86j69l19J21N01M87Q37K016K927
63417F36069K283Q09N76K199L965M101K772J301L09n51j495k164k232j939j816
63402F44187k116k559k579j870o64N81J633K435K787K540K011J782K034K705M208
63387F57115P176J1197J4683J6594J7560J8594J9632K0329K1563K4507K8521L1753
$$ y = [1792821, 1822505, 1841380, 1851145, 1852595, 1846441, 1834566, 1819687, 1804005, 1788436, 1772717, 1755682, 1735674, 1711362, 1682304, 1648426, 1609132, 1563602, 1512190, 1457138, 1401529, 1347605, 1295960, 1245920, 1196550, 1147722, 1100539, 1056494, 1016091, 978669, 943685, 911490, 882391, 855606, 830011, 805561, 783075, 762806, 744192, 727071, 712061, 699316, 687791, 676367, 665112, 654884, 646252, 639366, 634418, 631449, 629946, 629236, 629080, 629382, 629668, 629499, 629180, 629301, 629802, 630289, 631126, 633142, 636069, 638352, 639161, 639737, 641936, 645901, 650002, 652774, 654075, 654384, 653833, 652338, 650174, 647942, 646003, 644187, 642071, 639512, 636933, 635063, 634399, 634980, 636613, 639048, 641835, 644375, 646386, 648168, 650202, 652907, 657115, 664291, 675488, 690171, 706765, 724325, 742919, 762551, 782880, 804443, 828950, 857471, 889224]
63375H89224L4022L7311M2488M7211M8482M6163M2519L9079L5741L2485L0069
63364A324794K8838K8513K9498L2810L8020M2823M5777M8189N1962N6585N9830
63353A787639O0660N9527N6001M8414L6784K4380J4922Q924L984j826q167j3772
63341B077470j8140k1492k4079k6367k9320l3740l9374m5120m9977n3415n5147
63330A681299n5100n3696n1684m9593m7572m5624m3530m0571l6083l0492k5316
63319A202038k1713j9401j7245j4469j0962o955k848J016M834R113J3557J6877
63307A153842J8517J9907K2957K7647L2270L5840L9022M2628M6467M9965N2833
63296A541895N4825N5827N6467N7464N8068N6439N2035M6168L9498L0639J8757
$$ y = [889224, 923246, 960557, 1003045, 1050256, 1098738, 1144901, 1187420, 1226499, 1262240, 1294725, 1324794, 1353632, 1382145, 1411643, 1444453, 1482473, 1525296, 1571073, 1619262, 1671224, 1727809, 1787639, 1848299, 1907826, 1963827, 2012241, 2049025, 2073405, 2088327, 2097251, 2101235, 2099409, 2091242, 2077470, 2059330, 2037838, 2013759, 1987392, 1958072, 1924332, 1884958, 1839838, 1789861, 1736446, 1681299, 1626199, 1572503, 1520819, 1471226, 1423654, 1378030, 1334500, 1293929, 1257846, 1227354, 1202038, 1180325, 1160924, 1143679, 1129210, 1118248, 1111293, 1108445, 1109461, 1114295, 1123408, 1136965, 1153842, 1172359, 1192266, 1215223, 1242870, 1275140, 1310980, 1350002, 1392630, 1439097, 1489062, 1541895, 1596720, 1652547, 1709014, 1766478, 1824546, 1880985, 1933020, 1979188, 2018686, 2049325, 2068082]
63285B068082O252l070q035j0830j3954j7887k1731k4820k7411l0502l5023m0653
63273A840418m5800m9426n2212n5055n7224n7343n5540n2984m9813m5374m0366
63262A279281l6539l3986l0791k6206k2286k1215k2560k4327k5534k6382k6918
63251I82537k6953k6685k6239k5105k3127k1409k1117k1722k1550j9802j7092
63240G31736j4264j1753r921r003q615q120p522p412p999q766r093q758p876o764
63226F05870n821n256n039n098n209m647k758j84J356J074O2m00n27j033j480
63211E70910j022p3K80J25M24J174J493J519K503M651O506P014O772O563O067
63196F14906M980M229M851O448P857Q860J0108J1644J2537J2189J1357J1595J3826
$$ y = [2068082, 2074334, 2071264, 2063229, 2052399, 2038445, 2020558, 1998827, 1974007, 1946596, 1916094, 1881071, 1840418, 1794618, 1745192, 1692980, 1637925, 1580701, 1523358, 1467818, 1414834, 1365021, 1319647, 1279281, 1242742, 1208756, 1177965, 1151759, 1129473, 1108258, 1085698, 1061371, 1035837, 1009455, 982537, 955584, 928899, 902660, 877555, 854428, 833019, 811902, 790180, 768630, 748828, 731736, 717472, 705719, 695798, 686795, 678180, 670060, 662538, 655126, 647127, 638361, 629268, 620510, 612634, 605870, 600049, 594793, 589754, 584656, 579447, 574800, 572042, 571858, 573214, 574288, 574350, 573950, 573423, 572390, 570910, 569888, 569815, 570095, 570220, 570644, 571818, 573311, 574830, 577333, 581984, 588490, 595504, 602276, 608839, 614906, 619886, 624115, 628966, 635414, 643271, 652131, 662239, 673883, 686420, 698609, 709966, 721561, 735387]
63183G35387J7381K0552K2258K3096K4416K6576K8785L0446L1719L2714L3249
63172A026579L3563L4181L4712L4052L2369L1457L2259L3298L2909L1824L1838
63161A389041L2768L2737L1230K9792K9279K8369K5682K1922J8635J5672J1331
63150A666458M813k598r115j4527k0094k6591l2840l6669l7133l5444l3525l2090
63138A390645l0454k7832k4223k0283j6795j4184j2081r518n928j800J977N146
63126A234670P977J0556J2769J4695J6301J7106J6955J6887J8128K0308K1673
63115A408025K1186J9483J7612J5918J4394J3066J1563R227O127L005j80m570
63103A534856j0552j6660k1318k4835k8575l2763l6229l7928l7726l6094l4080
$$ y = [735387, 752768, 773320, 795578, 818674, 843090, 869666, 898451, 928897, 960616, 993330, 1026579, 1060142, 1094323, 1129035, 1163087, 1195456, 1226913, 1259172, 1292470, 1325379, 1357203, 1389041, 1421809, 1454546, 1485776, 1515568, 1544847, 1573216, 1598898, 1620820, 1639455, 1655127, 1666458, 1671271, 1668673, 1659558, 1645031, 1624937, 1598346, 1565506, 1528837, 1491704, 1456260, 1422735, 1390645, 1360191, 1332359, 1308136, 1287853, 1271058, 1256874, 1244793, 1235275, 1229347, 1227547, 1229524, 1234670, 1242647, 1253203, 1265972, 1280667, 1296968, 1314074, 1331029, 1347916, 1366044, 1386352, 1408025, 1429211, 1448694, 1466306, 1482224, 1496618, 1509684, 1521247, 1530474, 1536601, 1539606, 1539426, 1534856, 1524304, 1507644, 1486326, 1461491, 1432916, 1400153, 1363924, 1325996, 1288270, 1252176, 1218096]
63092A218096l3107l3613l4070l2589k9430k6660k5267k4144k2246k0289j9256
63081I17425j8466j6439j3219j0421q975p973o165l783k196k111k737k850k204
63068H19886j541j466j649j234K55K477M588N842O113N934N894N982N779N346
63054H62206N411O347P411P422O078M220K965K835L515M248M567M828N604O499
63040I34156O267M529K593J870K223K774L526M857N969N571M027L129L381L329
63026I88201K226J623K985N186O098N750O034P596Q993R176R138J0313J2529J4573
63012A090421J5971J7186J8372J9092J9429K0523K3421K7723L1896L4886L7044
63001A355964L9344M2138M5076M8048N1579N6044O0782O4492O6684O8499P1654
$$ y = [1218096, 1184989, 1151376, 1117306, 1084717, 1055287, 1028627, 1003360, 979216, 956970, 936681, 917425, 898959, 882520, 869301, 858880, 849905, 841932, 835767, 831984, 829788, 827677, 824940, 822090, 819886, 818345, 816879, 815230, 813996, 814251, 816728, 821316, 827158, 833271, 839205, 845099, 851081, 856860, 862206, 867617, 873964, 881375, 888797, 894875, 899095, 902060, 904895, 908410, 912658, 917225, 922053, 927657, 934156, 940423, 944952, 947545, 949415, 951638, 954412, 957938, 962795, 968764, 974335, 978362, 981491, 984872, 988201, 990427, 992050, 995035, 1000221, 1006319, 1012069, 1018103, 1025699, 1034692, 1043868, 1053006, 1063319, 1075848, 1090421, 1106392, 1123578, 1141950, 1161042, 1180471, 1200994, 1224415, 1252138, 1284034, 1318920, 1355964, 1395308, 1437446, 1482522, 1530570, 1582149, 1638193, 1698975, 1763467, 1830151, 1898650, 1970304]
62990A970304P6366Q0749Q2771Q2614Q2375Q3377Q4762Q5157Q4594Q3915Q3132
62979B880116Q1688P9865P8457P7213P4991P1453O7227O2259N5428M6158L5013
62968C609868K2375P990p536k2402l5563m7613n8804o7840p3906p8327q2479q5355
62956C080408q5044q1676p6894p1258o4355n6832m9867m2886l4204k4224j5518
62945B477650r220l640K674Q708J3059J6366J9991K3723K6448K8150K9624L0916
62933B664449L1518L1606L1741L1563L0026K6770K2451J7759J2813P232J46r257
62921B898817k0425l1205l9856m6909n4029o1532o8200p3220p6898p9325p9852
62910B267366p8268p5351p1695o7111o1873n7528n5322n4424n2908n0211m7395
$$ y = [1970304, 2046670, 2127419, 2210190, 2292804, 2375179, 2458556, 2543318, 2628475, 2713069, 2796984, 2880116, 2961804, 3041669, 3120126, 3197339, 3272330, 3343783, 3411010, 3473269, 3528697, 3574855, 3609868, 3632243, 3640233, 3632697, 3610295, 3574732, 3527119, 3468315, 3400475, 3326569, 3248242, 3165763, 3080408, 2995364, 2913688, 2836794, 2765536, 2701181, 2644349, 2594482, 2551596, 2517392, 2493168, 2477650, 2468430, 2464790, 2467464, 2476172, 2489231, 2505597, 2525588, 2549311, 2575759, 2603909, 2633533, 2664449, 2695967, 2727573, 2759314, 2790877, 2820903, 2847673, 2870124, 2887883, 2900696, 2907928, 2908074, 2898817, 2878392, 2847187, 2807331, 2760422, 2706393, 2644861, 2576661, 2503441, 2426543, 2347218, 2267366, 2189098, 2113747, 2042052, 1974941, 1913068, 1855540, 1800218, 1745794, 1692886, 1642675, 1595280]
62899A595280m4983m2005l7913l4198l2751l3041l2510k9967k7171k6270k6880
62888A227591k6915k5598k4105k3410k3108k2620k2135k1675k0462j8200j6093
62877I83270j5435j5692j5157j3278j1247j0267j0058r471p969o146n104n489
62865H57957p029q789r756r242p080l973j601j474l266m866m587k888j523j529
62851G90354k629l954m618l970k314j213k113m581o578o541m668k336r51j143
62837G42745k260k635j291N61O86j269l121k923j228J77Q22J429J871J020j054
62822G33530k275j076J180J660k27k022j499N10J605J263J119J969K351R25j186
62807G37827j884j089n41q67p47N60J565O16j442k120m34K075L519L650L395L338
$$ y = [1595280, 1550297, 1508292, 1470379, 1436181, 1403430, 1370389, 1337879, 1307912, 1280741, 1254471, 1227591, 1200676, 1175078, 1150973, 1127563, 1104455, 1081835, 1059700, 1038025, 1017563, 999363, 983270, 967835, 952143, 936986, 923708, 912461, 902194, 892136, 882665, 874696, 868550, 863446, 857957, 850928, 842139, 832383, 823141, 816061, 812088, 810487, 809013, 805747, 800881, 796294, 793406, 791883, 790354, 787725, 783771, 779153, 775183, 772869, 771656, 769543, 764962, 758384, 751843, 747175, 744839, 743888, 742745, 740485, 737850, 736559, 737120, 737806, 736537, 733416, 730493, 729265, 729442, 730264, 731693, 733564, 734584, 733530, 731255, 730179, 731359, 733019, 732792, 730770, 729271, 729781, 731386, 732649, 733768, 735737, 738088, 739013, 737827, 735943, 734854, 734313, 733446, 732699, 733259, 734824, 735440, 733998, 731878, 731444, 733519, 737038, 740688, 744083, 747421]
62791G47421L402L418L307K868K049J279J059J312J675K300L558M863M746K659
62777G85916n3j705k189k485k716k017k50J412J960J716J552J785K344L233M240
62762G92743M798M815N078O133P269P323O186M897M530N572P889J0584J2236J2123
62748H92176J1182J0988J2000J3362J4321J5011J5855J6920J8081J9378K1125
62737A060399K3815K7618L1668L4483L5678L6795L9469M3311M6776M9778N3924
62726A483714N9964O6487P1779P5958Q0520Q6550R4053J02199J09493J14332J16298
62715B461347J16646J16721J16082J12736J05144R3552P9508O4569M9350L3361
62705C349016J5672l902k4086m2679n7961o9723p9201q7862r6018j02588j06465
$$ y = [747421, 750823, 754241, 757548, 760416, 762465, 763744, 764803, 766115, 767790, 770090, 773648, 778511, 783257, 785916, 785863, 784158, 781969, 779484, 776768, 774751, 774501, 775913, 777873, 779589, 781141, 782926, 785270, 788503, 792743, 797541, 802356, 807434, 813567, 820836, 828159, 834345, 839242, 843772, 849344, 857233, 867817, 880053, 892176, 903358, 914346, 926346, 939708, 954029, 969040, 984895, 1001815, 1019896, 1039274, 1060399, 1084214, 1111832, 1143500, 1177983, 1213661, 1250456, 1289925, 1333236, 1380012, 1429790, 1483714, 1543678, 1610165, 1681944, 1757902, 1838422, 1924972, 2019025, 2121224, 2230717, 2345049, 2461347, 2577993, 2694714, 2810796, 2923532, 3028676, 3122228, 3201736, 3266305, 3315655, 3349016, 3364688, 3360786, 3336700, 3294021, 3236060, 3166337, 3087136, 2999274, 2903256, 2800668, 2694203]
62694B694203j07871j07988j07368j05455j01892r7534r3648r0395q6648q1198
62684A714206p3942o6107n9517n5301n2950n0760m7434m3166l9035l5593l2378
62673A158023k8686k4512k0616j7691j5573j3466j0977q585o782n102k660M80
62661A003853L085M140L956L809M776P126J0394J3914J7452K1272K5318K8687
62649A147782L0644L1979L4461L8853M4286M9785N5316O0830O5372O8216P0205
62638A697729P2953P6834Q0679Q3402Q4951Q5475Q4415Q1091P5788O9438O1981
62627B554736N1710L7144J9483K306j1689k3014l3868m5065n5628o4767p2610
62616B358738p8854q2557q3892q4655q5887q6173q3639p8802p3961p0228o6612
$$ y = [2694203, 2586332, 2478344, 2370976, 2265521, 2163629, 2066095, 1972447, 1882052, 1795404, 1714206, 1640264, 1574157, 1514640, 1459339, 1406389, 1355629, 1308195, 1265029, 1225994, 1190401, 1158023, 1129337, 1104825, 1084209, 1066518, 1050945, 1037479, 1026502, 1017917, 1011135, 1006033, 1003373, 1003853, 1006938, 1011078, 1015034, 1018843, 1023619, 1030745, 1041139, 1055053, 1072505, 1093777, 1119095, 1147782, 1178426, 1210405, 1244866, 1283719, 1328005, 1377790, 1433106, 1493936, 1559308, 1627524, 1697729, 1770682, 1847516, 1928195, 2011597, 2096548, 2182023, 2266438, 2347529, 2423317, 2492755, 2554736, 2606446, 2643590, 2663073, 2665379, 2653690, 2630676, 2596808, 2551743, 2496115, 2431348, 2358738, 2279884, 2197327, 2113435, 2028780, 1942893, 1856720, 1773081, 1694279, 1620318, 1550090, 1483478]
62605A483478o2090n7170n3014m9900m7100m3875m0227l6858l4373l2458l0070
62594I96343k6838k3858k2424k2153k1192j8490j5114j2917j2354j2171j1075
62583G97757r055o972n379m371m164m962o016n861m089k138j465j744j863j810
62569G37868j990j393J244M590N518L393J135J008J838J916K200M298P132Q463
62555G77220Q511R231J0754J1489J1385J2140J4022J5347J5678J6911K0233K4332
62543I47253K7666L0386L2872L4379L4587L4890L6730L9930M3719M7979N2305
62532A362696N5345N6455N6551N5990N3211M7226L9903L3562K7515J9406R181
62521A817041q65r637j8151k6758l4011l9034m2946m6841m9992n1164n0519m9187
$$ y = [1483478, 1421388, 1364218, 1311204, 1261304, 1214204, 1170329, 1130102, 1093244, 1058871, 1026413, 996343, 969505, 945647, 923223, 901070, 879878, 861388, 846274, 833357, 821003, 808832, 797757, 788702, 781730, 776351, 771980, 767816, 762854, 756838, 750977, 746888, 744750, 743285, 741541, 739678, 737868, 735878, 734485, 735729, 740319, 745837, 749230, 750365, 751373, 753211, 755127, 757327, 761625, 768757, 777220, 785731, 794962, 805716, 817205, 828590, 840730, 854752, 870099, 885777, 902688, 922921, 947253, 974919, 1005305, 1038177, 1072556, 1107143, 1142033, 1178763, 1218693, 1262412, 1310391, 1362696, 1418041, 1474496, 1531047, 1587037, 1640248, 1687474, 1727377, 1760939, 1788454, 1807860, 1817041, 1816176, 1806539, 1788388, 1761630, 1727619, 1688585, 1645639, 1598798, 1548806, 1497642, 1447123, 1397936]
62509A397936m7916m6914m6217m5446m3885m1408l8636l5883l2788k9492k6980
62498I62371k5629k4406k2285j9503j6611j3430j0155q326r028j0649j0271p212
62486G84866l592j309j49O87Q99P9q15l55J473L371M408M681M455L678K564J870
62470H06811K256L784O244R575J3608J7710K0966K2689K2791K1988K1811K4002
62458I94235K9207L6085M2071M5390M6441M7061M8500N0327N1420N1522N1236
62447A493495N0674M8846M4886L9256L3095K6798J9968J2707N962L98m272q444
62435A763369j1795j3892j5011j5554j5148j3183j0057o797l392J361P892J4740
62423A682533K0267K4820L0103L6566M2538M6211M7659M8519N0116N2327N3724
$$ y = [1397936, 1350020, 1303106, 1256889, 1211443, 1167558, 1126150, 1087514, 1051631, 1018843, 989351, 962371, 936742, 912336, 890051, 870548, 853937, 840507, 830352, 822026, 812998, 802349, 792078, 784866, 781274, 779965, 779816, 780503, 781402, 781481, 780666, 780311, 781784, 785155, 789563, 794244, 798699, 802377, 804941, 806811, 809067, 812851, 819095, 828670, 842278, 859988, 880954, 903643, 926434, 948422, 970233, 994235, 1023442, 1059527, 1101598, 1146988, 1193429, 1240490, 1288990, 1339317, 1390737, 1442259, 1493495, 1544169, 1593015, 1637901, 1677157, 1710252, 1737050, 1757018, 1769725, 1775687, 1776085, 1771813, 1763369, 1751574, 1737682, 1722671, 1707117, 1691969, 1678786, 1668729, 1661932, 1658540, 1659901, 1667793, 1682533, 1702800, 1727620, 1757723, 1794289, 1836827, 1883038, 1930697, 1979216, 2029332, 2081659, 2135383]
62412B135383N2463M7546L9740L1025K2578J3765L587p446j7931k7690l7732m7937
62400B207351n6442o2183o6603p1441p5756p6966p4370o9915o5498o1347n7360
62389A469470n4213n2033m9404m5070l9726l4986l1178k7520k3902k1019j8820
62378A071599j6226j2716r216o891n864n460n082m435l477k676k936m756p603
62365I84261j0326j2128j2916j3059j3034j3245j3822j4514j4870j4597j3793
62354H37957j2710j1378r652p845o908p320p978p084m496k241k105l509m552m521
62340G45658m176m020l648k791j747m58J672M503O612O789N558M594M895N963
62326G69404O619O308N704N968P321Q676R171R540J0950J2879J3630J3152J3623
$$ y = [2135383, 2187846, 2235392, 2275132, 2306157, 2328735, 2342500, 2346087, 2338641, 2320710, 2293020, 2255288, 2207351, 2150909, 2088726, 2022123, 1950682, 1874926, 1797960, 1723590, 1653675, 1588177, 1526830, 1469470, 1415257, 1363224, 1313820, 1268750, 1229024, 1194038, 1162860, 1135340, 1111438, 1090419, 1071599, 1055373, 1042657, 1033441, 1026550, 1020686, 1015226, 1010144, 1005709, 1002232, 999556, 996620, 991864, 984261, 973935, 961807, 948891, 935832, 922798, 909553, 895731, 881217, 866347, 851750, 837957, 825247, 813869, 804217, 796372, 789464, 782144, 774166, 767082, 762586, 760345, 758240, 754731, 750179, 745658, 741482, 737462, 733814, 731023, 729276, 728818, 730490, 734993, 741605, 748394, 753952, 758546, 763441, 769404, 776023, 782331, 788035, 794003, 801324, 810000, 819171, 828711, 839661, 852540, 866170, 879322, 892945]
62313H92945J6518K0474K3348K5173K7531L0728L3442L5026L6528L9004M2156
62302A222873M5170M8064N1556N6185O2031O8844P6014Q2703Q8227R2122R3816
62291A987605R2871Q9531Q4333P6994O6488N2843L8123K4851J3785L937n642j5114
62279B510605k4663l4834m5490n5242o2591o7279p0021p1296p1004o9103o5924
62268A873158o1863n7333n2965m9325m6299m3272m0079l7308l5516l4629l4226
62257A380343l3907l3161l1648k9984k9485l0409l1110k9828k6866k4045k2336
62246A057564k1171j9948j8873j8022j6767j4779j2724j1283j0124q556o672n115
62234H93530m066l191k312j529q70l27nL08J400L698O177P140O327N561O710R503
$$ y = [892945, 909463, 929937, 953285, 978458, 1005989, 1036717, 1070159, 1105185, 1141713, 1180717, 1222873, 1268043, 1316107, 1367663, 1423848, 1485879, 1554723, 1630737, 1713440, 1801667, 1893789, 1987605, 2080476, 2170007, 2254340, 2331334, 2397822, 2450665, 2488788, 2513639, 2527424, 2531361, 2525719, 2510605, 2485942, 2451108, 2405618, 2350376, 2287785, 2220506, 2150485, 2079189, 2008185, 1939082, 1873158, 1811295, 1753962, 1700997, 1651672, 1605373, 1562101, 1522022, 1484714, 1449198, 1414569, 1380343, 1346436, 1313275, 1281627, 1251643, 1222158, 1191749, 1160639, 1130811, 1103945, 1079900, 1057564, 1036393, 1016445, 997572, 979550, 962783, 948004, 935280, 923997, 913873, 905317, 898645, 893530, 889464, 886273, 883961, 882432, 881562, 881235, 881230, 881538, 882938, 886636, 892813, 899953, 906280, 911841, 918551, 928054]
62218I28054J2026J3095J3334J3816J4523J4878J5276J6871J9728K2207K3001
62207A106809K3029K4422K7950L2558L7239M2124M7443N2624N7233O2005O7954
62196A581390P4823Q1317Q6751R1574R6041R8979R8467R3644Q5528P5929O5731
62185B530174N4551M2025K8875J6327M770o409j7785k9126l9715m9023n7087o4450
62173B413127p1475p7402q0525q0102p7678p5587p4349p2583o9246o4756n9885
62162A609539n5048n0954m8459m7081m4997m1349l7352l4346l2017k9530k7177
62151A161229k5612k4454k2965k1243j9509j7198j4148j1616j0532r602p108l820
62139I73422j976j790j240P07K933M494N898P482Q536Q894R658J1435J3397J4945
$$ y = [928054, 940080, 953175, 966509, 980325, 994848, 1009726, 1025002, 1041873, 1061601, 1083808, 1106809, 1129838, 1154260, 1182210, 1214768, 1252007, 1294131, 1341574, 1394198, 1451431, 1513436, 1581390, 1656213, 1737530, 1824281, 1915855, 2011896, 2110875, 2209342, 2302986, 2388514, 2464443, 2530174, 2584725, 2626750, 2655625, 2671952, 2676722, 2670313, 2652528, 2623402, 2583687, 2534664, 2477577, 2413127, 2341652, 2264250, 2183725, 2103623, 2025945, 1950358, 1876009, 1803426, 1734180, 1669424, 1609539, 1554491, 1503537, 1455078, 1407997, 1363000, 1321651, 1284299, 1249953, 1217936, 1188406, 1161229, 1135617, 1111163, 1088198, 1066955, 1047446, 1030248, 1016100, 1004484, 993952, 984350, 977242, 973422, 971446, 969656, 968416, 969123, 972056, 976550, 982448, 989930, 998466, 1007360, 1017018, 1028453, 1041850, 1056795]
62125A056795J6628J8591J9780J9858K0220K1715K2877K2155K0589K0406K1833
62114A281447K3308K4175K5165K6550K7838K9420L2690L8091M4390N0357N5909
62103A659340O1287O6151O9871P1696P0422O5165N6917M8181M0276L2019K1860
62092B263185J0429J4q037j4332k0204k6359l2787l9244m5467n1071n5331n7320
62080A923476n6655n4173n1280m8366m4462l8891l2610k7245k3363k0452j8174
62069A507805j6529j5026j2845r953o988l916q5L901N792M319J186r49j854l342
62055A451516n832p209n699k313M70J209k75l889q857j3023j4387j3505j2871
62042A365335j3654j4251j2627q962n214k825j786j426j200p94q9Q52K023L543
$$ y = [1056795, 1073423, 1092014, 1111794, 1131652, 1151872, 1173587, 1196464, 1218619, 1239208, 1259614, 1281447, 1304755, 1328930, 1354095, 1380645, 1408483, 1437903, 1470593, 1508684, 1553074, 1603431, 1659340, 1720627, 1786778, 1856649, 1928345, 1998767, 2063932, 2120849, 2169030, 2209306, 2241325, 2263185, 2273614, 2273628, 2265591, 2251259, 2231055, 2204696, 2171909, 2132665, 2087198, 2036127, 1980796, 1923476, 1866821, 1812648, 1761368, 1713002, 1668540, 1629649, 1597039, 1569794, 1546431, 1525979, 1507805, 1491276, 1476250, 1463405, 1453452, 1446464, 1442548, 1442463, 1446364, 1452156, 1456475, 1457661, 1456712, 1454858, 1451516, 1445684, 1438475, 1432776, 1430463, 1430933, 1432142, 1431867, 1427978, 1419121, 1406098, 1391711, 1378206, 1365335, 1351681, 1337430, 1324803, 1315841, 1310627, 1307802, 1306016, 1304590, 1303390, 1302596, 1302507, 1303359, 1305382, 1308925]
62028A308925N286O796P895R046J0649J2334J3527J4424J5749J7665J9653K1414
62016A463363K3214K5209K7105K8806L0678L2861L4884L6443L8037M0244M2815
62005A823659M5243M7806N1041N4193N5394N3903N1140M8773M6312M1696L3896
61994B353056K4020J3898M551l737j0933j7487k4385l2203m0380m7931n4513o0192
61982B103764o4547o6817o6937o5672o3685o1142n8336n5958n4203n2217m9079
61971A445171m5076m1393l8533l5753l2307k8698k6108k4774k3643k1811j9671
61960A107404j8224j7672j7471j7461j8037j8997j9219j7954j5801j3798j2119
61949I20651j0340q498o982n702m256k880k426l259m751n880n823m200j514P35
$$ y = [1308925, 1314211, 1321007, 1328902, 1337948, 1348597, 1360931, 1374458, 1388882, 1404631, 1422296, 1441949, 1463363, 1486577, 1511786, 1538891, 1567697, 1598375, 1631236, 1666120, 1702563, 1740600, 1780844, 1823659, 1868902, 1916708, 1967749, 2021942, 2077336, 2131239, 2182379, 2231152, 2277464, 2319160, 2353056, 2377076, 2390974, 2395525, 2391788, 2380855, 2363368, 2338983, 2306780, 2266400, 2218469, 2163956, 2103764, 2039217, 1972400, 1905463, 1839791, 1776106, 1714964, 1656628, 1600670, 1546467, 1494250, 1445171, 1400095, 1358702, 1320169, 1284416, 1252109, 1223411, 1197303, 1172529, 1148886, 1127075, 1107404, 1089180, 1071508, 1054037, 1036576, 1018539, 999542, 980323, 962369, 946568, 932770, 920651, 910311, 901813, 894831, 889129, 884873, 881993, 879567, 876308, 871557, 865677, 859854, 855654, 854140, 854875]
61935H54875J297O43L22P40O14j000l274m868n711o478p102o926o081n535n739
61920H05777o173o401o676p153p287o664n984o403p918r061q547o782n311m985
61906G10432n266n292m800l721j818M80J528J39k387l281j643M78R21Q5k39L95
61890F86011R63J144J885L697N649O774P499Q874J0871J2344J2625J2476J3164
61877G83976J4970J6999J8324J8885J9114J9142J8853J8467J8367J8300J7429
61866I82826J5494J3322J1730J0438Q690O550M752L463K047J53j686k905l729
61853A051145m550m907l762q94K553N323P461R905J2671J4285J3492J1057R093
61840A122872Q745R261R272Q124N741K204j977n756q454j0428j2299j3932j4650
$$ y = [854875, 856172, 856815, 857137, 857877, 858491, 857491, 854217, 849349, 843638, 837160, 830058, 823132, 817051, 811516, 805777, 799604, 793203, 786527, 779374, 772087, 765423, 759439, 753036, 745118, 736057, 727510, 720728, 715417, 710432, 705166, 699874, 695074, 691353, 689535, 690015, 691543, 691682, 689295, 686014, 684371, 684849, 685770, 685855, 685616, 686011, 686974, 688118, 690003, 693700, 699349, 706123, 713622, 722496, 733367, 745711, 758336, 770812, 783976, 798946, 815945, 834269, 853154, 872268, 891410, 910263, 928730, 947097, 965397, 982826, 998320, 1011642, 1023372, 1033810, 1042500, 1049050, 1053802, 1057265, 1059312, 1059465, 1057779, 1054874, 1051145, 1046595, 1041688, 1037926, 1037032, 1039585, 1044908, 1052369, 1062274, 1074945, 1089230, 1102722, 1113779, 1122872, 1131617, 1140878, 1150150, 1158274, 1164015, 1166219, 1164242, 1158486, 1150032, 1139604, 1127305, 1113373, 1098723]
61827A098723j4137j2673j0843r490r381j0336j1135j1062j0967j1935j3393j3834
61815I59537j3133j2706j3203j3531j2729j1516j0953j0590r090o242l166p80
61803H41898Q91J861J869J361J908M611Q468J1144J1622J1469J3103J7155K2020
61790I49380K5719K7548K7929K7491K6811K6477K6649K6643K5587K3459K1055
61779A234748J8875J6502J3271R143M806J023j976m478o615p815p216m885k144
61766A263239k35J055K889N619Q203R353Q817P412O144N250L795M33n025j1010
61752A305939j5743j9020k1786k4294k5832k6213k6276k6552k6562k5883k4949
61741A042829k4101k2856k0818j8526j6603j4903j3360j2811j3685j4590j3644
$$ y = [1098723, 1084586, 1071913, 1061070, 1051580, 1042199, 1031863, 1020728, 1009666, 998699, 986764, 973371, 959537, 946404, 933698, 920495, 906964, 894235, 882719, 871766, 861176, 852086, 845844, 842678, 841898, 842789, 844650, 846519, 847880, 849788, 854399, 862867, 874011, 885633, 897102, 910205, 927360, 949380, 975099, 1002647, 1030576, 1058067, 1084878, 1111355, 1138004, 1164647, 1190234, 1213693, 1234748, 1253623, 1270125, 1283396, 1292539, 1297345, 1298368, 1296392, 1291914, 1285299, 1277484, 1270268, 1265383, 1263239, 1263004, 1264059, 1266948, 1272567, 1280770, 1290123, 1298940, 1306352, 1312496, 1317746, 1321541, 1321974, 1316949, 1305939, 1290196, 1271176, 1249390, 1225096, 1199264, 1173051, 1146775, 1120223, 1093661, 1067778, 1042829, 1018728, 995872, 975054, 956528, 939925, 925022, 911662, 898851, 885166, 870576, 856932]
61730H56932j1042q944q814j0054j1242j1441j0074p040l519j556j878k966l127
61717G65235k693l150m631n569m783k989j889k332l595m150k989n47J660K469
61703G30047K082J511J352J577K198L317M420M452L089J498J251K612M197M210
61689G67813J933j618m220m021j289J484J778n14l098l759k464r76p66j685k532
61674G46066k564k210k229k382j576N29K618L086K019J008J061J717K306L053
61660G52502M167M826M086K382J111Q51Q94M84k75p43l61J043K791L282J410j795
61644G76655l920l935l231l457m348m588l980l545l828m290m350m129m030m262
61630G20762m890n702n962m947k927j149o49j439k823m015m394l784k742k101
$$ y = [856932, 845890, 836946, 828132, 818078, 806836, 795395, 785321, 778281, 774762, 773206, 771328, 768362, 765235, 762542, 759392, 754761, 749192, 744409, 741420, 739531, 737199, 733604, 729454, 726465, 725918, 727578, 730047, 732129, 733640, 734992, 736569, 738767, 742084, 746504, 750956, 754045, 755543, 756794, 759406, 763603, 767813, 769746, 768128, 763908, 759887, 758598, 760082, 761860, 761346, 758248, 754489, 752025, 751049, 750283, 748598, 746066, 743502, 741292, 739063, 736681, 735105, 735634, 738252, 741338, 743357, 744365, 745426, 747143, 749449, 752502, 756669, 761495, 765581, 767963, 769074, 769925, 770819, 771303, 771028, 770285, 769924, 770967, 773758, 777040, 778450, 776655, 772735, 768800, 765569, 762112, 757764, 753176, 749196, 745651, 741823, 737533, 733183, 729054, 725024, 720762, 715872, 710170, 704208, 699261, 696334, 695185, 694536, 693097, 690274, 686259, 681865, 678081, 675339, 673238]
61616F73238k171k716l538m382m442l061j092m04j498k709k471j288m48K1P11
61601F43750J035l3j778k268j197l03n23o03N33J750J485K21l39J96Q95J387K063
61584F46271K698K520J729J424J756J640O59j62o9K86K95O33J888K917K169K7
61568F66681j604k002k418l826n181m766k585n08k15j552l059l621l390l219l499
61553F25236l791l490k586j661j351j945l295m911o313p372q245q887q909q109
61539E54371o855n733m988m470l985l519l272l516m130m371l599k397k165l229
61525D98142m072l223j345m91j563l450m628m741m404m210m219l948k720n10J631
61510D56249K581K559K722L262K930R06j724l141k888j950j218o87l9Q21J894
$$ y = [673238, 671067, 668351, 664813, 660431, 655989, 652928, 651836, 651432, 649934, 647225, 644754, 643466, 643018, 643039, 643750, 644785, 644752, 642974, 640706, 639509, 639206, 638683, 638080, 638613, 640363, 641848, 642069, 641730, 641926, 642821, 644208, 646271, 648969, 651489, 653218, 654642, 656398, 658038, 658697, 658535, 658466, 658752, 659047, 659680, 661568, 664485, 666654, 666681, 665077, 663075, 660657, 656831, 651650, 646884, 644299, 643791, 643576, 642024, 638965, 635344, 631954, 628735, 625236, 621445, 617955, 615369, 613708, 612357, 610412, 607117, 602206, 595893, 588521, 580276, 571389, 562480, 554371, 547516, 541783, 536795, 532325, 528340, 524821, 521549, 518033, 513903, 509532, 505933, 503536, 501371, 498142, 494070, 490847, 489502, 489011, 487448, 483998, 479370, 474629, 470225, 466015, 461796, 457848, 455128, 454618, 456249, 458830, 461389, 464111, 467373, 470303, 471209, 469485, 466344, 463456, 461506, 460288, 459601, 459562, 460383, 462277]
61495D62277L083L912L777K677J324M11N2R4M57R59J181R83Q70J416K358K725
61479D88556J941M15j036j923k080j486n72k75j001j747j033J175L206L640K625
61464D90405J023p82k381k657j023J015J141p19k038j041Q72J195j91j138n86
61449D83095K2p26j784j145R48K020P47j246j780r83m56m86P0J348J916J116J71
61432D82847J5k94j683k930k221K7J791K278K285K106J208J67O03K561L904L261
61416D95925J851J347J444J013L31M99J462K276K683L018K914J710l3p93l1J251
61400E16867K043K303K279J824P97m64j315j216j89P92L29j674l291k609j65J767
61384E18078K079J677J540J464J209J398K462L707M249M102L647K899K047J856
$$ y = [462277, 465360, 469272, 473049, 475726, 477050, 477461, 477513, 477607, 478064, 479023, 480204, 481187, 482057, 483473, 485831, 488556, 490497, 490912, 489876, 487953, 485873, 484387, 483815, 483540, 482539, 480792, 479759, 480934, 484140, 487780, 490405, 491428, 490646, 488265, 485608, 484585, 485600, 486741, 486022, 483984, 482943, 483815, 485010, 484819, 483681, 483095, 483117, 482391, 480607, 479462, 480410, 482430, 483177, 481931, 480151, 479168, 478712, 478226, 478296, 479644, 481560, 482676, 482847, 482862, 482568, 480885, 477955, 475734, 475761, 477552, 479830, 482115, 484221, 485429, 485596, 486199, 488760, 492664, 495925, 497776, 499123, 500567, 501580, 501911, 502410, 503872, 506148, 508831, 511849, 514763, 516473, 516440, 515647, 515616, 516867, 518910, 521213, 523492, 525316, 526113, 525649, 524334, 523118, 522929, 523721, 524050, 522376, 519085, 516476, 516311, 518078, 520157, 521834, 523374, 524838, 526047, 527445, 529907, 533614, 537863, 541965, 545612, 548511, 550558, 552414]
61370E52414K588L202K704J709J593K381K723J903P04J45K84O67J169J799K228
61355E78213J973J055O5k92J92R64J160N46j12J7P04R44K48r65k201l316l996
61338E75199l652k377j286j243j752j789j265q84q59p33m06k88k31O28K424L815
61322E65301L511K013J009J336K309L013L249L045K139O00n69k08J637L635M492
61307E96512M048L073K411K578L682N207O050N412L777K508K199K079J465J101
61293F42102K106M103N672O581Q029J0209J1280R849P240N861O125O581O430O091
61279G38259N542M213K867L408N877P550O397M056L568N236O548N786L794K081
61265H05182R06k02j282k072k541k715k434j693q22j1Q60J860K846L903N349P103
$$ y = [552414, 555002, 558204, 560908, 562617, 564210, 566591, 569314, 571217, 571921, 572066, 572350, 573017, 574186, 575985, 578213, 580186, 581241, 581306, 581014, 581206, 582170, 583330, 583876, 583764, 583781, 584485, 585429, 585677, 584712, 582511, 579195, 575199, 571547, 569170, 567884, 566641, 564889, 563100, 561835, 560951, 560092, 559359, 558953, 558665, 558434, 559062, 561486, 565301, 568812, 570825, 571834, 573170, 575479, 578492, 581741, 584786, 586925, 587525, 586956, 586748, 588385, 592020, 596512, 600560, 603633, 606044, 608622, 612304, 617511, 623561, 628973, 632750, 635258, 637457, 639536, 641001, 642102, 644208, 648311, 653983, 660564, 668593, 678802, 690082, 699931, 707171, 713032, 719157, 725738, 732168, 738259, 743801, 748014, 750881, 754289, 760166, 767716, 774113, 778169, 781737, 786973, 793521, 799307, 803101, 805182, 806088, 805886, 804604, 802532, 799991, 797276, 794842, 793149, 792327, 792316, 793176, 795036, 797882, 801785, 807134, 814237]
61249H14237Q512R198R606J0372J1479J2439J3016J3331J3368J2721J0884P712
61237I46875L740J20k082k731k691k919l640m460n046n473o118p356r191j0892
61223H88136j1304r917p607n897n347n025l777j726k8O69J001J816K951L638L866
61208H51449M431N463N858M839L441L471N125O656O723O072O275P400P945O962
61194I32110N308M378M247L885K942K378K967L939L976L145K864L728M339K992
61180I83198j6k575l069j876n50j55n70j026j013p46p85j173j215l79Q58J577
61164I70485J700K099L331M874N845O076O104O404O899P239P324P518Q088Q363
61150A052349O943L467p8q97J428M284N124M343M136N259O422O649O747P840R698
$$ y = [814237, 822749, 831947, 841553, 851925, 863404, 875843, 888859, 902190, 915558, 928279, 939163, 946875, 950615, 950735, 948653, 945922, 943231, 940312, 936672, 932212, 927166, 921693, 915575, 908219, 899028, 888136, 876832, 866915, 859308, 853411, 848064, 843039, 839262, 837536, 837508, 838177, 839178, 840994, 843945, 847583, 851449, 855880, 861343, 867201, 872040, 875481, 878952, 884077, 890733, 897456, 903528, 909803, 917203, 925148, 932110, 937418, 941796, 946043, 949928, 952870, 955248, 958215, 962154, 966130, 969275, 972139, 975867, 980206, 983198, 983182, 980607, 977538, 975662, 975112, 974957, 974387, 973361, 972348, 971602, 970817, 969644, 968429, 968050, 968908, 970485, 972185, 974284, 977615, 982489, 988334, 994410, 1000514, 1006918, 1013817, 1021056, 1028380, 1035898, 1043986, 1052349, 1059292, 1062759, 1062681, 1061784, 1063212, 1067496, 1072620, 1076963, 1081099, 1086358, 1092780, 1099429, 1106176, 1114016, 1123714]
61135A123714J1363J2638J3872J4788J4652J3515J2286J1342J0037Q030O249N740
61123A258226O066N744M135K072M99p23k217l876m805m443l289k473k742l886
61109A248288n008n367n083m986n729p078q124q193p498o924p236q432r782j0487
61095A148361j0329r765r446r620r833r301p739n843m728m865n850p204q813j0449
61081A034576j1444j1408j0830j0299r584q185o488n454n206m837l653j840J65
61068I45513K075L440L906M090N163P204Q921R619J0434J2810J6491J9887K1847
61055A071400K2346K2025K1929K3170K5884K8822L0705L1582L2077L1955L0565
61044A372460K8349K6539K5394K3949K1652J9003J6325J3018Q769M585J729L7
$$ y = [1123714, 1135077, 1147715, 1161587, 1176375, 1191027, 1204542, 1216828, 1228170, 1238207, 1246237, 1252486, 1258226, 1264292, 1270036, 1274171, 1276243, 1276742, 1276019, 1273802, 1269926, 1265121, 1260678, 1257389, 1254916, 1252174, 1248288, 1243280, 1237913, 1232830, 1227844, 1222115, 1215037, 1206913, 1198720, 1191222, 1184298, 1177062, 1168630, 1158848, 1148361, 1138032, 1128267, 1118821, 1109201, 1099368, 1090067, 1082328, 1076485, 1071757, 1066892, 1061042, 1053838, 1045025, 1034576, 1023132, 1011724, 1000894, 990595, 981011, 972826, 966338, 960884, 955678, 950841, 947188, 945348, 945513, 947588, 951028, 954934, 959024, 964187, 971391, 980312, 989931, 1000365, 1013175, 1029666, 1049553, 1071400, 1093746, 1115771, 1137700, 1160870, 1186754, 1215576, 1246281, 1277863, 1309940, 1341895, 1372460, 1400809, 1427348, 1452742, 1476691, 1498343, 1517346, 1533671, 1546689, 1555458, 1560043, 1561772, 1561809]
61032A561809j854m733p938j0404j2132j4098j6737j9033j9664j8838j8262j9074
61020A399042k0510k1009k0056j8405j6939j5917j5001j3573j1347q986p532o887
61008A222880n679l206n50J122K408M585P447R738J1247J2942J5208J7431J9308
60995A314881K1202K3174K4988K7067L0091L3615L6544L8960M1988M5728M9088
60984A687326N2021N6036O1680O7356P1653P5345P9867Q5182R0586R6503J03845
60973B527400J12137J19723J25716J30742J36043J42562J50663J60168J70857
60964C776011J83278J98349K15856K34140K51987K70219K91033L16656L48903
60955F086432L89006M37120M92932N57053O30730P14227Q07850R15197J042760
$$ y = [1561809, 1559955, 1555222, 1547284, 1536880, 1524748, 1510650, 1493913, 1474880, 1455216, 1436378, 1418116, 1399042, 1378532, 1357523, 1337467, 1319062, 1302123, 1286206, 1271205, 1257632, 1246285, 1237299, 1229767, 1222880, 1217201, 1213995, 1213445, 1214567, 1216975, 1221560, 1229007, 1238745, 1249992, 1262934, 1278142, 1295573, 1314881, 1336083, 1359257, 1384245, 1411312, 1441403, 1475018, 1511562, 1550522, 1592510, 1638238, 1687326, 1739347, 1795383, 1857063, 1924419, 1996072, 2071417, 2151284, 2236466, 2327052, 2423555, 2527400, 2639537, 2759260, 2884976, 3015718, 3151761, 3294323, 3444986, 3605154, 3776011, 3959289, 4157638, 4373494, 4607634, 4859621, 5129840, 5420873, 5737529, 6086432, 6475438, 6912558, 7405490, 7962543, 8593273, 9307500, 10115350, 11030547, 12073307]
60946A2073307J195418J376119J590275J839047K093291K274056K278388K047210
60938B6767111J617666J107887O49166L28964J81131J98855L33143M83903N22214
60929C2190040L51709l5463n56344j087005j521212j802616j927578j930870j862420
60920B1818241j763106j652645j535354j412951j289924j170657j057260r51251
60912A0985093q54481p67587o89590o19632n57715n03464m55637m13080l75060
60903E748847l40737l09560k81923k57950k36002k14166j93172j75836j63305
60894C576196j53714j44932j36677j29211j21903j14228j06753r9949r3261q6347
60884B389221q0041p4952p0226o4969n9968n6649n4964n3599n1842n0083m8679
$$ y = [12073307, 13268725, 14644844, 16235119, 18074166, 20167457, 22441513, 24719901, 26767111, 28384777, 29492664, 30141830, 30470794, 30651925, 30850780, 31183923, 31667826, 32190040, 32541749, 32506286, 31949942, 30862937, 29341725, 27539109, 25611531, 23680661, 21818241, 20055135, 18402490, 16867136, 15454185, 14164261, 12993604, 11936344, 10985093, 10130612, 9363025, 8673435, 8053803, 7496088, 6992624, 6536987, 6123907, 5748847, 5408110, 5098550, 4816627, 4558677, 4322675, 4108509, 3915337, 3739501, 3576196, 3422482, 3277550, 3140873, 3011662, 2889759, 2775531, 2668778, 2568829, 2475568, 2389221, 2309180, 2234228, 2164002, 2099033, 2039065, 1982416, 1927452, 1873853, 1822011, 1771928, 1723249]
60873A723249m7367m5659m3256m0229l7269l5354l4580l3909l2681l1686l1864
60862A309395l2528l1913k9259k5476k1976j9653j8826j9124j9430j8713j7132
60851A055365j5667j4724j3655j1802r389p234n869n152m473l466k621k867m202
60838I54244n145m265k001l08m53j770k695k466j596j172j926l707n649o929p420
60823I06742p618q080r122j0645j1964j2059j0620q669p621p754q138p992p478
60810G88982p087o871o550n921m945l760k764k263k000j609j529k661m726n919
60796G30377m879k401l34O26R41N97r95l342m653m018k661k130k213j783q67m88
60780G01777p78p51p6L14k21j043j424j711k471l281l295k602k093k168k314j953
$$ y = [1723249, 1675882, 1630223, 1586967, 1546738, 1509469, 1474115, 1439535, 1405626, 1372945, 1341259, 1309395, 1276867, 1244954, 1215695, 1190219, 1168243, 1148590, 1129764, 1110640, 1091210, 1072497, 1055365, 1039698, 1024974, 1011319, 999517, 990128, 982894, 977025, 971873, 967400, 963934, 961313, 958446, 954244, 949099, 944834, 942833, 942525, 942072, 940302, 937607, 935141, 933545, 932373, 930447, 926740, 921091, 914162, 906742, 899124, 891044, 881922, 871277, 859313, 847254, 836634, 827965, 820344, 812590, 804452, 796460, 788982, 781895, 775024, 768474, 762553, 757608, 753848, 751084, 748821, 746821, 745212, 743683, 741022, 736296, 730377, 725498, 723097, 722763, 723389, 724330, 724927, 723932, 720590, 715937, 711919, 709258, 707128, 704915, 703132, 702265, 701777, 700999, 700248, 700172, 700486, 700265, 699222, 697798, 696087, 693616, 690335, 687040, 684438, 682345, 680177, 677863, 675910]
60764F75910j077j20M18L02j15j24M50R33P87M18L64J49j102l048m241l922k879
60747F63103k224k188k528l342m812o410p062o136m208k804l239n245o874o311
60733E99720l982k233k721m651n997n845m888l927k835j189P24K038K304J927
60719E68445J554J371J136O31k16j385k455k437n77K512N182O368O243N182L188
60704E94742Q60k55O15K222K877K600K323J733j79k669l459j839K78J089J014
60689F01952J203J532J443J444K142K625J501q60k623k982l011l847n137n710
60675E89672n064l863l348m282o107p218o536m655l069k532k745l217l642l642
60661E29752l109k807l567m810m878l253j398p45p79j09J258J952J436P91R43
$$ y = [675910, 674833, 674713, 675131, 675433, 675318, 675194, 675644, 676577, 677364, 677782, 678146, 678295, 677193, 674145, 669904, 665982, 663103, 660879, 658691, 656163, 652821, 648009, 641599, 634537, 628401, 624193, 621389, 618150, 612905, 606031, 599720, 595738, 593505, 590784, 586133, 580136, 574291, 569403, 565476, 562641, 561452, 562176, 564214, 566518, 568445, 569999, 571370, 572506, 573137, 572921, 571536, 569081, 566644, 566067, 568579, 573761, 580129, 586372, 591554, 594742, 595602, 595347, 595962, 598184, 601061, 603661, 605984, 607717, 607538, 604869, 601410, 599571, 599849, 600938, 601952, 603155, 604687, 606130, 607574, 609716, 612341, 613842, 612982, 610359, 607377, 604366, 600519, 595382, 589672, 584608, 580745, 577397, 573115, 567008, 559790, 553254, 548599, 545530, 542998, 540253, 537036, 533394, 529752, 526643, 523836, 520269, 515459, 510581, 507328, 505930, 505185, 504406, 504297, 505555, 507507, 508943, 509734, 510677]
60646E10677J231O47l99o39P3O20M90M65R90J245Q19J094L428O466P232M996K350
60629E41785J840K980L586K860J903J815K534L364L747L629L590M272N248N152
60615E88305L639K337K718L778L380J488K77Q53J783J529N84P8l31j586l233l951
60599F01648l740l841m556m760l954l215l322l287j963p7P39M34M53J348K035
60584E73942J796J431J636J574K36j656k551k364k380l014l183k269j282j357
60570E60559k026k039j295r82j837l033l051j351J007K371K164J368J215J693
60556E54763J744Q07o14j872k835l367k935j303Q99K814M089M547L744J663m62
60541E61682r82M50K522L711L661L007K364J869J454J160J013R06Q57J290K447
$$ y = [510677, 511908, 512555, 512156, 511517, 511590, 512210, 512700, 513165, 514155, 515400, 516219, 517313, 520741, 527207, 534439, 539435, 541785, 543625, 546605, 550191, 553051, 554954, 556769, 559303, 562667, 566414, 570043, 573633, 577905, 583153, 588305, 591944, 594281, 596999, 600777, 604157, 605645, 605922, 606775, 608558, 610087, 610671, 610749, 610418, 608832, 605599, 601648, 597908, 594067, 589511, 584751, 580797, 577582, 574260, 570973, 569010, 568933, 569672, 570106, 570559, 571907, 573942, 575738, 577169, 578805, 580379, 580615, 578959, 576408, 574044, 571664, 568650, 565467, 563198, 561916, 560559, 558533, 556494, 555199, 554217, 552380, 549347, 546296, 544945, 545952, 548323, 550487, 551855, 553070, 554763, 556507, 557314, 556700, 554828, 551993, 548626, 545691, 544388, 545287, 548101, 552190, 556737, 560481, 562144, 561682, 560700, 561150, 563672, 567383, 571044, 574051, 576415, 578284, 579738, 580898, 581911, 582817, 583674, 584964, 587411]
60526E87411L566L364J876R26J843L346L141J330N04K075M330N097M862N668P908
60511F37247R943J0684J0938J1964J3788J5461J6186J5729J4178J1703Q543N093
60499G81457J959k84j550k214k587k710k717k788k565j335Q31K832M003N111P206
60484G84649J0048J2519J4053J4892J5414J6098J7606J9889K1579K1358J9705
60473I67810J8146J6936J4702J0570N396O09l106n515o351n932n521o063o852
60460I94829o328m193k023j443k217k740k112q68N67L045P172J1318J2893J1812
60446A019712J1026J2952J6953K1268K5861L1638L8010M3281M7033N0280N3380
60435A371394N5539N6420N6641N6294N4365N0014M3257L4240K3115J0896r29j2049
$$ y = [587411, 590977, 594341, 596217, 597143, 598986, 602332, 605473, 606803, 607307, 609382, 613712, 618809, 623671, 629339, 637247, 647190, 657874, 668812, 680776, 694564, 710025, 726211, 741940, 756118, 767821, 776364, 781457, 783416, 783132, 781582, 779368, 776781, 774071, 771354, 768566, 766001, 764666, 765497, 768329, 772332, 777443, 784649, 794697, 807216, 821269, 836161, 851575, 867673, 885279, 905168, 926747, 948105, 967810, 985956, 1002892, 1017594, 1028164, 1033560, 1034169, 1031063, 1025548, 1019197, 1013265, 1007744, 1001681, 994829, 988501, 984308, 982285, 980842, 978625, 975885, 973773, 972905, 973472, 976517, 983689, 995007, 1007900, 1019712, 1030738, 1043690, 1060643, 1081911, 1107772, 1139410, 1177420, 1220701, 1267734, 1318014, 1371394, 1426933, 1483353, 1539994, 1596288, 1650653, 1700667, 1743924, 1778164, 1801279, 1812175, 1811246, 1799197]
60423A799197k3292l4636m4572n2024n7416o1145o2459o0957n7998n5252n2677
60412A236769m9270m5161m1583l9032l6799l4299l1803k9640k7601k5433k3306
60401H52842k1382j9376j6930j4258j2110j0954j0359r426p935o689o432o820
60389G10171p009o967p346q079q050o538m306k806k648l218l461k844j747j011
60375F44141r61j094j046j359k511l634l348j704k16K00R3J34J38j56n07q61j542
60358F25767k301k334j745j688k311k115l55J363J353M50O03J711J970R45K33
60343F21546R25K258L299M283N473N977M845K662J040Q65J781L070M299N054M831
60328F72208L554K018J404K230L812M930M873L882K760K270K735L791M683N027
$$ y = [1799197, 1775905, 1741269, 1696697, 1644673, 1587257, 1526112, 1463653, 1402696, 1344698, 1289446, 1236769, 1187499, 1142338, 1100755, 1061723, 1024924, 990625, 958822, 929182, 901581, 876148, 852842, 831460, 812084, 795154, 780896, 768786, 757832, 747473, 738047, 730112, 723423, 716991, 710171, 703162, 696195, 688849, 680770, 672720, 666182, 661876, 659070, 656422, 653204, 649743, 646899, 645152, 644141, 643180, 642086, 641040, 639681, 637170, 633536, 630188, 628484, 628268, 628468, 628561, 628695, 628833, 628677, 628170, 627309, 625767, 623466, 621132, 619387, 617699, 615388, 613273, 612918, 614281, 615634, 616084, 616687, 618398, 620368, 621313, 621546, 622471, 624729, 628028, 632311, 637784, 643761, 648606, 651268, 652308, 653173, 654954, 658024, 662323, 667377, 672208, 675762, 677780, 679184, 681414, 685226, 690156, 695029, 698911, 701671, 703941, 706676, 710467, 715150, 720177]
60314G20177N182N484N525M893M215M431N227N356M592L948L707K841J156M10
60300G77144J985M647O088N891N443N603O055O702P961R543J0320R786Q684P909
60286H73761P521O940N505K956k4k056k661l210n236q157r939r787q742p696o375
60271H32800m703l584l603m118m387m541m734m382l212k070j703j362J42K474
60257G93017M058M217L920M281N272O369P696R860J2812J5535J7113J7814J8706
60244I20670K0169K1342K1223J9826J7545J3891P948J29p543j3336j7194j9761
60232I84909k0979k0631j9564j9036j8856j7369j3851j0000q257q977j0059r383
60220H07947o858l956j910r38p04p70p73q66j887m276o824p627o511n367n446
$$ y = [720177, 725359, 730843, 736368, 741261, 745476, 749907, 755134, 760490, 765082, 769030, 772737, 775578, 776734, 777144, 779129, 783776, 789864, 795755, 801198, 806801, 812856, 819558, 827519, 837062, 847382, 857168, 865852, 873761, 881282, 888222, 893727, 896683, 896659, 894603, 891942, 888732, 883496, 875339, 865400, 855613, 846871, 839175, 832800, 828097, 824513, 820910, 816792, 812405, 807864, 803130, 798748, 795536, 793466, 791763, 790401, 790543, 793017, 797075, 801292, 805212, 809493, 814765, 821134, 828830, 838690, 851502, 867037, 884150, 901964, 920670, 940839, 962181, 983404, 1003230, 1020775, 1034666, 1042614, 1042743, 1035200, 1021864, 1004670, 984909, 963930, 943299, 923735, 904699, 885843, 868474, 854623, 844623, 836366, 827389, 817330, 807947, 801089, 797133, 795223, 794285, 793581, 792811, 792038, 791172, 789285, 785009, 778185, 770558, 764047, 758680, 753234]
60205G53234n580m234k204j631k890m204m347l933l720l315k355j625j904k578
60191G08714k445j224N14K250L472L319J510o30j191J91K058L040L191L150K813
60176G28732J637j7p01N46K744L708K482N55J70J719L457L691K508J205P81J320
60160G54537K179K420J603N00M41J663L153M463O545R820J2493J2364R902P867
60146H29950P930R134J0015J0535J1130J1212J0035Q319P688Q600R851J0063Q865
60133I53327O616L957J908J558K946M655N122M280L457L578L936L063O36j986
60119I97053l380l856m969p219r016q619o564n112n380o143n855m772m158m263
60105I17747m396m602n770p742q693p252m389k221j489j189m84K25K94m5j50J2
$$ y = [753234, 747654, 743420, 741216, 739585, 736695, 732491, 728144, 724211, 720491, 717176, 714821, 713196, 711292, 708714, 706269, 705045, 705559, 707809, 711281, 714600, 716110, 715480, 714289, 714480, 716538, 719578, 722769, 725919, 728732, 730369, 730352, 729651, 730197, 732941, 736649, 739131, 739686, 739856, 741575, 745032, 748723, 751231, 752436, 753217, 754537, 756716, 759136, 760739, 761239, 761680, 763343, 766496, 770959, 777504, 787324, 799817, 812181, 822083, 829950, 837880, 847014, 857029, 867564, 878694, 889906, 899941, 908260, 915948, 924548, 934399, 944462, 953327, 959943, 963900, 965808, 967366, 970312, 974967, 980089, 984369, 987826, 991404, 995340, 998403, 999039, 997053, 993673, 989817, 984848, 977629, 968613, 959994, 953430, 948318, 942938, 936795, 930940, 926168, 922010, 917747, 913351, 908749, 902979, 895237, 886544, 879292, 874903, 872682, 871193, 870004, 869520, 869745, 870039, 869994, 869844, 869856]
60089H69856q1o35j266j488j015L41K545M809N715M492K162Q80J816M017N587
60074H97735N701N104M990N865P377Q674Q921P929O316M798L472K256J575J837
60060I72550K385K105J151Q87J775K618K547K426L209M147M000L147K830K897
60046A008674K146O84L9O08Q70k60j842k565k629k901l249k983k305k094k513
60031I89680k903k914k900l174l570l754l579l035k317j883k095k806l458l534
60017I47758k916k086j987l166m882n654n054m271m481n323n722n634n987p201
60003H83394q691r834j0493j0553r743q164o356m655l091k071k426m201n969n965
59989G91182l826r01J074J330L55p59j129m88R99L048N191O639O731N726M816
$$ y = [869856, 869775, 869140, 867874, 866386, 865371, 865712, 868257, 873066, 878781, 883273, 885435, 886315, 888131, 892148, 897735, 903436, 908540, 913530, 919395, 926772, 935446, 944367, 952296, 958612, 963410, 966882, 969138, 970713, 972550, 974935, 977040, 978191, 979078, 980853, 983471, 986018, 988444, 991653, 995800, 999800, 1002947, 1005777, 1008674, 1010820, 1011504, 1011543, 1012151, 1013021, 1012761, 1010919, 1008354, 1005725, 1002824, 999575, 996592, 994287, 992193, 989680, 986777, 983863, 980963, 977789, 974219, 970465, 966886, 963851, 961534, 959651, 957556, 954750, 951292, 947758, 944842, 942756, 940769, 937603, 932721, 927067, 922013, 917742, 913261, 907938, 902216, 896582, 890595, 883394, 874703, 864869, 854376, 843823, 834080, 825916, 819560, 814905, 811814, 809743, 807317, 803116, 797147, 791182, 787356, 786455, 787529, 788859, 789214, 788455, 787326, 786838, 787837, 790885, 796076, 802715, 809446, 815172, 819988]
59974H19988N011O047O594N495K809j73j855j535K5J257J162%j382k573l766n114
59958H31990o363p173p443p230o741o529p364r297j1031j0843q434n517m125m583
59944G29317n596o103o298o617o509m988k220K39R43o6j497k075j419j19P68N88
59928F88348j71l33N84J704J976J664J923L064M056L990L287K964L271L627L470
59913G23424K616J126n51j528j278l99l7n30j237j576j518j118k95O52J046O50
59897G19447l4m55m64j0Q04J241M53j123j846r97J75L08j35J70J234K001K218
59880G22987K606L238L224K234J091M06k95j536k885l585l467k651j012J344L502
59865G25201M467M323M108M530N260N620N631O031P105P899P161N091L370L073
$$ y = [819988, 824999, 831046, 837640, 843135, 845944, 845771, 843916, 842381, 842406, 843663, 844825, 844825, 843443, 840870, 837104, 831990, 825627, 818454, 811011, 803781, 797040, 790511, 783147, 773850, 762819, 751976, 743542, 738025, 733900, 729317, 723721, 717618, 711320, 704703, 698194, 693206, 690986, 691225, 692168, 692102, 690605, 688530, 687111, 686992, 687760, 688348, 688177, 687844, 688428, 690132, 692108, 693772, 695695, 698759, 702815, 706805, 710092, 713056, 716327, 719954, 723424, 726040, 727166, 726615, 725087, 723809, 723410, 723373, 722843, 721606, 720030, 718512, 717394, 717099, 717751, 718797, 719447, 719413, 718958, 718494, 718484, 719288, 720529, 720982, 719859, 718013, 717016, 717191, 717499, 717364, 717534, 718768, 720769, 722987, 725593, 728831, 732055, 734289, 735380, 735786, 735491, 733955, 731070, 727485, 724018, 721367, 720355, 721699, 725201, 729668, 733991, 738099, 742629, 747889, 753509, 759140, 765171, 772276, 780175, 787336, 792427, 795797, 798870]
59851G98870L334K864J943J803K558L232L576M237N025M814L640L215M398N692
59837H49201N481M397L927L770K477K28r47P4K075L259L273L076L599M924O230
59822H95044O405N290M254M745O340P099O016M102K819K433K347K119J496L29
59808I50838q93j171m03J41l96j003l50R17R69l10r93P3J861L212M599O678Q466
59791I72235Q636P767P423P426O028K888m7j170r91n22L90J784K058l71m553p931
59775A001050r564j0762j2470j3646j2920j0638q358o967o100n151m198l850m390
59762H92036n160n077l822k249j340j240j713k912m818o404o481n284m248m187
59748H37101m670n080n311n309m936m404l884k751l81K262L290K434J471J596
$$ y = [798870, 802204, 805068, 807011, 808814, 811372, 814604, 818180, 822417, 827442, 832256, 835896, 839111, 843509, 849201, 854682, 859079, 863006, 866776, 869253, 869481, 868534, 868608, 870683, 873942, 877215, 880291, 883890, 888814, 895044, 901449, 906739, 910993, 915738, 922078, 929177, 935193, 939295, 942114, 944547, 946894, 949013, 950509, 950838, 949945, 948774, 948371, 948512, 948116, 947113, 946763, 947680, 948649, 948339, 947346, 947419, 949280, 952492, 957091, 963769, 972235, 980871, 988638, 996061, 1003487, 1009515, 1012403, 1012356, 1011186, 1010195, 1009673, 1010063, 1011847, 1013905, 1013534, 1008981, 1001050, 991486, 980724, 968254, 954608, 941688, 931050, 922692, 915725, 909625, 904474, 900276, 896426, 892036, 886876, 881799, 877977, 875728, 874388, 873148, 871435, 868523, 863705, 857301, 850820, 845536, 841288, 837101, 832431, 827351, 822040, 816731, 811795, 807391, 803507, 800756, 800375, 802637, 805927, 808361, 809832, 811428]
59734H11428J917J340L89Qj16o50j130r09p17j647l098l423k331j173r09j237
59718G97742j682k096j925m54J707K703J694J13j84Q01J607J507J227J492J850
59703H06102J473O63P49K377M523N738N967O380P524Q596Q717Q072P353O985P361
59688H88580R026J1740J4001J4412J3115J1255R598Q455Q280R071R500P986M759
59675A019778J809N94O86Q22M05l88j190j649j504q84l45l83j007j714j865j340
59659A011825j024k054m172n489m609k531j408j875k711k939k936l254l595l462
59645I69766k873j945n41J176K504L095L473M140M614M039K458R66O43J653L207
59630I96375M155L768K291O91j89k78j20l08j068k186l191l679l498k758j887
$$ y = [811428, 813345, 814685, 815074, 815082, 814966, 814316, 813186, 812277, 811560, 809913, 806815, 803392, 801061, 799888, 798979, 797742, 796060, 793964, 792039, 791585, 793292, 795995, 797689, 797802, 797618, 798419, 800026, 801533, 802760, 804252, 806102, 807575, 808238, 808987, 811364, 815887, 821625, 827592, 833972, 841496, 850092, 858809, 866881, 874234, 881219, 888580, 897606, 909346, 923347, 937759, 950874, 962129, 971727, 980182, 988462, 997533, 1007033, 1015019, 1019778, 1021587, 1022181, 1022867, 1023689, 1024094, 1023706, 1022516, 1020867, 1019363, 1018479, 1018134, 1017751, 1016744, 1015030, 1013165, 1011825, 1010801, 1008747, 1004575, 999086, 994477, 991946, 990538, 988663, 985952, 983013, 980077, 976823, 973228, 969766, 966893, 964948, 964407, 965583, 968087, 971182, 974655, 978795, 983409, 987448, 989906, 990872, 991515, 993168, 996375, 1000530, 1004298, 1006589, 1007280, 1007091, 1006813, 1006693, 1006385, 1005317, 1003131, 999940, 996261, 992763, 990005, 988118]
59615I88118j649k608m357n739o081n875n878o116o172n952n580n022m422m346
59601I18321m940n411n072m399m057l429j420J519L575L877L384L239L394L245
59587I11826K648J804Q98J88j76n40j294k041k105j785j993k578k431j565j513
59572H99343k956m349m102k927k644l523m325m423m320m215l627k793l008m868
59558H47263p023p586o459n413n844p055p158n392l048j927k388l221l246k470
59544G79033j695j409j281n91Q12J984J657q2j406p22J309K611K391J850K107
59529G86568K568K019M68r08j231o44K08P57P12L4j122k513l750m295l900l005
59513G71966k321k003j667j151p44o75r40j635k813l844l651j959J49J155M42
$$ y = [988118, 986469, 983861, 979504, 973765, 967684, 961809, 955931, 949815, 943643, 937691, 932111, 927089, 922667, 918321, 913381, 907970, 902898, 898499, 894442, 891013, 889593, 891112, 894687, 898564, 901948, 905187, 908581, 911826, 914474, 916278, 917176, 917364, 917188, 916648, 915354, 913313, 911208, 909423, 907430, 904852, 902421, 900856, 899343, 896387, 892038, 887936, 885009, 882365, 878842, 874517, 870094, 865774, 861559, 857932, 855139, 852131, 847263, 840240, 832654, 826195, 820782, 814938, 807883, 800725, 795333, 792285, 790358, 787970, 784749, 781503, 779033, 777338, 775929, 774648, 774057, 774869, 776853, 778510, 778428, 777022, 776300, 777609, 780220, 782611, 784461, 786568, 789136, 791155, 791623, 790715, 789484, 788840, 789048, 789805, 790517, 790551, 789429, 786916, 783166, 778871, 774971, 771966, 769645, 767642, 765975, 764824, 764080, 763405, 762465, 760830, 758017, 754173, 750522, 748563, 748712, 749867, 750309]
59498G50309j286k501k017j34J523J848J565J940K742K783K106K099L195M151
59484G68323M145M154N413P670R824J1376J2534J3777J5789J8585K0159J7634
59472I09383J0884L704j02p15r09j959k912l203l542m100l889k575j353j249j728
59457H95735j678r05L8Q05J266J104Q5j426k687l335l701m381n523o602p006o894
59441H54895p094p970q747q311o460m067k333k015k934l807l182j104O41N76n77
59426G97511q25O14K563L526L275K814L283M909O564O642M911L243L713O168Q439
59411H57350Q879P769O240M824L561K621K062J402J75j216j735r60L32J061J150
59396H93515J593L164N430P350Q524R383J0240J0814J0821J0450R991R523R163
$$ y = [750309, 749023, 746522, 744505, 744371, 745894, 747742, 749307, 751247, 753989, 756772, 758878, 760977, 764172, 768323, 772468, 776622, 782035, 789705, 799529, 810905, 823439, 837216, 853005, 871590, 891749, 909383, 920267, 923971, 923869, 923154, 922245, 920286, 917374, 914171, 910629, 906529, 902640, 900065, 898712, 897463, 895735, 894057, 893152, 893190, 893995, 895261, 896365, 896450, 895024, 892337, 889002, 885301, 880920, 875397, 868795, 861789, 854895, 847801, 839831, 831084, 822773, 816313, 812246, 809913, 807898, 804964, 801157, 797975, 796871, 797512, 798088, 797511, 796686, 797300, 799863, 803389, 806664, 809478, 812761, 817670, 824234, 830876, 835787, 839030, 842743, 848911, 857350, 866229, 873998, 880238, 885062, 888623, 891244, 893306, 894708, 894883, 893667, 891932, 890972, 891304, 892365, 893515, 895108, 898272, 903702, 911052, 919576, 928959, 939199, 950013, 960834, 971284, 981275, 990798, 999961]
59383I99961R078Q962P956N555K100j721n301p797q317p073n646n311n585n218
59369I81643m097l231l073k954k215j048N7J179K930N692Q968J1570J2765J3272
59355A021458J4646J7560K1266K5021K9076L3494L6666L5995L0023J9490O799
59344A291494m775j2113j3886j1578q087m927j258M127J0167J3307J0264J235
59332A273970r804j8432k3256k5704k6988k6810k5043k2785k0804j8339j4744
59321A041261j1133q941p705n905l403j432m14O04K259L927M706M325L087J772
59307A023008J569L057N226O377O047N276N064N363N607N402M738M182M755O877
59293A092548R543J1205J1248J0153Q742P933Q585J0659J2993J4707J6142J7501
$$ y = [999961, 1009039, 1018001, 1025957, 1031512, 1033612, 1031891, 1026590, 1018793, 1010476, 1003403, 997757, 992446, 986861, 981643, 977546, 974315, 971242, 968288, 966073, 965025, 965082, 966261, 969191, 974883, 983851, 995421, 1008186, 1021458, 1036104, 1053664, 1074930, 1099951, 1129027, 1162521, 1199187, 1235182, 1265205, 1284695, 1291494, 1286719, 1274606, 1260720, 1249142, 1241055, 1236128, 1234870, 1238997, 1249164, 1262471, 1272735, 1273970, 1264166, 1245734, 1222478, 1196774, 1169786, 1142976, 1117933, 1095148, 1074344, 1056005, 1041261, 1030128, 1021187, 1013482, 1007577, 1004174, 1002742, 1002328, 1002932, 1005191, 1009118, 1013824, 1018149, 1021236, 1023008, 1024577, 1027634, 1032860, 1039237, 1045284, 1050560, 1055624, 1060987, 1066594, 1071996, 1076734, 1080916, 1085671, 1092548, 1102091, 1113296, 1124544, 1134697, 1143439, 1151372, 1159957, 1170616, 1183609, 1198316, 1214458, 1231959]
59281A231959J7624J5611J2763J1185J0987J0596R372Q011O662M730K532J138
59269A343170M01r18k932m558n926q489j2122j4419j3962j2302j1381j0872r578
59256A236112p901p117p201p056o309n420m453k932o77J956M378N932O272O012
59242A211596O094O113M274k87o133j1136j4514j6635j7774j8076j7870j7235
59230A108417j5909j4213j3127j2803j2160j0750r782j0137j0532r182o463m383
59218I78976l817l678k603l12K567N079O493P027P736R119J0362J0687J0658J1205
59204A049499J2051J2229J1638J0807R607P655N728N136N481M498P99m169p700
59191A123259q712q368q162q193p507n749l792k690k438k315k018j759j457q15
$$ y = [1231959, 1249583, 1265194, 1277957, 1289142, 1300129, 1310725, 1320097, 1328108, 1334770, 1339500, 1342032, 1343170, 1343571, 1342653, 1339721, 1335163, 1329237, 1320748, 1308626, 1294207, 1280245, 1267943, 1256562, 1245690, 1236112, 1228211, 1221094, 1213893, 1206837, 1200528, 1195108, 1190655, 1187723, 1187046, 1189002, 1193380, 1199312, 1205584, 1211596, 1217690, 1223803, 1228077, 1227790, 1221657, 1210521, 1196007, 1179372, 1161598, 1143522, 1125652, 1108417, 1092508, 1078295, 1065168, 1052365, 1040205, 1029455, 1019673, 1009536, 999004, 989822, 983359, 978976, 975159, 971481, 968878, 968566, 971133, 976212, 982705, 989732, 997468, 1006587, 1016949, 1027636, 1038294, 1049499, 1061550, 1073779, 1085417, 1096224, 1105831, 1113486, 1119214, 1124350, 1129831, 1134329, 1135128, 1130959, 1123259, 1114547, 1106179, 1098017, 1089824, 1082317, 1076568, 1072776, 1070086, 1067648, 1065333, 1063315, 1061556, 1060099, 1059284]
59177A059284j24K8j02L72J451K190K466L352N152O534O543O080O206O183M611
59162A110226J591j600m232o166o989o537n775n738o058n814n263n313n728n379
59148A041225m078k800k193k158k652l556l998l265k242k360l137k543j23J916
59134A008036J537n17j877j436j77L46l36j352j516o14M92J161J875L213M603
59119A013438N062M801M936N712O186N722M718L784L195L233M034N031N403N250
59105A080505N432O311P606R150J0554J0361P338K841J27N23J863J527l98k123
59091A141617l039m020n554p071q027q571r084r722j0360j0578r939q741q103
59078A038808q780j0152j0887j0382r105p832p026o754o696o242m980l156j488
$$ y = [1059284, 1059160, 1059188, 1059086, 1059458, 1060909, 1063099, 1065565, 1068917, 1074069, 1080603, 1087146, 1093226, 1099432, 1105615, 1110226, 1111817, 1110217, 1105985, 1099819, 1092830, 1086293, 1080518, 1074780, 1068722, 1062908, 1057645, 1052332, 1046604, 1041225, 1037147, 1034347, 1032154, 1029996, 1027344, 1023788, 1019790, 1016525, 1014283, 1011923, 1008786, 1006243, 1006120, 1008036, 1009573, 1009056, 1007179, 1005743, 1005566, 1005912, 1005576, 1004224, 1002708, 1002094, 1002586, 1003747, 1005622, 1008835, 1013438, 1018500, 1023301, 1028237, 1033949, 1040135, 1045857, 1050575, 1054359, 1057554, 1060787, 1064821, 1069852, 1075255, 1080505, 1085937, 1092248, 1099854, 1109004, 1119558, 1129919, 1137257, 1140098, 1140225, 1140748, 1142611, 1144138, 1143740, 1141617, 1138578, 1134558, 1129004, 1121933, 1113906, 1105335, 1096251, 1086529, 1076169, 1065591, 1055652, 1046911, 1038808, 1030028, 1019876, 1008989, 998607, 989502, 981670, 974644, 967890, 961194, 954952, 949972, 946816, 945328]
59065I45328m82J4O92K117L994N256N185M297L661L589L698M078N492Q071J0612
59050A005602J1739J1263J0044Q838P833P055O796P440Q789R650Q674N999L486
59037A113208K632K749K171P51k36m09p62j594j789r14m77j813l999n191n123
59022A099204m865m885m895n095n933o784o419n018m326n380p178q131p900p153
59008A015242o398n903o209p683r450r625p240l674j689k692n209o506n581l933
58994I33450l306l572l470k685k079k088k072j452n43J23M83N22j40j461k380
58979I09330j861l33P14N19k78p40n95J95J982M853P875R693R856R095Q380Q120
58963I66805Q297Q767R363J0056J1179J3022J5042J6039J5441J4059J3140J2954
$$ y = [945328, 944846, 944860, 945552, 947669, 951663, 956919, 962104, 966401, 970062, 973651, 977349, 981427, 986919, 994990, 1005602, 1017341, 1028604, 1038648, 1047486, 1055319, 1062374, 1069170, 1076610, 1085399, 1095049, 1103723, 1109722, 1113208, 1115840, 1118589, 1120760, 1121511, 1121275, 1120866, 1120104, 1118510, 1116721, 1115807, 1115330, 1113517, 1109518, 1104327, 1099204, 1094339, 1089454, 1084559, 1079464, 1073531, 1066747, 1060328, 1055310, 1050984, 1045604, 1038426, 1030295, 1022395, 1015242, 1008844, 1002941, 996732, 989049, 979599, 969974, 962734, 959060, 957371, 954679, 949470, 942964, 937383, 933450, 930144, 926572, 923102, 920417, 918338, 916250, 914178, 912726, 912183, 912306, 912789, 913311, 913171, 911710, 909330, 907469, 907136, 907850, 908369, 908091, 907351, 906756, 906951, 908933, 913786, 921661, 931354, 941210, 950305, 958685, 966805, 975102, 983869, 993232, 1003288, 1014467, 1027489, 1042531, 1058570, 1074011, 1088070, 1101210, 1114164]
58951A114164J2779J1952J0402Q236N495K482r4j641k160k084j810j468j048m71
58937A154734L94J678L263M526M672L602K367K189L020L612L253K758L200M252
58923A197520M602L758K533J667J022N17J036L498P164R832J0088Q906Q500R823
58909A270466J1815J3097J3597J3996J4382J4407J4427J5172J6087J5318J2034
58898A424798P931N555N605O578O656N162K562j69k293l947n949q545j0723j1338
58884A421883j0556r554r139r325r915j0583j0510q932o325m312m156n599p256
58871A315721p804o904n404m554m691m926m476l834l994m900n483n097m086l050
58857A246518k273j905j966k075j677p27K83Q59Q02K57n1R25L437O392Q654J0449
$$ y = [1114164, 1126943, 1138895, 1149297, 1157533, 1163028, 1165510, 1165416, 1163775, 1161615, 1159531, 1157721, 1156253, 1155205, 1154734, 1155128, 1156806, 1160069, 1164595, 1169267, 1172869, 1175236, 1177425, 1180445, 1184057, 1187310, 1190068, 1193268, 1197520, 1202122, 1205880, 1208413, 1210080, 1211102, 1211619, 1212655, 1216153, 1223317, 1233149, 1243237, 1252143, 1260643, 1270466, 1282281, 1295378, 1308975, 1322971, 1337353, 1351760, 1366187, 1381359, 1397446, 1412764, 1424798, 1432729, 1438284, 1443889, 1450467, 1457123, 1462285, 1464847, 1464678, 1462385, 1458438, 1452489, 1443944, 1433221, 1421883, 1411327, 1401773, 1392634, 1383309, 1373394, 1362811, 1352301, 1343369, 1337044, 1332732, 1328576, 1322977, 1315721, 1307917, 1301013, 1295609, 1291055, 1286364, 1281438, 1276962, 1273128, 1269134, 1264234, 1258751, 1253654, 1249568, 1246518, 1244245, 1242340, 1240374, 1238299, 1236622, 1235895, 1236178, 1237037, 1237839, 1238096, 1238045, 1238970, 1242407, 1248799, 1257453, 1267902]
58841A267902J2651J5022J6239J5638J4036J2642J1898J1381J0427Q924P865Q557
58829A413182J0774J2539J2580J1984J2262J2862J2412J1481J1711J2619J1874
58818A546280R026O302N045L836J283j687l889o131r376j2287j2915j1868j1496
58805A502123j2389j2794j1590r963r643j0810j2329j3185j3173j2646j2082j1740
58793A359779j1674j2095j3325j5173j6658j6787j5453j3442j1813j1242j1525
58782A210592j1623j0822r868j0089j1378j2063j1237j0032r937j0760j1151j0392
58770A081240q844p343o761p468q418p655m722j794j285k918m290l912k300l41
58756A013189J886M340O247O707N607L660J900J111J213J204K21j309k058j402
$$ y = [1267902, 1280553, 1295575, 1311814, 1327452, 1341488, 1354130, 1366028, 1377409, 1387836, 1396760, 1404625, 1413182, 1423956, 1436495, 1449075, 1461059, 1473321, 1486183, 1498595, 1510076, 1521787, 1534406, 1546280, 1555306, 1561608, 1566653, 1570489, 1571772, 1570085, 1566196, 1560065, 1550689, 1538402, 1525487, 1513619, 1502123, 1489734, 1476940, 1465350, 1455387, 1445744, 1434934, 1422605, 1409420, 1396247, 1383601, 1371519, 1359779, 1348105, 1336010, 1322685, 1307512, 1290854, 1274067, 1258614, 1245172, 1233359, 1222117, 1210592, 1198969, 1188147, 1178279, 1168190, 1156812, 1144749, 1133512, 1123480, 1113543, 1102783, 1091632, 1081240, 1072396, 1065053, 1058292, 1050824, 1042406, 1034751, 1030029, 1028235, 1026950, 1024032, 1019742, 1015830, 1013530, 1013189, 1015075, 1019415, 1025662, 1032369, 1037976, 1041636, 1043536, 1044647, 1045860, 1047064, 1047285, 1045976, 1043918, 1042516]
58742A042516j93J74r33l134n588p498q260p619n993m592m662o281q127q814q268
58727I62728p369o625n870n016m254l484k363r51L92J597K646K982K288J570K064
58712I40335L135K856Q76j037j782k373l732m937m963m593m970n486m739k827
58698I05763j128m50o63j536k588k828j918r88j062j385o82P00J465J586K123
58683H96409L222M023M434N203O213O303N178M101M321N767P512Q611Q405P051
58669I76753N821N922O943P399O782N975N662N571N513N945O926P431O447M266
58655A063356K184J216J401K157L078M192N328N594M309K426J840K736K942P80
58641A103539k674n379p171r231j1713j3787j5369j6934j7944j7450j6067j5418
$$ y = [1042516, 1042323, 1042497, 1041564, 1038430, 1032842, 1025344, 1017084, 1009465, 1003472, 998880, 994218, 987937, 979810, 970996, 962728, 955359, 948734, 942864, 937848, 933594, 930110, 927747, 926796, 927188, 928785, 931431, 934413, 936701, 938271, 940335, 943470, 946326, 947202, 946165, 944383, 942010, 938278, 933341, 928378, 923785, 918815, 913329, 908590, 905763, 904635, 904185, 903522, 901986, 899398, 896570, 894652, 893664, 892602, 891217, 890535, 891235, 892700, 894286, 896409, 899631, 903654, 908088, 913291, 919504, 925807, 930985, 935086, 939407, 945174, 952686, 961297, 969702, 976753, 982574, 988496, 995439, 1002838, 1009620, 1015595, 1021257, 1026828, 1032341, 1038286, 1045212, 1052643, 1059090, 1063356, 1065540, 1066756, 1068157, 1070314, 1073392, 1077584, 1082912, 1088506, 1092815, 1095241, 1097081, 1099817, 1102759, 1103539, 1100865, 1095486, 1088315, 1079084, 1067371, 1053584, 1038215, 1021281, 1003337, 985887, 969820, 954402]
58629I54402j5631j5358j4402j4130j4747j4260j1143o572k983j634k319m224
58617H36999o124o833o358n860n855n460l975k153j074o64j68P14J932L622N763
58602H04506P743Q923R172Q599P359O027N243M593K777m96l651m982m467l261
58588H48085k275j963k739m489o141o593n876m754l711k927k773l451m406m786
58574G91201m327l207j423R39L046L780K976J604O35K68L33R62K484M841P239
58559H11351Q412P461M879K677K836N128O844N482J725j041o09J541K438J525
58545H60649Q68J715K757K443J270N57K42n61j661k028j493p54%J050J986J981
58529H69021J245Q08Q80P49M68J284L900P410J0346J1981J2312J1746J1135J1355
$$ y = [954402, 938771, 923413, 909011, 894881, 880134, 865874, 854731, 848159, 845176, 843542, 841223, 836999, 830875, 824042, 817684, 811824, 805969, 800509, 796534, 794381, 793307, 792643, 792475, 793189, 795121, 798743, 804506, 812249, 821172, 830344, 838943, 846302, 852329, 857572, 862165, 864942, 864446, 860795, 855813, 851346, 848085, 845810, 843847, 841108, 836619, 830478, 823885, 818009, 813255, 809544, 806617, 803844, 800393, 795987, 791201, 786874, 783667, 782244, 783183, 786229, 790009, 792985, 794589, 795224, 795492, 795825, 796787, 799271, 804112, 811351, 819763, 827224, 832103, 834780, 837616, 842744, 849588, 855070, 856795, 855754, 855145, 856686, 859124, 860649, 861517, 863232, 865989, 868432, 869702, 870259, 870501, 869940, 868279, 866251, 864758, 864004, 864004, 865054, 867040, 869021, 870266, 871074, 871954, 872703, 873171, 874455, 878355, 885765, 896111, 908092, 920404, 932150, 943285, 954640]
58515I54640J2461J3662J4199J3683J2035R949R067J0487J3252J5432J6528J7462
58503A112857J8607J9583K0949K3974K8135L0755L0211K7987K6411K5760K4799
58492A390028K3035K0961J8708J5781J1928P426K876p36k472k674l142n202q109
58479A468408j0181j1124j2253j4668j8023k1151k3180k4049k4336k4710k5231
58468A259502k5166k3680k0781j7583j5556j5271j5714j5063j2553r356p268o764
58456A074747o821o436n660n220n608o539p044o371n003m254m539m867m505m070
58442I97810m035l429j438P40J368Q41R98K210L112K975K427J861J124Q15J891
58427A009270L748M628M245M122M999N993O768Q370J1047J3255J3963J4246J5398
$$ y = [954640, 967101, 980763, 994962, 1008645, 1020680, 1030629, 1039696, 1050183, 1063435, 1078867, 1095395, 1112857, 1131464, 1151047, 1171996, 1195970, 1224105, 1254860, 1285071, 1313058, 1339469, 1365229, 1390028, 1413063, 1434024, 1452732, 1468513, 1480441, 1487867, 1490743, 1490007, 1487535, 1484861, 1481719, 1476517, 1468408, 1458227, 1447103, 1434850, 1420182, 1402159, 1381008, 1357828, 1333779, 1309443, 1284733, 1259502, 1234336, 1210656, 1189875, 1172292, 1156736, 1141465, 1125751, 1110688, 1098135, 1088779, 1081511, 1074747, 1067926, 1061490, 1055830, 1050610, 1045002, 1038463, 1031419, 1025048, 1020045, 1015791, 1011252, 1006385, 1001880, 997810, 993775, 990346, 988908, 989648, 991016, 991857, 992855, 995065, 998177, 1001152, 1003579, 1005440, 1006564, 1007379, 1009270, 1013018, 1017646, 1021891, 1026013, 1031012, 1037005, 1043773, 1052143, 1063190, 1076445, 1090408, 1104654, 1120052]
58414A120052J7006J7997J8240J8037J7138J5323J2850R726N691J540r59j261
58402A251380q58j191k128l184m475n582n107k712q8J269K041L524N463O794P497
58387A252643Q146Q420P503N445L039O76j871m832q086j0968j2332j1595r759
58374A226429q368p501o091m198l214l565l896k988q94K112N714Q495Q842P488
58360A218365O910P618P487N559L687L278L163K208J304R35n21l760o357o207
58346A243669n036n705p817q762p841o525n595m639l682l009k037k71J353J727
58332A185830J451J727K446K949L512M427M893M480M380N427O351N974N524O653
58318A246024Q530R183Q520P759P138O422O458P905R573J0210J0717J2217J3437
$$ y = [1120052, 1137058, 1155055, 1173295, 1191332, 1208470, 1223793, 1236643, 1246369, 1252060, 1253600, 1252641, 1251380, 1250522, 1249331, 1247203, 1244019, 1239544, 1233962, 1228855, 1226143, 1226055, 1227324, 1229365, 1232889, 1238352, 1245146, 1252643, 1260789, 1269209, 1276712, 1282157, 1285196, 1285872, 1284001, 1279169, 1271083, 1260115, 1247783, 1236188, 1226429, 1218061, 1210560, 1204469, 1200271, 1197057, 1193492, 1189596, 1186608, 1185714, 1187826, 1193540, 1202035, 1210877, 1218365, 1225275, 1232893, 1240380, 1245939, 1249626, 1252904, 1256067, 1258275, 1259579, 1260514, 1259993, 1256233, 1249876, 1243669, 1238633, 1232928, 1225111, 1216349, 1208508, 1201983, 1196388, 1191749, 1188067, 1185058, 1183021, 1182750, 1184103, 1185830, 1187281, 1189008, 1191454, 1194403, 1197915, 1202342, 1207235, 1211715, 1216095, 1221522, 1227873, 1233847, 1239371, 1246024, 1254554, 1263737, 1272257, 1280016, 1287154, 1293576, 1300034, 1307939, 1317512, 1327722, 1338439, 1350656, 1364093]
58305A364093J2666J1055J1023J2331J2770J2100J2269J3979J5789J6676J7097
58294A511848J7437J7400J6907J6040J4545J2737J1976J2573J2592J0666Q638
58283A663359R044J1200J2301J1449J0078R305R243J0191J2174J4081J5219J6596
58271A804240J8775K0133J9578J9152K1089K4033K5283K5066K5275K5451K3755
58260B051830K0779J8793J8059J7285J6674J7102J7418J6159J4815J5615J7289
58249B241818J7089J5916J7091K0773K4022K5819K7437K8420K7096K5007K5934
58238B496422K9975L3205L3700L3451L3725L3254L2058L2569L5430L8061L8937
58227B870787L9815M2375M5806M8906N1648N3786N4609N4729N5710N7809O0462
$$ y = [1364093, 1376759, 1387814, 1398837, 1411168, 1423938, 1436038, 1448307, 1462286, 1478075, 1494751, 1511848, 1529285, 1546685, 1563592, 1579632, 1594177, 1606914, 1618890, 1631463, 1644055, 1654721, 1663359, 1672403, 1683603, 1695904, 1707353, 1717431, 1726736, 1735979, 1746170, 1758344, 1772425, 1787644, 1804240, 1823015, 1843148, 1862726, 1881878, 1902967, 1927000, 1952283, 1977349, 2002624, 2028075, 2051830, 2072609, 2091402, 2109461, 2126746, 2143420, 2160522, 2177940, 2194099, 2208914, 2224529, 2241818, 2258907, 2274823, 2291914, 2312687, 2336709, 2362528, 2389965, 2418385, 2445481, 2470488, 2496422, 2526397, 2559602, 2593302, 2626753, 2660478, 2693732, 2725790, 2758359, 2793789, 2831850, 2870787, 2910602, 2952977, 2998783, 3047689, 3099337, 3153123, 3207732, 3262461, 3318171, 3375980, 3436442]
58216C436442O4230O9274P3033P3181P1931P3359P7423Q1031Q3963Q8580R4362
58205D286809R8412J01301J06821J15519J23924J30737J38348J47448J55637J62421
58195E567377J70342J79942J88585J95446K02948K12359K22545K33583K46917
58186G420044K61670K75529K89192L04887L21220L35236L48890L67079L89903
58177A0313650M13589M38336M67681N00570N31929N61175N92222O25549O58884
58168A5103585O95142P40143P92496Q45865R01112R65259J037990J111093J182332
58159B3375017J257803J339458J423539J513068J617798J739257J870343K012322
58151C6148605K176336K364702K567942K785303L030555L311824L623909L966680
$$ y = [3436442, 3500672, 3569946, 3642979, 3716160, 3788091, 3861450, 3938873, 4019904, 4103867, 4192447, 4286809, 4385221, 4486522, 4593343, 4708862, 4832786, 4963523, 5101871, 5249319, 5404956, 5567377, 5737719, 5917661, 6106246, 6301692, 6504640, 6716999, 6939544, 7173127, 7420044, 7681714, 7957243, 8246435, 8551322, 8872542, 9207778, 9556668, 9923747, 10313650, 10727239, 11165575, 11633256, 12133826, 12665755, 13226930, 13819152, 14444701, 15103585, 15798727, 16538870, 17331366, 18177231, 19078343, 20043602, 21081592, 22192685, 23375017, 24632820, 25972278, 27395817, 28908885, 30526683, 32265940, 34136283, 36148605, 38324941, 40689643, 43257585, 46042888, 49073443, 52385267, 56009176, 59975856]
58143E9975856M352397M789794N283193N853541O534732P340723Q264056R315959
58135A11710251J0534769J1942555J3530927J5302670J7282233J9479215K1921296
58128B21703916K4734074K7992098L1247205L3210194L2183193K7110690J8362615
58121D16543985P573631l220441j2400492j9110758k3222712k5124847k5437315
58114C15601051k4746885k3483508k1941602k0326178j8758134j7284317j5919291
58107A73141136j4671001j3528398j2457293j1427731j0432723r475366q557256
58100I2591368p687785o886539o165312n519369m942075m434591l995268l613277
58092D9347152l279795k993737k750290k535235k337205k155588j990871j837406
$$ y = [59975856, 64328253, 69118047, 74401240, 80254781, 86789513, 94130236, 102394292, 111710251, 122245020, 134187575, 147718502, 163021172, 180303405, 199782620, 221703916, 246437990, 274430088, 305677293, 338887487, 371070680, 398181370, 416543985, 424117616, 420897175, 408496683, 389385925, 366163213, 341038366, 315601051, 290854166, 267370658, 245429056, 225102878, 206344744, 189060427, 173141136, 158470135, 144941737, 132484444, 121056713, 110623990, 101148624, 92591368, 84903583, 78017044, 71851732, 66332363, 61390288, 56955697, 52960429, 49347152, 46067357, 43073620, 40323330, 37788095, 35450890, 33295302, 31304431, 29467025]
58084B9467025j691713j558345j441257j337184j242521j158546j084852j015597
58076A8937010r47524q84511q29408p78391p28066o81232o40740o03986n68218
58067A2274934n35455n07588m81967m56066m31425m09347l87800l65998l46792
58058H352496l31195l15929k99476k84974k73733k61799k46755k32257k21558
58049E884820k11977k00349j88946j81091j75383j69094j63337j59975j56922
58040D277746j51385j44862j40465j37683j33924j28999j24466j20523j16680
58031C078759j13337j10039j04605r6687q9436q5031q1305p5530o8620o2814n8198
58020B133157n4293n2144n1794n0716m7745m5547m6023m6473m3924m0190l8541
$$ y = [29467025, 27775312, 26216967, 24775710, 23438526, 22196005, 21037459, 19952607, 18937010, 17989486, 17104975, 16275567, 15497176, 14769110, 14087878, 13447138, 12843152, 12274934, 11739479, 11231891, 10749924, 10293858, 9862433, 9453086, 9065286, 8699288, 8352496, 8021301, 7705372, 7405896, 7120922, 6847189, 6585390, 6338635, 6106378, 5884820, 5672843, 5472494, 5283548, 5102457, 4927074, 4757980, 4594643, 4434668, 4277746, 4126361, 3981499, 3841034, 3703351, 3569427, 3440428, 3315962, 3195439, 3078759, 2965422, 2855383, 2750778, 2654091, 2564655, 2479624, 2398319, 2322789, 2254169, 2191355, 2133157, 2078864, 2026720, 1974926, 1924210, 1876465, 1830918, 1784895, 1738422, 1694498, 1654308, 1615767]
58009A615767l8104l5965l2560l0403k9139k6486k3114k2037k3511k4483k3350
57998A306615k1752k1343k1626k1521k0893k0015j9147j8630j8375j7660j6458
57987A089195j5933j6567j7093j6634j6286j7015j7592j6431j4101j2188j1076
57976I18279j0558j1042j2246j2344j0566r024r786j1647j2121j1225j0733j0959
57964G86028j0998j1110j2190j3431j3135j1474j0223j0068j0171j0005r704r078
57952F54441q035p389p576p423n937m358m362n111m436k234l00P13J665K527K080
57937F04265K53j454k227k687l061k432l70K049L396L108J547j68o89O0K99j357
57921F00532l535l676j727l48j311l483m943n463n969o719p119o864o414o309
$$ y = [1615767, 1577663, 1541698, 1509138, 1478735, 1449596, 1423110, 1399996, 1377959, 1354448, 1329965, 1306615, 1284863, 1263520, 1241894, 1220373, 1199480, 1179465, 1160318, 1141688, 1123313, 1105653, 1089195, 1073262, 1056695, 1039602, 1022968, 1006682, 989667, 972075, 955644, 941543, 929355, 918279, 907721, 896679, 884433, 872089, 861523, 852499, 842713, 831066, 818945, 807720, 796987, 786028, 775030, 763920, 751730, 738299, 725164, 713690, 703467, 693399, 683228, 673223, 663519, 654441, 646406, 639017, 631441, 624018, 618081, 613723, 609361, 604250, 599814, 597580, 597280, 597993, 599658, 602185, 604265, 604518, 603064, 600837, 598150, 595089, 592657, 592287, 594336, 597732, 600840, 602387, 602219, 601530, 601590, 601889, 600532, 596997, 593321, 591594, 591246, 589935, 586452, 581509, 576046, 570077, 563358, 556239, 549375, 542961, 536652]
57907E36652o378n816m121j867j10Q08J267J265M36p82j316j261k050l999n329
57892E07399m750l581l645m309l587j433N8l73j698k235j495j52R33J511K188
57877D84831L567N001N015L486K257K683L739L658K436J363R61Q21P60Q01M88
57862E21867n75k014l475n248p156p914o976n871o077o594n522l267k120l001
57848D56057m466m800l555j284Q44J480N55j90N34J590J243P5k7J037J712J596
57832D52401J672J905J119n79j600j426j131r54J65K004K419M81j761k040p39
57817D51936L48O50O83M55m95k012l483m722n826o506o243m790k355K48J645J061
57801D20594l70n55Q83K115J760Q58J289L234N255O212O101N422M674M254M154
$$ y = [536652, 530274, 524458, 520337, 518470, 518360, 519168, 520435, 521700, 522136, 521354, 520038, 518777, 516727, 512728, 507399, 502649, 499068, 495423, 491114, 487527, 486094, 486152, 485779, 484081, 481846, 480351, 480199, 481132, 482643, 484831, 488398, 493399, 498414, 501900, 504157, 506840, 510579, 514237, 516673, 518036, 518997, 519818, 520578, 521379, 521867, 521292, 519278, 515803, 510555, 503399, 495485, 488509, 482638, 476561, 469967, 464445, 461178, 459058, 456057, 451591, 446791, 443236, 441952, 442796, 444276, 444831, 444641, 445175, 446765, 448008, 448083, 448056, 449093, 450805, 452401, 454073, 455978, 457097, 456518, 454918, 453492, 452361, 451407, 451572, 453576, 455995, 456476, 454715, 452675, 451936, 452284, 452934, 453617, 454072, 453577, 451565, 448082, 443360, 437534, 431028, 424785, 419995, 417640, 417888, 419533, 420594, 420224, 419669, 420552, 422667, 424427, 425285, 426574, 429808, 435063, 441275, 447376, 452798, 457472, 461726, 465880]
57786D65880L882L146K343J965J732Q57r65l173m954n970o526p019p300o782n344
57771D31772l774k943k803k669k219j682j245r61j034j569k076j891j018q4M14
57756D06218L08o05k332m211n379n701n773o050o472o724o441n495m585m917o558
57741C35283p647o305k885N23K442K789J878R3j592k104j405j90J258K812L552
57726C28502K654J127R51K306L280K756J905K121L034L495L387L343L510L598
57712C65969L595L663L741L659L265K303P74n93j126j569l379o378q472q416p481
57697C49555p409p924p686o776o540p195p202n447k864j161o28k8J466K944K831
57682B95936J038o02k60J872L907M326L348K466K998M912O703O700M848K848K239
$$ y = [465880, 469762, 472908, 475251, 477216, 478948, 479805, 478840, 475667, 470713, 464743, 458217, 451198, 443898, 437116, 431772, 427998, 425055, 422252, 419583, 417364, 415682, 414437, 413476, 412442, 410873, 408797, 406906, 405888, 405804, 406218, 406526, 405921, 403589, 399378, 393999, 388298, 382525, 376475, 370003, 363279, 356838, 351343, 346758, 341841, 335283, 327636, 321331, 318446, 318969, 321411, 324200, 326078, 326171, 324579, 322475, 321070, 320880, 322138, 324950, 328502, 331156, 332283, 333234, 335540, 338820, 341576, 343481, 345602, 348636, 352131, 355518, 358861, 362371, 365969, 369564, 373227, 376968, 380627, 383892, 386195, 386969, 386376, 385250, 383681, 380302, 373924, 365452, 357036, 349555, 342146, 334222, 326536, 319760, 313220, 306025, 298823, 293376, 290512, 289351, 288723, 288695, 290161, 293105, 295936, 296974, 296372, 296112, 297984, 301891, 306217, 309565, 312031, 315029, 319941, 326644, 333344, 338192, 341040, 343279]
57667C43279K837L489L571L049J945P86Q41K477L889K919o0k580l121k292j168
57652C59861j85K48j59o38j25O40m06l402n618m780j916J96K44r83k091k077o94
57635C38115J084J691Q55J34P40J678J072j359m201o151o912o606n309l235q01
57620C10795J505L234M281N136O289P385P814Q187J0162J4363J9517K4194K8414
57607D51276L2872L7301M0172L9411L3204K1398O784o191j4944k0367k4393k7229
57595E69294k8018k7031k5654k4614k3544k2035k0166j8051j5744j3473j1450
57584C39514r711q446p996q081p708o422n003m362m292l978l210k391j884j877
57570B64153k398k967k788j713m12O15J369J454J61k012l279k802j825j679k008
$$ y = [343279, 346116, 349605, 353176, 356225, 358170, 358956, 359797, 362274, 366163, 369082, 369022, 366442, 363321, 361029, 359861, 359676, 359924, 359765, 359127, 359002, 359642, 359236, 355834, 350216, 345436, 343520, 343716, 343960, 342977, 340886, 338809, 338115, 339199, 340890, 341745, 341879, 342619, 344297, 345369, 344010, 339809, 333658, 326746, 320140, 314831, 311596, 310795, 312300, 315534, 319815, 324951, 331240, 338625, 346439, 354626, 364788, 379151, 398668, 422862, 451276, 484148, 521449, 561621, 601032, 634236, 655634, 662418, 656227, 641283, 620916, 596523, 569294, 541276, 514245, 488591, 463977, 440433, 418398, 398232, 380181, 364437, 350964, 339514, 329803, 321357, 313361, 305280, 297572, 291150, 286147, 281785, 277493, 273515, 270305, 267914, 266030, 264153, 261755, 258788, 256000, 254287, 253875, 254490, 255859, 257313, 257474, 255462, 252183, 249381, 247556, 245877, 243869]
57555B43869k053k250l118l776l245k205j762j393m1J468J280m58j537q63J82
57540B24098l7j345k461k577j743o56k94j087k227k624k379k525l426m516n390
57525A90811o021n964m624k446p19J3L30O57O94L31K0j49o94j679k308k036j423
57508A64793j376k079k979l397l047k330k081k528k761j858k60Q56J264J703K317
57493A46237K384J695J041Q68N52m61j744k570k793k526j751p47k09l80p22r00
57477A37974j452k809m177m267k938j472j127j867k645k630j840o29J020L244
57463A14385N443O483O080N306N121N037M055K571K231M000P144J0101J1562J0923
57449B00442Q649O341N477N821N769M418K497J102L59k19p66j003q13m65m51j134
$$ y = [243869, 241816, 239566, 236448, 232672, 229427, 227222, 225460, 224067, 224026, 225494, 226774, 226316, 224779, 223916, 224098, 224061, 222716, 220255, 217678, 215935, 215279, 214985, 213898, 211671, 209047, 206668, 204143, 200717, 196201, 190811, 184790, 178826, 174202, 171756, 171037, 171050, 171380, 172037, 172731, 173062, 173082, 172933, 172239, 170560, 168252, 166216, 164793, 163417, 161338, 158359, 154962, 151915, 149585, 147504, 144976, 142215, 140357, 140097, 140953, 142217, 143920, 146237, 148621, 150316, 151357, 152225, 152777, 152316, 150572, 148002, 145209, 142683, 140932, 140185, 139976, 139596, 138874, 137974, 136522, 133713, 129536, 125269, 122331, 120859, 119732, 117865, 115220, 112590, 110750, 110121, 111141, 114385, 119828, 126311, 132391, 137697, 142818, 147855, 151910, 154481, 156712, 160712, 167856, 177957, 189519, 200442, 209091, 215432, 220909, 226730, 232499, 236917, 239414, 240516, 240875, 240656, 239890, 238887, 238074, 237609, 237158, 236024]
57433B36024k304l124k981k291k041k599l509m250m572m186k938j431p12j126
57419A97960j994k485k320j587n60J57Kq70j726k163k354k360j860p24O33J537
57403A79286J486M40q52j188j90R67R85K86M97K116L781L991K637O89p85j034
57387A93112N7J704K785K811K003P12m78n24J036K949L391K275J178R49R17O71
57371B15548R95K324L652L920L347K563J537L54O0J398L365M168L366K115J437
57356B50149J115L69q64j540n08J981M102M429L653L390L717L400K422K226K986
57341B81027K734M02k109k537j372m92R5J825M511O033N282L452K117J564J455
57326C03987J722K172K353K370K967M298N481N776N443M959M251L254K468K269
$$ y = [236024, 233720, 230596, 227615, 225324, 223283, 220684, 217175, 212925, 208353, 204167, 201229, 199798, 199086, 197960, 195966, 193481, 191161, 189574, 189014, 189171, 189173, 188303, 186577, 184414, 182060, 179700, 177840, 177116, 177749, 179286, 180772, 181212, 180360, 179172, 178982, 179949, 180934, 181220, 181717, 183833, 187614, 191605, 194242, 194931, 194146, 193112, 193169, 194873, 197658, 200469, 202472, 203184, 202706, 202182, 203218, 206167, 209558, 211833, 213011, 213960, 214877, 215548, 216543, 218867, 222519, 226439, 229786, 232349, 233886, 234240, 234300, 235698, 239063, 243231, 246597, 248712, 250149, 251264, 251633, 250769, 249229, 248721, 250702, 254804, 259233, 262886, 266276, 269993, 273393, 275815, 278041, 281027, 283761, 284163, 282054, 279517, 278145, 277653, 277748, 279573, 284084, 290117, 295399, 298851, 300968, 302532, 303987, 305709, 307881, 310234, 312604, 315571, 319869, 325350, 331126, 336569, 341528, 345779, 349033, 351501, 353770]
57312C53770K263K035K028K811L790L825L052L091M859P084P791O750N467M986
57298D13602M872M614M730N720O920P498P904R001J0181R935Q292P088P374Q010
57284E15741P614O533N838N441M663L907M209N329N746M828L771L869M792N308
57270E87589N157N235O028O756O541N842N915P027Q056Q173Q003Q502R407R795
57256F88026R675R905J0636J1001J0504R770R604J0122J0934J1546J1469J0664
57244H13856R882R837J0185J0238J0307J1085J2028J1999J1411J1769J2757J2150
57232I47504R516P679R015J2109J3979J4093J3998J4123J3367J1549J0160J0399
57220A087491J1906J3511J4357J4472J5100J7880K2608K6576K7521K6625K6972
$$ y = [353770, 356033, 358068, 360096, 362907, 366697, 370522, 373574, 376665, 381524, 388608, 396399, 403149, 408616, 413602, 418474, 423088, 427818, 433538, 440458, 447956, 455860, 464861, 475042, 484977, 493269, 500357, 507731, 515741, 523355, 529888, 535726, 541167, 545830, 549737, 553946, 559275, 565021, 569849, 573620, 577489, 582281, 587589, 592746, 597981, 604009, 610765, 617306, 623148, 629063, 636090, 644146, 652319, 660322, 668824, 678231, 688026, 697701, 707606, 718242, 729243, 739747, 749517, 759121, 769243, 780177, 791723, 803192, 813856, 823738, 833575, 843760, 853998, 864305, 875390, 887418, 899417, 910828, 922597, 935354, 947504, 957020, 964699, 973714, 985823, 999802, 1013895, 1027893, 1042016, 1055383, 1066932, 1077092, 1087491, 1099397, 1112908, 1127265, 1141737, 1156837, 1174717, 1197325, 1223901, 1251422, 1278047, 1305019]
57209A305019K9482L2127L3060L2722L2529L2994L3643L3701L2512L0140K7727
57198A655656K6442K6167K6038K5937K6255K6527K5857K4792K5170K7762L1323
57187A947926L4453L7108L9670M1672M2213M1015L8564L5741L3522L2319L1351
57176B355554K9383K6247K2826J9578J6156J2724J0373R563R188P997O377N953
57164B531919P761J1320J5281J8620K1366K4355K8113L2182L6003M0087M5414
57153B812421N1734N7424O1220O3284O4313O4550O4058O3096O1634N9104N5239
57142C478077N0676M6210M1809L6888L1348K5806K0803J6187J1633P677N644O073
57130C778831P504P926P368P821J0083J2156J1759R257O734N300M901N764P923
$$ y = [1305019, 1334501, 1366628, 1399688, 1432410, 1464939, 1497933, 1531576, 1565277, 1597789, 1627929, 1655656, 1682098, 1708265, 1734303, 1760240, 1786495, 1813022, 1838879, 1863671, 1888841, 1916603, 1947926, 1982379, 2019487, 2059157, 2100829, 2143042, 2184057, 2222621, 2258362, 2291884, 2324203, 2355554, 2384937, 2411184, 2434010, 2453588, 2469744, 2482468, 2492841, 2502404, 2511592, 2519589, 2525966, 2531919, 2539680, 2551000, 2566281, 2584901, 2606267, 2630622, 2658735, 2690917, 2726920, 2767007, 2812421, 2864155, 2921579, 2982799, 3046083, 3110396, 3174946, 3239004, 3302100, 3363734, 3422838, 3478077, 3528753, 3574963, 3616772, 3653660, 3685008, 3710814, 3731617, 3747804, 3759437, 3767114, 3772758, 3778831, 3786335, 3794261, 3801629, 3809450, 3819533, 3831689, 3843448, 3852705, 3859439, 3864739, 3869640, 3875404, 3883327]
57117C883327R762R273O766M584M089M769O098Q080R672R090O429L996L105K493
57103C971533P39j680l952o650j0341j3944j6066j6898j7453j7874j7713j6805
57091C832896j4873j1346o804l482k935m253n662o788p961q670q521q905j1831
57078C730865j7767k6065l6661m9342o2062p2359q0456q8974r9273j09940j19373
57067B968593j28261j38653j51582j66399j81852j97260k12916k29727k48515
57058A313428k69849k94492l23201G0060c21325m29367m69904n12531n56349o02454
57048b891930o54355p14465p81594q53722r31676j017734j111605j210186j310649
57039a1477916j411735j513070j615691j722506j835871j955270k078801k204022
$$ y = [3883327, 3893089, 3902362, 3909128, 3913712, 3917801, 3922570, 3928668, 3936748, 3946420, 3955510, 3961939, 3965935, 3969040, 3971533, 3972272, 3970592, 3966640, 3959990, 3949649, 3935705, 3919639, 3902741, 3885288, 3867414, 3849701, 3832896, 3818023, 3806677, 3799873, 3796391, 3793456, 3789203, 3783541, 3776753, 3768792, 3760122, 3751601, 3742696, 3730865, 3713098, 3687033, 3650372, 3601030, 3538968, 3466609, 3386153, 3297179, 3197906, 3087966, 2968593, 2840332, 2701679, 2550097, 2383698, 2201846, 2004586, 1791670, 1561943, 1313428, 1043579, 749087, 425886, 70060, -321325, -750692, -1220596, -1733127, -2289476, -2891930, -3546285, -4260750, -5042344, -5896066, -6827742, -7845476, -8957081, -10167267, -11477916, -12889651, -14402721, -16018412, -17740918, -19576789, -21532059, -23610860, -25814882]
57031b5814882k324694k432222k528454k632692k760404k889191k961039k938495
57023d7282073k863852k854442l027845l413391l906051m280527m260336l625616
57015g5514133k318390m84587J579031L540139N138616O238569O822264O950224
57007d8048267O714392O204992N500386M673626L800817K961395K230047J663848
56999a4298764J289570J098543J054174J107551J210672J322863J413892J466347
56991d335152J474820a419001d7591A225736J157405J032867R05863P81356O65502
56982E768729N64054M78919M08166L49457L02120K65776K38413K16573J97129
56973H789336J79004J63504J52324J44063J32843J11798P8637L7722l024l6779
$$ y = [-25814882, -28139576, -30571798, -33100252, -35732944, -38493348, -41382539, -44343578, -47282073, -50145925, -53000367, -56028212, -59441603, -63347654, -67628181, -71888517, -75514133, -77832523, -78317110, -76738079, -73197940, -68059324, -61820755, -54998491, -48048267, -41333875, -35128883, -29628497, -24954871, -21154054, -18192659, -15962612, -14298764, -13009194, -11910651, -10856477, -9748926, -8538254, -7215391, -5801499, -4335152, -2860332, -1419001, -47591, 1225736, 2383141, 3416008, 4321871, 5103227, 5768729, 6332783, 6811702, 7219868, 7569325, 7871445, 8137221, 8375634, 8592207, 8789336, 8968340, 9131844, 9284168, 9428231, 9561074, 9672872, 9751509, 9789231, 9786207, 9749428]
56963I749428o0481p5083q4146r1345r8354j04902j10352j14467j17009j17882
56953H775407j17924j18422j19523j20094j19544j18703j18402j18399j18575
56944G705821j20292j25340j33957j44759j56299j67839j78954j89294j98737
56935F290350k07093k13781k18321k21073k22961k24464k25355k25336k24382
56926D307584k22452k19136k13689k05465j94592j82424j70872j60936j52144
56917B585874j43680j35583j28511j22658j17416j11771j04752r5943q6003p6398
56907A463159o8132o1089n4822m9363m4702m0129l4965k9542k4614k0129j5485
56896A020187j0900p515o077o368p981j0823j4452j7721j9764k1039k2789k5346
$$ y = [9749428, 9688947, 9613864, 9529718, 9438373, 9340019, 9235117, 9124765, 9010298, 8893289, 8775407, 8657483, 8539061, 8419538, 8299444, 8179900, 8061197, 7942795, 7824396, 7705821, 7585529, 7460189, 7326232, 7181473, 7025174, 6857335, 6678381, 6489087, 6290350, 6083257, 5869476, 5651155, 5430082, 5207121, 4982657, 4757302, 4531966, 4307584, 4085132, 3865996, 3652307, 3446842, 3252250, 3069826, 2898954, 2738018, 2585874, 2442194, 2306611, 2178100, 2055442, 1938026, 1826255, 1721503, 1625560, 1539557, 1463159, 1395027, 1333938, 1279116, 1229753, 1185051, 1144922, 1109957, 1080415, 1055801, 1035672, 1020187, 1009287, 1001772, 995695, 989327, 981346, 970523, 956071, 938350, 918586, 897547, 874758, 849412]
56884H49412k7285k6663k3173j8748j5575j3819j1975r273o561m538k455N98M193
56871F94138P508J0753J4146J6121J4419Q878J652n325j1491j6211j8309j7883
56859F98396j7042j7443j8258j7744j6006j4740j4747j5138j4949j4295j3723
56848E24311j3410j3361j3727j4361j4445j2965r700n761l072k905m517n590m530
56835D05967k235q79j063j067P81L831O062O751P204Q802J1189J2799J2535J0514
56821D81191P563M574K113K99q92j133k6J902L214L180K885L859O089Q333J0015
56806E33166J1635J3423J5105J7097K0438K5000K9101L1550L2741L2893L0675
56795G92824K4879J6493P729r8o492j0480j1373j0317r420r277q803p387n487
$$ y = [849412, 822127, 795464, 772291, 753543, 737968, 724149, 712174, 702901, 696340, 691802, 689347, 689945, 694138, 701646, 712399, 726545, 742666, 757085, 765963, 767615, 762290, 750799, 734588, 716279, 698396, 681354, 663911, 645653, 627909, 611903, 597163, 582416, 567278, 552329, 538034, 524311, 510901, 497540, 483813, 469452, 455007, 442042, 432342, 426581, 423509, 420604, 416087, 410497, 405967, 403732, 402853, 401790, 400723, 401504, 405335, 411397, 418148, 425352, 434154, 445343, 458142, 470677, 481191, 488754, 493328, 495441, 495740, 494848, 493715, 493689, 495591, 498805, 501985, 504870, 508729, 514818, 523151, 533166, 544801, 558224, 573329, 590426, 610864, 635864, 664965, 696515, 729256, 762149, 792824, 817703, 834196, 841925, 841827, 835335, 824855, 813482, 803165, 793745, 784468, 775665, 768278, 762791]
56782G62791l096O43N653J0418J4068J7776K3124L0035L7245M3837M8935N0486
56770A041915M6046L5397K1467P943l634j3859k2967k9533l2165l1558k9729k7613
56758I61710k4702k0981j7543j4699j1165o220j256K254N237R688J5673K1358
56746I19354K5389K7387K6426K1214J2040R56j0075j9779k6639k9522k9512k9205
56734H88034k9563k9237k7322k4746k2248j9084j4940j1194q922p211m853k284
56722F86430k55J972N223Q193Q539N729J222l600q198j1993j4351j5475j6182
56709F47254j6828j7314j7818j8490j8774j8039j6589j5155j3803j2322j1232
56698D70890j1189j1615j1207r758q450q251q857r189q364o236l752k442k891
$$ y = [762791, 759695, 760338, 765991, 776409, 790477, 808253, 831377, 861412, 898657, 942494, 991429, 1041915, 1087961, 1123358, 1144825, 1152768, 1149134, 1135275, 1112308, 1082775, 1050610, 1019052, 989323, 961710, 937008, 916027, 898484, 883785, 872620, 866400, 865144, 867398, 872635, 882323, 897996, 919354, 944743, 972130, 998556, 1019770, 1031810, 1032766, 1022691, 1002912, 976273, 946751, 917239, 888034, 858471, 829234, 801912, 777166, 754918, 735834, 720894, 709700, 700778, 693567, 688714, 686430, 686175, 688147, 693370, 701563, 710102, 715831, 717053, 713453, 705255, 693262, 678911, 663436, 647254, 630426, 613112, 595294, 576804, 558030, 539991, 523402, 508247, 494444, 482122, 470890, 459701, 448086, 436879, 427121, 418671, 410420, 401563, 392374, 384010, 377774, 374022, 371580, 368689]
56685C68689l898l935l027k385k621l248l688l761l424k933k983l771m248l311
56671C21456j429j2M22M16K34k78p21m91k2k93j007p88O48J926K008J369P11l9
56653C24110q36r23k9R06J031P63Q61J161J123Q32O27K83n65j650k359k455k002
56636C20878j126k99k77j121j938k063j896j909j663o13P58J596J967K439K822
56621C17555K446J448P19N66M62J59J13O03J284J811K192K307J785O63l68o15
56605C33130J45J855M098N778N745M209K757K476K732K339J269M70M42R03J452
56590C69800J727J102p30k935m123l996l539l433l230k513j992k583l949m815
56576C34791m560l795l395l523l699l435k768k304k592l279l318k319j247j171
$$ y = [368689, 364791, 360856, 357829, 355444, 352823, 349575, 345887, 342126, 338702, 335769, 332786, 329015, 324767, 321456, 320027, 320015, 320437, 320853, 321087, 320809, 320088, 319597, 319575, 319282, 318275, 317487, 318135, 320061, 322069, 323438, 324149, 324110, 323274, 322351, 322322, 323228, 324259, 325022, 325883, 327044, 328167, 328999, 329626, 329909, 329344, 327694, 325335, 322880, 320878, 319752, 319453, 319176, 318055, 316117, 314054, 312158, 310249, 308586, 307973, 308731, 310327, 312294, 314733, 317555, 320001, 321449, 322168, 322734, 323196, 323355, 323468, 324071, 325355, 327166, 329358, 331665, 333450, 334113, 333745, 333130, 333275, 335130, 339228, 345006, 350751, 354960, 357717, 360193, 362925, 365264, 366533, 367003, 367445, 368348, 369800, 371527, 372629, 371899, 368964, 364841, 360845, 357306, 353873, 350643, 348130, 346138, 343555, 339606, 334791, 330231, 326436, 323041, 319518, 315819, 312384, 309616, 307312, 304720, 301441, 298123, 295804, 294557, 293386]
56562B93386j693j400K02J936K372J428M19P04K309L671L135R62o87l39R22J159
56546C08486M02K95J267J913J357M21k24j218k764l351j836L81J013N7m68L72
56530C06103J376J318O29M08R00J503J584R45n1n93j88O41Q68K00o77r99n61M22
56512C13828J417J656Q22k30l6J917M553O138N737L905K414K879N206P663Q983
56497C66852R759J0953J1799J0555P104L248L69j691l162l412k378j492j978l157
56483D03369l603l255l113l360l233k569k172k405k608k226j599j176q08m80q31
56468C69931k033k736j389J447L335K843J161K55M26O56O05Q30J252Q76o51k329
56452C74479l099k913k057n51J141J823R81k75o77n82j167k436l256l195l072
$$ y = [293386, 291693, 290293, 290495, 292431, 294803, 296231, 296650, 297354, 299663, 303334, 306469, 307431, 306744, 306405, 307327, 308486, 308888, 309183, 310450, 312363, 313720, 314141, 313917, 312699, 309935, 306584, 304748, 305129, 306142, 306199, 305731, 306103, 307479, 308797, 309426, 309834, 310734, 312237, 313821, 314766, 314715, 314122, 313934, 314575, 315443, 315643, 314966, 313967, 313406, 313828, 315245, 316901, 317723, 317493, 317457, 319374, 323927, 330065, 335802, 339707, 342121, 345000, 350206, 357869, 366852, 376611, 387564, 399363, 409918, 417022, 420270, 420639, 418948, 415786, 412374, 409996, 408504, 406526, 403369, 399766, 396511, 393398, 390038, 386805, 384236, 382064, 379659, 377051, 374825, 373226, 372050, 371242, 370762, 369931, 367898, 365162, 363773, 365220, 368555, 371398, 372559, 372814, 373240, 373896, 374501, 375331, 376583, 377459, 376808, 374479, 371380, 368467, 366410, 365859, 367000, 368823, 369804, 369529, 368852, 368270, 367103, 364667, 361411, 358216, 355144]
56437C55144l514l985l550k012j52Q16K04j288k055j422m35j33P0J077K025J307
56421C42097o38j557p06O0p16j842j373N83K362L067L041K613J863J285J459K024
56405C53622K030J381J037J561K215J831J85j818k918k393m80J664K607J665m97
56390C61692k335k707j750m10P19J767K781L181K533J447J019J448J806J277J57
56375C72625m72J61J740K947K491M43j710k659k563k251j695l33J363J934Q40
56360C72861o17q51K28J525K172K058J383N01J13R46K832M324L796J212j452k112
56344C88919r07Rq19k442k889j461J006L386M911N213M648M223M319M103K934
56329D15153J662J395J736J651J437K171L651M628M928N439O049N546L857K500
$$ y = [355144, 351630, 347645, 344095, 342083, 341931, 342747, 342951, 341663, 339608, 338186, 337751, 337618, 337688, 338765, 340790, 342097, 341459, 339902, 339196, 339256, 338540, 336698, 335325, 335908, 338270, 341337, 344378, 346991, 348854, 350139, 351598, 353622, 355652, 357033, 358070, 359631, 361846, 363677, 363862, 362044, 359126, 356733, 356253, 357917, 360524, 362189, 361692, 359357, 356650, 354900, 354490, 355209, 356976, 359757, 362938, 365471, 366918, 367937, 369385, 371191, 372468, 372625, 372153, 372314, 374054, 377001, 379492, 379935, 378225, 375566, 373003, 370752, 369057, 368724, 370087, 372021, 372861, 372244, 371393, 371621, 373146, 375318, 377376, 378759, 379260, 379373, 380319, 383151, 387475, 391271, 392483, 391031, 388919, 388012, 388021, 387202, 384760, 381871, 380410, 381416, 384802, 389713, 394926, 399574, 403797, 408116, 412219, 415153, 416815, 418210, 419946, 421597, 423034, 425205, 428856, 433484, 438412, 443851, 449900, 455446, 459303, 461803]
56315D61803K259K139J293L16r4k01k03K97R74M80j524l481m109m056m279m187
56299D47427k863j011j87p35j755k385k054k13K808N231N419L772K138J627J862
56284D59081J972J574R56Q06J420K041J656O36M52J462K321K208K185L275M624
56269D86669M877M200L575L120K608K756M322O488P626P328O471N677M880M021
56255E54618L086J861N25p4L44Q12O76Q45K215L853M257L609L166L132L050L588
56239E89563N831Q918J0472R637P998P222P246P204O786O217N857O111O986P814
56225F93862Q124Q495R533J0585J0751J0681J1821J4098J6035J7198J8771K1328
56213H51282K3572K3949K2535K0809K0394K2087K5278K8246K9954L1416L4271
$$ y = [461803, 464062, 466201, 467494, 467810, 467716, 467515, 467312, 467609, 468583, 469063, 467539, 464058, 459949, 455893, 451614, 447427, 444564, 443553, 443366, 442631, 440876, 438491, 436437, 436224, 439032, 444263, 449682, 453454, 455592, 457219, 459081, 461053, 462627, 463583, 464389, 465809, 467850, 469506, 470142, 470594, 472056, 474377, 476585, 478770, 482045, 486669, 491546, 495746, 499321, 502441, 505049, 507805, 512127, 518615, 526241, 533569, 540040, 545717, 550597, 554618, 557704, 559565, 560090, 560016, 560360, 561172, 561848, 562693, 564908, 568761, 573018, 576627, 579793, 582925, 585975, 589563, 595394, 604312, 614784, 624421, 632419, 639641, 646887, 654091, 660877, 667094, 672951, 679062, 686048, 693862, 701986, 710481, 720014, 730599, 741350, 752031, 763852, 777950, 793985, 811183, 829954, 851282, 874854, 898803, 921338, 942147, 962541, 984628, 1009906, 1038152, 1068106, 1099522, 1133793]
56202A133793L8315M1834M4239M6748N0329N4535N8808O3457O8692P4006P9252
56191A754008Q5333R3122J02443J12541J22722J32185J40054J46118J50846J54348
56181B993720J56007J55328J52455J47614J40654J31204J18608J01901Q0858N7140
56171D235489L3373J0960j0413l1211n1114o9605q6212r9933j09721j16037j20866
56160C584710j25527j29288j30571j28954j25606j22331j20190j18494j15238
56151B468511j09335j02195r6091r1318q6323q0451p4809p0111o5485o0205n5115
56140A577073n1226m7984m4163l9793l6119l3886l2498l0734k7902k4332k0964
56129A187472j8410j6474j4801j3535j2786j2017j0866j0208j1097j2618j2175
$$ y = [1133793, 1172108, 1213942, 1258181, 1304929, 1355258, 1409793, 1468601, 1532058, 1600750, 1674756, 1754008, 1839341, 1932463, 2034906, 2147447, 2270169, 2402354, 2542408, 2688526, 2839372, 2993720, 3149727, 3305055, 3457510, 3605124, 3745778, 3876982, 3995590, 4097491, 4178349, 4235489, 4268862, 4279822, 4269409, 4238198, 4187084, 4117479, 4031267, 3931334, 3821613, 3705576, 3584710, 3459183, 3329895, 3199324, 3070370, 2944764, 2822433, 2702243, 2583749, 2468511, 2359176, 2256981, 2160890, 2069572, 1983249, 1902798, 1827989, 1757878, 1692393, 1632188, 1577073, 1525847, 1477863, 1433700, 1393907, 1357788, 1323902, 1291404, 1260670, 1232768, 1208436, 1187472, 1169062, 1152588, 1137787, 1124252, 1111466, 1099449, 1088583, 1078375, 1067278, 1054660, 1042485]
56118A042485q432l133N27R08q52k163j356R85L137M506N933P541P894O415N159
56103A069554O312Q995J0621J0714J1027J2368J3806J5019J6813J9044K0476K1366
56091A236115K3769K8283L2761L5465L7607M1449M7384N4320O1665O9620P8314
56080A746752Q7508R6317J02784J04955J02924R8518R2588Q4281P3754O3728N7008
56069B711117N3665N1791M9794M6836M2174L5588K7993K0696J4412R211M456j665
56057C066068j1300k4840m0420n5857o9940q1509q8893r1347q9995q6601q2119
56046B343247p6890p1146o4724n7355m9699m3124l8097l3965l0376k7585k5130
56035A825156k1870j7811j4256j1728r355o740m624l173j458P22K366L358M935
$$ y = [1042485, 1034053, 1030920, 1031447, 1032355, 1031503, 1029340, 1027984, 1028969, 1032106, 1036612, 1042545, 1050086, 1057980, 1064395, 1069554, 1075866, 1084861, 1095482, 1106196, 1117223, 1129591, 1143397, 1158416, 1175229, 1194273, 1214749, 1236115, 1259884, 1288167, 1320928, 1356393, 1394000, 1435449, 1482833, 1537153, 1598818, 1668438, 1746752, 1834260, 1930577, 2033361, 2138316, 2241240, 2339758, 2432346, 2516627, 2590381, 2654109, 2711117, 2764782, 2816573, 2866367, 2913203, 2955377, 2990965, 3018958, 3039654, 3054066, 3063277, 3067733, 3066068, 3054768, 3029928, 2989508, 2933651, 2863711, 2782202, 2693309, 2601962, 2511967, 2425366, 2343247, 2266357, 2195211, 2130487, 2073132, 2023433, 1980309, 1942212, 1908247, 1877871, 1850286, 1825156, 1803286, 1785475, 1771219, 1759491, 1750136, 1743396, 1738772, 1735599, 1734141, 1734863, 1737229, 1740587, 1745522]
56022A745522P341R035R310R574J0912J2432J3343J4663J7182J9544K0166J9639
56010A908663J9659K0668K2040K3427K4660K5356K5722K6732K8687L0690L2046
55999B188350L2814L2743L1562L0653L2087L5333L7449L7476L7845M0100M2137
55988B578549M1698M0044L9883M1645M3996M6273M8351M9641N0151N1062N2754
55977C084047N3903N3985N4787N7758O1761O4975O7330O9504P1584P4172P8678
55966C792484Q4916R0469R3973R7053J01686J07959J15530J24549J33825J41058
55956D883502J46415J52910J61758J70710J78568J87533J99102K11527K23555
55947F515580K36627K50868K63189K72290K81422K93352L06814L20908L38121
$$ y = [1745522, 1752863, 1761898, 1771208, 1780782, 1791694, 1804126, 1817469, 1832132, 1849314, 1868858, 1889024, 1908663, 1928322, 1948990, 1971030, 1994457, 2019117, 2044473, 2070195, 2096927, 2125614, 2156304, 2188350, 2221164, 2253907, 2285469, 2316122, 2348209, 2383542, 2420991, 2458467, 2496312, 2536412, 2578549, 2620247, 2660291, 2700174, 2741819, 2785815, 2832088, 2880439, 2930080, 2980231, 3031293, 3084047, 3137950, 3191935, 3246722, 3304480, 3366241, 3431216, 3498546, 3568050, 3639634, 3713806, 3792484, 3877400, 3967869, 4061842, 4158895, 4260581, 4368540, 4484070, 4608619, 4742444, 4883502, 5029917, 5182827, 5344585, 5515295, 5693863, 5881396, 6080498, 6292025, 6515580, 6752207, 7003075, 7266264, 7538554, 7819976, 8113328, 8420142, 8741050, 9079171]
55938I079171L59477L81819M03851M29488M60507M91424N17308N41778N71138
55929A3235961O05320O41063O79696P24673P74958Q27619Q83859R46049J012131
55920B0331329J079201J149090J224353J303067J384176J473425J576980J694037
55912C1215658J822811J967992K134127K317966K516987K739423K995599L285382
55904E0995945L605078L960648M363343M820537N343995N958113O683693P521015
55896I3252367Q465147R529442J0738713J2115899J3700557J5562919J7763610
55889A81128654K0306008K3139434K6121881K8823891L0333151K9436108K5261606
55882C64550733J7919985Q572439j112515r648425j6137409k0332292k2493311
$$ y = [9079171, 9438648, 9820467, 10224318, 10653806, 11114313, 11605737, 12123045, 12664823, 13235961, 13841281, 14482344, 15162040, 15886713, 16661671, 17489290, 18373149, 19319198, 20331329, 21410530, 22559620, 23783973, 25087040, 26471216, 27944641, 29521621, 31215658, 33038469, 35006461, 37140588, 39458554, 41975541, 44714964, 47710563, 50995945, 54601023, 58561671, 62925014, 67745551, 73089546, 79047659, 85731352, 93252367, 101717514, 111246956, 121985669, 134101568, 147802125, 163365044, 181128654, 201434662, 224574096, 250695977, 279519868, 309853019, 339289127, 364550733, 382470718, 391043157, 389930642, 380282217, 364144808, 343812516, 321319205]
55875C21319205k3146220k2827321k1929819k0699330j9297132j7834980j6381943
55868A79202460j4983158j3678803j2495319j1429896j0461234r571186q746671
55861I7836193p972396p238189o548871n914890n337371m811284m336423l914390
55853E1762379l540323l208011k918370k672837k462618k274189k101795j945610
55845C0638626j801716j664007j533540j416277j312617j217472j129503j052142
55837A9511352r85638r25264q67535q12402p59608p08424o60454o17752n78783
55828A2595492n40817n05092m74998m50505m29146m10759l96149l82505l65803
55819H639718l47028l30639l17436l04027k89143k75193k63303k51549k38960
$$ y = [321319205, 298172985, 275345664, 253415845, 232716515, 213419383, 195584403, 179202460, 164219302, 150540499, 138045180, 126615284, 116154050, 106582864, 97836193, 89863797, 82625608, 76076737, 70161847, 64824476, 60013192, 55676769, 51762379, 48222056, 45014045, 42095675, 39422838, 36960220, 34686031, 32584236, 30638626, 28836910, 27172903, 25639363, 24223086, 22910469, 21692997, 20563494, 19511352, 18525714, 17600450, 16732915, 15920513, 15160905, 14452481, 13792027, 13174275, 12595492, 12054675, 11549583, 11074585, 10624080, 10194934, 9784175, 9388026, 9005521, 8639718, 8292690, 7962051, 7644615, 7340588, 7051445, 6776252, 6512949, 6261400, 6022440]
55810F022440k27072k16731k06907j97333j89136j82315j75562j68870j63513
55801D295001j59322j54667j49205j44134j39836j35620j31387j27282j22269
55792C031279j15591j08821j03925j00052r4979q8876q3728p9803p5779p1634
55782B108091o8292o5026o0549n6084n3959n3414n1438m7605m4418m2615m0082
55771A524609l6202l3495l3378l3518l1199k7037k3580k2129k2306k3154k3487
55760A215124k2447k0637j9608j9734j9958j9756j9703j9774j8957j7099j5525
55749A001926j5085j5069j4655j4068j3599j2794j1181q956o513m187k527j892
55737H81400j704j119k93Pk26m67q59j808k724k642j842j330j017j26Q62N06j357
$$ y = [6022440, 5795368, 5578637, 5371730, 5174397, 4985261, 4802946, 4627384, 4458514, 4295001, 4135679, 3981012, 3831807, 3687673, 3547837, 3412217, 3280830, 3153548, 3031279, 2915688, 2806867, 2702942, 2602890, 2507911, 2419035, 2335307, 2255504, 2179725, 2108091, 2039799, 1974773, 1914224, 1858140, 1804181, 1750767, 1699329, 1651724, 1607306, 1564691, 1524609, 1488407, 1454912, 1421534, 1388016, 1356817, 1329780, 1306200, 1284071, 1261765, 1238611, 1215124, 1192677, 1172040, 1152432, 1132698, 1112740, 1092984, 1073281, 1053507, 1034550, 1017451, 1001926, 986841, 971772, 957117, 943049, 929450, 916656, 905475, 896519, 890006, 885819, 883292, 881400, 879696, 878577, 878284, 878291, 878065, 877598, 876739, 874931, 872207, 869565, 867723, 866393, 865376, 865250, 866112, 866618, 865261]
55720H65261l499n418p748j0463j2491j3358j3489j2645j0009o094k699m68J496
55707G68376L110K478j264o169r816j1961j3583j4640j4383j3098j1934j1289
55695F65827j0548r325q126p622p796p873p066n435l916l296l505m209n491p175
55681E74444q140p497o080n477n735n446m214l444m238n789o608o384n874n676
55667D93842n837o204o577o698o508o189n905n580m982l946k686j988k463l360
55653D24919k886l99K449L566K821J721J339J622K183K531J821l97l236n180n662
55638D27212n277m836m939n845o950p034n983n347o062o743n652l336j654j045
55624C56509p86j017k203l197k321k14Q39L83R4N88O38NK49J743K510J331k90
$$ y = [865261, 861762, 856344, 848596, 838133, 825642, 812284, 798795, 786150, 776141, 770047, 767348, 766880, 768376, 771486, 773964, 772700, 766531, 756715, 744754, 731171, 716531, 702148, 689050, 677116, 665827, 655279, 645954, 637828, 630206, 622410, 614537, 607471, 602036, 598120, 594824, 591319, 587110, 581619, 574444, 566304, 558807, 552727, 547250, 541515, 536069, 531855, 528411, 524173, 518384, 511776, 505392, 499518, 493842, 488005, 481801, 475224, 468526, 462018, 455829, 449924, 444344, 439362, 435416, 432730, 430742, 428279, 424919, 422033, 421634, 424083, 427649, 430470, 432191, 433530, 435152, 437335, 439866, 441687, 441290, 438054, 432874, 427212, 421935, 417099, 412160, 406315, 399365, 392331, 386348, 381001, 374939, 368196, 362544, 359208, 357554, 356509, 355723, 354706, 352503, 349306, 346985, 346771, 347610, 347993, 348087, 348675, 349313, 349318, 349567, 351310, 353820, 355151, 354861]
55607C54861p44q40j944l312l252j782l80J36J3m43r58r43j06R23J398J351J094
55590C45072N75r3k28N16J466J754J246L33n04o10M14J855K450J997J361O97p90
55573C57511k874l936l431l087m386o322p054o572o211o414o545o169n195l400
55559B85915j175l9r29k497k678j598j331k793m428m398k911j751k136l593m638
55544B49020m310l020j889j412j177q84q57j263j620j569j520j863k210j998j294
55529B22134n03J72L82m33j993k690j234J577L608L759K772J899J636J886K568
55514B35540L696N118O430P278P692Q034Q410Q357P539O413N664N218M514L444
55500C23347K064k10l738p002p597n412l324l909o704r486j0873j0624q675n455
$$ y = [354861, 354117, 353277, 351333, 348021, 344769, 342987, 342607, 342743, 342756, 342313, 341355, 340412, 340306, 341229, 342627, 343978, 345072, 345647, 345554, 345326, 345842, 347308, 349062, 350308, 350641, 350137, 349527, 349941, 351796, 354246, 356243, 357604, 358301, 357511, 354637, 350701, 347270, 344183, 339797, 333475, 326421, 319849, 313638, 307224, 300679, 294510, 289315, 285915, 284740, 284701, 283772, 281275, 278597, 276999, 275668, 272875, 268447, 264049, 261138, 259387, 257251, 253658, 249020, 244710, 241690, 239801, 238389, 237212, 236328, 235471, 234208, 232588, 231019, 229499, 227636, 225426, 223428, 222134, 221631, 221803, 222185, 221752, 219759, 217069, 215835, 217412, 221020, 224779, 227551, 229450, 231086, 232972, 235540, 239236, 244354, 250784, 258062, 265754, 273788, 282198, 290555, 298094, 304507, 310171, 315389, 319903, 323347, 325411, 325201, 321463, 314461, 306864, 301452, 298128, 294219, 287515, 278029, 267156, 256532, 247857, 242402]
55486B42402k389q39q18j537k567l526l549k259p75n65j579k532k644k274k104
55471B12445k482l288l866l506k430j642j413r66k32o33k906n441o283n826n797
55456A65734o365o239n198m367l939k739n70R04N64k78L35K298L690L312J885
55441A49027O88n9r92k173k631j625K17J709K635L546M212L688K180J341J962
55426A63725K691K086P32L4rl04p80p42n49j239k620l284k509r32O23J842K507
55409A61272K523K228J732M19j773l246k516n78K21n63j236q50k70j42Q3M66m9
55392A57721j710l121l326l154l441l385k039r2J134J472J416Q32l84j203n49
55377A40171R45J615R42j34q14j091r59j92R39J733K000K166K296J883Q03k12
$$ y = [242402, 240013, 239174, 238356, 236819, 234252, 230726, 227177, 224918, 224143, 223578, 221999, 219467, 216823, 214549, 212445, 209963, 206675, 202809, 199303, 196873, 195231, 193818, 192852, 192620, 191987, 189081, 183640, 177357, 171531, 165734, 159369, 153130, 147932, 143565, 139626, 136887, 136317, 137221, 137785, 137507, 137842, 140140, 143830, 147142, 149027, 149715, 149656, 148664, 146491, 143860, 142235, 142452, 144161, 146796, 150342, 154554, 158242, 160422, 161763, 163725, 166416, 168502, 169234, 169268, 169259, 168955, 168175, 167433, 166884, 165645, 163025, 159741, 157232, 156300, 156923, 158765, 161272, 163795, 166023, 167755, 168174, 166401, 163155, 160639, 160061, 160282, 159719, 158483, 157633, 157363, 157221, 157304, 157770, 157721, 156011, 152890, 149564, 146410, 142969, 139584, 137545, 137453, 138587, 140059, 141475, 142307, 141923, 140720, 140171, 141116, 142731, 143673, 143539, 142725, 141634, 140675, 140483, 141422, 143155, 145155, 147321, 149617, 151500, 152303, 152091]
55361A52091m47RO55J257J780J944J477O38J72N23J315J774J573R31l5j458k960
55344A61239l324j827L64J134p5j673k084j538j088p62J72J631K547K286J324
55329A58326L85k81o06m51jJ87p5l81o07j335k735l545k253P82L329L732K599
55312A57070J596J248O64q66k707l431k141O38L122L665K362Q91M97O02R2q48
55296A62454j241j131j341j525l75J869K827J003j981l441k866j816j408j419
55282A49609j377j138m56P78J942K273J924J567J150J84r39j151m05k0r74k672
55266A50295l737l363j722L72J910K330J919J324P99L27J46M27P11L94l46q02
55250A50984p34l88J84R48J349Q83R2n0M67Q97J178J815K429J844kj550j583n58
$$ y = [152091, 151644, 151653, 152308, 153565, 155345, 157289, 158766, 159404, 159576, 160099, 161414, 163188, 164761, 165692, 165657, 164199, 161239, 157915, 156088, 156452, 157586, 157511, 155838, 153754, 152216, 151128, 150366, 150538, 152169, 154716, 157002, 158326, 158711, 158430, 157824, 157373, 157372, 157559, 157484, 157103, 156496, 155161, 152426, 148881, 146628, 147410, 150739, 154471, 157070, 158666, 159914, 160578, 159712, 157005, 153574, 151433, 152071, 155193, 158858, 161220, 162111, 162608, 163210, 163302, 162454, 161213, 160082, 158741, 157216, 156841, 158710, 161537, 162540, 160559, 157118, 154252, 152436, 151028, 149609, 148232, 147094, 146638, 147416, 149358, 151631, 153555, 155122, 156272, 156456, 155517, 154366, 153961, 153941, 152967, 150295, 146558, 143195, 141473, 141845, 143755, 146085, 148004, 149328, 150127, 150454, 150600, 151027, 151738, 152132, 151786, 150984, 150250, 149862, 150046, 150994, 152343, 153226, 153318, 153268, 153735, 154632, 155810, 157625, 160054, 161898, 161896, 160346, 158763, 158205]
55232A58205M89J281J869J887J035k08j077j333j199r68q48p94m27L56Q87O46
55216A59801M13J256K532K431Q11k56M84J477N49k061m127m066k085N52K338K205
55200A62254M45j366k096k168k374k452j765o15K24O67J006J034O10N28J549K833
55184A58314K740J069p12j508j684j928k151j967j427q64n07n09q13q75j19J085
55168A48144J554P61l26l80O25J480J383Q84Q93J174O54p63j657r78K73L52o82
55151A53391j183n08J18j93n96j65N04N59N47J288K007J348k16p14N66K120K226
55134A61099O97j504l229l472j940L51J826K051J839J667J030k22j103p33L63
55119A58720R92P96L88L96R10J488J345K2j722k223p68J264J849O29r01j392j002
$$ y = [158205, 158694, 159975, 161844, 163731, 164766, 164558, 163481, 162148, 160949, 159981, 159133, 158339, 157912, 158268, 159155, 159801, 160214, 161470, 164002, 166433, 167244, 166988, 167472, 168949, 169498, 167437, 163310, 159244, 157159, 157711, 160049, 162254, 162699, 161333, 159237, 157069, 154695, 152243, 150478, 149863, 150087, 150754, 151760, 152794, 153404, 153932, 155481, 158314, 161054, 162123, 161411, 159903, 158219, 156291, 154140, 152173, 150746, 149882, 149375, 148866, 148053, 147178, 147059, 148144, 149698, 150459, 150133, 149753, 150378, 151858, 153241, 154125, 155018, 156192, 156846, 156083, 154426, 153448, 153721, 154073, 153391, 152208, 151700, 151818, 151625, 151029, 150864, 151368, 151927, 152474, 153762, 155769, 157117, 156901, 156187, 156753, 158873, 161099, 161796, 160292, 157063, 153591, 151651, 152002, 153828, 155879, 157718, 159385, 160415, 160193, 159090, 158357, 158720, 159712, 160508, 160896, 161292, 162202, 163690, 165035, 165057, 163335, 161112, 160344, 161608, 163457, 164086, 163185, 161793, 160791]
55102A60791o43o18n30j10M23P32O79K23o13j489j750j053M7M24n13k090k885
55085A51025k031l7J721K352K241K353K855K868J752J79o05l17J37p0p50j108
55069A62565o82K31P79K94r02j604j067N5O51O37O61P45L56k50j50O38J007N30
55051A64494K6j10o33j639j669J98K533L319K514J452O42j76n64J63J312J443
55035A73305N47oK85N08J01l77n60q33j177q03M78J753K372K595K434J278n94
55018A81306j522o59M94Q2j270j254P25K530K120L51o7J887M045L592N76k138
55002A90798k482j477j208j690j317K57J538J574J070P54K30p72j510j522j541
54987A82702k147k603k215j688j884k104j141O28J692J565J086Q24N75L55M40
$$ y = [160791, 160148, 159530, 159000, 158890, 159313, 160045, 160724, 160947, 160334, 158845, 157095, 156042, 156089, 156513, 156000, 153910, 151025, 148994, 148957, 150678, 153030, 155271, 157624, 160479, 163347, 165099, 165278, 164673, 164356, 164493, 164423, 163673, 162565, 161883, 162114, 162893, 163187, 162285, 160681, 159614, 159669, 160320, 160957, 161618, 162363, 162719, 162469, 162319, 162957, 163964, 164494, 164520, 164410, 163777, 162138, 160469, 160667, 163200, 166519, 169033, 170485, 171127, 170951, 170387, 170550, 171862, 173305, 173852, 173846, 174131, 174639, 174740, 174363, 173803, 172970, 171793, 170990, 171468, 173221, 175593, 178188, 180622, 181900, 181306, 179784, 179125, 179619, 179701, 178431, 177177, 177902, 180432, 182552, 182903, 182836, 184723, 188768, 192360, 192936, 190798, 188316, 186839, 185631, 183941, 182624, 182881, 184419, 185993, 187063, 187817, 188047, 187275, 185765, 184243, 182702, 180555, 177952, 175737, 174049, 172165, 170061, 168920, 169548, 171240, 172805, 173891, 174715, 175290, 175645, 176085]
54972A76085L68o63k184k599j354J97N93j04j040j740j814o65J455K802J898m30
54956A70805j932j623n52J41O52J547K334J963L52j337j921j238J5J070J647K023
54940A73946K637L458L780K948J285m6k80J67L07k09q16p64J22J287J780R82o97
54923A89887j880j434L88K231K961K451J269J74r7O38J524J335Q2p15P1J569J976
54906B02430Q73m61q89n71k19j87o84j901l296l576k328r75j091k159k281r07
54890A81778N76J148J451K166K510J618L54K02R28R00l94j733k090j731j108o2
54874A86513J213J707Q99m01j227j550j465l84J871M010M602L887L117K673K183
54859B07648J947K635L685L732K833K611L690M612M241L811N108P446Q079N539
$$ y = [176085, 176453, 175790, 173606, 171007, 169653, 169850, 170443, 170339, 169299, 167559, 165745, 165080, 166535, 169337, 171235, 170805, 168873, 167250, 166698, 166839, 167491, 169038, 171372, 173335, 173687, 172350, 170429, 169191, 169206, 170276, 171923, 173946, 176583, 180041, 183821, 186769, 188054, 188008, 187728, 187895, 188202, 187993, 187177, 186413, 186535, 187822, 189602, 190584, 189887, 188007, 186573, 186961, 189192, 192153, 194604, 195873, 196047, 195950, 196588, 198112, 199447, 199529, 198814, 198885, 200454, 202430, 203303, 202842, 201953, 201382, 201163, 200976, 200292, 198391, 195095, 191519, 189191, 188216, 187125, 184966, 182685, 181778, 182354, 183502, 184953, 187119, 189629, 191247, 191601, 191803, 192731, 193631, 193237, 191504, 189414, 187683, 186575, 186513, 187726, 189433, 190332, 189931, 188704, 187154, 185689, 185305, 187176, 191186, 195788, 199675, 202792, 205465, 207648, 209595, 212230, 215915, 219647, 222480, 225091, 228781, 233393, 237634, 241445, 246553, 253999, 262078, 267617]
54845B67617J316j951l077k774k312k347k785l269l610l891m248m586m583l978
54831B25522k871j741j055r62j376k247l457m489m552l279j025J482L537M468
54817B07955M035L004K685L326L634K592J167J267L287N698P010P193P009O774
54803B66636O162M793K737O63o45j174j786l018m238m571m190l884l857l993m701
54788B44934o207p340o650m757l816m383m648l380j893j886k802k840j619l72
54774A92341Lk43n37n43j41L65L08m56j181j374j588k221k322q45J413K524J938
54757A87441R37N14K17n37j174q21K42Q81N37k51p69r79j176j107l9J964L440
54740A89320K981J234L95J438K872K863J669R19J132J182J34j513k557k354j122
$$ y = [267617, 268933, 266982, 263905, 261131, 258819, 256472, 253687, 250418, 246808, 242917, 238669, 234083, 229500, 225522, 222651, 220910, 219855, 218893, 217517, 215270, 211813, 207324, 202772, 199493, 198468, 199950, 203487, 207955, 211990, 214994, 217679, 221005, 224639, 227231, 228398, 229665, 232952, 238650, 245660, 252853, 259862, 266636, 272798, 277591, 280328, 280991, 280346, 279172, 277386, 274368, 270130, 265559, 261369, 257485, 253628, 249635, 244934, 238727, 231387, 224737, 219980, 216164, 211781, 207133, 203753, 201860, 199974, 197172, 194332, 192713, 192341, 192344, 192101, 191564, 191021, 190880, 191245, 191553, 191097, 189916, 188542, 186954, 184733, 182411, 181566, 182979, 185503, 187441, 188378, 188892, 189109, 188572, 187398, 186577, 186819, 187700, 188237, 187986, 187217, 186238, 185062, 183955, 183916, 185880, 189320, 192301, 193535, 193930, 195368, 198240, 201103, 202772, 203691, 204823, 206005, 206139, 204626, 202069, 199715, 198593]
54725A98593M05J451J665J275P27L52L89R05J443J369R21J241K723M120M070K915
54709B24564K027J936K182K614L495M521M961M812M705M676M177L346L059L499
54695B74574L801L470L001K716K056O21j050k388l572m790n483n092l909k609
54681B61346j563j155j968l820n254m901l066j255n14q50j774k527k237q35L42
54666B29969j12j754k647j752k8J177J773K358K840K737K532L507N879P978Q060
54651B62517O488N124M748M235K585N83o58j807m315p527q732o736l837k998m143
54636B45527m748l518j806j323j976k526k336j689j045o99p85j111j228j111j347
54621B18279k201k874k425j231o45j147j659j206m85q74k228k717j188J214K475
$$ y = [198593, 198998, 200449, 202114, 203389, 204116, 204468, 204857, 205762, 207205, 208574, 209495, 210736, 213459, 217579, 221649, 224564, 226591, 228527, 230709, 233323, 236818, 241339, 246300, 251112, 255817, 260493, 264670, 268016, 271075, 274574, 278375, 281845, 284846, 287562, 289618, 290239, 289189, 286801, 283229, 278439, 272956, 267864, 263955, 261346, 259783, 258628, 256660, 252840, 247586, 242685, 239619, 238364, 237850, 237000, 235226, 232699, 230462, 229627, 229969, 229857, 228103, 225456, 223704, 223676, 224853, 226626, 228984, 231824, 234561, 237093, 240600, 246479, 254457, 262517, 269005, 274129, 278877, 283112, 285697, 286280, 285622, 283815, 279500, 271973, 263241, 256505, 252668, 249670, 245527, 240779, 237261, 235455, 234132, 232156, 229630, 227294, 225605, 224560, 223861, 223076, 221965, 220737, 219626, 218279, 216078, 213204, 210779, 209548, 208903, 207756, 206097, 204891, 204406, 203532, 201304, 198587, 197399, 198613, 201088]
54606B01088K184J650J684J477J31j627k371k081k092k860l042j497P95J944J697
54591A97080J490K081K554K037J125Q11J010J121J248J662J677M33j446k400k103
54576B08380j709j794j570o12K12L06M12J054J265K42r24q24r1k97j106p10J017
54559B03251K076J403K52k43o85j518j391O15K602J929r83l085k756j376n99j75
54543A99317O79J367Q87k71o60O5Q57R39O19L25q6o96r56m07N57J153J071M58
54525B05218n26j472j532l63Q81N86j093k078q88J506K999K745J417j12j280j458
54509B04550m09Q85J027J35j60R55K165J729k22j929k110j079Q0P09Q85R49R64
54492B09124O97J68M0Q45J923J864M27p78k28J451K248J301l30j377j762j892
$$ y = [201088, 203272, 204922, 206606, 208083, 208214, 206587, 204216, 202135, 200043, 197183, 194141, 192644, 193439, 195383, 197080, 198570, 200651, 203205, 205242, 206367, 207178, 208188, 209309, 210557, 212219, 213896, 214329, 212883, 210483, 208380, 206671, 204877, 203307, 202695, 202907, 203213, 203625, 204679, 205944, 206186, 205262, 204438, 204347, 204050, 202944, 202234, 203251, 205327, 206730, 206982, 206739, 206054, 204536, 203145, 203760, 206362, 208291, 207308, 204223, 201467, 200091, 199492, 199317, 199996, 201363, 202250, 201979, 201319, 201384, 202241, 203180, 203799, 204124, 204038, 203342, 202386, 201979, 202536, 203689, 204760, 205218, 204692, 203220, 201688, 201325, 202206, 202792, 201699, 199621, 198733, 200239, 203238, 205983, 207400, 207288, 206008, 204550, 204141, 205026, 206053, 206188, 206028, 206983, 209148, 210877, 210655, 208726, 206616, 205537, 205617, 206326, 207211, 208160, 209124, 209821, 209989, 210029, 210874, 212797, 214661, 215088, 214310, 214082, 215533, 217781, 219082, 218752, 217375, 215613, 213721]
54476B13721j461J23K501M264M284K736P43o04p87K25J980L458L444J588r80k540
54460B32695k549k176k820m306n053m011j942n37n15r81o83M42J290J079L84L42
54444B10659J040J327L64j095j503l33J412K420K229J180j78j235j429p42J28
54429B14244N60P31J083J290O05p47j401n90P49J207O69N6j71k41o3Q80K379L325
54411B24565L127K476K240K289K043J542J282J406J664J814J602P53l20m18J056
54396B47121K928L385K088L09r47j857k772l258k731j373M8R16J044M99m72j537
54380B43391k440k939k735j826q46n51q90r98k79Q17J251M20j170k110j228J141
54364B29008L267L818L231K739K559J921O83k47j93N38J383K084K330J762P55
$$ y = [213721, 212260, 212383, 214884, 219148, 223432, 226168, 226911, 226307, 225520, 225745, 227725, 231183, 234627, 236215, 235235, 232695, 230146, 227970, 225150, 220844, 215791, 211780, 209838, 209301, 208786, 207805, 207122, 207564, 208854, 209933, 210317, 210659, 211699, 213026, 213390, 212295, 210792, 210459, 211871, 214291, 216520, 217700, 217522, 216287, 214858, 214116, 214244, 214804, 215535, 216618, 217908, 218513, 217766, 216365, 215775, 216524, 217731, 218400, 218456, 218285, 218044, 217981, 218861, 221240, 224565, 227692, 230168, 232408, 234697, 236740, 238282, 239564, 240970, 242634, 244448, 246050, 246803, 246483, 246065, 247121, 250049, 253434, 255522, 255831, 254884, 253027, 250255, 246997, 244266, 242893, 242941, 243857, 244901, 245400, 244928, 243391, 240951, 238012, 235277, 233451, 232605, 232054, 231164, 230166, 229887, 230704, 231955, 232375, 231205, 229095, 227867, 229008, 232275, 236093, 239324, 242063, 244622, 246543, 247226, 246979, 246786, 247324, 248707, 250791, 253121, 254883, 255638]
54349B55638K82N53O02k35j270j507j098q87j052r78k97N58R06N42m0j05N03J159
54331B53274J406J762K804L728L100J137j38M12J508J374P4j100j518j344o11
54316B65868N40J264Q99J00n3K95J69n39r53o70j56K33N84Q14P44P98J535K504
54298B73976K587J616O73N86J081J562J816J727J180M84J23Ml08o04m16l08j431
54281B84348l482m523l581k001j350j284p19r8p49k487l452k544p20L00j95j652
54265B55811k932l006j600M67J900K111J419K93j050k182k395j505l31R1m15j137
54249B45539j354j027p00r17j625k100j615l56O22N22k54n78J23J390K472L010
54233B43152L002K462J577P96L86M5o02j191q16P71K618L400K597P49j081j858
$$ y = [255638, 255920, 256473, 257075, 256840, 255570, 254063, 252965, 252078, 251026, 250048, 249751, 250309, 251215, 251757, 251717, 251612, 252115, 253274, 254680, 256442, 259246, 262974, 266074, 267211, 267073, 267485, 268993, 270367, 270441, 269341, 267823, 266479, 265868, 266408, 267672, 268571, 268671, 268618, 268913, 269082, 268543, 267590, 266920, 266764, 266997, 267581, 268395, 269139, 269937, 271472, 273976, 276563, 278179, 278852, 279438, 280519, 282081, 283897, 285624, 286804, 287288, 287411, 287415, 287107, 286503, 286087, 285779, 284348, 280866, 276343, 272762, 270761, 269411, 268127, 267408, 267310, 266561, 264074, 260622, 258078, 257358, 257658, 257463, 255811, 252879, 249873, 248273, 248740, 250640, 252751, 254170, 254463, 253413, 251231, 248836, 247331, 247000, 247091, 246676, 245539, 244185, 243158, 242458, 241541, 239916, 237816, 236201, 235845, 236467, 236989, 236735, 236157, 236280, 237670, 240142, 243152, 246154, 248616, 250193, 250989, 251375, 251420, 250818, 249627, 248811, 249582, 252200, 255600, 258197, 258946, 257865, 256007]
54217B56007j096O90K180K372J464M59j9j97n87j301j998k269j979j351o14L66
54201B52127J882L628M539L836K009L94k14j14O4J82N15J107J480J057p9q96k94
54184B71223J560L084K858J089p80j729j914k007k286k445j927n28J120J875J204
54169B70397k02j251j511j064M3J352J527m49l584n499m982k980q91Q78K202K307
54153B56293P54j365k293j536j93M70R9q29j464j021M70J911K092J060m1m39n44
54136B53424r87j461j104J24J117R62J78oN36O21l17j037j54J594K097P46q43
54119B55490j308j282j768k114r51J492L506M115L985L956L846L033J468k77j581
54104B71610k140k087j861j695j338o54j70m30j106j497j694k277k899k426p97
$$ y = [256007, 254911, 255601, 257781, 260153, 261617, 262076, 262057, 261860, 261273, 259972, 257974, 255705, 253726, 252375, 251761, 252127, 254009, 257637, 262176, 266012, 268021, 268415, 268201, 268087, 268151, 268333, 268848, 269955, 271435, 272492, 272413, 271517, 271223, 272783, 275867, 278725, 279814, 279034, 277305, 275391, 273384, 271098, 268653, 266726, 266198, 267318, 269193, 270397, 270195, 268944, 267433, 266369, 266412, 267764, 269291, 268842, 265258, 259759, 254777, 251797, 250906, 251784, 253986, 256293, 257047, 255682, 253389, 251853, 251660, 252130, 252229, 251400, 249936, 248915, 249385, 251296, 253388, 254448, 254407, 253968, 253424, 252437, 250976, 249872, 249996, 251113, 252075, 252253, 252247, 252783, 253404, 253087, 252050, 251896, 253490, 255587, 256333, 255490, 254182, 252900, 251132, 249018, 248067, 249559, 253065, 257180, 261165, 265121, 268967, 272000, 273468, 273191, 271610, 269470, 267383, 265522, 263827, 262489, 261835, 261665, 261235, 260129, 258632, 256938, 254661, 251762, 249336, 248539]
54089B48539M62K59n05k48J165K479K709J797J20j639k427j715m21O6k05K16J997
54072B52649L884M190K671L68j737l208l738l027j218R08K304K375J550J047J586
54057B60604K428K287J092j6m92r57j544j061J018K939K677Q77k4O44J074R8r44
54040B70700l11J629L184L498K866J707L64n33o38m14m00l48J50Q28J407K358
54024B86047L901M939M444L406L732N320O044M856L089K006Q91j177l130l205
54010C21163j662n58j040k296l147l329k961j968n86M34P29Q30J208J403P90k73
53994C08737p95m59K25R45J987L315M084L617K404J531J426J823K676M229O048
53979C41793O929O274M999M505N101N994O547O858P153P351P393P521P852P923
$$ y = [248539, 249001, 249260, 248755, 248507, 249672, 252151, 254860, 256657, 256777, 255138, 252711, 250996, 250575, 250641, 250436, 250652, 252649, 256533, 260723, 263394, 263762, 262025, 258817, 255079, 252052, 250834, 251742, 254046, 256421, 257971, 259018, 260604, 263032, 265319, 266411, 266395, 265903, 264946, 263402, 262341, 263359, 266298, 268975, 269852, 269828, 270472, 271546, 271644, 270700, 270389, 272018, 275202, 278700, 281566, 283273, 283637, 283104, 282466, 282052, 281652, 281304, 281454, 282282, 283689, 286047, 289948, 294887, 299331, 302737, 306469, 311789, 317833, 322689, 325778, 327784, 328675, 327498, 324368, 321163, 319501, 318943, 317903, 315607, 312460, 309131, 306170, 304202, 303616, 304050, 304779, 305609, 306817, 308220, 309010, 308737, 307942, 307483, 307708, 308653, 310640, 313955, 318039, 321656, 324060, 325591, 327017, 328840, 331516, 335745, 341793, 348722, 354996, 359995, 364500, 369601, 375595, 382142, 389000, 396153, 403504, 410897, 418418, 426270, 434193]
53965D34193P073N256L206J729R93P07Q05J462K348K480J359k42j309k032l253
53950D54775m703n106m259l589m074m918n139n167n573n528m275l209m338o909
53936C87988p798n709k991k417l813m972m653l397k151j367j091j038p17n2M05
53921C46227L33J69L02L32j80p31n60K4n0r75j682j310k98L96O61J097J711J593
53903C47059K74j113r77N83J713J342P23J605L643M934M707M001L723L510K979
53888C78706K765L503M772N847O761P840Q845R429J0000J1264J3022J3995J2865
53875D89614R456N089J826P46R69Q84K28M0N98Q01P7m99J46J390K079K340L008
53858E18792L872L983L380L289M502O399P638P319N663L954L433L727L178J292
$$ y = [434193, 441266, 446522, 449728, 451457, 452450, 453157, 453962, 455424, 457772, 460252, 461611, 461369, 460060, 458028, 454775, 450072, 444966, 440707, 437118, 433044, 428126, 422987, 417820, 412247, 406719, 402444, 399235, 394897, 387988, 380190, 374481, 371490, 369073, 365260, 360288, 355635, 352238, 350087, 348720, 347629, 346591, 345874, 345822, 346227, 346560, 346729, 347031, 347363, 347183, 346452, 345892, 345916, 345866, 344891, 343209, 341899, 341601, 341997, 342658, 343755, 345466, 347059, 347333, 346220, 345243, 345826, 347539, 348881, 349604, 351209, 354852, 359786, 364493, 368494, 372217, 375727, 378706, 381471, 384974, 389746, 395593, 402354, 410194, 419039, 428468, 438468, 449732, 462754, 476749, 489614, 499070, 504159, 505985, 506731, 507700, 508584, 508812, 508852, 509450, 510251, 510328, 509829, 509975, 511365, 513444, 515784, 518792, 522664, 526647, 530027, 533316, 537818, 544217, 551855, 559174, 564837, 568791, 572224, 575951, 579129, 580421]
53844E80421j22O44K483K656L55k431l572k921j720j136j727l375n343p006q581
53829E48625j0426j1838j1656r997q270p296o519n392m336l767l292k589k380
53816D60867l524n609p170p225o148n042m577m439l902k977k706l888n825o938
53802C90897o492n047l411k047j500k198l478l813k685j383j209j658j367l85
53788C54224k35j623l199l178j584j14L9n56o36M6P25Q97Q43Q28O04o1q82j470
53770C44668j747j654j104l86K8M69J849L929M919L713J580M08K23n3k97M93J916
53753C58954K347J533J077J892K990L394L635M387N220N625N973O312N556L317
53739D12212J452K068M534O074N289L607L115M142N519O256O236N593M212K154
$$ y = [580421, 580299, 580943, 583426, 586082, 586437, 584006, 580434, 577513, 575793, 574657, 572930, 569555, 564212, 557206, 548625, 538199, 526361, 514705, 504708, 496438, 489142, 482623, 477231, 472895, 469128, 465836, 463247, 460867, 457343, 451734, 444564, 437339, 431191, 426149, 421572, 417133, 413231, 410254, 407548, 403660, 397835, 390897, 384405, 379358, 375947, 373900, 372400, 370202, 366724, 362911, 360226, 358843, 357634, 355976, 354609, 354224, 353989, 352366, 349167, 345989, 344405, 344291, 344330, 343774, 343138, 343184, 343909, 344806, 345649, 346477, 347081, 347020, 346138, 344668, 342921, 341267, 340163, 339777, 339805, 340274, 342123, 346052, 350971, 354684, 356264, 356672, 356895, 356842, 356545, 357038, 358954, 361301, 362834, 363911, 365803, 368793, 372187, 375822, 380209, 385429, 391054, 397027, 403339, 408895, 412212, 413664, 415732, 420266, 426340, 431629, 435236, 438351, 442493, 448012, 454268, 460504, 466097, 470309, 472463]
53725D72463K55k81P13J858J628N6j640k827l906n062n731n562m942m224l382
53710D39416k720k793l295l158k357k286l560m888n121n085n876o626n796l871
53696C81984k732k815k879k499k638l394l182j117J367K291J496K68n37r90j339
53681C63284j667j964j959j257j07N42L11J13Q34J871J890P68j71J82J622L285
53665C67577M500M878M344L499L312L923M226L256J584P69J565L285M726N113
53651D16557M304K849J946K527M059M897M204K945K523L090L677L475K568J860
53637D61481K639N326Q138Q181M930J468P61J743J278p51j172J403M190M238K430
53622E06283J541K110K509K014J369P56n71k403l143j870L33J575R95p64k230
$$ y = [472463, 472718, 472437, 473150, 475008, 476636, 476692, 475052, 472225, 468319, 463257, 457526, 451964, 447022, 442798, 439416, 436696, 433903, 430608, 427450, 425093, 422807, 419247, 414359, 409238, 404153, 398277, 391651, 385855, 381984, 379252, 376437, 373558, 371059, 368421, 365027, 361845, 360728, 362095, 364386, 365882, 366150, 365613, 364623, 363284, 361617, 359653, 357694, 356437, 356330, 356872, 357183, 357296, 358130, 360001, 361891, 362659, 362488, 362670, 364292, 367577, 372077, 376955, 381299, 384798, 388110, 392033, 396259, 399515, 401099, 401868, 403433, 406718, 411444, 416557, 420861, 423710, 425656, 428183, 432242, 437139, 441343, 444288, 446811, 449901, 453578, 457053, 459621, 461481, 464120, 469446, 477584, 485765, 490695, 492163, 492924, 494667, 495945, 495194, 494022, 495425, 499615, 503853, 506283, 507824, 509934, 512443, 514457, 515826, 516582, 516011, 513608, 510465, 508595, 508928, 510503, 511498, 510734, 508504]
53607E08504k147n85J017J427J010Q23P28l69k485m055l829k354j102q48j217
53592D94518j246j35J931L512L137J025r92j437m26J205L038M812N681M764K358
53577E21745P9m23J081L113L771K625J238J442L243M974N405M887M376M299M753
53562E66608N943P646Q862Q800Q000P674Q148Q578Q188P076N758M584L849L855
53548F63569M486N109N326N563O389P460P781P011N744M333K291m37k513k523
53534G19589j044j15o70j666k061k307l171m143m090k929j547o06l31j049k620
53519F91240l649k523L97K650K175n99l421m364l189j207o7k98r22q11j94j08
53503F75110n59k71J375L142L337J893L49L5Q94K036K920L710M603N182M761L388
$$ y = [508504, 506357, 505772, 506789, 508216, 509226, 510049, 510777, 510408, 507923, 503868, 500039, 497685, 496583, 495735, 494518, 493272, 493137, 495068, 498580, 501717, 502742, 501750, 500313, 499887, 501092, 504130, 508942, 514623, 519387, 521745, 521824, 521401, 522482, 525595, 529366, 531991, 533229, 534671, 537914, 542888, 548293, 553180, 557556, 561855, 566608, 572551, 580197, 589059, 597859, 605859, 613533, 621681, 630259, 638447, 645523, 651281, 655865, 659714, 663569, 668055, 673164, 678490, 684053, 690442, 697902, 705683, 712694, 718438, 722771, 725062, 724625, 722112, 719589, 718545, 718430, 717760, 716094, 714033, 711726, 708555, 704412, 700322, 697393, 695846, 695240, 694909, 693860, 691240, 687591, 685068, 685465, 688115, 690290, 689691, 686270, 681906, 678717, 677510, 677443, 677145, 676223, 675412, 675218, 675110, 674551, 674280, 675655, 678797, 682134, 684027, 684376, 684411, 685305, 687341, 690261, 693971, 698574, 703756, 708517, 711905]
53487G11905K021J499J789K666M420P072R326R657Q512Q296J0567J4025J5903
53474H07658J4967J2587J1228J2285J5202J8245K0048K0570K0749K1512K3162
53463I98213K5274K6838K7032K6353K6447K8140L0268L1409L2078L3699L5864
53452A321615L6563L5422L4765L6511L9577M1587M1927M1731M1696M1351M0264
53441A753009L8776L7579L7153L7438L7609L6755L5084L3839L3406L2633L0842
53430B144123K9458L0141L2081L2738L1066K8417K6318K4875K3646K2676K1999
53419B447538K1234K0205J9169J8004J5971J2729Q909N220J684j817n043p934
53407B555869j1009j4534j7819j9950k0882k1245k1538k2116k3454k5569k7461
$$ y = [711905, 713926, 715425, 717214, 719880, 724300, 731372, 740698, 750355, 758867, 767163, 777730, 791755, 807658, 822625, 835212, 846440, 858725, 873927, 892172, 912220, 932790, 953539, 975051, 998213, 1023487, 1050325, 1077357, 1103710, 1130157, 1158297, 1188565, 1219974, 1252052, 1285751, 1321615, 1358178, 1393600, 1428365, 1464876, 1504453, 1546040, 1587967, 1629698, 1671394, 1712745, 1753009, 1791785, 1829364, 1866517, 1903955, 1941564, 1978319, 2013403, 2047242, 2080648, 2113281, 2144123, 2173581, 2203722, 2235803, 2268541, 2299607, 2328024, 2354342, 2379217, 2402863, 2425539, 2447538, 2468772, 2488977, 2508146, 2526150, 2542121, 2554850, 2563759, 2568979, 2570663, 2568846, 2563803, 2555869, 2544860, 2530326, 2512507, 2492557, 2471675, 2450430, 2428892, 2406776, 2383322, 2357753, 2330292]
53396B330292k8077k7937k8792l1322l3971l4688l3317l1452l0118k8693k6372
53385A995553k3820k2423k2223k1566j9023j4992j0966p799n252k946j064M6O29
53372A844154J667M124P847J1296J2961J3171J3882J6265J9261K1221K2256K3884
53360B011989K6731K9915L2682L5259L7766L9551M0454M1794M5047M9942N4646
53349B445776N7717N9308O0771O3397O7285P1134P3530P4667P6155P8822Q1682
53338C210244Q3759Q5794Q8824R1847R2626R0725Q8122Q6663Q6266Q5965Q5196
53327D176031Q3408P9943P5187P0712O7223O3501N8473N3149M8835M4347L7229
53316D858038K7544J8303J1605O227j26p735j5315k2446l0044l8815m8451n8176
$$ y = [2330292, 2302215, 2274278, 2245486, 2214164, 2180193, 2145505, 2112188, 2080736, 2050618, 2021925, 1995553, 1971733, 1949310, 1927087, 1905521, 1886498, 1871506, 1860540, 1852741, 1847489, 1844543, 1843479, 1843525, 1844154, 1845821, 1849945, 1857792, 1869088, 1882049, 1895220, 1909102, 1925367, 1944628, 1965849, 1988105, 2011989, 2038720, 2068635, 2101317, 2136576, 2174342, 2213893, 2254347, 2296141, 2341188, 2391130, 2445776, 2503493, 2562801, 2623572, 2686969, 2754254, 2825388, 2898918, 2973585, 3049740, 3128562, 3210244, 3294003, 3379797, 3468621, 3560468, 3653094, 3743819, 3831941, 3918604, 4004870, 4090835, 4176031, 4259439, 4339382, 4414569, 4485281, 4552504, 4616005, 4674478, 4727627, 4776462, 4820809, 4858038, 4885582, 4903885, 4915490, 4921717, 4921591, 4913856, 4898541, 4876095, 4846051, 4807236, 4758785, 4700609]
53304D700609o7091p4069p8340q0419q1790q3386q4896q5633q5600q5344q5095
53293C808946q4476q2975q0524p7600p4789p2279o9799o7055o4271o2128o1084
53282C011966o0617n9345n6289n2134m8826m7576m7562m6908m4548m0614l5578
53271B471969l0074k5348k2685k2093k2410k2806k3306k3634k2862k0652j7885
53260B218214j5513j3813j3071j3538j4036j2316q068l929j902l14L366Q014J0049
53247B143143Q826P704R341J2666J5516J7849K0701K3861K6279K7754K8705K9233
53235B371578K9633L0991L3858L7039L8897L9301L9125L8407L6394L3105K9532
53224B757860K6292K3125J9710J6120J2448Q809N599K981R7m290j0211j6299k1345
$$ y = [4700609, 4633518, 4559449, 4481109, 4400690, 4318900, 4235514, 4150618, 4064985, 3979385, 3894041, 3808946, 3724470, 3641495, 3560971, 3483371, 3408582, 3336303, 3266504, 3199449, 3135178, 3073050, 3011966, 2951349, 2892004, 2835715, 2783581, 2734755, 2687179, 2639617, 2592709, 2548161, 2507547, 2471969, 2441895, 2416547, 2393862, 2371769, 2349359, 2326553, 2303247, 2279613, 2256751, 2236099, 2218214, 2202701, 2188888, 2175817, 2162279, 2148243, 2135927, 2127859, 2123930, 2122028, 2121714, 2125080, 2133094, 2143143, 2151969, 2159673, 2169014, 2181680, 2197196, 2215045, 2235746, 2259607, 2285886, 2313640, 2342345, 2371578, 2401211, 2432202, 2466060, 2503099, 2541996, 2581297, 2620422, 2658829, 2695223, 2728328, 2757860, 2784152, 2807277, 2826987, 2843107, 2855555, 2864364, 2869963, 2872944, 2873041, 2868751, 2858540, 2842241, 2820896]
53211B820896k5339k8679l1172l2528l3546l5840m0045m4704m7549m7855m6994
53200B406645m6592m6951m7661m8730n0075n0604m9359m7332m6602m7484m8132
53189A877123m7237m5562m4197m2976m1550m0470m0020l9302l7771l6417l5989
53178A425632l5220l2617k9057k6743k6140k5804k4774k3241k1185j8384j5835
53167A146632j5179j6349j7472j7522j7433j8108j9067j9766k0711k2223k3303
53156I39499k2855k1249j9680j8711j8111j7606j7050j6292j5438j4903j4797
53145G42807j4673j4110j3160j2141j1568j2084j3693j5125j4940j3271j1395
53134E96647r719p654n600n132o572q086q249p894q148q211o792m608l463l536
$$ y = [2820896, 2795557, 2766878, 2735706, 2703178, 2669632, 2633792, 2593747, 2549043, 2501494, 2453639, 2406645, 2360053, 2313102, 2265441, 2216711, 2166636, 2116032, 2066673, 2019341, 1972739, 1925255, 1877123, 1829886, 1784324, 1740127, 1697151, 1655601, 1615131, 1575111, 1535809, 1498038, 1461621, 1425632, 1390412, 1357795, 1328738, 1301995, 1275855, 1250051, 1225277, 1202036, 1180851, 1162467, 1146632, 1131453, 1115104, 1097632, 1080110, 1062677, 1044569, 1025502, 1005736, 985025, 962802, 939499, 916644, 895395, 875715, 857004, 838893, 821287, 804237, 787945, 772507, 757604, 742807, 728134, 714024, 700864, 688723, 677155, 665071, 651378, 636253, 621313, 608042, 596647, 586928, 579274, 573674, 568542, 561970, 553884, 545635, 537741, 529593, 521382, 514590, 509982, 506519, 502983]
53120E02983l515l012l000l916n057n876o378o109m450k357j982l772n281m049
53106D44229p63J639J409n74k459l372l488l132k369j357o15o08j109j208k42
53091D25981J317K098J078j479m041m744k781N79K723K077k34j708j298j68L35
53076D19735L34N44O70j23j559k170j150N55J493J428J209J201P29o16j862j631
53060D18787p7R95L00j220j473K72K588L612K999J900J405J470J316N41m30j001
53044D31984j223j622k288k655k358j903j869j927j341l56j69j339k976l941m146
53029D01871m068l541j971M09K321K764J923O93j89l95N8O49O13j96r77r48l33
53012C98683Q5J23J48R2n09j348j204L88K046J995K55j474j896j254m38Q5J87
$$ y = [502983, 499468, 496456, 493456, 489540, 484483, 478607, 472229, 466120, 461670, 459313, 457331, 453559, 448278, 444229, 443466, 445105, 446514, 445940, 443481, 440109, 436621, 433489, 431120, 429763, 429148, 428540, 427431, 426223, 425981, 427298, 429396, 430474, 428995, 424954, 420210, 417429, 418008, 420731, 422808, 422574, 420866, 419568, 419400, 419735, 420069, 420613, 421283, 421160, 419601, 417431, 416281, 416836, 418329, 419757, 420966, 422167, 422896, 422280, 420418, 418787, 418710, 419705, 420005, 418785, 417312, 417584, 420172, 423784, 426783, 428683, 430088, 431558, 432874, 433415, 432985, 431984, 430761, 429139, 426851, 424196, 421838, 419935, 418066, 416139, 414798, 414442, 414273, 412934, 409958, 406017, 401871, 397803, 394262, 392291, 392700, 395021, 397785, 399708, 400401, 400212, 399817, 399875, 400524, 401137, 400941, 399964, 399016, 398683, 398768, 398891, 399039, 399131, 398622, 397274, 396070, 396458, 398504, 400499, 400754, 399280, 397384, 396130, 395692, 395777, 395964]
52995C95964k02p35n99N07J701J802P74k34k30O77J618J862J256K00p45j331j825
52978D00460k521l114k805j221R08K279K233J265L02l62j126k135k753k329j148
52963C87933j28L35N83P35L25o92j256l82J396K540K392J695J233Q59K63n5O35
52946C98411K115L283L352K482J259J31n79o07pP57J279J530J572J229M16m16
52930D16207o02j18K67j73j370k545k835j742N72L158M749M725L555K069N70r75
52914D25512k159k254j115N89K131L242L722L294K240J602K030K744K419R61l21
52899D44637m21J76L29l86j456k185k120j088M97J483P68j428l459l673j974R4
52883D29794P29n01k218k533j090K95m52l122n277n057l208j767j458j321o13
$$ y = [395964, 395762, 395027, 394428, 394935, 396636, 398438, 399212, 398978, 398748, 399425, 401043, 402905, 404161, 404361, 403616, 402285, 400460, 397939, 394825, 392020, 390799, 391707, 393986, 396219, 397484, 397786, 397424, 396298, 394163, 391410, 389081, 387933, 387805, 388140, 388723, 389458, 389783, 389091, 387835, 387453, 388849, 391389, 393781, 395476, 396709, 397568, 397831, 397776, 398411, 400526, 403809, 407161, 409643, 410902, 411033, 410454, 409847, 409840, 410597, 411876, 413406, 414978, 416207, 416623, 416207, 415605, 415487, 415754, 415581, 414211, 411666, 408831, 407089, 407661, 410819, 415568, 420293, 423848, 425917, 426487, 425512, 423353, 421099, 419984, 420573, 422704, 425946, 429668, 432962, 435202, 436804, 438834, 441578, 443997, 444958, 444637, 444216, 444392, 444721, 444335, 442879, 440694, 438574, 437486, 437983, 439466, 440234, 438806, 435347, 431674, 429700, 429794, 430523, 430022, 427804, 425271, 424181, 424476, 424024, 420902, 415625, 410568, 407360, 405593, 404135, 402814, 402201]
52868D02201J56L23J55K37M37J96m43q14o29m21p63j413j518p44J75L16j18P1
52850C97404J301K305J730J62n56J73J137J391J390J507R01r20k604k548j296
52835D01477p25j229j409n35L81M27J95N42J110J064N36L37O96J146J476J974
52819D07463K761L345L100J911L30q74j304j094n40J69O66L19r76k162j876k1
52803D11217K053L009K673J803J341J840K952L439K405N47o09n99l11l46l47l05
52787D30762j218l558o037o867n797m140l180l248l878m301l990l121k245j418
52773C77764l82M48K89l74N5J853L097K351Q14L51O08J7j289j795j458j868l362
52756C77119m110k789m48J085J294Q25M03O01J579K432J905L10m00Q18K632L198
$$ y = [402201, 402357, 402680, 402835, 403072, 403509, 403705, 403262, 402448, 401819, 401398, 400635, 399222, 397704, 396960, 397135, 397451, 397333, 397404, 398705, 401010, 402740, 402902, 402346, 402519, 403656, 405047, 406437, 407944, 408845, 407925, 405321, 402773, 401477, 400752, 399523, 398114, 397579, 397960, 398387, 398582, 399124, 400234, 401298, 401834, 402171, 402867, 404013, 405489, 407463, 410224, 413569, 416669, 418580, 418910, 418036, 416732, 415638, 415098, 415267, 415933, 416252, 415276, 413114, 411238, 411217, 413270, 416279, 418952, 420755, 422096, 423936, 426888, 430327, 432732, 433279, 432670, 432071, 431760, 431414, 431067, 430762, 429544, 425986, 419949, 413082, 407285, 403145, 399965, 396717, 392839, 388538, 384548, 381427, 379182, 377764, 377382, 377830, 378119, 377745, 377800, 379653, 382750, 385101, 385915, 386266, 386874, 386891, 385602, 383807, 382349, 380481, 377119, 373009, 370220, 369772, 370857, 372151, 372976, 373379, 373980, 375559, 377991, 379896, 380206, 379806, 380624, 383256, 386454]
52740C86454K349J031l18j581k222j954j570j754j813q56M00N46k53n75j86l43
52724C77355j386j843o52J078J548N11j006k289l249l616k946j354M70J881K501
52709C67003K185J329Q22J022J175M97m97p73n79j249l015m162l033j43K370K963
52693C65915J831L73L3J298L192L996K932J036n4K02J138K043K620K627J877Q41
52677C91900N03J305K627L424L202K332J734K175L498M609M559L547K449J591
52663D29455O27n80j737k744l743m376l962k626j440r66m94O30J727J672N60m68
52647D11535q96j385k497l583l491k120o82j51O9J336L502M459K648n73k249j245
52631D04677P69J747J389N62j13m24k43K02M17L59L91K99o06j967k208o79J101
$$ y = [386454, 388803, 389834, 389516, 387935, 385713, 383759, 382189, 380435, 378622, 377766, 378166, 378712, 378459, 377884, 377698, 377355, 375969, 374126, 373474, 374552, 376100, 376611, 375605, 373316, 370067, 366451, 363505, 362151, 362621, 364502, 367003, 369188, 370517, 371339, 372361, 373536, 374033, 373536, 372763, 372184, 370935, 367920, 363758, 360725, 360582, 362952, 365915, 367746, 368119, 368152, 369450, 372642, 376638, 379570, 380606, 380552, 380754, 381892, 383935, 386555, 389182, 391059, 391900, 392403, 393708, 396335, 399759, 402961, 405293, 407027, 409202, 412700, 417309, 421868, 425415, 427864, 429455, 430082, 429502, 427765, 425021, 421278, 416902, 412940, 410314, 408874, 407908, 407414, 408044, 409771, 411443, 412003, 411535, 410639, 409254, 406757, 403174, 399683, 397563, 396881, 396730, 396799, 398135, 401637, 406096, 408744, 408171, 405922, 404677, 405446, 407193, 408582, 409144, 409031, 408607, 408364, 408566, 408983, 409342, 409733, 410032, 409426, 407459, 405251, 404572, 405673]
52614D05673J329J35r51r16J52J541K041O71j779k935j692L38J305J670K556L071
52598D12209J614r21j865l88J832L461M589N019L940J901Q22J251J598Q17j46
52583D35733m47q89k124l076k613j401p84q34p77l20M24J379J981J393J11O8K045
52566D29869M285M946M567M627M986M611L723L187K430J51l068m927m344k612
52552D52431j387j058j319j899k252j782q87p98j836k814k642j687j047j123j463
52537D28437j559j228n30L06J022J545J957K177J909R19o96k316k873j602Q30
52522D28298K463J909j17j682j850j342j189j430j370o95j4k29j291j831o62J385
52506D20353K118P87q23q17L33Q01O8p73q64l06P29K231L549L531J836o04k519
$$ y = [405673, 407002, 407137, 406186, 405270, 405422, 406963, 409004, 409675, 407896, 404961, 403269, 403607, 404912, 406582, 409138, 412209, 413823, 412902, 411037, 410649, 412481, 415942, 420531, 425550, 429490, 431391, 432213, 433464, 435062, 435879, 435733, 435286, 434397, 432273, 429197, 426584, 425183, 424399, 423565, 422788, 422468, 422892, 424271, 426252, 427645, 427756, 427824, 429869, 434154, 439100, 443667, 448294, 453280, 457891, 461614, 464801, 467231, 467382, 464314, 459387, 455043, 452431, 451044, 449986, 448667, 446768, 444516, 442734, 441847, 441049, 439213, 436399, 433757, 432070, 431023, 429900, 428437, 426878, 425650, 425120, 425426, 426448, 427993, 429950, 432127, 434036, 434955, 434259, 431943, 429070, 427468, 428298, 430761, 432670, 432553, 430871, 429021, 427679, 426490, 425060, 423690, 422995, 422981, 422752, 421461, 419630, 418968, 420353, 422471, 423258, 422435, 421618, 421951, 422752, 422820, 422047, 421183, 420877, 421606, 423837, 427386, 430917, 432753, 432149, 429630]
52489D29630l113k247n86O32Q28O80O53k71k855n231m440n10L122L822K525J390
52473D24029P28j82q65l36P51O98o90j752j315l6R45J413J646J476O19n00j012
52456D25617o28O7M63O20Q98J256J489K085L895O505P801O274L259J628K280L312
52440D66821K897J552P04M70Np32j024q48r96j802k850l884m982n667m938k719
52424D42007m38M59J45q5L62P48J39j332k508k281m33K245M365M622K656m54k759
52407D47458l004j619k1R37J459J950K346K508K742L457M584N665O301O159M857
52392D85779K356n25k520l102k952l051l486l543k870k108k110k917l919m668
52378D50364m974m414k661m27Q89R85J032J703J875N05j243j353KO83r6o16N99
$$ y = [429630, 426517, 424270, 423684, 424316, 425144, 425824, 426477, 426206, 423351, 418120, 413680, 413170, 416292, 420114, 422639, 424029, 424757, 424575, 423710, 423374, 424125, 424823, 424133, 422381, 421066, 421030, 421975, 423388, 425034, 426510, 427129, 426629, 425617, 424989, 425056, 425519, 426139, 427037, 428293, 429782, 431867, 435762, 442267, 450068, 456342, 459601, 461229, 463509, 466821, 469718, 471270, 471974, 472444, 472449, 471717, 470693, 469845, 468849, 467047, 464197, 460313, 455331, 449664, 444726, 442007, 441569, 442028, 442173, 442088, 442450, 443198, 443337, 442005, 439497, 437216, 436783, 439028, 443393, 448015, 450671, 450217, 447458, 444454, 442835, 442814, 443751, 445210, 447160, 449506, 452014, 454756, 458213, 462797, 468462, 474763, 480922, 485779, 488135, 487610, 485090, 481988, 479036, 475985, 472499, 468956, 466086, 463978, 461868, 458951, 455032, 450364, 445390, 440976, 438315, 437888, 438777, 439762, 440794, 442497, 444372, 444877, 443634, 442281, 442283, 442966, 442870, 442254, 442853]
52361D42853K545L237K215N13q38j223k70J613L139L646M069N477P244P883P226
52346D89329O548O781P737Q907R803R617P784N013K694J125o30k993n103o056
52332E40556n884m877l026q12L75l37j975k673j856p55p57j704k022n10K087L611
52316E19441K949J604K040M520O568N972L440J598J964L771N417O162O317O295
52302E78058N992N104L917L459M340N690N930M794L776M171N330N501L963J750
52288F41775N90J594M472P485Q628P550N989N652O296O716O999Q390J1129J3881
52274G37146J5616J6803J8193J9618K0654K1600K2988K4723K6481K8295L0136
$$ y = [442853, 445398, 448635, 450850, 451363, 450525, 449302, 449032, 450645, 453784, 457430, 461499, 466976, 474220, 482103, 489329, 495877, 502658, 510395, 519302, 529105, 538722, 546506, 551519, 554213, 555338, 554708, 551715, 546612, 540556, 534672, 529795, 526769, 525957, 526332, 525995, 524020, 521347, 519491, 518736, 517979, 516275, 514253, 513743, 515830, 519441, 522390, 523994, 526034, 530554, 537122, 543094, 546534, 548132, 550096, 553867, 559284, 565446, 571763, 578058, 584050, 589154, 593071, 596530, 600870, 606560, 612490, 617284, 621060, 625231, 630561, 636062, 640025, 641775, 642365, 643959, 648431, 655916, 664544, 672094, 678083, 683735, 690031, 696747, 703746, 712136, 723265, 737146, 752762, 769565, 787758, 807376, 828030, 849630, 872618, 897341, 923822, 952117, 982253]
$$ [...]
##END NTUPLES=NMR SPECTRUM
##END=
