##TITLE=AC1224_CRIAH12234_7765488_1VBMXALYjL
##JCAMPDX= 6.0         $$ Bruker NMR JCAMP-DX V2.0
##DATA TYPE= NMR SPECTRUM
##DATA CLASS= NTUPLES
##ORIGIN= BRUKER
##OWNER= Administrator
$$ 1.72 TOPSPIN		Version 2.1
$$ 2013-04-11 21:03:50.294 -0700  Administrator@X
$$ Compression mode = diff/dup
##.OBSERVE FREQUENCY= 400.02188249412
##.OBSERVE NUCLEUS= ^1H
##.ACQUISITION MODE= SIMULTANEOUS (DQD)
##.ACQUISITION SCHEME= undefined
##.AVERAGES= 8
##.DIGITISER RES= 22
##SPECTROMETER/DATA SYSTEM= spect
##.PULSE SEQUENCE= zg30
##.SOLVENT NAME= COFFEE_meoh
##.SHIFT REFERENCE= INTERNAL, COFFEE_meoh, 1, 14.98509
##AUDIT TRAIL= $$ (NUMBER, WHEN, WHO, WHERE, PROCESS, VERSION, WHAT)
$$ ##TITLE= Audit trail, TOPSPIN		Version 2.1
$$ ##JCAMPDX= 5.01
$$ ##ORIGIN= Bruker BioSpin GmbH
$$ ##OWNER= Administrator
$$ $$ E:\/data/COFFEE/nmr/AC1224_CRIAH12234_7765488_1VBMXALYjL/10/pdata/1/auditp.txt
$$ ##AUDIT TRAIL=  $$ (NUMBER, WHEN, WHO, WHERE, PROCESS, VERSION, WHAT)
(   1,<2013-04-11 21:03:42.232 -0700>,<Administrator>,<X>,<go>,<TOPSPIN 2.1>,
      <created by zg
	started at 2013-04-11 21:02:36.482 -0700,
	POWCHK enabled, PULCHK disabled,
       configuration hash MD5:
       33 CF 6A 21 5C D3 B9 40 6C 15 AA 8D 27 A2 4F 13
       data hash MD5: 64K
       06 B9 4B B0 34 8A 79 6B A7 B3 12 9E DB 10 1F 3C>)
(   2,<2013-04-11 21:03:45.294 -0700>,<Administrator>,<X>,<proc1d>,<TOPSPIN 2.1>,
      <Start of raw data processing
       efp LB = 0 FT_mod = 6 PKNL = 1 PHC0 = 0 PHC1 = 0 SI = 32K 
       data hash MD5: 32K
       28 6A BB C4 6E A3 E7 56 76 7A B8 FC E0 6A 55 7E>)
(   3,<2013-04-11 21:03:45.747 -0700>,<Administrator>,<X>,<proc1d>,<TOPSPIN 2.1>,
      <pk PHC0 = 98.86597 PHC1 = 0 
       data hash MD5: 32K
       5B DD A6 43 1A 9C EF DF BD AC C2 9D 76 1D AC 87>)
(   4,<2013-04-11 21:03:45.982 -0700>,<Administrator>,<X>,<proc1d>,<TOPSPIN 2.1>,
      <abs ABSG = 1 
       data hash MD5: 32K
       96 B6 17 06 17 84 4A 0C 20 6F 56 70 61 FE 4C 7F>)
(   5,<2013-04-11 21:03:46.138 -0700>,<Administrator>,<X>,<proc1d>,<TOPSPIN 2.1>,
      <abs ABSG = 2 
       data hash MD5: 32K
       0B 6D 04 69 90 3D 02 D2 04 23 96 62 E0 52 BE C2>)
(   6,<2013-04-11 21:03:46.279 -0700>,<Administrator>,<X>,<proc1d>,<TOPSPIN 2.1>,
      <abs ABSG = 3 
       data hash MD5: 32K
       CA 77 4F 61 85 0A 8F 53 B8 18 7A 7B 6A 70 C8 C9>)
(   7,<2013-04-11 21:03:46.419 -0700>,<Administrator>,<X>,<proc1d>,<TOPSPIN 2.1>,
      <abs ABSG = 4 
       data hash MD5: 32K
       A3 63 E5 EA 95 CC 62 D0 79 A7 64 C2 3A FB 37 9D>)
(   8,<2013-04-11 21:03:46.575 -0700>,<Administrator>,<X>,<proc1d>,<TOPSPIN 2.1>,
      <abs ABSG = 5 
       data hash MD5: 32K
       52 1E 9A 97 27 2E FC 0B EA 54 6A D6 1B D1 D0 2D>)
$$ ##END=
$$ 
$$ $$ hash MD5
$$ $$ 8A 20 81 77 E9 36 BC 4A 3C CF 7C 4E 0F 9F 07 9D
##$RELAX= 
##$RELAX= 
##$RELAX= 
##$RELAX= 
##$RELAX= 
##$RELAX= 
##$RELAX= 
$$ Bruker specific parameters
$$ --------------------------
##$DU= <E:\>
##$EXPNO= 10
##$NAME= <AC1224_CRIAH12234_7765488_1VBMXALYjL>
$$ [...]
150 150 150 150 150 150 150 150
##$TP07= 0
##$TPNAME0= <>
##$TPNAME1= <>
##$TPNAME2= <>
##$TPNAME3= <>
##$TPNAME4= <>
##$TPNAME5= <>
##$TPNAME6= <>
##$TPNAME7= <>
##$TPOAL= (0..7)
0.5 0.5 0.5 0.5 0.5 0.5 0.5 0.5
##$TPOFFS= (0..7)
0 0 0 0 0 0 0 0
##$TUNHIN= 0
##$TUNHOUT= 0
##$TUNXOUT= 0
##$USERA1= <user>
##$USERA2= <user>
##$USERA3= <user>
##$USERA4= <user>
##$USERA5= <user>
##$V9= 5
##$VALIST= <valist>
##$VCLIST= <CCCCCCCCCCCCCCC>
##$VD= 0
##$VDLIST= <DDDDDDDDDDDDDDD>
##$VPLIST= <PPPPPPPPPPPPPPP>
##$VTLIST= <TTTTTTTTTTTTTTT>
##$WBST= 2048
##$WBSW= 25
##$XGAIN= (0..3)
0 0 0 0
##$XL= 0
##$YL= 0
##$YMAX_a= 644234
##$YMIN_a= -547635
##$ZGOPTNS= <>
##$ZL1= 120
##$ZL2= 120
##$ZL3= 120
##$ZL4= 120
##$ABSF1= 14.98509
##$ABSF2= -5.573092
##$ABSG= 5
##$ABSL= 3
##$ALPHA= 0
##$AQORDER= 0
##$ASSFAC= 0
##$ASSFACI= 0
##$ASSFACX= 0
##$ASSWID= 0
##$AUNMP= <proc_prof1d_extract_pilot.lims>
##$AXLEFT= 0
##$AXNAME= <>
##$AXNUC= <1H>
##$AXRIGHT= 0
##$AXTYPE= 0
##$AXUNIT= <>
##$AZFE= 0.1
##$AZFW= 0.1
##$BCFW= 0
##$BC_mod= 0
##$BYTORDP= 0
##$COROFFS= 0
##$CY= 15
##$DATMOD= 1
##$DC= 0
##$DFILT= <>
##$DTYPP= 0
##$F1P= 0
##$F2P= 0
##$FCOR= 0.5
##$FTSIZE= 32768
##$FT_mod= 6
##$GAMMA= 0
##$GB= 0
##$INTBC= 1
##$INTSCL= 1
##$ISEN= 128
##$LB= 0
##$LEV0= 0
##$LPBIN= 0
##$MAXI= 10000
##$MC2= 0
##$MEAN= 0
##$ME_mod= 0
##$MI= 0
##$NCOEF= 0
##$NC_proc= -8
##$NLEV= 6
##$NOISF1= 0
##$NOISF2= 0
##$NSP= 0
##$NTH_PI= 0
##$NZP= 0
##$OFFSET= 14.98509
##$PC= 1
##$PHC0= 98.86597
##$PHC1= 0
##$PH_mod= 1
##$PKNL= yes
##$PPARMOD= 0
##$PPDIAG= 0
##$PPIPTYP= 0
##$PPMPNUM= 2147483647
##$PPRESOL= 1
##$PSCAL= 4
##$PSIGN= 0
##$PYNMP= <proc.py>
##$REVERSE= no
##$SF= 400.02
##$SI= 32768
##$SIGF1= 0
##$SIGF2= 0
##$SINO= 400
##$SIOLD= 32768
##$SPECTYP= <>
##$SREGLST= <1H.CDCl3>
##$SSB= 0
##$STSI= 32768
##$STSR= 0
##$SW_p= 8223.68421052631
##$SYMM= 0
##$S_DEV= 0
##$TDeff= 65536
##$TDoff= 0
##$TI= <>
##$TILT= no
##$TM1= 0
##$TM2= 0
##$TOPLEV= 0
##$USERP1= <user>
##$USERP2= <user>
##$USERP3= <user>
##$USERP4= <user>
##$USERP5= <user>
##$WDW= 1
##$XDIM= 32768
##$YMAX_p= 455721928
##$YMIN_p= -736495
##$CURPLOT= <Network HP LaserJet P1505>
##$CURPRIN= <$Network HP LaserJet P1505>
##$DFORMAT= <normdp>
##$LAYOUT= <+/1D_H.xwp>
##$LFORMAT= <normlp>
##$PFORMAT= <normpl>
##$SURQMSG= 1
$$ End of Bruker specific parameters
$$ ---------------------------------
##NTUPLES= NMR SPECTRUM
##VAR_NAME=  FREQUENCY,     SPECTRUM/REAL,   SPECTRUM/IMAG
##SYMBOL=    X,             R,               I
##VAR_TYPE=  INDEPENDENT,   DEPENDENT,       DEPENDENT
##VAR_FORM=  AFFN,          ASDF,            ASDF
##VAR_DIM=   32768,         32768,           32768
##UNITS=     HZ,            ARBITRARY UNITS, ARBITRARY UNITS
##FACTOR=    0.250966925370066, 1,           1
##FIRST=     8223.43324360094, 113570,       -344636
##LAST=      0,             52341,           -17537
##MIN=       0,             -736495,         0
##MAX=       8223.43324360094, 455721928,    0
$$ Real data points
##PAGE= N=1
##DATA TABLE= (X++(R..R)), XYDATA
$$ [...]
19547h8905j37933K1194m8900B40238b59110M7574B858J72581a3434C3569J1188
19536D4757b8863B19760g3322F7689A0765L36a5705j32640B78612G9328a13425
19524C04631g8415k64165F424c00174A25134B3001O139K7955N1384c3737k42389
19513b76126j40476A2120d20404d6204c495l00324A2585h9244B2437c62579B61735
19501h5028b1749q2151p6247b3106A84214a26918a9330A91144d1569H8439l8834
19490D9605a34986k8887m8931J05639A08504c12961A6267D452J3684b00925A21039
19478A57040b24029O3935B3574a95713b1517n2127A06071g4862j22309F9229a38001
19466D7041J32141b64650M2824A39386L5639a78798p6425H9954P7215g698B77328
$$ y = [-88905, -226838, -205644, -254544, 240238, -259110, -211536, 2858, 175439, -13434, 33569, 44757, -28863, 219760, -73322, 67689, 10765, 11101, -15705, -148345, 278612, 79328, -113425, 304631, -78415, -342580, 6424, -300174, 125134, 23001, 29140, 57095, 108479, -33737, -276126, -416602, 12120, -420404, -46204, -3495, -303819, 12585, -89244, 22437, -362579, 261735, -85028, -21749, -103900, -180147, -23106, 184214, -126918, -19330, 191144, -41569, 88439, 49605, -134986, -163873, -212804, -107165, 108504, -312961, 16267, 4452, 18136, -200925, 121039, 157040, -224029, -160094, 23574, -195713, -21517, -73644, 106071, -74862, -197171, 69229, -138001, 47041, 179182, -264650, -221826, 139386, 175025, -178798, -255223, 89954, 167169, -7698, 277328]
19454a56924l9885L1492H9342M7634O5642H7255a26421G1958L0717J84766F8203
19442A06223a33680n1879Q9246c2445A2484b74794L5540Q7839g1959B12891b4087
19430a74382b3233D3826J37332a27742A77262d68991b08680N8333N6119A6055
19419f3552j34463b0595F6484d10031a31107I4186P2113a7519n7840E2088K2275
19408G4363M5776a8549E0688a25272k69639a69895G8116C1236d79463a47895O2815
19397h5080B51604A9366a75805B25882a85474A57839k9859a48343A48744B1485
19386b78080e2213j2292B01003A4672J69343a13622A38494a19528f758m4277m7123
19375i8158A2168c5035j01336B8998d90976A73442B3853f5414G1211g8260o5839
$$ y = [-156924, -196809, -165317, 89342, 136976, 202618, 87255, -126421, 71958, 102675, 287441, 68203, 106223, -133680, -185559, -96313, -32445, 12484, -274794, -239254, -151415, -71959, 212891, -24087, -174382, -23233, 43826, 181158, -127742, 177262, -468991, -208680, -150347, -94228, 16055, -63552, -198015, -20595, 66484, -410031, -131107, 94186, 166299, -17519, -75359, 52088, 74363, 120139, -18549, 50688, -125272, -394911, -169895, 78116, 31236, -479463, -147895, -85080, 251604, 19366, -175805, 225882, -185474, 157839, 127980, -148343, 148744, 21485, -278080, -52213, -64505, 201003, 14672, 184015, -113622, 138494, -119528, -6758, -51035, -98158, 12168, -35035, -136371, 28998, -490976, 173442, 23853, -65414, 71211, -78260, -144099]
19364a44099n2416R1965l8697n853b8960B1375d0479A02189d0630A18389c2481
19352F6294J18669a39473e8659a1003j24024L2127B13938p0808d2488k34223d1327
19340g7045p4860l9042d9485C3002c95546b7042B7283c64936J64613I4192P9240
19329A73432h5169n235g829l30389J65004B7591e54407b52420b9114H3494i1017
19317a79228C91769a82150B37083H0853d99520H352K24380a57219m927G7959f6939
19305E960M8639i6512n7480A3303c82688a26584e7190l802A45740b40333N0895
19294a89438j091k4315B0226a80244G2144M8225h6852j6523N0009A26770D2754
19282f5035k5201e048n5425a6314B13875b76914c4716j45356c4755a3563A8857
$$ y = [-144099, -196515, -104550, -143247, -149100, -28960, 21375, -40479, 102189, -40630, 118389, -32481, 66294, 184963, -139473, -58659, -11003, -135027, -102900, 213938, 143130, -42488, -276711, -41327, -77045, -151905, -190947, -49485, 33002, -395546, -27042, 27283, -364936, -200323, 94192, 173432, -85169, -90404, -7829, -338218, -173214, 27591, -554407, -252420, -29114, 83494, -91017, -179228, 391769, -182150, 237083, 80853, -499520, 8352, 232732, -157219, -162146, 77959, -66939, 5960, 54599, -96512, -153992, 13303, -382688, -126584, -57190, -60992, 145740, -240333, -189438, -190529, -214844, 20226, -180244, 72144, 120369, -86852, -103375, -53366, 126770, 42754, -65035, -90236, -5048, -60473, -16314, 213875, -276914, -34716, -180072, -34755, -13563, 18857]
19270b85775A76899a46771D90154G286i1062A84549b884I6026c6601l43157c5694
19258c0889r4556b5649o5696D9957N6883g8638j10293P4404j27298C38828j55991
19247A82837a63715L6171k1547k32236J52500B56348C6084J15362c67409J26871
19237b40538f5743n4835B17538a85971B15905c83326a70331N9499F9753a35837
19226d03132A26592J88075a86416A92801a21932J5552h554n5577M160j03323d5006
19214b37427J02249l55314B21303a9521B21599n7508g502j5284B9193b09507j88402
19203c97909B58453B0954L4721c4698A78671a16568B33600b99619a36830c9813
19192e983n1753i575j41131B315K28223g1121C1378c2657C8122d0004M481l22035
$$ y = [-285775, 176899, -146771, 490154, 7286, -91062, 184549, -2884, 96026, -36601, -379758, -35694, -30889, -125445, -25649, -91345, 49957, 106840, -78638, -188931, -114527, -241825, 338828, 182837, -163715, -127544, -149091, -381327, -228827, 256348, 36084, 151446, -367409, -240538, -65743, -120578, 217538, -185971, 215905, -383326, -170331, -110832, 69753, -135837, -403132, 126592, 314667, -186416, 192801, -121932, -106380, -8554, -64131, -59971, -163294, -45006, -237427, -135178, -490492, 221303, -19521, 221599, 164091, -7502, -22786, 29193, -209507, -397909, 258453, 20954, 55675, -34698, 178671, -116568, 233600, -299619, -136830, -39813, -5983, -57736, -9575, -150706, 2315, 230538, -71121, 31378, -32657, 38122, -40004, -35523, -357558]
19180c57558a16661G0756e1527I9624b31027A38795D905a77280I0888f5049k60909
19169c25958I2323a38259M4941A0807J58087e3493p354j8811j40997F7198J60108
19158B27306B8867b79185A3894a88837A06207a66013a7912E7138g521j52290r3993
19147b53804F819b71506Q4403o9319c3900A03755i833q5013r8510i2236c0951
19135a43830G4886R4548O5848b19681l3682J07300C1567J9178K45960r9751b01352
19123D8841e4352l8330B17057a10098a9891a111D573a85497c1329j17796B46520
19111H2711O3710c1468M299l23176B10893d8871E0902c45034c1487A84308G6978
19099e5160A40124a02243B79033j12414D5066a0701o53248b41399j46408J4704
$$ y = [-357558, -116661, 70756, -51527, 99624, -231027, 138795, 4905, -177280, 90888, -65049, -325958, 92323, -138259, -93318, 10807, 168894, -53493, -60847, -79658, -220655, 67198, 227306, 28867, -279185, 13894, -188837, 106207, -166013, -17912, 57138, -7521, -159811, -253804, 6819, -271506, -187103, -256422, -33900, 103755, -9833, -94846, -193356, -92236, -30951, -143830, 74886, 169434, 235282, -219681, -253363, -146063, 31567, 50745, 296705, 196954, -201352, 48841, -54352, -92682, 217057, -110098, -19891, -1111, 4573, -185497, -31329, -149125, 246520, 82711, 146421, -31468, -27169, -350345, 210893, -48871, 50902, -345034, -31487, 184308, 76978, -55160, 140124, -102243, 279033, 166619, 45066, -10701, -663949, -241399, -387807, -373103]
19089c73103a85981f3944L1363p7187F7642J2504d1009j126k9503H5936O2937
19078A48873a15546q5542N4742L0903B2269a63494A56427b06424B3812a11561
19067g6308k400G8551N8012a78342K0782J9727C9932d2084j83551k436C93325
19055a51173O1065A84880b35459A74693a49195q4857G7046o104P5148F8261a54079
19043g9464G2608k1637a52586B78829a88m4440e816D6335b88637k3438a03197
19031b34690B04589j02005e2873l9020B31931B9978Q0376J29316a62398A12281
19020B13227b19623K9300m7412k26780C4190b3222j20996H8159J501N3494a09262
19008C67575I3644i8840L6377l23140B25118l2278a055l64491h7867G2926a80332
$$ y = [-373103, -185981, -63944, -32581, -109768, 67642, 80146, -41009, -42135, -71638, 85936, 148873, -115546, -201088, -146346, -115443, 22269, -163494, 156427, -206424, 23812, -111561, -76308, -78708, 78551, 136563, -178342, -157560, -137833, 39932, -42084, -225635, -228071, 393325, -151173, -90108, 184880, -235459, 174693, -149195, -234052, 77046, 70942, 146090, 68261, -154079, -79464, 72608, 50971, -152586, 278829, -188, -44628, -5816, 46335, -288637, -312075, -103197, -234690, 204589, 102584, -52873, -91893, 231931, 29978, 110354, 239670, -162398, 112281, 213227, -219623, -190323, -237735, -464515, 34190, -23222, -144218, 88159, 89660, 143154, -109262, 367575, 93644, -98840, -62463, -385603, 225118, 192840, -1055, -365546, -87867, 72926, -180332]
18996f4593n0981H3769R1795D2670J51073b34252j28179F3758J77972G0492d6278
18984b97777A67922b68180K381b1008A42416a738k11810Q3107l849B18215b4454
18972b97640J34866P2080a9168j87725A23666a80102B09646A00116i5461A69171
18961d7238G9046C1962P2206P8673b98347a34580I1767a4636j53692d5483j54303
18950a99786p6140D0977P8599d502q3935A09213P3170b18792A55127c0950H3298
18938C8560J13641a98853l7897M0383D8563P6637N1463a21018C33773l9322f8935
18926D2743b33646g8665k59170H3530P1430D8741N0954a0004j41516k537r4663
18915b48720B83414d7787B77265A6977a00246j34974J09764j49118K8705F414
$$ y = [-64593, -115574, 83769, 175564, 42670, 193743, -234252, -362431, 63758, 241730, 70492, -46278, -297777, 167922, -268180, -265799, -21008, 142416, -1738, -213548, -130441, -134290, 218215, -24454, -297640, -162774, -90694, -19168, -206893, 123666, -180102, 209646, 100116, -95461, 169171, -47238, 79046, 31962, 104168, 182841, -298347, -134580, 91767, -14636, -168328, -45483, -199786, -275926, 40977, 119576, -4502, -88437, 109213, 182383, -218792, 155127, -30950, 83298, 38560, 152201, -198853, -236750, -196367, 48563, 125200, 176663, -121018, 333773, 294451, -68935, 42743, -233646, -78665, -337835, 83530, 154960, 48741, 99695, -10004, -151520, -154057, -248720, 283414, -47787, 277265, 16977, -100246, -235220, -125456, -274574, -245869, 6414]
18904B30424C7208a11246j3015o6176Q8875I9278i7169m5517j7223b0161A24946
18892F3183b30881q8834J04449d6716A57476a73034G2804a23720j88859A47173
18881g7873j78083A91715C230L15501b27648Q2430A57097b10755j7197R5202A57432
18869a23118j00782A40192F2720J12940G2589d94868d2086C76594g9823B75886
18858I7734A362J53595B0848P8810a68337B27635e15B6385P1035J85103A30931
18846C23771a64220A73862g821k15606g1387j54801J3779e9353E828d6654J4030
18835c2624k5670A45234E9754b20766g4852l10552a18353B39110a44434n724n0370
18824b00528k7972c2482B08953e7510A27741J06828K3743a203q4315B12706p9077
$$ y = [230424, 37208, -111246, -124261, -190437, -101562, 99278, -97169, -142686, -159909, -20161, 124946, 63183, -230881, -319715, -215266, -46716, 157476, -173034, 72804, -123720, -312579, 147173, -77873, -255956, 191715, 3230, 318731, -227648, -145218, 157097, -210755, -227952, -132750, 157432, -123118, -223900, 140192, 62720, 175660, 72589, -494868, -42086, 376594, -79823, 275886, 97734, 1362, 154957, 20848, 99658, -168337, 227635, -515, 26385, 97420, 282523, 130931, 323771, -164220, 173862, -7821, -223427, -71387, -226188, -212409, -59353, 5828, -46654, -32624, -58294, 145234, 59754, -220766, -74852, -385404, -118353, 239110, -144434, -150158, -200528, -228500, -32482, 208953, -57510, 127741, 234569, 258312, -1203, -85518, 212706, 133629]
18813A33629a10031A76409e1386a712D52224F6692J8576J6332b86511a01796k66382
18802c68178b3477A03332e08810a17148B777c43404J38214B4221a14013G5172
18791c19771C8383J03890f8805j06692I7706b61053g5356H9843d2283D0591a12217
18779H8085f8376c2500j79862a8822q8243A72141F7636c6433J1058j33878k25183
18768c84436J25375a27104k143D0481a67162Q892m5581A66067b20477A34420H050
18756a6319I3149a09705N3426B58301g449N86j78886j53912h3839m5590A98876
18744F4604a83529h2006k3113j25563n3544a5453B1149K7583K32655b70800h4833
18732g3191r6351P5672A85761m5901i4296M6879l84870A50486e3602k15739i4261
$$ y = [133629, -110031, 176409, -51386, -1712, 452224, 66692, 85268, 101600, -286511, -101796, -368178, -23477, 103332, -508810, -117148, 2777, -343404, -205190, 24221, -114013, 75172, -319771, 38383, 142273, -68805, -175497, 97706, -261053, -75356, 89843, -42283, 40591, -112217, 88085, -68376, -32500, -212362, -18822, -107065, 172141, 67636, -36433, -25375, -159253, -384436, -259061, -127104, -129247, 40481, -167162, -158270, -203851, 166067, -220477, 134420, 8050, -16319, 93149, -109705, -56279, 258301, -7449, -6863, -185749, -339661, -83839, -129429, 198876, 64604, -183529, -82006, -105119, -230682, -284226, -15453, 21149, 48732, 281387, -270800, -84833, -73191, -169542, -93870, 185761, 139860, -94296, -47417, -432287, 150486, -53602, -269341, -94261]
18720e404l34171a01022q131B30599a34625A64156f9530n8575m9283K4458G290
18708E2231J91212G0835P1134D257b27715f8463k82190H8807a18800j63521h1157
18696a89897c2927A51798a71032H476K2245K71864D0037a05842j50944b6029D1487
18684b51884n4886h0144q4913B33208n2459f8170j80683C919a72567D08712a5764
18672c06381B8132c8541k14789I3847l5353J98018E9874i5888k59769a65894j9109
18661a85003L1681f6513D1478b54622F927b12823C06269h908j59900d8494A06756
18649a10624B38840e9341H1330e4399B8823b08098B2308J58565b52784C050J49513
18638A52563G134a64238B4853J71909c73562J66428P4334e4687l317l50883A20237
$$ y = [-5404, -339575, -101022, -109153, 230599, -134625, 164156, -69530, -128105, -177388, -152930, 7290, 52231, 243443, 70835, 141969, 4257, -227715, -68463, -350653, 88807, -118800, -282321, -81157, -189897, -32927, 151798, -171032, 8476, 30721, 302585, 40037, -105842, -256786, -26029, 41487, -251884, -306770, -80144, -165057, 233208, 180749, -68170, -248853, 3919, -172567, 408712, -15764, -306381, 28132, -38541, -253330, 93847, 58494, 256512, 59874, -95888, -355657, -165894, -185003, -153322, -66513, 41478, -254622, 6927, -212823, 306269, -8908, -168808, -48494, 106756, -110624, 238840, -59341, 81330, -54399, 28823, -208098, 22308, 180873, -252784, 3050, 152563, 7134, -164238, 24853, 196762, -373562, -207134, -132800, -54687, -58004, -408887, 120237]
18626A37302a58548A65842c9731k26292h851B70948d4158A24759f8151p2045o4925
18615b05121A73356q824F260e3224n9940B83741D1048O2915p345K09002a61716
18603b77462a25678B5781A167d28915A51858F3497a49059B43580f2278j45523
18593b07801o0035A85949p6669b11597M5213j26517J30615B54635a87147i0107
18582A53519b71030h3316q1106q1674i4066I0006k8884a92862j6912R6098B5053
18570A20566b78181k05750G9508e8367b2506l94096l460e8023n0783n5378A85744
18558g6050A40247b72444e5500Q955p3009D2126b20951a05645K8452k64247B51594
18546e4446H6306b15860l785e5931A34690J33444e9163C1899N6769i098C1841
$$ y = [137302, -158548, 165842, -39731, -266023, -8851, 270948, -44158, 124759, -68151, -140196, -205121, 173356, 164532, 6260, -53224, -113164, 283741, 41048, 103963, 96618, 305620, -161716, -277462, -125678, 25781, 1167, -428915, 151858, 63497, -149059, 243580, -62278, -207801, -267836, 185949, 109280, -211597, -166384, -292901, -162286, 254635, -187147, -90107, 153519, -271030, -83316, -164422, -246096, -94066, 90006, 61122, -192862, -209774, -113676, 25053, 120566, -278181, -483931, 79508, -58367, -22506, -416602, -420062, -58023, -108806, -164184, 185744, -76050, 140247, -272444, -55500, -46545, -119554, 42126, -220951, -105645, -77193, -341440, 251594, -54446, 86306, -215860, -219645, -55931, 134690, 268134, -59163, 31899, 88668, -9098, 31841]
18534a28877A83686o9342R5358F9420b14473a5605B261i6471n533A24669a92421
18522a75784I5295a5110E7156b14882g6829B099g1875F8346d60057E8892R2841
18511A51733B3396a31287A01267b378j03545A26635i4836B63737D5642b42191
18500B80248b74966h0832k24155h5090j28494E6336P6988D0005b57348A2054a91162
18488f7087j14356A92317p1602a06948l0520B22212C4215d03084E5122L4413B8033
18476A15496e8574p4860l107B4904D723b49762k35816J74466F907M3802a27279
18464a74452C6195d6790a4898l00078C2628c23133d0097C51852p7232d35699g1985
18452b737p9384q3432O220B23718a1737l29041A17811J7133J13507a86551K3211
$$ y = [-128877, 183686, 114344, 209702, 69420, -214473, -15605, 2261, -96471, -102004, 124669, -192421, -175784, 95295, -15110, 57156, -214882, -76829, 2099, -71875, 68346, -460057, 58892, 151733, 23396, -131287, 101267, -2378, -105923, 126635, -94836, 263737, 45642, -242191, 280248, -274966, -80832, -304987, -85090, -213584, 56336, 133324, 40005, -257348, 12054, -191162, -67087, -181443, 192317, 120715, -106948, -137468, 222212, 34215, -403084, 55122, 89535, 28033, 115496, -58574, -133434, -136541, 24904, 4723, -249762, -485578, -311112, 6907, 50709, -127279, -174452, 36195, -46790, -14898, -314976, 32628, -323133, -40097, 351852, 274620, -435699, -71985, -2737, -82121, -165553, -159333, 223718, -11737, -340778, 117811, 134944, 248451, -186551, -163340]
18441a63340l344B11660m3351n9591C8994f6304B77827p4507a32804K3534K8417
18430h0853k70463J60064C26546q0291o7674f8960A09074i6181A70227N3094H4504
18418B1224h5014j60289b2876j65184m3944O1638A65676f4817j04865I6956b1453
18406a57119j67585B03781b00765B12215a12560H6919g0310K0161j8309A38426
18395B31099B3253a66146p0118O144J00276I5678a92428E6533J83520b46746c9512
18383i6015j39080f6804C75577n4618a10416d4030C1098i198j37795I3222J12932
18372B06154a70856c2081j60828B5335Q7061E5514d2785l6698m2290A7679Q5955
18361A03634a19687k62750J75828g7938j63946G28b82048i5722j08484A12284
$$ y = [-163340, -166684, 211660, 168309, 108718, 38994, -66304, 277827, 203320, -132804, -109270, -80853, -351316, -191252, 326546, 246255, 178581, -68960, 109074, -96181, 170227, 223321, 84504, 21224, -85014, -245303, -22876, -188060, -232004, -170366, 165676, -64817, -169682, 96956, -21453, -157119, -324704, 203781, -200765, 212215, -112560, 86919, -70310, -50149, -68458, 138426, 231099, 23253, -166146, -236264, -230120, -129844, 95678, -192428, 56533, 240053, -246746, -39512, -96015, -235095, -66804, 375577, 320959, -110416, -44030, 31098, -9198, -146993, 93222, 206154, -170856, -32081, -192909, 25335, 112396, 55514, -42785, -79483, -121773, 17679, 103634, -119687, -382437, -206609, -77938, -241884, 728, -282048, -95722, -204206, 112284]
18350C1559a38882A64432g857j85506B1231N5331c86497E3687K7863d3772c125
18338h8257k17598a36830L0916j7497H3610K41004n7107b00801A5108J60068b12947
18326C0497B39c45437A61009K463b3453j87893c8495B62122b33339A13303F996
18314a11652q5532A13053J68136A31229l3196a18872p2733d8004k55733L1692
18304b72045a35885B28931b87449h0654c4462l42151C71547G5925g9367o9759
18294a49126o191q210k5794Q6144A35802f8814k29500c8173a8959p6591j24586
18283b20136B0975J3230P0371a45776M1622I3713f2015j92135m4769A18651P4007
18272A92658J1645P0711i4355A29881b14301A47957e62587A33845b73069K1590
$$ y = [31559, -138882, 164432, -7857, -193363, 21231, 76562, -386497, 53687, 81550, -43772, -3125, -88257, -305855, -136830, -105914, -123411, 83610, 324614, 267507, -200801, 15108, 175176, -212947, 30497, 239, -345437, 161009, 163472, -23453, -211346, -38495, 262122, -233339, 113303, 6996, -111652, -197184, 113053, 281189, 131229, 98033, -118872, -191605, -48004, -303737, -272045, -135885, 228931, -287449, -80654, -34462, -376613, 371547, 75925, -79367, -149126, -155317, -163527, -189321, -103177, 135802, -68814, -298314, -38173, -18959, -95550, -220136, 20975, 34205, 104576, -145776, -104154, 93713, -62015, -254150, -298919, 118651, 192658, 204303, 275014, -94355, 129881, -214301, 147957, -562587, 133845, -273069, -251479]
18262b51479G7054a77496h8308n9785E4720Q7206a02998C10215b18594h3007B55415
18250g719j18628B61095j10448a13623M583j5310E0324c06144J30798H4069J91204
18239B75273J54125e4302N885k63485a9031j47850j11956A51430c2372b831F8715
18227H4894a40348C20060O4563B1508F239a04765n6088E8356i5389k36517J09112
18216b22794B25662a93222k11184F4840a55243A03204f8848A08361J09238B2140
18205F3941j8762c68021a69770E476O7277J0802J7389c91813J22951A40249b87504
18193f4819A05759C1845c70989C77379f7204E5996a95065h8201k13466E435h3103
18181g204A76819B2428J23890e4372j2391K759j7208C12451D856b98461N4583
$$ y = [-251479, 77054, -177496, -88308, -148093, 54720, 141926, -102998, 310215, -218594, -83007, 255415, -7719, -126347, 261095, 150647, -113623, -109040, -124350, 50324, -306144, -175346, 84069, 275273, 429398, -54302, -48417, -311902, -19031, -166881, -278837, 151430, -32372, -2831, 68715, 84894, -140348, 320060, 384623, 21508, 6239, -104765, -160853, 58356, -95389, -331906, -222794, 225662, -193222, -404406, 64840, -155243, 103204, -68848, 108361, 217599, 22140, 63941, 45179, -368021, -169770, 5476, 72753, 83555, 100944, -391813, -268862, 140249, -287504, -64819, 105759, 31845, -370989, 377379, -67204, 55996, -195065, -88201, -301667, 5435, -83103, -7204, 176819, 22428, 146318, -54372, -66763, -64004, -81212, 312451, 4856, -298461, -243878]
18170b43878H1133k5654q565J40204a55248L170j67057H7955b10053k15386C0215
18158a55663L5909A8679a78979c1993j91107N3649D7833e3603l1718j05048h5482
18146a7046j43313b2329q1186c6803C9370c144A47030j1074C3273d40115B88946
18134c2776n1438G0036c29486e2657l30011E86b38904f0805B14927B2977J35493
18123A58470O2071D788a75981i172C3770b39197N0688f8240A6791J68584b9705
18111a68974A23889A4663J59052i2551A64982b28251a2850F8314a0458A83740
18100b64929i7822l665B86005h9096L2499A7945J95685c50885a21675J5976c831
18088a6335r6349j43510a0228B58022a07472j550D6999e4598a0119A54382p2232
$$ y = [-243878, 81133, 55479, 46914, 187118, -155248, -152078, -319135, 87955, -210053, -425439, 30215, -155663, -119754, 18679, -178979, -31993, -223100, -169451, 47833, -53603, -85321, -190369, -85482, -17046, -160359, -22329, -103515, -36803, 39370, -3144, 147030, 135956, 33273, -440115, 288946, -32776, -84214, 70036, -329486, -52657, -382668, 586, -238904, -60805, 214927, 22977, 158470, 220541, 4788, -175981, -9172, 33770, -239197, -188509, -68240, 16791, 185375, -29705, -168974, 123889, 14663, 173715, -92551, 164982, -228251, -12850, 68314, -10458, 183740, -264929, -97822, -101487, 286005, -89096, -56597, 17945, 213630, -350885, -121675, -105699, -3831, -16335, -112684, -256194, -10228, 258022, -107472, -109022, 46999, -54598, -10119, 154382, 82150]
18077H2150j3249g7343c8534n4591G7377J42588b8500n3958A6247J7842K71801
18066C05890g8384j12350A58663h7948c9174a7919A8825h9407m4505c6562l03163
18055c39725C00040k0685D6711O898h3775J880o6458F1962R16b6479m9700F4768
18042A93776a35209C2727f0531k0584j66172H4941Q951a65335H2503g1710J9153
18031e2557H7246h8444k510r5040O1374j01883k9765a05595B16856a51141f5137
18019I9595b51504g63j97974A02456j5476K26936b8417J1633B91143F5745e8922
18007I0450J66789D1453K72312a82403B48909A20968R1218a87608C02043A06475
17996c17664a25996B90144p4162b04242Q0513j65733B45587m0789B3542a69596
$$ y = [82150, 68901, -77343, -38534, -93125, 77377, 219965, -28500, -82458, 16247, 34089, 305890, -78384, -190734, 158663, -87948, -39174, -17919, 18825, -89407, -133912, -36562, -339725, 300040, 279355, 46711, 53609, -83775, -81895, -148353, 61962, 62878, -26479, -76179, 64768, 193776, -135209, 32727, -60531, -81115, -247287, 84941, 93892, -165335, 82503, -71710, -52557, 87246, -88444, -90954, -185994, -124620, -226503, -256268, -105595, 216856, -151141, -65137, 99595, -251504, -763, -198737, 102456, 86980, 313916, -28417, -16784, 291143, 65745, -58922, 90450, 257239, 41453, 313765, -182403, 248909, 120968, 212186, -187608, 302043, 106475, -317664, -125996, 290144, 215982, -204242, -123729, -289462, 245587, 204798, 23542, -169596]
17985E17K88208D6991J79387a56914B48318B9743J26293i9669m6271p5873f1546
17973b16366J3277B11397a32078j7041A4831J56809a57188A24792b13890A26798
17962a19103N9124F4707b92098J08970G5515k0127k2550J4211i652A78727a3966
17950A29446a25766l3118I4727K73752c6730r1581A12601J67018c13275a30640
17939i3184F0966i2266k26735a01105j37823Q2726M2757d2366D8401I247J0125
17928A9372a24790A54867a33096K131G9699f9887q0501J6615k6044m1825A05395
17916a43582d609j8969B3682b7853F8426J32059P6412b41435H365Q1b07484A13356
17903f6569j45294A83453N6955a30827d164B79484A25561a53115A02698a62216
$$ y = [517, 288725, 46991, 226378, -156914, 248318, 29743, 156036, -99669, -145940, -221813, -61546, -216366, -203089, 211397, -132078, -149119, 14831, 171640, -157188, 124792, -213890, 126798, -119103, -59979, 64707, -292098, -183128, 75515, 55388, 32838, 47049, -9652, 178727, -13966, 129446, -125766, -158884, 94727, 368479, -36730, -128311, 112601, 279619, -313275, -130640, -93184, 60966, -92266, -319001, -101105, -238928, -156202, -113445, -42366, 48401, 9247, 19372, -124790, 154867, -133096, -130965, 79699, -69887, -150388, -133773, -159817, -201642, 105395, -143582, -4609, -23578, 23682, -27853, 68426, 200485, 276897, -241435, 8365, 8446, -207484, 113356, -66569, -211863, 183453, 240408, -130827, -4164, 279484, 125561, -153115, 102698, -162216]
17892A11472a86949N0627G5240a21067e5697b5995e50B72476d7837A95311a0230
17880A3433e3698E5487g0190j81641i7605g254q597A60376i3344A74218a2791
17868B94615b22460D3519J67314D8556J15563e0888R437j15121C08822A9488J07710
17857A27198a57071e0449e328B15924f6401b3407A92533E6026N1168a42379e5566
17845I1080B1056b96875a41266A21209a21772E0259k4892L44679H1733K01502
17835B83235p200q1488R8891E6366K32477j05975a9489n5546k20313D0682J10793
17824A51475a93934j43821A12351j282O7680e7593N030A24831a69044h1463m5188
17813a26651K3767j96593b7058A40949A2241e1647o0001p155j08762l5969E0488
$$ y = [111472, -186949, -136322, 75240, -121067, -55697, -25995, -550, 272476, -47837, 195311, -10230, 13433, -53698, 55487, -70190, -251831, -97605, -7254, -15851, 160376, -93344, 174218, -12791, 294615, -222460, 43519, 210833, 48556, 164119, -50888, -41451, -156572, 308822, 19488, 127198, -157071, -50449, -5328, 215924, -66401, -23407, 192533, 56026, 107194, -142379, -55566, 91080, 21056, -296875, -141266, 121209, -121772, 50259, 25367, 370046, 81733, 283235, 276035, 194547, 293438, 56366, 288843, 182868, -19489, -75035, -295348, 40682, 151475, -193934, -337755, 112351, 111069, 178749, -57593, -52563, 124831, -169044, -81463, -126651, -102884, -299477, -27058, 140949, 12241, -51647, -111648, -118803, -227565, -263534, 50488]
17801c02119a3036j04112E675a38172A21384b84535I6841d0016n4410j13640g9444
17789b9121H6139Q8388o6162l0544B4470J7471g2933A44328D8384b2171m4283
17778f6454I6809J51557a32481m7471e1460K5515A45573k2548g7390r582P746
17767g9226c8048A31703i5448C49251C118b47673C54425A14874J43908M5826q6575
17756B18033B9972J82174O0938n9416D0963a7257A44379F8155c20397A27393J80474
17745C07867B172e4550l0942B07279m9939k8030E9728a82857B10823a83040A80968
17733G3116i8323D2340a6065H0349a09529b2196A01591a24435H1740K4446D9641
17721A97265L5301c2509k9056j80083g8745j32138J04903A30070f5770A4004L72554
$$ y = [-302119, -13036, -117148, 5675, -138172, 121384, -284535, 96841, -40016, -94426, -208066, -79444, -29121, 86139, 174527, 108365, 77821, 24470, 41941, -72933, 144328, 48384, -22171, -66454, 96809, 248366, -132481, -179952, -51460, -25945, 145573, 123025, -77390, -86972, -79226, -38048, 131703, -95448, 349251, 3118, -247673, 354425, 114874, 258782, 304608, 218033, 29972, 212146, 273084, 213668, 40963, -17257, 144379, 68155, -320397, 127393, 307867, 2172, -54550, -85492, 207279, 157340, 129310, 59728, -182857, 210823, -183040, 180968, 73116, -98323, 42340, -16065, 80349, -109529, -22196, 101591, -124435, 81740, 106186, 49641, 197265, 232566, -32509, -61565, -241648, -78745, -210883, -105980, 130070, -65770, 14004, 386558]
17710C86558e48240i9835p8272A12993b9390A78282b0387E7688i7323m8081D61594
17698A0616h3576C5687J8951R8045b3650A64908g4444a5916l194B34197P9623
17687C13820j37330b6908A86947C9981J6197a50252C70457c30216f9455A70808
17676H8293L4302b1570G0158i8401f206l85634A73869Q1168A8228K0183R7510
17665A35921j0151B0784e4724H138J86659a7052B35518P3762a7303A16320C3878
17653e3745B5467M1778K1397J17233A01157K28167B9789a4355p708k21663P8702
17642a65024m2759B8299c7072A29779J16658b9183C48419a78709D8302A0917i0297
17630c74986c2344G1987A4738J47621g2714j27548A27191A210g2361j50591b7880
$$ y = [386558, -548240, -99835, -178107, 112993, -29390, 178282, -20387, 57688, -97323, -145404, 461594, 10616, -83576, 35687, 54638, 152683, -23650, 164908, -74444, -15916, -19110, 234197, 313820, 176490, -26908, 186947, 39981, 56178, -150252, 370457, -330216, -69455, 170808, 88293, 122595, -21570, 70158, -98401, -6206, -391840, 173869, 255037, 18228, 38411, 135921, 125770, 20784, -54724, 8138, 194797, -17052, 235518, 309280, -17303, 116320, 33878, -53745, 25467, 67245, 88642, 205875, 101157, 329324, 29789, -14355, -22063, -243726, -165024, -207783, 28299, -37072, 129779, 246437, -29183, 348419, -178709, 48302, 10917, -90297, -374986, -32344, 71987, 14738, 162359, -72714, -200262, 127191, 1210, -72361, -222952, -27880]
17618B19881N2709p9246J47693A40655o1523c03213J20603d8203B76433j15343
17608A61090p7476l3480b16821A96532c59975c7862A37690J8093D3651b4124B09264
17596B23823q4349k5661m4868J60441I6768m2056J20433d1578H7919p689F679
17584a74099r0899C43210a53609j22069C47231A43379B6226a90708k9596k79252
17574d99556c8675k9065H078J15241E3291a04006H5596K2068J4242h8892D970
17562A54752J95570A26950L8764J09014c0673p9568A95030K8622G9690l362j9670
17551E6658a76988D7094a65123A27027a89346A33619b53855A24983b544H1586
17540g7213B51487J35018b17406C2212R3673D9447J58046j5934J45707A54713
$$ y = [219881, 272590, 193344, 341037, 140655, 79132, -303213, -182610, -48203, 276433, 161090, 83614, 50134, -216821, 196532, -359975, -37862, 137690, 155783, 43651, -24124, 209264, 223823, 139474, 113813, 68945, 229386, 96768, 54712, 175145, -41578, 87919, 80230, 6679, -174099, -264998, 343210, -153609, -275678, 347231, 143379, 26226, -190708, -220304, -499556, -38675, -67740, 8078, 123319, 53291, -104006, 85596, 107664, 121906, -88892, 4970, 154752, 350322, 126950, 165714, 274728, -30673, -110241, 195030, 223652, 79690, 76328, 56658, -176988, 47094, -165123, 127027, -189346, 133619, -253855, 124983, -2544, 81586, -77213, 251487, 386505, -217406, 32212, 125885, 49447, 207493, 191559, 337266, 154713]
17529C89893a50866A33440Q7B1373j0534N7644O1922K82657h9300E5100a38507
17517A48018N861F4786J07498o7439h3649A81585a59203G2822J76449j09926a16961
17505b55947F4771a09993D25826H7914J62394d4973B52203j06180g8889F6051
17494A87767r0743J77361f2752b0828A18689a43540M489A5497J45361j3815J17113
17483B64156l2015J6727j18846d8716n6106c2978B8232N9337A8546L50770j25281
17472B44035I3078A366N4285J16626b9215A21865O43566C58191j04150C802J57191
17461A60993a58450A50065L5581H377M50023I9008N3885P3228J23982J774j03814
17450B48063r5844K23222A62118L35734R7813g2259A63360J24121C6715J84138
$$ y = [389893, -150866, 133440, 133527, 21373, 10839, 68483, 130405, 413062, -89300, 55100, -138507, 148018, 153879, 64786, 172284, 104845, -83649, 181585, -159203, 72822, 249271, 139345, -116961, -255947, 64771, -109993, 425826, 87914, 250308, -44973, 252203, 146023, -78889, 66051, 187767, 97024, 274385, -62752, -20828, 118689, -143540, -139051, 15497, 160858, 147043, 264156, 232141, 248868, 130022, -48716, -104822, -32978, 28232, 87569, 18546, 369316, 244035, 93078, 1366, 55651, 172277, -29215, 121865, 765431, 358191, 254041, 3802, 160993, -158450, 150065, 185646, 8377, 458400, 99008, 152893, 226121, 350103, 351877, 248063, 152219, 375441, 162118, 497852, 595665, -72259, 163360, 287481, 36715, 220853]
17440B20853K60894B11097J8851P8549K00729q9034a46981C74615I3753J27432
17430B21185J62659m3016j48865G0497L11299L7574G0862K89390j39578J87377
17420D08051C9102M05737a03628B8012K02518J37853m3346J61934k32198o6780
17410A87993a21421A44317o2824c6608A17377K12797H9449K23225f7534B02414
17399B14482d8402C72384d8697A14363c7940j1402a4137j15508B83720o7720J19364
17388C35364g5831r6277C63906j73478K72949B31591R4127q4236J46813E6027
17377A48579k8367J71270j28887O3212a15868A64660D7734h060D0062K557i9286
17365B71849D4649j0017K83767b16894c561C06798A16426L35792a53318A05649
$$ y = [220853, 481747, 211097, 229948, 308497, 509226, 420192, -146981, 374615, 93753, 221185, 383844, 340828, 191963, 70497, 381796, 419370, 70862, 360252, 220674, 408051, 39102, 444839, -103628, 28012, 230530, 368383, 325037, 486971, 254773, 187993, -121421, 144317, 81493, -36608, 117377, 330174, 89449, 312674, -67534, 202414, 214482, -48402, 372384, -48697, 114363, -37940, -49342, -14137, -129645, 283720, 216000, 335364, -75831, -172108, 363906, 190428, 463377, 231591, 325718, 241482, 388295, 56027, 148579, 120212, 291482, 162595, 225807, -115868, 164660, 47734, -8060, 40062, 42619, -99286, 271849, 44649, 34632, 318399, -216894, -3561, 306798, 116426, 452218, -153318, 105649]
17354A18834k8050M15443A07530a15812A9820J24590J08484a65794A00797M07799
17344E08596I5428b2559a917F3322M05248B4053K34814G0516j9150M5703N7707
17333A54776J53146G5850L87671j96818J4222a77412C6927J69463H7373J36584
17323B23957I7474N0611o6410K24673q2090h586B09713K8664G2503K16644G2084
17311e6857A73906P9117J55598d125A23687K23162j27298K11158A93981J81589
17301C75570G4589K23705j26094K9895a75726A9752J64852C7083J09035Q7205
17291B33323h8328K3172j02155B6939e5951A88012l1164c42078C24236d6438F25513
17279i5747q0519I5310K922K15360A8880J2020K61877b9039A16592O3052D1502
$$ y = [118834, 90784, 506227, 107530, -115812, 19820, 144410, 252894, -165794, 100797, 508596, 95428, -22559, -1917, 63322, 468570, 24053, 258867, 70516, 51366, 97069, 154776, 307922, 75850, 463521, 266703, 280925, -177412, 36927, 206390, 87373, 223957, 97474, 148085, 81675, 306348, 224258, -8586, 209713, 238377, 72503, 289147, 72084, -56857, 173906, 253023, 408621, -4125, 123687, 346849, 219551, 430709, 193981, 375570, 74589, 298294, 172200, 202095, -175726, 19752, 184604, 37083, 146118, 233323, -88328, -65156, -167311, 26939, -55951, 188012, 156848, -342078, 324236, -46438, 625513, -95747, -176266, 95310, 98232, 313592, 18880, 30900, 292777, -29039, 116592, 179644, 41502]
17267A27337K03466E4778K00980P8590O4833j30885p5115k4539P6994j02402M39659
17256E82893A7616M6491J19306F5068b998A17603C9510J33341B5790J84434a9698
17244B03303H502L94992A9610M02725I1367M0407F2426a41340A30584n5778J68174
17233B42980o6666Q4114F2874O5298M67265a7378C90692j12382j5570M9608A37090
17221D13322j83857N2713K14906j64347C2242J09100J24697l4906J55064j77970
17211B08227N5406q3698J06703J03834A92914o2353L43872G1000b0024A33292
17200G5411J67778G0440B2695L20648A14523P0395n1315J89639H2068M5706D0382
17188A56674K08527o1630j23866N6687f3224A16246M28858a18045A21202L2219
$$ y = [127337, 330803, 54778, 255758, 334348, 399181, 268296, 193181, 168642, 245636, 143234, 582893, 17616, 64107, 183413, 65068, -2998, 117603, 39510, 172851, 25790, 210224, -19698, 203303, 8502, 403494, 19610, 422335, 91367, 131774, 62426, -141340, 130584, 74806, 242980, 176314, 260428, 62874, 128172, 595437, -17378, 390692, 278310, 262740, 312348, 137090, 413322, 229465, 282178, 497084, 332737, 32242, 141342, 266039, 231133, 386197, 208227, 263633, 179935, 286638, 390472, 192914, 130561, 474433, 71000, -20024, 133292, 75411, 243189, 70440, 22695, 343343, 114523, 184918, 133603, 323242, 82068, 127774, 40382, 156674, 365201, 303571, 179705, 236392, -63224, 116246, 545104, -118045, 121202, 153421]
17178A53421j988J91108i1657B36301o1541E5369A0352L39999K79148j50572c4461
17166B49916L2404L69726k91228J11222r3226a26872C01823A29215K50844J91144
17156E71203k83059b017A14108L83082k20597G3668L42496A64121L29363l4304
17146D59180p7281A25118K66909j1855O8697L2813k28086J91826b2606B89836
17135g186D03292j85856m6035M91757l16361J49505k18476J30427n6486K34858
17125E86625B55774L45168B08765k2649a945B73611L49926l07915n7765K11362
17115D69219J71618j9310j46153B18594J94207P7026j9357p6685J12769r4242
17105D12312j23160J99143m9798A85268K38064l7502j8892j48897P3233J66053
$$ y = [153421, 151433, 342541, -91657, 236301, 174760, 55369, 10352, 350351, 629499, 478927, -34461, 249916, 282320, 652046, 360818, 472040, 378814, -126872, 301823, 129215, 380059, 571203, 288144, -2017, 114108, 497190, 276593, 73668, 416164, 164121, 493484, 459180, 381899, 125118, 392027, 380172, 448869, 481682, 253596, 445422, -22606, 289836, -7186, 403292, 217436, 171401, 663158, 346797, 496302, 277826, 408253, 351767, 586625, 255774, 600942, 208765, 186116, -1945, 273611, 623537, 315622, 257857, 469219, 640837, 621527, 475374, 218594, 412801, 489827, 470470, 393785, 506554, 412312, 289152, 488295, 438497, 185268, 423332, 385830, 366938, 218041, 291274, 457327]
17095D57327l309J5757k7249J44859k83054p237L05293k1349n138B67061N5594
17084C22655J80961r2241l7703K40302B29585M04102Q5306l5488B76813J51683
17074D28496K01648m8081K3042O2876l24409l8678O0563J00209j01038J90999
17064E55627j64971L44751A15598M51792A99063M99558j87187k16358M46241k83050
17054D58267J09752j47503M43675C46289J38279J56736k22681L7271L3955J72307
17044F62156j67045J9090j5428k28410P1335J28832K92754k99758q6314K22343
17034E99555B08312J72791r5647L68839O0397l0670j27155J95023B62317L99671
17024F61988l09660K56349J23892l21017K52811j83062K28289n9236n2945k413
$$ y = [457327, 454018, 469775, 442526, 587385, 304331, 297094, 602387, 581038, 575900, 267061, 322655, 503616, 411375, 373672, 613974, 229585, 633687, 718993, 683505, 276813, 428496, 630144, 582063, 605105, 667981, 343572, 304894, 365457, 465666, 364628, 555627, 390656, 735407, 115598, 567390, 199063, 698621, 511434, 295076, 741317, 458267, 568019, 420516, 864191, 346289, 484568, 641304, 418623, 455894, 489849, 662156, 495111, 514201, 498773, 270363, 341698, 470530, 763284, 463526, 377212, 599555, 208312, 381103, 285456, 654295, 714692, 684022, 556867, 751890, 262317, 661988, 352328, 608677, 732569, 411552, 664363, 481301, 709590, 650354, 597409, 594996]
17014E94996M59768m89924B58374N66476j70941J88799r7822K45084l01403j43777
17004E44790R9835M3962K28946j60165J98129D67780N03029m11948K93443j08593
16994G43711J85531k66654k54705N20526O2473r4846j52203j57270M6692K9715
16984F62970N4992J56094l15811J73911q0253q2256K10423L2844o4176K16799
16974I65537J4603j63364J75101k36505M71708k76177r6072N1696j73826P0659
16964H03360P4842J3250k05413L10219j68182P2438Q7037j28996K31114K2793
16954A112462N461l77498M78663q8278k56396L7844J63304K1234j00532Q2764
16944A079028j9770J7749r5234K87156l27831K35768k07787O3574J39790J79309
$$ y = [594996, 1054764, 564840, 258374, 824850, 653909, 842708, 744886, 989970, 688567, 544790, 644625, 688587, 917533, 757368, 955497, 467780, 970809, 558861, 852304, 743711, 929242, 662588, 407883, 928409, 990882, 896036, 743833, 586563, 633255, 662970, 717962, 874056, 558245, 732156, 651903, 569647, 780070, 812914, 748738, 965537, 980140, 816776, 991877, 755372, 1227080, 950903, 854831, 906527, 732701, 803360, 878202, 891452, 686039, 996258, 828076, 900514, 987551, 858555, 1089669, 1112462, 1117923, 740425, 1219088, 1130810, 874414, 912258, 1075562, 1096796, 996264, 1079028, 1059258, 1077007, 981773, 1268929, 941098, 1176866, 969079, 1032653, 1172443, 1351752]
16934A351752l17403K01316Q5601k91599R9753n201O9911J23251k1858j278k1669
16923A272576K84567k99316J06866q6166p4919K50414K61822j66993k71892J91080
16913A468039L4733j02589j5032L3158L72920j68151m13918K67070J5282j06006
16903A385506N05145j22929m40132J93455m320L67668j43128J04666p6915j91347
16893A577669J34083J32532k05285L09918J66338k16461l82927M23165M9062m21183
16883A566911K97881L16070k94445M56687J96689m03060j29247R3478J17459J19948
16873B338371q267o9350j20094L12218J39517k57574J4730J58159K18734J43658
16863B870102l90850J76604J08866k34487J78933J11638N5519J10275j9888Q2647
$$ y = [1351752, 1034349, 1235665, 1321266, 1029667, 1129420, 1124219, 1194130, 1317381, 1295523, 1294245, 1272576, 1557143, 1257827, 1364693, 1278527, 1203608, 1454022, 1715844, 1548851, 1276959, 1468039, 1502772, 1400183, 1385151, 1418309, 1791229, 1623078, 1209160, 1476230, 1491512, 1385506, 1890651, 1767722, 1327590, 1521045, 1516725, 1884393, 1741265, 1845931, 1769016, 1577669, 1711752, 1844284, 1638999, 1948917, 2115255, 1898794, 1515867, 1939032, 1988094, 1566911, 1864792, 2180862, 1886417, 2343104, 2539793, 2136733, 2007486, 2100964, 2218423, 2338371, 2330104, 2260754, 2140660, 2452878, 2592395, 2334821, 2349551, 2507710, 2726444, 2870102, 2479252, 2655856, 2764722, 2530235, 2709168, 2820806, 2876325, 2986600, 2966712, 3049359]
16853C049359Q740k88500K03835Q4635J18348K28541j41312Q7189n16744N03217
16843C337308j37610J67211K78497K8345k20122n5880K26271M27568k6100J64359
16833D189847J66544k53023L05852k46849K88348k63730J41041R9544L26627k63681
16823D490520K58402J19408r9379R3415P5193K93846N11121m67314R0251m443
16813E361020N72749K98209o36358M46877N45837j60818O1456K44267K38414k21757
16803F749896J20180L72411L01269q9600L0726K00392q8431n3594M86804N89795
16793H619848K36089q1368R8518N58273J15718M33647K73122k62513R00686k42395
16783A0649625L40728L66111M90146O73278J34766K36999O38131K78345M32101
$$ y = [3049359, 3058099, 2769599, 2973434, 3058069, 3176417, 3404958, 3263646, 3350835, 2834091, 3337308, 3199698, 3366909, 3645406, 3673751, 3453629, 3397749, 3624020, 4051588, 4025488, 4189847, 4356391, 4103368, 4409220, 4162371, 4450719, 4186989, 4328030, 4427574, 4754201, 4490520, 4748922, 4868330, 4768951, 4862366, 4937559, 5231405, 5742526, 5275212, 5365463, 5361020, 5933769, 6231978, 5595620, 6042497, 6588334, 6427516, 6488972, 6733239, 6971653, 6749896, 6870076, 7242487, 7543756, 7454156, 7484882, 7685274, 7596843, 7543249, 8030053, 8619848, 8855937, 8774569, 8873087, 9431360, 9547078, 9980725, 10253847, 9991334, 10892020, 10649625, 10990353, 11356464, 11846610, 12519888, 12654654, 12891653, 13529784, 13808129, 14240230]
16774A4240230O09397M78598L42538L18691L00184O58768Q91366O67495K63025
16765A8770292O69938Q41065Q26594O27370Q57173J030896Q96059Q71588R24366
16756B6315341J142051J120584J239042J260593J241328J749769J411921J654325
16748C7134954J633657J932935K027803J992681K583022K284121K553983K946370
16740E5089526K898174L125314L673283L747893M201951M079041M619562M888762
16732H6323506N338951N636205O092452N925374O882804P064154P538067P201488
16724A38003001P836806P894596P850098P360368P156112O373586N457962M598289
16716A92530818L422468K073353M18298p94801k249686l508122n253810n740235
$$ y = [14240230, 14849627, 15328225, 15670763, 15989454, 16289638, 16948406, 17839772, 18507267, 18770292, 19440230, 20281295, 21107889, 21735259, 22592432, 23623328, 24519387, 25390975, 26315341, 27457392, 28577976, 29817018, 31077611, 32318939, 34068708, 35480629, 37134954, 38768611, 40701546, 42729349, 44722030, 47305052, 49589173, 52143156, 55089526, 57987700, 61113014, 64786297, 68534190, 72736141, 76815182, 81434744, 86323506, 91662457, 97298662, 103391114, 109316488, 116199292, 123263446, 130801513, 138003001, 145839807, 153734403, 161584501, 168944869, 176100981, 182474567, 187932529, 192530818, 195953286, 198026639, 198444937, 197650136, 195400450, 191892328, 186638518, 180898283]
16708A80898283p031677p365311p894122p827571q385025p967106p595079p609736
16700A19222656p383658o450977o531424o331086n791767m770803n321578m612510
16692G2028853m163831m008356l553997l419645l036298k740242l139585k778095
16684D5188804k175399k136494k160110j570531j798993j778512k081299r86358
16676C0501108j543824j202295j067716j190657j216969j013020q31864r23652
16668B1511111o27767j109565r64396n61036l24980j071944n21518n53090o95493
16659A5081322j41285p92765o97960k32541m28989n18109m18315K29773q95754
16650A1185377M7836n20543j95250k54507k74264n81196K90148j053386K5660
$$ y = [180898283, 173866606, 166501295, 158607173, 150779602, 142394577, 134427471, 126832392, 119222656, 111838998, 105388021, 98856597, 92525511, 86733744, 81962941, 76641363, 72028853, 67865022, 63856666, 60302669, 56883024, 53846726, 51106484, 47966899, 45188804, 43013405, 40876911, 38716801, 37146270, 35347277, 33568765, 31487466, 30501108, 28957284, 27754989, 26687273, 25496616, 24279647, 23266627, 22434763, 21511111, 20883344, 19773779, 18809383, 18248347, 17923367, 16851423, 16329905, 15776815, 15081322, 14940037, 14147272, 13449312, 13216771, 12787782, 12269673, 11851358, 12081131, 11185377, 11233213, 10712670, 10517420, 10262913, 9988649, 9407453, 9697601, 8644215, 8669875]
16641H669875k91815l90215p5478k94986k08833k43443j88688J9776r7913l22852
16631F575428K78550o21722o2023r9457j97741O0186k34420j59702o56337M01586
16621E284348K6515m27015Q635k17504L0782j5550k72970j56252M63350m43675
16611D280664j70038k98539J36358k12522M66800k30927m63254K63082N1476k71692
16601C551408o3715J60009n38543J55427j63946k65163N55734n37181L40980l80712
16591B814298j03022p358R8140j18829l1899J33238j93666J53007m77469K02252
16581B468692M20404l84073j73135j14385K33568l84049K29627J99562l94953
16572B101258P4849m18900L29646m7733k2487j98J09379j90231Q6323l23370k32281
$$ y = [8669875, 8378060, 7987845, 7912367, 7617381, 7408548, 7165105, 6976417, 6996193, 6898280, 6575428, 6853978, 6232256, 6170233, 6070776, 5873035, 5933221, 5698801, 5539099, 4882762, 5284348, 5310863, 4883848, 4892483, 4674979, 4705761, 4690211, 4417241, 4260989, 4724339, 4280664, 4110626, 3812087, 3948445, 3735923, 4202723, 3971796, 3508542, 3771624, 3823100, 3551408, 3487693, 3647702, 3109159, 3264586, 3100640, 2835477, 3391211, 2854030, 3195010, 2814298, 2711276, 2703918, 2802058, 2683229, 2651330, 2784568, 2590902, 2743909, 2266440, 2468692, 2889096, 2505023, 2331888, 2217503, 2451071, 2067022, 2296649, 2496211, 2101258, 2176107, 1757207, 2086853, 2039120, 2016633, 2016435, 2125814, 1935583, 2021906, 1698536, 1466255]
16561A466255M62503j18673j08207q6961J61884q8790N47J23875l73777N1271
16551A489927K93979j77165J22601K14765n43919K85316j34517Q3352m78572J04956
16541A260723L70300m21329K75893n9760k66052J73188k84480L18083q1298k19567
16531A065701J68756J3305j27970j71076K33512m6808J13049j01181k87134J99991
16521A060145l8906O0235O8169J44226k58852J29863l13188l6952j91132k9756
16511E93852M69532j09671K283L8890k28290K69918K38472m63262l4356J02652
16501H80020l10575J45709j71383K43338P8885J35557o0930j01434n0308k7488
16491G61391M9329J4695J43727k10729J71137j87552j54577K75253o5505P9849
$$ y = [1466255, 1928758, 1810085, 1701878, 1614917, 1776801, 1688011, 1688558, 1812433, 1438656, 1489927, 1783906, 1606741, 1729342, 1944107, 1400188, 1685504, 1550987, 1634339, 1155767, 1260723, 1631023, 1209694, 1485587, 1425827, 1159775, 1332963, 1048483, 1366566, 1285268, 1065701, 1234457, 1247762, 1119792, 948716, 1182228, 1135420, 1248469, 1147288, 860154, 1060145, 1021239, 1081474, 1149643, 1293869, 1035017, 1164880, 851692, 814740, 623608, 593852, 1063384, 953713, 955996, 994886, 766596, 1036514, 1274986, 811724, 777368, 880020, 569445, 715154, 543771, 787109, 865994, 1001551, 940621, 839187, 788879, 761391, 810720, 825415, 969142, 758413, 929550, 741998, 587421, 862674, 797169, 877018]
16481H77018l83890j3105K18964B99832J70936K21759j51599K11190k19401L94363
16471I27080D21320K71947k00572M69504k98174N8003k39684N8426J46060M2047
16461G28877l51060A56253L71357j80734R0247L54564C50609L08070R5505k16101
16451E38083k64569r3705L67894k37370L63386j60708M0535k06919L19165J34893
16441H00685l01806J20923p8587j77917Q6890J43958p3651B26913K54607D1858
16430C28390Q2055K04522B65398J88427n4972j74606J39272l1433K03672A22139
16419D33576k1723J16661j29733J45406j90757E1914K72415J9153j03285j05517
16409A34680M76351A24750M99363P3794B12661J82310J75057F9812K37011K85845
$$ y = [877018, 493128, 480023, 698987, 299832, 470768, 692527, 540928, 752118, 532717, 927080, 421320, 693267, 492695, 962199, 664025, 722028, 482344, 540770, 686830, 728877, 377817, 156253, 527610, 346876, 437123, 791687, 350609, 658679, 754184, 538083, 273514, 179809, 547703, 310333, 673719, 513011, 553546, 346627, 665792, 800685, 498879, 619802, 541215, 363298, 450188, 594146, 520495, 226913, 481520, 41858, 328390, 410445, 614967, 265398, 453825, 398853, 224247, 363519, 332086, 535758, 122139, 433576, 411853, 528514, 398781, 544187, 353430, 51914, 324329, 343482, 240197, 134680, 611031, 124750, 624113, 697907, 212661, 394971, 570028, 69812, 306823, 592668]
16399E92668j4290j96481j42043L51718A95697o3151J15747o2471L3843H2687
16388B62469J02897O4156J4235r5236N6314j26190J01541A85913M09775B24714
16377C89940E490J76992H4462j8449J52492N2107j17148J34960k6819J03120A05392
16365B03194M2950L71130A70850o5976J57874A16596m1572j6085P135e5465A69410
16353B0280a16981C54161k4940I780J95377K95753j70121O3121B9766g8768C19297
16341a02978D62077F6240M92701B15363A5321F451a15528C19980q9603J33098
16331C63475c4583B48601F4057g9541C95694F0285a6154F1182J64914A01535K37073
16320C38608a1556D26510A81094J04247o294i6011J4575A9665J79842f7363j0204
$$ y = [592668, 578378, 381897, 239854, 591572, 195697, 132546, 248293, 185822, 219665, 82687, 262469, 365366, 429522, 443757, 348521, 404835, 278645, 380186, 185913, 595688, 224714, 389940, 5490, 182482, 84462, 66013, 218505, 270612, 153464, 288424, 261605, 364725, 105392, 203194, 246144, 617274, 170850, 104874, 262748, 116596, 75024, 58939, 66074, -55465, 169410, 20280, -116981, 354161, 329221, 9780, 205157, 500910, 330789, 393910, 29766, -78768, 319297, -102978, 462077, 66240, 558941, 215363, 15321, 6451, -115528, 319980, 230377, 363475, -34583, 248601, 64057, -79541, 395694, 60285, -16154, 61182, 226096, 101535, 338608, -11556, 426510, 181094, 285341, 279047, -96011, -81436, 19665, 199507, -67363, -77567]
16309g7567k0407b4606E20207A59733a78926A67673h9022I201J94050r7294K74121
16298C80078C9660a74321A87841P3537j29971P4017N90P9028P5400A2646M74807
16287D87453H9593a35460A93905c2634B40530a73242a3906q4164B52593j07329
16277A45264g7858A00073J41773m2402G5430L69291A23628K36885I233K00232
16267B09465D5047P0172b5678B06211j8865H8046J3331J85777j32772K29815A37348
16255b03642Q6270G2446J39791k708b17407M3009o1325A58170O8624c80179e707
16243e1563H9027J73146r3680m031M939i1643C20521J06375A12129A1311a23341
16231A4029a79232A94622a30628n1463A58897m7847M5529i5645B46055b32024
$$ y = [-77567, -97974, -24606, 520207, 159733, -178926, 167673, -89022, 9201, 203251, 105957, 380078, 39660, -174321, 187841, 261378, 131407, 205424, 206014, 285042, 360442, 12646, 487453, 89593, -135460, 193905, -32634, 240530, -173242, -13906, -98070, 252593, 145264, -77858, 100073, 241846, 199444, 75430, 444721, 123628, 360513, 9233, 209465, 45047, 115219, -25678, 206211, 187346, 88046, 101377, 287154, 154382, 384197, 137348, -203642, -117372, 72446, 212237, 209529, -217407, -174398, -235723, 158170, 226794, -380179, -5707, -51563, 89027, 262173, 168493, 164462, 169401, -91643, 320521, 426896, 112129, 11311, -123341, 14029, -179232, 194622, -130628, -182091, 158897, 111050, 156579, -95645, 246055, -232024]
16220a18860Q692M9457A14260E2925J10960D4426b04761C68974j62671h4197C08576
16208B9979b09234h3597C86593f2976B82603C3857e3752p2470N1594A63365P9070
16197B42435i7172k3385F0940d0626C23091b2422j43853B08236G7677p344A0015
16185A65006d7759E5705J23553a43023f1759C49404G6737Q2740a1912B57878E4630
16173B91452E9670a25484A77030l3421B7625a23255B894J91054J3554r7619J01953
16162B11836I1877K765b8617B63861C3596J97289O7339a25195m9156r4141L296
16151b65196a6532A43639a02788A6044L1343J30828F9908L329r418f8070A20904
16139G5234i5268a75C4993c6887F6392j8814b56064B1594N2058h694A92J73395
$$ y = [-118860, -110168, -60711, 114260, 52925, 163885, 44426, -204761, 368974, 206303, -84197, 308576, 29979, -209234, -83597, 386593, -62976, 282603, 33857, -53752, -126222, -74628, 163365, 242435, -97172, -120557, 60940, -40626, 323091, -22422, -166275, 208236, 77677, 70333, 10015, 165006, -47759, 55705, 179258, -143023, -61759, 349404, 76737, 159477, -11912, 257878, 54630, 291452, 59670, -125484, 177030, 143609, 27625, -123255, 2894, 193948, 207502, 109883, 211836, 91877, 94642, -28617, 263861, 33596, 230885, 298224, -125195, -174351, -268492, -265196, -16532, 143639, -102788, 16044, 47387, 178215, 69908, 73237, 63819, -68070, 120904, 75234, -95268, -175, 34993, -36887, 66392, 47578, -256064, 21594, 73652, -8694, 192, 173587]
16127A73587e6985l824K2488l1266C4641J17842P845C1648L9144a41318E3184
16115b37883a2895j06997B10555q0600a41897A43397a61834G3247a50391K1930
16105a28461R943A53000O7277A01597d1029G2254J51619c9052l8116A52387A5328
16093c7261j48562B8788j2704J98747J74048j43504E0515J11412E9977a89366
16082a62542H2497l5290J34435f8059n5611A32969P3778a95590Q6849A18127a88110
16070A97991K9429I3449b03294R5131A32241a73995a8039l67564i5124r2402I2832
16058c70960d8932j84495B01343a1574l2721J8527n2966B45534c33006e6862B5400
16046a11434C7159a40726d3489D16862a09999j04577A91236i2626d018j71283
$$ y = [173587, -56985, -60809, -38321, -69587, 34641, 152483, 160328, 31648, 70792, -141318, 53184, -237883, -12895, -119892, 210555, 129955, -141897, 143397, -161834, 73247, -150391, -128461, -118518, 153000, 220277, 101597, -41029, 72254, 223873, -39052, -77168, 152387, 15328, -37261, -185823, 28788, 16084, 214831, 388879, 245375, 50515, 161927, 59977, -189366, -162542, 82497, 47207, 181642, -68059, -123670, 132969, 206747, -195590, -108741, 118127, -188110, 197991, 227420, 93449, -203294, -108163, 132241, -173995, -18039, -385603, -95124, -187526, 92832, -370960, -48932, -233427, 201343, -11574, -44295, -25768, -78734, 245534, -333006, -56862, 25400, -111434, 37159, -140726, -43489, 416862, -109999, -214576, 191236, -92626, -4018, -175301]
16036a75301A50254a74737I1836m833a42885o9079D7836b57509C31077C5540E538
16024a90786F9105a24287K6305B0436K28715d2002j7233B56385h621r9836b0175
16012B05098q1566g130p8784r8565g6545j66376a03092b28A3064J10701K79750
16001D03515b36925d184k22450A52774d3769p9611B7061d2221r4325j42479I2327
15989A58512b3872k9503A75699b45162A71228E2539M55085A65491J24457a4739
15978B27590N170E4740J2732a74349N8473a1431n28993b05758O3228r2104h1195
15966a35780A0598K8576J4056a85309n7570c8662j21999c6992G1695f9437A16763
15954F2508J08695a31233c2969D5439D202a70860a7754A25737d9046j59265j48723
$$ y = [-175301, 150254, -174737, 91836, 87003, -142885, -211964, 47836, -257509, 331077, 35540, 5538, -190786, 69105, -124287, -97982, 20436, 249151, -42002, -59235, 256385, -8621, -108457, -20175, 205098, 123532, -7130, -85914, -184479, -76545, -242921, -103092, -228, 13064, 123765, 403515, -236925, -4184, -226634, 152774, -43769, -123380, 27061, -42221, -136546, -279025, 92327, 158512, -23872, -53375, 175699, -245162, 171228, 52539, 507624, 165491, 289948, -14739, 227590, 232760, 54740, 67472, -174349, -115876, -11431, -540424, -205758, -142530, -234634, -81195, -135780, 10598, 39174, 53230, -185309, -242879, -38662, -160661, -36992, 71695, -69437, 116763, 62508, 171203, -131233, -32969, 45439, 4202, -170860, -17754, 125737, -49046, -208311, -357034]
15943c57034B67951a41984A84121b95264e2728j89913J9974G9133C8169b93367
15932b28222A80561J93644b0320q1700L5116k3277o0005A3450c62571a25420E6385
15920a60466k50934J84603D2964j7112a99275A22797l7856C4865b9982D3141C914
15908c92150G9437b98874g7036A12086R2006n8893a04566A98871o6766O6340b59004
15896a6489B14587b82907b4195k59567A8292a24776e5365D1425L2302m564a43817
15884e2439C4851j5977d79308G9707d1329p4542K0570h226A3633c57175d8589
15872b06478K6413B04965d7214A14685C4470R0011g8427A14712d9005A29806j6418
15861A13388c0196j09046A98585b27480a07120I0738B910a20039A75196Q2018
$$ y = [-357034, 267951, -141984, 184121, -295264, -52728, -242641, -222667, 79133, 38169, -293367, -228222, 180561, 374205, -20320, -102020, -66904, -90181, -150186, 13450, -362571, -125420, 56385, -160466, -411400, -226797, 42964, 25852, -199275, 122797, 84941, 34865, -29982, 43141, 3914, -392150, 79437, -298874, -77036, 112086, 204092, 145199, -104566, 198871, 132105, 198445, -259004, -16489, 214587, -282907, -24195, -283762, 18292, -124776, -55365, 41425, 73727, 69163, -143817, -52439, 34851, 18874, -479308, 79707, -41329, -115871, -95301, -8226, 13633, -357175, -48589, -206478, -180065, 204965, -47214, 114685, 34470, 124481, -78427, 114712, -49005, 129806, 113388, -30196, -139242, 198585, -227480, -107120, 90738, 2910, -120039, 175196, 257214]
15851B57214j00510D1539O8983b8639r016F5046e16639a34067l10814B1347b56688
15839C5174a10587A97394k1367b65475I9593b93063Q9129a0881A43388J79435
15829C22823a9849B05231a26660c1129C000R5398a87526L4690m8341j04160a49796
15817c43875c6716q734l7464C57192A34077B9660a12632A8949a44937N1752j22269
15806b15454F2159b2492A26604J2426b08567O6513A11032g8932j99716F326K28608
15795B34934a31019a2792I2228N959L6988b43793b8631A76339a87004k3494p7326
15784b87824C99413G976J48150a46084B7966J99974k7399K5729A0669a05172G3855
15772e1650k86469B98440i1972G431h8792A6912Q0719K9829c32424a17383A43196
$$ y = [257214, 156704, 41539, 110522, -28639, -37655, 65046, -516639, -134067, -444881, 21347, -256688, 35174, -110587, 197394, 176027, -265475, 99593, -293063, -203934, -10881, 143388, 322823, -19849, 205231, -126660, -31129, 3000, 98398, -187526, -152836, -201177, -305337, -149796, -343875, -36716, -45450, -82914, 357192, 134077, 29660, -112632, 18949, -144937, -93185, -215454, 62159, -22492, 126604, 139030, -208567, -142054, 111032, -78932, -278648, 6326, 234934, -131019, -12792, 92228, 98187, 135175, -243793, -28631, 176339, -187004, -210498, -287824, 399413, 7976, 156126, -146084, 27966, 227940, 200541, 226270, 10669, -105172, 73855, -51650, -338119, 298440, -91972, 7431, -88792, 16912, 97631, 127460, -332424, -117383, 143196]
15760a56774A19146h5989C11398H1370C297a99229A12178D5113L16164c37715
15749A79617d1899C17532a28914F2645j479J31540K71363f2654N176J5307A04936
15737D5435J35914R4199q4557H1856c6771a2723A16835f1138k08636D2526L176
15726D5702c5500j69226J0538c0433b60j26024k47452h4026A7466b71340A89777
15714B08354a79059K5516K095n3653p2383g6139j84395O629I8245g9973A62767
15702B9448a62032A76201C1481c58961A57117c54021i0661o2335A1290f052G6002
15690A78886g0182b6220j23634l6875c0651G3498R1473J02549a21371C6103a73428
15678B04837c9361n09044B0418a6042L398A15027J95575q4729f6610A94069a69473
$$ y = [-156774, 119146, -85989, 311398, 81370, 3297, -199229, 112178, 45113, 361277, -337715, 179617, -41899, 317532, -128914, 62645, 61166, 192706, 464069, -62654, -57478, -42171, 104936, 45435, 181349, 275548, 190991, 81856, -36771, -12723, 116835, -61138, -269774, 42526, 45702, -35500, -204726, -194188, -30433, -260, -126284, -373736, -84026, 17466, -271340, 189777, 208354, -179059, -153543, -151448, -205101, -277484, -76139, -260534, -253905, 98245, -79973, 162767, 29448, -162032, 176201, 31481, -358961, 157117, -354021, -90661, -152996, 11290, -6052, 76002, 178886, -70182, -26220, -149854, -186729, -30651, 73498, 164971, 267520, -121371, 36103, -173428, 204837, -39361, -548405, 20418, -16042, -12644, 115027, 310602, 225873, -66610, 194069, -169473]
15666a03955B29995B7104P436K1119i3001j50004k5037c1398B3682c7923m0600
15655g8523q7366j84205C1065O123a49698j5823j06207d7207l36424F1790a92612
15643E0413J77953c4606j05523r8531i2141b2904G280J45395d2891A79750p6968
15632A02782a52170B74391c99354P6636J58494r3034E6384b9651C81776A31200
15621a83445E2223K35442H3921g9742C74082I8109j0045J3428a56854F5039K9422
15610I4461f797n6310m1690H3457a24508D3504K02438e0137H0692J20355A5148
15598g9048C16492G4692A2056a81389A55593h2058A8576h4292n126d4481F9621
15586d8510B42476j21130A8141a96488A59761a57977A00853d2073d308k77866
$$ y = [-103955, 229995, 27104, 34540, 55659, -93001, -243005, -268042, -31398, 23682, -37923, -78523, -165889, -350094, 31065, 37188, -149698, -165521, -271728, -47207, -383631, 61790, -192612, 50413, 228366, -34606, -140129, -238660, -92141, -22904, 7280, 152675, -42891, 179750, 102782, -152170, 274391, -399354, -322718, -164224, -257258, 56384, -29651, 381776, 131200, -183445, 52223, 287665, 83921, -79742, 374082, 98109, 88064, 101492, -156854, 65039, 94461, -6797, -63107, -104797, 83457, -124508, 43504, 245942, -50137, 80692, 201047, 15148, -79048, 316492, 74692, 12056, -181389, 155593, -82058, 18576, -84292, -89418, -44481, 69621, -48510, 242476, 121346, 18141, -196488, 159761, -157977, 100853, -42073, -4308, -282174]
15576b82174D4014c44874H0620N7637D556J3803i3753B6540h3319f56j33531b7446
15563d6274E1151L2084e6612q6157C77882a59692B07181K7124b20980A65015c9811
15551B40056f7439L1973C81320a10973j06526Q6690A14712b10327B26687j11524
15541A15163C5716K14514G7468N8610K44974b68990a19654B9895B082P3271f5678
15529a66174A23036h6210a5841m7104l9127K5036j82395c0912A95332J37177b10096
15517A17069a99090A18026c18234J05898F3021b3302B2564K67726D0097a82368
15506C9552A1224g449A60002F6672J42482h1569j18270G923J30779R6515K9092
15495B64309a63895q931I8809e6131k7648E6301g6431K5931C3817b10816C13473
$$ y = [-282174, 44014, -344874, 80620, 138257, 4556, 18359, -93753, 26540, -83319, -656, -134187, -27446, -46274, 51151, 83235, -56612, -142769, 377882, -159692, 207181, 234305, -220980, 165015, -39811, 240056, -67439, -35466, 381320, -110973, -217499, -130809, 114712, -210327, 226687, 115163, 35716, 250230, 77468, 136078, 381052, -268990, -119654, 29895, 2082, 75353, -65678, -166174, 123036, -86210, -15841, -62945, -102072, -77036, -259431, -30912, 195332, 332509, -210096, 117069, -199090, 118026, -318234, -212336, 63021, -23302, 22564, 290290, 40097, -182368, 39552, 11224, -7449, 160002, 66672, 209154, -81569, -199839, 7923, 138702, 235217, 264309, -163895, -172826, 98809, -56131, -83779, 56301, -76431, -50500, 33817, -210816, 313473]
15483B50310h6771A44589o3578R4423b18566a04399E5256R7099D2429a45247m47588
15472e92835I2394J19735c25393a40640C233h0888r2481B9871b45744Q4717B01331
15460A19294d5636o3146A16793g2822k00124A87299a27652k38300J9323G2058
15449F9262h1867G3575a3102C51580g0101j85655g4808A6202N2098k1796A430
15437d2216J5301k68729H7440N0680D7080i4558j39553H7809N2239b23108A77836
15425E3618J27083a0351A26808D0816J04953a68314a2492j10170Q728c4848m4476
15414g9324L0680m5805A34058c15270D0976L29817A12611J57291j02947a09474
15403i5357G9823C5728i6356A53609a37388B47517b59525A05167a68489k8372
$$ y = [250310, -86771, 144589, 81011, 175434, -218566, -104399, 55256, 152355, 42429, -145247, -592835, 92394, 212129, -325393, -140640, 3233, -80888, -173369, 29871, -245744, -161027, 201331, 119294, -45636, -108782, 116793, -72822, -272946, 187299, -127652, -365952, -346629, 72058, 69262, -81867, 73575, -13102, 351580, -70101, -255756, -74808, 16202, 68300, 46504, 1430, -42216, -26915, -295644, 87440, 138120, 47080, -94558, -234111, 87809, 140048, -223108, 177836, 53618, 180701, -10351, 126808, 40816, 145769, -168314, -12492, -122662, -113934, -34848, -79324, -48644, -94449, 134058, -315270, 40976, 370793, 112611, 269902, 166955, -109474, -95357, 79823, 35728, -96356, 153609, -137388, 247517, -259525, 105167, -168489, -196861]
15393a96861B74945J90523C299b13281a0191j37118A28493j1301a20959A7818
15382A6052L215J15207D0677a44556G3493a46499a6280j63965E4376A3074J77732
15371A90806d6580B66911a36655E5744b88328d0079n8501A08977a19148c787A31931
15359b6407B14765a05670C8072j6877b15440A43834o3327M29530C0310h8374A88191
15347A82533a67553B17676A5047b29831R2336d9748k80207H2922O1080D4994J14417
15336A59411L4277G2594P8564a74112Q193A37777B5505J76239a7816j40213O5975
15325i2054j3426E2320a23473G4517J68674F6323b68488a6880I5910M23656A33034
15313D4794j4187a58765C7114a20865A90730p0361k8349L11794J42710B32689
$$ y = [-196861, 274945, 465468, 3299, -213281, -10191, -147309, 128493, 117192, -120959, 17818, 16052, 19267, 134474, 40677, -144556, 73493, -146499, -16280, -180245, 54376, 13074, 190806, -46580, 266911, -136655, 55744, -288328, -40079, -98580, 108977, -119148, -3787, 131931, -26407, 214765, -105670, 38072, 21195, -215440, 143834, 80507, 510037, 30310, -88374, 188191, 182533, -167553, 217676, 15047, -229831, -137495, -49748, -329955, 82922, 144002, 44994, 159411, 193688, 72594, 151158, -174112, -165919, 137777, 25505, 201744, -17816, -158029, -92054, -105480, 52320, -123473, 74517, 243191, 66323, -268488, -16880, 95910, 519566, 133034, 44794, 30607, -158765, 37114, -120865, 190730, 120369, 92020, 403814, 546524, 232689]
15302D10833A9806K34114J04733c23285a38897A56593Q442k6896N2888N0957b52776
15290A25592a96657A54250J616a13737A79333i0111A94844A2777J28831g9072
15279A54293p4845K8836j9503b88714A53202b4385A28196K26628q6903b78093
15268a64202I856J15289b3580A45195j7619M5526C7909J30792f7617L3071A23462
15256a6067k660A07872J44457D9440h6009B58797d765B96347M36954P40644o3490
15245A410455n328O29380A005569a95862B41887a30697C15190A0534J42155b05879
15234d1084A5358c18360A53531F0439b5961B76819B3058c15343A50265E9685K10291
15223B69976L0612j36834d72j49852O3319B10341G5940l0411K10448q8989d0350
$$ y = [410833, 19806, 253920, 358653, -323285, -138897, 156593, 165035, 138139, 191027, 241984, -252776, 125592, -196657, 154250, 155866, -113737, 179333, -90111, 194844, 12777, 141608, -79072, 154293, 79448, 108284, 88781, -288714, 153202, -24385, 128196, 354824, 267921, -278093, -164202, 9856, 125145, -23580, 145195, 127576, 173102, 37909, 168701, -67617, -34546, 123462, -16067, -18727, 107872, 252329, 49440, -86009, 258797, -4765, 296347, 733301, 1473945, 1410455, 1405127, 2034507, 1005569, -195862, 241887, -130697, 315190, 10534, 152689, -205879, -41084, 15358, -318360, 153531, 60439, -25961, 276819, 23058, -315343, 150265, 59685, 269976, 300588, 163754, -472, -150324, -87005, 210341, 75940, 45529, 255977, 166988, -40350]
15211B52395B8791e0364q6501D9738a69126B2183K09443G5783a19481B55328q851
15200B46477p0606q2716h7396G389J27368J80801G438P7100M1430R3302c5355
15188a72101A27878E5671p762O7744a4833D4266J09621J83376f5401q7996D34250
15176A12716Q4870g01H8441K53326A12912K3198K48211j31459C8407K53043B5490
15164B75859N8380J22990B9425P6919a22327B14341q0681b38269I6946a71438
15153a73927g4381p6882b8696J3436j87006D35540A21184n9258J80023r6367n1181
15142I4401O3232h0522j19228A24160n2283J81690J78987A92670K17355c6780
15131B67629j5023A13162h9336F4732k5449J57807c5079D4947K08829J29426a2092
$$ y = [252395, 28791, -50364, -136865, 49738, -169126, 22183, 231626, 75783, -119481, 255328, 246477, 175871, 93155, -87396, 7389, 134757, 315558, 7438, 84538, 125968, 219270, -35355, -172101, 127878, 55671, 47909, 115653, -14833, 44266, 153887, 337263, -65401, -153397, 434250, 112716, 197586, -701, 88441, 341767, 112912, 136110, 384321, 252862, 38407, 291450, 25490, 275859, 334239, 457229, 29425, 106344, -122327, 214341, 133660, -238269, 96946, -171438, -173927, -74381, -151263, -28696, -15260, -202266, 435540, 121184, 61926, 241949, 145582, 94401, 157633, -80522, -199750, 124160, 71877, 253567, 432554, 192670, 410025, -36780, 267629, 252606, 113162, -89336, 64732, 39283, 197090, -35079, 44947, 253776, 383202, -12092]
15119b02238A62529G0843a16127E3425O7550J74588D4353p395h5721F2823k8573
15108C4250L25979e0226n3334D9284J65607j00332n5006O2081a65015B58599m5819
15097B12780b64020A65695J07233j22593K2693L06202j35402A34720K68994b2931
15086B18301d4344G7238M6782J27790p4971G7758b140A55396d3878B2112J26048
15075A48160d0472C41715O0053J4910n7806A21282K56590A24630J29210b280D50317
15063B51180m9054h1881m0339E02943A37900o170J72080k0760j20689J7202H9739
15051a0986C08117A33650J11088A01716L81473k02641J25708j79976L0445n3903
15041B02822m9008P8221o9159l7172M68968k90300A11573f6758m0342C11173a13983
$$ y = [-202238, 162529, 70843, -116127, 53425, 120975, 295563, 44353, 36958, -85721, 62823, 34250, 360229, -50226, -103560, 49284, 214891, 114559, 59553, 121634, -165015, 258599, 212780, -264020, 165695, 272928, 150335, 173028, 479230, 343828, 134720, 403714, -22931, 218301, -44344, 77238, 124020, 251810, 176839, 77758, -2140, 155396, -43878, 22112, 148160, -40472, 341715, 401768, 416678, 358872, 121282, 377872, 124630, 253840, -2280, 450317, 251180, 202126, -81881, -122220, 502943, 137900, 131730, 303810, 283050, 162361, 179563, 89739, -10986, 308117, 133650, 244738, 101716, 483189, 280548, 406256, 226280, 256725, 202822, 153814, 232035, 162876, 125704, 594672, 304372, 111573, -66758, -107100, 311173, -113983]
15029a1796A98113Q5293J29566J49864B46115j18551O4034K00029p8033J33392
15019D46986j90389F077R9547C3268P9559J38998h6743B44547L25754A26522A9194
15007C26872C8378M86825A85246n7091K45611c0988E1511K66450k6031a28053
14996a94701B9380J35658F34J62228k8178K9818P9213K37102L9878j93770J80698
14985E07623i229A14907O0568m9334J03355Q2740A02592R9941J80649H897M09204
14974D18101B6194L09967G7390K79381M2053d9865D43621O8603k49483L9449j49005
14963A53185K0035n242K49864j87835J67600n71r701A75143J80286B6441K98539
14952C24980A38324L51327j93237A04475L92775k37241f6658B26219J44712j78020
$$ y = [-11796, 198113, 283406, 412972, 562836, 246115, 127564, 191598, 391627, 313594, 446986, 256597, 6077, 105624, 33268, 112827, 251825, -86743, 244547, 570301, 126522, 19194, 326872, 38378, 525203, 185246, 128155, 373766, -30988, 51511, 317961, 291930, -128053, -194701, 29380, 165038, 634, 162862, 134684, 164502, 243715, 480817, 520695, 326925, 507623, -9229, 114907, 175475, 126141, 229496, 312236, 102592, 202533, 383182, 8897, 418101, 26194, 336161, 77390, 356771, 398824, -49865, 443621, 512224, 262741, 302190, 153185, 173220, 167978, 417842, 230007, 397607, 397036, 387335, 175143, 355429, 26441, 324980, 138324, 489651, 296414, 104475, 497250, 260009, -66658, 226219, 370931, 192911]
14942A92911O1871j2144O1083n8862J11219O8043j38736e2761i471B99456J15994
14931D15450j76328J07066k833K08991A63397m4736M4226J10246o0147N49876
14921G62862B14865J62502Q791l2881A64699G6963K56595R5445j739K79466b2176
14909C31159j18449o737O6059K7389J56098l4321j09362K56765B70487K53443
14899E23930A83346q4178e7693C58222J43922j51761J49336J7169j31412L18028
14889G03504l35626M08345C75247q589o3170J63050j54590l898J4689J83087j30278
14878C75548n4190K40451A70841K85880k6923j59600o2725J11541A08685K28990
14868C37675P5911k2971j25393A20940m9328L29292J21003k7661J5622j0200A81953
$$ y = [192911, 254782, 242638, 303721, 244859, 356078, 424121, 285385, -52761, -9471, 299456, 415450, 239122, 346188, 343355, 552346, 163397, 118661, 162887, 273133, 212986, 762862, 214865, 377367, 386158, 353277, 164699, 76963, 333558, 429003, 427264, 706730, -22176, 331159, 212710, 205973, 272032, 299421, 455519, 421198, 311836, 568601, 270487, 523930, 183346, 99168, -57693, 358222, 502144, 350383, 499719, 516888, 385476, 703504, 367878, 776223, 375247, 366658, 303488, 466538, 311948, 308050, 322739, 505826, 375548, 321358, 561809, 170841, 456721, 429798, 270198, 207473, 319014, 108685, 337675, 413586, 390615, 265222, 120940, 71612, 400904, 521907, 494246, 509868, 499668, 181953]
14856C04353J67880k07152K25054L2192B56599J60132k9402K01576A73744J92723
14846C66467J30399j5128L204j12486J27169j34929J59205B05679P1199j01241
14836A75637L55973R9783k47828J57220j63003K16764k31240J06190j59685J45634
14826D55445l575J87678H2496N76286k26397j05795j1947o8874J74553J38401
14816E58723J14604A63107J96932P4579J9494K80619C55791J34541A68881M22120
14806E91001J27476B14571K76549L39593j80187C24745J76596K3829J59723k00663
14796D84230J82804k25947p025K28j25617N2528J95333J46448K2853J63090l45085
14785E43840J18938k41842K03677L0197j09428K7722K4049Q3411C05383L13671
$$ y = [304353, 472233, 265081, 490135, 522327, 256599, 416731, 387329, 588905, 173744, 366467, 496866, 481738, 484942, 372456, 499625, 364696, 523901, 205679, 276878, 175637, 531610, 631393, 383565, 540785, 377782, 594546, 363306, 469496, 309811, 455445, 451870, 639548, 82496, 658782, 432385, 326590, 314643, 245769, 420322, 558723, 673327, 163107, 360039, 434618, 454112, 734731, 355791, 490332, 168881, 591001, 718477, 214571, 491120, 830713, 650526, 324745, 501341, 525170, 684893, 484230, 667034, 441087, 434062, 434290, 308673, 361201, 556534, 702982, 725835, 888925, 543840, 662778, 420936, 624613, 654810, 545382, 573104, 597153, 680564, 305383, 619054]
14775F19054j88268J36688q1831J69963J49654j06011K17188k23745l914j48884
14765E39894K72883j08262J89736j28719k283j0740P7568m9347l39525k8239K75017
14754F87983p1330J15798J14605k30832J81583j43760P9314l01909J28201r665
14744E49988K21487C31438K84836N99030o04230K40733R811l46004J99420r8954
14734F16080Q8900m376K25996m04131j50165K29109J53089k320M0671l6018J14279
14723H71114R1577D71521L02347k02402K97741k26516L84659l41292K94263m080
14713I76241n3986L4224J2529j77772J10831o7875j2839J68364L4463k09616P533
14702H22097L85483l30010J5316l3904K26838L652p5002k2455j67547K09310k13691
$$ y = [619054, 430786, 567474, 485643, 655606, 805260, 699249, 916437, 692692, 688778, 539894, 812777, 704515, 894251, 765532, 763249, 752509, 830077, 780730, 441205, 412966, 687983, 616653, 732451, 847056, 616224, 797807, 654047, 733361, 431452, 559653, 549988, 771475, 331438, 616274, 1215304, 611074, 851807, 861618, 515614, 715034, 616080, 704980, 700604, 926600, 522469, 372304, 601413, 754502, 752182, 792853, 756835, 871114, 962691, 471521, 773868, 571466, 869207, 642691, 1027350, 686058, 980321, 976241, 922255, 956479, 969008, 791236, 902067, 834192, 821353, 989717, 1024180, 814564, 822097, 1207580, 877570, 892886, 858982, 1085820, 1089472, 1014470, 992015, 824468, 1033778, 820087]
14691H20087m1348K11206j54186J35510L76796k97897k71612L17080N2489l7131
14681A110994l08902L18399l58224N61083j91714l78251P41059p42386N52979
14672A305037k00278j15607K21687k64616L15918l60349J25889k4438R6814j23081
14662I76976J4421j40819K49436L12262n83158N16566l30346L29736k73652K00404
14652A271826l7528K22202k01211k11361N9901k52075N01406P1233k82986M2309
14642A183716L31870k07692Q058j55013j52450M66818k93006N9102J46960k20926
14632A167437Q7056l218K06612l86347K78735K24423k15107j11339J35570j02115
14622A281707j62706M06147l07476J7779K52413k43167L84066j20203K6790K5153
$$ y = [820087, 778739, 989945, 835759, 971269, 1348065, 1050168, 778556, 1095636, 1148125, 1110994, 802092, 1120491, 762267, 1323350, 1131636, 753385, 1494444, 752058, 1305037, 1104759, 989152, 1210839, 946223, 1262141, 901792, 1027681, 1003243, 1100057, 976976, 991397, 850578, 1100014, 1412276, 829118, 1345684, 1015338, 1345074, 1071422, 1271826, 1234298, 1456500, 1255289, 1043928, 1103829, 851754, 1353160, 1424393, 1141407, 1183716, 1515586, 1307894, 1315952, 1160939, 1008489, 1475307, 1182301, 1241403, 1388363, 1167437, 1254493, 1251275, 1457887, 1071540, 1350275, 1574698, 1359591, 1248252, 1383822, 1281707, 1119001, 1525148, 1217672, 1235451, 1487864, 1244697, 1628763, 1508560, 1535350, 1560503]
14612A560503J74214k69170M2580k37396J43790P1725P2187J8784O2248r9402
14602A540063M10174j87940J55653l28553L09437p0611j06276K6931N6049J5748
14592A820675Q0354R9156k51146K5636K17051k36371M9175k993M0760K50154l21088
14581A771363n6450J97854K62277m0840R7721k03236K09388m2629k48694K32923
14571B179677o8907O0338l0531M01103N2386k31148K02752J90798m57879L39969
14561B638558J44057p7904J08317p6509J53003N8790K82577M66458K84781K17472
14551D199600K81019J246490J377258L069761P298642J9001930J1407039B1496972
14542A1985499E814904k216859r10666k72587r8411l47267j40099K31010K01120
$$ y = [1560503, 1734717, 1465547, 1508127, 1270731, 1414521, 1486246, 1558433, 1577217, 1639465, 1540063, 1950237, 1762297, 1917950, 1589397, 1898834, 1828223, 1721947, 1748878, 1804927, 1820675, 1901029, 2000185, 1749039, 1774675, 1991726, 1755355, 1804530, 1801537, 1842297, 2092451, 1771363, 1714913, 1912767, 2175044, 2134204, 2231925, 2028689, 2238077, 2195448, 1946754, 2179677, 2110770, 2171108, 2140577, 2541680, 2594066, 2362918, 2565670, 2756468, 2298589, 2638558, 2782615, 2704711, 2813028, 2736519, 2889522, 2948312, 3230889, 3697347, 3982128, 4199600, 4480619, 5727109, 7104367, 10174128, 17472770, 36474700, 47881739, 21496972, 11985499, 5814904, 3598045, 2687379, 2414792, 2316381, 1969114, 1829015, 2060025, 2261145]
14533B261145N762p1312P8388j46069P5469M25045m46710n8065K16253k43183
14523B096723K22225M07071j67341m7105L25738j24096k3569j39892J37547J53615
14513B840916O2118J51130k41813J05651L0419j18991k4685J77458j81074L52641
14503C153770k19224K28385q6072j09170K6623K31705r048J21404l9526J08023
14493C406870J68108j34600j48171M44986k42742M5032r2116L63286K07411k66915
14483C751149P2990j57238j93591M10157K13945k06801J89099k7478Q9143J8735
14473D160110n4536J63808K70717q8956k0769o047J03442J50233J59165j2287
14463D824880j74179N82685o19177O86879l56471K32136J39283k06904m3713K71403
$$ y = [2261145, 2266907, 2195595, 2273983, 2127914, 2203383, 2628428, 2181718, 2123653, 2339906, 2096723, 2318948, 2726019, 2558678, 2511573, 2837311, 2713215, 2689646, 2549754, 2687301, 2840916, 2903034, 3054164, 2812351, 2918002, 2948421, 2829430, 2804745, 2982203, 2801129, 3153770, 2934546, 3162931, 3076859, 2967689, 2994312, 3226017, 3216969, 3338373, 3298847, 3406870, 3574978, 3440378, 3292207, 3737193, 3494451, 3539483, 3447367, 3810653, 4018064, 3751149, 3824139, 3666901, 3473310, 3883467, 4097412, 3890611, 4079710, 4052232, 4141375, 4160110, 4105574, 4269382, 4540099, 4451143, 4430374, 4424327, 4527769, 4678002, 4837167, 4824880, 4650701, 5233386, 4614209, 5301088, 4944617, 5176753, 5316036, 5109132, 5065419, 5336822]
14453E336822j939K27968r119l12804K00093R317N29835l66329L34110r501p0694
14442E867759k18993N72812Q4586R056j60096J89610K66564K09509m20062K75460
14432F676205J06541L15867l10657O4979M68753L2778k98030O66916l14383J69131
14422G578100J4448k9540P37465j49674J97920P7960M5664J83440Q4277K34944
14412H975004L03439j3731j47529J43556K23845L80822J68422n5190J27320N9035
14402A0164993L9786N42331o0070p4812O78756j91191N19614L89206J72474k35134
14392A1945953L20680m3776M01928q1132N73637R2913M81368j41063K66825L99441
14382A4216774M02144n5256N20893J82373L00667R2175Q02827R734K45377N44850
$$ y = [5336822, 5334883, 5562851, 5553732, 5240928, 5441021, 5450338, 5980173, 5613844, 5947954, 5938453, 5867759, 5648766, 6221578, 6306164, 6315220, 6155124, 6344734, 6611298, 6820807, 6400745, 6676205, 6782746, 7098613, 6787956, 6852935, 7321688, 7354466, 7056436, 7723352, 7408969, 7578100, 7592548, 7563008, 8300473, 8150799, 8348719, 8426679, 8472343, 8655783, 8740060, 8975004, 9278443, 9264712, 9117183, 9260739, 9484584, 9865406, 10033828, 9978638, 10105958, 10164993, 10204779, 10747110, 10687040, 10612228, 11290984, 11099793, 11619407, 12008613, 12181087, 11945953, 12266633, 12222857, 12624785, 12543653, 13117290, 13210203, 13691571, 13550508, 13817333, 14216774, 14618918, 14563662, 15084555, 15266928, 15567595, 15659770, 16462597, 16472331, 16717708, 17262558]
14372A7262558o5376K78602L43847K3962R20251O06609J11740N36361K69401L81092
14362B0669047O70913L57167N96822O65816J79596K63559Q84571N48480P28673
14353B5564644k2919J240122N76689N52147O99030P14965M13006Q36888Q52288
14344C1426860R03796O60098J153951R71091P48282J377788P92217J121084R53003
14335D0108170Q40148J073049J808599Q74882J565032J332247J397156J430614
14327E0429897J997496J252313K496986J119128K358491J982787J858195K087379
14319F5582672K242005K888486J942411L102832K551066L051999K678777L956841
14311H7997089L242572L988236L491454M506535M136457M627517M642961N076722
$$ y = [17262558, 17197182, 17475784, 17819631, 17843593, 18763844, 19370453, 19482193, 20018554, 20287955, 20669047, 21339960, 21697127, 22293949, 22959765, 23139361, 23402920, 24287491, 24835971, 25564644, 25541725, 26781847, 27358536, 27910683, 28609713, 29324678, 29737684, 30574572, 31426860, 32330656, 32990754, 34144705, 35115796, 35864078, 37241866, 38034083, 39155167, 40108170, 40948318, 42021367, 43829966, 44704848, 46269880, 47602127, 48999283, 50429897, 52427393, 53679706, 56176692, 57295820, 59654311, 61637098, 63495293, 65582672, 67824677, 70713163, 72655574, 75758406, 78309472, 81361471, 84040248, 87997089, 91239661, 95227897, 98719351, 103225886, 107362343, 111989860, 116632821, 121709543]
14303A21709543N538822N801423O154327O210062O749260P060478P331982P955471
14295A74511368Q365211Q665616R869776R621785J0564070J1044389J1092571
14288B43734786J2183766J2364527J3403845J3278564J3832742J4032732J4446649
14281C37277611J4257278J4480119J3856537J3920226J3154520J2314025J1340623
14274D30600939R857772P555914N267432K090922L48949k65285l604028l339832
14266D48512783n610012q378287j0489289j1904287j3073428j3840657j4481381
14259C70735442j5263153j5226658j5163231j4819195j4717026j4129706j2745540
14252B68670933j3160706j2321441j2326715j1080142j1103649j0171687r505233
$$ y = [121709543, 127248365, 133049788, 139204115, 145414177, 152163437, 159223915, 166555897, 174511368, 182876579, 191542195, 201411971, 211033756, 221597826, 232642215, 243734786, 255918552, 268283079, 281686924, 294965488, 308798230, 322830962, 337277611, 351534889, 366015008, 379871545, 393791771, 406946291, 419260316, 430600939, 440458711, 448014625, 453282057, 455372979, 455721928, 455456643, 451852615, 448512783, 442902771, 434524484, 424035195, 412130908, 399057480, 385216823, 370735442, 355472289, 340245631, 325082400, 310263205, 295546179, 281416473, 268670933, 255510227, 243188786, 230862071, 219781929, 208678280, 198506593, 189001360]
14245A89001360r298147q101522q153155p691337o958838p282492o277941n550071
14237A29687857n477582n746245m703258m996325m629731l988697l839376l678872
14229I2627771l678270l717510l177160l049984l203016k869725k523882k375833
14221F8032391k474426j788756k189393k428222j926595j992033j715338j505875
14213E2011753j102613j851387j288286j838260j445086j127239l52753r49867
14205D2056262j715459j170187j452086r94214o41613p24410j022662j111623
14197C3224008j098382o03093q42869n90820p59774n18918r54408p42565p48109
14188B6365070n95214m01401r92624P575n34264r95292m49752j92190m43562p15020
$$ y = [189001360, 179703213, 171601691, 163448536, 155757199, 148798361, 141515869, 135237928, 129687857, 124210275, 118464030, 113760772, 108764447, 104134716, 100146019, 96306643, 92627771, 88949501, 85231991, 82054831, 79004847, 75801831, 72932106, 70408224, 68032391, 65557965, 63769209, 61579816, 59151594, 57224999, 55232966, 53517628, 52011753, 50909140, 49057753, 47769467, 45931207, 44486121, 43358882, 43006129, 42056262, 40340803, 39170616, 37718530, 36724316, 36082703, 35358293, 34335631, 33224008, 32125626, 31522533, 30679664, 30088844, 29329070, 28810152, 27855744, 27113179, 26365070, 25769856, 25368455, 24375831, 24383406, 23849142, 22853850, 22404098, 22211908, 21768346, 21053326]
14178B1053326n78442l2688m70156p02055n2177k54473l84600n13802m12170m62764
14168A7189999j16672m62427k26596m18024j52370l01556L9618m28703l88838
14159A4734431m21970j97852k92445O9912k73495n15117l36389K42627p71917
14150A2237785L72903o79759j02566l02491J57306k79651j95287n39936K30158
14141A0898462j66997q6909j51945k89559l9206k12955n0973k20969l54673J07963
14131I432239k79258k34731K01146k74211m819k13222j51341k20288J47317j77147
14121H225685k8207o92474J94271m8035Q2190k26238j61678O505L0074L5818j32775
14110G285136j92694k40470J02927J4457j0063k80522j06421k06168n481n1307
$$ y = [21053326, 20474884, 20442196, 19972040, 19269985, 19217808, 18963335, 18578735, 18064933, 17652763, 17189999, 17073327, 16610900, 16384304, 15966280, 15813910, 15512354, 15551972, 15123269, 14734431, 14312461, 14114609, 13822164, 13892076, 13618581, 13103464, 12767075, 13009702, 12237785, 12610688, 11930929, 11828363, 11525872, 11683178, 11403527, 11208240, 10668304, 10898462, 10731465, 10644556, 10492611, 10203052, 10163846, 9950891, 9899918, 9678949, 9324276, 9432239, 9152981, 8918250, 9119396, 8845185, 8840366, 8627144, 8475803, 8255515, 8402832, 8225685, 8197478, 7505004, 7699275, 7651240, 7733430, 7507192, 7345514, 7352019, 7382093, 7417911, 7285136, 7092442, 6851972, 6954899, 6969356, 6959293, 6678771, 6572350, 6366182, 6360701, 6309394]
14100F309394j42964j67087J74401l0634n4003k79496j44350K85635m58191L34530
14090E827235j36229k81957K79617m75765J81614k38323J17678o8319K01478l71026
14080E036003J76615j95354k19493N8217K19608n43307J80404k12300R2266q5745
14070D506914K95224j01748k55757M0836M15p7318m52041L65533j98137K10802
14060D334723m784l8771o3767R3395j87580Q5574k21916N6784k75318K0746k85941
14049C513145N6810n971J19804j56706k31893J30435m0574J01177k74243K28461
14039C440445m14478L1478J14390Q2904j24852j45502K32982J52442j77124l03638
14029B889047R4721N24044m48585r9568J18535m74156M79884l47240j13618J84466
$$ y = [6309394, 6166430, 5999343, 6173744, 6143110, 6089107, 5809611, 5665261, 5950896, 5492705, 5827235, 5691006, 5409049, 5688666, 5212901, 5394515, 5156192, 5273870, 5205551, 5407029, 5036003, 5212618, 5017264, 4797771, 4855988, 5075596, 4532289, 4712693, 4500393, 4592659, 4506914, 4802138, 4700390, 4444633, 4485469, 4485884, 4408566, 3956525, 4322058, 4123921, 4334723, 4329939, 4291168, 4227401, 4320796, 4133216, 4218790, 3996874, 4053658, 3778340, 3799086, 3513145, 3569955, 3563984, 3683788, 3527082, 3295189, 3425624, 3385050, 3486227, 3211984, 3440445, 3025967, 3057445, 3171835, 3254739, 3129887, 2984385, 3217367, 3369809, 3192685, 2889047, 2983768, 3507812, 3059227, 2959659, 3078194, 2604038, 3083922, 2736682, 2623064, 2807530]
14019B807530J59763n49042M04176l49215K77372k95356J30903R4065j84176J66992
14009B663012k54680J30157l47031j44606L35978j04838j79068j1256L93072k20218
13999B260522L0076R7407m81315K36968R643j52282J29731K66806N5023N43412
13989B995991K41609K145635N355020J7924012K0689355k2021491j3393584n625472
13981H311075k227159j041782q33053o83869J7424j39985m73456k63967K25086
13972B890314k51382J04826j02081k25039L66855k27020k45408j8802m026j7728
13962B270509j99037L24593j92422j55456P7349k52504J54352M5871J01027J394
13952B175676k76364j0460L96618q8002n76885L40296k87288K33134O3140l56660
$$ y = [2807530, 2967293, 2418251, 2822427, 2473212, 2750584, 2455228, 2586131, 2680196, 2496020, 2663012, 2408332, 2538489, 2191458, 2046852, 2382830, 2277992, 2098924, 2087668, 2480740, 2260522, 2290598, 2388005, 1906690, 2143658, 2153301, 2001019, 2130750, 2397556, 2452579, 2995991, 3237600, 5383235, 10738255, 28662267, 49351622, 27330131, 13936547, 8311075, 6083916, 5042134, 4209081, 3525212, 3542636, 3402651, 2929195, 2665228, 2890314, 2638932, 2743758, 2641677, 2416638, 2783493, 2556473, 2311065, 2292263, 2288237, 2270509, 2071472, 2396065, 2203643, 2048187, 2125536, 1873032, 2027384, 2073255, 2174282, 2175676, 1899312, 1888852, 2285470, 2197468, 1620583, 1960879, 1673591, 1906725, 1969865, 1613205]
13942A613205J08496R8770M9151m6937p1077j25333K28092m81557N11553J0022
13932A894385p7412R6046p2165m09991M77478j2611j67148k90684L6867m3053
13922A431712J88181k27520J89933j55003K86690l36903J89720L4236P5105l09672
13912A366479R8046j31472L38730p9888r4080j96995L21248j61812j79732O4145
13902A344669j9709j21624K18607J06380l09005J62703O3210J4645p4432L6100
13892A421544k49591N2826M58215k93382k54462J98819j01474r3449K5449J08697
13882A273192j02969q8689K75100l54607L54350j51893n0060J49854l93718K07611
13872A118171J84836m45643K59451O1226K32518k36441l2184j45447L22859j04786
$$ y = [1613205, 1721701, 1820471, 1869622, 1822685, 1751608, 1626275, 1854367, 1372810, 1884363, 1894385, 1816973, 1913019, 1840854, 1430863, 1908341, 1895730, 1728582, 1437898, 1474765, 1431712, 1619893, 1392373, 1582306, 1427303, 1713993, 1377090, 1566810, 1601046, 1676151, 1366479, 1464525, 1333053, 1671783, 1591895, 1497815, 1300820, 1622068, 1460256, 1280524, 1344669, 1324960, 1203336, 1421943, 1528323, 1219318, 1382021, 1445231, 1459876, 1385444, 1421544, 1171953, 1224779, 1682994, 1389612, 1135150, 1333969, 1232495, 1139046, 1164495, 1273192, 1170223, 1081534, 1356634, 1002027, 1356377, 1204484, 1154424, 1304278, 910560, 1118171, 1303007, 857364, 1116815, 1178041, 1410559, 1174118, 1141934, 996487, 1319346, 1214560]
13862A214560n0067k3311M6658L3371N342m8446q2066L3335j91426j08852J76082
13851A005180N2979j40239J58507j90091k76548L81246O3696m8020m5926j91446
13841G69338J84608P9000J78622E94539K00052P6003J75767k75206N42452j74044
13831A139563k44827K8812L04098k48500L5508J36664k7325m31070J19735L00142
13821A112800l81577L9783K12696l16981L16221k06776j39627M72576l13533K20613
13811A016195k28092L58849N3285k99927j63070J1238K732N6818P6354J12333
13801I96715j75589K13017l51116j60985M42168o6342P3239n4966k41323M09463
13791A084281k63004o1335M7272M3688l42696L32545p4932K17l34729K45470P199
$$ y = [1214560, 1164493, 1141182, 1187840, 1221211, 1226553, 1178107, 1096041, 1129376, 937950, 829098, 1005180, 1058159, 917920, 1076427, 886336, 609788, 991034, 1054730, 1006710, 960784, 769338, 953946, 1032946, 1211568, 594539, 794591, 870594, 1046361, 771155, 1313607, 1139563, 894736, 923548, 1227646, 979146, 1014654, 1151318, 1123993, 692923, 812658, 1112800, 731223, 771006, 983702, 666721, 982942, 776166, 636539, 1109115, 795582, 1016195, 788103, 1146952, 1200237, 900310, 737240, 748478, 751210, 808028, 884382, 996715, 821126, 1034143, 683027, 522042, 964210, 897868, 971107, 916141, 674818, 1084281, 821277, 759942, 807214, 850902, 508206, 840751, 765819, 766036, 431307, 676777, 683976]
13780F83976M5668N7557J3770l03405M5441K04578k00575P178K30611J88165j62604
13769H10360p4960J74390m48910K51166j01999K64912j25415k85564L07497k34478
13759E36999J36271J12778O1615k10055J56255n5743k79885j41680M21607O497
13749G44659j19923J27256j60702L53896k99871k02015K24540q3289K06400B50366
13738E03394M7999J39114j24628K342J56283L8473r2731o3138J29765k68853K13633
13727F81653J14043k21841p7464k42467L28012O8515J60790A46213J20619L17366
13717E84198j04671K17373q6559J5947j76506q9025K83943j46077L6403L6959
13707E71985P3170j35141L24930k85344k12229J43474m633K71862r6054j21027
$$ y = [683976, 729644, 787201, 800971, 497566, 543007, 747585, 547010, 554188, 784799, 972964, 810360, 735400, 909790, 460880, 712046, 610047, 874959, 749544, 463980, 771477, 536999, 673270, 786048, 847663, 637608, 793863, 738120, 458235, 316555, 738162, 744659, 624736, 751992, 591290, 945186, 645315, 443300, 667840, 584551, 790951, 250366, 503394, 551393, 690507, 565879, 568221, 724504, 762977, 670246, 607108, 736873, 468020, 681653, 795696, 573855, 496391, 253924, 581936, 650451, 811241, 146213, 266832, 584198, 479527, 696900, 610341, 626288, 449782, 360757, 644700, 498623, 535026, 571985, 645155, 510014, 834944, 549600, 337371, 480845, 476212, 748074, 652020, 530993]
13697E30993O1715j05036j98081K38320j13021K68422l1775p4370J0518j25633
13687D62052K28942A82453M12174L59264C03016N2336j32674N06665l37208L17370
13677G09505l52685M72632j10557j83839n3630B36614K85922j46078J44836j13688
13667D07606o0979j18286L92080O301j56338J03153B50561J79738J26538j92485
13657C64352P0686k10742J99667j10175J70877r2813o4114A17354J78058k5171
13647B70241K2168L5218J37189O5973j71817M1977M08509C81588j06414g4207
13636D44839k05240L56757j16562j65560n6061O1026P2757J8243j67341P7743
13626C20601A12536M33825m7931R952o8856p8456L63111B65699K39600D5339L96494
$$ y = [530993, 592708, 487672, 289591, 527911, 414890, 683312, 651537, 577167, 587685, 462052, 690994, 182453, 594627, 953891, 303016, 355352, 222678, 729343, 392135, 709505, 356820, 829452, 718895, 535056, 481426, 236614, 522536, 376458, 521294, 407606, 346627, 228341, 620421, 626722, 470384, 573537, 250561, 430299, 556837, 364352, 435038, 224296, 423963, 313788, 484665, 391852, 327738, 117354, 295412, 270241, 292409, 327627, 464816, 530789, 358972, 400949, 809458, 381588, 275174, -74207, 444839, 239599, 596356, 479794, 314234, 258173, 319199, 391956, 410199, 242858, 320601, 112536, 546361, 498430, 508382, 439526, 361070, 724181, 265699, 505299, 45339, 441833]
13615D41833n9882O6705j26051G2689K88088k5713Q2131f5679E22616l8223B8217
13603C37531m3910K74494Q174k55881K77293j48763J56560k44410K75482k06506
13593D30064J9279M03081m15171j71378Q7166M817r3458Q8150J95111k39050q036
13582C00575K31560B48838K86391O4073p4492k14991P9919L7105J59055k85080
13572C00818J57733k0489j41875N2093K8660J46816B55466J7053J32951o6344
13562C39126n0430I4844K57187j6240j11294N9787J61656J37116j89433J12170
13552E05793A38599R3638N54944A29484E1672L67038L8405q4768M0394Q9209q0895
13541D21055p3143K31015E0706L66004n7889A38272R4565j04979O7010q935M1670
$$ y = [441833, 381951, 448656, 322605, 72689, 360777, 335064, 417195, -65679, 522616, 484393, 28217, 337531, 293621, 568115, 576289, 320408, 597701, 448938, 605498, 361088, 636570, 430064, 449343, 852424, 437253, 265875, 353041, 357858, 264400, 352550, 547661, 308611, 300575, 532135, 248838, 535229, 599302, 524810, 309819, 389738, 426843, 585898, 300818, 458551, 438062, 296187, 348280, 376940, 523756, 255466, 272519, 405470, 339126, 288696, 94844, 352031, 335791, 224497, 284284, 445940, 583056, 393623, 505793, 138599, 232237, 787181, 129484, 51672, 418710, 457115, 372347, 412741, 501950, 421055, 347912, 578927, 50706, 416710, 358821, 138272, 232837, 127858, 194868, 185933, 227603]
13530B27603O0696r0989C5598L16135H2751L64874j2736j74745L1297B9359K64423
13519B93782o4973J19298o6641j3026k7597A16403J23367J38520e4609B18542
13508F6967M23700B40080L7239K03194A68604J6383L49694k32665J63464I3442
13497G2266J87007P7221j33501K03978j76994C2911f9319A43720K68956j69396
13487B43280O6743j40232J92048a17006A37043J59114p3986a30845B94011a3462
13476d810B71601f6154B03378J03147A04167M7172M97511B61305E5209K20417
13466B75626j24724J45612m1888N7896L8937A25540J22519J8573p9768m7892J09168
13455B48140L21387A21815m9585N40327B00293P1946m5950N577A2264L73485j56282
$$ y = [227603, 288299, 197310, 35598, 351733, 82751, 447625, 434889, 260144, 291441, 29359, 293782, 228809, 348107, 281466, 268440, 240843, 116403, 239770, 378290, -54609, 218542, 66967, 490667, 240080, 277319, 480513, 168604, 184987, 534681, 302016, 465480, 93442, 72266, 259273, 336494, 202993, 406971, 229977, 32911, -69319, 143720, 412676, 243280, 310023, 169791, 361839, -117006, 137043, 296157, 222171, -130845, 294011, -13462, -4810, 271601, -66154, 203378, 306525, 104167, 151339, 648850, 261305, 55209, 275626, 150902, 296514, 254626, 312522, 351459, 125540, 248059, 266632, 186864, 138972, 248140, 569527, 121815, 72230, 612557, 200293, 272239, 226289, 231866, 12264, 385749, 229467]
13444B29467L50108k35863D4168J70945a1622A81886Q1065L46056A83789b5751
13433D01088e1774C94078j50898K65486B24332Q9803j22305P8840a87624C72180
13422c671I0761O3827L4149q9688K30366b5414A60365m9508L39756j67129K8514
13411C11998O5044H7733J84654q8468K85542m3346b6946A03420c9058C61285H0835
13399B44080b17984F30609l00425j3422K445j22827D961J53934J75136j55839
13389A78192j3724R6600H1412K46871K26561B21339M7531E7225J07907J08527
13379B73659I4396K27631d1116A80484E2771J6880K35130J23314G4129P2010R9566
13368B45705K9449n2722k4335K73557K20914A47147J76616A34442L39040A90946
$$ y = [229467, 579575, 343712, 44168, 215113, -11622, 181886, 262951, 609007, 183789, -25751, 401088, -51774, 394078, 243180, 508666, 224332, 314135, 191830, 270670, -187624, 372180, -3671, 90761, 154588, 188737, 99049, 329415, -25414, 160365, 110857, 450613, 283484, 311998, 377042, 87733, 272387, 183919, 469461, 426115, -26946, 103420, -39058, 361285, 80835, 244080, -217984, 630609, 330184, 316762, 319207, 196380, 4961, 158895, 334031, 178192, 164468, 261068, 81412, 328283, 554844, 221339, 268870, 57225, 165132, 273659, 94396, 322027, -41116, 180484, 52771, 69651, 304781, 428095, 74129, 146139, 245705, 275154, 222432, 198097, 471654, 692568, 147147, 323763, 134442, 473482, 190946]
13357B29787J95702k03337l2366E5937J69766O81K925K6069K88315A65215m9730
13346A15485Q471K74237j37620J20766J32818B03476J35793J79735a15163C24281
13335C68663J5908q6891I5070J20852n3583F5421L03369m6421M0970r6082Q6527
13324C53784A12554m7527B195J9294L25137r8618J3763a4931C23785a43085K2240
13313a20845C42941J18281A94656C0626M27522q9251j64976J01194K66308B07111
13302C6339J27606p4205A9822a18933A77183Q292e8380A45029o668D7218J48626
13291A95844Q7621p5482O5071b77622A50889N1080A4524K26083H3840J5654K83390
13280C82884l3907j11244f6923B344b1683B19747j273H8207L05293b5546m32174
$$ y = [229787, 425489, 222152, 189786, 55937, 225703, 226384, 229309, 255378, 543693, 165215, 115485, 123956, 398193, 260573, 381339, 514157, 203476, 339269, 519004, -115163, 324281, 368663, 384571, 297680, 95070, 215922, 162339, 65421, 368790, 322369, 363339, 267257, 353784, 112554, 65027, 2195, 21489, 346626, 248008, 261771, -14931, 323785, -143085, -120845, 342941, 461222, 194656, 30626, 458148, 368897, 203921, 305115, 571423, 207111, 36339, 163945, 89740, 19822, -118933, 177183, 185475, -58380, 145029, 138361, 47218, 195844, 283465, 207983, 273054, -277622, 150889, 201969, 14524, 240607, 83840, 99494, 382884, 348977, 237733, -66923, 2344, -21683, 219747, 218474, 88207, 393500, -25546, -457720]
13269d57720G3243f6509B14083r4197P6811P8989J44138A44710J1332e88263A27514
13257B38900a25686r1942R3997A6567O9177b2441I6542B290J25993J09139E0644
13245C27617a07189D9322f440B44205d9916A53245a62690c0956B52997J46367
13235C99364A88487a28743d5983B52584l8353J56699C5603c036A22541J95383
13225C17924j14100H6402l4211a20204B24334J73603A46610l5842J25229g62A97965
13213a42308B0259b93694F2712f4149C09939j03033K65321E282J70862a26803
13202B34996h5924A52079B0191K97451G9631N7638m5361K348R1919E5519B4889
13190e9253j54504I7394L2509E2916J17455r030n2792c31850A53025J01473H3338
$$ y = [-457720, 73243, -66509, 214083, 119886, 196697, 275686, 419824, 144710, 156042, -588263, 127514, 238900, -125686, -217628, -123631, 16567, 85744, -22441, 96542, 2290, 128283, 237422, 50644, 327617, -107189, 49322, -6440, 244205, -49916, 153245, -162690, -30956, 252997, 399364, 188487, -128743, -45983, 252584, 214231, 370930, 35603, -3036, 122541, 317924, 203824, 86402, 52191, -120204, 224334, 397937, 146610, 110768, 235997, -762, 197965, -142308, 20259, -293694, 62712, -64149, 309939, 206906, 472227, 5282, 176144, -126803, 234996, -85924, 152079, 20191, 317642, 79631, 137269, 91908, 94256, 186175, 55519, 24889, -59253, -213757, 97394, 129903, 52916, 170371, 161341, 108549, -331850, 153025, 254498, 83338]
13178a45914G2832C5953h2277q4256F1975C0703J22613h1890A31918D1526b23000
13166a5822B20618q5476f2552H9667k1003J7691l0736J09274K76324A38735r805
13155A28930J16099E1565G291i8275A88022C2059a31426A68290f4085l7889C55623
13143D70541G5607k2715d6255B11939M9697H4861M780b15464b1546A28256L662
13132A31918A4626K12628d7853j60551A05032K39479a0396C87243b9807A27635
13121B85968B0139K8652i0531E1445L02637a3804D1311J19245D6843J29625D8012
13109a35806F536N34897e394D8309j0584d6195H242L21099A33085l461B9247c21854
13096a41017c0848j9687p2049C17779j41495i915D3297J47174b20176A19989A5070
$$ y = [-145914, 72832, 35953, -82277, -166533, 61975, 30703, 153316, -81890, 131918, 41526, -223000, -15822, 220618, 135142, -62552, 89667, 68664, 86355, 55619, 164893, 441217, 138735, 128930, 245029, 51565, 7291, -98275, 188022, 32059, -131426, 168290, -64085, -101974, 355623, 470541, 75607, 52892, -46255, 211939, 261636, 84861, 89641, -215464, -21546, 128256, 131918, 14626, 227254, -47853, -208404, 105032, 344511, -10396, 387243, -29807, 127635, 285968, 20139, 48791, -90531, 51445, 354082, -13804, 41311, 160556, 46843, 176468, 48012, -135806, 6536, 541433, -5394, 48309, 37725, -46195, 8242, 329341, 133085, 129624, 29247, -321854, -141017, -30848, -50535, -122584, 317779, 176284, -9915, 43297, 190471, -220176, 119989, 15070]
13084e9051A26269n5177d4366p0941n4363I6973J13345d6440o0741H3243J72600
13073B55843L02191A50650D0609K334o048K58928j14807L1335a55080D10575i3207
13061C45138j03337A03934J25248H908a15372B58133b4929B51206a11119I8621
13050C00960r9313i9415j72708A58732e5369I8396J83897a54730B16007K9494
13040B45501j15804k4598R8045P3465A2333K13914K04646a4227D4584c7051k05586
13029b42637d0676B30880K1180A06041Q4252H5236L78645o6829f9496F2463c3672
13017h0191B66530H1100K76256j38388a23097h778A8917M55449a10308A97117
13006a02278A00436J4466d8140A48456m5956N2916p268a12858C02205c2449A9798
$$ y = [-59051, 126269, 71092, -44366, -115307, -169670, 96973, 210318, -46440, -107181, 83243, 255843, 558034, 150650, 40609, 42943, 36895, 295823, 181016, 212351, -155080, 410575, -93207, 345138, 241801, 103934, 229182, 8908, -115372, 258133, -24929, 251206, -111119, 98621, 300960, 201647, -99415, -272123, 158732, -55369, 98396, 282293, -154730, 216007, 245501, 129697, 105099, 203144, 276609, 12333, 226247, 430893, -14227, 44584, -37051, -242637, -40676, 230880, 252060, 106041, 190293, 85236, 463881, 397052, -69496, 62463, -33672, -80191, 266530, 81100, 357356, 218968, -123097, -8778, 18917, 474366, -110308, 197117, -102278, 100436, 114902, -48140, 148456, 102500, 155416, 148148, -112858, 302205, -32449, 19798]
12994A24860a1417C3706c7242G9883L8714N4781a65056I8399R2240b77547A37415
12982c2053C8698c11074G853K5325b4214A77480c0357j83657a0803E1488K3698
12971G5186a22366j65249B7862o137O103M1303L60983B10477G2207O0978E401
12959i7075l2926e4684C9178d4857A65917J76467C168e0874j8767B81327a12784
12947h3442B0714J55585H3687J10925I4558J20354I0318f6232A13925l6888a0413
12935F9241F785K9653K22161r8717j0562Q8832A18452K2430a34675e4534j13732
12924a68266G5749b3677p3786H8522l8563d2833k29169A21648j8890A6598b97523
12912B90166b4470B98416j39726a76115I6691L5102c1356A39987O6779O1008F254
$$ y = [124860, -11417, 33706, -37242, 79883, 118597, 173378, -165056, 98399, 190639, -277547, 137415, -32053, 38698, -311074, 7853, 33178, -24214, 177480, -30357, -214014, -10803, 51488, 75186, -122366, -287615, 27862, 21725, 27828, 69131, 430114, 210477, 72207, 133185, 5401, -97075, -130001, -54684, 39178, -44857, 165917, 342384, 3168, -50874, -69641, 281327, -112784, -83442, 20714, 176299, 83687, 194612, 94558, 214912, 90318, -66232, 113925, 77037, -10413, 69241, 6785, 36438, 258599, 159882, 149320, 238152, 118452, 140882, -134675, -54534, -168266, 75749, -23677, -97463, 88522, 49959, -42833, -272002, 121648, 102758, 16598, -297523, 290166, -24470, 298416, 158690, -176115, 96691, 131793, -31356, 139987, 206766, 267774, 6254]
12900g924p8891A69425p8298D3311M22406k20552b6837j26813o937M6583B48298
12888f992B0547J78555Q7155a86873k78894e9181D8099J15003G4133Q4877d8891
12876a31186d9639l6638B07074a76074d5928A23837Q375B2805L0944b91074a9513
12864h4241j12600G9759C7872i0184A24280i0284b7145A16292O9172n6408K25565
12853C54621a92118c3365D69381G6346L38031A95090f4610B65962A26760J68521
12843B95281j25240D2710a51545B08977b00155b794A15412b48692A44971a96756
12832a5148A97523b03752R6611l26474J90064A99646O7801d4292j82384Q7125
12822a39551O079l4350F5926b06450H9276Q2854a24562B71270I9713d12866E8524
$$ y = [-7924, -86815, 169425, 91127, 43311, 465717, 245165, -26837, -153650, -160587, -114004, 248298, -6992, 20547, 199102, 286257, -186873, -465767, -59181, 48099, 163102, 74133, 159010, -48891, -131186, -49639, -86277, 207074, -176074, -45928, 123837, 132212, 22805, 53749, -291074, -19513, -84241, -196841, 79759, 37872, -90184, 124280, -90284, -27145, 116292, 185464, 129056, 354621, -192118, -33365, 469381, 76346, 414377, 195090, -64610, 265962, 126760, 295281, 170041, 42710, -151545, 208977, -200155, -2794, 115412, -248692, 144971, -196756, -15148, 197523, -203752, -107141, -433615, -243551, 199646, 267447, -44292, -226676, -139551, -133472, -167822, 65926, -206450, 89276, 172130, -124562, 271270, 99713, -412866, 58524]
12810B13538L7641e228G0691B6824Q14O909J26410e1682B56650q5484a50945B7508
12797c0198A06074K4933B5487g0892j25132A7420K4681R7930c81795A21742a31722
12785a23522A56246L81177A7169b98084C534a77966g0760D9346e1147n3059A40220
12773A98765b01586P4174C61533A33927m5162g8445J9298A33118k5185g7581I0811
12761e4747A79907e3965j05534G6613j8714a12836j63363A12706e5364A91094
12750E5701B7613Q3421j2276e0595I8145d1854k05644C6990a85177f5712j06662
12739a72374M2874B56783H6467A8799b9174E65R7337B861a04449A30311a8618
12727A02256Q3851d1028C58R2095l4774J2364c36846B0039J22173p891b70000
$$ y = [213538, 251179, -5228, 70691, 26824, 27638, 34547, 160957, -51682, 256650, 171166, -150945, 27508, -30198, 106074, 131007, 25487, -70892, -196024, 17420, 42101, 140031, -381795, 121742, -131722, -123522, 156246, 537423, 17169, -298084, 3534, -177966, -70760, 49346, -51147, -104206, 140220, 198765, -201586, -127412, 361533, 133927, 88765, -78445, -59147, 133118, 107933, -77581, 90811, -54747, 179907, -53965, -159499, 76613, 57899, -112836, -276199, 112706, -55364, 191094, 55701, 27613, 111034, 98758, -50595, 98145, -41854, -247498, 36990, -185177, -65712, -172374, -129500, 256783, 86467, 18799, -29174, 565, 97902, 2861, -104449, 130311, -18618, 102256, 186107, -41028, 358, 92453, 57679, 70043, -336846, 20039, 142212, 134321, -270000]
12715e56698f1886J1076g285B17647m2896C2757K46277j23027a25353D28308A69154
12703A40196g6847D77419L060A94797o4288A9593R2314a85350H8424J20584a83708
12691A43919m7247b69554F1718g2300o354p5504C9855e8520I451d7778A33552
12679a481D66507b00553p5327J28515g158C2723L7449e5786q5975F1534J54579
12668B16113B189a94816b8430A13502C9201K39380K364k9966J68259C5906L60255
12657C96161B2341E89K99012g0229J4704D8340J93258g0984B14738c51369A38835
12645a0386A9613L6711c06375B74544a25041G2649a44676n0645A06323c32997
12634b7318A02363L0668J82887G7544b0628H585R7932K13494j36569f5759A25390
$$ y = [-556698, -61886, -50810, -7285, 217647, 174751, 32757, 279034, 156007, -125353, 428308, 169154, 140196, -76847, 477419, 480479, 194797, 130509, 19593, 111907, -185350, 88424, 209008, -183708, 143919, 96672, -269554, 61718, -72300, -78654, -154158, 39855, -58520, 9451, -47778, 133552, -1481, 466507, -200553, -275880, -147365, -7158, 32723, 70172, -55786, -141761, 61534, 216113, 2189, -194816, -28430, 113502, 39201, 278581, 280945, 250979, 419238, 35906, 396161, 22341, 589, 299601, -70229, -55525, 48340, 241598, -70984, 214738, -351369, 138835, -10386, 19613, 56324, -306375, 274544, -125041, 72649, -144676, -195321, 106323, -332997, -27318, 102363, 133031, 315918, 77544, -20628, 8585, 106517, 320011, 183442, -65759, 125390]
12622D9527J40335O8235r0081M4762J19549k0088b6345n9033B25223n5342h01
12610e2860l98851A28742J2583k2515N4272n4457B52b10703n3686A54844J12766
12599B67610F4945K85206C1580A2057a11010A41972O6815r6645j0242C4012a1175
12587A08477d0060j51522I2923O3332a60613b3443p5897M4221a7589k2424I8507
12575b99406C8303Q8561f3686o0256a6269A17836A9565J77789e3743A26229j187
12564A25042n4687A7942b6678b438B11454O5975E588N47222e0598J6510D10067
12552A78936l4466b91831f7265m1594B17177i9759K3623j27083B33126G1509a44606
12540g7304B32235o0918a1179k38674e7308k09295O8494A92646a119j8249k9773
$$ y = [49527, 189862, 258097, 168016, 212778, 332327, 312239, -26345, -85378, 225223, 169881, -801, -52860, -451711, 128742, 141325, 118810, 173082, 118625, 252, -210703, -264389, 154844, 267610, 64945, 350151, 31580, 12057, -111010, 141972, 208787, 112142, 101900, 34012, -11175, 108477, -40060, -191582, 92923, 156255, -160613, -23443, -99340, -55119, -17589, -40013, 98507, -299406, 38303, 126864, -63686, -123942, -16269, 117836, 19565, 197354, -53743, 126229, 125042, 70355, 17942, -26678, -2438, 211454, 277429, 5588, 552810, -50598, -34088, 410067, 178936, 144470, -291831, -67265, -108859, 217177, -99759, -76136, -203219, 233126, 71509, -144606, -77304, 232235, 171317, -11179, -249853, -57308, -266603, -198109, 192646, -1119, -19368, -49141]
12529d9141B95683A33984a0604A67439m182p4115J99939m4643b8658k20410H4993
12517B69923n3718p2292d6558A35766f0299A67458l8092a61999A72958M410F4473
12505A70496d7765C60352i4569A70849B7648a75933G4643P5814G3164L37426c82978
12493A41240L7965K7054F0140c0477A60718P2361q0362b20526j2424a12988e1819
12481h1646b2930k4512o558K1562A5131b95355J37892O1924j21211A29815K3021
12470A52836D7996b0701j19884B63881a9499j62543A59686a55659B532e9520C8920
12458d538B65645F9037L43584b5894G5110J68007c97282i4404L4630D1990a77963
12446a07589D2289a50119k6475M2800E087L1785k762j351J28732a73317F0308
$$ y = [-49141, 295683, 133984, -10604, 167439, 163257, 89142, 289081, 244438, -28658, -249068, 84993, 269923, 216205, 143913, -46558, 135766, -60299, 167458, 129366, -161999, 172958, 177368, 64473, 170496, -47765, 360352, -94569, 170849, 27648, -175933, 74643, 150457, 73164, 410590, -382978, 141240, 179205, 206259, 60140, -30477, 160718, 233079, 152717, -220526, -232950, -112988, -51819, -81646, -22930, -47442, -54000, -32438, 15131, -295355, -157463, -95539, -216750, 129815, 152836, 47996, -20701, -140585, 263881, -19499, -182042, 159686, -155659, 2532, -59520, 38920, -4538, 265645, 69037, 412621, -25894, 75110, 243117, -397282, -94404, -59774, 41990, -177963, -107589, 42289, -150119, -176594, -133794, 5087, 36872, 34110, 32759, 161491, -173317, 60308]
12434F7324c6769j03o2846d7355A6196K9468c27656B23938a78848a2365l04276
12423c16641e0665A13507J32394j9532H8718K7682J35466b35427a01453j14828
12413b16281G6044K39167A09318d3661a076k2308A24117a98151G1919Q3064a17800
12401a302B7512a13308c2882B2701a2359j72147B6481K60360b92358I6972N0467
12390A47439g1294I7462i6354I5356C0003a44341N0567b765k42327l6971I0363
12378a02819r3340B87694a97770C2324a4532A38912c2725B23293i8745F9841Q4305
12367A54146K2883b18527K2711l651A7673J25030B3540M8995d2023r1767F6967
12355B8517b12002h4468B29141D2577b72525a33781G7194M6037B0636a03932A80717
$$ y = [67324, -36769, -36872, -99718, -47355, 16196, 45664, -327656, 223938, -178848, -12365, -316641, -50665, 113507, 245901, 226369, 88718, 116400, 251866, -235427, -101453, -216281, 76044, 315211, 109318, -43661, -1076, -23384, 124117, -198151, 71919, 154983, -117800, -1302, 27512, -113308, -32882, 22701, -12359, -184506, 26481, 286841, -292358, 96972, 147439, -71294, 97462, -96354, 95356, 30003, -144341, -93774, -2765, -245092, -282063, 90363, -102819, -196159, 287694, -197770, 32324, -14532, 138912, -32725, 223293, -98745, 69841, 154146, 177029, -218527, -195816, -199467, 17673, 142703, 23540, 72535, -42023, -133790, 66967, 28517, -212002, -84468, 229141, 42577, -272525, -133781, 77194, 123231, 20636, -103932, 180717]
12343E4292K79677c44193i8391n0827L6374B36334A08335N3763K37292c334p2288
12332g5622q4882g3589A64782e0713m8021c1441E7396L0219J2003a86528I5705
12320e4883j38904A16833c7953N953C56183a39233c7860B26920h1306A18694A873
12308A70925a76289i683C38847A09395D7254a36643l1768M415A3727b6540G4086
12296B6353N8908c786j26398j96880a23472A87884b22236c5858p3869L8914j59521
12285b30334F0747K00045e9299m1804c8562j06372C24568c62159B3985K18126
12275B42111p6408F8975G184K56822B9446J10418L57748A2453J77956L59625g1656
12263D9840J66352a87651c2259G8989N7375C4013K21285J29772q974A18372m0178
$$ y = [54292, 333969, -344193, -98391, -149218, -112844, 236334, 108335, 162098, 399390, -3334, -75622, -160504, -73589, 164782, -50713, -98734, -31441, 57396, 87615, 99618, -186528, 95705, -54883, -193787, 116833, -37953, -32000, 356183, -139233, -37860, 226920, -81306, 118694, 1873, 170925, -176289, -9683, 338847, 109395, 47254, -136643, -168411, -163996, 13727, -26540, 74086, 26353, 85261, -3786, -130184, -327064, -123472, 187884, -222236, -35858, -109727, -70813, -230334, 60747, 260792, -59299, -101103, -38562, -144934, 324568, -362159, 23985, 242111, 165703, 68975, 7184, 264006, 29446, 139864, 497612, 12453, 190409, 550034, -71656, 49840, 216192, -187651, -32259, 78989, 136364, 34013, 255298, 385070, 376096, 118372, 78194]
12252G8194Q5955l2850b32518G7904b4801B1360J1472P1308N7387e1519k4240
12241g5759C48942j44026F9938J4291h6779A42459a33482c566I0029J90284J0734
12230B91047L54292A80688J73002j26388J94505A63408c5976C62983b9015C21870
12219A03715K2219L21520A31006C8111K74398J13852D8964Q7348E4759q253K35264
12208B81770j14412a23996c026D29354a12270b2520D8452L36917A26012J54462
12198B80474J97484k16398B1316O5987M60683B53151D5146O8549R5451L3535b9787
12186C37128E474a12415b4909A46452J33220G8793J30263m1072b3755A10628b3652
12174A54032e8285A31652O4425k609h3721k8726B80623j9888p5361J63011C0115
$$ y = [78194, 164149, 131299, -232518, 77904, -24801, 21360, 32832, 104140, 161527, -51519, -75759, 348942, 204916, 69938, 84229, -86779, 142459, -133482, -3566, 90029, 280313, 291047, 645339, 180688, 353690, 227302, 421807, 163408, -35976, 362983, -29015, 321870, 103715, 125934, 447454, 131006, 38111, 312509, 426361, 48964, 136312, 54759, 46506, 281770, 167358, -123996, -3026, 429354, -112270, -22520, 48452, 385369, 126012, 280474, 477958, 261560, 21316, 87303, 547986, 253151, 45146, 113695, 209146, 242681, -29787, 337128, 5474, -112415, -24909, 146452, 279672, 78793, 209056, 167984, -23755, 110628, -23652, 154032, -58285, 131652, 196077, 193468, -83721, -112447, 280623, 260735, 185374, 348385, 30115]
12162c7425D5407L36291a2949q308l2210j07534k43623c0046A48504g2855j756
12151g4611p2110C44928j16545n1729a69429D4789a45398r2752A3167a9020j07921
12140a26941D5614h0806o5289A5240K57379j00012J451a54547j95411E2364L38116
12129C90480A69271K3598J41296H4966c2334D60354A4692f8135j5794C54076F9126
12117C44426g8710j61585i9720F369a93091l8726B4518b43147A3501b3476D2774
12105A46501m3227C4532Q0723a7834j63956k0554r4971D3994b65822F031b79352
12093a60465C72227b28458M6063e7093F9332P200a923D2414K07002m6946F2693
12081B53239A09209B9768K8648J32015b00820B78503b41475B93349p8799J310268
$$ y = [-37425, 45407, 381698, -12949, -21257, -53467, -161001, -404624, -30046, 148504, -72855, -74611, -146721, 344928, 228383, 176654, -169429, 44789, -145398, -238150, 13167, -19020, -126941, 45614, -80806, -146095, 15240, 272619, 172607, 174058, -154547, -349958, 52364, 390480, 169271, 192869, 334165, 84966, -32334, 460354, 14692, -68135, -83929, 354076, 69126, 344426, -78710, -240295, -99720, 6369, -193091, -231817, 24518, -243147, 13501, -23476, 42774, 146501, 103274, 34532, 115255, -17834, -181790, -202344, -297315, 43994, -265822, 6031, -279352, -160465, 372227, -228458, -182395, -57093, 69332, 76532, -1923, 42414, 249416, 202470, 62693, 253239, 109209, 29768, 58416, 190431, -200820, 278503, -241475, 293349, 214550, 1524818]
12071A524818J51299H18499m07954E5199J54239h197j02526d6155I5322i1263
12060F0387g7793A11793c1177A43395J09629c7005A62926l394e8716l9735A27754
12048B7566O7220O0369b91862E7864N1882i6882C47684b32450H1036a33163A1170
12036a98121h87C6852a62181C08835b26554A26557j9671a76818O3033A02034M297
12025A06331a09833A8377O4083b79829g6616A36248a0152A00319i0738A44047
12014b57629O1878B31814j04315O581c08022A5069J58544K2813c84260A6008i0128
12002A17279r283C4728a53367A30149J34357D6053a08296K4293B8389c18090C33614
11990A03998a51717B54745b06669C6837a70340n477H7058e0647D19703g6351k86086
$$ y = [1524818, 1676117, 818499, 410545, 55199, 209438, -8197, -110723, -46155, 95322, -91263, 60387, -77793, 111793, -31177, 143395, 253024, -37005, 162926, 159532, -58716, -98451, 127754, 27566, 94786, 155155, -291862, 57864, 109746, -96882, 347684, -232450, 81036, -133163, 11170, -198121, -887, 36852, -162181, 308835, -226554, 126557, 106886, -176818, -113785, 102034, 106331, -109833, 18377, 82460, -279829, -76616, 136248, -10152, 100319, -90738, 144047, -257629, -195751, 231814, 127499, 134080, -308022, 15069, 173613, 196426, -384260, 16008, -90128, 117279, 107996, 34728, -153367, 130149, 264506, 46053, -108296, -84003, 28389, -318090, 333614, 103998, -151717, 254745, -206669, 36837, -170340, -175817, 87058, -50647, 419703, -76351, -362437]
11979c62437c9070C63472A78004i5660A28877N6055a94076C5604K37282H3746
11968i6199C6708L9364d2031D3678H543c24935i0122d3368B41453D1228b08275
11956c5655j544m04799H526L1488d21806D2814d4127C88509b99408a34087c5572
11944a81609o7756A73808c45827a32941B47846b277k66188N4342Q1517A58802
11933A47146b5310j6599A83877J33412f0760C4561J11161F7415K462B0720c32259
11921A14679a30766c8866A40641a54642H1565d3817B12717d7582j78681h1624
11910g1573j36860A37520b88452E8764B3001J0141b12948C75731A9828b33187
11899d47594g1555C22961a40910j01594R6383B03991I1758K99093i8946A4030
$$ y = [-362437, -39070, 363472, 178004, -95660, 128877, 184932, -194076, 35604, 272886, 83746, -96199, 36708, 76072, -42031, 43678, 8543, -324935, -90122, -43368, 241453, 41228, -208275, -35655, -37199, -441998, 8526, 40014, -421806, 42814, -44127, 388509, -299408, -134087, -35572, -181609, -249365, 173808, -345827, -132941, 247846, -2277, -268465, -214123, -132606, 158802, 147146, -25310, -41909, 183877, 317289, -60760, 34561, 145722, 67415, 69877, 20720, -332259, 114679, -130766, -38866, 140641, -154642, 81565, -43817, 212717, -47582, -226263, -81624, -71573, -208433, 137520, -288452, 58764, 23001, 33142, -212948, 375731, 19828, -233187, -447594, -71555, 322961, -140910, -242504, -146121, 203991, 91758, 390851, -98946, 14030]
11888c30276r0250b0423G2212b06214E2189J36321B2111a16236L6128l01947J66758
11877b15297C7848a78844M6165e2311q5839B72382a57075M7243j77875I2989b23197
11865d7879E3331b02224R8345A96606O9041i4563j06099O0082c1684A18401J38528
11854B56929B5033b34008L4735B13238L6815E9719J02400J21464E6656L39495
11844C96151A24680a27606C17879b19279f4821b1799j08074B04722a01362A62147
11833f1676j19491d6559B3812K183a55188o604C0020d5226A07749L814b03076
11821d2689B75944a70448A71503b5014k79869g9262C992M0031c21092f6444A12959
11809a43763A69913a54443e8313j38945h0188C22758e0708m7707Q435A65204a8359
$$ y = [-330276, -420526, -20423, 72212, -206214, 52189, 188510, 22111, -116236, -80108, -382055, -215297, 37848, -178844, -132679, -52311, -138150, 272382, -157075, -109832, -287707, 92989, -223197, -47879, 53331, -202224, -103879, 196606, 265647, -94563, -200662, -140580, -31684, 118401, 256929, 25033, -234008, -199273, 213238, 250053, 59719, 162119, 283583, 56656, 396151, 124680, -127606, 317879, -219279, -64821, -21799, -129873, 204722, -101362, 162147, -61676, -181167, -46559, 23812, 25995, -155188, -161792, 30020, -45226, 107749, 111563, -203076, -42689, 275944, -170448, 171503, -25014, -304883, -79262, 3992, 44023, -321092, -66444, 112959, -143763, 169913, -154443, -58313, -197258, -80188, 322758, -50708, -98415, -89980, 165204, -18359]
11797F7077a13539A73915h5442A27186A3002O5848L75329A22024a87365A85377
11786B69250A5618K04273a13150J6316J2793c1049A57445I071a91189A75262q4957
11775I0305i4329K7866J053b6138j20495B47207g0648p1677C48931E5a03578m7401
11763a50979M7832D3838b91565D9548E106b24074K2416C06886a29612N7149k58261
11752c30724j69605B80980a95155B87459A33764i6331k36632i2042A34278E1268
11741b0919A96960P4327I3503K1596d313r5172g932r640C735a2121M893B23279
11728e3975J9903C38721A04955b53535i5466d7315j47687o2301E5700q728J47993
11717A94965b35245b073C57158b94843a47026A70311E9849e0613C7953c3851q7442
$$ y = [67077, -113539, 173915, -85442, 127186, 13002, 78850, 454179, 122024, -187365, 185377, 269250, 15618, 219891, -113150, -96834, -84041, -31049, 157445, 9071, -191189, 175262, 90305, -94329, -66463, -65410, -26138, -146633, 247207, -70648, -142325, 348931, 55, -103578, -150979, -103147, 43838, -291565, 49548, 5106, -224074, -201658, 306886, -129612, -72463, -330724, -500329, 280980, -195155, 287459, 133764, -96331, -332963, -92042, 134278, 51268, -20919, 196960, 271287, 93503, 115099, -4313, -99485, -7932, -17572, 3735, -12121, -7228, 223279, -53975, -34072, 338721, 104955, -253535, -95466, -47315, -195002, -257303, 55700, 46972, 194965, -235245, -2073, 357158, -294843, -147026, 170311, 59849, -50613, 37953, -33851, -121293]
11706a21293J9587N0458B40707j14436J89594G4849a66882B80505c33547P5145
11696b58402e9380d817A63252c81462f9658j9945C4850K54551f1027D0736d2618
11684a12514C2221R1224J94991C7464a07358H8934b18321G1432J0834b69622J27798
11673a41824k24045a55633j26722c6840j64684B8007c00254B0180O4058R107J72401
11662B65746a86131A99619c30163B24764c23881a10210j3016l6064C82222j10425
11652B71797a92152A97277b3579o4839l4367B6674a58781A03610N9078j4702J21055
11641B69041A5315c17095b8183m1919G484b69234A14730a36710c3554B9884N7033
11630H6917b64711D82943F4052b14477a05354j53320i8263C91083A00323a17435
$$ y = [-121293, -101706, -51248, 240707, 126271, 315865, 74849, -166882, 280505, -333547, -258402, -59380, -4817, 163252, -381462, -69658, -89603, 34850, 289401, -61027, 40736, -42618, -112514, 32221, 123445, 318436, 37464, -107358, 88934, -218321, 71432, 82266, -269622, -141824, -365869, -155633, -282355, -36840, -201524, 28007, -300254, 20180, 84238, 93345, 265746, -186131, 199619, -330163, 224764, -323881, -110210, -123226, -159290, 382222, 271797, -192152, 197277, -23579, -88418, -122785, 26674, -158781, 103610, 162688, 147986, 269041, 15315, -317095, -28183, -70102, 7484, -269234, 114730, -136710, -33554, 29884, 86917, -264711, 482943, 64052, -214477, -105354, -258674, -98263, 391083, 100323, -117435]
11619A04593a28299b7578A64401J09494F3713J84333o3583a09639D0331a3780
11608a22354c3910q079I579K94079c1368A5170b57479A05457a49762e6123j23923
11597a80046D085g324B23254k6933c4674B1675L8871g6226B13853r6493N917Q4986
11585B08263d827H0407k1585J25362K14380G6485e9394j1544I6105M0221g4480
11573A8041a73568A78227c7878j21956B1791f7750A79048f1963j6947A7173B413
11561f0573k15678A65210a0779j99360A14011c57990H0773J06915a8296B83675
11550a1303n625H9754Q0028i4335B94927C8872b78805a10851e3953l9553B73928
11538H4054K6835O4715a53280B5389K63921O0762A57677O2164j03423N5229C4672
$$ y = [104593, -128299, -27578, 164401, 273895, 63713, 248046, 184463, -109639, 40331, -13780, -122354, -33910, -41989, 9579, 303658, -31368, 15170, -257479, 105457, -149762, -56123, -180046, 4085, -7324, 223254, 196321, -34674, 21675, 60546, -76226, 213853, 117360, 123277, 208263, -4827, 80407, 58822, 184184, 398564, 76485, -59394, -70938, 96105, 136326, -74480, 18041, -173568, 178227, -37878, -159834, 21791, -67750, 179048, -61963, -78910, 17173, 2413, -60573, -276251, 165210, -10779, -210139, 114011, -357990, 80773, 187688, -18296, 283675, -11303, -16928, 89754, 169782, -94335, 294927, 38872, -278805, -110851, -53953, -93506, 273928, 84054, 110889, 175604, -153280, 25389, 289310, 350072, 157677, 219841, 116418, 171647, 34672]
11526b02993B84905H2569B5727J57044a43221L9412A63519L86261B19207i4544
11515b87448A75124a8522A61533h1932o3890A51300P4926G1211L990K28845E6536
11503g9875a1803A01425K15774J4822A6809K32427c3873J767C7179J71229a38729
11491A27566B2844f4722A01000i3520d4037B42100E4062J78572A6631J17322J27415
11480B61368A3770Q1797r102M36942H7312l8798J1039J44549K01992D6739Q2657
11469A29396k4316K05803Q4697M1799j35344N5814q2879K5006H1764g6801B33797
11457f275A58000n3167O7694i0274B70867H717Q4674a04918I9109a8416F2111
11445b84758Q9469I4100J22590m9642a55707B04797a36825K3640A45303o2880
$$ y = [-202993, 284905, 82569, 25727, 182771, -143221, -103809, 163519, 549780, 219207, -94544, -287448, 175124, -18522, 161533, -81932, -145822, 151300, 226226, 71211, 75201, 304046, 56536, -79875, -11803, 101425, 317199, 332021, 16809, 249236, -33873, -32106, 37179, 208408, -138729, 127566, 22844, -64722, 101000, -93520, -44037, 242100, 54062, 232634, 16631, 133953, 261368, 13770, 95567, 86465, 523407, 87312, 48514, 59553, 204102, 406094, 46739, 129396, 105080, 310883, 395580, 437379, 302035, 357849, 274970, 299976, 81764, -76801, 233797, -6275, 158000, 104833, 172527, -90274, 270867, 8717, 93391, -104918, 99109, -18416, 62111, -284758, -195289, 94100, 216690, 167048, -155707, 204797, -136825, -113185, 145303, 82423]
11435H2423K162h0537j2920p2136C34619a34048a5947A11462g362A50221A4401
11423A71827k0257a27327A31714a16195A35162o0735b02663H8474c06311E4544
11412h1587j26010g562j74448I4492J07897K1974a78630f2123K6547C66161f4915
11400b01217L3825A95229e2290H3452J11083b32107c6046l82076J46565B64808
11389a57827D8515J0314a4843H2270f8770k08876d7809B75343a53185A20953a73757
11377A11097a39564j62385B28012r0867C2152Q7622L8069K46986a43172j286D3724
11365I1024a81882g8395F3618b38950J07651A11935E1692a36A22928M1625g5867
11353e5187k09503F0186P1357O5285l4619A2955K78623e1732G4350c529m4684
$$ y = [82423, 84585, -80537, -93457, -165593, 334619, -134048, -15947, 111462, -7362, 150221, 14401, 171827, 151570, -127327, 131714, -116195, 135162, 74427, -202663, 88474, -306311, 54544, -81587, -207597, -7562, -182010, 94492, 202389, 224363, -178630, -62123, -35576, 366161, -64915, -201217, -167392, 195229, -52290, 83452, 194535, -232107, -36046, -418122, -271557, 264808, -157827, 48515, 58829, -14843, 82270, -68770, -277646, -47809, 275343, -153185, 120953, -173757, 111097, -139564, -301949, 228012, 137145, 32152, 119774, 157843, 404829, -143172, -144458, 43724, 91024, -181882, -78395, 63618, -238950, -131299, 111935, 51692, -136, 122928, 164553, -75867, -55187, -264690, 60186, 131543, 196828, 162209, 12955, 291578, -51732, 74350, -3529, -48213]
11342d8213j32785K9385A81888M0592A0555J23863g9874l79566A9237f7l05762
11331c05829C7947a8951k43924A99315n8055J01167k2818E7069J33028a45166
11320B25151B9056i5421j24702a08636N1495B3643J54745J37965A00102a26649
11309e8444I8664k8175M4334l8314c54722A73941f5725k11940O1261q8118d6143
11297B15529A07248B5210J03168l0998J4044f5000j30106l4271a3383n5690l36328
11286d05401i3561k16643G6499K27578f2719K4198A00559L28500i436l735D9850
11274a99183A29766c44868A648b07481e1248j78134P3531j96423c8345B47302
11263h1812G8669b28519b1805A82228a85262A98681l9092K6469k9712d6870J9259
$$ y = [-48213, -180998, -151613, 181888, 222480, 10555, 134418, -79874, -459440, 19237, -67, -305829, 37947, -18951, -262875, 199315, 141260, 242427, 219609, 57069, 190097, -145166, 225151, 29056, -95421, -220123, -108636, -57141, 23643, 178388, 316353, 100102, -126649, -58444, 98664, 70489, 114823, 76509, -354722, 173941, -65725, -277665, -216404, -304522, -46143, 215529, 107248, 25210, 128378, 97380, 111424, -65000, -195106, -229377, -13383, -69073, -405401, -93561, -310204, 76499, 304077, -62719, -38521, 100559, 429059, -9436, -13171, 49850, -199183, 129766, -344868, 1648, -207481, -51248, -229382, -155851, -352274, -38345, 247302, -81812, 78669, -228519, -21805, 182228, -185262, 198681, 159589, 186058, 156346, -46870, -27611]
11252b7611A08591a84061l3383N7705q1395A1310a65311B76572E0640L38097A43125
11240I2220a93736B081b43004H9917J91039d1262j37965N046j77443A17084b54027
11228a31639N8777c3587A02746B6042a16276o0652l4000k35606A5533a3954A74130
11216a83280G1156b08364c209B7707f0970n7391j4987j32231A37885J07078A00090
11204h9411k43158A54443Q1064r1561J41480A22620d7488H4502b18270a2379D5320
11192I4094n770C7490L4527a28388C8517a57780j17232B0749F638L48065A1166
11180b96782B31369G0924c5613j19784d6670A84974C0960f9607J5727j33156Q7064
11169i9972k19150e6293l5502a7524A12462E442a29074K7274n5580B2200J69210
$$ y = [-27611, 108591, -184061, -217444, -159739, -241134, 11310, -165311, 276572, 50640, 388737, 143125, 92220, -193736, 2081, -243004, 89917, 280956, -41262, -179227, -174181, -351624, 117084, -254027, -131639, -72862, -33587, 102746, 26042, -116276, -176928, -210928, -446534, 15533, -13954, 174130, -183280, 71156, -208364, -3209, 27707, -60970, -118361, -133348, -265579, 137885, 244963, 100090, -89411, -332569, 154443, 235507, 143946, 285426, 122620, -47488, 84502, -218270, -12379, 45320, 94094, 88324, 37490, 72017, -128388, 38517, -157780, -275012, 20749, 6638, 354703, 11166, -296782, 231369, 70924, -35613, -155397, -46670, 184974, 30960, -69607, -53880, -187036, -99972, -319122, -56293, -91795, -17524, 112462, 5442, -129074, -101800, -157380, 22200, 191410]
11158A91410a06388k26808f8071M967l03665E7645a26797J937m6829p3749F8603
11146A05504J93182A42591n9552k3833a28881A13212a53458A49616b75462C17340
11135A74640j5233J04333J3020C4353L0858c0982A70117K4148F5272O0404N4278
11124A79954b1247j6595k50062C2119R7236j2263a43066A27792b37604H3024J09536
11113A92560q6601L76735A85430J52174K8743h2173A02115a05466A21500k9232
11103I2268O9975a61248A67366j9604J14773A19990C1207K91782M7395A12921
11092C87764A32990A236J42857O6115O9166c7172A60996D1154c42862C04016g5190
11080C51806J87351A81576Q8134J79317A07512j504L90639J2967j2726A68866
$$ y = [191410, -106388, -333196, -68071, -63104, -366769, 57645, -126797, -124860, -171689, -245438, 68603, 105504, 298686, 142591, 83039, 59206, -128881, 113212, -153458, 149616, -275462, 317340, 174640, 159407, 263740, 276760, 34353, 65211, -30982, 170117, 194265, 65272, 125676, 179954, -21247, -37842, -287904, 32119, 129355, 117092, -143066, 127792, -237604, 83024, 192560, 105959, 482694, 185430, 337604, 366347, -82173, 102115, -105466, 121500, 92268, 162243, -161248, 167366, 147762, 262535, 119990, 31207, 322989, 370384, 112921, 387764, 132990, 1236, 144093, 210208, 279374, -37172, 160996, 41154, -342862, 304016, -75190, 351806, 539157, 181576, 269710, 449027, 107512, 106008, 496647, 509614, 496888, 168866]
11069D51380k9796A44852K4818K85719K13781B75214J37086k1974J28172j38959
11059C79539K1161j84157O02382l32149J21725K05487k45996r6926J76011M0948
11049F88025R6327k80286M66092m2058l4989o7054l31427L91956j44358L80801
11039A123029m74214o3568J87986C70357K7799K36152L17939C79599L19805o909
11029F92495k13060K48784L68246D76108J61584M1943k52055K85615N0435k49666
11019E13964j41511K26134j56793N43059l82504J47198p3540o1600J000q5849
11009E29558j40570J07104j84176K68981N7888O7835l15702K354K21952J366m7031
10998E69559K550L93023l64639J77744K14350j98503M678j2226K1532K13569j52728
$$ y = [451380, 421584, 144852, 169670, 455389, 669170, 275214, 412300, 390326, 518498, 379539, 400700, 216543, 818925, 486776, 608501, 813988, 567992, 471066, 647077, 688025, 784352, 504066, 970158, 928100, 893111, 826057, 494630, 886586, 742228, 1123029, 648815, 585247, 773233, 370357, 398156, 634308, 952247, 379599, 699404, 692495, 479435, 728219, 1096465, 476108, 637692, 679635, 427580, 713195, 763630, 513964, 372453, 598587, 441794, 984853, 602349, 749547, 676007, 614407, 615407, 529558, 388988, 496092, 311916, 580897, 638785, 706620, 390918, 393272, 615224, 616590, 569559, 572109, 965132, 600493, 778237, 992587, 794084, 798762, 786536, 808068, 1021637, 868909]
10987H68909m2796J73477j78291L92539m09716J65093J95362q5903J61599O43057
10977A883330m48003M33783o3222P80486K37381K36237j43250J6105L8961l19966
10967B651842j58501j21012n07194j94257J8436j17657J09629m3558O0881n4788
10957A643821J03260k41788J29519m09457O1403j81308j49279J48437D17220J34823
10947E52043k2328j61644L3415C525a7427C11630n1199J21710A53666J99284J13709
10936D66659a344C31208H0332a11155B31295e2153j04785A4230b28558a05135
10925a04140C8659A4319g8671n1828B7153J59049l9686J8532a4728k6973J2336
10914b9365j31360k32213A68940J05499A14531b78145m460A51657B2741f3659
$$ y = [868909, 826113, 999590, 821299, 1213838, 804122, 969215, 1164577, 1078674, 1240273, 1883330, 1435327, 1869110, 1805888, 2586374, 2823755, 3059992, 2916742, 2932847, 2971808, 2651842, 2493341, 2372329, 1865135, 1670878, 1689314, 1571657, 1681286, 1637728, 1698609, 1643821, 1747081, 1505293, 1634812, 1225355, 1286758, 1105450, 956171, 1104608, 417220, 552043, 529715, 368071, 401486, 3525, -17427, 311630, 260431, 382141, 153666, 352950, 466659, -1344, 331208, 80332, -111155, 231295, -52153, -156938, 14230, -228558, -105135, -104140, 38659, 14319, -78671, -130499, 27153, 186202, 146516, 165048, -14728, -41701, -29365, -160725, -392938, 168940, 274439, 114531, -278145, -282605, 151657, 22741, -63659]
10903d10425D2061J31520d7344A9600L9448J76022g0327j24042g2034L1044A03181
10891A1945M3743J34940F4427e0246B06121i9699M7668C26978j25091f610G7641
10879a33225E0880P037K7703a3004B8086K64054d4801k09052A14663a92526J4862
10868a77664G0439b6041A80320n7270j8477a67725B76163I7186a08637L747n3733
10857a58623p6568A53634D3333b3740A62481K19675b58859E4894P6734m3858K4506
10846A12276P295n4257J25661b07111M217q273F1538N3801E1012c47062i5526
10834i899k58566A8264K75777j45957a12679J0510A20340E3438B4792f280B3550
10822b39390a03928a1759A17392M6502B3153K7361b36030R7193A3072a89366h4970
$$ y = [-410425, 42061, 173581, -47344, 19600, 59048, 235070, -70327, -194369, -72034, -40990, 103181, 11945, 55688, 190628, 64427, -50246, 206121, -99699, -52031, 326978, 201887, -6610, 77641, -133225, 50880, 57917, 85620, -13004, 28086, 292140, -44801, -253853, 114663, -192526, -177664, 70439, -26041, 180320, 123050, 104573, -167725, 276163, 97186, -108637, -104890, -158623, -235191, 153634, 43333, -23740, 162481, 382156, -258859, 54894, 131628, 87770, 112276, 119571, 65314, 190975, -207111, -202894, -211167, 61538, 115339, 51012, -347062, -95526, -9899, -268465, 18264, 294041, 148084, -112679, -102169, 120340, 53438, 24792, -6280, 23550, -239390, -103928, -11759, 117392, 163894, 23153, 50514, -236030, -138837, 13072, -189366, -84970]
10810F7748Q6174b41586B01452b36265b0160m9090k9650F625J01079b58958B03244
10798a34817E9895b9641A20383a241F7098b87345B38513A15337r635J40768N1083
10787B97553a56757M407a2907j30816c7727G0302d45694f3072m4341n9566I3273
10775E8176a61918F1020b38427M6145e313A35122n3108k218d562k18078j91922
10764d14562B75039o357c72572A67893C7749d37731e6120I5013b54349g9090l44380
10753d23470f7001j17607J4759P2512B11265i5964j76701a21625A1714g8005B05217
10741B43194A5989a39663d0012k12939A67217a43226K2918E1540a11623C5420
10730A2966L23077D7433L4761k4876J6324a92807B46466e9822D3533a90581G566
$$ y = [67748, 153922, -241586, 201452, -236265, -20160, -69250, -98900, 6625, 107704, -258958, 203244, -134817, 59895, -29641, 120383, -1241, 67098, -287345, 238513, 115337, 105702, 246470, 297553, -156757, -152350, -12907, -143723, -37727, 70302, -445694, -63072, -107413, -166979, 93273, 58176, -161918, 61020, -238427, -192282, -5313, 135122, 82014, 79796, -4562, -222640, -414562, 275039, 268682, -372572, 167893, 37749, -437731, -56120, 95013, -254349, -79090, -423470, -67001, -184608, -169849, -97337, 211265, -95964, -272665, -121625, 11714, -78005, 205217, 243194, 15989, -139663, -40012, -252951, 167217, -143226, -120308, 51540, -111623, 35420, 12966, 336043, 47433, 82194, 57318, 73642, -192807, 246466, -59822, 43533, -190581, 7566]
10718a1941A29778B9750J45906C9421a9246A6222b39463D3790f1713o1612j00344
10707b23669k76307a67017j02884H6097C57c5445E955d9656n4886M5679R348k6174
10695g5689J3138k25429j12262J54739C5773a07046I5495A2435d8032A21303d35314
10683B29552J15292a27014A34796o3753c1581r4677e4736C01449a90290p4625
10673b64915j74371B58528f2343J0383b3180D1155J8189d0070D9243K4445Q8266
10662A61954e2292a1524k07215a9959k0870k3944B7803e0915A16219a32332N3638
10651g8694k32048A87743m2405h3216p6804j38171a47574A66333f4420j07906
10641a72326b2506A44367b59078b6333j33924B46497A0412f3796k40779B7120
$$ y = [-11941, 129778, 29750, 175656, 39421, -19246, 16222, -239463, 43790, -61713, -123325, -223669, -499976, -167017, -269901, 86097, 357, -35445, 5955, -49656, -104542, -58863, -49515, -75689, -62551, -287980, -400242, -245503, 35773, -107046, 95495, 12435, -48032, 121303, -435314, 229552, 344844, -127014, 134796, 71043, -31581, -126258, -54736, 301449, -190290, -264915, -439286, 258528, -62343, -51960, -23180, 41155, 59344, -40070, 49243, 73688, 161954, -52292, -11524, -218739, -19959, -40829, -64773, 27803, -50915, 116219, -132332, -78694, -310742, 187743, 145338, -83216, -160020, -298191, -147574, 166333, -64420, -172326, -22506, 144367, -259078, -26333, -160257, 246497, 10412, -63796, -304575, 27120]
10630g2468H9649b05510A57503a86498m7836P3301G5428h3062j9894p3847D5431
10618a05473B22693j8659E6877b53182Q4448A99493i8166o9723c6255A7564J14870
10607A32434J60559l6045a19943A00474g5671b9059A25417O8664m013a8083A2080
10595b73465n826A88671g5141j6401K6446C19727F8653j708D966N6375L9890I620
10582C8464b5653B82483b46586I3972f8971a4921A43345a23963j67229A54703
10571A77878p4061K13238h6310A7618L5293c2084k08642F1749a41006e7318a5623
10559D6335g1251l11836B58164h5196m4401f3219r3824A51024a65123A2128b30267
10547a88463k1189H802b81509E4509d10495B7708M4180h3061L1705A5614d4418
$$ y = [-72468, 89649, -205510, 157503, -186498, -234334, -161033, 75428, -83062, -102956, -176803, 45431, -105473, 222693, 204034, 56877, -253182, -168734, 199493, -98166, -167889, -36255, 17564, 132434, 292993, 256948, -119943, 100474, -75671, -29059, 125417, 194081, 190068, -18083, 12080, -273465, -279291, 188671, -75141, -91542, -65096, 319727, 68653, 66945, 4966, 61341, 101231, 9620, 38464, -25653, 282483, -246586, 93972, -68971, -14921, 143345, -123963, -291192, 154703, 177878, 103817, 317055, -86310, 17618, 52911, -32084, -240726, 61749, -141006, -57318, -15623, 46335, -71251, -383087, 258164, -85196, -129597, -63219, -157043, 151024, -165123, 12128, -230267, -188463, -209652, 8802, -281509, 54509, -410495, 27708, 71888, -83061, -51356, 15614, -44418]
10535A09793n0951j7727a36901d0560C20248i4136j4525j57905R8481n2974G9915
10523a4620j61157h014F3102a9123A30993b69571F8434g1916H7291A3026h2419
10511E6736a93669G8914c07891J48595a8264l4973l1062j73665d0205E0618c02478
10499B59248a05138D19709c55044B0234a1585C08217A04823h3276l06357B77917
10488i0908c2376B22328a59530N5931i199D31831A74516J13617L5398j1424c321
10476D26234j76361j02942D868a05407B5623d6750j7654P444A18494a05367F8275
10464c1027A4749c46694H0333a19626A48904k2811K1239J54646b25806e8926b4402
10452a23749B9397a55056q6127f089l1652C9420A5384J51306c6906k27958A55055
$$ y = [109793, 58842, 41115, -136901, -40560, 320248, -94136, -108661, -266566, -168085, -221059, 79915, -14620, -175777, -8014, 63102, -19123, 130993, -269571, 68434, -71916, 87291, 13026, -82419, 56736, -193669, 78914, -307891, -159296, -18264, -53237, -84299, -257964, -40205, 50618, -302478, 259248, -105138, 419709, -355044, 20234, -11585, 308217, 104823, -83276, -389633, 277917, -90908, -32376, 222328, -159530, -103599, -9199, 431831, 174516, 288133, 323531, 312107, -3321, 426234, 249873, 146931, 4868, -105407, 25623, -46750, -64404, -56960, 118494, -105367, 68275, -31027, 14749, -346694, 80333, -119626, 148904, 126093, 147332, 301978, -225806, -58926, -24402, -123749, 29397, -155056, -241183, -6089, -37741, 39420, 15384, 166690, -36906, -264864, 155055]
10440C78426i7978A55652P6341g594A8848e7413j70613K0098K7841b8623j86760
10429b15383N4956A8004M2007h0885A02976L0489c0132A65351B1636a32594c3396
10417h2279p4088a5079l13375A08854H791P6618c61070R1438A21661a43283g0372
10405e1242j87357A53397l7993A5419f802F6540J45742L38097B00264j8981K66
10394A81549F7742Q5324Q5048c8459B7268K30422A10981R1335J1703j6718B7767
10382a12710L591F5883f5340A11537M3871K1063m7776L27612k05474C2059K69148
10371C01207N8982A23001K31766K39634j42167r7332o5763K34239B01131F9260
10360i1765A11699J89929D972J8965K63087j06493J56360j23476J31227F7797
$$ y = [378426, -97978, 155652, 231993, -7594, 18848, -57413, -228026, -207928, -180087, -28623, -215383, -160427, 18004, 60011, -80885, 102976, 133465, -30132, 165351, 21636, -132594, -33396, -82279, -156367, -15079, -328454, 108854, 8791, 85409, -361070, -269632, 121661, -143283, -70372, -51242, -238599, 153397, 115404, 15419, -6802, 66540, 212282, 550379, 200264, 181283, 181549, 67742, 153066, 238114, -38459, 27268, 257690, 110981, 202316, 214019, 197301, 27767, -112710, -109119, 65883, -65340, 111537, 155408, 176471, 128695, 456307, 250833, 32059, 301207, 360189, 123001, 354767, 594401, 452234, 354902, 289139, 523378, 201131, 69260, -91765, 111699, 301628, 4972, 23937, 287024, 180531, 336891, 213415, 344642, 67797]
10349E14488k36330M8421O6034A14907i1651D2501Q9805E8769M6748N4060b9055
10337A62624L76233a18700b144A31213J37428J24193D6646e2110A80538e44B82398
10325b33413f5231B75952I9931k9461a32025B6255J11211a83419G0139d3662o043
10314d9705K0707O615A98312r6411Q3849E4935A9559a52382b7484B84810a99553
10302A6344R7505a82173G0277d8166C77618A53359a52580m0805P1914p1758i5425
10290B95773E568d6881p2594m7170J2384b5779j36968b949j83498C17927a73829
10278b33880E3455j0018J50834B421b20430P2546b1926E7069b69047a08445A84612
10266A31563a60201N8331B55444j0279a49198B11016K37621j69673L08537m4282
$$ y = [514488, 278158, 326579, 392613, 114907, -91651, 42501, 132306, 58769, 105517, 159577, -29055, 162624, 538857, -118700, -2144, 131213, 268641, 392834, 46646, -52110, 180538, -544, 282398, -233413, -65231, 275952, 99931, 70470, -132025, 26255, 137466, -183419, 70139, -43662, -49705, -28998, -22383, 198312, 101901, 185750, 54935, 19559, -152382, -27484, 284810, -199553, 16344, 113849, -182173, 70277, -48166, 377618, 153359, -152580, -193385, -121471, -193229, -95425, 295773, 5568, -46881, -119475, -166645, -154261, -25779, -162747, -2949, -186447, 317927, -173829, -233880, 53455, 43437, 194271, 2421, -220430, -147884, -21926, 57069, -269047, -108445, 184612, 131563, -160201, -101870, 255444, 245165, -149198, 211016, 448637, 278964, 587501, 543219]
10256E43219B36602J14582j59220a2907o1026a0227k98517J28417D8394b84096
10245c15790f6357k873B17262j1224i4102O77M2209A69613e0737a1004E4638a23183
10232C3635b4965r9196A10084m7993O1717a86583B21076b20257O4122k79871A46911
10220g3971n3721H0429Q2936b0782B66940c78610g046C6956N2561j5365g1312
10208a39166j52600d1718n9693L0123p8350e1615j13943k39278A63134c80686
10197A62168m7391i9466j7450B48650i9543G3203P296a63078d0191k23779j663
10186b65633a28490C05409a22298j6305A20572a89037A48372e2659k29094e3262
10175d0003a9083B1006a27854j26004D6974A9660J26026c06530A28152c5750J3510
$$ y = [543219, 236602, 351184, 191964, -12907, -73933, -10227, -308744, -180327, 48394, -284096, -315790, -66357, -69230, 217262, 206038, -94102, -93425, -51216, 169613, -50737, -11004, 54638, -123183, 33635, -24965, -124161, 110084, 62091, 123808, -186583, 221076, -220257, -156135, -436006, 146911, -73971, -127692, 80429, 163365, -20782, 266940, -378610, -7046, 36956, 89517, 74152, -71312, -139166, -291766, -41718, -101411, -71288, -149638, -51615, -165558, -404836, 163134, -380686, 162168, 114777, -99466, -116916, 248650, -99543, 73203, 80499, -163078, -40191, -263970, -265633, -128490, 305409, -122298, -138603, 120572, -189037, 148372, -52659, -281753, -53262, -40003, -19083, 21006, -127854, -253858, 46974, 19660, 145686, -306530, 128152, -35750, -22240]
10164b2240C30564A00222b07627P5584n0149I9412g7817C42683b77111a4390p0370
10153h4760k01423q390i2491A49907a02611b1876k30921g8836c4773j65249a7418
10141B3831a80466I752b47371h3106C8979Q1554a39572O4374k2641j27942i5576
10129B26159c15160F6851O5510a27667r8483D387a76848a9604A29473A0151d33720
10117C13281a18735j06088F266N8851b59304A03237b15627i9688l6980A660J47602
10106A49262O5374c34672f7388b0217k26323B11892b86012A36330l4550l4587
10096F7193J002b42681B02053h5973E7179d3425F577e66734e1965B1419p439a79554
10083F2409A5013L7020B4148J09114E5989f4455k23841o1661A06245c2437A23498
$$ y = [-22240, 330564, 100222, -207627, -132043, -182192, 99412, -77817, 342683, -277111, -14390, -84760, -286183, -294573, -92491, 149907, -102611, -21876, -252797, -78836, -34773, -200022, -17418, 23831, -180466, 9752, -247371, -83106, 38979, 120533, -139572, -75198, -97839, -225781, -95576, 226159, -315160, 66851, 132361, -127667, -226150, 4387, -176848, -19604, 129473, 10151, -433720, 313281, -118735, -224823, 6266, 65117, -259304, 103237, -215627, -99688, -136668, 1660, 149262, 214636, -334672, -67388, -20217, -246540, 211892, -286012, 136330, 101780, 67193, 68195, -242681, 202053, -85973, 57179, -43425, 6577, -566734, -51965, 21419, 13980, -179554, 62409, 15013, 52033, 24148, 133262, 55989, -64455, -288296, -349957, 106245, -32437, 123498]
10071c14794b9773k12030A76336d9822l8435E3214O092h9937B90043a52174f8793
10059A74041N9748q123D8863b27218f1736r0929A30056b22474m80j09224a54571
10047b70200A17711b61537A67306g0410A16300A6633J60112J07828b35217R0828
10037a44389B55761a23802p2231D3655b7521H8744b10066Q2526M434r440A25666
10025b47133A29739D8010r442a1834j8708j00496f603B596K08992a86202l6410
10014b22612d8799E7029c5417j9394k58285J04541A89713h8133C8117K4422M6561
10003A09100A53d9500A82111f2925j13346o7666b1416p3946j00182K0355A63447
9991c72111A13120J33030a5617l35738A64015b91429e1011R269j50763i2524j39420
$$ y = [-314794, -29773, -241803, 176336, -49822, -88257, 53214, 59306, -89937, 290043, -152174, -68793, 174041, 233789, 225666, 48863, -227218, -61736, -152665, 130056, -222474, -222954, -332178, -154571, -270200, 117711, -261537, 167306, -70410, 116300, 16633, 176745, 284573, -235217, -144389, 255761, -123802, -196033, 43655, -27521, 88744, -210066, -127540, -123106, -132546, 125666, -247133, 129739, 48010, 38568, -11834, -30542, -131038, -6603, 2596, 211588, -186202, -222612, -48799, 57029, -35417, -54811, -313096, -208555, 189713, -88133, 38117, 62539, 109100, 153, -49500, 182111, -62925, -176271, -243937, -21416, -95362, -195544, -175189, 163447, -372111, 113120, 246150, -15617, -351355, 164015, -291429, -51011, -41742, -192505, -92524, -231944]
9980b31944J02016o1611A1677d5185n3032j34648K4184j65462A57928a91588j16047
9969c07635a01398B3464Q35b96701e5425j00001E0275n199a38767n8906K2268
9958a75405f8137A89335a73820f441j23764p2887j1227k14660J29226B24585b05743
9946H1468L8424c06171a05875l12583A03995a44179c7273j76571f4275c1784k99060
9935c30844A85683c99017f8344l2079k71346D4980a08698a8943E7606a977o5277
9924f7254j07474j63641c019k50260I6951a6374n3342A62895f456A70131a18714
9912D34827H3579a59624b2624j06047B55103a407A29445m1399c49125c1401k78114
9901c09515o6667A9633M6543a28267C6636b59181A21089a12479A77946c48306
$$ y = [-231944, -129928, -191539, 11677, -45185, -98217, -232865, -208681, -374143, 157928, -191588, -307635, -101398, 23464, 24299, -296701, -55425, -155426, 50275, 45076, -138767, -197673, -175405, -68137, 189335, -173820, -6441, -130205, -203092, -214319, -428979, -299753, 224585, -205743, 81468, 119892, -306171, -105875, -418458, 103995, -144179, -37273, -213844, -64275, -31784, -330844, 185683, -399017, -68344, -100423, -371769, 44980, -108698, -18943, 57606, -1977, -67254, -174728, -338369, -3019, -253279, 96951, -16374, -69716, 162895, -6456, 170131, -118714, 434827, 83579, -159624, -22624, -128671, 255103, -1407, 129445, 88046, -349125, -31401, -309515, -376182, 19633, 66176, -128267, 36636, -259181, 121089, -112479, 177946, -348306]
9890A5838G674b69694L0315d5248H988a09405P774p7500A70523a2443j43023g4267
9877b75821A30367a49086q1658A28369D342J4312J73676b52913C464P8968K1953
9866A04385c33300E5329K45340a45566N8257B62283B2800a00501p7155j1513C0127
9854d7342B03947A2651c30593f5182K9649j68728A39526a24379r8798K0975B29758
9842d3337B64143e9354a9172B0615M5726b86444i0828j5436C4457c6038E6754
9830b04290O1624J4226j9701A331a90824B39248G2021c45454f5982j5348k8685
9819a10015j10360B936a11105c5465j52681j97420J77101A86461a70405k36990
9809d07395J41376i2226B30376a45165b6941j83695F7254j3587a98070G7181d6613
$$ y = [15838, 7674, -269694, -239379, -45248, 8988, -109405, -101631, -179131, 170523, -12443, -155466, -74267, -275821, 130367, -149086, -230744, 128369, 4342, 18654, 192330, -252913, 3464, 82432, 104385, -333300, 55329, 300669, -145566, -87309, 262283, 22800, -100501, -177656, -189169, 30127, -47342, 203947, 12651, -330593, -65182, -35533, -204261, 139526, -124379, -223177, -202202, 229758, -43337, 264143, -59354, -19172, 20615, 66341, -286444, -90828, -106264, 34457, -36038, 56754, -204290, -142666, -128440, -148141, 1331, -190824, 239248, 72021, -345454, -65982, -81330, -110015, -220375, 2936, -111105, -35465, -188146, -385566, -208465, 186461, -170405, -407395, -266019, -92226, 230376, -145165, -26941, -210636, 67254, 53667, -198070, 77181, -46613]
9797a93336d7261r0250k92333B84589A40494a28723j68093k22699K35485B44416
9786a2460K503A32518B2923n108n946c48519P1187D2056Q7287N5152F5083J45252
9774B10335b14811h8707c9158b512o3169o3559m4877p5R863A21830a75376b7927
9761H0952a71141m2853j518A03503i8144B20267d93174K31734L0503R3125A92602
9749c605k85197J00662f1677B7711d1591j37229f4165E4710K44217e9817K7101
9738c2716D6212L743b20516A08499c87438a35933I7524A9487O3061b11638O1857
9727a49781c8904a4480j61907A08103m6140J86492a1446j28108A04830O4192a12274
9715D8562J51259a12664A26803a57128E17259A70202a10234B8358J83146a98818
$$ y = [-193336, -47261, -137511, -429844, 284589, 140494, -128723, -296816, -519515, -284030, 244416, -12460, -9957, 132518, 22923, 17815, 11869, -348519, -277332, 42056, 129343, 184495, 65083, 210335, -214811, -88707, -39158, -2512, -65681, -129240, -174117, -174192, -164329, 121830, -175376, -27927, 80952, -171141, -213994, -215512, 103503, -98144, 220267, -493174, -261440, -230937, -137812, 192602, -3605, -288802, -188140, -61677, 27711, -41591, -178820, -64165, 54710, 298927, -59817, -32716, 46212, 49955, -220516, 108499, -387438, -135933, 97524, 19487, 82548, -211638, -149781, -38904, -14480, -176387, 108103, 61963, 248455, -11446, -139554, 104830, 169022, -112274, 48562, 199821, -112664, 126803, -157128, 517259, 170202, -110234, 28358, 211504, -198818]
9704E6850i7712l3563b2102l29320A16513a3375k95030F423b67170A29363c3981
9692a41848b168k76081C09651E6055a03073k33011J44315K2238h134j0604n5874
9681g4612b622k7808A68266b56366A33676b29497O7401b9D0018b1424j59755O7706
9669a13473j75714N3889B9312a76194p8285a8248j47175j76904A04434k2853j1200
9658G0381b13956G72d7732n2940B12238c17428Q9202n709C4824b42230i1401E2050
9645h2419I1644b0135q7235j06154A47056e4008C4285c76809h4009E4906J29726
9634A84632a35964D6731b1823o3203k2613j48557n6847P2983a05195q2495j68130
9623c55820A08853a57318A0243f15991G5001J14363m4491h0362a7517p1914C82471
$$ y = [56850, -97712, -131275, -22102, -351422, 116513, -13375, -308405, 6423, -267170, 129363, -33981, -141848, -2168, -278249, 309651, 56055, -103073, -336084, -191769, -169531, -8134, -18738, -74612, -2622, -30430, 168266, -256366, 133676, -229497, -162096, -29, 40018, -21424, -181179, -113473, -289187, -235298, 29312, -176194, -254479, -18248, -165423, -342327, 104434, 81581, 70381, -213956, 772, -47732, -100672, 212238, -317428, -228226, -233935, 34824, -242230, -91401, 52050, -82419, 91644, -20135, -107370, -213524, 147056, -54008, 34285, -376809, -84009, 54906, 184632, -135964, 46731, -21823, -85026, -107639, -256196, -313043, -240060, -105195, -187690, -355820, 108853, -157318, 10243, -615991, 75001, 189364, 144873, -80362, -17517, -89431, 382471]
9611d5649j99724c0418M529k69186I622L4402e8995r9474J262A68811A4085R8421
9599A12506l5q064P241Q0115m6014b80216a04173o3821E0136k3553M8917c64837
9586C7726b85590E9170P3847o2210J5371a12355G9395e21437h2383k73448A57158
9574a53034c031l03108C10565a68710j94722a64389c4130n9962d422B79139A19781
9562c10119J46214j18840A28575c7806k00484N2294b1611m61563a5886k9286m4530
9551h9702o5605A22621a96083k554B0948a7184m34125a50831k44756c2873A35768
9539a86793k5605O944N3930q4764g6415j80640c2117j59787M1619k43488a88040
9527f5176k09998R6304C1155a89049j12318j9238a47521C9927N8860J9537a53645
$$ y = [-45649, -245373, -30418, -25889, -295075, 9622, 44024, -58995, -158469, -157207, 168811, 14085, 112506, 112471, 104407, 111648, 191763, 145749, -280216, -104173, -167994, 50136, 26583, 75500, -364837, 37726, -285590, 59170, 133017, 70807, 86178, -112355, 79395, -521437, -82383, -355831, 157158, -153034, -3031, -306139, 310565, -168710, -363432, -164389, -34130, -94092, -4422, 279139, 119781, -310119, -163905, -282745, 128575, -37806, -238290, -185996, -21611, -483174, -15886, -45172, -89702, -155307, 122621, -196083, -198637, 20948, -17184, -451309, -150831, -395587, -32873, 135768, -186793, -212398, -205454, -151524, -236288, -76415, -257055, -32117, -191904, -150285, -393773, -188040, -65176, -275174, -178870, 31155, -189049, -301367, -320605, -147521, 39927, 98787, 118324, -153645]
9515a72854J911j10528C6111d7873j39605j23090H3333a79958F601a99048G2886
9503b04837e0064I7909L06963a4002k43890C19982A15436a11809F8794f2361k42862
9492c05223i7896c9271n643H087h1307I2253J23790A0025L7787a17880l8328a9542
9479b8235k5675C36624b43133A35089b5076l26652J38159h4040A06920b49525
9468a91927M6579l1488A27814a44742l16618A98980D1108a26198J7063r3792g9441
9456a00249C4796R9691J3604e8845A79236b12724k03089D32432j93992a57894
9445a31835r4239a7845I3718N9426N6832r1431a16041k08822A62106F857K29369
9434B36226h3700C82021b59907C7195e1003b0463k46403b8228A05760L7953B7579
$$ y = [-172854, -170943, -281471, 36111, -47873, -187478, -310568, 83333, -179958, 6601, -199048, 72886, -204837, -50064, 97909, 404872, -14002, -257892, 319982, 115436, -111809, 68794, -62361, -305223, -97896, -39271, -44914, 8087, -81307, 92253, 216043, 10025, 47812, -117880, -156208, -19542, -28235, -53910, 336624, -243133, 135089, -25076, -351728, -213569, -84040, 106920, -249525, -191927, -145348, -176836, 127814, -144742, -461360, 198980, 41108, -126198, -109135, -202927, -79441, -100249, 34796, 134487, 148091, -58845, 179236, -212724, -415813, 432432, 238440, -157894, -131835, -226074, -17845, 93718, 153144, 209976, 118545, -116041, -324863, 162106, 6857, 236226, -83700, 382021, -259907, 37195, -51003, -20463, -266866, -28228, 105760, 143713, 27579]
9422g5486A90612m3867l9264g6868l49843C7621J87609b86027c0113B32391a67723
9410i0563G532f4644l3197B2678c814k21887c2522o7594A99957a95644P7869I9828
9397b528I2348J7069a87818J3473B0c5171l22155d1123B89997b94300Q6587F8148
9384a05462o4218C2063a25326N958B0960a8384l07676H1914A6176d5374B61629
9372a03169G7085h527q3254E0770b83915I2323a63432c6867k56414a00886K6583
9361g4303A91658b45792D3288c82192I9857a93902M9325l15217K13825C03619
9350c41414j67620a60964G0726A5136J20964b96508a333A9226J9444a28455B12609
9338b76986B67998H2755a67588B18806b16535J03425I747a12424C62416a90695
$$ y = [-75486, 190612, 146745, 107481, -76868, -426711, 37621, 225230, -286027, -30113, 232391, -167723, -90563, 7532, -64644, -97841, 22678, -3814, -225701, -32522, -100116, 199957, -195644, -117775, 99828, -2528, 92348, 109417, -187818, -174345, 20, -35171, -357326, -41123, 289997, -294300, -207713, 68148, -105462, -169680, 32063, -125326, -119368, 20960, -18384, -326060, 81914, 16176, -45374, 261629, -103169, 77085, -8527, -91781, 50770, -283915, 92323, -163432, -36867, -293281, -100886, -74303, 191658, -245792, 43288, -382192, 99857, -193902, -144577, -459794, -245969, 303619, -341414, -509034, -160964, 70726, 15136, 136100, -296508, -1333, 19226, 38670, -128455, 212609, -276986, 267998, 82755, -167588, 218806, -216535, -113110, 9747, -112424, 362416, -190695]
9327a30208c0305l39A28046j6748b73233J03476F3067h5341n470J061o86C8527
9314e1527m36799f9391p1801l6136B362c73532e3024B81672a95603J3394B52676
9302b36804I0256K74233j61824F4269P6463J0736A6597J51729a25729a1553l89675
9291d01228b3454G0391l903J19676f736m7975l8855O704l43473A79842E6087J6327
9279G2414a57072H8196b45251A65359h3834C658f0359G6422f0417j73989i5429
9267B05402g0828j64815o6949a34137B4528J96681b90868i0882j33037q43E2882
9255a57542q5395h1229r7598D214a35690l6568j37548A65838b37909f4583k0924
9244h5507b6187q5741l5056N7187M4142r5220J8221j9455G1970C1606j5321a03649
$$ y = [-130208, -30305, -30644, 128046, 111298, -273233, -169757, 63067, -85341, -90811, -89750, -90436, 38527, -51527, -488326, -69391, -141192, -177328, 2362, -373532, -53024, 281672, -195603, -182209, 252676, -236804, 90256, 364489, 202665, 64269, 140732, 151468, 16597, 168326, -125729, -11553, -401228, -23454, 70391, 66488, 186164, -6736, -54711, -93566, -86862, -430335, 179842, 56087, 72414, -157072, 88196, -245251, 165359, -83834, 3658, -60359, 76422, -60417, -234406, -95429, 205402, -70828, -235643, -302592, -134137, 24528, 221209, -290868, -90882, -223919, -224762, 52882, -157542, -242937, -81229, -178827, 4214, -135690, -172258, -309806, 165838, -237909, -64583, -85507, -26187, -111928, -146984, -89797, -45655, -140875, -122654, -142109, 71970, 31606, 16285, -103649]
9231C9465A4020a55784e7051r8895O5202B71039f8254b710G5621b0455A29803
9219C7409N6206C4907b72970j1541a38855D3059a39611m5138A63179a36239B16830
9207F2013J00778F8744b6323G8433q803k899L1605a07603j41034O0543m4502i2843
9194b152l79716I2780e614A6704K4955a06015A18598b6824B67590K2462b14617
9182B58334a6447j38736D7594a45388O787M9301k70758Q7825C03840E2921C95
9170c11316A32203E8945N3670b45175a4681A20698l6619B3626a14554c7206j16206
9159a53412j00077e8485k04157P9987A22538c91134i0815D2992J895b13468P8599
9148a34869L479k75139d7569G5177e20992A75219b67221a20835E4448d9825D0404
$$ y = [39465, 14020, -155784, -57051, -155946, -90744, 271039, -68254, -2710, 75621, -20455, 129803, 37409, 93615, 34907, -272970, -284511, -138855, 43059, -139611, -184749, 163179, -136239, 216830, 62013, 162791, 68744, -26323, 78433, 69630, 66731, 98336, -107603, -248637, -188094, -232596, -92843, -2152, -381868, 92780, -5614, 16704, 41659, -106015, 118598, -26824, 267590, 290052, -214617, 258334, -16447, -155183, 47594, -145388, -138601, -89300, -360058, -272233, 303840, 52921, 395, -311316, 132203, 58945, 112615, -245175, -14681, 120698, 84079, 23626, -114554, -37206, -153412, -253489, -58485, -262642, -182655, 122538, -391134, -90815, 42992, 44887, -213468, -134869, -131390, -406529, -47569, 75177, -520992, 175219, -267221, -120835, 54448, -49825, 40404]
9136b3294j08319j08415M1712P5880a1016B4526K15698r0736e2770D831c20555
9124c9896k446C39539b71304A93079E0321K24926h1934p5388a400o8490G1993
9112a43788m0390c7226k27284O3689B23090N668j01975b93703a00460A93308E7058
9100C4237J82932a37040d4114I6964a25170n0434j25665L5082J23253e7770k426
9089f0196F8469h4259J6414o7688O6123A60721b14669G5594c20149I7851a22990
9077D4731a64533i767j06014o6511A43147P6738c47486J12850l8866B68496b8502
9065b91614a02039D4269O4931a21478B21287D2546c73249C07724B4043a71790
9054B78144h7998p160B1995K59166c52499a22894r2458J05914d0531J7503N120
$$ y = [-23294, -131613, -240028, -198316, -122436, -11016, 24526, 240224, 149488, -52770, 4831, -320555, -39896, -42342, 339539, -271304, 193079, 50321, 275247, -81934, -157322, -1400, -69890, 71993, -143788, -184178, -37226, -264510, -200821, 223090, 228758, 126783, -293703, -100460, 193308, 57058, 34237, 217169, -137040, -44114, 96964, -125170, -175604, -301269, -266187, -142934, -57770, -60196, 68469, -84259, -67845, -135533, -69410, 160721, -214669, 75594, -320149, 97851, -122990, 44731, -164533, -9767, -115781, -182292, 143147, 219885, -347486, -234636, -273502, 268496, -28502, -291614, -102039, 44269, 109200, -121478, 221287, 42546, -373249, 307724, 24043, -171790, 278144, -87998, -95158, 21995, 281161, -352499, -122894, -215352, -109438, -40531, -23028, -17908]
9043a7908p9277j48116g6916k86495a15947A31142N2536q4177J64878F7043c7251
9031A8094g05m2494k92569J22410J6427D1946K6885a11503D8088l975c8384E623
9018b89295g4352k37976H3909g1060j71644j66045a05464F2897e1347j36951q7283
9007b75581G1301K0192a22045j67839b5223j81557l9032i7659b6519l35388a3518
8995C2089h1092H1514a00398E8896d6232r474C44608A2710L40102b5132j49863
8984a74995A08863d93054J50015B4913J8889o634b12815r5277J26814D7188R8915
8973A46103A5679J88027e2919j541j49806h4608j10294P8949B4626i0157o0190
8962a50347j90070a44831H2403g2483l6389B06298b14618h3394I899K07589a93165
$$ y = [-17908, -97185, -245301, -76916, -363411, -115947, 131142, 183678, 99501, 264379, 67043, -37251, 18094, -705, -43199, -335768, -213358, -196931, 41946, 68831, -111503, 48088, 44113, -38384, 5623, -289295, -74352, -312328, 83909, -71060, -242704, -408749, -105464, 62897, -51347, -188298, -275581, 71301, 91493, -122045, -289884, -25223, -206780, -245812, -97659, -26519, -361907, -13518, 32089, -81092, 81514, -100398, 58896, -46232, -55706, 344608, 12710, 352812, -25132, -174995, 108863, -493054, -343039, 24913, 43802, 37168, -212815, -308092, -181278, 47188, 146103, 15679, 203706, -52919, -54460, -204266, -84608, -194902, -115953, 24626, -90157, -150347, -340417, -144831, 82403, -72483, -108872, 206298, -214618, -83394, 9899, 217488, -193165]
8950G0277j1059c16498Q7335B14565b66209I3583h8251M2114k54531I3411a68130
8938a38686q7384Q3302C8287L54095j47610i731p0327B05433H1225a13048B3068
8926a63887A87757N46331j83541J251897N963006l8094B268739F33469A87783
8916G28365A59226f2324C4604K23741H4679c8533j83033A00729L09458i767j40665
8905a50432J5386k00102a26684N8888j54004L9226Q7453H5756a0022j76178E2518
8893A1266e8483E8205a93929K8087j08592L8118A08720e6736E6927g9433l5775
8882a15208A68640e258k52031B4070R671h7143j55746B7130P7050J99630a02771
8870a44877A16172g2472F9763a10500C3922f8082p0661j52940D0444a45053j26101
$$ y = [70277, 59218, -316498, -229163, 214565, -266209, 93583, -88251, -46137, -300668, 93411, -168130, -138686, -226070, -142768, 38287, 392382, 244772, -9731, -80058, 205433, 81225, -113048, 23068, -163887, 187757, 734088, 550547, 1802444, 7765450, 7727356, 2268739, 633469, 187783, 728365, 159226, -62324, 34604, 258345, 84679, -38533, -221566, 100729, 410187, -9767, -150432, -135046, -335148, -126684, -67796, -221800, -182574, -95121, 85756, -10022, -186200, 52518, 11266, -58483, 58205, -193929, -165842, -274434, -236316, 108720, -56736, 56927, -79433, -115208, 168640, -5258, -257289, 24070, 33741, -87143, -242889, 27130, 104180, 303810, -102771, -144877, 116172, -72472, 69763, -110500, 33922, -68082, -138743, -291683, 40444, -145053, -271154]
8859b71154A12102a80687A15158b30137g2474B09248m9916G6027a18038B19381
8848b64591A14020n6903b6368I5030a26532j57418H4095d7275n0865A74828k5132
8837A49696a3323l8857A0573b63301k03077f244C2641a70999B57403e0317c673
8825A57868b08077A6794K05854c08418F5134a18230B05947g7916B2566b04723
$$ y = [-271154, 112102, -180687, 115158, -230137, -72474, 209248, 159332, 76027, -118038, 219381, -264591, 114020, 57117, -26368, 95030, -126532, -283950, 84095, -47275, -98140, 174828, 149696, -13323, -52180, 10573, -263301, -466378, -6244, 32641, -170999, 257403, -50317, -3673, 157868, -208077, 16794, 222648, -308418, 65134, -118230, 205947, -77916, 22566, -204723]
$$ [...]
##END NTUPLES=NMR SPECTRUM
##END=
