
##TITLE=AC1224_Punto_6080179_L6QuNXOy2o
##JCAMPDX= 6.0         $$ Bruker NMR JCAMP-DX V2.0
##DATA TYPE= NMR SPECTRUM
##DATA CLASS= NTUPLES
##ORIGIN= BRUKER
##OWNER= Administrator
$$ 1.72 TOPSPIN		Version 2.1
$$ 2012-05-09 02:03:57.828 -0500  Administrator@TOPSPIN
$$ Compression mode = diff/dup
##.OBSERVE FREQUENCY= 400.13188235
##.OBSERVE NUCLEUS= ^1H
##.ACQUISITION MODE= SIMULTANEOUS (DQD)
##.ACQUISITION SCHEME= undefined
##.AVERAGES= 8
##.DIGITISER RES= 22
##SPECTROMETER/DATA SYSTEM= spect
##.PULSE SEQUENCE= zg30
##.SOLVENT NAME= COFFEE_meoh
##.SHIFT REFERENCE= INTERNAL, COFFEE_meoh, 1, 14.98061
##AUDIT TRAIL= $$ (NUMBER, WHEN, WHO, WHERE, PROCESS, VERSION, WHAT)
$$ ##TITLE= Audit trail, TOPSPIN		Version 2.1
$$ ##JCAMPDX= 5.01
$$ ##ORIGIN= Bruker BioSpin GmbH
$$ ##OWNER= Administrator
$$ $$ C:\Bruker\TOPSPIN/data/COFFEE/nmr/AC1224_Punto_6080179_L6QuNXOy2o/10/pdata/1/auditp.txt
$$ ##AUDIT TRAIL=  $$ (NUMBER, WHEN, WHO, WHERE, PROCESS, VERSION, WHAT)
(   1,<2012-05-09 02:03:51.093 -0500>,<Administrator>,<TOPSPIN>,<go>,<TOPSPIN 2.1>,
      <created by zg
	started at 2012-05-09 02:02:44.546 -0500,
	POWCHK enabled, PULCHK disabled,
       configuration hash MD5:
       AF F2 23 6B 01 CD 40 DD E5 A1 38 A0 06 EA F7 77
       data hash MD5: 64K
       FA DE B6 13 37 03 16 63 B8 42 BE D1 57 6E 9C 70>)
(   2,<2012-05-09 02:03:53.656 -0500>,<Administrator>,<TOPSPIN>,<proc1d>,<TOPSPIN 2.1>,
      <Start of raw data processing
       efp LB = 0 FT_mod = 6 PKNL = 1 PHC0 = 0 PHC1 = 0 SI = 32K 
       data hash MD5: 32K
       01 EC 70 12 09 CF A2 82 73 8F D4 87 43 7F B1 97>)
(   3,<2012-05-09 02:03:54.078 -0500>,<Administrator>,<TOPSPIN>,<proc1d>,<TOPSPIN 2.1>,
      <pk PHC0 = 213.6566 PHC1 = 0 
       data hash MD5: 32K
       9D A0 8C 51 CE F8 AB FE 6C 8A 0F 10 6B E9 A4 BC>)
(   4,<2012-05-09 02:03:54.156 -0500>,<Administrator>,<TOPSPIN>,<proc1d>,<TOPSPIN 2.1>,
      <abs ABSG = 1 
       data hash MD5: 32K
       CA D9 E2 C6 79 FE 3F B1 9C 88 95 C6 91 32 C1 EF>)
(   5,<2012-05-09 02:03:54.187 -0500>,<Administrator>,<TOPSPIN>,<proc1d>,<TOPSPIN 2.1>,
      <abs ABSG = 2 
       data hash MD5: 32K
       4E 36 7E 56 89 32 0A A6 4B E4 74 3A 42 AD DE 65>)
(   6,<2012-05-09 02:03:54.218 -0500>,<Administrator>,<TOPSPIN>,<proc1d>,<TOPSPIN 2.1>,
      <abs ABSG = 3 
       data hash MD5: 32K
       F6 16 E2 4C E5 AC 46 D6 39 54 51 FA 94 17 7A 0C>)
(   7,<2012-05-09 02:03:54.250 -0500>,<Administrator>,<TOPSPIN>,<proc1d>,<TOPSPIN 2.1>,
      <abs ABSG = 4 
       data hash MD5: 32K
       DB 78 D2 70 97 E1 43 CC B4 F9 B0 21 10 8B 2A B1>)
(   8,<2012-05-09 02:03:54.265 -0500>,<Administrator>,<TOPSPIN>,<proc1d>,<TOPSPIN 2.1>,
      <abs ABSG = 5 
       data hash MD5: 32K
       E2 AF ED 2D 57 65 1A B1 DF EE 7D 70 2B 1B E6 E8>)
$$ ##END=
$$ 
$$ $$ hash MD5
$$ $$ 73 11 05 7F 8E CC 80 D8 4B D5 05 B6 AE B2 26 7A
##$RELAX= 
##$RELAX= 
##$RELAX= 
##$RELAX= 
##$RELAX= 
##$RELAX= 
##$RELAX= 
$$ Bruker specific parameters
$$ --------------------------
$$ [...]
##$TP= (0..7)
150 150 150 150 150 150 150 150
##$TP07= 0
##$TPNAME0= <>
##$TPNAME1= <>
##$TPNAME2= <>
##$TPNAME3= <>
##$TPNAME4= <>
##$TPNAME5= <>
##$TPNAME6= <>
##$TPNAME7= <>
##$TPOAL= (0..7)
0.5 0.5 0.5 0.5 0.5 0.5 0.5 0.5
##$TPOFFS= (0..7)
0 0 0 0 0 0 0 0
##$TUNHIN= 0
##$TUNHOUT= 0
##$TUNXOUT= 0
##$USERA1= <user>
##$USERA2= <user>
##$USERA3= <user>
##$USERA4= <user>
##$USERA5= <user>
##$V9= 5
##$VALIST= <valist>
##$VCLIST= <CCCCCCCCCCCCCCC>
##$VD= 0
##$VDLIST= <DDDDDDDDDDDDDDD>
##$VPLIST= <PPPPPPPPPPPPPPP>
##$VTLIST= <TTTTTTTTTTTTTTT>
##$WBST= 1024
##$WBSW= 4
##$XGAIN= (0..3)
0 0 0 0
##$XL= 0
##$YL= 0
##$YMAX_a= 490587
##$YMIN_a= -583394
##$ZGOPTNS= <>
##$ZL1= 120
##$ZL2= 120
##$ZL3= 120
##$ZL4= 120
##$ABSF1= 14.98061
##$ABSF2= -5.57192
##$ABSG= 5
##$ABSL= 3
##$ALPHA= 0
##$AQORDER= 0
##$ASSFAC= 0
##$ASSFACI= 0
##$ASSFACX= 0
##$ASSWID= 0
##$AUNMP= <proc_prof1d_extract_pilot.lims>
##$AXLEFT= 0
##$AXNAME= <>
##$AXNUC= <1H>
##$AXRIGHT= 0
##$AXTYPE= 0
##$AXUNIT= <>
##$AZFE= 0.1
##$AZFW= 0.1
##$BCFW= 0
##$BC_mod= 0
##$BYTORDP= 0
##$COROFFS= 0
##$CY= 15
##$DATMOD= 1
##$DC= 0
##$DFILT= <>
##$DTYPP= 0
##$F1P= 0
##$F2P= 0
##$FCOR= 0.5
##$FTSIZE= 32768
##$FT_mod= 6
##$GAMMA= 0
##$GB= 0
##$INTBC= 1
##$INTSCL= 1
##$ISEN= 128
##$LB= 0
##$LEV0= 0
##$LPBIN= 0
##$MAXI= 10000
##$MC2= 0
##$MEAN= 0
##$ME_mod= 0
##$MI= 0
##$NCOEF= 0
##$NC_proc= -8
##$NLEV= 6
##$NOISF1= 0
##$NOISF2= 0
##$NSP= 0
##$NTH_PI= 0
##$NZP= 0
##$OFFSET= 14.98061
##$PC= 1
##$PHC0= 213.6566
##$PHC1= 0
##$PH_mod= 1
##$PKNL= yes
##$PPARMOD= 0
##$PPDIAG= 0
##$PPIPTYP= 0
##$PPMPNUM= 2147483647
##$PPRESOL= 1
##$PSCAL= 4
##$PSIGN= 0
##$PYNMP= <proc.py>
##$REVERSE= no
##$SF= 400.13
##$SI= 32768
##$SIGF1= 0
##$SIGF2= 0
##$SINO= 400
##$SIOLD= 32768
##$SPECTYP= <>
##$SREGLST= <1H.CDCl3>
##$SSB= 0
##$STSI= 32768
##$STSR= 0
##$SW_p= 8223.68421052632
##$SYMM= 0
##$S_DEV= 0
##$TDeff= 65536
##$TDoff= 0
##$TI= <>
##$TILT= no
##$TM1= 0
##$TM2= 0
##$TOPLEV= 0
##$USERP1= <user>
##$USERP2= <user>
##$USERP3= <user>
##$USERP4= <user>
##$USERP5= <user>
##$WDW= 1
##$XDIM= 32768
##$YMAX_p= 423072729
##$YMIN_p= -698719
##$CURPLOT= <Network HP LaserJet P1505>
##$CURPRIN= <$Network HP LaserJet P1505>
##$DFORMAT= <normdp>
##$LAYOUT= <+/1D_H.xwp>
##$LFORMAT= <normlp>
##$PFORMAT= <normpl>
##$SURQMSG= 1
$$ End of Bruker specific parameters
$$ ---------------------------------
##NTUPLES= NMR SPECTRUM
##VAR_NAME=  FREQUENCY,     SPECTRUM/REAL,   SPECTRUM/IMAG
##SYMBOL=    X,             R,               I
##VAR_TYPE=  INDEPENDENT,   DEPENDENT,       DEPENDENT
##VAR_FORM=  AFFN,          ASDF,            ASDF
##VAR_DIM=   32768,         32768,           32768
##UNITS=     HZ,            ARBITRARY UNITS, ARBITRARY UNITS
##FACTOR=    0.250966925370066, 1,           1
##FIRST=     8223.43324360095, -81275,       12982
##LAST=      0,             47579,           -167328
##MIN=       0,             -698719,         0
##MAX=       8223.43324360095, 423072729,    0
$$ Real data points
##PAGE= N=1
##DATA TABLE= (X++(R..R)), XYDATA
$$ [...]
$$ plain form
19546 -205056 -118045 1636 22593 -108815 -121011 119548 -412298 -154381 -384935 -174283
19535 -69243 -51957 -237153 -197530 -235219 -221359 -378841 -178661 328484 383413 -87425 113605
19523 -224459 177381 -187544 26058 -60298 -113145 476162 -148687 -365706 167615 82527
19512 352720 -84904 125124 31342 -190860 -9211 -261385 -92321 -61349 132926 -133461 155385
19500 -23109 20234 4352 -96277 -202030 116560 -68087 -187262 158537 217177 -9082 -124200
19489 -124200 -510826 -287059 -232747 336249 39488 -256790 -78686 -147020 -64367 196127
19478 -129718 182053 96008 907 85753 -241953 171678 -171540 -134642 -66327 -95873 1761
19466 123668 144916 -207974 49380 23178 -317855 334593 71080 -166408 -530759 9587 49628
$$ packed form
19546b05056Q7011A636K0957a08815j2196A19548d12298a54381k30554a74283
19535f9243J7286j85196L9623l7689J3860j57482a78661C28484N4929h7425A13605
19523b24459A77381a87544B6058f0298n2847D76162a48687k17019A67615H2527
19512C52720h4904A25124C1342a90860i211k52174i2321L0972A32926a33461A55385
19500b3109B0234D352i6277j05753A16560f8087j19175A58537N8640i082j15118
19489a24200l86626K23767N4312C36249C9488b56790g8686o8334f4367A96127
19478a29718A82053q6045I07Q4846b41953A71678a71540L6898f6327k9546A761
19466A23668K1248b07974D9380B3178c17855C34593G1080a66408l64351I587M0041
$$ plain form
19455 49628 -141522 -15042 -31950 -66004 -164353 -265863 -132332 -116757 -150254 -90800 103543
19443 -294660 98358 45504 -158562 -185 -131562 -193768 -99135 252308 -527307 200542 -253284
19431 -188620 -132820 -273882 -358812 36347 -74803 -166747 -57752 56117 112384 254185 -293467
19419 -235792 -55450 -166558 -34566 -85173 -61879 -354896 -129295 57770 -192629 -24254 62604
19407 197920 132960 -23812 -12223 -188883 356628 -318799 258729 -100674 -301100 312592
19396 -81456 -125990 156424 33596 -114973 -141015 59278 146799 31089 -141855 61483 64979
19385 64979 194140 -98319 18193 -43389 127394 11675 33638 -83351 -187466 -130325 19293
19373 -48232 88230 -323802 -451309 222455 63253 -15633 -72219 -121638 121627 -163231 242185
$$ packed form
19455D9628a41522a5042j6908l4054r8349j01510a32332J5575l3497N9454A03543
19443b94660I8358D5504a58562a85j31377o2206R4633B52308e27307B00542b53284
19431a88620N5800j41062q4930C6347g4803r1944e7752E6117N6267J41801b93467
19419b35792e5450j11108c4566n0607K3294k93017a29295E7770a92629b4254F2604
19407A97920o4960b3812J1589j76660C56628c18799B58729a00674k00426C12592
19396h1456m4534A56424C3596a14973k6042E9278Q7521C1089a41855F1483L496
19385F4979J29161i8319A8193d3389A27394A1675K1963h3351j04115N7141A9293
19373d8232H8230c23802j27507B22455F3253a5633n6586m9419A21627a63231B42185
$$ plain form
19361 -97434 36418 -41047 -28745 -87134 -50477 36416 -1471 -249396 169054 -87257 70183
19349 -134686 -112329 -100296 88649 -191346 -133176 184579 -66122 -101615 40279 -167740 -294794
19338 -294794 -264497 -54913 -42647 -172670 -142874 -84145 40935 -316934 -98435 212473 -259219
19326 -118426 -460716 241582 -258422 -271040 29282 -32732 324315 -87070 56069 -254578
19315 97384 -259395 -175528 -432772 -76917 -56773 -146925 -20880 11757 -68304 -399382 12749
19303 289524 127852 67251 346611 -117529 116201 -176631 -31707 -304482 22644 -13225
19292 -16181 26005 -45572 60893 319332 135061 183592 -118623 128441 -125206 -65256 -319835
19281 -319835 -154747 -1112 -31559 67138 99852 -27139 -128905 -206781 -31547 27712 -337373
$$ packed form
19361i7434C6418d1047J2302n8389L6657C6416a471k47925A69054h7257G0183
19349a34686K2357J2033H8649a91346N8170A84579f6122l5493D0279a67740j27054
19338b94794L0297e4913J2266j30023K9796N8729D0935c16934i8435B12473b59219
19326a18426l42290B41582b58422j2618B9282c2732C24315h7070E6069b54578
19315I7384b59395Q3867k57244g6917K0144r0152b0880A1757f8304l31078A2749
19303B89524A27852o0601K79360a17529A16201a76631c1707k72775B2644a3225
19292a6181B6005d5572F0893K58439A35061M8531a18623A28441a25206N9950k54579
19281c19835a54747a112l0447F7138L2714b7139j01766p7876c1547B7712c37373
$$ plain form
19269 -205445 -169211 -163928 34792 -128333 -266653 111268 -14124 144406 220998 191609 -21925
19257 2900 57763 -128729 -85218 77066 267850 -156621 303393 247511 -208538 -36837 -164793
19246 -164793 38926 -600608 -7730 -104845 -165186 -243472 -308059 -258578 68264 143631 114795
19235 114795 -62303 -138685 92238 209444 -148927 -136403 -184016 -118001 -74204 85744 96652
19224 96652 -1605 -246114 204130 -423106 -114972 -20821 10012 -264842 -246226 -277098 -87068
19212 -257802 -365088 -23715 312517 -184038 -203844 -73498 -221810 -114148 120606 -144429
19201 -158789 -188624 -393179 165692 425736 -45725 -43624 39788 -341979 -23664 -139096 39288
19189 61629 270689 -38732 27983 -75707 57890 38267 -130414 122182 -197566 -129966 188296
$$ packed form
19269b05445L6234N283C4792a28333j38320A11268a4124A44406P6592k9389b1925
19257B900N4863a28729M3511G7066J90784a56621C03393n5882b08538c6837j27956
19246a64793C8926f00608g730r7115o0341p8286o4587M9481F8264P5367k8836
19235A14795f2303p6382I2238J17206a48927J2524m7613O6015M3797H5744J0908
19224I6652a605k44509B04130d23106a14972b0821A0012b64842J8616l0872h7068
19212b57802j07286b3715C12517a84038j9806g3498j48312J07662A20606a44429
19201a58789k9835k04555A65692K60044d5725K101C9788c41979b3664j15432C9288
19189F1629K09060c8732B7983g5707E7890j9623a30414A22182a97566O7600A88296
$$ plain form
19177 -241348 -8168 -51210 -217320 -79674 -49369 6632 178452 -47642 98989 -136264 -53429
19165 -307920 -77384 -92096 -225969 40311 -55876 168035 -278 -399324 -119918 -245311 14393
19153 -55286 86513 17365 132053 145166 -358914 -222311 -113956 -434804 4176 21871 -81983
19141 -367078 -38544 -78697 -75609 -31194 254884 120411 64305 -54054 -268609 254689 179322
19130 179322 -190145 -209119 -143955 156666 253430 316009 -104926 -61808 -15052 -371455 -277971
19119 -277971 151718 -34198 -107937 239323 280610 -53477 -302131 -91498 -87849 116342 -201166
19107 -46212 -242591 -113676 222240 -198012 -39655 47335 -101050 -61333 -129053 -182448 -80
19095 -230677 -920 225261 232338 109109 -66217 168655 -215860 73597 -318973 -206606 -179327
$$ packed form
19177b41348h168m3042j66110g9674L0305F632J71820d7642I8989a36264e3429
19165c07920g7384j4712j33873D0311e5876A68035b78l99046a19918j25393A4393
19153e5286H6513A7365J14688J3113c58914J36603J08355l20848D176J7695h1983
19141c67078c8544m0153L088c1194B54884A20411n6106e4054k14555B54689p5367
19130A79322a90145j8974O5164A56666R6764O2579a04926M3118a5052l56403R3484
19119b77971A51718c4198p3739B39323M1287e3477k48654i1498L649A16342b01166
19107d6212j96379a13676B22240a98012c9655D7335a01050L9717o7720n3395h0
19095b30677i20B25261P077A09109f6217A68655b15860G3597c18973J12367K7279
$$ plain form
19084 -179327 318641 -280014 -145934 -67393 47525 114778 2976 -262783 6458 -37875 -38484
19073 -38484 -85169 -61863 -100329 85653 -173569 101266 -159820 45110 75600 -193044 122029
19061 -13503 -125825 -124159 112213 -90290 -37099 -241552 -161975 -299710 84117 -174908 47925
19049 23865 -102918 -70726 121102 -200136 -127704 359344 -202802 -118421 -136969 22046 -193777
19037 -92505 26391 -6581 -285779 253800 -354607 14496 214946 -71854 56893 30174 135716
19026 135716 66942 -110701 -373628 64182 153358 318664 210927 -91506 57946 38565 -196663
19014 -71882 260900 -42094 40282 -3681 187815 3843 52118 22690 93741 246736 -255037
19002 -190855 -63866 -86330 -160475 -448721 -267703 -510800 213766 -178086 268797 -48594
$$ packed form
19084a79327C18641b80014J34080f7393D7525O7253B976b62783F458c7875o09
19073c8484m6685K3306l8466H5653a73569A01266a59820D5110L0490a93044A22029
19061a3503j12322J666A12213i0290c7099k04453P9577j37735H4117a74908D7925
19049B3865a02918L2192A21102b00136P2432C59344b02802Q4381j8548B2046a93777
19037i2505B6391f581k79198B53800c54607A4496K00450g1854E6893k6719J05542
19026A35716F6942a10701k62927F4182Q9176J65306j07737i1506E7946j9381a96663
19014g1882B60900d2094D0282c681A87815C843M8275B2690P1051J52995b55037
19002a90855f3866k2464p4145k88246J81018k43097B13766a78086B68797d8594
$$ plain form
18991 -180001 -206400 -49867 -511235 -114553 -61609 -359371 61627 22913 -117919 -428577
18981 -428577 -107994 -337709 -191447 -35689 59051 -299201 -75432 -301799 354063 145202
18970 -154080 186906 291352 -213097 -63694 -219461 -160277 -503856 130622 -20081 150090
18959 -216689 -102619 136213 75545 -315433 -145449 208321 -79301 -98045 101398 141908
18949 141908 -254890 287420 -83508 192471 -104222 -194921 290193 85212 -46667 241383
18938 -123233 -284415 -201788 -119228 173595 -200295 -187616 313738 -117974 -52175 207381
18927 -95223 6062 -61730 103778 243231 -185793 -11425 -227411 -144971 69778 -24940 77544
18915 4789 52638 49226 101852 102106 -52342 197010 -191710 -75202 256776 -176457 233977
$$ packed form
18991a80001k6399d9867m61368a14553N2944k97762F1627B2913a17919l10658
18981d28577a07994k29715J46262c5689E9051b99201g5432k26367C54063A45202
18970a54080A86906J04446b13097f3694j55767N9184l43579A30622b0081A50090
18959b16689a02619A36213o0668c15433a45449B08321g9301j8744A01398M0510
18949A41908b54890B87420h3508A92471a04222r0699B90193H5212d6667B41383
18938a23233j61182Q2627Q2560A73595b00295J2679C13738a17974e2175B07381
18927i5223F062f1730A03778J39453a85793a1425k15986Q2440F9778b4940G7544
18915D789M7849l412N2626K54e2342A97010a91710g5202B56776a76457B33977
$$ plain form
18903 -379941 -162570 28419 -58126 34062 54614 -59410 -113603 -441692 -276036 -142519 10999
18891 -456815 21456 58232 -294152 15707 355091 170609 191146 89461 -28903 -301587 151072
18879 -90108 59496 -81227 -166860 -318253 -179253 -316013 -49593 -90296 51479 -93141 9685
18867 -197003 106003 118738 -66403 -259769 -109342 -203003 -97633 207978 -112429 155856
18856 -53371 83216 221547 -157678 -147695 155673 -214536 179090 -25795 -34039 136431 -221979
18844 -121211 85702 -301958 75572 -251453 103255 -80740 106627 -127621 -167182 -155097
18834 -155097 -32666 139800 -234605 -4489 431819 -48280 -211733 177578 -16736 138214
18823 -22842 25905 13299 -4681 -276832 123510 4543 319177 5260 23836 -58249 -130746 -31917
$$ packed form
18903c79941a62570B8419e8126C4062K0552e9410n4193l28089J65656J33517A0999
18891d56815B1456L6776b94152A5707L39384A70609K0537H9461b8903k72684A51072
18879i0108E9496h1227q5633j51393J39000j36760d9593m0703E1479i3141I685
18867a97003A06003J2735f6403j93366a09342r3661i7633B07978a12429A55856
18856e3371H3216J38331a57678R983A55673b14536A79090b5795q244A36431b21979
18844a21211H5702c01958G5572b51453A03255h0740A06627a27621l9561J2085
18834a55097c2666A39800b34605d489D31819d8280j63453A77578a6736A38214
18823b2842B5905j2606d681k72151A23510D543L14634E260J8576e8249p2497c1917
$$ plain form
18810 -1852 164831 -98341 -44536 92890 -141241 -76209 -60444 247012 140716 74726 -79029
18798 89905 222432 -103133 -255059 -122955 -63891 -76108 -35555 11969 -444014 131434
18787 -149572 18348 286194 -166129 -181668 -26920 81344 185027 -278403 -205709 -3025 204030
18775 115930 -44322 419347 -234361 -190977 107113 50090 -13483 150167 -23145 41906 64639
18764 64639 -461666 -31065 276894 -21073 -24150 -237609 -33716 225472 -115920 186700 25103
18752 -110752 -19493 -57850 -84193 -26183 -232826 -159747 -52863 -146153 39144 -41071 -76310
18741 -76310 -128001 -382615 200958 -8401 -40449 -190339 235991 -6833 -93585 56154 -132987
18729 -66540 15411 -41159 253356 154285 -186383 69685 -94611 -93196 -34811 -301527 -150436
$$ packed form
18810a852A64831i8341d4536I2890a41241O5032J5765B47012j06296o5990g9029
18798H9905J32527a03133j51926a22955N9064j2217c5555A1969d44014A31434
18787a49572A8348K67846a66129j5539b6920H1344J03683b78403P2694c025B04030
18775A15930d4322D19347b34361M3384A07113E0090a3483A50167b3145D1906K2733
18764F4639d61666c1065B76894b1073l077k13459c3716B25472a15920A86700B5103
18752a10752a9493l8357k6343b6183k06643P3079e2863r3290C9144d1071l5239
18741g6310n1691k54614B00958h401l2048j49890B35991f833q6752E6154a32987
18729f6540A5411d1159B53356r9071a86383F9685i4611J415c4811k66716a50436
$$ plain form
18717 -73305 41721 -141478 -93744 -114420 -21082 -116393 -44483 -290700 -418167 -101643 -286423
18706 -286423 -52068 -183353 -42753 -564158 186677 193715 -180244 -164726 49723 -214594 84999
18694 355634 198253 72710 118802 189647 -88704 131982 32089 -6790 -263619 22055 -322924
18682 -271051 71623 106793 -107003 -169563 336865 -27080 -116011 69264 -151462 -63910 186630
18670 160451 -329620 148638 91534 286627 88369 214652 -154084 293750 -259478 45178
18659 53724 -38855 24321 -272607 297886 -177086 -98203 94515 26419 95179 -110644 -2377
18647 -216361 -133576 -160849 79111 -168050 -154670 155522 -178220 -138400 80079 181835 193548
18636 193548 -92728 -8808 -378092 -134228 -45773 80925 -247810 214557 -108817 -277836
$$ packed form
18717g3305D1721a41478M7734k0676b1082r5311d4483k46217j27467a01643j84780
18706b86423e2068j31285d2753n21405A86677P038a80244J5518D9723b14594H4999
18694C55634j57381G2710M6092P0845h8704A31982C2089f790k56829B2055c22924
18682b71051G1623L5170a07003o2560C36865b7080q8931F9264a51462f3910A86630
18670A60451c29620A48638n7104J95093H8369J26283a54084B93750b59478D5178
18659E3724c8855B4321b72607B97886a77086P8883I4515B6419O8760a10644b377
18647b16361Q2785k7273G9111a68050J3380A55522a78220L9820H0079J01756J1713
18636A93548i2728h808l69284a34228d5773H0925b47810B14557a08817j69019
$$ plain form
18626 -277836 201432 -87484 65907 -315824 199001 128323 -291186 -98022 -354550 -156110
18615 -152484 -220798 -319979 -556964 -267401 -20720 -105367 79767 -28524 -172851 -20004 -20338
18604 -20338 118080 30670 309383 -416116 5831 45695 -51024 -45995 897 -8296 19587 42178
18592 42178 -86356 -33753 40133 196871 -84704 -94139 95475 -192866 -165272 -126642 105270
18580 369330 172066 -305640 11234 73226 202679 -6187 42585 -81850 197002 -140272 321584
18568 -79353 178120 -117845 53478 80657 -8660 -19170 -407673 -128127 317420 -34596 -240012
18557 -240012 -46339 -101228 17231 -423728 -48200 -127392 30812 -276630 -55584 -167762 -159136
18546 -159136 -234111 -19163 52708 203857 -290748 57900 -163894 -113790 254987 317240 -146929
$$ packed form
18626b77836B01432h7484F5907c15824A99001p0678b91186i8022k56528a56110
18615a52484o8314r9181k36985b67401b0720q4647G9767b8524j44327b0004l34
18604b0338A18080C0670K78713d16116E831L9864e1024N029H97h296A9587K2591
18592D2178h6356c3753D0133J56738h4704r435I5475a92866K7594L8630A05270
18580C69330A72066c05640A1234O1992J29453f187D2585h1850A97002a40272C21584
18568g9353A78120a17845E3478K7179h660j0510l88503a28127C17420c4596k05416
18557b40012d6339n4889A7231d23728d8200p9192C0812b76630e5584j12178Q626
18546a59136p4975a9163E2708J51149b90748E7900a63894N0104B54987O2253a46929
$$ plain form
18534 -97341 -161105 -226403 2753 -55796 171153 -346638 110477 -94494 -41308 205879 -198490
18522 49819 -214336 301679 -76747 230860 -275208 -98382 41518 -74210 -306057 8370 159636
18511 159636 -217523 -229165 -62608 -5952 192256 -455172 -217966 -47468 65166 -477602 -239008
18500 -239008 -247804 -28439 -14440 -109607 -34025 -68795 121821 86071 -73471 -32443 -300112
18489 -300112 -44892 -42895 -439381 -55284 -221265 -411248 36460 -18342 -442217 -21963 -207202
18478 -207202 -6789 -146211 175425 37332 146232 201506 -149683 111124 191558 351661
18468 351661 -115189 -211958 -111357 -234798 -22060 228486 -23153 -301839 -203638 -141647
18458 -141647 104161 -23549 -20768 -321130 -33214 -148626 -217728 -120304 176122 -186131 -60259
$$ packed form
18534i7341o3764o5298B753e5796A71153c46638A10477i4494d1308B05879a98490
18522D9819b14336C01679g6747B30860b75208i8382D1518g4210k31847H370J51266
18511A59636b17523j1642f2608e952A92256d55172b17966d7468F5166d77602K38594
18500b39008q796b8439J3999r5167c4025l4770A21821l5750g3471c2443k67669
18489c00112d4892J997l96486e5284j65981j89983C6460a8342m23875b1963j85239
18478b07202f789j39422A75425C7332J08900N5274a49683A11124Q0434J60103
18468C51661a15189r6769J00601j23441b2060B28486b3153k78686R8201O1991
18458a41647A04161b3549K781l00362c3214j15412o9102R7424A76122a86131f0259
$$ plain form
18446 -194743 9059 28752 -332866 92385 -420362 -187524 -315761 -135322 -91077 -277307
18436 -277307 27366 -11967 -281531 -75263 88553 -22028 105338 413826 33397 210006 -277340
18424 18045 -110102 -23528 10199 -278231 267527 332875 32211 153190 83009 -347222 -60128
18412 -2019 39233 66308 -50395 -114685 -56445 -50997 -115657 -27783 53203 434887 90401 -78885
18399 -20921 126376 -50848 -13331 14628 -201824 -302082 -105733 250803 228915 169172 -28510
18387 -171005 31893 116198 -13153 19390 -226451 55155 137442 -181994 31958 -35173 -141280
18376 -141280 171347 223776 54414 201736 -144106 210295 -70708 81115 -121764 -178605
18366 -178605 -114867 270117 48995 -27498 76392 35226 120801 -191952 -139419 -259216 -93588
$$ packed form
18446a94743I059J9693c32866I2385d20362a87524j28237a35322M4245j86230
18436b77307B7366a1967k69564g5263H8553b2028A05338L08488C3397J76609b77340
18424A8045a10102b3528A0199b78231B67527O5348C2211J20979p0181c47222f0128
18412b019C9233K7075e0395o4290e6445N448o4660b7783E3203L81684I0401g8885
18399b0921A26376e0848a3331A4628b01824j00258a05733B50803k1888n9743b8510
18387a71005C1893Q4305a3153A9390b26451E5155Q2287a81994C1958c5173j06107
18376a41280A71347N2429E4414J47322a44106B10295g0708H1115a21764n6841
18366a78605O3738B70117D8995b7498G6392C5226Q5575a91952N2533j19797i3588
$$ plain form
18354 -131029 -7358 53711 -124752 -8234 99764 35095 123391 -29585 141871 -121637 -97373
18343 -97373 141633 -282627 148913 97923 -59791 -99770 135513 -134184 36097 -306272
18332 -239728 -493044 72904 -43249 -87526 -25036 61828 -167397 219207 195438 -72636 142463
18320 52068 3024 -240341 -155047 -125442 -9976 -16603 -28034 -22900 9763 14741 142310 22308
18307 130773 136867 110352 -207672 -113145 222534 36808 49109 141690 -7157 -345761 -249682
18296 -249682 -117935 -103030 152327 -197265 364302 -260216 -258269 199633 -51715 259066
18285 92944 97072 23339 -248542 73678 -196110 -8806 -68103 -295020 -470732 143263 -122267
18273 124640 -342252 -168589 -17373 394341 -182607 103856 -74547 58811 -258619 193787
$$ packed form
18354a31029g358E3711a24752h234I9764C5095Q8296b9585A41871a21637K4264
18343i7373A41633b82627A48913n0990e9791l9979A35513a34184C6097c06272
18332b39728k53316G2904d3249m4277b5036F1828a67397B19207k3769g2636A42463
18320E2068C024b40341Q5294K9605i976o627j1431N134I763M978J27569B2308
18307A30773O094k6515b07672R4527B22534C6808J2301R2581g157l38604R6079
18296b49682a17935J4905A52327a97265C64302b60216J947A99633e1715B59066
18285I2944M128B3339b48542G3678a96110h806n9297k26917j75712A43263a22267
18273A24640c42252a68589a7373C94341a82607A03856g4547E8811b58619A93787
$$ plain form
18262 -462885 47726 -187564 76892 102166 -208986 -256794 41299 108194 -376331 -18064 -173045
18251 -173045 91656 138271 -261688 291082 -455701 349088 -119468 12203 -255431 -44748
18240 282018 21296 -190775 191154 -273189 226296 51666 1073 31304 -187801 -49669 98148
18228 -386627 -351839 -226088 -443585 -165863 -314211 257582 -297499 -30835 219350 -357891
18217 -46713 -160988 -284172 -59509 107031 5731 -195226 -310749 81467 133975 90419 45722
18206 45722 119870 -359651 221824 80319 -262156 60443 261712 91874 -237600 200990
18195 38654 41582 414639 -307419 -232673 -191997 -99798 -225270 105902 -106920 2586 93957
18184 93957 -54142 -100735 -43931 -130379 -223747 -55179 50342 -244128 -136137 30225 -287624
$$ packed form
18262d62885D7726a87564G6892K5274b08986m7808D1299O6895c76331a8064j54981
18251a73045I1656M6615b61688B91082d55701C49088a19468A2203b55431d4748
18240B82018B1296a90775A91154b73189B26296E1666A073L0231a87801d9669I8148
18228c86627L4788J25751k17497a65863j48348B57582b97499c0835B19350c57891
18217d6713j14275j23184e9509A07031E731a95226j15523H1467N2508m3556m4697
18206D5722P4148c59651B21824H0319b62156F0443K01269I1874b37600B00990
18195C8654K928L73057c07419P4746M0676R2199j25472A05902a06920B586R1371
18184I3957e4142m6593d3931q6448r3368e5179E0342b44128J07991C0225b87624
$$ plain form
18172 -431341 -325427 -33726 95606 -70554 -95547 -97782 57068 -230736 20226 -65111 -462771
18161 -462771 -90918 85334 117807 63599 144739 -432320 -81003 -177817 54603 -40309 -26856
18150 -26856 -197807 3488 -158769 -123556 -312822 66216 44463 73791 34013 190302 124373
18139 124373 -13745 5880 326675 -4646 35845 -229322 297035 103612 133829 102228 57570
18128 57570 117212 255255 -204538 -40895 -233372 20706 -377618 111007 -187447 -6912 193601
18116 -100099 32590 -145933 265853 5930 18009 22058 -338895 86823 -162995 -27402 -20082
18105 -20082 68139 -36472 155101 -103794 -77861 -224753 150911 -24318 -181880 -114001 20431
18093 160943 -78066 84340 -120649 89413 109479 -16832 -61800 16931 94290 9946 -21667
$$ packed form
18172d31341J05914c3726I5606g0554k4993k235E7068b30736B0226f5111l97660
18161d62771i0918H5334L2473n4208Q1140d32320h1003r6814E4603d0309J3453
18150b6856j70951C488a58769L5213j89266F6216k1753K9328C4013J56289o5929
18139A24373a3745E880L20795d646C5845b29322B97035A03612L0217l1601m4658
18128E7570N9642J38043b04538d0895j92477B0706c77618A11007a87447f912A93601
18116a00099C2590a45933B65853E930J2079M049c38895H6823a62995b7402P320
18105b0082F8139c6472A55101a03794K5933j46892A50911b4318j57562O7879B0431
18093A60943g8066H4340a20649H9413K0066a6832m4968A6931P7359I946b1667
$$ plain form
18081 259771 -63858 -86538 64999 82008 -327033 273174 31182 495595 -2072 235252 217713
18070 217713 -247618 -206576 217582 -153009 69383 -95554 52018 18064 -53006 -986 -77148
18059 -77148 213380 -248352 -144128 41938 -282756 -60850 233254 -269872 40929 -91237
18048 -210134 -185422 -154288 170535 -163345 -137705 173567 183074 -207821 -106407 -185582 -396854
18037 -396854 40154 -152869 -1861 291858 -208135 10588 110599 -235028 309987 -393161
18026 -178025 -446053 63804 -2972 -27290 79345 241856 -205671 182803 84537 -17452 90092
18014 93034 -219193 181927 -143745 -19818 250631 -199146 -134332 -60608 -299630 108278
18003 -142215 117680 -53176 -247509 107486 -145829 61472 -337403 -17667 84842 208050
$$ packed form
18081B59771f3858k2680F4999J7009c27033B73174C1182M64413b072B35252j7539
18070B17713b47618M1042B17582a53009F9383i5554E2018A8064e3006i86p6162
18059g7148B13380b48352J04224D1938b82756f0850B33254b69872D0929i1237
18048b10134K4712L1134A70535a63345K5640A73567R507b07821J01414p9175k11272
18037c96854D0154a52869a861B91858b08135A0588J00011b35028C09987c93161
18026a78025k68028F3804b972k4318G9345J62511b05671A82803H4537a7452I0092
18014I3034b19193A81927a43745a9818B50631a99146O4814f0608k39022A08278
18003a42215A17680e3176j94333A07486a45829F1472c37403a7667H4842J23208
$$ plain form
17993 208050 -53658 -128246 45554 139428 -475 33024 -13053 -38793 -371140 -425618 -194708
17981 187940 86958 13460 -113623 19211 -72188 -149138 -180602 28011 371396 -53186 323458
17969 -128721 56121 -65176 -127137 203974 -92609 -40724 -73474 -122608 -170322 255047 -222806
17957 -33333 257728 110310 238418 -84389 -29612 -270491 60006 114598 -119333 100530
17946 -177597 13988 -230123 -249559 272348 33678 -226007 -68728 112596 -131062 -224967
17936 -224967 -83725 65935 166225 -155954 -66163 -126019 -168976 72851 279897 128319 163234
17925 163234 -57967 20374 104001 222631 -152281 -188145 85713 -21331 -135891 -69559 308342
17913 175612 -300976 14957 -140763 -243008 51936 -312786 -18676 12485 -54845 -410618
$$ packed form
17993B08050e3658p4588D5554R3874d75C3024a3053k5740l32347n4478a94708
17981A87940H6958A3460a13623A9211g2188p6950l1464B8011L43385e3186C23458
17969a28721E6121f5176o1961B03974i2609d0724l2750m9134m7714B55047b22806
17957c3333B57728A10310J28108h4389b9612k40879F0006N4592a19333A00530
17946a77597A3988b30123j9436B72348C3678b26007f8728A12596a31062r3905
17936b24967h3725F5935J00290a55954f6163n9856m2957G2851K07046A28319L4915
17925A63234e7967B0374Q3627J18630a52281l5864H5713b1331j14560O6332C08342
17913A75612c00976A4957a40763j02245E1936c12786a8676A2485e4845l55773
$$ plain form
17903 -410618 -99874 132064 6871 54925 -271175 -22971 -143675 -30838 -201246 -142423 -219805
17892 -219805 -115088 72005 -159676 70800 -51642 -154449 126151 -191195 394535 51520
17881 -91266 -198244 219123 -393224 -229236 101781 16204 -45018 -171176 216595 310194
17871 310194 148390 -10247 -14085 31300 21944 78797 154534 -119872 -61669 -261076 -55776
17859 -46206 -135495 -22409 17726 -320927 99439 115122 22323 133170 21466 -176222 136933
17847 -206708 49177 -307207 121223 -23579 -16904 -130524 69212 -242459 167184 117209 163771
17836 163771 -328444 -56824 195471 -81241 -359444 -110210 282809 -102649 -68311 161105
17825 -311984 134286 387226 344522 -32825 -150396 -88170 -152283 -21002 13489 409194 171929
$$ packed form
17903d10618i9874A32064F871M8054b71175b2971j20704c0838j70408N8823p7382
17892b19805J04717G2005a59676G0800e1642j02807A26151a91195C94535E1520
17881i1266j06978B19123c93224J63988A01781A6204d5018j26158B16595R3599
17871C10194A48390a0247l838C1300r356N6853P5737a19872N8203j99407e5776
17859d6206q9289b2409A7726c20927I9439J5683B2323J10847B1466a76222A36933
17847b06708D9177c07207A21223b3579O675j13620F9212b42459A67184m9975M6562
17836A63771c28444e6824A95471h1241k78203a10210B82809a02649L4338A61105
17825c11984A34286K52940m2704c2825j17571O2226o4113b1002A3489L95705A71929
$$ plain form
17813 162257 154012 -144738 211424 138829 145701 134666 -113830 26265 -85513 249361 308960
17802 308960 26136 -175252 -327667 -19711 -151419 190923 357329 -126225 53486 362693
17792 362693 231754 -4152 -117026 -436097 -74570 -416 87542 69155 -124046 -308724 279370
17780 34047 -167097 62846 193084 18980 -144994 -30498 -282633 -184030 -271344 4352 -470651
17768 24563 -22113 110163 89744 85443 -140667 -37570 -225974 -269396 -246201 90250 44336
17756 95356 26942 143706 190528 -220371 -160695 -24555 -15083 38270 73838 252237 -179496
17744 -86880 -206872 -129398 55151 -237550 -67169 390415 -428212 -147293 13714 -276975
17733 63482 209272 -46803 -8224 -77162 -344673 3591 19568 -174617 -59313 140466 -59141
$$ packed form
17813A62257q245a44738B11424p2595O872j1035a13830B6265h5513B49361N9599
17802C08960B6136a75252j52415a9711j31708A90923J66406a26225E3486L09207
17792C62693j30939d152j12874l19071g4570d16H7542j8387a24046j84678B79370
17780C4047a67097F2846J30238A8980a44994c0498k52135R8603q7314D352d70651
17768B4563b2113A10163k0419m301a40667c7570j88404m3422K3195I0250D4336
17756I5356B6942J16764M6822b20371N9676b4555R472C8270L5568J78399a79496
17744h6880j19992P7474E5151b37550f7169C90415d28212a47293A3714b76975
17733F3482J45790d6803h224o8938k67511C591J5977a74617e9313A40466e9141
$$ plain form
17721 84668 -352704 149069 224196 161731 11125 53310 162137 62523 -106032 -67903 -134721
17710 -134721 71743 -248599 332851 -202747 180978 -165998 113679 280854 103423 -243870
17699 143674 80393 -320004 -187539 264024 -68311 -116263 -232147 49380 37594 -70668 26863
17687 295397 419454 -94518 66716 242697 -142012 252499 57412 111762 65731 45657 -216432
17675 31213 238047 15514 -88384 -109949 94756 -54880 136258 201084 23415 -373487 -111606
17663 -238138 230585 39651 -102779 -66697 -37880 155996 52996 42796 192556 -44412 -146615
17652 -146615 13799 210020 -24055 -195704 -152477 -223802 -315113 -192974 -187112 -94022 -17268
17640 -131857 -306136 467801 150139 366925 -150434 -19090 283330 -30707 111955 114698
$$ packed form
17721H4668c52704A49069P5127o2465A1125M2185J08827F2523a06032L8129o6818
17710a34721G1743b48599C32851b02747A80978a65998A13679J67175A03423b43870
17699A43674o3281c20004J32465B64024f8311m7952j15884D9380j1786g0668B6863
17687B95397J24057i4518F6716J75981a42012B52499E7412N4350m6031k0074b16432
17675C1213K06834A5514h8384k1565I4756e4880A36258O4826B3415c73487a11606
17663b38138B30585C9651a02779L6082K8817A55996E2996j0200J49760d4412j02203
17652a46615A3799J96221b4055j71649M3227p1325r1311J22139N862R3090a7268
17640a31857j74279D67801A50139K16786a50434a9090B83330c0707A11955K743
$$ plain form
17630 114698 -230359 108834 154458 -20300 -360073 -268302 40497 79095 -144531 -21269 181419
17618 131524 17974 26590 289011 -30210 193113 -240244 223823 51144 167326 -9755 389985
17606 54040 200100 -212931 -124442 -205792 -64797 29924 202113 -386725 -76025 122821 123291
17595 123291 86604 -17004 -224932 126392 147484 -124655 -5345 28131 -68755 -55970 47138
17583 86119 116538 -11505 38339 -7793 -3745 159041 137385 52065 160561 -16427 -87828 272364
17570 -339055 -247654 -33007 -75394 189342 -156897 -163401 -96416 49252 22422 -23558 68936
17558 -290303 -141469 -44359 91997 41662 75072 229425 193856 180872 -104721 251185 -13202
17546 -109674 -71554 -296230 -22123 323726 337250 -238678 195884 39967 -80389 206463
$$ packed form
17630A14698b30359A08834M5624b0300l39773R1771D0497L8598a44531b1269A81419
17618A31524A7974Q616K62421c0210A93113b40244B23823E1144J16182i755C89985
17606E4040J46060b12931Q8489q1350f4797B9924J72189c86725g6025A22821M70
17595A23291l6687a7004k07928A26392K1092a24655e345B8131f8755J2785D7138
17583H6119L0419a1505C8339g793c745A59041k1656E2065J08496a6427p1401B72364
17570c39055R1401c3007m2387A89342a56897o504O6985D9252B2422b3558F8936
17558b90303a41469d4359I1997D1662L3410J54353l5569j2984a04721B51185a3202
17546a09674L8120k24676b2123C23726J3524b38678A95884C9967h0389B06463
$$ plain form
17535 -35244 -352123 -253066 407588 379064 171457 118252 113008 308274 -79931 -283550 221008
17523 -197136 43650 143095 169301 -75801 277618 337548 -111315 174708 -59110 297290 350332
17512 350332 -283514 244879 43398 59771 396996 230251 75690 249211 351296 175471
17501 -83038 -96676 -63558 -39149 144310 -18550 310062 43150 185034 167265 -44212 184266
17489 158639 55434 -210790 266856 5751 -9264 328950 87749 70789 -13423 -190029 -34903
17477 113484 342776 5332 161806 23304 479183 -210648 173625 -41411 468337 240071
17467 240071 233283 -73348 342964 -85469 -25458 16551 824 10032 32823 127560 35411 250468
17455 250468 244675 424141 138408 -310423 -230106 127499 -7317 338407 92175 247405 308171
$$ packed form
17535c5244l16879R9057D07588k8524A71457n3205n244J95266g9931k03619B21008
17523a97136D3650R9445K6206g5801B77618N9930a11315A74708e9110B97290N3042
17512C50332b83514B44879D3398J6373L37225j66745G5690J73521J02085A75471
17501h3038j3638L3118K4409A44310a8550C10062D3150J41884j7769d4212A84266
17489A58639E5434b10790B66856E751i264C28950H7749j6960a3423j76606c4903
17477A13484K29292E332J56474B3304M55879b10648A73625d1411D68337k28266
17467B40071o788g3348C42964h5469b5458A6551H24R208K2791R4737C5411K15057
17455B50468n793J79466A38408c10423Q0317A27499g317C38407I2175J55230O0766
$$ plain form
17444 308171 223613 158217 -25912 89088 467683 132525 433342 274143 290428 455462
17434 455462 523588 36527 320818 236912 126537 30790 225115 122082 357315 111061
17423 99332 51538 221223 121908 -5274 415637 228275 -49610 79033 -128911 -32176 334057
17411 169285 222613 268011 -297341 -31582 -94204 247812 457254 76733 -136586 208361
17400 416052 479847 321918 176103 31967 -3920 301104 279229 140746 201608 -313606 128493
17388 184324 19579 -146549 73160 86142 305133 293492 161076 114229 133900 150227 -51991
17376 -63307 188677 -167388 208249 -120442 -59067 355177 104020 147188 193359 330762
17366 330762 144795 -12379 293742 -177962 192314 264143 75118 115374 -37632 382402
$$ packed form
17444C08171q4558o5396b5912H9088L78595A32525L00817j59199J6285J65034
17434D55462O8126C6527K84291q3906j10375C0790J94325j03033K35233A11061
17423I9332m7794J69685r9315e274D15637j87362d9610G9033a28911c2176C34057
17411A69285N3328M5398b97341c1582o2622B47812K09442G6733a36586B08361
17400D16052O3795j57929j45815C1967c920C01104k1875j38483O0862c13606A28493
17388A84324A9579a46549G3160J2982K18991j1641j32416m6847J9671J6327e1991
17376f3307A88677a67388B08249a20442e9067C55177A04020M3168M6171J37403
17366C30762A44795a2379B93742a77962A92314P1829G5118M0256c7632C82402
$$ plain form
17355 76999 440134 192879 -178020 -45806 15194 -283281 171474 -72820 -85621 -147695 -62935
17343 305270 4989 -1351 -142033 147911 -199158 -66422 398792 64788 273674 -10921 -243728
17332 -243728 -24039 192890 -186712 293667 -207984 351702 -185420 257966 -77822 418220
17321 -77184 113817 189627 229565 176337 147199 -132024 -133259 -314447 257874 -210254 -89076
17309 -21366 140920 194243 -224639 382756 -211383 -56015 58268 81765 -36133 74776 209819
17298 209819 -79533 196666 79378 137655 260511 -207426 -80258 75359 122924 59370 -200640
17286 291590 200200 -341020 191854 237204 86054 265160 249773 202454 71027 156989 64906
17274 219869 335262 370140 186170 -78378 186403 156456 24476 171810 263675 282645 330455
$$ packed form
17355G6999L63135A92879a78020d5806A5194b83281A71474g2820j2801o2074f2935
17343C05270D989a351j40682A47911a99158f6422C98792F4788K08886a0921k32807
17332b43728b4039A92890a86712B93667b07984C51702a85420B57966g7822D18220
17321g7184A13817P5810L9938n3228k9138a32024j235j81188B57874b10254h9076
17309b1366A40920N3323b24639C82756b11383e6015E8268K3497c6133G4776J35043
17298B09819g9533A96666G9378N8277J22856b07426h0258G5359M7565E9370b00640
17286B91590r1390c41020A91854M5350H6054J79106j5387m7319G1027Q5962F4906
17274B19869J15393L4878j83970g8378A86403k9947B4476J47334R1865J8970M7810
$$ plain form
17263 330455 307719 153895 71442 -297970 312690 4894 370203 62255 342562 261439 275565
17252 275565 -284511 33355 221263 74852 -188994 200039 1492 -99800 262450 100386
17241 83051 100128 263459 33690 -163342 -94231 101060 -20944 121952 -23755 -44103 2282
17229 -95572 344867 42334 112692 -198012 224568 152132 292207 -58181 59665 -134165 14397
17217 369811 417591 145476 65456 457698 121653 -150953 -4836 163582 337416 166923
17206 22090 184833 -105529 -26305 252338 151406 192183 134483 -13817 -101248 349657 136468
17194 291481 -2818 -131284 380695 169938 229769 -13495 73060 127968 166736 181688 76741
17182 584890 -21577 317608 -108766 -258179 14427 313213 155793 94465 252379 156733
$$ packed form
17263C30455k2736j53824G1442b97970C12690D894L65309F2255K80307q1123J4126
17252B75565b84511C3355J87908G4852a88994B00039A492i9800B62450A00386
17241H3051J7077J63331C3690a63342O9111A01060b0944A21952b3755k0348B282
17229i5572C44867D2334P0358a98012B24568p2436J40075e8181E9665a34165A4397
17217C69811M7780A45476F5456L92242A21653a50953d836A63582J73834A66923
17206B2090J62743a05529b6305B52338j00932M0777n7700a3817q7431C49657A36468
17194B91481b818j28466C80695A69938N9831a3495G3060N4908L8768J4952G6741
17182E84890b1577C17608a08766j49413A4427K98786A55793o1328J57914r5646
$$ plain form
17172 156733 221198 203401 246456 214125 -59433 265383 -123438 206161 124823 304169 -9817
17160 269396 559768 841160 403317 353991 382930 316762 350776 256780 498212 194229
17149 290034 146491 505274 57340 -10018 283504 35939 302941 381159 460275 287695
17139 287695 201534 233944 317337 432200 -31756 162325 290129 336704 244767 197331 -70818
17127 97290 -52805 382610 146266 72444 465370 211342 380099 393131 430307 95125 91924
17116 91924 526553 364804 387996 140950 365870 371388 510536 55672 647829 378432
17106 378432 110417 487964 522040 273013 382925 291399 491613 534866 246973 158121
17096 158121 276779 386899 91557 165009 300247 450384 602463 263049 281005 53232
$$ packed form
17172A56733O4465j7797M3055l2331e9433B65383a23438B06161q1338J79346i817
17160B69396K90372K81392D03317m9326K8939o6168L4014r3996K41432A94229
17149B90034j43543L58783E7340a0018B83504C5939K67002P8218P9116j72580
17139B87695q6161L2410Q3393J14863c1756A62325J27804M6575r1937m7436g0818
17127I7290e2805C82610A46266G2444L92926B11342J68757J3032L7176I5125l201
17116I1924M34629j61749K3192A40950K24920N518J39148E5672N92157k69397
17106C78432A10417L77547L4076k49027J09912r1526K00214M3253B46973q8852
17096A58121J18658J10120I1557P3452J35238J50137J52079B63049J7956E3232
$$ plain form
17085 320869 308353 602536 644815 345859 180930 327927 423986 493637 392559 321291
17075 321291 465270 354820 94532 332552 351127 333891 388585 248956 377052 264894
17065 264894 334487 439897 102443 278502 526820 165249 290431 282884 153267 472743
17055 472743 404338 501686 403672 433243 303557 337863 246619 370410 592056 77054 446366
17044 446366 504475 291421 569128 297422 669930 80426 588079 379767 385141 581525
17034 581525 571391 286803 113318 250152 278230 454216 503268 344163 269472 436353
17024 436353 733706 982115 330521 629291 487202 527203 245624 358728 513870 786695
17014 786695 226459 262706 643257 -63306 585361 693964 273673 688047 490137 610681
$$ packed form
17085C20869j2516K94183M2279k98956j64929J46997R6059O9651j01078p1268
17075C21291J43979j10450I4532K38020J8575j7236N4694j39629J28096j12158
17065B64894O9593J05410A02443J76059K48318A65249J25182p547j29617L19476
17055D72743o8405R7348r8014K9571j29686L4306r1244J23791K21646G7054L69312
17044D46366N8109k13054K77707k71706L72508H0426N07653k08312N374J96384
17034E81525j0134k84588A13318J36834K8078J75986M9052j59105p4691J66881
17024D36353K97353K48409C30521K98770j42089M0001B45624J13104J55142K72825
17014G86695B26459L6247L80551f3306E85361J08603B73673M14374j97910J20544
$$ plain form
17004 610681 384162 510541 338792 418547 518269 517774 590142 578872 622802 269526 476353
16993 476353 649262 471326 290809 261858 658867 315721 706800 1023679 570520 542792
16983 542792 849907 827802 750941 815634 748786 551235 537263 611366 1017959 761021 796495
16972 796495 770491 404159 667484 1017238 986731 650419 601965 536648 886536 1003633
16962 1003633 743690 809327 450913 886520 977507 953396 1045328 1054846 917791 521551
16952 521551 605188 832070 878039 930020 974905 942874 494853 774494 825758 566333 456618
16941 456618 1033555 699233 878750 946508 740428 1102294 873634 694214 994851 1012100
16931 1012100 1168905 1035581 990399 922975 1021915 1196183 1365008 924063 873650 927804
$$ packed form
17004F10681k26519J26379j71749P9755R9722m95P2368j1270M3930B69526K06827
16993D76353J72909j77936j80517k8951L97009C15721L91079L16879m53159k7728
16983E42792L07115k2105p6861O4693o6848j97551j3972P4103M06593k56938L5474
16972G96495k6004l66332K63325L49754l0507l36312m8454o5317L49888J17097
16962A003633k59943O5637l58414M35607R0987k4111R1932R518j37055l96240
16952E21551Q3637K26882M5969N1981M4885l2031m48021K79641N1264k59425j09715
16941D56618N76937l34322J79517O7758k06080L61866k28660j79420L00637J7249
16931A012100J56805j33324m5182o7424R8940J74268J68825m40945n0413N4154
$$ plain form
16921 927804 1216886 1268049 1379711 899542 1276586 739248 1085485 1127194 1247631 999407
16911 999407 1194510 923059 1308589 983289 1050082 1159524 1247928 1418390 1178950 1222631
16901 1222631 1121600 1392596 1588991 1723945 1119818 1580894 1326550 1326490 1441943 1331554
16891 1331554 1501232 1424127 1444464 1530730 1561588 1583367 1224233 1593504 1636253 1506486
16881 1506486 1319339 1669756 1636730 1801523 1643669 1752577 1890189 1668780 1658588 1791164
16871 1791164 1542535 1891445 2016014 1916082 2067739 1879213 2096591 2482654 2187433 1991828
16861 1991828 1948121 2008564 2083971 2099664 1912814 2251661 2074862 2342427 2347783 1967746
16851 1967746 2337267 2492634 2375199 2563125 2317246 2686931 2401227 2477333 2654549 2859710
$$ packed form
16921I27804K89082N1163J11662m80169L77044n37338L46237M1709J20437k48224
16911I99407J95103k71451L85530l25300O6793J09442Q8404J70462k39440M3681
16901A222631j01031K70996J96395J34954o04127M61076k54344o0J15453j10389
16891A331554J69678p7105K0337Q6266L0858K1779l59134L69271M2749j29767
16881A506486j87147L50417l3026J64793j57854J08908J37612k21409j0192J32576
16871A791164k48629L48910J24569r9932J51657j88526K17378L86063k95221j95605
16861A991828m3707O0443P5407J5693j86850L38847j76799K67565N356l80037
16851A967746L69521J55367j17435J87926k45879L69685k85704P6106J77216K05161
$$ plain form
16841 2859710 2633015 2493300 2420831 2812197 2750536 2762991 2891329 3276416 3051948 3136230
16831 3136230 3071440 3222100 3173415 2983495 3172787 3320793 3370468 3299666 3528651 3885761
16821 3885761 3581193 3813461 3518519 3590835 3719231 4284166 3996430 4009783 4121725 4249090
16811 4249090 4308125 4339388 4329302 4660380 4624498 4471924 4693296 4700796 4719478 5047705 5213875
16800 5213875 5371721 5364123 5259983 5558411 5809814 5768298 5903076 6003532 6155312 6133146
16790 6133146 6784036 6784647 6752080 6717360 7301136 7347086 7473679 7559619 8058745 7961745 8288510
16779 8288510 8351480 8244620 8473974 8623828 9113493 9377687 9916504 10103220 10278934 10301608
16769 10301608 10695245 11030236 11203284 11910550 11738308 12183876 12630506 13313832 13481961
$$ packed form
16841B859710k26695j39715p2469L91366o1661J2455J28338L85087k24468Q4282
16831C136230o4790J50660m8685j89920J89292J48006M9675p0802K28985L57110
16821C885761l04568K32268k94942P2316J28396N64935k87736J3353J11942J27365
16811D249090N9035L1263j0086L31078l5882j52574K21372P500J8682L28227J66170
16800E213875J57846p598j04140K98428K51403m1516J34778J00456J51780k2166
16790F133146O50890O11l2567l4720N83776M5950J26593Q5940M99126r7000L26765
16779H288510O2970j06860K29354J49854M89665K64194N38817J86716J75714K2674
16769A0301608L93637L34991J73048P07266j72242M45568M46630O83326J68129
$$ plain form
16760 13481961 13744837 14220782 14943436 15047477 16284887 16282906 16805023 17761952 18496155
16751 18496155 18687190 19808077 20020100 20880509 21645740 22735636 23575884 24576155 25493351
16742 25493351 26569716 27496232 28977637 30355218 31853496 33406782 34704899 36224900
16734 36224900 37929654 39707247 41848267 43703472 46600039 48893646 51476695 54416532
16726 54416532 57501059 60849951 64425219 68345799 72048210 76751203 81622456 86594590
16718 86594590 92364290 97843673 104011128 110865953 117464847 124611232 131862009 139736142
16710 139736142 147143894 154692524 161864752 168843548 175459068 181023178 186307819 189686149
16702 189686149 192045823 192970788 192414857 190732000 187517090 182708991 176937689 170774278
$$ packed form
16760A3481961K62876M75945P22654J04041J237410j981N22117R56929P34203
16751A8496155J91035J120887K12023Q60409P65231J089896Q40248J000271R17196
16742B5493351J076365R26516J481405J377581J498278J553286J298117J520001
16734C6224900J704754J777593K141020J855205K896567K293607K583049K939837
16726E4416532L084527L348892L575268L920580L702411M702993M871253M972134
16718H6594590N769700N479383O167455O854825O598894P146385P250777P874133
16710A39736142P407752P548630P172228O978796O615520N564110N284641L378330
16702A89686149K359674R24965n55931j682857l214910m808099n771302o163411
$$ plain form
16694 170774278 163384055 155763030 147972294 139877858 131999909 124431543 116347472 109485088
16686 109485088 102630462 95894147 89894311 83957266 78717696 73922125 68972930 64708274
16678 64708274 60571913 56852766 52946788 50641253 47506763 44985877 42131523 39820177
16670 39820177 37865204 35716089 34106028 32107928 30497876 29663068 27961877 26777134
16662 26777134 25102881 24409953 22922489 21971465 21128486 20319985 19187421 18207346 18143342
16653 18143342 16933247 16255349 15938624 15139317 14663663 14176818 13296668 13324034 12785130
16644 12785130 12124715 12140104 11535453 10899374 10892080 10454128 10096716 10045214 9382962 9287670
16634 9287670 8757715 8610560 8842417 8290360 7575726 7602266 7940978 7371886 7217063 7010164
$$ packed form
16694A70774278p390223p621025p790736q094436p877949p568366q084071o862384
16686A09485088o854626o736315n999836n937045n239570m795571m949195m264656
16678F4708274m136361l719147l905978k305535l134490k520886k854354k311346
16670C9820177j954973k149115j610061j998100j610052q34808j701191j184743
16662B6777134j674253o92928j487464r51024q42979q08501j132564r80075o4004
16653A8143342j210095o77898l16725p99307m75654m86845q80150K7366n38904
16644A2785130o60415J5389o04651o36079p294m37952l57412n1502o62252r5292
16634I287670n29955j47155K31857n52057p14634K6540L38712n69092j54823k06899
$$ plain form
16624 7010164 6719570 6893179 6453900 6377685 6622393 5675100 6093927 5763779 5491771 5350232
16614 5350232 5429631 4990804 4928818 4801279 4606063 4746412 4717122 4692210 4583659 4028696
16604 4028696 4165786 4174816 3974730 3794709 3752160 3862513 3610347 3900191 3673018 3431983
16594 3431983 3559043 3270800 3057593 3197633 3205077 2991700 2999037 2934183 2900965 2740664
16584 2740664 2929515 2776580 2566238 2785018 2576808 2776669 2343124 2806681 2389857
16575 2389857 2361969 2297907 2171311 2689897 2128989 2207226 1903444 1949779 2091754 2189847
16565 2189847 1763032 1907908 1889195 1723508 1846412 2141743 2034800 1645545 1800626 1612659
16555 1612659 1562698 1772919 2015446 1582383 1584191 1678859 1522545 1456054 1234659 1482044
$$ packed form
16624G010164k90594J73609m39279p6215K44708r47293M18827l30148k72008j41539
16614E350232P9399m38827o1986j27539j95216J40349k9290k4912j08551n54963
16604D028696J37090R030k00086j80021m2549J10353k52166K89844k27173k41035
16594C431983J27060k88243k13207J40040P444k13377P337o4854l3218j60301
16584B740664J88851j52935k10342K18780k08210J99861m33545M63557m16824
16575B389857k7888o4062j26596N18586n60908P8237l03782M6335J41975R8093
16565B189847m26815J44876j8713j65687J22904K95331j06943l89255J55081j87967
16555A612659m9961K10221K42527m33063J808R4668j56314o6491k21395K47385
$$ plain form
16545 1482044 1636849 1213068 1228730 1557679 1724144 1291331 954946 1553785 1171057 1600964
16535 1600964 1465239 1355603 1196037 1205548 1094384 1259803 1270348 1030106 1297720 1050100
16525 1050100 1174924 1193964 837578 1172574 1269513 1192338 1096067 1125903 1089742 1167910 1188624
16514 1188624 965736 1356665 1065923 944631 1042953 861877 1120453 1198808 785047 816058
16504 816058 723629 802565 923037 941345 940923 873637 760400 706067 872947 842284 815464
16493 815464 735335 924138 620876 977425 626715 604483 855173 309175 1201101 718188
16483 718188 602818 724334 460038 700808 711789 520148 664189 777362 704956 890591
16473 890591 474150 620693 684875 565208 810933 648372 481401 810318 513276 893616
$$ packed form
16545A482044J54805m23781J5662L28949J66465m32813l36385N98839l82728M29907
16535A600964j35725j09636j59566R511j11164J65419J0545k40242K67614k47620
16525A050100J24824J9040l56386L34996R6939p7175r6271K9836l6161P8168K0714
16514A188624k22888L90929k90742j21292R8322j81076K58576P8355m13761L1011
16504H16058r2429P8936J20472J8308m22o7286j13237n4333J66880l0663k6820
16493H15464q0129J88803l03262L56549l50710k2232K50690C09175Q91926m82913
16483G18188j15370J21516k64296K40770J0981j91641J44041J13173p2406J85635
16473H90591m16441J46543O4182j19667K45725j62561j66971L28917k97042L80340
$$ plain form
16463 893616 550529 783124 773418 753622 925912 540896 369352 424798 657703 882741
16453 882741 479719 96954 472270 623190 301571 608894 522713 701650 623482 583928
16443 583928 877023 360097 610445 524697 724031 827880 677173 646697 517068 542723
16433 542723 326228 468065 510217 358859 477300 216404 503786 -102568 578590 201889
16422 399097 644870 434131 311002 310769 395421 320422 515655 282884 400254 397564 460549
16411 460549 481622 605786 425025 342655 298991 335189 339940 596192 253052 212869 251454
16400 251454 358609 410819 303060 208604 219487 244857 315146 694395 534506 370319
16390 370319 242954 340764 120261 326327 116873 94309 577674 291277 122598 98817
$$ packed form
16463H93616l43087K32595r706j9796J72290l85016j71544N5446K32905K25038
16453H82741m03022I6954L75316J50920C01571L07323q6181J78937p8168l9554
16443E83928K93095C60097K50348q5748J99334J03849j50707l0476j29629K5655
16433E42723k16495J41837M2152j51358J18441B16404K87382a02568E78590B01889
16422C99097K45773k10739j23129k33Q4652p4999J95233k32771J17370k690O2985
16411D60549K1073J24164j80761q2370m3664L6198M751K56252B53052m0183L8585
16400B51454J07155N2210j07759r4456J0883K5370P0289L79249j59889j64187
16390C70319j27365R7810A20261K06066A16873k2564M83365k86397A22598k3781
$$ plain form
16380 98817 314991 240778 291287 108447 422911 193742 556274 416470 469913 726787
16370 726787 27996 215080 38657 386566 278507 -24270 182593 285543 207752 285628
16360 285628 534286 95485 24563 222263 130107 388981 155545 254713 211305 136477 404356
16349 404356 281718 83989 437700 255956 19864 23183 173181 306787 322361 87180 108053
16338 108053 -19437 265606 -2875 356166 211753 370812 57539 454969 -5598 179143 364373
16327 364373 407570 161200 114855 206553 89054 90286 185556 -254651 88607 13057 155364
16316 155364 145571 630059 391838 584879 272721 61235 154293 -217285 342506 118510
16305 119068 505163 10222 164257 275478 283341 228756 224483 239208 122243 73793 -24574
$$ packed form
16380I8817K16174p4213N0509A08447L14464A93742L62532j39804N3443K56874
16370G26787B7996J87084C8657L47909j08059b4270A82593J02950p7791P7876
16360B85628K48658I5485B4563J97700r2156K58874A55545R9168m3408p4828K67879
16349D04356j22638H3989L53711j81744A9864L319J49998J33606J5574H7180K0873
16338A08053a9437B65606b875C56166j44413J59059E7539L97430e598A79143J85230
16327C64373M3197A61200m6345R1698H9054J232R5270b54651H8607A3057J42307
16316A55364r793M84488k38221J93041B72721F1235R3058b17285C42506A18510
16305A19068L86095A0222J54035J11221P863n4585m273J4725j16965m8450b4574
$$ plain form
16293 255032 -130652 -52465 465520 51182 -61011 240145 103170 -166916 -161894 107312
16282 148938 44554 416231 103123 130214 -37489 125802 -4822 314953 194412 267546 -9848
16270 322945 172282 31679 206641 -155368 -121654 257656 466068 309155 99554 362595
16260 362595 -12823 -36719 344703 19844 134455 386556 91570 136947 267872 294317 369373
16249 369373 -78032 346905 380699 257179 -95971 196240 -9954 -87094 -62595 -182347 221236
16237 -160712 132800 289925 -77825 -117907 -150551 -30847 172645 41653 193324 -29059 510349
16225 40466 237252 238142 205233 57725 -115814 -10699 -39617 173356 179426 -161619 38925
16213 321589 128555 -57415 48165 279366 -16809 -213166 66999 96817 270717 333078 107243
$$ packed form
16293B55032a30652e2465D65520E1182f1011B40145A03170a66916N022A07312
16282A48938D4554L71677A03123K7091c7489A25802d822C14953j20541P3134i848
16270C22945j50663C1679J74962a55368L3714B57656K08412j56913I9554K63041
16260C62595a2823k3896C44703A9844J14611K52101I1570M5377J30925K6445P5056
16249C69373g8032C46905L3794j23520i5971A96240i954p7140K4499j19752B21236
16237a60712A32800J57125g7825m0082l2644c0847A72645D1653J51671b9059E10349
16225D0466J96786Q90l2909E7725a15814a0699k8918A73356O070a61619C8925
16213C21589A28555e7415D8165K31201a6809j96357F6999K9818J73900O2361A07243
$$ plain form
16201 -170754 60092 -134257 350414 43888 101516 -164783 92070 163204 55562 118737 240764
16190 240764 69049 -39162 -11112 -70999 9245 124927 -203660 134305 26147 -75939 -194229
16179 -194229 73036 287826 395414 -16137 -46643 -225125 59619 95839 51524 -60675 110929
16167 171660 88533 74551 304776 39690 189750 169099 108805 94674 -74939 111985 -140370
16155 -55274 -327702 11551 176812 182751 40973 -209155 -23579 269509 32585 174199 -124703
16143 524144 79460 23656 -33194 -159399 113939 -127521 64713 -101002 7252 -260210 253318
16131 -279421 530 141662 339762 290538 -41713 -114372 292509 187420 -123285 20401 69111
16120 69111 35289 -194841 322625 184686 -91903 209009 -50432 258818 400262 109393
$$ packed form
16201a70754F0092a34257C50414D3888N7628a64783I2070P1134E5562O3175J22027
16190B40764F9049c9162a1112n9887I245J15682b03660A34305B6147g5939j18290
16179a94229G3036K14790J07588a6137l0506j78482E9619L6220m4315f0675A10929
16167A71660q3127j3982K30225C9690J50060k0651o0294j4131g4939A11985a40370
16155e5274k72428A1551J65261N939D0973b09155b3579B69509C2585J41614a24703
16143E24144G9460B3656c3194j26205A13939a27521F4713a01002G252b60210B53318
16131b79421E30J41132J98100m9224d1713p2659B92509j05089a23285B0401M8710
16120F9111l3822a94841C22625j37939i1903B09009e0432B58818J41444A09393
$$ plain form
16109 -251159 162334 97858 256644 -10464 56777 -28628 125986 -37983 132978 50688 -289124
16097 3919 -49780 -288289 -269773 82819 -3586 -262646 109402 -143615 588268 391252 155672
16085 -23593 -83822 217480 -359033 22143 66012 213377 32246 21973 -322034 417972 10766
16073 -139126 47255 -47190 -126260 -217294 300017 -65791 2379 30512 -84672 -344628 -282359
16062 -282359 448091 159356 108425 -17475 98448 -212905 -20481 164827 -210027 -43876
16051 64438 -131304 48673 -41762 226417 -41131 -54956 86328 -281992 135407 -151925 20238
16039 95465 254836 -296914 -454255 152091 294679 105761 -257469 -340644 293088 -166468
16028 43108 -198971 -404253 124139 -110693 43404 -126625 23573 17599 175363 33518 -5956
$$ packed form
16109b51159A62334o4476J58786a0464E6777b8628A25986c7983A32978E0688b89124
16097C919d9780k38509J8516H2819c586k59060A09402a43615E88268j97016A55672
16085b3593o0229B17480c59033B2143M3869J47365C2246j0273c22034D17972A0766
16073a39126D7255d7190p9070r1034C00017f5791B379K8133h4672k59956O2269
16062b82359D48091A59356n0931a7475I8448b12905b0481A64827b10027d3876
16051F4438a31304D8673d1762B26417d1131j3825H6328b81992A35407a51925B0238
16039I5465J59371b96914j57341A52091J42588A05761b57469q3175B93088a66468
16028D3108a98971k05282A24139a10693D3404a26625B3573n974J57764C3518e956
$$ plain form
16016 -97843 -432571 105124 -297706 205055 -13199 -235873 193276 -126873 -9537 34535
16005 -10135 98195 -217757 27029 164500 -93768 -12802 24054 -20693 -111679 75121 -34928
15993 144586 51259 173083 91190 -11217 335 -506370 176644 33271 -69803 -81271 -18105
15981 59933 58313 44226 108458 224472 -275162 -108065 -78346 243933 60033 -35275 -23191
15970 -23191 -151727 26124 54231 228907 -147069 17633 6779 -159906 60442 -87185 -219716
15959 -219716 -189512 79970 -103380 -323121 77974 20087 -158084 333575 -21854 -307870
15949 -307870 26261 -94142 -299225 -124768 -60782 -121202 171515 -23895 -265154 -43702 -712
15937 -173580 -217772 255977 219338 627 218006 143968 379292 29027 -37006 -262565 -169405
$$ packed form
16016i7843l34728A05124b97706B05055a3199k22674A93276a26873i537C4535
16005a0135I8195b17757B7029J37471i3768a2802B4054b0693r0986G5121c4928
15993A44586E1259J21824q1893a1217C35e06370A76644C3271f9803j1468a8105
15981E9933j620j4087O4232J16014b75162a08065K9719B43933F0033c5275J2084
15970b3191j28536B6124K8107J74676a47069A7633F779a59906F0442h7185j32531
15959b19716L0204G9970a03380k19741G7974B0087a58084C33575b1854k86016
15949c07870B6261i4142k05083a24768f0782o0420A71515b3895k41259d3702g12
15937a73580m4192B55977l6639F27K17379p4038K35324B9027c7006k25559R3160
$$ plain form
15926 -169405 380448 -17791 203642 7166 -128995 43820 -73267 -93705 52095 -168394 -174865
15915 -174865 -182725 -203371 11931 -290867 222883 118921 -190264 -126344 116794 50557 59792
15904 59792 -113943 -200715 -321666 99512 103856 -234721 23295 120870 211757 -430944 -152583
15892 101653 28192 -26440 -224016 -149469 131643 30094 111566 337945 163499 -6233 112342
15880 3439 48317 251416 -103008 -407927 -75023 242388 -532588 58511 55301 -217926 -227400
15869 -227400 44228 235440 92922 82741 108270 -58744 -69740 -114304 8352 -156441 -125880
15858 -125880 16517 116555 -65149 -29315 -40377 101408 -59040 -100711 -150536 168386 -118116
15846 -80956 52170 360865 124672 -119635 -108924 69388 -115784 202441 87848 141090 -27070
$$ packed form
15926a69405C80448a7791B03642G166a28995D3820g3267k0438E2095a68394o471
15915a74865p860k0646A1931b90867B22883j03962a90264O3920A16794E0557R235
15904E9792a13943q6772j20951I9512M344b34721B3295R7575R0887d30944a52583
15892A01653B8192b6440j97576P4547A31643C0094Q1472K26379A63499f233A12342
15880C439M4878K03099a03008l04919g5023B42388e32588E8511l210b17926r474
15869b27400D4228J91212I2922j0181K5529e8744j0996m4564H352a56441L0561
15858a25880A6517J00038f5149b9315j1062A01408e9040m1671m9825A68386a18116
15846h0956E2170L08695A24672a19635J0711F9388a15784B02441H7848N3242b7070
$$ plain form
15834 -68786 -80368 -182205 -341044 113316 -282 759 -527356 13596 210427 -197925 16093
15822 -165088 -24918 -159411 41640 -85138 -104359 141388 2963 -237452 53594 -267048 -195313
15811 -195313 68000 -202187 -35447 -8119 -218211 122515 -70031 11326 -158547 -328088 -276662
15800 -276662 -2542 -254173 -223617 214663 -240622 170841 290494 184484 -381103 139653
15789 -57878 104568 158325 -2695 -359072 -132542 -147557 -465211 6530 -226794 -296817 -230828
15778 -230828 -181256 -190549 105389 -84318 -216455 -128417 -225203 103093 95077 -64233 -4093
15766 -90237 -75599 -293057 -201377 -275718 302985 -65032 -216635 26226 -351572 272724 -195448
15754 -204640 -113851 76595 88071 -153195 -40807 -407 315526 10761 93069 -30803 367270
$$ packed form
15834f8786j1582j01837j58839A13316b82G59e27356A3596J96831a97925A6093
15822a65088b4918j34493D1640h5138j9221A41388B963b37452E3594b67048P1735
15811a95313F8000b02187c5447h119k10092A22515g0031A1326a58547j69541N1426
15800b76662b542k51631L0556B14663b40622A70841J19653j06010c81103A39653
15789e7878A04568N3757b695l56377a32542j5015l17654F530b26794p0023O5989
15778b30828M9572r293A05389h4318j32137Q8038r6786A03093q016f4233d093
15766i0237J4638k17458R1680p4341C02985f5032j51603B6226c51572B72724a95448
15754b04640R0789G6595J1476a53195d0807d07C15526A0761Q2308c0803C67270
$$ plain form
15742 -268256 197114 -28069 -70036 44773 -40482 -203131 185533 19012 -31830 122324 -109946
15730 216266 -80959 212639 -25859 18625 -104580 107105 -114595 1652 140859 148018 -266177
15718 -431206 -179737 26345 -300925 -3569 50223 -74654 -55906 -162453 130588 -128235 108488
15706 -226344 3142 207087 -228615 -59852 -25358 -41915 -52139 -20884 5567 -29571 -190174
15695 -190174 -248639 -219100 150086 5456 -181968 84649 -320245 -183743 -105372 -73233 -56387
15684 -56387 -171785 22799 -37733 -57159 44886 -42187 -26057 -233296 -420833 258864 -81426
15672 157500 -218205 297752 51987 62636 118551 -152453 214418 -456679 65915 86628
15662 86628 304358 -35175 -155405 -362514 -30247 -450945 -104343 287408 13272 114453
$$ packed form
15742b68256A97114b8069m1967D4773d0482j62649A85533A9012c1830A22324a09946
15730B16266h0959B12639b5859A8625a04580A07105a14595A652J39207P159b66177
15718d31206a79737B6345c00925c569E0223g4654J8748j06547A30588a28235A08488
15706b26344C142K03945b28615e9852b5358j6557j0224b0884E567b9571j60603
15695a90174n8465K9539A50086E456a81968H4649c20245J36502P8371L2139J6846
15684e6387j15398B2799c7733j9426D4886d2187J6130k07239j87537B58864h1426
15672A57500b18205B97752E1987J0649N5915a52453B14418d56679F5915K0713
15662H6628K17730c5175j20230k07109c0247m20698a04343B87408A3272J01181
$$ plain form
15652 114453 13968 295686 -14696 -98317 -369528 -104935 283165 -471234 -144494 -45411
15641 -228293 -90778 -213416 -317227 46296 -431018 51121 -262121 37979 84601 986 71553
15630 71553 -175317 -21267 162058 167390 -131266 -14950 -185456 -36660 176532 -212583 -92384
15618 -102930 268249 -57595 -55257 -217052 -166476 -113737 12907 133628 204400 -129659 -232691
15607 -232691 208372 -143562 212303 -401788 -24460 -21243 40309 81384 100564 174178 -260920
15595 -154190 -222030 -285835 -13814 34752 -135340 -116515 67439 7709 -4604 86361 -113412
15583 -44000 -71517 -84707 -205815 129922 75417 -219650 221349 -119756 -293010 141427
15572 -84127 -29891 -60053 308408 250847 44862 -243012 118921 164841 -172548 -318440 223325
$$ packed form
15652A14453A3968K81718a4696q3621k71211a04935B83165d71234a44494d5411
15641b28293i0778j22638j03811D6296d31018E1121b62121C7979M6622I86P0567
15630G1553a75317b1267A62058N332a31266a4950j70506c6660A76532b12583i2384
15618a02930B68249e7595K338j61795N0576N2739A2907J20721P0772a29659j03032
15607b32691B08372a43562B12303d01788b4460L217D0309M1075J9180P3614b60920
15595a54190o7840o3805a3814C4752a35340J8825F7439G709d604H6361a13412
15583d4000k7517j3190j21108A29922n4505b19650B21349a19756j73254A41427
15572h4127b9891l0162C08408n7561D4862b43012A18921M5920a72548j45892B23325
$$ plain form
15560 -276696 -178942 -97452 52569 8922 -2216 -254151 47279 -252141 -54560 43906 59389
15549 59389 418846 71094 -112068 -89983 324821 -178339 -105436 -375767 -8012 -127005 74661
15537 -33079 247285 -99259 -104414 2964 -232994 184521 -36587 -103427 -322548 250015 -147619
15525 -200610 158661 164061 -86608 -228655 -58634 -40306 132634 -319999 24187 -59222 -385514
15514 -385514 -137468 -73722 -27644 1452 64593 -427227 28496 62300 -208183 -282025 -126893
15502 -130924 3843 165469 -82353 -9467 76614 185975 2148 -96658 44341 8447 -124983 -92461
15490 -92461 -337735 329006 -78731 129936 -140505 -41521 -10928 -198957 64364 262460
15480 262460 -39961 29936 171137 30371 -42000 -201513 -157977 79939 13037 400928 297495
$$ packed form
15560b76696R7754Q1490E2569H922b216k51935D7279b52141e4560D3906J5483
15549E9389L59457G1094a12068K2085C24821a78339P2903k70331h012j18993G4661
15537c3079B47285i9259n155B964b32994A84521c6587o6840k19121B50015a47619
15525b00610A58661N400h6608j42047e8634J8328A32634c19999B4187e9222l26292
15514c85514a37468O3746b7644A452O3141d27227B8496L3804b08183p3842a26893
15502a30924C843J61626h2353i467G6614J09361B148i6658D4341H447a24983L2522
15490i2461k45274C29006g8731A29936a40505d1521a0928j88029F4364J98096
15480B62460c9961B9936J41201C0371d2000j59513M3536G9939A3037L87891j03433
$$ plain form
15469 297495 -76040 -299815 -12515 158317 -65533 232590 -133736 -78284 335300 136567
15458 -172907 -66980 3059 382408 -133857 -378928 457754 -108523 -13694 -71396 -268734
15448 -268734 -197069 50066 -166598 -220279 111674 241716 26767 -12356 -132813 -35095 169094
15436 926 -167873 -25359 96755 -110543 -274099 280132 -99770 342623 -205066 419506 159595
15424 -48765 55725 -134246 193686 -225183 56565 -426062 -44661 -217890 -337871 296016
15413 -52520 -11923 -56007 140117 193017 -35292 182753 -258716 -27471 39829 -107729 -338665
15402 -338665 -65864 -152586 9156 52364 -220438 -14763 366906 162012 -216824 15527 64337
15391 64337 116237 131302 -223351 -22233 152890 41151 -146843 -13576 -7963 -274885 -85438
$$ packed form
15469B97495g6040k23775a2515A58317f5533B32590a33736N5452C35300A36567
15458a72907f6980C059L79349a33857k45071D57754a08523a3694n7702j97338
15448b68734P1665E0066a66598n3681A11674J30042B6767a2356j20457c5095A69094
15436I26a67873b5359I6755a10543j63556B80132i9770C42623b05066D19506A59595
15424d8765E5725a34246A93686b25183E6565d26062d4661j73229j19981B96016
15413e2520a1923m4084A40117N2900c5292A82753b58716b7471C9829a07729k30936
15402c38665f5864q6722I156M3208b20438a4763C66906A62012b16824A5527M8810
15391F4337N1900J5065b23351b2233A52890D1151a46843a3576N613k66922h5438
$$ plain form
15379 54653 -146776 143356 -219798 -146654 153427 87845 -97260 -215461 3282 -40287 73915
15367 -111008 279426 124759 148873 -243730 -161472 18741 -357207 -64099 62121 199418
15357 199418 -3065 -201631 -242400 -322606 98701 270197 -411044 149258 222798 -177254 -154805
15346 -154805 104259 -105954 149948 65175 -214587 121265 -66695 134948 57103 120372
15336 120372 55085 17491 -232285 111505 -131023 304334 -43368 -23658 345679 -47369
15325 125303 -150295 193695 -74809 109639 23086 -98807 143948 -68125 283334 -143047
15314 -96932 -222535 55209 294165 346198 129468 -26621 -123335 -3582 170212 27432 176129
15303 176129 113838 107344 270286 -328280 43267 -179963 201310 -121060 -149484 271562
$$ packed form
15379E4653a46776A43356b19798P3144A53427o5582i7260j18201C282d0287G3915
15367a11008B79426A24759K4114b43730Q2258A8741c57207f4099F2121J37297
15357A99418c065j98566m0769q0206I8701J71496d11044A49258P3540a77254K2449
15346a54805A04259a05954A49948F5175b14587A21265f6695A34948E7103O3269
15336A20372E5085A7491b32285A11505a31023C04334d3368J9710C45679d7369
15325A25303a50295A93695g4809A09639B3086i8807A43948f8125B83334a43047
15314i6932j25603E5209K38956N2033A29468b6621r6714c582A70212B7432J48697
15303A76129o2291o494J62942c28280D3267a79963B01310a21060k8424B71562
$$ plain form
15292 -40984 86011 -21079 -73181 -192138 -38715 80047 184294 -54394 -12322 -223302 409
15280 10224 224752 -125902 -84838 -171839 283573 196633 81311 119459 256354 74050 150702
15269 150702 124973 -10620 -184410 118460 82652 48074 165257 121062 -179364 286183
15258 23066 -157266 78727 -14664 120984 87524 122701 -88889 3671 69369 93951 208658
15247 208658 -31674 -111831 41833 99578 160726 206263 314123 270823 148201 -49453 421268
15235 536252 1033355 1170864 913198 1102040 936505 169443 241594 453357 62602 -28229
15224 249719 164366 51569 69739 -47764 -81244 55626 57013 100895 227522 -195171 -158390
15213 -158390 144346 183530 84331 130475 136482 -79708 -259268 482 229846 144342 33380
$$ packed form
15292d0984H6011b1079n2102j18957c8715H0047J04247e4394a2322k10980D09
15280A0224K14528a25902M1064q7001B83573q6940H1311L8148J36895G4050P6652
15269A50702k5729a0620j73790A18460l5808l4578J17183m4195a79364B86183
15258B3066a57266G8727a4664A20984l3460L5177h8889C671O5698K4582J14707
15247B08658c1674q0157D1833N7745O1148M5537J07860m3300j22622d9453D21268
15235E36252M97103J37509k57666J88842j65535A69443P2151K11763F2602b8229
15224B49719q5353E1569J8170d7764l3480E5626J387M3882J26627a95171L6781
15213a58390A44346L9184H4331M6144O007g9708j79560D82K29364q5504C3380
$$ plain form
15201 80364 180861 11967 59365 145396 -7942 385989 478233 185489 -153364 161228 -141466
15189 137773 178799 22933 -760 152966 -105842 129103 82366 28432 287599 61201 -37199
15177 74442 -295886 -50613 167386 187874 74667 340140 308552 -118509 -28058 16032 -174838
15165 124366 248489 149220 246608 96551 330293 -215048 183086 162064 61728 100077 -38738
15153 394645 11373 -109445 438391 155459 90474 160564 141636 187897 -173658 -87418 135561
15141 90128 533687 -117873 316623 6296 75748 205711 -254049 65234 319677 107535
15130 -172000 -130978 231956 -79113 120098 261413 177990 167646 372606 36138 6895 43222
15119 43222 111515 117449 -27823 167810 142210 -199762 -177862 -1194 27571 -77091 409219
$$ packed form
15201H0364J00497A1967M7398Q6031g942C85989R2244A85489a53364A61228a41466
15189A37773M1026B2933g60A52966a05842A29103m6737B8432K59167F1201c7199
15177G4442b95886e0613A67386K0488G4667K65473l1588a18509b8058A6032a74838
15165A24366J24123r9269R7388I6551K33742b15048A83086k1022F1728L8349c8738
15153C94645A1373a09445D38391A55459o4985P0090j8928M6261a73658Q6240A35561
15141I0128M43559a17873C16623F296O9452J29963b54049F5234K54443A07535
15130a72000M1022B31956g9113A20098J41315q3423j0344K04960C6138F895L6327
15119D3222O8293N934b7823A67810k5600a99762K1900a194B7571g7091D09219
$$ plain form
15107 254313 87465 143990 124228 -266034 58005 -130305 35191 370389 45992 234559 143393
15096 143393 35764 27823 28549 116604 287034 -144209 50797 -284296 -47863 275672 -439324
15084 151277 430925 330103 -30069 429182 187711 -195973 -119873 314080 -340135 -82146
15073 105674 -80641 7516 399073 327139 209507 -125165 316581 327408 140056 -34463 9906
15061 247365 395309 220361 -14065 -23459 65073 349250 126137 137831 363352 9537 167002
15050 167002 113401 53021 70828 134266 8853 143855 146694 -49927 293732 -40507 -68181
15039 -68181 276786 -41665 269771 86958 87774 13950 363769 -15796 338342 12373 95224
15028 95224 235449 129455 68 319939 -15575 275720 420152 71163 -37051 82542 280331
$$ packed form
15107B54313H7465N6525j9762b66034E8005a30305C5191L35198D5992J88567r1166
15096A43393C5764p941P26Q8055J70430a44209E0797b84296d7863B75672d39324
15084A51277K79648j00822c0069D29182A87711a95973P6100C14080c40135h2146
15073A05674h0641G516L91557p1934j17632a25165C16581J0827A40056c4463I906
15061B47365J47944j74948a4065r394F5073K84177A26137J1694K25521I537J57465
15050A67002n3601E3021J7807O3438H853J35002K839d9927B93732d0507k7674
15039f8181B76786d1665B69771H6958Q16A3950L49819a5796C38342A2373Q2851
15028I5224J40225j05994F8L19871a5575B75720J44432G1163c7051H2542J97789
$$ plain form
15017 280331 186038 212041 266454 -14820 -102185 254649 103622 170295 370528 312948 172218
15006 172218 46515 339306 412171 463828 363369 114896 38618 -90917 -47904 -149590 354927
14994 196744 263437 157153 -62821 305857 290980 458524 125647 75795 116459 542658
14984 542658 13338 96649 -33344 394075 -101614 312916 489880 148328 22852 184545
14974 184545 621702 169972 167178 279213 164449 242526 259053 313255 422745 220264
14964 220264 -64862 116850 -21604 121820 96140 220775 147022 387290 206968 -60459
14953 17640 304620 70437 496752 152473 -17098 205196 288569 110383 -92976 284145
14942 258873 183667 443049 234315 144029 85778 411489 666288 354699 143480 403191
$$ packed form
15017B80331r4293K6003N4413a4820q7365B54649A03622O6673K00233n7580j40730
15006A72218D6515K92791P2865N1657j00459A14896C8618i0917M3013j01686C54927
14994A96744O6693j06284f2821C05857j4877J67544A25647m9852M0664M26199
14984E42658A3338Q3311c3344C94075a01614C12916J76964A48328B2852J61693
14974A84545M37157A69972k794J12035j14764P8077J6527N4202J09490k02481
14964B20264f4862A16850b1604A21820k5680J24635p3753K40268j80322f0459
14953A7640K86980G0437M26315A52473a7098B05196Q3373A10383i2976B84145
14942B58873p5206K59382k08734r0286n8251L25711K54799l11589A43480K59711
$$ plain form
14932 403191 185125 292072 229165 290367 392038 138732 96655 87549 628271 460779
14922 460779 488712 437833 509412 57673 264684 303962 265596 233055 576686 441730 251628
14911 251628 614072 771 419764 363559 224992 442932 352972 50082 291285 204553 213930
14900 213930 278861 220017 176684 216008 211303 97822 219754 377259 144164 12171 113900
14889 113900 299618 360692 397020 295550 223425 354209 188823 300583 361079 223163
14879 223163 242300 427653 510988 452239 139689 559590 401411 455514 402339 303256 447558
14868 447558 -156208 95315 383074 404390 -62870 837998 232823 246617 249519 -109137 597620
14856 463044 539545 465494 286756 686610 228597 251392 474618 473474 470989 58613 128082
$$ packed form
14932D03191A85125J06947o2907O1202J01671A38732m2077r106N40722j67492
14922D60779K7933n0879P1579E7673K07011L9278l8366l2541L43631j34956j90102
14911B51628L62444G71M18993n6205j38567K17940q9960E0082K41203q6732R377
14900B13930O4931n8844m3333L9324m705I7822J21932J57505A44164A2171J01729
14889A13900J85718O1074L6328j01470p2125J30784j65386J11760O0496j37916
14879B23163J9137J85353Q3335n8749A39689M19901j58179N4103n3175r9083J44302
14868D47558a56208I5315K87759K1316f2870H37998B32823J3794K902a09137E97620
14856D63044P6501p4051j78738L99854B28597K2795K23226j144k485E8613O9469
$$ plain form
14845 128082 369490 354913 289064 482133 440405 650724 419016 377465 493343 475418
14835 475418 547251 406622 597505 91689 596806 139255 487918 517062 478101 103665
14824 468264 605222 248399 628472 279540 738131 484163 345071 285929 306955 392948
14814 392948 113924 99093 317193 553402 461221 519821 342911 597668 706647 176844
14803 399972 594951 519724 500520 430232 311722 429813 373119 473497 541191 493282 506628
14792 506628 444808 405524 580928 501641 509116 373416 558332 409936 559757 341341
14782 341341 504109 520628 560167 601382 535568 446809 590036 620563 550514 313611 363231
14771 363231 411028 311535 483538 355009 284121 508703 478079 470808 595613 667976 606839
$$ packed form
14845A28082K41408j4577o5849J93069m1728K10319k31708m1551J15878j7925
14835D75418P1833j40629J90883I1689N05117A39255L48663K9144l8961A03665
14824D68264J36958B48399L80073B79540M58591k53968j39092n9142K1026Q5993
14814C92948A13924j4831K18100K36209r2181N8600j76910K54757J08979A76844
14803C99972J94979p5227j9204p0288j18510J18091n6694J00378O7694m7909J3346
14792E06628o1820l9284J75404p9287P475j35700J84916j48396J49821k18416
14782C41341J62768J6519L9539M1215o5814q8759J43227L0527p0049k36903M9620
14771C63231M7797r9493J72003j28529p0888K24582l0624p271J24805P2363o1137
$$ plain form
14760 606839 696223 424348 575277 671025 736752 584078 747195 599654 637552 480480
14750 480480 680043 469951 373514 747763 732701 679741 378356 561143 872017 778160
14740 778160 632618 568915 803567 676939 648831 793861 712259 697106 906768 498362
14730 498362 608314 514501 543303 684211 791308 768410 424379 657145 714397 791253
14720 791253 467368 961564 640130 774038 792373 875133 676844 903699 606476 760531
14710 760531 960565 782567 372868 1063040 802685 830016 866898 595130 986517 858382
14700 858382 981627 846790 569047 733998 1044136 742479 686014 796061 826281 1003112
14690 1003112 764081 845027 707580 727935 707914 867958 906386 655158 1118493 629133
$$ packed form
14760F06839Q9384k71875J50929R5748O5727j52674J63117j47541L7898j57072
14750D80480J99563k10092r6437L74249j5062n2960l01385J82787L10874r3857
14740G78160j45542o3703K34652j26628k8108J45030q1602j5153K09662m08406
14730D98362J09952r3813K8802J40908J07097k2898l44031K32766N7252P6856
14720G91253l23885M94196l21434J33908J8335Q2760j98289K26855k97223J54055
14710G60531K00034j77998C72868O90172k60355K7331L6882k71768L91387j28135
14700H58382J23245j34837k77743J64951L10138l01657n6465J10047L0220J76831
14690A003112k39031Q0946j37447K0355k0021J60044L8428k51228M63335m89360
$$ plain form
14680 629133 1023923 499663 817390 873005 1002023 840770 654342 626330 1289666 769117
14670 769117 873414 675142 1049787 659666 932842 1220924 1275577 844943 1223651 912478
14660 912478 945763 668457 1032955 1248771 1154548 949811 1315603 1181406 1117954 1066239
14650 1066239 1164238 904397 1095371 1070326 1108365 1019378 1281114 1326887 948150 1081507
14640 1081507 1031489 959094 988993 810861 1243698 1252217 1024442 1307566 1289301 1165163
14630 1165163 1225693 1170930 1329055 1131888 999218 1240648 1099282 1186347 1024585 1289891
14620 1289891 1324450 1175957 1153215 1234016 1311643 1412840 1615099 1154208 1280971 1103964
14610 1103964 1241715 1397914 1592208 1101281 1202097 1179959 1528377 1660904 1357778 1486132
$$ packed form
14680F29133L94790D99663L17727N5615J29018j61253j86428k8012O63336n20549
14670G69117J04297j98272L74645l90121K73176K88082N4653m30634L78708l11173
14660I12478L3285k77306L64498K15816r4223k04737L65792j34197o3452n1715
14650A066239R7999k59841J90974k5045L8039q8987K61736M5773l78737J33357
14640A081507n0018p2395K9899j78132M32837Q519k27775K83124j8265j24138
14630A165163O0530n4763J58125j97167j32670K41430j41366Q7065j61762K65306
14620A289891L4559j48493k2742Q0801P7627J01197K02259m60891J26763j77007
14610A103964J37751J56199J94294m90927J00816k2138L48418J32527l03126J28354
$$ plain form
14600 1486132 1481934 1484095 1581718 1540361 1587612 1815770 1464360 1212603 1946207 1414909 1633163
14589 1633163 1287428 1514244 1726679 1502909 1703668 1589050 1850949 1778706 1915567 1668623
14579 1668623 1856328 1677784 1485264 1614103 1728771 1671063 1710964 1784159 1962235 1730856
14569 1730856 2036680 2001768 1948580 2075615 1918943 1853200 2107521 2164061 2038190 2083328
14559 2083328 2044227 2023592 2342480 2001026 2480409 2095032 2315509 2594292 2471150 2767422
14549 2767422 2668809 2588638 2721513 2886574 2630557 3141669 3249057 3172065 3640176 3898146
14539 3898146 4442525 4862887 5505714 6475239 7474271 9553377 13338693 19310311 27720927
14530 27720927 27003819 16617778 10374482 6461011 4644238 3709571 2885641 2780564
$$ packed form
14600A486132m198K161R7623m1357M7251K28158l51410k51757P33604n31298K18254
14589A633163l45735K26816K12435k23770K00759j14618K61899p2243J36861k46944
14579A668623J87705j78544j92520J28839J14668n7708L9901P3195J78076k31379
14569A730856L05824l4912n3188J27035j56672o5743K54321N6540j25871M5138
14559B083328l9101k0635L18888l41454M79383l85377K20477K78783j23142K96272
14549B767422r8613q0171J32875J65061k56017N11112J07388p6992M68111K57970
14539C898146N44379M20362O42827R69525R99032K079106L785316N971618Q410616
14530B7720927p17108j0386041o243296l913471j816773r34667q23930j05077
$$ plain form
14522 2780564 2303765 2183635 2373697 2414922 2286295 2376427 2268852 2698162 2229637 2240536
14512 2240536 2411766 2236174 2519666 2345112 2452694 2443289 2500813 2423271 2483301 2410323
14502 2410323 2591311 2767031 2965610 2664182 2678641 2890440 2635053 2835754 2643667 3088017
14492 3088017 3128597 3185438 3080515 3183938 3107971 3247896 3134951 3105214 3408025 3197968
14482 3197968 3202743 3387206 3117600 3332858 3497738 3417880 3639664 3501611 3634572 3537049
14472 3537049 3460887 3597155 3806622 3446542 3939757 4014738 3930317 4376555 4062647 4157085
14462 4157085 4228580 4181224 4319991 4391347 4127875 4361032 4706048 4246754 4748892 4463930
14452 4463930 4704262 4788489 4463886 4881564 4647686 4750975 4779810 5282972 5208732 5051483
$$ packed form
14522B780564m76799j20130J90062M1225j28627R0132j07575M29310m68525J0899
14512B240536J71230j75592K83492j74554J07582r405N7524p7542O0030p2978
14502B410323J80988J75720J98579l01428J4459K11799k55387K00701j92087M44350
14492C088017M0580N6841j04923J03423p5967J39925j12945k9737L02811k10057
14482C197968M775J84463k69606K15258J64880p9858K21784j38053J32961r7523
14472C537049p6162J36268K09467l60080M93215P4981q4421M46238l13908R4438
14462D157085P1495m7356J38767P1356k63472K33157L45016m59294N02138k84962
14452D463930K40332Q4227l24603M17678k33878J03289K8835N03162p4240j57249
$$ plain form
14442 5051483 5261218 5070729 5153064 5442117 5355912 5355696 5718586 5587830 5756659 5703189
14432 5703189 5909089 5858192 5641608 6250217 5847137 6231696 6130722 6425155 6310171 6266333
14422 6266333 6368893 6920154 6930617 6955250 7051502 7171788 7088041 7052636 7328998 7142663
14412 7142663 7472497 7501886 7629899 7507104 7859139 7958354 7946107 8308340 8297547 9067856
14402 9067856 8661555 8821970 8784225 8890072 9431027 8868280 9204107 9505678 9398911 9486687
14392 9486687 9763684 10128064 10039835 10235874 10505287 10642139 11133955 11243894 11356728 11377016
14382 11377016 11351840 11563484 11939153 12331118 12303169 12551726 12445185 12836723 13025549 13540940
14372 13540940 13730277 13719117 14041569 14406360 14535229 14855775 15203755 15473114 16101202
$$ packed form
14442E051483K09735j90489Q2335K89053q6205k16L62890j30756J68829n3470
14432E703189K05900n0897k16584O08609m03080L84559j00974K94433j14984m3838
14422F266333J02560N51261J0463K4633R6252J20286q3747l5405K76362j86335
14412G142663L29834K9389J28013j22795L52035R9215j2247L62233j0793P70309
14402I067856m06301J60415l7745J05847N40955n62747L35827L01571j06767Q7776
14392I486687K76997L64380q8229J96039K69413J36852M91816J09939J12834K0288
14382A1377016k5176K11644L75669L91965k7949K48557j06541L91538J88826N15391
14372A3540940J89337j1160L22452L64791J28869L20546L47980K69359O28088
$$ plain form
14363 16101202 16139313 16439447 16620513 16742988 17154526 17267182 17867427 18179609 18547512
14354 18547512 19158114 19698211 19639992 20284122 20688709 21108684 21501066 22256434 22539769
14345 22539769 22790161 23161546 24057565 24403144 25050200 25724177 26308214 26366952 27648557
14336 27648557 27924665 28586629 29347292 29952851 30711406 31726186 32773588 33653635 34415353
14327 34415353 34844288 35853881 37067243 37808724 39296587 40186313 41513994 42549719
14319 42549719 43911493 44997205 46545414 47793263 49183881 50778511 52379836 53732287
14311 53732287 55650002 57737461 59923315 61332425 63464941 65900835 67944580 70228479
14303 70228479 72952676 75329033 78033335 80811596 84152791 87177442 90613163 94212017
$$ packed form
14363A6101202L8111L00134J81066J22475M11538J12656O00245L12182L67903
14354A8547512O10602N40097n8219O44130M04587M19975L92382P55368K83335
14345B2539769K50392L71385Q96019L45579O47056O73977N84037N8738J281605
14336B7648557K76108O61964P60663O05559P58555J014780J047402Q80047P61718
14327C4415353M28935J009593J213362P41481J487863Q89726J327681J035725
14319D2549719J361774J085712J548209J247849J390618J594630J601325J352451
14311E3732287J917715K087459K185854J409110K132516K435894K043745K283899
14303G0228479K724197K376357K704302K778261L341195L024651L435721L598854
$$ plain form
14295 94212017 97562053 101686010 105880589 110099482 115111731 119878936 124796275 130562102
14287 130562102 136330038 142469195 148743092 155759278 163038348 170664704 178341264 187380078
14279 187380078 196688707 206103922 215982417 226387591 237447105 248651929 260529872
14272 260529872 272768482 285580056 298468255 311812742 325127155 337876967 350143235
14265 350143235 361446634 371852073 381813442 390906973 399510828 406750859 413374393 418332762
14257 418332762 421042601 422165926 423072729 421779435 416147835 409834496 402156203 393033016
14249 393033016 382980665 372686694 360679690 348149141 335007424 322306129 309583015
14242 309583015 296476598 283457106 270629596 257942071 245273624 233121367 221042244
$$ packed form
14295I4212017L350036M123957M194579M218893N012249M767205M917339N765827
14287A30562102N767936O139157O273897P016186P279070P626356P676560R038814
14279A87380078R308629R415215R878495J0405174J1059514J1204824J1877943
14272B60529872J2238610J2811574J2888199J3344487J3314413J2749812J2266268
14265C50143235J1303399J0405439R961369R093531Q603855P240031O623534M958369
14257D18332762K709839J123325R06803j293294n631600o313339p678293r123187
14249C93033016j0052351j0293971j2007004j2530549j3141717j2701295j2723114
14242C09583015j3106417j3019492j2827510j2687525j2668447j2152257j2079123
$$ plain form
14235 221042244 209660947 198794589 188722847 179076003 170159293 161646211 153883488
14228 153883488 146583384 139459358 132917583 126992689 120908752 115501145 110680292 105783234
14220 105783234 101183716 97199681 93037858 89305873 85859911 82671455 79209014 76010767
14212 76010767 72982069 70458480 67607291 65292720 62932063 60673911 59040484 56825257
14204 56825257 54959495 53271381 51478920 49449643 48184225 46819487 45409412 44019370
14196 44019370 42540101 41420930 40004583 39385520 38385088 37442134 35915235 34877272
14188 34877272 34121175 33079959 32435141 31542861 30571434 29932313 29443587 28303670 27680619
14179 27680619 27113371 26494034 25714257 25000801 24654734 24036509 23209618 23231972 22428796
$$ packed form
14235B21042244j1381297j0866358j0071742r646844q916710q513082p762723
14228A53883488p300104p124026o541775n924894o083937n407607m820853m897058
14220A05783234m599518l984035m161823l731985l445962l188456l462441l198247
14212G6010767l028698k523589k851189k314571k360657k258152j633427k215227
14204E6825257j865762j688114j792461k029277j265418j364738j410075j390042
14196D4019370j479269j119171j416347o19063j000432r42954j526899j037963
14188C4877272p56097j041216o44818q92280r71427o39121m88726j139917o23051
14179B7680619n67248o19337p79777p13456l46067o18225q26891K2354q03176
$$ plain form
14170 22428796 22107444 21445600 20799635 20571472 20006161 19670679 19175592 18672119 18261633
14161 18261633 18263411 17726664 17402025 17147494 16851116 16466739 16195964 15678282 15578536 15227181
14151 15227181 14961714 14859965 14496925 13961745 13833846 13717555 13375884 13009442 13132064
14142 13132064 12604552 12703568 12356597 12318225 11918143 11692962 11448926 11135254 11081609 10944161
14132 10944161 10800121 10357953 10642327 10116354 9763727 9896534 9779999 9594522 9383825
14123 9383825 9322906 9466671 9014178 8840828 8873030 8686466 8687723 8837936 8374850 8330674
14113 8330674 7946277 7976062 7871506 7598751 7581333 7545177 7375658 7342061 7384227 6724335
14103 6724335 7032370 7185720 7089328 6518596 6757474 6793574 6609969 6453453 6324972 6018206
$$ packed form
14170B2428796l21352o61844o45965k28163n65311l35482m95087n03473m10486
14161A8261633J778n36747l24639k54531k96378l84377k70775n17682r9746l51355
14151A5227181k65467j01749l63040n35180j27899j16291l41671l66442J22622
14142A3132064n27512R9016l46971l8372m00082k25181k44036l13672n3645j37448
14132A0944161j44040m42168K84374n25973l52627J32807j16535j85477k10697
14123I383825o0919J43765m52493j73350L2202j86564J257J50213m63086m4176
14113H330674l84397K9785j04556k72755j7418l6156j69519l3597M2166o59892
14103F724335L08035J53350r6392n70732K38878L6100j83605j56516j28481l06766
$$ plain form
14093 6018206 6374990 6114878 5953511 6032950 6193759 6102852 5918894 5943099 5556144 5359958
14083 5359958 5976067 5742637 5348618 5245228 5304001 5346555 4877362 5090155 5022979 4933301
14073 4933301 4795128 4846303 4880892 5017315 4793129 4956616 4505729 4486296 4550379 4336512
14063 4336512 4520059 4452223 4651398 4542822 4163421 3990303 4246954 4452172 4280680 4043688
14053 4043688 3925146 3855110 3882840 3905913 4037017 3841372 3602301 3553927 3854808 3900993
14043 3900993 3765519 3922584 3819237 3674260 3638518 3252927 3564852 3483593 3328639 3330810
14033 3330810 3524760 2908321 3354858 3314214 3514102 3148598 3195815 3224483 3005582 2890261
14023 2890261 2978208 3135265 3180834 2883204 2993312 3264994 2949962 3044069 3012019 2767965
$$ packed form
14093F018206L56784k60112j61367P9439J60809r0907j83958K4205l86955j96186
14083E359958O16109k33430l94019j03390N8773M2554m69193K12793o7176q9678
14073D933301j38173N1175L4589J36423k24186J63487m50887j9433O4083k13867
14063D336512J83547o7836J99175j08576l79401j73118K56651K05218j71492k36992
14053D043688j18542p0036K7730K3073J31104j95645k39071m8374L00881M6185
14043C900993j35474J57065j03347j44977l5742l85591L11925q1259j54954K171
14033C330810J93950o16439M46537m0644J99888l65504M7217K8668k18901j15321
14023B890261Q7947J57057M5569k97630J10108K71682l15032R4107l2050k44054
$$ plain form
14013 2767965 2870017 2839760 2859774 2662819 2537619 2529944 2469456 2287537 2352744 2628481
14003 2628481 2708990 2585625 2393725 2434989 2694276 2505654 2533249 2539576 2200596 2258986
13993 2258986 2170785 2349831 2171344 2261021 2346293 2245622 2186117 2359431 2422989 2407557
13983 2407557 2418038 2719318 2601482 2568303 2799292 2901018 3377291 3783357 4662497 6564667
13973 6564667 9564061 15036487 23570010 27033615 18672517 12787069 9130871 6961486
13965 6961486 5492572 4595439 4017666 3644304 3436839 2990912 3181153 2899519 2532250
13956 2532250 2745320 2499404 2316143 2448999 2318938 2327866 2405867 2218038 2236006 1997320
13946 1997320 2266925 2112531 2424342 2239899 1868107 1470354 1994254 1935901 1955562 1901702
$$ packed form
14013B767965J02052l0257K0014j96955j25200p675o0488j81919O5207K75737
14003B628481Q0509j23365j91900M1264K59287j88622K7595O327l38980N8390
13993B258986q8201J79046j78487Q9677Q5272j00671n9505J73314O3558j5432
13983B407557J0481L01280j17836l3179K30989J01726M76273M06066Q79140J902170
13973F564667K999394N472426Q533523L463605q361098n885448l656198k169385
13965F961486j468914q97133n77773l73362k07465m45927J90241k81634l67269
13956B532250K13070k45916j83261J32856j30061Q928P8001j87829J7968k38686
13946A997320K69605j54394L11811j84443l71792l97753N23900n8353J9661n3860
$$ plain form
13936 1901702 2313656 1773926 1913618 1997366 1586058 1686878 1493178 1915275 1677578 1759700
13926 1759700 1588696 1681242 1339644 1431402 1748947 1589048 1472104 1295443 1760328 1697853
13916 1697853 1597877 1487923 1532418 1267246 1783988 1200031 1370130 1651827 1201550 1517292
13906 1517292 1474059 1582565 1423668 1639260 1137958 1382938 1659933 1312119 1700223 1277230
13896 1277230 1350378 1013274 1404985 1109339 1195674 1442826 1304970 1413423 1245908 996688
13886 996688 1212365 1357744 1308246 1293451 1168335 1202364 909370 1595524 1122985 1250017
13876 1250017 996095 1535945 1333524 1585928 954333 1127473 1220371 1528062 1174639 1359221
13866 1359221 1057710 1248106 1039608 1140440 851973 1268324 975310 1031470 1124759 1416581
$$ packed form
13936A901702M11954n39730J39692Q3748m11308J00820j93700M22097k37697Q2122
13926A759700j71004R2546l41598R1758L17545j59899j16944j76661M64885o2475
13916A697853r9976j09954M4495k65172N16742n83957J70099K81697m50277L15742
13906A517292m3233J08506j58897K15592n01302K44980K76995l47814L88104m22993
13896A277230P3148l37104L91711k95646Q6335K47152j37856J08453j67515k49220
13886I96688K15677J45379m9498j4795j25116L4029k92994O86154m72539J27032
13876A250017k53922N39850k02421K52404o31595J73140R2898L07691l53423J84582
13866A359221l01511J90396k08498J00832k88467M16351k93014N6160R3289K91822
$$ plain form
13856 1416581 1111267 1270926 1160931 922083 919097 1028868 1337913 892119 1042306 1115892
13846 1115892 790984 1326911 1161615 978947 813367 983199 958202 812591 928224 834929
13836 834929 986239 841304 975818 943618 1094643 1068890 855881 1389967 607317 1282303
13826 1282303 1157872 818676 834977 782755 752513 897222 873908 1163219 982053 796437
13816 796437 860051 973257 1033261 952099 1107978 552048 929947 692652 959336 748541
13806 748541 768477 420376 682605 808967 1022877 977867 698867 750195 611791 821836
13796 821836 725305 585443 1009041 742451 629606 985890 535193 563843 841511 732223
13786 732223 582925 841273 555786 550404 794285 743203 672159 458264 714744 817370
$$ packed form
13856A416581l05314J59659j09995k38848k986J09771L09045m45794J50187P3586
13846A115892l24908N35927j65296j82668j65580J69832k4997j45611J15633r3295
13836H34929J51310j44935J34514l2200J51025k5753k13009N34086F07317O74986
13826A282303j24431l39196J6301n2222l0242J44709k3314K89311j81166j85616
13816G96437O3614J13206O0004q1162J55879E52048L77899k37295K66684k10795
13806G48541J9936l48101K62229J26362K13910m5010k79000N1328j38404K10045
13796H21836r6531j39862M23598k66590j12845L56284m50697K8650K77668j09288
13786G32223j49298K58348k85487n382K43881n1082p1044k13895K56480J02626
$$ plain form
13776 817370 886389 861019 548175 996603 384856 830377 534856 801673 650557 625113
13766 625113 660835 776821 932012 870353 686347 656976 802362 450149 676157 305977
13755 917857 918194 467161 625806 459313 880664 706676 704659 756538 337582 845935 412011
13743 966800 311885 185347 943386 490579 653137 942845 798258 651014 401241 695318
13733 695318 502113 582061 373895 692711 539645 520913 549122 991567 697446 538678
13723 538678 506432 402493 973307 553956 815923 433827 577328 587638 293394 345274
13713 345274 572487 666010 611308 909304 345674 312390 494952 536405 425237 590004
13703 590004 632569 734431 565756 643120 413992 640818 517653 446922 425675 327662
$$ packed form
13776H17370O9019k5370l12844M48428C84856M45521k95521K66817j51116k5444
13766F25113L5722J15986J55191o1659j84006k9371J45386l52213K26008C05977
13755I17857L37m51033J58645j66493M21351j73988k017N1879C37582N08353D12011
13743I66800C11885j26538P58039m52807J62558K89708j44587j47244k49773K94077
13733F95318j93205P9948k08166L18816j53066j8732K8209M42445k94121j58768
13723E38678l2246j03939N70814m19351K61967l82096J43501J0310B93394N1880
13713C45274K27213R3523n4702K97996C45674l3284J82562M1453j11168J64767
13703E90004M2565J01862j68675P7364k29128K26826j23165p0731k1247r8013
$$ plain form
13693 327662 440341 430880 490890 429704 494020 642185 460302 822873 486643 736466
13683 736466 542139 497552 434070 456528 507403 609958 575272 678203 575416 692576
13673 692576 489475 645697 595253 462612 544033 367109 980134 727961 506656 426228
13663 426228 343958 400159 757110 649484 370023 705107 483546 498296 556527 219618
13652 340516 519756 666524 597023 451792 625857 473136 523502 545101 411581 473721
13642 473721 638127 287135 642445 505915 368231 467209 355591 288617 440819 327888
13632 327888 397722 146203 480133 386044 519532 410249 367248 398702 541460 471705
13622 471705 375975 332466 251166 519120 494146 264278 329171 259816 659249 173033 403056
$$ packed form
13693C27662J12679r461O0010o1186O4316J48165j81883L62571l36230K49823
13683G36466j94327m4587o3482K2458N0875J02555l4686J02931j02787J17160
13673F92576k03101J56222n0444j32641Q1421j76924O13025k52173k21305q0428
13663D26228q2270N6201L56951j07626k79461L35084k21561J4750N8231B19618
13652C40516J79240J46768o9501j45231J74065j52721N0366K1599j33520O2140
13642D73721J64406B87135L55310j36530j37684R8978j11618o6974J52202j12931
13632C27888O9834A46203L33930r4089J33488j09283m3001L1454J42758o9755
13622D71705r5730m3509q1300K67954k4974k29868O4893o9355L99433A73033K30023
$$ plain form
13611 403056 297280 440649 236353 202597 980572 -5295 217052 526872 496361 271899
13601 271899 124593 314030 309874 459805 251062 236625 198260 324106 441028 433491 246661
13590 246661 516870 332336 461737 235462 555443 399990 362545 233106 430632 562727
13580 562727 478754 709502 226276 125387 372788 513437 291331 295343 333251 397325
13570 397325 190530 422797 437292 728732 283070 362558 273828 -14313 404836 339508
13560 339508 326101 258654 386530 416265 394052 33730 524586 46304 -321457 268993 -69965
13548 173958 215462 22969 364589 112871 159347 305769 540281 253738 -24609 136543
13537 387679 67071 92599 390706 -49175 364278 376115 280700 356900 307236 299076 336785
$$ packed form
13611D03056j05776J43369k04296l3756P77975e295B17052L09820l0511k24462
13601B71899A24593J89437m156J49931k08743j4437l8365J25846J16922p537j86830
13590B46661K70209j84534J29401k26275L19981j55453l7445j29439J97526J32095
13580E62727q3973K30748B26276j00889K47401J40649k22106M012L7908O4074
13570C97325A90530K32267J4495K91440B83070P9488q8730a4313D04836o5328
13560C39508j3407o7447J27876K9735k2213C3730M90856D6304c21457B68993f9965
13548A73958M1504B2969L41620A12871M6476J46422K34512B53738b4609A36543
13537C87679F7071K5528K98107d9175C64278J1837r5415P6200m9664q160L7709
$$ plain form
13526 336785 5941 471586 73253 157733 212527 -44608 139074 320291 416999 244228 156129
13515 156129 456787 246456 426323 127680 274602 -23513 381293 486847 375989 302891
13505 302891 280346 167912 54527 241191 260001 218817 311091 -87756 359858 41684 190164
13494 190164 257061 271104 409173 549605 96149 257136 179660 183201 302501 175878 -56338
13482 468937 178995 154921 583125 471392 25099 312214 392478 345051 268948 436470
13472 436470 117828 203870 220413 377593 335781 142053 322936 421320 154084 34407
13461 319667 172047 648509 294800 53314 183001 193105 248592 576320 321176 280059
13451 280059 196769 286877 423724 501955 421929 21929 214004 184473 78768 168545 -67379
$$ packed form
13526C36785E941M65645G3253Q4480N4794d4608A39074J81217R6708j72771q8099
13515A56129L00658k10331J79867A27680J46922b3513C81293J05554j10858p3098
13505C02891k2545j12434E4527J86664J8810m1184R2274h7756C59858D1684J48480
13494A90164O6897J4043J38069J40432I6149J60987p7476L541J19300j26623e6338
13482D68937A78995k4074M28204j11733B5099K87115Q0264m7427p6103J67522
13472D36470A17828Q6042J6543J57180m1812A42053J80883R8384A54084C4407
13461C19667j47620M76462B94800E3314J29687J0104N5487L27728k55144m1117
13451B80059q3290R0108J36847P8231q0026B1929J92075k9531G8768Q9777f7379
$$ plain form
13439 179173 226455 408788 159876 572655 187559 40984 593650 308510 88553 -41413
13428 288991 101699 396065 -77419 196018 86840 262764 229010 208893 373037 323440
13418 323440 184442 109937 14025 126100 202574 138567 315980 178932 -200139 63866
13407 464382 415593 200173 78365 174874 173606 18187 290801 280454 279328 -48859 -20674
13395 213023 20181 -59383 -40118 145632 91297 173603 81277 406172 -176273 -100099 154465
13383 -210472 -52874 31465 156552 87436 420265 228334 374091 165261 49430 461585
13373 461585 22378 68542 -133731 24852 210837 254907 187455 345642 182370 203039 343042
13362 343042 275000 220381 174216 -233309 221664 95723 649484 172526 353211 90522
$$ packed form
13439A79173M7282J82333A59876M12779A87559D0984N52666k85140H8553d1413
13428B88991A01699K94366g7419A96018H6840J75924l3754k0117J64144m9597
13418C23440j38998p4505A4025J12075P6474o4007J77413j37048b00139F3866
13407D64382m8789B00173G8365R6509j268A8187K72614j0347j126d8859b0674
13395B13023B0181e9383J9265A45632n4335Q2306H1277L24895a76273P6174A54465
13383b10472e2874C1465J25087o9116L32829j91931J45757A65261D9430M12155
13373D61585B2378M6164a33731B4852J85985M4070o7452J58187j63272K0669J40003
13362C43042o8042n4619m6165b33309B21664I5723N53761A72526J80685I0522
$$ plain form
13351 550026 200643 129167 211053 418174 344157 320897 573863 322992 187733 -130616
13340 53356 -16598 293941 56360 54135 158941 318465 329805 449694 181369 411526 43719
13328 486353 406222 171751 298392 104518 353692 -1552 94424 452147 407614 300288
13318 300288 331941 5070 210543 419519 264965 -51869 68615 264666 -82246 198739 285096
13307 285096 52999 -85409 -27294 307931 468029 101764 42348 256141 161683 3163 -4733
13295 117545 -122387 153075 190122 125570 310531 274829 179317 -4244 521175 142483 -38241
13283 498876 236389 240320 181410 135779 162578 20824 265905 -51507 492744 482925 430503
13272 430503 307953 -58991 200968 270159 268168 -164793 -21138 155266 334118 202988
$$ packed form
13351E50026B00643p1476Q1886K07121p4017k3260K52966k50871j35259a30616
13340E3356a6598B93941E6360k225J04806J59524J1340J19889A81369K30157D3719
13328D86353q0131A71751J26641A04518K49174a552I4424L57723m4533j07326
13318C00288L1653E070K05473K08976j54554e1869F8615J96051h2246A98739Q6357
13307B85096E2999h5409b7294C07931J60098A01764D2348K13793r4458C163d733
13295A17545a22387A53075L7047o4552J84961l5702r5512d244E21175A42483c8241
13283D98876B36389L931n8910m5631K6799B0824K45081e1507D92744r819n2422
13272D30503j22550e8991B00968O9191j991a64793b1138A55266J78852j31130
$$ plain form
13262 202988 113026 61061 266082 46283 -188546 -45987 -93558 150693 216494 141300 237626
13251 237626 469160 -90451 172974 122261 159839 -122640 121849 41413 95156 319444
13241 319444 7994 74423 -42740 181788 -141507 -41727 -86188 316047 192492 -162264 240509
13229 -92173 326215 138328 241459 45089 -83226 19605 101782 418464 -36640 -68662 269422
13217 -295371 158166 580425 -67550 201954 265710 118626 -209930 -24052 82477 140904
13207 140904 215298 -227181 -7775 -74142 139056 194432 160978 105736 78058 258391 179077
13196 179077 26644 200640 295340 81474 294536 238209 -46698 -151043 -79875 129778 214085
13185 214085 -85729 -87845 398607 -136997 -176108 454629 -14488 3736 -180180 -55045 209142
$$ packed form
13262B02988q9962n1965K05021D6283a88546d5987m7571A50693O5801p5194R6326
13251B37626K31534i0451A72974n0713L7578a22640A21849D1413N3743K24288
13241C19444G994O6429d2740A81788a41507d1727m4461C16047j23555a62264B40509
13229i2173C26215A38328J03131D5089h3226A9605Q2177L16682c6640l2022B69422
13217b95371A58166M22259f7550B01954O3756A18626b09930b4052H2477N8427
13207A40904P4394b27181g775o6367A39056N5376l3454n5242k7678J80333p9314
13196A79077B6644J73996R4700H1474K13062n6327d6698j04345P1168A29778Q4307
13185B14085h5729k116C98607a36997l9111D54629a4488C736a80180e5045B09142
$$ plain form
13173 113606 258519 -85183 264455 165374 100591 -86487 -56879 -241813 101799 59355 12813
13161 123777 183069 87961 101746 235283 158543 249673 76401 52255 -101450 177619 101421
13150 101421 132332 -51561 72055 30548 28715 -329635 673 314816 299903 279968 -58403 10693
13137 170216 -53345 43457 393474 393364 85753 121307 33223 -243233 183799 211623 -57292
13125 238825 17681 -237084 457881 138017 406081 280152 50943 -184025 -197222 -32562
13114 -97948 293599 278810 -13382 100599 172520 -240848 322153 189985 334550 256618
13104 256618 318282 224370 -63893 45226 91695 16518 -86142 257485 -136007 -205514 -296722
13093 -296722 14019 -364533 277864 -109983 23968 62985 336465 85828 -3708 60140 57390
$$ packed form
13173A13606J44913h5183B64455r9081o4783h6487K9608j84934A01799m2444A2813
13161A23777N9292H7961J3785J33537p6740R1130G6401k4146a01450A77619p6198
13150A01421L0911e1561G2055C0548j833c29635F73L14143j4913j9935e8403A0693
13137A70216e3345D3457L50017j10H5753L5554C3223b43233A83799K7824e7292
13125B38825A7681b37084D57881A38017K68064j25929E0943a84025j3197c2562
13114i7948B93599j4789a3382A00599P1921b40848C22153j32168J44565p7932
13104B56618O1664r3912f3893D5226M6469A6518h6142B57485a36007o9507r1208
13093b96722A4019c64533B77864a09983B3968L9017K73480H5828c708F0140k750
$$ plain form
13082 57390 84418 112535 -16606 484108 54834 142369 54434 311891 -200807 41186 173869
13071 173869 36148 228971 -29305 234849 33454 -258173 31375 -95513 123529 151110 258513
13060 258513 187302 -95625 331160 73210 270168 371757 71800 22759 136298 -185092
13049 185192 27674 -142737 104650 191862 -53865 181726 107030 323141 100908 110163 204809
13038 204809 121903 59816 163263 171908 -284705 205294 294578 -75790 161237 209515 -20228
13026 207185 -49138 280850 177022 12673 -41724 14887 162732 316874 -258457 8896 42342
13015 42342 402802 356946 32447 221365 -8232 -300515 -204987 -25715 101924 55715 55369
13004 55369 -1733 14796 262317 -12473 177820 -248759 80213 286700 105367 19286 121086
$$ packed form
13082E7390K7028K8117a6606D84108E4834Q7535E4434K57457b00807D1186J32683
13071A73869C6148J92823b9305B34849C3454b58173C1375i5513A23529K7581J07403
13060B58513p1211i5625C31160G3210J96958J01589G1800B2759J13539a85092
13049A85192B7674a42737A04650Q7212e3865A81726p4696K16111A00908R255R4646
13038B04809q2906E9816J03447Q645b84705B05294Q9284g5790A61237M8278b0228
13026B07185d9138B80850j03828A2673d1724A4887J47845J54142b58457H896L3446
13015D2342L60460m5856C2447J88918h232k92283R5528b5715A01924m6209l46
13004E5369a733A4796K47521a2473A77820b48759H0213K06487A05367A9286J01800
$$ plain form
12993 121086 174070 -119160 -172517 557935 117948 143996 134021 82598 94127 312385 -13694
12981 -103581 3335 399665 -48824 149971 154620 -35098 -151385 -70191 -163993 528293 -65401
12969 57067 399900 110557 160258 200199 174497 -267876 86523 148689 156113 58614 271541
12958 271541 227063 84187 337159 -20453 216293 -242748 -207309 159625 230960 50971 -59077
12946 -70576 -218232 172937 -191782 30270 218215 45856 235169 286392 326474 389397 243629
12935 243629 -75479 12925 -238133 58063 -1936 69024 228271 100047 156246 114103 -55447
12923 -21916 108617 233687 97605 102527 141899 217667 296215 193207 -35093 62068 107551
12912 107551 -99664 -26131 119469 229480 -63262 -20725 -94051 3220 -147992 317903 309101
$$ packed form
12993A21086N2984a19160n3357E57935A17948K6048r975n1423J1529K18258a3694
12981a03581C335L96330d8824A49971M649c5098j16287g0191r3802E28293f5401
12969E7067L42833A10557M9701L9941k5702b67876H6523O2166P424E8614K12927
12958B71541m4478H4187K52972b0453B16293b42748L5439A59625P1335E0971e9077
12946g0576j47656A72937a91782C0270J87945D5856J89313N1223M0082O2923j45768
12935B43629g5479A2925b38133E8063a936F9024J59247A00047N6199m2143e5447
12923b1916A08617J25070I7605M922L9372P5768P8548j03008c5093F2068M5483
12912A07551i9664b6131A19469J10011f3262b0725p3326C220a47992C17903q802
$$ plain form
12901 309101 -133878 -71562 -397857 -192750 75704 -199518 -148913 -177043 111368 55404
12890 -156829 -396073 262215 39083 -228649 21303 68957 505884 159992 195175 -99964
12879 -99805 -172388 -88039 102961 74107 -355948 -28765 265644 78967 9096 110508 5784
12867 161526 176701 -363716 14150 6692 135616 88727 156683 -345921 -328387 -133871 220526
12855 -47710 -120765 -18915 385948 -526 57910 132919 9545 24748 330040 228778 -216593
12843 -161970 -97778 291496 81665 337277 145198 34713 -54577 61737 75154 -46945 134540
12831 77032 111770 -180288 6973 145115 160436 -40332 -57759 31180 46522 53717 -107940
12819 117309 -19251 88043 123973 232812 -33568 -138830 212969 -127068 260732 7261 -288461
$$ packed form
12901C09101a33878O2316l26295a92750G5704a99518N0605k8130A11368E5404
12890a56829k39244B62215C9083b28649B1303M7654M36927A59992L5183i9964
12879i9805p2583Q4349A02961k8854c55948b8765B65644G8967I096J01412E784
12867A61526J5175c63716A4150F692J28924m6889O7956c45921J7534a33871B20526
12855d7710p3055a8915C85948e26E7910P5009I545J5203L05292j01262b16593
12843a61970O4192B91496H1665K55612A45198C4713e4577F1737J3417d6945A34540
12831G7032L4738a80288F973J38142J5321d0332j7427C1180J5342P195a07940
12819A17309a9251H8043L5930J08839c3568j05262B12969a27068B60732G261b88461
$$ plain form
12807 -233104 70571 62732 82443 -183670 334792 261061 -646746 120901 -17712 162598 -309986
12795 167530 -117675 -33976 -100893 65764 185980 -303059 141071 164421 391283 12587
12784 -8200 -98449 215638 434056 -251443 179472 92953 36095 -194520 -149579 63510 74735
12773 74735 -168716 -652 283661 92146 -289786 208320 -152034 -76228 152250 -97532 -26964
12761 -108705 -41045 -192334 48102 -77933 -53410 259366 158172 313502 206690 64037
12750 -102746 102587 345733 47705 105543 142216 381836 -194294 145241 163432 -47922
12739 29866 -501203 16533 -48919 296111 -117059 29664 121611 124454 39400 -69369 31539
12727 12463 59779 411140 -63276 199244 239399 114026 438570 215974 478783 -14861
$$ packed form
12807b33104G0571p839J9711a83670C34792p3731f46746A20901a7712A62598c09986
12795A67530a17675c3976o6917F5764J20216c03059A41071K3350K26862A2587
12784h200r0249B15638K18418b51443A79472q6519C6095a94520M4941F3510J1225
12773G4735a68716f52B83661I2146b89786B08320a52034P5806A52250i7532b6964
12761a08705d1045j51289D8102g7933K4523B59366j01194J55330j06812F4037
12750a02746A02587K43146D7705N7838L6673K39620a94294A45241J8191d7922
12739B9866e01203A6533d8919B96111a17059B9664R1947K843C9400f9369C1539
12727A2463M7316L51361f3276A99244M0155A14026L24544B15974K62809a4861
$$ plain form
12716 129061 186699 142293 35768 -95222 53180 -65071 -103950 -294169 247646 -31328 -33678
12705 -33678 47907 -146038 -152887 -298596 -51499 -30713 285146 -163916 109647 -228863 244245
12693 5395 195922 293673 114228 111122 240992 356613 464892 332466 -252059 -24164 -511840
12682 -511840 -55638 -218573 -15781 -45871 84550 80186 -201877 -83009 84560 -110370 -162220
12671 -162220 -172695 331903 -10442 59766 125468 185016 -185308 -13907 148791 296688 148908
12660 148908 6679 399200 83694 136262 -244406 -17369 34898 27942 -128671 263838 -42014
12648 402810 75477 247567 171681 287299 139677 203169 75419 219977 437233 6277 134228
12637 134228 173815 179420 78405 113070 158411 401283 -117358 -817 -48504 337775 -17537
$$ packed form
12716A29061N7638m4406C5768i5222E3180f5071l8879j90219B47646c1328k350
12705c3678D7907a46038o849j45709e1499K0786B85146a63916A09647b28863B44245
12693E395J90527R7751A14228l106J29870J15621J08279j32426b52059b4164m87676
12682e11840e5638j62935a5781l0090H4550m364b01877h3009H4560a10370n1850
12671a62220j0475C31903a0442E9766O5702N9548a85308a3907A48791J47897j47780
12660A48908F679L92521H3694N2568b44406a7369C4898o956a28671B63838d2014
12648D02810G5477J72090p5886J15618A39677O3492G5419J44558K17256F277J27951
12637A34228L9587N605G8405L4665M5341K42872a17358h17m7687C37775a7537
$$ plain form
12625 -24336 182977 73793 203075 30095 141282 197769 361896 127131 183833 -43604 -8780
12613 144018 124064 400392 203574 -4989 28101 349288 -131385 109274 73748 131603 8201
12601 -210419 -110894 -342409 3388 -220146 58664 7884 226598 101125 195996 -123788 91345
12589 40761 17592 -116541 -137012 91288 110711 -168662 179688 125150 154262 392867 -324541
12577 -79716 184497 -34742 13551 107158 468241 -360129 -66528 3005 -115519 97874 -314357
12565 -3859 1863 -188678 371902 -14796 277894 158078 -224704 -63334 -114173 -20839 -29662
12554 -29662 322307 -95991 -204504 -131111 45560 111733 -140083 201366 -332147 -402728 -391398
12543 -391398 -76102 -89154 -164716 262176 99860 -121869 286701 -265919 -174691 110252
$$ packed form
12625b4336A82977G3793J29282C0095J11187N6487J64127A27131N6702d3604h780
12613A44018j9954K76328j96818d989B8101L21187a31385A09274l5526N7855H201
12601b10419R9525k31515C388b20146E8664G884K18714A01125R4871a23788I1345
12589D0761A7592a16541k0471I1288J9423a68662A79688n4538K9112K38605c24541
12577g9716A84497c4742A3551R3607L61083c60129f6528C005a15519I7874c14357
12565c859A863a88678C71902a4796B77894j19816b24704f3334n0839b0839q823
12554b9662C22307i5991j08513P3393D5560O6173a40083B01366c32147p0581J1330
12543c91398g6102j3052p5562B62176I9860a21869B86701b65919R1228A10252
$$ plain form
12532 -6591 44294 -187826 281436 180693 -202833 134373 116755 94443 -40877 54330 -12831
12520 113425 -249444 2216 198170 -138169 -668 -11669 143488 -192796 -393744 -121710 18435
12508 164370 110997 58046 120992 65725 228614 -157767 -145437 99660 141053 -26665 -73797
12497 -73797 118894 -24365 225923 -19978 -29829 175716 235666 3337 100577 117321 448182
12486 448182 415471 -55794 65732 172275 -54566 -47766 145830 146119 -69290 -136895 288204
12474 -284568 63991 -44888 376213 158202 -12838 216183 -36330 103485 109600 301307 -348068
12462 -242875 127257 -66218 -164872 151750 -121397 -329543 39370 -21538 -358523 -137582
12451 -128306 115982 -125426 130348 230288 -74170 109193 -234876 63068 117338 543836
$$ packed form
12532f591D4294a87826B81436j00743b02833A34373j7618k2312d0877E4330a2831
12520A13425b49444B216J95954a38169f68j1001A43488a92796k00948a21710A8435
12508A64370n3373n2951O2946n5267J62889a57767J2330I9660M1393b6665m7132
12497g3797A18894b4365B25923a9978r851A75716N9950C337R7240J6744L30861
12486D48182l2711e5794F5732J06543e4566O800A45830K89f9290o7605B88204
12474b84568F3991d4888C76213A58202a2838B16183c6330A03485O115J91707c48068
12462b42875A27257f6218r8654A51750a21397k08146C9370b1538l36985a37582
12451a28306A15982a25426A30348R9940g4170A09193b34876F3068N4270M26498
$$ plain form
12441 543836 214786 -161221 420653 -50202 207169 -221094 26785 40248 -10999 43744
12430 -292121 -127654 -153172 24829 146710 114480 56682 -41896 -1711 222443 -211887 -52034
12418 86271 111619 30629 -271678 -241564 -307330 191805 286100 20610 -163632 -160414 303587
12406 258979 -188242 -14096 273880 -170741 306109 79843 28336 -43292 55816 -52106 132015
12394 412495 -128790 -135825 -159962 -69810 116576 -225954 86901 -168674 -7586 46687 152461
12383 152461 -76380 -112257 9877 -209087 93304 -174088 -89905 2 233038 -79589 -181889 152023
12370 -206296 -99803 165412 -64243 289576 -70756 -180563 35204 52983 -92629 -104604 -292530
12359 -292530 208672 -65645 51097 172871 -19815 -151585 -182209 -13437 -214395 -203383 -47527
$$ packed form
12441E43836B14786a61221D20653e0202B07169b21094B6785J3463a0999D3744
12430b92121a27654k5518B4829J21881l2230E6682d1896a711B22443b11887e2034
12418H6271K5348C0629b71678L0114o5766A91805R4295B0610a63632L218C03587
12406B58979a88242a4096B73880a70741C06109G9843B8336d3292E5816e2106A32015
12394D12495a28790p035k4137f9810A16576b25954H6901a68674g586D6687J05774
12383A52461g6380l5877I877b09087I3304a74088Q4183BK33036g9589j02300A52023
12370b06296i9803A65412f4243B89576g0756j09807C5204J7779i2629j1975j87926
12359b92530B08672f5645E1097J21774a9815j31770l0624a3437k00958J1012d7527
$$ plain form
12347 -91794 248859 46365 -18579 -128008 177174 -51483 -177589 -147729 -65899 124940 16655
12335 274510 -20810 466256 -32756 281184 -110329 21091 314981 -30331 54732 -238315
12324 -133856 -203594 -188270 11246 -331719 49893 24641 184372 -174501 232579 170137 -238332
12312 384157 189336 84829 -64978 -99417 -193630 -86251 214470 -106244 248571 -36949 -174787
12301 -174787 114690 -264644 -222740 -316362 71475 -163831 195511 124526 76602 -16414 109579
12289 172027 78997 -110523 -36394 -227265 180991 -119245 -315645 214101 67237 91461
12279 91461 116698 204083 98476 169869 373913 -266299 28047 135244 -93947 204088 256139
12268 256139 384841 209168 -133739 -137757 124292 99378 -260529 -123401 163058 -329217
$$ packed form
12347i1794B48859D6365a8579j09429A77174e1483j26106K9860f5899A24940A6655
12335B74510b0810D66256c2756B81184a10329B1091K93890c0331E4732b38315
12324a33856o9738J5324A1246c31719D9893B4641J59731a74501B32579o2442b38332
12312C84157A89336H4829f4978l4439r4213h6251B14470a06244B48571c6949j37838
12301a74787A14690b64644M1904r3622G1475a63831A95511p0985m7924a6414A09579
12289A72027G8997a10523c6394j90871A80991a19245j96400B14101F7237K4224
12279I1461K5237Q7385I8476P1393K04044b66299B8047J07197i3947B04088N2051
12268B56139J28702j75673a33739m018A24292k4914b60529a23401A63058c29217
$$ plain form
12257 -109825 140182 86429 -41711 -73043 -47008 63697 -277362 -48038 92021 170243 -84320
12245 70348 168727 278974 -61942 -38237 -15566 312564 28651 -63656 31122 133047 172325
12234 172325 101530 237895 -119746 -376562 249205 -67433 486568 32287 222661 -300373
12223 515481 15314 -135359 -352686 65265 144437 336664 211752 302292 393759 177205
12212 129527 281784 -39596 282204 383358 87268 97842 331316 163767 230907 287119
12202 287119 220591 292252 -146039 1364 278438 93142 206081 -170346 98468 69628 224105
12191 224105 476650 -199302 60747 73944 363091 -61390 225899 108468 63207 -23476
12180 111348 190952 309169 184622 331474 163575 205441 -48711 134850 -22658 331970
$$ packed form
12257a09825A40182n3753d1711l1332K6035F3697b77362d8038I2021P8222h4320
12245G0348R8379J10247f1942K3705a5566C12564B8651f3656C1122J01925L9278
12234A72325p0795J36365a19746k56816B49205f7433D86568C2287J90374c00373
12223E15481A5314a35359k17327F5265P9172J92227j24912R0540R1467A77205
12212A29527J52257c9596B82204J01154H7268J0574K33474A63767O7140N6212
12202B87119o6528P1661a46039A364K77074I3142J12939a70346I8468k8840J54477
12191B24105K52545a99302F0747J3197K89147f1390B25899A08468m5261b3476
12180A11348P9604J18217j24547J46852A63575M1866d8711A34850b2658C31970
$$ plain form
12169 28342 18311 7925 -98621 -30942 -78622 252557 78441 184171 120209 208234 168422
12158 168422 -30777 43171 156247 -294517 -75467 -29760 437127 103556 149389 407471
12148 407471 46483 275578 -367878 159179 100327 195028 186558 162496 216542 160992 125612
12137 125612 -68999 195431 154476 -80223 196608 108991 170518 -143043 211163 -67381 -25631
12125 58422 19122 20988 199975 -29193 -113002 -51500 -64510 385403 151900 -327823 -248302
12114 -248302 89295 218497 -139392 119856 196863 85410 59743 155547 -246327 58014 91797
12103 91797 94397 69519 159080 -11407 37239 195830 -42236 -264040 -116607 -77992 -210979
12092 -210979 45199 -156027 106128 53907 250381 -245344 114483 202815 -302150 42869
$$ packed form
12169B8342j0031G925i8621c0942m7680B52557G8441J05730o3962Q8025l9812
12158A68422c0777D3171J13076b94517g5467b9760D37127A03556M5833K58082
12148D07471D6483K29095c67878A59179n8852R4701q470k4062N4046n5550l5380
12137A25612f8999A95431m0955h0223A96608q7617O1527a43043B11163f7381b5631
12125E8422A9122J866J78987b9193q3809e1500j3010C85403A51900c27823P9521
12114b48302H9295J29202a39392A19856P7007H5410k5667R5804b46327E8014L3783
12103I1797K600k4878Q9561a1407C7239J58591d2236k21804a16607L8615j32987
12092b10979D5199a56027A06128n2221J96474b45344A14483Q8332c02150D2869
$$ plain form
12081 265710 -331087 -243512 77751 99259 -62784 70941 -205904 165887 -251851 301771
12070 -118643 265085 259611 41762 70961 -353513 45563 -343534 98218 272102 73195 -3295
12058 147361 -177044 -88963 211568 68710 -129640 -49187 216374 -4632 321445 113451
12047 15151 364601 -7546 279480 199170 527568 934560 428606 322041 217497 115905
12037 115905 371971 255614 187924 260796 138257 15308 -112724 -22168 76084 -111340
12026 78660 -421 -279082 -181758 159486 -513499 176088 -386378 -30645 -125186 -20491 79297
12014 -128188 -54411 305935 221902 130299 -140730 114128 -288356 -251499 -433708 34505
12003 286154 -79484 210937 -76991 287025 -177000 8801 -132647 71828 167323 -305931 -238595
$$ packed form
12081B65710c31087Q7575G7751K1508f2784G0941b05904A65887b51851C01771
12070a18643B65085n474D1762K9199c53513D5563c43534I8218J73884G3195c295
12058A47361a77044Q8081B11568F8710a29640d9187B16374d632C21445A13451
12047A5151L49450g546B79480q0310L28398M06992D28606j06565j04544j01592
12037A15905K56066j16357o7690P2872j22539A5308a12724b2168G6084a11340
12026G8660d21k78661R7324A59486e13499A76088c86378c0645r4541b0491G9297
12014a28188e4411C05935q4033r1603a40730A14128b88356L6857j82209C4505
12003B86154g9484B10937g6991B87025a77000H801a32647G1828R5495c05931O7336
$$ plain form
11992 -238595 -208417 -85821 -34416 33151 10134 102720 -146953 240016 -233055 -141207 157807
11980 95463 -174023 101541 -136547 -2443 104364 -55454 -115118 -148734 -371712 42607 -2140
11968 -245829 50124 -299463 -31044 195640 -355074 -66435 -14416 -366934 143170 -229348
11957 23917 207946 101633 -38985 80712 28615 -211145 66873 -38238 120914 -47197 -222182
11946 -222182 27285 -203270 9637 -10370 206146 -124949 -12366 -304408 30614 -192848 -61084
11934 301666 18593 494849 -100360 288957 171658 9399 -201328 -75554 -171061 239471
11923 -4110 -114956 34214 9802 -206661 170623 -42482 100479 101339 -51233 -46108 -44088 148290
11910 207728 -2543 -104598 125953 -38595 -359570 -92752 -24979 27918 -77460 42530 -106708
$$ packed form
11992b38595L0178h5821c4416C3151A0134R2586a46953B40016b33055R1848A57807
11980I5463a74023A01541a36547b443A04364e5454n9664l3616k22978D2607b140
11968b45829E0124b99463c1044A95640c55074f6435a4416l52518A43170b29348
11957B3917J84029A01633c8985H0712B8615b11145F6873c8238A20914d7197j74985
11946b22182B7285b03270I637a0370B06146a24949a2366k92042C0614a92848f1084
11934C01666A8593M76256a00360B88957j17299I399b01328g5554r5507B39471
11923d110j10846C4214I802b06661A70623d2482A00479Q60e1233N125K020A48290
11910B07728b543j02055A25953c8595l20975i2752b4979B7918g7460D2530a06708
$$ plain form
11898 -65820 -194871 173982 -56156 36484 -143437 -88293 170728 -196384 -68953 263253
11887 -43326 -173929 144165 228023 -176827 116188 -84198 -70628 -30447 27459 -121159 -127203
11876 -127203 35762 -272531 -252345 171891 -34389 132972 -262966 110240 -296751 118291
11865 -22463 -112785 -62508 23029 -14652 -200119 -122557 212580 -22812 -110296 -155040 -32994
11853 126968 3083 44537 36978 -177392 -219332 26240 72794 5211 151743 336545 66198
11841 -65076 -230409 25381 97214 66405 -57530 -419160 157050 504454 -358940 -91985 -167847
11830 -167847 -60570 244190 154331 -107282 -201359 -111006 26058 -239001 68876 166885 252324
11819 252324 -41454 -130365 -115257 138221 45802 9671 223368 -149513 -63941 -108071 -183260
$$ packed form
11898f5820j29051A73982e6156C6484a43437N5144A70728a96384f8953B63253
11887d3326j30603A44165Q3858a76827A16188h4198J3570c0447B7459a21159o044
11876a27203C5762b72531K0186A71891c4389A32972b62966A10240b96751A18291
11865b2463r0322N0277B3029a4652j85467P7562B12580b2812q7484m4744c2994
11853A26968C083M1454p559a77392m1940B6240M6554E211J46532J84802F6198
11841f5076j65333B5381P1833l0809e7530l61630A57050L47404c58940i1985p5862
11830a67847f0570B44190q9859a07282r4077R0353B6058b39001F8876R8009Q5439
11819B52324d1454q8911J5108A38221D5802I671K13697a49513f3941m4130p5189
$$ plain form
11808 -183260 196548 -32377 45926 -166491 -18371 -481924 -22016 -57150 -242 150407 226224
11797 226224 -93511 94924 -190310 43199 134898 -193222 -216407 293305 -84093 -95105 112199
11785 11580 -36356 62777 287122 -356620 -256236 17349 235050 176199 200191 -226061 -67802
11773 78503 45091 -331802 -33601 -75573 96940 256766 -68741 -82251 58663 -224883 -4384
11761 247822 46623 -161195 137968 3276 -10137 250152 293084 76211 -118352 -171341 -67113
11749 171592 -26779 -174596 206312 83956 -57822 -55879 -149236 -71942 -7919 -95593 123191
11737 -122529 2865 40487 119431 -162192 -387669 -126728 -37815 -175495 93725 -59790 177605
11725 67068 -180413 103095 -68501 22193 193255 -135347 131365 -179940 -61712 -39081
$$ packed form
11808a83260A96548c2377D5926a66491a8371m63553b2016l5134b42A50407P5817
11797B26224i3511I4924a90310D3199R1699a93222k3185B93305h4093j1012A12199
11785A1580c6356F2777K24345c56620J00384A7349K17701n8851K3992b26061f7802
11773G8503l3412c31802c3601m1972I6940J59826f8741j3510E8663b24883d384
11761B47822D6623a61195A37968C276a0137B50152M2932G6211a18352n2989f7113
11749A71592b6779j47817B06312H3956e7822J943r3357g1942g919q7674A23191
11737a22529B865L7622P8944a62192k25477a26728c7815j37680I3725e9790A77605
11725F7068a80413A03095f8501B2193J71062a35347A31365a79940f1712K2631
$$ plain form
11715 -39081 -101580 -153141 195654 89881 -173620 -146320 -191670 -238566 -26970 130887 25987
11703 -64388 42228 255680 -223643 161247 393359 -114585 -171679 219774 -277078 -160845
11693 -160845 75485 211159 194095 276834 98081 347271 239847 4570 17816 -85417 -24378
11681 -206081 -147684 412058 283431 179437 -109881 96084 89822 3376 336893 87083 48568
11670 48568 -21777 301888 -71717 -134558 14519 236160 2397 -316469 -252953 257590 274419
11659 274419 147264 -48063 186679 236446 154314 172908 -87634 113627 -130084 89094 128078
11648 128078 -136453 334966 -372211 49241 18427 -397070 3458 121119 -77374 -12441 -33473
11637 -33473 -94704 -237159 -87263 343978 -251936 99946 -19990 -23993 -74349 37682 -78014
$$ packed form
11715c9081o2499n1561A95654H9881a73620K7300m5350m6896b6970A30887B5987
11703f4388D2228K13452b23643A61247K32112a14585n7094B19774b77078J16233
11693a60845G5485J35674j7064Q2739I8081K49190j07424D570J3246h5417b4378
11681b06081N8397D12058j28627j03994a09881I6084o262C376L33517H7083l8515
11670D8568b1777C01888g1717o2841A4519K21641B397c16469O3516B57590J6829
11659B74419j27155d8063A86679M9767q2132J8594h7634A13627a30084H9094L8984
11648A28078a36453C34966c72211D9241A8427c97070C458J17661g7374a2441k1032
11637c3473o1231j42455h7263C43978b51936I9946a9990m003n0356C7682g8014
$$ plain form
11625 36692 18460 -254152 -154820 -56947 263041 -202676 -48979 84300 -122675 -294937 33786
11613 401052 115004 50786 51706 -14978 286523 -96778 283924 105273 243555 -282793 -75987
11601 137822 -183664 2311 244577 -102404 -274860 49480 -57764 310503 -26053 103343
11590 -93658 81794 -45284 -39992 -247082 4416 121333 142983 38883 -44343 577858 219120
11578 209880 15370 297328 -255528 -160496 324059 156992 -49412 -67282 56433 46864 61980
11567 61980 49022 112878 128419 22880 -288254 82307 -71482 -100670 301327 230624 -48245
11555 -270234 -212439 421505 184404 426357 333828 121242 -129739 -124752 -111858 255474
11544 -44212 -292906 152894 -190184 14671 -31582 273590 87917 -86804 -16400 -98559 -39668
$$ packed form
11625C6692j8232b54152R9332e6947B63041b02676d8979H4300a22675j72262C3786
11613D01052A15004E0786R20a4978B86523i6778B83924A05273J38282b82793g5987
11601A37822a83664B311K42266a02404j72456D9480e7764C10503b6053A03343
11590i3658H1794d5284N292k07090D416J16917K1650C8883d4343E77858B19120
11578B09880A5370K81958b55528R5032C24059A56992d9412j7870E6433r569J5116
11567F1980j2958O3856J5541B2880b88254H2307g1482k9188C01327p0703d8245
11555b70234N7795D21505A84404K41953r2529A21242a29739M987J2894B55474
11544d4212k48694A52894a90184A4671c1582B73590H7917h6804a6400q2159c9668
$$ plain form
11532 210992 197679 96200 -20895 104213 -178655 -87316 24736 61900 120817 196670 8952
11520 297730 -213809 41943 -95499 -334793 -3292 132807 -84183 111689 -47038 -247634 175919
11508 296423 211532 -92658 23385 26426 306057 502752 -284661 408130 221144 94113 -37204
11496 587373 222255 550151 219289 252882 -236270 -41349 448443 156054 109045 -34816
11485 86061 392361 533108 41944 245079 -129134 -97750 -327319 105833 -53766 35905
11474 372594 -134639 -86642 169387 332301 271463 241008 32042 -21906 187210 352933
11464 352933 9261 94143 -31447 26256 -215191 15477 260551 217742 176001 -102007 -87674
11453 -87674 -120615 -205706 437214 143563 212873 58341 204097 184161 202064 54746 139418
$$ packed form
11532B10992j3313I6200b0895A04213a78655h7316B4736L7164N8917P5853H952
11520B97730b13809D1943i5499k39294c292A32807h4183A11689d7038k00596A75919
11508B96423q4891i2658B3385L041K79631J96695b84661D08130j86986I4113c7204
11496E87373B22255L27896B19289L3593b36270d1349D48443A56054m7009c4816
11485H6061L06300J40747D1944K03135a29134L1384k29569A05833e3766C5905
11474C72594a34639M7997A69387J62914o0838l0455C2042b1906A87210J65723
11464C52933I261Q4882c1447B6256b15191A5477K45074m2809m1741a02007J4333
11453h7674l2941q5091D37214A43563O9310E8341J45756j9936J7903E4746Q4672
$$ plain form
11442 139418 27696 198391 -189601 54251 62593 170892 17713 52319 263917 220047 192186
11431 192186 346206 26449 -54854 -91961 428028 252119 253993 245874 40648 -171012 58163
11419 17026 20666 106754 51059 -34383 85917 -163985 61186 66093 185386 80036 -329416
11407 -399237 -179512 358903 -164044 -456255 -100299 -80819 -297644 -148605 390 -16720
11396 -95418 28594 211775 -79014 98219 6330 -116425 115665 99619 -1004 38823 -183996
11384 -185791 -192843 28218 276589 67601 402812 -192868 -52863 -94317 -25701 -59418 -5885
11372 63485 -31740 -62732 -205701 162663 73208 -197412 -359774 151135 4280 97100 -38042
11360 97430 -54161 -42207 -289682 148544 -35899 -141 -50172 -352911 301690 -229144 74116
$$ packed form
11442A39418B7696J70695a89601E4251Q342J08299A7713L4606K11598m3870k7861
11431A92186J54020B6449e4854l7107D28028j75909J874q119D0648a71012E8163
11419A7026L640Q6088E1059c4383H5917a63985F1186M907J19293H0036c29416
11407c99237a79512C58903a64044k92211a00299J9480k16825a48605C90a6720
11396i5418B8594J83181g9014I8219F330a16425A15665j6046a004C8823a83996
11384a85791p052B8218K48371F7601L35211a92868e2863m1454b5701l3717e885
11372F3485c1740l0992j42969A62663G3208a97412j62362A51135D280R2820c8042
11360I7430e4161J1954k47475A48544c5899a41n0031l02739C01690b29144G4116
$$ plain form
11348 28240 -17218 -2193 187570 -133859 342748 33075 -255485 -131149 -172304 -146177 262208
11336 154088 212382 -113755 -20430 -125308 -241014 -92204 -25850 263981 126264 386139
11326 386139 16812 -88673 105386 255083 227921 161581 -26761 -87098 17212 35593 153750
11315 153750 -303425 -30517 -58598 237426 277526 29898 -38305 735 -216749 -65255 -150925
11304 -150925 -229240 -158686 -57521 -90408 -80893 -26492 254378 -24837 79098 -53399 16567
11292 85069 -239499 99186 -87681 26754 -256127 126487 40671 79474 73774 248727 439778
11281 439778 -89452 -212582 47420 78919 -141939 -171007 94338 230539 -159470 166681
11270 -116745 232536 -423785 396522 -195124 -76347 44896 -18236 51272 -298373 -28554
$$ packed form
11348B8240a7218b193A87570a33859C42748C3075b55485J24336m1155K6127B62208
11336A54088N8294a13755b0430j04878j15706i2204b5850B63981A26264K59875
11326C86139A6812h8673A05386J49697k7162o6340b6761o0337A7212J8381J18157
11315A53750c03425c0517k8081B37426M0100B9898c8305G35b16749f5255q5670
11304a50925p8315P0554e7521l2887R515b6492B54378b4837G9098e3399A6567
11292H5069b39499I9186h7681B6754b56127A26487D0671L8803n700J74953J91051
11281D39778h9452j23130D7420L1499a41939k9068I4338J36201a59470A66681
11270a16745B32536d23785C96522a95124g6347D4896a8236E1272b98373b8554
$$ plain form
11259 121498 -324394 -274222 35894 -189595 128419 -292520 -199877 -179925 -209009 49807 -224854
11247 83564 -184342 -48812 232903 -116424 7096 44589 39818 209354 -127130 101753 -146855
11235 -254154 -172313 5509 -13618 -38822 -325618 344875 -161660 262913 -102165 242134
11224 -111703 132853 -64783 -181404 -341434 -103291 260342 -269519 -188749 70203 -22589
11213 -24409 194673 -42317 -219724 -72913 -25596 -355283 98836 83872 21683 277618 317698
11202 317698 -251793 -174783 174424 -181503 56674 -214862 17946 73039 186347 -85251
11191 69314 1418 -96162 -70146 -1591 74665 86600 109674 108557 -6596 -79767 26760 -292149
11178 -229567 72225 184362 -384535 28738 -170391 -191996 115731 32471 209202 131447
$$ packed form
11259A21498c24394N0172C5894a89595A28419b92520R2643J9952k9084D9807b24854
11247H3564a84342d8812B32903a16424G096L7493m771J69536a27130A01753a46855
11235b54154Q1841E509a3618k5204k86796C44875a61660B62913a02165B42134
11224a11703A32853f4783j16621j60030a03291B60342b69519Q0770G0203b2589
11213b4409A94673d2317j77407g2913b5596l29687I8836j4964B1683K55935M0080
11202C17698b51793P7010A74424a81503E6674b14862A7946N5093J13308h5251
11191F9314A418i6162K6016a591G4665J1935K3074j117f596p3171B6760b92149
11178b29567G2225J12137c84535B8738a70391k1605A15731C2471J76731p7755
$$ plain form
11168 131447 -150067 -46926 -176969 120865 -266532 -3526 212253 6103 -95784 322111 -163842
11156 -253641 22719 -57715 -5437 -214535 -223119 -50807 -125661 125428 -223603 -320103 217556
11144 220149 45615 133021 -281822 -9489 21052 182217 -156379 42902 49615 14442 72395
11133 72395 -458595 -104198 29907 -58810 -168792 195667 -105899 -61370 232740 69491
11122 -346118 -211240 -59558 214288 -62360 212049 13457 383813 89660 16682 -17606 185104
11110 -329869 -111337 -211856 95323 -62960 2399 -158269 188555 220629 -182081 -348 177723
11098 -25663 21272 -20232 22163 -231412 -14877 273257 140299 269361 16951 200109 -12097
11086 247156 229391 148028 128402 -37557 238512 117279 57238 257713 200571 223149 195190
$$ packed form
11168A31447a50067d6926j30043A20865b66532c526B12253F103i5784C22111a63842
11156b53641B2719e7715e437k09098q584e0807p4854A25428b23603r6500B17556
11144B20149D5615Q7406b81822i489B1052J61165a56379D2902O713A4442N7953
11133G2395d58595a04198B9907e8810j09982A95667a05899M4529B32740F9491
11122c46118J34878e9558B14288f2360B12049A3457L70356H9660A6682a7606A85104
11110c29869a11337j00519I5323f2960B399a58269A88555L2074a82081c48A77723
11098b5663B1272b0232B2163b31412a4877B73257j32958J29062A6951J83158a2097
11086B47156j7765q1363j9626c7557B38512A17279E7238K00475n7142K2578k7959
$$ plain form
11075 195190 414118 206255 278475 75551 -11558 240195 307399 102271 219133 362848
11065 362848 -11329 256966 181470 347120 429246 309914 350489 351017 84832 543266 606016
11054 606016 315161 253956 161104 546592 405788 458372 752235 589045 510852 385775
11044 385775 442128 439290 739929 483032 1085241 898041 816338 899513 453740 499574 591191
11033 591191 641649 797008 826431 802590 724059 534213 682315 824007 333495 566140
11023 566140 685785 905426 907341 801466 774432 753036 850811 600724 511896 438698 722412
11012 722412 724290 716592 749250 705458 209445 674454 649153 627148 575962 560371 491777
11001 491777 209118 532193 703560 579517 538107 505433 459992 532433 972422 500486
$$ packed form
11075A95190K18928B06255P2220G5551a1558B40195O7204A02271J16862J43715
11065C62848a1329B56966p5496J65650Q2126j19332M0575N28H4832M58434O2750
11054F06016k90855o1205r2852L85488j40804N2584K93863j63190p8193j25077
11044C85775N6353k838L00639k56897O02209j87200q1703Q3175m45773M5834R1617
11033E91191N0458J55359K9423k3841p8531j89846J48102J41692C33495K32645
11023E66140J19645K19641J915j05875k7034k1396R7775k50087q8828p3198K83714
11012G22412J878p698L2658m3792B09445M65009k5301k2005n1186j5591o8594
11001D91777B09118L23075J71367j24043m1410l2674m5441P2441M39989m71936
$$ plain form
10991 500486 732301 278863 628950 515081 344206 483831 711706 707314 645693 379059
10981 379059 503519 663436 662115 743294 773433 841511 704045 827730 691207 783711 1111773
10970 1111773 863004 1054157 1091665 1011446 1193791 1173873 1580549 1827107 1713445 2001075
10960 2001075 2095830 2324975 2321233 2785084 2545588 2674196 2355687 1987425 2058351 1464764
10950 1464764 1640169 1238266 1415597 1174604 1180128 1322603 994284 1278632 1300259 1177166
10940 1177166 1229093 972756 1162847 860269 594339 652418 359856 568137 338600 447767
10930 447767 571855 161824 477123 330284 15512 -55255 364990 6439 -35267 -87266 -117920
10919 -117920 -133065 79151 -82755 261806 15557 -127864 -45607 190464 -95419 -142597 82664
$$ packed form
10991E00486K31815B78863L50087j13869j70875J39625K27875m392o1621k66634
10981C79059J24460J59917j321Q1179L0139O8078j37466J23685j36523R2504L28062
10970A111773k48769J91153L7508q0219J82345j9918M06676K46558j13662K87630
10960B001075R4755K29145l742M63851k39496J28608l18509l68262P0926n93587
10950A464764J75405m01903J77331k40993N524J42475l28319K84348K1627j23093
10940A177166N1927k56337J90091l02578k65930N8079k92562K08281k29537J09167
10930D47767J24088A61824L15299j46839A5512e5255C64990F439c5267n1999l0654
10919a17920j5145G9151h2755B61806A5557a27864d5607A90464i5419m7178H2664
$$ plain form
10907 -548272 163519 -87060 -244640 -158533 -146155 -89780 240143 -113568 250333 -228433
10896 -316329 -226791 -212339 23153 94195 -150753 -259951 187465 185379 -55774 -263915 -230309
10885 -230309 187253 215681 53779 -3710 -31655 -184251 -91807 -210863 -90161 87849 22410
10873 62367 -245203 -208104 61397 161636 13305 -80493 161817 23953 155392 -111448 -5495
10861 -121967 292431 14930 228725 -222934 -57998 -70163 1436 -127293 -135248 -149525 -40777
10849 99233 -108798 48231 64168 109221 -78860 -204555 27664 -136242 -91107 -28904 121446
10837 241844 -305622 -148104 -30205 -6746 -22491 -27961 -36654 -22619 24020 -351812 -121285
10825 -57106 -335391 399751 -132684 286690 33707 -20997 12672 -343595 107613 115101 -226167
$$ packed form
10907e48272A63519h7060j57580Q6107J2378N6375B40143a13568B50333b28433
10896c16329Q9538J4452B3153P1042a50753j09198A87465k086e5774k08141L3606
10885b30309A87253K8428E3779c710k7945j52596i1807j19056i0161H7849B2410
10873F2367b45203L7099F1397J00239A3305h0493A61817B3953J31439a11448e495
10861a21967B92431A4930K13795b22934e7998j2165A436a27293p955j4277d0777
10849I9233a08798D8231J5937M5053g8860j25695B7664a36242M5135b8904A21446
10837B41844c05622a48104c0205f746j5745n470q693J4035B4020c51812a21285
10825e7106k78285C99751a32684B86690C3707b0997A2672c43595A07613P488b26167
$$ plain form
10813 4873 -46640 -207043 -227173 162433 -165761 42350 -127679 3829 59779 27075 -72378
10801 139516 307706 108075 -33645 -68123 -75137 -89684 -101291 -273199 30708 -63870 -172593
10790 -172593 243924 247010 -179335 44353 -141116 -97119 22179 136332 -125819 -158577 136800
10778 -17315 -111431 -267606 -241256 -322594 -236524 -159397 492792 479553 271605 -204807 34326
10766 -312140 -51728 138919 -19210 -214898 74868 226001 -30405 97810 -40919 176844 -170724
10754 94563 -104084 260904 226004 -33547 -270116 -103210 169877 299578 -14617 15868
10743 -84183 203179 445440 -26438 69731 104945 -307955 -186641 -104810 21453 -92188 -112241
10732 -112241 169260 -149845 42400 -157996 51945 -265383 -66066 47584 -78421 388673
$$ packed form
10813D873d6640j60403k0130A62433a65761D2350a27679C829N5950B7075g2378
10801A39516J68190A08075c3645l4478p014j4547j1607j71908C0708f3870j08723
10790a72593B43924L086a79335D4353a41116M3997B2179J14153a25819l2758A36800
10778a7315r4116j56175K6350q1338Q6070P7127D92792j3239k07948b04807C4326
10766c12140e1728A38919a9210j95688G4868J51133c0405I7810d0919A76844a70724
10754I4563a04084B60904l4900c3547k36569a03210A69877J29701a4617A5868
10743h4183B03179K42261b6438F9731L5214c07955J21314Q1831B1453i2188k0053
10732a12241A69260a49845D2400a57996E1945b65383f6066D7584g8421C88673
$$ plain form
10721 -40264 -1831 -248915 74531 -34824 -101050 -25045 -57614 -323220 -416133 -38270 -44968 150171
10708 -385883 -220896 67511 -218192 -90169 -541338 -91693 -121170 296047 -41315 222987
10697 51809 -371161 76702 -395503 130916 -53855 -176854 -240826 95333 -286746 41407 -205389
10685 -235321 77184 -148403 -269277 -91924 35876 317911 -218116 287529 -7442 31527 -73024
10673 -488782 -376733 -206433 -71543 -125142 10911 -74064 -392201 -202740 -23052 -265393
10663 -265393 -438243 -52238 16969 -208585 320169 448940 -125898 144651 124240 -233401
10652 -1636 -91644 -138950 -124735 -52376 -103308 211478 -64747 -166379 -164390 83252 11435 258896
10640 258896 225423 -31001 -32927 -314196 -77691 -56741 -183864 -37029 58795 -207296 -413110
$$ packed form
10721d0264a831k47084G4531c4824o6226b5045l2569k65606r2913c8270o698A50171
10708c85883J64987F7511b18192i0169m51169i1693k9477B96047d1315B22987
10697E1809c71161G6702c95503A30916e3855j22999o3972I5333b86746D1407b05389
10685b35321G7184a48403j20874i1924C5876K82035b18116B87529g442C1527g3024
10673d88782J12049J70300g1543n3599A0911g4064l18137J89461b3052k42341
10663b65393j72850e2238A6969b08585C20169J28771a25898A44651k0411b33401
10652a636r0008m7306J4215e2376n0932B11478f4747j01632J989H3252A1435K47461
10640B58896l3473c1001j926k81269g7691K0950j27123c7029E8795b07296k05814
$$ plain form
10629 -413110 105919 -156480 -216511 140384 -300350 -146288 -311462 -344101 176243 -167628
10618 328385 62284 -22004 -168724 -102101 10154 -80265 -257976 234990 -146167 -67792 -109742
10607 -109742 -20556 364463 22313 14230 -75962 -238915 149111 39866 127723 -120679 197613
10595 -57307 -23913 106098 383917 306024 -187791 9360 -193146 -339995 18721 105246 71466
10584 71466 -306209 -288007 -487 199366 48597 6393 58784 12502 11780 10258 314710 94504
10571 -185320 -200334 -49922 -70264 -390227 112989 143663 249278 264947 -71593 177326 124344
10560 124344 -103001 226155 36834 4387 -323055 226370 11535 -22191 95748 -2416 151116
10548 -106624 66635 -168585 -13685 -162241 -342942 -202912 -246950 -18257 346227 -66430
$$ packed form
10629d13110A05919a56480o0031A40384c00350a46288j65174l2639A76243a67628
10618C28385F2284b2004j46720O6623A0154h0265j77711B34990a46167f7792m1950
10607a09742b0556C64463B2313q083g5962j62953A49111C9866Q7857a20679A97613
10595e7307b3913A06098K77819p7893a87791I360a93146j46849A8721Q6525l3780
10584G1466c06209J8202d87A99366D8597F393N2391A2502p22j522L04452I4504
10571a85320j5014d9922k0342l19963A12989L0674J05615J5669g1593A77326n2982
10560A24344a03001B26155C6834D387c23055B26370A1535b2191I5748b416A51116
10548a06624F6635a68585a3685j48556j80701J40030m4038a8257C46227f6430
$$ plain form
10537 192036 -139294 101151 241053 -170005 -133001 -260637 128249 -38596 105369 23123
10526 -252558 211386 -74030 -29590 -81759 -46166 77392 -163647 13062 -20429 -275423 -41588
10514 -200492 -267209 122337 -35948 -250689 -119608 31903 -101298 58216 -93092 -226212
10504 -226212 -1988 -84561 -71562 -54989 141151 202955 -61580 107012 -84659 -105177 138230
10492 2306 -485303 84253 -168 -133621 88184 358590 35530 -34352 146116 -155170 -11491
10480 247776 144088 64578 240577 107674 99365 87165 258244 47820 -16763 -134627 229716
10468 422572 143191 10311 138303 288438 207927 19604 360560 85576 73561 -14641 -93712
10457 -93712 170964 -25228 -141473 -104091 58213 167171 165639 -50565 271943 3239 -304857
$$ packed form
10537A92036a39294A01151J39902a70005L7004j27636A28249c8596A05369B3123
10526b52558B11386g4030b9590n2169L5593G7392a63647A3062b0429k54994d1588
10514b00492o6717A22337c5948k14741a19608C1903a01298E8216i3092j33120
10504b26212a988q2573J2999J6573A41151O1804f1580A07012h4659k0518A38230
10492B306d85303H4253a68j33453H8184K70406C5530c4352A46116a55170a1491
10480B47776j03688F4578J75999A07674q309j2200J71079D7820a6763j17864B29716
10468D22572A43191A0311J27992J50135q0511A9604L40956H5576j2015a4641p9071
10457i3712A70964b5228j16245L7382E8213J08958j532e0565B71943C239c04857
$$ plain form
10445 -235965 208568 -296854 216563 -131695 -159346 -84192 -100098 -269855 -337616 -836 2807
10433 -298188 -58506 -257206 -99947 -335487 60278 293116 -239033 9446 97334 36701 -144687
10421 -151 -96208 226147 -122116 235276 -124238 184189 -352837 49546 -134613 -78968 -94439
10410 -94439 -198634 -71028 -39286 16852 -57008 126540 -214955 167479 194172 379000 146802
10398 -33184 58328 -176812 -207504 235360 -73186 235594 2943 -70604 374697 230660 48110
10386 -81249 157809 -166689 53914 -67605 -12661 -90215 168754 -72026 305302 186381 -121496
10374 -92857 -9191 -213309 294088 -101135 288313 293211 175737 322606 -192447 100680
10363 132037 334204 280270 241349 337266 13345 240796 237823 -1443 86640 251082 572694
$$ packed form
10445b35965B08568b96854B16563a31695k7651P5154j5906j69757o7761h36B807
10433b98188e8506j98700i9947k35540F0278K32838b39033I446Q7888C6701a44687
10421a51r6057B26147a22116B35276a24238A84189c52837D9546a34613N5645j5471
10410i4439j04195g1028L1742A6852e7008A26540b14955A67479K6693J84828A46802
10398c3184E8328a76812l0692B35360g3186B35594B943g0604C74697j44037D8110
10386h1249A57809a66689E3914f7605a2661p7554A68754g2026C05302j18921a21496
10374i2857i191k04118B94088a01135B88313M898j17474J46869a92447A00680
10363A32037K02167n3934l8921R5917A3345K27451k973a443H6640J64442L21612
$$ plain form
10352 572694 563141 194496 318704 479090 248011 32426 409517 482824 -96544 66653 145503
10341 145503 144038 -129912 482477 314313 385098 688816 574443 286750 436131 351266
10331 351266 294133 307947 113615 115285 437663 300013 604622 85976 432340 436889 159902
10319 5353 -163112 8108 239962 68200 -4761 214010 -23350 147543 234391 -338991 177902
10307 90615 216127 11740 324487 52855 -388915 100976 -25997 144675 -165687 44551
10296 -181204 116417 355942 58287 -457572 3322 63797 303591 27774 -79983 187112 -329822
10284 12660 175127 -217062 -20242 -50893 200557 -120090 -60968 -205016 -161144 -218992 -120622
10273 -120622 169456 -21087 285632 -448506 15805 16166 -164083 41914 -92437 -98992 25918
$$ packed form
10352E72694r553A94496J24208J60386k31079C2426L77091P3307i6544F6653P8850
10341A45503j465a29912D82477j68164P0785L03718j14373B86750J49381q4865
10331C51266n7133J3814A13615J670L22378j37650L04609H5976L46364M549A59902
10319E353a63112H108K31854F8200d761B14010b3350A47543Q6848c38991A77902
10307I0615J25512A1740L12747E2855c88915A00976b5997A44675a65687D4551
10296a81204A16417K39525E8287d57572C322O0475K39794B7774g9983A87112c29822
10284A2660J62467b17062b0242l0651B00557a20090N9122j44048M3872n7848R8370
10273a20622A69456b1087B85632d48506A5805L61a64083D1914i2437o555B5918
$$ plain form
10261 -58901 -86806 -214261 120715 -16052 134525 -27677 -198478 56582 -232010 90909 12449
10249 -323973 -58645 108200 216448 252506 174151 -124913 34237 279862 -218689 -139562
10239 -139562 146907 -35910 -76160 71452 -1320 -234356 -167571 293763 45142 -1752 101564
10227 1877 -129973 -48792 -234091 127117 -40061 -131999 110292 -29809 -47551 -249541 96887
10215 34985 -191394 172307 808 10518 43294 1830 -321117 -97079 -26639 -89450 -41929 135887
10202 -253265 -48065 328302 73476 -189518 3527 -333472 221800 -179016 175172 -22877
10191 -28182 4802 -181463 115445 -48532 51292 -302434 205883 136965 -89832 225375 -260575
10179 -93400 -279173 -365698 142055 40073 -175507 260925 -163116 -78959 50930 -26661 40498
$$ packed form
10261e8901k7905j27455A20715a6052A34525b7677j70801E6582b32010I0909A2449
10249c23973e8645A08200J08248L6058p8355a24913C4237K45625b18689P9127
10239a39562A46907c5910m0250G1452a320k33036O6785B93763D5142a752A01564
10227A877a29973d8792j85299A27117d0061r1938A10292b9809j7742k01990I6887
10215C4985a91394A72307H08R710L2776A830c21117i7079b6639o2811d1929A35887
10202b53265d8065C28302G3476a89518C527c33472B21800a79016A75172b2877
10191b8182D802a81463A15445d8532E1292c02434B05883o8918h9832B25375b60575
10179i3400j85773q6525A42055D0073a75507B60925a63116g8959E0930b6661D0498
$$ plain form
10167 -23105 -154895 77039 -8328 69338 133829 226384 184227 -357172 -365845 153692 -257956
10155 -91448 -170069 -240508 50691 -178522 -295550 -13448 -24750 -373999 36492 62885 -271303
10143 19837 50228 -119540 -109483 12770 -156855 -24858 107026 256203 228091 57038 -199570
10131 106297 -17629 -277842 31270 -305705 -170508 -23863 51194 -70347 176681 163990 114973
10120 114973 131543 -179478 246403 219784 -171568 -168829 114629 -18897 61254 -22597 -11217
10108 -347499 167618 -107916 -113319 57903 149373 -49471 -181922 -144675 -94610 -126612 -195593
10097 -195593 92844 -97674 -206800 -185635 129776 12851 59768 21722 -187992 -19496 117290
10085 -83207 -189720 181686 -114462 -167542 -84372 126560 47413 -17446 52390 28294 -86097
$$ packed form
10167b3105j31790G7039h328F9338O4491R2555m2157c57172q673A53692b57956
10155i1448p8621p0439E0691a78522j17028a3448j1302l49249C6492K6393b71303
10143A9837L0391a19540J0057A2770a56855b4858A07026J49177k8112E7038a99570
10131A06297a7629k60213C1270c05705J35197b3863E1194g0347A76681j2691m9017
10120A14973J6570a79478B46403k6619a71568K739A14629a8897F1254b2597a1217
10108c47499A67618a07916n403E7903R1470d9471j32451L7247N0065l2002o8981
10097a95593I2844i7674j09126K1165A29776A2851M6917B1722a87992a9496A17290
10085h3207j06513A81686a14462n3080Q3170A26560D7413a7446E2390k4096h6097
$$ plain form
10073 -89830 114345 -192755 181718 160109 -180500 -256267 -407488 -226740 98260 -20767
10062 108007 -63029 -131149 -223183 -67628 -154194 187582 -87487 -128560 42008 -16798 -329543
10051 -329543 -100905 -88258 -250223 -110635 -29249 39728 72131 -447196 -120259 -257201
10041 -257201 -49928 -120575 59190 116164 -337827 -64654 22771 452 -85090 -72016 -248897
10030 -248897 -37685 391963 111032 -194439 123635 -119584 234169 79524 -68886 -112544
10020 -112544 169079 72053 -173472 173566 -235808 5471 67842 -337966 68831 -161287
10009 -134688 -116162 -229254 -280015 -215687 52469 -207802 136107 -146785 -342063 14644
9998 160106 -58840 20074 429181 257914 -9764 -157607 222354 256182 18000 232642 -377000
$$ packed form
10073h9830A14345a92755A81718k1609a80500p5767j51221J80748I8260b0767
10062A08007f3029o8120r2034f7628q6566A87582h7487m1073D2008a6798l12745
10051c29543a00905J2647j61965a10635b9249C9728L2403d47196a20259j36942
10041b57201d9928p0647E9190N6974c37827f4654B2771D52h5090J3074j76881
10030b48897c7685C91963A11032a94439A23635a19584B34169G9524f8886m3658
10020a12544A69079G2053a73472A73566b35808E471O2371c37966F8831a61287
10009a34688J8526j13092n0761O4328E2469b07802A36107a46785j95278A4644
9998A60106e8840B0074M09107j71267i764j47843B22354L3828A8000K14642c77000
$$ plain form
9986 -188590 -9286 147274 -204493 -222786 -71262 -105044 -75355 -370516 89914 -19851 -117468
9975 -117468 56682 -154938 144408 109642 -54598 -110009 145846 -230559 -398803 82077 -154090
9963 205111 -60974 124539 12729 88380 -33382 -155700 -17078 41786 -85365 -85676 -186888
9952 -186888 -252828 -82625 72980 -36855 -73300 150544 -295683 -208460 -353328 -73870 -229199
9941 -229199 134389 -177405 -16844 1618 150399 -32109 -195799 -104922 37897 20924 -308928
9929 -191979 -5826 -15411 -165844 -242828 191899 106076 293493 -29612 -279000 59372 51943
9918 51943 -31585 -136948 -44879 -343938 -13040 92753 153556 79039 -192014 -49610 101938
9906 -45069 -23362 -37992 -238380 -154270 -241600 -330948 -257749 -67562 320288 -23951 27563
$$ packed form
9986a88590i286A47274b04493j8293g1262l3782K9689k95161H9914a9851r7617
9975a17468E6682a54938A44408l4766e4598n5411A45846b30559j68244H2077a54090
9963B05111f0974A24539A2729P5651c3382j22318a7078D1786h5365l11j01212
9952a86888o5940h2625G2980c6855l6445A50544b95683Q7223j44868g3870j55329
9941b29199A34389a77405a6844A618J48781c2109j63690R0877C7897j6973c08928
9929a91979e826r585j50433p6984A91899q5823J87417b9612k49388E9372p429
9918E1943c1585j05363d4879k99059a3040I2753O0803p4517a92014d9610A01938
9906d5069K1707j4630k00388Q4110q7330q9348P3199f7562C20288b3951B7563
$$ plain form
9894 8967 150391 125955 -187185 100101 -309799 -19510 -5178 -197243 -131371 -2907 -32785
9883 -32785 -299830 55128 -306773 -518181 134372 321321 -6993 12012 -273425 -38318 -221831
9872 -221831 -145530 102577 219169 173799 142199 -38706 -303451 -45213 -188801 -307729 -72758
9860 -266514 120877 140328 -206383 208092 -245859 26015 81199 128083 -122122 83371 191081
9849 191081 -40590 -202992 210093 120287 -99062 -154979 -157921 16745 58293 -97514 -106733 -35429
9836 -88274 18290 -247344 -248982 -57727 -64557 210179 -242860 67217 -95022 43920 -255778
9824 -57502 -153216 -193054 212414 7716 4695 -281962 10733 -175133 9852 -28980 86364 -266367
9811 -119329 -235808 -45730 -182030 2076 -251578 103421 -355496 -7364 -133161 -269408 76900
$$ packed form
9894H967J41424k4436a87185A00101c09799a9510e178j92065O5872b907k9878
9883c2785k67045E5128c06773k11408A34372J86949f993A2012b73425c8318j83513
9872b21831P6301A02577J16592m5370l1600c8706k64745d5213j43588j18928g2758
9860b66514A20877J9451b06383B08092b45859B6015N5184M6884a22122H3371J07710
9849A91081d0590j62402B10093q9806i9062n5917k942A6745M1548i7514r219c5429
9836h8274A8290b47344j638e7727o830B10179b42860F7217i5022D3920b55778
9824e7502r5714l9838B12414G716l021b81962A0733a75133I852b8980H6364b66367
9811a19329j16479d5730j36300B076b51578A03421c55496g364j25797j36247G6900
$$ plain form
9799 -48452 -86428 54398 105320 -40246 -268726 -82581 66981 -535407 116430 -188903 -112646
9788 -112646 -295419 55312 30267 106015 287773 97213 51804 104037 39463 -115821 -431878
9777 -431878 306391 -216962 271559 -2526 209623 168934 -96643 183590 -178879 55185 -87856
9765 25142 -210944 140800 -227625 -130814 -112792 -202225 -157432 174071 91285 -188282 11488
9753 14803 -114550 -284710 -162060 -32882 97496 -41288 24326 -142006 -228002 7144 304637
9742 304637 -120472 -192719 199065 145807 -40321 -107890 34130 -1557 62185 -191013 -263089
9731 -263089 -120462 -27672 -57512 -237610 54231 373876 -10932 133650 31141 -155604 -44275
9719 -216762 30011 -125582 -29712 211730 209136 -449753 50341 -393530 45252 -264793 -66211
$$ packed form
9799d8452l7976E4398N0922d0246k28480h2581F6981e35407A16430a88903P6257
9788a12646j82773E5312k5045P5748J81758I7213m5409N2233C9463a15821l16057
9777d31878C06391b16962B71559b526B09623m0689i6643A83590a78879E5185h7856
9765B5142b10944A40800b27625R6811J8022q9433M4793A74071q2786a88282A1488
9753A4803a14550j70160J22650c2882I7496d1288B4326a42006q5996G144K97493
9742C04637a20472p2247A99065n3258d0321o7569C4130a557F2185a91013p2076
9731b63089a20462b7672k9840j80098E4231L19645a0932A33650C1141a55604d4275
9719b16762C0011a25582b9712B11730k594d49753E0341c93530D5252b64793f6211
$$ plain form
9707 -22038 106287 59882 -148954 42592 -19098 -77638 57787 -59532 -20763 -148292 -1914
9695 -90154 -162253 -147587 -5047 -142128 59293 -99008 -28002 53871 45383 -7166 29167 -269446
9682 -256377 335541 25900 -221877 317566 55290 -231353 -297586 -76457 -417324 -204700
9671 67528 -96381 138705 -50552 216085 -1542 57766 122455 -102057 297652 -74645 -241599
9660 -241599 64587 -152715 58572 109017 97881 285868 -82767 8418 -306177 -125836 157453
9648 25568 -66306 -70003 124872 149654 -67046 -303523 153246 -144691 -302363 382887 158244
9636 -94922 -161642 1323 -43401 -83610 -308440 -240521 -71609 -189039 -115459 -52417 105676
9624 -208460 -145309 -157268 -106388 122110 139800 16086 238955 -231712 -168225 150385 -191161
$$ packed form
9707b2038A06287m6405a48954D2592a9098n8540E7787e9532b0763j27529a914
9695i0154p2099J4666e047j37081E9293i9008b8002E3871q488g166B9167b69446
9682b56377C35541B5900b21877C17566E5290b31353o6233g6457l40867b04700
9671F7528i6381A38705e0552B16085a542E7766O4689a02057B97652g4645j66954
9660b41599F4587a52715E8572N0445j1136J87987h2767H418c06177a25836A57453
9648B5568f6306l697A24872K4782f7046k36477A53246a44691j57672C82887A58244
9636i4922o6720A323d3401m0209k24830O7919g1609j17430P3580e2417A05676
9624b08460O3151j1959N0880A22110J7690A6086K22869b31712O3487A50385a91161
$$ plain form
9612 129025 -110628 26383 -200867 207427 -87552 -914 156677 -250502 35233 127301 -47202
9600 -29773 -105333 -43184 -159871 -204442 -206325 -112323 -101462 26334 182521 -71518 -465468
9589 -465468 -51094 -49265 107295 237147 -171234 21525 -165714 -78163 -73277 -148097 305862
9577 144439 -72033 -124838 60540 -50609 48831 -172822 -164334 -53605 -75317 -244907 141578
9565 143215 -194941 -9601 39105 -143634 -51778 -155614 58732 -212855 -218316 -190487 -157387
9554 -157387 -298149 8972 -344605 -284163 -20085 102813 189772 -412247 -51580 -142480 -340196
9543 -340196 -77947 -3047 -113816 -59722 -204571 24187 -99913 -236410 239044 -21678 -179687
9532 -179687 -225798 -193429 -210509 340997 -109380 21592 -199607 -1277 -112621 -133682 -251476
$$ packed form
9612A29025a10628B6383b00867B07427h7552i14A56677b50502C5233R2068d7202
9600b9773p5560d3184j16687m4571j883R4002J0861B6334J56187g1518l93950
9589d65468e1094J829A07295J29852a71234B1525a65714g8163M886p4820C05862
9577A44439g2033n2805F0540e0609D8831a72822Q488e3605k1712j69590A41578
9565A43215a94941i601C9105a43634e1778j03836E8732b12855n461K7829L3100
9554a57387j40762H972c44605O0442b0085A02813Q6959d12247e1580r0900j97716
9543c40196g7947c047j10769N4094j44849B4187i9913j36497B39044b1678j58009
9532a79687m6111L2369j7080C40997a09380B1592a99607a277j11344k1061j17794
$$ plain form
9521 -251476 -11581 139371 -243403 -116657 222269 -274712 -310920 17055 -45924 8877 50314
9510 50314 -156545 -237249 -119566 272629 124180 -20724 -47914 -509990 -105012 -104589 51689
9498 16568 82634 90404 -87440 190297 132739 -605689 -466121 -130170 257249 -71152 156489
9486 -125713 30627 176579 -128962 37043 137679 151813 -146190 32772 41387 66319 -124435
9474 135265 62511 56633 -39586 -179827 -209236 278944 -60718 -193886 -135950 -69624 -58992
9463 -58992 -89892 -15606 22695 384265 -19885 -348327 18939 -36049 -344957 268215 182952
9452 182952 206049 -191890 -166303 -42615 160265 -269658 16223 -135033 -135919 52115 -26272
9440 42128 -356044 -203997 60438 -30962 -136489 -98769 -170863 -71883 85429 118180 -276244
$$ packed form
9521b51476a1581A39371b43403a16657B22269b74712l6208A7055d5924H877M1437
9510E0314a56545q0704J17683B72629A24180b0724k7190m62076a05012M23E1689
9498A6568O6066P770h7440A90297n7558f05689J39568a30170B57249g1152A56489
9486a25713C0627J45952a28962C7043J00636J4134a46190C2772Q615K4932a24435
9474A35265F2511n878c9586j40241k9409B78944f0718j33168N7936O6326J0632
9463e8992l0900a5606B2695L61570a9885l28442A8939c6049l08908B68215q5263
9452A82952K3097a91890K5587d2615A60265b69658A6223a35033q86E2115b6272
9440D2128c56044J52047F0438c0962j05527L7720p2094g1883H5429L2751b76244
$$ plain form
9428 -55741 -97519 208914 -160974 36330 32183 -867 -109160 90466 -54864 -108921 13713 201390
9416 201390 -313232 -125316 -100843 101498 -552278 -276743 329942 146812 -221547 351369
9405 -5118 -175033 10906 69783 -121603 -252635 314 -238964 -9492 -156136 -24351 -59038 121172
9392 -172409 -82244 -202477 -87228 90058 269290 -89524 -219008 383476 103240 -71078 368085
9380 -156102 203192 55490 -238602 -397198 -76959 92968 107329 -347328 -1432 -341271 116545
9368 -105807 -52114 83489 150784 94789 -369647 -86099 94552 144059 -256099 96166 233985
9357 233985 -128704 -150786 -107723 -7531 440862 -165236 52219 -175415 106454 16371 -2410
9345 124763 291165 -255533 -352743 157887 197891 32518 -211787 -148601 -25393 -177364 17151
$$ packed form
9428e5741m1778B08914a60974C6330m147h67j08293I0466e4864n4057A3713J87677
9416B01390c13232a25316K4473A01498e52278K75535C29942A46812b21547C51369
9405e118j69915A0906N8877a21603j31032C14b38964i492j46644b4351l4687A21172
9392a72409h2244j20233h7228I0058J79232h9524j29484C83476A03240g1078C68085
9380a56102B03192E5490b38602j58596g6959I2968J4361c47328a432l39839A16545
9368a05807e2114H3489O7295n5995c69647h6099I4552M9507b56099I6166J37819
9357B33985a28704k2082M3063g531D40862a65236E2219a75415A06454A6371b410
9345A24763J66402b55533r7210A57887M0004C2518b11787O3186b5393j51971A7151
$$ plain form
9333 268834 -8090 50088 -31313 180552 -150479 -229856 -97979 125894 -54891 -308297 44821
9321 142496 28820 -80099 -199433 -242979 20460 167432 -312200 25719 -97967 -27149 272035
9309 127871 -94517 123652 -29786 -228204 77986 -62837 -79337 -120234 -35809 -209080 21643
9297 22411 162640 -117864 19770 -15898 -286987 -79982 123024 11125 -6322 -306938 3665
9285 13633 -117426 -6117 -174322 29427 170087 14388 -181154 33142 -7084 -814 -218482 163226
9272 -238785 -28295 -155346 103657 170252 -70021 361432 -37259 -238200 -219366 267080 99596
9260 -20906 -119558 73123 108149 -149122 -33937 125275 129629 -51303 87455 -170420 -53284
9248 -246769 -44847 -183442 -150366 136331 -41259 56831 -23168 18973 356642 -4789 -20151
$$ packed form
9333B68834h090E0088c1313A80552a50479p9377i7979A25894e4891k53406D4821
9321A42496B8820h0099j19334m3546B0460J46972c12200B5719i7967b7149B72035
9309A27871i4517A23652b9786j98418G7986f2837j6500m0897c5809j73271B1643
9297B2411J40229a17864A9770a5898k71089g9982A23024A1125f322l00616C665
9285A3633a17426f117j68205B9427J40660A4388a81154C3142g084h14k17668A63226
9272b38785b8295j27051A03657O6595g0021C61432c7259k00941J8834B67080I9596
9260b0906r8652G3123L5026a49122c3937A25275M354e1303H7455a70420e3284
9248b46769d4847j38595L3076A36331d1259E6831b3168A8973L37669d789j5362
$$ plain form
9237 -20151 391521 -108419 -133282 -38962 -281299 56819 -37258 118249 41934 -85069 -150354
9226 -150354 87705 -205030 -177739 -274743 200931 -140015 -125530 -153340 -17387 -299822 -10088
9214 -171406 -236313 -167829 -4163 -52703 -161405 -221275 98069 -104348 -292756 -155326 -112622
9203 -112622 -85403 210493 17520 229724 364910 -197655 -226928 -222480 -29343 3290 -327860
9191 207180 -193422 -79459 -157954 112107 -1282 123716 -44611 -318847 -17188 -106909 -12762
9179 -16325 -3191 -69181 -91083 62567 3440 -277343 30290 -155251 41288 -122116 50294 344035
9167 344035 -75363 -86271 17790 -151449 105677 12419 195670 -73970 -60052 -381300 -124351
9155 -178282 -350496 32625 72536 -95242 -414921 -2760 11252 11031 -96442 -242865 64391 11879
$$ packed form
9237b0151C91521a08419k4863c8962k42337E6819c7258A18249D1934h5069o5285
9226a50354H7705b05030K7291r7004B00931a40015J4485k7810a7387k82435a0088
9214a71406o4907O8484d163m8540j08702n9870I8069a04348j88408J37430M2704
9203a12622K7219B10493A7520K12204J35186a97655k9273M448b9343C290c27860
9191B07180a93422g9459p8495A12107a282A23716d4611k74236a7188q9721a2762
9179a6325c191o5990k1902F2567C440b77343C0290a55251D1288a22116E0294K93741
9167C44035g5363j0908A7790a51449A05677A2419J83251g3970J3918l21248a24351
9155a78282j72214C2625L9911i5242l19679b760A1252k21i6442j46423F4391A1879
$$ plain form
9142 -58416 -142569 260676 -175779 -14001 -48840 -128032 -57660 -173360 -430177 -94641 13817
9130 -29128 -188007 384 51107 50007 93703 -16061 -144096 80170 -31850 4235 -109767 -249704
9118 -249704 73778 -172719 59977 133301 6950 -172504 -162063 -102896 -31537 -266075 -315170
9107 -315170 29583 -303197 -291902 -98238 114935 -37592 -67567 348314 -133309 8936 -34750
9095 341369 -245645 -219167 -329434 189735 -168458 -226380 -81593 -207272 -54631 -51158 -17243
9083 -224493 -100259 19930 70538 -148985 -252132 170873 -327707 -6748 165226 -96901 18681
9071 -169366 22616 109697 -57432 -140471 -72818 56382 -404569 -218573 245343 -270782 42404
9059 208719 -26076 209416 -112769 -289680 -212785 -587203 -112644 -210961 59472 244655
$$ packed form
9142e8416q4153B60676a75779a4001l4839p9192e7660j15700k56817i4641A3817
9130b9128j58879C84N0723j100M3696a6061j28035H0170c1850D235a09767j39937
9118b49704G3778a72719E9977P3324F950a72504J0441N9167c1537k34538m9095
9107c15170B9583c03197J1295i8238A14935c7592k9975C48314a33309H936c4750
9095C41369b45645K6478j10267A89735a68458n7922h1593j25679e4631L473a7243
9083b24493a00259A9930N0608a48985j03147A70873c27707f748A65226i6901A8681
9071a69366B2616Q7081e7432q3039O7653E6382d04569J85996B45343b70782D2404
9059B08719b6076B09416a12769j76911P6895l74418a12644r8317E9472J85183
$$ plain form
9049 244655 -11706 -314377 115541 -93227 -318045 -38870 -62079 -124494 226643 -222935 -200606
9038 -200606 -371915 57236 -82024 -148648 12129 37466 -74186 179844 -150571 246340 -361663
9026 174776 -8663 28215 132806 -96553 -138901 183 -7367 -211987 157397 -13025 -67276 25203
9013 -40510 27301 -313372 168776 17030 -192986 48405 -244213 -21359 165580 265763 24913
9001 -48342 -106305 148715 -207978 37704 -307239 23384 130492 137774 -158223 -95600 -224567
8990 -224567 183828 -126202 99886 134217 82379 -90668 42855 -196212 -43062 -40852 -127258
8979 -127258 24888 -249694 28800 233279 -201035 -143477 -45064 -87332 -137609 -67786 -177679
8968 -177679 59229 -317538 -6034 -66361 -9955 266747 -124142 130202 79678 32951 55026
$$ packed form
9049B44655a1706l02671A15541i3227k24818c8870k3209o2415B26643b22935K2329
9038b00606j71309E7236h2024o6624A2129K5337g4186A79844a50571B46340c61663
9026A74776h663B8215J04591i6553m2348A83g367k04620A57397a3025n4251B5203
9013d0510B7301c13372A68776A7030a92986D8405b44213b1359A65580J00183B4913
9001d8342n7963A48715b07978C7704c07239B3384J07108P282a58223O2623j28967
8990b24567A83828a26202I9886L4331n1838i0668D2855a96212d3062K210q6406
8979a27258B4888b49694B8800K04479b01035N7558d5064m2268n0277f7786j09893
8968a77679E9229c17538f034o0327i955B66747a24142A30202n0524C2951K2075
$$ plain form
8957 55026 144494 -16682 -136712 126318 6856 136033 192433 -165988 -91618 -201084 -331222
8946 -331222 -35723 -88899 -36547 50664 -293211 -109977 -92056 130344 92245 44801 -46504
8934 -39457 -222526 -205111 190279 126158 -87295 182047 -103189 52708 -87159 -464858 -139203
8922 -126957 -53189 -48944 202221 492981 298596 170405 281455 386410 -117943 394748
8911 504679 526346 1207999 1968505 3160733 6346400 12182469 5394366 2741646 1738310
8902 1738310 1126566 701262 684183 67973 -15306 105107 315965 118342 229232 302574
8892 302574 432589 185851 -304243 -271676 258409 -109336 176666 6254 364485 7611 -112827
8880 260759 10113 -102337 216140 48580 105031 -58296 47114 -236814 -65002 -77662 -6748
$$ packed form
8957E5026Q9468a6682j20030A26318F856J29177N6400a65988P4370j09466j30138
8946c31222c5723n3176c6547E0664b93211a09977J7921A30344l8099D4801d6504
8934c9457j83069J7415A90279o4121h7295A82047a03189E2708h7159l77699a39203
8922a26957e3189M245B02221K90760j94385j28191J11050J04955a17943C94748
8911E04679K1667O81653P60506J192228L185667N836069E394366k652720j003336
8902A738310o11744m25304j7079F7973a5306A05107K10858A18342J10890P3342
8892C02574J30015A85851c04243L2567B58409a09336A76666F254L58231G611a12827
8880B60759A0113a02337B16140D8580N6451e8296D7114b36814f5002j2660f748
$$ plain form
8868 6321 -98144 -352650 -163508 -154667 -227374 142162 21098 -175555 69949 33947 -15764
8856 -139796 149221 158682 147792 -194876 10722 237118 84311 11494 -493883 -187103 -369501
8845 -369501 34919 190406 -267914 77542 76122 -55170 137773 -174958 262946 68824 -164282
8833 -87378 -178994 -7462 -355629 31998 -113637 244502 236343 -239796 142233 -105994 107672
$$ packed form
8868F321i8144k54506a63508Q841p2707A42162B1098a75555F9949C3947a5764
8856a39796A49221R461j0890a94876A0722K26396H4311A1494d93883a87103j82398
8845c69501C4919J55487b67914G7542j420e5170A37773a74958B62946F8824a64282
8833h7378r1616g462l48167C1998a13637B44502q159b39796A42233a05994A07672
$$ [...]
##END NTUPLES=NMR SPECTRUM
##END=
