
##TITLE=AC1224_Punto_6080179_L6QuNXOy2o
##JCAMPDX= 6.0         $$ Bruker NMR JCAMP-DX V2.0
##DATA TYPE= NMR SPECTRUM
##DATA CLASS= NTUPLES
##ORIGIN= BRUKER
##OWNER= Administrator
$$ 1.72 TOPSPIN		Version 2.1
$$ 2012-05-09 02:17:01.781 -0500  Administrator@TOPSPIN
$$ Compression mode = diff/dup
##.OBSERVE FREQUENCY= 400.13188235
##.OBSERVE NUCLEUS= ^1H
##.ACQUISITION MODE= SIMULTANEOUS (DQD)
##.ACQUISITION SCHEME= undefined
##.AVERAGES= 64
##.DIGITISER RES= 22
##SPECTROMETER/DATA SYSTEM= spect
##.PULSE SEQUENCE= noesygpps1d.comp
##.SOLVENT NAME= COFFEE_meoh
##.SHIFT REFERENCE= INTERNAL, COFFEE_meoh, 1, 14.96653
##AUDIT TRAIL= $$ (NUMBER, WHEN, WHO, WHERE, PROCESS, VERSION, WHAT)
$$ ##TITLE= Audit trail, TOPSPIN		Version 2.1
$$ ##JCAMPDX= 5.01
$$ ##ORIGIN= Bruker BioSpin GmbH
$$ ##OWNER= Administrator
$$ $$ C:\Bruker\TOPSPIN/data/COFFEE/nmr/AC1224_Punto_6080179_L6QuNXOy2o/12/pdata/1/auditp.txt
$$ ##AUDIT TRAIL=  $$ (NUMBER, WHEN, WHO, WHERE, PROCESS, VERSION, WHAT)
(   1,<2012-05-09 02:16:57.062 -0500>,<Administrator>,<TOPSPIN>,<go>,<TOPSPIN 2.1>,
      <created by zg
	started at 2012-05-09 02:05:26.875 -0500,
	POWCHK enabled, PULCHK disabled,
       configuration hash MD5:
       AF F2 23 6B 01 CD 40 DD E5 A1 38 A0 06 EA F7 77
       data hash MD5: 64K
       E6 F9 41 36 A7 A7 C9 44 B4 17 CC 42 21 0D 3F 0A>)
(   2,<2012-05-09 02:16:59.828 -0500>,<Administrator>,<TOPSPIN>,<proc1d>,<TOPSPIN 2.1>,
      <Start of raw data processing
       efp LB = 0.3 FT_mod = 6 PKNL = 1 PHC0 = 0 PHC1 = 0 SI = 128K 
       data hash MD5: 128K
       2A D9 D0 D3 FA 1E 28 B2 B7 42 9F F6 78 75 6D 72>)
(   3,<2012-05-09 02:17:01.062 -0500>,<Administrator>,<TOPSPIN>,<proc1d>,<TOPSPIN 2.1>,
      <pk PHC0 = 34.40369 PHC1 = 0 
       data hash MD5: 128K
       38 6A C2 92 4D 77 37 5B B9 FC A2 C2 4D CE 52 F7>)
(   4,<2012-05-09 02:17:01.281 -0500>,<Administrator>,<TOPSPIN>,<proc1d>,<TOPSPIN 2.1>,
      <abs ABSG = 1 
       data hash MD5: 128K
       65 1B EC F6 EB 18 D6 DB 89 2F 25 98 38 9C BD AC>)
(   5,<2012-05-09 02:17:01.359 -0500>,<Administrator>,<TOPSPIN>,<proc1d>,<TOPSPIN 2.1>,
      <abs ABSG = 2 
       data hash MD5: 128K
       CD AA D7 A7 A2 53 D4 85 00 24 10 3F 08 18 FE 50>)
(   6,<2012-05-09 02:17:01.500 -0500>,<Administrator>,<TOPSPIN>,<proc1d>,<TOPSPIN 2.1>,
      <abs ABSG = 3 
       data hash MD5: 128K
       6B A2 12 3D 7D 93 2E F5 FE AE 47 72 DA 89 9A AE>)
(   7,<2012-05-09 02:17:01.640 -0500>,<Administrator>,<TOPSPIN>,<proc1d>,<TOPSPIN 2.1>,
      <abs ABSG = 4 
       data hash MD5: 128K
       F5 E6 A6 D6 F0 24 76 AB 43 F6 CF 72 2D 54 93 55>)
(   8,<2012-05-09 02:17:01.687 -0500>,<Administrator>,<TOPSPIN>,<proc1d>,<TOPSPIN 2.1>,
      <abs ABSG = 5 
       data hash MD5: 128K
       9D F9 94 AE 70 2E D9 59 EF F7 35 33 EE 58 FC 1B>)
$$ ##END=
$$ 
$$ $$ hash MD5
$$ $$ 10 88 2A 2B EB C2 56 1F C7 EA 78 66 74 BC 51 CA
##$RELAX= 
##$RELAX= 
##$RELAX= 
##$RELAX= 
##$RELAX= 
##$RELAX= 
##$RELAX= 
##$RELAX= 
$$ Bruker specific parameters
$$ [...]
##$TP07= 0
##$TPNAME0= <>
##$TPNAME1= <>
##$TPNAME2= <>
##$TPNAME3= <>
##$TPNAME4= <>
##$TPNAME5= <>
##$TPNAME6= <>
##$TPNAME7= <>
##$TPOAL= (0..7)
0.5 0.5 0.5 0.5 0.5 0.5 0.5 0.5
##$TPOFFS= (0..7)
0 0 0 0 0 0 0 0
##$TUNHIN= 0
##$TUNHOUT= 0
##$TUNXOUT= 0
##$USERA1= <user>
##$USERA2= <user>
##$USERA3= <user>
##$USERA4= <user>
##$USERA5= <user>
##$V9= 5
##$VALIST= <valist>
##$VCLIST= <CCCCCCCCCCCCCCC>
##$VD= 0
##$VDLIST= <DDDDDDDDDDDDDDD>
##$VPLIST= <PPPPPPPPPPPPPPP>
##$VTLIST= <TTTTTTTTTTTTTTT>
##$WBST= 1024
##$WBSW= 4
##$XGAIN= (0..3)
0 0 0 0
##$XL= 0
##$YL= 0
##$YMAX_a= 12023648
##$YMIN_a= -6467383
##$ZGOPTNS= <>
##$ZL1= 120
##$ZL2= 120
##$ZL3= 120
##$ZL4= 120
##$ABSF1= 14.96653
##$ABSF2= -5.586
##$ABSG= 5
##$ABSL= 3
##$ALPHA= 0
##$AQORDER= 0
##$ASSFAC= 0
##$ASSFACI= 0
##$ASSFACX= 0
##$ASSWID= 0
##$AUNMP= <proc_prof1d_extract.lims>
##$AXLEFT= 0
##$AXNAME= <>
##$AXNUC= <1H>
##$AXRIGHT= 0
##$AXTYPE= 0
##$AXUNIT= <>
##$AZFE= 0.1
##$AZFW= 0.1
##$BCFW= 0
##$BC_mod= 0
##$BYTORDP= 0
##$COROFFS= 0
##$CY= 15
##$DATMOD= 1
##$DC= 0
##$DFILT= <>
##$DTYPP= 0
##$F1P= 0
##$F2P= 0
##$FCOR= 0.5
##$FTSIZE= 131072
##$FT_mod= 6
##$GAMMA= 0
##$GB= 0
##$INTBC= 1
##$INTSCL= 1
##$ISEN= 128
##$LB= 0.3
##$LEV0= 0
##$LPBIN= 0
##$MAXI= 10000
##$MC2= 0
##$MEAN= 0
##$ME_mod= 0
##$MI= 0
##$NCOEF= 0
##$NC_proc= -3
##$NLEV= 6
##$NOISF1= 0
##$NOISF2= 0
##$NSP= 0
##$NTH_PI= 0
##$NZP= 0
##$OFFSET= 14.96653
##$PC= 1
##$PHC0= 34.40369
##$PHC1= 0
##$PH_mod= 1
##$PKNL= yes
##$PPARMOD= 0
##$PPDIAG= 0
##$PPIPTYP= 0
##$PPMPNUM= 2147483647
##$PPRESOL= 1
##$PSCAL= 4
##$PSIGN= 0
##$PYNMP= <proc.py>
##$REVERSE= no
##$SF= 400.130005634622
##$SI= 131072
##$SIGF1= 0
##$SIGF2= 0
##$SINO= 400
##$SIOLD= 131072
##$SPECTYP= <>
##$SREGLST= <1H.CDCl3>
##$SSB= 0
##$STSI= 131072
##$STSR= 0
##$SW_p= 8223.68421052632
##$SYMM= 0
##$S_DEV= 0
##$TDeff= 65536
##$TDoff= 0
##$TI= <>
##$TILT= no
##$TM1= 0
##$TM2= 0
##$TOPLEV= 0
##$USERP1= <user>
##$USERP2= <user>
##$USERP3= <user>
##$USERP4= <user>
##$USERP5= <user>
##$WDW= 1
##$XDIM= 131072
##$YMAX_p= 406382031
##$YMIN_p= -130352882
##$CURPLOT= <Network HP LaserJet P1505>
##$CURPRIN= <$Network HP LaserJet P1505>
##$DFORMAT= <normdp>
##$LAYOUT= <+/1D_H.xwp>
##$LFORMAT= <normlp>
##$PFORMAT= <normpl>
##$SURQMSG= 1
$$ End of Bruker specific parameters
$$ ---------------------------------
##NTUPLES= NMR SPECTRUM
##VAR_NAME=  FREQUENCY,     SPECTRUM/REAL,   SPECTRUM/IMAG
##SYMBOL=    X,             R,               I
##VAR_TYPE=  INDEPENDENT,   DEPENDENT,       DEPENDENT
##VAR_FORM=  AFFN,          ASDF,            ASDF
##VAR_DIM=   131072,        131072,          131072
##UNITS=     HZ,            ARBITRARY UNITS, ARBITRARY UNITS
##FACTOR=    0.0627417313425165, 1,          1
##FIRST=     8223.62146879498, -10,          -110352
##LAST=      0,             2076,            -111362
##MIN=       0,             -130352882,      0
##MAX=       8223.62146879498, 406382031,    0
$$ Real data points
##PAGE= N=1
##DATA TABLE= (X++(R..R)), XYDATA
$$ [...]
63577F77323J1527J3994J5197J4823J4454J5007J6005J6800J7139J6938J6562
$$ 677323 688850 702844 718041 732864 747318 762325 778330 795130 812269 829207 845769
63566H45769J7021J8820K0982K2214K2810K4165K6511K8384K8718K8428K9316
$$ 845769 862790 881610 902592 924806 947616 971781 998292 1026676 1055394 1083822 1113138
63555A113138L2074L5943L9916M3589M6899M9429N0330M9060M6253M3572M2268
$$ 1113138 1145212 1181155 1221071 1264660 1311559 1360988 1411318 1460378 1506631 1550203 1592471
63544A592471M1849M0437L6394K9474K0672J1452L066l845r221j3113j5510j6970
$$ 1592471 1634320 1674757 1711151 1740625 1761297 1772749 1775815 1771970 1762749 1749636 1734126 1717156
63532A717156j8885k2296k6515k9781l1348l2198l3496l5336l7230l8852l9657
$$ 1717156 1698271 1675975 1649460 1619679 1588331 1556133 1522637 1487301 1450071 1411219 1371562
63521A371562l8713l5838l2213k9005k6080k2975k0285j8581j6567j2228n885
$$ 1371562 1332849 1297011 1264798 1235793 1209713 1186738 1166453 1147872 1131305 1119077 1113192
63510A113192l10K716M356O495R173J1372J3012J4775J6890J9386K2770K7033
$$ 1113192 1112882 1115598 1119954 1126449 1135622 1146994 1160006 1174781 1191671 1211057 1233827 1260860
63498A260860L0748L2856L4731L8524M3663M7164M7820M8014N0482N4951N9239
$$ 1260860 1291608 1324464 1359195 1397719 1441382 1488546 1536366 1584380 1634862 1689813 1749052
63487A749052O2289O4590O6329O6634O4310N8276M7714L3084J6830J947j0274
$$ 1749052 1811341 1875931 1942260 2008894 2073204 2131480 2179194 2212278 2229108 2231055 2220781
63476B220781k0275k8179l2938l3953l2608l1453l2100l4460l7681m1294m5214
$$ 2220781 2200506 2172327 2139389 2105436 2072828 2041375 2009275 1974815 1937134 1895840 1850626
63465A850626m9067n2027n3555n4140n4854n6175n7484n7855n6907n4781n1661
$$ 1850626 1801559 1749532 1695977 1641837 1586983 1530808 1473324 1415469 1358562 1303781 1252120
63454A252120m7745m3465l9374l5832l2840k9989k6679k2804j9306j7395j6950
$$ 1252120 1204375 1160910 1121536 1085704 1052864 1022875 996196 973392 954086 936691 919741
63443I19741j6381j4553j2247j1039j1187j1454j0836r503q003o307m149j869
$$ 919741 903360 888807 876560 865521 854334 842880 832044 822541 814538 808231 804082 802213
63431H02213l37j09q36j641j915j589o80R60L121M921N696N989O789P831P709
$$ 802213 801876 801767 800931 799290 797375 795786 795106 796066 799187 804108 809804 815793 822582 830413 838122
63416H38122N864L452J803J103J109J998L461M024K597J15j500j631j057k46J081
$$ 838122 843986 847438 849241 850344 851453 853451 856912 860936 863533 863648 862148 860517 859460 859214 860295
63401H60295K884M547N758O616O898O358N714O156P702R076R456R404R860J1176
$$ 860295 863179 867726 873484 880100 886998 893356 899070 905226 912928 922004 931460 940864 950724 961900
63387I61900J3334J6221J9370K2206K4740K7406L0194L2805L5566L9215M3729
$$ 961900 975234 991455 1010825 1033031 1057771 1085177 1115371 1148176 1183742 1222957 1266686
63376A266686M8435N3215N8317O2891O5091O3928N9726N2646M2587L1173K1754
$$ 1266686 1315121 1368336 1426653 1489544 1554635 1618563 1678289 1730935 1773522 1804695 1826449
63365A826449J6134J2831J0087R068J2143J8981K6448L2159L6254L9782M2994
$$ 1826449 1842583 1855414 1865501 1874569 1886712 1905693 1932141 1964300 2000554 2040336 2083330
63354B083330M5472M6441M4556L8547K8733J7196O205l030j0247j5787k0547k5280
$$ 2083330 2128802 2175243 2219799 2258346 2287079 2304275 2310480 2307450 2297203 2281416 2260869 2235589
63342B235589k9603l2446l3837l5423l8674m3234m7662n1284n4515n7537n9493
$$ 2235589 2205986 2173540 2139703 2104280 2065606 2022372 1974710 1923426 1868911 1811374 1751881
63331A751881n9329n7011n3582n0101m6899m3783m0544l6931l2531k7166k1425
$$ 1751881 1692552 1635541 1581959 1531858 1484959 1441176 1400632 1363701 1331170 1304004 1282579
63320A282579j6272j2096q514n106j774J615N367R458J3398J6807J9780K2674
$$ 1282579 1266307 1254211 1245697 1240591 1238817 1240432 1245799 1255257 1268655 1285462 1305242 1327916
63308A327916K5983L0264L5432M0255M3612M6256M9979N4817N8616O0068O0606
$$ 1327916 1353899 1384163 1419595 1459850 1503462 1549718 1599697 1654514 1713130 1773198 1833804
63297A833804O2110O4106O4694O3111N9825N4984M8501M0967L2770K3021J1284
$$ 1833804 1895914 1960020 2024714 2087825 2147650 2202634 2251135 2292102 2324872 2347893 2359177
63286B359177j77q266j3090j7770k3914k9598l2721l4089l5853l8608m1625m4660
$$ 2359177 2359000 2350734 2337644 2319874 2295960 2266362 2233641 2199552 2163699 2125091 2083466 2038806
63274B038806m7960n1210n3876n5949n7324n7082n4522n0396m6042m1807l7292
$$ 2038806 1990846 1939636 1885760 1829811 1772487 1715405 1660883 1610487 1564445 1522638 1485346
63263A485346l2520k7769k2796j7512j3175j1618j3372j7611k3638l1062l8415
$$ 1485346 1452826 1425057 1402261 1384749 1371574 1359956 1346584 1328973 1305335 1274273 1235858
63252A235858m3160m3916m1836l9153l6979l4961l2369k8851k4521k0032j6423
$$ 1235858 1192698 1148782 1106946 1067793 1030814 995853 963484 934633 910112 890080 873657
63241H73657j4391j3710j3570j3318j2693j1675j0496r574q964q073o398m490
$$ 873657 859266 845556 831986 818668 805975 794300 783804 774230 765266 757193 750795 746305
63229G46305l653m478o068o983o578n162l228j151M81R02j32j922l321l581k773
$$ 746305 742652 738174 732106 725123 718545 713383 710155 709004 709485 710387 710255 708333 705012 701431 698658
63214F98658j690j292j781k193j405L85J830K319K766L967N049M688L312K787
$$ 698658 696968 695676 693895 691702 690297 690682 692512 694831 697597 701564 706613 711301 714613 717400
63200G17400L975N866P324Q433R615J0511J0611J0342J0627J1613J2628J3293
$$ 717400 721375 727241 734565 742998 752613 763124 773735 784077 794704 806317 818945 832238
63188H32238J4003J5242J6836J8220J9196K0199K1610K3043K3792K4002K4739
$$ 832238 846241 861483 878319 896539 915735 935934 957544 980587 1004379 1028381 1053120
63177A053120K6429K7909K7980K7303K7530K8681K8988K7605K5983K5754K6556
$$ 1053120 1079549 1107458 1135438 1162741 1190271 1218952 1247940 1275545 1301528 1327282 1353838
63166A353838K7144K7524K8476K9463K8703K5547K1524J8466J6443J4130J0809
$$ 1353838 1380982 1408506 1436982 1466445 1495148 1520695 1542219 1560685 1577128 1591258 1602067
63155A602067P151M015J015l078q601j4341j9058k3027k7186l1204l3632l4005
$$ 1602067 1609218 1613233 1614248 1611170 1602569 1588228 1569170 1546143 1518957 1487753 1454121 1420116
63143A420116l3408l2661l1349k9220k7020k4887k1349j5481r023m508j947P59
$$ 1420116 1386708 1354047 1322698 1293478 1266458 1241571 1220222 1204741 1195718 1191210 1189263 1190022
63131A190022M453P738R521J0522J1686J2798J3614J4939J7354J9750K0525J9741
$$ 1190022 1194475 1202213 1211734 1222256 1233942 1246740 1260354 1275293 1292647 1312397 1332922 1352663
63119A352663J8976J9078J9079J7628J4830J2136J0574R498P330L420j295n531
$$ 1352663 1371639 1390717 1409796 1427424 1442254 1454390 1464964 1474462 1481792 1485212 1483917 1478386
63107A478386r036j2372j5875j9432k2975k6434k9493l2012l4416l6884l8518
$$ 1478386 1469350 1456978 1441103 1421671 1398696 1372262 1342769 1310757 1276341 1239457 1200939
63096A200939l8328l6824l5496l4702l3279l0482k7136k4456k2755k1808k1343
$$ 1200939 1162611 1125787 1090291 1055589 1022310 991828 964692 940236 917481 895673 874330
63085H74330k0548j8109j3755r111o173n352n646o116o420o292n516m314l179
$$ 874330 853782 835673 821918 812807 806634 801282 795636 789520 783100 776808 771292 766978 763799
63072G63799k303j468l87J064K558L243K554J265R18J824K571K120J397J976L874
$$ 763799 761496 760028 759641 760705 763263 766506 769060 770325 771243 773067 775638 777758 779155 781131 785005
63057G85005N755O727O923O673O215N964O088N994N198M470N068O946Q703R329
$$ 785005 790760 797487 804410 811083 817298 823262 829350 835344 840542 845012 850080 857026 865729 875058
63043H75058R044Q463P935P870Q666R989J0940J1164J1124J1088J0690R718Q479
$$ 875058 884102 892565 900500 908370 917036 927025 937965 949129 960253 971341 982031 991749 1000228
63030A000228P114N403L586K602K972M076M961N376N549N635N846O663Q414J0913
$$ 1000228 1007342 1012745 1016331 1018933 1021905 1025981 1030942 1036318 1041867 1047502 1053348 1060011 1068425 1079338
63016A079338J3729J6394J8287J9037J9397K0835K3816K7117K9410L0748L1907
$$ 1079338 1093067 1109461 1127748 1146785 1166182 1187017 1210833 1237950 1267360 1298108 1330015
63005A330015L3071L4100L5427L7622M0462M3491M7136N2083N7712O2377O5391
$$ 1330015 1363086 1397186 1432613 1470235 1510697 1554188 1601324 1653407 1711119 1773496 1838887
62994A838887O7596O9756P1519P2456P3079P3961P4562P3968P2502P1693P2478
$$ 1838887 1906483 1976239 2047758 2120214 2193293 2267254 2341816 2415784 2488286 2559979 2632457
62983B632457P4000P4426P2630O8976O4702O0865N7790N5215N2488M8621M2569
$$ 2632457 2706457 2780883 2853513 2922489 2987191 3048056 3105846 3161061 3213549 3262170 3304739
62972C304739L3922K3238J1472p81j3167k5111l6139m6430n6343o5364p2377p7044
$$ 3304739 3338661 3361899 3373371 3372590 3359423 3334312 3298173 3251743 3195400 3130036 3057659 2980615
62960B980615q0027q1523q0599p6604p0352o3108n5168m6414l7518k9369k1708
$$ 2980615 2900588 2819065 2738466 2661862 2591510 2528402 2473234 2426820 2389302 2359933 2338225
62949B338225j3780o095pM593R481J5403K0770K3961K5667K7559K9587L0186K8700
$$ 2338225 2324445 2318350 2318343 2322936 2332417 2347820 2368590 2392551 2418218 2445777 2475364 2505550 2534250
62936B534250K6208K3950K2126K0345J8226J5446J1984Q398N133J574l357r788
$$ 2534250 2560458 2584408 2606534 2626879 2645105 2660551 2672535 2680933 2686066 2687640 2684283 2674495
62924B674495j7048k5008l4001m3278n1024n6558o1264o6508p1709p5333p6890
$$ 2674495 2657447 2632439 2598438 2555160 2504136 2447578 2386314 2319806 2248097 2172764 2095874
62913B095874p6796p5113p1668o7077o2572n8883n5955n3299n0048m5406l9969
$$ 2095874 2019078 1943965 1872297 1805220 1742648 1683765 1627810 1574511 1524463 1479057 1439088
62902A439088l5884l4402l3903l1852k8269k5491k4550k3815k1756j9248j8050
$$ 1439088 1403204 1368802 1334899 1303047 1274778 1249287 1224737 1200922 1179166 1159918 1141868
62891A141868j8337j8974j9274j9232j8690j7521j6284j5690j5608j5430j5163
$$ 1141868 1123531 1104557 1085283 1066051 1047361 1029840 1013556 997866 982258 966828 951665
62880I51665j5269j5511j4893j3047j0949r983j0513j1501j1351r239n907l204
$$ 951665 936396 920885 905992 892945 881996 872013 861500 849999 838648 829409 823502 820298
62868H20298k534l661n039n212l822j631J75P98L22n09j015j002n87M2O17R13
$$ 820298 817764 814103 809064 803852 800030 798399 798574 799372 799694 799185 798170 797168 796581 796623 797240 798153
62852G98153J022J214J440J354Q81K66n66k066m117n596n468m017k567k225l099
$$ 798153 799175 800389 801829 803183 804064 804330 803764 801698 797581 791985 786517 782500 779933 777708 774609
62837G74609m321m510k757K77K698L382L144L322L776L255J525r3m54M9L07M3
$$ 774609 770288 765778 763021 763298 765996 769378 772522 775844 779620 782875 784400 784307 783853 783902 784209 784252
62821G84252p9L97J003R30J26l79M94K558M328M488L080J193k00q17q82p77o69
$$ 784252 784173 784570 785573 786503 786629 786250 786744 789302 793630 798118 801198 802391 802191 801374 800492 799715 799046
62804G99046m04J02L70j49j071j338o83K8L56J064K601L869L655K502J778J578
$$ 799046 798642 798744 799114 798965 797894 796556 795873 795901 796257 797321 799922 803791 807446 809948 811726 813304
62788H13304J050L54N97J793K569K221J704K044K902L280K770J671O95P60K250
$$ 813304 814354 814708 815305 817098 819667 821888 823592 825636 828538 831818 834588 836259 836954 837714 839964
62773H39964M224N286N327N433N908N721M387L064L038M187N633O856P497P088
$$ 839964 844188 849474 854801 860234 866142 871863 876250 879314 882352 886539 892172 899028 906525 913613
62759I13613O036N843P234Q907R203Q410Q169R159J0615J1820J2868J3954J4949
$$ 913613 919649 925492 932726 941633 950836 959246 967415 976574 987189 999009 1011877 1025831 1040780
62746A040780J5728J6253J6404J6465J7511K0440K4592K8170L0118L0967L1775
$$ 1040780 1056508 1072761 1089165 1105630 1123141 1143581 1168173 1196343 1226461 1257428 1289203
62735A289203L2989L4579L6691L9712M3700M8077N2117N5859O0291O6175P2890
$$ 1289203 1322192 1356771 1393462 1433174 1476874 1524951 1577068 1632927 1693218 1759393 1832283
62724A832283P9163Q4754R0355R5772R9659J01651J03241J05394J06517J04255
$$ 1832283 1911446 1996200 2086555 2182327 2281986 2383637 2486878 2592272 2698789 2803044
62714B803044R8419R0465Q0816O8573N3715L7610K1115L844j4203l1727m7547
$$ 2803044 2901463 2991928 3072744 3141317 3195032 3232642 3253757 3257601 3243398 3211671 3164124
62703C164124o1700p4462q5200r2996r7861j00722j02634j04149j04945j03859
$$ 3164124 3102424 3027962 2942762 2849766 2751905 2651183 2548549 2444400 2339455 2235596
62693B235596j00064r4426q8972q4742q0944p6404p0953o5016n8881n3010m8337
$$ 2235596 2135532 2041106 1952134 1867392 1786448 1710044 1639091 1574075 1515194 1462184 1413847
62682A413847m5365m3361m1047l7784l3718k9297k5106k1672j8925j6136j2950
$$ 1413847 1368482 1325121 1284074 1246290 1212572 1183275 1158169 1136497 1117572 1101436 1088486
62671A088486j0002q009o594m690k084J8K02j405k731j384K996Q277J2075J4201
$$ 1088486 1078484 1070475 1063881 1059191 1057107 1057125 1057327 1055922 1053191 1051807 1054803 1063080 1075155 1089356
62657A089356J6200J8935K1716K3785K5316K6644K7868K9803L3926M0268M6431
$$ 1089356 1105556 1124491 1146207 1169992 1195308 1221952 1249820 1279623 1313549 1353817 1400248
62646A400248N0109N1928N4421N8696O3666O8264P2617P6580P8792P8216P5747
$$ 1400248 1450357 1502285 1556706 1615402 1679068 1747332 1819949 1896529 1975321 2053537 2129284
62635B129284P3240P1201O8267O2832N4633M4681L4109K3267J1752p65j3811k6277
$$ 2129284 2202524 2273725 2341992 2404824 2459457 2504138 2538247 2561514 2573266 2572501 2558690 2532413
62623B532413l7415m7529n7452o7282p5827q1466q3551q2937q1281p9846p8781
$$ 2532413 2494998 2447469 2390017 2322735 2246908 2165442 2081891 1998954 1917673 1837827 1759046
62612A759046p7195p4034o9319o4438o0740n7823n4020m8739m3358l9203l5780
$$ 1759046 1681851 1607817 1538498 1474060 1413320 1355497 1301477 1252738 1209380 1170177 1134397
62601A134397l2095k8686k6752k5785k4024k1195j8927j8055j7353j5655j3531
$$ 1134397 1102302 1073616 1046864 1021079 997055 975860 956933 938878 921525 905870 892339
62590H92339j1836j0236q481p680q637j0001r784q027o294n162l999k803k281
$$ 892339 880503 870267 861786 854106 845469 835468 825684 817657 811363 806201 802202 799399 797118
62577G97118k068q19J470K957K433R58K76P57J693K592L197L025J875N28J76J349
$$ 797118 795050 794231 795701 798658 801091 802049 802325 803082 804775 807367 810564 813589 815464 815992 816168 817517
62561H17517L776O816R548J0921J0577R384Q732R387J1278J4001J6975J9372K0519
$$ 817517 821293 828109 837657 848578 859155 868539 877271 886658 897936 911937 928912 948284 968803
62548I68803K0500K0150K0397K1771K4388K8004L1947L5295L7384L8294L8802
$$ 968803 989303 1009453 1029850 1051621 1076009 1104013 1135960 1171255 1208639 1246933 1285735
62537A285735L9769M1529M3737M5674M6563M5927M3987M1561L9060L5647L0047
$$ 1285735 1325504 1367033 1410770 1456444 1503007 1548934 1592921 1634482 1673542 1709189 1739236
62526A739236K2349J4147O518j169r824j8873k6929l3543l9139m3682m6729m8588
$$ 1739236 1761585 1775732 1782250 1781081 1771257 1752384 1725455 1691912 1652773 1609091 1562362 1513774
62514A513774n0081n1057n0453m8074m5219m3129m1802m0624l9138l6759l2903
$$ 1513774 1463693 1412636 1362183 1314109 1268890 1225761 1183959 1143335 1104197 1067438 1034535
62503A034535k8038k3812k1408k0494k0104j9606j8243j5014j0124n771m209n298
$$ 1034535 1006497 982685 961277 940783 920679 901073 882830 867816 857692 851921 847712 842414
62491H42414o877p223o269m844l723l314l343k818j076J209K717L069L126L742
$$ 842414 835537 828314 822045 817201 813478 810164 806821 804003 802927 804136 806853 809922 813048 816790
62477H16790N011O671Q473R972J0636J0439R935R556R318R349J0226J2457J5853
$$ 816790 821801 828472 836945 846917 857553 867992 877927 887483 896801 906150 916376 928833 944686
62464I44686J9629K3062K5889K8206L0153L1894L3908L6864M0651M3812M4837
$$ 944686 964315 987377 1013266 1041472 1071625 1103519 1137427 1174291 1214942 1258754 1303591
62453A303591M4101M3462M3540M2646L9329L4782L1135K8173K3663J6866R719
$$ 1303591 1347692 1391154 1434694 1477340 1516669 1551451 1582586 1610759 1634422 1651288 1661007
62442A661007M024p48n924j1337j5929j9581k2830k5250k5734k4377k2717k1741
$$ 1661007 1665031 1664283 1658359 1647022 1631093 1611512 1588682 1563432 1537698 1513321 1490604 1468863
62430A468863k0643j8162j4298r971n537o00M753R344J2031J3026J3701J5144
$$ 1468863 1448220 1430058 1415760 1405789 1400252 1399652 1404405 1413749 1425780 1438806 1452507 1467651
62418A467651J7323J9573K1468K2899K3616K3065K0776J6782J1679O289J096m084
$$ 1467651 1484974 1504547 1526015 1548914 1572530 1595595 1616371 1633153 1644832 1651121 1652217 1648133
62406A648133r727j5818k1712k6927l1699l6352m0366m2711m3120m2564m2233
$$ 1648133 1638406 1622588 1600876 1573949 1542250 1505898 1465532 1422821 1379701 1337137 1294904
62395A294904m2370m2318m1454l9805l7736l5243l1915k7735k3650k0723j8714
$$ 1294904 1252534 1210216 1168762 1128957 1091221 1055978 1024063 996328 972678 951955 933241
62384I33241j6184j2378q401n846m831m157l155k369k407k962l251k839j872r42
$$ 933241 917057 904679 896278 890432 885601 881444 878289 875920 873513 870551 867300 864461 862589 861647
62370H61647q05j719l115m355n567o985p832p047n188m200m913n962n835m727
$$ 861647 860842 859123 856008 851653 846086 839101 831269 824222 819034 814834 809921 803959 798124 793397
62356G93397l579k453j097j41l50j224j732j915k439k867k013KJ566J727J213
$$ 793397 789818 787365 786268 786127 785777 784553 782821 780906 778467 775600 773587 773589 775155 776882 778095
62341G78095R44Q20O60J049K418M163N518O623P835Q758Q907Q785R256J0162J0601
$$ 778095 779039 779859 780519 781568 783986 788149 793667 800290 808125 816883 825790 834575 843831 853993 864594
62326H64594J0525J0956J2432J4101J4770J4271J3479J3367J4401J6536J9465
$$ 864594 875119 886075 898507 912608 927378 941649 955128 968495 982896 999432 1018897
62315A018897K2827K6240K9185L1157L2207L3135L4734L6963L9331M1991M5768
$$ 1018897 1041724 1067964 1097149 1128306 1160513 1193648 1228382 1265345 1304676 1346667 1392435
62304A392435N0954N6617O1467O5008O7607P0015P3163P7872Q3920Q9500R2297
$$ 1392435 1443389 1500006 1561473 1626481 1694088 1764103 1837266 1915138 1999058 2088558 2180855
62293B180855R1214Q6819Q0131P1675O1682N0504L8317K4897J0387l974j6546
$$ 2180855 2272069 2358888 2439019 2510694 2572376 2622880 2661197 2686094 2696481 2692507 2675961
62282B675961k6871l6044m5298n4672o3318p0594p6209p9578q0079p8233p5789
$$ 2675961 2649090 2613046 2567748 2513076 2449758 2379164 2302955 2223377 2143298 2065065 1989276
62271A989276p3815p1224o6250n9362n3392n0292m8763m6189m2169l8669l6927
$$ 1989276 1915461 1844237 1777987 1718625 1665233 1614941 1566178 1519989 1477820 1439151 1402224
62260A402224l5821l3991l2004l1187l1207l0416k8341k6274k5144k4158k2283
$$ 1402224 1366403 1332412 1300408 1269221 1238014 1207598 1179257 1152983 1127839 1103681 1081398
62249A081398j9948j8307j7484j6645j5435j4281j3324j2064j0279q489p005n224
$$ 1081398 1061450 1043143 1025659 1009014 993579 979298 965974 953910 943631 935142 928137 922913
62237I22913k509N40K392K273J087N06J332K962M314M996N520O571Q231R894J0827
$$ 922913 920404 920944 923336 925609 926696 927202 928534 931496 935810 940806 946326 952897 961128 971022 981849
62222I81849J0964J1270J2997J6178J9119K0210K0058K0786K2893K4219K3102
$$ 981849 992813 1004083 1017080 1033258 1052377 1072587 1092645 1113431 1136324 1160543 1183645
62211A183645K1377K2474K7028L2267L5931L8767M2405M6660N0435N4073N8902
$$ 1183645 1205022 1227496 1254524 1286791 1322722 1361489 1403894 1450554 1500989 1555062 1613964
62200A613964O4974P0807P5373P8933Q1923Q4286Q6091Q7576Q8154Q6393Q1448
$$ 1613964 1678938 1749745 1825118 1904051 1985974 2070260 2156351 2243927 2332081 2418474 2499922
62189B499922P3686O3439N0272L4279J7282J621j2045k4898l8065n1241o3130
$$ 2499922 2573608 2637047 2687319 2721598 2738880 2740501 2728456 2703558 2665493 2614252 2551122
62178B551122p2641p9557q4514q8383r1434r3041r2488q9918q6172q1776p6546
$$ 2551122 2478481 2398924 2314410 2226027 2134593 2041552 1949064 1859146 1772974 1691198 1614652
62167A614652p0278o3475n7054n1482m6477m1681l7393l4326l2486l0715k7873
$$ 1614652 1544374 1480899 1423845 1372363 1325886 1284205 1246812 1212486 1180000 1149285 1121412
62156A121412k4223k0967j8394j5531j2003r221q715r887j0588r738q148o625
$$ 1121412 1097189 1076222 1057828 1042297 1030294 1021073 1012358 1002471 991883 982145 973997 967372
62144I67372m727k045M04J250Q56J049K776M980O150O254O537P801R576J1067
$$ 967372 962645 960600 961004 962254 963110 964159 966935 971915 978065 984319 990856 998657 1008233 1019300
62130A019300J2281J3864J6048J8278K0026K1447K2907K4084K4207K3243K2331
$$ 1019300 1031581 1045445 1061493 1079771 1099797 1121244 1144151 1168235 1192442 1215685 1238016
62119A238016K2648K4196K6005K7295K7951K8211K8598L0064L3373L8025M2477
$$ 1238016 1260664 1284860 1310865 1338160 1366111 1394322 1422920 1452984 1486357 1524382 1566859
62108A566859M5919M9216N3488N8361O2452O5225O7146O7992O6243O0783N2330
$$ 1566859 1612778 1661994 1715482 1773843 1836295 1901520 1968666 2036658 2102901 2163684 2216014
62097B216014M2491L2101K1246J0326Q4r189j7652k5307l2111l8496m4785n0238
$$ 2216014 2258505 2290606 2311852 2322178 2322262 2313073 2295421 2270114 2238003 2199507 2154722 2104484
62085B104484n3642n4887n4944n4140n1635m7063m1570l6409l1401k5674j9269
$$ 2104484 2050842 1995955 1941011 1886871 1835236 1788173 1746603 1710194 1678793 1653119 1633850
62074A633850j3026p291j771L468P786J0860J3205J5653J8629K1804K4244K5098
$$ 1633850 1620824 1613533 1611762 1615230 1623016 1633876 1647081 1662734 1681363 1703167 1727411 1752509
62062A752509K4377K2707K0237J6537J1942P932N215K402k064p315j0987j2551
$$ 1752509 1776886 1799593 1819830 1836367 1848309 1856241 1861456 1863858 1861794 1854479 1843492 1830941
62050A830941j3912j6558j9757k2217k3920k5353k6027k4960k1973j7636j2527
$$ 1830941 1817029 1800471 1780714 1758497 1734577 1709224 1683197 1658237 1636264 1618628 1606101
62039A606101p368l192m36J733M260O878Q831J0406J2519J5005J6599J6945J7338
$$ 1606101 1598733 1595541 1595105 1596838 1601098 1607976 1616807 1627213 1639732 1654737 1671336 1688281 1705619
62026A705619J8868K0728K1233K0244J9668K1442K5535L0152L3544L5304L6014
$$ 1705619 1724487 1745215 1766448 1786692 1806360 1827802 1853337 1883489 1917033 1952337 1988351
62015A988351L6173L5899L5479L5620L6892L9153M1675M3698M4740M4712M3957
$$ 1988351 2024524 2060423 2095902 2131522 2168414 2207567 2249242 2292940 2337680 2382392 2426349
62004B426349M3095M2545M2211M1598M0074L7008L1919K4768J6062O736k120r753
$$ 2426349 2469444 2511989 2554200 2595798 2635872 2672880 2704799 2729567 2745629 2752365 2750245 2740492
61992B740492j6468k3571l2032m1184m9484n6484o3114o9749p5069p7607p7721
$$ 2740492 2724024 2700453 2668421 2627237 2577753 2521269 2458155 2388406 2313337 2235730 2158009
61981B158009p7119p6806p6383p5223p3434p1442o9180o6012o1469n6015n0955
$$ 2158009 2080890 2004084 1927701 1852478 1779044 1707602 1638422 1572410 1510941 1454926 1403971
61970A403971m7221m4285m0840l6609l2625k9575k6892k4147k2145k1548k1302
$$ 1403971 1356750 1312465 1271625 1235016 1202391 1172816 1145924 1121777 1099632 1078084 1056782
61959A056782j9897j7629j6036j5354j4240j2190j0563j0481j1053j0586q711
$$ 1056782 1036885 1019256 1003220 987866 973626 961436 950873 940392 929339 918753 910042
61948I10042o457m795l892l344k426m65K453N177O354N539L553J946J950L204
$$ 910042 903585 898790 894898 891554 889128 888663 891116 896293 902647 908186 911739 913685 915635 918839
61934I18839L543R12m109q576j0349j0177j0010j0296j0051r055q512r423j1315
$$ 918839 922382 923294 919185 910609 900260 890083 880073 869777 859726 850671 842159 832736 821421
61921H21421j2820j2911j1349q604n701l723l035l082l102k834k463k142j759
$$ 821421 808601 795690 784341 775737 770036 766313 763278 760196 757094 754260 751797 749655 747896
61908G47896j144m16k6k80p32l85J230L308M509M365L678L558M473O207Q235R920
$$ 747896 746752 746336 746310 746030 745298 744913 746143 749451 753960 758325 762003 765561 770034 776241 784476 794396
61892G94396J0754J0814J0835J1527J2903J4585J6540J8984K1583K3440K4227
$$ 794396 805150 815964 826799 838326 851229 865814 882354 901338 922921 946361 970588
61881I70588K4733K5709K6627K6437K5340K4742K5226K5616K4651K2760K1340
$$ 970588 995321 1021030 1047657 1074094 1099434 1124176 1149402 1175018 1199669 1222429 1243769
61870A243769K0810K0297J8884J6265J2442P740L182q7j941l287m893o765q566
$$ 1243769 1264579 1284876 1303760 1320025 1332467 1340207 1343389 1343302 1341361 1338074 1333181 1326416 1317850
61857A317850r937j0335r382p340m692j398K499N833P316P664R106J2180J4662
$$ 1317850 1307913 1297578 1288196 1280856 1276164 1274766 1277265 1283098 1290414 1298078 1307184 1319364 1334026
61844A334026J4632J3072J1953J1053Q489L831j262n381q683j1701j4381j6731
$$ 1334026 1348658 1361730 1373683 1384736 1393225 1397056 1395794 1390413 1381730 1370029 1355648 1338917
61832A338917j9228k1956k4249k5686k6586k7092k6475k4126k0729j7843j6447
$$ 1338917 1319689 1297733 1273484 1247798 1221212 1194120 1167645 1143519 1122790 1104947 1088500
61821A088500j6263j6301j5771j4541j2891j0872q189n003k451j597j912j525
$$ 1088500 1072237 1055936 1040165 1025624 1012733 1001861 993672 988669 986218 984621 982709 981184
61809I81184P60M224P204Q706Q891Q650R152J1222J4561J7809J9871K0953K1983
$$ 981184 981944 986168 993372 1002078 1010969 1019619 1028771 1039993 1054554 1072363 1092234 1113187 1135170
61796A135170K3371K4881K6532K8931L2424L6286L9141M0167L9733L8807L7920
$$ 1135170 1158541 1183422 1209954 1238885 1271309 1307595 1346736 1386903 1426636 1465443 1503363
61785A503363L6860L5286L3110L0196K6129K0828J5077R916N564J421k955p451
$$ 1503363 1540223 1575509 1608619 1638815 1664944 1685772 1700849 1710765 1716329 1717750 1714795 1707344
61773A707344j1718j5129j6475j4755j0621o183k827M6L495P122R619J0714J1225
$$ 1707344 1695626 1680497 1664022 1649267 1638646 1632463 1629636 1629682 1633177 1640299 1649918 1660632 1671857
61760A671857J1222R386M725j864q446j4048j9204k4682l0337l5330l9116m1854
$$ 1671857 1683079 1692465 1697190 1695326 1686880 1672832 1653628 1628946 1598609 1563279 1524163 1482309
61748A482309m3877m5069m5018m3749m1984m0307l8346l5280l1262k7754k6034
$$ 1482309 1438432 1393363 1348345 1304596 1262612 1222305 1183959 1148679 1117417 1089663 1063629
61737A063629k5697k5123k3348k0786j8234j5885j3722j2096j1264j0760r947
$$ 1063629 1037932 1012809 989461 968675 950441 934556 920834 908738 897474 886714 876767
61726H76767q994q509q433q117p495p118o883n860l866k180j950k732l432l866
$$ 876767 867773 859264 850831 842714 835219 828101 821218 815358 811492 809312 807362 804630 801198 797332
61712G97332m412m844m677m201l974l700k826j873j785k265k202j634j583j902
$$ 797332 792920 788076 783399 779198 775224 771524 768698 766825 765040 762775 760573 758939 757356 755454
61698G55454j147R31K719L317L898N394O486N525L069Q87m80j355j208N92K784
$$ 755454 754307 755238 757957 761274 765172 770566 777052 782577 785646 786533 786053 784698 783490 784082 786866
61683G86866L252K068J509K634L732K878O24q36j91K072M581O174O615O626O970
$$ 786866 790118 792186 793695 796329 800061 802939 803563 802727 802536 804608 809189 815363 821978 828604 835574
61668H35574P441P363O861O691O771O136M713L874M558N776N891M629L007J826
$$ 835574 843015 850378 857239 863930 870701 876837 881550 885424 889982 895758 901649 906278 909285 911111
61654I11111J103P16P70J250J642R96j399n005p974q905q532q633r438r551q589
$$ 911111 912214 912930 913700 914950 916592 917588 916189 911184 903210 894305 885773 877140 867702 858151 849562
61639H49562p956q226p812n681l596l619m724m404k750k191l376m243l757l653
$$ 849562 841606 833380 825568 819887 816291 812672 807948 803544 800794 798603 795227 790984 787227 783574
61625G83574n119o181m424q62J205M50j278j844j197o51j090k321l432l472k259
$$ 783574 778455 772274 767850 766988 768193 768643 767365 765521 764324 763673 762583 760262 756830 753358 751099
61610G51099o82J72J35m6L47J383K481K679J375o20j322L93L239M867M455L124
$$ 751099 750417 750589 750724 750678 751025 752408 754889 757568 758943 758323 757001 757394 760633 765500 769955 773079
61594G73079K047J345Q49P35R54R77P51J021K199L508L907L319K396J600J120
$$ 773079 775126 776471 777320 778055 779009 779986 780737 781758 783957 787465 791372 794691 797087 798687 799807
61579G99807J155J605J813J216o6j747l880o235p839q111p843p967p885o487m449
$$ 799807 800962 802567 804380 805596 805530 803783 799903 793668 785829 777718 769875 761908 754023 747536 743087
61564G43087l618m054l741j933p39j892l758l557j429J4l90j262j523j963l244
$$ 743087 739469 735415 731674 729741 729002 727110 723352 719795 718366 718380 717990 716728 715205 713242 709998
61549G09998m369m347l909m342n646o969p966q527q106o539m972m625n105n124
$$ 709998 705629 701282 697373 693031 687385 680416 672450 663923 655817 649278 644306 639681 634576 629452
61535F29452m526m266m669n134n452o044o698o559n616m928m894m620l598k768
$$ 629452 624926 620660 615991 610857 605405 599361 592663 586104 580488 575560 570666 566046 562448 559680
61521E59680l073m023m640m941n391n694n279m483m044l723k628q58L36J54q27
$$ 559680 556607 552584 547944 543003 537612 531918 526639 522156 518112 514389 511761 510903 511239 511393 510566
61506E10566j524j426o06N14J171O20j013k605l054k272j032j06L45P33J461K283
$$ 510566 509042 507616 507010 507524 508695 509315 508302 505697 502643 500371 499339 499233 499578 500311 501772 504055
61490E04055K387J373r8r80j040q74r20j024r12n48P1Q53J338J022J46m11k04
$$ 504055 506442 507815 507717 506737 505697 504823 503903 502879 501967 501419 501490 502343 503681 504703 504849 504438 504234
61473E04234M16J092J891K531K075J96j801k233j202m23q18j317o08P84J157l6
$$ 504234 504650 505742 507633 510164 512239 512435 510634 508401 507199 506776 505958 504641 504033 504817 505974 505938
61457E05938j617k457k704k751k147n71Q18M61j335k621k524k284l003l778l246
$$ 505938 504321 501864 499160 496409 494262 493691 494509 494970 493635 491014 488490 486206 483203 479425 476179
61442D76179j894j369k074k911l089k776k127j093k98o58j764j980o55R30J352
$$ 476179 474285 472916 470842 467931 464842 462066 459939 458846 458548 457890 456126 454146 453491 454421 455773
61427D55773P46M6l66l76M07J844K663J865L25r4J228L217M662N156M582K810
$$ 455773 456519 456565 456199 455823 456230 458074 460737 462602 462927 462833 464061 467278 471940 477096 481678 484488
61411D84488L10j687k197j405k92M84J019J617K040J731P62J29M78R23P0j816
$$ 484488 484798 483111 480914 479509 479217 479701 480720 482337 484377 486108 486870 486999 487477 488400 488470 486654
61395D86654k779j711J42R37N85L78R35J700K119K265K336K426K739L300L541
$$ 486654 483875 482164 482306 483243 483828 484206 485141 486841 488960 491225 493561 495987 498726 502026 505567
61380E05567K904J787J193J571K668M203N787O325M828K056K74Q28K716M004L993
$$ 505567 508471 510258 511451 513022 515690 519893 525680 532005 536833 538889 539163 539991 542707 546711 550704
61365E50704L391K974K815K587K081J296L77m96j065q72M67K516L823L253J461
$$ 550704 554095 557069 559884 562471 564552 565848 566225 565729 564664 563792 564259 566775 570598 573851 575312
61350E75312L65R14K033K118R42m82j450k222l155l892l881l401l463m492n535
$$ 575312 575677 576591 578624 580742 581684 581202 579752 577530 574375 570483 566602 563201 559738 555246 549711
61335E49711n291l706j913p11N3N33L76l66q65p58p79j293j253J31J646J650O93
$$ 549711 544420 540714 538801 538090 538143 538676 539052 538686 537821 537063 536284 534991 533738 533869 535515 537165 537858
61318E37858O83J865K655K501K598L423L748K988K483L195L921L284K036J783
$$ 537858 538541 540406 543061 545562 548160 551583 555331 558319 560802 563997 567918 571202 573238 575021
61304E75021K591L481M203M849M816L914L714N631Q204Q637O881N898P505J0133
$$ 575021 577612 581093 585296 590145 594961 598875 602589 608220 616424 625061 631942 637840 645345 655478
61290F55478J1477J1386J0993J0629J0091R835J0378J1019J0461Q537O467N555
$$ 655478 666955 678341 689334 699963 710054 719889 730267 741286 751747 760284 766751 772306
61278G72306O191P778R047Q874P438O106N540M644K327k63p45J288L496L614J820
$$ 772306 778497 786275 795322 804196 811634 817740 823280 827924 830251 829988 829243 830531 834027 837641 839461
61263H39461l45k205l962n241n089l423j349K22J431K605L391L435L344M169O013
$$ 839461 839116 836911 832949 827708 822619 819196 817847 818069 819500 822105 825496 828931 832275 836444 842457
61248H42457P880Q921R398J0160J1452J2487J2156J0203P623N716M670L385Q94
$$ 842457 850337 859258 868656 878816 890268 902755 914911 925114 932737 938453 943123 946508 947402
61235I47402k387n106o370o372o017o319p688r105q590n407j593j28j546l537
$$ 947402 945015 939909 933539 927167 921150 914831 907143 898038 889448 884041 882448 882320 880774 877237
61221H77237m021l329k772k455j651l46Q25J845L264N091O659P598Q059Q059P492
$$ 877237 873216 869887 867115 864660 863009 862663 863488 865333 868597 873688 880347 887945 896004 904063 911555
61206I11555O780O667P180P576P585P944R176J0591J1198J1245J1900J3394J4337
$$ 911555 918335 925002 932182 939758 947343 955287 964463 975054 986252 997497 1009397 1022791 1037128
61193A037128J3435J1334R778R173Q066N517K859J977K518K362P25q32r80n52
$$ 1037128 1050563 1061897 1071675 1080848 1088914 1094431 1097290 1099267 1101785 1104147 1104872 1104040 1103060 1102508
61179A102508r59j956k402k367k882l961m377l560k443k080k232j819j64K381
$$ 1102508 1101549 1099593 1097191 1094824 1091942 1087981 1083604 1080044 1077601 1075521 1073289 1071470 1071306 1073687
61165A073687M679N528M607K732R77k6K69K522O350R594J0182Q562P009O611O420
$$ 1073687 1078366 1083894 1088501 1091233 1092210 1092184 1092453 1094975 1101325 1110919 1121101 1129663 1136672 1143283 1149703
61150A149703N779N585O450P186O506N199N134O584P979Q181P799Q092R509J1527
$$ 1149703 1155482 1161067 1167517 1174703 1181209 1186408 1191542 1198126 1206105 1214286 1222085 1230177 1239686 1251213
61136A251213J3329J4444J5185J6490J8852K1489K3058K3096K2106K0362J7596
$$ 1251213 1264542 1278986 1294171 1310661 1329513 1351002 1374060 1397156 1419262 1439624 1457220
61125A457220J4190J1713J1426J2672J3576J3132J1867J0559R226P713O489O113
$$ 1457220 1471410 1483123 1494549 1507221 1520797 1533929 1545796 1556355 1565581 1573294 1579783 1585896
61113A585896O262O006M958L463J755l97k972n325o998q379j0113j2135j3854
$$ 1585896 1592158 1598164 1603122 1606585 1608340 1607943 1604971 1599646 1592648 1584269 1574156 1562021 1548167
61100A548167j4963j5601j5898j5990j6333j7309j8408j8524j7321j5808j5140
$$ 1548167 1533204 1517603 1501705 1485715 1469382 1452073 1433665 1415141 1397820 1382012 1366872
61089A366872j5284j5363j4973j4448j3825j2366r730p086o225p477r262r976
$$ 1366872 1351588 1336225 1321252 1306804 1292979 1280613 1270883 1263797 1257572 1250095 1240833 1230857
61077A230857r543q640p304n406l828l619l964k529J557O406R718J1219J2043
$$ 1230857 1221314 1212674 1205370 1199964 1196136 1192517 1188553 1186024 1187581 1193987 1203705 1214924 1226967
61064A226967J2884J4047J6323K0181K4509K7637K9443L1136L3198L4964L6217
$$ 1226967 1239851 1253898 1270221 1290402 1314911 1342548 1371991 1403127 1436325 1471289 1507506
61053A507506L7664L9521M0957M1557M2115M3289M4432M4544M3677M2557M1300
$$ 1507506 1545170 1584691 1625648 1667205 1709320 1752609 1797041 1841585 1885262 1927819 1969119
61042A969119L9312L6249L2454K8411K4097J8980J2721N986K41l649o484r761
$$ 1969119 2008431 2044680 2077134 2105545 2129642 2148622 2161343 2167329 2167570 2163921 2157437 2147676
61030B147676j3836j7691k0562k2969k5834k9189l2142l3827l4210l4100l4302
$$ 2147676 2133840 2116149 2095587 2072618 2046784 2017595 1985453 1951626 1917416 1883316 1849014
61019A849014l4536l3614l1004k7742k5134k3201k1315j9653j8634j7389j4525
$$ 1849014 1814478 1780864 1749860 1722118 1696984 1673783 1652468 1632815 1614181 1596792 1582267
61008A582267j0358o702m239j780J469M736P448J0248J3338J5587J6703J8609
$$ 1582267 1571909 1565207 1560968 1559188 1560657 1565393 1572841 1583089 1596427 1612014 1628717 1647326
60996A647326K2865K7951L1188L2684L5249M0520M7025N2389N6038N9095O2681
$$ 1647326 1670191 1698142 1729330 1762014 1797263 1837783 1884808 1937197 1993235 2052330 2115011
60985B115011O6945P1460P6161Q1789Q9096R7543J05577J12628J20025J29127
$$ 2115011 2181956 2253416 2329577 2411366 2500462 2598005 2703582 2816210 2936235 3065362
60975C065362J39341J48926J57190J64713J71974J79067J86762J96517K09064
$$ 3065362 3204703 3353629 3510819 3675532 3847506 4026573 4213335 4409852 4618916
60966D618916K23716K39435K56142K74895K96955L22640L51314L83174M21030
$$ 4618916 4842632 5082067 5338209 5613104 5910059 6232699 6584013 6967187 7388217
60957G388217M68993N28736N98482O76557P64222Q63072R71002J083305J197225
$$ 7388217 7857210 8385946 8984428 9660985 10425207 11288279 12259281 13342586 14539811
60948A4539811J313119J432219J557080J693335J842256J982392K058932K001884
$$ 14539811 15852930 17285149 18842229 20535564 22377820 24360212 26419144 28421028
60940B8421028J768162J375037Q96554M27924M8839j92865k84521k55456j82136
$$ 28421028 30189190 31564227 32460781 32888705 32937544 32744679 32460158 32204702 32022566
60931C2022566j68857k99846n94289j000547j429947j798234k049068k160324
$$ 32022566 31853709 31553863 30959574 29959027 28529080 26730846 24681778 22521454
60923B2521454k142928k032352j870966j690594j507575j329610j162809j012338
$$ 22521454 20378526 18346174 16475208 14784614 13277039 11947429 10784620 9772282
60915I772282q80508p66898o69972n87844n18407m59707m10166l68308l32505
$$ 9772282 8891774 8124876 7454904 6867060 6348653 5888946 5478780 5110472 4777967
60906D777967l01123k72908k47365k24782k05362j88224j71831j55742j41090
$$ 4777967 4476844 4203936 3956571 3731789 3526427 3338203 3166372 3010630 2869540
60897B869540j28856j18585j09551j02214r7198r3364q8452q1703p4592o8737
$$ 2869540 2740684 2622099 2512548 2410334 2313136 2219772 2131320 2049617 1975025 1906288
60887A906288o4142n9859n5479n1263m7468m4097m1159l8720l6856l5655l5084
$$ 1906288 1842146 1782287 1726808 1675545 1628077 1583980 1542821 1504101 1467245 1431590 1396506
60876A396506l4753l4126l2984l1444k9623k7616k5893k5133k5523k6423k6866
$$ 1396506 1361753 1327627 1294643 1263199 1233576 1205960 1180067 1154934 1129411 1102988 1076122
60865A076122k6111k3867k0580j7575j6251j6688j7372j6741j4717j2433j0815
$$ 1076122 1050011 1026144 1005564 987989 971738 955050 937678 920937 906220 893787 882972
60854H82972r969r650r559r195q005n997l838k115q27K17Q99J029Q44Q33J208
$$ 882972 873003 863353 853794 844599 836594 830597 826759 824644 823817 824034 824933 825962 826806 827639 828847
60839H28847J794K367K756K753K297J671J179O86j41j148j702j518j088j104j773
$$ 828847 830641 833008 835764 838517 840814 842485 843664 844350 844209 843061 841359 839841 838753 837649 835876
60824H35876k877m183n529o723p576p963p858p395o837o219n268m019l197l278
$$ 835876 832999 828816 823287 816564 808988 801025 793167 785772 778935 772716 767448 763429 760232 756954
60810G56954l414k316k53R28K35j036j005N40K332L381L590L292L008L295L952
$$ 756954 753540 751224 750971 751899 752134 751098 750093 750633 752965 756346 759936 763228 766236 769531 773483
60795G73483L857K408O73K36J292K807M064M953N142M236K740J743J634K042K880
$$ 773483 777340 779748 780421 780657 781949 784756 788820 793773 798915 803151 805891 807634 809268 811310 814190
60780H14190M145M847L577N61k074k651j709r46j188j895k111j523q49j209k768
$$ 814190 818335 823182 826759 827320 825246 822595 820886 819940 818752 816857 814746 813223 812374 811165 808397
60765H08397m305m704m312l902l069j238K85o88l990o867p580p308p674q231p705
$$ 808397 804092 799388 795076 791174 788105 786867 787152 786464 782474 775607 768027 760719 753045 744814 737109
60750G37109o275n056m346l746l232k903k396j595j206j591j842j054K61J039
$$ 737109 730834 725778 721432 717686 714454 711551 709155 707560 706354 704763 702921 701867 702128 703167
60736G03167J223J338J401J380K001L605M896M414K837K281L481N162O088O367
$$ 703167 704390 705728 707129 708509 710510 714115 719011 723425 726262 728543 732024 737186 743274 749641
60722G49641O582P003P799Q987R921R939R569J0071J1621J3006J3410J3424J3896
$$ 749641 756223 763226 771025 780012 789933 799872 809441 819512 831133 844139 857549 870973 884869
60709H84869J4600J4649J3636J1964J0397R578R655J0142J0334R882Q941Q009
$$ 884869 899469 914118 927754 939718 950115 959693 969348 979490 989824 999706 1008647 1016656
60697A016656P733Q308Q851Q227O946P222J0188J3950J5651J4758J3015J1822
$$ 1016656 1024389 1032697 1041548 1049775 1056721 1063943 1074131 1088081 1103732 1118490 1131505 1143327
60685A143327J1387J1920J3613J5361J5404J3669J1867J1004J0418R757R903J1131
$$ 1143327 1154714 1166634 1180247 1195608 1211012 1224681 1236548 1247552 1257970 1267727 1277630 1288761
60673A288761J2045J1649J0984J1337J2020J1558J0204R566J0097J0429R290O895
$$ 1288761 1300806 1312455 1323439 1334776 1346796 1358354 1368558 1378124 1388221 1398650 1407940 1414835
60661A414835M324K349R92l43k255m526o203p021q106j0532j3615j5640j6102
$$ 1414835 1419159 1421508 1422500 1422157 1419902 1415376 1409173 1402152 1394046 1383514 1369899 1354259 1338157
60648A338157j6110j6676j7665j8691j9924k1324k1962k1011j9115j7909j8137
$$ 1338157 1322047 1305371 1287706 1269015 1249091 1227767 1205805 1184794 1165679 1147770 1129633
60637A129633j8882j8882j8043j7209j6888j6803j6676j6743j7201j7655j7555
$$ 1129633 1110751 1091869 1073826 1056617 1039729 1022926 1006250 989507 972306 954651 937096
60626I37096j6700j5023j2444r645q281r296j1254j1678j0141q775r189j0245
$$ 937096 920396 905373 892929 883284 875003 865707 854453 842775 832634 823859 814670 804425
60614H04425r893q152o851o852p042o276n101m878n946p296p849p390o290m824
$$ 804425 794532 786380 779529 772677 765635 759359 754258 749380 743434 736138 728289 720899 714609 709785
60600G09785l079j399m07m08r29j175q36j86N26J346K232K849L009L026L402M244
$$ 709785 706706 705307 704900 704492 703563 702388 701552 701366 701892 703238 705470 708319 711328 714354 717756 722000
60584G22000N083N202M188K442J058Q53J432J613Q44k26p41p15p38r76r48k64
$$ 722000 727083 732285 736473 738915 739973 740826 742258 743871 744715 744489 743748 743033 742295 741319 740371 740107
60568G40107P79J442J284O06M7k30p53j886l138l683l472l208l214k944j825k13
$$ 740107 740886 742328 743612 744218 744265 744035 743282 741396 738258 734575 731103 727895 724681 721737 719912 719699
60552G19699P51J20j991m228m928l717k095j813k820l552l165k412k096j783o89
$$ 719699 720450 720570 718579 714351 709423 705706 703611 701798 698978 695426 692261 689849 687753 685970 685281
60537F85281R61K153K219J199l97j721k043j568j296j549j409k29J092J188Q0
$$ 685281 686242 688395 690614 691813 691416 689695 687652 686084 684788 683239 681830 681601 682693 683881 683961
60522F83961j020j257n67R96L224N257O269O670P610R223J0336J0157R313Q974
$$ 683961 682941 681684 681117 682113 685337 690594 696863 703533 711143 720366 730702 740859 750172 759146
60508G59146R639J1097J2651J3143J1604Q433N307L377K090J55k763n705p236
$$ 759146 768785 779882 792533 805676 817280 825713 831020 834397 836487 836642 833879 828174 820938
60495H20938o300k954J142L635L646K719K978M720O621P769Q391Q697Q350P484
$$ 820938 814638 811684 812826 816461 820107 822826 825804 830524 837145 844914 853305 862002 870352 877836
60481H77836P165Q058R309R531Q421O725N021L373K005J407J491J440O99k97p12
$$ 877836 885001 893059 902368 911899 920320 927045 932066 935439 937444 938851 940342 941782 942481 942184 941472
60466I41472k68N78J151J067M86R2N24J724L131M558O265P962Q543P497O042N970
$$ 941472 941204 941782 942933 944000 944486 944578 945102 946826 949957 954515 960780 968742 977285 984782 990824 996794
60450I96794P565R531J0928J2214J4183J6694J8988K0842K2834K5586K9038L2449
$$ 996794 1004359 1013890 1024818 1037032 1051215 1067909 1086897 1107739 1130573 1156159 1185197 1217646
60438A217646L4956L6194L6368L5686L3862L0340K4758J7024P270l758j4567k3875
$$ 1217646 1252602 1288796 1325164 1360850 1394712 1425052 1449810 1466834 1474104 1470346 1455779 1431904
60426A431904l1680l8766m5087m9324n0365m8666m5833m3191m0954l8503l5235
$$ 1431904 1400224 1361458 1316371 1267047 1216682 1168016 1122183 1078992 1038038 999535 964300
60415I64300l1353k7795k5249k3333k1165j8536j6021j4075j2779j2280j2701
$$ 964300 932947 905152 879903 856570 835405 816869 800848 786773 773994 761714 749013
60404G49013j3412j3253j1783r676p715o095m943m562m665m229k791j247p86j417
$$ 749013 735601 722348 710565 700889 693174 687079 682136 677574 672909 668680 665889 664642 663856 662439
60390F62439k179k362j995j538j507k043k516k094j062q61k289m385n681n869
$$ 662439 660260 657898 655903 654365 652858 650815 648299 646205 645143 644282 641993 637608 631927 626058
60376F26058n388m180k057J30J004L87m87o59m67o12r61p56K86J462J688O13p89
$$ 626058 620670 616490 614433 614563 615567 615954 615467 614808 614341 613729 612768 612012 612298 613760 615448 616061 615272
60359F15272j053K17J822K340J640O75K10K27M25P36J252J994K680K759J934Q04
$$ 615272 614219 614436 616258 618598 620238 620913 621123 621350 621775 622511 623763 625757 628437 631196 633130 633934
60343F33934M83J404K852L976M603M815M376L222J967J339J364J558J536J147
$$ 633934 634417 635821 638673 642649 647252 652067 656443 659665 661632 662971 664335 665893 667429 668576
60329F68576N72N38J658L205L507K135O53M82J089J360J572K566L921M675N141
$$ 668576 669148 669686 671344 674549 678056 680191 680844 681326 682415 683775 685347 687913 691834 696509 701650
60314G01650O164O988N976L478J829K049K455J516L37R43L178M852M582L203K354
$$ 701650 707814 714802 720778 724256 726085 728134 730589 732105 732442 733385 736563 741415 745997 749200 751554
60299G51554K584L180L460L667M467N791O687O458N510M885N398P271R937J1899
$$ 751554 754138 757318 760778 764445 768912 774703 781390 787848 793358 798243 803641 810912 820849 832748
60285H32748J1732R771P861O826N389K485p75k915m528o897r217r578q193p168
$$ 832748 844480 854251 862112 868938 874327 876812 876037 873122 868594 861697 852480 842902 834709 827541
60271H27541p096o372m261k169j137k70J236K342J688m45k661l752k900N2L675
$$ 827541 820445 814073 809812 807643 806506 806236 807472 809814 811502 811057 808396 804644 801744 801796 805471
60256H05471N766N854N676O497P608Q316R523J2032J4714J6001J6097J6284J6884
$$ 805471 811237 817091 822767 829264 836872 845188 854711 866743 881457 897458 913555 929839 946723
60243I46723J7208J6759J5321J2701R349O368L934P62l789q174j0499j0830j0373
$$ 946723 963931 980690 996011 1008712 1018061 1024429 1028363 1029125 1025336 1017162 1006663 995833 985460
60230I85460r568q480q102r359j1351j2216j1499j0325r639r515r781j0137r998
$$ 985460 975892 967412 959310 949951 938600 926384 914885 904560 894921 885406 875625 865488 855490
60217H55490r230q545q247p491n846m515m583n153m940m631n650p377p843o737
$$ 855490 846260 837715 829468 821977 816131 811616 807033 801880 796940 792309 786659 779282 771439 764702
60203G64702n455m555l453k530k915l990l550j222N82J36j285j677j139r12j005
$$ 764702 759247 754692 751239 748709 745794 741804 738254 737032 737614 737750 736465 734788 733649 732737 731732
60188G31732l50J318L041L775L223J916Q35O18Q75Q26N19N71R00Q90Q12J609L092
$$ 731732 731382 732700 735741 739516 742739 744655 745490 746108 746983 747809 748328 748899 749799 750689 751501 753110 756202
60171G56202L788L085K111J901K147K499L518N301O436N714L986L029L217L497
$$ 756202 759990 763075 765186 767087 769234 771733 775251 780552 786988 792702 796688 799717 802934 806431
60157H06431L208K697K435K482K830L566M677O020P257P823P409O664O630P324
$$ 806431 809639 812336 814771 817253 820083 823649 828326 834346 841603 849426 856835 863499 870129 877453
60143H77453P743P545P624Q511R337R147Q218P231O194N121M798N573O220N351
$$ 877453 885196 892741 900365 908876 918213 927360 935578 942809 949003 954124 958922 964495 970715 976066
60129I76066L383J752O47r14k930l966l180j572p29j256k770m635o184o929p072
$$ 976066 979449 981201 981848 980934 978004 974038 970858 969286 968557 967301 964531 959896 953712 946783 939711
60114I39711p348p895p724n909l051r96r35k207l255l411l231l126k536r53R05
$$ 939711 932363 924468 916744 910835 907784 906788 905853 903646 900391 896980 893749 890623 888087 887134 888039
60099H88039J865J912K043K587K810K392K147K804L975M966N678O098N744M464
$$ 888039 889904 891816 893859 896446 899256 901648 903795 906599 910574 915540 921218 927316 933060 937524
60085I37524L201L058M003N145N906O358O785P455Q391R017Q616P504O868O957
$$ 937524 940725 943783 947786 952931 958837 965195 971980 979435 987826 996843 1005459 1012963 1019831 1026788
60071A026788O504M693K570J434Q65k08j421j550o27K42P69J386J561J06k561
$$ 1026788 1033292 1037985 1040555 1041989 1042854 1042646 1041225 1039675 1039048 1039290 1040059 1041445 1043006 1043112 1040551
60056A040551m320l973k448r59K87R38%k190l094r08K538L707J786n75r92j31
$$ 1040551 1036231 1032258 1029810 1028851 1029138 1030076 1030076 1027886 1024792 1023884 1026422 1030129 1031915 1031340 1030348 1030217
60040A030217q6j359k592k747k291k134k254j967j123m08m51j101j648j420j91
$$ 1030217 1030131 1028772 1026180 1023433 1021142 1019008 1016754 1014787 1013664 1013256 1012805 1011704 1010056 1008636 1008445
60025A008445J526K506J825R7r51m86N15R08R24J184J081l14k193k635j499j089
$$ 1008445 1009971 1012477 1014302 1014399 1013448 1012962 1013477 1014385 1015309 1016493 1017574 1017260 1015067 1012432 1010933 1009844
60009A009844l183o606q704q407p020o403p234q758r733r573q835q453q571q519
$$ 1009844 1006661 1000055 991351 982944 975924 969521 962287 953529 943796 934223 925388 916935 908364 899845
59995H99845p826o621n097l433k251k202k763k587j404n13o38o00Q32K768L350
$$ 899845 892019 885398 880301 876868 874617 872415 869652 867065 865661 865148 864510 863910 864742 867510 870860
59980H70860K542K162L235M786N466N143M329L103J347n58j885k233j786j108
$$ 870860 873402 875564 878799 883585 889051 894194 898523 901626 902973 902415 900530 898297 896511 895403
59966H95403q84j458k465l219l561m052n287p362r987j2533j3895j3124j0656
$$ 895403 894519 893061 890596 887377 883816 879764 874477 867115 857128 844595 830700 817576 806920
59953H06920q338p504p456o580m742l571m161n413n339l534j432k43M80J735L267
$$ 806920 798582 791078 783622 777042 772300 768729 764568 759155 753816 750282 748850 748607 749087 750822 754089
59938G54089L736K597J078R09K391M157M685L738K371J668J772K048K115K304
$$ 754089 757825 760422 761500 762409 764800 768957 773642 777380 779751 781419 783191 785239 787354 789658
59924G89658K923L450L098K069J547K094K785K430J101l07j566l100m637n062
$$ 789658 792581 796031 799129 801198 802745 804839 807624 810054 811155 810848 809282 806182 801545 796483
59910G96483l944k268j124m29L73J038Q95P3n63n15J54J487L410M790L996R43
$$ 796483 792539 790271 789147 788718 789091 790129 791024 791097 790534 790019 790173 791660 795070 799860 803856 804799
59894H04799k336l812l366k047l99J347K248J418k53o13J048K901K696K50k662
$$ 804799 802463 798651 795285 793238 792839 794186 796434 797852 797599 796986 798034 800935 803631 803881 801219
59879H01219m164l543j441M99O22j419m386o696p528o698m373j584j63j078l108
$$ 801219 797055 793512 792071 792570 793192 791773 787387 780691 773163 766465 762092 760508 760345 759267 756159
59864G56159m062l100j138P09K067K784K571J559N42L24J132K679M336N270N042
$$ 756159 752097 748997 747859 748568 750635 753419 755990 757549 758091 758415 759547 762226 766562 771832 776874
59849G76874M154L545L502L577L476L470L867M631N606O543O985O722O328O514
$$ 776874 781028 784573 788075 791652 795128 798598 802465 807096 812702 819245 826230 832952 839280 845794
59835H45794P015O889O004N270N188N128M457L587L351L978N110O250O808O502
$$ 845794 852809 859698 865702 870972 876160 881288 885745 889332 892683 896661 901771 908021 914829 921331
59821I21331O028O614Q287R411Q613O525M837M220L915K969J111j178k942l454
$$ 921331 927359 933973 942260 951671 960284 966809 971646 975866 979781 982750 983861 982683 979741 976287
59807I76287l178l447m633n381m471k661j537j223n71P69J943K557L335M699N865
$$ 976287 973109 969662 965029 959648 955177 952516 950979 949756 949185 949954 951897 954454 957789 962488 968353
59792I68353N846M616K912J501Q59R58J198J046P45O74J43k100n895r200j0183
$$ 968353 974199 978815 981727 983228 984087 985045 986243 987289 988034 988708 988851 986751 980856 971656 961473
59777I61473r129p841p677q622r686r775q607p054o353o775p502p744p326o185
$$ 961473 952344 944503 936826 928204 918518 908743 900136 893082 886729 879954 872452 864708 857382 851197
59763H51197m340k551k018k785l418k900k058k346l828n297n891n688n083m346
$$ 851197 846857 844306 842288 839503 836085 833185 831127 828781 824953 819656 813765 808077 802994 798648
59749G98648l719l232k643j965j643j697j344j79Q37N53p45j983l103m816o642
$$ 798648 794929 791697 789054 787089 785446 783749 782405 782226 783063 783616 782871 780888 777785 772969 766327
59734G66327o919n120k852j803j762j486o20K13N15K50o12j954l093l222k227
$$ 766327 759408 754288 751436 749633 747871 746385 745765 745978 746493 746743 746131 744177 741084 737862 735635
59719G35635o85P43J477J097k4n40M82K140K527J167l84n77M31J617K605L443
$$ 735635 734950 735693 737170 738267 738243 737703 738185 740325 742852 744019 743635 743058 743489 745106 747711 751154
59703G51154L565K294L16n75M68K494M308N815P178P648O520M824M573O131P662
$$ 751154 754719 757013 757329 756754 757222 759716 764024 769839 777017 784665 791185 796009 800582 806713 814375
59688H14375P648O851O807P375P046N364L691L372M222N139N368M783L615K506
$$ 814375 822023 828874 835681 843056 850102 855466 859157 862529 866751 871890 877258 882041 885656 888162
59674H88162K245K793L073K360J436J549K517K932K169J112N41j00j489k858k749
$$ 888162 890407 893200 896273 898633 900069 901618 904135 907067 909236 910348 910889 910789 909300 906442 903693
59659I03693j133M01O29l0n45o44n98l03N73J755K449K267J581R30N36L46J46
$$ 903693 902560 902961 903590 903560 903015 902371 901773 901470 902043 903798 906247 908514 910095 911025 911561 911907 912053
59642I12053l81j201j579o68J313L012L238K073O02q1L98J454J816P07j099j950
$$ 912053 911672 910471 908892 908224 909537 912549 915787 917860 918462 918381 918779 920233 922049 922756 921657 919707
59626I19707j397q25j494k750k997j870m12N08Q39N65m70j764k260j737j241j710
$$ 919707 918310 917485 915991 913241 910244 908374 907962 908470 909309 909874 909404 907640 905380 903643 902402 900692
59610I00692k844l802m351m774n157n400n528n502m963l682k014n24N39J086R55
$$ 900692 897848 894046 889695 884921 879764 874364 868836 863334 858371 854689 852675 852151 852690 853776 854731
59595H54731K65k95j15N86J081J062Q18O76P23R86J441J763J463L38j231k424
$$ 854731 854996 854701 854586 855172 856253 857315 858133 858809 859532 860518 861959 863722 865185 865523 864292 861868
59579H61868k486j394m1N99M61J49j50p07j170o53O78J335P12K99J488L153L080
$$ 861868 859382 857988 857947 858546 859007 859156 859006 858299 857129 856476 857154 858489 859201 859500 860988 864141 867221
59562H67221J166o77j422j812k331k359j817j794k685l318k884k170j852j017
$$ 867221 868387 867710 866288 864476 862145 859786 857969 856175 853490 850172 847288 845118 843266 842249
59548H42249J090L100L064J310P1M59J360J323K95p48r72l16M21J76j164k475
$$ 842249 843339 846439 849503 850813 850884 851343 852703 854026 854321 853573 852601 852285 852706 852882 851718 849243
59532H49243k863k825l091l022j496R80K538K257Q44r49l021m803n129l944k800
$$ 849243 846380 843555 840464 837442 835946 836926 839464 841721 842565 841616 838595 833792 828663 824719 821919
59517H21919k726k731j513K82P64o93k768l851l351j494J272M190O046N685L178
$$ 821919 819193 816462 814949 815231 815995 815302 812534 808683 805332 803838 805110 809300 815346 821031 824209
59502H24209M15p6K302N071N133K472K57R91L668N457N050L323J727J281K561
$$ 824209 824624 824548 826850 831921 837054 839526 839783 840774 844442 849899 854949 858272 859999 861280 863841
59487H63841N152P290P367N984N546P700J1916J6348J9122J9052J6522J3867J3418
$$ 863841 868993 876283 883650 889634 895180 902880 914796 931144 950266 969318 985840 999707 1013125
59474A013125J4553J3956R554L108j968m276m738m317l275k292k228k354n24L809
$$ 1013125 1027678 1041634 1051188 1054296 1052328 1048052 1043314 1038997 1035722 1033430 1031202 1028848 1028324 1032133
59460A032133Q049R212P531N851N766N906M340J248j593l135l852m634n833p323
$$ 1032133 1040182 1049394 1056925 1062776 1068542 1074448 1078788 1080036 1078443 1075308 1071456 1066822 1060989 1053666
59446A053666q774r763j0053r906r777r747r530q950q025o745n161l618k479j695
$$ 1053666 1044892 1035129 1025076 1015170 1005393 995646 986116 977166 969141 962396 957235 953617 951138 949443
59432I49443j064o22k18Q55K876M630M538L029K362L655N446O074O252P905J1152
$$ 949443 948379 947757 947539 948394 951270 955900 960438 963467 965829 969484 974930 981004 987256 995161 1006313
59417A006313J4046J5031J4449J3499J2870J2595J2391J1694R954P273M535K848
$$ 1006313 1020359 1035390 1049839 1063338 1076208 1088803 1101194 1112888 1122842 1130115 1134650 1137498
59405A137498K843M193N531N402M006L439N461R407J3133J5598J7350J8853J9821
$$ 1137498 1140341 1144534 1150065 1155467 1159473 1162912 1168373 1177780 1190913 1206511 1223861 1242714 1262535
59392A262535K0451K1798K4302K6928K8476K8825K8309K6654K3295J8158J1500
$$ 1262535 1282986 1304784 1329086 1356014 1384490 1413315 1441624 1468278 1491573 1509731 1521231
59381A521231L530n154j3236j9467k3513k5609k5960k5058k4034k3816k4097k3749
$$ 1521231 1524761 1519607 1506371 1486904 1463391 1437782 1411822 1386764 1362730 1338914 1314817 1291068
59369A291068k2099j9368j6104j2790r808p196m485j182K635O491J0141J3669
$$ 1291068 1268969 1249601 1233497 1220707 1210899 1203703 1199218 1198036 1200671 1207162 1217303 1230972
59357A230972J7087K0202K2807K4931K7047K9892L3429L5847L4413K7920J7783
$$ 1230972 1248059 1268261 1291068 1315999 1343046 1372938 1406367 1442214 1476627 1504547 1522330
59346A522330O510m185j3260j9616k2651k2897k1011j6840j0776n389l825o674
$$ 1522330 1528840 1524655 1511395 1491779 1469128 1446231 1425220 1408380 1397604 1392215 1388390 1381716
59334A381716j2036j8571k6472l4982m1249m3013m0968l7158l2348k6581k1086
$$ 1381716 1369680 1351109 1324637 1289655 1248406 1205393 1164425 1127267 1094919 1068338 1047252
59323A047252j7485j5469j3265j0483q691q855r708r393p536m999k616r23l39
$$ 1047252 1029767 1014298 1001033 990550 981859 973004 963296 953903 946367 941368 938752 937829 937490
59310I37490o71r72n01N95K036M032O402P897P542O369O481Q340J0120J0222R419
$$ 937490 936819 935847 935346 935941 937977 942009 948411 956308 963850 970219 976700 985040 995160 1005382 1014801
59295A014801R720J1676J3670J4007J3066J2923J4929J8147K0580K1658K2626
$$ 1014801 1024521 1036197 1049867 1063874 1076940 1089863 1104792 1122939 1143519 1165177 1187803
59284A187803K4340K5746K5491K4200K3763K4592K5042K3684K0743J6763J1466
$$ 1187803 1212143 1237889 1263380 1287580 1311343 1335935 1360977 1384661 1405404 1422167 1433633
59273A433633M983r62m567o272q257j1788j6020j9295k0779k0770k0177j9845
$$ 1433633 1438616 1437654 1433087 1426815 1418558 1406770 1390750 1371455 1350676 1329906 1309729 1289884
59261A289884j9897j9764j9061j8084j6970j5143j2308r353p221n493l295j044
$$ 1289884 1269987 1250223 1231162 1213078 1196108 1180965 1168657 1159304 1152083 1146590 1143295 1142251
59249A142251K26R99K871N890Q203Q788Q656Q528P162L306k155p374j1659j4867
$$ 1142251 1142477 1143476 1146347 1152237 1160440 1169228 1177884 1186412 1193574 1196880 1194725 1187351 1175692 1160825
59235A160825j6007j4451j1813j0499j0535r790p365m859l753l446k692j537o37
$$ 1160825 1144818 1130367 1118554 1108055 1097520 1087730 1080365 1075506 1071753 1068307 1065615 1064078 1063441
59222A063441L18K136M602O480P069O887O880P529Q799J0455J2169J3552J4288
$$ 1063441 1063759 1065895 1070497 1076977 1084046 1090933 1097813 1105342 1114141 1124596 1136765 1150317 1164605
59209A164605J4437J4565J5376J6912J8172J7910J5825J2726R531O437L155m15
$$ 1164605 1179042 1193607 1208983 1225895 1244067 1261977 1277802 1290528 1300059 1306496 1309651 1309236
59197A309236l989p121r564j1413j2940j4152j4735j4677j4615j5042j5366j4473
$$ 1309236 1305247 1298126 1288562 1277149 1264209 1250057 1235322 1220645 1206030 1190988 1175622 1161149
59185A161149j2239r760p819n884l220l78J216J100M78R13K634M470N201M658
$$ 1161149 1148910 1139150 1131331 1125447 1122227 1121849 1123065 1124165 1124643 1125556 1128190 1132660 1137861 1142519
59171A142519L504K299J194M07L51Q54P72q90l577n678o570p406r377j1796j2767
$$ 1142519 1146023 1148322 1149516 1149923 1150274 1151128 1151900 1151010 1147433 1141755 1135185 1127779 1118402 1106606 1093839
59156A093839j1574r703r150j0236j1468j1333r786p886o371n101l886l334m263
$$ 1093839 1082265 1072562 1063412 1053176 1041708 1030375 1020589 1012703 1006332 1001231 997345 994011 989748
59143I89748o256p350n757j951J379J825l85k774l287k079n57O60K124M157O040
$$ 989748 983492 976142 970385 968434 969813 971638 971253 968479 965192 963113 962556 963216 965340 969497 975537
59128I75537O899O822O639O837P017O462N131M152M929P402R539R329P117N030
$$ 975537 982436 989258 995897 1002734 1009751 1016213 1021344 1025496 1030425 1037827 1047366 1056695 1063812 1068842
59114A068842M304M316M355M816O001P173P831Q751J0516J2146J2527J2313J2736
$$ 1068842 1073146 1077462 1081817 1086633 1092634 1099807 1107638 1116389 1126905 1139051 1151578 1163891 1176627
59101A176627J3301J2518J0534R009Q418P410N128K364k4k223m380o005p106q479
$$ 1176627 1189928 1202446 1212980 1221989 1230407 1237817 1242945 1245309 1245285 1243062 1238682 1232677 1225571 1217092
59087A217092j0124j0868j0405j0186j1207j2274j1910j0704j0220j0413r925
$$ 1217092 1206968 1196100 1185695 1175509 1164302 1152028 1140118 1129414 1119194 1108781 1098856
59076A098856q457p200o930p061o689n670m350l003j559L68K932N209N616L961
$$ 1098856 1090399 1083199 1076269 1069208 1062519 1056849 1052499 1049496 1047937 1048305 1051237 1056446 1062062 1066023
59062A066023K352K978N536P967R261J0121J1073J1611J1546J1770J2827J3679
$$ 1066023 1068375 1071353 1076889 1084856 1094117 1104238 1115311 1126922 1138468 1150238 1163065 1176744
59050A176744J2860J0453Q218P838R381J1393J2229J1276R088O552M264K563J596
$$ 1176744 1189604 1200057 1208275 1216113 1225494 1236887 1249116 1260392 1269480 1276032 1280296 1282859 1284455
59037A284455J091N58J2r4O1m70j874k814k196r27p80k045l560m629n395n689
$$ 1284455 1285546 1286104 1286116 1286022 1286083 1285613 1283739 1280925 1278729 1277802 1277022 1274977 1271417 1266788 1261393 1255704
59021A255704n179m835o396r854j2972j3999j3507j2828j2155j1334j1238j2683
$$ 1255704 1250525 1245690 1239294 1229440 1216468 1202469 1188962 1176134 1163979 1152645 1141407 1128724
59009A128724j4613j4979j3303j0995r191p538n537l822l302l659l713l138k993
$$ 1128724 1114111 1099132 1085829 1074834 1065643 1058105 1052568 1048746 1045444 1041785 1038072 1034934 1031941
58996A031941m033n177m435j540J229J450o62k603k497q24O55Q16k51j657k321
$$ 1031941 1027908 1022731 1018296 1016756 1017985 1019435 1018773 1016170 1013673 1012849 1013504 1014320 1014069 1012412 1010091
58981A010091j685k16J218K544M315O308P240O417M793L792L856M822O676Q946
$$ 1010091 1008406 1008190 1009408 1011952 1016267 1022575 1029815 1036232 1041025 1044817 1048673 1053495 1060171 1069117
58967A069117J0190R501Q043P813R156J0858J2271J3730J4904J4800J3862J4106
$$ 1069117 1079307 1088808 1096851 1104664 1113820 1124678 1136949 1150679 1165583 1180383 1194245 1208351
58955A208351J6008J7076J5100J1493R378R212Q641O338L632J934Q72o1K7J813
$$ 1208351 1224359 1241435 1256535 1268028 1277406 1286618 1295259 1301597 1305229 1307163 1308035 1307974 1308001 1309814
58941A309814M046N090N133N293N456M925M529N908Q718J0640J0543R695R313
$$ 1309814 1313860 1318950 1324083 1329376 1334832 1339757 1344286 1350194 1358912 1369552 1380095 1389790 1399103
58928A399103Q849P657O485N918M860K200j085l082l433l101k382q83R39J989
$$ 1399103 1407952 1415609 1422094 1428012 1432872 1435072 1433987 1430905 1427472 1424371 1421989 1421106 1422045 1424034
58914A424034K326L189N128P356R053J0103J0557J0581J0893J2068J3320J3342
$$ 1424034 1426360 1429549 1434677 1442033 1451086 1461189 1471746 1482327 1493220 1505288 1518608 1531950
58902A531950J2303J1578J1454J0822R402Q379Q095P063M350J312n33j945m628
$$ 1531950 1544253 1555831 1567285 1578107 1587509 1595888 1603983 1611046 1615396 1616708 1616175 1614230 1609602
58889A609602q481j1915j4218j5896j6964j6671j5002j3090j1857j1239j0866
$$ 1609602 1601121 1589206 1574988 1559092 1542128 1525457 1510455 1497365 1485508 1474269 1463403
58878A463403j0627j0440j0256j0401j1147j1908j1552r748p369n487m468m070
$$ 1463403 1452776 1442336 1432080 1421679 1410532 1398624 1387072 1377324 1369955 1364468 1360000 1355930
58866A355930l858l398k519j559j039j111j537k009k174j641m85M90O11L53R15
$$ 1355930 1352072 1348674 1346155 1344596 1343557 1342446 1340909 1338900 1336726 1335085 1334600 1335090 1335701 1336054 1336969
58851A336969K784N267P430R047J0452J1890J3192J4090J4798J6061J8177K0110
$$ 1336969 1339753 1345020 1352450 1361497 1371949 1383839 1397031 1411121 1425919 1441980 1460157 1480267
58839A480267K0420J9269J8534J9346K0490K0071J7946J5446J3464J2140J1813
$$ 1480267 1500687 1519956 1538490 1557836 1578326 1598397 1616343 1631789 1645253 1657393 1669206
58828A669206J2825J4525J5927J7223J9242K1438K2011K0350J7810J5509J2829
$$ 1669206 1682031 1696556 1712483 1729706 1748948 1770386 1792397 1812747 1830557 1846066 1858895
58817A858895Q888M227j09m174q642j3311j7331k0680k4219k8135l1150l1766
$$ 1858895 1867783 1872010 1871901 1867727 1859085 1845774 1828443 1807763 1783544 1755409 1724259 1692493
58805A692493l0024k7626k6258k5991k5643k4562k3357k2508k1174j8502j5486
$$ 1692493 1662469 1634843 1608585 1582594 1556951 1532389 1509032 1486524 1465350 1446848 1431362
58794A431362j4140j4811j5730j5473j4548j4147j4542j5369j6309j6789j5979
$$ 1431362 1417222 1402411 1386681 1371208 1356660 1342513 1327971 1312602 1296293 1279504 1263525
58783A263525j3868j1518r662p958o267n411n775o367o345o422p447q581q427
$$ 1263525 1249657 1238139 1228477 1220519 1214252 1208841 1203066 1196699 1190354 1183932 1176485 1167904 1159477
58770A159477p083n514l634r78J318J362m77j607o45J010J719J832K349K986K960
$$ 1159477 1152394 1146880 1143246 1142268 1143586 1144948 1144471 1142864 1142219 1143229 1144948 1146780 1149129 1152115 1155075
58755A155075K653K931L496L350K519J969J901J390K5j148r59J60N26p70k727
$$ 1155075 1157728 1160659 1164155 1167505 1170024 1171993 1173894 1175284 1175309 1174161 1173202 1173362 1173888 1173118 1170391
58740A170391l556k769j667j681k748l749m192m543m988m821l606k184j765k267
$$ 1170391 1166835 1164066 1162399 1160718 1157970 1154221 1150029 1145486 1140498 1135677 1132071 1129887 1128122 1125855
58726A125855k335j089Q21K202K931L905N325N894M380J571m34q27q29j380j624
$$ 1125855 1123520 1122431 1123252 1125454 1128385 1132290 1137615 1143509 1147889 1149460 1149026 1148199 1147370 1145990 1144366
58711A144366p29K8j247m045n859n526m349l721l472l122l047l426l440k513j262
$$ 1144366 1143637 1143665 1142418 1138373 1132514 1126988 1122639 1118918 1115446 1112324 1109277 1105851 1102411 1099898 1098636
58696A098636l18N91J567J927J774K672N305P704P773O408O126P253P860P174
$$ 1098636 1098318 1098909 1100476 1102403 1104177 1106849 1112154 1119858 1127631 1134039 1140165 1147418 1155278 1162452
58682A162452O559O930P407P330P591Q858J0017R599P824O279O194P614R577J0653
$$ 1162452 1169011 1175941 1183348 1190678 1198269 1207127 1217144 1226743 1234567 1240846 1247040 1254654 1264231 1274884
58668A274884J0063Q624P787P712P346O571O674Q133R414Q884O762M308K329J374
$$ 1274884 1284947 1293571 1301358 1309070 1316416 1322987 1329661 1337794 1347208 1356092 1362854 1367162 1369491 1370865
58654A370865K058L972N363N251M804N384O305O102M936L916K826O60k058l705
$$ 1370865 1372923 1376895 1382258 1387509 1392313 1397697 1404002 1410104 1415040 1418956 1421782 1422442 1420384 1416679
58640A416679m293n736q987j2821j5870j8151j9843k0292j9196j7555j6403j5507
$$ 1416679 1412386 1406650 1397663 1384842 1368972 1350821 1330978 1310686 1291490 1273935 1257532 1242025
58628A242025j4150j2430j0949r943r399r389r675r651r094q371p485n802l268
$$ 1242025 1227875 1215445 1204496 1194553 1185154 1175765 1166090 1156439 1147345 1138974 1131489 1125687 1122419
58615A122419j035j96n60j249j675j310M37L120M950M825M174N340Q481J1320
$$ 1122419 1121384 1121188 1120628 1119379 1117704 1116394 1116831 1119951 1124901 1129726 1133900 1139240 1147721 1159041
58601A159041J2035J1117J0039R182P833N612L115J186Q1m76p02o22o17j448l126
$$ 1159041 1171076 1182193 1192232 1201414 1209247 1214859 1217974 1219160 1219241 1218765 1218063 1217441 1216824 1215376 1212250
58586A212250m177l093n23J096N49o51m55J007K014J806J238J147J379J557J771
$$ 1212250 1208073 1204980 1204457 1205553 1206102 1205451 1204996 1206003 1208017 1209823 1211061 1212208 1213587 1215144 1216915
58571A216915K101K170J726J264J638K941M045L616J844P95K245N316P288O945
$$ 1216915 1219016 1221186 1222912 1224176 1225814 1228755 1232800 1236416 1238260 1239055 1241300 1246616 1253904 1260849
58557A260849N855N781O291O108N580O150Q036J0061J1461J2286J2257J0902Q817
$$ 1260849 1266704 1272485 1278776 1284884 1290464 1296614 1304650 1314711 1326172 1338458 1350715 1361617 1370434
58544A370434P156N739L268k08k702k796j415l33k08p56j706k566k453j131N13
$$ 1370434 1377590 1383329 1386597 1386389 1383687 1380891 1379476 1379143 1378935 1378179 1376473 1373907 1371454 1370323 1370836
58529A370836J740K844L996M341L463K860M504Q282J2140J4494J5386J5411J4750
$$ 1370836 1372576 1375420 1379416 1383757 1387220 1390080 1394584 1402866 1415006 1429500 1444886 1460297 1475047
58516A475047J3502J2058J0853J0221J0468J1547J2824J3786J4752J6196J7624
$$ 1475047 1488549 1500607 1511460 1521681 1532149 1543696 1556520 1570306 1585058 1601254 1618878
58505A618878J8109J7869J8259J9949K1999K3148K3351K3504K4180K5051K5236
$$ 1618878 1636987 1654856 1673115 1693064 1715063 1738211 1761562 1785066 1809246 1834297 1859533
58494A859533K3936K1028J7287J3727J0592P293L477k81l073m573n256n999p545
$$ 1859533 1883469 1904497 1921784 1935511 1946103 1953396 1956873 1956592 1953519 1948946 1943690 1937691 1930146
58481A930146r924j2194j3275j3262j3449j4746j6622j8001j8606j8859j8888
$$ 1930146 1920222 1908028 1894753 1881491 1868042 1853296 1836674 1818673 1800067 1781208 1762320
58470A762320j8385j7186j5348j2980j0625r350r423r177o561k046J407J877P51
$$ 1762320 1743935 1726749 1711401 1698421 1687796 1678446 1669023 1659846 1653285 1651239 1652646 1654523 1655274
58457A655274N31J525K072J338K79m2L95J271K431L378L298K191J077P66J218
$$ 1655274 1655805 1657330 1659402 1660740 1661019 1660977 1661372 1662643 1665074 1668452 1671750 1673941 1675018 1675784 1677002
58442A677002K239L646M469L451J135j32P52J910J325p6m2J333J970J397J385
$$ 1677002 1679241 1682887 1687356 1690807 1691942 1691810 1692562 1694472 1695797 1695721 1695679 1697012 1698982 1700379 1701764
58427A701764K746M004M001L663M135N036N840P216R344J0465R116O836O606R066
$$ 1701764 1704510 1708514 1712515 1716178 1720313 1725349 1731189 1738405 1747749 1758214 1767330 1774166 1780772 1789838
58413A789838J2144J4077J4824J4543J2766R817P334O338N709L603j34l663m957
$$ 1789838 1801982 1816059 1830883 1845426 1858192 1868009 1875343 1881681 1887390 1890993 1890859 1887196 1882239
58400A882239l475m67K018K739K202J872K551L979N801Q036J0420J2121J2547
$$ 1882239 1878764 1878297 1880315 1883054 1885256 1887128 1889679 1893658 1899459 1907495 1917915 1930036 1942583
58387A942583J1860J0371Q143N500L153J294o69k912m459m484l668l249l258k738
$$ 1942583 1954443 1964814 1972957 1978457 1981610 1982904 1982235 1979323 1974864 1970380 1966712 1963463 1960205 1957467
58373A957467j322N65K875N858Q855J0608J1139J1954J3766J5341J5473J4832
$$ 1957467 1956145 1956710 1959585 1965443 1974298 1984906 1996045 2007999 2021765 2037106 2052579 2067411
58361B067411J4686J4899J4637J4221J4500J4875J3903J1733R968Q835O577K595
$$ 2067411 2082097 2096996 2111633 2125854 2140354 2155229 2169132 2180865 2190833 2199668 2206245 2208840
58349B208840p82j168N19J287j14k240l378l220k240q38N38J474K115K901L705
$$ 2208840 2208058 2206890 2207409 2208696 2208582 2206342 2202964 2199744 2197504 2196666 2197204 2198678 2200793 2203694 2207399
58334B207399M020L980M331N266O140O527O753P109P270O867O117N517N328N601
$$ 2207399 2211419 2215399 2219730 2224996 2231136 2237663 2244416 2251525 2258795 2265662 2271779 2277296 2282624 2288225
58320B288225O318P335Q423R412J0071J0111R701R646J0462J1682J2694J3850
$$ 2288225 2294543 2301878 2310301 2319713 2329784 2339895 2349596 2359242 2369704 2381386 2394080 2407930
58308B407930J5720J7794J9044J9609K0533K1911K2778K2911K3282K4342K5275
$$ 2407930 2423650 2441444 2460488 2480097 2500630 2522541 2545319 2568230 2591512 2615854 2641129
58297B641129K5442K5210K4957K4562K4445K5388K6603K5742K2005J7782J5833
$$ 2641129 2666571 2691781 2716738 2741300 2765745 2791133 2817736 2843478 2865483 2883265 2899098
58286B899098J6119J6949J7859J9476K1444K2630K3027K3620K4637K5571K6683
$$ 2899098 2915217 2932166 2950025 2969501 2990945 3013575 3036602 3060222 3084859 3110430 3137113
58275C137113K8753L1309L2937L3503L4423L6232L7473L6917L5618L5730L7893
$$ 3137113 3165866 3197175 3230112 3263615 3298038 3334270 3371743 3408660 3444278 3480008 3517901
58264C517901M0676M2219M1802M0032L8083L6723L5817L4712L3137L1752L1812
$$ 3517901 3558577 3600796 3642598 3682630 3720713 3757436 3793253 3827965 3861102 3892854 3924666
58253C924666L4082L7796M0893M1983M1983M2848M4723M5689M4906M4348M6212
$$ 3924666 3958748 3996544 4037437 4079420 4121403 4164251 4208974 4254663 4299569 4343917 4390129
58242D390129M9874N3035N4844N6145N7311N7939N8525O0400O3679O6847O8704
$$ 4390129 4440003 4493038 4547882 4604027 4661338 4719277 4777802 4838202 4901881 4968728 5037432
58231E037432O9419O9512O9338O9898P2555P7147Q1658Q4488Q6078Q7701Q9709
$$ 5037432 5106851 5176363 5245701 5315599 5388154 5465301 5546959 5631447 5717525 5805226 5894935
58220E894935R1887R4572R8272J02572J06324J09035J11558J15324J20942J27557
$$ 5894935 5986822 6081394 6179666 6282238 6388562 6497597 6609155 6724479 6845421 6972978
58210F972978J33741J39039J44163J49530J54468J58543J62771J68414J75144
$$ 6972978 7106719 7245758 7389921 7539451 7693919 7852462 8015233 8183647 8358791
58201H358791J81723J87982J94712K01896K08767K15571K23668K33493K43889
$$ 8358791 8540514 8728496 8923208 9125104 9333871 9549442 9773110 10006603 10250492
58192A0250492K53894K63952K74938K87155L00781L16252L33672L52787L73872
$$ 10250492 10504386 10768338 11043276 11330431 11631212 11947464 12281136 12633923 13007795
58183A3007795L97799M24850M54226M84888N16271N48241N81446O17550O57962
$$ 13007795 13405594 13830444 14284670 14769558 15285829 15834070 16415516 17033066 17691028
58174A7691028P02259P48813P96702Q45794Q95361R44294R92860J042892J096302
$$ 17691028 18393287 19142100 19938802 20784596 21679957 22624251 23617111 24660003 25756305
58165B5756305J154846J220941J296667J381763J474382J573857J681001J795876
$$ 25756305 26911151 28132092 29428759 30810522 32284904 33858761 35539762 37335638
58157C7335638J917714K047435K187967K341332K507375K685939K878753L089271
$$ 37335638 39253352 41300787 43488754 45830086 48337461 51023400 53902153 56991424
58149E6991424L322992L588317L894744M249626M658379N127967N668697O293841
$$ 56991424 60314416 63902733 67797477 72047103 76705482 81833449 87502146 93795987
58141I3795987P019558P861614Q825704R900675J1065633J2301766J3590541J4903503
$$ 93795987 100815545 108677159 117502863 127403538 138469171 150770937 164361478 179264981
58133A79264981J6208276J7493017J8781431K0119890K1539662K2983415K4182311
$$ 179264981 195473257 212966274 231747705 251867595 273407257 296390672 320572983
58126C20572983K4551529K3263844J9587237J3330018N076420l976165j2467740
$$ 320572983 345124512 368388356 387975593 401305611 406382031 402405866 389938126
58119C89938126j9329826k4029760k6568058k7308778k6755613k5374680k3517750
$$ 389938126 370608300 346578540 320010482 292701704 265946091 240571411 217053661
58112B17053661k1429671j9282635j7198212j5256317j3501948j1951338j0597970
$$ 217053661 195623990 176341355 159143143 143886826 130384878 118433540 107835570
58105A07835570r422227q402547p519866o754877o086632n496059m968825m494387
$$ 107835570 98413343 90010796 82490930 75736053 69649421 64153362 59184537 54690150
58097E4690150m065117l677040l328451l016340k735736k482893k256622k055696
$$ 54690150 50625033 46947993 43619542 40603202 37867466 35384573 33127951 31072255
58089C1072255j877251j718876j580051j460041j356024j264686j184186j113052
$$ 31072255 29195004 27476128 25896077 24436036 23080012 21815326 20631140 19518088
58081A9518088j048368r86848r27171q69885q15383p63261p13618o67518o25600
$$ 19518088 18469720 17482872 16555701 15685816 14870433 14107172 13393554 12726036 12100436
58072A2100436n86924n50034n14842m82612m53896m27354m01455l76662l54704
$$ 12100436 11513512 10963478 10448636 9966024 9512128 9084774 8683319 8306657 7951953
58063G951953l35757l17850k99419k81091k64283k49322k35754k23243k11060
$$ 7951953 7616196 7298346 6998927 6717836 6453553 6204231 5968477 5745234 5534174
58054E534174j97965j83887j70777j60327j51728j43214j34805j27691j21589
$$ 5534174 5336209 5152322 4981545 4821218 4669490 4526276 4391471 4263780 4142191
58045D142191j14895j07372j00594r5385r0537q4719p8217p2250o7635o4522o2493
$$ 4142191 4027296 3919924 3819330 3723945 3633408 3548689 3470472 3398222 3330587 3266065 3203572
58034C203572o0498n7678n4552n2511n1872n1418n0020m7751m5038m1799l8102
$$ 3203572 3143074 3085396 3030844 2978333 2926461 2875043 2825023 2777272 2732234 2690435 2652333
58023B652333l4822l2985l2675l2934l2512l0773k8323k6585k6234k6203k4913
$$ 2652333 2617511 2584526 2551851 2518917 2486405 2455632 2427309 2400724 2374490 2348287 2323374
58012B323374k2232j9452j7693j7248j8174k0235k2190k2372k0306j6993j3646
$$ 2323374 2301142 2281690 2263997 2246749 2228575 2208340 2186150 2163778 2143472 2126479 2112833
58001B112833j1050r908j0442j1570j1818j1210j0966j1309j1093r888q671p894
$$ 2112833 2101783 2091875 2081433 2069863 2058045 2046835 2035869 2024560 2013467 2003579 1994908 1987014
57989A987014o774n320n118o724q075p348n939o384q325r088p923o995p691q346
$$ 1987014 1980240 1974920 1969802 1963078 1955003 1947655 1941716 1935332 1927007 1917919 1909996 1903001 1895310 1886964
57975A886964o975m505l567m906o684p189o815o946p929q847q838p866o373m877
$$ 1886964 1879989 1875484 1871917 1867011 1860327 1853138 1846323 1839377 1831448 1822601 1813763 1805897 1799524 1794647
57961A794647l995m128m787m805l738k450j722r62N88J876Q76k403n271n382l269
$$ 1794647 1790652 1786524 1781737 1776932 1773194 1770744 1769022 1768060 1768648 1770524 1771400 1768997 1763726 1758344 1755075
57946A755075j072J61Q46J400J752K010K466L013L365L744M501N180M845L346
$$ 1755075 1754003 1754164 1755010 1756410 1758162 1760172 1762638 1765651 1769016 1772760 1777261 1782441 1787286 1790632
57932A790632J533J40p53j047l08J475L384M442M624M613M756M708M118L311L043
$$ 1790632 1792165 1792305 1791552 1790505 1790197 1791672 1795056 1799498 1804122 1808735 1813491 1818199 1822317 1825628 1828671
57917A828671L695M806N539N458M762L856L054K669L034M135N500O562P003O648
$$ 1828671 1832366 1837172 1842711 1848169 1852931 1856787 1859841 1862510 1865544 1869679 1875179 1881741 1888744 1895392
57903A895392N472L912K777K541K878L165L084K569J631O43L43J032K059K639
$$ 1895392 1900864 1904776 1907553 1910094 1912972 1916137 1919221 1921790 1923421 1924064 1924407 1925439 1927498 1930137
57889A930137K874L316L841L772L107K823L649N124O213O481O349O423O890P444
$$ 1930137 1933011 1936327 1940168 1943940 1947047 1949870 1953519 1958643 1964856 1971337 1977686 1984109 1990999 1998443
57875A998443P602P141O377O022O760Q720J1121J2400J1207P755M012K063K202
$$ 1998443 2006045 2013186 2019563 2025585 2032345 2041065 2052186 2064586 2075793 2083548 2087560 2089623 2091825
57862B091825K863K331L19j977k944j765Q88L187L541K017K32k71M70J075M46
$$ 2091825 2094688 2097019 2097338 2095361 2092417 2090652 2091540 2094727 2098268 2100285 2100517 2100246 2100716 2101791 2102237
57847B102237r70j617m78J824L650L877K669J018m5P5J212K410K718K140J461
$$ 2102237 2101267 2099650 2099172 2100996 2104646 2108523 2111192 2112210 2112165 2112240 2113452 2115862 2118580 2120720 2122181
57832B122181J155J169J657K958M514M946L868K625K378K477J869J178J831L674
$$ 2122181 2123336 2124505 2126162 2129120 2133634 2138580 2142448 2145073 2147451 2149928 2151797 2152975 2154806 2158480
57818B158480N115N411N233N013M411L623L526M094M225L749M042N757P392P309
$$ 2158480 2163595 2169006 2174239 2179252 2183663 2187286 2190812 2194906 2199131 2202880 2206922 2212679 2220071 2227380
57804B227380N994N085N114N585O514Q321J0527J1984J2330J2244J2313J2534
$$ 2227380 2233374 2238459 2243573 2249158 2255672 2263993 2274520 2286504 2298834 2311078 2323391 2335925
57792B335925J2772J2814J2190J0845R790J0072J1166J1493J0625R912J0540J1849
$$ 2335925 2348697 2361511 2373701 2384546 2394336 2404408 2415574 2427067 2437692 2447604 2458144 2469993
57780B469993J2093J0368P426M875L933M698O356P983Q957Q821P434N627M901
$$ 2469993 2482086 2492454 2499880 2504755 2508688 2513386 2519742 2527725 2536682 2545503 2552937 2558564 2563465
57767B563465N843P421Q529R350J0297J0602R538Q314Q807J0602J1336J0073Q314
$$ 2563465 2569308 2576729 2585258 2594608 2604905 2615507 2625045 2633359 2642166 2652768 2664104 2674177 2682491
57754B682491P219O041M319L405M195N092M153K134J329K147K919K834L020M455
$$ 2682491 2689710 2695751 2700070 2703475 2707670 2712762 2716915 2719049 2720378 2722525 2725444 2728278 2731298 2735753
57740B735753O437P695P948P854Q157R070J0014R992Q862P923Q447R934J0818
$$ 2735753 2742190 2749885 2757833 2765687 2773844 2782914 2792928 2802920 2811782 2819705 2828152 2838086 2848904
57727B848904J0560R922R436R083R380J1152J3769J5172J4307J2441J1372J1478
$$ 2848904 2859464 2869386 2878822 2887905 2897285 2908437 2922206 2937378 2951685 2964126 2975498 2986976
57715B986976J2190J3199J4124J4057J2530J0439R019Q432Q092P764P387O593
$$ 2986976 2999166 3012365 3026489 3040546 3053076 3063515 3072534 3080966 3089058 3096822 3104209 3110802
57703C110802N429M993O131P855Q399P616P031P439P913P577P125P780R496J1055
$$ 3110802 3116231 3121224 3127355 3135210 3143609 3151225 3158256 3165695 3173608 3181185 3188310 3196090 3205586 3216641
57689C216641J1623J1560J1761J2503J2999J2231J0361R051R747J1788J3024J2374
$$ 3216641 3228264 3239824 3251585 3264088 3277087 3289318 3299679 3308730 3318477 3330265 3343289 3355663
57677C355663J0968J0441J1020J1829J2363J2766J3143J3453J3870J4477J4625
$$ 3355663 3366631 3377072 3388092 3399921 3412284 3425050 3438193 3451646 3465516 3479993 3494618
57666C494618J3533J1597J0345J0711J1981J2942J3506J4504J6142J7564J8052
$$ 3494618 3508151 3519748 3530093 3540804 3552785 3565727 3579233 3593737 3609879 3627443 3645495
57655C645495J7943J7952J8068J7798J7165J6720J6495J5647J3720J1751J1458
$$ 3645495 3663438 3681390 3699458 3717256 3734421 3751141 3767636 3783283 3797003 3808754 3820212
57644C820212J3245J5605J6700J6203J5272J4985J5343J5831J6405J7366J8513
$$ 3820212 3833457 3849062 3865762 3881965 3897237 3912222 3927565 3943396 3959801 3977167 3995680
57633C995680J9000J8276J6790J5471J4843J5000J6041J7862J9559J9888J8659
$$ 3995680 4014680 4032956 4049746 4065217 4080060 4095060 4111101 4128963 4148522 4168410 4187069
57622D187069J7182J6950J8202K0049K1704K3146K4914K7599L1386L5674L9277
$$ 4187069 4204251 4221201 4239403 4259452 4281156 4304302 4329216 4356815 4388201 4423875 4463152
57611D463152M1296M1814M1718M2068M3530M5529M5640M0783L0168J6791N024
$$ 4463152 4504448 4546262 4587980 4630048 4673578 4719107 4764747 4805530 4835698 4852489 4857513
57600D857513l157q711j2794j4929j4379j1878r067o829m921k776k2L379O773
$$ 4857513 4854356 4845645 4832851 4817922 4803543 4791665 4782598 4775769 4770848 4768072 4768050 4771429 4778202
57587D778202Q964R426R089R391J0803J2849J5100J7278J8685J8674J7794J7508
$$ 4778202 4787166 4796592 4805681 4815072 4825875 4838724 4853824 4871102 4889787 4908461 4926255 4943763
57575D943763J8344J9208J8907J7726J6925J7237J8372J9624K0321K0040J9001
$$ 4943763 4962107 4981315 5000222 5017948 5034873 5052110 5070482 5090106 5110427 5130467 5149468
57564E149468J8136J8241J9152K0114K0695K0862K0466J9387J8125J7533J7837
$$ 5149468 5167604 5185845 5204997 5225111 5245806 5266668 5287134 5306521 5324646 5342179 5360016
57553E360016J8517J9183J9936K0724K1126K1072K1097K1507K1809K1445K0552
$$ 5360016 5378533 5397716 5417652 5438376 5459502 5480574 5501671 5523178 5544987 5566432 5586984
57542E586984J9655J9100J9143J9895K0786K0894K0337K0409K1486K2024K0866
$$ 5586984 5606639 5625739 5644882 5664777 5685563 5706457 5726794 5747203 5768689 5790713 5811579
57531E811579J9424J9728K1062K0917J9114J8403K0308K2849K3639K3221K3499
$$ 5811579 5831003 5850731 5871793 5892710 5911824 5930227 5950535 5973384 5997023 6020244 6043743
57520F043743K4463K4541K3345K2139K1947K2706K3941K4980K4946K3920K3514
$$ 6043743 6068206 6092747 6116092 6138231 6160178 6182884 6206825 6231805 6256751 6280671 6304185
57509F304185K4847K6504K6264K4503K3826K5299K7117K7518K7042K6943K7023
$$ 6304185 6329032 6355536 6381800 6406303 6430129 6455428 6482545 6510063 6537105 6564048 6591071
57498F591071K6330K4972K4142K4817K7026K9765L1212K9961K6595K3405K2127
$$ 6591071 6617401 6642373 6666515 6691332 6718358 6748123 6779335 6809296 6835891 6859296 6881423
57487F881423K2734K4466K6735K8607K8941K7926K7265K7904K8820K9008K9233
$$ 6881423 6904157 6928623 6955358 6983965 7012906 7040832 7068097 7096001 7124821 7153829 7183062
57476G183062L0423L1545L0886K8719K6959K6592K7040K7655K8336K8748K8576
$$ 7183062 7213485 7245030 7275916 7304635 7331594 7358186 7385226 7412881 7441217 7469965 7498541
57465G498541K8368K8828K9373K8914K7832K7585K8267K8452K7701K7392K8335
$$ 7498541 7526909 7555737 7585110 7614024 7641856 7669441 7697708 7726160 7753861 7781253 7809588
57454G809588K9337K9091K8081K7459K7253K7046K7336K8774L0570L1096K9945
$$ 7809588 7838925 7868016 7896097 7923556 7950809 7977855 8005191 8033965 8064535 8095631 8125576
57443H125576K8351K7533K7505K7523K7061K6383K6382K7675K9540L0327K9358
$$ 8125576 8153927 8181460 8208965 8236488 8263549 8289932 8316314 8343989 8373529 8403856 8433214
57432H433214K7757K6809K6272K5290K4230K4286K5506K6644K7079K7447K8115
$$ 8433214 8460971 8487780 8514052 8539342 8563572 8587858 8613364 8640008 8667087 8694534 8722649
57421H722649K8304K7542K6873K7539K9091K9880K9269K8362K8483K9674L0906
$$ 8722649 8750953 8778495 8805368 8832907 8861998 8891878 8921147 8949509 8977992 9007666 9038572
57410I038572L1266L0637K9527K8581K8197K8431K9053K9627K9553K8513K7071
$$ 9038572 9069838 9100475 9130002 9158583 9186780 9215211 9244264 9273891 9303444 9331957 9359028
57399I359028K6521K7605K9464L0401K9661K7988K6420K5223K4366K4275K5383
$$ 9359028 9385549 9413154 9442618 9473019 9502680 9530668 9557088 9582311 9606677 9630952 9656335
57388I656335K7216K8648K9011K8407K7210K5945K5410K5969K6684K6173K4573
$$ 9656335 9683551 9712199 9741210 9769617 9796827 9822772 9848182 9874151 9900835 9927008 9951581
57377I951581K3579K4114K5089K5226K4912K5036K5021K3758K1989K1805K3632
$$ 9951581 9975160 9999274 10024363 10049589 10074501 10099537 10124558 10148316 10170305 10192110 10215742
57366A0215742K5375K5188K3634K2381K2048K2268K2758K3191K2814K1336J9670
$$ 10215742 10241117 10266305 10289939 10312320 10334368 10356636 10379394 10402585 10425399 10446735 10466405
57355A0466405J8819J8640J8620J9179K0854K2714K3156K2212K1577K2126K2801
$$ 10466405 10485224 10503864 10522484 10541663 10562517 10585231 10608387 10630599 10652176 10674302 10697103
57344A0697103K2409K1263K0381K0150K0411K1025K1560K1272K0251J9805K0739
$$ 10697103 10719512 10740775 10761156 10781306 10801717 10822742 10844302 10865574 10885825 10905630 10926369
57333A0926369K1857K1368J9444J8118J8665K0155K1000K0925K0773K0991K0989
$$ 10926369 10948226 10969594 10989038 11007156 11025821 11045976 11066976 11087901 11108674 11129665 11150654
57322A1150654J9983J8065J6334J5950J6988J8299J8609J7618J5951J4399J3552
$$ 11150654 11170637 11188702 11205036 11220986 11237974 11256273 11274882 11292500 11308451 11322850 11336402
57311A1336402J3730J4568J4823J3471J1081R384R261R864J0049R910J0250J1117
$$ 11336402 11350132 11364700 11379523 11392994 11404075 11413459 11422720 11432584 11442633 11452543 11462793 11473910
57299A1473910J1717J1483J0498R016P309O094O253P675Q900Q517O797N366N212
$$ 11473910 11485627 11497110 11507608 11516624 11523933 11530027 11536280 11543955 11552855 11561372 11568169 11573535 11578747
57286A1578747N579N165L969L184L304L289K111M57n3J036K721M226N737P238
$$ 11578747 11584326 11589491 11593460 11596644 11599948 11603237 11605348 11605805 11605752 11606788 11609509 11613735 11619472 11626710
57272A1626710P872P283O547O770P463P494P043P334Q555R428R000P789O790O402
$$ 11626710 11634582 11641865 11648412 11655182 11662645 11670139 11677182 11684516 11693071 11702499 11711499 11719288 11726078 11732480
57258A1732480O633P379P922P039M466J643K69M51J012J225J411J931K494K703
$$ 11732480 11739113 11746492 11754414 11761453 11765919 11767562 11767831 11768282 11769294 11770519 11771930 11773861 11776355 11779058
57244A1779058K731L009L515L751L405K755K215J656N17j330l160m166m322m098
$$ 11779058 11781789 11784798 11788313 11792064 11795469 11798224 11800439 11802095 11802612 11801282 11798122 11793956 11789634 11785536
57230A1785536l659k923k191j945j964j454k08J045J691J846J664R52j6j44J086
$$ 11785536 11781877 11778954 11776763 11774818 11772854 11771400 11771192 11772237 11773928 11775774 11777438 11778390 11778374 11778230 11779316
57215A1779316K516K481Q97p89j595k124l658o763j0933j4993j7737j8685j8565
$$ 11779316 11781832 11784313 11785210 11784421 11782826 11780702 11777044 11770281 11759348 11744355 11726618 11707933 11689368
57202A1689368j8790k0122k1946k2909k2400k1283k1062k2222k3626k3884k2909
$$ 11689368 11670578 11650456 11628510 11605601 11583201 11561918 11540856 11518634 11495008 11471124 11448215
57191A1448215k1561j9973j7261j3093q453m305l63M115R019J3704J7973K2044
$$ 11448215 11426654 11406681 11389420 11376327 11367874 11363569 11363206 11367321 11376340 11390044 11408017 11430061
57179A1430061K5988K9973L4401L9009M2479M3952M4337M4993M5749M5526M4426
$$ 11430061 11456049 11486022 11520423 11559432 11601911 11645863 11690200 11735193 11780942 11826468 11870894
57168A1870894M3623M3239M2076L9664L7093L5367L4297L3439L2838L2258L0880
$$ 11870894 11914517 11957756 11999832 12039496 12076589 12111956 12146253 12179692 12212530 12244788 12275668
57157A2275668K8509K6025K3923K1505J8315J5253J3241J1618R039N356J513j909
$$ 12275668 12304177 12330202 12354125 12375630 12393945 12409198 12422439 12434057 12443096 12448452 12449965 12448056
57145A2448056n095q264j1569j5361j9679k3802k7257l0869l5751m1516m6652
$$ 12448056 12442961 12434697 12423128 12407767 12388088 12364286 12337029 12306160 12270409 12228893 12182241
57134A2182241n0622n4304n8193o1559o3967o6551p0777p6554q2436q7409r1766
$$ 12182241 12131619 12077315 12019122 11957563 11893596 11827045 11756268 11679714 11597278 11509869 11418103
57123A1418103r6327j01559j07482j13893j20433j26723j32578j37872j42241
$$ 11418103 11321776 11220217 11112735 10998842 10878409 10751686 10619108 10481236 10338995
57114A0338995j45323j47348j48903j49816j48821j44965j38936j32091j24385
$$ 10338995 10193672 10046324 9897421 9747605 9598784 9453819 9314883 9182792 9058407
57105I058407j14413j01778q8266p5819o4323n2465m0294k9649k2239j8502j8437
$$ 9058407 8943994 8842216 8753950 8678131 8613808 8561343 8521049 8491400 8469161 8450659 8432222
57094H432222k2373l0502m2371n7195p3911r0710j05333j16296j23211j25678
$$ 8432222 8409849 8379347 8336976 8279781 8205870 8115160 8009827 7893531 7770320 7644642
57084G644642j22876j14963j04206r3956q6715q3490q4293q8385r4311j00466
$$ 7644642 7521766 7406803 7302597 7208641 7121926 7038436 6954143 6865758 6771447 6670981
57074F670981j05771j09631j11690j12083j11683j11605j12563j15067j19980
$$ 6670981 6565210 6455579 6343889 6231806 6120123 6008518 5895955 5780888 5660908
57065E660908j28355j40626j56223j74016j93076k13205k34847k58519k84303
$$ 5660908 5532553 5391927 5235704 5061688 4868612 4655407 4420560 4162041 3877738
57056C877738l11978l41364l72385m05106m40138m78825n22576D32884a97294
$$ 3877738 3565760 3224396 2852011 2446905 2006767 1527942 1005366 432884 -197294
57046h95916p81041q79748r97046j137104j305386j505739j738528k001243k290097
$$ -895916 -1676957 -2556705 -3553751 -4690855 -5996241 -7501980 -9240508 -11241751 -13531848
57037a3531848k602227k939175l309309l725593m199898m738423n340359n999502
$$ -13531848 -16134075 -19073250 -22382559 -26108152 -30308050 -35046473 -40386832 -46386334
57029d6386334o708560p459482q225323q924645r405310r488645r057312q111809
$$ -46386334 -53094894 -60554376 -68779699 -77704344 -87109654 -96598299 -105655611 -113767420
57021a13767420o747276n091457l278846j467883J63669J480621K456642L170897
$$ -113767420 -120514696 -125606153 -128884999 -130352882 -130189213 -128708592 -126251950 -123081053
57013a23081053L735257M223214M656094N034503N367179N670790N951585O193622
$$ -123081053 -119345796 -115122582 -110466488 -105431985 -100064806 -94394016 -88442431 -82248809
57005h2248809O365285O436599O392065O232193N969062N622856N219025M783186
$$ -82248809 -75883524 -69446925 -63054860 -56822667 -50853605 -45230749 -40011724 -35228538
56997c5228538M336254L894033L469698L074045K713470K389609K101426J846682
$$ -35228538 -30892284 -26998251 -23528553 -20454508 -17741038 -15351429 -13250003 -11403321
56989a1403321J622050J424063J250714J100981R72606Q61650P64738O80568O08596
$$ -11403321 -9781271 -8357208 -7106494 -6005513 -5032907 -4171257 -3406519 -2725951 -2117355
56980b117355N47113M93338M44822b31885A26868L20020K83869K51109K23231
$$ -2117355 -1570242 -1076904 -632082 -231885 126868 446888 730757 981866 1205097
56971A205097K00807J81796J62091J38212J09121P5656L9741M828k4555m5613
$$ 1205097 1405904 1587700 1749791 1888003 1997124 2072780 2112521 2117349 2092794 2047181
56961B047181n9298o8407p4355p7110p7429p6983p6453p5329p3749p2771p2433
$$ 2047181 1987883 1919476 1845121 1768011 1690582 1613599 1537146 1461817 1388068 1315297 1242864
56950A242864p1306o8623o5440o2973o1077n9154n7262n5446n2976m9319m5075
$$ 1242864 1171558 1102935 1037495 974522 913445 854291 797029 741583 688607 639288 594213
56939E94213m1109l7494l4129l1604l0361k9570k7939k5222k2109j8959j5768
$$ 594213 553104 515610 481481 449877 419516 389946 362007 336785 314676 295717 279949
56928B79949j3037j1620j1401j1002r094n649j884P04J216k12k686n332p686r221
$$ 279949 266912 255292 243891 232889 223795 218146 216262 216966 218182 217970 215284 209952 202266 193045
56914A93045r110o992l740q50R09J854K638L726N469P904J0272J1375J0826R640
$$ 193045 183935 176943 173203 172353 173262 175116 177754 181480 186949 194853 205125 216500 227326 236966
56900B36966R242J0038J1233J1908J1985J2025J2228J1855R819N819P93l751o617
$$ 236966 246208 256246 267479 279387 291372 303397 315625 327480 337299 343118 343911 340160 333543
56887C33543p349o417n228n247o433o889m860r10K710M876O657R178J1536J2023
$$ 333543 326194 319777 314549 309302 302869 295980 291120 290210 292920 297796 304453 313631 325167 337190
56873C37190J0806J0131J1472J3629J4146J1979Q062L769k89l928o814q671r726
$$ 337190 347996 358127 369599 383228 397374 409353 417415 421184 420895 416967 410153 401482 391756
56860C91756j0504j1268j1863j1871j0815q536n671l575l185l919m187l100j389
$$ 391756 381252 369984 358121 346250 335435 326899 321228 317653 314468 310549 306362 303262 301873
56847C01873l92m80q32n52M68J864L460N262O991Q096Q309P894P302O842O802
$$ 301873 301481 301001 300169 299617 300085 301949 305409 310671 317662 325758 334067 341961 349263 356105 362907
56832C62907P496Q783R862J0051R632R385R392R013Q151P528P290O205L253n92
$$ 362907 370403 379186 389048 399099 408731 418116 427508 436521 444672 452200 459490 465695 468948 468356
56818D68356l340m555n645p454q796q094n496k418L27K940N501P669R563J1974
$$ 468356 465016 460461 454816 447362 438566 430472 424976 422558 422885 425825 431326 438995 448558 460532
56804D60532J5200J8410K0560K1466K1483K0697J9044J6878J4594J1866P925K830
$$ 460532 475732 494142 514702 536168 557651 578348 597392 614270 628864 640730 648655 651485
56792F51485k303o523r873j2541j3821j2744r518n612k349J57K739O229J0747
$$ 651485 649182 642659 632786 620245 606424 593680 584162 578550 576201 576358 579097 585326 596073
56779E96073J5410J8882K0805K2566K5756K9793L2117L1071K7637K3645J9311
$$ 596073 611483 630365 651170 673736 699492 729285 761402 792473 820110 843755 863066
56768H63066J3509N668l669j3646k2997k9615l1834l0352k7542k4570k0542j4928
$$ 863066 876575 882243 878574 864928 841931 812316 780482 750130 722588 698018 677476 662548
56756F62548r215n037j917J795O367J0505J3356J5350J7116J8608J9397J8909
$$ 662548 653333 648296 646379 648174 654541 665046 678402 693752 710868 729476 748873 767782
56744G67782J6349J1285M458k813j0089j7628k4661k9099k9682k7536k4854k2781
$$ 767782 784131 795416 799874 797061 786972 769344 744683 715584 685902 658366 633512 610731
56732F10731k1278k0131j8936j6622j2354o863j903J589L866N129N230M781N076
$$ 610731 589453 569322 550386 533764 521410 514547 512644 514233 518099 523228 528458 533239 538315
56719E38315O170O234L780l70m417q010j1968j6056j8679j9120j8674j8938j9831
$$ 538315 544485 550719 554499 554129 549712 541702 529734 513678 494999 475879 457205 438267 418436
56706D18436j9974j8512j5926j3398j1735j0768r629p843o031n085m819m331l639
$$ 418436 398462 379950 364024 350626 338891 328123 318494 310651 304620 299535 294716 290385 286746
56693B86746l782m896n389l965j582k83p23j949l067l806l775k695j499j720l279
$$ 286746 282964 278068 272679 268714 267132 266849 266126 264177 261110 257304 253529 250834 249335 247615 244336
56678B44336m163l022j005j80r57k113k784l141l240k487o62J296K199J943J483
$$ 244336 240173 237151 236146 235966 235009 232896 230112 226971 223731 221244 220582 221878 224077 226020 227503
56663B27503J450J397N74q67j912j954j485j231j035l28N73N29p04j677r32R60
$$ 227503 228953 230350 230924 230057 228145 226191 224706 223475 222440 222112 222685 223214 222510 220833 219901 220861
56647B20861J905R15o03n40J380L392L762K430N09j076j898j569m0J683K151J241
$$ 220861 222766 223681 223078 222538 223918 227310 231072 233502 234011 232935 231037 229468 229428 231111 233262 234503
56631B34503M34Q13J685J968K052K942M112L896K001O6n81l35QN07J092P68q66
$$ 234503 234937 235750 237435 239403 241455 244397 248509 252405 254406 254472 253891 253556 253564 254071 255163 255931 255065
56614B55065k334j999n15j3j156k488k681k004j243n19K32O56M63l1l89m40J17
$$ 255065 252731 250732 250217 250204 249048 246560 243879 241875 240632 240113 240345 241001 241464 241433 241044 240604 240721
56597B40721J673L770M902M071K046N24L10R48J677K066J952J459R90P33L78j89
$$ 240721 242394 246164 251066 255137 257183 257707 258017 258965 260642 262708 264660 266119 267109 267842 268220 268031
56581B68031l32N47J949K836K966K763K129O38j073j521m70N85O36N58J302K045
$$ 268031 267699 268246 270195 273031 275997 278760 280889 281527 280454 278933 278463 279048 279684 280242 281544 283589
56565B83589J591O08O66J699K292K162K273K523J597m22j435m10R32P62k87p84
$$ 283589 285180 285788 286454 288153 290445 292607 294880 297403 299000 298578 297143 296733 297665 298427 298140 297356
56549B97356j059k088l084k569j011j58j38M07J504J652N40k90j93n16k068l548
$$ 297356 296297 294209 291125 288556 287545 287387 287249 287656 289160 290812 291352 291062 290869 290353 288285 284737
56533B84737l608k646j314Q52L764N357L906P20j394j593j126p45r2N71J32j441
$$ 284737 281129 278483 277169 278021 281785 287142 291048 291768 290374 288781 287655 286910 286818 287389 287521 286080
56517B86080k565k056n80N13Q26R62J546K611L516L488K580J908K302L148L405
$$ 286080 283515 281459 280879 281392 282218 283180 284726 287337 290853 294341 296921 298829 301131 304279 307684
56502C07684L328M079N721O956O924O181N497M835L908K889K078J543J460J980
$$ 307684 311012 315091 320812 327768 334692 340873 346370 351205 355113 358002 360080 361623 363083 365063
56488C65063K479J864J69j114r43k40o94k560m485n184m510l135j872j304j501
$$ 365063 367542 369406 369575 368461 367518 367278 366584 364024 359539 354355 349845 346710 344838 343534 342033
56473C42033j927j890j212l73j17q53k160k827j900J88J910K277J678R00L4j077
$$ 342033 340106 338216 337004 336631 336514 335661 333501 330674 328774 328962 330872 333149 334827 335727 335761 334684
56457C34684j919j760q87m46q62j150k61J300J896P36j122k005j520p61p23j116
$$ 334684 332765 331005 330118 329672 328810 327660 327399 328699 330595 331331 330209 328204 326684 325923 325200 324084
56441C24084r90p5J001J603J579J004p1j361k264k311j587o11J68P93J655K864
$$ 324084 323094 323019 324020 325623 327202 328206 328135 326774 324510 322199 320612 320001 320169 320962 322617 325481
56425C25481L757L481K155R99R05J411J562J269J110J188J086P62O41P66O49P1
$$ 325481 329238 332719 334874 335873 336778 338189 339751 341020 342130 343318 344404 345166 345807 346573 347222 347293
56409C47293n66p33j70J020K129K178J225Q34K029L381K688L65r06j33N27p91
$$ 347293 346727 345994 345824 346844 348973 351151 352376 353210 355239 358620 361308 361673 360767 360634 361161 360370
56393C60370k791l074j534J14J069J758K196J994J735K425L537L372J675K76M42
$$ 360370 357579 354505 352971 353085 354154 355912 358108 360102 361837 364262 367799 371171 372846 373122 373564
56378C73564J118P36l51n64M34J321J153O46R85K029K566K067J370J407J929K059
$$ 373564 374682 375418 375067 374503 374937 376258 377411 378057 379042 381071 383637 385704 387074 388481 390410 392469
56362C92469J581R67L86l49r90r15j17Q29J853L343M803M814K981P17o75j441
$$ 392469 394050 395017 395403 395054 394064 393149 393032 393861 395714 399057 403860 408674 411655 412372 411697 410256
56346D10256k032j806m20P35K89q05p06L14N71K91J507M253N558L545L67o87N48
$$ 410256 408224 406418 405998 406733 407022 406217 405511 405825 406396 406687 408194 412447 418005 421550 421917 421230 421778
56329D21778J687J592J420K114K836K390Q79o27j225n70J186L279M606M633L860
$$ 421778 423465 425057 426477 428591 431427 433817 434696 434069 432844 432274 433460 436739 441345 445978 449838
56314D49838L095K463J529K96l92L63K432M645N685N051L302J731J507K634L677
$$ 449838 452933 455396 456925 457221 456829 457192 459624 464269 469954 475005 478307 480038 481545 484179 487856
56299D87856L105J120m09j41J247K190K191J823J377O49n1J11J191K100K029J544
$$ 487856 490961 492081 491672 491531 492778 494968 497159 498982 500359 501008 500957 501068 502259 504359 506388 507932
56283E07932J676K471L099L112K990L384M272M971M904M225L623L535L721L839
$$ 507932 509608 512079 515178 518290 521280 524664 528936 533907 538811 543036 546659 550194 553915 557754
56269E57754M104M904N838N817M361K466J681K433L623L923L294K905L543M486
$$ 557754 561858 566762 572600 578417 582778 585244 586925 589358 592981 596904 600198 603103 606646 611132
56255F11132M314K677P29k02K77J805L790N359N611M660L856M309N597O523O668
$$ 611132 615446 618123 618852 618650 618927 620732 624522 629881 635492 640152 644008 648317 653914 660437 667105
56240F67105O470O339O501P315Q738R724R144P174N058L746L534M562O611Q678
$$ 667105 673575 679914 686415 693730 702468 712192 721336 728510 733568 737314 740848 745410 752021 760699
56226G60699R854J0423J1117J1685J1482J1089J1842J3803J5721J6959J7778J7807
$$ 760699 770553 780976 792093 803778 815260 826349 838191 851994 867715 884674 902452 920259
56214I20259J6338J4512J5029J8688K3080K5873K7583K9639L1524L1875L1279
$$ 920259 936597 951109 966138 984826 1007906 1033779 1061362 1091001 1122525 1154400 1185679
56203A185679L1733L3880L6676L9465M2649M6300M9856N3424N7936O3578O9213
$$ 1185679 1217412 1251292 1287968 1327433 1370082 1416382 1466238 1519662 1577598 1641176 1710389
56192A710389P3835P7800Q2082Q6953R1813R5960R9251J02235J05549J08878J10630
$$ 1710389 1784224 1862024 1944106 2031059 2122872 2218832 2318083 2420318 2525867 2634745 2745375
56181B745375J09054J03711R5589Q5961P5430O3801N0483L5167J8450J602j4410
$$ 2745375 2854429 2958140 3053729 3139690 3215120 3278921 3329404 3364571 3383021 3384623 3370213
56170C370213k9361m3196n5637o6700p6814q5891r2986r7518j00165j01770j01978
$$ 3370213 3340852 3297656 3242019 3175319 3098505 3012614 2919628 2822110 2721945 2620175 2518197
56159B518197r9890r5638r0367q4979p9810p5170p1209o7321o2660n7248n1894
$$ 2518197 2418307 2322669 2232302 2147323 2067513 1992343 1921134 1853813 1791153 1733905 1682011
56148A682011m7125m2931l9369l6535l3979l1003k7642k4668k2553k1070j9851
$$ 1682011 1634886 1591955 1552586 1516051 1482072 1451069 1423427 1398759 1376206 1355136 1335285
56137A335285j8683j7223j5094j2420r818p863o859o760o796n676l045l88N49
$$ 1335285 1316602 1299379 1284285 1271865 1262047 1254184 1247325 1240565 1233769 1228093 1225048 1224660 1225209
56124A225209M7M0J493L398M587N281O104O702O351N418N167O115P351P666P021
$$ 1225209 1225256 1225296 1226789 1230187 1234774 1240055 1246159 1252861 1259212 1264630 1269797 1275912 1283263 1290929 1297950
56109A297950O574P403R462J1883J4044J5919J7509J8557J9053J9444K0032K0685
$$ 1297950 1304524 1311927 1321389 1333272 1347316 1363235 1380744 1399301 1418354 1437798 1457830 1478515
56097A478515K1511K3145K5771K8488L0462L2194L4799L8409M2185M5579M8611
$$ 1478515 1500026 1523171 1548942 1577430 1607892 1640086 1674885 1713294 1755479 1801058 1849669
56086A849669N1218N3479N6453O1606O9085P7382Q4886R0932R5175R6929R5779
$$ 1849669 1900887 1954366 2010819 2072425 2141510 2218892 2303778 2394710 2489885 2586814 2682593
56075B682593R2127Q6694P9895P2131O4247N7153N1098M5670M0487L5594L1084
$$ 2682593 2774720 2861414 2941309 3013440 3077687 3134840 3185938 3231608 3272095 3307689 3338773
56064C338773K6438K0550J2862M312l387r593j5328k1981l0064l9441m9722n9877
$$ 3338773 3365211 3385761 3398623 3402935 3399548 3389955 3374627 3352646 3322582 3283141 3233419 3173542
56052C173542o8332p4165p7504p8302p5820p0216o3401n7009n0540m2862l4585
$$ 3173542 3105210 3031045 2953541 2875239 2799419 2729203 2665802 2608793 2558253 2515391 2480806
56041B480806k7209k0805j4586r190o069m738k889L69L474N094N966P226Q730
$$ 2480806 2453597 2432792 2418206 2409016 2402947 2398209 2395320 2395689 2399163 2404257 2410223 2417449 2426179
56028B426179J0011J1518J3857J6740J9519K1827K3300K3661K3664K4739K7119
$$ 2426179 2436190 2447708 2461565 2478305 2497824 2519651 2542951 2566612 2590276 2615015 2642134
56017B642134K9363L0332L0581L1114L1944L2675L3538L4929L6653L8262L9500
$$ 2642134 2671497 2701829 2732410 2763524 2795468 2828143 2861681 2896610 2933263 2971525 3011025
56006C011025M0039L9679L9275M0301M2881M5310M6382M7144M9317N2706N5397
$$ 3011025 3051064 3090743 3130018 3170319 3213200 3258510 3304892 3352036 3401353 3454059 3509456
55995C509456N6175N5860N6191N7901O0012O1122O1441O2834O6259O9936P1479
$$ 3509456 3565631 3621491 3677682 3735583 3795595 3856717 3918158 3980992 4047251 4117187 4188666
55984D188666P1268P1818P3959P5791P5924P5671P7041Q0361Q4949R0437R6113
$$ 4188666 4259934 4331752 4405711 4481502 4557426 4633097 4710138 4790499 4875448 4965885 5061998
55973E061998J00485J03173J06154J11501J18501J24482J28230J31272J35772
$$ 5061998 5162483 5265656 5371810 5483311 5601812 5726294 5854524 5985796 6121568
55964F121568J41998J48037J51895J53926J56886J62978J71359J79675J87465
$$ 6121568 6263566 6411603 6563498 6717424 6874310 7037288 7208647 7388322 7575787
55955G575787J96172K06001K15153K22851K30857K40887K52429K64385K77191
$$ 7575787 7771959 7977960 8193113 8415964 8646821 8887708 9140137 9404522 9681713
55946I681713K91869L08224L25518L43952L64338L86993M11721M38104M65489
$$ 9681713 9973582 10281806 10607324 10951276 11315614 11702607 12114328 12552432 13017921
55937A3017921M93813N24574N59416N97605O36823O76551P18322P62227Q06049
$$ 13017921 13511734 14036308 14595724 15193329 15830152 16506703 17225025 17987252 18793301
55928A8793301Q48924Q93216R41476R94141J051469J115030J185527J261689J342892
$$ 18793301 19642225 20535441 21476917 22471058 23522527 24637557 25823084 27084773 28427665
55919B8427665J430330J524239J623163J727987J843596J974006K118386K274031
$$ 28427665 29857995 31382234 33005397 34733384 36576980 38550986 40669372 42943403
55911D2943403K440785K621019K819026L042931L303751L609748L964593M372826
$$ 42943403 45384188 48005207 50824233 53867164 57170915 60780663 64745256 69118082
55903F9118082M843195N385264O008066O723627P543876Q469680R490370J0598667
$$ 69118082 73961277 79346541 85354607 92078234 99622110 108091790 117582160 128180827
55895A28180827J1796528J3078358J4417247J5777322J7132202J8462648J9742313
$$ 128180827 139977355 153055713 167472960 183250282 200382484 218845132 238587445
55888B38587445K0917070K1841254K2170176K1330716J8709843J4005131P477022
$$ 238587445 259504515 281345769 303515945 324846661 343556504 357561635 365038657
55881C65038657r8800p717520j4453476j9656228k3035241k4654294k4830325
$$ 365038657 364939857 357222337 342768861 323112633 300077392 275423098 250592773
55874B50592773k3972498k2452308k0560099j8516748j6485649j4574327j2842005
$$ 250592773 226620275 204167967 183607868 165091120 148605471 134031144 121189139
55867A21189139j1313374r988290q849255p871986p033105o309840n679000n121193
$$ 121189139 109875765 99887475 91038220 83166234 76133129 69823289 64144289 59023096
55859E9023096m623868m178197l776328l413506l088547k799131k539561k305261
$$ 59023096 54399228 50221031 46444703 43031197 39942650 37143519 34603958 32298697
55851C2298697k095763j910827j747127j601459j473581j362865j265205j176608
$$ 32298697 30202934 28292107 26544980 24943521 23469940 22107075 20841870 19665262
55843A9665262j097111j027875r66580r09014q53397q00163p49109o99766o53293
$$ 19665262 18568151 17540276 16573696 15664682 14811285 14011122 13262013 12562247 11908954
55834A1908954o11167n72799n36720n03044m72613m44852m18691l94562l73416
$$ 11908954 11297787 10724988 10188268 9685224 9212611 8767759 8349068 7954506 7581090
55825G581090l54659l37137l21153l07426k94844k81359k66497k51170k35780
$$ 7581090 7226431 6889294 6568141 6260715 5965871 5684512 5418015 5166845 4931065
55816D931065k20398k06044j93727j82708j71657j61014j52158j44652j36665
$$ 4931065 4710667 4504623 4310896 4128188 3956531 3795517 3643359 3498707 3362042
55807C362042j28059j20791j15779j11249j05017r6949q8414q0508p3698o8329
$$ 3362042 3233983 3113192 2997413 2886164 2781147 2684198 2595784 2515276 2441578 2373249
55797B373249o4504o1781n9404n6832n3992n1282m9258m8048m7207m6405m5814
$$ 2373249 2308745 2246964 2187560 2130728 2076736 2025454 1976196 1928148 1880941 1834536 1788722
55786A788722m5369m4293m2096l9638l8160l7434l5952l3140l0421k9523l0246
$$ 1788722 1743353 1699060 1656964 1617326 1579166 1541732 1505780 1472640 1442219 1412696 1382450
55775A382450l0594k8954k5789k2993k1850k1923k1949k1306k0158j8618j6624
$$ 1382450 1351856 1322902 1297113 1274120 1252270 1230347 1208398 1187092 1166934 1148316 1131692
55764A131692j4702j3920j4633j5833j6140j5107j3268j1501j0601j0971j2189
$$ 1131692 1116990 1103070 1088437 1072604 1056464 1041357 1028089 1016588 1005987 995016 982827
55753I82827j3160j3073j2082j0918j0196j0105j0312j0032q675o534m426k808
$$ 982827 969667 956594 944512 933594 923398 913293 902981 892949 884274 877740 873314 870506
55741H70506j760j547k205k690j812j43L81p68j819j337k01K25L99J455K770K711
$$ 870506 868746 867199 864994 862304 860492 860349 860730 859962 858143 856806 856605 856830 857229 858684 861454 864165
55725H64165J381N31O00k27l358p702j1122j2925j3787j4045j3288j1518r595
$$ 864165 865546 866077 866677 866450 863092 855390 844268 831343 817556 803511 790223 778705 769110
55712G69110q351p906q106q923r950j0099q784p263p735j0666j3818j4649j2994
$$ 769110 760759 752853 744747 735824 725874 715775 706991 699728 691993 681327 667509 652860 639866
55699F39866j0603q722p406o748p127p991p985o920o344p277q469q108o408n242
$$ 639866 629263 620541 613135 606387 599260 591269 583284 576364 570020 562743 554274 546166 539758 534516
55685E34516n678p108q552r538r595q120n305k562j375j941l241m251m804n282
$$ 534516 528838 521730 513178 503640 494045 485925 480620 478058 476683 474742 471501 467250 462446 457164
55671D57164n688n389m051k652k905n277p960q423o003k691j199k362m496n106
$$ 457164 451476 446087 442036 439384 436479 431202 423242 414819 408816 406125 404926 402564 398068 392962
55657C92962l244j30K245K824J899N00k28M23K076L333L144J932Q28J17p71k008
$$ 392962 389718 389588 391833 394657 396556 397056 396828 397251 399327 402660 405804 407736 408564 408681 407910 405902
55641D05902l072l718m227m609m531m228m527n613o646o881o384n353l759k055
$$ 405902 402830 399112 394885 390276 385745 381517 376990 371377 364731 357850 351466 346113 342354 340299
55627C40299j259j731k572k756k180j229j11Q25J005M38j4K77R91J517J588J037
$$ 340299 339040 337309 334737 331981 329801 328572 328461 329286 330291 330729 330715 330992 331983 333500 335088 336125
55611C36125j21j066o98O65J376P55qP0K63j91m81L36J469J648J147R35P66nn46
$$ 336125 336004 334938 334240 334905 336281 337036 337028 337098 337361 337170 336689 337025 338494 340142 341289 342224 342990 342985 342439
55592C42439L14J567J003j258k539j344O52J187K67n77m71M70J908L160L094J318
$$ 342439 342753 344320 345323 344065 341526 340182 340834 342021 342288 341711 341240 341710 343618 346778 349872 351190
55576C51190q79j793j430j496l159n523o719o153n057m814n295n355m615l855
$$ 351190 350311 348518 347088 345592 342433 336910 330191 324038 318981 314167 308872 303517 298902 295047
55562B95047l681l688l327k728k243j876j684j990k618k815k499k648l637m211
$$ 295047 291366 287678 284351 281623 279380 277504 275820 273830 271212 268397 265898 263250 259613 255402
55548B55402l221j476n48n51n07l06o50j499k085k286k559k684k098j269j177
$$ 255402 252181 250705 250157 249606 249099 248793 248143 246644 244559 242273 239714 237030 234932 233663 232486
55533B32486j522j040K88J011M50l72m32K4L93N87O19M78O90J869L528M520M774
$$ 232486 230964 229924 230212 231223 231673 231301 230869 230893 231286 231873 232492 232970 233660 235529 239057 243577 248351
55516B48351N159N597N075L911M022O177Q615R336Q228O172L674J382K59L1j022
$$ 248351 253510 259107 264182 268093 272115 278292 286907 296243 304471 310643 314317 315699 315958 315989 314967
55501C14967l453n470n759n702o934q364p993o514o323p595q113o921n573n218
$$ 314967 311514 306044 300285 294583 287649 279285 271292 264778 258455 250860 242747 235826 230253 225035
55487B25035m929l752k413j849j614r90l66l21l54N0J3j595l913m504k269J047
$$ 225035 220106 216354 213941 212092 210478 209488 209122 208801 208447 208497 208510 206915 203002 198498 196229 197276
55471A97276K770K094N08j71L57J033J019O42P06J272J580J183N68L70L29l80
$$ 197276 200046 202140 202648 202477 202834 203867 204886 205528 206234 207506 209086 210269 210837 211207 211536 211156
55455B11156j837k966k791j774j351k154l273l498k777k010j814k132k779l629
$$ 211156 209319 206353 203562 201788 200437 198283 195010 191512 188735 186725 184911 182779 180000 176371
55441A76371m217l956k952j996j518j138n42j10k06m19j20N67R69Q06M34K48L36
$$ 176371 172154 168198 165246 163250 161732 160594 160052 159942 159736 159317 159197 159764 160733 161539 161973 162221 162557
55424A62557O60J076J212P59j3l62Q4P33N07r65k709l228j976J86K018K992L050
$$ 162557 163217 164293 165505 166264 166251 165889 165973 166706 167213 166248 163539 160311 158335 158521 160539 163531 166581
55407A66581K086M16p55n01L33K2j508k342j230O61J399O66n39j562k230k055
$$ 166581 168667 169083 168328 167827 168160 168182 166674 164332 163102 163763 165162 165828 165289 163727 161497 159442
55391A59442p55O70P77k69p93N6J182J297P30O41J171J426J085Q99J340J703J207
$$ 159442 158687 159357 160134 159865 159072 159128 160310 161607 162337 162978 164149 165575 166660 167559 168899 170602 171809
55374A71809L91M34J207J262J22n70P74L120L886K278O6j063j369j710j818j039
$$ 171809 172200 172634 173841 175103 175225 174655 175429 178549 182435 184713 184779 183716 182347 180637 178819 177780
55358A77780K04R18R53Q38P07M28M53J346K449K174m7k827m206l605k225j767
$$ 177780 177984 178902 179855 180693 181400 181828 182281 183627 186076 188250 188203 185376 181170 177565 175340 173573
55342A73573k856m519n205m281k379l85J312K454K645J995J389J488J919J985
$$ 173573 170717 166198 160993 156712 154333 153948 155260 157714 160359 162354 163743 165231 167150 169135
55328A69135J632J044jj507k513k090p18K33K14k81q63j463j550m46J371K348
$$ 169135 170767 171811 171810 170303 167790 165700 164982 165215 165429 165148 164285 162822 161272 160826 162197 164545
55312A64545J634mj263j498o52R84K462K540R42j169k417k512k004j321n51J64
$$ 164545 166179 166175 164912 163414 162762 163746 166208 168748 169690 168521 166104 163592 161588 160267 159716 159880
55296A59880N07K30n64j269j049K80J714J905O53r35j750j617r05M0Q38R89L02
$$ 159880 160387 160617 160053 158784 157735 158015 159729 161634 162287 161352 159602 157985 157080 157120 157958 158947 159249
55279A59249r64k377l331k899n86K497M134L275J198j12j36K78O12J149J832J723
$$ 159249 158285 155908 152577 149678 149092 151589 155723 158998 160196 160084 159948 160226 160838 161987 163819 165542
55263A65542J78j877k579j156J057J986J039m35r90p20p14j459k432k932k530
$$ 165542 165720 163843 161264 160108 161165 163151 164190 163755 162765 162045 161331 159872 157440 154508 151978
55248A51978r71J292K635J595j036k562j469Q11J964J685J347J502J194j09j228
$$ 151978 151007 152299 154934 156529 155493 152931 151462 152273 154237 155922 157269 158771 159965 159856 158628
55233A58628p18J117K455K155R71M03Q28J296R84J15p93j796l013l815l453k248
$$ 158628 157910 159027 161482 163637 164608 165011 165839 167135 168119 168234 167441 165645 162632 158817 155364 153116
55217A53116j216n96K72J512K333K343K182K317K251J614J078J286J679J380N38
$$ 153116 151900 151304 151576 153088 155421 157764 159946 162263 164514 166128 167206 168492 170171 171551 172089
55202A72089k17j014k122k661j437R68K455K004P80K00J81kk36j9L12j41j446
$$ 172089 171872 170858 168736 166075 164638 165606 168061 170065 170845 171045 171226 171224 170988 170969 171281 171140 169694
55185A69694k619k763j915p69L0K78J89K1l82j385k725l267k110K29K228K854
$$ 169694 167075 164312 162397 161628 161658 161936 162125 162146 161764 160379 157654 154387 152277 152506 154734 157588
55169A57588K264J194K08m06n50m18l57m69n24l11J27O41J031R74L46l47k85O68
$$ 157588 159852 161046 161254 160848 160298 159880 159523 159054 158530 158219 158346 158987 160018 160992 161338 160991 160706 161374
55151A61374J739K185K040J735J515J502J699J473j16k714m163k824N3J574P15
$$ 161374 163113 165298 167338 169073 170588 172090 173789 175262 175146 172432 168269 165445 165498 167072 167787
55136A67787p84j176q14q59j287j220m46N27J370K057K442K378K003J387M11n89
$$ 167787 167003 165827 165013 164154 162867 161647 161201 161728 163098 165155 167597 169975 171978 173365 173776 173187
55120A73187p97j36L32K9r5P79J594R04o24j085m14m82j880k699j358J044K468
$$ 173187 172390 172254 172586 172615 172520 173299 174893 175797 175173 174088 173674 173192 171312 168613 167255 168299 170767
55103A70767K659K777L146K912J681K76k76J36P43O91j76j126j359r72p45r29
$$ 170767 173426 176203 179349 182261 183942 184218 183942 184078 184821 185512 185336 184210 182851 181879 181134 180205
55087A80205r29m23M9Oj93m6K29J28k82n73o18n42m01l65p69j551k091k047j751
$$ 180205 179276 178853 178902 178908 178715 178669 178898 179026 178744 178171 177553 177011 176610 176245 175476 173925 171834 169787 168036
55068A68036j418o07Q58K212K756K832K927K515R59j003j993j892j700j729j346
$$ 168036 166618 166011 166869 169081 171837 174669 177596 180111 181070 180067 178074 176182 174482 172753 171407
55053A71407o47o64j538j851o58J042J875K134K964M157M206K616R16Q10K152
$$ 171407 170760 170096 168558 166707 166049 167091 168966 171100 174064 178221 182427 185043 185959 186769 188921
55038A88921L362L426K779K265J882R88n03j723j879j259q19q79p81M5J143J560
$$ 188921 192283 195709 198488 200753 202635 203623 203120 201397 199518 198259 197440 196561 195780 195825 196968 198528
55022A98528J070M49M23P30N32m27j478j853j476p18K05J111J444O66p91j692
$$ 198528 199598 200047 200470 201200 201732 201305 199827 197974 196498 195780 195985 197096 198540 199206 198415 196723
55006A96723j368m77r0m00p82p46l03M54J485K392K281N19k283m270l881j556
$$ 196723 195355 194878 194788 194388 193606 192860 192557 193011 194496 196888 199169 199688 197405 193135 189254 187698
54990A87698N11P61M4K38J488K039R28n34o39M19J133Q67L13K28O18J102J285
$$ 187698 188209 188970 189014 189252 190740 192779 193707 193173 192534 192953 194086 194953 195266 195494 196112 197214 198499
54973A98499R03J78k62k49n12j487k393k245j353q30r72j174j109q91l62N36R08
$$ 198499 199402 199580 199318 199069 198557 197070 194677 192432 191079 190249 189277 188103 186994 186103 185741 186277 187185
54956A87185j10j541j336P06K311J679k74j570j744j643j427l26J821L790M147
$$ 187185 187075 185534 184198 184904 187215 188894 188620 187050 185306 183663 182236 181910 183731 187521 191668
54941A91668K740R03J58O98J307J030M44N98J227J222O39O55J372J354N9j005
$$ 191668 194408 195311 195469 196167 197474 198504 198948 199546 200773 201995 202634 203289 204661 206015 206074 205069
54925B05069n82L15J06q86j209n97J50R70K408M042M669L967K597Q72j204k808
$$ 205069 204487 204802 204908 204022 202813 202216 202366 203336 205744 209786 214455 218422 221019 221891 220687 217879
54909B17879k885j939j511j761j278L57J693J770J534J837J806N67p95p14M02
$$ 217879 214994 213055 211544 209783 208505 208862 210555 212325 213859 215696 217502 218069 217274 216560 216962
54894B16962R05L91k02n11r49j187k83J456K336J528J52m38k45N2K58K78m05j870
$$ 216962 217867 218258 218056 217545 216596 215409 215126 216582 218918 220446 220598 220160 219915 219967 220225 220503 220098 218228
54876B18228k973k544r65L52P48P02O77N63L23L49R05J789K670L307L424K920
$$ 218228 215255 212711 211746 212098 212846 213548 214225 214788 215111 215460 216365 218154 220824 224131 227555 230475
54860B30475K327K394L046L377K960K543K978M019M667M432L734L335L677M574
$$ 230475 232802 235196 238242 241619 244579 247122 250100 254119 258786 263218 266952 270287 273964 278538
54846B78538N125M283J979o06k316l166l759m101l883l582m002m769m444k636
$$ 278538 283663 287946 289925 289319 287003 283837 280078 275977 272094 268512 264510 259741 255297 252661
54832B52661q21m83j347k208k627k820k613j751r11r98j532r89R73K869L474L356
$$ 252661 251840 251357 250010 247802 245175 242355 239742 237991 237080 236082 234550 233561 234534 237403 240877 244233
54816B44233L453L262J751l94j080M79K640L577L613M348O052P092O087L670J617
$$ 244233 247686 250948 252699 252305 251225 251704 254344 257921 261534 265882 271934 279026 285113 288783 290400
54801B90400P28K23r62k845m512n135m621l527k619k508l391m825n884n789m630
$$ 290400 291128 291351 290389 287544 283032 277897 273276 269749 267130 264622 261231 256406 250522 244733 240103
54786B40103l340k701k501k033j390j580k912l891k670M99L145L234J154j216
$$ 240103 236763 234062 231561 229528 228138 226558 223646 219755 217085 217584 220729 223963 225117 223901
54772B23901k625k905k140n97O68L89j309k758k650j500o32l69pP70J368J218
$$ 223901 221276 218371 216231 215634 216302 216691 215382 212624 209974 208474 207842 207473 207466 208236 209604 210822
54756B10822M28p43k248l607l543j318J755L180K114N15P96K851M355L845K245
$$ 210822 211250 210507 208259 204652 201109 199791 201546 204726 206840 207355 208151 211002 215357 219202 221447
54741B21447J122N67k30j142j167j82N80K03p29j095p24l09k77l87l31k26m28
$$ 221447 222569 223136 222906 221764 220597 220415 220995 221198 220469 219374 218650 218341 218064 217677 217346 217120 216692
54724B16692j074j718j482K3J909K682K080J547K328L788M377L817L190L138L190
$$ 216692 215618 213900 212418 212441 214350 217032 219112 220659 222987 226775 231152 234969 238159 241297 244487
54709B44487K970K879L152L268K918K666L063L817M532N501O852P694P105N559
$$ 244487 247457 250336 253488 256756 259674 262340 265403 269220 273752 279253 286105 293799 300904 306463
54695C06463M221L193J692k93j851k833m091n708o343n230l639l337m341n291
$$ 306463 310684 313877 315569 315276 313425 310592 306501 300793 294450 289220 285581 282244 277903 272612
54681B72612n461n272n194n169m986m282k486K84K468K434O55p29o36n7RR6Q34
$$ 272612 267151 261879 256685 251516 246530 242248 239762 240046 242514 244948 245603 244874 244238 244181 244190 244286 245120
54664B45120J341N56o37l79J352K522K009J225K030M151N714N696M745L871L380
$$ 245120 246461 247017 246380 246001 247353 249875 251884 253109 255139 259290 265004 270700 275445 279316 282696
54649B82696L158L042K593J159j363m136o160p180p523p333o463n074l840l336
$$ 282696 285854 288896 291489 292648 291285 287149 280989 273809 266286 258953 252490 247416 243576 240240
54635B40240l455l570l197k303j187k34K52K05j28l34j37M20R32Q16k48j787k643
$$ 240240 236785 233215 230018 227715 226528 226294 226546 226751 226623 226289 226152 226572 227504 228320 228072 226285 223642
54618B23642k041n76L16Q0k36N64J992K324Q34j266k420k449k065j353J01J828
$$ 223642 221601 221025 221341 221421 221185 221749 223741 226065 226899 225633 223213 220764 218699 217346 217447 219275
54602B19275K483J591L69Q0L75Q8q50j382j075p97j293j874j247P11K604K950
$$ 219275 221758 223349 223718 223798 224173 224261 223411 222029 220954 220157 218864 216990 215743 216454 219058 222008
54586B22008J657j27j338j926k325k390j434N21K223K403J218q7o58n89k39K08
$$ 222008 223665 223538 222200 220274 217949 215559 214125 214646 216869 219272 220490 220403 219745 219156 218917 219125
54570B19125N60P14R58J522J944J688J215J343J566M57j952l685l487k460k000
$$ 219125 219685 220399 221357 222879 224823 226511 227726 229069 230635 231092 229140 225455 221968 219508 217508
54555B17508j637m25Q45Q51K90Q90K249K096j8j686j100M98R70K45k18K83J272
$$ 217508 215871 215446 216291 217142 217432 218322 220571 222667 222649 220963 219863 220361 221331 221576 221358 221641 222913
54538B22913K046J931M67j615k451j215O22J325J178J366J640R72j46k68L82N5
$$ 222913 224959 226890 227357 225742 223291 222076 222698 224023 225201 226567 228207 229179 229033 228765 229147 229202
54522B29202j474k257j221M0k81j620k325k177k090k141j566l38P10J197J441
$$ 229202 227728 225471 224250 224290 224009 222389 220064 217887 215797 213656 212090 211752 212462 213659 215100
54507B15100J413O65n40j117n05O45J443J802K165K667K942K512J243l40j279
$$ 215100 216513 217178 216638 215521 215016 215661 217104 218906 221071 223738 226680 229192 230435 230095 228816
54492B28816j058k32K89L80N67Q93Q42M38M43J062J344N75m39m21N83J400J437
$$ 228816 227758 227526 227815 228195 228762 229655 230497 230935 231378 232440 233784 234359 233920 233499 234082 235482 236919
54475B36919J259J379J471J180R68J546K677L136J957k86j759j119R32K278J745
$$ 236919 238178 239557 241028 242208 243176 244722 247399 250535 252492 252206 250447 249328 250260 252538 254283
54460B54283L42l39l01p67j982k689j994n72N78J455K313K561J573O8n75k50j26
$$ 254283 254625 254286 253985 253218 251236 248547 246553 245981 246559 248014 250327 252888 254461 254529 253954 253704 253578
54443B53578p02j063m60M56O70K57k5r0m80j158j318o63j06o10j740k055r51M52
$$ 253578 252876 251813 251353 251809 252479 252736 252711 252621 252141 250983 249665 249002 248896 248286 246546 244491 243540 243992
54425B43992P08r5m86M40J951K788K769K595K565K253J518R17Q79J024O63l89
$$ 243992 244700 244605 244119 244559 246510 249298 252067 254662 257227 259480 260998 261915 262794 263818 264481 264092
54409B64092j797l088l757l339j930m29K24N3r5L26Q91Q21K8q02j066q76o21j66
$$ 264092 262295 259207 255450 252111 250181 249752 249976 250029 249934 250260 251151 251972 252000 251198 250132 249256 248635 248469
54391B48469R15K333K990K360J309Q51O56k72j660k091j123M6M42N06P04L77q44
$$ 248469 249384 251717 254707 257067 258376 259227 259883 259611 257951 255860 254737 254783 255225 255731 256435 256812 255968
54374B55968j594m57J597K178O57j335k536l267l620k493M17L147L478J680m4
$$ 255968 254374 253917 255514 257692 258349 257014 254478 251211 247591 245098 245515 248662 252140 253820 253776
54359B53776k33P83J923K221J043j213k740j872Q25L054L439K658J918J547J455
$$ 253776 253543 254326 256249 258470 259513 258300 255560 253688 254513 257567 261006 263664 265582 267129 268584
54344B68584J733J980J162q95k507j862O43K727K786J316j88q64p85l04L87J150
$$ 268584 270317 272297 273459 272564 270057 268195 268838 271565 274351 275667 275479 274615 273830 273526 273913 275063
54328B75063J683J608J065R75K045L350K906L15k050j797K39J016n75k327j974
$$ 275063 276746 278354 279419 280394 282439 285789 288695 289010 286960 285163 285402 286418 285843 283516 281542
54313B81542j44R81P08J38R0K32J44R7M62J121J595J456N89n60j204j108r30j186
$$ 281542 281398 282379 283087 283225 283315 283547 283691 283788 284250 285371 286966 288422 289011 288451 287247 286139 285209 284023
54295B84023j275m14Q60J194M13k25k2R4p84j850j598k0J296J211K03n96p34m88
$$ 284023 282748 282334 283194 284388 284801 284576 284554 284648 283864 282014 280416 280396 281692 282903 283106 282510 281776 281288
54277B81288j44J23l4r37k207k750j743M25K478L466L459L008K337J291K1p45
$$ 281288 281144 281267 281233 280296 278089 275339 273596 274021 276499 279965 283424 286432 288769 290060 290081 289336
54261B89336j98J624L541M091L008J640J492K508L353L323L111L394L570K595
$$ 289336 289138 290762 294303 298394 301402 303042 304534 307042 310395 313718 316829 320223 323793 326388
54247C26388M73j806l417m126l948l188k509k340k446k566k922l377k912j050
$$ 326388 326861 325055 321638 317512 313564 310376 307867 305527 303081 300515 297593 294216 291304 290254
54233B90254P40N51j366k874k712j549l36O52R47p8j710k056n89J030J469J507
$$ 290254 290994 291545 290179 287305 284593 283044 282708 283360 284307 284229 282519 280463 279874 280904 282373 283880
54217B83880K157K726K312J806K387L028J699j294l342k978j506q14j186j849
$$ 283880 286037 288763 291075 292881 295268 298296 299995 298701 295359 292381 290875 290061 288875 287026
54203B87026k304k311j489K21K053K992K665J592O75M22M19o2p29k99J529K965
$$ 287026 284722 282411 280922 281143 283196 286188 288853 290445 291120 291542 291961 291899 291170 290871 292400 295365
54187B95365K249K18p69k18o5j603l608m158k907p80J341K621K095j37k223k356
$$ 295365 297614 297832 297063 296845 296780 295177 291569 287411 284504 283724 285065 287686 289781 289644 287421 285065
54171B85065j044m30j468k773k500n23J635K555K075R30k87j497k580k975k258
$$ 285065 284021 283591 282123 279350 276850 276327 277962 280517 282592 283522 283235 281738 279158 276183 273925
54156B73925r61j66j62q0Q20J989K240J265k2p27r84j481k233k322j068Q73K005
$$ 273925 272964 272798 272636 272556 273376 275365 277605 278870 278848 278121 277137 275656 273423 271101 270033 270906 272911
54139B72911J592M15k16K02J157J881J961J514J002P13L54l71q53k07R84P87j325
$$ 272911 274503 274918 274702 274904 276061 277942 279903 281417 282419 283132 283486 283115 282262 282055 283039 283826 282501
54122B82501l164k569n19L46l59m67J082K533K015Q3j415j700j089M8J294J872
$$ 282501 279337 276768 276249 276595 276236 275769 276851 279384 281399 281482 280067 278367 277278 277326 278620 280492
54106B80492J431N95q5j007k596m179m662l696j597J106L272L420J556j16K26
$$ 280492 281923 282518 282433 281426 278830 274651 269989 266293 264696 265802 269074 272494 274050 273934 274160
54091B74160J512J358l97j591j062l6K15K30R16J689J407L13k50K51J112J663
$$ 274160 275672 277030 276633 275042 273980 273944 274159 274389 275305 276994 278401 278714 278464 278715 279827 281490
54075B81490J962K034J418m1j495j791p45P45J722J885J371M06n32p56r8P23R60
$$ 281490 283452 285486 286904 286863 285368 283577 282832 283577 285299 287184 288555 288961 288429 287673 287575 288298 289258
54058B89258Q10Q84J051O31k71o46j0R41J438J540J457Q80l29j507k053k207k288
$$ 289258 290068 290952 292003 292634 292363 291717 291707 292648 294086 295626 297083 297963 297634 296127 294074 291867 289579
54041B89579j819m62Q31P95k39o12M46J921K399J553J26q09m68R37K096J825M85
$$ 289579 287760 287298 288129 288924 288685 288073 288519 290440 292839 294392 294518 293709 293241 294178 296274 298099 298584
54024B98584o03j008j455k137k020m61J504K349J926J311J227J431J463J218Q16
$$ 298584 297981 296973 295518 293381 291361 290900 292404 294753 296679 297990 299217 300648 302111 303329 304145
54009C04145M78N35J083J540J087k79j477j388l6J556K562L060L521L951M015
$$ 304145 304623 305158 306241 307781 308868 308589 307112 305724 305688 307244 309806 312866 316387 320338 324353
53994C24353L756L622L591K917J198p35j601j049K39J554K584L065K897K666L214
$$ 324353 328109 331731 335322 338239 339437 338702 337101 336052 336291 337845 340429 343494 346391 349057 352271
53979C52271M451N356N368N062N041N082M930N081N848O330N514M077L731M680
$$ 352271 356722 362078 367446 372508 377549 382631 387561 392642 398490 404820 410334 414411 418142 422822
53965D22822N065L453Q13r09j314j588k419l099k800j782r92j109k195l687m498
$$ 422822 427887 431340 432153 431244 429930 428342 425923 422824 420024 418242 417250 416141 413946 410259 405761
53950D05761l784k046q44j042j908k464k868l593l969k831m36J561K068J433M13
$$ 405761 401977 399931 399087 398045 396137 393673 390805 387212 383243 380412 379976 381537 383605 385038 385451
53935C85451n24p46J51J022j33l189n102l498J44K530K860L026M043M674M107
$$ 385451 384927 384181 384332 385354 385221 382032 376930 373432 373576 376106 378966 381992 386035 390709 394816
53920C94816L721M983P104Q237P939P065O006M755M342O332J0360J3728J4338
$$ 394816 398537 403520 410624 418861 426800 433865 439871 444626 448968 455300 465660 479388 493726
53907D93726J3102J2311J2325J1271P863L053j536n562r430j2758j4584j4807
$$ 493726 506828 519139 531464 542735 550598 553651 552115 546553 537123 524365 509781 494974
53895D94974j4247j3305j1637r247o948n360m376l773l531l140j631J009L271
$$ 494974 480727 467422 455785 446538 439590 434230 429854 426081 422550 419410 417779 418788 422059
53882D22059L754K814J888J686J827J802J626J730K656M425N855N357L014J023
$$ 422059 425813 428627 430515 432201 434028 435830 437456 439186 441842 446267 452122 457479 460493 461516
53868D61516J229K921M062L896L180K560K109K142L002M144M693M778N130N645
$$ 461516 462745 465666 469728 473624 476804 479364 481473 483615 486617 490761 495454 500232 505362 511007
53854E11007N621N244N285N417M433K336N85mq4j82k3J28q25k881m454m797n273
$$ 511007 516628 521872 527157 532574 537007 539343 539928 539924 539840 539658 539635 539763 538938 536057 531603 526806 521533
53837E21533o942q448p961o048m758m659m623m087l637l474l023k292k194l099
$$ 521533 514591 506143 498182 492134 487376 482717 478094 474007 470370 466896 463873 461581 459387 456288
53823D56288m090m124l165j921j181j554l083m835n530m867l737k979k520k080
$$ 456288 452198 448074 444909 442988 441807 440253 437170 432335 426805 421938 418201 415222 412702 410622
53809D10622j971k648l718m177l626k743k255j839p19P66J127k40j812j823q24
$$ 410622 408651 406003 402285 398108 394482 391739 389484 387645 386926 387692 388819 388579 386767 384944 384120
53794C84120r72k767m223l736k293j697j910j587m25N80R23J216J960K771L037
$$ 384120 383148 380381 376158 372422 370129 368432 366522 364935 364510 365090 366013 367229 369189 371960 374997
53779C74997K525J347J1n54K20J635K410K195J724J508J283Q53O18Q77J186Q11
$$ 374997 377522 378869 378880 378326 378546 380181 382591 384786 386510 388018 389301 390154 390772 391649 392835 393646
53763C93646m19j850k319r24J974M639N553N125N150O431P777P740O697O495Q210
$$ 393646 393227 391377 389058 388134 390108 394747 400300 405425 410575 417006 424783 432523 439220 445715 453925
53748D53925J0828J2390J2224J1713J2625J4980J7205J8275J8747J9273J9293
$$ 453925 464753 477143 489367 501080 513705 528685 545890 564165 582912 602185 621478
53737F21478J8103J6261J4497J1944P200R45m457q262j2262j7464k1634k1758
$$ 621478 639581 655842 670339 682283 689483 690428 685971 677709 665447 647983 626349 604591
53725F04591j7955j3294j0277r028q696q935r493r669q931p618o420n604n097
$$ 604591 586636 573342 563065 554037 545341 536406 526913 517244 508313 500695 494275 488671 483574
53712D83574m992n429o164o685o779o644o393n729m343k514j049n39q36j297j445
$$ 483574 478582 473153 466989 460304 453525 446881 440488 434759 430416 427902 426853 426314 425478 424181 422736
53697D22736j284j077r72p69m2J306K483K198O3k606l884l136j394J15J107J763
$$ 422736 421452 420375 419403 418634 418592 419898 422381 424579 424642 422036 418152 415016 413622 413737 414844 416607
53681D16607J910J408R70J682L620N626O717P129P623Q250Q528Q479Q641Q978
$$ 416607 418517 419925 420895 422577 426197 431823 438540 445669 453292 461542 470070 478549 487190 496168
53667D96168Q786Q005P640Q079P901N593K036k78n59o51k089l813l892k473j492
$$ 496168 504954 512959 520599 528678 536579 542172 544208 543930 543371 542720 540631 536818 532926 530453 528961
53652E28961k032l340m253m294l276j149J345K862K851K254K348L341M384M623
$$ 528961 526929 523589 519336 515042 511766 510617 511962 514824 517675 519929 522277 525618 530002 534625
53638E34625L934K862K102J900J958J912J787J669J323N91m2Q3Q36J387J255P19
$$ 534625 538559 541421 543523 545423 547381 549293 551080 552749 554072 554663 554621 554704 555540 556927 558182 558901
53622E58901J09o86j807k885l200k332p74J35o57k543l642k994j687j083q47j8
$$ 558901 559010 558324 556517 553632 550432 548100 547326 547461 546804 544261 540619 537625 535938 534855 534008 533990
53606E33990P29k29k603l876k412O36L135M259M188K982R54p93j413j362j506
$$ 533990 534719 534490 531887 528011 525599 526235 529370 533629 537817 540799 541753 540960 539547 538185 536679
53591E36679j773j546p64L16J717L240L997L528K820L030L686L453K409K104L298
$$ 536679 534906 533360 532596 532912 534629 537869 541866 545394 548214 551244 554930 558383 560792 562896 566194
53576E66194M974N852N717M891L521K081J669K833M541N117M184L132L566N579
$$ 566194 571168 577020 582737 587628 591149 593230 594899 597732 602273 607390 611574 614706 618272 623851
53562F23851P640Q143O938N225M116L654L468L753M965O696P702P270O118N539
$$ 623851 631491 639634 646572 651797 655913 659567 663035 666788 671753 678449 686151 693421 699539 705078
53548G05078N907O311N660L978K474K223K914L187K209M89q90j362q86L99J889
$$ 705078 710985 717296 722956 726934 729408 731631 734545 737732 739941 740430 739540 738178 737292 737691 739580
53533G39580K388J175q53j902j217K22J021P14k69j384k262k668k607k408k441
$$ 739580 741968 743143 742290 740388 739171 739393 740414 741128 740859 739475 737213 734545 731938 729530 727089
53518G27089k740l021l029k852k859l149l141k105k77R61N16j038j929j102P40
$$ 727089 724349 721328 718299 715447 712588 709439 706298 704193 703916 704877 705393 704355 702426 701324 702064
53503G02064J938J566L65J32J914M672O188N555M287M443O168P764P846O643N438
$$ 702064 704002 705568 705933 706065 707979 712651 718839 724394 728681 733124 739292 747056 754902 761545 766983
53488G66983N472P227R932J1941J2303J1931J2317J3450J4204J4594J6184J9634
$$ 766983 772455 779682 789614 801555 813858 825789 838106 851556 865760 880354 896538 916172
53476I16172K3304K5184K5293K5147K5552K6046K6149K6068K6192K6570K6949
$$ 916172 939476 964660 989953 1015100 1040652 1066698 1092847 1118915 1145107 1171677 1198626
53465A198626K6916K6153K4983K4367K4893K6038K6945K7630K8771L0554L2446
$$ 1198626 1225542 1251695 1276678 1301045 1325938 1351976 1378921 1406551 1435322 1465876 1498322
53454A498322L4091L5722L7614L9677M1637M3101M3432M2207M0026L8265L7767
$$ 1498322 1532413 1568135 1605749 1645426 1687063 1730164 1773596 1815803 1855829 1894094 1931861
53443A931861L8150L8627L8894L8859L8102L6362L4317L3046L2729L2585L2267
$$ 1931861 1970011 2008638 2047532 2086391 2124493 2160855 2195172 2228218 2260947 2293532 2325799
53432B325799L2370L3019L2755L0072K5911K3272K3870K6100K7014K5513K2671
$$ 2325799 2358169 2391188 2423943 2454015 2479926 2503198 2527068 2553168 2580182 2605695 2628366
53421B628366J9676J6839J4329J2311J0042O297J298k974n269o829r585j3467
$$ 2628366 2648042 2664881 2679210 2691521 2701563 2707860 2709158 2706184 2700915 2694086 2684501 2671034
53409B671034j6804j8791k0038k1123k2107k3520k6137k9285l0962l0433k9460
$$ 2671034 2654230 2635439 2615401 2594278 2572171 2548651 2522514 2493229 2462267 2431834 2402374
53398B402374k9886l1077l1153k9922k8997k9175k9427k8731k7523k6600k5699
$$ 2402374 2372488 2341411 2310258 2280336 2251339 2222164 2192737 2164006 2136483 2109883 2084184
53387B084184k4101k1952k0017j8409j6476j3813j0694p406l939m43K549M725
$$ 2084184 2060083 2038131 2018114 1999705 1983229 1969416 1958722 1951316 1947377 1946934 1949483 1954208
53375A954208O438Q261J0372J2572J4665J6559J8266J9992K2026K4335K6589K8791
$$ 1954208 1960646 1968907 1979279 1991851 2006516 2023075 2041341 2061333 2083359 2107694 2134283 2163074
53363B163074L1468L4820L8101M0477M2337M4914M8554N2091N4275N5245N6193
$$ 2163074 2194542 2229362 2267463 2307940 2350277 2395191 2443745 2495836 2550111 2605356 2661549
53352B661549N8000O0625O3490O5966O7829O9643P2453P6494Q0553Q3227Q4702
$$ 2661549 2719549 2780174 2843664 2909630 2977459 3047102 3119555 3196049 3276602 3359829 3444531
53341C444531Q6444Q9060R1378R2042R1279R0363Q9855Q9211Q7931Q6267Q4650
$$ 3444531 3530975 3620035 3711413 3803455 3894734 3985097 4074952 4164163 4252094 4338361 4423011
53330D423011Q2995Q0810P7606P2989O6883N9826N2717M5989L9376L2719K6474
$$ 4423011 4506006 4586816 4664422 4737411 4804294 4864120 4916837 4962826 5002202 5034921 5061395
53319E061395K0954J5446Q809Q26p613j5682k3375l0986l8560m6116n3928o2061
$$ 5061395 5082349 5097795 5106604 5107430 5099817 5084135 5060760 5029774 4991214 4945098 4891170 4829109
53307D829109o9920p6699q2050q6071q8832r0414r1189r1651r1930r1826r1244
$$ 4829109 4759189 4682490 4600440 4514369 4425537 4335123 4243934 4152283 4060353 3968527 3877283
53296C877283r0216q8477q5549q1575p7825p5885p6102p6929p6156p2974o8735
$$ 3877283 3787067 3698590 3613041 3531466 3453641 3377756 3301654 3224725 3148569 3075595 3006860
53285C006860o5371o3236o1047n7831n4250n1533m9773m7887m4956m0942l6326
$$ 3006860 2941489 2878253 2817206 2759375 2705125 2653592 2603819 2555932 2510976 2470034 2433708
53274B433708l1784k8166k6048k5136k4541k3672k2495k1095j9570j8258j7316
$$ 2433708 2401924 2373758 2347710 2322574 2298033 2274361 2251866 2230771 2211201 2192943 2175627
53263B175627j6118j3826j0759q285p083o288m824k771q06J033L247N984Q955
$$ 2175627 2159509 2145683 2134924 2126639 2119556 2113268 2108444 2105673 2104867 2105900 2109147 2115131 2124086
53250B124086J2005J4988J7367J8702J9491K0837K3145K5754K7949K9881L2194
$$ 2124086 2136091 2151079 2168446 2187148 2206639 2227476 2250621 2276375 2304324 2334205 2366399
53239B366399L4986L7508L8892L9097L8959L9184L9479L9026L7630L5730L3336
$$ 2366399 2401385 2438893 2477785 2516882 2555841 2595025 2634504 2673530 2711160 2746890 2780226
53228B780226K9820K5266K1127J8650J7057J4221R090K762k847o891j0086j3740
$$ 2780226 2810046 2835312 2856439 2875089 2892146 2906367 2915457 2918219 2915372 2908481 2898395 2884655
53216B884655j8282k2642k5460k6995k9122l2904l7074l9847m1487m3704m6933
$$ 2884655 2866373 2843731 2818271 2791276 2762154 2729250 2692176 2652329 2610842 2567138 2520205
53205B520205m9737n0961n1023n0755n0367n0022n0183n0714n0710n0013m9860
$$ 2520205 2470468 2419507 2368484 2317729 2267362 2217340 2167157 2116443 2065733 2015720 1965860
53194A965860n0978n1949n0655m7061m3348m1418m1101m0975m0210l9253l8919
$$ 1965860 1914882 1862933 1812278 1765217 1721869 1680451 1639350 1598375 1558165 1518912 1479993
53183A479993l9021l8213l5528l1952k9622k9330k9579k8573k6232k3622k1272
$$ 1479993 1440972 1402759 1367231 1335279 1305657 1276327 1246748 1218175 1191943 1168321 1147049
53172A147049j8995j6882j5462j5032j5618j7243j9521k1268k1416k0229j9000
$$ 1147049 1128054 1111172 1095710 1080678 1065060 1047817 1028296 1007028 985612 965383 946383
53161I46383j8635j9022j9413j8911j7053j4665j3550j4378j5542j5232j4039
$$ 946383 927748 908726 889313 870402 853349 838684 825134 810756 795214 779982 765943
53150G65943j3965j5252j6057j5277j3788j2451j0890r057q168q750r203p944
$$ 765943 751978 736726 720669 705392 691604 679153 668263 659206 651038 642288 633085 625141
53138F25141n901n193o080p013p261p666q609q926p591n399m164m670n926o230
$$ 625141 619240 614047 607967 600954 593693 586027 577418 568492 560901 555502 551338 546668 540742 534512
53124E34512m853k733j467j586k206k484k587k737k295r17J12o77k531l069j363
$$ 534512 529659 526926 525459 523873 521667 519183 516596 513859 511564 510647 510759 510082 507551 504482 503119
53109E03119J089K701L425L508K483M59r83o51N07R32P56J044J489Q75m91q80
$$ 503119 504208 506909 510334 513842 516325 516784 515801 515150 515657 516589 517345 518389 519878 520753 520262 519382
53093E19382O6N33p21k503l060k433j715j112k07N72L75m94r33r39j593k929l333
$$ 519382 519448 519981 519260 516757 513697 511264 509549 508437 508230 508802 509177 508683 507750 506811 505218 502289 498956
53076D98956j909j04J52r22j547j162j102k252l441k944r42N69P1j962l824m179
$$ 498956 497047 496943 497095 496173 494626 493464 492362 490110 486669 483725 482783 483352 483423 481461 477637 473458
53060D73458k867p46Q73J090J96n57l26L85N63J49rL88N62r2j100j814k493l576
$$ 473458 470591 469845 470718 471808 472004 471447 471121 471506 472069 472218 472209 472597 473159 473067 471967 470153 467660 464084
53042D64084m410l850j997k75L75L29J10m28j281j740j528j569k569l527k854
$$ 464084 459674 455824 453827 453552 453927 454256 454366 453938 452657 450917 449389 447820 445251 441724 438870
53027D38870p59Q25O69m54j136j101j113j738k588k654j325P15J921J684J202
$$ 438870 438111 438936 439605 439151 438015 436914 435801 434063 431475 428821 427496 428211 430132 431816 433018
53012D33018J801K879K741J245J33N10J454J619Q68m08k097l544l265q54J804
$$ 433018 434819 437698 440439 441684 441817 442327 443781 445400 446268 445860 443763 440219 436954 436100 437904
52997D37904K692K240K211K854K919K113J454J215N19n65n59R83K264J697J81
$$ 437904 440596 442836 445047 447901 450820 452933 454387 455602 456121 455556 454997 455980 458244 459941 460122
52982D60122m55j49k59j132j737j404n51L10J045J285N58p13j395j223j152j675
$$ 460122 459667 459518 459259 458127 456390 454986 454435 454745 455790 457075 457633 456920 455525 454302 453150 451475
52966D51475j825o69R44J261j07j824k634k567k224j792j213o31j78K48N69L87
$$ 451475 449650 448981 449925 451186 451079 449255 446621 444054 441830 440038 438825 438194 438016 438264 438833 439220
52950D39220j60oJ426K844K240m53k989l435k234r99k79N36J634K332K130J411
$$ 439220 439060 439054 440480 443324 445564 445111 442122 438687 436453 435454 435175 435711 437345 439677 441807 443218
52934D43218R53J273K316L302L134J539l46j293j406j430j042O96L165M109K464
$$ 443218 444171 445444 447760 451062 454196 455735 455389 454096 452690 451260 450218 450914 454079 458188 460652
52919D60652o7j224r29o08p60o22R6Q27J454K612M152M636L157Q67l03K8O05N81
$$ 460652 460585 459361 458432 457824 457064 456442 456538 457365 458819 461431 465583 470219 473376 474243 473940 473968 474573 475154
52901D75154O35J705L362M111L136J137n88j441j714j908k227k588k772k629k407
$$ 475154 475789 477494 480856 484967 488103 489240 488652 487211 485497 483589 481362 478774 476002 473373 470966
52886D70966k679l652m658m811m042k963j882o69L96N51k04p30k35N11L52m15
$$ 470966 468287 464635 459977 455166 451124 448161 446279 445610 446006 446557 446353 445623 445388 445899 446251 445836
52870D45836m80M12R92K81j088j863j636p77M50J879K858K584J086n88j411j222
$$ 445836 445356 445768 446760 447041 445953 444090 442454 441677 442127 444006 446864 449448 450534 449946 448535 447313
52854D47313n66j16l29j182j961j742n17N03K88n54n05P57J820J428Q3q34q48
$$ 447313 446747 446631 446302 445120 443159 441417 440900 441403 441691 441137 440632 441389 443209 444637 444720 443886 443038
52837D43038n37k96L0M50O28M23J9m78r74j057n23Op2k1J387L510L925J543j708
$$ 443038 442501 442205 442235 442685 443313 443736 443755 443277 442303 441246 440723 440729 440657 440636 442023 445533 449458 451001 449293
52818D49293l379l405l215l079k179p36q5m93o52K29J272J505J268J248J170N59
$$ 449293 445914 442509 439294 436215 434036 433300 433215 432722 432070 432299 433571 435076 436344 437592 438762 439321
52802D39321l9K87J347K098K126J932J787J369O30M7l50j347l207m685m352k687
$$ 439321 439282 439569 440916 443014 445140 447072 448859 450228 450858 450905 450555 449208 446001 441316 436964 434277
52786D34277j649k038k454j554l12p48k900m553m160k663j776j585r14O21K090
$$ 434277 432628 430590 428136 426582 426270 425522 422622 418069 413909 411246 409470 407885 406971 407592 409682
52771D09682K634K340J679Q34j09q36j049q31n86o06p15m20M06J069P69k43q34
$$ 409682 412316 414656 416335 417169 417060 416224 415175 414344 413758 413152 412437 412017 412423 413492 414261 414018 413184
52754D13184m93J39N04Q76J238N25j796m128m241k019O41K430L611M412M211K871
$$ 413184 412691 412830 413334 414210 415448 415973 414177 410049 405808 403789 404430 406860 410471 414883 419094 421965
52738D21965J443P15K30n61j238j407j693k620l346k762j342o22j032j443r37
$$ 421965 423408 424123 424353 423792 422554 421147 419454 416834 413488 410726 409384 408762 407730 406287 405350
52723D05350K9M95J73n88j366j709j108N00K287K988K081M47k83P08K490L192
$$ 405350 405379 405874 406047 405459 404093 402384 401276 401776 404063 407051 409132 409579 409296 410004 412494 415686
52707D15686J880m90k078j921n94O35J018P75M78K73r1m57m6J411K753K431N13
$$ 415686 417566 417076 414998 413077 412483 413118 414136 414911 415389 415662 415571 415114 415068 416479 419232 421663 422176
52690D22176j238j462n71L09P98J036Q31L6o08j40J212K136J830P71k09q42j106
$$ 422176 420938 419476 418905 419214 420012 421048 421879 421915 421307 421167 422379 424515 426345 427116 426907 426065 424959
52673D24959p52L42J665K464K524K166J634R32K29k8L60R34J020M01o54j784k570
$$ 424959 424207 424549 426214 428678 431202 433368 435002 435934 436163 436135 436495 437429 438449 438850 438196 436412 433842
52656D33842k359p80J400K518J682k41j743k349k607k819k609j682k55J215K179
$$ 433842 431483 430703 432103 434621 436303 436062 434319 431970 429363 426544 423935 422253 421998 423213 425392
52641D25392K033Q20k51j7R46R31l86j309n67Q15J116M15K39J174K095J757L37
$$ 425392 427425 428245 427994 427977 428923 429854 429468 428159 427592 428407 429523 429938 430177 431351 433446 435203 435540
52624D35540q41n68J220L283M048L099J508L85l40j183j690p96J458L531L954
$$ 435540 434699 434131 435351 438634 442682 445781 447289 447674 447334 446151 444461 443665 445123 448654 452608
52609D52608K728R94k14o18n56n06o45p88p27m43J46J229K551L119K196M44m90
$$ 452608 455336 456330 456116 455498 454942 454436 453791 453003 452276 451833 451979 453208 455759 458878 461074 461518 461028
52592D61028K82K011L306L501K791J462l49k157k955k115l94N74P9q07o64M35
$$ 461028 461310 463321 466627 470128 472919 474381 474032 471875 468920 466805 466411 466985 467064 466257 465593 466028
52576D66028J285J481J864K888L664L238K038J264J360J870K363K841L375L936
$$ 466028 467313 468794 470658 473546 477210 480448 482486 483750 485110 486980 489343 492184 495559 499495
52562D99495M458M698M218K762N02k141m504n633n096m007m118n440n900m089
$$ 499495 503953 508651 512869 515631 516133 513992 509488 503855 498759 494752 490634 485194 479294 475205
52548D75205j236N69J019J173J321Q83q5r10j582k473k978j991J01J476J182J14
$$ 475205 473969 474538 475557 476730 478051 478934 478849 477939 476357 473884 470906 468915 469016 470492 471674 471788
52532D71788o34j055j394j249k62J073K018K423K603K793K953K728J670K5r41
$$ 471788 471154 470099 468705 467456 467194 468267 470285 472708 475311 478104 481057 483785 485455 485480 484539
52517D84539k49J404K555K929L268L453K336k58k869m172m291l926l498l392l705
$$ 484539 484290 485694 488249 491178 494446 497899 500235 499977 497108 492936 488645 484719 481221 477829 474124
52502D74124l395j191K056L656K567Q95Q16J675J725J165J491K674L134K087L22
$$ 474124 470729 469538 471594 475250 477817 478712 479528 481203 482928 484093 485584 488258 491392 493479 493801
52487D93801j212k001j598j00J061M50j258j908p73N70N73l72r09m62N30J405
$$ 493801 492589 490588 488990 488890 489951 490401 489143 487235 486462 487032 487605 487233 486324 485862 486392 487797
52471D87797J673J256P06O73R53O27n98j860k222j669p59J91J095J746J947J802
$$ 487797 489470 490726 491432 492105 493058 493685 493087 491227 489005 487336 486577 486768 487863 489609 491556 493358
52455D93358J600J517J733K509L850N111N346M255K797K445L539M635M103K233
$$ 493358 494958 496475 498208 500717 504567 509678 515024 519279 522076 524521 528060 532695 536798 539031
52441E39031Q76P95N43j404m312o207o459o000n312l790j341Q48J715J468P45
$$ 539031 539907 540702 541245 539841 535529 529322 522863 516863 511551 507761 506420 507268 508983 510451 511196
52426E11196m36k049l276l324k616k209k133j289Q58L249M302L584K014P29K19
$$ 511196 510760 508711 505435 502111 499495 497286 495153 493864 494722 497971 502273 505857 507871 508600 508819
52411E08819M46J144J828K016J879K224L339M268L946K796K166K356K353J700
$$ 508819 509265 510409 512237 514253 516132 518356 521695 525963 529909 532705 534871 537227 539580 541280
52397E41280J180J158O61q40k125j983j224j316j940j783j227j859l410l579j605
$$ 541280 542460 543618 544279 543439 541314 539331 538107 536791 534851 533068 531841 529982 526572 522993 521388
52382E21388J25o96l141m520l782j957j25J351J995J241m84j790j774q60J5N68
$$ 521388 521513 520817 517676 513156 509374 507417 507292 508643 510638 511879 511395 509605 507831 506971 506986 507554
$$ [...]
##END NTUPLES=NMR SPECTRUM
##END=
